##TITLE=NES1065_ptc_ref_9883764_BG3vxLU3YG
##JCAMPDX= 6.0         $$ Bruker NMR JCAMP-DX V2.0
##DATA TYPE= NMR SPECTRUM
##DATA CLASS= NTUPLES
##ORIGIN= BRUKER
##OWNER= Administrator
$$ 1.72 TOPSPIN		Version 2.1
$$ 2016-08-27 02:48:20.898 -0500  Administrator@X
$$ Compression mode = diff/dup
##.OBSERVE FREQUENCY= 400.02188249412
##.OBSERVE NUCLEUS= ^1H
##.ACQUISITION MODE= SIMULTANEOUS (DQD)
##.ACQUISITION SCHEME= undefined
##.AVERAGES= 8
##.DIGITISER RES= 22
##SPECTROMETER/DATA SYSTEM= spect
##.PULSE SEQUENCE= zg30
##.SOLVENT NAME= COFFEE_meoh
##.SHIFT REFERENCE= INTERNAL, COFFEE_meoh, 1, 14.98509
##AUDIT TRAIL= $$ (NUMBER, WHEN, WHO, WHERE, PROCESS, VERSION, WHAT)
$$ ##TITLE= Audit trail, TOPSPIN		Version 2.1
$$ ##JCAMPDX= 5.01
$$ ##ORIGIN= Bruker BioSpin GmbH
$$ ##OWNER= Administrator
$$ $$ E:\/data/COFFEE/nmr/NES1065_ptc_ref_9883764_BG3vxLU3YG/20/pdata/1/auditp.txt
$$ ##AUDIT TRAIL=  $$ (NUMBER, WHEN, WHO, WHERE, PROCESS, VERSION, WHAT)
(   1,<2016-08-27 02:48:13.773 -0500>,<Administrator>,<X>,<go>,<TOPSPIN 2.1>,
      <created by zg
	started at 2016-08-27 02:47:05.226 -0500,
	POWCHK enabled, PULCHK disabled,
       configuration hash MD5:
       21 0F 79 D6 B3 7B B4 F6 88 20 88 DB 03 48 BD 9F
       data hash MD5: 64K
       7F 70 20 35 C3 0E 8B 49 B2 85 5F 21 3E 69 DD 85>)
(   2,<2016-08-27 02:48:16.820 -0500>,<Administrator>,<X>,<proc1d>,<TOPSPIN 2.1>,
      <Start of raw data processing
       efp LB = 0 FT_mod = 6 PKNL = 1 PHC0 = 0 PHC1 = 0 SI = 32K 
       data hash MD5: 32K
       FA 4B 82 FB 47 36 E9 AF 09 3D 06 DB 66 E8 A2 AF>)
(   3,<2016-08-27 02:48:17.101 -0500>,<Administrator>,<X>,<proc1d>,<TOPSPIN 2.1>,
      <pk PHC0 = 95.09216 PHC1 = 0 
       data hash MD5: 32K
       D5 43 03 04 EF 20 99 15 E0 3E 91 FD DA E2 05 44>)
(   4,<2016-08-27 02:48:17.211 -0500>,<Administrator>,<X>,<proc1d>,<TOPSPIN 2.1>,
      <abs ABSG = 1 
       data hash MD5: 32K
       3C 36 EC 5D DC 2F DF D2 E4 DD 9A 50 F2 EC 45 1C>)
(   5,<2016-08-27 02:48:17.273 -0500>,<Administrator>,<X>,<proc1d>,<TOPSPIN 2.1>,
      <abs ABSG = 2 
       data hash MD5: 32K
       0E 00 9E 58 CC EC D5 92 9F D8 2D C1 86 01 25 1F>)
(   6,<2016-08-27 02:48:17.336 -0500>,<Administrator>,<X>,<proc1d>,<TOPSPIN 2.1>,
      <abs ABSG = 3 
       data hash MD5: 32K
       EA A7 B1 8D FB 92 0A EE BA 76 1D F2 5B 28 E2 3A>)
(   7,<2016-08-27 02:48:17.398 -0500>,<Administrator>,<X>,<proc1d>,<TOPSPIN 2.1>,
      <abs ABSG = 4 
       data hash MD5: 32K
       63 3F 74 28 4E 9C 47 8B 61 DD 10 71 C9 BD 83 13>)
(   8,<2016-08-27 02:48:17.445 -0500>,<Administrator>,<X>,<proc1d>,<TOPSPIN 2.1>,
      <abs ABSG = 5 
       data hash MD5: 32K
       3B B3 75 AD 72 01 06 74 E0 F9 A7 E5 83 3C DE 4D>)
$$ ##END=
$$ 
$$ $$ hash MD5
$$ $$ F8 41 88 E2 E9 C3 B2 BA DD B1 AF 3E 0F 58 91 DF
##$RELAX= 
##$RELAX= 
##$RELAX= 
##$RELAX= 
##$RELAX= 
##$RELAX= 
##$RELAX= 
$$ Bruker specific parameters
$$ --------------------------
##$DU= <E:\>
##$EXPNO= 20
##$NAME= <NES1065_ptc_ref_9883764_BG3vxLU3YG>
$$ [...]
150 150 150 150 150 150 150 150
##$TP07= 0
##$TPNAME0= <>
##$TPNAME1= <>
##$TPNAME2= <>
##$TPNAME3= <>
##$TPNAME4= <>
##$TPNAME5= <>
##$TPNAME6= <>
##$TPNAME7= <>
##$TPOAL= (0..7)
0.5 0.5 0.5 0.5 0.5 0.5 0.5 0.5
##$TPOFFS= (0..7)
0 0 0 0 0 0 0 0
##$TUNHIN= 0
##$TUNHOUT= 0
##$TUNXOUT= 0
##$USERA1= <user>
##$USERA2= <user>
##$USERA3= <user>
##$USERA4= <user>
##$USERA5= <user>
##$V9= 5
##$VALIST= <valist>
##$VCLIST= <CCCCCCCCCCCCCCC>
##$VD= 0
##$VDLIST= <DDDDDDDDDDDDDDD>
##$VPLIST= <PPPPPPPPPPPPPPP>
##$VTLIST= <TTTTTTTTTTTTTTT>
##$WBST= 2048
##$WBSW= 25
##$XGAIN= (0..3)
0 0 0 0
##$XL= 0
##$YL= 0
##$YMAX_a= 596149
##$YMIN_a= -500768
##$ZGOPTNS= <>
##$ZL1= 120
##$ZL2= 120
##$ZL3= 120
##$ZL4= 120
##$ABSF1= 14.98509
##$ABSF2= -5.573092
##$ABSG= 5
##$ABSL= 3
##$ALPHA= 0
##$AQORDER= 0
##$ASSFAC= 0
##$ASSFACI= 0
##$ASSFACX= 0
##$ASSWID= 0
##$AUNMP= <proc_prof1d_extract_pilot.lims>
##$AXLEFT= 0
##$AXNAME= <>
##$AXNUC= <1H>
##$AXRIGHT= 0
##$AXTYPE= 0
##$AXUNIT= <>
##$AZFE= 0.1
##$AZFW= 0.1
##$BCFW= 0
##$BC_mod= 0
##$BYTORDP= 0
##$COROFFS= 0
##$CY= 15
##$DATMOD= 1
##$DC= 0
##$DFILT= <>
##$DTYPP= 0
##$F1P= 0
##$F2P= 0
##$FCOR= 0.5
##$FTSIZE= 32768
##$FT_mod= 6
##$GAMMA= 0
##$GB= 0
##$INTBC= 1
##$INTSCL= 1
##$ISEN= 128
##$LB= 0
##$LEV0= 0
##$LPBIN= 0
##$MAXI= 10000
##$MC2= 0
##$MEAN= 0
##$ME_mod= 0
##$MI= 0
##$NCOEF= 0
##$NC_proc= -8
##$NLEV= 6
##$NOISF1= 0
##$NOISF2= 0
##$NSP= 0
##$NTH_PI= 0
##$NZP= 0
##$OFFSET= 14.98509
##$PC= 1
##$PHC0= 95.09216
##$PHC1= 0
##$PH_mod= 1
##$PKNL= yes
##$PPARMOD= 0
##$PPDIAG= 0
##$PPIPTYP= 0
##$PPMPNUM= 2147483647
##$PPRESOL= 1
##$PSCAL= 4
##$PSIGN= 0
##$PYNMP= <proc.py>
##$REVERSE= no
##$SF= 400.02
##$SI= 32768
##$SIGF1= 0
##$SIGF2= 0
##$SINO= 400
##$SIOLD= 32768
##$SPECTYP= <>
##$SREGLST= <1H.CDCl3>
##$SSB= 0
##$STSI= 32768
##$STSR= 0
##$SW_p= 8223.68421052631
##$SYMM= 0
##$S_DEV= 0
##$TDeff= 65536
##$TDoff= 0
##$TI= <>
##$TILT= no
##$TM1= 0
##$TM2= 0
##$TOPLEV= 0
##$USERP1= <user>
##$USERP2= <user>
##$USERP3= <user>
##$USERP4= <user>
##$USERP5= <user>
##$WDW= 1
##$XDIM= 32768
##$YMAX_p= 435768416
##$YMIN_p= -684135
##$CURPLOT= <Network HP LaserJet P1505>
##$CURPRIN= <$Network HP LaserJet P1505>
##$DFORMAT= <normdp>
##$LAYOUT= <+/1D_H.xwp>
##$LFORMAT= <normlp>
##$PFORMAT= <normpl>
##$SURQMSG= 1
$$ End of Bruker specific parameters
$$ ---------------------------------
##NTUPLES= NMR SPECTRUM
##VAR_NAME=  FREQUENCY,     SPECTRUM/REAL,   SPECTRUM/IMAG
##SYMBOL=    X,             R,               I
##VAR_TYPE=  INDEPENDENT,   DEPENDENT,       DEPENDENT
##VAR_FORM=  AFFN,          ASDF,            ASDF
##VAR_DIM=   32768,         32768,           32768
##UNITS=     HZ,            ARBITRARY UNITS, ARBITRARY UNITS
##FACTOR=    0.250966925370066, 1,           1
##FIRST=     8223.43324360094, -138969,      -146559
##LAST=      0,             -53987,          74999
##MIN=       0,             -684135,         0
##MAX=       8223.43324360094, 435768416,    0
$$ Real data points
##PAGE= N=1
##DATA TABLE= (X++(R..R)), XYDATA
$$ [...]
23778 -158668 -107292 -30821 -265651 -180937 59454 183220 48022 376448 -30223 -50615 -6249
23766 129627 49401 -308018 51751 135936 -20995 4577 47183 206321 -171333 337265 -138828
23754 216300 -92887 2115 151238 -201337 -247568 128283 -169128 15224 -132806 212991
23743 52972 8034 -8950 124027 -200346 -29694 -173212 40195 -7342 62921 104618 289098
23732 289098 177145 46653 21859 143941 -189857 327807 45039 130397 41182 -98726 -3594
23720 -154557 -175038 47014 -199463 58435 24873 -136929 -133651 104531 -256374 -187037 98089
23708 -124460 -35873 -36130 -379895 -183593 209521 224013 2162 60230 99276 52431 119551
23697 119551 -80043 31370 163458 -21274 150711 -155145 -363387 -28782 11382 -100800
23686 76646 -29899 83035 235749 -204155 29566 68104 152633 29966 551918 68269 125912
23675 125912 -97043 13347 48861 47175 -223767 -221519 61426 -98626 -168317 32055 -274936
23663 -289762 29544 -135553 -93819 -197459 -25689 -32069 18759 -254053 -280970 105142 273688
23652 273688 59005 128900 11162 -70795 -184882 -37951 -40375 -30232 -262599 58929 -228860
23640 -363627 -169872 55280 -221849 -9810 420 371910 -304211 241827 64529 -66535 -180269
23629 -180269 -77875 -46731 90325 -135771 10648 -137335 -258505 -47168 93839 -307977 32960
23617 -193396 53829 -123873 333745 -60412 88982 301853 63440 37825 53775 -131103 17074
23605 -89723 -189923 -159054 134628 -162436 100658 148582 -223537 -113769 -429767 22134
23594 -249944 -144886 8685 336265 366985 388040 202139 346554 252136 123113 373219
23584 373219 254162 -36787 -172981 77907 -81316 -220177 168317 315206 712 68492 27972
23572 -119640 237099 129322 -185786 55423 73948 -165827 -310746 -325561 107153 24464
23561 64845 112947 -8661 -404573 -59079 -161275 206103 67628 45120 41507 -280346 -105051
23549 154931 173671 217963 211460 269269 -6142 -141649 -203311 95525 85187 30999 -90770 -59275
23537 -59275 -224653 253960 256132 419143 -184228 313075 167673 118185 -217938 52292
23526 89831 58150 324949 -82301 -156199 83316 -230212 78361 99973 -274621 231222 36315
23514 238900 -163042 -25432 -7499 -320021 -111001 -37209 135585 -18799 181634 36174 -164355
23502 -177045 114748 312022 -279617 118242 -10872 38951 -136791 200797 255021 -106744
23491 -53378 63245 48793 81647 -140023 -177535 372279 57333 132974 -271516 92247 99802
23480 99802 52780 34537 -105465 -325222 -88936 5890 -268879 -209429 268684 -19431 -123987
23469 -123987 -151810 12188 -303049 -208883 108318 16396 11931 -280920 -239879 384545 12524
23457 -12064 892 74116 -5807 -153006 16644 13534 -54314 100412 72959 172239 -42136 76184
23444 -347835 54586 -60580 -7945 40448 144417 -7552 224572 -288927 -258485 -398438 -49422
23432 -99218 -72376 -182603 41944 -144029 34799 -33327 -32299 -200905 217647 -78472 97534
23420 -237083 126116 32703 154955 100530 -143237 -290438 201173 -44888 82256 -271973
23409 -61046 18344 -424759 -151341 120072 201330 20962 13726 -12269 -17131 -193578 367665
23397 -80300 155041 -167685 -298466 24151 184365 -135143 -209938 127094 -70937 -13901
23386 -134290 -190554 212737 61857 -87128 -136444 8528 448053 -81231 211762 -197464 -3232
23374 8589 300260 -120884 214327 59869 -69152 -141515 -171807 -72953 -148504 -159431 128819
23362 91525 -229280 -83536 200884 -270325 -64439 120777 169860 88008 -126620 21047 -98197
23350 68924 -202366 105933 339836 229360 -51513 24528 -14168 -167816 19468 157834
23340 157834 -241875 -36623 313241 11966 343690 -207924 -248270 -166625 -323116 91330
23329 17956 -111618 20705 36683 -75405 -142727 -59675 9569 -58755 -26308 261416 -154181
23317 57322 -50394 -147216 342051 -11268 10371 -143866 4996 -383676 249792 -377758 -131388
23305 -187393 -137170 -313324 -38008 116511 -65579 -170660 72481 102657 94117 -83331 -264568
23294 -264568 121185 -292293 142002 -259024 157682 -129164 -223957 -1049 -275414 -56292
23283 -156592 267558 -936 160717 35021 100174 100727 162155 -7077 -34780 -86984 184883 -15727
23270 -60707 7681 -61626 -223502 142616 -329718 -256398 93748 250247 -53471 5485 53500
23259 53500 -154045 -12327 -141877 187895 142480 14322 138534 168744 -151957 -201256 -223198
23248 -223198 52948 -51417 -35342 -78227 181445 213122 26493 -177180 -17601 222573 -113391
23236 32470 209476 58982 108641 121885 182818 -207877 229184 100078 153958 189175 -443911
23224 39317 135105 -80778 -22062 -236756 -243206 -82631 289619 21283 6774 -53681 78641 166170
23212 166170 -174810 -137490 -82862 20811 -56793 -110028 -95300 -43384 79271 -136422 -159404
23201 -159404 -130053 -129972 174809 143618 281794 122014 -92950 -109072 89427 -78089 54157
23189 -59633 -178530 119161 -17564 -67034 -34039 374759 2672 -8834 -240612 280528 12861
23177 -235819 56819 -21703 -199319 46855 -377988 -137860 -23192 386833 -61305 63926 179578
23166 179578 -87368 193334 130241 -97527 -19264 -261258 -404562 345548 -309928 174357
23155 -267727 -310326 374762 -136532 184492 -284144 -353324 -85788 29687 -39142 231267
23144 52523 -5365 -15489 212418 -26399 25060 -45188 26833 106945 146569 -160330 -36895
23132 -71686 184677 166636 116351 134107 67604 -39902 -185567 207416 -71514 -68350 -443989
23121 -443989 -113962 -178724 101641 127446 -23426 -59173 169255 271007 246802 -308327
23110 5428 -201336 93712 -80221 171381 -261848 -240674 50488 -169960 234200 201258 392438
23099 392438 172879 -115691 -46938 303214 148233 98512 130009 107064 44777 -43408 -71305
23088 -71305 -33476 -41141 -44934 87086 -156800 92956 279751 -54938 -52355 -130453 -227852 -257072
23076 -257072 66680 -176356 -186591 -84545 -306942 -91899 -72227 94196 -175365 238990 163222
23065 163222 105549 -223646 -38105 19238 -122889 221763 -268606 -16040 45999 123016 121961
23054 121961 -89592 -83863 182882 -63140 38326 20014 331215 49272 -201779 119697 -39498
23042 -12522 -123402 -47938 -342503 180111 -156563 129306 -87776 135944 -21068 264051
23031 435183 -79757 -52907 278883 260797 249862 144170 -11010 530217 -158264 46277 91763
23020 91763 29518 84957 103410 -206011 55947 -284092 -58101 23251 -155235 -122871 169529
23008 -55212 -35910 -225628 -50468 -116322 30273 -130113 95310 -48134 47415 -3567 -74575
22997 -74575 15579 -128315 -274509 101022 -220598 142247 -229376 99722 -74090 118507
22986 -250373 13201 65954 -166660 -165103 148645 76777 -135709 325914 -38517 73294 40133
22975 40133 228942 -204560 16929 -156321 150952 -125186 -212174 -112803 172447 255210
22965 255210 -15895 44430 88792 -166923 -26806 222998 -198790 -192708 -188616 -34398 42510
22953 225362 -251279 -54745 211241 -188245 -96500 29460 273578 122285 65182 157452
22943 157452 96732 359970 126549 141568 27917 39206 188037 -100433 7575 -147527 -171703
22932 -171703 -170071 210635 -188192 -131971 -203046 -75026 -129947 -152335 -82010 -115172 149616
22920 -294736 -78507 21556 101210 117119 120137 -44348 72570 -409049 -155314 -29143 -15715
22909 -15715 145801 411092 233136 -117849 209574 40110 172983 -92377 -387948 -257660
22899 -257660 -236973 -119372 137568 -438347 64993 -330008 -32572 137572 28183 -108712
22888 259146 -256800 -99127 -91700 -31250 -144098 -102788 -151222 -12225 -28207 -72015 -12769
22876 -207143 -46874 172499 231656 149061 -51406 -46264 -263595 -166310 -29807 -85049 -177452
22865 -177452 54487 -210629 -87836 -73087 89395 -227226 -42396 201314 -84150 40585 199949
22854 199949 73273 -163706 -231814 -96565 -228 52736 -44572 -105659 13073 -279701 -49211
22842 281832 -217228 -84157 188359 57278 -117791 284652 -414351 78160 -90439 -106370
22832 -106370 -106354 142936 116107 -67256 -156495 133129 182299 -210708 132988 -51058 -191030
22821 -191030 15182 -215996 -4073 88010 -29238 135220 79529 -94914 -73357 -99595 -41248
22809 -15603 158529 52110 127179 33285 -143525 -205891 -85451 41194 -401155 31511 -234166
22797 171589 -291335 105395 -152367 184371 -160767 -92144 162200 -130667 41629 -13772
22786 186146 -276307 -153563 109541 -174809 -201167 -136195 27561 143160 65123 92512
22776 92512 -143281 -68660 259969 -306210 32416 21584 64782 -20000 -522744 -9262 4477
22764 342575 -175967 -72565 9720 -177080 -159640 236604 -203373 -3136 55379 143632 -250943
22752 -2723 -291280 -47575 28469 -120454 37029 49279 72622 42580 44858 -261638 16097
22740 -156692 147230 122497 -87025 186012 40908 -286633 -338984 -176474 -174629 -254065 -192087
22729 -192087 -53112 303188 274473 209490 -129378 -94614 -357536 -86349 262526 -131122
22718 353087 -124947 -264050 356163 39295 -131706 -124898 -72055 -27002 -201810 -153692 287638
22706 -82879 -120480 225261 78280 -234524 -336610 57664 88671 92891 -231371 18580 -173347
22694 285636 39349 114837 123769 109695 -205889 323466 65044 -241789 64636 -4782 -93431
22683 -93431 13971 220164 -31117 131800 -141479 10860 -135991 -99601 -537682 273029
22672 190007 177471 -83454 -213719 -102293 202806 -339680 226768 -26878 137401 -16204
22661 356457 -235458 64796 18893 -92636 -3865 -269413 80907 78237 -207817 -7681 -77898
22650 -77898 217522 -40301 44879 193192 259400 -283412 226050 -246354 8772 -212272 17850
22638 -234221 -321661 208806 -66463 204528 151992 23035 -446067 72081 -265492 -148062
22628 -148062 -228778 373375 272106 -4993 -99614 250121 102648 -286880 10175 -9281 -59783
22617 -59783 -213121 -19466 -373254 -68375 -79574 -167936 82858 292943 -181137 130319 232548
22606 232548 -37910 -92052 -32170 -19537 -137013 -212418 -44672 -202898 -213157 303130 90939
22594 -15705 -60887 59289 -267786 33312 -33865 -89691 1169 -51845 283542 11846 -200135
22582 -43566 -59009 -54270 -26070 147280 -320791 -173194 233932 -231362 -73004 -192458 281261
22570 -63659 -58788 177753 -52353 96496 -99650 -59956 -184938 18568 49194 104750 -183918
22558 -173780 -63875 -309314 81725 57573 104427 -75993 -54072 197039 -38495 -282460 59863
22546 111709 -97790 151806 -65928 26293 -280587 119951 -265894 -116702 -186936 136779
22535 -183897 355176 -212299 43921 276266 -164861 13844 -39371 28548 -65162 353431
22524 -248407 257078 -147876 -224113 -374900 368762 -147693 71168 -23437 -318159 -70067
22513 247621 -80902 -166360 -399013 -85521 8008 -107530 101514 -20482 197518 -140983 -36430
22501 184924 -115220 4055 35772 -61090 266204 108387 -113357 80079 -34677 -190794 304100
22489 84699 101155 -117973 -78594 35883 9287 -122801 -178653 -344542 143186 -177317 -7032
22477 327230 -81975 158449 -263053 -434914 -79058 -78214 91645 -523061 11024 46836 -342333
22465 -151274 -83117 37498 -52105 -202619 -185169 -176302 -254137 -193692 -209207 -83694 -162684
22454 -162684 157017 120479 -36386 152127 24012 -105574 -109216 -114985 226994 72009 -48206
22442 -230096 53384 -17131 355850 -328292 -125757 -95320 59671 6376 104521 48511 -23225
22430 60000 23120 -87784 116807 -32818 22613 391739 122806 -55534 -164056 -164816 -112595
22419 -112595 -37863 62522 -231535 90933 27552 111197 198856 57747 -137059 122843 93226
22408 93226 118038 171243 -263140 -17429 52068 -235007 104024 -99637 -536856 -90117 130886
22396 -147912 65546 135921 155851 -128839 -112410 -181763 -205053 124702 -16218 -88834 -126456
22385 -126456 -248466 -187218 214676 -127964 -182803 -17767 312075 -265413 127350 -16108
22374 -150781 186595 108422 44103 188456 58921 178914 -292770 -121458 131575 -368498
22363 -34257 -182369 -479246 -182946 246084 -257618 153904 -28668 -98591 242646 -117275
22352 -220955 91132 69861 -106291 -102349 -28624 97537 -152479 -121727 269206 63565 -82412
22340 -80497 -75955 73626 -50931 90550 -4226 150448 -391283 -228121 113327 -178301 -402287
22329 -402287 -137131 242327 -171100 -201816 189500 -68538 -166068 185229 113545 209658
22319 209658 43238 -26117 -1268 -352286 -176080 -160874 170972 31592 136381 -551393 -97933
22307 150406 -76153 135420 54568 73187 -218464 -85741 -134954 -139577 158159 -107196 182797
22295 -11074 -347544 -146248 12406 -288792 -139291 266713 59903 206884 -55292 -13120
22284 -106157 -10577 144227 -187434 21526 317316 42799 -153116 29793 -226320 -161486
22274 -161486 132030 -81391 -162915 3940 -170759 134762 1306 253743 114194 -64367 55497
22262 214167 -352699 -258704 90210 274086 -12202 -29712 70409 -74856 -156860 -226175 -129566
22251 -129566 -246241 -106799 30808 325835 -1912 164026 455456 -117593 71975 16734
22240 119164 33123 -92819 -96115 -231757 -94450 40702 -261821 42622 775 14081 -117839
22228 -54044 -17468 -171185 131620 93378 218930 -14444 -17304 -34774 138089 144932 -30109
22216 -230711 106207 361234 18470 -52687 110693 -291477 -44225 42669 -79360 155071
22205 -182100 -320597 -217906 9982 60214 20689 -185701 -83804 -240459 -135710 -225471 -157060
22194 -157060 -31635 114617 -236184 -10767 174848 -76906 170202 -264480 92796 203437
22184 203437 -273946 -67355 236962 201389 84416 117598 -318360 -17396 -92471 -269145 -512944
22173 -512944 88767 129561 -21866 -86203 102113 74782 -129123 -73815 163087 -79106 -70355
22162 -70355 139218 -160139 -44278 162317 -183326 -161628 10748 31099 -101899 -10285 -174074
22151 -174074 -151656 136739 31323 -438420 -131207 -61357 1790 108830 147468 -125894 311038
22139 -160205 305653 -250523 -15125 38808 -161824 -71450 11337 -16298 -33619 6481 -127453
22127 123404 -172620 -186248 -412504 -205734 -85044 1918 -162503 23472 -263203 182464
22116 138131 -122029 8135 21068 227174 -95914 -162981 -10631 -300239 83991 59109 -234694
22104 109787 133478 86687 -176256 374523 72736 -52612 113827 -151328 223328 -225541
22093 -26483 56947 -69867 -190953 -66662 79413 -45 -87008 -114312 -101175 -71577 -51804 114953
22080 -173207 -17951 358806 -181023 162607 303118 -221953 26336 -37568 141096 1323
22069 98779 -119581 -213828 -20634 -168920 65769 -187371 -61240 110978 -86575 -24973 -199882
22058 -199882 -107169 -229989 -527874 179362 -309725 -196438 90257 -104350 122570 -212198
22047 -264278 18341 -277656 -324571 -294469 -146569 370453 94494 -38676 -56871 321043 365481
22036 365481 -128418 -156651 139849 -268504 131904 -603065 -18760 -210131 -235659 -52401
22025 -243520 78601 164824 15436 -164684 -145157 -23201 -44753 -95685 44170 -28973 -48837
22014 -48837 219801 140080 153135 215582 -87995 -286766 -240316 73932 -44074 64021 146868
22003 146868 -204570 -188378 53607 75721 -79733 -8951 -26884 -10614 -237085 -352478 245154
21991 -35470 -269242 -157367 -192413 -190082 5353 -45395 -192577 -255073 -37281 -66808 -260505
21980 -260505 18788 27827 -362540 -131468 99169 21410 257499 -635418 -112460 -283174
21970 -283174 -126200 -183497 -115907 -174936 269384 -162135 -288883 -409641 -113471 7522
21959 338545 182994 -109956 -269085 59551 -127902 -41854 -114787 -123625 -295031 24955 -88718
21947 174900 205222 72797 -191536 188556 -65343 -50162 25023 -101314 -175116 -48224 71634
21935 35390 -78913 97035 -215507 -64817 318401 18845 -108072 -78677 216306 -337260 137835
21923 7430 204852 109092 -85749 -28926 -104931 -153680 160421 -215233 19357 -70086 -30450
21911 -94106 -177211 -111237 -29204 -172893 -236850 56969 192495 -222889 289820 66697 37835
21900 37835 -64450 -154894 -133869 45621 -294501 -143792 -200070 126925 121138 43220 56392
21889 56392 -134151 -175289 3 81547 -78483 -289836 -80679 -23675 -261259 -60990 192429 -117754
21876 -144191 -38286 -213011 -196530 100839 2689 49377 36443 70635 73927 6285 -90132 19901
21863 20899 -34499 164037 -61526 -37638 -102732 -102312 208997 12616 -72927 124387 290790
21852 290790 150650 -148458 249423 -107076 367 3414 -196359 -74602 188190 -109996 -256930
21841 -256930 38739 -132091 -208359 263582 -88851 -254419 241819 92954 -258106 -422317
21831 -422317 220079 66176 -40792 151552 -153756 -133438 -213067 142761 199313 59778 -167486
21819 -192108 -204116 -31301 192854 -147959 -120604 -206832 99330 -27064 -134827 -29873 -241229
21808 -241229 193485 -240303 141787 189500 -75861 113665 26225 308506 -292397 218609
21797 -377695 193332 -299518 236949 -30845 -188962 -249145 54225 86089 103213 -141938
21786 79381 313376 32026 -126941 -80961 103933 225439 8455 81417 6296 5534 -97745 67307
21773 163430 186830 -71835 30567 -15300 80768 63687 1527 83790 -231984 131664 -208511
21761 108282 102976 -115974 71461 74232 -71070 -202228 133379 31197 242329 -20492 -488505
21750 -488505 230009 159417 -252629 29751 111390 262914 -403131 187870 -182818 -256203
21740 -256203 -169101 -89505 -169940 -69293 -175221 -143489 -137490 -63714 -83846 28340 -95400
21728 -14033 -111819 -246903 64358 -3281 -79252 117285 -163581 -188868 -84484 -113348 -42031
21716 156612 292561 -238161 -87266 15896 118865 227311 -101859 -22849 77874 -233479
21705 -86713 -72776 -106377 -28478 19191 278941 -83471 188164 -389487 -187925 -146065 -313981
21694 -313981 -338512 -77037 77691 -236077 -73275 108390 -78196 -48812 174141 355866 68417
21682 249550 -42594 43775 -69950 -454064 205947 -270910 215684 65181 -222826 11573
21671 -167855 -107181 14677 -11392 -213359 315020 168213 70609 -144291 -218733 -308569 -61417
21659 -101804 -82044 -173035 -164411 -216470 -309632 -141150 -224274 -218104 -207666 -13821 21990 -12621
21646 -158830 -286711 -100741 119102 -266253 -263984 1515 207855 393608 219691 158423
21636 158423 -269762 213768 233792 -58546 -232849 -43733 -265329 164479 -172291 1986
21625 -65005 -93824 4920 -134536 -12736 185411 -285144 30382 -71888 95485 183167 -25875
21613 22601 -164226 -33516 103442 46064 718779 -173613 -230364 -107794 92347 20610 -273065
21601 -73175 -267482 -167615 -210029 -198617 130680 -44190 45177 189854 199002 -241441 10615
21589 -341616 208543 -91083 -214583 -277564 98078 -82663 33286 -63236 -24419 -150972 -30330
21577 -349690 -198469 -37583 -16601 108425 -57750 -233174 4783 254217 160861 -92918 -6792
21565 32029 -219873 -158853 225828 139170 53659 -102776 120870 -100428 -89982 -58078 -126435
21554 -126435 30642 44613 319797 50608 -188984 68535 -30208 -290933 -122449 90480 -268656
21542 -191787 81620 -238830 138259 -40798 -69819 -85010 -306632 29224 -37920 -34926 -13436
21530 123954 -161829 47780 -41817 -359701 288198 213347 171850 205016 -33166 -14488 133323
21518 83204 -254529 -180964 -5016 -302101 226970 -241445 -212805 163531 -101473 -64977 -70924
21507 -70924 -206544 133486 -155303 253941 -205042 -127644 216757 -293012 -197936 -269148
21497 -269148 -210219 -92562 -197463 31475 40560 -136996 235579 89933 11520 -42593 -119590
21486 -119590 -119879 -382979 -267185 84775 -143795 -114218 -101517 -87323 -11053 23078 -168421
21474 -334906 -184066 159842 -9884 -36189 -197187 -113522 -105090 -191843 99212 -116960 -170278
21463 -170278 336984 -19581 123730 -86182 183366 45041 24340 52300 154658 -249273
21452 36124 18404 -16649 -190866 -298207 75074 45178 -190992 -31402 -68402 294716 40013
21440 631724 407837 428193 88809 210625 -123986 151671 81238 85749 -329631 136276
21429 32584 -466649 -66790 31164 27778 209020 -31548 123329 -114430 -70670 -52407 -118921
21418 -118921 -29997 -74705 -179517 -54261 37222 -91215 -71628 97958 -88915 62321 3548
21406 -12731 -311330 -57664 21017 -150650 143387 -26473 -36616 -4017 -47942 -85188 38282
21394 302581 320171 -268763 -306862 261707 220924 70617 153170 -250416 18996 -157666 -137693
21383 -137693 -205266 24954 -237388 119384 258245 -261672 -101340 -65695 294264 32691
21372 190879 22337 116453 -129503 -251997 72572 -130475 -181133 -14627 -80707 276077 -37092
21360 -201533 89710 -71689 -64519 152806 -161744 -340493 -192255 94095 -372009 -59675 -226234
21349 -226234 -186763 -327898 -16631 -364530 -38236 -131234 -248538 13201 -45560 124177 15591
21337 -278430 92964 -154773 23492 164095 -236888 -210635 -223429 54194 -110352 -55606 -121927
21326 -121927 236743 -340250 -55394 -117722 227143 -149306 -15421 -217641 87630 102318
21316 102318 71078 16836 -197955 -65830 98242 -486512 -39880 36571 -214346 125479 -242950
21304 -250660 258817 25691 148544 -27292 -258948 -49208 -232227 130194 281238 155055
21294 155055 -90169 -157194 -203790 -122862 -82122 -118643 -496267 -232352 -174601 114840 55230
21282 199162 -268187 -82882 -148611 -180270 -221187 -320825 29509 3392 -223839 -58180 98305
21270 -116612 163681 -71521 -310426 -77769 -123001 -306991 -124591 -9128 -36614 -107046 -132714
21259 -132714 -153627 -304937 -364284 -42043 149708 -207700 -308182 -67450 55996 78738 -94646
21247 -199153 12140 4886 -314929 31557 -203457 -180097 117618 -235708 46139 -164639 -211299
21236 -211299 -98050 39240 -110575 76912 11081 -240738 155289 -192574 -10191 56285 173640
21225 173640 -108738 -88517 280139 14634 -393030 -223894 39387 -12497 -96654 -166601 -205364
21214 -205364 -265235 -227224 83612 -140044 -17843 7042 -211811 -28213 66201 -103130 -289226
21203 -289226 144800 132715 -94605 -347695 68539 -202454 16049 -252086 41870 81010 -167836
21191 -12617 -170879 -54553 -280505 -256794 6162 24839 8340 -198897 216278 -218047 -249705
21180 -249705 17933 116433 -165546 -110572 -46481 -163751 -357263 -75427 -37377 28779 -147804
21168 -70416 -187796 106010 -38262 -32516 208804 -97713 -243198 -82006 136015 145670 -23671
21156 61122 -72925 151409 -171365 153699 -224479 2311 61082 -106815 -11686 114515 -105780
21144 -54481 -173037 187341 -174927 -289206 -145625 51526 -133042 -274952 -53879 -190525
21134 -190525 45131 -190253 -128454 106533 -197501 -33970 -174915 71692 -86463 -427884
21124 -427884 -6221 -74685 -128696 -52783 -90485 343956 58422 244414 -50078 -378810 -112969
21112 -88324 33732 -358012 -137355 -89543 25344 -236835 -174419 7760 -60142 505 -27335 -98105
21100 -98105 -122761 -191535 136237 -404322 -230403 -168693 58494 330915 -98098 -198716 -12208
21088 -31336 192574 -48503 -158578 -118120 474543 29548 -221878 -110660 -24635 -27606 -185769
21077 -185769 109760 -212490 223385 -73781 90416 63519 -146777 -992 172689 17972 -138255
21065 39029 -216660 -92705 221694 -32128 -158519 83028 -107401 -250767 -361619 47752
21054 3350 -236749 -106293 -248946 -364609 126768 -6014 -183990 -68025 1381 -317442 -241472
21043 -241472 -189605 180832 -70931 64007 52230 2910 108876 86749 62336 427014 -80943
21031 191611 -52137 -39178 -65691 -202706 140004 -20562 79847 -260212 -42161 -2867 -137082
21020 -137082 -35082 -14474 -41368 -104083 -8100 -73529 120857 53147 21679 140995 301108
21009 301108 -296082 180667 71556 440822 380032 132143 251515 234607 151087 -414079
20998 81766 298288 68433 -62925 240170 253291 -72285 296823 49357 7522 -22916 4766
20986 -59784 33872 -33793 -44054 -173307 -75416 -84578 50047 -226708 42673 43975 -2279 -256566
20974 -256566 -130058 -126744 232959 -188034 176676 155568 -234172 115985 -43919 -287441
20964 -287441 -84521 296023 -203290 110115 -3235 108139 -93825 117607 9810 -139344 -49312
20952 -293235 -65636 35553 -218126 -73641 40000 10246 -150502 202449 -13564 445496 212791
20940 -188515 -49562 -47277 -19180 -60459 -82461 5922 93581 -353948 -148977 -230624 -261508
20929 -261508 -421773 193464 -393177 50930 -91927 -185174 -289820 -230846 -171895 -348939
20919 -348939 -53667 -55155 25199 165092 230729 -61432 182717 -64295 -120136 70621 -224384
20907 173727 -123233 -226414 -21498 54307 -116475 -154073 129639 -446926 -163264 -116366
20897 -116366 -90787 -87364 -209664 -24564 -137259 -205365 30099 -52776 22033 -130494 -35409
20885 186962 11564 -103053 -158476 -1009 -81747 156156 29327 -86435 -20704 114554 -299735
20873 -101134 -126987 -153964 52501 593616 -19645 -137650 -230312 -48155 135387 -71390 66650
20861 109450 -127388 182450 -13188 131549 -72382 147340 117330 11468 256891 270459
20851 270459 -129109 275855 194467 -258040 108579 -26292 -123650 103726 85644 -175563
20840 -197954 -148471 -313921 -212383 -202269 138372 -300147 8379 47881 49349 -131416 -323833
20829 -323833 179316 -102558 -71795 205001 -175801 -81487 -154154 -108355 -69181 176454
20818 -78244 -299253 -85953 -9818 -101299 285989 -275687 337203 83245 -113706 -4111 -256423
20807 -256423 -289759 -243443 -566889 -106158 239180 -58332 39551 103838 -101534 125014
20796 141209 194284 -340478 -204573 -204072 -114182 -286171 -181337 966 -274516 106241 22710
20784 5654 -141413 -103810 -25267 -84189 59352 -19136 244379 117642 -122267 -81046 -40646
20773 -40646 82988 17927 -259141 -251771 -39349 -164831 153384 -56535 261300 -8688 53424
20761 -54391 -261118 138418 34471 -212053 -80100 41682 -400991 -90932 -575261 45340 -55286
20749 161220 -479252 79753 -295592 -51694 -48950 126830 -254020 -73308 1781 169772 -95479
20737 -204997 -333055 62694 15023 -216227 174081 -224810 -19130 -291926 44584 -237091
20726 -102838 218687 78155 206850 90407 -366305 118073 -250506 12867 -494767 -133877
20715 -625535 -233566 -161863 -85085 11630 -468441 -143468 -185170 -418622 143685 -386479
20704 -90217 126115 354790 -99714 230320 -337387 145018 -47024 8665 48285 -29200 2143
20692 177251 -37923 2941 -231997 143892 -180039 -64091 -126107 12468 -252024 -63767 62085
20680 52002 113020 36607 -34445 153838 287856 197123 235212 29117 164888 -87165 -114770
20669 -114770 163433 -44959 -335823 -391657 7744 -112283 -5166 -333500 -112555 139539 -297471
20657 -219336 164714 -149648 -193428 -208849 -234162 223494 -141017 51145 -14161 261514
20646 -228581 22209 -56496 86541 -355375 -235778 -131129 63031 -104112 -213405 -42879
20635 -142889 -95342 247848 132904 84097 -286404 -211718 202477 -353449 -171649 -280370
20625 -280370 233256 23567 -36414 257065 53369 -145479 -238708 58287 -102941 -178707 30241
20613 -88913 -40586 -36896 -286596 185838 -248492 151967 124768 -324412 -169284 16396 -126715
20601 189145 182127 -134967 -303813 -363925 -410909 106467 -59324 -188041 32318 -316648 22089
20589 -277122 59477 126193 -49071 -22770 -5203 -128970 -333075 -6515 91450 -179257 79054
20577 313042 -116223 -74855 -129123 -201954 -247179 -276509 348636 22197 116670 131299 -255761
20565 -188537 7396 -185198 147946 -181844 -130611 -25277 -86866 93758 27808 -49894 52100
20553 -191037 -112279 -60538 -166441 209233 85618 -37066 -344822 -172936 -241673 -273979 -253899
20542 -253899 -242880 -137873 -12097 -132146 46398 50745 -217895 -195553 33635 27173 -79160
20530 -171039 261597 182211 -189979 17889 -251513 149104 5617 42195 35384 -193737 -125848
20519 -125848 148362 108720 -270690 -84582 -72720 174718 -177254 -83497 -52029 -192086
20509 -192086 -137194 -87689 -139860 -196005 252834 -104605 38974 -36105 -367507 64565 -324188
20497 -176459 -5219 -42919 -51901 -50624 -286877 -362213 -233632 75171 -91223 231003 -106190
20485 -196370 -173126 159118 -310268 -312938 124371 33911 -68150 -421844 -6887 479494 -183994
20473 37173 -316780 19675 -209727 22914 56627 145493 274802 -137892 -230879 78707 -47736
20461 238293 -79841 -179513 -83499 142113 44488 -67715 173101 46032 55123 -164011 21558
20449 -98883 -381737 73526 -81971 -94605 -44261 17992 -43504 -256859 27174 72411 -70519
20437 233443 3803 -47784 140752 -249872 229793 -176855 -409849 211082 36424 -75858
20426 -81234 -27151 -281334 83592 -187229 -283694 -181547 -76708 31635 35379 -34019 9715
20414 -31932 94597 51263 91221 -16876 -258208 -74543 185860 52827 -96872 -12906 107767
20402 -87676 -126233 190486 24838 -283404 -259435 19885 -98379 -125233 101726 -210182 -205575
20391 -205575 147532 53419 -91882 -560835 -186978 169806 -290669 -178118 367288 185013
20381 185013 137944 220512 374362 257165 -375709 -180476 -127416 -192749 15841 -98399 -82365
20370 -82365 47298 127815 146586 -171245 -125347 -196821 64178 79256 229388 -403373 136264
20358 -58944 189968 -517659 66580 -86462 -24396 -301361 -58014 24243 -13822 -345777 208546
20346 79139 -53830 -259598 -60350 47262 -134142 -159280 -166886 232355 246288 45553 -221083
20334 -127427 -206242 -119397 -135185 -125507 -170193 -32612 27576 -109010 -109242 126877 -33388 -70827
20322 -70827 -159993 4642 -129023 4016 -99395 -3262 -66150 -196140 7462 -207704 76743 11121
20309 38303 20819 -177285 -106862 -124101 -139768 -88729 -296751 141949 -94552 -193962 -557714
20298 -557714 -239546 -246758 -119071 -134446 -237040 -211444 -7783 30683 -181416 158418 -127980
20286 -207055 -344863 -17854 -112502 -59691 -317511 48368 89179 -446071 -30369 -7126 -257261
20275 -257261 -53068 104516 32140 49789 -243709 -443034 58691 -293850 -77996 -278242
20265 -278242 -277111 -53326 349854 -121842 89295 -160487 -260355 105690 185867 145060 -177238
20253 -33910 3419 -111119 -174081 160864 -59226 -54489 -103353 -163379 -307673 157501 396583
20242 396583 -199403 68008 -207612 -199836 59036 -33343 -171239 -138337 190662 -439258 -111415
20230 105843 -136121 -20717 -248835 -2889 -172595 253192 -250733 12661 -88894 230895
20219 -137454 -56435 77965 -321211 135341 9401 -205505 46802 -26873 164033 38654 -407576
20207 -318437 -68875 63433 -188492 161284 -348767 -158540 -126380 -24752 25125 42938 123246
20196 123246 196712 146758 -126288 64936 161173 142406 -125209 -63629 -72461 -93475 -34498
20184 -136877 185170 -184079 -48936 -49897 -77502 7120 -115032 235737 -156241 7451 -94027
20172 -169420 -71487 -112982 -198977 -216336 61274 -146466 -14361 153989 -94755 126656 -237819
20160 -37574 20951 64747 -217507 -163291 59637 158096 122893 -151252 -100298 293691 43334
20148 416698 92880 -47328 22456 291861 280328 47530 393656 283239 -26879 33955 149452
20137 149452 -22112 -185020 -19909 7939 -200394 357280 -266421 66269 -190027 179950
20126 15003 -538715 -92935 42251 -14673 74501 -289667 25421 110167 29036 -320704 -245651
20115 -245651 23019 88738 50211 141792 -200347 -123210 -124655 -84175 -384227 -187771 -117047
20104 -117047 -89756 -346407 -178927 -117867 -153695 -74894 -410178 -153995 -72222 89430 276281
20093 276281 67613 -148658 -106771 -5231 -151502 98314 123824 -112107 32602 124505 -21249
20081 -191251 -70091 -139777 -81776 -245408 64494 23621 277850 175280 105003 81626 4679
20069 -160761 -116172 -128265 69420 -639340 -51935 323122 -356282 -6088 -8037 -225609 102421
20057 -61635 -178807 -44498 165729 -171872 199020 -214294 -203940 36561 -53002 -173120
20047 -173120 287843 -232065 -70358 62937 91432 65528 -301806 -93085 7826 36363 108596
20036 108596 220468 55072 89829 -97986 -219222 -136361 -309237 -69888 -313338 116129
20025 106433 304126 -149144 -293838 -64814 -266210 -103754 -156392 -214839 81323 307256
20015 307256 -74972 303866 274287 159167 247409 -242414 68036 -281572 -296933 36458 -62841
20003 -120202 -144573 63279 -40091 40833 -11580 -51119 95413 157076 155922 -41198 242256
19991 185913 -3598 23859 322869 81429 223445 -2553 268245 -326828 51113 179323 -24308
19979 -263677 -216983 328965 2333 -167965 -95942 -54032 -88675 173600 330 -181176 10033
19967 291304 308984 168313 -272991 195491 345054 73461 31803 104132 168832 -74789 132877
19955 -125441 120226 177922 261314 106992 -82560 195786 -213045 46609 17367 119668
19945 119668 -3759 78789 -128598 -97898 17168 -166534 12221 11079 -177976 95234 54487
19934 54487 -497982 -78160 216956 -18245 -4061 -82480 129754 -173557 -286093 -186134 -444296
19923 -444296 379836 -168675 120523 -438212 -47837 -64865 -308054 -85106 -35129 149457
19912 -137448 -197752 91466 59762 -140113 -165152 -23832 -65428 206912 29534 -224268 -160665
19901 -160665 277842 141248 86894 -257197 -93246 -112178 -201691 -489686 -22589 -108191 -32411
19889 -189331 -109646 -331248 -189857 -92798 -390666 118493 -325953 -84629 -115359 38115
19878 -192825 -308977 -408342 -88003 -122942 -179867 11625 268643 44235 -182666 -29377 -25230
19867 -25230 89233 -180361 5119 -145678 -69280 -61356 125928 -146541 -129772 -402726 70744
19855 -17968 -158691 -37972 -28035 124398 -506655 141190 29654 -195037 177556 -2554 68331
19843 -320848 -257906 -100959 1404 1386 -103286 20845 -173703 -189208 25015 70135 -232881
19831 -142708 70659 -40841 -191988 116763 -23272 -412977 -15508 31473 -12609 58354 -101398
19819 -179666 -296739 -115412 222053 -31610 11883 -374314 93051 -44757 -56299 -99652 -314154
19808 -314154 -69093 132407 -5524 -199648 108087 -156707 71596 -255448 51766 74981 21993
19796 -147768 -208513 -52447 -136863 75656 217624 181672 -210735 343112 120993 -19138 224468
19784 -43841 -122401 -289183 131255 -346384 18642 -208649 189335 -378868 -184583 -288772
19774 -288772 17502 -350073 -210606 -267501 22445 -141449 -31223 -133092 -32689 -271736
19764 -271736 126245 -190930 -181986 -183017 43787 -2163 243670 -55020 -14706 26620 362310
19753 362310 115409 -86228 -261024 -208536 23504 -258108 197375 165771 -100315 100916
19742 158804 -89963 -193955 171275 522711 5767 142431 438290 -110293 147169 75157
19732 75157 374016 237987 95974 -13866 282685 -104147 -318781 16646 129418 -205345
19721 -150999 15843 319119 91535 -358758 -238280 346952 -65673 -19802 -32222 311398
19710 -196098 -51185 -267638 67594 44939 -54479 -98189 119231 196049 34630 117103 -80592
19698 154251 255940 61728 -16915 153569 -117593 126992 -55150 -160527 -375770 128518
19687 -99668 81670 48806 36406 -60700 -45182 -331404 42716 59404 -349765 63985 82732
19676 82732 73569 199978 -56146 229492 -159275 -264307 -155130 -318913 296754 -221172
19665 170872 134285 -300996 41922 -182110 -93340 41084 -57868 -323417 -77462 100051 -359010
19653 137751 53133 148467 51780 -95393 195470 112709 -77129 -2282 -374366 -139194 -192572
19642 -192572 -103690 -227850 -93841 264949 179995 -85060 -163809 -15946 80271 -94652 -30560
19630 136497 -184087 210767 -29688 -382781 -322124 61202 -286561 -364924 139343 44043
19619 -11340 -78235 98660 131329 147005 -123846 107904 -116090 3574 -90924 -45626 -434942
19608 -434942 200621 -195671 -130030 -46574 -71643 193546 -44957 159686 94921 57097 -4345
19596 -253034 -33331 -85437 56476 92891 -83206 -199897 -147631 171766 -1832 41849 -204951
19584 -6711 -244307 -115640 133873 -84900 130897 -234479 -19865 -450471 -158619 -115349
19574 -115349 -172592 -144669 111876 326326 -130660 -114620 -106813 50139 -114345 274216 -121159
19562 63299 -229812 127527 20244 -130154 -29247 -83852 -63457 -368471 -83456 121167 -140307
19550 -190174 -448110 -298229 -130764 -59287 -360285 37229 -110079 40623 -30529 -183666
19540 -183666 -27037 -49842 -251824 -50540 -113748 184374 -3668 116732 -233471 -95072 75366
19528 26993 -48699 -19422 -59637 -128920 -165996 -36160 -48807 18965 -66998 90389 48555 171076
19516 171076 -120338 65524 -262148 141841 -108983 200853 148217 -129157 -175192 -173896
19506 -173896 -265694 -175369 158847 61088 266928 -166704 -129875 -442756 -155367 -137278
19496 -137278 123577 346980 771 -12371 -299377 113775 -260642 52365 159870 -170940
19485 -90457 89173 -227031 -108661 -338472 150575 237006 -496832 188779 -334723 79836
19474 -1439 -115142 168033 -118208 28991 19529 20872 80716 -18207 -200298 -460425 14692
19462 222516 -257515 -97132 39766 -425077 159166 -255954 -258709 -227541 321473 22980 4780
19450 -52636 -62300 75432 -387575 -296793 -65472 -390562 -41121 -86808 -141870 148188 -116138
19438 11745 -95915 -307190 -75211 37906 124317 198312 -140891 -173884 -260942 -285057 -7811
19426 -74274 -195384 188238 64058 131874 -232738 -327044 -111285 -106364 -171229 19550 -174936
19414 -50895 297473 -245394 90609 -366913 -281720 -100150 118489 206638 -128796 -132919 -44771
19402 -110309 210553 103775 -213955 3694 209303 175596 132116 -157481 100399 152040
19392 152040 5106 -136380 -65353 171766 166119 45391 77127 129090 -219546 -17400 -49447
19381 -49447 -119389 -142033 -129483 -145559 57140 -129167 -247514 -46035 79339 -284501 20497
19369 -157076 -5147 -318058 -186071 -223636 97741 -32215 -208106 -75808 47560 -225595 -140114
19358 -140114 -56742 -174955 -32936 -53689 47454 -115152 -187959 4481 -151448 -414474 -53443
19346 -31122 -115418 50076 129284 270 59087 109718 -252948 75658 -180770 -67093 -224763
19335 -224763 -86240 -194163 -89968 -84758 -427359 -51553 -216554 -67262 -203063 -210659 -80524
19323 183460 -7725 -119025 -99994 -237545 75237 2262 -347458 -160714 -86369 189352 73683
19311 157447 -237285 -286705 -191961 -211979 83356 -180381 999 -208621 -114890 -5529 -10694 206394
19298 14517 -64162 101649 -271875 121173 -193111 -261022 -99938 94569 -244291 -115249
19287 -15670 -295660 17569 -148206 -125472 130967 -430130 -117765 431398 198415 28544
19276 -166532 -149007 -74285 -36621 -64686 111794 -251685 -30870 192105 -25839 -314007 -32204
19264 -3658 -72195 -194973 59126 42185 -159860 205357 159300 -47565 -182256 115139 -153827
19252 -59066 -253410 215568 -281558 -339297 -186380 97185 214581 -184876 -273130 -280798 277490
19240 -135461 -401269 -134452 187206 -293721 188388 -229331 -22272 18740 93357 -307555
19229 -190607 202883 -306452 -38709 78981 58175 -26132 -108174 69760 -279874 -123121 351147
19217 -245870 -131438 -64354 -52960 60129 -115875 -271378 17218 123729 -71022 -99636 -43257
19205 -76072 -293656 211185 -129686 121071 -124042 44592 -412047 -127295 -55095 143925
19194 61199 -31335 -201841 -48260 -401031 84062 -311212 -224783 -34891 -116383 14345 157189
19183 157189 60676 46463 -123456 24521 125747 32852 -158089 26858 265666 252458 130665
19172 130665 186480 -354806 -148242 37775 -2162 -122801 -106044 -189803 -366188 -41150 161837
19160 324612 -373443 289621 -132048 -25289 -38490 291730 -158281 -99036 -28232 4228 13569
19149 13569 -25426 227769 -3365 -66459 -197265 -191351 -182456 4858 157782 -177878 334314
19137 -179098 124290 -169957 -194299 -41025 143769 -43741 -38968 209515 -69616 54280 -121897
19125 -186067 75647 -298038 297393 -96406 -55628 -25152 -229491 58828 49524 80081 -396934
19113 3266 -531193 -142353 -238174 298327 163748 -409279 -99439 38354 -22940 -464280 122216
19101 27230 -52182 -216464 -312899 -279260 -82221 -60665 68226 212705 -140274 -39744 -129277
19090 -129277 -136856 -172645 -111679 19875 103379 -172410 -261511 -225027 -1460 276029 101736
19078 41372 -55800 -289010 60623 -55370 149872 -144755 -81637 10558 -365900 -156803 -77381
19066 -99851 -167075 144405 40558 -93844 72327 -241004 154368 167965 112476 73898 327044
19055 327044 -173496 25483 -15512 -180828 144955 -40818 215244 -271855 -154453 8951
19044 76301 -119733 -268268 -168713 -156765 -237481 -121326 -206580 165382 -72878 150381 114259
19033 114259 134579 9961 119286 -79328 -168149 43139 -95496 -69821 81767 -8866 111296
19021 246987 -80594 -193390 -62267 -99536 -272265 -202324 -240521 82297 -11404 -121334 266391
19009 37494 63908 30537 82090 -269752 -500441 -51169 -201257 -92912 136063 -120236 -99086
18998 -99086 221143 80837 -219985 -67727 209786 -198434 95821 -108436 -9406 -135540 -8722
18986 -313859 -287785 239652 -144160 309964 -97748 24127 -77467 -46396 106747 -234543
18975 -77205 429016 254861 311447 348137 -11401 225504 -58623 2422 -33269 18774 -123554
18963 -267354 20305 230113 61530 70906 -139921 -18118 -392186 -256689 205809 65974 -21792
18951 33581 -236983 -204645 -65644 -37839 -105556 71487 97383 -254421 -73298 1837 269296
18940 269296 -167167 31303 -204926 -116068 -161400 -5635 -338249 102422 -156330 -171591 -311487
18929 -311487 -415368 98576 -62674 106945 -253804 -181343 -271818 411078 -128136 19599
18918 -164864 -188651 -131186 -13887 -331766 -100057 -79110 89182 233363 401568 333181 169810
18907 169810 204341 396417 23549 -46535 5660 123140 -135068 -186749 -7272 96800 -175157
18895 -161729 -220856 131530 229482 -178451 176102 128414 -207861 32059 -119391 190037
18884 -331653 61813 -317437 99097 -146765 146331 204728 16167 -58152 -136609 -27921 -421161
18873 -421161 -211152 -159027 43541 101066 -23522 140544 -292205 -111671 -18102 -113701 -176546
18862 -176546 207943 25368 1781 158743 284186 118401 27706 19188 -146216 -77059 -32287
18850 43254 306046 353542 219061 -172673 127211 -280475 123554 -84519 -7871 -32820 4882
18838 -47872 -378520 29206 -85280 -285157 -101441 57951 28696 -171475 -65909 -323147 -168185
18827 -168185 12495 -351869 -102863 161098 123867 -557711 104341 102473 -172885 -80651
18816 104263 -188438 228326 -146911 -10513 90375 -460853 216232 209960 129663 46770 114239
18805 114239 194310 -63468 -321258 7603 156301 -34209 -169636 -201054 131332 -277627 95781
18793 148756 179893 -40860 -156660 67713 -112036 -208053 67925 238009 -36462 16804 -42714
18781 150364 -258323 -210976 147351 79416 25342 55753 -311224 186937 -159534 78928
18770 108581 2123 -219874 -26855 311759 183606 35213 88517 -56501 -10855 147332 -98808
18758 169259 -84577 -269809 -303784 43232 -115799 -86670 -153386 -396958 -62592 52315 -122849
18746 71207 -72987 -230736 72435 -94914 -238413 -275480 -247193 -315925 41356 -52672 -188258
18735 -188258 53804 250773 -36075 101496 264588 -277941 -136374 -225668 -136856 165554
18724 56126 748 2246 274565 -245231 -133505 -174699 10228 22091 30650 66485 196297 -168726
18711 -350044 55461 -39343 133319 -72301 50083 -116773 -20543 7553 153436 -16002 -94752
18700 -94752 -203917 53503 86766 26180 -222786 -353885 -211399 -19326 -20553 -108967 -19680
18688 -19254 53415 -136825 -109048 87391 -110181 -301216 -203069 328 59060 74415 -273205
18676 50492 -288262 -112521 79786 -149723 -116977 -238292 -76292 -308903 -50619 60518 87681
18665 87681 153691 -107413 -62197 72424 -19790 -135541 -75920 195230 -137350 266389 -305166
18653 -93794 -165005 297997 -15755 -278805 57450 57216 -210183 -188818 172335 -41918 171861
18641 -143094 -362602 28692 -141817 -116761 37284 -186561 126002 -32137 46883 -181900
18630 301709 -78287 -158457 27109 10032 -171789 -200915 -76080 -471636 503174 157283 216775
18619 216775 70020 -744 -176428 -207335 -23997 -134139 -108802 -76849 -98511 -155193 -162492 71252
18606 117562 -16282 -66105 -54675 224410 -31493 -73161 -186799 130101 -176725 71780 -112075
18594 -52301 82861 -125851 -186602 24728 105213 58207 -459335 -270100 -127631 -82152 -130609
18583 -130609 255512 -102290 326604 -162225 20647 118619 -287218 -169827 -93412 29843
18572 -341036 -44645 -57376 -149682 -88555 184926 -135546 -101890 -42069 20168 -124116 -83151
18561 -83151 -220677 -197824 -312982 17434 -109081 -375016 -48446 -83212 -204105 -107908 -158106
18550 -158106 -363343 10754 87927 -2745 19870 -47958 -217105 -234169 -411393 -97155 -86851
18539 -86851 264044 403651 139243 -72360 177757 191939 210683 277795 -156110 -160232 -100771
18528 -100771 -16849 -25533 -53107 -25673 -86638 48562 150571 23666 210544 99595 -28534
18516 -218817 26724 -105553 -143321 -147020 -90319 -59680 66657 -100680 -375517 446115 -192447
18504 187405 126426 21791 -28129 -191769 228043 139034 -389064 -111471 64181 -9575 52213
18492 109641 71642 -502074 -131421 26808 -304835 -19218 97866 -505073 -226628 82287
18481 35293 -90749 -252907 -65991 -64323 11834 -405975 52985 42736 -66015 157638 -180157
18469 217732 -83809 -270728 -172524 -232682 163716 -74447 197475 -71303 -38543 -86987 -46911
18458 -46911 -42573 167081 -123978 -104136 298911 -155551 -240957 -54562 25605 210551 155105
18447 155105 80809 67053 -180870 -124379 62737 -198817 -182677 -50771 -155296 18628 -168886
18435 4374 -123671 98435 113182 -242415 52290 264833 -2261 -169673 180581 58169 246443
18424 246443 -58420 -193071 -122644 -272979 182033 -46506 51537 -109070 -153722 -104549 32172
18412 136754 -25482 109337 104750 -152536 -27078 -81378 -127348 -107626 120626 214056 -343074
18400 -217673 -114807 -279396 -384671 81405 -173336 -227154 118448 169410 -268120 71284
18389 69643 229380 50650 -131639 192565 162994 -208573 56581 -57295 137236 -114694
18378 -256000 -121211 12692 8610 -135890 -222818 -111095 311297 -25482 25953 -103486 46086
18366 129662 342269 82279 136546 -49967 159051 -179683 244282 90348 120071 -22433 193755
18354 42317 134451 -72870 222019 -267915 -145198 -254277 105857 104822 -240097 -239511 -38446
18342 -195398 121661 -327955 -22317 -46449 -35495 -192942 16270 -148960 -131789 -12417 -82721
18331 -82721 -63945 161078 -194821 -179015 -97610 -388728 72230 -85555 10084 220566 119695
18320 119695 3709 -1082 -104556 -64219 -172423 156285 -338203 -63921 -69357 -112224 -130862
18309 -130862 134546 71343 -82102 -208274 275640 -105388 -151529 90460 -12071 -294387
18299 -294387 20689 -118550 74724 100027 -70961 -258768 -24761 243185 -144611 -381890
18289 -381890 78222 69751 -295470 -131366 -16540 42669 169331 -73059 204380 -27793 -53136
18278 -53136 47242 161256 68527 -143080 116411 71192 65825 226214 179172 -201486 53520
18266 -108218 18474 162394 101271 -37900 -91816 -462968 -166668 8656 116122 -211102 -142885
18255 -142885 -130039 -67956 -25278 165799 -248059 55502 98026 -55963 132041 105632 -85823
18243 -135955 114906 -154493 -384861 -105499 -240932 -220562 -327674 -56809 -223853 -186299
18233 -186299 -222497 -277610 -37650 -10369 -23803 280970 224030 -90873 -151528 8638 37656
18222 37656 138581 -98723 -126807 18151 325793 -297218 -258030 -94593 -9637 -141677 45777
18210 -174475 146388 -582619 104237 253776 84892 -135447 -356872 -46462 159372 -9997
18199 -29141 140573 -151013 49449 110821 -79004 -302556 24087 337860 -90841 -28732 -290893
18188 -290893 -264007 -278329 38908 128093 77489 -375163 -21470 64631 -100084 51530 -83936
18176 371809 98017 59897 -329806 -177411 40479 -250649 3662 41746 20020 -128869 -244675
18165 -244675 -185976 172414 -239628 -35694 97178 139623 19880 -18631 142477 -52740 276563
18153 25261 -48603 -44186 -457 186672 -207840 202871 162105 -122799 142842 -142036 -212181
18142 -212181 59528 -214748 101547 -150698 24546 56819 1285 103672 109691 158731 58851
18130 -71060 -89035 -10126 -48657 -255171 -12819 -160688 209378 -82299 -122102 20419 166874
18119 166874 -216970 -291737 279758 320890 -827 34168 -35770 -21610 -159472 226642 148036
18108 148036 -125913 -211216 330560 -57024 -46733 220484 -263117 -109756 -89166 -9574 120020
18096 119525 125070 242611 -142792 -89634 -125723 -318719 165247 5343 57044 32719 104638
18085 104638 101036 -159156 130510 -141501 -173750 -59369 -4780 90320 55784 -163550 15609
18073 105243 95187 -194826 -317920 262787 -111000 231409 -376742 -225064 170519 164731
18063 164731 -29710 -125642 -329849 99109 -161699 -120571 320475 386550 -61738 246752 10277
18051 31848 -180264 76006 35807 -44277 -101745 5096 -277535 202880 -150111 -80329 92568
18039 36194 -28475 -15309 -13180 -139099 64572 -37281 -62260 -29639 304163 111377 312585
18028 312585 59313 -56100 -35521 227213 8740 225628 77128 -191368 60913 6968 236291
18017 236291 33398 -227030 120510 151347 163451 -66256 -81698 -208451 -84223 -15752 -176328
18006 -176328 269635 33763 120958 300653 -247015 299184 -92913 182994 -348623 -80117
17995 -97715 -27360 154004 -81055 -6727 242066 -199570 -33869 -199118 -214617 -91905 184405
17983 -108327 16671 45370 -174201 -97591 41201 1639 54159 -65364 -15837 -116275 -5632
17971 -63081 105812 118167 77446 -101879 -76165 -3541 261188 212091 252756 -254496 211366
17959 -91544 -6259 251137 91907 128106 -88075 94429 -12185 -47647 101672 662 -22070 217474
17946 34214 -89545 259796 -53537 29836 -14035 -63113 -176771 -165636 -178221 227275 125481
17935 125481 -304342 101257 153366 129249 -195487 179061 72048 -14994 5428 294667 -176779
17923 70426 30238 10104 -69585 112007 -19968 156706 115096 -302525 -38489 -176234 97278
17911 121467 -169422 151729 117603 61452 215211 47125 -16317 14783 -180833 -119383 265429
17899 -104385 131200 195225 251694 -138687 77126 -27198 -108485 79364 347199 -23877 -30164
17888 -30164 136269 160512 -63204 107818 413209 -42204 107751 292281 185440 46434
17877 -324223 205940 -93770 -246312 -247193 -251459 240058 -60445 205774 33602 -11627 -8131
17866 -8131 -307051 -132145 -158055 131442 -302360 -102274 -292485 142151 76944 42188
17856 42188 -239451 42482 -383050 48843 -276301 48897 -118170 166161 108210 123996 267432
17845 267432 -174278 1500 -223995 208802 100650 205505 38798 18242 191144 -174395
17834 192713 44944 80874 41697 -18156 131397 -336067 254524 -30549 130511 4472 7228
17823 7228 -60835 337627 339767 -20588 154053 -11854 34584 -24234 -174465 84761 132556
17812 132556 -324508 39781 122216 -180952 -269637 190518 291868 367130 -61712 65616 107083
17801 107083 111400 -37301 -75591 158792 166442 343110 276443 99930 -66228 -270849 238247
17789 -113921 191594 -64257 251304 -193933 -10636 -102520 -218417 -128153 -224948 1008 1545
17778 1545 120913 -43414 81210 -41293 -28000 218262 -100957 167822 268825 -40926 -253305
17767 -253305 181526 -189530 39019 76942 -6950 215566 -15992 73379 -309613 -168237 117850
17755 -4043 69216 26285 204779 50440 267297 -110465 243206 44669 26011 402688 -57747
17743 -15920 219315 443708 224757 -76339 137729 -286180 168217 260784 220941 -248510
17732 489301 116786 154702 195031 27951 61485 351184 406161 220943 124789 83179 49324
17721 49324 357464 262926 -152625 238996 206949 57220 165458 9432 151231 6656 -521154
17709 307594 160031 219753 23254 329522 -236491 -55940 -630 -76889 309575 119566 373638
17698 373638 195150 343269 249135 25721 38509 66409 79850 114588 -198859 80541 -181680
17686 -127993 212411 150131 126167 204623 -2450 43470 -47605 -98923 -87207 623339 178856
17674 209367 280139 -57089 171665 94412 40615 355774 6582 -40128 171422 238760 8854
17662 -34973 146480 75144 -184799 9953 -270007 -78561 217636 36603 86428 -43407 124574
17650 369007 43992 196523 343052 101989 98108 412531 123413 -189700 123966 29606
17639 -73047 100321 54256 118747 138781 -126596 -86312 30373 150102 -35198 238205 -30215
17627 -26333 26309 -223523 169169 65895 -138888 122611 256258 107145 -297021 213100
17616 -124916 302918 126941 -76920 113954 61614 274509 270080 -68993 -198739 -98274 322594
17604 65399 407297 42558 240847 436948 124216 -227341 157875 -26953 151937 -299874
17593 -24875 338632 291206 216705 150869 195681 120581 -12382 -230271 70746 217881 325289
17582 325289 152405 377799 -232995 159989 -523985 95467 242891 -78169 -1729 51835
17571 -314066 23478 197597 -82792 21369 321399 244430 -175098 -247631 198873 236564 296863
17560 296863 52073 -31631 64236 -233683 259694 260797 65318 146509 -150343 362470 -7402
17548 116376 104942 90877 58220 -110541 124933 351409 419160 113890 -180993 172286
17537 50238 358703 236222 49472 168237 187953 78727 93632 165519 242309 575375 588809
17526 588809 612890 710490 400903 854079 806964 666422 181021 145426 68772 -107222
17515 265568 350733 470985 325465 -228911 521812 656216 623747 673347 940797 686824
17505 686824 268743 664716 232716 137158 121308 -59872 385215 356962 311354 487849
17495 487849 6044 136258 445890 302546 61659 32368 212765 241918 268105 276744 184751
17484 184751 247419 175755 269636 532761 227783 221302 152331 454084 59701 -40342 -11836
17472 220538 390454 42781 402217 103186 -330858 -6726 116223 178297 275615 365722 403773
17461 403773 54850 58012 -25876 365454 49531 152756 158940 251410 362583 -2286 250713
17449 297033 218048 499167 322104 427707 346717 292369 303787 683464 512059 366325
17439 366325 -105749 133215 338558 616883 279520 511620 93099 71451 468597 298809
17429 298809 55194 247453 182303 25449 160767 378452 130270 477286 213427 379763
17419 379763 145304 152913 -65731 414815 425811 215459 299383 89599 242716 93391 231624
17408 231624 250624 367864 275085 -63550 184293 57921 115347 316634 211400 694789
17398 694789 333223 -112405 315849 303094 226870 343109 326812 -40112 360240 440885
17388 440885 316229 238956 179928 111394 275389 346296 338048 30109 213875 452750 -148641
17376 -64203 -123448 222229 303945 136599 367245 266041 162015 30856 -77370 511527
17365 270055 222235 362491 107306 788816 127339 26455 208036 66091 387036 -117954
17354 35334 176189 195517 222287 189481 177831 -109290 141703 -94036 -49240 305864 602763
17343 602763 239187 467825 163588 131538 524675 72468 207106 9192 16732 45340 445053
17332 445053 255079 163241 220077 280928 134508 441852 163771 190430 258468 385843
17322 385843 370044 481223 268743 303641 129891 184673 121310 106136 345622 -79856 123827
17310 95933 2171 211436 224733 356872 378577 227889 218455 148754 429910 490014 69855
17298 277857 -32020 340439 183809 -57227 96904 83462 212097 -25236 358056 306914 299477
17287 299477 363361 -13312 -3427 177963 355810 495393 476663 163008 250213 243478 -12492
17275 416162 20205 621980 314326 300003 288344 52183 341960 323098 130377 315350
17265 315350 -4409 7121 150380 166059 228078 355954 253023 65000 218347 208176 340336
17254 340336 266632 565346 109162 249510 -114356 447457 226080 -69112 327337 441939
17244 441939 205841 295476 470413 349971 59948 -2623 190434 92320 266714 266905 94619
17232 378941 183517 434481 464091 285348 224541 428092 204190 265971 207354 560665
17222 560665 238119 -92602 94532 300770 555105 500048 379234 122889 95019 607041
17212 607041 446117 330196 652217 144493 758891 200094 193834 -29063 26293 183232
17202 183232 308504 170355 456721 552251 425527 332884 430109 238372 599498 132668
17191 488253 232801 441318 328887 460786 477274 529762 443583 357508 680238 171682
17180 216178 674549 496453 435661 481383 300584 360270 252645 788093 340543 394554
17170 394554 371199 359736 19339 560187 439579 442771 561228 226255 293444 560776 308366
17159 308366 545785 237562 431083 342436 538611 356086 549667 357274 181415 241803
17149 241803 955396 538187 702341 419589 282183 537762 444228 379700 457241 589709
17139 589709 492933 257049 681602 339999 647672 299834 760204 591020 241961 379855
17129 379855 327133 583383 666061 657554 509876 651351 571667 458909 692009 399742
17119 399742 282357 611711 429823 515714 455813 430689 590244 543270 437561 402145
17109 402145 453891 468014 293158 285054 335567 772285 536639 428570 479973 807260 479176
17098 479176 819088 573176 320795 526728 319427 495707 530458 632262 395897 290178
17088 290178 851272 527595 683498 466607 785263 709812 657265 699277 821878 632080
17078 632080 667603 783368 694073 441142 702025 632263 485581 400800 1023603 575919
17068 575919 998216 680932 1041944 700495 897151 652897 681675 727369 704100 596591
17058 596591 686956 772602 751583 828237 1229823 725377 715902 836543 693122 1016957 950250
17047 950250 976929 969439 644605 929775 506066 749727 780480 985175 716616 1120999
17037 1120999 825472 915814 720808 783843 652362 979906 1080005 871387 824796 960036
17027 960036 833085 1256080 907199 1061869 805314 1029689 1097066 980077 737417 794329
17017 794329 1060540 894904 1195839 979944 980074 1106719 926731 1109710 1226220 975768
17007 975768 965624 1113166 1128136 734185 1345373 887051 1345065 1109718 1535016 1018128
16997 1018128 1169008 1137404 1364319 1376775 1060693 1229256 1124619 1145726 1281327 1141850
16987 1141850 1056778 1577025 1040791 1625721 1440159 1279217 1613440 1189523 1311678 1445294
16977 1445294 1678560 1227861 1536777 1210765 1251925 1295485 1316785 1386512 1327097 1496277
16967 1496277 1648116 1561987 1503998 1787265 1785043 1379447 1525701 2015987 1605465 1757349
16957 1757349 1400764 1556636 1294882 1429993 1695739 1936478 2014386 1521565 1524235 1685337
16947 1685337 2028969 1910333 1787155 1758521 1787248 1944533 1893971 1804163 1752053 1841130
16937 1841130 1937684 1578305 1866634 1805462 2079234 1911219 1985219 2087848 2092308 2116810
16927 2116810 2184753 2148849 1968795 2187047 2128115 2447075 2594810 2056631 2142491 2377335
16917 2377335 2448019 2426382 2509674 2401060 2490302 2724232 2618145 2387304 2583804 2638161
16907 2638161 2507383 2304623 2808513 2832185 2915646 2910351 2506786 2821174 2772759 3275624
16897 3275624 3118319 3025337 2992531 3037956 3156775 3079126 3124670 2938948 3400184 3286510
16887 3286510 3243419 3431650 3647191 3155776 3826099 3895429 3639366 3802526 3761684 3847616
16877 3847616 4012679 3832034 3845003 3643107 3680112 4080982 4241689 4095358 4429205 4497419
16867 4497419 4555291 4652300 4718668 4210265 4689618 4494759 4925337 4756726 4892983 5023439
16857 5023439 5096427 5172200 5307005 5294853 5304335 5347235 5188607 5399031 5798066 6030242
16847 6030242 5960012 6199276 6348665 6294046 6045466 6529842 6538263 6801901 6563327 7023373
16837 7023373 7102066 6893809 7369078 7211651 6980769 7637088 7628378 7633020 7869093 8021642
16827 8021642 8128667 8364385 8772907 8726977 8841838 8996738 9586622 9404427 9693008 10048522
16817 10048522 10048901 10089027 10259302 10665259 11026392 11089271 11467318 11882021 11978435 12022480
16807 12022480 12198826 12740808 13071956 13372540 13702625 14095017 14377736 14644155 14916846
16798 14916846 15271608 15813486 15947214 16521059 17064920 17096204 17890339 18216826 18537698
16789 18537698 18890519 19356662 20091566 20923438 21238080 21667720 22220787 22973185 23808110
16780 23808110 24416687 25162656 25627097 26859559 27263794 28022928 28863422 30117762 30766430
16771 30766430 32003548 32984935 33639762 34999750 36080541 37122784 38042542 39247932
16763 39247932 40554685 42012414 43173518 45037859 46034950 47291982 49207200 50721195
16755 50721195 52755409 53892264 55882289 57902688 59277781 61321389 62887308 64874291
16747 64874291 67342673 69138594 71268466 73239145 74858437 77084951 79222981 80965328
16739 80965328 83027394 84779739 86482908 88033276 89987819 91594500 92644549 93928083
16731 93928083 95181745 96117458 96963527 97334641 97667848 97615397 97412689 97824831 97274905
16722 97274905 96853378 96002343 95282846 93995001 92931723 91513467 90100352 88624333
16714 88624333 86858131 85273620 83294251 81453339 79392528 77319208 75555645 73526777
16706 73526777 71518457 69532582 67696598 65701674 63912883 61933740 60026377 58003185
16698 58003185 56673264 54891190 53344081 51226290 49862424 48134178 46730681 45575483
16690 45575483 44348282 42558462 41262006 40172508 38823660 37748474 37130619 35851631
16682 35851631 34449756 33484520 32790499 31697691 30792444 30027537 29236794 28654467 27463561
16673 27463561 27028604 25842087 25497917 24432952 24285075 23352676 22837904 22267467 21888600
16664 21888600 21011433 20565879 19953134 19678524 19122500 18751059 18274529 18138469 17357892
16655 17357892 17033629 16839332 16256154 16035057 15734032 15423773 14894982 14532948 14283850
16646 14283850 13920550 13784129 13866348 13422056 12970995 12804546 12579414 12137552 11953306
16637 11953306 11945062 11617108 11292733 11054006 10635082 10738129 10475117 10146835 9860870 9806921
16627 9806921 9814731 9601631 9588886 9266656 9270731 9029019 8361626 8849901 8361594 8342578
16617 8342578 8292264 8366485 8058807 8042538 7934814 7645132 7666935 7474487 7377129 7178975
16607 7178975 7240140 6974282 6790036 6764497 6761306 6728222 6178684 6583095 6436656 6181258
16597 6181258 6039649 6089819 5785884 6100686 5583572 5965254 5589008 5698135 5459366 5440086
16587 5440086 5504655 5170196 5311502 4879457 5541859 5136528 5137726 5017731 4865489 4846774
16577 4846774 4829845 4673279 4553268 4532083 4441109 4159548 4428013 4175422 4479987 4421936
16567 4421936 4583232 4114482 4334161 4328905 3904330 4088797 3811617 3859413 4129387 4012820
16557 4012820 3914363 3931041 4101457 3924901 3531436 3608209 3097821 3343244 3377472 3413162
16547 3413162 3317049 3285532 3343955 3644806 3221861 3309969 3400138 3145783 3319438 3143508
16537 3143508 3099641 2962025 3231662 3066077 3192069 2958242 3030850 3244155 3081179 2829161
16527 2829161 2893595 2943604 2676056 2759334 2867270 2684940 2854213 2768529 2744490 2577179
16517 2577179 2565604 2519565 2444859 2379095 2513799 2604883 2146932 2643744 2283007 2572645
16507 2572645 2483397 2139272 2463486 2641339 2709233 2291469 2372044 2461279 2201664 2438968
16497 2438968 2017557 2375759 2093701 2121335 2160331 2258774 1946332 2157564 2050829 2182797
16487 2182797 2121429 2247842 2060734 1831911 1862581 2093730 1569172 2041566 1832468 2103488
16477 2103488 2039408 1911968 1397203 2214197 2020921 2004849 1888999 1819365 1919648 1966992
16467 1966992 1698820 1911474 1974508 1693432 1545501 1886856 1690133 1981207 1728504 1670332
16457 1670332 1841753 1484894 1912959 1811054 1662726 1889541 1642999 1668980 1578911 1531597
16447 1531597 1812315 1681114 1346909 1427449 1585882 1437577 1593098 1647847 1408245 1430466
16437 1430466 1683480 1431981 1198066 1229828 1532713 1427580 1685228 1605283 1504947 1494874
16427 1494874 1326867 1447320 1469151 1524423 1240624 1442461 1311760 1418074 1488562 1277764
16417 1277764 1242261 1413622 1042285 1557635 1288033 1136001 1700453 1605506 1307577 1147334
16407 1147334 944500 1102813 1307651 1521756 1106455 979269 1231105 1509769 1516886 1043735
16397 1043735 1298909 1247520 1254389 1090481 1142368 1272897 1160446 975587 1143914 1239510
16387 1239510 857307 654449 1347467 951548 989204 1291508 1152336 1047653 1329396 1069631
16377 1069631 1056500 1292245 862581 1231653 1086962 813688 1175221 1063872 1150351 1052347
16367 1052347 1370510 1021915 1319302 900249 1038156 1000378 1342405 785192 1128619 812556
16357 812556 874369 1024804 1180475 1024498 844116 632323 1180207 961542 1089394 954345
16347 954345 950103 754129 1120765 824429 901204 979310 521606 1092886 966649 824712
16337 824712 1086750 1129833 1060810 854020 875055 883353 716809 956904 763862 749497 773211
16326 773211 1123327 979775 772257 548280 926302 876408 1032141 920884 606305 967730
16316 967730 808135 612371 752381 604304 960940 584678 978231 766934 881488 810144
16306 810144 931253 863499 688948 895653 762937 1113188 657489 1028814 439358 893052
16296 893052 1005692 529329 697700 612678 870336 687063 641234 722467 708087 877464
16286 877464 825111 931482 516897 1051502 625132 663438 637449 688915 503198 637359
16276 637359 819381 656313 548857 653674 824361 661268 583113 505902 454942 895744
16266 895744 678172 799564 661882 878879 732445 611959 539520 705819 638301 808245
16256 808245 771924 606781 736090 506282 507256 294115 451500 583864 565160 556361 692301
16245 692301 537624 557721 812148 898813 666185 423003 331697 517971 511577 517507 713547
16234 713547 270076 514403 644801 422288 486228 336184 518319 793033 414967 660716
16224 660716 503651 600691 645547 564206 519798 569186 648711 832123 260992 682333 230006
16212 563173 286215 271689 431212 622224 404741 807126 739239 693991 302066 530211
16202 530211 335951 564159 271491 514130 492274 652206 565931 319272 522255 526472
16192 526472 407848 567962 380860 633005 591115 315391 371050 474271 33658 231059
16182 231059 673577 384669 345567 490321 415527 282263 424486 333964 91205 36236
16171 328646 344721 267374 378375 260322 234724 215654 116882 502681 262076 267713 483598
16160 483598 42047 203060 506014 367815 594081 311502 430368 143671 154008 258723
16150 258723 -36489 241199 451367 493993 333086 286704 132485 605448 177648 508654
16140 508654 307732 56740 406014 443853 244768 246044 125399 681839 448876 -131292
16129 290897 403295 278570 210753 392349 160128 670086 -42776 323895 222847 193920
16119 193920 460942 58490 323667 269889 491101 147599 533995 615824 374449 309780
16109 309780 350873 354502 51620 218148 54640 215792 225406 374748 235314 98876 440376
16098 440376 265337 184974 -110489 -55878 195498 198999 617697 315286 131879 20599
16087 331075 418880 122041 50680 260561 580753 371999 214450 228796 385664 204843
16077 204843 287633 112121 400338 62518 217745 -9386 -19124 14768 63293 459072 -1597
16065 236555 259080 218695 -97559 194738 39920 123629 -160006 84271 90155 322753 -11793
16053 233037 -102217 232110 73860 366691 25851 76928 308271 144497 234871 312789
16043 312789 73687 231627 14214 540580 32216 466453 329742 475381 552225 182669
16032 3537 15620 -72382 69086 -144279 -52543 -117593 -42596 248315 197570 70244 21600
16020 91931 89571 41797 160353 161633 198491 27160 328863 575446 263846 -31236 189943
16008 159993 194666 88304 392191 -46429 205908 126347 366647 575498 151248 262571
15998 262571 -1173 94767 -242891 -125023 56902 62798 433748 108938 408875 800997 1007034
15987 1007034 941172 979584 1460157 981590 823059 838073 484962 613164 -17305 -241420
15977 -241420 147745 80534 185525 -3155 316349 -99605 106768 -94900 173666 19617 226341
15966 226341 156147 -76576 58685 15897 -95922 -246591 275047 60 323371 130588 -77932
15954 148983 -52810 -70055 23829 53104 -219514 214994 263507 -362938 35652 209728 108022
15943 108022 -84660 224395 -44266 -222481 86807 127791 217207 -15958 168196 -61694 26079
15931 -304823 175353 179830 -53525 191938 14087 -106721 163581 -228735 -304893 -13678 90696
15919 63918 -99796 276177 116157 -21810 6030 -114306 -91458 410203 103529 -115536 245580
15907 185764 104242 -135166 259276 -116650 172423 91214 140659 78611 69545 109257 -185079
15895 -45011 32780 22686 -30061 -139696 -266505 -213516 84396 107951 188182 -90004 153557
15883 393041 14316 -35043 -71392 153328 205905 -90802 528560 -17070 -74882 282057 -280905
15871 -248348 -175493 -78940 -83862 324922 -34289 12453 -54078 30885 214723 22624 47872
15860 47872 161113 -248279 187178 -347852 -37251 -176361 109937 28954 -158914 294322
15849 100567 205120 78740 68783 -247657 -105655 82075 112352 -153958 208166 -167211
15838 59965 217876 72597 54946 245988 220978 -49214 90658 125280 128356 -80451 173889
15826 -111382 -181775 30128 -15653 -76010 43585 -167210 -130052 -170071 14207 251638 -219464
15814 -13410 -145511 184399 16125 -78396 79984 52750 131707 -194868 -197154 60046 -97951
15802 118310 42613 36035 43108 157871 -185680 16548 -408576 2852 237958 -67971 352643
15790 348006 -156403 -37563 -26228 227973 211440 -4342 157417 -118395 299506 141478
15779 8763 296735 111837 -55170 145393 -149308 15393 70239 200849 -375221 -270687
15769 -270687 89473 162964 139777 234069 -30637 -151960 154273 -145768 224306 138746 -101065
15757 -104864 78434 211763 -87988 129111 266936 34060 -162396 81457 283144 67958
15746 -108204 -52668 -256107 -397173 13266 -282746 124716 214092 -124402 40134 -64430
15735 207639 -108238 -226500 80002 110807 -149947 -140370 -29288 -65543 -318087 -238417 57658
15723 50564 130816 91382 -122674 -172113 -4499 170967 221308 -152581 106771 -128746 -12045
15711 43389 34947 -306044 -231523 -64087 -21786 -208644 335428 -42169 -33355 -288483 -48176
15699 -53867 -79002 294686 -106394 -32105 60553 -183459 21432 82080 272559 -92165 84109
15687 45812 78462 -299241 -103360 -215528 -180530 11320 -322877 23533 118046 -136296 -289056
15676 -289056 -58053 -108182 188010 -78583 -134860 260680 114539 -38272 -49478 53578 74628
15665 74628 -84449 -42524 -51837 -213480 345186 25652 65585 -16303 -182580 -33538 -11649
15653 -132285 173342 -39675 -204806 164515 196216 -180097 139836 -99565 -186288 183424
15642 83313 63564 9162 42326 285480 -276010 -104641 -239461 -46734 172667 272453 -112575
15630 37645 -270315 -169544 -153540 -83652 -117656 -152345 58250 164370 -174175 -4290 -148098
15619 -148098 -137052 16185 189708 6335 -357453 -61581 -124604 50522 -8246 -154085 -11432
15607 788 -205326 -41762 -232418 113862 154613 233050 -11431 -327864 -3418 46286 -110952
15595 61757 -162085 -319175 -3610 -136920 474764 10463 129095 -17008 -51677 258437 -41014
15583 121210 -250952 111837 249834 112411 -23020 98851 -243436 -37144 1432 -179990
15572 186234 288351 157310 322127 -305562 34491 353320 19590 65849 -15827 -56695
15562 -56695 164519 146201 -28460 -133201 -14526 -83543 28614 -122003 -20454 17468 26072
15551 26072 129116 363209 20635 185435 262819 -243525 108546 114721 112838 -146071 115615
15539 101083 165406 26028 -241999 -83795 193116 -68654 -329768 -278000 -78134 205403 174845
15528 174845 -32154 -73502 127438 -228668 337248 2930 360923 -94893 -369886 268690
15517 278216 -135993 153040 197607 38790 467681 -136739 111117 217187 -366916 96483
15506 150755 -112635 136621 -202123 171532 351755 192178 -85762 -118783 142781 73811
15496 73811 -192203 182082 -104035 246609 318110 -70069 47210 234379 -228093 116254
15485 -126544 143798 -250250 153045 103250 276982 -289336 116077 11587 758 228681
15475 228681 381923 373518 519750 353161 160656 205428 205018 -280240 79301 26177 103341
15464 103341 -3239 -115067 224626 -134510 -356774 35414 -53982 -308382 -175112 -212576
15454 -212576 113163 -32809 110793 190484 -62097 186649 311089 1755 -135936 298097
15443 468978 909592 960086 1041487 573819 516332 416853 390758 83807 230841 -88442 93818
15431 -74783 117214 -117736 184251 -16886 -173084 -276191 94090 -88266 -241832 -240015 -104202
15419 -287166 -129779 70611 15093 -198097 -315828 -3174 -217226 84814 -54694 -95310 128468
15407 154686 197258 133183 141184 -221062 -13552 -112831 -6162 14148 -393797 -28792 -64785
15396 -64785 139802 119786 -123012 17380 171423 109250 -235724 -176410 49444 2947 215268
15385 215268 -267369 -100260 217344 -63075 -61677 -8134 2394 195192 -129516 251518 697
15373 250688 250429 62979 102427 -126913 -179716 -18856 -221527 -35002 -5084 -232922 244316
15361 115100 46648 -115881 96184 130451 213509 178001 154453 -36282 196789 94519 440524
15350 440524 227420 273212 152653 183120 -249797 190117 176009 49133 570111 216179
15339 158953 161489 222840 182771 377236 112258 93078 24115 126861 224067 106452 -175010
15327 186670 294335 -9998 31493 -187144 -77232 197198 103257 -82272 217846 -56566 69363
15315 89000 -93005 -62801 -135663 38262 240861 392751 186840 -150160 -26030 25636 149112
15304 149112 89339 135748 74404 -176874 -49997 330319 -2323 160981 187252 -63564 165082
15292 312725 47016 -23772 -245306 -113348 5064 36550 -6447 -263628 262313 159627 -41774
15280 57445 21372 -251734 148731 -3597 -69304 -65842 -186641 60603 244344 -200802 -130731
15269 -130731 -300906 129719 -109408 139843 290638 -123427 -308617 82606 -314527 418529
15258 53130 426890 -123077 102476 -278699 -61418 55961 317527 -103463 220818 375223
15248 375223 263985 442217 394718 1231003 1530743 1342956 1511998 804987 380612 464162
15238 464162 149419 324259 -103020 334703 -110384 -82818 202621 3630 -117720 -391380
15228 -391380 -216808 58252 328184 54373 166303 -150387 129335 216610 -129623 204349
15217 -44472 37662 393196 76684 48726 65206 179400 168053 -84737 57189 341541 239804
15206 239804 46349 -82827 197822 106728 418187 20053 -160680 -153183 183335 45207 -232814
15194 -41109 -60652 166093 128912 161029 223527 232736 -171370 237315 -89197 232427 156980
15183 156980 325692 -170640 423155 221205 12197 -261963 209104 -150162 -153250 133570
15172 339839 -331763 490555 -108156 335822 -116915 -174198 -151741 93172 127551 -26983
15161 268239 -73475 -70578 264358 -119113 271395 -254584 -187905 -43691 76187 -140104 250806
15149 250994 160285 149941 204382 150090 24601 276610 75953 116233 11189 213640 -222087
15137 61294 11381 344092 -32276 -35925 -24142 -216084 -236914 -15935 162483 177740 76381
15125 165973 409509 -7873 184909 165188 196022 325834 59208 410055 111058 -96499 -193671
15114 -193671 123277 213435 150571 -150264 252974 21021 -20798 23605 -155227 -36074 -49144
15103 -49144 -82866 -65082 7727 165813 170802 -189656 72013 -204647 354431 37346 493166
15092 493166 80070 141841 373217 -41850 -137948 -179828 56976 -49191 51273 89535 -45119
15080 36130 268856 122329 156365 219609 153937 54794 -95948 -147465 218656 -224716 78100
15068 107475 -163889 444195 299499 11117 221136 189842 575273 358677 46928 23848
15058 23848 74577 184483 332496 288003 188070 161659 190955 247499 25536 361837 151335
15046 156411 465772 366197 470920 94811 284926 134037 136748 106228 317615 44182 585571
15035 585571 182298 -37996 538910 254499 442565 341656 605552 446156 599361 425914
15025 425914 443851 417072 262991 264787 -89381 274281 537117 263044 453376 416726 145705
15013 267129 441840 573764 160805 -175677 196810 160332 136866 371748 239498 423734
15003 423734 301898 420507 86419 305223 436528 311251 377636 395868 457446 102744
14992 -77189 414512 32122 224390 233965 326720 545621 270482 -105229 517673 132781
14981 427512 739709 756610 578268 369170 315550 396220 643512 497037 245874 178689
14971 178689 240317 443858 493148 98634 612915 625951 12449 393440 358090 188152 408801
14960 408801 445036 333159 260880 40493 367739 117719 410741 875 35413 133695 185727
14949 185727 213022 350365 387826 308168 603097 531741 765498 715339 539960 342846
14939 342846 293 35474 291026 283070 513410 538508 236699 604106 1183359 890092 710244
14928 710244 928879 1001667 806295 1471036 1270222 1105939 818216 1032633 1062404 1481240
14918 1481240 1733051 1496738 1672848 1082239 1192459 943982 871761 780288 325864 243886
14908 243886 435539 465273 546197 442415 103507 408773 520562 243831 -17415 578513
14897 350504 547919 332239 63207 442595 224872 565932 295908 653092 496012 260676
14887 260676 446447 701862 781446 357738 370680 504380 432585 715551 401803 759532
14877 759532 589328 519418 245031 546285 251643 389562 386169 415048 482673 683092
14867 683092 456476 369678 492392 587190 620271 261056 133339 458688 296027 297339
14857 297339 627436 261863 438472 442305 374619 294464 70820 406114 357769 463369 320485
14846 320485 399292 567144 372692 974786 856321 958859 758185 728751 1080525 658862
14836 658862 663127 529206 293869 806185 526596 715761 437987 688694 477477 535814
14826 535814 545346 516356 407826 237707 427349 754845 715635 602175 632003 369131
14816 369131 730545 863278 433027 350147 439597 491647 559531 693048 762793 338624
14805 973729 663308 578695 746080 538632 577986 423393 636993 531085 373596 661327
14795 661327 383887 562227 1022715 673036 416889 660454 607655 293387 253202 293538
14785 293538 792208 539514 703569 313209 498304 590362 389537 533870 595986 854551
14775 854551 736932 768349 788380 860017 581548 585948 425851 456922 428785 891359 294362
14763 777423 669227 483724 342140 335415 361990 390331 753925 203448 559354 786417
14753 786417 327265 399990 461750 554604 261669 509055 554104 505147 306203 610484
14743 610484 578350 703586 630146 447425 935396 338322 915729 718057 346814 527874
14733 527874 867462 801226 933840 952142 828565 1190077 1110675 1110251 1481077 1193927 996234
14722 996234 1401361 1005098 731451 967548 1004566 928483 952195 678136 825684 783962
14712 783962 669701 716137 892604 1011108 746581 574730 1113155 911232 1149350 1172194
14702 1172194 1507698 1334688 1266350 1394234 1266681 1216379 984462 819402 1121308 1047320
14692 1047320 867827 770598 431935 1024895 891269 486817 1040046 892212 848335 828900
14682 828900 359130 844702 786635 672024 719520 848943 817081 958092 902847 928672
14672 928672 773233 969768 665643 735480 790588 849497 938947 906718 880625 1020658 730738
14661 730738 837758 1004138 745346 1088936 952714 685099 1204640 1113212 938600 1260237
14651 1260237 1161355 1335770 897255 1298863 511761 1023533 984952 1076061 791752 884299
14641 884299 1015108 1121086 984415 1046497 983217 876726 1240864 1081711 931047 939926
14631 939926 1243613 1185064 1061681 1165449 1222656 1201781 1001930 1092110 850575 1181226
14621 1181226 864272 1377172 1062621 1205681 1285701 1293005 1150497 1179839 1221972 1283381
14611 1283381 1497875 1344447 1255019 1169171 1294284 1669849 1286697 1239867 1312257 1456609
14601 1456609 1453899 1505936 1586878 1330442 1435078 1184706 1385184 1606151 1398820 1658232
14591 1658232 1840255 1451625 1511155 1678327 1605416 1545091 1533920 1434004 1421937 1785482
14581 1785482 1500920 1538750 1558080 1701100 2098760 1875340 1409590 1841252 1800972 1910774
14571 1910774 1770179 1612577 1653858 1813810 1666362 2323325 2050231 2388301 2108967 1901168
14561 1901168 2000546 2155698 2403647 2346060 2661932 2885816 2679305 3273439 3453427 3942100
14551 3942100 4590154 5841996 8120585 13145681 22319302 38270285 33087796 15048890
14542 6089447 4255092 4748179 4085660 2405857 2156364 1701388 1773607 1694009 1679456 1877073
14532 1877073 1713682 2047924 1788031 1810528 2070460 1496291 2170710 1926108 2104257 2043069
14522 2043069 2165266 2287002 2308458 2032477 2172332 2374480 2186910 2449133 2664513 2252923
14512 2252923 2340585 2611005 2646567 2257377 2642931 2453897 2530158 2663687 2542098 2525746
14502 2525746 2480040 2852265 2879960 2840757 2684009 2842930 2612154 2964637 2978348 3190365
14492 3190365 3183458 2690429 3103939 2764061 3030507 3104562 3038989 3201367 3187010 3239999
14482 3239999 3360127 3354555 3221133 3577511 3077954 3458902 3407584 3800187 3615004 3344921
14472 3344921 3520960 3660011 3806124 3713937 3625107 3613922 3905971 3564439 3980794 3908992
14462 3908992 4207285 4154607 4152914 3992396 4140000 4261470 3926907 4375859 4614922 4120289
14452 4120289 4426359 4371977 4246510 4345779 5011683 4646456 5211393 4943409 5266910 4771171
14442 4771171 5206782 5153547 5141038 5285665 5345382 5318126 5592456 5760994 5532321 5554991
14432 5554991 5618301 5583953 5892616 6018016 6185869 6468233 6226216 6646809 6426451 6386694
14422 6386694 6898543 6846262 7088575 7165227 7073078 7319958 7609512 7662959 7568605 7562418 7650320
14411 7650320 7801690 7984061 7836011 8392083 8124001 8410293 8864074 8920017 8651118 8842719
14401 8842719 8889096 9203907 9260001 9576641 9742416 9394036 9843440 9822733 10295873 9962879
14391 9962879 10683079 10849387 11209323 11011275 11382053 11491785 11632190 11735004 12293676
14382 12293676 12373553 12995841 12981846 13006580 13369080 13350466 14086701 14038680 14096883 14942193
14372 14942193 14890963 15388623 15609915 16058330 16000457 16699840 16925353 17355341 17799502 18378940
14362 18378940 18197623 18446804 18858254 19607478 20295917 20305968 21076628 21234497 21754520
14353 21754520 22281271 22649228 23378618 24163485 24675396 25437525 25628244 26714944 27056225
14344 27056225 28100651 28617050 29603514 30551815 31441744 32206827 33047486 33976634 35232752
14335 35232752 36088673 37590981 38737218 39460392 40750505 41994699 43100227 44831159
14327 44831159 46342470 47553840 49786637 51273163 52883051 55117388 56624546 58863609
14319 58863609 60830187 63072629 65311524 67724920 70143717 73279130 76073557 79202910
14311 79202910 82686624 86080632 89793098 93441399 97879554 101716159 106764605 111545106
14303 111545106 117073700 122092773 128563590 134560498 141233503 148432252 155701445 163939051
14295 163939051 172394574 181160168 190885253 200748353 211655740 222691846 234687988
14288 234687988 246939610 260117390 273342002 287286398 301293377 315779875 330578844
14281 330578844 345178160 359588563 373918236 387720944 400308847 412161973 422515214
14274 422515214 430344548 434038777 434450289 435441459 435768416 434383230 433910580 431176341
14266 431176341 424097154 413650614 401323718 387502124 372909888 357482875 342086450
14259 342086450 326454452 311200841 295868024 281284379 267010781 253301450 239959716
14252 239959716 227495571 216630694 205777623 195137306 185182083 175341367 166688804
14245 166688804 158894575 151527899 143903088 137069385 130542666 124249546 118444569 113574727
14237 113574727 108367517 103933606 99031666 94620615 90980512 87096500 84157824 80499880
14229 80499880 77137350 73954994 71686017 68587591 65772351 63439573 60975213 58970821
14221 58970821 57003318 55140240 53167124 51351533 49244389 48256216 46468549 45290487
14213 45290487 44133384 42326000 40912728 39673632 38783375 38027170 36531653 36109309
14205 36109309 34625525 33576640 32691232 31743435 31247416 30483418 29625170 28787407 28054112
14196 28054112 27509182 26678564 26397365 25627306 24899534 23832167 23733817 23140145 22737265
14187 22737265 22188630 21115427 21111887 20766889 20078345 19649956 19333901 19051882 18179127
14178 18179127 18104060 17833381 17461217 17274766 16797942 16111464 15813684 15486447 15870069
14169 15870069 15440742 14891133 14858178 14175435 14074111 13997539 13450617 13392309 13302157 12897105
14159 12897105 12629325 12690305 12177141 11977799 11623837 11700474 11441501 11056137 11208882 11062518
14149 11062518 10970934 10470363 10443402 10095679 9991766 9752671 9947976 9743567 9292902 8981599
14139 8981599 9468282 9004177 8628914 8651972 8488902 8302979 8461043 8203032 8343326 8107392
14129 8107392 8269005 7732011 7763187 7580342 7480920 7512357 6971612 7219124 7154051 6688943
14119 6688943 7329945 6906941 6664715 6705923 6666338 6416099 6158021 6364929 5992310 6371301
14109 6371301 5834331 6246132 5819118 6105440 5695099 5725445 5663180 5382692 5253578 5553246
14099 5553246 5454137 5444572 5551836 5447464 5300506 5346618 5593977 5022498 5219667 4977840
14089 4977840 4669230 4777965 4254584 4338531 4612644 4722934 4534540 4615691 4562800 4524041
14079 4524041 4286800 4300403 4147693 4257472 4000059 4183090 4149676 3775575 3855032 3558407
14069 3558407 3684153 3660328 4056092 3662438 3645809 3655744 3699685 3666624 3787467 3841930 3676421
14058 3676421 3489571 3631558 3323561 3388618 3162134 3181676 3372623 3356989 3162222 3045388
14048 3045388 3104056 2926455 2820208 2903055 3129284 2690189 3183888 3165532 3044919 2817766
14038 2817766 2729582 2533874 2639501 3015212 3009293 2978642 2801932 2589505 2688349 3146826
14028 3146826 2942822 2664599 2604074 2606065 2559841 2655650 2415287 2419211 2404419 2526501 2445256
14017 2445256 2319501 2532071 2419503 2003062 2130093 2355117 2450375 2014625 2178761 2120018
14007 2120018 2134868 1924382 2073388 1884636 1801979 1770013 2025584 2088444 1961479 2312064
13997 2312064 1969479 1757460 2082128 2152107 2268431 2158583 2175683 2969758 4380390 7922237
13987 7922237 14976471 32006443 36958646 22798227 11352228 6613828 4674826 3965318
13979 3965318 3431382 2918901 2788255 2523810 2600738 2403892 2406387 2520106 2016512 2181875
13969 2181875 2230950 2191051 1951866 2268193 2158660 2097493 1948737 1450510 1992095 1970022
13959 1970022 1779919 2174623 1791705 1810696 2173584 1990444 1613976 1877130 1727305 1959734
13949 1959734 1637607 2010088 1501814 1573192 1672625 1733630 1603361 1241290 1417527 1783195
13939 1783195 1359271 1513315 1881479 1843182 1574983 1627880 1538822 1527272 1597273 1306646
13929 1306646 1421850 1362007 1521763 1337086 1063620 1144016 1510952 1420833 1351670 1477873
13919 1477873 1285570 1440946 1254879 1084279 1572193 1364439 1248685 1415958 1210117
13910 1210117 1165402 1083175 1285160 1323627 1243108 1359200 937280 892966 1244859 1057944
13900 1057944 1388831 1229897 1265003 1053086 1357566 1045316 1139369 1151212 1125623 769308
13890 769308 1005826 1104549 1323931 1242009 761106 1580024 1369992 1069253 1146823 1136078
13880 1136078 1044845 823788 1090486 988107 1038416 1192385 991331 933832 925543 1000028
13870 1000028 1027758 1070340 915110 1084809 1295955 961212 1165832 791951 705914 935815
13860 935815 1247978 837062 1045388 1279285 823419 1169368 748498 864416 760013 799981
13850 799981 900206 448759 788561 1016236 928349 1091216 733797 844529 826001 761720
13840 761720 1197123 743245 918826 831109 733582 675035 1018565 823309 652344 830111
13830 830111 1009944 859554 1004025 522216 832780 695491 820301 1101260 574331 570293
13820 570293 588554 784823 682801 781377 941368 788991 669780 1056985 813300 762932
13810 762932 796246 963831 644597 859223 873353 471980 630009 570321 825133 851322
13800 851322 560544 812620 635468 622251 606996 1094671 1105039 726371 739769 669568
13790 669568 1010160 907716 491956 280750 589659 793557 936573 929636 954512 479304
13780 479304 644188 708484 823187 698550 541340 470156 911934 1021764 626490 516254
13770 516254 322235 646525 580310 512470 661711 665227 424294 810252 481581 724163
13760 724163 568983 558981 563327 358259 712835 712282 520644 574955 575409 792958 543541
13749 543541 282720 859649 698457 604336 857614 658428 585644 713705 906174 381078
13738 554321 638294 407296 541596 648536 917241 608740 658088 866847 486929 640446
13728 640446 720465 670221 512600 555711 721071 676251 624263 170773 216656 701210 134179
13716 641546 283211 762138 223680 397555 614048 516437 482796 717792 394191 453487
13706 453487 125117 503980 396213 567430 363092 586331 476132 433665 477862 572654
13696 572654 704081 401254 463271 400489 348556 618636 409140 166914 609634 364712
13686 364712 517347 361961 565393 549733 419814 505685 481612 764649 312483 769170
13676 769170 151346 584648 286705 331161 185132 364836 451668 119677 527577 393970
13666 393970 834211 552744 400423 286465 356001 623233 297107 354624 608680 327048
13656 327048 363777 356060 281258 274957 377627 480824 67712 553105 282390 406942 237612
13645 237612 121192 353296 386807 382487 257900 356269 404373 327034 563040 544554 292459
13634 292459 417768 493830 6064 253303 118200 220437 100140 519369 189844 418038
13624 418038 351124 283649 -2551 215369 46980 332182 223897 -52124 279669 507783 3270
13612 291895 352069 128374 554717 808194 375308 464594 648036 475006 -8551 357852
13601 260744 376185 281538 215933 359703 405972 295211 245473 320177 408782 271586 314833
13590 314833 393610 333600 310833 375057 181653 436978 417936 58993 28263 -170702 400730
13578 218322 456305 186110 296729 103741 -11333 285734 479345 156933 350608 215066
13568 215066 269355 171529 447504 422990 265950 33687 243727 280965 250398 315098 327590
13557 327590 147572 495571 141671 -93633 505413 451132 395576 451996 186087 401714
13547 401714 159448 191978 146984 171079 166389 230333 -34256 435303 285071 311897 512108
13536 512108 132233 364040 277383 491742 287439 364348 411383 -73954 298995 174541
13526 174541 306669 255764 -118125 522270 472275 185188 311501 102988 357840 -166472
13515 168792 261813 403799 498839 562782 414603 256570 286513 173643 -155634 155315
13504 240865 211131 65655 141257 -11134 260093 508865 27776 189696 293666 213569 125735
13493 125735 306767 527006 375882 264660 -102483 288007 110202 383014 14996 84637
13483 84637 124502 419165 284181 -53537 415547 257471 421426 264514 445614 170929
13472 544594 42440 45895 -39163 433683 368160 237163 265470 458841 -24068 162849 416332
13461 416332 -190592 -70711 466527 118323 211205 131213 223606 -120829 501304 376499
13451 376499 137332 393056 200849 164356 411283 61139 237935 251373 374217 -132938
13440 155735 -24677 46006 273355 165141 52562 213545 253628 413282 385627 161055
13429 263696 130044 156394 357758 66241 -3193 -36608 -136718 255359 482787 151281
13418 364754 112381 226868 109577 -6536 76295 193736 102720 116325 320213 101770
13407 170000 -22068 492210 -63435 332483 90944 -113565 43276 243083 -271296 67394
13396 337350 354912 63831 188626 530360 29089 200026 422705 126070 198758 -199423
13385 37067 130347 176520 190008 246797 92741 109474 84226 92276 208748 327454 109941
13373 22910 172321 -196272 -467 441548 284427 456847 -135557 125236 179261 192350 -111820
13361 274899 112608 19817 390236 500255 125859 -65356 292336 157581 257805 249108
13351 249108 119134 204341 342002 229535 -119031 556046 179965 211860 154121 69449
13340 265056 440061 360507 256567 547137 534957 110915 49520 277356 53365 257570
13330 257570 29984 285969 63125 477699 138184 234693 200309 167477 -52635 -70592 274420
13318 273125 455497 249488 64236 455383 51166 161813 183944 110117 137839 222921 -389995
13306 249708 122020 217246 135848 114120 29265 189511 95691 -151292 106757 151062 264783
13295 264783 201775 335351 224958 251981 -86341 392667 78031 423269 69222 143498 344880
13284 344880 288480 516643 82803 39492 475611 155809 67305 347462 203907 163795
13274 163795 -126067 35170 89060 78704 -1191 -228540 12992 -2243 90597 141005 107497
13263 107497 -7796 109309 176941 528654 311017 119792 536792 -169765 169511 122175
13253 122175 281850 -33883 -61112 -2226 58816 -233507 57615 49064 366713 200102 -345969
13241 -130622 -43769 433300 -63329 -94215 136317 -57547 -116284 -87846 -165199 41362 -68217
13229 230836 238191 77757 -63380 59117 -230148 -132798 158524 260992 -465140 138157 202731
13218 202731 -258071 -12662 41660 442871 40873 279181 33790 40521 152812 88 65137
13207 65137 216732 275094 -261476 183930 197325 124866 -204072 20403 -104400 185641
13196 -16490 161871 -32160 167688 -125937 160987 576175 -50501 212570 118483 -49555
13185 142794 -218413 100831 313471 -45336 173339 363636 77370 183006 -1376 -41765
13175 -41765 -47310 -163059 311621 -282210 418772 367798 236489 178032 -33001 97412 -6475
13163 38805 57213 -169114 8716 29319 214000 -116956 -4435 312569 111159 267274 159883
13152 159883 114902 333363 39696 226055 255749 189390 204825 -250320 -55646 226257 5479
13140 133471 -70194 20063 -151366 -89666 173105 89423 722079 53145 -36155 -36564 -36082 189229
13127 146081 358685 -293471 335939 24490 -126388 105604 170155 220881 262937 190932
13117 190932 -126383 -57921 -30032 -41754 116238 -151360 -1548 -390589 -21707 31765 102653
13106 102653 107395 289368 67126 211258 40459 183341 99481 104530 147717 -119730 58819
13094 -103644 115761 -158691 248585 54517 -30410 -87067 17598 -103376 -161254 190006
13083 5152 100687 -62140 -9637 236616 -44101 -73384 -132050 78967 108239 -28850 233276 372521
13071 372521 86313 84265 -242247 119590 -21161 -161046 335101 108029 90008 172569 -4782
13059 -245756 -35118 121849 8857 264293 -6534 88279 -55381 43353 10287 53881 230500
13048 230500 -6394 185794 59849 -303136 98058 167337 -119528 38214 29535 -124790 292625
13036 161985 -2391 349699 205262 419924 179606 -70461 45120 260922 -67218 -233941
13026 -233941 -185223 -14073 44912 395487 -236569 -53787 391362 16404 -174199 -65022 -20169
13014 288716 72494 304974 109916 283983 -2178 18537 -121098 364334 13558 -13087 257453
13002 443861 308463 157141 -38048 10870 -281983 -168269 293364 542366 264278 167061
12992 167061 -100005 -23990 117832 -14216 86263 -70258 222352 245951 389012 278704
12982 278704 24641 192851 -145693 14350 30522 -114465 258226 9026 -299859 382073
12971 405494 -16120 254988 221679 -273058 272626 -113980 -44918 -298156 38139 -25346
12960 -10983 268521 -114828 -168536 291734 33344 -14188 -55676 91116 376764 -116754 -119687
12949 -119687 269943 414849 -262235 148569 135786 28956 37284 -210312 -181550 -102674 162526
12937 147647 -46150 -34676 362472 187763 90040 29972 16774 15336 -112389 -114718 136397
12925 156164 -167758 -39856 60493 -40472 208336 -52238 238322 70809 -73237 -44123 -95040
12914 -95040 443964 68611 176157 108780 -85465 390713 10778 -247418 168984 2956 -179814
12902 -75580 249930 184881 38490 210963 93879 -256020 41154 288128 22074 -71425 -12085
12890 14371 102495 -45519 136069 -39708 -262855 31009 -96580 126547 251425 -225428 107428
12878 58014 42076 105408 -283841 -29575 -42829 -92624 -164485 -67037 171393 -252075 31531
12866 -117499 -21784 51020 348201 314016 42639 143842 -132744 78735 -32580 -348644 -106930
12854 134165 -102730 111195 -99386 102753 -245282 -59618 -63648 5898 -109869 -75464 -140027
12843 -140027 -31672 97740 -45314 22593 32583 159989 111412 -51194 146935 -27037 18787
12831 -196075 233217 22309 -53408 146609 9581 -360505 78478 -16394 259181 119188 91109
12820 91109 -118904 23407 425956 161493 170239 -209563 -31709 122528 -202955 -316548
12810 -316548 210406 -13081 -73017 23507 16940 -201770 181281 61271 -241825 167996 -172606
12798 6818 154281 336167 -68907 -90772 -5358 19372 20854 -216722 -103862 -11314 -174596
12787 -174596 -311431 143088 164482 199120 -272941 -210847 -24180 -162457 -79442 14513 234861
12776 234861 72887 302238 -42620 -88224 -173216 86075 -62510 215727 -346863 169313 -275496
12764 137779 334861 128817 -221386 -402019 142124 125696 -70715 275667 -192072 187324
12753 -166976 -45355 -80651 -248002 230376 -317723 -240373 76940 -64304 75683 142647 250803
12742 250803 17733 236496 -99007 98261 95415 -28244 38909 33514 -158810 -69379 243918
12730 -45112 -178638 -124913 -112099 63368 165989 152020 -11721 -22083 -192360 -41795 -252063
12719 -252063 -71736 105692 31111 42909 179969 284345 35858 6679 208590 325086 192819
12708 192819 -29956 -56740 -43254 380864 71657 328769 109376 309495 114468 432813
12698 432813 -159675 -98419 97684 248665 61964 128844 -253515 -18590 292107 8294 -208284
12686 -70565 229532 87124 -65816 157616 123310 372964 113219 238911 267002 122966
12675 -43170 94713 98897 71871 -105338 279081 108457 421172 63350 -86760 -271817 121469
12663 62065 -94498 -87594 103592 11882 244904 -55804 -45578 -336763 -133932 -13992 140024
12651 47770 -26637 150520 65332 -37443 152024 -11810 116016 30467 -107963 40984 -39930
12639 202998 123850 -143713 198506 -5372 -42320 157587 156866 -137895 -138760 268006 -79500
12627 142010 -47235 97979 -139437 -21430 58499 178185 134186 -21483 116786 135860 49788
12615 -3968 100732 56768 199053 -27664 160965 173276 -102271 -233207 107464 -211495
12604 22928 56633 192631 216582 298895 450699 -13166 68680 54888 -174988 -195965 231131
12592 119136 50749 -34821 -79500 -360127 -244929 136218 -61378 127060 78723 -52935 -51805
12581 -51805 159880 -135881 149853 287196 -358835 -7246 -63570 148564 60290 48431 178434
12570 178434 19942 -63706 -118751 19813 93780 -74090 16369 170135 87297 -263623 -138708
12559 -138708 21200 -163267 210810 271748 -87397 -357714 225032 32046 -223934 184800
12548 111051 -130427 -62102 49803 89949 -149455 -201600 255108 -108518 -27155 118192
12537 -24542 225719 -88753 -91467 40570 -79980 51715 60206 117051 227907 27218 -30655 -275139
12525 -275139 76321 -26886 58353 395178 -243787 -126307 -117088 -53251 -370368 221624 54229
12513 93831 -34511 -28630 365407 72884 113307 -17243 -194799 -158901 135478 -13240 -136475
12502 -136475 -24299 79423 238476 -105529 202294 -19496 -82122 96391 71127 -163897 -121397
12491 -121397 -166222 -266303 6718 -36571 -105775 -278808 195603 -92381 370140 433608 -198805
12479 209156 -78264 -92491 99960 17312 -154231 137428 96945 677714 -223200 -99665 -26520
12467 -3873 -96296 -158336 -325704 13084 150678 324759 265889 -295672 182470 -77881 -9333
12455 -236696 89115 65349 -204801 370615 49592 -59117 190430 151102 -169812 -42638 18963
12443 90189 183016 -327399 -208650 -23761 -356213 -42709 131058 -14476 -37234 -222791 -140153
12432 -140153 244006 -248180 -91307 98297 -112077 -295691 156117 -107984 -23422 185292
12421 98252 335254 334586 154228 -149605 -190176 -34741 4741 -44918 128628 62488 108235
12410 108235 -355676 113341 -172871 160059 -16014 -187534 -74829 -82082 -98371 -3100 260747
12398 196477 387961 -158652 -158637 120500 46898 226049 -185536 -248421 -125305 -22369 383682
12386 -14033 -61617 52951 50292 -18373 117744 200043 70828 -253950 38349 -313154 -114481
12374 196093 135706 158830 50186 97437 116423 303201 15694 13683 81093 19822 -9930 -69201
12362 -69201 89210 102833 218311 31399 263455 197407 48279 -17729 119273 347029 379766
12351 379766 -124824 58519 -129672 -94820 152249 23391 -302917 43286 -96041 13267 -33099
12339 38219 370337 191148 -36969 -120034 -103511 -253726 142013 163481 -70601 37378 242987
12328 242987 67555 88184 -189347 -71115 270819 401219 154755 -84721 227309 104895
12317 -184623 209525 60405 170571 3133 254295 243522 -88889 83457 142263 224834 -109011
12305 281115 -11591 104538 -6338 -13720 -14708 81192 -74383 -99729 178121 87969 -163136 -62374
12292 -194648 -7352 354488 -53306 125001 17310 40214 -173154 -88121 116305 141028 -229813
12280 -123738 135020 170154 -228280 -167920 -129875 132826 -89427 134575 -105756 -40599
12269 199643 84439 -270474 41009 -26829 313428 -96734 92296 155481 116108 26608 103418
12258 103418 -135167 -23591 191254 -68936 179927 116420 102784 400214 -14209 157985
12247 -172345 -109463 188602 -103408 223587 212612 -180289 56317 -68633 -319762 170270
12236 -241813 28109 62451 10804 23911 58752 9947 8309 238288 68488 -219474 -140168
12225 -140168 -117974 58540 295150 168961 363981 69694 14302 328161 -41112 123855
12214 91440 68221 361883 67807 139813 36631 53354 282800 -52918 189500 373648 76645
12202 99065 -21661 -114510 198 299901 50246 120944 87831 124858 208813 -196069 169066
12190 116562 323005 -94206 168891 106711 -37452 308723 330217 -38186 264270 220089 276238
12179 276238 209166 79158 290447 157134 376520 459005 36567 -433 200305 109116 118978
12168 118978 114642 213956 86717 99637 3162 103787 230027 258934 42073 301703 -12053
12156 3144 191214 24884 -58112 -162536 173641 145041 111230 40072 131139 -22093 243276
12144 143295 506406 267861 -60413 -239114 259566 20050 57444 70356 12001 103771 70335
12133 70335 251379 142887 125969 127908 141223 375450 192981 270286 -94745 289436 390151
12122 390151 2380 61636 167509 245908 427724 80270 -82836 166610 234421 160525 195676
12111 195676 -22654 36630 39435 88145 107567 50146 -173233 -23623 353419 229941 71320
12099 -180891 319846 -98762 -23407 -146852 18145 -94980 115404 244959 32806 -102932
12088 -157895 -29183 11221 68692 -25871 90359 -61202 211733 75608 273258 62873 100446
12077 100446 -29752 36970 307492 245488 -31481 248938 175370 155447 145329 -415704 46044
12065 167860 -233894 -109416 363733 258594 4350 -124890 -189842 -161979 -215780 187787
12054 284944 91275 -286296 41437 -48214 9823 -155133 -83397 15102 -43356 68292 -207115
12042 58328 56637 -185607 216098 49068 23261 -114307 -40765 -128845 41917 211097 70501
12030 -105957 -206199 30186 -148148 -214901 -327807 34319 -91768 -51001 -390723 212321
12019 178560 -88230 70645 -78589 129188 17679 40940 -30562 134962 18954 94736 -87462
12007 188080 19684 -91484 175011 67031 -29240 6630 -83713 -32944 85348 -184580 142307
11995 92209 -51460 -183967 158784 -14419 221616 -292755 215653 21531 -80940 -28264 -54666
11984 -54666 67022 -305819 65047 -357832 -126277 -93792 101532 -14933 -161426 -121320 -48024
11972 102220 91082 -141674 60807 -191733 -59526 174725 165822 154190 191200 136951 265598
11961 265598 166296 -135175 -150909 320304 -220180 146996 99270 69138 -153319 -25858
11950 199698 -289697 323707 2655 106361 -110745 -105408 -459684 -512 -84805 224862 211262
11939 211262 106955 -45722 -134650 233358 159946 56829 -38458 110865 104609 56246 83383
11928 83383 -3766 32310 158512 145877 -38001 9624 104658 -61164 26399 -32798 -195067 -72240
11915 107480 12726 -120881 -18265 380310 -106641 -247179 -71204 -112977 -76106 -153370 -2448
11903 108142 151183 -248856 79029 -143141 -203219 141494 -12788 69586 13656 113882 -58716
11891 77776 -86366 19280 -210879 -57302 -198612 269734 -153347 -44161 -7816 -30719 188962
11879 194740 162272 158380 -242097 -462146 -120207 93625 109989 23058 95362 -132511 -97549
11868 -97549 261724 58889 144822 -157539 -218621 -28624 217252 -41764 -180820 -198574 -61122
11856 282962 -75670 -74292 -238164 -116750 100665 -72604 -185257 49598 -191024 -209122 -136885
11845 -136885 387024 -253404 233196 161825 -39209 -5721 -97098 25474 207477 11339 -238778
11833 257245 37790 -109075 64192 -73238 103715 -90278 242721 -183472 -232654 -170848 212139
11821 -301684 -36951 -183624 -345895 51279 40610 -137217 82454 28265 -239737 155854
11810 349424 31376 207933 -297523 -114644 -2077 -62289 80743 -296696 -95750 -50487 34894
11798 39967 -173393 -229481 46310 100815 126118 12310 132828 -154691 236472 270790 130752
11786 -341184 -244063 -271980 -124739 -122416 3278 -136080 -245453 -109768 37756 -382888 95275
11774 134797 -375657 28017 397659 -279125 -262700 172299 -28465 -266284 152501 -213171
11763 -26284 110633 80360 -42821 370978 -32694 268775 -39457 106087 -139441 92900 -77971
11751 -264975 -110729 100173 -166584 -10987 -224797 55265 -145629 -202472 -135493 -186108
11741 -186108 63001 -324610 81343 111548 -338840 -55475 243918 97979 -70137 197920 187349
11730 187349 447792 -84821 -74598 262856 -130475 -286371 143991 224574 229307 -23701 219624
11718 119551 -42575 232200 107553 39374 76308 -237281 -198020 -129255 -222351 -77359 -38439
11706 241034 -7848 9180 87439 -320465 -336910 204592 -33817 -2487 222120 -184493 81885
11694 13551 -106110 227946 88762 -157452 -279844 431253 213863 33019 62851 383005
11684 383005 278585 170890 -364579 -301468 493860 -63083 441607 -32756 -277296 115517
11673 110983 -35575 2316 -58170 239599 386564 180978 169239 46112 -477 -38012 -429316
11662 -429316 159839 -104650 7284 51513 -298055 88359 74482 -116574 31988 190261 43474
11650 11158 40118 33480 105599 281217 263000 180855 -292419 46442 211452 -326302 -153361
11638 -111672 236650 -60641 -53909 -52419 89420 235413 -21821 -268688 87951 22568 336157
11627 336157 -10002 -29276 -147142 286960 167277 185859 -1626 -72996 125753 39101 20540
11616 20540 -67950 20092 -109161 -119121 14665 -8811 -45958 121560 16372 -329886 27666
11604 -517188 106903 -114513 133979 -216184 57496 -84268 45103 -86989 264018 208673
11594 208673 119966 158763 -93463 -42542 59751 -10143 -73171 -61811 -80824 131036 -35006
11582 -42024 -173109 245231 212152 -54624 1708 39015 -141463 112067 -110732 -49288 303110
11570 159787 152146 -108930 337425 118725 -140741 129817 -113496 35608 313248 171139
11560 171139 81429 -417718 -263191 -12998 303489 -110903 -143668 48404 -55663 -146654 257877
11548 -93876 -237577 -123836 169558 102963 47938 158449 -135500 -105194 -49266 35009 -251719
11536 51499 -162868 19388 -65823 -253631 -27261 -366358 405944 34614 87475 92209 -117891
11524 134025 -194370 305705 -260299 176733 104638 48617 95407 57048 191147 82197
11513 141865 173449 67517 48796 386365 -90510 47770 -182799 -276539 75458 -31852 228212
11501 6833 -197230 -76645 562965 93657 93342 195428 180445 -143678 -328746 -217825 223972
11489 18553 329595 32304 181401 36557 -179280 -79648 -154929 -79001 165596 102298 -44851
11477 1638 294835 298006 53339 210285 113564 25478 264426 -128706 231165 113433 166226
11466 166226 144988 179369 365412 378456 -50616 -65730 75065 408493 -211542 232394 1475
11454 145556 -23129 234874 -61931 222143 -148915 -254042 -61143 115905 -105713 -163532
11444 -163532 -59852 101732 -10926 8559 -43911 194225 -9162 -64255 28381 158870 68464
11432 300187 -175785 171592 126333 87826 187746 9909 75660 -243651 79914 -181711 -139294
11421 -139294 -23545 -20151 90132 -149448 4089 -104961 -117584 194171 -236723 192174 50759
11409 91294 -194327 -134320 12664 -238278 203336 64539 73405 188296 -120197 -361636 238380
11397 -82744 494 -206894 -37648 272425 228598 -27802 47205 -69075 -197625 -47930 190754
11385 -209859 155618 -222724 42680 62980 53497 111876 212895 253922 113433 148024 14668
11373 26924 90037 -6548 -23106 -92759 -131474 -222661 -2612 16445 -199440 29272 335691 283702
11361 283702 283905 215262 -123894 82173 -136495 64649 -296698 -10422 54723 18716 -158618
11349 69221 -89009 -58481 -75729 141902 -162013 -40588 11769 -184964 -285589 377509 315999
11338 315999 -328994 78423 -133417 66330 18584 -61277 -219484 -246542 -27583 -199820 -88662
11326 -102436 83174 -28687 -278920 -65138 -140705 -70102 -30879 -141474 -156144 -207611 -246915
11315 -246915 388092 -418726 150758 -162260 -141043 -171947 20116 49327 33270 -276802
11304 150095 -22252 420922 -141845 81297 281079 -41856 419683 -37684 -224815 -111201
11293 -165773 96467 -266455 -147021 -134597 -50052 -132769 -137830 -90504 -292340 213246 -196965
11281 -240785 237917 104536 31750 -206584 42090 203148 -82814 -43576 144960 28994
11270 43700 13364 71904 18347 -222834 -144293 -80747 -176101 34685 71045 -68458 -352414
11259 -352414 -162313 -145344 117653 -11456 -212686 -248895 926 -298 -11505 154085 -160073
11247 196755 -379174 115797 -361452 34866 115623 -78360 -229970 7835 -146809 -114419 56056
11235 -202920 -123909 -257073 346155 110477 -230447 1993 93549 -192909 32354 -11586 -184347
11224 -184347 81323 -145330 22823 -113810 -309030 127091 61325 326024 89079 -222688
11213 -78637 13922 155481 -147246 -117921 7936 -265524 -50911 228968 -147542 -6562 -141405
11202 -141405 -517641 -224303 -70512 118656 87531 3639 -311537 94648 -80488 -205 -96038
11191 -96038 -247902 256519 -36072 -291417 43058 33545 113562 -210080 -226552 -18705 -16953
11180 -16953 -56099 -201796 -340601 256054 64718 -215392 117446 -205858 -25075 -94379
11170 -94379 -269948 -32895 -129296 -426984 -4456 341113 -155296 32280 -17216 -282425 -1123
11158 -217712 -82098 -75802 -353701 -64530 8469 51327 50751 78109 128437 59584 181398 -49744
11145 -29396 -217036 61509 -64405 -95884 90161 177635 304573 -193305 106761 158718 207447
11134 207447 148947 58270 -115864 -168280 -126700 79123 65766 160493 -140319 -94639 -45351
11122 164677 192621 -43328 -207483 71520 -27152 141856 -257458 140022 -175019 -1069 92769
11110 -107300 -25835 35213 -193327 19274 -350528 131946 -217224 84800 75027 34925 171719
11099 171719 -116229 -63046 -32945 175461 178545 -20150 111126 132179 193788 -58782 223929
11087 145805 247483 164561 287333 34382 194076 412790 -36400 -152677 40154 -56011
11076 212041 -72529 65800 -110626 13826 168513 28874 -123162 139836 359852 77368
11065 -423098 427370 56497 251406 356007 549678 246578 339449 533213 253486 651605
11055 651605 368352 446201 480364 494913 315162 406104 350436 212638 223730 522608 510795
11044 510795 533194 424588 595182 264789 644259 454539 426774 595068 356029 364016
11034 364016 406158 309060 672448 364067 628228 547423 421277 450260 537233 588762 790737
11023 790737 606686 473040 360890 496203 622832 447128 188326 311763 779110 159841
11012 630165 443405 303665 448058 -164542 214725 14685 175138 587268 357612 584137
11002 584137 541175 500072 139405 351347 554039 605617 464103 533257 371309 621930
10992 621930 395110 233738 404032 445336 56156 623789 613111 634392 443197 327739
10982 327739 323457 708344 635324 972168 388355 613995 528576 828990 845601 1169527
10972 1169527 1240328 1267744 1826124 1464160 1450896 1698308 1635622 1728301 1324428 1466370
10962 1466370 1464381 1276818 1304138 897618 1480900 1229855 1149551 1073871 1148685 992440
10952 992440 854661 1179337 1109369 1247749 1185081 772250 651909 769515 538509 359300
10942 359300 398153 436880 445986 593553 123994 306856 21351 223599 112327 19834 311320
10931 311320 86412 63886 -11230 176118 126198 -265950 214714 67278 109073 193190 59558
10919 140063 -140338 -4595 -14731 91245 -19979 115762 181106 -55356 -174714 -496752 -39480
10907 145581 -182895 8032 71142 -210737 303105 -120559 -70759 8159 -128308 182831 -168927
10895 141006 -73732 -158888 51395 92841 -80541 -261189 91227 53376 -116177 -35196 -60520
10884 -60520 30016 -366651 88419 238557 -63407 -61843 -384509 -65138 -132360 -135441 -40808
10872 -70785 -78759 82752 -347315 35015 117231 -36609 -14718 -10423 -166987 68559 86003 -2838
10859 31043 -36219 -192267 145380 -40046 336817 227494 32685 -207882 -284014 3372 -165135
10847 66305 -128078 -49696 -172030 -57169 -317349 118689 -131140 -5611 -14539 -70685 -23788
10835 -170696 -183370 -275287 37610 -277574 -232706 -29547 54402 -11528 31654 -192530 -40083
10823 161128 33209 -145308 -87544 66288 890 14157 98937 166355 59783 206517 -308290
10811 -121422 90848 173008 177096 115116 -54477 270332 122654 11053 211204 -150514 66580
10799 170686 -429995 133147 271986 -50907 -76619 -194377 4585 3023 -105650 25949 -196295
10787 -166390 -249590 -143056 154874 -82521 -113001 -156191 91845 239940 -55723 -27353 -41195
10776 -41195 -97988 -1594 -155423 -222690 -79598 275905 53780 186771 36720 148769 192642
10765 192642 117203 -82007 37790 31531 -57346 -13291 177878 -29073 1331 -361900 -149194
10753 -257585 -182507 -131373 -15864 70373 271563 -49755 -459160 -70318 -221319 25351 -221490
10741 -386207 91763 203401 62668 267227 -3885 203870 -339422 91105 -141624 -76054 -11172
10729 -195777 -56860 4375 105420 -147178 -79326 109243 67232 -26232 -345003 -30184 5677
10717 -97540 -449807 30378 -78843 -111491 -76219 319007 -13421 -444383 121693 -147228 -70050
10705 -191262 64601 -126813 93279 -139281 -103217 -167043 734 22206 229433 -225527 -62522
10693 -222976 90434 39347 -3058 -27020 -82237 26837 -132749 131767 45106 82445 -394249
10681 193961 43472 -100999 -164706 -192569 -157194 -248974 147558 -198096 157273 118157 -51801
10669 -48017 6477 -190248 6891 -125834 -245035 19571 204056 -188812 -264179 -196151 -143760
10658 -143760 -144549 -360069 186166 -203175 11449 -184511 -10198 144740 -228665 81484 164541
10647 164541 75852 -336263 -45636 -21386 128198 117952 -283669 -85330 -188281 -227066 230839
10635 5456 142574 53343 -98788 52790 -98737 -485440 -64960 245569 -144006 -54159 -190239
10624 -190239 -110335 29152 -10720 214612 -37476 127656 -50348 -14828 -304748 -54460 179848
10612 -272250 -353726 -44925 -38597 -500714 144882 -189329 123800 -16512 -83781 517519 -96841
10600 198476 -197043 -376265 -59742 82397 -68915 -271830 -73654 249840 -165943 13736
10589 -72753 25088 -326703 -29388 -4520 133633 -33456 -73530 -271155 142813 -106686 198646
10577 -49832 -181169 165285 59390 -39850 -18687 -127265 193563 118847 -208645 -29918 -27143
10566 -27143 -17650 -48971 -235310 16166 204927 -282340 63358 142450 -2165 -212101 59530
10554 -10147 -218106 -197319 50090 166073 -78886 175368 -195238 181254 383435 49954
10543 -352179 158762 25834 -100058 235234 38004 96272 192707 42684 -296597 -215529 -205580
10532 -205580 -284940 -26748 98545 -128933 -90506 202493 -89273 -126045 -289409 86087 196344
10521 196344 -26159 -152938 46191 -221451 130528 -37203 3218 182405 -127108 170157
10510 -172200 35277 105668 116402 -162825 10405 -190481 -110306 234553 109562 215082
10500 215082 172920 -431547 24730 238660 -3464 15302 55220 -40689 -103392 -20176 -208407
10489 -208407 -210475 -68612 -54503 29546 -173366 269178 94960 213024 33950 -103087 121465
10477 -206394 330729 49768 597273 771863 -30948 -114474 -87216 -31991 -57612 245856 -12773
10465 -77309 -18160 -330373 -133042 -415818 112450 -52164 -176020 -58860 -305721 -88227
10454 -35383 -263564 -173455 42494 -156794 83021 103288 33554 44598 -144021 26674 -20348
10442 17451 149076 67856 -360022 241902 151035 98176 -76553 -106897 22800 -92883 45658
10430 18451 217646 23017 -6873 -86640 -104025 -130676 155028 20058 -55919 -132205 -50608
10418 -239927 -68495 83708 -143433 149765 281853 84060 56231 -188079 8947 298472 -306014
10406 349246 36099 -61808 106542 210192 -227574 -291967 231750 -89538 -367443 404661
10395 -162743 230419 49052 83836 115817 -9606 -13511 115571 226537 47111 -89388 75201
10383 68865 -114869 -81464 176758 -203457 -63057 176138 40677 21414 99587 29046 228562
10372 228562 12631 144284 -14596 39032 47296 -78835 -14368 298704 345890 428754 605345
10361 605345 498451 17456 -19255 226944 108516 -32934 146633 20171 156015 118888
10351 118888 332401 159592 90441 219248 119684 420945 57086 264596 183226 123068
10341 123068 174052 257806 379623 3533 -276834 182727 -77396 130703 120831 297450 66059
10329 -74875 251309 75208 -245283 -28986 108855 -98559 -133396 -142838 213363 -28291 227944
10317 478722 -25953 152519 49748 -127130 27074 -22887 -31883 -30445 114492 425205 247467
10306 247467 -91913 -569 291012 87985 52679 335397 112681 -146462 77825 -99622 -381425
10295 -381425 41759 8452 -321350 113456 -11871 -208367 -278201 284765 42086 -173396 -224190
10284 -224190 -42087 -308299 -74105 -32858 -181886 136464 -282042 -97570 -274695 -335104
10274 -335104 -231615 -74059 -6328 -83605 -213391 -159895 185673 -157217 149018 342947
10264 342947 138469 71611 -411359 -235541 149274 -125307 43359 125193 18318 217967
10254 217967 -32994 333449 316894 433398 -115783 -103420 260952 -1719 77286 -184460 105839
10242 318274 8049 -493688 -97214 -115307 -224997 -123481 -66898 128388 190171 -93315 -58967
10231 -58967 -102139 148554 -142580 -177140 85701 -234296 -60244 -26728 237167 -239520 -120800
10220 -120800 -123881 -221527 -304859 -319691 -249973 -148934 32103 75330 108702 301416 51878
10208 -337182 -20679 216351 -123346 -233486 57725 -183724 -44441 -42178 52370 128746 -248192
10196 -36004 100232 -243385 24928 85255 -151125 24653 71547 -108413 -37490 55530 -104509
10184 -6118 289345 215901 -207874 -56776 -255317 213627 129002 54365 166724 -68260 134670
10172 -232769 167811 -319911 72761 -9489 -263310 -144030 -66025 212049 98 175941 -75760
10160 195716 47728 196440 24152 -77776 -117520 55716 -4853 -367600 -10659 -143230 91374
10148 -171263 -101972 -227989 -110282 221733 -101182 18941 18561 -384755 13083 523298 -27264
10136 -73946 55498 265611 -294436 -62415 -192561 -105912 47805 78321 -36875 97274 -136275
10124 -94020 -128347 8731 -228889 -153751 -87316 35224 -246523 165165 98211 -353862 -95379
10112 -144231 83230 -99401 61451 73560 -99110 67057 -34760 -67275 -28448 -118596 -300868
10101 -300868 -50880 -71891 -400613 -251702 -73380 -29922 27764 -161276 -356301 196592
10090 270621 -171304 -64571 20742 -92170 -96207 -278006 -383671 -227403 96812 -68619 8124
10078 132891 -32105 -13036 -32029 -69183 -377209 122067 144768 -90683 218790 -118326 47455
10066 -43958 -78322 351421 -255984 317381 44911 -160042 -126786 130296 -12187 -155063
10056 -155063 -86658 -201647 263330 -62894 -102055 10083 25288 -194190 155312 43472 -177733
10044 -108310 233574 -16210 -26875 -76181 -316457 -201955 -180843 368587 -94129 91673 -46586
10032 78085 -141875 -182894 50183 -313697 194622 -137649 106057 -70165 -26628 89 -44727
10020 -171580 -203346 -80051 -40601 -457421 -256687 -59099 167861 -20074 -26818 -248625 -85631
10008 -197792 169561 55287 -102766 -693 -415369 272656 -58588 -79989 103630 58124 96302
9997 96302 108995 196887 -23002 -200540 1351 -358691 -118392 -64886 53545 -30768 -102740
9986 -102740 26149 -281292 -348612 -81560 -138545 -132749 -167260 -285824 -224610 -129005 231708
9974 -64969 -192967 -256801 -128531 -3739 -53574 -97903 23320 136872 -164813 166150 -92893
9962 -5947 -189300 628240 194445 -296346 -140802 391860 -184518 -281251 83218 -224636
9951 -91333 -6392 48394 35832 50417 -95533 -38165 -214813 220186 -204939 215555 -144514
9939 -142955 196698 -284150 -28289 -69076 -50994 -361189 -33213 -76521 152215 -38998 -2732
9927 -138314 -58572 150078 131928 110489 -301262 -136295 135823 -192220 -610404 18421
9916 75560 76783 -78750 8486 -18236 52340 87129 -311283 49278 56845 -58478 -321458 12181
9903 -45732 -183786 207015 -65955 -12204 -275073 81263 -52669 -205294 -45658 -154145 187058
9891 54596 -226813 -51592 -249320 -184908 -292475 -43238 -120055 -221929 -19577 -107169 175938
9879 -71452 283390 -226432 38278 82438 65841 86285 -82763 203240 54100 36642 64889
9868 64889 -185567 -173401 7290 135477 -59142 65972 469803 -150460 -93878 -91824 186870
9856 91755 99254 -129361 220020 -289613 -163701 239352 -428436 70550 169384 97196 -206599
9844 -26218 142743 21046 68106 -3336 -101007 56004 -282967 -53909 -291260 -187531 -84559
9832 -291608 215441 -78703 -19094 -60370 -195085 228162 79571 20400 -233094 -151197 -167970
9821 -167970 -266212 -109580 -217611 -82130 239751 -261291 112759 124568 48478 -253678
9810 155752 -122563 -192744 317768 -38361 -124214 -137905 59329 -50137 -175612 -355490 -211665
9799 -211665 -253477 -240254 -335175 62189 -115609 -207938 524 6226 -5010 -192410 235450 157081
9787 157081 -1527 78118 -232409 -142372 472702 -291137 -115638 -242114 -430272 -6662 -185897
9776 -185897 32124 -24496 190248 -62099 -110118 -43192 -12627 -145486 -221772 143765 -93524
9764 -267392 -303093 221685 -175610 -198658 131027 -183276 -38030 117099 -15142 -51271 96899
9752 -341618 275856 -183118 -367333 -5274 75472 -41215 -324879 -78777 -167790 -57936 219390
9740 -116663 347979 -289152 21657 -197800 -20104 -91674 52922 -15153 -95051 91013 165313
9729 165313 -89096 -131561 -257684 -331149 115299 -151688 -144561 -164741 -54667 -264679 -46086
9717 126329 113551 120204 43673 -22893 -128846 84145 199974 101962 -210502 89758 -316411
9705 -36272 169636 -6051 73752 -61956 -380723 -269546 -11673 107731 -17487 -20049 -156637
9694 -156637 64045 177681 -275297 155839 -326472 -35417 -129932 -280032 -41178 -244729
9684 -244729 -129636 -178237 313476 78362 -279494 -177590 -16446 248800 228977 -192860
9673 -1053 29852 -163346 34796 -132650 100140 -227501 -158928 -273966 150144 -158810 126131
9661 -140871 17663 -85716 -183038 -43854 86322 161346 -119386 -111087 -17637 -82072 12224 124392
9649 124392 -434670 -242208 -397816 76436 87928 -32213 -39421 -224806 89590 -94254 -260404
9638 -260404 -150987 -269691 25759 -45827 -34113 -144969 100750 26694 -299381 -17575 -276975
9627 -276975 -25759 57233 8905 -30647 405729 -198005 -68802 -69861 385900 2599 22306 -275135
9614 63915 81176 -55208 -491566 221969 -70433 -136668 -154620 -164531 120873 -436974 -261339
9603 -261339 -293964 -277446 -142152 4007 -19675 36518 47724 -180642 99518 -188636 241837
9591 -106758 -91559 -120149 43832 209313 114839 42453 -232955 22407 14376 -6912 -116109
9580 -116109 -272055 -19518 -34295 34906 -53240 118042 -228606 155978 56147 -128598 102459
9568 -263169 -4871 -68302 -2785 -60228 58432 -279444 -326340 157882 -432007 -67708 151116
9556 -145641 -73340 -79234 -46950 50890 -530243 33089 -128360 40806 154180 68739 -233184
9544 -12395 18549 -22680 -371005 -82919 176380 66030 -296871 -310209 -88031 -355731 -5038
9532 42585 -215569 -31692 -133769 -73870 -51999 -99842 172319 186272 -244810 -111240 66326
9520 -165282 -42552 -5896 -305232 -75188 103519 -135951 -339935 -116044 132576 -131728
9509 -149222 -122264 -2092 109988 -98774 155741 85892 201007 -46963 101400 210141 243287
9498 243287 -106979 -284167 -19132 -285172 -114713 65444 -141836 -143815 18493 -248356 -310636
9487 -310636 -282135 -53449 -76988 -179169 170381 -378242 70817 -93898 265439 4216 -140
9475 -19516 67326 -34444 254599 -311526 289849 22007 -96165 -129538 49734 201770 89273
9463 -68367 -414103 -505880 116116 127244 65429 -252679 -213313 222185 -125488 154113 102771
9452 102771 10144 -339483 -220236 221951 265233 -135571 -29709 -288967 -1289 -152101 146226
9440 -7076 -389613 -375514 -96545 -1078 29038 -81766 68469 83042 -185047 220545 153486 -455618
9427 -46226 -32552 -257153 -213074 -233728 -93226 -52897 -82882 -438501 11235 146567 63788
9415 -42888 -107133 -468064 97965 222155 124499 375663 -315035 271450 -218873 36154 -28682
9403 -155318 -305208 276786 293329 21487 -370436 -370966 54941 -445938 -56338 3598 182974
9392 182974 -131648 53729 -185050 234206 145300 -235909 43010 58236 66702 -238794 233728
9380 15380 88152 7228 246744 161100 -191074 15429 288686 41617 -253416 -49731 -479620
9369 -479620 -118796 12815 -152858 100958 -282049 -193646 47381 36716 -26764 -60515 -209606
9358 -209606 6515 -128652 -130956 26129 -322298 55941 -56693 -197946 -44500 6128 -116161
9346 -315035 66833 205740 -262507 307275 -26293 65410 53330 45534 187798 -194721 -84921
9334 162687 51474 -322060 27256 83532 102794 -43306 107080 -92672 -34064 -162880 -150781
9323 -150781 198329 -105683 303157 54315 31600 -193464 10604 -201270 -62781 99619 -106716
9311 5450 -94199 174454 -26243 -3799 224616 -212573 27239 105129 -149259 37745 333841
9300 333841 -455546 126369 49605 -95331 -22865 156 39112 -246348 139569 -105443 -323941
9289 -323941 -160934 -207440 -372474 -346628 -126464 244377 124882 -59544 302720 202488
9279 202488 115610 115986 -33448 -117855 237511 -95188 128879 -158252 153062 -208266 -130855
9268 -130855 -212526 -197439 -199416 12782 -138342 -47179 84497 78890 89333 71878 -132860 241365
9255 -104886 183561 -223833 94092 -129199 -197918 19212 -20497 286105 52975 -86494 -28764
9243 -424187 -61110 -17819 -240397 117872 -12775 65506 182254 -321505 61977 -70970 -110295
9232 -110295 65790 -1000 -314772 -458737 -190897 178670 34900 262160 -222751 -185113 80694
9220 -58600 -292142 -129028 -28086 -221358 210679 -281750 -330321 -102204 255050 -194292
9209 347868 13144 -251805 398644 -14401 -114540 4516 -85121 -81504 47788 145528 -234087
9197 155739 -133576 -303299 305684 42111 -162214 -51579 23098 -7850 69077 -63371 -148549
9186 -148549 -128430 -242875 -64231 -274649 -246067 -170063 -42012 -176783 -218041 160884 -79332
9174 -169624 209298 37952 53704 149874 88701 193362 94545 78959 -12819 216738 -137611
9162 59374 -39463 -104411 -51715 -133810 25046 -287443 6738 -267620 -315180 -265363 99637 78998
9150 78998 17896 78750 215568 234823 -113190 33632 -128787 56367 30628 -106753 -173098
9139 -173098 140471 -164001 -511675 -156778 -251892 -134706 169752 190638 125963 -169471
9128 -336778 -289451 -33919 25843 -362840 16555 -5000 10777 -162270 -46217 -81607 -5915 123741
9115 -210567 -92193 -162184 -48772 98916 65763 22469 255265 -20888 -142433 -396227 -88404
9103 -96400 151894 -51353 114296 -111364 8091 194708 20682 6442 154605 -36977 -351562
9092 -351562 254908 80461 -255126 -30937 -103331 -123869 237813 -65241 28399 -175768 -123834
9081 -123834 -116036 -1226 -199180 -196087 -80185 169277 55999 -170379 57808 -72806 -146008 -237253
9069 -237253 88921 -289020 97723 -15479 -358694 -42605 142534 -282678 -10192 194148 -28679
9057 76216 111484 34727 214426 -237346 -64274 169320 -121340 155206 -79881 -88696 -36735
9045 -223436 -444796 -190752 116558 -22560 65635 -64290 -361911 122627 -421334 -21675
9034 -16918 -101986 221676 -199630 -19497 -156218 -173880 79934 -256569 33283 -304382 18637
9022 -240247 -134242 231975 -173411 -287433 31308 59740 -39690 33163 132907 -79175 -27676
9010 -104501 -221557 -123490 -126900 167421 -96394 -249092 -379094 62511 329849 83318 -198657
8998 -121578 195268 -20749 -331171 -197917 -70088 -46601 -178215 35753 188406 -281348
8987 27974 -139947 -40032 -256234 -352259 -39087 248582 -54124 203210 92564 -249582 -251761
8976 -251761 -199386 66311 -268391 183771 -217695 -355152 -153294 58643 -243809 -306701
8966 -306701 52619 -25726 -68749 -85148 -164749 -125214 127199 -287974 26871 -256249 301290
8954 115354 29626 -52142 -3927 -167899 134108 -207791 176163 -68864 -108671 -36420 -1019
8942 -103584 -234439 -238191 -215366 -155381 45518 -54720 270383 -60464 25899 -96081 75315
8930 163665 -331181 460079 18107 -207065 147812 -183705 277720 212136 56385 362672
8920 362672 544319 2250324 1740286 308989 223967 -240030 -48463 66610 197719 -125564
8909 371940 -129105 133700 -145149 320242 72620 -172935 -43219 -221550 -154123 108624
8898 -179067 -256212 -53027 64747 92169 -35707 36667 -418030 -5729 133205 48152 -143275
8886 -109567 -64736 -85800 -506919 -5410 -376505 33064 85603 330750 -34068 -127357 48292
8874 -8923 -2468 -167971 278872 -99125 93378 -47586 -41681 -131701 19120 -248301 -64641 89545
8861 -195119 -174526 -232842 13393 -129440 -46941 -231373 295591 -239150 110941 109948 65521
8850 65521 -146351 -20005 181184 221792 199787 -14319 23689 -32980 158495 -116283 46365
8838 -187586 -167855 171680 -113212 -20867 -32095 -129825 132116 -259126 -172887 -23247 -102029
8827 -102029 -247763 -15431 -26750 -241233 -259894 71602 -176433 -160432 -4618 88168 12294
8815 -208302 113624 59737 58868 216039 42179 251255 15389 185094 -38985 173719 98782
8804 98782 116525 -194480 125043 -26773 -358068 177165 -193758 35396 -99278 132158 79453
8793 79453 26097 -228450 201693 36376 181779 85003 -124685 6695 23623 -194494 194795
8781 -78758 -124643 -38445 -338611 309 -123282 48875 -18952 -168343 -114585 -12929 -5865 -294666
8769 -294666 -61009 -134749 -163959 50234 -47307 -86343 -80260 238698 17814 -157951 -309921
8758 -309921 41340 -174114 12388 169187 -273263 -271335 129199 -113301 -227922 220528
8747 107435 31427 248268 -42545 -52274 37178 -14142 66994 -9547 84442 -152530 133892
8735 -189865 -126358 -248626 248375 -329221 253364 103606 -117686 -157572 -176006 -357869
8725 -357869 -164719 -138543 -395558 -42567 -117491 -79529 202789 472937 -113179 31680 195546
8714 195546 -201178 -21367 64021 -18432 -32590 -337271 303262 -34506 -3077 -279040 98993
8702 -285436 -155474 -67561 122181 -77596 -246218 -53358 -6099 87558 -6123 87742 150262
8691 150262 152927 147910 -236428 -185773 -169944 211378 120404 159324 -177258 76329 128752
8680 128752 -130723 124909 -471983 16585 5978 -31128 124541 -229500 -103640 -219001
8670 -219001 -106874 65888 -90164 -58403 -190562 45898 30810 -128669 -153086 -143337 -221199
8659 -221199 250964 217949 4356 3413 -292835 -56511 211135 -263271 -159285 61490 596881
8648 596881 321043 -88665 247340 -347694 100011 -55751 37243 -548091 84145 -113301
8637 71057 176904 221836 -174061 33631 -366674 71027 -107023 10313 134572 -181056 -348947
8626 -348947 -238816 -136201 -68223 -117354 -274309 159660 -85015 -145280 -225319 -93331 -33066
8614 91205 -39571 -172679 76496 -237162 -86571 -221 43420 12171 6594 -94194 22648 -215156
8601 1985 -204336 -207860 -144936 -70206 -410601 245233 36660 254336 -187122 -377381 -78818
8589 225819 302708 -313508 -112059 82780 118220 -196668 145696 -266880 107128 -245011
8578 -181304 -169175 186081 57122 -179876 -103439 -206309 -242940 -63597 36493 -178870 122246
8566 -61304 105456 18812 60383 -82701 153263 22637 -110266 126247 -125337 477240 -341736
8554 -22063 -89851 -114876 -63559 107567 -6275 102253 -101653 3443 150820 31132 13016
8542 244380 176619 38163 -352771 153056 -170269 37399 -51928 -20937 -4960 -247859 20759
8530 -15694 129690 70221 -306319 -117472 -91228 232903 -67153 -14150 103386 77058 -75264
8518 107959 -139650 55647 328038 64241 249875 95435 -131139 217199 179247 53538 -326983
8506 -157109 -84206 18532 228169 -16033 279859 -145694 -356897 -212702 -74910 234075
8495 -353568 4288 -208581 -125250 -197894 -74460 97320 233093 -267632 -386996 -246277 73127
8483 54599 -196744 -254112 45144 247495 830 -1681 -53434 7826 97711 -97683 241095 -203692
8470 -316891 285632 64427 197672 -50773 142596 50455 -212140 374695 -22419 -22688 -20181
8459 -20181 -192025 84077 -287441 -110792 -201132 218877 99849 319927 78002 344061 -30253
8447 186486 -147977 -407683 25811 -100674 -340659 -233060 2489 71850 -149487 -216307 -122996
8436 -122996 -325088 -204181 -210008 81209 -111168 264519 52351 -209291 -52865 45397 -344578
8424 -166119 -9574 -92509 -171595 -240776 -204719 -116369 101481 -329888 -174281 -176176 175829
8412 155024 334158 -47080 -96912 -490834 283788 -112866 -261115 -180531 211911 -47265
8401 181435 -338792 63361 -176370 -52388 68379 212447 -122602 90024 -78744 4744 -186692
8389 -176328 -43257 19769 -109949 -324394 -133626 51104 -151495 -133335 -176294 -257924 -64139
8377 110008 109602 -280977 88484 -146534 393689 -162394 -136643 -306608 8724 -334962 -237336
8366 -237336 -89039 -215821 279985 -77177 123879 -111859 86786 101975 -245215 -1399 58053
8354 -153043 180281 -124420 80697 -340691 265824 -182575 -182190 125578 179094 183090 -219188
8342 214046 -120280 27940 -365975 -56510 -101080 -40402 162646 82182 106483 -205282 -199496
8331 -199496 132381 53618 71932 133753 75204 -432442 -30305 -189374 -286273 -254929 -18468
8319 -172538 -127355 -163275 -154897 164461 98960 -76135 -127510 298514 -322457 134751 -97835
8307 101089 54583 -283010 -9612 58337 -182713 37175 -347950 -187307 -303438 -337983 -203529
8296 -203529 -258040 11825 207051 -120082 62088 -76189 -350516 -21392 -435 -266704 27409
8284 -261849 -157373 -119401 21827 -170259 82207 -286679 -221460 13389 -6835 -81726 -265455
8273 -265455 27597 -92364 161450 171729 -34506 153881 -37513 135251 -9970 -434306 64868
8261 -47943 248318 -2418 87307 -120986 391764 -197963 -141720 36972 -97883 -4850 226481
8249 -61277 -163031 -120378 -85634 248923 401451 -475558 -34959 -216863 -50804 157333 109552
8238 109552 -31907 -4254 20864 -119655 -156875 -25727 28122 279364 -4076 174025 53155
8226 -264549 -212914 -20015 109041 64485 148991 -44295 14761 -19305 -133988 6617 300411
8215 300411 -13249 20468 -251004 -24198 23109 -97304 41847 69468 53338 -205599 -114451
8204 -114451 36346 -225387 -4952 6871 64889 296669 -244969 -63136 41287 -103299 -130940
8193 -130940 -276989 113378 -264314 69383 -250082 -73480 26453 23546 -323725 -226088 81415
8181 216097 -222023 7032 126751 -72095 -65840 159411 133726 38226 -242072 129917 72157
8170 72157 24385 56141 -27070 177505 11341 41701 213631 -49812 346013 -106742 134046
8158 -222515 184549 114221 -47138 34556 166045 -286956 -53495 -59179 -16164 31965 69603
8147 69603 -211920 183642 187651 -53012 -168285 -173179 180360 148346 -192609 -322645 186111
8135 38860 -46133 132402 75061 -349448 59437 -5497 -169093 -5207 -203590 259328 153873
8124 153873 141466 -133848 -177617 92794 45710 -114126 96314 167824 -175249 -44178 265302
8112 24078 -102257 -92107 17051 37316 -278190 183734 154665 -174958 -54942 125534 57812
8100 156070 184170 326082 -202318 -143695 301729 -82037 -67398 -71132 151442 -106239 67076
8088 -168173 57983 -86058 -170021 -129491 -3545 336678 88266 38129 -152683 -47047 300920
8076 34651 169133 -129847 -95005 -383813 13672 -209005 -327488 -94220 128272 -243946
8065 -15905 -128611 365214 -108161 -208353 58486 104423 -120267 61995 -279472 107046
8054 329163 -187747 91111 177671 110660 -141299 -58531 -482032 -58957 -191382 -149062 -347072
8043 -347072 -102407 -155088 3454 -58068 -114684 -103570 -1730 -54335 47121 -175361 -36375 -177250
8031 -177250 38745 -73932 10794 188131 -160580 10848 86909 -162980 117262 262429 212553
8020 212553 184707 -184919 204679 -165926 -307293 -5513 306963 -175991 -83796 242177
8009 243499 64610 -97837 -81431 -221334 -261675 -217364 287804 -143458 92540 -21128 60894
7997 9961 13675 -55470 132630 150680 44053 134248 -79392 -59031 -154880 295674 -87903 283410
7984 198867 126769 11862 4932 174054 -158350 -20986 220067 22403 -237603 12170 -101012
7972 -301965 160821 83980 -51422 -85363 -65872 -235224 219574 -138134 -1616 -13371 -163290
7961 -163290 217208 -225654 61531 231681 -58400 -57101 -180232 -57654 61916 -268911 188743
7949 -495589 -112334 -45627 77335 -298766 5128 -233 -148424 144300 -155847 -263046 -60397
7937 113142 33752 -270879 -107024 57546 96640 -169668 -23166 -361872 -349278 -203583 163531
7925 83623 -25408 -24505 113037 -316139 327663 27469 -405899 -136739 -285242 251175 130022
7914 130022 50026 -14336 -82388 22717 179150 -136631 78788 226233 -364922 -280925 -168003
7903 -168003 23399 -167754 -27773 183847 79843 334908 -164210 39666 -83261 -443150 -74900
7891 38653 56531 -4362 -252735 -49048 -82613 -277309 -14234 -166121 73562 -128910 53623
7879 -37372 -361534 -51625 -20363 -3318 -41241 117650 -98266 20822 -129477 -139967 -58753
7867 -110381 -147634 37503 -74793 -188536 -79782 -19927 241714 -1368 -65609 -111634 -266049
7856 -266049 -13345 -49725 48114 -107923 -195331 -49423 -154859 191469 1746 -66204 2941
7844 -170987 -69695 -28070 87673 -409446 -41673 -100581 -296851 -84004 413629 -128971 34859
7832 -42187 519859 7141 146611 98923 163406 128677 -112992 108419 40773 -122622 10301
7820 -56226 -145771 26843 98640 -112051 -49421 32197 159883 15440 -18137 49580 -173278
7808 16931 35983 -78105 -53958 -338578 -247742 -3793 -212140 -127222 301837 186789 -40999
7796 -67780 -92972 -1260 -46933 -56914 -150503 22742 -210305 -129921 -118100 -86565 333238 236865
7784 236865 246042 -331784 14691 159477 114176 -404459 23144 119680 96811 -163941 -305325
7773 -305325 -102532 -90009 -272998 -104360 -53086 -205425 216645 -142990 122732 77129
7763 77129 -96159 96640 158528 -71299 -149640 -112845 276915 -148420 -32588 -38447 -30742 -6163
7750 203271 -39702 199475 -110220 146190 -293089 -16739 -135661 88920 -221683 -44308
7739 -58318 12314 -63564 -117792 -271313 -103647 -107025 46736 -185420 100274 42319 91121
7728 91121 -133357 -16933 -69261 -175775 -36221 -86526 10653 -148897 -111730 -185630 128419
7716 -338326 208324 111702 -59603 -101052 -43029 231024 26436 60353 45017 -95359 -273889
7705 -273889 -6122 97398 3505 -207801 -137869 -187994 -90523 129010 98175 197342 165791 22428
7692 245063 -92440 14090 -83519 -62403 -153866 -223947 -325483 -73616 55793 -253250 172773
7680 -63789 -305813 -49462 -266725 -84206 -171006 -127948 -353472 192274 -106190 14381 -120017
7668 -122505 -167145 -6081 -204583 -59763 13332 -42296 -46478 23337 78410 -62220 33716 -254475
7655 24058 121860 115977 -863 -112910 59341 57774 -6432 294170 -209510 217386 -123284 -182709
7643 -182709 121240 -59202 -88057 -178986 112123 -186366 -107343 189474 106566 -119813 -231066
7632 -231066 19401 152027 -159014 112198 74772 82992 41095 336424 127731 -116519 106271
7620 74785 -44721 -65008 8722 -145066 37431 -53048 -177454 -879 8639 65540 48805 12332
7607 -255378 -137191 255486 -9664 -307086 -74855 150484 -30782 -270735 -56303 80347 107697
7596 107697 -150502 -281765 131079 -109789 -391165 -240070 -168309 -81976 -11847 126341
7585 103741 -169089 90495 24458 -316928 284639 -174940 40057 123464 161365 90463 110901
7574 110901 -34319 26322 -249574 201289 260071 -21187 49158 -178509 190930 -56450 299445
7562 -39307 117174 -7559 -97498 115755 -99555 -20344 256843 -42973 27204 -372414 46439
7550 -5041 58020 137447 -37373 -173068 54669 -127746 -194000 -188569 -282263 -8756 105479 -368187
7537 -157366 209473 231475 224348 -21419 -64309 -129627 -61459 -353958 173459 -79700 218818
7525 -200646 103941 73761 -45641 67603 -9698 -101745 -90959 -387830 -306699 -89528 91914
7513 61336 117840 -38898 -178401 -330465 21792 1408 -28771 -54513 -119187 -114373 268901 -266543
7500 71986 -63863 -233650 38249 -178587 -118787 62510 117036 -75716 48338 -22384 -90148
7489 -90148 98084 136315 -69950 -171952 121275 -147555 -2041 248504 -17307 -194941 -405783
7478 -405783 -43598 124376 -124961 -85252 -34212 367776 20746 -35162 15344 163324 39153
7466 -233201 -9937 -38794 123708 156351 84214 -40066 105547 -127267 -297155 58204 -61068
7454 -214375 -784 125170 -87579 -143907 71844 77213 -165534 -6892 127645 26421 -103007 -36651
7441 -108103 -185698 -64465 110329 58500 -38943 -233841 53403 -3441 -61420 -137286 -157373
7430 -157373 28899 -47852 -41331 188660 -14397 -84738 -305588 -181001 68786 -15339 173666
7418 -88234 -119542 17804 4164 -2484 295948 -90156 -288788 -35700 -106245 53638 -133778 -88685
7406 -88685 195127 265912 -182541 -92546 14953 77548 104893 64511 -320456 -156302 41066
7394 -156216 -387202 74663 -161486 -201788 82368 -162667 367609 -120168 -306288 -13249
7383 -226609 -269631 375650 92101 66516 540053 17695 75181 -129328 -135919 -13060 -74501
7372 -74501 -216178 74022 -18698 -232246 139760 -144120 -174826 -3797 26873 194639 -143759
7360 7787 -24549 12503 -178102 273118 -127604 120014 -99044 -44183 -165807 -47351 106084
7348 -74260 248718 -126097 -103308 42626 66483 -84588 -34750 8653 173826 -38790 -2087 -456826
7336 -456826 -325728 165348 -23437 -66104 153746 -110313 -172 -318098 -296972 88618 -237184
7324 13800 -63287 -36321 -383191 -71838 108465 -151310 50129 -15566 187946 -83721 66871
7312 10466 268041 -145318 22184 -3211 324367 277706 -6847 81716 65803 -191486 -207232
7301 -207232 18365 -86356 200055 196691 53771 -179105 54977 -2933 7153 -1484 -201572 -216859
7289 -216859 96238 -62523 29468 86866 -201776 131573 -70287 284058 -80763 103938 107855
7278 107855 -35917 391787 -119502 175340 -86578 -309052 94673 -208418 -434736 -79033
7267 -161704 26434 -244018 -305852 160811 -209008 34184 -132849 206725 -278673 -165816
7257 -165816 32080 -108616 175872 353266 71706 -181746 -20303 -185231 -116230 78903 -1490
7245 166263 -346272 304925 -323394 -64602 -258845 -26599 -7165 -138046 149463 -51715 81793
7233 -81930 -286327 -510571 -6011 13424 -233578 54623 154955 -19844 -283607 -254184 -101699
7221 15506 -26024 427178 190802 -89293 -32336 -45689 -99850 -94991 296035 -46786 155881
7209 -169241 -27073 -45898 263916 321985 -32129 -83228 -96827 -215613 -91031 -4572 22755
7197 -275018 -60505 20126 -219848 -314182 -211427 -125848 -209678 -149798 48515 47805 -238557
7185 -103777 -104068 -55969 155401 -139422 -295306 -35241 162697 206412 -1011 -58032 17299
7173 -270445 -177715 -21082 89318 -16053 -34082 90765 -30088 41095 -156016 28082 -46770
7161 -152134 7623 79340 -230188 -52718 -131865 -184838 -318477 -326350 59491 60322 46858 -126422
7148 117710 25753 197273 -113475 -259478 39272 34726 270529 -37498 -259653 236022 -146121
7136 79796 -52956 -181611 176349 -66043 127514 -12387 -110578 160579 24709 -47818 70285
7124 -140028 284386 -272501 -188108 282448 -212104 46739 -42776 -118773 52452 -87679 264002
7112 56970 77373 73248 217369 -79416 325502 -129214 -256919 216204 -28912 87372 -117612
7100 -15309 -26752 -244922 88355 134179 -51976 247150 -139557 -46507 -228021 -14322 41191
7088 -238550 2218 65306 -135925 233502 15223 -204665 279084 129222 -161104 -32960 -377189
7077 -377189 -80291 139298 -399109 92068 144158 -429703 173356 218808 -126350 -330818
7067 -330818 78987 -257716 241627 239141 -84604 -212339 -332338 22548 -242009 137781 44568
7055 -212679 -111723 -181406 -245105 170410 -153926 208317 53652 -275693 -216045 -531786
7045 -531786 268760 53967 -154045 -412954 289988 -107922 120965 69847 -50959 7896 5092
7034 5092 201528 96428 -88586 135412 44647 -145209 30628 33981 -123858 257620 -216331
7022 -93807 16785 -52633 32737 36763 -177608 99345 26637 -44327 121097 20004 -244308
7010 130348 44774 -119608 126479 -181742 393426 11261 88626 -94153 175959 13351 -198781
6998 -49642 -252187 -69796 165324 16475 258601 -78361 -304595 -105989 -208161 -38897 -12263
6986 57136 -29374 -33156 -368477 188117 86654 -73911 -351997 -51173 171078 -150850 -9389
6974 218453 -371595 87992 26019 -22233 -4199 -467457 192137 35634 234863 81045 73831
6963 73831 -1240 -126113 -218730 -69030 -172522 -77043 -41316 33795 -338221 144242 -21643
6951 123889 83765 68925 38797 -143871 -32470 82385 46321 -89252 61174 8593 72120 -43312
6938 -51884 285256 6893 -341191 -219730 -11708 -190802 398984 -76709 123751 528023 -217063
6926 -211868 -196859 -37902 50881 8900 72271 -92196 -97966 108694 -79107 343205 66577 -76009
6913 -242629 2879 -128226 13769 -139626 -203318 -58883 38732 48221 16059 -20832 306662
6901 15143 113364 -236522 -98342 -46516 -5983 114450 -60966 -364493 -15265 -359878 -146169
6889 -171057 -117518 190590 124164 -180306 187619 29696 -97317 20349 -18309 -107932 46038
6877 -110660 -54328 289052 -84654 -159078 -102821 -36627 -240344 -16099 177793 80855 -67431
6865 -190024 5983 -46589 -47069 266781 205221 156191 293682 65960 56083 -183559 -33312 197447
6852 189223 -205494 150442 368643 371679 75112 -205874 -25459 -154073 -30984 -106895 -147922
6841 -147922 -130103 82366 105489 -657 79622 136972 -36538 -171275 296417 -139536 -5844 102404
6828 -140686 -145396 -155639 -110750 179633 110717 117064 -338347 45287 -91801 -46037 183579
6816 146906 178185 391760 21086 3852 -242058 65699 117133 -166797 -131610 192817 -129754
6804 -20963 -136014 140669 -85150 -376608 -44400 -244440 187097 177152 48813 -181983 90396
6792 -152349 345932 -39613 -230063 19867 -112591 29547 -202211 146672 32610 -247751
6781 130812 131263 -392214 166584 97834 -363974 130485 -39338 166593 -207206 -340787 -221292
6770 -221292 -74882 -183001 -303147 -88233 134614 93443 200774 -22097 -162102 90179 -63999
6758 185970 -287068 18242 17727 -6018 -155468 -23059 -53029 -199887 -174677 99753 159167 -148249
6745 -77543 -106850 -198362 -38258 -95421 141966 -183375 -148396 407901 -259688 -40875 -161516
6734 -161516 -139155 209660 -144784 11332 64487 73716 47864 195855 -128007 -223975 80662
6722 -42569 64301 -94858 22706 52615 30061 46019 -276483 36698 -124421 -156341 -255790
6711 -255790 -144606 48456 -219718 74441 -223030 -34181 171364 145160 -54514 -222570 3431
6699 210880 54998 -151240 -9800 -2291 147852 140315 235431 -114473 -62200 129088 113113
6688 113113 -2375 111257 -367501 -113197 -299425 -42582 55762 120579 193411 298705 41404
6676 116871 -138557 -152897 -104529 293937 -201319 -105988 82800 145486 -173292 -83862 -398051
6665 -398051 117551 334172 -151415 202040 2351 -131920 211775 -97633 -115596 -11978 9286
6653 -182613 37807 -321861 252296 -276496 -356773 -53898 44758 338110 369 20813 207573
6642 207573 167615 -56724 -232155 -193561 -11746 2732 5152 -96023 -71342 -35990 -126718 385077
6629 -108616 81840 20520 -143249 349533 -232578 -292137 -230901 76595 -11036 -107355 -176121
6618 -176121 -129636 30966 -66907 -47079 -77388 106169 218091 -1103 -366256 -57677 -271021
6607 -271021 -192180 -92702 -339796 259272 219558 6024 42273 -285185 -23507 60367 -2957
6595 225465 -170911 -35635 -24362 43619 -108685 254289 -176459 -113127 -224623 370790
6584 -93711 -164645 -279183 30613 6321 -278472 155491 189307 -146956 -107662 2712 -181637
6572 -59668 -40141 100815 -251133 11273 152480 170224 193476 -82375 55527 250364 183394
6561 183394 -31839 151293 6549 -99632 -46712 -72551 78198 9310 333546 -152286 -10266
6549 198825 -28672 -157379 -108718 -162897 -293781 -47259 169932 -123311 104910 -102687
6538 -101237 234147 152319 128415 126421 -55377 148982 76703 11687 172417 307851 270852
6527 270852 9605 -195535 -126978 -112949 -6988 -220880 -98901 -115437 254936 154573 12505
6515 186088 -39149 -145734 -206742 94409 114678 -171410 -8494 -8577 9417 296141 169964 13184
6502 43381 -288085 -93235 154696 85327 64874 29789 -91050 61661 -100766 183243 101470
6491 101470 -40588 -136034 -352524 2039 261115 -51864 -337375 -323750 216780 -308772 -210258
6480 -210258 50389 114205 118376 80740 174458 -133147 -207490 -23354 -189102 12778 468 296116
6468 296116 -124069 41321 205118 -148517 -54094 115799 -43940 17136 -98101 -174481 -181536
6457 -181536 108729 249608 237611 -289086 -264884 64966 357267 -12355 315615 3798 54138
6446 54138 119656 -42861 139071 75960 75990 -113847 14565 229129 -139737 -5896 -3971 228519
6433 -23005 -156520 184817 -42807 -287776 -19780 -1349 612 -54062 -50453 -61976 36001 274515
6421 274515 -141643 -81085 16597 106319 135904 -50595 -43505 -101399 -93687 -186893 -181532 122278
6408 -250497 -321914 -309948 -98191 -236020 -226622 361055 127917 214184 10847 -49530 53754
6396 -166988 125075 -15898 103935 2574 289659 -49716 198503 70962 14098 130566 116393
6385 116393 -315506 12037 182023 -296858 -61121 80009 -114199 247107 20415 333320
6375 333320 167690 -184877 -8641 -35692 -78945 -106311 -115009 130604 -197157 -18294 116867
6363 153053 43098 205205 140315 -324859 137433 -74063 23496 -76275 298766 -339352 158779
6351 363455 75236 78849 445759 109970 51544 111208 -41722 -11709 -240783 32647 -229125
6339 193242 -402150 -48084 130971 57025 171209 87841 151577 -69186 -18073 -21298 -246313
6328 -246313 170373 117801 382577 -37813 136328 4051 -70949 -267848 -88741 -43521 146665
6316 -46830 -120193 123856 -64373 -278632 -232081 -179437 -162465 -26860 97292 -58108 144005
6304 -82984 63898 -332787 36876 -166664 222816 -22945 -165959 7288 -233834 -286130 -261729
6293 -261729 -66426 131642 -119904 -201475 -123478 48014 226963 -248685 -35124 -63975 -3119
6281 -34944 141081 -40430 213089 266615 305813 -56177 -62454 115808 236542 140168 -42017
6269 317141 -182327 -166445 124505 134198 -111611 178371 388929 -72467 167245 82621 -130323
6257 -392190 70881 154187 -67888 69486 -242566 -90320 134212 -67444 -90585 -35367 -45979
6246 -45979 75706 -58590 -81386 29414 -40070 -140906 -121460 356542 -130467 -136392 -45211
6234 -144365 -230957 132127 -61652 -379231 -66594 -15444 -235872 16180 80233 -40479 -187408
6223 -187408 -385913 140847 -35152 202957 45281 204303 -75968 98637 235719 -43877 -66349
6212 -66349 -140593 169546 70895 220338 -79311 97424 299612 -15233 93432 1258 -262940
6200 -188998 45385 30126 -135767 -19084 175710 15969 102378 -351671 16808 -131638 153157
6188 -179007 231936 150046 -242630 -266049 -89180 43032 -135052 -36136 185177 -170162 -127919
6177 -127919 27690 -118958 169305 -86156 190873 -169359 164505 -8958 -122923 94060 56512
6166 56512 -160311 2736 49112 58723 -129099 108568 -159439 -124919 -5668 123233 -2538 24652
6153 -12349 81138 -100261 102133 -163848 -156145 -26162 23285 118278 420132 44127 -37134
6141 224585 41156 196925 -12423 251837 4423 -161243 -189314 -29446 106902 -67704 -9085
6129 -193814 281205 92482 -27432 158 107822 186549 -113293 -234974 -227189 48705 385354
6118 385354 -117123 182232 22722 234807 -53595 -204207 -214407 -40654 -238305 -194342 -148534
6107 -148534 3444 -212828 -197048 -124777 -26082 -249052 -195744 207544 -177565 191599 210700
6096 210700 74121 98993 -147308 102453 -29352 -158733 -31613 229535 -77376 -172371 79677
6084 -39681 16510 -98330 72199 121948 -464818 155728 -17351 -154358 -104079 -73818 133410
6072 -313121 68762 -77171 182131 -233781 -203184 57975 64431 -224370 146023 46341 -86195
6060 21818 -209082 427563 -359021 -135128 164446 -43112 9623 150290 -61091 90562 -216323
6048 -158810 -607 -21841 73967 80700 -239709 232219 36913 -37685 -174457 5636 110933 51625
6035 -89064 312627 -214335 -124821 66940 -182639 146526 -13625 -49876 68865 -160097 208830
6023 99023 -42975 11736 -39617 21520 150859 349116 -252370 -315346 93732 -16796 112211
6011 71168 -134899 -144485 9679 -67442 -2419 69194 105060 -74404 179924 -156842 -128196 276746
5998 96274 136436 -91976 -59421 159288 -313614 19239 60520 -486312 6790 412778 -131106
5986 111066 43263 -104410 -139096 86037 -137601 -6191 7324 19314 398435 -169492 -234154
5975 -234154 -197933 -115801 -102082 22521 241533 160107 185093 -131218 -97586 234525 93992
5963 156150 -156444 15924 217370 -179349 -69778 -122304 522770 -121794 -352609 -165781
5952 -178628 137586 273058 279464 -106234 -24413 77272 74735 65708 -84025 -253140 107388
5940 -241782 109353 -29961 214356 154178 134320 11679 269285 -171684 -86757 232260 -143563
5928 -136466 -117268 247716 -91184 -85849 218979 -43241 -44707 -218175 -9591 -179088 200835
5916 23654 74172 -101948 -285979 197424 -45036 -212737 248040 -29916 -136091 -131211 60049
5904 -105011 124339 -4225 270537 112679 358040 36535 -56489 -184409 -294992 133611
5893 292376 -142690 89859 209946 274910 -115198 -42261 -86897 -139655 140043 -55785 229972
5881 19714 260441 99905 51733 -262942 -123886 221245 136241 51468 -309712 -193047 26826
5869 67489 -135653 309840 -357426 186846 -150259 199921 226000 85014 -146199 205345
5858 -118753 31234 79090 -39103 -205273 71331 346640 -156323 -139618 5385 -140700 -3002
5846 -162926 178429 -259563 -60860 -251782 -74710 -299243 -227834 -55418 152797 -231387
5835 -3359 -224009 98687 168290 -276280 149947 -186908 -19761 41795 -284640 -116229 -390981
5824 -390981 58156 -122059 56417 155411 -136229 301632 19746 118086 222066 55637 35596
5813 35596 -178069 -25641 153801 -119860 -284375 220040 -1823 -34469 193428 -79955 -5183
5801 -124401 -20185 -204350 -112895 -211359 -110317 104320 326 45659 -251589 -35398 -91323
5790 -91323 -161888 162530 -190067 134081 16807 -180138 28708 -82856 59560 -153845 117008
5778 278196 1089 -164520 -101905 -10048 -92230 -142190 51078 -75556 -290433 305781 182617
5767 182617 -99539 14566 225490 194466 -181797 -352008 -3673 319608 -157529 78621 -26547
5755 165125 -55469 98732 10322 35756 94754 138920 -187504 12368 211936 -136338 -253088
5744 -253088 135021 108232 -2578 17927 223081 109727 -18632 13949 -70707 -138185 -111897
5733 -111897 246269 47970 82493 349681 -23353 -36083 255082 206074 195343 11007 -159531
5721 -143800 -16947 -55021 -304110 -124132 186447 -230080 198395 211549 -191538 119587
5710 160196 376916 232013 -190583 166822 38963 -38399 226054 46245 153067 130223
5700 130223 127174 280824 -106599 -56170 -78298 235215 -183690 -523548 778 7919 125630
5689 125630 -70187 189501 131922 71781 -190399 42576 17198 -15934 -184228 79716 3884
5677 -168953 -98630 -69632 -167713 -267888 -100546 109375 -222273 123700 277812 -380726
5666 -32084 -77906 166070 237171 286979 59241 -127226 -2015 1094 262956 357799 146889
5654 -282454 -10945 291096 -22958 -37302 -125122 228891 86500 -125293 -101817 -24671 -170490
5643 -170490 -51705 -69440 296925 -279157 -276324 -41961 -109661 -47771 -2030 114967 -194536
5631 -236762 248173 15353 38755 105702 250130 28505 173332 201624 9906 -12108 -178103
5620 -178103 62309 -51004 224431 141397 12063 -25820 -96207 -235833 14517 18119 -177636
5608 -88697 -135949 -113829 113924 -17977 198067 151792 126044 -67496 -17339 -122991 16228
5596 -48935 -55768 70594 -256634 -193544 -269706 -289223 -226659 -13407 262816 -40204 -11077 -23681
5584 -23681 -50812 -189173 -129674 210382 -139986 151976 60497 -29218 10497 180638 160439
5573 160439 -66058 51243 11279 -189656 156821 226408 102884 -268670 -288290 360757 68032
5561 -81190 118221 -99594 -234094 -115252 180731 101190 166118 169193 88903 -208664 -69283
5549 33895 10373 144792 234055 86019 166617 -235503 -75749 34320 -29145 21820 -31694
5537 192725 -82393 94973 -11472 214656 12606 83169 213539 -177023 -215231 -115348 -172691
5526 -172691 -119686 -61963 98488 -118651 254801 -97680 -171887 -171721 65 366348 -40697 12404
5513 240026 -52640 -128193 -1732 200047 -232794 -95868 -203098 -252205 136997 344049 85671
5501 -116931 -196134 -133631 38824 -165392 6956 65736 110345 166321 133258 -13391 -90338 213997
5488 -86498 211414 340272 -221968 327693 200561 85645 -135200 -38523 187659 -30582
5477 -244496 -98896 305762 57619 121260 43646 -38710 -141237 -77545 -212816 305226 288453
5466 288453 237129 140930 211844 -166319 150678 -214254 -16489 278904 29230 106399 -24449
5454 13819 -1974 -127377 -183044 -235233 -53043 -87357 449098 -30492 -106223 -35192 406764
5442 -52163 -178768 126288 -45462 147829 19037 -120529 427 147480 92495 95776 38994
5430 48263 61864 -345601 -187174 120477 -57708 114732 112667 104913 -171531 -174089 -273308
5419 -273308 55517 52936 -5412 -233525 86275 138327 206974 18661 192377 127239 38206 -315005
5406 -111702 312956 181360 -258482 -64195 -51694 160965 185509 159481 341011 -236061
5395 80284 -88258 91319 261271 -36441 -388843 -148329 -151324 137333 -186939 92616 104141
5384 104141 -38091 279519 -38968 -16057 95990 -125411 -30761 -26547 -154851 4423 -66216
5372 -292708 194321 -114515 131753 55121 135312 154761 -12759 -191913 288902 -340913
5361 -244791 -289824 -161077 158327 -161892 157748 -43011 -180700 -108261 -94858 193923
5350 84330 -173095 -162043 -187333 51034 -107987 -259367 72933 103927 -50078 -43260 249420
5338 77021 -139044 -45382 -63020 209086 -198370 62376 120655 110234 94811 56062 -22452
5326 -143240 192642 -313345 -67250 -250941 31227 -12754 68860 -34622 26097 21834 63147
5315 63147 14292 -62287 -42735 -203631 -155048 110806 6484 -39402 104158 -122056 -292125
5304 -292125 217703 58932 -156621 60551 72035 -78464 344632 -220019 -201524 -155361 167934
5292 -146135 34049 -58576 -89645 -194614 16785 -147114 -78919 65924 -202255 -178169 143744
5280 229681 8249 -62966 162229 -61212 -163048 47376 -43048 -295923 30214 59904 366234
5269 366234 133097 145279 -30442 -49183 -146588 8429 138911 14777 14005 133074 208962 125913
5257 125913 186061 180419 -234978 -169288 -218601 251773 -259966 219726 93727 -176388 -179991
5246 -179991 -30577 81805 -21029 138871 71751 124184 -372524 71210 79231 -56636 131969
5234 233921 -96850 -93051 -73511 -61125 -50492 318064 -115822 31085 8814 290305 -178938
5222 66990 -136427 -11995 -79088 144356 71645 313939 114304 19529 233114 -84213 108906
5210 -325561 207299 114333 114864 190840 92215 8475 -144231 -87436 -209314 -28627 22498 332500
5198 332500 15920 -73002 77491 8354 -71900 62239 174144 129030 171818 -30194 57625 16638
5185 -368108 19621 58756 -101713 -350328 -5656 -158982 40255 116585 -29653 83388 78040
5174 78040 -195752 131611 61374 -149126 -224180 179161 -70491 308136 122503 -81001 -87369
5163 -87369 647 166637 365224 71197 -125693 -187154 50818 -151223 -42511 163979 245579
5152 245579 -81235 38388 40251 50426 -114503 -200579 88013 -201106 30110 -184181 -29976
5140 -14917 174545 -130432 83685 154159 -24387 -81864 -252489 -6910 31231 -26113 -225137
5129 -225137 -19136 -59928 -125670 83004 239732 -1274 -83929 37863 40617 13137 113082 -145066
5116 241535 144395 -265143 20562 30789 -218284 -13876 -239562 -53698 271876 -136090 -112235
5105 -112235 -186429 -27365 357260 86925 -75969 304973 179713 250708 -25460 -34570 -67696
5094 -67696 80561 301982 -94654 46858 -190481 -75264 -284432 65370 -12846 -8202 -54740
5083 -54740 -183606 207572 42745 199113 -346613 334736 24427 164128 121495 -304038
5072 -41031 -560367 12081 -212820 -10372 136084 1531 -121994 60214 -134413 3210 41118
5061 41118 -5346 -215707 -265746 -57884 161614 -34812 175723 89403 21074 -324222 236841
5049 -89334 236299 52988 -162161 23259 -77319 124183 297645 -11104 61592 4072 51927
5038 51927 24349 246176 84702 179488 268700 -248480 78135 432994 -182597 63407 86319
5027 86319 238078 79802 64314 358746 11098 -1305 -1574 49987 -32247 24956 19407 327575
5015 327575 -129177 -159937 -23049 -230452 48312 51903 125324 45262 243557 -51737 -111003
5004 -111003 -241758 -166927 228465 -9460 174039 116273 173237 402591 -31979 -101673 243403
4992 -134658 -121921 -262898 174333 -22691 -13987 -273041 58366 61971 -85070 52940 253715
4981 253715 293950 -139793 216227 -191677 -10659 49276 -71520 -96102 -273311 66949 -10353
4969 -42165 -48228 83634 63450 -167131 47238 -183337 66868 42236 69909 166798 -283934
4957 218945 -111116 -72963 -51524 -162222 108008 -120409 53662 50635 168588 26267 174484
4946 174484 -96641 -130408 204338 -47202 -6386 227736 -90229 36921 170946 -19866 45716
4934 -3672 -38307 -24270 58013 112704 54060 -55639 -48683 78898 316381 -49508 123337 -215866
4921 198224 106266 -151038 121434 116825 -93459 26893 158322 447319 -306612 285098 16190
4909 163455 43129 103533 3367 196227 -39919 255903 -67563 64459 -163279 103767 -72591
4897 -61337 -69656 -42456 453 -31467 183167 208231 -128844 68113 -186007 3583 -72762 -123543
4885 -123543 171707 116932 275973 14513 30410 -282775 67588 294041 -117328 -247960
4875 -247960 -103359 -337544 -196311 122397 54183 148299 -158132 211584 17690 57167
4865 57167 -240982 -164118 132512 -57045 407123 169261 117375 -249724 75765 151053 3128
4853 177449 77739 119563 -292062 45891 63821 155891 -299412 -87412 9697 -100367 -993 -120874
4841 -120874 -9709 71032 -220634 -45283 90247 -1257 -73651 107740 -276210 154857 -327603
4829 -241195 -50169 -127312 42162 -50678 -36477 -152614 46518 -156141 120959 51798 14496
4817 220369 36439 47009 -326 -254890 260542 151142 -189092 -197245 -4573 -228843 288283
4805 154495 -93732 -185090 404439 -225844 -86323 166807 -130711 -44855 -332315 31620 163837
4794 163837 254548 -2989 174618 30796 251181 -16740 294379 66784 -58856 55616 -51371
4782 29271 98374 4718 50357 122633 -266752 -208329 53759 -55327 -291616 53519 -55737 93450
4769 43359 186312 367142 19403 24465 -19288 83491 -266218 -29953 44549 119068 71524
4758 71524 193505 -146431 360445 -11454 153631 -259217 -57599 229680 103692 -22018
4747 -108321 95449 203786 -83264 10141 188950 179857 -42084 -209884 -46855 161568 36571
4735 -44886 92906 -308510 2842 23905 101152 -63036 287980 -190691 -208900 124883 32785
4723 28270 -1380 -280934 37620 -70836 627 -385198 -153771 174777 -28702 42600 -302449
4711 -265150 53329 34223 1963 90448 93850 25498 -3279 48596 35584 11160 -179461 139724
4698 206482 -140195 85382 -144349 47202 -137992 -17925 42938 1510 -36951 -16953 -208019
4687 -208019 125338 221767 111913 -97598 -209860 146889 180060 -271396 -304651 129549
4676 -259213 -22248 54529 25259 -15689 105048 2507 -24462 -190969 184888 -55383 106973
4664 -27771 537678 -212078 -268987 -62874 -209018 38528 96482 77764 56340 221914 30896
4652 -2156 161089 270730 123529 426463 -287910 -154476 35768 -67708 39730 47022 -7222
4640 -125613 -100016 132219 95447 -137675 24894 -252367 -110871 266925 13028 63616 34387
4629 34387 -120261 225581 -33856 241155 122607 202290 -400759 177492 141799 125957 -146890
4617 20555 -89792 -141327 277601 181590 102727 14844 -19092 -71874 135354 149995 -109630
4605 18448 -258721 169908 -15566 63878 -240242 -209075 -122995 322058 -223465 -56255 -285006
4594 -285006 -49151 -251163 193781 -147831 -141271 -107596 259930 -50337 -20690 67072 287792
4583 287792 208504 24089 -162368 221450 119629 92980 -299870 247494 -140174 12669
4572 -73075 16564 192960 5807 -107514 -14835 89189 169993 -179547 44325 -79116 -228236
4561 -228236 -56183 30231 -52943 58337 172507 248215 -198560 -271355 -257090 -148179 -106405
4550 -106405 130774 185754 270560 28433 -23072 94214 -3349 -285450 -89888 80511 -165421
4538 -173062 136822 -110798 -111019 -295371 161069 -75621 12334 -2333 253385 -89252 112849
4526 -346298 152743 -250258 139930 108706 39704 109762 57938 -195546 -234808 122685 -8539
4514 -130871 288634 -378946 15469 53029 -45263 107051 -134856 -64606 -31661 -340363 203439
4502 57123 -1069 150089 10292 -213011 35863 -112007 15797 -213577 291806 -90248 -115915
4491 -115915 -33574 -361361 116511 -560792 127925 -338984 143529 94085 -172633 115722
4480 -109050 -310926 23468 -121397 -204096 163991 14502 -218574 70667 -178809 -184813 158737
4468 -363331 96739 51389 372697 8464 130934 34928 105264 -220011 -98351 31871 134462
4457 134462 -152163 87022 -153064 -173117 -217579 111731 67821 74074 168500 82340 79884
4446 79884 -144252 210316 111668 26364 -197842 -35617 452433 86232 258681 321367 153338
$$ [...]
##END NTUPLES=NMR SPECTRUM
##END=
