##TITLE=NES1065_ptc_ref_9883764_BG3vxLU3YG
##JCAMPDX= 6.0         $$ Bruker NMR JCAMP-DX V2.0
##DATA TYPE= NMR SPECTRUM
##DATA CLASS= NTUPLES
##ORIGIN= BRUKER
##OWNER= Administrator
$$ 1.72 TOPSPIN		Version 2.1
$$ 2016-08-27 03:01:23.929 -0500  Administrator@X
$$ Compression mode = diff/dup
##.OBSERVE FREQUENCY= 400.02188249412
##.OBSERVE NUCLEUS= ^1H
##.ACQUISITION MODE= SIMULTANEOUS (DQD)
##.ACQUISITION SCHEME= undefined
##.AVERAGES= 64
##.DIGITISER RES= 22
##SPECTROMETER/DATA SYSTEM= spect
##.PULSE SEQUENCE= noesygpps1d.comp
##.SOLVENT NAME= COFFEE_meoh
##.SHIFT REFERENCE= INTERNAL, COFFEE_meoh, 1, 14.96263
##AUDIT TRAIL= $$ (NUMBER, WHEN, WHO, WHERE, PROCESS, VERSION, WHAT)
$$ ##TITLE= Audit trail, TOPSPIN		Version 2.1
$$ ##JCAMPDX= 5.01
$$ ##ORIGIN= Bruker BioSpin GmbH
$$ ##OWNER= Administrator
$$ $$ E:\/data/COFFEE/nmr/NES1065_ptc_ref_9883764_BG3vxLU3YG/22/pdata/1/auditp.txt
$$ ##AUDIT TRAIL=  $$ (NUMBER, WHEN, WHO, WHERE, PROCESS, VERSION, WHAT)
(   1,<2016-08-27 03:01:18.679 -0500>,<Administrator>,<X>,<go>,<TOPSPIN 2.1>,
      <created by zg
	started at 2016-08-27 02:49:49.008 -0500,
	POWCHK enabled, PULCHK disabled,
       configuration hash MD5:
       21 0F 79 D6 B3 7B B4 F6 88 20 88 DB 03 48 BD 9F
       data hash MD5: 64K
       6E 87 95 16 CB 85 45 48 CF 9F E6 9C E5 D0 E7 9B>)
(   2,<2016-08-27 03:01:21.883 -0500>,<Administrator>,<X>,<proc1d>,<TOPSPIN 2.1>,
      <Start of raw data processing
       efp LB = 0.3 FT_mod = 6 PKNL = 1 PHC0 = 0 PHC1 = 0 SI = 128K 
       data hash MD5: 128K
       28 A9 2A E7 C2 82 A2 64 8E 97 29 97 51 3E 44 E2>)
(   3,<2016-08-27 03:01:22.742 -0500>,<Administrator>,<X>,<proc1d>,<TOPSPIN 2.1>,
      <pk PHC0 = -82.78748 PHC1 = 0 
       data hash MD5: 128K
       F7 6F A1 0B 7E 84 41 5B 0E 17 A3 62 81 A9 88 2D>)
(   4,<2016-08-27 03:01:23.117 -0500>,<Administrator>,<X>,<proc1d>,<TOPSPIN 2.1>,
      <abs ABSG = 1 
       data hash MD5: 128K
       19 E6 5F F6 EE A2 2E 42 08 E9 F4 06 5D B4 D1 D0>)
(   5,<2016-08-27 03:01:23.226 -0500>,<Administrator>,<X>,<proc1d>,<TOPSPIN 2.1>,
      <abs ABSG = 2 
       data hash MD5: 128K
       FC CE 11 09 70 C1 90 40 4F 8A 73 EC CA BF 8E 52>)
(   6,<2016-08-27 03:01:23.304 -0500>,<Administrator>,<X>,<proc1d>,<TOPSPIN 2.1>,
      <abs ABSG = 3 
       data hash MD5: 128K
       E8 0F 13 0A 7C C8 10 D8 D1 A4 3F C2 5E 39 4B 92>)
(   7,<2016-08-27 03:01:23.398 -0500>,<Administrator>,<X>,<proc1d>,<TOPSPIN 2.1>,
      <abs ABSG = 4 
       data hash MD5: 128K
       89 9D 8C 2A 9D 9D DD FF C7 95 86 5A 91 45 F0 89>)
(   8,<2016-08-27 03:01:23.508 -0500>,<Administrator>,<X>,<proc1d>,<TOPSPIN 2.1>,
      <abs ABSG = 5 
       data hash MD5: 128K
       AF 6D 44 43 A4 2A 28 DF 50 A5 05 C5 DC 63 16 D4>)
$$ ##END=
$$ 
$$ $$ hash MD5
$$ $$ 45 7C 94 41 B9 CC 0D B6 A3 07 33 D3 F7 6A C3 F5
##$RELAX= 
##$RELAX= 
##$RELAX= 
##$RELAX= 
##$RELAX= 
##$RELAX= 
##$RELAX= 
##$RELAX= 
$$ Bruker specific parameters
$$ --------------------------
##$DU= <E:\>
##$EXPNO= 22
$$ [...]
##$TP07= 0
##$TPNAME0= <>
##$TPNAME1= <>
##$TPNAME2= <>
##$TPNAME3= <>
##$TPNAME4= <>
##$TPNAME5= <>
##$TPNAME6= <>
##$TPNAME7= <>
##$TPOAL= (0..7)
0.5 0.5 0.5 0.5 0.5 0.5 0.5 0.5
##$TPOFFS= (0..7)
0 0 0 0 0 0 0 0
##$TUNHIN= 0
##$TUNHOUT= 0
##$TUNXOUT= 0
##$USERA1= <user>
##$USERA2= <user>
##$USERA3= <user>
##$USERA4= <user>
##$USERA5= <user>
##$V9= 5
##$VALIST= <valist>
##$VCLIST= <CCCCCCCCCCCCCCC>
##$VD= 0
##$VDLIST= <DDDDDDDDDDDDDDD>
##$VPLIST= <PPPPPPPPPPPPPPP>
##$VTLIST= <TTTTTTTTTTTTTTT>
##$WBST= 2048
##$WBSW= 25
##$XGAIN= (0..3)
0 0 0 0
##$XL= 0
##$YL= 0
##$YMAX_a= 6617777
##$YMIN_a= -14300968
##$ZGOPTNS= <>
##$ZL1= 120
##$ZL2= 120
##$ZL3= 120
##$ZL4= 120
##$ABSF1= 14.96263
##$ABSF2= -5.595551
##$ABSG= 5
##$ABSL= 3
##$ALPHA= 0
##$AQORDER= 0
##$ASSFAC= 0
##$ASSFACI= 0
##$ASSFACX= 0
##$ASSWID= 0
##$AUNMP= <proc_prof1d_extract.lims>
##$AXLEFT= 0
##$AXNAME= <>
##$AXNUC= <1H>
##$AXRIGHT= 0
##$AXTYPE= 0
##$AXUNIT= <>
##$AZFE= 0.1
##$AZFW= 0.1
##$BCFW= 0
##$BC_mod= 0
##$BYTORDP= 0
##$COROFFS= 0
##$CY= 15
##$DATMOD= 1
##$DC= 0
##$DFILT= <>
##$DTYPP= 0
##$F1P= 0
##$F2P= 0
##$FCOR= 0.5
##$FTSIZE= 131072
##$FT_mod= 6
##$GAMMA= 0
##$GB= 0
##$INTBC= 1
##$INTSCL= 1
##$ISEN= 128
##$LB= 0.3
##$LEV0= 0
##$LPBIN= 0
##$MAXI= 10000
##$MC2= 0
##$MEAN= 0
##$ME_mod= 0
##$MI= 0
##$NCOEF= 0
##$NC_proc= -2
##$NLEV= 6
##$NOISF1= 0
##$NOISF2= 0
##$NSP= 0
##$NTH_PI= 0
##$NZP= 0
##$OFFSET= 14.96263
##$PC= 1
##$PHC0= -82.78748
##$PHC1= 0
##$PH_mod= 1
##$PKNL= yes
##$PPARMOD= 0
##$PPDIAG= 0
##$PPIPTYP= 0
##$PPMPNUM= 2147483647
##$PPRESOL= 1
##$PSCAL= 4
##$PSIGN= 0
##$PYNMP= <proc.py>
##$REVERSE= no
##$SF= 400.020008985788
##$SI= 131072
##$SIGF1= 0
##$SIGF2= 0
##$SINO= 400
##$SIOLD= 131072
##$SPECTYP= <>
##$SREGLST= <1H.CDCl3>
##$SSB= 0
##$STSI= 131072
##$STSR= 0
##$SW_p= 8223.68421052631
##$SYMM= 0
##$S_DEV= 0
##$TDeff= 65536
##$TDoff= 0
##$TI= <>
##$TILT= no
##$TM1= 0
##$TM2= 0
##$TOPLEV= 0
##$USERP1= <user>
##$USERP2= <user>
##$USERP3= <user>
##$USERP4= <user>
##$USERP5= <user>
##$WDW= 1
##$XDIM= 131072
##$YMAX_p= 380526748
##$YMIN_p= -12081
##$CURPLOT= <Network HP LaserJet P1505>
##$CURPRIN= <$Network HP LaserJet P1505>
##$DFORMAT= <normdp>
##$LAYOUT= <+/1D_H.xwp>
##$LFORMAT= <normlp>
##$PFORMAT= <normpl>
##$SURQMSG= 1
$$ End of Bruker specific parameters
$$ ---------------------------------
##NTUPLES= NMR SPECTRUM
##VAR_NAME=  FREQUENCY,     SPECTRUM/REAL,   SPECTRUM/IMAG
##SYMBOL=    X,             R,               I
##VAR_TYPE=  INDEPENDENT,   DEPENDENT,       DEPENDENT
##VAR_FORM=  AFFN,          ASDF,            ASDF
##VAR_DIM=   131072,        131072,          131072
##UNITS=     HZ,            ARBITRARY UNITS, ARBITRARY UNITS
##FACTOR=    0.0627417313425164, 1,          1
##FIRST=     8223.62146879497, -2703,        -45303
##LAST=      0,             -1689,           -45883
##MIN=       0,             -12081,          0
##MAX=       8223.62146879497, 380526748,    0
$$ Real data points
##PAGE= N=1
##DATA TABLE= (X++(R..R)), XYDATA
$$ [...]
63337C05074r784r122q273p073n779m701l974l611l468l182k431j375n51k44j93
63322B41313j9L18P24J286J963K230J617O00L52J338K684L250K861K093J330N77
63306B64517J9o9M7l40j354k144j881q56j79m81j251j504q72R8O27M98J16n7O7
63287B55001L14N50P67R94J286J679K081K305K318K276K223J985J520J125J109
63272B77533J433J875K325K645K628K344K259K591K847K542K038K115K802L359
63258C11336L380L274L535M116M728N190N380N272N113N210N436N512N719O604
63244C79805P971Q944R300R840J1077J2353J2973J3374J4369J5778J6799J7400
63232E29983J8355J9937K1432K2093K1884K1174K0263J9368J8673J8198J7834
$$ plain form
63337 305074 295290 286168 277895 270822 265043 260342 256368 252757 249289 246107 243676 242301 241750 241506 241313
63322 241313 241294 241612 242336 243622 245585 247815 249432 250032 250384 251722 254406 257656 260517 262610 263940 264517
63306 264517 264536 264467 264514 264174 262820 260676 258795 257939 257760 257279 256028 254524 253652 253750 254377 254875 254991 254934 255001
63287 255001 255315 255865 256632 257626 258912 260591 262672 264977 267295 269571 271794 273779 275299 276424 277533
63272 277533 278966 280841 283166 285811 288439 290783 293042 295633 298480 301022 303060 305175 307977 311336
63258 311336 314716 317990 321525 325641 330369 335559 340939 346211 351324 356534 361970 367482 373201 379805
63244 379805 387776 396720 406020 415860 426937 439290 452263 465637 480006 495784 512583 529983
63232 529983 548338 568275 589707 611800 633684 654858 675121 694489 713162 731360 749194
63221G49194J7594J7558J7672J7828J8045J8286J8216J7474J6054J4060J1357
63210I33338P893M167P06k810p221j2602j7922k2188k5341k7763k9458l0085k9480
63197G41234k7759k5208k2283j9494j7001j4473j1554q311n019j802J300M109
63185E93739O411Q246R828J1246J2393J3224J3996J5120J6664J7926J7839J6153
63173G52785J4051J3092J3490J3991J3572J2632J2139J2117J1580R762O852L529
63161H89592L22k616n504q759j2516j6283j9344k1530k3184k4383k4646k3668
63149G07481k1931k0270j9086j8235j7431j6440j5046j3234j1334r641q032o306
63137E30495m811m177m320m316l550k577k338k863l209k650j394j31P12J151J437
$$ plain form
63221 749194 766788 784346 802018 819846 837891 856177 874393 891867 907921 921981 933338
63210 933338 941231 945398 946104 943294 936073 923471 905549 883361 858020 830257 800799 770714 741234
63197 741234 713475 688267 665984 646490 629489 615016 603462 595151 590132 588330 589630 593739
63185 593739 600150 608396 618224 629470 641863 655087 669083 684203 700867 718793 736632 752785
63173 752785 766836 779928 793418 807409 820981 833613 845752 857869 869449 879211 886063 889592
63161 889592 889914 887298 881794 873035 860519 844236 824892 803362 780178 755795 731149 707481
63149 707481 685550 665280 646194 627959 610528 594088 579042 565808 554474 544833 536801 530495
63137 530495 525684 521507 517187 512871 509321 506744 504406 501543 498334 495684 494290 494159 494871 496022 497459
63122D97459J772K149K369K341K300K517K919L238L431L634L816L862L909M100
63108E39816M096L437K450K109K732L420L277K551K090K105K196K236K501K982
63094E77998L194K789J981J280J093J435J848J767J251J077J736K729L342L688
63080F07208M333N160N555N595O087P264Q275Q391P983P878Q281Q749Q970R134
63066G08863R756J1223J3308J5156J6217J7097J8887K1633K4255K6182K8118L0817
63054I41512L3975L6943L9671M2129M3600M3652M3307M4095M6059M7763M8156
63043A410862M7472M6294M4794M3166M1830M0843L9763L8501L7545L7039L6379
63032A864488L5160L3722L2133K9305K4075J6687Q367l69r938k0300l0304l8860
$$ plain form
63122 497459 499231 501380 503749 506090 508390 510907 513826 517064 520495 524129 527945 531807 535716 539816
63108 539816 543912 547349 549799 551908 554640 558060 561337 563888 565978 568083 570279 572515 575016 577998
63094 577998 581192 583981 585962 587242 588335 589770 591618 593385 594636 595713 597449 600178 603520 607208
63080 607208 611541 616701 622256 627851 633938 641202 649477 657868 665851 673729 682010 690759 699729 708863
63066 708863 718619 729842 743150 758306 774523 791620 810507 832140 856395 882577 910695 941512
63054 941512 975487 1012430 1052101 1094230 1137830 1181482 1224789 1268884 1314943 1362706 1410862
63043 1410862 1458334 1504628 1549422 1592588 1634418 1675261 1715024 1753525 1791070 1828109 1864488
63032 1864488 1899648 1933370 1965503 1994808 2018883 2035570 2043937 2043568 2033630 2013330 1983026 1944166
63020A944166m6011n2310n7613o1154o2568o2247o0623n7636n3191m7798m2320
63009A340695l7101l1666k5499j8845j2476o788j512L615Q281J2040J5035J7922
62997A263701K1039K4011K6246K7542K8088K8107K7769K7307K6980K6796K6418
62986A554004K5444K3722K1374J8489J4834R988L849l011r673j5687k1507k7859
62974A593967l4679m0941m5684m9028n1849n4579n6626n7121n5905n3551n0607
62963A043397m7210m3371l9297l5252l1376k7753k4530k1807j9527j7547j5822
62952G19905j4355j3085j1917j0800r733q788q134p898p888p642o956o170n654
62939F00885n257m585l767l418l757m254m396m421m870n662o032n454m298l445
$$ plain form
63020 1944166 1898155 1845845 1788232 1727078 1664510 1602263 1541640 1484004 1430813 1383015 1340695
63009 1340695 1303594 1271928 1246429 1227584 1215108 1208320 1206808 1210423 1218704 1230744 1245779 1263701
62997 1263701 1284740 1308751 1334997 1362539 1390627 1418734 1446503 1473810 1500790 1527586 1554004
62986 1554004 1579448 1603170 1624544 1643033 1657867 1667855 1671704 1668693 1659020 1643333 1621826 1593967
62974 1593967 1559288 1518347 1472663 1423635 1371786 1317207 1260581 1203460 1147555 1094004 1043397
62963 1043397 996187 952816 913519 878267 846891 819138 794608 772801 753274 735727 719905
62952 719905 705550 692465 680548 669748 660015 651227 643093 635195 627307 619665 612709 606539 600885
62939 600885 595628 591043 587276 583858 580101 575847 571451 567030 562160 556498 550466 545012 540714 537269
62925E37269l423l955m321m165l894m192n098n871n855n200m466l834l051k047
62911D77897j078l21K61O05N10O6l12m20n84j108j727j876j434q88q52j485k418
62894D64836l050l042k613k319k539l179l860m192l895l003j998j556j860k382
62880D25348k476k060j550j319j353j348r43n2R43J470J393J109R31P07K87k5
62864D21062P1K50pn19n33J19O68M18l34q16q35q78j246j597j453q85m59n58r54
62845D11514j073o57J0M85O16N61M69L78L43M60P04Q45O46J39l33l88J2M75O10
62826D15816N09N83R27J129R06N74N76Q06Q22O38P59J391K066K341K475L068M120
62809D39506M898M803M151L870M492N652O649P295P967Q966J0108J1086J1879
$$ plain form
62925 537269 533846 529891 525570 521405 517511 513319 508221 502350 496495 491295 486829 482995 479944 477897
62911 477897 476819 476498 476759 477364 477874 477940 477628 477208 476624 475516 473789 471913 470479 469591 468739 467254 464836
62894 464836 461786 458744 456131 453812 451273 448094 444234 440042 436147 433144 431146 429590 427730 425348
62880 425348 422872 420812 419262 417943 416590 415242 414299 414247 415190 416660 418053 419162 420093 420800 421087 421062
62864 421062 421133 421383 421376 420857 420324 420443 421111 421529 421195 420379 419544 418666 417420 415823 414370 413485 413026 412468 411514
62845 411514 410441 409784 409794 410279 410895 411456 411925 412303 412646 413106 413810 414655 415301 415440 415107 414719 414731 415206 415816
62826 415816 416325 416908 417835 418964 419870 420444 421020 421826 422648 423286 424045 425436 427502 429843 432318 435386 439506
62809 439506 444404 449207 453358 457228 461720 467372 474021 481316 489283 498249 508357 519443 531322
62796E31322J2680J3565J4477J5416J6478J7853J9820K2593K6015K9550L2775
62785G52544L5721L8718M2150M6397N1570N7075O1821O5233O7783P0228P2695
62774A361935P4759P5931P5532P2618O6786N8788M9699L9726K8476J6099L255
62763A923604r796k3056l5758m6569n5038o1914o7735p2069p4570p5764p6153
62752A325182p5341p2816o9065o5092o1294n7444n3441m9371m5142m0690l6322
62741F99164l2420k8944k5741k2990k0919j9317j7798j6247j4638j2767j0725
62730D76658r133q296p508n982m128l023k812k555j653n15L33R84J700K459L289
62715D39818M453N985P504Q804J0203J2007J3991J5701J7037J8424K0509K3635
$$ plain form
62796 531322 544002 557567 572044 587460 603938 621791 641611 664204 690219 719769 752544
62785 752544 788265 826983 869133 915530 967100 1024175 1085996 1151229 1219012 1289240 1361935
62774 1361935 1436694 1512625 1588157 1660775 1727561 1786349 1836048 1875774 1904250 1920349 1923604
62763 1923604 1913808 1890752 1854994 1808425 1753387 1691473 1623738 1551669 1477099 1401335 1325182
62752 1325182 1249841 1177025 1107960 1042868 981574 924130 870689 821318 776176 735486 699164
62741 699164 666744 637800 612059 589069 568150 548833 531035 514788 500150 487383 476658
62730 476658 467525 459229 451721 445739 441611 438588 435776 433221 431568 431053 431386 432370 434070 436529 439818
62715 439818 444271 450256 457760 466564 476767 488774 502765 518466 535503 553927 574436 598071
62703E98071K7307L0400L2481L4703L8524M3503M7459M9131M9711N0951N2780
62692A055021N3710N2940N0825M7571M2814L6533K9278K1110J1373M7j1408k1301
62680A368513k9356l6459m3097m8774n2875n5424n6815n7257n6696n5072n2414
62669H24274m8951m5198m1774l8876l6135l3145l0055k7357k5228k3330k1328
62658D52897j9282j7392j5592j3687j1750j0096q875p919p110o567o375o284n964
62645C16004n432m969m662m312l813l309k896k466k024j857k096k359k206j824
62631B71779j774k121k287j891j238q13o42m84k88j23M2K44L91N42J029J959K874
62614B67199L276L318L508M041M790N767O997Q163Q931R560J0550J1832J2955
$$ plain form
62703 598071 625378 655778 688259 722962 761486 804989 852448 901579 951290 1002241 1055021
62692 1055021 1108731 1161671 1212496 1260067 1302881 1339414 1368692 1389802 1401175 1401222 1389814 1368513
62680 1368513 1339157 1302698 1259601 1210827 1157952 1102528 1045713 988456 931760 876688 824274
62669 824274 775323 730125 688351 649475 613340 580195 550140 522783 497555 474225 452897
62658 452897 433615 416223 400631 386944 375194 365098 356223 348304 341194 334627 328252 321968 316004
62645 316004 310572 305603 300941 296629 292816 289507 286611 284145 282121 280264 278168 275809 273603 271779
62631 271779 270005 267884 265597 263706 262468 261655 261013 260529 260241 260118 260160 260404 260795 261337 262366 264325 267199
62614 267199 270475 273793 277301 281342 286132 291899 298896 307059 315990 325550 336100 347932 360887
62601C60887J4077J5914J8607K1445K3922K6310K8862L1221L3124L4952L7013
62590F46334L8767L9413L8777L7100L4348L0438K5730K0616J4891Q198R35n975
62578I29572j2040j7427k2301k6526k9995l2677l4353l4810l4307l3404l2316
62567F19416l0846k8892k6608k4143k1625j9389j7699j6289j4659j2891j1676
62556C94699j1379j1478j1148j0139q944q195q030q003p664p132o770o338n112
62543B84367l175j835k068l038l068j788l22N01J030J791K614L169L580M040M392
62528B90190M591N030O038P387Q606R502J0117J0623J1488J3202J5627J7947J9629
62515D29977K1037K2830K5087K7285K8881K9652K9762K9622K9382K8520K6304
$$ plain form
62601 360887 374964 390878 409485 430930 454852 481162 510024 541245 574369 609321 646334
62590 646334 685101 724514 763291 800391 834739 865177 890907 911523 926414 934612 935547 929572
62578 929572 917532 900105 877804 851278 821283 788606 754253 719443 685136 651732 619416
62567 619416 588570 559678 533070 508927 487302 467913 450214 433925 419266 406375 394699
62556 394699 383320 371842 360694 350555 341611 333416 325386 317383 309719 302587 295817 289479 284367
62543 284367 281192 279357 277289 274251 271183 269395 269073 269574 270604 272395 275009 278178 281758 285798 290190
62528 290190 294781 299811 305849 313236 321842 331344 341461 352084 363572 376774 392401 410348 429977
62515 429977 451014 473844 498931 526216 555097 584749 614511 644133 673515 702035 728339
62504G28339K2710J8422J3892R029L841j341o478j1862j7222k1619k4668k7023
62492F86020k8999k9712k8482k6368k5038k4509k3264k0632j7785j6032j5128
62481D30071j3849j1719r500q186p870p682o750n105l475k219r48N95J814K037
62467C57214J582J375J690K064K302K722L354L845M307N386P049Q120P722O548
62453D15280N985O363O809O590N752M491K751O86j152k552m134o580r554j1905
62439D18830j2922j2947j2695j2339j1544j0165q526p052n882m910l976k965j899
62426C11008j014n63m09k2R64K261L234L659L944M555N438O211O741P295Q029
62411C61331Q673Q931Q948R043R096Q679P737O654N479L739J387o46j439j325
$$ plain form
62504 728339 751049 769471 783363 792392 796233 794892 788414 776552 759330 737711 713043 686020
62492 686020 657021 627309 598827 572459 547421 522912 499648 479016 461231 445199 430071
62481 430071 416222 404503 395003 386817 378947 371265 364515 359410 355935 353716 352768 353363 355177 357214
62467 357214 358796 360171 361861 363925 366227 368949 372303 376148 380455 385841 392890 401010 408732 415280
62453 415280 421265 427628 434437 441027 446779 451270 454021 454707 453555 451003 446869 440289 430735 418830
62439 418830 405908 392961 380266 367927 356383 346218 337692 330640 324758 319848 315872 312907 311008
62426 311008 309994 309431 309022 309000 309964 312225 315459 319118 323062 327617 333055 339266 346007 353302 361331
62411 361331 370004 378935 387883 396926 406022 414701 422438 429092 434571 438310 439697 439051 437612 436287
62397D36287j469k490m055n570o521o330m788k767j649j822k387k431j817n49
62383C91642J601M402O936Q669J0090J1821J3801J5877J8394K1456K4376K6723
62371E55788K9201L2546L6101L8634M0077M1315M2504M2800M1678L9304L5624
62360I75572L0308K3797J7234J1085M758j988q352j3613j8028k2038k5455k8031
62348I45249l0111l1945l3092l3153l2574l1987l1222k9741k7598k5190k2477
62337F16159j9378j6614j5130j4739j4203j2821j1117r819q929q171p585p144
62325D70509o291m608k605j255q01n54L6O27N30l92j654k746l429l642l529l605
62309D36591m375n619o409o238n747n896o611o887o214n194m511l925k780j072
$$ plain form
62397 436287 434818 432328 428273 422703 416182 409852 405064 402297 400648 398826 396439 394008 392191 391642
62383 391642 393243 397645 404581 413250 423340 435161 448962 464839 483233 504689 529065 555788
62371 555788 584989 617535 653636 692270 732347 773662 816166 858966 900644 939948 975572
62360 975572 1005880 1029677 1046911 1057996 1062754 1060766 1052414 1038801 1020773 998735 973280 945249
62348 945249 915138 883193 850101 816948 784374 752387 721165 691424 663826 638636 616159
62337 616159 596781 580167 565037 550298 536095 523274 512157 502338 493409 485238 477653 470509
62325 470509 464218 459610 457005 455750 454949 454395 454431 455058 455588 455196 453542 450796 447367 443725 440196 436591
62309 436591 432216 426597 420188 413950 408203 402307 395696 388809 382595 377401 372890 368965 366185 365113
62295C65113N11J454J785J700J415J352K001L317M670N573O193O912P723Q401
62281D18120Q968R579J0004R843R344R472J0832J2896J4712J6069J7490J9293
62269E66622K1296K3367K5580K7699K9207L0130L1141L2362L2751L1293K8282
62258H79730K4637K0402J4924Q393K051l287p947j2377j6347j9673k2866k6230
62246H41410k9001l0204l0061k9656k9433k8823k7320k5122k2617j9924j7242
62235E52007j5051j3605j2508j1157r373p442n792m738m319m141l619k682j993
62222D55587k146k836l121k464j197J6Q61J397J740J925K014K165K561L222L918
62207D63642M316M333M276M454M780N012N331O262P901R587J0613J1007J1336
$$ plain form
62295 365113 365624 367078 368863 370563 371978 373330 375331 378648 383318 388891 395084 401996 409719 418120
62281 418120 427088 436667 446671 456514 465858 475330 486162 499058 513770 529839 547329 566622
62269 566622 587918 611285 636865 664564 693771 723901 755042 787404 820155 851448 879730
62258 879730 904367 924769 939693 948086 950137 946850 938903 926526 910179 890506 867640 841410
62246 841410 812409 782205 752144 722488 693055 664232 636912 611790 589173 569249 552007
62235 552007 536956 523351 510843 499686 490313 482871 477079 472341 468022 463881 460262 457580 455587
62222 455587 453441 450605 447484 445020 443823 443839 444700 446097 447837 449762 451776 453941 456502 459724 463642
62207 463642 467958 472291 476567 481021 485801 490813 496144 502406 510307 519894 530507 541514 552850
62194E52850J1937J2690J3336J3614J3210J2074J0757J0081J0312J1002J1596
62183F83459J1913J2054J2251J2877J4217J6172J8481K1118K3992K6372K7366
62172H80272K7092K6588K6255K5221K2718J9330J6169J3451J0657P652M743J994
62160A082142p13l120m896o306p821r204r838r801r747r781r403q622q052p708
62146I77130o742m863l128k644l195l778l985m088m166l954l452l040k843k397
62132I24855j180O55K308L155L476M121N389O621P200P496Q292R649J0988J2104
62118A005129J3243J4303J4867J5069J5595J6705J8020J9378K0968K2568K3707
62107A199552K4786K6811K9557L1246L0803K9296K8188K7297K5670K3632K2604
$$ plain form
62194 552850 564787 577477 590813 604427 617637 629711 640468 650549 660861 671863 683459
62183 683459 695372 707426 719677 732554 746771 762943 781424 802542 826534 852906 880272
62172 880272 907364 933952 960207 985428 1008146 1027476 1043645 1057096 1067753 1075405 1080148 1082142
62160 1082142 1081429 1078309 1073413 1067107 1059286 1050082 1040244 1030443 1020696 1010915 1001512 992890 984838 977130
62146 977130 970388 965525 962397 959753 956558 952780 948795 944707 940541 936587 933135 930095 927252 924855
62132 924855 923675 924330 926638 929793 933269 937390 942779 949400 956600 964096 972388 982037 993025 1005129
62118 1005129 1018372 1032675 1047542 1062611 1078206 1094911 1112931 1132309 1153277 1175845 1199552
62107 1199552 1224338 1251149 1280706 1311952 1342755 1372051 1400239 1427536 1453206 1476838 1499442
62096A499442K3209K4778K6406K7543K7767K7034K5968K5125K4222K2931K2023
62085A776448K2545K4159K5459K5946K6537K7986K9906L1591L2895L3969L4866
62074B092307L5684L6467L6837L6334L5184L3996L2748L0846K8282K5799K3729
62063B448213K1584J9047J6564J4545J2837J1300J0112R025P203M452J918Q35
62051B577635J013J235R16O65J326K896M439M941M334L609L659M141L999K982
62037B617790J889J282P91o1j125k097k996l820m357m754n522o600p108o603n819
62022B570890n592n799n917n938n917n413m237l174k932k934k165p69L44J110
62008B521557K212L548M104L597L071L439M300M618L823J934p05l408n431o697
$$ plain form
62096 1499442 1522651 1547429 1573835 1601378 1629145 1656179 1682147 1707272 1731494 1754425 1776448
62085 1776448 1798993 1823152 1848611 1874557 1901094 1929080 1958986 1990577 2023472 2057441 2092307
62074 2092307 2127991 2164458 2201295 2237629 2272813 2306809 2339557 2370403 2398685 2424484 2448213
62063 2448213 2469797 2488844 2505408 2519953 2532790 2544090 2554202 2563227 2570430 2574882 2576800 2577635
62051 2577635 2578648 2579883 2580799 2581464 2582790 2585686 2590125 2595066 2599400 2603009 2606668 2610809 2614808 2617790
62037 2617790 2619679 2620961 2621752 2621691 2620566 2618469 2615473 2611653 2607296 2602542 2597020 2590420 2583312 2576709 2570890
62022 2570890 2565298 2559499 2553582 2547644 2541727 2536314 2532077 2528903 2525971 2523037 2520872 2520103 2520447 2521557
62008 2521557 2523769 2527317 2531421 2535018 2538089 2541528 2545828 2550446 2554269 2556203 2555498 2552090 2546659 2539962
61994B539962p751q854r649r941j0187j0893j2072j3533j5164j6620j7321j7215
61982B390762j7014j7270j7685j7730j7482j7327j7301j7294j7508j8089j8516
61971B197546j8131j7187j6687j7052j7515j7207j6279j5584j5448j5286j4473
61960B016697j3180j2000j1027r777q174p040p088p749p696o573n401n012m820
61947A911160l737j758J44J504K852M659O560Q013R223J0814J2853J4712J5995
61934A992994J7209J9288K2589K6583L0510L4168L7999M2511M7847N3935O0945
61923B386578O9336P9428R1029J03727J17638J33619J52457J73919J97044K21462
61913C726237K47959K77310L08917L41254L73417M05343M36158M62780M80573
$$ plain form
61994 2539962 2532211 2523357 2513708 2503767 2493580 2482687 2470615 2457082 2441918 2425298 2407977 2390762
61982 2390762 2373748 2356478 2338793 2321063 2303581 2286254 2268953 2251659 2234151 2216062 2197546
61971 2197546 2179415 2162228 2145541 2128489 2110974 2093767 2077488 2061904 2046456 2031170 2016697
61960 2016697 2003517 1991517 1980490 1970713 1962539 1955499 1948411 1940662 1932966 1926393 1920992 1915980 1911160
61947 1911160 1907423 1905665 1905809 1907313 1910165 1914824 1921384 1929397 1938620 1949434 1962287 1976999 1992994
61934 1992994 2010203 2029491 2052080 2078663 2109173 2143341 2181340 2223851 2271698 2325633 2386578
61923 2386578 2455914 2535342 2626371 2730098 2847736 2981355 3133812 3307731 3504775 3726237
61913 3726237 3974196 4251506 4560423 4901677 5275094 5680437 6116595 6579375 7059948
61904G059948M84945M72043M38651L82620L03935K05332R2020k8863j48886k59507
61894I002238l53771m27377m78618n07844n17130n09977m90466m62306m28537
61885D826212l91915l55062l19943k87317k57074k29192k04103j82068j62618
61876B436920j45026j29183j15484j03877r3556q3838p4866o7124o0563n4670
61866A508733m9136m3982l9150l4471l0048k6219k3056k0227j7430j4668j2045
61855A198301r693p886o854o317n636m636l822l526l324k675j775j212j071r32
61841A138942o26l26M9Q26J860K476K416K281K683L413L910M123M351M520M264
61826A175162L665L335L712M711O098P713R274J0492J1589J3261J5819J8775K1531
$$ plain form
61904 7059948 7544893 8016936 8455587 8838207 9142142 9347474 9439494 9410631 9261745 9002238
61894 9002238 8648467 8221090 7742472 7234628 6717498 6207521 5717055 5254749 4826212
61885 4826212 4434297 4079235 3759292 3471975 3214901 2985709 2781606 2599538 2436920
61876 2436920 2291894 2162711 2047227 1943350 1849794 1765956 1691090 1623966 1563403 1508733
61866 1508733 1459597 1415615 1376465 1341994 1311946 1285727 1262671 1242444 1225014 1210346 1198301
61855 1198301 1188608 1180722 1173868 1167551 1161915 1157279 1153457 1149931 1146607 1143932 1142157 1140945 1139874 1138942
61841 1138942 1138316 1137990 1138039 1138865 1140725 1143201 1145617 1147898 1150581 1153994 1157904 1162027 1166378 1170898 1175162
61826 1175162 1178827 1182162 1185874 1190585 1196683 1204396 1213670 1224162 1235751 1249012 1264831 1283606 1305137
61813A305137K4111K6863K9835L2873L6058L9576M3352M7254N1532N6488O1842
61802A754921O7020P2056P7711Q4537R2334J00743J09931J20385J32395J46034
61792B758067J61386J78552J97699K19337K44213K72747L04774L40154L79244
61783E056173M22473M69642N20005N72810O27359O82637P37092P88320Q32208
61774A0708719Q62398Q71125Q50904P95579P00884N65759L94190J95525j7366
61765A5927717k30376m29529o02208p39099q35874q92992r14183r05018q72129
61756I506309q22400p62185o97000o31431n68631n09851m55160m04880l59974
61747D294797l20946k86951k56523k28953k04447j83133j64496j47886j33031
$$ plain form
61813 1305137 1329248 1356111 1385946 1418819 1454877 1494453 1537805 1585059 1636591 1693079 1754921
61802 1754921 1821941 1893997 1971708 2056245 2148579 2249322 2359253 2479638 2612033 2758067
61792 2758067 2919453 3098005 3295704 3515041 3759254 4032001 4336775 4676929 5056173
61783 5056173 5478646 5948288 6468293 7041103 7668462 8351099 9088191 9876511 10708719
61774 10708719 11571117 12442242 13293146 14088725 14789609 15355368 15749558 15945083 15927717
61765 15927717 15697341 15267812 14665604 13926505 13090631 12197639 11283456 10378438 9506309
61756 9506309 8683909 7921724 7224724 6593293 6024662 5514811 5059651 4654771 4294797
61747 4294797 3973851 3686900 3430377 3201424 2996977 2813844 2649348 2501462 2368431
61738B368431j19822j07932r7064q7307p8847p1463o4654n8279n2597m7693m3310
61727A539463l9412l6293l3859l1322k8221k5298k3587k2798k1567j9420j7531
61716A240155j7004j7208j6651j5044j3530j3000j3170j3422j3730j4211j4414
61705A078771j3775j2560j1671j1566j1795j1761j1429j1113j0876j0521r947
61694I51757r176q151o868n718n279n618o081n997n413m866m702m881n298n837
61680H67872o177n961n246m480l958l605l372l364l522l517l297l306l792m297
61666H09978m243l779l487l451l247k786k565k847l214l201l004l104l507l775
61652G63768l692l465l277l026k593k093j729j589j671j943k161j878q49N88J816
$$ plain form
61738 2368431 2248609 2140677 2043613 1956306 1877459 1805996 1741342 1683063 1630466 1582773 1539463
61727 1539463 1500051 1463758 1429899 1398577 1370356 1345058 1321471 1298673 1277106 1257686 1240155
61716 1240155 1223151 1205943 1189292 1174248 1160718 1147718 1134548 1121126 1107396 1093185 1078771
61705 1078771 1064996 1052436 1040765 1029199 1017404 1005643 994214 983101 972225 961704 951757
61694 951757 942581 934430 927562 921844 916565 910947 904866 898869 893456 888590 883888 879007 873709 867872
61680 867872 861695 855734 850488 846008 842050 838445 835073 831709 828187 824670 821373 818067 814275 809978
61666 809978 805735 801956 798469 795018 791771 788985 786420 783573 780359 777158 774154 771050 767543 763768
61652 763768 760076 756611 753334 750308 747715 745622 743893 742304 740633 738690 736529 734651 733802 734390 736206
61637G36206K591L173L760M158M184M100M273M601M626M214L722L441L215K733
61623G88997J957J101M25J01N3j72j085k605m111n127n725o062o011n601n398
61608G50737n942p037p969q261p885o916n544m240l537l570m122m874n283m627
61594F70930k772p41K08J5k63N4O71J304K397M312O392P485P254O520O447P566
61578G17779R479J1357J2761J4025J5696J7660J9260K0140K0533K0659K0397J9767
61566I19513J9211J9019J8852J8164J6857J5323J4117J3681J4013J4422J4035
61555A097207J2757J1358J0457R936R514R247R082Q556P424O075M855L522J855
61542A201845J98j271l101n636q039r275r650j0265j1235j1613j1080j0432j0112
$$ plain form
61637 736206 738797 741970 745730 749888 754072 758172 762445 767046 771672 775886 779608 783049 786264 788997
61623 788997 790954 792055 792480 792581 792634 792462 791377 788772 784661 779534 773809 767747 761736 756135 750737
61608 750737 744795 737758 729789 721528 713643 706727 701183 696943 693406 689836 685714 680840 675557 670930
61594 670930 668158 667417 667625 667640 667377 667431 668102 669406 671803 676115 682507 689992 697246 703766 710213 717779
61578 717779 727258 738615 751376 765401 781097 798757 818017 838157 858690 879349 899746 919513
61566 919513 938724 957743 976595 994759 1011616 1026939 1041056 1054737 1068750 1083172 1097207
61555 1097207 1109964 1121322 1131779 1141715 1151229 1160476 1169558 1178114 1185538 1191613 1196468 1199990 1201845
61542 1201845 1202043 1200772 1197671 1192035 1183996 1174721 1165071 1154806 1143571 1131958 1120878 1110446 1100334
61529A100334r461p892n885m150k555n32J993M679P438J0431J3707J7259K1161
61516A146527K5269K9172L2898L7297M3147N0143N7278O4142P1316P9481Q8672
61505A725342R8502J08816J19778J31506J43688J55576J66321J75276J81897J85391
61495C192093J84689J78811J67138J49235J24948R4958O1112K5797q876m1186
61485D128719o9458r2261j09077j20351j26769j28754j26790j21835j14998j06911
61475C011515r7748q7842p7981o8963o1011n3821m7062m0636l4476k8353k2009
61464B391613j5415q800k443L545R251J4788J9962K4250K7279K9327L1084L2789
61452B557230L3969L4163L3615L3014L2759L2829L3208L4034L5368L7042L8716
$$ plain form
61529 1100334 1090873 1082981 1077096 1072946 1070391 1069859 1071852 1076531 1083969 1094400 1108107 1125366 1146527
61516 1146527 1171796 1200968 1233866 1271163 1314310 1364453 1421731 1485873 1557189 1636670 1725342
61505 1725342 1823844 1932660 2052438 2183944 2327632 2483208 2649529 2824805 3006702 3192093
61495 3192093 3376782 3555593 3722731 3871966 3996914 4091872 4152984 4178781 4169905 4128719
61485 4128719 4059261 3967000 3857923 3737572 3610803 3482049 3355259 3233424 3118426 3011515
61475 3011515 2913767 2825925 2747944 2678981 2617970 2564149 2517087 2476451 2441975 2413622 2391613
61464 2391613 2376198 2367398 2364955 2368500 2377751 2392539 2412501 2436751 2464030 2493357 2524441 2557230
61452 2557230 2591199 2625362 2658977 2691991 2724750 2757579 2790787 2824821 2860189 2897231 2935947
61441B935947L9865L9988L9135L8063L7367L6557L4511L0878K6475K2196J8055
61430C299037J3552Q522L220k121p404j2524j7399k1964k5943k8774l0185l0722
61418C147295l1342l2407l3346l3366l2235l0252k7688k4520k0742j6622j2566
61407B852209q868n801l732k849k795l033l567m872o891q641r288r134q955q668
61393B765115p363m472j40N566J3021K2274L2633M3417N4759O7286Q1199R6042
61381C169337J11086J25761J39861J53510J66761J79055J89212J95985J98428
61372D628996J95789J87408J72914J52317J26009R4963O0916K5840q831m2212
61362E594109p3378j01368j25770j46643j63821j76945j86308j92798j96689j97287
$$ plain form
61441 2935947 2975812 3015800 3054935 3092998 3130365 3166922 3201433 3232311 3258786 3280982 3299037
61430 3299037 3312589 3321111 3324331 3322210 3314806 3302282 3284883 3262919 3236976 3208202 3178017 3147295
61418 3147295 3115953 3083546 3050200 3016834 2984599 2954347 2926659 2902139 2881397 2864775 2852209
61407 2852209 2843341 2837540 2833808 2830959 2828164 2825131 2821564 2816692 2809801 2801160 2791872 2782738 2773783 2765115
61393 2765115 2757752 2753280 2753140 2758706 2771727 2794001 2826634 2870051 2924810 2992096 3073295 3169337
61381 3169337 3280423 3406184 3546045 3699555 3866316 4045371 4234583 4430568 4628996
61372 4628996 4824785 5012193 5185107 5337424 5463433 5558396 5619312 5645152 5636321 5594109
61362 5594109 5520731 5419363 5293593 5146950 4983129 4806184 4619876 4427078 4230389 4033102
61352D033102j94273j88530j81096j72022j61112j49116j37243j25795j14232
61343B609683j02309r0434p8961o7912n7342m7364l7908k8965k0921j3975p482
61332B056110n74O621J3151J8594K3472K8229L2476L5558L7347L8279L9025M0114
61320B368402M1353M1606L9763L6059L1842K7979K4180K0069J6093J2883J0358
61309B670587Q074O010M430L226J980N56q46k247m098o855j0508j4551j8308k1396
61295B616054k3973k6516k9313l2192l4681l6318l6869l6542l5807l4782l2942
61284B256119k9879k6249k3314k1411j9585j6996j4041j1559r577p602n822n111
61272B064973n845p451r321j1499j4081j6510j8014j8545j8702j8746j8116j6045
$$ plain form
61352 4033102 3838829 3650299 3469203 3297181 3136069 2986953 2849710 2723915 2609683
61343 2609683 2507374 2416940 2337979 2270067 2212725 2165361 2127453 2098488 2077567 2063592 2056110
61332 2056110 2055536 2062157 2075308 2093902 2117374 2145603 2178079 2213637 2250984 2289263 2328288 2368402
61320 2368402 2409755 2451361 2491124 2527183 2559025 2587004 2611184 2631253 2647346 2660229 2670587
61309 2670587 2678661 2684671 2689101 2692327 2694307 2694863 2694017 2691770 2687672 2680817 2670309 2655758 2637450 2616054
61295 2616054 2592081 2565565 2536252 2504060 2469379 2433061 2396192 2359650 2323843 2289061 2256119
61284 2256119 2226240 2199991 2176677 2155266 2135681 2118685 2104644 2093085 2083508 2075906 2070084 2064973
61272 2064973 2059128 2051677 2042356 2030857 2016776 2000266 1982252 1963707 1945005 1926259 1908143 1892098
61260A892098j2314p265j352N117J2013J9477K7833L7128M6783N6027O4633P2900
61248B213078Q0888Q8113R3975R8099J00069R9305R5394Q8192P7424O2716M4350
61237C141603K3447J016k2482m6101o7599q4762r7218j06064j11812j13842j11826
61226B404360j06649r9584r1508q3323p6157p0479o5611o0707n5788n1306m7255
61215A595993m3240l9050l4582k9599k4093j8631j3863r888o524l851j971n92
61203A370109O27J479J572J104O09N0j131k961m551n080m728m357m561n318o408
61188A336455p791r512j1374j2936j3911j4518j5306j6555j7982j9075j9617j9811
61176A158067k0058k0592k1185k1211k0230j8484j6652j5122j3833j2730j1942
$$ plain form
61260 1892098 1879784 1872519 1871167 1876284 1888297 1907774 1935607 1972735 2019518 2075545 2140178 2213078
61248 2213078 2293966 2382079 2476054 2574153 2674222 2773527 2868921 2957113 3034537 3097253 3141603
61237 3141603 3165050 3166066 3143584 3097483 3029884 2945122 2847904 2741840 2630028 2516186 2404360
61226 2404360 2297711 2198127 2106619 2023296 1947139 1876660 1811049 1750342 1694554 1643248 1595993
61215 1595993 1552753 1513703 1479121 1449522 1425429 1406798 1392935 1383047 1376523 1372672 1370701 1370109
61203 1370109 1370736 1372215 1373787 1374891 1375500 1375550 1374419 1371458 1366907 1361827 1357099 1352742 1348181 1342863 1336455
61188 1336455 1328664 1319152 1307778 1294842 1280931 1266413 1251107 1234552 1216570 1197495 1177878 1158067
61176 1158067 1138009 1117417 1096232 1075021 1054791 1036307 1019655 1004533 990700 977970 966028
61165I66028j1491j1284j1450j2186j3236j4102j4901j6301j8362k0216k1307
61154H01192k2097k2992k3352k2421k0592j8826j7310j5641j3932j2643j1520
61143E99866r850p721n973m859l752k343j108k92O04J976L522M868O077P241Q216
61128E96472R126J0347J1673J2291J2050J1937J2736J3888J4366J4054J3468J2708
61116G45116J1496R907Q229O367M107J743k35j935l771n576o672o889o856p163
61102G47868p836q627r332r713r566r022q430p969p635p567p899q330q305p649
61088F29988o679n658m657l992m195n336o722p548p599p187o644o075n414m605
61074E47677l848l503l588l494k597j123R3O55R88J569K211K404J956J129L93
$$ plain form
61165 966028 954537 943253 931803 919617 906381 892279 877378 861077 842715 822499 801192
61154 801192 779095 756103 732751 710330 689738 670912 653602 637961 624029 611386 599866
61143 599866 590016 582295 576322 571463 567711 565368 564260 563968 564572 566548 570070 574938 581015 588256 596472
61128 596472 605598 615945 627618 639909 651959 663896 676632 690520 704886 718940 732408 745116
61116 745116 756612 766519 774748 781115 785222 786965 786730 784795 781024 775448 768776 761887 755031 747868
61102 747868 740032 731405 722073 712360 702794 693772 685342 677373 669738 662171 654272 645942 637637 629988
61088 629988 623309 617651 612994 609002 604807 599471 592749 585201 577602 570415 563771 557696 552282 547677
61074 547677 543829 540326 536738 533244 530647 529524 529617 530272 531260 532829 535040 537444 539400 540529 540922
61059E40922K05P53J770K817L788M831N821O416O706P258Q174Q670Q093O945O427
61044F19596P100Q407R384R496Q915Q338Q476R394J0476J1174J1716J2712J4245
61031G49429J5703J6587J7119J7865J8933J9855K0357K1009K2688K5318K7672
61020I72535K8855K9581L1341L4480L8003M1142M4185M7480N0687N3566N6702
61009A428557O0796O5916P2147Q0277R0881J03289J16379J30161J45877J65030
60999B459310J89124K19924K58896L06587L63239M29303N04691N88886O83814
60990F003774P96282R36135J112817J333520J596792J875226K101716K187672
60982A7943934K075133J778817J373133R37835N23961J71071o6623j42474p5342
$$ plain form
61059 540922 541127 541880 543650 546467 550255 555086 560907 567323 574029 581287 589461 598131 606224 613169 619596
61044 619596 626696 635103 644487 653983 662898 671236 679712 689106 699582 710756 722472 735184 749429
61031 749429 765132 781719 798838 816703 835636 855491 875848 896857 919545 944863 972535
61020 972535 1001390 1030971 1062312 1096792 1134795 1175937 1220122 1267602 1318289 1371855 1428557
61009 1428557 1489353 1555269 1627416 1707693 1798574 1901863 2018242 2148403 2294280 2459310
60999 2459310 2648434 2868358 3127254 3433841 3797080 4226383 4731074 5319960 6003774
60990 6003774 6800056 7736191 8849008 10182528 11779320 13654546 15756262 17943934
60982 17943934 20019067 21797884 23171017 24108852 24632813 24803884 24737261 24594787 24519445
60973B4519445L1609N0844q4512l55003p01853j079839j459271j796389k028566
60964A7096465k108325k035822j854173j618350j370999j138150r33632p61858
60956E275156o20435n04902m11983l38899k81908k37123k01947j74794j53964
60947B349201j37510j23869j12083j01716r2711q5024p8212p1689o5465o0156
60937A420766n6199n3429n1467n0115m9197m8415m7470m6113m4112m1450l8472
60926H94327l5500l2446k9103k5711k2776k0459j8548j6897j5418j3872j2189
60915F51408j0831j0209r913r214q190p542p339o814n624m455m038m219m384m273
60901E54363l969l577l255l163l081k480j225J53J071J434J424J245J323K211
$$ plain form
60973 24519445 24551054 24601898 24517386 24162383 23460530 22380691 20921420 19125031 17096465
60964 17096465 14988140 12952318 11098145 9479795 8108796 6970646 6037014 5275156
60956 5275156 4654721 4149819 3737836 3398937 3117029 2879906 2677959 2503165 2349201
60947 2349201 2211691 2087822 1975739 1874023 1781312 1696288 1618076 1546387 1480922 1420766
60937 1420766 1364567 1311138 1259671 1209556 1160359 1111944 1064474 1018361 974249 932799 894327
60926 894327 858827 826381 797278 771567 748791 728332 709784 692887 677469 663597 651408
60915 651408 640577 630368 620455 611241 603051 595509 588170 581356 575732 571277 567239 563020 558636 554363
60901 554363 550394 546817 543562 540399 537318 534838 533613 533766 534837 536271 537695 538940 540263 542474
60887E42474L928N752P006P649P932P838P247O262N114L963K943K143J417N90
60873F12258j62n72r07j687k767l491l859m614n782o233n416m461m603n283n017
60858E57404l618k217j298j12J806L781N057N814O594P428Q072Q497Q649Q237
60844F14094P272O516O759P807Q678Q805Q595Q731R249R519Q973P701O353N590
60830G24642N608O083O475O461O107N672N248M726M121L701L545L206K220Q81
60816G88696M0k5o2q94k385l734m584n428o826q633j0101j0704j0646j0519j0569
60801G03626j0515j0135r687r408q906p592n625l886k885k199j164L02J757K817
60787F36500L441L904M565N418N833N232L946K902K437K044J453J179J608K265
$$ plain form
60887 542474 546402 552154 559160 566809 574741 582579 589826 596088 601202 605165 608108 610251 611668 612258
60873 612258 612096 611524 610617 608930 606163 602672 598813 594199 588417 582184 576768 572307 567704 562421 557404
60858 557404 553786 551569 550271 550159 551965 555746 560803 566617 573211 580639 588711 597208 605857 614094
60844 614094 621366 627882 634641 642448 651126 659931 668526 677257 686506 696025 704998 712699 719052 724642
60830 724642 730250 736333 742808 749269 755376 761048 766296 771022 775143 778844 782389 785595 787815 788696
60816 788696 788736 788711 788649 787755 785370 781636 777052 771624 764798 756165 746064 735360 724714 714195 703626
60801 703626 693111 682976 673289 663881 654975 647383 641758 637872 634987 632788 631624 631926 633683 636500
60787 636500 639941 643845 648410 653828 659661 664893 668839 671741 674178 676222 677675 678854 680462 682727
60773F82727K510K470K699L332M084M760N314N668N880O157O446O440O267O576
60759G51330P503Q215Q015P310O898O857O858O946P179O987N876M417L593L379
60745H41363K914J889P69j61j004j561j439r54r23j450j819j737j807k495l576
60730H28009m871o585q529r850j0124j0060j0498j1246j1565j1367j1271j1625
60718G10418j2085j2170j1847j1457j1230j1004j0481r715r066q524p445n381
60706E90013k938j177l18M02J591L015M123M722M993N324O133P388Q265P817O032
60691F45385L812J905L82q89j978l155m837o997r096j0672j1567j1628j0828r737
60677E70100r160r125q919q163p188o225n044l629k427j601p93Q6O08O75Q98J573
$$ plain form
60773 682727 685237 687707 690406 693738 697822 702582 707896 713564 719444 725601 732047 738487 744754 751330
60759 751330 758833 767048 775063 782373 789271 796128 802986 809932 817111 824098 829974 834391 837984 841363
60745 841363 844277 846166 846935 846774 845770 844209 842770 841816 840893 839443 837624 835887 834080 831585 828009
60730 828009 823138 816553 808024 798174 788050 777990 767492 756246 744681 733314 722043 710418
60718 710418 698333 686163 674316 662859 651629 640625 630144 620429 611363 602839 595394 590013
60706 590013 587075 585898 585580 585982 587573 590588 594711 599433 604426 609750 615883 623271 631536 639353 645385
60691 645385 649197 651102 651484 650595 648617 645462 640625 633628 624532 613860 602293 590665 579837 570100
60677 570100 560940 551815 542896 534733 527545 521320 516276 512647 510220 508619 507826 507912 508520 509195 510093 511666
60661E11666K108K025J796K038K471K408J896J636K043K896L700L947L355K179
60647E46164J089M94L49P26J951L815N432O249O606O860O787O451O841Q609J0785
60632F19208J1749J1257J0540J0569J1097J1408J1252J0887J0649J0666J0696
60621G39978J0350R622Q934Q408P619O401N317M784M260L042J398J61m94j113
60607H08667k035l182m579o276p901r015r827j0888j2115j2786j2476j1446j0102
60594F96039q716p491o454n305l933k786k217j763q06L89J030R95Q04O35L10J09
60578F60840N09J220J487J377J593J959J385k49j552j616j397k177l593m333m107
60563F51346l804l935m026l570k768k102j659j085J6J638L251M312M983O060P992
$$ plain form
60661 511666 513774 515799 517595 519633 522104 524512 526408 528044 530087 532983 536683 540630 543985 546164
60647 546164 547253 547747 548096 548822 550773 554588 560020 566269 572875 579735 586522 592973 599814 608423 619208
60632 619208 630957 642214 652754 663323 674420 685828 697080 707967 718616 729282 739978
60621 739978 750328 759950 768884 777292 784911 791312 796629 801413 805673 808715 810113 810274 809780 808667
60607 808667 806632 803450 798871 792595 784694 775679 765852 754964 742849 730063 717587 706141 696039
60594 696039 687323 679832 673378 668073 664140 661354 659137 657374 656568 656957 657987 658982 659786 660421 660731 660840
60578 660840 661349 662569 664056 665433 667026 668985 670370 670121 668569 666953 665556 663379 659786 655453 651346
60563 651346 647542 643607 639581 636011 633243 631141 629482 628397 628413 630051 633302 637614 642597 648657 656649
60548F56649J0423J2920J5688J9093K2841K6298K9373L2509L5768L8430L9594
60537I39586L8807L6008L1189K4329J5666N887l947j2888k0476k6581l0825l2497
60525I64258l1220k7446k2128j6091r996m584m50K416M512O225P577Q608R597
60512H91278J0638J1330J1348J1327J2620J5905K0372K4827K9404L5550M4133
60501A118732N4301O4646P4856Q5606R7194J09125J20875J32380J43764J55279
60491B156758J67642J81806J98218K16570K35955K54271K67295K69443K56300
60482D204258K26160J79280J16851M1820l9952j20590j92706k51006k92407l15863
60472C555845l22414l14689k95963k69796k40060k10307j82580j57257j34314
$$ plain form
60548 656649 667072 679992 695680 714773 737614 763912 793285 825794 861562 899992 939586
60537 939586 978393 1014401 1045590 1069919 1085585 1091472 1087525 1074637 1054161 1027580 996755 964258
60525 964258 933038 905592 883464 867373 857377 852793 852343 854759 859271 865496 873073 881681 891278
60512 891278 901916 913246 924594 935921 948541 964446 984818 1009645 1039049 1074599 1118732
60501 1118732 1173033 1237679 1312535 1398141 1495335 1604460 1725335 1857715 2001479 2156758
60491 2156758 2324400 2506206 2704424 2920994 3156949 3411220 3678515 3947958 4204258
60482 4204258 4430418 4609698 4726549 4768369 4728417 4607827 4415121 4164115 3871708 3555845
60472 3555845 3233431 2918742 2622779 2352983 2112923 1902616 1720036 1562779 1428465
60463A428465j14330r7980q5029p4387o5173n7239n0654m5093m0006l5176l0817
60452G32581k7173k4202k1725j9563j7504j5398j3465j2229j1792j1432j0315
60441E47783q483o713n538m865m572m736n169n355n261n531o470p266o920n547
60427D65357m109l015j741R5J988L170L543L592L616L445K874K133J724J850K215
60412D86737K471K709L231L956M457M595M637M635M295L816M109N527O921O913
60398E49009N870N512O534P724P809P112O631O305N312L730K758L134M114M399
60384F25953L521J991N09o14j453k293l309m301m873n066n457o364p124o731n139
60369E79250l402k414j951j248j41P98J135J016Q11P22Q55J308J923K302K246
$$ plain form
60463 1428465 1314135 1216155 1131126 1056739 991566 934327 883673 838580 798574 763398 732581
60452 732581 705408 681206 659481 639918 622414 607016 593551 581322 569530 558098 547783
60441 547783 539300 532587 527049 522184 517612 512876 507707 502352 497091 491560 485090 477824 470904 465357
60427 465357 461248 458233 456492 456587 458575 461745 465288 468880 472496 475941 478815 480948 482672 484522 486737
60412 486737 489208 491917 495148 499104 503561 508156 512793 517428 521723 525539 529648 535175 542096 549009
60398 549009 554879 560391 566925 574649 582458 589570 596201 602506 607818 611548 614306 617440 621554 625953
60384 625953 629474 631465 631974 631360 629907 627614 624305 620004 615131 610065 604608 598244 591120 584389 579250
60369 579250 575848 573434 571483 570235 570094 570892 572027 573043 573854 574576 575431 576739 578662 580964 583210
60354E83210K074K189K537K734K623K378K099J664J059N52L49K36j65r17j703
60339F00919k163k183j902j591j482j568j509r16K27J502K528L311M089M869N274
60324F09405M920L861K674K017K088K459K469J765M53j142k652l666l806l072
60310F17773j934j002o96j187k351l526l747k676j199n74j055j818k194k374k748
60295E88692l116l010k398j638r99n78m48m88k35O38J790K565K846L171L965N035
60279E95792N895O310O316O027N614N419N797O742P692P980P584P308P899R085
60265F91460R882R927R928J0590J1646J2438J3013J3979J5441J6859J7921J8926
60253H52010K0183K1587K3090K5065K7866L1274L4702L7841M0916M4394M8589
$$ plain form
60354 583210 585284 587473 590010 592744 595367 597745 599844 601508 602567 603119 603468 603704 603539 602622 600919
60339 600919 598756 596573 594671 593080 591598 590030 588521 587605 587832 589334 591862 595173 599262 604131 609405
60324 609405 614325 618186 620860 622877 624965 627424 629893 631658 632111 630969 628317 624651 620845 617773
60310 617773 615839 614837 614141 612954 610603 607077 603330 600654 599455 598881 597826 596008 593814 591440 588692
60295 588692 585576 582566 580168 578530 577531 576953 576505 576017 575782 576420 578210 580775 583621 586792 590757 595792
60279 595792 601687 607997 614313 620340 625954 631373 637170 643912 651604 659584 667168 674476 682375 691460
60265 691460 701342 711269 721197 731787 743433 755871 768884 782863 798304 815163 833084 852010
60253 852010 872193 893780 916870 941935 969801 1001075 1035777 1073618 1114534 1158928 1207517
60242A207517N3468N8755O4225O9831P5491Q0934Q5876R0146R3421R5126R4960
60231B069750R3350R0871Q7347Q1943P4294O4979N4886M4459L3796K3045J2456
60220B731176K300p101j5477k2752k8829l3227l5300l4949l2785k9497k5325k0204
60208B448030j3945o230L083J3379K3440L2585M1345N0712O0837P0770P9255Q5620
60196B888881R0035R3064R4840R4578R1187Q4380P4936O3791N1274L7428K2608
60185C687002P384p808k2590l6467m9010o0043o9354p6417q0655q1839q0030p5437
60173C054736o8542o0035n0296l9175k6685j3585q24J1280K2869L3707M3085N0469
60161B957004N5707N8645N9072N7119N3109M6973L8364K7683J6448O137l033j1753
$$ plain form
60242 1207517 1260985 1319740 1383965 1453796 1529287 1610221 1696097 1786243 1879664 1974790 2069750
60231 2069750 2163100 2253971 2341318 2423261 2497555 2562534 2617420 2661879 2695675 2718720 2731176
60220 2731176 2733476 2726375 2710898 2688146 2659317 2626090 2590790 2555841 2523056 2493559 2468234 2448030
60208 2448030 2434085 2427855 2430938 2444317 2467757 2500342 2541687 2592399 2653236 2724006 2803261 2888881
60196 2888881 2978916 3071980 3166820 3261398 3352585 3436965 3511901 3575692 3626966 3664394 3687002
60185 3687002 3694386 3686578 3663988 3627521 3578511 3518468 3449114 3372697 3292042 3210203 3130173 3054736
60173 3054736 2986194 2926159 2875863 2836688 2810003 2796418 2795594 2806874 2829743 2863450 2906535 2957004
60161 2957004 3012711 3071356 3130428 3187547 3240656 3287629 3325993 3353676 3370124 3376261 3373228 3361475
60149C361475k0251k7819l3516l6842l7620l5781l1494k5160j6901o398O406K0717
60137C116816L5489N0536O6471Q3561J01180J18573J35621J52608J69725J87149
60127D217729K05009K22796K39169K52973K64137K73017K79191K81562K79454
60118F515037K72808K61478K45093K23769J98150J68635J35228R8343N9109J8707
60108H196357k2038o2236j00816j37088j70686k00678k25352k43320k54245k58287
60098F521611k55575k46727k33120k15865j95076j70837j44416j17648r1432o5603
60088D785312m0174j5963O120K5802M3355N9015P2536Q3043Q9456R1240Q8590
60077E288332Q1873P1314N7363M0873K2561K815j7667l7677n6436p4074r0592
$$ plain form
60149 3361475 3341224 3313405 3279889 3243047 3205427 3169646 3138152 3112992 3096091 3089693 3096099 3116816
60137 3116816 3152305 3202841 3269312 3352873 3454053 3572626 3708247 3860855 4030580 4217729
60127 4217729 4422738 4645534 4884703 5137676 5401813 5674830 5954021 6235583 6515037
60118 6515037 6787845 7049323 7294416 7518185 7716335 7884970 8020198 8118541 8177650 8196357
60108 8196357 8174319 8112083 8011267 7874179 7703493 7502815 7277463 7034143 6779898 6521611
60098 6521611 6266036 6019309 5786189 5570324 5375248 5204411 5059995 4942347 4850915 4785312
60088 4785312 4745138 4729175 4735295 4761097 4804452 4863467 4936003 5019046 5108502 5199742 5288332
60077 5288332 5370205 5441519 5498882 5539755 5562316 5565131 5547464 5509787 5453351 5379277 5288685
60066E288685j05007j16424j25352j32877j38837j41972j41759j38966j34270
60057D113221j27445j18201j06929r4180q0193o5363n0445l5788k0908n332J0477
60046C418914K5547L9408N2298O4617P6419Q7241R6048J01676J03639J02359R8302
60035D266468R1151Q0166O5331M7691K8560Q738j1325l0981m9429o6385q2080
60024D347905r6312j07760j14928j17671j17246j14683j09826j02246r2393q1217
60014C293623o9158n6244m2832k9507j6370l140J0101K3033L5868M9357O3806
60003C258537P8675R3232J07031J19621J30355J38637J43971J45611J42748J35158
59993D493576J23291J07644Q8538O6621M3036J8844n294k8802n1054p1728r0619
$$ plain form
60066 5288685 5183678 5067254 4941902 4809025 4670188 4528216 4386457 4247491 4113221
60057 4113221 3985776 3867575 3760646 3666466 3586273 3520910 3470465 3434677 3413769 3408437 3418914
60046 3418914 3444461 3483869 3536167 3600784 3677203 3764444 3860492 3962168 4065807 4168166 4266468
60035 4266468 4357619 4437785 4503116 4550807 4579367 4588105 4576780 4545799 4496370 4429985 4347905
60024 4347905 4251593 4143833 4028905 3911234 3793988 3679305 3569479 3467233 3374840 3293623
60014 3293623 3224465 3168221 3125389 3095882 3079512 3076372 3086473 3109506 3145374 3194731 3258537
60003 3258537 3337212 3430444 3537475 3657096 3787451 3926088 4070059 4215670 4358418 4493576
59993 4493576 4616867 4724511 4813049 4879670 4922706 4941550 4936256 4907454 4856400 4784672 4694053
59982D694053j06881j19088j26479j29556j29005j24619j16028j04006r0223p5748
59972C572420o0555m4491k8075j2058L272J7923L1725M4406N5993O6706P6417
59961C723683Q4497R0299R3626R4570R3143Q9261Q3028P4749O4768N3585M2097
59950D587306L1195K1081J1436K472m707r147j0895j0278o780N62J1810K5984
59938D650039M2358O1187Q2948J07394J33644J60822J88289K15529K42014K67050
59928F151274K89609L08426L22203L29545L28756L18058K96120K62374K17171
59919H823536J61984R9388L2388l6217j03550j66169k20530k64147k95972l15883
59909G714828l24379l22699l12550k95500k73027k46960k19081j90206j60311
$$ plain form
59982 4694053 4587172 4468084 4341605 4212049 4083044 3958425 3842397 3738391 3648168 3572420
59972 3572420 3511865 3467374 3439299 3427241 3430513 3448436 3480161 3524567 3580560 3647266 3723683
59961 3723683 3808180 3898479 3992105 4086675 4179818 4269079 4352107 4426856 4491624 4545209 4587306
59950 4587306 4618501 4639582 4651018 4653490 4648783 4639636 4628741 4618463 4611683 4612245 4624055 4650039
59938 4650039 4692397 4753584 4836532 4943926 5077570 5238392 5426681 5642210 5884224 6151274
59928 6151274 6440883 6749309 7071512 7401057 7729813 8047871 8343991 8606365 8823536
59919 8823536 8985520 9084908 9117296 9081079 8977529 8811360 8590830 8326683 8030711 7714828
59909 7714828 7390449 7067750 6755200 6459700 6186673 5939713 5720632 5530426 5370115
59900E370115j29791r9810p1155m3449j6041J0856L6440O0226Q2193J02297J20340
59889E422221J36022J48628J56817J59134J54739J43427J25163R9925O8027L0529
59879F644632j0578n2628r3061j30107j62546j89025k08243k19908k24862k23928
59869E129746k17344k05777j91294j76401j62321j48876j36026j24623j15341
59860C651743j07519r9677r1082q2315p4187o6441n7911m7819l6548k5081j4167
59849B948996m323L745R365J2428J3253J1885Q014J624o591j5583k4412l2379
59837B926022l8973m3757m6258m6245m4366m2129m0713l9945l8919l7256l5094
59826B472367l2205k8080k2833j7081j0997m359K438Q459J3520J8357K3252K7494
$$ plain form
59900 5370115 5240324 5140514 5069359 5025910 5009869 5020725 5057165 5117391 5199584 5301881 5422221
59889 5422221 5558243 5706871 5863688 6022822 6177561 6320988 6446151 6546076 6614103 6644632
59879 6644632 6634054 6581426 6488365 6358258 6195712 6006687 5798444 5578536 5353674 5129746
59869 5129746 4912402 4706625 4515331 4338930 4176609 4027733 3891707 3767084 3651743
59860 3651743 3544224 3444547 3353465 3271150 3196963 3130522 3072611 3024792 2988244 2963163 2948996
59849 2948996 2944673 2948418 2957783 2970211 2983464 2995349 3003363 3004987 2998396 2982813 2958401 2926022
59837 2926022 2887049 2843292 2797034 2750789 2706423 2664294 2623581 2583636 2544717 2507461 2472367
59826 2472367 2440162 2412082 2389249 2372168 2361171 2356812 2359250 2367709 2381229 2399586 2422838 2450332
59814B450332L0598L2961L4746L5176L3589L0381K6158K0892J4724Q794M294J239
59802B723884r02j905j061J842O655J3590K2782L3496M4765N6610O9821Q4808
59790C054385J01486J19979J40490J62596J85611K09459K34235K58801K80536
59781D747578K96184L02016K93477K66417K19680J56250Q1761K509p5183j45092
59771F145597k01928k42334k65224k71578k64094k46404k22109j94344j65841
59762D071741j38678j13747r0952p0099n1327l4705j9893o411O091J7867K9107
59751C598994L9960N0830O2467P5247Q8589J01634J14506J28146J42969J58556
59741D561898J74791J92407K11977K33177K55577K79440L04985L31463L57822
$$ plain form
59814 2450332 2480930 2513891 2548637 2583813 2617402 2647783 2673941 2694833 2709557 2718351 2722645 2723884
59802 2723884 2722982 2721077 2720016 2721858 2728513 2742103 2764885 2798381 2843146 2899756 2969577 3054385
59790 3054385 3155871 3275850 3416340 3578936 3764547 3974006 4208241 4467042 4747578
59781 4747578 5043762 5345778 5639255 5905672 6125352 6281602 6363363 6365872 6290689 6145597
59771 6145597 5943669 5701335 5436111 5164533 4900439 4654035 4431926 4237582 4071741
59762 4071741 3933063 3819316 3728364 3658265 3606938 3572233 3552340 3545929 3552020 3569887 3598994
59751 3598994 3638954 3689784 3752251 3827498 3916087 4017721 4132227 4260373 4403342 4561898
59741 4561898 4736689 4929096 5141073 5374250 5629827 5909267 6214252 6545715 6903537
59732F903537L84010M10644M37318M62034M82450M97052N04798N04459M95096
59723A1081398M77118M52318M22954L91385L60516L33809L14169L03042L00802
59714A4437511L07467L22273L42859L65731L87605M05707M16949M17982M06569
59705A7810653L82303L45664K97327K39032J74230J07011M0737k1631p6690j21169
59695A9177467j53094j71513j75500j64600j40031j04229n8920m676N7568J25633
59685A8388105J97210K70959L46007M20983M94134N63790O27982O83635P26475
59676B2719280P51659P54408P30339O75768N88226M67514L16967J43634m3171
59667B7104624k33530m17182n83434p22599q28293q98079r32311r33534r07162
$$ plain form
59732 6903537 7287547 7698191 8135509 8597543 9079993 9577045 10081843 10586302 11081398
59723 11081398 11558516 12010834 12433788 12825173 13185689 13519498 13833667 14136709 14437511
59714 14437511 14744978 15067251 15410110 15775841 16163446 16569153 16986102 17404084 17810653
59705 17810653 18192956 18538620 18835947 19074979 19249209 19356220 19396957 19375326 19298636 19177467
59695 19177467 19024373 18852860 18677360 18512760 18372729 18268500 18209580 18204904 18262472 18388105
59685 18388105 18585315 18856274 19202281 19623264 20117398 20681188 21309170 21992805 22719280
59676 22719280 23470939 24225347 24955686 25631454 26219680 26687194 27004161 27147795 27104624
59667 27104624 26871094 26453912 25870478 25147879 24319586 23421507 22489196 21555662 20648500
59658B0648500q61386q05435p48083o97507o60799o42002o40701o53005o73644
59649A4265938o96884p16637p27438p25955p11385o84657o47739o03616n55975
59640H195652n08229m62493m19310l78380l39761l04405k73234k45882k20911
59631E043047j97373j75576j56065j38541j22285j07024r2797p9465o7070n6328
59621C850523m7997m1811l6755l2425k9523k8908l0618l3973l8275m3190m8616
59610C438432n4378o0018o4990o8981p1847p3247p2719p0381o7071o3477n9477
59599B711846n4749m9614m4586l9444l3475k6684k0008j4215r238m733o35L155
59587B417620O996J0944J4343J6537J7776J8901K0253K1407K2016K2386K3089
$$ plain form
59658 20648500 19787114 18981679 18233596 17536089 16875290 16233288 15592587 14939582 14265938
59649 14265938 13569054 12852417 12124979 11399024 10687639 10002982 9355243 8751627 8195652
59640 8195652 7687423 7224930 6805620 6427240 6087479 5783074 5509840 5263958 5043047
59631 5043047 4845674 4670098 4514033 4375492 4253207 4146183 4053386 3973921 3906851 3850523
59621 3850523 3802526 3760715 3723960 3691535 3662012 3633104 3602486 3568513 3530238 3487048 3438432
59610 3438432 3384054 3324036 3259046 3190065 3118218 3044971 2972252 2901871 2834800 2771323 2711846
59599 2711846 2657097 2607483 2562897 2523453 2489978 2463294 2443286 2429071 2419833 2415100 2414465 2417620
59587 2417620 2424616 2435560 2449903 2466440 2484216 2503117 2523370 2544777 2566793 2589179 2612268
59576B612268K4406K6355K8984L2271L5941L9771M4055M9355N5748O2691O9786
59565C081631P7334Q5804R5073J04656J14522J25169J36824J49016J61106J72838
59555D303973J84176J94884K04510K12583K18545K21762K21827K18791K12982
59546F194033K04747J94304J81352J64705J43015J16621Q8223O0961L5875J2120
59536G395956j0431k9952m4447n3700n8590n9137n4460m4425l0142j2701P649
59525G005620L0678N5431Q0689J05262J27200J43483J51516J50568J40958J22419
59515H113824R4325N7354J3676l4586q5820j37694j86778k30187k66740k95852
59505G041522l16286l26984l28450l22221l09409k90824k68138k43694k19023
$$ plain form
59576 2612268 2636674 2663029 2692013 2724284 2760225 2799996 2844051 2893406 2949154 3011845 3081631
59565 3081631 3158965 3244769 3339842 3444498 3559020 3684189 3821013 3970029 4131135 4303973
59555 4303973 4488149 4683033 4887543 5100126 5318671 5540433 5762260 5981051 6194033
59546 6194033 6398780 6593084 6774436 6939141 7082156 7198777 7287000 7347961 7383836 7395956
59536 7395956 7385525 7355573 7311126 7257426 7198836 7139699 7085239 7040814 7010672 6997971 7005620
59525 7005620 7036298 7091729 7172418 7277680 7404880 7548363 7699879 7850447 7991405 8113824
59515 8113824 8208149 8265503 8279179 8244593 8158773 8021079 7834301 7604114 7337374 7041522
59505 7041522 6725236 6398252 6069802 5747581 5438172 5147348 4879210 4635516 4416493
59496D416493j94426j70111j46827j25238j05320q6648o8704n0896l2960j5460
59486C419903P70J5917L1151M7133O3251P8725R3729J08883J24143J38830J52387
59475D274822J64455J74406J81404J84964J84982J81132J72480J57894J36811
59466E813350J09665P7635M1927L396l6950p7231j14884j47848j75355j97449
59456E296256k14032k24720k29524k29273k25138k17882k07843j95647j82552
59447C369645j69639j56901j43687j30202j17770j07268r7900q8240p8056o8360
59437B211622n9914n2463m5437l8628l2111k6111k0987j6782j2833q424l828k1
59425A894083K630M720O822R005J1429J4465J7755J9915J9822J7760J4920J2235
$$ plain form
59496 4416493 4222067 4051956 3905129 3779891 3674571 3587923 3519219 3468323 3435363 3419903
59486 3419903 3420673 3436590 3467741 3514874 3578125 3656850 3750579 3859462 3983605 4122435 4274822
59475 4274822 4439277 4613683 4795087 4980051 5165033 5346165 5518645 5676539 5813350
59466 5813350 5923015 6000650 6042577 6045973 6009023 5931792 5816908 5669060 5493705 5296256
59456 5296256 5082224 4857504 4627980 4398707 4173569 3955687 3747844 3552197 3369645
59447 3369645 3200006 3043105 2899418 2769216 2651446 2544178 2446278 2358038 2279982 2211622
59437 2211622 2151708 2099245 2053808 2015180 1983069 1956958 1935971 1919189 1906356 1897932 1894104 1894083
59425 1894083 1896713 1901433 1908255 1917260 1928689 1943154 1960909 1980824 2000646 2018406 2033326 2045561
59413B045561J0122Q841Q673R990J3432J9530K7722L6209M3188M7996N0934N2466
59401B374664N3051N3354N4151N6188O0285O7172P6918Q8849J02272J16947J32788
59390C236639J49657J67692J87197K07927K29101K50568K73326K98357L25379
59381E325843L53134L80333M05716M27753M44989M56379M60835M56941M43949
59372I155872M22778L95424L63674L29046K93461K58933K26494J96100J67583
59363A1809365J40942J15572Q9899O2072L0852m256m3232q5677j30880j77785
59353A1806872k24860k70164l11897l48823l80116m05041m23056m34094m38477
59344H570344m36729m29528m17577m01303l81041l57720l32922l07948k83164
$$ plain form
59413 2045561 2055683 2064524 2073197 2083187 2096619 2116149 2143871 2180080 2223268 2271264 2322198 2374664
59401 2374664 2427715 2481069 2535220 2591408 2651693 2718865 2795783 2884632 2986904 3103851 3236639
59390 3236639 3386296 3553988 3741185 3949112 4178213 4428781 4702107 5000464 5325843
59381 5325843 5678977 6059310 6465026 6892779 7337768 7794147 8254982 8711923 9155872
59372 9155872 9578650 9974074 10337748 10666794 10960255 11219188 11445682 11641782 11809365
59363 11809365 11950307 12065879 12155778 12217850 12248702 12244446 12201214 12115537 11984657 11806872
59353 11806872 11582012 11311848 10999951 10651128 10271012 9865971 9442915 9008821 8570344
59344 8570344 8133615 7704087 7286510 6885207 6504166 6146446 5813524 5505576 5222412
59335E222412k58533k34332k11045j89043j68771j50695j34475j18818j02858
59326C653842q7301p3390o1179m9668l8410k7957j8760j0525k782M662J1974J9253
59314C319759K6017L1312L4626L6295L6946L6925L6345L5087L2671K8614K3171
59303C677768J7284J1638O209Q61m042p895j0384j1375j0612p791k956L469J1034
59290C673208J9658K9608M1062N3674O6576P8787Q9410R7575J02657J04737J04427
59279D461379J01942R6738Q8348P7239O4439N0578L5778K0201M308j1224k5573
59268D964153l8030m8487n7260o4151o8281o9371o8598o7405o5966o3619o0441
59257D292544n7379n5021n3191n1751n0906n0592n0350m9941m9456m8891m8177
$$ plain form
59335 5222412 4963879 4729547 4518502 4329459 4160688 4009993 3875518 3756700 3653842
59326 3653842 3566541 3493151 3431972 3382304 3343894 3315937 3297177 3286652 3283870 3288532 3300506 3319759
59314 3319759 3345776 3377088 3411714 3448009 3484955 3521880 3558225 3593312 3625983 3654597 3677768
59303 3677768 3695052 3706690 3712899 3713760 3709718 3701823 3691439 3680064 3669452 3661661 3658705 3662174 3673208
59290 3673208 3692866 3722474 3763536 3817210 3883786 3962573 4051983 4149558 4252215 4356952 4461379
59279 4461379 4563321 4660059 4748407 4825646 4890085 4940663 4976441 4996642 5000950 4989726 4964153
59268 4964153 4926123 4877636 4820376 4756225 4687944 4618573 4549975 4482570 4416604 4352985 4292544
59257 4292544 4235165 4180144 4126953 4075202 4024296 3973704 3923354 3873413 3823957 3775066 3726889
59246C726889m7453m6560m4415l9916l3352k5954j7983q416L315J6454L0317M5403
59234C558329O2365Q0866J00323J21026J43569J67596J91967K15860K38941K60624
59224E141466K79745K94787L03926L05136K96929K78922K51262K13734J66112
59215G532019J09398M6238j9993q6130j49416k07329k57614k98365l28172l46445
59205E994191l53626l50957l39982l22404l00143k75206k49309k23689j99210
59196C379665j76417j55575j36881j20647j07082r5930q6521p8327p1229o5160
59186B285896n9662n4137m8417m2797l7471l2234k6920k1812j7253j3077q832
59175A923284m484m76K972O190R531J2967J6314J9499K2425K5001K7430L0163
$$ plain form
59246 3726889 3679436 3632876 3588461 3548545 3515193 3489239 3471256 3462840 3466155 3482609 3512926 3558329
59234 3558329 3620694 3701560 3801883 3922909 4066478 4234074 4426041 4641901 4880842 5141466
59224 5141466 5421211 5715998 6019924 6325060 6621989 6900911 7152173 7365907 7532019
59215 7532019 7641417 7687655 7667662 7581532 7432116 7224787 6967173 6668808 6340636 5994191
59205 5994191 5640565 5289608 4949626 4627222 4327079 4051873 3802564 3578875 3379665
59196 3379665 3203248 3047673 2910792 2790145 2683063 2587133 2500612 2422285 2351056 2285896
59186 2285896 2226234 2172097 2123680 2080883 2043412 2011178 1984258 1962446 1945193 1932116 1923284
59175 1923284 1918800 1918324 1921296 1927486 1937017 1949984 1966298 1985797 2008222 2033223 2060653 2090816
59163B090816L3313L6552L9711M2902M5870M7924M8938M9716N0791N1441N0681
59152B588655M8600M5927M2659L8087L1999K4931J7402R652K090m862j1285j7388
59140B816467k2683k6369k8407k9416k9555k8480k6419k4157k1750j8256j3175
59129B547800p214j184N026J1781J8867K5937L3224M1069M9215N7145O4829P2581
59117B919076Q0396Q7949R5035J01681J08032J14374J20963J27536J33360J38080
59107D026482J42238J46538J50894J54457J56339J55933J52688J45945J34905
59098E366419J18687R6634O8799L6093j82l8612p7530j14904j48740j77530k00323
59087D928811k16660k26625k30807k30075k25377k17604k07433j95334j81976
$$ plain form
59163 2090816 2124129 2160681 2200392 2243294 2289164 2337088 2386026 2435742 2486533 2537974 2588655
59152 2588655 2637255 2683182 2725841 2763928 2795927 2820858 2838260 2847912 2850002 2845140 2833855 2816467
59140 2816467 2793784 2767415 2739008 2709592 2680037 2651557 2625138 2600981 2579231 2560975 2547800
59129 2547800 2540586 2539402 2544428 2556209 2575076 2601013 2634237 2675306 2724521 2781666 2846495 2919076
59117 2919076 2999472 3087421 3182456 3284137 3392169 3506543 3627506 3755042 3888402 4026482
59107 4026482 4168720 4315258 4466152 4620609 4776948 4932881 5085569 5231514 5366419
59098 5366419 5485106 5581740 5650539 5686632 5686450 5647838 5570308 5455404 5306664 5129134 4928811
59087 4928811 4712151 4485526 4254719 4024644 3799267 3581663 3374230 3178896 2996920
59078B996920j68401j55492j43469j32216j21794j12145j02700r3062q3927p6430
59068A807284p0638o5444o0069n4825n0267m6379m2922l9782l6692l3267k9641
59057A277358k6431k3799k1279j8761j6843j5765j4773j3181j1373j0185r759
59046A095209r601r322q747p752o545n695n388m956l686j743J56J719L125M467
59032A041241N643O769Q167R888J1503J2502J2860J3265J4520J6508J8050J8284
59020A189200J7874J8072J8802J8674J6913J4163J1175P846M057L74k784n727
59008A308639q573j0624j1394j1492j1572j1213r776p722o084n000l846k438j132
58995A207773M2J398K798L701M005M145M393M614M649M471M101L764L916M652
$$ plain form
59078 2996920 2828519 2673027 2529558 2397342 2275548 2163403 2060703 1967641 1883714 1807284
59068 1807284 1736646 1671202 1611133 1556308 1506041 1459662 1416740 1376958 1340266 1306999 1277358
59057 1277358 1250927 1227128 1205849 1187088 1170245 1154480 1139707 1126526 1115153 1104968 1095209
59046 1095209 1085608 1076286 1067539 1059787 1053242 1047547 1042159 1037203 1033517 1031774 1031930 1033649 1036774 1041241
59032 1041241 1046884 1053653 1061820 1071708 1083211 1095713 1108573 1121838 1136358 1152866 1170916 1189200
59020 1189200 1207074 1225146 1243948 1262622 1279535 1293698 1304873 1312719 1316776 1317150 1314366 1308639
59008 1308639 1300066 1289442 1278048 1266556 1254984 1243771 1233995 1226273 1220189 1215189 1211343 1208905 1207773
58995 1207773 1207815 1209213 1212011 1215712 1219717 1223862 1228255 1232869 1237518 1241989 1246090 1249854 1253770 1258422
58981A258422N434N799O010O564P468Q481R542J0501J0966J1084J1846J3786J6036
58968A381939J7597J8961K1264K4215K6234K6685K6711K7584K9214L0651L1275
58957A662330L1120L0553K9999K9629K9217K8653K8406K9075L0612L2604L5050
58946A997248L8186M1680M4816M7599N1001N5892O2162O8861P4821P9348Q2816
58935B644430Q6487R1235R6733J02404J08642J16269J25143J34573J44891J57359
58925C808166J72333J88709K05591K23440K43031K64284K86771L10546L35796
58916F038667L62246L89560M17788M46733M75296N02017N25835N45679N59628
58907A0263449N65175N60202N43159N12529M66938M06076L31213K44640J48934
$$ plain form
58981 1258422 1263856 1269655 1275665 1282229 1289697 1298178 1307720 1318221 1329187 1340271 1352117 1365903 1381939
58968 1381939 1399536 1418497 1439761 1463976 1490210 1516895 1543606 1571190 1600404 1631055 1662330
58957 1662330 1693450 1724003 1754002 1783631 1812848 1841501 1869907 1898982 1929594 1962198 1997248
58946 1997248 2035434 2077114 2121930 2169529 2220530 2276422 2338584 2407445 2482266 2561614 2644430
58935 2644430 2730917 2822152 2918885 3021289 3129931 3246200 3371343 3505916 3650807 3808166
58925 3808166 3980499 4169208 4374799 4598239 4841270 5105554 5392325 5702871 6038667
58916 6038667 6400913 6790473 7208261 7654994 8130290 8632307 9158142 9703821 10263449
58907 10263449 10828624 11388826 11931985 12444514 12911452 13317528 13648741 13893381 14042315
58898A4042315M6919n7833j60851k57398l43451m16323m74611n17811n46200n60871
58888A0753885n63561n56302n41065n19570m93212m63292m31410l99437l68890
58879F417146l40416l13971k89339k66373k45016k25361k07493j91181j76042
58870D161954j62120j49749j38612j27651j16451j06081r7669r0663q3523p5855
58860C013580o8734o2886n7692n2275m6623m1110l5703l0228k4857j9692j4320
58849B559460q325k084L562Q265J2463J6747K1356K6288L1545L7043M2420M7266
58837B796006N1644N6343O2294O9686P7749Q5639R3274J01257J10123J19928J30424
58826C754367J41405J52936J65441J79469J95234K12535K31157K51174K72743
$$ plain form
58898 14042315 14089234 14031401 13870550 13613152 13269701 12853378 12378767 11860956 11314756 10753885
58888 10753885 10190324 9634022 9092957 8573387 8080175 7616883 7185473 6786036 6417146
58879 6417146 6076730 5762759 5473420 5207047 4962031 4736670 4529177 4337996 4161954
58870 4161954 3999834 3850085 3711473 3583822 3467371 3361290 3263621 3172958 3089435 3013580
58860 3013580 2944846 2881960 2824268 2771993 2725370 2684260 2648557 2618329 2593472 2573780 2559460
58849 2559460 2551135 2549051 2552613 2560878 2573341 2590088 2611444 2637732 2669277 2706320 2748740 2796006
58837 2796006 2847650 2903993 2966287 3035973 3113722 3199361 3292635 3393892 3504015 3623943 3754367
58826 3754367 3895772 4048708 4214149 4393618 4588852 4801387 5032544 5283718 5556461
58817E556461K95870L20562L46829L74368M02509M30623M58080M83564N04953
58808I173819N20288N28368N28000N17175M93612M55729M02724L34492K52362
58799A3206569J59628O0463m1477j42792k39347l26817m02248m64253n11774n43890
58789A0754062n61041n65380n59336n44511n22307m94839m64558m33217m01713
58780F207160l70650l40738l12791k87538k65333k45917k28603k12762j98060
58771C744768j84317j71404j59285j47968j37475j27845j18997j10491j01832
58762B485154r3155q5146p8071p1356o4532n7967n2152m6841m1586l6655l2549
58751A825144k9016k5383k1658j8529j6446j5328j4919j4721j3989j2647j1859
$$ plain form
58817 5556461 5852331 6172893 6519722 6894090 7296599 7727222 8185302 8668866 9173819
58808 9173819 9694107 10222475 10750475 11267650 11761262 12216991 12619715 12954207 13206569
58799 13206569 13366197 13426660 13385183 13242391 13003044 12676227 12273979 11809726 11297952 10754062
58789 10754062 10193021 9627641 9068305 8523794 8001487 7506648 7042090 6608873 6207160
58780 6207160 5836510 5495772 5182981 4895443 4630110 4384193 4155590 3942828 3744768
58771 3744768 3560451 3389047 3229762 3081794 2944319 2816474 2697477 2586986 2485154
58762 2485154 2391999 2306853 2228782 2157426 2092894 2034927 1982775 1935934 1894348 1857693 1825144
58751 1825144 1796128 1770745 1749087 1730558 1714112 1698784 1683865 1669144 1655155 1642508 1630649
58740A630649j2731j4797j6773j8515k0975k4340k7459k9354l0111l0047k9064
58729A376483k7302k5468k4084k3030k2175k1766k1935k2443k3051k3546k3353
58718A118330k1938j9749j7935j6913j5940j4341j2390j0710r543q871q640q631
58706I52729q715r343j1048j3367j5060j5562j5526j5751j6300j6811j6923j6216
58694G82107j4574j2734j1649j1157j0155q225o113m419k870j296j87K41O25J466
58680G01060K371K823K971L027K574J177p91k487l359l259k289q79M12J398K164
58665G06913K528K216J519R26J15j657m055n724o113o023n999n413l796j824j74
58650F73439J503L531N154N626N584O261P837R588J1159J2749J4373J5787J6985
$$ plain form
58740 1630649 1617918 1603121 1586348 1567833 1546858 1522518 1495059 1465705 1435594 1405547 1376483
58729 1376483 1349181 1323713 1299629 1276599 1254424 1232658 1210723 1188280 1165229 1141683 1118330
58718 1118330 1096392 1076643 1058708 1041795 1025855 1011514 999124 988414 978871 970000 961360 952729
58706 952729 944014 934671 923623 910256 895196 879634 864108 848357 832057 815246 798323 782107
58694 782107 767533 754799 743150 731993 721838 713613 707500 703081 700211 698915 698728 698969 699594 701060
58680 701060 703431 706254 709225 712252 714826 716003 715212 712725 709366 706107 703818 702939 703351 704749 706913
58665 706913 709441 711657 713176 714102 714217 712560 708505 702781 696668 690645 684646 679233 675437 673613 673439
58650 673439 674942 678473 683627 689253 694837 701098 708935 718523 729682 742431 756804 772591 789576
58637G89576J8159J9365K0710K2472K4641K6790K8806L1221L4403L7989M1626
58626A095758M5585N0173N5167O0477O6725P4357Q2761R0998R9040J07559J16871
58615A945471J26661J36389J45317J52407J56790J58257J56851J52165J43280
58606C273588J29106J08816Q2483N1593J8452j5054m7558p7329j02394j21903
58596C299800j36375j46196j50880j50437j46347j40343j32997j24302j14834
58587B057089j05452r6391q7486p8870p0814o3347n6597n0957m6394m2187l7888
58576A320706l3827l0270k6831k3297k0269j8293j7055j6057j5289j4627j3497
58565A091394j1931j1070j1766j3409j4956j6310j7792j9055j9524j9329j8847
$$ plain form
58637 789576 807735 827100 847810 870282 894923 921713 950519 981740 1016143 1054132 1095758
58626 1095758 1141343 1191516 1246683 1307160 1373885 1448242 1531003 1622001 1721041 1828600 1945471
58615 1945471 2072132 2208521 2353838 2506245 2663035 2821292 2978143 3130308 3273588
58606 3273588 3402694 3511510 3593993 3645586 3664038 3648984 3601426 3524097 3421703 3299800
58596 3299800 3163425 3017229 2866349 2715912 2569565 2429222 2296225 2171923 2057089
58587 2057089 1951637 1855246 1767760 1688890 1618076 1554729 1498132 1447175 1400781 1358594 1320706
58576 1320706 1286879 1256609 1229778 1206481 1186212 1167919 1150864 1134807 1119518 1104891 1091394
58565 1091394 1079463 1068393 1056627 1043218 1028262 1011952 994160 975105 955581 936252 917405
58554I17405j7965j6563j5129j4073j3071j1877j0995j0760j0562r842r026q605
58542G68937q174p368o786o836o644n397l921l506l956m245m342m758m915l785
58528F94304j886r37j553k728l606m302m978n442n792o347o813o582n839n320
58514F32179n046m388l326k496j996j325n65n07j355k361k949l279l491l268k514
58499E93313j728j356j230q62J8J246K210K264J490P93Q41J297J496J351J103
58484F02246P80N00P15J463J980J787J544J939K518K489K052J872J829J366O16
58469F25696P7l25q50j124p67l86p72j645k229k645l477m457m791m535m515n081
58453E88174n962o941p686p370n595l373k107j978k260k609k936k621j226M53
$$ plain form
58554 917405 899440 882877 867748 853675 840604 828727 817732 806972 796410 786568 777542 768937
58542 768937 760763 753395 746609 739773 733129 727732 723811 720305 716349 712104 707762 703004 698089 694304
58528 694304 692418 691481 689928 687200 683594 679292 674314 668872 663080 656733 649920 643338 637499 632179
58514 632179 627133 622745 619419 616923 614927 613602 613037 612530 611175 608814 605865 602586 599095 595827 593313
58499 593313 591585 590229 588999 588137 588155 589401 591611 593875 595365 596158 596999 598296 599792 601143 602246
58484 602246 603026 603526 604241 605704 607684 609471 611015 612954 615472 617961 620013 621885 623714 625080 625696
58469 625696 625773 625448 624598 623474 622707 622321 621549 619904 617675 615030 611553 607096 602305 597770 593255 588174
58453 588174 582212 575271 567585 560215 554620 551247 549140 547162 544902 542293 539357 536736 535510 535963
58439E35963J171Q07J34m08o83l31N91J147Q69P35J553K398K139J486J780K651
58423E52002K871K746L548N104O057O180O428P014P342P503P927P951O833N685
58409F35191O154P497P450N818M687M941N195M534L808L549K905J490K71j49l44
58394F92997n77k80M72Q01Q42J815L724M894M472L602L403L540L507L598L845
58379G30655L596K863K546K660K006K49j245j419q88n28j78N75J544K453L174
58364G48063L181K180J274J892L434L825K716K026K912M194M593M422M245L681
58350G92638K624K015K345K836K954L333M440N651O396O942P469P654P645Q123
58336H63065R037R683J0197J1419J3042J3697J3126J2502J2309J1779J0764J0256
$$ plain form
58439 535963 537134 537941 538075 537667 536984 536653 537244 538391 539260 539995 541548 543946 546085 547571 549351 552002
58423 552002 554873 557619 561167 566271 572328 578508 584936 591950 599292 606795 614722 622673 629506 635191
58409 635191 641345 648842 656292 662110 666797 671738 676933 681467 685275 688824 691729 693219 693490 693341 692997
58394 692997 692420 692140 692612 693413 694255 696070 699794 704688 709160 712762 716165 719705 723212 726810 730655
58379 730655 734251 737114 739660 742320 744326 744575 743330 741911 741023 740495 740317 740892 742436 744889 748063
58364 748063 751244 753424 754698 756590 760024 763849 766565 768591 771503 775697 780290 784712 788957 792638
58350 792638 795262 797277 799622 802458 805412 808745 813185 818836 825232 832174 839643 847297 854942 863065
58336 863065 872102 881785 891982 903401 916443 930140 943266 955768 968077 979856 990620 1000876
58324A000876J0559J0818J0716J0867J1195J0907J0273J0413J1084J0847R695
58313A118250R197R764J0191J0229J1006J2417J2834J2091J2116J3797J5796J7171
58301A264859J8531J9894K0132J9451J9604K0801K1233K0549K0746K2522K3897
58290A492219K3785K3871K5375K6948K7464K8062K9719L1380L2201L3126L4774
58279A808924L6283L7588M0150M3976M6791M7499M7658M8246M8097M6891M6416
58268B298519M7151M7002M5178M4076M5391M7585M9151N1065N4049N6747N8677
58257B844591O1697O6491P0934P3938P7422Q2447Q7061R0178R3920R9769J06034
58246C754482J11367J17086J23743J29450J33884J39879J48560J57163J64154
$$ plain form
58324 1000876 1011435 1022253 1032969 1043836 1055031 1065938 1076211 1086624 1097708 1108555 1118250
58313 1118250 1127447 1137211 1147402 1157631 1168637 1181054 1193888 1205979 1218095 1231892 1247688 1264859
58301 1264859 1283390 1303284 1323416 1342867 1362471 1383272 1404505 1425054 1445800 1468322 1492219
58290 1492219 1516004 1539875 1565250 1592198 1619662 1647724 1677443 1708823 1741024 1774150 1808924
58279 1808924 1845207 1882795 1922945 1966921 2013712 2061211 2108869 2157115 2205212 2252103 2298519
58268 2298519 2345670 2392672 2437850 2481926 2527317 2574902 2624053 2675118 2729167 2785914 2844591
58257 2844591 2906288 2972779 3043713 3117651 3195073 3277520 3364581 3454759 3548679 3648448 3754482
58246 3754482 3865849 3982935 4106678 4236128 4370012 4509891 4658451 4815614 4979768
58237D979768J72063J82696J94099K05023K17656K33095K48949K64249K81708
58228F979306L02376L23456L44239L68337L97030M26820M56887M92079N34743
58219A0625273N80839O28375O82342P46663Q18990Q98480R90823J100335J225432
58210A8297552J367460J535550J737485J975722K258665K605890L036002L560451
58202C6374777M195236M965023N886417O958328Q175403R539792J1062320J2780799
58194I9938095J4789663J7228540K0224305K3829205K7915302L1945717L4782200
58187B70653027L4930698L1323441K4044246J4260541L424402p393825j7443223
58180C53799307k5879990l1750530l4467992l4199066l1732184k8022480k3845793
$$ plain form
58237 4979768 5151831 5334527 5528626 5733649 5951305 6184400 6433349 6697598 6979306
58228 6979306 7281682 7605138 7949377 8317714 8714744 9141564 9598451 10090530 10625273
58219 10625273 11206112 11834487 12516829 13263492 14082482 14980962 15971785 17072120 18297552
58210 18297552 19665012 21200562 22938047 24913769 27172434 29778324 32814326 36374777
58202 36374777 40570013 45535036 51421453 58379781 66555184 76094976 87157296 99938095
58194 99938095 114727758 131956298 152180603 176009808 203925110 235870827 270653027
58187 270653027 305583725 336907166 360951412 375211953 378636355 371242530 353799307
58180 353799307 327919317 296168787 261700795 227501729 195769545 167747065 143901272
58173A43901272j9711195j5900463j2517877r554699o986919m863514l314651
58166G1051954k454768k254399k514777k990823l532811m087925m588928m905164
58158D3722359m926598m657604m199051l661850l120832k623429k197524j845772
58150A6489699j554752j314842j122094r67116q37325p28189o40676n70356n09624
58141H244725m57649m17809l87640l60665l35811l16098l00008k82593k63486
58132E122966k46156k30556k13533j95191j78417j63318j48082j33943j23709
58123C490061j16760j10596j05787j04274j04506j03241j00639r8801r6859r2385
58113B456213q6203q1128p7153p2260o6745o2437n8925n4619n0296m7674m5789
$$ plain form
58173 143901272 124190077 108289614 95771737 86217038 79230119 74366605 71051954
58166 71051954 68597186 66342787 63828010 60837187 57304376 53216451 48627523 43722359
58158 43722359 38795761 34138157 29939106 26277256 23156424 20532995 18335471 16489699
58150 16489699 14934947 13620105 12498011 11530895 10693570 9965381 9324705 8754349 8244725
58141 8244725 7787076 7369267 6981627 6620962 6285151 5969053 5669045 5386452 5122966
58132 5122966 4876810 4646254 4432721 4237530 4059113 3895795 3747713 3613770 3490061
58123 3490061 3373301 3262705 3156918 3052644 2948138 2844897 2744258 2645457 2548598 2456213
58113 2456213 2370010 2288882 2211729 2139469 2072724 2010287 1951362 1896743 1846447 1798773 1752984
58102A752984m2701l9380l7949l7398l5121l1544k9240k8475k7563k6691k7426
58091A389496k9047k9156k7602k6257k5514k4296k3033k3240k4413k4502k3258
58080A109178k2204k1641k0530j8976j8072j7543j6256j4609j3898j3696j2528
58069I19225j0705r821r834r144p429n918n069m302l773m176m953m869m191m203
58055H30838m927n335n484o249p269p246o130n070m417l628k822k594k595k002
58041G65070j088o63m80J83R66J175J316K063K491J378n37j704k401m015o256
58026G57498p545p742q113q765q617p752p479p860p499o049m814m461m084l026
58012F63692j825r15L7J082J746K125K913M099M926N316N969P046P914Q248Q216
$$ plain form
58102 1752984 1710283 1670903 1632954 1595556 1560435 1528891 1499651 1471176 1443613 1416922 1389496
58091 1389496 1360449 1331293 1303691 1277434 1251920 1227624 1204591 1181351 1156938 1132436 1109178
58080 1109178 1086974 1065333 1044803 1025827 1007755 990212 973956 959347 945449 931753 919225
58069 919225 908520 898699 888865 879721 872292 866374 861305 857003 853230 849054 844101 839232 835041 830838
58055 830838 825911 820576 815092 808843 801574 794328 788198 783128 778711 775083 772261 769667 767072 765070
58041 765070 763982 763319 762839 763022 763988 765163 766479 768542 771033 772411 771874 770170 767769 763754 757498
58026 757498 749953 742211 734098 725333 716716 708964 701485 693625 686126 680077 675263 670802 666718 663692
58012 663692 661867 660952 660989 662071 663817 665942 668855 672954 677880 683196 689165 696211 704125 712373 720589
57997G20589P674O382M771L330J566j053l623m850n179o159p916r037q874q167
57983F89454p376o192m889m350m480m146l055k124j659q06Q01K270L027L824N510
57968F65809P819R910J1196J1253R838P386M837K639M43k153n169q342j0971j2012
57954F92483j1196r770r086q822p594n094k458p48q4r0j06P43K608M327M795M447
57938F54355M212L701J906p64k840m055n525p784j0206j2321j4190j5410j5352
57925E75727j4472j3847j3383j1967r435o808m470j881P06K053J991J928K739
57912E08881L655L913M070M775N587N820N517M869L579J533p50k793m554n841
57898E38261o269o094o176o810p492q055q888r874j0287j0031r792r628q657o585
$$ plain form
57997 720589 728263 734645 739416 742746 744312 743259 739636 734786 729607 723448 715532 706495 697621 689454
57983 689454 682078 675886 670997 666647 662167 658021 654966 652842 651183 650377 651178 653448 656475 660299 665809
57968 665809 673628 683538 694734 705987 715825 723211 728048 730687 731130 728977 723808 715466 704495 692483
57954 692483 681287 671517 662431 653609 646015 640921 638463 637715 637631 637541 637435 638178 640786 645113 649908 654355
57938 654355 658567 662268 664174 663410 660570 656515 650990 643206 633000 620679 606489 591079 575727
57925 575727 561255 547408 534025 522058 512623 505815 501345 499464 500170 502223 504214 506142 508881
57912 508881 512536 516449 520519 525294 530881 536701 542218 547087 550666 552199 551449 548656 544102 538261
57898 538261 531992 525898 519722 512912 505420 497365 488477 478603 468316 458285 448493 438865 430208 423623
57884D23623m288k352k86K134L949M339L919L895M570N453O155O547O539O239
57870D70436N957N801N622N440N268M642L101J070o03j892l360m839n561n657
57856D85425o107p053p485o973o360o274o270n914n448m816l394j356j14n50j853
57841D15458k810l258l551l657l574l781m450m974m982n007n576o409p053p577
57827C48799q012q028p568p080o649n836m730m106m087l737k519j056J16J346
57813B86853K773L721L991M523N901P343Q100Q730R917J1089J1418J1220J1222
57800C86801J1263J0856J0239R790R185Q250P844Q695J0008J0494J0069R413Q462
57787E11369O606L951J044k197o141j0351j3976j6907j9441k1137k1178j9662
$$ plain form
57884 423623 419335 416983 416697 418831 422780 427119 431038 434933 439503 444956 451111 457658 464197 470436
57870 470436 476393 482194 487816 493256 498524 503166 506267 507337 506734 504842 501482 496643 491082 485425
57856 485425 479318 472265 464780 457807 451447 445173 438903 432989 427541 422725 419331 417975 417861 417311 415458
57841 415458 412648 409390 405839 402182 398608 394827 390377 385403 380421 375414 369838 363429 356376 348799
57827 348799 340787 332759 325191 318111 311462 305626 300896 296790 292703 288966 286447 285391 285507 286853
57813 286853 289626 293347 297338 301861 307762 315105 323205 331935 341852 352941 364359 375579 386801
57800 386801 398064 408920 419159 428949 438134 446384 454228 462923 472931 483425 493494 502907 511369
57787 511369 517975 521926 522970 520773 514632 504281 490305 473398 453957 432820 411642 391980
57775C91980j7502j5272j3088j1279j0124r118p574n763m509l829l042k010j217
57762B87653o54K81J666K755L017K768K692L279M608O125O823O271N274M862M965
57747C42385M849M418M219M312M237L913L692L445K615J230J13j41K86R89J796
57732C82358K515K884K952L097L549M244N021N765O431P265Q613J0253J1359J1619
57718D67925J1772J2445J3144J3272J3452J4716J6780J8382J9194K0191K2095
57707F43368K4572K7145K9859L2794L5783L8927M2700M7317N2609N8530O5192
57696A098796P2365P9705Q7518R6490J06581J16921J26927J36757J46405J55121
57686B223586J61933J66135J66990J63582J55387J42479J25055J03306P8120N1557
$$ plain form
57775 391980 374478 359206 346118 334839 324715 315597 308023 302260 297751 293922 290880 288870 287653
57762 287653 286999 287280 288946 291701 294718 297486 300178 303457 308065 314190 321013 327284 332558 337420 342385
57747 342385 347234 351652 355871 360183 364420 368333 372025 375470 378085 379315 379428 379287 379573 380562 382358
57732 382358 384873 387757 390709 393806 397355 401599 406620 412385 418816 426081 434694 444947 456306 467925
57718 467925 479697 492142 505286 518558 532010 546726 563506 581888 601082 621273 643368
57707 643368 667940 695085 724944 757738 793521 832448 875148 922465 975074 1033604 1098796
57696 1098796 1171161 1250866 1338384 1434874 1541455 1658376 1785303 1922060 2068465 2223586
57686 2223586 2385519 2551654 2718644 2882226 3037613 3180092 3305147 3408453 3486573 3538130
57676C538130K6347N123r944j7323j6507q626K751J1301R794n978l4519p0334
57664C430215j08160j44868j77810k03165k17022k17592k06062j85904j61628
57655A808004j37277j15119r5549p8266o3153n0112l8811k8991k0654j3621p317
57644A159134j201M884J0859J6607K2028K7372L3405M0723M8891N6877O4385P2040
57632A556004Q0199Q8381R6175J03931J12009J19887J26420J30613J31725J28989
57622B674333J21642J09102R1012O7521L9738R571k1043n0522p7359j00197j18443
57611B745355j32290j41821j46551j46284j41976j35243j27167j17966j07814
57602A548243r7541q8372q0913p4596o8344o1781n5487m9992m5128m0640l6780
$$ plain form
57676 3538130 3564477 3569600 3559656 3542333 3525826 3517200 3519951 3531252 3541046 3535068 3500549 3430215
57664 3430215 3322055 3177187 2999377 2796212 2579190 2361598 2155536 1969632 1808004
57655 1808004 1670727 1555608 1460059 1381793 1318640 1268528 1229717 1200726 1180072 1166451 1159134
57644 1159134 1157933 1162817 1173676 1190283 1212311 1239683 1273088 1313811 1362702 1419579 1483964 1556004
57632 1556004 1636203 1724584 1820759 1924690 2036699 2156586 2283006 2413619 2545344 2674333
57622 2674333 2795975 2905077 2996089 3063610 3103348 3112919 3091876 3041354 2963995 2863798 2745355
57611 2745355 2613065 2471244 2324693 2178409 2036433 1901190 1774023 1656057 1548243
57602 1548243 1450702 1362330 1281417 1206821 1138477 1076696 1021209 971217 926089 885449 848669
57591H48669l3656l0702k7558k4872k3206k1745j9325j6346j4225j3141j1921
57580F11972j0208q990q640q168p120o551p080p461o383m445l017k197j339o73
57566E29700p23p36N89L002M907N659O246P543R181J0509J1596J2736J3878J4940
57552F29027J6182J7893K0145K2919K5996K8816L1060L3335L6574M0745M5010
57541I47702M9212N4229O0494O7114P3107P8741Q4916R1540R7465J01795J04632
57530A810947J06296J06314J03375R6123Q3957O7308M7306K5124J543k2797m6791
57519B378705o8645q6485r9304j07260j11127j11639j09392j05015r9066r1837
57509A388935q3671p5279o7369o0073n3143m6694m1031l5916l0760k5744k1782
$$ plain form
57591 848669 815013 784311 756753 731881 708675 686930 667605 651259 637034 623893 611972
57580 611972 601764 592774 584134 575966 568846 562295 555215 547754 541371 536926 533909 531712 530373 529700
57566 529700 528977 528241 528830 531832 536739 542398 548644 556187 565368 575877 587473 600209 614087 629027
57552 629027 645209 663102 683247 706166 732162 760978 792038 825373 861947 902692 947702
57541 947702 996914 1051143 1111637 1178751 1251858 1330599 1415515 1507055 1604520 1706315 1810947
57530 1810947 1917243 2023557 2126932 2223055 2307012 2374320 2421626 2446750 2448293 2425496 2378705
57519 2378705 2310060 2223575 2124271 2017011 1905884 1794245 1684853 1579838 1480772 1388935
57509 1388935 1305264 1229985 1162616 1102543 1049400 1002706 961675 925759 894999 869255 847473
57498H47473j8971j6045j2066p797m520k167L65L527O865J0192J3782J7498K0761
57485H58897K3553K6558L0182L4273L8858M4228N0133N5903O1561O7816P4597
57474A366559Q0697Q5440Q9708R4435R8787J00723R8861R3021Q3369P0027N3296
57463B314923L3497J0835j3895l8719o1369q0708r6614j08741j16376j19503j19072
57452A604258j15955j10480j03301r5755q8677q1542p3557o5197n7804n1857m6561
57441G13572m1236l6285l2394k9350k6331k3170k0605j9155j8239j6780j4533
57430D35494j2378j1222j0988j0828j0192r268q459p770o997o196n672n500n391
57417C24633n159m953m880m672m050l272k860k829k628k017j498j598j998j915
$$ plain form
57498 847473 828502 812457 800391 792594 788074 785907 786272 789799 796664 806856 820638 838136 858897
57485 858897 882450 909008 939190 973463 1012321 1056549 1106682 1162585 1224146 1291962 1366559
57474 1366559 1447256 1532696 1622404 1716839 1815626 1916349 2015210 2108231 2191600 2261627 2314923
57463 2314923 2348420 2359255 2345360 2306641 2245272 2164564 2067950 1959209 1842833 1723330 1604258
57452 1604258 1488303 1377823 1274522 1178767 1090090 1008548 934991 869794 811990 760133 713572
57441 713572 672336 636051 603657 574307 547976 524806 504201 485046 466807 450027 435494
57430 435494 423116 411894 400906 390078 379886 370618 362159 354389 347392 341196 335524 330024 324633
57417 324633 319474 314521 309641 304969 300919 297647 294787 291958 289330 287313 285815 284217 282219 280304
57403B80304j175l39J63N26R41J130Q24M38O05J259J662J440J054J024J152R17
57387B91925L70J03L81P66Q13P37J077J898K650K760K181J340P93Q70J453K075
57371C12192K327K199J934J671J413J217J210J396J708K109K437K271J426N44
57357C36054O10J738K914L252K925K564K347K210K435L222L975L876L145K857
57343C74124L393L938L787L362L415L897M242M406M817N462N757N419M993N177
57329D36189O048P080P773P970P758P332P003P112P697Q365Q665Q638Q750R196
57315E45576R612R724R990J1052J2699J3983J4436J4576J4982J5556J6064J6818
57303G05068J8138J9494K0020J9747J9701K0639K2259K3806K4864K5379K5388
$$ plain form
57403 280304 279129 278790 278953 279479 280420 281550 282374 282812 283417 284676 286338 287778 288832 289856 291008 291925
57387 291925 292295 292398 292779 293545 294358 295095 296172 298070 300720 303480 305661 307001 307794 308664 310117 312192
57371 312192 314519 316718 318652 320323 321736 322953 324163 325559 327267 329376 331813 334084 335510 336054
57357 336054 336664 338402 341316 344568 347493 350057 352404 354614 357049 360271 364246 368122 371267 374124
57343 374124 377517 381455 385242 388604 392019 395916 400158 404564 409381 414843 420600 426019 431012 436189
57329 436189 442237 449317 457090 465060 472818 480150 487153 494265 501962 510327 518992 527630 536380 545576
57315 545576 555188 564912 574902 585954 598653 612636 627072 641648 656630 672186 688250 705068
57303 705068 723206 742700 762720 782467 802168 822807 845066 868872 893736 919115 944503
57292I44503K5115K4980K5140K5155K4377K2533J9760J6292J2383Q356M379L32
57280A153305l867p863j1050j3221j4698j5744j6120j5362j3470j1030q691o667
57268A015522m736k683n88J291K782L939M965O081P402Q791R924J0624J1116J1777
57254A086207J2657J3424J3931J4539J5647J7043J8044J8249J7906J7476J7185
57243A262308J7211J7919J9434K1109K1935K1721K1441K2097K3500K4616K4931
57232A498222K4935K5305K6155K7202K8173K8785K8848K8740K9333L0935L2593
57221A809226L3078L2355L1493L1242L1370L1439L1445L1456L1253L0748L0326
57210B155431L0362L0741L1254L2140L3811L6206L8777M1027M2710M3726M4117
$$ plain form
57292 944503 969618 994598 1019738 1044893 1069270 1091803 1111563 1127855 1140238 1148594 1152973 1153305
57280 1153305 1149438 1141575 1130525 1117304 1102606 1086862 1070742 1055380 1041910 1030880 1022189 1015522
57268 1015522 1010786 1008103 1007515 1008806 1011588 1015527 1020492 1026573 1033975 1042766 1052690 1063314 1074430 1086207
57254 1086207 1098864 1112288 1126219 1140758 1156405 1173448 1191492 1209741 1227647 1245123 1262308
57243 1262308 1279519 1297438 1316872 1337981 1359916 1381637 1403078 1425175 1448675 1473291 1498222
57232 1498222 1523157 1548462 1574617 1601819 1629992 1658777 1687625 1716365 1745698 1776633 1809226
57221 1809226 1842304 1874659 1906152 1937394 1968764 2000203 2031648 2063104 2094357 2125105 2155431
57210 2155431 2185793 2216534 2247788 2279928 2313739 2349945 2388722 2429749 2472459 2516185 2560302
57199B560302M4146M4118M4187M4441M4924M5437M5529M5032M4298M3644M2839
57188C048897M1531L9913L8498L7423L6424L5357L4268L3075L1714L0554L0122
57177C437776L0495L1385L2756L4651L6498L7380L7276L7292L8246L9642M0577
57166C833974M1113M2063M3698M5382M6523M7244M7939M8578M8781M8412M7730
57155D341437M6934M5786M3908M1378L8655L5856L2522K8384K3996K0161J7002
57144D716019J4095J1399R313P889O762O104O917R871J4366J9181K3677K7904
57132D873497L1898L5384L8036L9546L9567L7962L5158L1994K9190K7163K6214
57121E245609K6788K9317L3725L9027M3696M6890M9327N2826N9017O8702Q2093
$$ plain form
57199 2560302 2604448 2648566 2692753 2737194 2782118 2827555 2873084 2918116 2962414 3006058 3048897
57188 3048897 3090428 3130341 3168839 3206262 3242686 3278043 3312311 3345386 3377100 3407654 3437776
57177 3437776 3468271 3499656 3532412 3567063 3603561 3640941 3678217 3715509 3753755 3793397 3833974
57166 3833974 3875087 3917150 3960848 4006230 4052753 4099997 4147936 4196514 4245295 4293707 4341437
57155 4341437 4388371 4434157 4478065 4519443 4558098 4593954 4626476 4654860 4678856 4699017 4716019
57144 4716019 4730114 4741513 4750826 4758715 4765477 4771581 4778498 4788369 4802735 4821916 4845593 4873497
57132 4873497 4905395 4940779 4978815 5018361 5057928 5095890 5131048 5163042 5192232 5219395 5245609
57121 5245609 5272397 5301714 5335439 5374466 5418162 5465052 5514379 5567205 5626222 5694924 5777017
57110E777017R9135J19682J44011J73210K08676K51531L03144L66043M43556N38808
57100H424813O54937P95840R65299J165074J394540J651586J932329K230571K540167
57091B1755156K858615L186249L520922L854528M173938M461981M697100M855353
57083E3363842M911872M832691M562865M036500L219555K152658R47974k62050
57075G7765907j377699k347812l155093l799253m288481m632509m836609m903296
57067D8425155m839977m662736m393594m057338l680474l288659k902402k535593
57059A8064382k197642j894645j628339j396571j196342j025506q81490p60322
57051G083525o57918n71222m97630m34510l79941l33003k92932k58725k29680
$$ plain form
57110 5777017 5876152 5995834 6139845 6313055 6521731 6773262 7076406 7442449 7886005 8424813
57100 8424813 9079750 9875590 10840889 12005963 13400503 15052089 16984418 19214989 21755156
57091 21755156 24613771 27800020 31320942 35175470 39349408 43811389 48508489 53363842
57083 53363842 58275714 63108405 67671270 71707770 74927325 77079983 78027957 77765907
57075 77765907 76388208 74040396 70885303 67086050 62797569 58165060 53328451 48425155
57067 48425155 43585178 38922442 34528848 30471510 26791036 23502377 20599975 18064382
57059 18064382 15866740 13972095 12343756 10947185 9750843 8725337 7843847 7083525
57051 7083525 6425607 5854385 5356755 4922245 4542304 4209301 3916369 3657644 3427964
57042C427964k05358j84823j66880j51176j37967j26841j16741j07354r9160r1995
57032B039669q4885p7615p1110o5869o1220n6662n2568m8918m4630l8963l2546
57021A404683k6234j9824j2682m672M250J4513K6464M0385N7255P7453R7200J07903
57009A766694J01758P8361M4472P447k9625o6320j00523j27221j41508j42208
56999A391327j32676j18286j03158q8950p5962o4306n3850m4120l5044k7244k0977
56988F26754j5442r839m527l67K435L933L564Q66l223p045j0078j2974j5799j7474
56974E40784j7228j5463j2896r815o634m170k732j609qK068M365P137J0572J4007
56960E08378J6467J7772J8362J8110J6058J1577N306j377p554j3156j8279k2425
$$ plain form
57042 3427964 3222606 3037783 2870903 2719727 2581760 2454919 2338178 2230824 2131664 2039669
57032 2039669 1954784 1877169 1806059 1740190 1678970 1622308 1569740 1520822 1476192 1437229 1404683
57021 1404683 1378449 1358625 1345943 1341271 1345521 1360034 1386498 1426883 1484138 1561591 1658791 1766694
57009 1766694 1868452 1946813 1991285 1998732 1969107 1902787 1802264 1675043 1533535 1391327
56999 1391327 1258651 1140365 1037207 948257 872295 807989 754139 710019 674975 647731 626754
56988 626754 611312 601473 596946 596579 599014 602947 606511 607377 604154 597109 587031 574057 558258 540784
56974 540784 523556 508093 495197 485382 478748 474578 471846 470237 470229 472297 476662 483799 494371 508378
56960 508378 524845 542617 560979 579089 595147 606724 612030 610653 603099 589943 571664 549239
56948E49239k4645k4376k2035j8718j5327j2078q648m736m81L593P113J0317J3803
56935D53021J7803K1934K5614K8271K9001K6593K0478J1438J028r437j9021k6789
56923E79934l2039l4802l5441l3957l0339k5484k0941j7485j4692j2087r993q798
56911C03876q098p203o092n220m649l911k738j489o58k85R6Q90J958K779L171
56896B72427L632M679O055P074P721Q785J0770J3200J5231J6461J6677J5427J2429
56883D10568Q218L749n39m770q713j1491j2434j1850j0593r059o949m003n93K651
56869C44192N636Q881J2716J6844K0894K5076K9777L4614L8340L9700L7942L2599
56857F47211K3535J1549j497j3595k3436l0279l3594l3322l0203k5355j9567j3225
$$ plain form
56948 549239 524594 500218 478183 459465 444138 432060 423412 418676 418195 421788 428901 439218 453021
56935 453021 470824 492758 518372 546643 575644 602237 622715 634153 635181 625744 606723 579934
56923 579934 547895 513093 477652 443695 413356 387872 366931 349446 334754 322667 312674 303876
56911 303876 295778 288575 282483 277263 272614 268703 265965 264476 263818 263533 263629 264519 266477 269256 272427
56896 272427 276059 280738 286793 293867 301588 310373 321143 334343 349574 366035 382712 398139 410568
56883 410568 418786 422535 421996 417226 408513 397022 384588 372738 362145 353086 346137 342134 341541 344192
56869 344192 349828 358709 371425 388269 409163 434239 464016 498630 536970 576670 614612 647211
56857 647211 670746 682295 680798 667203 643767 613488 579894 546572 516369 491014 471447 458222
56845D58222o596J41O884J3336J9038K4185L0026L7849M7526N7385O5201O8789
56833H21986O6035N5669L8583J7812l320k2842l9889n3522o2466o5903o4053n8011
56821F30079m9324l9588l0050k1304j3404o149P11P414J4146K1116K8614L6569
56809E78830M3785M7960M7019M0555K9759J6142Q01j5155l0082m2122m9900n2850
56797F14742n1298m6444l9895l2808k5622j8762j3056q919n473j353L677Q601
56785C83390J2751J6651K0803K4283K5268K2706J6960R040j55r794j8922k6501
56773D76480l1641l3882l3538l1547k8721k5241k1177j7113j3810j1363r317p492
56761B11638o140n316m702m142l821l712l374k582j657r66m34R2L85R9o94j488
$$ plain form
56845 458222 451626 451767 458651 471987 491025 515210 545236 583085 630611 687996 753197 821986
56833 821986 888021 943690 982273 1000085 996765 973923 934034 880512 818046 752143 688090 630079
56821 630079 580755 541167 511117 489813 476409 470260 470971 478385 492531 513647 542261 578830
56809 578830 622615 670575 717594 758149 787908 804050 804851 789696 759614 717492 667592 614742
56797 614742 563444 517000 477105 444297 418675 399913 386857 377938 372465 371112 374789 383390
56785 383390 396141 412792 433595 457878 483146 505852 522812 531852 531697 521903 502981 476480
56773 476480 444839 410957 377419 345872 317151 291910 270733 253620 239810 228447 219130 211638
56761 211638 205498 200182 195480 191338 187517 183805 180431 177849 176192 175226 174792 174884 175269 175368 174674 173186
56745A73186j818j647j401j532j847j535k62J027J082M1p96q76j024j840k568
56730A58190k273j278m91j33j5m11j486k334j894o14Q1j14j31M80P52L0p50m52
56712A47157N33R73O42L50M31K76m58j110r48k42J37j19m37k79J45K16k95j006
56694A45966j390j138k36R86J864J970J735J992K746L021K297J420J434K075K346
56679A67088K168K360K993K980J683M6o16k35J37k63j278k311k925l035k827k547
56663A63418k211j660r61m61l36m23o46j217k070k530j995p46L39P96R09J122
56647A51328J477J675J441P44j64q73j077q14m30k74m05n37l21J78M04r4j104
56630A51154j930k086j561o34K25M14k83j196j394q61n07q42j295j153n68r0K72
$$ plain form
56745 173186 171368 169721 168320 166788 164941 163406 163144 164171 165253 165294 164498 163622 162598 160758 158190
56730 158190 155917 154639 154148 154015 154000 153589 152103 149769 147875 147261 147342 147228 147097 147577 148329 148359 147609 147157
56712 147157 147690 148663 149305 149655 150086 150362 149904 148794 147846 147604 147741 147622 147185 146906 147051 147267 146972 145966
56694 145966 144576 143438 143202 144188 146052 148022 149757 151749 154495 157516 159813 161233 162667 164742 167088
56679 167088 169256 171616 174609 177589 179272 179318 178702 178467 178604 178341 177063 174752 171827 168792 165965 163418
56663 163418 161207 159547 158586 158125 157789 157366 156720 155503 153433 150903 148908 148162 148501 149297 150206 151328
56647 151328 152805 154480 155921 156665 156501 155628 154551 153737 153307 153033 152628 152091 151770 151948 152352 152258 151154
56630 151154 149224 147138 145577 144943 145168 145582 145299 144103 142709 141848 141341 140499 139204 138051 137483 137393 137665
56613A37665Q86J689K185K129J715J159N63J08m6o7k50n21n44l02j66l27m99l44
56595A45033O0L88N58P67J098J271J026O43P96J648K377K031P48l37m82n8K96
56578A57863O24J304K231K902L132L186L312L527L771L901L659K988K308K090
56564A96798K312K674L154L874M527M501L620K377J348P92P93J307J876J815R49
56549B32717j03o41o76p42j167j812k423k901l213l329l354l581m135m640m494
56534A95506l586k570k171k337k401j950j238o63k81o8k08q53j677k122j978j539
56518A69864j286j492k043k489k450k039j709j621j536j347j264j238p70K88J181
56503A50049J093K38m94o56m81j74K80O70O29J97j54k33l30o44r08p95k97M37
$$ plain form
56613 137665 138551 140240 142425 144554 146269 147428 147991 148099 148053 147986 147736 147215 146671 146369 146203 145876 145377 145033
56595 145033 145093 145481 146039 146806 147904 149175 150201 150844 151640 153288 155665 157696 158444 158107 157625 157567 157863
56578 157863 158487 159791 162022 164924 168056 171242 174554 178081 181852 185753 189412 192400 194708 196798
56564 196798 199110 201784 204938 208812 213339 217840 221460 223837 225185 225977 226770 228077 229953 231768 232717
56549 232717 232614 231973 231297 230555 229388 227576 225153 222252 219039 215710 212356 208775 204640 200000 195506
56534 195506 191920 189350 187179 184842 182441 180491 179253 178590 178309 178241 178033 177180 175503 173381 171403 169864
56518 169864 168578 167086 165043 162554 160104 158065 156356 154735 153199 151852 150588 149350 148580 148868 150049
56503 150049 151142 151380 150886 150230 149749 149575 149855 150525 151154 151351 151197 150964 150634 149990 149082 148287 147990 148427
56485A48427J269K051K673L169L513L389K626J739J484J857K100J899J868K519
56471A80583L344L472K920K551K903L539L701L267K852K977L323L023J688oj038
56456B19099j133q52o83n46k11J72K52j11q12j641k305k463k026j280o23k51j77
56439B04409l82p91j242j577j767j843j858j845j766j515j074o00k76o5J87M55
56423A88450N06K01l53q80j107r53o61o04q46j046j024j136j770k652l056k630
56407A70439j644n12N03J152J191P22J93%K12O69J112J281J143R62R28Q55N96
56390A79802M94R39J604J755J303R55J212J767K066J989J741J474J268J139R07
56375B00415L93j65k37L03R31J141J000R13J165J752K416K691K346J842J955K742
$$ plain form
56485 148427 149696 151747 154420 157589 161102 164491 167117 168856 170340 172197 174297 176196 178064 180583
56471 180583 183927 187399 190319 192870 195773 199312 203013 206280 209132 212109 215432 218455 220143 220137 219099
56456 219099 217966 217114 216431 215885 215674 215846 216098 215987 215175 213534 211229 208766 206740 205460 204837 204586 204409
56439 204409 204027 203236 201994 200417 198650 196807 194949 193104 191338 189823 188749 188149 187873 187808 187995 188450
56423 188450 188956 189157 188804 187924 186817 185864 185203 184599 183753 182707 181683 180547 178777 176125 173069 170439
56407 170439 168795 168283 168786 169938 171129 171851 172044 172044 172256 172925 174037 175318 176461 177423 178351 179206 179802
56390 179802 180296 181235 182839 184594 185897 186852 188064 189831 191897 193886 195627 197101 198369 199508 200415
56375 200415 200808 200643 200406 200709 201640 202781 203781 204694 205859 207611 210027 212718 215064 216906 218861 221603
56359B21603L284K699J195j47l98M24J397J449M53n03k38J133K336K490J914J412
56343B40503J366J751K446L160L502L474L489L747M009M214M718N581O165N958
56329B94083N333N009N098N209N167N070M861M423M004M024M442M706M346L423
56315C59198K390J737J641J780J597R85N02O98J376J859J846J703J867K287K607
56300C84073K664K636K750L003L303L712M378N207N956O701P815R329J0730J1721
56286D63978J2754J4253J5762J6528J6759J7507J9394K2108K5116K8188L1228
56275F83575L4276L7715M1864M6356N0651N5148O0861O7980P5608Q3165R1067
56264A328266R9662J08420J16712J24584J32211J39281J45379J50373J53846J54753
$$ plain form
56359 221603 224887 227586 228781 228634 228236 228660 230057 231506 231959 231456 231218 232351 234687 237177 239091 240503
56343 240503 241869 243620 246066 249226 252728 256202 259691 263438 267447 271661 276379 281960 288125 294083
56329 294083 299416 304425 309523 314732 319899 324969 329830 334253 338257 342281 346723 351429 355775 359198
56315 359198 361588 363325 364966 366746 368343 369328 369830 370528 371904 373763 375609 377312 379179 381466 384073
56300 384073 386737 389373 392123 395126 398429 402141 406519 411726 417682 424383 432198 441527 452257 463978
56286 463978 476732 490985 506747 523275 540034 557541 576935 599043 624159 652347 683575
56275 683575 717851 755566 797430 843786 894437 949585 1010446 1078426 1154034 1237199 1328266
56264 1328266 1427928 1536348 1653060 1777644 1909855 2049136 2194515 2344888 2498734 2653487
56254B653487J52223J46278J37321J25404J10500R3054P3847N3758L3857J5184
56244C594913j912j7701l2098m4426n4388o2436o8956p3952p7905q1916q6412
56233B992811r0688r4369r8169j02460j06181j08319j09498j10792j11748j11029
56223A949558j08496j05219j01761r7787r3214q8426q3275p7128p0072o3104n6924
56212A004152n1371m6194m1491l7281l3357k9757k6703k4023k1274j8565j6519
56201F57617j5273j4098j2352j0324q899q576q910q841p587n458l591k774k711
56188E48223k572j835m09J484L147L786L497L389M206N381O048O279O659P158
56174E94441P374P425P725Q169Q413Q588Q967R238Q958Q434Q320Q593Q802R049
$$ plain form
56254 2653487 2805710 2951988 3089309 3214713 3325213 3418267 3492114 3545872 3579729 3594913
56244 3594913 3593001 3575300 3543202 3498776 3444388 3381952 3312996 3239044 3161139 3079223 2992811
56233 2992811 2902123 2807754 2709585 2607125 2500944 2392625 2283127 2172335 2060587 1949558
56223 1949558 1841062 1735843 1634082 1536295 1443081 1354655 1271380 1194252 1124180 1061076 1004152
56212 1004152 952781 906587 865096 827815 794458 764701 737998 713975 692701 674136 657617
56201 657617 642344 628246 615894 605570 596671 588095 579185 570344 562757 557299 553708 550934 548223
56188 548223 545651 543816 543407 544891 548038 551824 555321 558710 562916 568297 574345 580624 587283 594441
56174 594441 601815 609240 616965 625134 633547 642135 651102 660340 669298 677732 686052 694645 703447 712496
56160G12496R804J0947J2009J3233J5443J8769K2375K5632K8890L2938L8288M5025
56148I85849N2968O1867P1742Q2908R5378J08479J21253J32740J41579J46060
56138B000823J45227J39492J29791J16923J02221Q7928P5686O5199N5140M4805
56128B963235L4077K2570J0096k458j3869k3881l2992m1534n0012n9655p1330
56117B734247q4309r7094j09061j20048j28781j33200j32186j26124j16045j03351
56107A584048q9868p6953o4796n3494m4128l7564l2900k8588k4627k2102k0992
56096A088036k0128j9057j8292j7769j6689j4912j3141j1612r910q011o300m665
56084I27550k733q17N25J534K733L805M287M729N805O924P276P553Q789J0236
$$ plain form
56160 712496 722300 733247 745256 758489 773932 792701 815076 840708 869598 902536 940824 985849
56148 985849 1038817 1100684 1172426 1255334 1350712 1459191 1580444 1713184 1854763 2000823
56138 2000823 2146050 2285542 2415333 2532256 2634477 2722405 2798091 2863290 2918430 2963235
56128 2963235 2997312 3019882 3029978 3027520 3013651 2989770 2956778 2915244 2865232 2805577 2734247
56117 2734247 2649938 2552844 2443783 2323735 2194954 2061754 1929568 1803444 1687399 1584048
56107 1584048 1494180 1417227 1352431 1298937 1254809 1217245 1184345 1155757 1131130 1109028 1088036
56096 1088036 1067908 1048851 1030559 1012790 996101 981189 968048 956436 946526 938515 932215 927550
56084 927550 924817 924000 924525 926059 928792 932597 936884 941613 947418 954342 961618 969171 977960 988196
56070I88196J0468J0004J0564J2150J3160J3236J3567J4373J4529J3880J3682
56059A127809J4378J5077J5514J6411J7592J7902J7376J7392J8325J9060J9198
56048A316034J9621K0568K1253K1754K3118K5257K6801K7457K8289K9434K9906
56037A589492L0073L1791L5392L8888M0938M2402M4217M6032M7657M9699N2048
56026B048629N3695N4671N6117N8050N9324O0025O1485O3590O4712O4819O5888
56015B711005O8641P1566P3895P6794Q0839Q5016Q8995R3806R9579J05143J10360
56004C665639J16269J22629J28201J33510J40247J47916J54592J60909J69473
55995D939385J80240J90709K00891K13457K28576K43461K57784K74505K94432
$$ plain form
56070 988196 998664 1008668 1019232 1031382 1044542 1057778 1071345 1085718 1100247 1114127 1127809
56059 1127809 1142187 1157264 1172778 1189189 1206781 1224683 1242059 1259451 1277776 1296836 1316034
56048 1316034 1335655 1356223 1377476 1399230 1422348 1447605 1474406 1501863 1530152 1559586 1589492
56037 1589492 1619565 1651356 1686748 1725636 1766574 1808976 1853193 1899225 1946882 1996581 2048629
56026 2048629 2102324 2156995 2213112 2271162 2330486 2390511 2451996 2515586 2580298 2645117 2711005
56015 2711005 2779646 2851212 2925107 3001901 3082740 3167756 3256751 3350557 3450136 3555279 3665639
56004 3665639 3781908 3904537 4032738 4166248 4306495 4454411 4609003 4769912 4939385
55995 4939385 5119625 5310334 5511225 5724682 5953258 6196719 6454503 6729008 7023440
55986G023440L15170L36443L61122L89707M19431M50220M85807N27369N72128
55977A0880837O20045O75708P41739Q16677R01143R99405J113147J241120J387172
55968A9376993J561231J770738K019639K318022K684109L134900L684425M352385
55960D0902442N162188O126262P242601Q507159R922046J1501798J3297036J5415182
55952A18076714J7997659K1165760K4956597K9180384L3161693L5609687L5005593
55945C15154087L0455909K2309819J1904482P02451j0269687k0248555k8350813
55938C21657693l3666584l5765796l4991280l2223310k8414882k4304703k0371164
55931A11919974j6872377j3894586j1421559r402338p776012o470822n416806
$$ plain form
55986 7023440 7338610 7675053 8036175 8425882 8845313 9295533 9781340 10308709 10880837
55977 10880837 11500882 12176590 12918329 13735006 14636149 15635554 16748701 17989821 19376993
55968 19376993 20938224 22708962 24728601 27046623 29730732 32865632 36550057 40902442
55960 40902442 46064630 52190892 59433493 67940652 77862698 89364496 102661532 118076714
55952 118076714 136074373 157240133 182196730 211377114 244538807 280148494 315154087
55945 315154087 345609996 367919815 379824297 380526748 370257061 350008506 321657693
55938 321657693 287991109 252225313 217234033 185010723 156595841 132291138 111919974
55931 111919974 95047597 81153011 69731452 60329114 52553102 46082280 40665474
55924D0665474m562834l871780l307648k839487k450196k129248j861735j633042
55916A8009504j437589j273718j134843j013261r07389q17848p40725o71124o09054
55907I403953n55873n08990m65370m26183l92973l63243l34509l08699k87906
55898E760207k69689k51120k33631k19419k06656j92811j79378j68855j60039
55889C878609j50520j40993j33070j25552j16775j08177j01726r6143q9322q2214
55879B734117p6808p2471o7698o3444o1257o0018n7759n5003n3101n1027m7026
55868B068505m2040l8542l7163l7020l8066m0593m3679m6308m8798n1149n1659
55857A593488m9204m5234m1507l7708l3283k9564k7700k6429k4418k2834k3068
$$ plain form
55924 40665474 36102640 32230860 28923212 26083725 23633529 21504281 19642546 18009504
55916 18009504 16571915 15298197 14163354 13150093 12242704 11424856 10684131 10013007 9403953
55907 9403953 8848080 8339090 7873720 7447537 7054564 6691321 6356812 6048113 5760207
55898 5760207 5490518 5239398 5005767 4786348 4579692 4386881 4207503 4038648 3878609
55889 3878609 3728089 3587096 3454026 3328474 3211699 3103522 3001796 2905653 2816331 2734117
55879 2734117 2657309 2584838 2517140 2453696 2392439 2332421 2274662 2219659 2166558 2115531 2068505
55868 2068505 2026465 1987923 1950760 1913740 1875674 1835081 1791402 1745094 1696296 1645147 1593488
55857 1593488 1544284 1499050 1457543 1419835 1386552 1356988 1329288 1302859 1278441 1255607 1232539
55846A232539k3749k2869k1204k0664k0772j9769j8055j7471j7969j7966j7317
55835A014734j7215j7640j7503j6932j6907j6992j5776j3452j1710j1176j0944
55824H48487j0533j0431j0714j0808j0648j0621j0550r962r019p957o279l809
55812G37156j820j492j961j497p7Q83Q05K12q49k803n119o526o741o620o672o659
55796F90220o568o716o967o900o603o315n495l322J3L284N282N257K947r88n131
55781F51998q688j2145j5789j8516j9153j8092j6472j4571j2244j0177r261r234
55769D87656r182q998r195r826j0656j1770j2965j3224j1996j0242r039p941o096
55756C56526m136l356l690m111m506n475o676p125o822o531o164n064l726l488
$$ plain form
55846 1232539 1208790 1185921 1164717 1144053 1123281 1103512 1085457 1067986 1050017 1032051 1014734
55835 1014734 997519 979879 962376 945444 928537 911545 895769 882317 870607 859431 848487
55824 848487 837954 827523 816809 806001 795353 784732 774182 764220 755201 747244 740965 737156
55812 737156 735336 733844 731883 730386 730309 731192 731997 732209 731360 728557 723438 716912 710171 703551 696879 690220
55796 690220 683652 676936 669969 663069 656466 650151 644656 641334 641347 644631 649913 655170 658117 657129 651998
55781 651998 643310 631165 615376 596860 577707 559615 543143 528572 516328 506151 496890 487656
55769 487656 478474 469476 460281 450455 439799 428029 415064 401840 389844 379602 370563 362622 356526
55756 356526 352390 349034 345344 341233 336727 331252 324576 317451 310629 304098 297934 292870 289144 285656
55742B85656m410n016m428l359k722k553k565k648k515j841r85p12j024j168q26
55727B48884n26q01j709l098m554n236m610l342k634k797l136l033k449j606r04
55712B08449q11j092o67R73K736L273K816K568K818K824K210J297K67q42j600
55697B25219j673j504j556j388o02J5l43r01m84K25l42j838k268j178l23p41j223
55680B09095n31P14J423J780K410K973K904K629K965L792M291M128L643L186K888
55665B48290K881L262L992M943N879O325O019N386N094N051M453K939J063m89
55651C05088j636k683l835m972n641n408m573m184m735n362n093m395m440n187
55637B42944n531n189n063n588o037n870n597n770o148o350o492o655o415n528
$$ plain form
55742 285656 281246 276230 271802 268443 265721 263168 260603 257955 255440 253599 252614 251902 250878 249710 248884
55727 248884 248358 247557 245848 242750 238196 232960 228350 225008 222374 219577 216441 213408 210959 209353 208449
55712 208449 207638 206546 205879 206852 209588 212861 215677 218245 221063 223887 226097 227394 227661 226819 225219
55697 225219 223546 222042 220486 219098 218496 218511 218168 217267 216783 217008 216666 214828 212560 211382 211059 210318 209095
55680 209095 208564 209278 210701 212481 214891 217864 220768 223397 226362 230154 234445 238573 242216 245402 248290
55665 248290 251171 254433 258425 263368 269247 275572 281591 286977 292071 297122 301575 304514 305577 305088
55651 305088 303452 300769 296934 291962 286321 280913 276340 272156 267421 262059 256966 252571 248131 242944
55637 242944 237413 232224 227161 221573 215536 209666 204069 198299 192151 185801 179309 172654 166239 160711
55623A60711m391l519k988k756k859l095k975k373j694j288j140j176j301j151
55609A28005n18ll98j354j606p58R9q2r60j550j602j619j930k266k153j453o12
55592A09240l65r21j655j891j743j650j486r28l78n90j412j834j386o33k32k90
55576I1846o58j112j216p74l35n04q60n10M29J015R89J011J286J227O27Lm30r86
55558I1048j459j112p2N49K94k5J59K61k30p62p00l01ML70Q99J146Q64N43N92
55539I2068Q39J235K046K937K969K160J814K567L319L010K289K316K923L245L259
55524A28996L386L320K569J659J496J871J779R48j03j173k462l631l995l598l295
55509A27767l609m241m695m826m772m798n040n058m141k456j379j884l224l913
$$ plain form
55623 160711 156320 152801 149813 147057 144198 141103 138128 135755 134061 132773 131633 130457 129156 128005
55609 128005 127487 127484 127086 125732 124126 123368 123467 123385 122425 120875 119273 117654 115724 113458 111305 109852 109240
55592 109240 108875 107954 106299 104408 102665 101015 99529 98601 98223 97633 96221 94387 93001 92368 92136 91846
55576 91846 91188 90076 88860 88086 87751 87247 86387 85877 86306 87321 88310 89321 90607 91834 92461 92464 92034 91048
55558 91048 89589 88477 88405 88954 89248 89223 89382 89643 89413 88651 87951 87650 87654 88024 88923 90069 90933 91476 92068
55539 92068 92907 94142 96188 99125 102094 104254 106068 108635 111954 114964 117253 119569 122492 125737 128996
55524 128996 132382 135702 138271 139930 141426 143297 145076 146024 145921 144748 142286 138655 134660 131062 127767
55509 127767 124158 119917 115222 110396 105624 100826 95786 90728 86587 84131 82752 80868 77644 73731
55495G3731l531k721j927j148o17o01p20m34p7m66j491k114j809j126p41p11p92
55478E2705q08n97j88o0n94j269j149j94N87M73k32q59j156j111o70jM50M62K66
55459D6055J15p0m12p97j052j117r39m77R0L90L02J24K16N91R19Q37K52n00r05
55440D3622p20j60M59R72J242J012K89m18n60j76K61M83N78O27N50L20J29K41
55422D8751P52J401J618J027J4m90J1J020J614J348M71m16p51l43M01Q40P68M39
55404E8475lo67j319j412r50p16j194j882k113j958j755j356n12M37R48J024R53
55387D6000O92J38l42l47j08q5k13k10k46n68q16n97l94r10j656j366P9J235R23
55368D1209l60j256j137l82L93Q79J063J050Q69M44j16l89j13L63M64J26l00o95
$$ plain form
55495 73731 70200 67479 65552 64404 63787 63186 62466 62032 61955 61489 59998 57884 56075 54949 54208 53497 52705
55478 52705 51897 51300 51112 51052 50458 49189 48040 47846 48433 48906 48674 47815 46659 45548 44878 44877 45327 45789 46055
55459 46055 46170 46100 45688 44891 43839 42722 41783 41306 41396 41786 42088 42212 42428 43019 43938 44775 45027 44527 43622
55440 43622 42902 42742 43201 44173 45415 46427 46716 46298 45738 45562 45823 46306 46884 47511 48061 48381 48510 48751
55422 48751 49503 50904 52522 53549 53563 53073 53084 54104 55718 57066 57537 57121 56370 56027 56428 57268 58036 58475
55404 58475 58472 57805 56486 55074 54124 53408 52214 50332 48219 46261 44506 43150 42638 43075 44023 45047 46000
55387 46000 46692 46830 46488 46141 46033 45948 45735 45525 45279 44711 43895 43298 42904 41994 40338 38972 39051 40286 41209
55368 41209 40849 39593 38456 38074 38467 39346 40409 41459 42328 42772 42656 42267 42154 42517 42981 43107 42807 42112
55350D2112j238j803j951j545r38m76k07r3j58l84p20j180j605j526p17K88P56
55333B8615P14Q01J245J645J708J564J229M84n16j116r68n38m60p05p31k73K84
55316C2982L42k03p33n99K8L00j01m89k08L34L45p1j51K86O90P97Q99J065R16
55297C6429L56j68l49l67l40j44J27J06j88k54M8K43K6k55k28q2j10k26k46k02
55277C4176j23J07L95M27K54L12N95M48l77j060p81R8N81M85N07R82J345J008
55259C9379K07l75m62l10j87m4K15M11K75r0k89j91j36l72o22n53k72J3M18R33
55239C7948Q83k86j886k518j808p18o9L23P26P65J75m67n86n09q26j302j234n85
55221B8026O0M60Q63J267J219N61j81m03p5L31M02J91R4L65P13O19R2j93K31R05
$$ plain form
55350 42112 40874 39071 37120 35575 34637 34161 33954 33861 33703 33319 32599 31419 29814 28288 27571 27859 28615
55333 28615 29329 30130 31375 33020 34728 36292 37521 38005 37489 36373 35405 34867 34407 33702 32971 32698 32982
55316 32982 33324 33121 32388 31789 31817 32117 32016 31527 31319 31653 31998 31927 31776 32062 32752 33549 34448 35513 36429
55297 36429 36785 36617 36268 35901 35561 35417 35544 35650 35462 35208 35256 35499 35525 35270 35042 34960 34850 34624 34378 34176
55277 34176 34053 34160 34555 34982 35236 35548 36143 36591 36214 35154 34373 34471 35052 35537 36044 37026 38371 39379
55259 39379 39586 39211 38749 38439 38252 38208 38423 38834 39109 39019 38730 38539 38403 38031 37409 36856 36584 36597 37015 37948
55239 37948 38831 38545 36659 34141 32333 31615 31546 31869 32595 33360 33535 33068 32482 31973 31147 29845 28611 28026
55221 28026 28086 28546 29409 30676 31895 32456 32275 31872 31797 32128 32530 32721 32815 33180 33893 34512 34604 34411 34642 35547
55201C5547J007L89l54o88o43m94l46j66N6K51L78M45N00N78O33O61P33Q42P31
55182D0060K36k57j61M44P28K00o10q64m72J3K31K28J4m87j063j311j157r48r08
55163C3916q30m23K77R61J318J115L32o84j319j204n41J41N33P24Q57P90L18l43
55145C5938n77p8O41P78J85n35p84n01N3O09Q07L45m99q81l23O01R68O35L27O27
55125C8336J344J902J948J535R40M37J15j03k53k13Q2M62O91P14N74K45j98m93
55107D8065m85m26n91p71n56n6J51j56m73k64L79R94J277J149N83j97o10k50N57
55088D8320J057R82P55P72Q15M76j66n50l13L20P77O98K06k18k22N0J11k41o02
55069E3027m43J78O61O26K70l4k49n47q77r61o64j79J98L61M05L91J43n04j269
$$ plain form
55201 35547 36554 36943 36589 35901 35258 34764 34418 34252 34308 34559 34937 35382 35882 36460 37093 37754 38487 39329 40060
55182 40060 40296 40039 39878 40322 41050 41250 40640 39776 39304 39317 39548 39776 39790 39303 38240 36929 35772 34824 33916
55163 33916 33086 32663 32940 33901 35219 36334 36666 35982 34663 33459 32918 33059 33592 34316 35173 35963 36281 35938
55145 35938 35361 35283 35924 36702 36887 36352 35568 35067 35120 35729 36536 36881 36382 35501 35178 35779 36747 37382 37709 38336
55125 38336 39680 41582 43530 45065 46005 46442 46557 46454 46201 45988 46070 46532 47223 47937 48511 48756 48558 48065
55107 48065 47580 47154 46563 45792 45236 45180 45331 45175 44702 44438 44817 45811 47088 48237 48820 48623 48013 47763 48320
55088 48320 49377 50359 51114 51886 52701 53177 53011 52461 52148 52468 53245 53943 54149 53931 53709 53759 53870 53629 53027
55069 53027 52584 52762 53423 54049 54319 54285 54036 53489 52612 51651 50987 50808 51006 51367 51772 52163 52306 51802 50533
55050E0533j472p52L19P66L08l75n53k01K70O13P88P02K96k55o14n41N4J073K104
55031E3063K565K188J221Q4q79j343j122n76m04p71j095r71p31p17n61Q3P03N34
55013E1271k72q54p64k33M42J025J081M17m31q57j105j671k092j463l2R25R93
54996D6380J106J845K471K251J628J306J107N85R2K54Q91J282J188R58Q59R47
54980F5150J310J863K162J941J563J443J402J108Q74J332K539L964N197O148O671
54965A04667O655O423O608P518Q932J0459J1790J2797J3655J4690J5751J5971
54953B35916J4564J1651P918L729q93n637r795j2842j4752j5675j5754j5234j4453
54940A68743j3594j2608j1336r625p499n381l938l438l422l251k724j957r74J97
$$ plain form
55050 50533 49061 48309 48628 49394 49702 49327 48774 48573 48843 49456 50244 50946 51242 50987 50373 49832 49886 50959 53063
55031 53063 55628 57816 59037 59121 58242 56899 55777 55201 54797 54026 52931 51960 51229 50512 49951 50034 50737 51271
55013 51271 50999 50145 49381 49148 49590 50615 51696 52113 51682 50825 49720 48049 45957 44494 44462 45387 46380
54996 46380 47486 49331 51802 54053 55681 56987 58094 58679 58771 59025 59916 61198 62386 63344 64203 65150
54980 65150 66460 68323 70485 72426 73989 75432 76834 77942 78816 80148 82687 86651 91848 97996 104667
54965 104667 111322 117745 124353 131871 140803 151262 163052 175849 189504 204194 219945 235916
54953 235916 250480 262131 270049 273778 272885 267248 257453 244611 229859 214184 198430 183196 168743
54940 168743 155149 142541 131205 121580 114081 108700 104762 101324 97902 94651 91927 89970 88996 89193
54926H9193J288K043K560L089L645M120M569N130N954P386R732J2517J4528J5118
54912A80872J4946J4741J3953J1532P693L785M55k903o708j0277j2792j4337j5434
54899A85526j6079j5911j4879j3260j1294r264p582o439n487m313l097k387k320
54886G3214k418k186j668j270j203j227j008n44k11k86o60j001j148j130r79o60
54870E5615k05K52M85K38o22j798k596k477j584n60L6L1m32j032j408j389j062
54853D1492n77l0M01M52J17k54l98m27m92m45j59J25J19k1J01N51J057J356J306
54834D4274R01M72O22J561K673L134K742J861Q45j4l27M3O82J137J512K038K416
54817F6572K236J832J923K590L269L734M277M994N707O583Q006R711J0936J1611
$$ plain form
54926 89193 90481 92524 95084 98173 101818 105938 110507 115637 121591 128977 138709 151226 165754 180872
54912 180872 195818 210559 224512 236044 243737 247522 247977 245074 238366 228089 215297 200960 185526
54899 185526 169447 153536 138657 125397 114103 104839 97257 90818 85331 81018 77921 75534 73214
54886 73214 70796 68610 66942 65672 64469 63242 62234 61690 61479 61193 60533 59532 58384 57254 56275 55615
54870 55615 55410 55662 56147 56385 55763 53965 51369 48892 47308 46748 46784 46815 46383 45351 43943 42554 41492
54853 41492 40915 40885 41286 41738 41855 41601 41203 40776 40284 39839 39680 39805 39924 39903 40004 40555 41612 42968 44274
54834 44274 45175 45647 46269 47830 50503 53637 56379 58240 59085 59071 58744 58787 59469 60606 62118 64156 66572
54817 66572 68808 70640 72563 75153 78422 82156 86433 91427 97134 103717 111723 121434 132370 143981
54803A43981J2518J3976J5117J4982J3629J1697R419O563K952j246n438q618j0087
54790B19445j0351j0689j1576j2235j1979j1150j0212q881o966n304m748m744
54778A10610m026k476j191p81o37n8Q41J716K608L575M325M689N026N713O604
54763A36538P411Q292R570J1145J2631J3846J4708J4725J3268J0406O980L627
54751B63147K30l407o740q937r872j0184j0390j0505j0476j0347r831q486o645
54738A57557n524n839o821p245o999o810o793o331n384m794m888m726l450j765
54724H0188j184k065l157l157k171j307j233j503j363p29j42J15K94M90K88m65
54708F2899j060p60M5L54N3oN69J193J411J553J838J734R41J75K21O58N19k18
$$ plain form
54803 143981 156499 170475 185592 200574 214203 225900 235319 241882 244834 243588 238150 229532 219445
54790 219445 209094 198405 186829 174594 162615 151465 141253 132372 125406 120102 115354 110610
54778 110610 106584 104108 102917 102136 101499 101441 102282 103998 106606 110181 114506 119195 124221 129934 136538
54763 136538 143949 152241 161811 172956 185587 199433 214141 228866 242134 252540 259520 263147
54751 263147 263377 259970 253230 244293 234421 224237 213847 203342 192866 182519 172688 164202 157557
54738 157557 152033 146194 139373 132128 125129 118319 111526 105195 99811 95017 90129 85403 81953 80188
54724 80188 79004 76939 73782 70625 68454 67147 65914 64411 63048 62319 62177 62292 62586 63076 63364 62899
54708 62899 61839 61079 61124 61478 61531 61525 62094 63287 64698 66251 68089 69823 70764 70939 71160 71818 72337 72119
54690G2119p44q06r72j458j628r62K09J242J887K144J906J227O09N15Q16J093
54674G7197J374K021K986L620L466K865K473K410K269J910J721J969K299K160
54660A10740J513P58J78j88l01j86j40m89j016j113n27L22R61J369J814K415L039
54643A19149L439L458L295L452M194N183N994O721P540P944P295N979M995M271
54629A92909K591l89l235m670n313o445p870q372p720o833o110n071l715k909
54615A26848k988l113k548j643j047p33m86n96j328k191k520k380k283k297k113
54600I8582j731j436j254j092j226j944k745k707j755r06r60j565j913j783j481
54585G4084j221j101j327j872k160j736j040r27j436j735j373q49o90n72Q9J174
$$ plain form
54690 72119 71375 70569 69597 68139 66511 65549 65758 67000 68887 71031 72937 74164 74773 75288 76104 77197
54674 77197 78571 80592 83578 87198 90664 93529 96002 98412 100681 102591 104312 106281 108580 110740
54660 110740 112253 113011 113189 113001 112700 112514 112374 111885 110869 109756 109229 109551 110512 111881 113695 116110 119149
54643 119149 122588 126046 129341 132793 136987 142170 148164 154885 162425 170369 177664 183643 188638 192909
54629 192909 195500 195111 191876 187206 181893 175448 167578 159206 151486 144653 138543 133472 129757 126848
54615 126848 123860 120747 118199 116556 115509 114776 114290 113694 112366 110175 107655 105275 102992 100695 98582
54600 98582 96851 95415 94161 93069 91843 89899 87154 84447 82692 81786 80826 79261 77348 75565 74084
54585 74084 72863 71762 70435 68563 66403 64667 63627 62700 61264 59529 58156 57307 56617 56045 56134 57308
54569E7308J921J801R43j11p56o69j49Q0l32r57j261j238j066n25N34J488J493
54552E8504O19k72p08r11q97k43R56J747J504Q49P97J428J953J849J358R65R03
54535G0401J145J586K106K576K845K785K470K252K403K748K964L095L360L495
54521A06231K930J680M09n24j382k252k710k682k854l624m344m273l703l362l220
54506G6320k789k204k028k116j688o02L28M43O4p2K73P87J054Q76L63j57m93o84
54488F7675o74j57Q92J835K102J900J670J174k4j406j818j090l14k72m45q4N82
54471G1546Q49O66N05M64J87l65p11m46K88R64J084N08m25j070j037m96J14N29
54453G3154O90N17n1q09j303j199n81Q4L00n2o20r80r98p92m30LK09r3o20o90
$$ plain form
54569 57308 59229 61030 61973 61862 61106 60437 60288 60368 60036 59079 57818 56580 55514 54989 55523 57011 58504
54552 58504 59123 58851 58143 57232 56335 56092 57048 58795 60299 61148 61945 63373 65326 67175 68533 69498 70401
54535 70401 71546 73132 75238 77814 80659 83444 85914 88166 90569 93317 96281 99376 102736 106231
54521 106231 109161 110841 111250 110726 109344 107092 104382 101700 98846 95222 90878 86605 82902 79540 76320
54506 76320 73531 71327 69299 67183 65495 64893 65221 65664 65728 65656 65929 66716 67770 68646 69009 68852 68359 67675
54488 67675 67001 66844 67736 69571 71673 73573 75243 76417 76393 74987 73169 72079 71765 71493 71048 70964 71546
54471 71546 72395 73061 73566 74030 74217 73852 73141 72695 72983 73947 75031 75539 75114 74044 73007 72511 72625 73154
54453 73154 73844 74361 74310 73501 72198 70999 70418 70502 70802 70750 70130 69150 68152 67360 66930 66933 67142 67049 66429 65739
54433F5739p3O42Q21N97N28P01O76K69p7P6N15O49L08kL20J275K240K576K176
54414G9956J456Q89N96M19K44J63K89N77R47J488K345L366M121M321M118L824
54398A09119L548L208K755K174J455P54L55K56N9m52q98r40j018j764k876l316
54382A12419k727j855j456j528j873k537l247l268k435j692j849k379k228j366
54368H1979o84o30p92p00l18K18P49R47O91L73L79M63K63J49P66J849K397K074
54350I0173J619J704K176K608K914L109L079K869K686K440J813R14K96J29m6n15
54334A17968r63j105j217j649k332l039l652l914l474k565k055k364k833k713
54320H4093k251k232k724l058k859k451k234k147j908j390o94o4K35J63L5J69
$$ plain form
54433 65739 65666 66308 67129 67726 68254 68955 69631 69900 69823 69899 70414 71063 71371 71369 71689 72964 75204 77780 79956
54414 79956 81412 82301 82897 83316 83560 83723 84012 84589 85536 87024 89369 92735 96856 101177 105295 109119
54398 109119 112667 115875 118630 120804 122259 123013 123368 123624 123683 123231 122333 121393 120375 118611 115735 112419
54382 112419 109692 107837 106381 104853 102980 100443 97196 93928 91493 89801 87952 85573 83345 81979
54368 81979 81295 80665 79873 79173 78855 79073 79822 80769 81460 81833 82212 82675 82938 83087 83853 85702 88099 90173
54350 90173 91792 93496 95672 98280 101194 104303 107382 110251 112937 115377 117190 118104 118400 118529 118483 117968
54334 117968 117005 115900 114683 113034 110702 107663 104011 100097 96623 94058 92003 89639 86806 84093
54320 84093 81842 79610 76886 73828 70969 68518 66284 64137 62229 60839 60145 60081 60316 60479 60514 60683
54304F0683M31K98m95j537k062j705r06m75p51j260j303o94K04R95J459J409P59
54287E5050k16r70j162q33j73N59R68P75K28n5K70Q96J223Q69l2q40r09k90K41
54268E5599J85l9J67N74O24M57N94Q24N12m7K45J516K430J922N33n24p61k92P21
54249F5240J766J833N32j149j875j428n72J03M79N08K57P4J23N7l17m52J89J194
54231F6562J643J277N45j55o08n07J66O96L81m00o76k53J25N3l6K85P41Q31M11
54212G1081k93q78q70j35P57J009N16j12l91m40n21o63q21j010j156j084p53k74
54194F3962K48O63O98L12j10k77m22p46q31k35N51O11k9m28j67J47j1l26l48k13
54174F3049j78j46p5k74q11j126q29l51k88m60k99J68L67J18j57j55o1n9NK84
$$ plain form
54304 60683 61114 61412 60917 59380 57318 55613 54707 54232 53481 52221 50918 50224 50428 51423 52882 54291 55050
54287 55050 54834 53864 52702 51869 51696 52255 53223 53998 54226 54171 54441 55337 56560 57429 57397 56557 55648 55358 55599
54268 55599 55784 55745 55912 56486 57110 57567 58161 58985 59497 59450 59695 61211 63641 65563 66096 65572 64811 64519 65240
54249 65240 67006 68839 69371 68222 66347 64919 64347 64450 64929 65437 65694 65768 65891 65948 65631 65179 65368 66562
54231 66562 68205 69482 70027 69872 69264 68757 68923 69619 70000 69600 68924 68671 68796 68849 68813 69098 69839 70670 71081
54212 71081 70788 69910 69040 68905 69662 70671 71187 71075 70684 70244 69723 69060 68239 67229 66073 64989 64236 63962
54194 63962 64210 64873 65571 65883 65773 65496 65074 64328 63497 63262 63813 64424 64395 63967 63800 63947 63936 63610 63262 63049
54174 63049 62871 62725 62650 62376 61565 60439 59610 59259 58971 58511 58212 58380 58747 58865 58708 58553 58492 58433 58438 58722
54154E8722N32L18m62j450k063j906j072j64J72j52n60m28J81N92L89l1k1L12
54136E2909J74p50j652j547m78O68J324J619J671J186J1j374k238k293j788j158
54120D6284o93l76L2O39J149J152O95K75K48N21Q34J045J019O59J84L3K73M01
54102E4374np11j164j198j030p49k11N16R68P82K00j45K6L26K48j15j95J96N08
54083E2621K07l71l89L56J088R85J78m17q3R96J961K102J469P14L53L30L69L82
54065F2851M24M35M37P07J338J766J299J20p46o26J07O98R44J170J603K146K551
54048G7224K623K294J741J342J351J672K059K442K898L412L801L932L905L975
54034A14671M221M424M403M359M635N125N330N130N044N405N728N402M559L709
$$ plain form
54154 58722 59254 59572 59110 57660 55597 53691 52619 52455 52627 52475 51915 51487 51668 52260 52649 52618 52597 52909
54136 52909 53083 52333 50681 49134 48656 49324 50648 52267 53938 55124 55135 53761 51523 49230 47442 46284
54120 46284 45591 45215 45247 45886 47035 48187 48882 49157 49405 49926 50760 51805 52824 53483 53667 53700 53973 54374
54102 54374 54369 53658 52494 51296 50266 49517 49306 49822 50790 51572 51772 51627 51653 51979 52227 52112 51917 52113 52621
54083 52621 52828 52457 52068 52424 53512 54497 54675 54258 54175 55171 57132 59234 60703 61417 61770 62100 62469 62851
54065 62851 63275 63710 64147 64854 66192 67958 69257 69377 68631 68005 68112 68810 69754 70924 72527 74673 77224
54048 77224 79847 82141 83882 85224 86575 88247 90306 92748 95646 99058 102859 106791 110696 114671
54034 114671 118892 123316 127719 132078 136713 141838 147168 152298 157342 162747 168475 173877 178436 182145
54020A82145K861J754P23M15O62N04m69j560k046k066k114k335k764l619m743
54005A67348n304m685l397k511k406k587k572k428k432k596k704k565k210j825
53991A27126j476r66j79M40K43p05j513j478q42l09j88l23n25o70o26l95j72q9
53973A17353r7j60k37L2J047K398K939K079N53n36r87j251j526j706j885k106
53957A15910j935r78L01R85Q75N42L61J45j84k97O5Q03J729K627L071K788K271
53940A29079K391L257M078M330M465N122O117O661O251M998L387K017J270R92
53926A84415O42Qn09m99j09J90K64L49O71J246J973K728L406L985M481M809M851
53909B12901M694M533M302L717K822K177K165K396K068Q72p31k038k668k664k328
$$ plain form
54020 182145 185006 186760 187483 187898 188560 189064 188595 187035 184989 182923 180809 178474 175710 172091 167348
54005 167348 162044 157359 153962 151451 149045 146458 143886 141458 139026 136430 133726 131161 128951 127126
53991 127126 125650 124684 124505 124945 125188 124483 122970 121492 120650 120341 120153 119830 119305 118635 118009 117614 117442 117353
53973 117353 117256 117096 116859 116891 117938 120336 123275 125354 125907 125371 124384 123133 121607 119901 118016 115910
53957 115910 113975 112997 113298 114283 115158 115700 116061 116206 116022 115725 115790 116593 118322 120949 124020 126808 129079
53940 129079 131470 134727 138805 143135 147600 152722 158839 165500 171751 176749 180136 182153 183423 184415
53926 184415 185057 185065 184556 184057 183948 184138 184402 184751 185422 186668 188641 191369 194775 198760 203241 208050 212901
53909 212901 217595 222128 226430 230147 232969 235146 237311 239707 241775 242647 241916 239878 237210 234546 232218
53894B32218k035k040k388k991l677m250m585m812n212n834o336o331n769m916
53880A71042m068l421l042k849k735k816l313m012m183l399k295j956k600l304
53866A27049l216k562k149k225k322k050j597j431j770k474l135l226k427j007
53852I5458L22J005J000M73n14j768k768l044k629j857q45L46J243J182J26j123
53836H6607j757j623j002k17L38K77k75n99k46L33N19M86Q38J457J528Q19J57
53819H7640L30J052J490J415J322J578J975K097J776J144N22K90O31J305J930
53804A06497K446L096L827M126L729L209L379M170M641M186L279K736K711K791
53790A54823K772K749K617K069J146L12j12j77M2N43J048J064M85k83r98j846
$$ plain form
53894 232218 230183 228143 225755 222764 219087 214837 210252 205440 200228 194394 188058 181727 175958 171042
53880 171042 166974 163553 160511 157662 154927 152111 148798 144786 140603 137204 134909 132953 130353 127049
53866 127049 123833 121271 119122 116897 114575 112525 110928 109497 107727 105253 102118 98892 96465 95458
53852 95458 95780 96785 97785 98258 97744 95976 93208 90164 87535 85678 84833 85179 86422 87604 87730 86607
53836 86607 84850 83227 82225 82008 82346 82623 82348 81749 81503 81836 82355 82841 83679 85136 86664 87483 87640
53819 87640 87970 89022 90512 91927 93249 94827 96802 98899 100675 101819 102341 102631 103262 104567 106497
53804 106497 108943 112039 115866 119992 123721 126930 130309 134479 139120 143306 146585 149321 152032 154823
53790 154823 157595 160344 162961 165030 166176 166488 166376 166199 166241 166784 167832 168896 169381 169098 168100 166254
53774A66254k791l244k816j967j431j351j408j459j565j662j743k024k456k494
53760A37843j891j297j399j850j856j497j451j641j287l50K06k3k37K30Q43Q19
53744A25162L86K50M17L23j83o65q03o92o54j041k017l142l544k899j890j322
53728A07686j187j091j076j344j498r62J9N27K34k46l05j1L51P69J228J419J022
53711A05535J50p57j278j224o93m3M28P80J268J978K781L590M275M520M096L251
53695A28657K434J745J023M41M06Q72J307J466J625J895J863J263M93R1Q8J89
53679A45858K90M36O04Q30J196J391P53p50j987j848p16ml33r54j035p33n99o02
53661A41797l35J46L44J11m8L22R67J118L66q31j539j253l27M65P48P30P42P88
$$ plain form
53774 166254 163463 160219 157403 155436 154005 152654 151246 149787 148222 146560 144817 142793 140337 137843
53760 137843 135952 134655 133256 131406 129550 128053 126602 124961 123674 123324 123530 123507 123270 123500 124343 125162
53744 125162 125548 125798 126215 126538 126355 125690 124887 124195 123541 122500 120483 117341 113797 110898 109008 107686
53728 107686 106499 105408 104332 102988 101490 100528 100547 101074 101308 101062 100757 100746 101097 101866 103094 104513 105535
53711 105535 105685 104928 103650 102426 101733 101690 102118 102898 104166 106144 108925 112515 116790 121310 125406 128657
53695 128657 131091 132836 133859 134300 134706 135578 136885 138351 139976 141871 143734 144997 145490 145581 145669 145858
53679 145858 146148 146584 147188 148018 149214 150605 151358 150608 148621 146773 146057 146053 145720 144766 143731 142998 142399 141797
53661 141797 141462 141608 141952 142063 142015 142337 143304 144422 144788 143957 142418 141165 140838 141303 142051 142781 143523 144311
53643A44311O44J91m33r82j282j321j165q14k42M04Q16Q80Q41R15Q74M01l14o82
53625A43042m60K8N21J124J823K163J886J508J751K501K941K675K225K213K522
53610A68463K561K107J547J390J757K336K691K624K341K299K795L687M445M543
53596B05586L954L282L255L895M328L746K409J394J316J717J880J751J699J698
53582B41910J334O03R4K39P17R29P60N85O60Q57J019J224J554J812J675J129N39
53565B57640K83L17K42k60r80j278p34L28J104J159Q50P75J049J369J607J925
53549B65396K287K340J962J506J258R76M20l4K16J040J612J425P90K71P6K64R80
53532B82785K077K827K594J680J030J078J363J416J536K290L496M273M226M044
$$ plain form
53643 144311 144955 145146 144713 143731 142449 141128 139963 139149 138907 139311 140127 141007 141848 142763 143637 144038 143724 143042
53625 143042 142582 142610 143131 144255 146078 148241 150127 151635 153386 155887 158828 161503 163728 165941 168463
53610 168463 171024 173131 174678 176068 177825 180161 182852 185476 187817 190116 192911 196598 201043 205586
53596 205586 209540 212822 216077 219972 224300 228046 230455 231849 233165 234882 236762 238513 240212 241910
53582 241910 243244 243847 243941 244180 244897 245826 246586 247171 247831 248688 249707 250931 252485 254297 255972 257101 257640
53565 257640 257923 258240 258482 258222 257242 255964 255230 255558 256662 257821 258671 259446 260495 261864 263471 265396
53549 265396 267683 270023 271985 273491 274749 275725 276145 276111 276327 277367 278979 280404 281194 281465 281541 281805 282785
53532 282785 284862 287689 290283 291963 292993 294071 295434 296850 298386 300676 304172 308445 312671 316715
53518C16715M586N664O228N793N059M927N347N683N850O457P804R293J0103J0055
53504D09564R647R517J0034J1128J2315J3033J3230J3409J4041J5156J6496J7725
53492E65295J8344J7885J6516J5188J4804J5389J6331J7092J7364J6902J5822
53481G46932J4833J4618J5013J5304J5332J5632J6433J7128J7026J6212J5305
53470I19768J4754J4665J5002J5538J5756J5230J4034J2612J1294J0226R559R409
53458A077847R522R299Q261O437M202J916k83k349m166n528o337o773p209p889
53444A076950q734r501j0080j0530j0892j1111j1206j1427j2015j2843j3411j3401
53432I41799j3099j3134j3692j4240j4106j3185j1915j0723r783r121q628p834
$$ plain form
53518 316715 321301 326965 333193 338986 344045 348972 354319 360002 365852 372309 380113 389406 399509 409564
53504 409564 419211 428728 438762 449890 462205 475238 488468 501877 515918 531074 547570 565295
53492 565295 583639 601524 618040 633228 648032 663421 679752 696844 714208 731110 746932
53481 746932 761765 776383 791396 806700 822032 837664 854097 871225 888251 904463 919768
53470 919768 934522 949187 964189 979727 995483 1010713 1024747 1037359 1048653 1058879 1068438 1077847
53458 1077847 1087369 1096668 1104929 1111366 1115568 1117484 1117201 1114852 1110686 1105158 1098821 1092048 1084839 1076950
53444 1076950 1068216 1058715 1048635 1038105 1027213 1016102 1004896 993469 981454 968611 955200 941799
53432 941799 928700 915566 901874 887634 873528 860343 848428 837705 827922 818801 810173 802339
53420H02339o187l837j864j318k013k695k394j357m71j41L9O48J831L263M441
53405G90284N049N244N622O623Q029R299J0299J1338J2450J3252J3706J4462J5992
53392I21649J7793J9005J9520J9987K0930K2407K4303K6309K7795K8363K8505
53381A176566K9011K9874L0485L0800L1362L2114L2330L1993L2145L3192L3961
53370A523833L3247L1457K9711K8118K6063K3710K1914K0711J9112J6538J3513
53359A787927J0735Q204N628K964K94k447n379q513j1680j4398j6170j7249j8778
53346A721138k1447k4389k6190k6757k7241k8218k9030k9075k8633k8119k7392
53335A424647k6320k5266k4504k3784k2913k2178k1780k1441k0965k0655k0701
$$ plain form
53420 802339 796152 792315 790451 789133 787120 784425 782031 780674 780203 780062 780101 780749 782580 785843 790284
53405 790284 795333 800577 806199 812822 820851 830150 840449 851787 864237 877489 891195 905657 921649
53392 921649 939442 958447 977967 997954 1018884 1041291 1065594 1091903 1119698 1148061 1176566
53381 1176566 1205577 1235451 1265936 1296736 1328098 1360212 1392542 1424535 1456680 1489872 1523833
53370 1523833 1557080 1588537 1618248 1646366 1672429 1696139 1718053 1738764 1757876 1774414 1787927
53359 1787927 1798662 1806866 1812494 1815458 1815752 1813305 1807926 1799413 1787733 1773335 1757165 1739916 1721138
53346 1721138 1699691 1675302 1649112 1622355 1595114 1566896 1537866 1508791 1480158 1452039 1424647
53335 1424647 1398327 1373061 1348557 1324773 1301860 1279682 1257902 1236461 1215496 1194841 1174140
53324A174140k0729k0357j9725j9012j8027j6666j5256j3912j2234j0131q376
53313I99715p519o905n698m477m694o594q712r680r597r297q947q119o800n642
53299H97034n126m926m392l463k719k479k207j201M18J805K500K926L706M957
53285H86833O355P547Q288Q611Q997J0017J1602J3064J3923J4282J4260J3752
53273A017531J2928J2422J2486J2571J2079J1073R830Q307O576N191M430L674
53261A129098K238M66p35j245j850l190n148p169q687r383r523r861j0727j1600
53247A052684j2041j2605j4011j5760j6598j6193j5469j5194j5162j4954j4684
53236H90013j4562j4376j3864j3216j2767j2443j1847j0867r969r740j0146j0385
$$ plain form
53324 1174140 1153411 1133054 1113329 1094317 1076290 1059624 1044368 1030456 1018222 1008091 999715
53313 999715 992196 985291 979593 975116 970422 963828 955116 945436 935839 926542 917595 909476 902676 897034
53299 897034 891908 886982 882590 879127 876408 873929 871722 870521 870939 872744 875244 878170 881876 886833
53285 886833 893188 900735 909023 917634 926631 936648 948250 961314 975237 989519 1003779 1017531
53273 1017531 1030459 1042881 1055367 1067938 1080017 1091090 1100920 1109227 1115803 1120994 1125424 1129098
53261 1129098 1131336 1131802 1131067 1129822 1127972 1124782 1119634 1112465 1103778 1094395 1084872 1075011 1064284 1052684
53247 1052684 1040643 1028038 1014027 998267 981669 965476 950007 934813 919651 904697 890013
53236 890013 875451 861075 847211 833995 821228 808785 796938 786071 776102 766362 756216 745831
53224G45831r845q985q775r216r272q465p555p080o306m617k958k498k623j903
53210F55733n83l53j588k773k984l227m450n853o258o033o374p419q285q492q378
53195E82683q287q217q083p740o956n821m960m880n394n995o453o697o597o362
53181D90241o601p522q395q436p825p268o922o464n974n960o504o989o874o360
53167C92147o075o263o477o091n159m516m704n102m718l654l018l265l637l500
53153C25968l331l752m461m828m820m655m199l500l227l695m108l766l351l840
53139B70435m667m426l109k170k291k569k301k118k668l353l238k424j706j409
53125B31986j287j201j202j272j464j954k536k485j435j16M10Ln93q07o99n10
$$ plain form
53224 745831 735986 727001 718226 709010 699738 691273 683718 676638 670332 665715 662757 660259 657636 655733
53210 655733 655150 654797 653209 650436 647452 644225 639775 633922 627664 621631 615257 607838 599553 591061 582683
53195 582683 574396 566179 558096 550356 543400 537579 532619 527739 522345 516350 509897 503200 496603 490241
53181 490241 483640 476118 467723 459287 451462 444194 437272 430808 424834 418874 412370 405381 398507 392147
53167 392147 386072 379809 373332 367241 362082 357566 352862 347760 343042 339388 336370 333105 329468 325968
53153 325968 322637 318885 314424 309596 304776 300121 295922 292422 289195 285500 281392 277626 274275 270435
53139 270435 265768 261342 258233 256063 253772 251203 248902 246784 244116 240763 237525 235101 233395 231986
53125 231986 230699 229498 228296 227024 225560 223606 221070 218585 217150 217034 217444 217447 216854 216047 215348 214838
53109B14838l07j37k1K13O87J100J048P51R49J845K625K386J206r5r93j604k065
53092B22426k197j963j845k342l350m278m700m605m168l598l190l151l382l610
53078A76047l695l587l114k276j589j545j769j365l38J83m84j484j600r35o27
53063A51822j167j935k247k083j678j131o18l85l75k46J5L1l07n76n05m26p32
53046A37457j207j289q29k88j68n18r71j143j037r93j257j613j619j136m52M5
53030A22982J34j78o30q07n77l04m21q31j113j129j068r46n89r6J98L30P68J598
53012A17321K170J883R57J39j51j02j52n80j242j568j089l0Q49J129J058Q83L44
52995A21819p29j747j902j171l43MLN1K77O36J064J323R93M6p67n36O70J717J691
$$ plain form
53109 214838 214531 214394 214373 214586 215273 216373 217421 218172 219121 220966 223591 225977 227183 227088 226095 224491 222426
53092 222426 220229 218266 216421 214079 210729 206451 201751 197146 192978 189380 186190 183039 179657 176047
53078 176047 172352 168765 165651 163375 161786 160241 158472 157107 156769 156952 156468 154984 153384 152449 151822
53063 151822 150655 148720 146473 144390 142712 141581 140963 140578 140203 139957 139972 140003 139696 139120 138615 138189 137457
53046 137457 136250 134961 134132 133844 133676 133158 132187 131044 130007 129014 127757 126144 124525 123389 122937 122982
53030 122982 123116 122938 122308 121501 120924 120620 120199 119368 118255 117126 116058 115112 114523 114427 114625 114955 115723 117321
53012 117321 119491 121374 122331 122470 122319 122217 122065 121485 120243 118675 117586 117556 118405 119534 120592 121475 121819
52995 121819 121090 119343 117441 116270 115927 115931 115934 115985 116262 116898 117962 119285 120278 120324 119557 119021 119691 121408 123099
52976A23099J036Q79J426J720J127L50L45Q97J091Q85J139K054K649K186J296
52961A42179J059J659K519L265L872M211M172L984L818L306K134Q62M44R12J296
52946A79692J007M89K55n4j051k462l272k983k228j946k224k239j410l06m9q95
52930A60324j831j864j252r68j267j489j262j083j381j705j379n27J67M60O73
52915A45616R38R73O85M62N46O82O31O53J000J261Q38k4l83N0M54J18l83RJ167
52896A55293J781J100j23p59o70m10j75K11N55M47J17K58Q47R42J02p35m94M74
52878A58761R43O28M57J011J630J466O71l9m12o27n67N2R44J386J195R50J095
52861A69544J296J023L26k71m04o7N46J138J408J290J009P73O29P18J259K049
$$ plain form
52976 123099 124135 125014 126440 128160 129287 129637 129982 130879 131970 132855 133994 136048 138697 140883 142179
52961 142179 143238 144897 147416 150681 154553 158764 162936 166920 170738 174044 176178 177040 177484 178396 179692
52946 179692 180699 181188 181443 181389 180338 177876 174604 171621 169393 167447 165223 162984 161574 161268 161219 160324
52930 160324 158493 156629 155377 154409 153142 151653 150391 149308 147927 146222 144843 144316 144483 144943 145616
52915 145616 146554 147527 148212 148674 149220 149902 150533 151186 152186 153447 154285 154261 153878 153928 154382 154500 154117 154126 155293
52896 155293 157074 158174 158051 157292 156622 156212 156037 156248 156803 157250 157367 157625 158472 159414 159516 158781 158287 158761
52878 158761 159704 160332 160789 161800 163430 164896 165567 165528 165116 164489 163922 163974 164918 166304 167499 168449 169544
52861 169544 170840 171863 172189 171918 171514 171447 171993 173131 174539 175829 176838 177611 178240 178958 180217 182266
52845A82266K386J951J366J374J747J640Q85K16J68M62O17N88N38M78M64O74R95
52828A98815R40L17l76o20n73p35j182j628j985k383k709k668k298k015k044k170
52812A76686k145k043k098k360k699k895k712k068j230o91o79r32j068j025r68
52797A51073q51m55Q5J20p42j881k206j471o46o62j288j649j458j140r46p26n74
52780A34583q87j577j947j662j221j104j054p62n99j005j541j408o86k58n43j044
52764A17285j238j238j374j625j747j682j547j447j406j364j218j037j070j328
52750I7964j389j000o45r10j470j452p70l20o34j087q96k28K62M05M47L23j96
52733H8404q46r56l47M15P01M77J07j48l81r05j876k929l310k640j491q40r55
$$ plain form
52845 182266 184652 186603 187969 189343 191090 192730 193615 193831 193999 194461 195078 195666 196204 196682 197146 197820 198815
52828 198815 199755 200072 199696 199076 198503 197768 196586 194958 192973 190590 187881 185213 182915 180900 178856 176686
52812 176686 174541 172498 170400 168040 165341 162446 159734 157666 156436 155745 155066 154134 153066 152041 151073
52797 151073 150222 149767 149852 149972 149230 147349 145143 143672 143026 142364 141076 139427 137969 136829 135883 135157 134583
52780 134583 133696 132119 130172 128510 127289 126185 125131 124369 123770 122765 121224 119816 119130 118872 118329 117285
52764 117285 116047 114809 113435 111810 110063 108381 106834 105387 103981 102617 101399 100362 99292 97964
52750 97964 96575 95575 94930 94020 92550 91098 90328 90008 89374 88287 87391 87163 87425 87830 88277 88600 88404
52733 88404 87558 86602 86255 86670 87371 87848 87955 87807 87426 86521 84645 81716 78406 75766 74275 73435 72480
52716G2480j133o68K60Q72P82L53J38K00J48k76q22r90n63K28R71J364J310R29
52698G5583N55N32Q79J278J506J717K138K638K859K701K445K318K219J936J479
52683A02783J042P78P01Q05J049J240J076M36m42j156j523j661j713j680j592
52668A00143j646j974k376k518k369k205k167k031j593r88n32k84p1J60K01j87
52652G9563r83j881k436k282j399k43M98M57n8l58j20K33L4p37j308r67O1Q44
52634F8918P21j66j193j779j575n78P21J553J508Q92L06P3K13O93J361J784J575
52617G5027Q86K41j46n88j262j774j610q51o4L91N90O23L99N2J48J051K245K733
52599G8091K184J213M91l9p41j460j627j074k57L40O28P34P23O52O29O53O23N87
$$ plain form
52716 72480 71347 70679 70939 71811 72593 72946 73084 73284 73432 73156 72334 71344 70781 71009 71980 73344 74654 75583
52698 75583 76138 76670 77549 78827 80333 82050 84188 86826 89685 92386 94831 97149 99368 101304 102783
52683 102783 103825 104603 105304 106109 107158 108398 109474 109910 109468 108312 106789 105128 103415 101735 100143
52668 100143 98497 96523 94147 91629 89260 87055 84888 82857 81264 80276 79744 79460 79389 79549 79750 79563
52652 79563 78580 76699 74263 71981 70582 70339 70837 71294 71236 70878 70758 70991 71025 70288 68980 68013 68074 68918
52634 68918 69639 69473 68280 66501 64926 64348 65069 66622 68130 69022 69328 69401 69614 70307 71668 73452 75027
52617 75027 75913 76154 76008 75420 74158 72384 70774 69923 69859 70250 70840 71463 71862 71914 72062 73113 75358 78091
52599 78091 80275 81488 81979 81940 81199 79739 78112 77038 76781 77121 77749 78483 79206 79858 80487 81140 81763 82350
52581H2350P57J143J414J307R22N23K27N7N3J10j5l57o01m97j72J78O53J333J857
52562I1242J751J088M15R4J16M70J195J966K109J338J95m71k95L87R70J051O74
52545A04295K62K12M80P12P54Q17J074J361J438J300J070Q04O43Q20J310J596
52529A18948J209L96r6O4M42M87J90o5r9r8k57n26p02o25k44L48Q91J075Q30M28
52509A22596K27K75L02J00j69j34L87J145J595J322L89o64j293j432j422j438
52493A21786j222n25L61Q53P83N51N44O71O13K92j29n04o90m30M10J435J923J538
52475A28260O64p7m03k97L00J263J941J594L82o07n63J51O78Q66J153J545J437
52458A38287O49p5jO63J139J040N46o6n61o15p8O40R28P59O66R35J234J169P97
$$ plain form
52581 82350 83107 84250 85664 86971 87893 88416 88643 88700 88753 88863 88848 88491 87890 87393 87221 87399 88052 89385 91242
52562 91242 92993 94081 94496 94590 94706 95176 96371 98337 100446 101784 101979 101508 101213 101600 102570 103621 104295
52545 104295 104557 104769 105249 105961 106715 107532 108606 109967 111405 112705 113775 114579 115222 116042 117352 118948
52529 118948 120157 120553 120457 120521 120963 121450 121640 121575 121476 121378 121121 120595 119893 119268 119024 119372 120263 121338 122168 122596
52509 122596 122823 123098 123400 123500 123331 123197 123584 124729 126324 127646 128035 127371 126078 124646 123224 121786
52493 121786 120564 120039 120400 121253 122036 122587 123131 123802 124415 124707 124578 124074 123384 122954 123364 124799 126722 128260
52475 128260 128924 128847 128444 128147 128447 129710 131651 133245 133627 133020 132457 132608 133286 134152 135305 136850 138287
52458 138287 138936 138861 138860 139523 140662 141702 142248 142182 141621 141006 140928 141568 142496 143255 143921 144856 146090 147259 148056
52439A48056L73j07p80j538j923j543n04N16P48P9p61r74n60j71k32n02n54k44
52421A39379K67O95P23L12j06LN46R33R17Q61J021J153J101J191J589J766J202
52404A53553K83j49R2M91Q46J506K571L394L254K187R39K80M50J011J210O90q3
52387A72525l23J54P28P56J49p38j515j845j555q68l67m31q07r11m93J70O21O64
52369A65914M28J63M9J95O94J501K282K597K373K011J900J992K051K027J971J853
52353A90001J777J995K396K293J383N55R30K189K847K299J589J743K377K597K447
52338B19418K488K576K157J488J423K045K488K301K028K176K372K133J733J763
52324B48589K182K463K415K303K276K213K112K226K721L492M325N053N520N642
$$ plain form
52439 148056 148429 148322 147542 146004 144081 142538 142034 142550 143298 143377 142616 141642 141082 140911 140679 140177 139623 139379
52421 139379 139646 140341 141064 141376 141270 141273 141819 142752 143669 144530 145551 146704 147805 148996 150585 152351 153553
52404 153553 153836 153687 153779 154270 155116 156622 159193 162587 165841 168028 168967 169247 169697 170708 171918 172608 172525
52387 172525 172202 172356 173084 173840 173989 173251 171736 169891 168336 167468 167101 166670 165863 164952 164459 164629 165250 165914
52369 165914 166342 166505 166554 166749 167443 168944 171226 173823 176196 178207 180107 182099 184150 186177 188148 190001
52353 190001 191778 193773 196169 198462 199845 200400 201330 203519 206366 208665 210254 211997 214374 216971 219418
52338 219418 221906 224482 226639 228127 229550 231595 234083 236384 238412 240588 242960 245093 246826 248589
52324 248589 250771 253234 255649 257952 260228 262441 264553 266779 269500 272992 277317 282370 287890 293532
52310B93532N563N571N822O276O880P560Q020P989P810Q374J0087J2066J2936
52297C98486J2396J1506J1232J1348J1219J1112J1900J3501J4613J4307J3277
52286E34897J2936J3709J4793J5330J5200J4731J4271J4150J4534J5124J5319
52275F94994J4799J3718J2291J0631R011P859P201O497N366M098L162K521J858
52262G94006J240R46P52O0j196k204k195j385o77n71p47o07qP09J199J504J973
52245G92799K901M202N487O436P070P661Q322Q822Q941Q959R549J0971J2551J3255
52231I07926J2738J1572J0462R568Q711P881P151O433N614M857M325L712K487
52218A003437O41j170k366k991l440m007m839o048p499q755r520r999j0560j1217
$$ plain form
52310 293532 299095 304666 310488 316764 323644 331204 339224 347213 355023 363397 373484 385550 398486
52297 398486 410882 422388 433620 444968 456187 467299 479199 492700 507313 521620 534897
52286 534897 547833 561542 576335 591665 606865 621596 635867 650017 664551 679675 694994
52275 694994 709793 723511 735802 746433 755444 763303 770504 777001 782367 786465 789627 792148 794006
52262 794006 795246 796192 796944 797004 795808 793604 791409 790024 789347 788776 788029 787422 787414 788123 789322 790826 792799
52245 792799 795700 799902 805389 811825 818895 826556 834878 843700 852641 861600 871149 882120 894671 907926
52231 907926 920664 932236 942698 952266 960977 968858 976009 982442 988056 992913 997238 1000950 1003437
52218 1003437 1004078 1002908 1000542 997551 994111 990104 985265 979217 971718 962963 953443 943444 932884 921667
52204I21667j1688j1847j1775j1500j1026j0592j0451j0368r714q250o505n249
52192H02702m808n016n469n621n021l788k696k391k724l081l226l320l340k998
52178G49203k364k008k323l051l700m088m216m007l495l050k944k853k271j391
52164G07442j096j823k943l441k986k117j553j622k193k861l198l035k565k045
52150F73964j506r23n27o64j295k019k617l278m038m388l853k793k150k364k951
52135F38598l191k815j960q79l7o1j064k262k708k344j901j851j948j829j545
52120F12203j307j097q29n68m06l19l01m09n24l68J52R08J998L731N895P551Q018
52103F34328P734P638Q052Q743R832J1775J4450J7002J8714J9556J9755J9424
$$ plain form
52204 921667 909979 898132 886357 874857 863831 853239 842788 832420 822706 814456 807951 802702
52192 802702 797894 792878 787409 781788 776767 772979 770283 767892 765168 762087 758861 755541 752201 749203
52178 749203 746839 744831 742508 739457 735757 731669 727453 723446 719951 716901 713957 711104 708833 707442
52164 707442 706346 704523 701580 698139 695153 693036 691483 689861 687668 684807 681609 678574 676009 673964
52150 673964 672458 671535 671008 670344 669049 667030 664413 661135 657097 652709 648856 646063 643913 641549 638598
52135 638598 635407 632592 630632 629753 629716 629655 628591 626329 623621 621277 619376 617525 615577 613748 612203
52120 612203 610896 609799 608970 608402 607996 607677 607376 606967 606443 606075 606227 607135 609133 612864 618759 626310 634328
52103 634328 642062 649700 657752 666495 676327 688102 702552 719554 738268 757824 777579 797003
52091G97003J8869J8628J8906J9327J9507J9505J9371J8805J7601J6147J4977
52080I98646J4126J3253J2232J1208J0230R164P896O348M464K443P57l53j251
52067A089163k386l683m757n575o468p543q564r317r749r768r318q620p993p448
52053I87974o853o366o214o091n406m223l307l020k768j851l63J104K199K810
52039I47625K822K436K406L319M794N899O265O166N745M864L812L407L916M480
52025A007956M120L019K204K091J935Q66r74k619l432l686m054m817n782o814
52011I90013q064r662j1441j3145j4723j6196j7398j8108j8439j8738j9149j9504
$$ plain form
52091 797003 815872 834500 853406 872733 892240 911745 931116 949921 967522 983669 998646
52080 998646 1012772 1026025 1038257 1049465 1059695 1068859 1076755 1083103 1087567 1090010 1090767 1090414 1089163
52067 1089163 1086777 1083094 1078337 1072762 1066294 1058751 1050187 1040870 1031121 1021353 1012035 1003415 995422 987974
52053 987974 981121 974755 968541 962450 957044 952821 949514 946494 943726 941875 941512 942616 944815 947625
52039 947625 950447 952883 955289 958608 963402 969301 975566 981732 987477 992341 996153 999560 1003476 1007956
52025 1007956 1012076 1015095 1017299 1019390 1021325 1022191 1021217 1018598 1015166 1011480 1007426 1002609 996827 990013
52011 990013 981949 972287 960846 947701 932978 916782 899384 881276 862837 844099 824950 805446
$$ [...]
##END NTUPLES=NMR SPECTRUM
##END=
