##TITLE=NES1066_Nhol10911_9883663_4HlQrt3YVF
##JCAMPDX= 6.0         $$ Bruker NMR JCAMP-DX V2.0
##DATA TYPE= NMR SPECTRUM
##DATA CLASS= NTUPLES
##ORIGIN= BRUKER
##OWNER= Administrator
$$ 1.72 TOPSPIN		Version 2.1
$$ 2016-08-26 21:50:00.336 -0500  Administrator@X
$$ Compression mode = diff/dup
##.OBSERVE FREQUENCY= 400.02188249412
##.OBSERVE NUCLEUS= ^1H
##.ACQUISITION MODE= SIMULTANEOUS (DQD)
##.ACQUISITION SCHEME= undefined
##.AVERAGES= 8
##.DIGITISER RES= 22
##SPECTROMETER/DATA SYSTEM= spect
##.PULSE SEQUENCE= zg30
##.SOLVENT NAME= COFFEE_meoh
##.SHIFT REFERENCE= INTERNAL, COFFEE_meoh, 1, 14.98509
##AUDIT TRAIL= $$ (NUMBER, WHEN, WHO, WHERE, PROCESS, VERSION, WHAT)
$$ ##TITLE= Audit trail, TOPSPIN		Version 2.1
$$ ##JCAMPDX= 5.01
$$ ##ORIGIN= Bruker BioSpin GmbH
$$ ##OWNER= Administrator
$$ $$ E:\/data/COFFEE/nmr/NES1066_Nhol10911_9883663_4HlQrt3YVF/10/pdata/1/auditp.txt
$$ ##AUDIT TRAIL=  $$ (NUMBER, WHEN, WHO, WHERE, PROCESS, VERSION, WHAT)
(   1,<2016-08-26 21:49:53.195 -0500>,<Administrator>,<X>,<go>,<TOPSPIN 2.1>,
      <created by zg
	started at 2016-08-26 21:48:47.461 -0500,
	POWCHK enabled, PULCHK disabled,
       configuration hash MD5:
       21 0F 79 D6 B3 7B B4 F6 88 20 88 DB 03 48 BD 9F
       data hash MD5: 64K
       AE 29 14 C2 91 01 25 14 30 D1 83 C5 39 6C 7D 3F>)
(   2,<2016-08-26 21:49:56.304 -0500>,<Administrator>,<X>,<proc1d>,<TOPSPIN 2.1>,
      <Start of raw data processing
       efp LB = 0 FT_mod = 6 PKNL = 1 PHC0 = 0 PHC1 = 0 SI = 32K 
       data hash MD5: 32K
       28 7D 34 78 B3 3E 38 C5 68 ED 1A 75 D1 AB 6E 0D>)
(   3,<2016-08-26 21:49:56.586 -0500>,<Administrator>,<X>,<proc1d>,<TOPSPIN 2.1>,
      <pk PHC0 = 92.66968 PHC1 = 0 
       data hash MD5: 32K
       75 90 00 36 E2 06 5B 91 CF FA 77 84 37 2F 5A BB>)
(   4,<2016-08-26 21:49:56.679 -0500>,<Administrator>,<X>,<proc1d>,<TOPSPIN 2.1>,
      <abs ABSG = 1 
       data hash MD5: 32K
       E0 5F 29 32 70 7D 4B B5 FA 2E 6C C6 E9 21 27 E1>)
(   5,<2016-08-26 21:49:56.758 -0500>,<Administrator>,<X>,<proc1d>,<TOPSPIN 2.1>,
      <abs ABSG = 2 
       data hash MD5: 32K
       C4 E5 E8 A5 04 E3 09 23 0E FB BB 03 85 0B 3A 45>)
(   6,<2016-08-26 21:49:56.804 -0500>,<Administrator>,<X>,<proc1d>,<TOPSPIN 2.1>,
      <abs ABSG = 3 
       data hash MD5: 32K
       AB 4B 95 17 76 1F 35 3A 6B 0E D5 B2 C8 C3 0D 9B>)
(   7,<2016-08-26 21:49:56.867 -0500>,<Administrator>,<X>,<proc1d>,<TOPSPIN 2.1>,
      <abs ABSG = 4 
       data hash MD5: 32K
       FA 11 03 6C 2B D1 25 18 F6 73 59 F1 F3 EE 89 40>)
(   8,<2016-08-26 21:49:56.929 -0500>,<Administrator>,<X>,<proc1d>,<TOPSPIN 2.1>,
      <abs ABSG = 5 
       data hash MD5: 32K
       00 25 4F 01 78 BF 9C BD DB 86 10 D7 04 C9 B7 74>)
$$ ##END=
$$ 
$$ $$ hash MD5
$$ $$ BF 1C A3 F9 F4 5F 75 DF 55 48 6E 2E F5 0D 00 18
##$RELAX= 
##$RELAX= 
##$RELAX= 
##$RELAX= 
##$RELAX= 
##$RELAX= 
##$RELAX= 
$$ Bruker specific parameters
$$ --------------------------
##$DU= <E:\>
##$EXPNO= 10
##$NAME= <NES1066_Nhol10911_9883663_4HlQrt3YVF>
$$ [...]
150 150 150 150 150 150 150 150
##$TP07= 0
##$TPNAME0= <>
##$TPNAME1= <>
##$TPNAME2= <>
##$TPNAME3= <>
##$TPNAME4= <>
##$TPNAME5= <>
##$TPNAME6= <>
##$TPNAME7= <>
##$TPOAL= (0..7)
0.5 0.5 0.5 0.5 0.5 0.5 0.5 0.5
##$TPOFFS= (0..7)
0 0 0 0 0 0 0 0
##$TUNHIN= 0
##$TUNHOUT= 0
##$TUNXOUT= 0
##$USERA1= <user>
##$USERA2= <user>
##$USERA3= <user>
##$USERA4= <user>
##$USERA5= <user>
##$V9= 5
##$VALIST= <valist>
##$VCLIST= <CCCCCCCCCCCCCCC>
##$VD= 0
##$VDLIST= <DDDDDDDDDDDDDDD>
##$VPLIST= <PPPPPPPPPPPPPPP>
##$VTLIST= <TTTTTTTTTTTTTTT>
##$WBST= 2048
##$WBSW= 25
##$XGAIN= (0..3)
0 0 0 0
##$XL= 0
##$YL= 0
##$YMAX_a= 608924
##$YMIN_a= -512583
##$ZGOPTNS= <>
##$ZL1= 120
##$ZL2= 120
##$ZL3= 120
##$ZL4= 120
##$ABSF1= 14.98509
##$ABSF2= -5.573092
##$ABSG= 5
##$ABSL= 3
##$ALPHA= 0
##$AQORDER= 0
##$ASSFAC= 0
##$ASSFACI= 0
##$ASSFACX= 0
##$ASSWID= 0
##$AUNMP= <proc_prof1d_extract_pilot.lims>
##$AXLEFT= 0
##$AXNAME= <>
##$AXNUC= <1H>
##$AXRIGHT= 0
##$AXTYPE= 0
##$AXUNIT= <>
##$AZFE= 0.1
##$AZFW= 0.1
##$BCFW= 0
##$BC_mod= 0
##$BYTORDP= 0
##$COROFFS= 0
##$CY= 15
##$DATMOD= 1
##$DC= 0
##$DFILT= <>
##$DTYPP= 0
##$F1P= 0
##$F2P= 0
##$FCOR= 0.5
##$FTSIZE= 32768
##$FT_mod= 6
##$GAMMA= 0
##$GB= 0
##$INTBC= 1
##$INTSCL= 1
##$ISEN= 128
##$LB= 0
##$LEV0= 0
##$LPBIN= 0
##$MAXI= 10000
##$MC2= 0
##$MEAN= 0
##$ME_mod= 0
##$MI= 0
##$NCOEF= 0
##$NC_proc= -8
##$NLEV= 6
##$NOISF1= 0
##$NOISF2= 0
##$NSP= 0
##$NTH_PI= 0
##$NZP= 0
##$OFFSET= 14.98509
##$PC= 1
##$PHC0= 92.66968
##$PHC1= 0
##$PH_mod= 1
##$PKNL= yes
##$PPARMOD= 0
##$PPDIAG= 0
##$PPIPTYP= 0
##$PPMPNUM= 2147483647
##$PPRESOL= 1
##$PSCAL= 4
##$PSIGN= 0
##$PYNMP= <proc.py>
##$REVERSE= no
##$SF= 400.02
##$SI= 32768
##$SIGF1= 0
##$SIGF2= 0
##$SINO= 400
##$SIOLD= 32768
##$SPECTYP= <>
##$SREGLST= <1H.CDCl3>
##$SSB= 0
##$STSI= 32768
##$STSR= 0
##$SW_p= 8223.68421052631
##$SYMM= 0
##$S_DEV= 0
##$TDeff= 65536
##$TDoff= 0
##$TI= <>
##$TILT= no
##$TM1= 0
##$TM2= 0
##$TOPLEV= 0
##$USERP1= <user>
##$USERP2= <user>
##$USERP3= <user>
##$USERP4= <user>
##$USERP5= <user>
##$WDW= 1
##$XDIM= 32768
##$YMAX_p= 445183029
##$YMIN_p= -681880
##$CURPLOT= <Network HP LaserJet P1505>
##$CURPRIN= <$Network HP LaserJet P1505>
##$DFORMAT= <normdp>
##$LAYOUT= <+/1D_H.xwp>
##$LFORMAT= <normlp>
##$PFORMAT= <normpl>
##$SURQMSG= 1
$$ End of Bruker specific parameters
$$ ---------------------------------
##NTUPLES= NMR SPECTRUM
##VAR_NAME=  FREQUENCY,     SPECTRUM/REAL,   SPECTRUM/IMAG
##SYMBOL=    X,             R,               I
##VAR_TYPE=  INDEPENDENT,   DEPENDENT,       DEPENDENT
##VAR_FORM=  AFFN,          ASDF,            ASDF
##VAR_DIM=   32768,         32768,           32768
##UNITS=     HZ,            ARBITRARY UNITS, ARBITRARY UNITS
##FACTOR=    0.250966925370066, 1,           1
##FIRST=     8223.43324360094, -47939,       -51073
##LAST=      0,             38983,           -193897
##MIN=       0,             -681880,         0
##MAX=       8223.43324360094, 445183029,    0
$$ Real data points
##PAGE= N=1
##DATA TABLE= (X++(R..R)), XYDATA
$$ [...]
19501b40867b869A91564b57081A27120a40936A82477a43645I8320h3653r7325
$$ -240867 -2869 191564 -257081 127120 -140936 182477 -143645 98320 -83653 -180978
19491a80978E4679a71118g0163K2595j54142m4381d0035k56309A31382d29517
$$ -180978 54679 -171118 -70163 -47568 -201710 -246091 -40035 -296344 131382 -429517
19480e5167M039B82019g9210c2767l7692l3095a0106b440j5994k94643g1600K4978
$$ -55167 -51128 282019 -79210 -32767 -70459 -103554 -10106 -2440 -18434 -313077 -71600 -46622
19468d6622j40746k77130a92697Q4190d0943E0118i704C45885c58617G8394a82063
$$ -46622 -187368 -464498 -192697 -108507 -40943 50118 -9704 345885 -358617 78394 -182063
19456b75673E5881b9373k53867a02401M0967k11033a2463F6654f2397A41702a38637
$$ -275673 55881 -29373 -283240 -102401 -61434 -272467 -12463 66654 -62397 141702 -138637
19444h8743m3327d8928l7835m368J2440j86407g1552j8648k80976h88q3756m5403
$$ -88743 -132070 -48928 -86763 -91131 -78691 -265098 -71552 -90200 -371176 -888 -84644 -130047
19432a30047B19455b34834k10498d9355k2062A39124h0703j25671I6294a86356
$$ -130047 219455 -234834 -445332 -49355 -71417 139124 -80703 -206374 96294 -186356
19421A12720F293f251k00270g0145k25377a12132j71014D3230i0439C1057c45983
$$ 112720 6293 -6251 -206521 -70145 -295522 -112132 -283146 43230 -90439 31057 -345983
19409a23666B52127d2696A74363A3700M1511A9265b40298F098M5302c2655l21792
$$ -123666 252127 -42696 174363 13700 55211 19265 -240298 6098 51400 -32655 -354447
19398c54447b8918A37603k7527J01870m1380p3596K2918l0145g1626j37017j01772
$$ -354447 -28918 137603 110076 211946 170566 96970 119888 89743 -71626 -208643 -310415
19387c10415O8590a05701i635A251b03418A1129f4072k4565j48308r7005e3451
$$ -310415 -241825 -105701 -9635 1251 -203418 11129 -64072 -88637 -236945 -333950 -53451
19375a65179H7348d6396m1215B9416L51147G7873j4348b11213i0435B2586a52321
$$ -165179 87348 -46396 -87611 29416 380563 77873 63525 -211213 -90435 22586 -152321
19363b4106k08657e2813j30395k21051A24258C6078b82874a25201A09681J95249
$$ -24106 -232763 -52813 -183208 -404259 124258 36078 -282874 -125201 109681 304930
19353C04930a62516F982a48356k25241a24689d3043A10176c95269a79445P8213
$$ 304930 -162516 6982 -148356 -373597 -124689 -43043 110176 -395269 -179445 -101232
19343a01232k03236q7081J82649R4541B8673K4944b82954E7626b68779a22933
$$ -101232 -304468 -391549 -208900 -114359 28673 53617 -282954 57626 -268779 -122933
19332g6253B6268P4184D2940i6604q3751c8316A2146J70878a59164H273b55132
$$ -76253 26268 100452 42940 -96604 -180355 -38316 12146 183024 -159164 8273 -255132
19320c12606A70052b41937i7278j72319J5879B3607a05149B64827g2309A9048
$$ -312606 170052 -241937 -97278 -269597 -253718 23607 -105149 264827 -72309 19048
19309b03963c6556K873A4746L12622F4656N2248b03508k1363g2412A00380c92101
$$ -203963 -36556 -33683 14746 327368 64656 116904 -203508 -224871 -72412 100380 -392101
19297b84330K0833G7483J5205J60309a24554A0159P2030g5899j67957n905A54019
$$ -284330 -263497 77483 92688 252997 -124554 10159 82189 -75899 -243856 -249761 154019
19285a61112N8961j3327p200E6857k3578b60510N7668D82991A16923J7981a10772
$$ -161112 -102151 -115478 -122678 56857 33279 -260510 -202842 482991 116923 134904 -110772
19273c6912j14224N9543N714A39526c61946a9681B8217K5421a81764G979c17899
$$ -36912 -151136 -91593 -85879 139526 -361946 -19681 28217 53638 -181764 7979 -317899
19261a37977c1848r612A94705a43147A44203A4238a76672q281A13922J92220e5692
$$ -137977 -31848 -41460 194705 -143147 144203 14238 -176672 -184953 113922 306142 -55692
19249a10650k0760G8848d6117j70532B41757a47453G5b97703d9470l2637j99876
$$ -110650 -131410 78848 -46117 -216649 241757 -147453 75 -297703 -49470 -82107 -281983
19238b81983J05293a0053j92676Q3863J1339b3846A41626a22152j04047D5504
$$ -281983 -176690 -10053 -202729 -118866 -107527 -23846 141626 -122152 -226199 45504
19227a04861J0908j57036D9055O3551A5487a37854b770B38281A3181M5684K15493
$$ -104861 -93953 -250989 49055 112606 15487 -137854 -2770 238281 13181 58865 274358
19216B74358E137b42735g6230j57324A50515b52465B32758g7981J0110A5937a15226
$$ 274358 5137 -242735 -76230 -233554 150515 -252465 232758 -77981 -67871 15937 -115226
19204a13711m4604k03892a00680A5688a12484j55302D1331b54496B33258b1544
$$ -113711 -158315 -362207 -100680 15688 -112484 -267786 41331 -254496 233258 -21544
19193H6336b06861a3822l4867l61312f7090A36696M4345b31763A48491C3906i6885
$$ 86336 -206861 -13822 -48689 -410001 -67090 136696 181041 -231763 148491 33906 -96885
19181b16989e4173j11030l4802k00992H5929K33293a14951b6015l27122B82663
$$ -216989 -54173 -165203 -200005 -400997 85929 319222 -114951 -26015 -353137 282663
19170b7523A31297a58896A13566i8546n1400e8034E5227l74g3187j42078h2744
$$ -27523 131297 -158896 113566 -98546 -149946 -58034 55227 54853 -73187 -215265 -82744
19158b85909J9685E085a91807c5684j04136o7464f894k8916a0976n8686j63793
$$ -285909 -266224 5085 -191807 -35684 -139820 -207284 -6894 -35810 -10976 -69662 -233455
19147b33455B04885b50932n3598g6503j57460C6818N9850b69680I445b91733Q4542
$$ -233455 204885 -250932 -304530 -76503 -233963 36818 96668 -269680 9445 -291733 -207191
19136b07191I7695a38182j42673B91221j39434f3153B66319H6398i7717E425J15051
$$ -207191 97695 -138182 -280855 291221 151787 -63153 266319 86398 -97717 5425 120476
19125A20476Q2649A5427a92540O7872k34490a50447B21170C3373a39476j46118
$$ 120476 203125 15427 -192540 -124668 -359158 -150447 221170 33373 -139476 -285594
19115b85594F7411C2064a70193h986a553F0440K6124a40952a4075k88396L379
$$ -285594 67411 32064 -170193 -8986 -1553 60440 86564 -140952 -14075 -302471 -299092
19104b99092A24378f3390p8884E002J73534b58001J10511k9890d691A75804a38470
$$ -299092 124378 -63390 -142274 5002 178536 -258001 -147490 -177380 -4691 175804 -138470
19092a21579J8417F3273L59725B10066i7020Q523j33197B77545P9586N6454g7844
$$ -121579 -103162 63273 422998 210066 -97020 -88497 -221694 277545 357131 413585 -77844
19080A44323a61248D9485b38570F4515N10445c30399D5337c1207k28389Q0713
$$ 144323 -161248 49485 -238570 64515 574960 -330399 45337 -31207 -259596 -178883
19070a78883I9741i4082k51830A4545J86000b81470a30899C44995a58297j01255
$$ -178883 99741 -94082 -345912 14545 200545 -281470 -130899 344995 -158297 -259552
19060b59552i4049b7989A02957J5953M891C7013a90142j00979a16561j76901a16015
$$ -259552 -94049 -27989 102957 118910 123801 37013 -190142 -291121 -116561 -293462 -116015
19048g9723G0580J56112g3197j2980d1399G7908J83533m9062F0553a86265I8917
$$ -79723 70580 226692 -73197 -86177 -41399 77908 261441 212379 60553 -186265 98917
19036b12161i0282C752c3662j06991I54g4243b1899m3524C2152c1457j0210A30972
$$ -212161 -90282 3752 -33662 -140653 954 -74243 -21899 -65423 32152 -31457 -41667 130972
19023G5456K8852J46686a92607M5523F5382L10904h2502j15828J9930n960A7002
$$ 75456 104308 250994 -192607 -147084 65382 376286 -82502 -198330 -178400 -184360 17002
19011b25538f9995J290l14298C21455a93776C4186b08904B28491h1573a6604j13786
$$ -225538 -69995 -68705 -383003 321455 -193776 34186 -208904 228491 -81573 -16604 -130390
19000a30390M6808a1026r4872B08635a28394o1945F8583a55106F3049c4287o8268
$$ -130390 -83582 -11026 -105898 208635 -128394 -190339 68583 -155106 63049 -34287 -102555
18989a02555k35611g0796A77992A1630N9472e25777A40644C9033h7418k0175A15100
$$ -102555 -338166 -70796 177992 11630 71102 -525777 140644 39033 -87418 -107593 115100
18977A04116B3698A955g0451C52884c43905a67353c2441j21476G3561a10100A32821
$$ 104116 23698 1955 -70451 352884 -343905 -167353 -32441 -153917 73561 -110100 132821
18965A55446m8976l2874J17185n0611a97443A68551c7032j08751j37275A03566
$$ 155446 106470 73596 190781 140170 -197443 168551 -37032 -145783 -283058 103566
18954d4099d074H6347d5188B9667c4206A29326c91813a66104G238f1806A04163
$$ -44099 -4074 86347 -45188 29667 -34206 129326 -391813 -166104 7238 -61806 104163
18942A2319c25592a25999o6149F4351a38459d976q2659j37815o4274B7458a35576
$$ 12319 -325592 -125999 -192148 64351 -138459 -4976 -87635 -225450 -289724 27458 -135576
18930b04580J01527J686A75282e1510m0921c8525r5874C29669e2824C6069J1143
$$ -204580 -103053 -101367 175282 -51510 -92431 -38525 -134399 329669 -52824 36069 47212
18919D7212a91490E8256r944k3898a676A87619l2931d6769k69520a06864h33o8485
$$ 47212 -191490 58256 48312 24414 -1676 187619 154688 -46769 -316289 -106864 -833 -69318
18907f9318D0313a9944j98780A68968A5591K20679H4949K35867j46816J28835
$$ -69318 40313 -19944 -218724 168968 15591 236270 84949 320816 174000 302835
18897C02835a54482D65763a21204j86942B32302d00414I3020j4114b84993e6654
$$ 302835 -154482 465763 -121204 -308146 232302 -400414 93020 78906 -284993 -56654
18886a96307f337q4169o0297m5737e0107I5123b00710A52440b26863c6941k61966
$$ -196307 -6337 -90506 -150803 -196540 -50107 95123 -200710 152440 -226863 -36941 -298907
18875b98907i9661L2909G5129e6925j15949F4187a17366B24451D6203J35114a16264
$$ -298907 -99661 -66752 75129 -56925 -172874 64187 -117366 224451 46203 181317 -116264
18863a29547R634P459c991k05412j42686H5467J22399I0649J5708l0904b93786
$$ -129547 -119913 -112454 -3991 -209403 -352089 85467 207866 90649 106357 75453 -293786
18851e6021D20877b7379r5068a1082k15874b6644H7580a27348A04553C337P7771
$$ -56021 420877 -27379 -122447 -11082 -226956 -26644 87580 -127348 104553 3337 81108
18840H1108l8224b5038A42875a22912F2927c6736r6975j8313J9907M5467j36058
$$ 81108 42884 -25038 142875 -122912 62927 -36736 -133711 -152024 -132117 -86650 -222708
18829b22708J08017M5167D0632e9762j40836A95296G3246A4474K0835j6700d44681
$$ -222708 -114691 -69524 40632 -59762 -200598 195296 73246 14474 35309 18609 -444681
18817G102N3672J19547a00270j40689A98154a82800A56156D6188a10135b0749
$$ 7102 60774 180321 -100270 -240959 198154 -182800 156156 46188 -110135 -20749
18806f2358F4614J42436J5573q9153G418c9813j57373I7835h8546j93338A65165
$$ -62358 64614 207050 222623 133470 7418 -39813 -197186 97835 -88546 -281884 165165
18794c80563C93746F1406A4893Q627J04181C7708J29491i686A61830b57681i6281
$$ -380563 393746 61406 14893 23520 127701 37708 167199 -9686 161830 -257681 -96281
18782d5446A99191a93253M4951P896K5152k38507a5435l9375j32597j47154H3136
$$ -45446 199191 -193253 -148302 -140406 -115254 -353761 -15435 -54810 -187407 -334561 83136
18770A04692a29200H2698A1901R1121L1118a1686j13237c0198o8374E2975c0183
$$ 104692 -129200 82698 11901 103022 134140 -11686 -124923 -30198 -98572 52975 -30183
18758c2632A56922R2985h1116j71189g895H0450a44248e2967j92008d3348a4563
$$ -32632 156922 249907 -81116 -252305 -7895 80450 -144248 -52967 -244975 -43348 -14563
18746c03896I9037a27582K3884B0592a15201A88989h3586o368C57727a40943a0764
$$ -303896 99037 -127582 -103698 20592 -115201 188989 -83586 -89954 357727 -140943 -10764
18734a84746c3323m34050a24100j06872j3459M841I4732d26782a52585J5193b3725
$$ -184746 -33323 -467373 -124100 -230972 -244431 -239590 94732 -426782 -152585 -137392 -23725
18722g2572j19032d3569D0963P9081J04303a09100k4973A08789a09701A6295K30596
$$ -72572 -191604 -43569 40963 120044 224347 -109100 -134073 108789 -109701 16295 246891
18711B46891i2075j66755A23259h1791j07595A4122a11625o523l731F5472r055
$$ 246891 -92075 -258830 123259 -81791 -189386 14122 -111625 -118148 -121879 65472 56417
18700E6417a04344k6755Q681B01553a00188C6918J403L7263c8839k31291n4676
$$ 56417 -104344 -131099 -122418 201553 -100188 36918 38321 75584 -38839 -270130 -324806
18689c24806A05974L4978J05020d41185B39205c79964I6614j9831Q4639i0432
$$ -324806 105974 140952 245972 -441185 239205 -379964 96614 76783 161422 -90432
18678I9780a47838O2807e008k27448R429b8959B68246a63182e4940p4643D2059
$$ 99780 -147838 -85031 -5008 -232456 -223027 -28959 268246 -163182 -54940 -129583 42059
18666E2938a40415j53372A5072J4826d5651A260J31928J0855o7895a55750j861
$$ 52938 -140415 -293787 15072 29898 -45651 1260 133188 144043 76148 -155750 -157611
18655a57611A6606e8653o1388C8610Q1464c36382A46676P4429a34868B32936b70371
$$ -157611 16606 -58653 -120041 38610 120074 -336382 146676 221105 -134868 232936 -270371
18643G9389a350A2351a7836D0464f8353A03711c32601J03155J00852c4177A66568
$$ 79389 -1350 12351 -17836 40464 -68353 103711 -332601 -229446 -128594 -34177 166568
18631a12060j36077k76683K22808e1298n5644j24988N5955M1316N3015A48662
$$ -112060 -248137 -524820 -302012 -51298 -106942 -231930 -175975 -134659 -81644 148662
18620A67131b51194q486c7830B1476d6779l4438D3304J27106b3206F3572d5549
$$ 167131 -251194 -259680 -37830 21476 -46779 -81217 43304 170410 -23206 63572 -45549
18608b44076d2278r5186c9588j82945B25309h352l3984B38940a14648A97470c9261
$$ -244076 -42278 -137464 -39588 -222533 225309 -8352 -42336 238940 -114648 197470 -39261
18596f7209j62748J11063d333l11881A4242c6777B98830g5539h613H2049a49002
$$ -67209 -229957 -118894 -4333 -316214 14242 -36777 298830 -75539 -8613 82049 -149002
18584a29179l8434f029k54008a20350N1230b5398F6707B5120P5301k562M1529
$$ -129179 -167613 -6029 -260037 -120350 -69120 -25398 66707 25120 100421 97859 139388
18573A39388a01534k45116a02250q4155G2276e15406b9748m36523C5870O0714
$$ 139388 -101534 -346650 -102250 -186405 72276 -515406 -29748 -466271 35870 96584
18563I6584d6227j97131c0923k83636a30816N1336I731K37665c0114C8288h5807
$$ 96584 -46227 -243358 -30923 -314559 -130816 -79480 9731 247396 -30114 38288 -85807
18551g7380o9422A56463b86606e7747A52488c98666a77203e3177G042J35217E3831
$$ -77380 -146802 156463 -286606 -57747 152488 -398666 -177203 -53177 7042 142259 53831
18539a59647b0437k21735m05973H6953f963n623E4553L61141a47028c315B7084
$$ -159647 -20437 -242172 -648145 86953 -6963 -12586 54553 415694 -147028 -3315 27084
18527b58257i0010p9742e0553A36574O2400f4577I97a94370o3547h9008j75158
$$ -258257 -90010 -169752 -50553 136574 198974 -64577 997 -194370 -257917 -89008 -264166
18516b64166d3421E7297Q427a39605C0358J30503E0412C650N5122r877J0388K4257
$$ -264166 -43421 57297 65724 -139605 30358 160861 50412 3650 58772 48895 59283 83540
18504H3540A815J62676a94461j19681J49770P7596j90302H7998N6613J4690f8366
$$ 83540 1815 164491 -194461 -314142 -164372 -86776 -277078 87998 144611 159301 -68366
18492B36578b63125J09940F682J54777a59788A7830O9706k4023b37292k03251
$$ 236578 -263125 -153185 6682 161459 -159788 17830 87536 63513 -237292 -440543
18482d40543B53346a91066A54572O210G1195K07625a71377I1150M8280a80172
$$ -440543 253346 -191066 154572 160782 71195 278820 -171377 91150 139430 -180172
18471b76442A05957b73799P9767A93159f7528A39684n7471b13356A47409a20180
$$ -276442 105957 -273799 -194032 193159 -67528 139684 82213 -213356 147409 -120180
18460C28978a43592A76857f0809A36918E662N5147J3068n811q832b37486f5048
$$ 328978 -143592 176857 -60809 136918 5662 60809 73877 68066 59234 -237486 -65048
18448A18269c79926a1941F811M6127A5157b50291a19431D9574a15532L3083j40713
$$ 118269 -379926 -11941 6811 52938 15157 -250291 -119431 49574 -115532 -82449 -223162
18437b23162E1444a10890a6811D1293a62021C95615a89017G1531e7313B22169
$$ -223162 51444 -110890 -16811 41293 -162021 395615 -189017 71531 -57313 222169
18426d3777j4834A16457a22874a6703C7307a90193C2488D198M4928Q9849L7145
$$ -43777 -58611 116457 -122874 -16703 37307 -190193 32488 4198 49126 138975 176120
18415A76120G7064a56143C2326K59530c06688J20544h3653B6943k834J10368E9874
$$ 176120 77064 -156143 32326 291856 -306688 -186144 -83653 26943 24109 134477 59874
18403a16737A07432J65821j24939B7708a25542A39407d2039A94125a3201j23845
$$ -116737 107432 273253 148314 27708 -125542 139407 -42039 194125 -13201 -137046
18393a37046b2268j52408q554D5436b42144a19145A33703o4792a98320R0717A20468
$$ -137046 -22268 -174676 -183230 45436 -242144 -119145 133703 68911 -198320 -107603 120468
18381a40165k6404A5509a57915M6177A10494G036C060b44938D54277c9046k89896
$$ -140165 -166569 15509 -157915 -111738 110494 7036 3060 -244938 454277 -39046 -328942
18370c28942B49434c20502N4378J02789E7540K22202E2203J99903C3965K25939
$$ -328942 249434 -320502 -266124 -163335 57540 279742 52203 252106 33965 259904
18360B59904C9476K25193a60259A18230m7946J30022a58829J3051G2818J38070
$$ 259904 39476 264669 -160259 118230 70284 200306 -158829 -145778 72818 210888
18350B10888f5441j11775P4481A68677b1353l10287a06845A0451O246b44563R4498
$$ 210888 -65441 -177216 -102735 168677 -21353 -331640 -106845 10451 16697 -244563 -150065
18339a50065f8898A25307i6700F6724P3391b4014j29517B3153b26651B63936b60178
$$ -150065 -68898 125307 -96700 66724 140115 -24014 -153531 23153 -226651 263936 -260178
18327f8698E8602R1077b04264g8730r2019F1585L7178b44909e8390P554A92212
$$ -68698 58602 149679 -204264 -78730 -170749 61585 98763 -244909 -58390 -50836 192212
18315C84029C9137a70110k78238a69818D0989b71025A03964c5534l41773c4374
$$ 384029 39137 -170110 -448348 -169818 40989 -271025 103964 -35534 -377307 -34374
18304a03371a7766P834A30250d3694F3106L8459c19169O0874J09986e7508m7953
$$ -103371 -17766 -9932 130250 -43694 63106 101565 -319169 -258295 -148309 -57508 -105461
18293a05461A45451A8948J53863G1027i8394A9773g7403a2281o2792E9091b70188
$$ -105461 145451 18948 172811 71027 -98394 19773 -77403 -12281 -75073 59091 -270188
18281c45050d1635D6921M8367a08661j28215c5649q4933k02754L892a01140l67286
$$ -345050 -41635 46921 95288 -108661 -236876 -35649 -120582 -323336 -319444 -101140 -468426
18270d68426a8151j84281a9975j50177A53820n7481b25139h3414j64330e6920
$$ -468426 -18151 -202432 -19975 -170152 153820 96339 -225139 -83414 -247744 -56920
18259h5898A3393b21113A1101K65394b4532D9710J09540G2196E024g1776B16084
$$ -85898 13393 -221113 11101 276495 -24532 49710 159250 72196 5024 -71776 216084
18247b86240F7017b53799A18588b57440e9257b3446j56710r3728G2033b95004
$$ -286240 67017 -253799 118588 -257440 -59257 -23446 -180156 -273884 72033 -295004
18236a43015m23B5858J72115N5538F294b75062C6526L73263A0818a23583D7499
$$ -143015 -143438 25858 197973 253511 6294 -275062 36526 409789 10818 -123583 47499
18224f1948j04060K6714f9096j3500o8402O1852B23463i6714j99907q1894R8511
$$ -61948 -166008 -139294 -69096 -82596 -150998 -89146 223463 -96714 -296621 -378515 -280004
18213b80004B2164a13659b7450j64332B96137b8670q014k18050B6163I197J10295
$$ -280004 22164 -113659 -27450 -191782 296137 -28670 -36684 -254734 26163 9197 119492
18202A19492E3645g6117A03242Q4037a65366G095b00681A53784h7307K3505b5286
$$ 119492 53645 -76117 103242 187279 -165366 7095 -200681 153784 -87307 -63802 -25286
18190B39904b06870A34184l0858a73289l9473F5816P209d50961i392j41995l89414
$$ 239904 -206870 134184 103326 -173289 -212762 65816 73025 -450961 -9392 -151387 -540801
18179e40801A44788J31627q2339p8846b80832h6607j15454A54245d4831B65130
$$ -540801 144788 276415 194076 115230 -280832 -86607 -202061 154245 -44831 265130
18168G2523a47502c6204k95833F5669J84811O0979B7154M575K3112R1304b5236
$$ 72523 -147502 -36204 -332037 65669 250480 311459 27154 31729 54841 146145 -25236
18156a15973A04158a95683a9148c020k47576g0965G6045a38393A54783J72391
$$ -115973 104158 -195683 -19148 -3020 -250596 -70965 76045 -138393 154783 327174
18146C27174G9736l6666g3941A15307a30532k10082G3461K37084l3209a68733
$$ 327174 79736 43070 -73941 115307 -130532 -340614 73461 310545 277336 -168733
18135a04893B4329d0476a0788D9947M3626a40851A46901j9206a04182H8276l8265
$$ -104893 24329 -40476 -10788 49947 93573 -140851 146901 127695 -104182 88276 50011
18124E0011a75155j3129D5339J14436d7949A89361J4422p0824a16203A07206a12493
$$ 50011 -175155 -188284 45339 159775 -47949 189361 203783 132959 -116203 107206 -112493
18112A97277E5753f509B24663b60958B17460a24117j10504L4747C3480h722A76345
$$ 197277 55753 -6509 224663 -260958 217460 -124117 -234621 -199874 33480 -8722 176345
18100b55048I6377L7662J78332h3796m0685N8649E8205J08118J23236A14562J2480
$$ -255048 96377 134039 312371 -83796 -124481 -65832 58205 166323 289559 114562 127042
18089A27042c11996g5680k5359d2288B01171A9043Q2750a05089q6308B07928b6202
$$ 127042 -311996 -75680 -101039 -42288 201171 19043 101793 -105089 -191397 207928 -26202
18077a54783P3498l34914B08029n8207a70305f9539l1461C0750b26195A2296a38294
$$ -154783 -81285 -416199 208029 149822 -170305 -69539 -101000 30750 -226195 12296 -138294
18065a38661e5773A6463g6948n200a7987k5910o2760j3013B22678f5155B42520
$$ -138661 -55773 16463 -76948 -82148 -17987 -43897 -106657 -119670 222678 -65155 242520
18053A39578a64648b159j92881B11934j7684b4022B75339A36684C9612b21428
$$ 139578 -164648 -2159 -195040 211934 194250 -24022 275339 136684 39612 -221428
18042a36879E0308a00393H6408M7665a59733a5755k57990A04159b25105J07742
$$ -136879 50308 -100393 86408 134073 -159733 -15755 -273745 104159 -225105 -117363
18032a17363N4051k89577a6300k7312j52264C58160a5306A39082c49681B25753
$$ -117363 -63312 -352889 -16300 -43612 -195876 358160 -15306 139082 -349681 225753
18021A17520b8738l1702j41030e2739A11619l9219C622L69248b84547A47574c4409
$$ 117520 -28738 -60440 -201470 -52739 111619 72400 3622 372870 -284547 147574 -34409
18009a01840m24498d7936A57382p4764J5477i8882a4765N868r2105j627j80472
$$ -101840 -526338 -47936 157382 82618 98095 -98882 -14765 -8897 -101002 -102629 -283101
17998b83101f3075C1787J56608J00567j30195L150J79469b2444j10685F8923a60711
$$ -283101 -63075 31787 188395 288962 158767 161917 341386 -22444 -133129 68923 -160711
17986D7883q208g0328D8545c3716m913n3751d320r7749c6658m35846H247K8588
$$ 47883 39675 -70328 48545 -33716 -38629 -92380 -4320 -102069 -36658 -472504 8247 36835
17974C6835L17425D5306L6458A3565J03466a28154B18336k9935B5111a63145D816
$$ 36835 354260 45306 81764 13565 117031 -128154 218336 188401 25111 -163145 4816
17962A31281g4406B17277H7820j3998K32822a7645A40048b5449a0857A37379g6453
$$ 131281 -74406 217277 87820 73822 306644 -17645 140048 -25449 -10857 137379 -76453
17950C6864K13883a32591A69171a94237C099h618B95178G7753R2154O3074c3671
$$ 36864 250747 -132591 169171 -194237 3099 -8618 295178 77753 169907 232981 -33671
17938a7303C63534a85150P0743o7340I1110P4977B2564b74678b9816A80300g4713
$$ -17303 363534 -185150 -114407 -181747 91110 166087 22564 -274678 -29816 180300 -74713
17926C2349e8321D232a34582c7084p2036A07348a06687r6582G5785q449a23207
$$ 32349 -58321 4232 -134582 -37084 -109120 107348 -106687 -203269 75785 67336 -123207
17914C08174h7278B09546a16904A79054a88571A38158f6798p4503b0897n7233
$$ 308174 -87278 209546 -116904 179054 -188571 138158 -66798 -141301 -20897 -78130
17904g8130C36558E9992a73700A58209B0137c99447J09102a09161l9334H085d3273
$$ -78130 336558 59992 -173700 158209 20137 -399447 -290345 -109161 -148495 8085 -43273
17892f977A52933p9p3243l5638L2031Q2912n1035J53548A06702O1497F0137L9203
$$ -6977 152933 152854 79611 43973 76004 158916 107881 261429 106702 168199 60137 99340
17880I9340C1992g4887A93097D5263d2943a3975A9927J89248g4690B45457N087
$$ 99340 31992 -74887 193097 45263 -42943 -13975 19927 209175 -74690 245457 250544
17869B50544a24375C6756h748l10296a10259A82600a24605B40903b9956A28192
$$ 250544 -124375 36756 -8748 -319044 -110259 182600 -124605 240903 -29956 128192
17858A53361c53549a9750j00713B9535i0138j02268g4682m4226G1927c75094I8937
$$ 153361 -353549 -19750 -120463 29535 -90138 -192406 -74682 -118908 71927 -375094 98937
17846c03758h0400D8405c20709D2328c2752r8866N091N3530C5198O4512C0441
$$ -303758 -80400 48405 -320709 42328 -32752 -131618 -126527 -72997 35198 99710 30441
17834A20229M8190a68389k9150A97674g4838B43599F3335b37884A06808J1655
$$ 120229 168419 -168389 -197539 197674 -74838 243599 63335 -237884 106808 118463
17824A18463a42753f1268A1374J52087D6182c7675l0421j284B47481H9184O6317
$$ 118463 -142753 -61268 11374 163461 46182 -37675 -68096 -69380 247481 89184 155501
17813A55501d8443b2632g990l7294I1345P9294a60497D6927J09579p4855L43488
$$ 155501 -48443 -22632 -7990 -45284 91345 170639 -160497 46927 156506 81651 425139
17802D25139D7336L59033h5503k5956b8835l41406A24679a38196H6811O5277a55929
$$ 425139 47336 406369 -85503 -111459 -28835 -370241 124679 -138196 86811 152088 -155929
17790d3095j02635B04677c4019r7349G7670P3009K42567b67011h959A98346i9502
$$ -43095 -145730 204677 -34019 -131368 77670 150679 393246 -267011 -8959 198346 -99502
17778B0711a7656A61266J27310g7961B50942j04101o0007c41083j06350D7669
$$ 20711 -17656 161266 288576 -77961 250942 146841 86834 -341083 -447433 47669
17767a48553d7193j0479k6302K7514D0093J14461j6933D4110d2486N560D8027
$$ -148553 -47193 -57672 -83974 -56460 40093 154554 137621 44110 -42486 -36926 48027
17755C24082b53420P6644M5683G8718B6466N5164K8637L8307c9705B58252G3340
$$ 324082 -253420 -176776 -131093 78718 26466 81630 110267 148574 -39705 258252 73340
17743a56431C82790p8566A24354J02796a36641B83155d7483B1425l370c2865F941
$$ -156431 382790 304224 124354 227150 -136641 283155 -47483 21425 18055 -32865 6941
17731f1063J7467B55436A00705D5437a93387c1229B65865E5737e24669I0050J2416
$$ -61063 -43596 255436 100705 45437 -193387 -31229 265865 55737 -524669 90050 102466
17720A02466b51341n0375G0178O0317K6616k142G0036b39451b6999A91053J27488
$$ 102466 -251341 -301716 70178 130495 157111 154969 70036 -239451 -26999 191053 318541
17709C18541K1457b91339i6275A11735l7339K67954A57059Q9082b2478O193l24812
$$ 318541 339998 -291339 -96275 111735 74396 342350 157059 246141 -22478 -16285 -341097
17698c41097i5114D8263b25893i4350l7847G3848a06358b6987B5274K52001j14968
$$ -341097 -95114 48263 -225893 -94350 -132197 73848 -106358 -26987 25274 277275 162307
17687A62307m7578d3841A02456i2827o7578I0938b79157A6461J61419b8365A63671
$$ 162307 114729 -43841 102456 -92827 -160405 90938 -279157 16461 177880 -28365 163671
17675B07580g4085J3318C45383A29949C2225K8651J90977a29525F9386R9206F8951
$$ 207580 -74085 -60767 345383 129949 32225 60876 251853 -129525 69386 168592 68951
17663g4237B88104I8011a74369I8361K76304A47170k5619a00032j597l6172N2224
$$ -74237 288104 98011 -174369 98361 374665 147170 121551 -100032 -101629 -137801 -85577
17652h5577k3638r9033A49902O8763g8616k2172A78918g2841H7797C5367d45527
$$ -85577 -109215 -208248 149902 218665 -78616 -100788 178918 -72841 87797 35367 -445527
17640A90420P9975F9189l645l0413L4536f3447K6330A8851i3912A08344L3498
$$ 190420 270395 69189 65544 35131 69667 -63447 -37117 18851 -93912 108344 141842
17629A41842P5894n9193J18022j04347a7215n398C35787i1520A04085a31401H5143
$$ 141842 217736 158543 276565 172218 -17215 -22613 335787 -91520 104085 -131401 85143
17617h9511D81575F2575J04787K6762n1631h3776E6384B2896g1969h314p0000
$$ -89511 481575 62575 167362 194124 142493 -83776 56384 22896 -71969 -8314 -78314
17606g8314q4063A68292l3839k3370D9916f4476B73072F7782M9040a8641D9226
$$ -78314 -162377 168292 134453 111083 49916 -64476 273072 67782 116822 -18641 49226
17594B24128k7189k8835c6919j03749D73838A25349a63214A58881b8359I2986
$$ 224128 196939 168104 -36919 -140668 473838 125349 -163214 158881 -28359 92986
17583C0630Q3243g3860F845K46169a6208B03258a05012j63153B12715k9618j9486
$$ 30630 113873 -73860 6845 253014 -16208 203258 -105012 -268165 212715 183097 163611
17572A63611J48686A4725h5492d111A35760J26269A29104b29653D03711j35159
$$ 163611 312297 14725 -85492 -4111 135760 262029 129104 -229653 403711 268552
17562B68552H1394M5365a17794A02984D5498a00317D12698d2680B05167P0857
$$ 268552 81394 126759 -117794 102984 45498 -100317 412698 -42680 205167 276024
17552B76024K7353j41564M2283i591r4542B81505H9101R1407K31205A61387J23679
$$ 276024 303377 161813 204096 -9591 -104133 281505 89101 180508 411713 161387 285066
17541B85066c366D5231K36454j05197G0864A5845J75650L41019A84633c7874o69
$$ 285066 -3366 45231 281685 176488 70864 15845 191495 532514 184633 -37874 -38543
17530c8543A36838J59044P3583j64478b8068C00515D4193M52232J12896M7407
$$ -38543 136838 295882 369465 204987 -28068 300515 44193 496425 609321 656728
17520F56728j29665K91012m04037H1484J53316h5419B80748J65926j33303j20798
$$ 656728 527063 818075 414038 81484 234800 -85419 280748 446674 313371 192573
17510A92573J77797C3810J95825J52855m6355A54099L08762j7168q0110I3405
$$ 192573 370370 33810 229635 382490 336135 154099 462861 445693 365583 93405
17499C96327L8036g0234A84139J9508f3142C38794c8051C51972m326a2034C65878
$$ 396327 434363 -70234 184139 203647 -63142 338794 -38051 351972 347646 -12034 365878
17487A68173P2081l4907m1392E6579J42917L1033J52494H9597M15673a77711A47127
$$ 168173 240254 205347 163955 56579 199496 230529 383023 89597 505270 -177711 147127
17475D08411k03834c6294C89818g2800B04061K75238A10224L4104L13566G8781
$$ 408411 204577 -36294 389818 -72800 204061 479299 110224 144328 457894 78781
17464I3056O7380E3046b46837A5343N37643D2579e081E4578Q9708K8625L29940
$$ 93056 160436 53046 -246837 15343 552986 42579 -5081 54578 144286 172911 502851
17453E02851k05299K44899j16314j02480P1919J00029p3608A02347L64887B16821
$$ 502851 297552 542451 426137 323657 395576 495605 421997 102347 467234 216821
17442D97199k38338m9659G6715J97845J52458A68663k4592O0027H18J90711K17022
$$ 497199 258861 209202 76715 274560 427018 168663 144071 204098 818 191529 408551
17431D08551A68824J45379j39499L9021k9036K47467R5443r6784J15875A98750
$$ 408551 168824 314203 174704 213725 184689 432156 527599 430815 546690 198750
17420A62225C8284J95871J67340k8461J61193O5160A99534o7880K17624q4255
$$ 162225 38284 234155 401495 373034 534227 599387 199534 131654 349278 265023
17410B65023c0569C416J97940J05572l3690E5348J95849F4383a1078k056A78531
$$ 265023 -30569 3416 201356 306928 273238 55348 251197 64383 -11078 -13134 178531
17398A40384Q6156J94477A54748J08660O3378b416D81621a54349C01768K17748
$$ 140384 226540 421017 154748 263408 326786 -2416 481621 -154349 301768 519516
17388E19516B9535K94816G2332J96754h8978B78918E5909L69674j99452n5772
$$ 519516 29535 324351 72332 269086 -88978 278918 55909 425583 226131 170359
17378A70359O4901J17134A3087J68575n3293b46921A47707J69409b2596F5248
$$ 170359 235260 352394 13087 181662 128369 -246921 147707 317116 -22596 65248
17367A41735n1941K66252n9255j42165C3145N76436H6350K44096a02044A0108
$$ 141735 89794 356046 296791 154626 33145 609581 86350 330446 -102044 10108
17356g2084D30559j75098J03363P7784m0531A57939J18258A34635a59340L1362
$$ -72084 430559 255461 358824 436608 396077 157939 276197 134635 -159340 -127978
17346a27978A17313J90071j7862A41053N4577O3760o6859c4457A8225J37573K42780
$$ -127978 117313 307384 289522 141053 195630 259390 192531 -34457 18225 155798 398578
17335C98578j21902o2696Q3315k9131a46854B66308L07988C7430f7229E47879
$$ 398578 276676 213980 297295 268164 -146854 266308 574296 37430 -67229 547879
17324A64263p1496L5194a07652B92449a66243B89966n2486F3888K44418j45159
$$ 164263 92767 127961 -107652 292449 -166243 289966 237480 63888 308306 163147
17314A63147a68341a7549m9740E53804k25588b09059B05552J87558h941A23888
$$ 163147 -168341 -17549 -67289 553804 328216 -209059 205552 393110 -8941 123888
17303G2190J43108A8177K07989p452I427K3906O4833a20056B86132J23763j31971
$$ 72190 215298 18177 226166 218714 9427 33333 98166 -120056 286132 409895 277924
17292B77924A8240M33753A00899K14422N4041k4315A67688i5528D91276a30770
$$ 277924 18240 451993 100899 315321 369362 345047 167688 -95528 491276 -130770
17281A3071K59145m8417a58418B65648h0036B48276l7809n8306l741K84783j78327
$$ 13071 272216 223799 -158418 265648 -80036 248276 210467 152161 148420 433203 254876
17270B54876J35833A68496P3619p9893J57112Q3642F548K83313J83440E1905J02985
$$ 254876 390709 168496 242115 162222 319334 402976 6548 289861 473301 51905 154890
17259A54890j4975a29553B49944J99933J79651j01127A29309J51795L29076B40849
$$ 154890 139915 -129553 249944 449877 629528 528401 129309 281104 610180 240849
17248D8582J95874J80106J2757k12672A06852O1801K1151M5526L46372A41235
$$ 48582 244456 424562 437319 224647 106852 168653 189804 235330 581702 141235
17237i4533F8963K31602q66j19067n559K96742B10818J21253A1508L00150A07842
$$ -94533 68963 300565 299699 180632 175073 471815 210818 332071 11508 311658 107842
17225A89817O0140A5715L35292j64225k6629Q9321j20705a12814E82673a11564
$$ 189817 249957 15715 351007 186782 160153 249474 128769 -112814 582673 -111564
17214A50571m9334C5139J59432J51360J47358j73095j35153D5534M45929j0677
$$ 150571 101237 35139 194571 345931 493289 320194 185041 45534 491463 480786
17204D80786k03092J17709k1825b01026B79971O1951l6783J17618J21964B24407
$$ 480786 277694 395403 373578 -201026 279971 341922 305139 422757 544721 224407
17193B87273j4564L02864A14546J43701O07N4480J83376j04517A81865L0646L33552
$$ 287273 272709 575573 114546 258247 258854 313334 496710 392193 181865 212511 546063
17182E46063c9749A85670Q6254J89573j74812J36336l968K1629N2016A38884K54330
$$ 546063 -39749 185670 271924 461497 286685 423021 419053 440682 492698 138884 393214
17171C93214K10452q7328l7301k12290J7950J53582q6086J16764j26071j6446
$$ 393214 603666 516338 479037 266747 284697 438279 352193 468957 342886 326440
17161C26440R531P2689l5647J40207j63675R1992n8051j1283o8409K13747A71730
$$ 326440 335971 408660 373013 513220 349545 441537 383486 372203 303794 517541 171730
17149E18578B44579J81361j25066n8826J440N03955A65245J89922N1674r5684
$$ 518578 244579 425940 300874 242048 243488 747443 165245 355167 406841 311157
17139C11157a22171D80781l9739e5006C90562m2924Q8693q6594H8585K69514K07086
$$ 311157 -122171 480781 441042 -55006 390562 347638 436331 349737 88585 358099 565185
17128E65185M738l2514k07210j38921K56461A55780J50059J65131B14544N65867
$$ 565185 569923 537409 330199 191278 447739 155780 305839 470970 214544 780411
17118G80411j66141j05033B48124L39934k02618j7857N3807J7097j62202J16460
$$ 780411 614270 509237 248124 588058 385440 367583 421390 438487 276285 392745
17108C92745J53138m7059J75678k06956J50699Q484m3045B73417K80704J5231
$$ 392745 545883 498824 674502 467546 618245 626729 583684 273417 554121 569352
17098E69352j00424j72131K72795j50454r7694L01566q8676P9817K13898F2915
$$ 569352 468928 296797 569592 419138 321444 623010 534334 614151 828049 62915
17087D34667K52868k32144K16062k81432J51259k042K56216r5836K13139A23981
$$ 434667 687535 455391 671453 390021 541280 539238 795454 699618 912757 123981
17076F91834j49920J91121l38395L16737j46574A45482Q06871D69487N8454J59048
$$ 691834 541914 733035 394640 711377 564803 145482 952353 469487 527941 686989
17066F86989j97244Q7736J07603O8580C27919K59741o1719P7454K4176k69433
$$ 686989 489745 577481 685084 753664 327919 587660 525941 603395 627571 358138
17056C58138L39714J52258k56729j54221K98164k90534L23763K03775j44081k04030
$$ 358138 697852 850110 593381 439160 737324 446790 770553 974328 830247 626217
17046F26217J90103L7344n2323j43513N7629k0838j20662L982K61605k86689M16382
$$ 626217 816320 853664 801341 657828 715457 694619 573957 577939 839544 552855 969237
17035I69237j83749k3942k45956J57423M15964j55404l30764J53657j87819Q0842
$$ 969237 785488 761546 515590 673013 1088977 933573 602809 756466 568647 649489
17025F49489J79509O5314Q6385j02115j6265j63664P9142M4948K164k24419K60409
$$ 649489 828998 894312 980697 878582 862317 698653 777795 822743 824907 600488 860897
17014H60897l18050Q6079J62809J71056M4014p9987k10825Q7878K1477K27419
$$ 860897 542847 628926 791735 962791 1006805 926818 715993 803871 825348 1052767
17004A052767o2922J21223k33390N8646m5771k20284P5811K49962l09493L76204
$$ 1052767 989845 1111068 877678 936324 890553 670269 746080 996042 686549 1062753
16994A062753J17008j84031j56306j83432L96585l78757K11156M16509o0150l73528
$$ 1062753 1179761 995730 839424 655992 1052577 673820 884976 1301485 1241335 867807
16984H67807K85447j34814K86184k06705J15710o0228J79188k98038N365J0476
$$ 867807 1153254 1018440 1304624 1097919 1213629 1153401 1332589 1034551 1039916 1050392
16974A050392L30747n2461k94817K22497L6450J2720j0389o1423m618K5821q974
$$ 1050392 1381139 1328678 1033861 1256358 1292808 1305528 1295139 1233716 1229098 1254919 1245945
16963A245945K6499k82784K91319k64718M205K39649M12942p93043M66113j89161
$$ 1245945 1272444 989660 1280979 1016261 1020466 1260115 1673057 880014 1346127 1156966
16953A156966M13973J44242j76344l32068L40488j97778J27490r8782K89529r2893
$$ 1156966 1570939 1715181 1538837 1206769 1547257 1349479 1476969 1378187 1667716 1574823
16943A574823l17465J10838L62274m56035L02561J1843K9474Q1196J8540j92498
$$ 1574823 1257358 1368196 1730470 1274435 1576996 1588839 1618313 1699509 1718049 1525551
16933A525551J2720M617O74402n35873O3826J00775O1442o9651m6752k28054L39616
$$ 1525551 1538271 1542888 2217290 1681417 1745243 1846018 1907460 1837809 1791057 1563003 1902619
16922A902619N75r5688j27531L7871J31661l8731o5598K87838K15793K18477k90877
$$ 1902619 1903194 1807506 1679975 1717846 1849507 1810776 1745178 2033016 2248809 2467286 2176409
16911B176409K23689k51216P7436j22730K6837J31344j13414M28487j12250L6152
$$ 2176409 2400098 2148882 2226318 2103588 2130425 2261769 2148355 2576842 2464592 2500744
16901B500744p0737m38054N25130j11390J29466p9504J39098q4251J68170l05857
$$ 2500744 2430007 1991953 2517083 2405693 2535159 2455655 2594753 2510502 2678672 2372815
16891B372815j33226L16164K53324j89153n2589N91935k47365j42127L92652k76991
$$ 2372815 2239589 2555753 2809077 2619924 2567335 3159270 2911905 2769778 3162430 2885439
16881B885439P3047K38990l99036K48321K24375j37934N9147L54924k10788J30408
$$ 2885439 2958486 3197476 2798440 3046761 3271136 3133202 3192349 3547273 3336485 3466893
16871C466893J95965k6403J24538j96805K8490J17110P2942K07304k25890K14332
$$ 3466893 3662858 3636455 3760993 3564188 3592678 3709788 3782730 3990034 3764144 3978476
16861C978476j06062K27387j215K70545k31675L05925k76435J37454M90904k89823
$$ 3978476 3872414 4099801 4098586 4369131 4137456 4443381 4166946 4304400 4795304 4505481
16851D505481L08493r6084J80774R229M1674L89816P003O4341J66915j71932j66987
$$ 4505481 4813974 4717890 4898664 4907893 4949567 5339383 5346386 5410727 5577642 5405710 5238723
16840E238723K69372J71310Q5143M90707l30714K71071J08429K54730k46344N05913
$$ 5238723 5508095 5679405 5764548 6255255 5924541 6195612 6304041 6558771 6312427 6818340
16830F818340j46007K96361j35385J82933K87777K84419j83911K23376K81716
$$ 6818340 6672333 6968694 6833309 7016242 7304019 7588438 7404527 7627903 7909619
16821G909619J18480N2297L86048k05710M04812M07547J45551j58860L83465P9087
$$ 7909619 8028099 8080396 8466444 8260734 8665546 9073093 9218644 9059784 9443249 9522336
16811I522336J88719L09518M43268K78166K06892J81849J89786L88325K24547
$$ 9522336 9711055 10020573 10463841 10742007 10948899 11130748 11320534 11708859 11933406
16802A1933406K75581k06251P62344M50974M75360q811M92076o5582Q62861M48226
$$ 11933406 12208987 12002736 12765080 13216054 13691414 13682603 14174679 14109097 14971958 15420184
16792A5420184K4072O08119R24278k24699P56400P03507K76311O27482O59550
$$ 15420184 15444256 16052375 16976653 16751954 17508354 18211861 18488172 19115654 19775204
16783A9775204K92411J106313L30376R91544P05458O24940N94934N66907J050473
$$ 19775204 20067615 21173928 21504304 22495848 23201306 23826246 24421180 24988087 26038560
16774B6038560P82067P94717J124301J531018K85006J430501Q36826J702834O75742
$$ 26038560 26820627 27615344 28739645 30270663 30555669 31986170 32822996 34525830 35201572
16765C5201572J624088J254174J319282J947234R19966J558723J734433K166340
$$ 35201572 36825660 38079834 39399116 41346350 42266316 43825039 45559472 47725812
16757D7725812J539389K088727J917305K472700K128013J896189K493001K948802
$$ 47725812 49265201 51353928 53271233 55743933 57871946 59768135 62261136 65209938
16749F5209938K160200K520608K536596K809169K997012L128927L040118K823221
$$ 65209938 67370138 69890746 72427342 75236511 78233523 81362450 84402568 87225789
16741H7225789K784508L290547K783942K979285K862286K815029K994080K626920
$$ 87225789 90010297 93300844 96084786 99064071 101926357 104741386 107735466 110362386
16733A10362386K358293K225609J812802J513217J311154J035579Q30345N33956
$$ 110362386 112720679 114946288 116759090 118272307 119583461 120619040 121449385 121983341
16725A21983341k2638m51877l83275j164673j241239j893689j596504k453134
$$ 121983341 121960703 121508826 121125551 119960878 118719639 116825950 115229446 112776312
16717A12776312k529797k281857k964211k466531k866559l003916l471488k568107
$$ 112776312 110246515 107964658 105000447 102533916 99667357 96663441 93191953 90623846
16709I0623846l008202k766227l181988k846733k835776k728325k761517k762946
$$ 90623846 87615644 84849417 81667429 78820696 75984920 73256595 70495078 67732132
16701F7732132k465734j998094k680479k019751k558308k022425j789255k066684
$$ 67732132 65266398 63268304 60587825 58568074 56009766 53987341 52198086 50131402
16693E0131402j986432j612294j834720j534747j130030j975044j124339j629371
$$ 50131402 48144970 46532676 44697956 43163209 42033179 40058135 38933796 37304425
16685C7304425j536238o33352j056675j459172q99494j107656j079425q93070
$$ 37304425 35768187 35134835 34078160 32618988 31719494 30611838 29532413 28639343
16677B8639343q85873n77426q48501q34899n71867j124902p25746m84409q22042
$$ 28639343 27753470 27176044 26327543 25492644 24920777 23795875 23070129 22585720 21763678
16668B1763678p4126j012037m17768n88670p17446k38767o91157m4121q89421
$$ 21763678 21689552 20677515 20259747 19671077 18953631 18714864 18023707 17979586 17090165
16659A7090165j04511p03419o15800j53185l23071n61425k49742q40658M7458
$$ 17090165 16985654 16282235 15666435 15513250 15190179 14628754 14379012 13538354 13585812
16650A3585812k62209l36201j25704l14817q13320K74747k31928k35856k62214
$$ 13585812 13323603 12987402 12861698 12546881 11733561 12008308 11776380 11540524 11278310
16641A1278310j12428k98076m93339k06490J84447l79169l15686n53156K29584
$$ 11278310 11165882 10867806 10374467 10167977 10352424 9973255 9657569 9104413 9333997
16632I333997j00197j79564l13113k99327J67882r7062j04585l91977L30073p23961
$$ 9333997 9233800 9054236 8741123 8441796 8609678 8512616 8408031 8016054 8346127 7622166
16622G622166j93460Q1156p6135l18910O7989j8068m04309J17602k70821j34998
$$ 7622166 7428706 7509862 7433727 7114817 7182806 7164738 6760429 6878031 6607210 6472212
16612F472212j06218j6175r3312k21166J22313k00994j86853o2545l4714J29884
$$ 6472212 6365994 6349819 6256507 6035341 6157654 5956660 5769807 5707262 5672548 5802432
16602E802432j14846k51247O2517k54006k16813J94114k56370q0214Q0023j65885
$$ 5802432 5687586 5436339 5498856 5244850 5028037 5222151 4965781 4885567 4965590 4799705
16592D799705N4936j86250n3372j1808k45950o3613K37338J56183j27415j54584
$$ 4799705 4854641 4668391 4615019 4603211 4357261 4293648 4530986 4687169 4559754 4405170
16582D405170m71903q3785K34091J58322n9100k82792k48882R7854K5954j3005
$$ 4405170 3933267 3849482 4083573 4241895 4182795 3900003 3651121 3748975 3774929 3761924
16572C761924K58542m87914j91187K01120k8624m47051L67992j17311J21340l57792
$$ 3761924 4020466 3532552 3341365 3542485 3513861 3066810 3434802 3317491 3438831 3081039
16562C081039K71985J13497k48402j41108J92736K2724k86739j20398M05102k38182
$$ 3081039 3353024 3466521 3218119 3077011 3269747 3292471 3005732 2885334 3290436 3052254
16552C052254N0823j57465k17126K26015q112j81805k55030K18712Q1520R1537
$$ 3052254 3103077 2945612 2728486 2954501 2946389 2764584 2509554 2728266 2809786 2901323
16542B901323l59636J37604J01695m78462K77853J37938l71581J70231j38708
$$ 2901323 2541687 2679291 2780986 2302524 2580377 2718315 2346734 2516965 2378257
16533B378257l30921M99782K2533l45744K0082K16834k67007M0056l58934J90271
$$ 2378257 2047336 2547118 2569651 2223907 2243989 2460823 2193816 2233872 1874938 2065209
16523B065209j82437J90431j30947M26579L5880l85443J34957L162J84641q5263
$$ 2065209 1882772 2073203 1942256 2368835 2404715 2019272 2154229 2157391 2342032 2256769
16513B256769n53832O64807m88105J18727J0157J09501j67016K8918j42438K81726
$$ 2256769 1702937 2367744 1879639 1998366 2008523 2118024 1951008 1979926 1837488 2119214
16503B119214m75199J70149R6442j53236J95672p7373p2469j84571N62318n86626
$$ 2119214 1644015 1814164 1910606 1757370 1953042 1875669 1803200 1618629 2180947 1594321
16493A594321M16504l46426J27554j59366L2195k21809K31823k4895k17835L24952
$$ 1594321 2010825 1664399 1791953 1632587 1664782 1442973 1674796 1649901 1432066 1757018
16483A757018q7811K61536m50896J44039Q702j09644N1994k74579K35504K2051
$$ 1757018 1669207 1930743 1479847 1623886 1632588 1522944 1574938 1300359 1535863 1557914
16473A557914M11332k53628m25284J41341k76889O2308L34265j9701N8453j98132
$$ 1557914 1969246 1715618 1290334 1431675 1154786 1217094 1551359 1531658 1590111 1391979
16463A391979J01822r6987K19321j76259k38069J51461M0598J57716l12829K14492
$$ 1391979 1493801 1396814 1616135 1439876 1201807 1353268 1393866 1551582 1238753 1453245
16453A453245l88033Q4882J42546n8144J26035k55523J09467P4769k9517o7563
$$ 1453245 1065212 1150094 1292640 1234496 1360531 1105008 1214475 1289244 1259727 1192164
16443A192164M696k19061N67925j54832J20366j20722M0706l01099k37809M95324
$$ 1192164 1196860 977799 1545724 1390892 1511258 1390536 1431242 1130143 892334 1387658
16433A387658n25038K08628L37349k07303r0389R2772l30542L47289j91416k58811
$$ 1387658 862620 1071248 1408597 1201294 1110905 1203677 873135 1220424 1029008 770197
16423G70197K66230K09382K34772j78357m06405j10497J08255K08013Q1720m4450
$$ 770197 1036427 1245809 1480581 1302224 895819 785322 893577 1101590 1183310 1138860
16413A138860M0270j34527K16199j70793J99589l72140J95755k509k47992R9297
$$ 1138860 1179130 1044603 1260802 1090009 1289598 917458 1113213 1110704 862712 962009
16403I62009k49019o8145K85552Q7281K4892j39049M4639k35351K00578K22105
$$ 962009 712990 644845 930397 1017678 1042570 903521 948160 712809 913387 1135492
16393A135492k13556J44606j77457q6110O2203J7631K06829P03l73659O7989J50047
$$ 1135492 921936 1066542 889085 802975 865178 882809 1089638 1090341 716682 784671 934718
16382I34718K30952m05099J66321j19808N2685j48698K7233L43691k23737O6682
$$ 934718 1165670 760571 926892 807084 859769 711071 738304 1081995 858258 924940
16372I24940L0967k28976l13882M18106k76302M66089M3042l41189M00753l20395
$$ 924940 955907 726931 413049 831155 554853 1020942 1063984 722795 1123548 803153
16362H03153J70920K339j78825j88588n1031L59123p0394O2573m5668p7302K16233
$$ 803153 974073 976412 797587 608999 557968 917091 846697 909270 863602 786300 1002533
16351A002533m18483L10538j51069j33419J15760M8668Q6538k24395L28693l80716
$$ 1002533 584050 894588 743519 610100 725860 774528 861066 636671 965364 584648
16341E84648M90247k72368j51996J56646k43283N1865o8637n3437J47235L59660
$$ 584648 1074895 802527 650531 807177 563894 615759 547122 493685 640920 1000580
16331A000580m53532K57738l22863J87126N47745n55691J94790l49532J90818
$$ 1000580 547048 804786 481923 669049 1216794 661103 855893 506361 697179
16322F97179J9096l21469K02834j34966L9342J18383L88818D84834J17440K56779
$$ 697179 716275 394806 597640 462674 502016 620399 1009217 484834 602274 859053
16312H59053j98864r148L2060J67726j63997O4396k41201j4369J68630J88135
$$ 859053 660189 651041 683101 850827 686830 751226 510025 495656 664286 852421
16302H52421l28728K04071P3134k48487p4971K93411l28013J50505K75900k63472
$$ 852421 523693 727764 800898 552411 477440 770851 442838 593343 869243 605771
16292F05771m2137j91372L28215k51213r3003R8927J20678K6579k08628L27638
$$ 605771 563634 372262 700477 449264 356261 455188 575866 602445 393817 721455
16282G21455k48751L81776C90347L81952l21672N1923j20276R0323J2963l1488
$$ 721455 472704 854480 390347 772299 450627 502550 382274 472597 485560 454072
16272D54072J42648J82138k22984j45699K4646L2133r9801p7062H5606O71489
$$ 454072 596720 778858 555874 410175 434821 466954 367153 290091 85606 757095
16262G57095k55222j19273K13965j79142K78740k85954m3277R8299m4438J76576
$$ 757095 501873 382600 596565 417423 696163 410209 366932 465231 420793 597369
16252E97369Q693j30226L06264k07687L29444C94146L4217R7141m9256A01844
$$ 597369 606062 475836 782100 574413 903857 394146 428363 525504 476248 101844
16241d4761C56112K00496k29900J36223j53585H9931N52346j45798j61924R3084
$$ -44761 356112 556608 326708 462931 309346 89931 642277 496479 334555 427639
16231D27639A96519N8962P1538Q4644L0101q6523K74637k65530L23110B52812
$$ 427639 196519 255481 327019 411663 441764 355241 629878 364348 687458 252812
16220F53426A95576J68209J3018K663M47514l56371k27893J76664r824R1370j12937
$$ 653426 195576 363785 376803 379466 826980 470609 242716 419380 409556 500926 387989
16209C87989j47268M57224C35901c503D56321M7234B47861Q9259K18101j45209
$$ 387989 240721 697945 335901 -3503 456321 503555 247861 337120 555221 410012
16199D10012o4083r2088A17074M5431o9645M3308R6976I1876L28274A62442K74842
$$ 410012 345929 253841 117074 162505 92860 136168 233144 91876 420150 162442 437284
16188D37284j74858j16035C5553K95466J8119K33763B65480K75950A5170K39353
$$ 437284 262426 146391 35553 331019 349138 582901 265480 541430 15170 254523
16178B54523J15149j49534J17320J4943J50119k16469J47485A69693K35258d8808
$$ 254523 369672 220138 337458 352401 502520 286051 433536 169693 404951 -48808
16167B98943R5219L8810B01295G5057J9291K42525A17115C1381L62690j67495
$$ 298943 394162 432972 201295 75057 94348 336873 117115 31381 394071 226576
16157B26576J19626m6981L559J30708A11417J64345K25721k39614r4462o5212
$$ 226576 346202 299221 302780 433488 111417 275762 501483 261869 167407 102195
16147A02195N3940a2022A46269m0524L03004a35254D46095a56045E50079A22145
$$ 102195 156135 -12022 146269 105745 408749 -135254 446095 -156045 550079 122145
16136E44400k64091j21990d7465A84796o9313K70393P3498j52281Q5943a08598
$$ 544400 280309 158319 -47465 184796 115483 385876 459374 307093 393036 -108598
16125A44913o8700K59477a17935B75569J30671J3249j79439G5250M25905B04618
$$ 144913 76213 335690 -117935 275569 406240 419489 240050 75250 501155 204618
16114A73563o8565N71089B77440m3704p3702k2436m1704L350J26749c7689I5699
$$ 173563 104998 676087 277440 233736 160034 137598 95894 99244 225993 -37689 95699
16102A83628J60070I7290a5924A96494J391G6889J88504E7308L4660M55418a6319
$$ 183628 343698 97290 -15924 196494 197885 76889 265393 57308 91968 547386 -16319
16090B59009p1713d5361G2774K25487i2549A89144b04605C05937j41725K17942
$$ 259009 187296 -45361 72774 298261 -92549 189144 -204605 305937 164212 382154
16080C82154e8158C22651B4241K88868K514E6294J31726g442H3865M9456C5591
$$ 382154 -58158 322651 24241 313109 315623 56294 188020 -7442 83865 133321 35591
16068A31937O274K76266A83098K08865A37011B9859g8360D89141c6731e59A34586
$$ 131937 138211 414477 183098 391963 137011 29859 -78360 489141 -36731 -559 134586
16056b8780B24149J76125A99972D94N4830A8175g9991b4797A18564a16302A76985
$$ -28780 224149 400274 199972 494 55324 18175 -79991 -24797 118564 -116302 176985
16044D5570O8480b1553B89194J2882b150A66567q2063K61742E8560b7300A90488
$$ 45570 114050 -21553 289194 302076 -2150 166567 84504 346246 58560 -27300 190488
16032b4213k52134i82j24876A4374i4014A53851b1651j60247A81678Q3720A4003
$$ -24213 -276347 -982 -125858 14374 -94014 153851 -21651 -181898 181678 265398 14003
16020A46592K31649a40762A9082A773K34213e7733A44271J0950J44703A07373
$$ 146592 378241 -140762 19082 1773 235986 -57733 144271 155221 299924 107373
16009h9461j34440M2700F3722L7870Q295j1231M0994E2529J86440a12612d8792
$$ -89461 -223901 -181201 63722 101592 109887 98656 139650 52529 238969 -112612 -48792
15997H7026C511e0848C41766b9028B02519i0780C07327A41383A6679K56391k7849
$$ 87026 3511 -50848 341766 -29028 202519 -90780 307327 141383 16679 273070 245221
15986B45221J64602Q4529j58822K73976q6891B18244K76124j77347A52505J41778
$$ 245221 409823 494352 335530 609506 522615 218244 494368 317021 152505 294283
15976B94283a0583p2960H1202b12552g2415B05327J11935B6960K50951q0454a47793
$$ 294283 -10583 -83543 81202 -212552 -72415 205327 317262 26960 277911 197457 -147793
15964B606O2678j5512j8751P6495J83973J4683d4121B64634B3071b49320j1800
$$ 2606 65284 49772 31021 107516 291489 306172 -44121 264634 23071 -249320 -261120
15953b61120d205A7204f9798K764j17877f4026D3265g0567n5968j15503d3764
$$ -261120 -4205 17204 -69798 -67034 -184911 -64026 43265 -70567 -126535 -242038 -43764
15941B22173a24729b5240B6343M11753e0507j48558p5958c6803r7503Q018G0342
$$ 222173 -124729 -25240 26343 438096 -50507 -199065 -275023 -36803 -134306 -126288 70342
15929A07654b82645e7050n121H7670K5255M2510c2604j17458B13659C938b3820
$$ 107654 -282645 -57050 -62171 87670 112925 155435 -32604 -150062 213659 3938 -23820
15917e4496J0641a2647C70821e4716A76583K8265e4720A08434A5098a06900a0221
$$ -54496 -43855 -12647 370821 -54716 176583 204848 -54720 108434 15098 -106900 -10221
15905E807K29062b06694f2901p0455M1126C8866a29847F1880D992e8898A65537
$$ 5807 234869 -206694 -62901 -133356 -92230 38866 -129847 61880 4992 -58898 165537
15893a3285l11406a10088A8680b20092M7703D608c57722B34470g4898A44979l5740
$$ -13285 -324691 -110088 18680 -220092 -172389 4608 -357722 234470 -74898 144979 109239
15882A09239b07759C9558J91235B5356a06214B00606b03337A96265K2011j5780
$$ 109239 -207759 39558 230793 25356 -106214 200606 -203337 196265 218276 202496
15872B02496c797H1505a25902B24711J24766c93990b2694q5541B96605b7909B61394
$$ 202496 -3797 81505 -125902 224711 349477 -393990 -22694 -108235 296605 -27909 261394
15860A9660J28239f7485C4627Q7786a20149C33868a98537n4943A44399c8019Q044
$$ 19660 147899 -67485 34627 122413 -120149 333868 -198537 -253480 144399 -38019 -29975
15849b9975K181l5657k24505E2733J08235a01805m5137B24319a059k7931E8805
$$ -29975 -27794 -63451 -287956 52733 160968 -101805 -146942 224319 -1059 -28990 58805
15837b19836j8746B63596O459j07563l2333j0829M295a35821A61831D7464a00497
$$ -219836 -238582 263596 270055 162492 130159 119330 123625 -135821 161831 47464 -100497
15825h6136B22945c8551m681j44636M2582B2650a48019f1171A11760n0372J58363
$$ -86136 222945 -38551 -43232 -187868 -145286 22650 -148019 -61171 111760 61388 219751
15814B19751H7458K41137B2197i942j35871d3528D1250a01493K9634j86834A13595
$$ 219751 87458 328595 22197 -9942 -145813 -43528 41250 -101493 -71859 -258693 113595
15802h1499p6967j17208C22506b8004j05895j79046l52037B28948a81884G403
$$ -81499 -158466 -275674 322506 -28004 -133899 -312945 -664982 228948 -181884 7403
15791e4198B35741j5072a96777A2685d0183a3567k3224B0164a94332i998B01047
$$ -54198 235741 220669 -196777 12685 -40183 -13567 -36791 20164 -194332 -9998 201047
15779e1905b1801C2099K93260b74884M7560j64371a76391k69461a79612n3792
$$ -51905 -21801 32099 325359 -274884 -227324 -391695 -176391 -445852 -179612 -233404
15769b33404J8736R4483o8681C0214a81383A94395b33471A88466k1412K39605
$$ -233404 -214668 -120185 -188866 30214 -181383 194395 -233471 188466 167054 406659
15759D06659a20129J1207B26393A2644Q8955K474K92057e0905G8370a11796F2921
$$ 406659 -120129 -108922 226393 12644 101599 104073 396130 -50905 78370 -111796 62921
15747I7486i6848G9751a86352B68919g2114r2746A46807E6597b48372M9684k16204
$$ 97486 -96848 79751 -186352 268919 -72114 -164860 146807 56597 -248372 -198688 -414892
15736d14892B20968d57179K12523f6026C06218A01948a95103M1233f5064A97367
$$ -414892 220968 -457179 -244656 -66026 306218 101948 -195103 -153870 -65064 197367
15725a92448Q4514j5338m85879b20045M8090P0467c4243C0123a70203j75043G8389
$$ -192448 -107934 -123272 -609151 -220045 -171955 -101488 -34243 30123 -170203 -345246 78389
15713A3731a81964D74501b60703b3818k35458A19132D2628a24209A28664J00891
$$ 13731 -181964 474501 -260703 -23818 -259276 119132 42628 -124209 128664 229555
15703B29555a82482N5722c0427p3839k69828A28118A9720a9522B20845C2810K8220
$$ 229555 -182482 -126760 -30427 -104266 -374094 128118 19720 -19522 220845 32810 61030
15692F1030K63023f5771E389n48Q0826i028A29642J25385a72390j59073A37894
$$ 61030 324053 -65771 5389 4841 85667 -9028 129642 255027 -172390 -331463 137894
15680c76904f713A40288j0356e9256n9978c4559p9246a3682A53371a06659j17282
$$ -376904 -6713 140288 129932 -59256 -119234 -34559 -113805 -13682 153371 -106659 -223941
15669b23941f7233C5005i3314D4988L43576j93442r6748K0205a25522A94383D8083
$$ -223941 -67233 35005 -93314 44988 388564 195122 98374 118579 -125522 194383 48083
15657c8283j25642n7218g1358H9237i7508j77225D100J09360i8363M4920A58344
$$ -38283 -163925 -221143 -71358 89237 -97508 -274733 4100 113460 -98363 -53443 158344
15645a81195J0435j59809A3391b8586A54190b4368q1304A12839c2740A49924P1890
$$ -181195 -170760 -330569 13391 -28586 154190 -24368 -105672 112839 -32740 149924 221814
15634B21814d8724k24609B8469M7884R232a73939a0182k35625a4879l6654K5377
$$ 221814 -48724 -273333 28469 76353 85585 -173939 -10182 -245807 -14879 -51533 -26156
15623b6156B66988b03041P3394d1363A7415a62264C6041A7064i4439A35860R2235
$$ -26156 266988 -203041 -129647 -41363 17415 -162264 36041 17064 -94439 135860 228095
15612B28095a35761L3384H7408A6274b7340l5223D9082d30966a80591p8510d4781
$$ 228095 -135761 -102377 87408 16274 -27340 -62563 49082 -430966 -180591 -259101 -44781
15600H3916d0709a9694n43040b20555G2178b32209d8000A02510N2176a61298D1101
$$ 83916 -40709 -19694 -562734 -220555 72178 -232209 -48000 102510 154686 -161298 41101
15588G6532b11656A51250j1124e218j31106k6236A84277a63644B60975a88161
$$ 76532 -211656 151250 140126 -5218 -136324 -162560 184277 -163644 260975 -188161
15577a31880H3220K4416B0038B15J67901d7288l4828j93904F1726J00535a33776
$$ -131880 83220 107636 20038 215 168116 -47288 -82116 -276020 61726 162261 -133776
15565i0627A58456n4305a22219A21692n4259d2996m14D5351e2891k46043a46383
$$ -90627 158456 104151 -122219 121692 67433 -42996 -43410 45351 -52891 -298934 -146383
15553e3282o3919I7254K978h2432j1133F430b22399j13974B2126a17445E1157
$$ -53282 -117201 97254 100232 -82432 -93565 6430 -222399 -336373 22126 -117445 51157
15541A14973d520j4249j65132A28212O6689K24004A78710A6717g3091G7852M0775
$$ 114973 -4520 -18769 -183901 128212 194901 418905 178710 16717 -73091 77852 118627
15530A18627a66687A82968n2502K25483a20500B63580a92686A08541j9057L61540
$$ 118627 -166687 182968 130466 355949 -120500 263580 -192686 108541 89484 451024
15520D51024A16787k2754k6632M9752D0974e7345j47230B19933c49973j84949
$$ 451024 116787 94033 67401 117153 40974 -57345 -204575 219933 -349973 -534922
15510e34922D05090e6488p1767C87867c4886r4532n5095F1970L5960B6649K09412
$$ -534922 405090 -56488 -128255 387867 -34886 -129418 -184513 61970 97930 26649 236061
15499B36061c78071b9241l5870m3356i938C5947a69832B82814i0943B70784c43202
$$ 236061 -378071 -29241 -65111 -108467 -9938 35947 -169832 282814 -90943 270784 -343202
15487f951A53531J46414D7680A8485E862g1192j26443C80646b02766d060j95461
$$ -6951 153531 299945 47680 18485 5862 -71192 -197635 380646 -202766 -4060 -199521
15476a99521A6341P0639J01358n6478L39136A66921M9276R1078j21304J9988q2650
$$ -199521 16341 86980 188338 131860 470996 166921 216197 307275 185971 205959 123309
15465A23309i6409B92929J90077A27424e1175A21885J80094h8510A5694i9756
$$ 123309 -96409 292929 483006 127424 -51175 121885 301979 -88510 15694 -99756
15454A14319i5120A98090b03302A87513q1456b33679J3974A32035a20378A62290
$$ 114319 -95120 198090 -203302 187513 106057 -233679 -219705 132035 -120378 162290
15443A38025J14647C0660L28372J14321L4908k44784f2957b8212k17829A61439
$$ 138025 252672 30660 359032 473353 508261 263477 -62957 -28212 -246041 161439
15432B18213G8546c6250n2033I7863H013N2919P4802k6002j0099J0977a4908D3479
$$ 218213 78546 -36250 -88283 97863 8013 60932 135734 109732 99633 110610 -14908 43479
15419b06669a7653n1608j45725o2077h1713k10732A28089a23081j20864A2058
$$ -206669 -17653 -69261 -214986 -277063 -81713 -292445 128089 -123081 -243945 12058
15408a15831A31053o797L2851h4281C8824d20940a73166A90009k1389b51906F4422
$$ -115831 131053 124256 157107 -84281 38824 -420940 -173166 190009 168620 -251906 64422
15396A23308C6314a9254r0907A09703B2159a13942G5083J17231a0784E1350L3193
$$ 123308 36314 -19254 -110161 109703 22159 -113942 75083 192314 -10784 51350 84543
15385H4543g8533A93013k2883a3367f011A27066n0661i6459A78327p7438P8595
$$ 84543 -78533 193013 170130 -13367 -6011 127066 76405 -96459 178327 100889 179484
15374A79484M6490f2215B90431P5468H4431a57047B53333p024a77990A9162L32583
$$ 179484 225974 -62215 290431 365899 84431 -157047 253333 246309 -177990 19162 351745
15363C51745a55099C65286A31092R2548k7748o6956J0800b47813b6519G9806J66763
$$ 351745 -155099 365286 131092 223640 195892 128936 139736 -247813 -26519 79806 246569
15352B46569g5710j17835A74J41289Q5053J11649E0867B0054a91846A45360a10785
$$ 246569 -75710 -193545 174 141463 226516 338165 50867 20054 -191846 145360 -110785
15340B20474L3324a91551d9512p5392q3585A02039d4889A17235C6790K04831H437
$$ 220474 253798 -191551 -49512 -124904 -208489 102039 -44889 117235 36790 241621 8437
15328H0592j5337b56899A05805i6312B8757P0163J04264A1998a756C9216J9548
$$ 80592 65255 -256899 105805 -96312 28757 98920 203184 11998 -1756 39216 58764
15317E8764N2109J89889j39422b09697C8931g9449j480F5158K11265f9318B90674
$$ 58764 110873 300762 161340 -209697 38931 -79449 -80929 65158 276423 -69318 290674
15305a5132B28758J33751j24926q7668J41528j20175m4990a31702E9951k459A7400
$$ -15132 228758 362509 237583 149915 291443 171268 126278 -131702 59951 57492 17400
15293C14139i4256J2305N678i133r7461l744I7183R3146c4001B72469E1402c11943
$$ 314139 -94256 -81951 -76273 -9133 -106594 -110338 97183 190329 -34001 272469 51402 -311943
15280b00380h0474D0590C140c0356C18249j45937i8379q6401B20486o7382i6312
$$ -200380 -80474 40590 3140 -30356 318249 172312 -98379 -184780 220486 153104 -96312
15268A78697J75592I4682a1950k02531q12E3738P0512R4775a93612i6345A66222
$$ 178697 354289 94682 -11950 -214481 -215293 53738 124250 219025 -193612 -96345 166222
15256a10293A99182a15469G7300J50834P3A00351J69001N6520J17540M16379P97552
$$ -110293 199182 -115469 77300 228134 228207 100351 269352 325872 443412 859791 1657343
15245A657343r5288k20457k25985A18753O3145C6076A62J68273R875a48059N6782
$$ 1657343 1562055 1341598 1115613 118753 181898 36076 162 168435 178310 -148059 -91277
15234i1277j16249R0292A49267a00237L5571j59134h5856B50060F9100k2462J68481
$$ -91277 -207526 -117234 149267 -100237 -64666 -223800 -85856 250060 69100 46638 215119
15223B15119F3857K93682k7650j47033a1940F7229b19268a2687o0298A66209k0799
$$ 215119 63857 357539 329889 182856 -11940 67229 -219268 -12687 -72985 166209 145410
15212A45410c6882B74252I9371M7128A5497J9301b30852D3349h4548o764H5136
$$ 145410 -36882 274252 99371 146499 15497 34798 -230852 43349 -84548 -91312 85136
15200C7995e2150D21065k02585O55O8535a08131J1314B20359e2799A2648L55385
$$ 37995 -52150 421065 218480 219135 287670 -108131 -96817 220359 -52799 12648 368033
15189C68033C0953K94793C7963f8086B79653q6392a24359N2763j27396a6538A86652
$$ 368033 30953 325746 37963 -68086 279653 193261 -124359 -71596 -198992 -16538 186652
15177A23702N7677i9501D2690c49372a41225A80713J89932B4789b68076C02693
$$ 123702 181379 -99501 42690 -349372 -141225 180713 370645 24789 -268076 302693
15166D558K13292r2276J535R0797n257p3092e9313A10706h0843A21124j093d1379
$$ 4558 217850 125574 127109 217906 212649 139557 -59313 110706 -80843 121124 120031 -41379
15153A71536E3569j4770K54344K650F8510k4598a82345D1531l014K19582E7904
$$ 171536 53569 38799 293143 295793 68510 43912 -182345 41531 38517 258099 57904
15141A74199a99017d0836B63938r7149a49432A28604R615R6905r9625a17062E6269
$$ 174199 -199017 -40836 263938 166789 -149432 128604 138219 235124 135499 -117062 56269
15129b6312j74729G2180P4995C6543O7312D8478e4801A43656o1595l3131K51617
$$ -26312 -201041 72180 147175 36543 103855 48478 -54801 143656 82061 48930 300547
15118C00547A02912a50239A39163J59158p0346C3673a20366B04299a51670B71722
$$ 300547 102912 -150239 139163 298321 227975 33673 -120366 204299 -151670 271722
15107C73152G2994L16800C2805K33495C3026L20404d7484A53321A6335K28559
$$ 373152 72994 389794 32805 266300 33026 353430 -47484 153321 16335 244894
15097B44894K29475B19000r8777R9119j05884D1637N1370K13825o1325n0027i751
$$ 244894 474369 219000 120223 219342 113458 41637 93007 306832 245507 195480 -9751
15085C74312c4549a3632A67475E1284J81615m2763a8426j50529B03065E7603Q6671
$$ 374312 -34549 -13632 167475 51284 232899 190136 -18426 -168955 203065 57603 144274
15074A44274E7393a23953j87396A28818K5406j362c4433E1622J72999N7044m8869
$$ 144274 57393 -123953 -311349 128818 154224 152862 -34433 51622 224621 281665 232796
15063B32796M2077A14406k3294b19632H6034m868K51305g4288C76753j33208J9244
$$ 232796 274873 114406 91112 -219632 86034 81166 332471 -74288 376753 243545 262789
15052B62789o2853K13463j45382J96516F3581K78112j46485a13670C29598L466
$$ 262789 199936 413399 268017 464533 63581 341693 195208 -113670 329598 333064
15042C33064I6342K04776n9892i3685B45488p2774b0625B35910B1097K64006K5727
$$ 333064 96342 301118 241226 -93685 245488 172714 -20625 235910 21097 285103 310830
15031C10830K14217j93999j47697o6680A9101N8483J06402J32995A29221g8034
$$ 310830 525047 331048 183351 116671 19101 77584 183986 316981 129221 -78034
15020D07136K19408C6945J10206M17409j44108j07370J75671A95800K7647J63721
$$ 407136 626544 36945 147151 564560 420452 313082 488753 195800 223447 387168
15010C87168J8743j49921J94308B24285m1518j0343K31884J82741k24997Q6863
$$ 387168 405911 255990 450298 224285 182767 172424 404308 587049 362052 448915
15000D48915h9519A52167K24574K58795G0011K20914J21654A65132K58477j42405
$$ 448915 -89519 152167 376741 635536 70011 290925 412579 165132 423609 281204
14990B81204b684E39607j03927J53769A63190J64616e2544B87992J99623j39178
$$ 281204 -2684 539607 435680 589449 163190 327806 -52544 287992 487615 348437
14980C48437A03402B5337N22564J7738l4800k18652K8426k6351A37022N75546
$$ 348437 103402 25337 547901 565639 530839 312187 340613 314262 137022 712568
14970G12568C41184L01331B64492J99582B09828K8898J00590D3487J92480N7711
$$ 712568 341184 642515 264492 464074 209828 238726 339316 43487 235967 293678
14960B93678K875o173J78389q2540M5481c1052E04495i9323n907B37845r4362
$$ 293678 296553 290380 468769 386229 431710 -31052 504495 -99323 -105230 237845 143483
14949A43483M57244j93819M0723e6510C88688o8215L9300m0298K92207j30221
$$ 143483 600727 406908 447631 -56510 388688 320473 359773 319475 611682 481461
14939D81461r4162j13088C6298N27255B25407K57724H3231L49265n9927m9392
$$ 481461 387299 274211 36298 563553 225407 483131 83231 432496 372569 323177
14929C23177G2804J5217N11951j36511M4938L26658j31025M60396l22754l55155
$$ 323177 72804 88021 599972 463461 508399 835057 704032 1164428 841674 486519
14919D86519k0376L20216K61958j13785J35278o040k67792j44038N4744k68361
$$ 486519 466143 786359 1048317 934532 1069810 1063770 795978 651940 706684 438323
14909D38323J87423k53517j26004R1804K642I444K44385m22J92613J0260r875
$$ 438323 625746 372229 246225 338029 340671 9444 253829 253407 446020 456280 446405
14898D46405q0005J23744k28710J8399J31396F0900P4095K51761K40713l997j44248
$$ 446405 366400 490144 261434 279833 411229 60900 134995 386756 627469 623472 479224
14887D79224r9915J12981B43556J92783Q0970r843k37335M1898m2690M29081H9441
$$ 479224 379309 492290 243556 436339 517309 507466 270131 312029 269339 698420 89441
14875D19902j61510K37232N5448m5153k8189m0527K71517k31528j239j94997N77686
$$ 419902 258392 495624 551072 505919 477730 437203 708720 477192 475953 280956 858642
14864H58642l75927j1642N7749B39712N16331B24081P1765K19976J72451k41036
$$ 858642 482715 471073 528822 239712 756043 224081 295846 515822 688273 447237
14854D47237L79702k85541k11640r8936N06310B94435L31104o4604J99595k23771
$$ 447237 826939 541398 329758 230822 737132 294435 625539 560935 760530 536759
14844E36759P0930J59725C45644J74963K18384j87622L08685l10055J53361J33038
$$ 536759 607689 767414 345644 520607 738991 551369 860054 549999 703360 836398
14834H36398P9798k71001B37807J35260O8049L29530n4409C07988K39171j25494
$$ 836398 916196 645195 237807 373067 441116 770646 716237 307988 547159 421665
14824D21665P8904m7229m7945J7973r9947L72094k71124L8984q9631L49883B15695
$$ 421665 500569 453340 405395 423368 323421 695515 424391 463375 373744 723627 215695
14812B77007n8138K28295j6474j0524N6729L03970C16885M78697l12794M1018
$$ 277007 218869 447164 430690 420166 476895 780865 316885 795582 482788 523806
14802E23806Q3599K34601l88540K55426J09258J09840L508l59560j25277L05639
$$ 523806 607405 842006 453466 708892 818150 927990 931498 571938 446661 752300
14792G52300B15047N1729K90798r032N2475K45485A54743L07744j737j38918K8971
$$ 752300 215047 266776 557574 548542 601017 846502 154743 462487 460750 321832 350803
14781C50803M03983A6958O82870j46469L43603l62650J70468j38976m4798k9864
$$ 350803 754786 16958 699828 553359 896962 534312 704780 565804 521006 491142
14771D91142j05446M98507l71092J1171J73084k98412J62017p2780K39336J15122
$$ 491142 385696 884203 513111 524282 697366 398954 560971 488191 727527 842649
14761H42649M2287l80289J41653J64990j73493j04873J41292j73902k30844L97017
$$ 842649 884936 504647 646300 811290 637797 532924 674216 500314 269470 666487
14751F66487j99309J43429L59913k14369j49992l274j26738O0567R7667q6668
$$ 666487 467178 610607 970520 756151 606159 602885 476147 536714 634381 547713
14741E47713j82060J21987J99063M0589N0471C30790P10365m25438L20298m47406
$$ 547713 365653 487640 686703 727292 777763 330790 1041155 615717 936015 488609
14731D88609J80962J38011m9678j42017M2792l07287M44608K7793J48522M421
$$ 488609 669571 807582 757904 615887 658679 351392 796000 823793 972315 976736
14721I76736L59322j86864M3435M4147m10573k31448M37788j05283j16899j10082
$$ 976736 1336058 1149194 1192629 1236776 826203 594755 1032543 927260 810361 700279
14711G00279J0276K36073j31520J01920J21001l10243K91210o0047J97754l65662
$$ 700279 710555 946628 815108 917028 1038029 727786 1018996 958949 1156703 791041
14701G91041p0503M70177j79226L8409M0360k39640N3305J49327J0489j18407
$$ 791041 720538 1190715 1011489 1049898 1090258 850618 903923 1053250 1063739 945332
14691I45332K17923J11542j97697k0398j33867O0479k59471P8174M6301J84992
$$ 945332 1163255 1274797 1077100 1056702 922835 983314 723843 802017 848318 1033310
14681A033310l31455J23458L11842j92015j35458M42565n12933K47410J25771
$$ 1033310 701855 825313 1137155 945140 809682 1252247 739314 986724 1112495
14672A112495j63027Q3714k19425n7911K94019K5546n7122m9559J70075m04334
$$ 1112495 949468 1033182 813757 755846 1049865 1075411 1018289 968730 1138805 734471
14662G34471J49416q7055J071J64285M6889K5025j18737K9648J10207J95216j73553
$$ 734471 883887 796832 797903 962188 1009077 1034102 915365 945013 1055220 1250436 1076883
14651A076883K58329n84179M61218l6612n2789k26337M90406o888L1950l78995
$$ 1076883 1335212 751033 1212251 1175639 1122850 896513 1386919 1380031 1411981 1032986
14641A032986o4879P978O723L03666m27952p2577M50930K52015m77831o229L2577
$$ 1032986 968107 976085 982808 1286474 858522 785945 1236875 1488890 1011059 1004830 1037407
14630A037407K16384p1340O1108R2656n1030m80042K24078L01026r347R1657J7746
$$ 1037407 1253791 1182451 1243559 1336215 1285185 805143 1029221 1330247 1320900 1412557 1430303
14619A430303p9098J65324k86521K28259K26980m17941j4873K32810N2846l05696
$$ 1430303 1351205 1516529 1230008 1458267 1685247 1267306 1252433 1485243 1538089 1232393
14609A232393K5997R7345j17708L33362p61767P53761n6327l35927L0215J42726
$$ 1232393 1258390 1355735 1238027 1571389 809622 1563383 1507056 1171129 1201344 1344070
14599A344070K33144k3426L9124k32339N10058l27096l5215p5050M36981l19597
$$ 1344070 1577214 1553788 1592912 1360573 1870631 1543535 1508320 1433270 1870251 1550654
14589A550654L82566j63931J03002O6052n83635J69451J24548j05400k4441P60886
$$ 1550654 1933220 1769289 1872291 1938343 1354708 1524159 1648707 1543307 1518866 2279752
14579B279752k63517k62169j30156M24251k04547J86834k17631O5059L0032j85235
$$ 2279752 2016235 1754066 1623910 2048161 1843614 2030448 1812817 1877876 1907908 1722673
14569A722673N95734m56588j9172M16758K0712j11653r630L68112j68656K52923
$$ 1722673 2318407 1861819 1842647 2259405 2280117 2168464 2158834 2526946 2358290 2611213
14559B611213M0866J4362P6657J42339J64203M22404K94763M46503O06613R90928
$$ 2611213 2652079 2666441 2743098 2885437 3049640 3472044 3766807 4213310 4819923 5810851
14549E810851K507045M123065Q211950J3150137J563860j6691359q503215l172754
$$ 5810851 8317896 12440961 20652911 33803048 35366908 18675549 10172334 6999580
14541F999580k931263j560379m98949k2004M6827j93326k0580M39617l37919j83982
$$ 6999580 4068317 2507938 2008989 1986985 2033812 1840486 1819906 2259523 1921604 1737622
14531A737622M48815m86209L4532L34932J445J00196L2621k07179K90247L33225
$$ 1737622 2186437 1700228 1734760 2069692 2071137 2171333 2203954 1996775 2287022 2620247
14521B620247n53004J7803R2212R6098M6960K96694q2065l0558R2560J27396l25181
$$ 2620247 2067243 2085046 2177258 2273356 2320316 2617010 2534945 2504387 2596947 2724343 2399162
14510B399162q1089O6304K34194J76506l33879J24614P0677K28358k92636J05283
$$ 2399162 2318073 2384377 2618571 2795077 2461198 2585812 2656489 2884847 2592211 2697494
14500B697494K13518j18066J34940j62283K33508R657P2248l8994k39674O22283
$$ 2697494 2911012 2792946 2927886 2765603 2999111 3008768 3081016 3042022 2802348 3424631
14490C424631j46306J83918l43623q9986M49821l26701R2155P7495J7936J97709
$$ 3424631 3278325 3462243 3118620 3028634 3478455 3151754 3243909 3321404 3339340 3537049
14480C537049j48153J08166n0256M54022k78295K1704k2622J14572p860M93583
$$ 3537049 3388896 3497062 3446806 3900828 3622533 3644237 3621615 3736187 3728327 4221910
14470D221910m07192N3181K60746o0726k58318j7171N6174L50788K1181L21576
$$ 4221910 3814718 3867899 4128645 4067919 3809601 3792430 3848604 4199392 4220573 4542149
14460D542149m22326Q1230j70605L58175L20244j53648k14258L88890J79425j15806
$$ 4542149 4119823 4201053 4030448 4388623 4708867 4555219 4340961 4729851 4909276 4793470
14450D793470K53596j98741K59921q9661K85221l57462J31233M23477k58306K02231
$$ 4793470 5047066 4848325 5108246 5018585 5303806 4946344 5077577 5501054 5242748 5444979
14440E444979k0008J62647J64497J47229k40100L70512q1507r5940K20534N4953
$$ 5444979 5424971 5587618 5752115 5899344 5659244 6029756 5948249 5852309 6072843 6127796
14430F127796o4120J67300J05555K00900J11700J39874P6395L4453J05650n4735
$$ 6127796 6063676 6230976 6336531 6537431 6649131 6789005 6865400 6899853 7005503 6950768
14420F950768l1789L85607L9245L49250L0298k32958M29930j28916K06776m91
$$ 6950768 6918979 7304586 7343831 7693081 7723379 7490421 7920351 7791435 7998211 7997720
14410G997720J44273J10594L91492j01386R0118K7123M26187K2042M1348K26895
$$ 7997720 8141993 8252587 8644079 8542693 8632811 8659934 9086121 9108163 9149511 9376406
14400I376406K16658N84915l39456J56599M99807l2735j8335J95166M52598m1565
$$ 9376406 9593064 10177979 9838523 9995122 10494929 10462194 10443859 10639025 11091623 11050058
14390A1050058M58722j67464M34074j06550P21979j57051L30328L2495L57817
$$ 11050058 11508780 11341316 11775390 11668840 12390819 12233768 12564096 12596591 12954408
14381A2954408L90331K17575J76543J96883L72723J20810J17734O05102L78216
$$ 12954408 13344739 13562314 13738857 13935740 14308463 14429273 14547007 15152109 15530325
14372A5530325J89064J36224M91455M42277J00890M24307O75924J3841M24377
$$ 15530325 15719389 15855613 16347068 16789345 16890235 17314542 17990466 18004307 18428684
14363A8428684L23006L85016M15306N76418O01147O13556L99845L1559O09848
$$ 18428684 18751690 19136706 19552012 20128430 20729577 21343133 21742978 21774537 22384385
14354B2384385R16574M08849N11843Q66337K71253R59737M37476O64162N89964
$$ 22384385 23300959 23709808 24221651 25087988 25359241 26318978 26756454 27420616 28010580
14345B8010580O22532P99463R12103O35107R52060R96381O70001R55410J074020
$$ 28010580 28633112 29432575 30344678 30979785 31931845 32928226 33598227 34553637 35627657
14336C5627657J229575P09103J426929Q66179J222728J878535R93672J736869
$$ 35627657 36857232 37566335 38993264 39859443 41082171 42960706 43954378 45691247
14328D5691247J434390J450453J532113J659110J757326K212530J960771K010349
$$ 45691247 47125637 48576090 50108203 51767313 53524639 55737169 57697940 59708289
14320E9708289K028646K041759K728085K355840K750089K631663K796101L462008
$$ 59708289 61736935 63778694 66506779 68862619 71612708 74244371 77040472 80502480
14312H0502480L142948L308039L752974L591186M266397M115260N090730M584177
$$ 80502480 83645428 86953467 90706441 94297627 98564024 102679284 107770014 112354191
14304A12354191N239534N665732O084940N897896O512814P134966P142172P880161
$$ 112354191 117593725 123259457 129344397 135242293 141755107 148890073 156032245 163912406
14296A63912406Q339942Q671389R289103J0077618J0272723J0925744J1533740
$$ 163912406 172252348 180923737 190212840 200290458 210563181 221488925 233022665
14289B33022665J1992298J2457980J2976190J3639842J3814495J4160471J4626178
$$ 233022665 245014963 257472943 270449133 284088975 297903470 312063941 326690119
14282C26690119J4642608J4573857J4501268J4331324J3320156J2905192J1426387
$$ 326690119 341332727 355906584 370407852 384739176 398059332 410964524 422390911
14275D22390911J0291288P582209L468396L37706L11698Q00821j127890l215670
$$ 422390911 432682199 440264408 443732804 444070510 444382208 445183029 444055139 440839469
14267D40839469m420485p085989r649378j1372818j3031778j4521699j5384716
$$ 440839469 436418984 429332995 419683617 408310799 395279021 380757322 365372606
14260C65372606j5584696j5729788j5362562j5476711j4931574j4480627j3933723
$$ 365372606 349787910 334058122 318695560 303218849 288287275 273806648 259872925
14253B59872925j2481639j2187192j2058960j1369867j0817368j0490712r434080
$$ 259872925 247391286 235204094 223145134 211775267 200957899 190467187 181033107
14246A81033107q916258q455753p679667p630536o848809o637935o060264n896931
$$ 181033107 172116849 163661096 155981429 148350893 141502084 134864149 128803885 122906954
14238A22906954n003119n236187n070831m653678m376646m338347l423635l513443
$$ 122906954 117903835 112667648 107596817 102943139 98566493 94228146 90804511 87291068
14230H7291068l616825l498350l255450k828758k358127k742506k699968k341592
$$ 87291068 83674243 80175893 76920443 74091685 71733558 68991052 66291084 63949492
14222F3949492k265181k279552j661863j872360k003958j862427j832304j395683
$$ 63949492 61684311 59404759 57742896 55870536 53866578 52004151 50171847 48776164
14214D8776164j470813j251785j365382j592215j337636j184282r05523p88551
$$ 48776164 47305351 46053566 44688184 43095969 41758333 40574051 39668528 38879977
14206C8879977j317037j045108j153286r84630r82215k65617j144103r85825o68657
$$ 38879977 37562940 36517832 35364546 34379916 33397701 33132084 31987981 31002156 30333499
14197C0333499r06247r47729p00305o29067n93576p61053o34018n73978m56744
$$ 30333499 29427252 28479523 27779218 27150151 26556575 25795522 25161504 24587526 24130782
14188B4130782m02371q21205o04619o27199l23873o26907k65378l79251l30745
$$ 24130782 23728411 22907206 22302587 21675388 21351515 20724608 20459230 20079979 19749234
14179A9749234m11784l14749n52313j57646o55394k78776l72842k96123k98162
$$ 19749234 19337450 19022701 18470388 18312742 17657348 17378572 17005730 16709607 16411445
14170A6411445l39946o4061n98768p1393l66861k13052m9072p84057k07576l5407
$$ 16411445 16071499 16007438 15408670 15337277 14970416 14757364 14708292 13924235 13716659 13681252
14160A3681252K62299n93010n16980j51988q4011k90963l00753K1067k51006j97815
$$ 13681252 13943551 13350541 12833561 12681573 12597562 12306599 12005846 12026913 11775907 11578092
14150A1578092j90387k66570m38987L67285m15928k85479n2572p803k10747l79334
$$ 11578092 11387705 11121135 10682148 11049433 10633505 10348026 10295454 10287651 10076904 9697570
14140I697570k1779m99219n2970J18606M5896k92563k91805l6747k86940N1574
$$ 9697570 9675791 9176572 9123602 9242208 9288104 8995541 8703736 8666989 8380049 8431623
14130H431623n08779L23130j91571n731n32329L07373m06620r8077L35648n19345
$$ 8431623 7922844 8245974 8054403 8048672 7516343 7823716 7417096 7319019 7654667 7135322
14120G135322r3439O6670p7898K3570m72684K65469k78135K76145p16780N86844
$$ 7135322 7041883 7108553 7030655 7054225 6581541 6847010 6568875 6845020 6128240 6715084
14110F715084n46833m1899L4943q3852o215l7351k98811J56186j14442k48817
$$ 6715084 6168251 6126352 6161295 6077443 6071228 6033877 5735066 5891252 5776810 5527993
14100E527993j9123n6912N60209m62225m12845K17012J4081J01489l63601K52229
$$ 5527993 5508870 5451958 6012167 5549942 5137097 5354109 5368190 5469679 5106078 5358307
14090E358307l83790J8441k73062P5358n8451l22799M54212k94645J10957J99358
$$ 5358307 4974517 4992958 4719896 4795254 4736803 4414004 4868216 4573571 4684528 4883886
14080D883886p09533J21923K44604m23889K49888j341m93112O54112n70214P0091
$$ 4883886 4174353 4296276 4540880 4116991 4366879 4365538 3872426 4526538 3956324 4026415
14070D026415p7497M3391J5898m69460K97788J04564R1208k53006k86025J31893
$$ 4026415 3948918 3992309 4008207 3538747 3836535 3941099 4032307 3779301 3493276 3625169
14060C625169l75245K30429J17531M1895m91748R4784K50518l46434R2520K12747
$$ 3625169 3249924 3480353 3597884 3639779 3148031 3242815 3493333 3146899 3239419 3452166
14050C452166j42950j01531k98531K46269K27056l26899j58762O44491n45274
$$ 3452166 3309216 3207685 2909154 3155423 3382479 3055580 2896818 3541309 2996035
14041B996035j6184N028P0555N8416k06033j76988K21839l34206L9313M18852
$$ 2996035 2979851 2984879 3055434 3113850 2907817 2730829 2952668 2618462 2657775 3076627
14031C076627j16194P1850J88382m27288J17439j80758j53878m85632L83181J52472
$$ 3076627 2960433 3032283 3220665 2793377 2910816 2730058 2576180 2090548 2473729 2626201
14021B626201n56007O85863j00972j52932q4651k3108j51714L1575J09170l9661
$$ 2626201 2070194 2756057 2655085 2502153 2417502 2394394 2242680 2274255 2383425 2343764
14011B343764j87436M503j25954L97536l80647J03719O3952k17415R0542P4980
$$ 2343764 2156328 2160831 2034877 2432413 2051766 2155485 2219437 2002022 2092564 2167544
14001B167544k72324l413M23552j26548J38290l11231K01795o397R5120K83635
$$ 2167544 1895220 1891807 2315359 2188811 2327101 2015870 2217665 2211268 2306388 2590023
13991B590023k48722J117705J287372K735882O831066J2976144J0185312j3099491
$$ 2590023 2341301 3459006 4746378 7482260 14313326 27289470 37474782 24375291
13983B4375291j1576523m877797k276152j385038l99871n44247j7670m34814j15188
$$ 24375291 12798768 7920971 5644819 4259781 3859910 3315663 3297993 2863179 2747991
13974B747991k75736J87358k23146o7489R2133r9056j07279J29578J43019l96391
$$ 2747991 2472255 2659613 2436467 2368978 2461111 2362055 2254776 2384354 2527373 2130982
13964B130982O0963q0354J53185l20435p0358j9210P6384J77752l14765K5811
$$ 2130982 2191945 2111591 2264776 1944341 1873983 1854773 1931157 2108909 1794144 1819955
13954A819955j70738J19520k36002K11282P20K5314j89431K13563k7592j87319
$$ 1819955 1649217 1768737 1532735 1744017 1744737 1770051 1580620 1794183 1766591 1579272
13944A579272q938O5073P3121J2964k15394p305J28734k00965j33756L7229L41762
$$ 1579272 1570334 1635407 1708528 1721492 1506098 1498793 1627527 1426562 1292806 1330035 1671797
13933A671797j61218j29316k04681J80709j98698O44516o07312L69590k01291
$$ 1671797 1510579 1381263 1176582 1357291 1158593 1803109 1195797 1565387 1364096
13924A364096L32420m58551J23532n2583L98955p76273N04665o0815J5886K33468
$$ 1364096 1696516 1237965 1361497 1308914 1707869 931596 1436261 1375446 1391332 1624800
13914A624800j58794j53594r1150o101j52714M09138l68245J41167K78795k70809
$$ 1624800 1466006 1312412 1221262 1215161 1062447 1471585 1103340 1244507 1523302 1252493
13904A252493k9560K39771Q8082k15288n17816R0379n4183M08608R3170j15395
$$ 1252493 1222933 1462704 1550786 1335498 817682 908061 853878 1262486 1355656 1240261
13894A240261L67899l78388J12346L76572G95584K29794J10088J87217m95897
$$ 1240261 1608160 1229772 1342118 1718690 795584 1025378 1135466 1322683 826786
13885H26786K72012O2028K6156k70504J28100O4397J64805l50369J56488N2134
$$ 826786 1098798 1160826 1186982 916478 1044578 1108975 1273780 923411 1079899 1132033
13875A132033n438m94035N27727j28133K01651j86870O3064j27306Q425l0059
$$ 1132033 1126595 632560 1160287 1032154 1233805 1046935 1109999 982693 991118 961059
13865I61059J67724o7948j54713n6873o5462K16875K69078n07612J85571K29456
$$ 961059 1128783 1060835 906122 849249 783787 1000662 1269740 762128 947699 1177155
13855A177155J0824k03443k615n3566k83061L47612j06544o6035m1270O0769J01868
$$ 1177155 1187979 984536 981921 928355 645294 992906 886362 820327 779057 839826 941694
13844I41694J69668J49748l50804K3562p1778k79752M12146J23877j84304J07109
$$ 941694 1111362 1261110 910306 933868 862090 582338 994484 1118361 934057 1041166
13834A041166j3344m58217M10834p7280k32812Q6807L9189M81012m26357L1019
$$ 1041166 1027822 569605 980439 903159 670347 757154 796343 1277355 850998 882017
13824H82017k77688k0380J05470k3944k92369N59701k61577J12075J40719l56844
$$ 882017 604329 583949 689419 665475 373106 932807 671230 783305 924024 567180
13814E67180O9747q9045K45389j16192o6539K04117j11900L78984j83308N4443
$$ 567180 636927 547882 793271 677079 610540 814657 702757 1081741 898433 952876
13804I52876k44906p629j43403Q2244J52173j29628j61915M02444k72975K1679
$$ 952876 707970 700341 556938 639182 791355 661727 499812 902256 629281 650960
13794F50960J7045K68830q2045j28686J65097l53009L95129k82742N3686J21683
$$ 650960 668005 936835 854790 726104 891201 538192 933321 650579 704265 825948
13784H25948C68845J61836r497L11136j06308C62976L74055j54743M2307J12860
$$ 825948 368845 530681 521184 832320 726012 362976 737031 582288 624595 737455
13774G37455j21869J55993J1768l4957j01654j7801K5792J73468l8295l52754
$$ 737455 615586 771579 783347 748390 646736 628935 654727 828195 789900 437146
13764D37146K30265M8197n6512j48357J3751K43209r2750J05378r0153j58444
$$ 437146 667411 715608 659096 510739 524490 767699 674949 780327 690174 531730
13754E31730K53254C55513J27357J85543J6928Q5205J9970o7615q1180l894r4073
$$ 531730 784984 355513 482870 668413 685341 770546 790516 722901 641721 637827 543754
13743E43754L2592P6443l08407K16247k14627L14718p0921k30717L34720l00322
$$ 543754 576346 652789 344382 560629 346002 660720 589799 359082 693802 393480
13733C93480M30861l60585J63627k99609J20889r4982Q7674O8817J66031k76770
$$ 393480 824341 463756 627383 327774 448663 353681 441355 510172 676203 399433
13723C99433q5924K90238j14747J04226j37456j14363L55084C34599j05945M00037
$$ 399433 313509 603747 489000 593226 455770 341407 696491 334599 228654 628691
13713F28691j18706j39606M3989q2630J73015R6885k71357L56594p0245j96088
$$ 628691 509985 370379 414368 331738 504753 601638 330281 686875 616630 420542
13703D20542j10088J94977K00590k85715O7274J90123k08595J26362j97673o3066
$$ 420542 310454 505431 706021 420306 487580 677703 469108 595470 397797 334731
13693C34731J59222A58703M35867j598J36336A97765Q9342A39549K98020A43089
$$ 334731 493953 158703 594570 592972 729308 197765 287107 139549 437569 143089
13682C76274j07330J67698O7435r8002j32873N7548K37376j0585k57455J27175
$$ 376274 268944 436642 504077 406075 273202 330750 568126 557541 300086 427261
13672D27261o7430p7053L65684B24420L05815A32601N88609A46503K88781O4o1538
$$ 427261 359831 282778 648462 224420 530235 132601 721210 146503 435284 435348 373810
13661C73810j18076K4454K65730A86131K63117m5086J62587B16044E0971J68283
$$ 373810 255734 280188 545918 186131 449248 404162 566749 216044 50971 219254
13651B19254K29116l0693K19828A54847K1966N0271K01896A00525l0530R6784
$$ 219254 448370 417677 637505 154847 176813 227084 428980 100525 69995 166779
13641A66779J8316J29660j48830L55076k23432J09297K04575j52517k06972K57431
$$ 166779 185095 314755 165925 521001 297569 406866 611441 458924 251952 509383
13631E09383P3691j80694o4152J81687R4341j63779A29771J94413p0676J25579
$$ 509383 583074 402380 338228 519915 614256 450477 129771 324184 253508 379087
13621C79087J53550k40985L35587k51412k0731p6467J44033K0089j75408J14624
$$ 379087 532637 291652 627239 375827 355096 278629 422662 442751 267343 381967
13611C81967K3028J76551A27298L44785j7280k224J2998D7099O10549k72379k0351
$$ 381967 404995 581546 127298 472083 454803 452579 465577 47099 657648 385269 364918
13600C64918l8610l6153J12873K08377B74909j34496K54885R1140L401q1762q6347
$$ 364918 326308 290155 403028 611405 274909 140413 395298 486438 489839 408077 321730
13589C21730J8114A36337P2170E2973M3201M74682p5842r0041J26876C189M81992
$$ 321730 339844 136337 208507 52973 96174 570856 495014 404973 531849 3189 485181
13578D85181A71113Q4833J39838O1189k00856J87134M8815F1978J99063J12565
$$ 485181 171113 255946 395784 456973 256117 443251 492066 61978 261041 373606
13568C73606J34506A07828j1920C9317P1868J93220A35608Q5479K04382l5840
$$ 373606 508112 107828 95908 39317 111185 304405 135608 221087 425469 389629
13558C89629j40098Q9066Q4235K31692j97585k12023K30030B16585h6579H6531
$$ 389629 249531 338597 422832 654524 456939 244916 474946 216585 -86579 86531
13547C68391A47363J58079l965j06550K00883a19207B64635E4057L94912A29806
$$ 368391 147363 305442 301477 194927 395810 -119207 264635 54057 448969 129806
13536B69229O5267N0896I4366m4716J39426D6908J64106J5235A12654J39430E2131
$$ 269229 334496 385392 94366 49650 189076 46908 211014 226249 112654 252084 52131
13524a53008B57559J10699j1713j51657O0052H4514l00c2751F3031J29656nl7159
$$ -153008 257559 368258 356545 204888 264940 84514 84214 -32751 63031 192687 192682 155523
13512A55523J78498j27583f256B40905J65388p4129H5299B93M759J35670M21100
$$ 155523 334021 206438 -6256 240905 406293 332164 85299 293 5052 140722 561822
13501E61822J14122A10113J42945O1270A43439J2857P5917K37564a72500D5572
$$ 561822 675944 110113 253058 314328 143439 156296 232213 469777 -172500 45572
13490B56196J11271j25382a73833I6469K21112A27644L74259A07459N55034A57727
$$ 256196 367467 242085 -173833 96469 317581 127644 501903 107459 662493 157727
13479f5100B23030J67901L7696o6198P4836I2545J04343p569k413J30102A48597
$$ -65100 223030 390931 428627 362429 437265 92545 196888 189319 186906 317008 148597
13467A48237a09234C40508M4044e2853B18175o2062J52929A00351k0438J04068
$$ 148237 -109234 340508 384552 -52853 218175 156113 309042 100351 79913 183981
13457A83981l7325L36984j15650F2321M9693j335K66632j24574G3257L31108j09207
$$ 183981 146656 483640 367990 62321 112014 110679 377311 252737 73257 404365 295158
13446B95158a65714C48261j09240f947A55692K42533c59159B64740K97422B28627
$$ 295158 -165714 348261 239021 -6947 155692 398225 -359159 264740 562162 228627
13435C0808O7877e0089B33782q6468h855j4274I5010J12889h0493D25256G8777
$$ 30808 98685 -50089 233782 147314 -8855 -23129 95010 207899 -80493 425256 78777
13423B2582a80594C23566p0453J62260A611M671J80271J38093J6008j67416q6521
$$ 22582 -180594 323566 253113 415373 1611 6282 186553 324646 340654 173238 86717
13412H6717K98673A60135a01452C35078L5474A05520j6439N6861L6206J7395o8205
$$ 86717 385390 160135 -101452 335078 370552 105520 89081 145942 182148 199543 131338
13401A31338J4257N618J72643n9774A27284J48961F6276B9084P8534D583P779
$$ 131338 145595 151213 323856 264082 127284 276245 66276 29084 107618 4583 12362
13390A2362J34885L4871K04803K19651B99038J85560C4278K04154m1496J58565
$$ 12362 147247 182118 386921 606572 299038 484598 34278 238432 196936 355501
13380C55501L4538C5416C613J50340J72464J49623A42858o0372J60705A14374
$$ 355501 390039 35416 3613 153953 326417 476040 142858 82486 243191 114374
13369E4960K96633C2285K0576j1161A0186L509J90709n7611R4091q9057O6111
$$ 54960 351593 32285 52861 41700 10186 13695 204404 146793 240884 151827 217938
13358B17938J60604A69310b409A34851P1534J0070j9060K9616q648L3442j16968
$$ 217938 378542 169310 -2409 134851 206385 216455 197395 227011 218363 251805 134837
13347A34837N8930K13459A73307P6534g2586F24587A20884K16028k4329j7868
$$ 134837 193767 407226 173307 249841 -72586 624587 120884 336912 312583 294715
13337B94715p85L4958K2622J22874m0592N3557a55133D12316c1947p2666B50559
$$ 294715 293930 328888 351510 474384 433792 487349 -155133 412316 -31947 -104613 250559
13325C48672A44085M55153g8241C17978C438K55832J3357r1186J71330A54008
$$ 348672 144085 599238 -78241 317978 3438 259270 272627 181441 352771 154008
13314D0319L26215j33084a57403B02430g0712C66727n4555j13161J26386B7654
$$ 40319 366534 233450 -157403 202430 -70712 366727 312172 199011 325397 27654
13303D83501A00613L30496g3423A05112M5498M4397F7618e3589B96133i618B3832
$$ 483501 100613 431109 -73423 105112 150610 195007 67618 -53589 296133 -9618 23832
13291B11666m1226L95816a96209i2591b4161j29876l41108C44256I5838k0000
$$ 211666 170440 566256 -196209 -92591 -24161 -154037 -495145 344256 95838 75838
13281G5838P6127P0635i763o6866A43042N1449p9532J92142j44135a99621A10860
$$ 75838 151965 222600 -9763 -76629 143042 194491 114959 307101 162966 -199621 110860
13269F6561a5220k20229B26802A01249J02628a96415c1124F664f2541A51352J2291
$$ 66561 -15220 -235449 226802 101249 203877 -196415 -31124 6664 -62541 151352 163643
13258A63643q0817f8337J7211j66733o315M4338A59184C9835f8214e977j89743
$$ 163643 82826 -68337 -51126 -217859 -224174 -179836 159184 39835 -68214 -5977 -195720
13247a95720A8699J76385a41310A04201a41757A20324b99744A47495E0039K00683
$$ -195720 18699 195084 -141310 104201 -141757 120324 -299744 147495 50039 250722
13237B50722b17776a03877I2966a77488B10993p183j9439l1473g3989A65789B6682
$$ 250722 -217776 -103877 92966 -177488 210993 203810 184371 152898 -73989 165789 26682
13225G9076e9344b1162j3211B80978J12519a75131A35974O1272I05a56777A12710
$$ 79076 -59344 -21162 -34373 280978 393497 -175131 135974 197246 905 -156777 112710
13213A16610a88473B50405M289a87205m0097J09531D05605A86221q8193J06000
$$ 116610 -188473 250405 254694 -187205 -227302 -117771 405605 186221 98028 204028
13203B04028J85144a78637H8553c8808C06861j02973b8010B52136j19902j6287
$$ 204028 389172 -178637 88553 -38808 306861 203888 -28010 252136 132234 115947
13193A15947i1860d4116B60175B8504h6998K2399F9152c88199C12203G213L327
$$ 115947 -91860 -44116 260175 28504 -86998 -64599 69152 -388199 312203 7213 10540
13182A0540R7949j9394c4152n5390A24177a94616C2552i0336D3697b736j30H3404
$$ 10540 108489 89095 -34152 -89542 124177 -194616 32552 -90336 43697 -2736 -2866 83404
13169a2062j75884C0768J01095n1685J5494P68j2805R6687a83273A75526l8773
$$ -12062 -187946 30768 131863 80178 95672 96440 83635 180322 -183273 175526 136753
13158A36753J64174A28362d6932B21902F1665J49648a8065F6498a40035F665b46524
$$ 136753 300927 128362 -46932 221902 61665 211313 -18065 66498 -140035 6665 -246524
13146A03954J7250n5933d7071B62475b10820A3342L2975K35007d4442F9166k8130
$$ 103954 121204 65271 -47071 262475 -210820 13342 46317 281324 -44442 69166 41036
13135D1036a36496F4609b21110j7795d0595B06430a20222M64B8419e3322B04593
$$ 41036 -136496 64609 -221110 -238905 -40595 206430 -120222 -119758 28419 -53322 204593
13123C08122O5938b25455B88048i4892d852j1903D906a40444B13455p4988Q2315
$$ 308122 374060 -225455 288048 -94892 -4852 -16755 4906 -140444 213455 138467 220782
13112B20782K28346D3754L3574f898A49937C6014K94537D392j298K14646H1845
$$ 220782 449128 43754 77328 -6898 149937 36014 330551 4392 3094 217740 81845
13100D7437c0783k8799q4725a8355B69376G7649K54720I6012Q3425a3059A83318
$$ 47437 -30783 -59582 -144307 -18355 269376 77649 332369 96012 179437 -13059 183318
13088A80719B3485b27587C59810j45528D2727g2227A45323b18584a07900B91711
$$ 180719 23485 -227587 359810 214282 42727 -72227 145323 -218584 -107900 291711
13077a27476o6291D20118g7245D1483M93622B909R3968b50103A09795L219k997
$$ -127476 -193767 420118 -77245 41483 535105 2909 96877 -250103 109795 113014 110017
13066A10017J53448c840A81974d8324C60723h9285r8486A36655b72319A55324
$$ 110017 263465 -3840 181974 -48324 360723 -89285 -187771 136655 -272319 155324
13055b63246A87133Q6116A12469J37640G6284L4085e7773m5851C1692O5815B6546
$$ -263246 187133 273249 112469 250109 76284 110369 -57773 -103624 31692 97507 26546
13043b9501p9585l12804C20726j47378Q0558J14838D1782J42410D6575a36462
$$ -29501 -109086 -421890 320726 173348 253906 368744 41782 184192 46575 -136462
13032a58173B68395I4140g9254B62482c7358J2596A19595K62675A59489o2244
$$ -158173 268395 94140 -79254 262482 -37358 -24762 119595 382270 159489 97245
13022I7245M1297a61770D6905P5056E9961J88489L7251F2433J06298p5920f770
$$ 97245 138542 -161770 46905 121961 59961 248450 285701 62433 168731 92811 -6770
13010C05583e7150L724K5706E4635Q1661A3681L81632f831B58059N9460J09906
$$ 305583 -57150 -53426 -27720 54635 136296 13681 395313 -6831 258059 317519 427425
12999D27425A15186J9926j7689a9778B19624b08253A50598a8922C04858q8674
$$ 427425 115186 135112 117423 -19778 219624 -208253 150598 -18922 304858 216184
12989B16184a06733A90709C4207a65823B08153M0157a8996m4400B90362D5734
$$ 216184 -106733 190709 34207 -165823 208153 248310 -18996 -63396 290362 45734
12978H6126h6781A38741o3946j6191Q8147d0428C4530J87963G5345i2168B33383
$$ 86126 -86781 138741 74795 58604 146751 -40428 34530 222493 75345 -92168 233383
12966h9275C5032k858N1718P8902J49903a79373H5278P2171h9864d0556j63727
$$ -89275 35032 32174 83892 162794 312697 -179373 85278 157449 -89864 -40556 -204283
12955b04283k24285a96633A3634b2799r081j65821A79797k746b32563C276b365
$$ -204283 -428568 -196633 13634 -22799 -31880 -197701 179797 177051 -232563 3276 -2365
12943A13387a91090K5831a1074A9706L6053a2416I0645a48588e9249B18218b90313
$$ 113387 -191090 -165259 -11074 19706 55759 -12416 90645 -148588 -59249 218218 -290313
12931F2522a31065d7273f968E5002J8618K25001h7865B4667K3466Q73b6178A3719
$$ 62522 -131065 -47273 -6968 55002 73620 298621 -87865 24667 48133 49006 -26178 13719
12918D069a88305f813j03028B11897a25043B82064I6783R5765b26423G723e1002
$$ 4069 -188305 -6813 -109841 211897 -125043 282064 96783 192548 -226423 7723 -51002
12906E0516f417E2768b48727n3535a01828A37571l1218A0957b83634c616G4619
$$ 50516 -6417 52768 -248727 -302262 -101828 137571 106353 10957 -283634 -3616 74619
12894D8787a5171A25189f4830A18136e7176C0536J05486j2660N2181a12733k0039
$$ 48787 -15171 125189 -64830 118136 -57176 30536 136022 123362 175543 -112733 -132772
12883a32772B18338a87095B64714l8208A7399c00381f6465a6152B60324d3178
$$ -132772 218338 -187095 264714 226506 17399 -300381 -66465 -16152 260324 -43178
12872B50906A4566b26534d0690B35783M629J48654a96798a4606m5638G4026a22773
$$ 250906 14566 -226534 -40690 235783 240412 389066 -196798 -14606 -60244 74026 -122773
12860b3989F3681o614J54086E1833A8438J75888F4078a30521C78483j1892c44428
$$ -23989 63681 57067 211153 51833 18438 194326 64078 -130521 378483 366591 -344428
12848E6879E390P2579d9015A35979o2319J5302a6022j166j5706n3855B68474a21939
$$ 56879 5390 77969 -49015 135979 73660 88962 -16022 -17188 -32894 -86749 268474 -121939
12835A07366b09163A29320m3085J36933F6920R9956b37152h450j86708A21010
$$ 107366 -209163 129320 86235 223168 66920 166876 -237152 -8450 -195158 121010
12824A40068j8662J714E5430c9882j47924B28280b60051h7637k2569O949L954
$$ 140068 121406 123120 55430 -39882 -187806 228280 -260051 -87637 -110206 -103257 -99303
12813i9303G3228k1534a0735D9782i1724G3608M4674O5258b08420n6911Q6997
$$ -99303 73228 51694 -10735 49782 -91724 73608 118282 183540 -208420 -265331 -178334
12802a78334q9490f7231A07536D8531K48014j13446a44287f4462k14893d8191
$$ -178334 -267824 -67231 107536 48531 296545 183099 -144287 -64462 -279355 -48191
12791B29107f2129b573j19209J2288L4369A6160A855L1194i6965a5178l6791k1801
$$ 229107 -62129 -2573 -121782 -109494 -75125 16160 1855 33049 -96965 -15178 -51969 -73770
12779g3770j7611k6147E4868a61299L2158b804k08780e8704p4668A5953O1858
$$ -73770 -91381 -117528 54868 -161299 -129141 -2804 -211584 -58704 -133372 15953 77811
12768G7811C1217d8393a8470q1101l6268j08795a07044k07266D0538J60770J92720
$$ 77811 31217 -48393 -18470 -99571 -135839 -244634 -107044 -314310 40538 201308 394028
12757C94028b02683a6642F592J17367A5765h8285j20758A67577A7034L1J9130
$$ 394028 -202683 -16642 6592 123959 15765 -88285 -209043 167577 17034 17065 36195
12746C6195a3929E4524d1794A69981n1379J58816i3663C01338A08641P9052g8652
$$ 36195 -13929 54524 -41794 169981 118602 277418 -93663 301338 108641 187693 -78652
12734A81326k2905b04837a1082A52315a43254H0264C1617K47593b40534C48098
$$ 181326 158421 -204837 -11082 152315 -143254 80264 31617 279210 -240534 348098
12723h1214G4170B0832h7371B59380E2003P1249L22719B0879b544l2063a2032
$$ -81214 74170 20832 -87371 259380 52003 123252 445971 20879 -2544 -34607 -12032
12711C921J71450p711K21538m3881B6786e7367A94307J5851a82785A40468F5348
$$ 3921 175371 167660 389198 345317 26786 -57367 194307 210158 -182785 140468 65348
12699G1054B2890J14976j550J286M8316p1361K957a46992C10976H5887c4365A69960
$$ 71054 22890 137866 136316 137602 185918 114557 117514 -146992 310976 85887 -34365 169960
12686C02971a84620I2117J89053F2014e201B79805c35818I8510c5478k8410B25247
$$ 302971 -184620 92117 281170 62014 -5201 279805 -335818 98510 -35478 -63888 225247
12674a71709e3001B54725b75142d043j58647B30696F0897L26320A36203J83033
$$ -171709 -53001 254725 -275142 -4043 -162690 230696 60897 387217 136203 319236
12664C19236O968e0557C2769Q7823K9723c6427A31988a80466C4689K30505A21001
$$ 319236 326204 -50557 32769 120592 150315 -36427 131988 -180466 34689 265194 121001
12652A79006l6127a05705l7224N3493G3420b64355A54514N0073i5865E05817c10737
$$ 179006 142879 -105705 -142929 -89436 73420 -264355 154514 204587 -95865 505817 -310737
12640a27667b5918A56443L4694a71119A94557b96799C3472J65240d270B09883
$$ -127667 -25918 156443 191137 -171119 194557 -296799 33472 198712 -4270 209883
12629A59285M1142J35732q4717P1977A7604K08069Q3004o4218P0994A15589J5618
$$ 159285 200427 336159 251442 323419 17604 225673 308677 244459 315453 115589 131207
12618A31207a79829A82238D5782j8892g9405J4034j03496A1075e9798b6661C01787
$$ 131207 -179829 182238 45782 26890 -79405 -65371 -168867 11075 -59798 -26661 301787
12606a15730j83934c659G140J11748J32574C5527O3708h6694G2203J46236e7356
$$ -115730 -299664 -3659 7140 118888 251462 35527 99235 -86694 72203 218439 -57356
12594a9790j24708B24917f0896l40058C28643A41908B1809e5436j2149H7840A5818
$$ -19790 -144498 224917 -60896 -400954 328643 141908 21809 -55436 -67585 87840 15818
12582C2390P0364K6550K52157r3607a39200o4414h0786R704A30981L9351b24328
$$ 32390 102754 129304 381461 287854 -139200 -203614 -80786 -71082 130981 170332 -224328
12570B8136K95460j02028n5257L5447a16334A75279O6219I04b08831e3145o5284
$$ 28136 323596 221568 166311 201758 -116334 175279 241498 904 -208831 -53145 -118429
12559a18429B3937b34535C7784c33363A25084h6974p6527m8657b2080k08034L5333
$$ -118429 23937 -234535 37784 -333363 125084 -86974 -163501 -212158 -22080 -230114 -194781
12548a94781b9392A62227o9942J29755F8452M643J94612b05531A74933h487o2427
$$ -194781 -29392 162227 92285 222040 68452 73095 267707 -205531 174933 -8487 -70914
12537g0914I3939N8996L297N1327E2696a29301a9176A04943J2606c21093A15185
$$ -70914 93939 152935 156232 207559 52696 -129301 -19176 104943 117549 -321093 115185
12525a97251B1402L6160b17863d7836A26756c57143A1160L21914L32681j72183
$$ -197251 21402 57562 -217863 -47836 126756 -357143 11160 333074 665755 493572
12515D93572J2914j86852J53093g8151G7400e3989q0304r4185a8959j4806j19407
$$ 493572 506486 319634 472727 -78151 77400 -53989 -134293 -228478 -18959 -33765 -153172
12504a53172L3681a8380j08351N8653o293A35984b96475A82414a40022B1440h3782
$$ -153172 -119491 -18380 -126731 -68078 -74371 135984 -296475 182414 -140022 21440 -83782
12492B55162q8700H1291h3698G3397a48305E03198j11075A86177P2876o2697b96677
$$ 255162 166462 81291 -83698 73397 -148305 503198 392123 186177 259053 196356 -296677
12480b11788q015A90911b79433J01564c0872l2603j48087C15807a80697B03253
$$ -211788 -219803 190911 -279433 -177869 -30872 -63475 -211562 315807 -180697 203253
12469E9089j6338l363j5683K73132b75925F7822j9892d13204f6114j84123J21629
$$ 59089 42751 39388 23705 296837 -275925 67822 47930 -413204 -66114 -250237 -128608
12458a28608F929a77176A09820J0785a33757M9843j17938F4652f4132m6444j57356
$$ -128608 6929 -177176 109820 120605 -133757 -83914 -201852 64652 -64132 -110576 -267932
12447b67932A6707Q943h986k26500I6603M4692b8239j88087A01401i6658A83798
$$ -267932 16707 25650 -8986 -235486 96603 141295 -28239 -216326 101401 -96658 183798
12435b85626O3739G3745a92133f3583n0926m492k5346b77C697f8272A66470K90311
$$ -285626 -221887 73745 -192133 -63583 -114509 -119001 -144347 -277 3697 -68272 166470 456781
12423D56781b69018E7018a91315B680a51106f4987n1401A54057a79490A87M41367
$$ 456781 -269018 57018 -191315 2680 -151106 -64987 -116388 154057 -179490 187 441554
12412D41554a79238B0187b64222D8710a54944A91717b34646A05528f645A74547
$$ 441554 -179238 20187 -264222 48710 -154944 191717 -234646 105528 -6645 174547
12401f7350H5077i4615A47495J63456r6274j03021a82968A57683D5642J88695
$$ -67350 85077 -94615 147495 310951 214677 111656 -182968 157683 45642 234337
12391B34337M2134E4569L2086a29493H5503a52953A01120a03605q7512h0819j40538
$$ 234337 276471 54569 86655 -129493 85503 -152953 101120 -103605 -191117 -80819 -221357
12380b21357a03903B73349b32091D854a09870k20078B47309f8251D20445a28142
$$ -221357 -103903 273349 -232091 4854 -109870 -329948 247309 -68251 420445 -128142
12369d5875A53950h5037k91264E824K00444q1946L6420a91420A4423L8638N6430
$$ -45875 153950 -85037 -376301 5824 206268 124322 160742 -191420 14423 53061 109491
12358A09491N3288m3788n8052R6702a89791E0988i0907k0599p0774C15126a8538
$$ 109491 162779 118991 60939 157641 -189791 50988 -90907 -111506 -182280 315126 -18538
12346B7802a38126r4142E5324d22887H5669J32047D4071A2268J85230b46631a02242
$$ 27802 -138126 -232268 55324 -422887 85669 217716 44071 12268 197498 -246631 -102242
12334d4806m0898A61535E5808M6640m929a30353e9168j31817I424R9214O3744
$$ -44806 -85704 161535 55808 102448 97519 -130353 -59168 -190985 9424 108638 172382
12323A72382q6091k4035K75189A49559K0907h1419A49127J87571a35868A30076
$$ 172382 86291 62256 337445 149559 170466 -81419 149127 336698 -135868 130076
12312c9112J002c779C447P631b86106J34622j39131O7386B5036a4057F6384R3886
$$ -39112 -38110 -3779 3447 11078 -286106 -151484 -290615 -223229 25036 -14057 66384 160270
12300A60270e4180k05096B40226q3022F0547a2770j64770o3753A19954N545l2788
$$ 160270 -54180 -259276 240226 157204 60547 -12770 -177540 -241293 119954 125499 92711
12289I2711b34960C96628A25958c13580B58347C7820b03050l1207I3960e3361
$$ 92711 -234960 396628 125958 -313580 258347 37820 -203050 -234257 93960 -53361
12278C92796j34707J44702q5176a54668D2387K15470j20076m8209J0773a51584
$$ 392796 258089 402791 317615 -154668 42387 257857 137781 89572 100345 -151584
12267b28673J00978f1490A15160b79194B63097h5196A15734a02570I5013m0161
$$ -228673 -127695 -61490 115160 -279194 263097 -85196 115734 -102570 95013 54852
12257E4852P6504e6808A22620E2963J65549q5757e7395C28475D5557M6737D493
$$ 54852 131356 -56808 122620 52963 218512 132755 -57395 328475 45557 92294 4493
12245A38012b46958q150C25831l6477E0067K39029j03439J48030b2001E0209K18498
$$ 138012 -246958 -255108 325831 289354 50067 289096 185657 333687 -22001 50209 268707
12234B68707a4670A39659h0106B03078J37821j61156G4964a79986B14671L3180
$$ 268707 -14670 139659 -80106 203078 340899 179743 74964 -179986 214671 247851
12224B47851h6039B6555q726Q5833J89832J03746K9478j04104G4410K3202J95237
$$ 247851 -86039 26555 17829 103662 293494 397240 426718 322614 74410 97612 292849
12213B92849o4667K03598j47731j11496j671J70024j35014J43578N6358A75599
$$ 292849 228182 431780 284049 172553 170882 340906 205892 349470 405828 175599
12202C78665A67314J97162m8132n8391n2794j1337J69617H5433a8101m0900C6167
$$ 378665 167314 364476 316344 257953 205159 193822 363439 85433 -18101 -59001 36167
12190I5257A6856K28098J71313A97871P2944G1145K53650L061C762J05230g0390
$$ 95257 16856 244954 416267 197871 270815 71145 324795 327856 3762 108992 -70390
12178C28468I3569P8922k9296c8339A81145k5469J61349j09264b13972l3069f8563
$$ 328468 93569 172491 143195 -38339 181145 155676 317025 207761 -213972 -247041 -68563
12166A66381k824p5026J18911K87518B34919J3906O009b49126A48262M3843m7062
$$ 166381 163557 88531 207442 494960 234919 248825 254834 -249126 148262 192105 145043
12155A45043K002h8970E7742K31598C375a45588C26596a57604B85039p8296P7537
$$ 145043 147045 -88970 57742 289340 3375 -145588 326596 -157604 285039 206743 284280
12144B84280e566n3443A83328K5753b6668o7248a7172C45951j10090k6656C5001
$$ 284280 -5566 -59009 183328 209081 -26668 -93916 -17172 345951 235861 209205 35001
12132A17364A9054N8141J68150a3364C36632b7046j27187O6944o8378B12941a34270
$$ 117364 19054 77195 245345 -13364 336632 -27046 -154233 -87289 -155667 212941 -134270
12120A11932b17074G3775B0575i1893j22274b6514j5479F4949j9230d5556H0059
$$ 111932 -217074 73775 20575 -91893 -214167 -26514 -41993 64949 45719 -45556 80059
12108A75121i7166C38982b35497A15119J36390H1555B3923h1725I4324L52818
$$ 175121 -97166 338982 -235497 115119 251509 81555 23923 -81725 94324 447142
12098D47142E1567a7361A51476P1150e02088A14086Q677l1076a44087k26090E1526
$$ 447142 51567 -17361 151476 222626 -502088 114086 122763 91687 -144087 -370177 51526
12086A441J5262J20093h635C05698G4646O8143n8759b48343E8192B1630K30345
$$ 1441 16703 136796 -8635 305698 74646 142789 84030 -248343 58192 21630 251975
12075B51975J87917F864c7049A24679D3716O273c48825a28703j32805b7085j42630
$$ 251975 439892 6864 -37049 124679 43716 49989 -348825 -128703 -261508 -27085 -169715
12064a69715B23952r4285P3504c92093a08021m3031j60588E9484d90733A55105
$$ -169715 223952 129667 203171 -392093 -108021 -151052 -311640 59484 -490733 155105
12053b26241O6198A15554c6115n66680I8026c42366E8615A0847J67605L6112I0406
$$ -226241 -160043 115554 -36115 -602795 98026 -342366 58615 10847 178452 214564 90406
12041A39115C3852c2340j43399A17601N2274c03611J41058D46199I0649b75583
$$ 139115 33852 -32340 -175739 117601 169875 -303611 -162553 446199 90649 -275583
12030D18745a68776H1772L1983f8235A2854K30388E7121c08743N1626f5244j26550
$$ 418745 -168776 81772 113755 -68235 12854 243242 57121 -308743 -257117 -65244 -191794
12019a91794K1318d7181a0718k9812j87836A86206A9883i8566A77956m3823k1218
$$ -191794 -170476 -47181 -10718 -40530 -228366 186206 19883 -98566 177956 134133 112915
12008A12915I225J05826f7160q3072M4153A51947c5394j3416o4540d2550B17932
$$ 112915 9225 115051 -67160 -150232 -106079 151947 -35394 -48810 -113350 -42550 217932
11996A3288J32497b18260F0928L01925b05190B35358b65660L9526A46903c25467
$$ 13288 145785 -218260 60928 362853 -205190 235358 -265660 -226134 146903 -325467
11985b11111h6431E4423a94324M7076C93408A20984E7262M2017a08372F5707a99318
$$ -211111 -86431 54423 -194324 -147248 393408 120984 57262 99279 -108372 65707 -199318
11973A51097j4165F1009b58968f1733n2820N0543o8371J0483l08586B49014a88980
$$ 151097 136932 61009 -258968 -61733 -114553 -64010 -132381 -121898 -430484 249014 -188980
11961c239l4760l14451H5860a55101M089G9963k7503A9460M5708g2844B82892
$$ -3239 -37999 -352450 85860 -155101 -151012 79963 52460 19460 65168 -72844 282892
11949b01746e5528B9080K3475J10324a40691j41118Q5806a0949A14467b76886
$$ -201746 -55528 29080 52555 162879 -140691 -281809 -196003 -10949 114467 -276886
11938e27921a4013a711A28228P2297e6962k07835A03567a94872A56248G1041R3376
$$ -527921 -14013 -1711 128228 200525 -56962 -264797 103567 -194872 156248 71041 164417
11927A64417J1048a84966B6232K1423J02890c3457A81640C3033J95231D7721b43197
$$ 164417 175465 -184966 26232 47655 150545 -33457 181640 33033 228264 47721 -243197
11915d4696C27200D6526a07064B35067B7741J3127K49342a24388j27161C0538
$$ -44696 327200 46526 -107064 235067 27741 40868 290210 -124388 -251549 30538
11904c28596F4085J63811r6013j3837b8036o9491k12347k5769A2699c83563D3089
$$ -328596 64085 227896 131883 118046 -28036 -97527 -309874 -335643 12699 -383563 43089
11892d9284k5079A01785D3916C143a37188C113r18a55246A39139b1914n1477k03212
$$ -49284 -74363 101785 43916 3143 -137188 3113 2195 -155246 139139 -21914 -73391 -276603
11880b76603f9514j5388L6204p4691A51193i6102A08624K7890O1971a26947j37814
$$ -276603 -69514 -84902 -48698 -123389 151193 -96102 108624 136514 198485 -126947 -264761
11869b64761D0475b54809E0500f1013j85792F4340a19161k42234a53992A5622
$$ -264761 40475 -254809 50500 -61013 -246805 64340 -119161 -361395 -153992 15622
11858A04698b5168k21144Q1281A18238j0953a40685O7638J0455A90414b19580
$$ 104698 -25168 -246312 -165031 118238 107285 -140685 -73047 -62592 190414 -219580
11847b07481i8261A38796a17616B4302J1548d27483e0768A33204a15444F0543
$$ -207481 -98261 138796 -117616 24302 35850 -427483 -50768 133204 -115444 60543
11836A82629i4881G1952J71109A00653f2020k47510a45377B88148c05880g1376
$$ 182629 -94881 71952 243061 100653 -62020 -309530 -145377 288148 -305880 -71376
11825C196h970m333l32137J44319b8224j78723M2779B00263J19526d1419B61989
$$ 3196 -8970 -13303 -345440 -201121 -28224 -206947 -164168 200263 319789 -41419 261989
11813A46407n6014R2502a43266o9532c6484A59034C0809K6397b98152m3049e0751
$$ 146407 90393 182895 -143266 -212798 -36484 159034 30809 57206 -298152 -341201 -50751
11801a2041K529j38845I7878h2541l1318A1588J51917O4860g5876L1185G8466
$$ -12041 -9512 -148357 97878 -82541 -113859 11588 163505 228365 -75876 -44691 78466
11789B70927p3847H6536B3377J65866a24284A75239a30876D7988h8787A00254
$$ 270927 197080 86536 23377 189243 -124284 175239 -130876 47988 -88787 100254
11778a74081f4219B58274a2640B46071e2516k12365H3116b76483A00093a60510
$$ -174081 -64219 258274 -12640 246071 -52516 -264881 83116 -276483 100093 -160510
11767i5392A6442L548b44690A12870c0761r8228H2866c96854e1990A4742J03349
$$ -95392 16442 19990 -244690 112870 -30761 -128989 82866 -396854 -51990 14742 118091
11756A18091c42981a69415k54918f1678K8638E2831o627d82705e9451D02931A64573
$$ 118091 -342981 -169415 -424333 -61678 -33040 52831 46204 -482705 -59451 402931 164573
11744A89861o0406a79474g5840E905a09825m2390A50837c67475A25910m4269B5324
$$ 189861 129455 -179474 -75840 5905 -109825 -152215 150837 -367475 125910 81641 25324
11732f92o5105k30216a09348A00383J15952A1883c311B81851I903J2601L81082
$$ -692 -65797 -296013 -109348 100383 216335 11883 -3311 281851 9903 22504 403586
11721D03586h4318A05299b30805J12072A33100A1406N8856d14A8730c4677a0412
$$ 403586 -84318 105299 -230805 -118733 133100 11406 70262 -414 18730 -34677 -10412
11709A09248b11357D0944J81488b47629i0221A459M173a71221M9424C34819b39072
$$ 109248 -211357 40944 222432 -247629 -90221 1459 5632 -171221 -121797 334819 -239072
11697C04856a8930C810M28541i974D84223G445L9551A5673b57515A66005a52532
$$ 304856 -18930 3810 432351 -9974 484223 7445 46996 15673 -257515 166005 -152532
11685B24060b44457F506a35866E6485A6783M5576J80167b96483B96352a69246
$$ 224060 -244457 6506 -135866 56485 16783 62359 242526 -296483 296352 -169246
11674A93704b769A0710J7966K2437c06807B7585L72742j85397F565a45641A22521
$$ 193704 -2769 10710 28676 51113 -306807 27585 400327 214930 6565 -145641 122521
11662a04767B9346a31677D1344a16587k9426j74662a101B07976A3831J59673a46237
$$ -104767 29346 -131677 41344 -116587 -146013 -320675 -1101 207976 13831 173504 -146237
11650a14911d760D7370K69676a67672A51399b67439G7161i1172J8798j98772C99106
$$ -114911 -4760 47370 317046 -167672 151399 -267439 77161 -91172 -72374 -271146 399106
11638A732J05487a83158F5391A1299a64400g9613A85836b59566B4921a04710q2525
$$ 1732 107219 -183158 65391 11299 -164400 -79613 185836 -259566 24921 -104710 -187235
11627a87235D8788b57410p740A32555N9635J12522n4877J32186i2353C44921i7604
$$ -187235 48788 -257410 -265150 132555 192190 304712 249835 382021 -92353 344921 -97604
11615a80887p9166j04548A31259B8284O7867P8622b386A46597K94836f4928q2191
$$ -180887 -260053 -364601 131259 28284 96151 174773 -2386 146597 441433 -64928 -147119
11604a47119I5796c5801A34589J2467K60620p6435b01911E7711K69699c4705j19955
$$ -147119 95796 -35801 134589 147056 407676 331241 -201911 57711 327410 -34705 -154660
11593a54660K3371d1824j50112C13458b53890I0066f7974A62449N1925e040A20244
$$ -154660 -131289 -41824 -191936 313458 -253890 90066 -67974 162449 214374 -5040 120244
11581I575J01342C3059K51009h3449b1047Q264k2855E4454K68504I8858a4259
$$ 9575 110917 33059 284068 -83449 -21047 -12783 -35638 54454 322958 98858 -14259
11569d43958c9421J4072A49945C7859a49124H4699l0589l011f4227B79315f2255
$$ -443958 -39421 -25349 149945 37859 -149124 84699 54110 51099 -64227 279315 -62255
11557A79641J66098j27148a99247A22840b7809G045J56557b57725D927O970d6175
$$ 179641 345739 218591 -199247 122840 -27809 7045 163602 -257725 4927 11897 -46175
11545A68947K5839a72235N9259A59524b6120j49701E69714a11759C11277A16037
$$ 168947 194786 -172235 -112976 159524 -26120 -175821 569714 -111759 311277 116037
11534f2350A34112l7075p053k9515j704N2594R0801A6692h2412H5397D1375a74260
$$ -62350 134112 97037 89984 60469 58765 111359 202160 16692 -82412 85397 41375 -174260
11521b95860E4187K8479l4373J54064m3571l7265c2545B73898q107D4138k671
$$ -295860 54187 82666 48293 202357 158786 121521 -32545 273898 265791 44138 41467
11510D1467K93661a9324l8807a4421h53A24897K2091J014A7486a58311A06572
$$ 41467 335128 -19324 -58131 -14421 -853 124897 146988 148002 17486 -158311 106572
11498A61197m5805a08690C53935E2490j2309O6779J30557B9136o904c77838J74904
$$ 161197 115392 -108690 353935 52490 40181 106960 237517 29136 22232 -377838 -202934
11487b02934B6591J46772R3030c1283C47369B9061R1127J93963g0321C36162H7316
$$ -202934 26591 173363 266393 -31283 347369 29061 120188 314151 -70321 336162 87316
11475D28824e0083G4999b42927B26203F4050p309c2116A38972o7887b15158k48664
$$ 428824 -50083 74999 -242927 226203 64050 56741 -32116 138972 71085 -215158 -463822
11464d63822a19372A41668a38259C94539o7547J3543c1539j48782e1209I3443
$$ -463822 -119372 141668 -138259 394539 326992 340535 -31539 -180321 -51209 93443
11453b7905A51517J8541K96930b33028J03907D6649e1733A5668a8662B12899i0084
$$ -27905 151517 170058 466988 -233028 -129121 46649 -51733 15668 -18662 212899 -90084
11441a15098B13639I9291C1990J11243N3876l7546a89902C24827E1444c0478j41942
$$ -115098 213639 99291 31990 143233 197109 159563 -189902 324827 51444 -30478 -172420
11430a72420B77114j5639b4848A32766l709L84720a04577C20338j56529c31895
$$ -172420 277114 261475 -24848 132766 129057 513777 -104577 320338 163809 -331895
11419a54250B7157a20994J5643A0019J45961c68336C6078J31188K0209g331m1505
$$ -154250 27157 -120994 -105351 10019 155980 -368336 36078 167266 187475 -7331 -48836
11408d8836k449D9596a02267l2658G1571K452h0236B8979K85961f2685r8054A68105
$$ -48836 -51285 49596 -102267 -134925 71571 74023 -80236 28979 314940 -62685 -160739 168105
11395D9247i7125B33569J33351C9288A4430a20856A47523g3546K8664D2116i6048
$$ 49247 -97125 233569 366920 39288 14430 -120856 147523 -73546 -44882 42116 -96048
11383C74083j77768c1493o3024n2012A72817E4202L3771B0021N8997a64525H8907
$$ 374083 196315 -31493 -94517 -146529 172817 54202 87973 20021 79018 -164525 88907
11371C17312b75585P9138A00136a67202c8647D010b27399e7486m6326J6182A47298
$$ 317312 -275585 -196447 100136 -167202 -38647 4010 -227399 -57486 -103812 -87630 147298
11359B14259E6194a11445Q427j81155j10864A71199a10005F4192l570J32199e5707
$$ 214259 56194 -111445 -103018 -284173 -395037 171199 -110005 64192 60622 192821 -55707
11347b9262B09212c8899j8106A47833J52944e76413C9212A34J02092i3285B19436
$$ -29262 209212 -38899 -57005 147833 300777 -576413 39212 134 102226 -93285 219436
11335a85232N2261J5321j95798h0305B2196a10994j27583A4502J00866a14283
$$ -185232 -132971 -117650 -313448 -80305 22196 -110994 -238577 14502 115368 -114283
11324f1282k6096H1139b54126J07829a3621l10025c2967D2271a02457j12845A95941
$$ -61282 -87378 81139 -254126 -146297 -13621 -323646 -32967 42271 -102457 -215302 195941
11312a97833C44001h1550k17200H3528a0594k57449A12844m3904J86402E7253
$$ -197833 344001 -81550 -298750 83528 -10594 -268043 112844 68940 255342 57253
11301A88325K31308c16998g5212E0456b50148i633m0574C33466f3746I986c42661
$$ 188325 419633 -316998 -75212 50456 -250148 -9633 -50207 333466 -63746 9986 -342661
11289A142K42162a03688A17746d78711B00336E3662g5610L0471H5836a00847H9413
$$ 1142 243304 -103688 117746 -478711 200336 53662 -75610 -45139 85836 -100847 89413
11277F2154J61484J72489C0157P4323a02571B10943C8756b317H047a47332A0296
$$ 62154 223638 396127 30157 104480 -102571 210943 38756 -2317 8047 -147332 10296
11265C0097M3813C2269K09784b47888M3141A10932n3681a2007k7451k0893D9330
$$ 30097 73910 32269 242053 -247888 -204747 110932 57251 -12007 -39458 -60351 49330
11253g968k6277J3491F8141Q2660F5003i6541A27955A7640g3118E9445b0661j15382
$$ -7968 -34245 -20754 68141 150801 65003 -96541 127955 17640 -73118 59445 -20661 -136043
11241a36043c058A2932J5749O9651j6483d26525A61367b2856B27473b42675j92042
$$ -136043 -3058 12932 28681 98332 81849 -426525 161367 -22856 227473 -242675 -434717
11230d34717B2117c45668A0813M49554a89910C337m06b1317A17054b55264J2913
$$ -434717 22117 -345668 10813 460367 -189910 3337 2931 -21317 117054 -255264 -242351
11219b42351A23198b7350A25139b41966g1052j41708f5726J2585F9513K1477A9061
$$ -242351 123198 -27350 125139 -241966 -71052 -212760 -65726 -53141 69513 90990 19061
11207I9459a22178k4882O6421g995A9040a44792c2195j18272q8565i7346a8383
$$ 99459 -122178 -147060 -80639 -7995 19040 -144792 -32195 -150467 -239032 -97346 -18383
11195b99364n5571B14845d66354a17316o2007J1112J9006A01976c31199B68444
$$ -299364 -354935 214845 -466354 -117316 -179323 -168211 -149205 101976 -331199 268444
11184a09457d6029k57661A44116a08780A73159c72805a57472P6914a9847p286
$$ -109457 -46029 -303690 144116 -108780 173159 -372805 -157472 -80558 -19847 -27133
11174b7133j01587e9118D1029A2449a01375A04968k1546a42787j61979B03024
$$ -27133 -128720 -59118 41029 12449 -101375 104968 83422 -142787 -304766 203024
11163G4639M57340i2513K9421j0500o737b8261k6613j91409A08700I876O7114
$$ 74639 531979 -92513 -63092 -73592 -80329 -28261 -54874 -246283 108700 9876 76990
11152G6990a79084B14875g7578A2572J73003C5289g7165k85381I5070i8724M5158
$$ 76990 -179084 214875 -77578 12572 185575 35289 -77165 -362546 95070 -98724 -53566
11141e3566p5579K8441I5042B3366J78743d923I9625A222M35851c717j37283B15461
$$ -53566 -129145 -100704 95042 23366 202109 -4923 99625 1222 437073 -3717 -141000 215461
11128A6485O2606R627b6399n9055B36888P8418C2335G35J81821Q048l8503a26379
$$ 16485 79091 88718 -26399 -85454 236888 315306 32335 735 182556 190604 152101 -126379
11115b25979C467J95707d3855J515J5499G4915c8054A9441g8780A45175b01304
$$ -225979 3467 199174 -43855 -42340 -26841 74915 -38054 19441 -78780 145175 -201304
11103G2153e2817B09962H2526j1567P38485B12308J9306M6645p0133J56887o9377
$$ 72153 -52817 209962 82526 70959 809444 212308 231614 278259 208126 365013 295636
11092B95636f8045l0115M4840B66207K7082B8350O7337J91522r1001K64068g8134
$$ 295636 -68045 -98160 -53320 266207 293289 28350 95687 287209 196208 460276 -78134
11080B46310K20158J1371j93222q8675i8125E80810B75442J295M29388B66323
$$ 246310 466468 477839 284617 195942 -98125 580810 275442 276737 706125 266323
11069B98307J15924L1471K16025q7698H1844M66098J692M9785k53728K38041L09224
$$ 298307 414231 445702 661727 574029 81844 547942 549634 599419 345691 583732 892956
11058H92956m07122k7999N9234J05546L0576k69622M58576k36455j13873J79527
$$ 892956 485834 457835 517069 622615 653191 383569 842145 605690 491817 671344
11048F71344J10818J31850j01037J44545Q7095m0158j85435K91709M0339K9843
$$ 671344 782162 914012 812975 957520 1044615 1004457 819022 1110731 1151070 1180913
11038A180913n21983K44866m4937j3435q4181N2431j42235J20098L70621k33214
$$ 1180913 658930 903796 858859 845424 761243 813674 671439 791537 1162158 928944
11028I28944l33086M85679k05245L73778m95003K59762k76130l7786J44570l80425
$$ 928944 595858 1081537 876292 1250070 755067 1014829 738699 700913 845483 465058
11018D65058N051L79780k97818j11273K20081j32290K48865R5319J13134k16686
$$ 465058 470109 849889 552071 440798 660879 528589 777454 872773 985907 769221
11008G69221j33610J03451k33096K20156k09109J37191K82818j28923n6692J14907
$$ 769221 635611 739062 505966 726122 517013 654204 937022 808099 751407 866314
10998H66314L7709k29005q7417J33217j51K01566l79975L28694j19280J96047
$$ 866314 904023 675018 587601 720818 720667 922233 542258 870952 751672 947719
10988I47719l11172J96036L7060o9566M42455J72406m20806J29933J85156Q5987
$$ 947719 636547 832583 869643 800077 1242532 1414938 994132 1124065 1309221 1395208
10978A395208k23699O86752L9025Q9958j9604O16959K41719k07726N59621M27923
$$ 1395208 1171509 1858261 1897286 1987244 1967640 2584599 2826318 2618592 3178213 3606136
10968C606136j9755O28399l84666K21023p45752p02660l95455p07766m8935j64889
$$ 3606136 3586381 4214780 3830114 4051137 3305385 2602725 2207270 1499504 1450569 1285680
10958A285680j80147L05024j52105Q612L28750k55895l43192L0147k30690j69947
$$ 1285680 1105533 1410557 1258452 1267064 1595814 1339919 996727 1026874 796184 626237
10948F26237j6589m1105l3676k03635H6747R8067G2954J83465m6821J37152j25424
$$ 626237 609648 568543 534867 331232 86747 184814 72954 256419 209598 346750 221326
10937B21326R6208a13714C76718P3595A75075N559H6936l0530b16460G8242a19348
$$ 221326 317534 -113714 376718 450313 175075 180634 86936 56406 -216460 78242 -119348
10925A12398d6731m725o701A50250b82500j9918a50068j41238g0693a397B9442
$$ 112398 -46731 -51456 -58157 150250 -282500 -302418 -150068 -291306 -70693 -1397 29442
10913f4238l8787I4755L9887B3154Q5012j1313j0277K5136J42190c44660A93075
$$ -64238 -103025 94755 134642 23154 108166 96853 86576 111712 253902 -344660 193075
10901A10267c1434C1923a53683k0479J5489A3851c2666n0800j2085E4317n915
$$ 110267 -31434 31923 -153683 -174162 -158673 13851 -32666 -83466 -95551 54317 48402
10890D8402n123K07556h4888d288B4034a14057J8760l8262H7702K7611a53565
$$ 48402 43279 250835 -84888 -4288 24034 -114057 -95297 -133559 87702 115313 -153565
10878a08011k6579A32198j8544j6311a4903j80179C06918a60731I198b01650f8776
$$ -108011 -134590 132198 113654 97343 -14903 -195082 306918 -160731 9198 -201650 -68776
10866A2132d15652a11009C7764a02135B73070E021J18583B6532K24980c11396
$$ 12132 -415652 -111009 37764 -102135 273070 5021 123604 26532 251512 -311396
10855a87834k24651e6935C96832a33161M7857n6719J6021E8239a37136j5459e7198
$$ -187834 -412485 -56935 396832 -133161 -85304 -142023 -126002 58239 -137136 -152595 -57198
10843e3831A89672J968K719a38537I3931b83066c0659I2433J3399D9279a3510
$$ -53831 189672 191640 194359 -138537 93931 -283066 -30659 92433 105832 49279 -13510
10831E1348M7676a69507A05157f4222j5394q0228A69398a01093n0615g1575A7286
$$ 51348 99024 -169507 105157 -64222 -79616 -159844 169398 -101093 -151708 -71575 17286
10819D558d2004k3767k6671H7989b05119L8036j68121F410d1672A08880H49K04151
$$ 4558 -42004 -65771 -92442 87989 -205119 -167083 -335204 6410 -41672 108880 849 205000
10807B05000a19504J6376M8125K2271P839J257k92525C05418a85493E9717J1051
$$ 205000 -119504 -103128 -55003 -32732 -24893 -23636 -316161 305418 -185493 59717 70768
10796G0768b89978P2289J4572L3032F2506P046K01012i390B4717h7330c1908j42771
$$ 70768 -289978 -217689 -203117 -170085 62506 69552 270564 -9390 24717 -87330 -31908 -174679
10784a74679c5991A7331P663D010a03125J7846C16338c03321B1429a17604f280
$$ -174679 -35991 17331 24994 4010 -103125 -85279 316338 -303321 21429 -117604 -6280
10772D965Q7367M526e38878a43308A27742m6137J56407g175q8443j58261J19870
$$ 4965 92332 96858 -538878 -143308 127742 81605 238012 -7175 -95618 -253879 -134009
10761a34009D37844E7954B3647e6802q1231a9178I2005f474C3607a71044m868
$$ -134009 437844 57954 23647 -56802 -138033 -19178 92005 -6474 33607 -171044 -175912
10750a75912e9256j57539H9511c3530a2137n3013n2601J310N8077l05205d5638
$$ -175912 -59256 -216795 89511 -33530 -12137 -65150 -117751 -116441 -58364 -363569 -45638
10738d65677P7963H4065c8040A16458C639b19567D4512K6428J9498l0452J24147
$$ -465677 -387714 84065 -38040 116458 3639 -219567 44512 70940 90438 59986 184133
10727A84133d06779D9074a36927L6603k29492B2967d4003E6740a90523A36915
$$ 184133 -406779 49074 -136927 -100324 -329816 22967 -44003 56740 -190523 136915
10716G6950a15487b2542j50934C4097J49660p2186b9319l78359J28452c1748A8060
$$ 76950 -115487 -22542 -173476 34097 183757 111571 -29319 -407678 -279226 -31748 18060
10704B72501b07905A0258L8177M3961a36389G2403J08713n3360b64272c6528j28240
$$ 272501 -207905 10258 48435 92396 -136389 72403 181116 127756 -264272 -36528 -164768
10693a64768r1194h4141L7008k22479p2761C1262I920O5077c27802C0396J64320
$$ -164768 -255962 -84141 -47133 -269612 -342373 31262 9920 74997 -327802 30396 194716
10682A94716A2451h8930n3483L7841D15837d69089J50189J30121L4895A38954
$$ 194716 12451 -88930 -142413 -104572 415837 -469089 -318900 -188779 -153884 138954
10671a22891P981B79259Q1831C2664g9590c5025l47511f7561j26882N698F4120
$$ -122891 -114910 279259 361090 32664 -79590 -35025 -382536 -67561 -194443 -188745 64120
10659a23852J1612B42666c00287a23846l0813L1362A37987c09782a03455c578
$$ -123852 -112240 242666 -300287 -123846 -154659 -123297 137987 -309782 -103455 -3578
10648c84643g1987j59793F6453e1371k35461G3582a92676C39694c3592j41413
$$ -384643 -71987 -231780 66453 -51371 -286832 73582 -192676 339694 -33592 -175005
10638a75005O9300A03641D9619b44943A42191R2025b76452a02229M2102D4184
$$ -175005 -105705 103641 49619 -244943 142191 234216 -276452 -102229 -60127 44184
10627b9200B22584a92276l1725C00606D2963f262j14753q7160K7892F0670a80377
$$ -29200 222584 -192276 -224001 300606 42963 -6262 -121015 -208175 -180283 60670 -180377
10615c92906J20877a06650N2329b6833D00031a97476A4759Q4680a16262M4678
$$ -392906 -272029 -106650 -54321 -26833 400031 -197476 14759 99439 -116262 -71584
10605g1584j6746A83406e6116j25466k9992R0207A7461a97975H858a67394P2696
$$ -71584 -88330 183406 -56116 -181582 -211574 -121367 17461 -197975 8858 -167394 -94698
10594i4698j34007g5608B3277N90085g4551J2242r7400E2875b81879a37910b5935
$$ -94698 -228705 -75608 23277 613362 -74551 -62309 -159709 52875 -281879 -137910 -25935
10582g1736A3030k173b13568b1612A23544J70959F3518h1013c1530k36671b7562
$$ -71736 13030 10857 -213568 -21612 123544 294503 63518 -81013 -31530 -268201 -27562
10570a4672m4484j05881g994k93269I5181J8521a18539J869k03316g1955A59886
$$ -14672 -59156 -165037 -7994 -301263 95181 113702 -118539 -116670 -319986 -71955 159886
10558a29395j18358N509a04297a5999k20904i411o0734k9843p6164c7564J1235
$$ -129395 -247753 -242244 -104297 -15999 -236903 -9411 -70145 -99988 -176152 -37564 -26329
10547b6329A96055j7979a59098f4678n8890a1174B20365a50736J9605C5380b67171
$$ -26329 196055 178076 -159098 -64678 -123568 -11174 220365 -150736 -131131 35380 -267171
10535C1176a24491a7213j40297A66159c62879b2934j13837G3732K8092a82594
$$ 31176 -124491 -17213 -157510 166159 -362879 -22934 -136771 73732 101824 -182594
10524b27729J05657E6750j3432J27942b59819J14653H566b17196j7296h7094j3220
$$ -227729 -122072 56750 43318 171260 -259819 -145166 8566 -217196 -234492 -87094 -100314
10513a00314j7796B99749a95404B4395a09428D9848b50111b5286l60867g8389
$$ -100314 -118110 299749 -195404 24395 -109428 49848 -250111 -25286 -386153 -78389
10502C095b59447g8099j47119B11346a18407j15501k2520I8529A9128J46863a14809
$$ 3095 -259447 -78099 -225218 211346 -118407 -233908 -256428 98529 19128 165991 -114809
10490G8608d8574C4485b65506L1917L3919A5554l466O6426c5313n9129A52195
$$ 78608 -48574 34485 -265506 -233589 -199670 15554 12088 78514 -35313 -94442 152195
10478C05192l654A44136J02575n8749a83712A46020O1384A03275K28613j2823
$$ 305192 301538 144136 246711 187962 -183712 146020 207404 103275 331888 319065
10468C19065e439A82360a19805B2379K46793r0290b74416B95038I7866K73591
$$ 319065 -5439 182360 -119805 22379 269172 178882 -274416 295038 97866 371457
10458C71457A03150a10227D9642b69580A53286a54932A67724a06612I7990J09346
$$ 371457 103150 -110227 49642 -269580 153286 -154932 167724 -106612 97990 207336
10448B07336a44989O4080n0796N5092k31039A50628i2019A94060k3533a48841
$$ 207336 -144989 -80909 -131705 -76613 -307652 150628 -92019 194060 170527 -148841
10437a05251A69265a05100B5526K25085c28343i814B55280a42220f7442r4747
$$ -105251 169265 -105100 25526 250611 -328343 -9814 255280 -142220 -67442 -162189
10427a62189B15252a03694j01118A61009L00532f9607j07409B3818b17117E1644
$$ -162189 215252 -103694 -204812 161009 461541 -69607 -177016 23818 -217117 51644
10416A98561I5361a75686f1761B8240R2457E7795c04882L2864r029B64944A8689
$$ 198561 95361 -175686 -61761 28240 120697 57795 -304882 -272018 -281047 264944 18689
10404C01576E8597j2299a26658k45800a24285J651l0004f6208p52m1237E2492
$$ 301576 58597 46298 -126658 -372458 -124285 -122634 -152638 -66208 -66960 -108197 52492
10392A46007j766J20591o9577r2819e5676A11350c3283B97161j024D3408J53756
$$ 146007 144241 264832 195255 102436 -55676 111350 -33283 297161 296137 43408 197164
10381A97164n7423C2871J36713p8693K03324j05456M04744k6248B66881B3085
$$ 197164 139741 32871 169584 90891 294215 188759 593503 567255 266881 23085
10370H1521K28702J28187A31894P9479J8685K12479n087j52434J52927L45493
$$ 81521 310223 438410 131894 211373 230058 442537 437450 285016 437943 783436
10360G83436l76199r1412j00055p6404f9707B83367O3549j05411L65577d9934
$$ 783436 407237 315825 215770 139366 -69707 283367 346916 241505 607082 -49934
10349C77014K00983K66048q5364j57197k42708K84849A86112J51538n9035O9738
$$ 377014 577997 844045 758681 601484 358776 643625 186112 337650 278615 348353
10339C48353K19628e8178B00049j7536F9589J50482f5836B8794J31540a40404
$$ 348353 567981 -58178 200049 182513 69589 220071 -65836 28794 160334 -140404
10328B99598J4344g2360o205F0995L744B3940R4765P8958L95071A08763J4313
$$ 299598 313942 -72360 -78565 60995 64739 23940 118705 197663 592734 108763 123076
10317A23076L6503J15666F6307R695a7897k33779B3741Q6922J18826c58938A7704
$$ 123076 159579 275245 66307 76002 -17897 -251676 23741 110663 229489 -358938 17704
10305A202a2540B31628I4337J5200b75230B29304A02252a42708n3766A95392m8916
$$ 1202 -12540 231628 94337 109537 -275230 229304 102252 -142708 -196474 195392 146476
10294A46476c7594j79806C76313A50858b51656L0515R1018j41026G4338a09276
$$ 146476 -37594 -217400 376313 150858 -251656 -221141 -130123 -271149 74338 -109276
10283E4434d0516l05651a34842D1406B866K5608a10318a6424C58108c0685j6447
$$ 54434 -40516 -346167 -134842 41406 2866 28474 -110318 -16424 358108 -30685 -47132
10272d7132j75182A19124c12088J46292e3808E6078J39341k8622a7590E2481c89461
$$ -47132 -222314 119124 -312088 -165796 -53808 56078 195419 166797 -17590 52481 -389461
10260a53879N1134B56084b2009p9722a9232I6335K69260a72212C50145E986J37703
$$ -153879 -102745 256084 -22009 -101731 -19232 96335 365595 -172212 350145 5986 143689
10249A43689b8003j84033a9438B3509b1850q2102j21130D8578c1770r1872l7985
$$ 143689 -28003 -212036 -19438 23509 -21850 -103952 -225082 48578 -31770 -123642 -161627
10238a61627H4528b25040a6838F6903c15851a46062p0443l33626b5016A14059
$$ -161627 84528 -225040 -16838 66903 -315851 -146062 -216505 -550131 -25016 114059
10227A88798O5503d8359j94281a07738p2889e2086k94422a54433j29031j08661
$$ 188798 254301 -48359 -242640 -107738 -180627 -52086 -346508 -154433 -283464 -392125
10217c92125A05498K393d6568A35786f8028B79218c20161g7433M482l4272A22946
$$ -392125 105498 107891 -46568 135786 -68028 279218 -320161 -77433 -72951 -107223 122946
10205b0077I3554f2455J1278E1171h3713j98733C4203L5385d09621R2999F4345
$$ -20077 93554 -62455 -51177 51171 -83713 -282446 34203 69588 -409621 -316622 64345
10193H7606a12828B4043a49422A44714a67624n7030b9803A08893j89b27751c4971
$$ 87606 -112828 24043 -149422 144714 -167624 -224654 -29803 108893 108704 -227751 -34971
10181H6580b7208G901d0055A60646b87050c1786E0752a09269j41207F3115B4155
$$ 86580 -27208 7901 -40055 160646 -287050 -31786 50752 -109269 -250476 63115 24155
10169b26202H5889J32913k8597D0602b55191E9644b4503k47242B6421a92099A6167
$$ -226202 85889 218802 190205 40602 -255191 59644 -24503 -271745 26421 -192099 16167
10157a4521j28500e3881j87605a06100G249a0412r8924F2656a31354j87356A33872
$$ -14521 -143021 -53881 -241486 -106100 7249 -10412 -109336 62656 -131354 -318710 133872
10145a4880r5540j16162J10551k76950J73603a06128j95889A97155c54455e0795
$$ -14880 -110420 -226582 -116031 -392981 -219378 -106128 -302017 197155 -354455 -50795
10134B9547a33685l18839B33857J26750e5473j27241C88166h7398B53602c03692
$$ 29547 -133685 -452524 233857 360607 -55473 -182714 388166 -87398 253602 -303692
10123b56740e2480q0550F0443N3750c01079H6205j1097H328J14252d72850A46004
$$ -256740 -52480 -133030 60443 114193 -301079 86205 75108 8328 122580 -472850 146004
10111A07595b0074B23200c44098A8819a27338r2906i6201a0450E3038a1544q5245
$$ 107595 -20074 223200 -344098 18819 -127338 -220244 -96201 -10450 53038 -11544 -96789
10100i6789k9018n7374k00808b8096B3271b26629a13002C8980h9886j31667C7774
$$ -96789 -125807 -183181 -383989 -28096 23271 -226629 -113002 38980 -89886 -221553 37774
10088A90849a7595j28851C3788M8691a78545a1480F7303A3418K39009a04796j95542
$$ 190849 -17595 -146446 33788 82479 -178545 -11480 67303 13418 252427 -104796 -300338
10077c00338j1081e9908E8124b97551D7816k3797d25344b0058q8724M7949n2883
$$ -300338 -311419 -59908 58124 -297551 47816 24019 -425344 -20058 -108782 -60833 -113716
10066a13716C0766a00065a150A6764i3144A58554a3238j0306r5758N6669j07083
$$ -113716 30766 -100065 -1150 16764 -93144 158554 -13238 -23544 -119302 -62633 -169716
10055a69716a4193F0931a34122A80177b3798k8932j80615L6697A6058J41326a68685
$$ -169716 -14193 60931 -134122 180177 -23798 -52730 -233345 -196648 16058 157384 -168685
10043A82928C8548b85569B64108d20480A59403C3199J7661a12501A19235B6155
$$ 182928 38548 -285569 264108 -420480 159403 33199 50860 -112501 119235 26155
10032a7146l68517J66254A49222J87322e1253A16185b0268j00172p0218A59041
$$ -17146 -385663 -219409 149222 336544 -51253 116185 -20268 -120440 -190658 159041
10021A70948H263a03024o6800A14252a8334j30559A18917E4484R1460h5413o1232
$$ 170948 8263 -103024 -169824 114252 -18334 -148893 118917 54484 145944 -85413 -146645
10010a46645H308c55856D4845a1490A250P7873b77517r365O8911M8469A37699
$$ -146645 8308 -355856 44845 -11490 1250 79123 -277517 -286882 -217971 -169502 137699
9998d05528E8797b62699D2735b462A4312b03161D4382b32993E4508J39594Q8029
$$ -405528 58797 -262699 42735 -2462 14312 -203161 44382 -232993 54508 194102 282131
9987B82131a35479j71218g0849j21996Q5274p351m4573C6673i6961B95529h8196
$$ 282131 -135479 -306697 -70849 -192845 -107571 -114922 -159495 36673 -96961 295529 -88196
9975a82253A2157a53301A7042c6552B6351c8971E4350b18527P8119D463c03185
$$ -182253 12157 -153301 17042 -36552 26351 -38971 54350 -218527 -140408 4463 -303185
9963B79202g3934A4915c28370J59219j50636a664j39817m5783n5116m3937A19275
$$ 279202 -73934 14915 -328370 -169151 -319787 -1664 -141481 -187264 -242380 -286317 119275
9951a05306j82812a03363m1246k42080f6913A64790b10016R716C4791J78376q4713
$$ -105306 -288118 -103363 -144609 -386689 -66913 164790 -210016 -200300 34791 213167 128454
9940A28454K04324b43816Q3916L7312e7630Q95B38998a36861K7569A34388l4351
$$ 128454 332778 -243816 -159900 -122588 -57630 -56735 238998 -136861 -109292 134388 100037
9929A00037g1990j42520O8752B29898k5992b19865D39736A04049D4770c79607
$$ 100037 -71990 -214510 -145758 229898 203906 -219865 439736 104049 44770 -379607
9918a30867I2464d79175a08788C4294c86434a83986F6026a77270j89438c8489
$$ -130867 92464 -479175 -108788 34294 -386434 -183986 66026 -177270 -366708 -38489
9907f2378j00190K4680A6187b71576A9c359k40612q9626F4610l2254c9559A30634
$$ -62378 -162568 -137888 16187 -271576 19 -3359 -243971 -333597 64610 32356 -39559 130634
9894c2571j60718D50218b1908E413P9313a09317r2357J7405O4769d2265Q336C4521
$$ -32571 -193289 450218 -21908 5413 84726 -109317 -201674 -184269 -119500 -42265 -33929 34521
9881a01177j41475j61561a98911B9811a0004B7395g951q783p692C54106A68438
$$ -101177 -242652 -404213 -198911 29811 -10004 27395 -7951 -16734 -24426 354106 168438
9869g9646B99187h9744B5667c68607g2707K8589n5234A66282b93800i3426j98209
$$ -79646 299187 -89744 25667 -368607 -72707 -44118 -99352 166282 -293800 -93426 -291635
9858b91635a06670m0542j82750B19741B6135J28878o7526O960D1814c6621b471
$$ -291635 -106670 -147212 -329962 219741 26135 155013 87487 94447 41814 -36621 -2471
9846b9317A88365c60112O3060B1585F156c37322a18575B0513b07979A5947b97157
$$ -29317 188365 -360112 -297052 21585 6156 -337322 -118575 20513 -207979 15947 -297157
9834c0265D69171b98418I0003b14986p3119O7519B34380a53513k7699N8146j55894
$$ -30265 469171 -298418 90003 -214986 -288105 -220586 234380 -153513 -181212 -123066 -278960
9823b78960J23530p7373i1938a5959q1488l01436G6851a30780B98819b58042J040
$$ -278960 -155430 -232803 -91938 -15959 -97447 -398883 76851 -130780 298819 -258042 -257002
9812b57002R6824a5302H487a05222k6230q8727A86067a89926p838k28575I5147
$$ -257002 -160178 -15302 8487 -105222 -131452 -220179 186067 -189926 -197764 -426339 95147
9800F5532a63663B58295A19839b93069k1530J7371b9829j13464G6202a98406A9925
$$ 65532 -163663 258295 119839 -293069 -314599 -297228 -29829 -143293 76202 -198406 19925
9788a37605l399d1097D4662c08053A14674b24798c5836j5279A60650C5678E661
$$ -137605 -141004 -41097 44662 -308053 114674 -224798 -35836 -51115 160650 35678 5661
9776A19772A6283a95496O2742b1868k69320A72589B3548A0814R1677b52574k3399
$$ 119772 16283 -195496 -132754 -21868 -291188 172589 23548 10814 102491 -252574 -275973
9765b75973a37603j79355i6132D24013a62097A71218c396A962a47853O1292k62691
$$ -275973 -137603 -316958 -96132 424013 -162097 171218 -3396 1962 -147853 -86561 -349252
9754c49252B4495a08959j31233m5041A00180a27888f0907j29325A03614i6995
$$ -349252 24495 -108959 -240192 -285233 100180 -127888 -60907 -190232 103614 -96995
9743A0175l326O9830a47109g1759j44006B05313c1059l1261B4557J36722f4378
$$ 10175 6849 76679 -147109 -71759 -215765 205313 -31059 -62320 24557 161279 -64378
9731g7469A29480d3780B21919b08964g5114A93519c7193q5124k8479m10718d3001
$$ -77469 129480 -43780 221919 -208964 -75114 193519 -37193 -122317 -150796 -561514 -43001
9719c57445G2021d5614j36823o5451d668j84069B8217i6805A8056o309J00609
$$ -357445 72021 -45614 -182437 -247888 -4668 -188737 28217 -96805 18056 11747 112356
9708A12356a76332A48480d3976p9799B9593a5433k54153A74752n6455f4992j34811
$$ 112356 -176332 148480 -43976 -123775 29593 -15433 -269586 174752 118297 -64992 -199803
9697a99803A61499J6899A7591a2993j42444L1569k45559B4468a80564P3188k1831
$$ -199803 161499 178398 17591 -12993 -155437 -123868 -369427 24468 -180564 -107376 -129207
9686a29207j18642A41407g0567C68433a59718N7262B5408c01155D9880J43191
$$ -129207 -247849 141407 -70567 368433 -159718 -102456 25408 -301155 49880 193071
9676A93071a18932A18830a86486I6104i633m6112A30990b09269C0358a79724L9760
$$ 193071 -118932 118830 -186486 96104 -9633 -55745 130990 -209269 30358 -179724 -139964
9665a39964A36583M9397a84475F822b99704P4005D855J00263m6395L09776j66526
$$ -139964 136583 185980 -184475 6822 -299704 -225699 4855 105118 58723 368499 201973
9654B01973A0916b23710f7025j23024C97834b55246J07189n2730m2226H383f5240
$$ 201973 10916 -223710 -67025 -190049 397834 -255246 -148057 -200787 -243013 8383 -65240
9642a25165e9763l2841D4940g1448b088k71973A20908b97407B63591j26473c9432
$$ -125165 -59763 -92604 44940 -71448 -2088 -274061 120908 -297407 263591 137118 -39432
9630d05810A50660b45175N3919k0912E8010R6963c4190A26114a16831m9762A76394
$$ -405810 150660 -245175 -191256 -212168 58010 154973 -34190 126114 -116831 -166593 176394
9618D4644J2373b29684O9952k2799B00642J95125c36445Q4407f757D75055e42
$$ 44644 57017 -229684 -159732 -182531 200642 395767 -336445 -252038 -6757 475055 -542
9606g1956A31394a81906A83306F9878a00953B47527b27965e3326B70377i6557
$$ -71956 131394 -181906 183306 69878 -100953 247527 -227965 -53326 270377 -96557
9595a72507D9740b11215L0943B99301a12551B98109a13407k43331i6717j25770
$$ -172507 49740 -211215 -180272 299301 -112551 298109 -113407 -356738 -96717 -222487
9585b22487g7481j97996A65754a34938C69991a0462j52933b781j87796A8899J11924
$$ -222487 -77481 -275477 165754 -134938 369991 -10462 -163395 -2781 -190577 18899 130823
9574A30823c56222K928A54140h0058C32619e3315C12739A8785K37371E2846a62636
$$ 130823 -356222 -353294 154140 -80058 332619 -53315 312739 18785 256156 52846 -162636
9562h355D6349L8499c7114A68047b15668A2741C549b52393J10351f609A62930
$$ -8355 46349 84848 -37114 168047 -215668 12741 3549 -252393 -142042 -6609 162930
9550G0320j97c65022A13554e3466c391D7944a73498a4268o8580o7755f6989H2625
$$ 70320 70123 -365022 113554 -53466 -3391 47944 -173498 -14268 -82848 -150603 -66989 82625
9537g68j52634m0195d1504I9450B0669c7679o9258d5927j68101p5063a34444j60916
$$ -768 -153402 -193597 -41504 99450 20669 -37679 -106937 -45927 -214028 -289091 -134444 -295360
9525b95360d2382l0851D6903N0371n58b08235B05527l6244D2478c62984a5118
$$ -295360 -42382 -73233 46903 97274 96716 -208235 205527 169283 42478 -362984 -15118
9513b49140C0656a37243k71826a25209E16805a10272a4999D244h8874L1739A09429
$$ -249140 30656 -137243 -409069 -125209 516805 -110272 -14999 4244 -88874 -57135 109429
9501b08814C62012c4951A97480d9684n43278b66197J9554h2397m4413A74009c41205
$$ -208814 362012 -34951 197480 -49684 -592962 -266197 -246643 -82397 -126810 174009 -341205
9489f2699O699A84916b60510m5260d8228k12967Q2410H9523B6149b75177J20478
$$ -62699 -56000 184916 -260510 -305770 -48228 -261195 -178785 89523 26149 -275177 -154699
9478a54699C77398h7092H4699Q3316g7726L1793j18479A42313M773g4129g140
$$ -154699 377398 -87092 84699 168015 -77726 -45933 -164412 142313 147086 -74129 -7140
9466A14960b0584F655a90837j18762c820q7548I1638c23643c3805g511j8576k02338
$$ 114960 -20584 6655 -190837 -309599 -3820 -91368 91638 -323643 -33805 -7511 -26087 -228425
9454b28425l05625A19523a61207J8433L0516k76514d0420C8772k508J37757h9841
$$ -228425 -534050 119523 -161207 -142774 -112258 -388772 -40420 38772 36264 174021 -89841
9442A37605k8273A3534c5780r7782E1479c14611a53626A4440d3174l351j19863
$$ 137605 109332 13534 -35780 -133562 51479 -314611 -153626 14440 -43174 -46525 -166388
9431a66388l12659J34610J13453a08974j45270O709j38704d5719B665a76908F6420
$$ -166388 -479047 -344437 -230984 -108974 -254244 -247535 -386239 -45719 2665 -176908 66420
9419C8568b1611k73677R1932a6321M006l45384L8974J53930j052m619B87160b4099
$$ 38568 -21611 -295288 -203356 -16321 -12315 -357699 -318725 -164795 -165847 -170466 287160 -24099
9406a708k24078H287J23823a14904j51081g7840B4932h8987R681p5164B07791
$$ -1708 -225786 8287 132110 -114904 -265985 -77840 24932 -88987 -79306 -154470 207791
9394a32815N1161A79135k5492F2438a15984A59915M5441c5167A70643i2056B9696
$$ -132815 -81654 179135 153643 62438 -115984 159915 205356 -35167 170643 -92056 29696
9382a00016k30866F8687a37831A9737A325b29189J05313B17123c92146a20416
$$ -100016 -330882 68687 -137831 19737 1325 -229189 -123876 217123 -392146 -120416
9371E3612j1838a96629R8039n0606F6924c1931D8562e2860A31646k1778B4489
$$ 53612 41774 -196629 -98590 -149196 66924 -31931 48562 -52860 131646 109868 24489
9359B20021r0720c51591B04M6706P3013K2162n3148I651a09155J9216j37345d0458
$$ 220021 129301 -351591 204 46910 119923 142085 88937 9651 -109155 -89939 -227284 -40458
9346B8927d3575l21809G0503L8010c6688C42071a64460j14203d5064n2839L8451
$$ 28927 -43575 -365384 70503 108513 -36688 342071 -164460 -278663 -45064 -97903 -59452
9335e9452l6590m1901D693a53183c7420D2701J90731e5711j6100C81175a50182
$$ -59452 -96042 -137943 4693 -153183 -37420 42701 233432 -55711 -71811 381175 -150182
9323d9130j0849H7084b08413C9761a20494m14537h8391k35567B894M9612J68583
$$ -49130 -59979 87084 -208413 39761 -120494 -535031 -88391 -323958 2894 52506 221089
9312B21089G0206K72860q1091e1244k8143k74491a2920k12699g1783b4965l19150
$$ 221089 70206 343066 261975 -51244 -79387 -353878 -12920 -225619 -71783 -24965 -344115
9301c44115E9915a80826B17089D7436a09887A26968E0375f234j46660C65324a37205
$$ -344115 59915 -180826 217089 47436 -109887 126968 50375 -6234 -152894 365324 -137205
9289B97374I7717M1688K7577B8244c57710e0067G790a93593B33356E7516a76999
$$ 297374 97717 139405 166982 28244 -357710 -50067 7790 -193593 233356 57516 -176999
9277A06778c3518a6757A36516a04323B37558L25350b1113l85297B71976b30962
$$ 106778 -33518 -16757 136516 -104323 237558 562908 -21113 -406410 271976 -230962
9266A12064a65756A34824a27855j79423J46784N7581G2216d18245A7293a27386
$$ 112064 -165756 134824 -127855 -307278 -160494 -102913 72216 -418245 17293 -127386
9255a76971i723j50073b3277B05184d3729j62461g3500I4438a39142l12039h2706
$$ -176971 -9723 -159796 -23277 205184 -43729 -206190 -73500 94438 -139142 -451181 -82706
9243D1319a49021F3614h0015m1388j01625J7874i5127j03781A40539a99537d4008
$$ 41319 -149021 63614 -80015 -121403 -223028 -205154 -95127 -198908 140539 -199537 -44008
9231a0697G3711g4728j92824A05605a87076p2016C26069h3550j47983J06667J3725
$$ -10697 73711 -74728 -267552 105605 -187076 -259092 326069 -83550 -231533 -124866 -111141
9220a11141k6880A27227G462b95681A42346e10058A73185q2595g7897N9K0802
$$ -111141 -138021 127227 7462 -295681 142346 -510058 173185 90590 -77897 -77838 -57036
9209e7036j13416p5747P9306C3447d7268A36373a73146n900E5442j0891a46981
$$ -57036 -170452 -246199 -166893 33447 -47268 136373 -173146 -179046 55442 44551 -146981
9197D4544K63505a65308k52787R1449B47419a41629m7569d0179g348j60697m9197
$$ 44544 308049 -165308 -418095 -326646 247419 -141629 -189198 -40179 -7348 -168045 -217242
9186b17242D6846b63273J04796k49935a31028n4571H5665a54952E01O8754J82677
$$ -217242 46846 -263273 -158477 -408412 -131028 -185599 85665 -154952 501 69255 251932
9175B51932b38673D793c61744q5503a48499N6869d3718G7714j1106g5163F7081
$$ 251932 -238673 4793 -361744 -447247 -148499 -91630 -43718 77714 66608 -75163 67081
9163a07183j81750B49410d9767o164j82828Q4960j65909O5460c4461D1394K88934
$$ -107183 -288933 249410 -49767 -55931 -238759 -153799 -319708 -254248 -34461 41394 330328
9152C30328a16353A88189m5337a19670A28619a93018B50756e7553q9269f2887
$$ 330328 -116353 188189 142852 -119670 128619 -193018 250756 -57553 -146822 -62887
9141B5334P2688C8093J8648J54600c29900B48875b92767f3507F7319a03682F7691
$$ 25334 98022 38093 56741 211341 -329900 248875 -292767 -63507 67319 -103682 67691
9129e7036A33250o1949b52284j20381J75397h1574j22704A63413e4400k03842
$$ -57036 133250 71301 -252284 -372665 -197268 -81574 -204278 163413 -54400 -258242
9119b58242D704J79457a41250d8826j76253P7690H8659c03687B26515N4345b8948
$$ -258242 4704 184161 -141250 -48826 -225079 -147389 88659 -303687 226515 280860 -28948
9107G6784P2786d17480a5238j12260A39622b71009P7027j42069e7249G2948L9995
$$ 76784 149570 -417480 -15238 -127498 139622 -271009 -193982 -336051 -57249 72948 112943
9096A12943q198M9462h3874b6424E1512e8139k96948a65635j46121e72A8231K71975
$$ 112943 104745 154207 -83874 -26424 51512 -58139 -355087 -165635 -311756 -572 18231 290206
9084B90206a14615J4349j84983F8976a13426B02397a32880A35072b29372A91663
$$ 290206 -114615 -100266 -285249 68976 -113426 202397 -132880 135072 -229372 191663
9073A52809d37589a40685e6954G4286f8467p4396A1713d9866j40084E868K8187
$$ 152809 -437589 -140685 -56954 74286 -68467 -142863 11713 -49866 -189950 5868 34055
9062C4055a89762B80728g7298j36022a05788q7727M921I3091J922e0438B9091
$$ 34055 -189762 280728 -77298 -213320 -105788 -193515 -188594 93091 95013 -50438 29091
9050B73050B8977J93843c6758j30407l29492p3162E4508a36736b7581A08106c3343
$$ 273050 28977 222820 -36758 -167165 -496657 -569819 54508 -136736 -27581 108106 -33343
9038c80038H1065g4510D2035J53814C5504J60095I6811f2440j45437a00599b0897
$$ -380038 81065 -74510 42035 195849 35504 195599 96811 -62440 -207877 -100599 -20897
9026a81672g2306H7963M0721a23683E6335c58570D450K20998b50474N6556K2201
$$ -181672 -72306 87963 128684 -123683 56335 -358570 4450 225448 -250474 -193918 -171717
9015a71717A94534a22106A19140c50138j51193a24657K1426B3526c8301n9805
$$ -171717 194534 -122106 119140 -350138 -501331 -124657 -103231 23526 -38301 -98106
9005i8106A96318b58075c2732H2959A9842J47861a03179F1840c85623j12393a06089
$$ -98106 196318 -258075 -32732 82959 19842 167703 -103179 61840 -385623 -498016 -106089
8993d3877n534q7600O4026A72431d2001k99146J63915A24158i9705L14A44891
$$ -43877 -49411 -137011 -72985 172431 -42001 -341147 -177232 124158 -99705 -99391 144891
8981C363a4756j9877A92663b7764C29907b07100c2892J2641l73880A76869a21920
$$ 3363 -14756 -34633 192663 -27764 329907 -207100 -32892 -20251 -394131 176869 -121920
8969b61066C06680d23155a07406n3709A14269m4586q375k3752e793j12367e8556
$$ -261066 306680 -423155 -107406 -161115 114269 69683 61308 37556 -5793 -118160 -58556
8957C01088a611A20003Q418A5729f2795m709k73850M7107J39421g7368j4005A06625
$$ 301088 -1611 120003 128421 15729 -62795 -67504 -341354 -294247 -154826 -77368 -91373 106625
8944h473p7244D6437d9433j05418e3483J4933k97346a43704e1426C6292a34354
$$ -8473 -85717 46437 -49433 -154851 -53483 -38550 -335896 -143704 -51426 36292 -134354
8932B8314a76167b5904R491A85190b34590C00766C1791N7802k4930L43304K93288
$$ 28314 -176167 -25904 -16413 185190 -234590 300766 31791 89593 64663 407967 701255
8921G01255K80273K352826A541395C76851a59868I9195b23765B7050M4960L02908
$$ 701255 981528 3334354 1541395 376851 -159868 99195 -223765 27050 72010 374918
8911C74918d0126A37580a18708K2539J1128G249J42157a54282c1272k3942k47511
$$ 374918 -40126 137580 -118708 -96169 -85041 7249 149406 -154282 -31272 -55214 -302725
8900c02725B75254a60892P3768A45294A1501d7578j46727G994b11318E43b80034
$$ -302725 275254 -160892 -87124 145294 11501 -47578 -194305 7994 -211318 543 -280034
8888e0520A06871a94538M6912j80469b9411q1061D3330I57e5026j67914c1724
$$ -50520 106871 -194538 -147626 -328095 -29411 -110472 43330 957 -55026 -222940 -31724
8876b8583j49291j46675c1795B35108b79206A0136g3676a171j25576j00586j52718
$$ -28583 -177874 -324549 -31795 235108 -279206 10136 -73676 -1171 -126747 -227333 -380051
8865c80051B36048k4125a35433m215n4376A82850c06202A10565h2358H9848f0478
$$ -380051 236048 211923 -135433 -139648 -194024 182850 -306202 110565 -82358 89848 -60478
8853A48613j5033h0125j01925N7376k73725J71541n524m6109a16225o085B01179
$$ 148613 133580 -80125 -182050 -124674 -398399 -226858 -232382 -278491 -116225 -122310 201179
8841D04107A42814c15882C16487i5838O915p455C9055J33011a84538B3307d2433
$$ 404107 142814 -315882 316487 -95838 -88923 -96378 39055 172066 -184538 23307 -42433
$$ [...]
##END NTUPLES=NMR SPECTRUM
##END=
