##TITLE=NES1067_Nhol10909_9883707_NhqFqdgz2h
##JCAMPDX= 6.0         $$ Bruker NMR JCAMP-DX V2.0
##DATA TYPE= NMR SPECTRUM
##DATA CLASS= NTUPLES
##ORIGIN= BRUKER
##OWNER= Administrator
$$ 1.72 TOPSPIN		Version 2.1
$$ 2016-08-26 23:27:02.679 -0500  Administrator@X
$$ Compression mode = diff/dup
##.OBSERVE FREQUENCY= 400.02188249412
##.OBSERVE NUCLEUS= ^1H
##.ACQUISITION MODE= SIMULTANEOUS (DQD)
##.ACQUISITION SCHEME= undefined
##.AVERAGES= 8
##.DIGITISER RES= 22
##SPECTROMETER/DATA SYSTEM= spect
##.PULSE SEQUENCE= zg30
##.SOLVENT NAME= COFFEE_meoh
##.SHIFT REFERENCE= INTERNAL, COFFEE_meoh, 1, 14.98509
##AUDIT TRAIL= $$ (NUMBER, WHEN, WHO, WHERE, PROCESS, VERSION, WHAT)
$$ ##TITLE= Audit trail, TOPSPIN		Version 2.1
$$ ##JCAMPDX= 5.01
$$ ##ORIGIN= Bruker BioSpin GmbH
$$ ##OWNER= Administrator
$$ $$ E:\/data/COFFEE/nmr/NES1067_Nhol10909_9883707_NhqFqdgz2h/10/pdata/1/auditp.txt
$$ ##AUDIT TRAIL=  $$ (NUMBER, WHEN, WHO, WHERE, PROCESS, VERSION, WHAT)
(   1,<2016-08-26 23:26:55.492 -0500>,<Administrator>,<X>,<go>,<TOPSPIN 2.1>,
      <created by zg
	started at 2016-08-26 23:25:49.726 -0500,
	POWCHK enabled, PULCHK disabled,
       configuration hash MD5:
       21 0F 79 D6 B3 7B B4 F6 88 20 88 DB 03 48 BD 9F
       data hash MD5: 64K
       2C 9D 73 E8 55 9E FB 68 7E 59 34 05 93 27 A4 A0>)
(   2,<2016-08-26 23:26:58.586 -0500>,<Administrator>,<X>,<proc1d>,<TOPSPIN 2.1>,
      <Start of raw data processing
       efp LB = 0 FT_mod = 6 PKNL = 1 PHC0 = 0 PHC1 = 0 SI = 32K 
       data hash MD5: 32K
       59 D3 70 5A B3 33 EF A2 AB F4 DD A1 87 EA B0 63>)
(   3,<2016-08-26 23:26:58.867 -0500>,<Administrator>,<X>,<proc1d>,<TOPSPIN 2.1>,
      <pk PHC0 = 90.97229 PHC1 = 0 
       data hash MD5: 32K
       EB 99 A6 7B 81 19 C7 A2 AA DC BF 23 F8 1E A4 20>)
(   4,<2016-08-26 23:26:58.976 -0500>,<Administrator>,<X>,<proc1d>,<TOPSPIN 2.1>,
      <abs ABSG = 1 
       data hash MD5: 32K
       AE 2F 73 CA 58 8B 17 28 E9 8D 49 82 D5 FE 46 FD>)
(   5,<2016-08-26 23:26:59.039 -0500>,<Administrator>,<X>,<proc1d>,<TOPSPIN 2.1>,
      <abs ABSG = 2 
       data hash MD5: 32K
       65 3E FE E3 B3 38 67 A8 16 B7 1A A0 A6 55 16 9C>)
(   6,<2016-08-26 23:26:59.086 -0500>,<Administrator>,<X>,<proc1d>,<TOPSPIN 2.1>,
      <abs ABSG = 3 
       data hash MD5: 32K
       07 42 82 4D A6 FA 92 CA C3 BF 07 FC C3 30 7C 08>)
(   7,<2016-08-26 23:26:59.148 -0500>,<Administrator>,<X>,<proc1d>,<TOPSPIN 2.1>,
      <abs ABSG = 4 
       data hash MD5: 32K
       67 83 F1 AB 57 2E 67 76 2E D6 B3 9E C9 46 05 F3>)
(   8,<2016-08-26 23:26:59.211 -0500>,<Administrator>,<X>,<proc1d>,<TOPSPIN 2.1>,
      <abs ABSG = 5 
       data hash MD5: 32K
       B7 1B EF 2A F5 DD 0A ED E7 36 71 53 96 EF 63 44>)
$$ ##END=
$$ 
$$ $$ hash MD5
$$ $$ 73 5A 0C 3C 8A 63 6F A8 00 DB 0F 74 D5 33 14 BE
##$RELAX= 
##$RELAX= 
##$RELAX= 
##$RELAX= 
##$RELAX= 
##$RELAX= 
##$RELAX= 
$$ Bruker specific parameters
$$ --------------------------
##$DU= <E:\>
##$EXPNO= 10
##$NAME= <NES1067_Nhol10909_9883707_NhqFqdgz2h>
$$ [...]
150 150 150 150 150 150 150 150
##$TP07= 0
##$TPNAME0= <>
##$TPNAME1= <>
##$TPNAME2= <>
##$TPNAME3= <>
##$TPNAME4= <>
##$TPNAME5= <>
##$TPNAME6= <>
##$TPNAME7= <>
##$TPOAL= (0..7)
0.5 0.5 0.5 0.5 0.5 0.5 0.5 0.5
##$TPOFFS= (0..7)
0 0 0 0 0 0 0 0
##$TUNHIN= 0
##$TUNHOUT= 0
##$TUNXOUT= 0
##$USERA1= <user>
##$USERA2= <user>
##$USERA3= <user>
##$USERA4= <user>
##$USERA5= <user>
##$V9= 5
##$VALIST= <valist>
##$VCLIST= <CCCCCCCCCCCCCCC>
##$VD= 0
##$VDLIST= <DDDDDDDDDDDDDDD>
##$VPLIST= <PPPPPPPPPPPPPPP>
##$VTLIST= <TTTTTTTTTTTTTTT>
##$WBST= 2048
##$WBSW= 25
##$XGAIN= (0..3)
0 0 0 0
##$XL= 0
##$YL= 0
##$YMAX_a= 565008
##$YMIN_a= -482245
##$ZGOPTNS= <>
##$ZL1= 120
##$ZL2= 120
##$ZL3= 120
##$ZL4= 120
##$ABSF1= 14.98509
##$ABSF2= -5.573092
##$ABSG= 5
##$ABSL= 3
##$ALPHA= 0
##$AQORDER= 0
##$ASSFAC= 0
##$ASSFACI= 0
##$ASSFACX= 0
##$ASSWID= 0
##$AUNMP= <proc_prof1d_extract_pilot.lims>
##$AXLEFT= 0
##$AXNAME= <>
##$AXNUC= <1H>
##$AXRIGHT= 0
##$AXTYPE= 0
##$AXUNIT= <>
##$AZFE= 0.1
##$AZFW= 0.1
##$BCFW= 0
##$BC_mod= 0
##$BYTORDP= 0
##$COROFFS= 0
##$CY= 15
##$DATMOD= 1
##$DC= 0
##$DFILT= <>
##$DTYPP= 0
##$F1P= 0
##$F2P= 0
##$FCOR= 0.5
##$FTSIZE= 32768
##$FT_mod= 6
##$GAMMA= 0
##$GB= 0
##$INTBC= 1
##$INTSCL= 1
##$ISEN= 128
##$LB= 0
##$LEV0= 0
##$LPBIN= 0
##$MAXI= 10000
##$MC2= 0
##$MEAN= 0
##$ME_mod= 0
##$MI= 0
##$NCOEF= 0
##$NC_proc= -8
##$NLEV= 6
##$NOISF1= 0
##$NOISF2= 0
##$NSP= 0
##$NTH_PI= 0
##$NZP= 0
##$OFFSET= 14.98509
##$PC= 1
##$PHC0= 90.97229
##$PHC1= 0
##$PH_mod= 1
##$PKNL= yes
##$PPARMOD= 0
##$PPDIAG= 0
##$PPIPTYP= 0
##$PPMPNUM= 2147483647
##$PPRESOL= 1
##$PSCAL= 4
##$PSIGN= 0
##$PYNMP= <proc.py>
##$REVERSE= no
##$SF= 400.02
##$SI= 32768
##$SIGF1= 0
##$SIGF2= 0
##$SINO= 400
##$SIOLD= 32768
##$SPECTYP= <>
##$SREGLST= <1H.CDCl3>
##$SSB= 0
##$STSI= 32768
##$STSR= 0
##$SW_p= 8223.68421052631
##$SYMM= 0
##$S_DEV= 0
##$TDeff= 65536
##$TDoff= 0
##$TI= <>
##$TILT= no
##$TM1= 0
##$TM2= 0
##$TOPLEV= 0
##$USERP1= <user>
##$USERP2= <user>
##$USERP3= <user>
##$USERP4= <user>
##$USERP5= <user>
##$WDW= 1
##$XDIM= 32768
##$YMAX_p= 438970957
##$YMIN_p= -735320
##$CURPLOT= <Network HP LaserJet P1505>
##$CURPRIN= <$Network HP LaserJet P1505>
##$DFORMAT= <normdp>
##$LAYOUT= <+/1D_H.xwp>
##$LFORMAT= <normlp>
##$PFORMAT= <normpl>
##$SURQMSG= 1
$$ End of Bruker specific parameters
$$ ---------------------------------
##NTUPLES= NMR SPECTRUM
##VAR_NAME=  FREQUENCY,     SPECTRUM/REAL,   SPECTRUM/IMAG
##SYMBOL=    X,             R,               I
##VAR_TYPE=  INDEPENDENT,   DEPENDENT,       DEPENDENT
##VAR_FORM=  AFFN,          ASDF,            ASDF
##VAR_DIM=   32768,         32768,           32768
##UNITS=     HZ,            ARBITRARY UNITS, ARBITRARY UNITS
##FACTOR=    0.250966925370066, 1,           1
##FIRST=     8223.43324360094, -21590,       -107085
##LAST=      0,             -100556,         -199226
##MIN=       0,             -735320,         0
##MAX=       8223.43324360094, 438970957,    0
$$ Real data points
##PAGE= N=1
##DATA TABLE= (X++(R..R)), XYDATA
$$ [...]
$$ plain form
19556 410949 -124295 158196 -195830 -348974 -24542 -105876 -141163 -242909 134338 -188406
19545 98735 159457 55448 -136020 10841 2266 -22373 -343999 175917 -55302 365411 -82758
19533 49737 21118 -113443 -84168 -98236 172596 -80161 -342429 195855 143389 -24552 -63881
19522 -63881 -4459 -19327 102331 72807 133914 192127 -305121 59316 -77254 90297 258572
19511 258572 56117 -16738 -107726 58299 -229157 -29519 -53766 -49079 -189008 -112433 -108393
19500 -108393 -183084 -102996 -150652 -224184 -86247 -144114 159732 -181812 -113706 145004 -20741
19488 163186 209446 -217242 -150563 -255663 -71848 -500090 -197101 -109792 236421 177933
19478 177933 -83174 -26543 -44065 -114536 -204904 85737 -405 33695 -188479 116149 165275
$$ packed form
19556D10949a24295A58196a95830j53144b4542q1334l5287j01746A34338a88406
19545I8735O0722E5448a36020A0841B266b2373l21626A75917e5302C65411h2758
19533D9737B1118a13443K9275j4068A72596h0161k62268A95855n2466b4552l9329
19522f3881d459j4868A02331k9524O1107N8213c05121E9316g7254I0297J68275
19511B58572E6117a6738r0988E8299b29157b9519k4247M687j39929P6575M040
19500a08393p4691Q0088m7656p3532h6247n7867A59732a81812O8106A45004b0741
19488A63186M6260b17242O6679j05100g1848m28242a97101Q7309B36421n8488
19478A77933h3174b6543j7522p0471r0368H5737d05C3695a88479A16149M9126
$$ plain form
19467 165275 -263125 258873 233663 45095 -146966 120392 -17364 -54941 -20550 -271591
19457 -271591 -362225 -29395 46194 -34471 236530 221198 -26291 -409180 -32191 -133857 31959
19445 157364 -109788 177014 -325433 -356772 35115 -22345 -207685 -487197 115798 -135955
19434 -201386 73521 137409 75429 58645 -250202 -179718 -182481 -462584 146861 -156602 -84116
19423 -84116 51248 96061 -373619 122735 -1522 -161200 -13306 115430 -60767 -131483 104748
19411 24347 16243 -102154 79608 -150219 69553 -161719 -358102 10523 -143409 -4431 -260958
19400 -260958 -293463 107768 -210893 11248 252756 -67743 -101307 370988 -224295 -10070
19389 136139 -80904 22671 -15891 -102818 -15629 -52414 -179219 -54211 -187426 108574 -38915
$$ packed form
19467A65275b63125B58873k5210D5095a46966A20392a7364l7577b0550k51041
19457b71591r0634b9395D6194c4471B36530j5332b6291l82889c2191j01666C1959
19445A57364a09788A77014c25433l1339C5115b2345j85340k79512A15798a35955
19434b01386G3521O3888o1980j6784b50202P0484k763k80103A46861a56602P2486
19423h4116E1248M4813c73619A22735a522j59678a3306A15430f0767p0716A04748
19411B4347q104a02154G9608a50219F9553a61719j96383A0523a43409d431k56527
19400b60958l2505A07768b10893A1248K41508f7743l3564C70988b24295a0070
19389A36139h0904B2671a5891q6927a5629l6785j26805e4211j33215A08574c8915
$$ plain form
19377 52807 51446 26168 349136 142848 -11542 -419754 -43806 -37137 40412 66046 -70150
19365 7924 111181 205689 -31667 48751 238494 -62497 -115728 251638 -80507 95483 -350269
19353 -338407 69224 -248295 -80126 -23161 -361984 -56008 38299 -204085 212673 -244873
19342 3963 140999 141369 972 69430 -164901 -116403 -361089 60555 339758 99938 70497 -152596
19329 35719 338184 -253602 -464265 -17630 -12394 -214179 -204187 -102976 -35149 -47100 -15561
19317 294622 -101616 -361296 28706 15808 57672 -265429 110781 -139535 -345028 -30577
19306 -175298 19458 134314 -23636 -292240 -15991 -56285 -161726 6571 -57329 88004 3806
19294 426084 54619 -483080 228042 -56486 -117994 -186640 -72482 -392633 105349 -166451
$$ packed form
19377E2807j361k5278L22968A42848a1542m08212d3806O669D0412K5634g0150
19365G924J03257R4508c1667D8751J89743f2497n3231B51638h0507I5483c50269
19353c38407F9224b48295h0126b3161l38823e6008C8299b04085B12673b44873
19342C963J37036L70I72O8458a64901M8498k44686F0555K79203I9938k9441a52596
19329C5719L02465b53602k10663a7630N236k01785R992J01211c5149j1951a5561
19317B94622a01616k59680B8706j2898M1864b65429A10781a39535k05493c0577
19306a75298A9458J14856b3636k68604a5991m0294j05441F571e7329H8004C806
19294D26084E4619d83080B28042e6486o1508o8646g2482l20151A05349a66451
$$ plain form
19283 -107391 -31877 27483 16739 -61989 1492 -223203 -14079 180131 -9785 -22583 208012
19271 8174 -94421 -37980 -235801 -70986 130028 3774 137624 -136380 240677 -5967 -69533
19260 -69533 -65819 73484 -62720 -129686 -391129 -90028 -353074 -285247 -318264 -261597 -76073
19248 -46889 -30823 145626 -44465 -31126 -91271 364 48106 -159963 -46530 221899 -243712
19236 97882 40979 -234443 151440 -213005 -29917 -146685 -339603 -81808 30623 -268160
19225 -185419 61025 -94336 -126739 4477 -119041 -331847 69358 63815 102855 -164895 -80261
19213 -157247 -352365 -83310 -562269 135742 -182288 -138741 -161261 30539 269979 98686
19202 -82696 -64280 -136193 -159979 -153219 -125939 -328759 -157516 82343 -63365 -99105 -209543
$$ packed form
19283a07391c1877B7483j0744f1989A492b23203a4079A80131i785j2798B08012
19271H174i4421c7980j97821g0986A30028C774J33850a36380B40677e967o3566
19260f9533L714G3484f2720o6966k61443i0028k63046O7827l3017N6667g6073
19248d6889J6066A45626d4465J3339o0145C64M7742a59963d6530B21899b43712
19236I7882D0979b34443A51440b13005b9917j16768j92918h1808C0623b68160
19225a85419F1025i4336l2403D477a19041k12806F9358n543L9040a64895h0261
19213a57247j95118h3310m78959A35742a82288M3547k2520C0539K39440I8686
19202h2696J8416p1913k3786O760K7280k02820a57516H2343f3365l5740j10438
$$ plain form
19191 -209543 7095 -34868 68545 -87262 -169669 -308577 -340015 -31999 -255800 -58553 -69796
19180 -69796 -195694 -356901 52234 -153276 15829 -177229 -164374 181138 89917 -14993 193807
19168 149521 49572 77719 35806 76742 -43521 -250601 55119 40197 82478 -39028 -160343
19157 -160343 -91821 228277 -203248 -20008 -46538 72202 -59604 -296464 -264263 -90547 81574
19145 124928 -295655 -149747 -3213 -138973 81431 -276681 -184867 184620 -69829 68984 19256
19133 -140749 239382 4082 26484 -255979 -8269 -60398 249225 177344 -171650 279791 -88673
19121 -40126 -123598 -128088 -116324 141396 123291 -337957 -149175 47542 44299 -346022 16597
19109 202670 -104297 -43709 -411755 258608 -295290 7422 71942 189965 -281519 15296
$$ packed form
19191b09543G095c4868F8545h7262q2407j38908l1438c1999k23801e8553j1243
19180f9796j25898j61207E2234a53276A5829a77229J2855A81138H9917a4993A93807
19168A49521D9572K8147C5806M0936d3521k07080E5119j4922M2281c9028j21315
19157a60343O8522B28277b03248b0008k6530G2202e9604k36860L2201i0547H1574
19145A24928b95655J45908c213j35760H1431b76681R1814A84620f9829F8984A9256
19133a40749B39382D082K2402b55979h269n2129B49225p1881a71650B79791h8673
19121d0126q3472m490J1764A41396j8105c37957a49175D7542l243c46022A6597
19109B02670a04297d3709l68046B58608b95290G422O4520J18023b81519A5296
$$ plain form
19098 95871 -460545 51133 -214144 -371913 -83329 24185 49103 -281005 -38649 -73128 87913
19086 -20401 123342 -130513 11892 -177234 80292 -79806 -51532 -132982 -354380 -34835 -180460
19075 -180460 152449 110169 74325 -191141 156481 -58444 10310 265254 27361 291738
19065 291738 137528 -212093 150617 -219605 164836 -53491 5051 100258 -89844 -463220
19055 -463220 259684 26841 -187385 11001 -63683 -34328 -207391 -82980 20171 -391118 -303808
19044 -303808 -143165 21809 -40647 126473 116397 -132622 -62998 -25522 -124714 -62732 -1399
19032 59047 32774 -120576 230554 39374 141191 -95886 -28918 -198355 36052 -120786 -146047
19021 -146047 -464648 20917 246932 182085 -70344 -127695 -184642 -199948 -60095 -7089 434727
$$ packed form
19098I5871d60545E1133b14144j57769h3329B4185K4918b81005c8649l4479H7913
19086b0401A23342a30513A1892a77234H0292g9806K8274q1450k21398c4835j45625
19075a80460A52449m2280l5844a91141A56481e8444A0310K54944B7361K64377
19065B91738A37528b12093A50617b19605A64836e3491E051R5207h9844l73376
19055d63220B59684B6841a87385A1001f3683K9355j73063h2980B0171c91118Q7310
19044c03808a43165B1809d0647A26473j0076a32622f2998b5522r9192O1982a399
19032E9047k6273a20576B30554C9374J01817i5886b8918j69437C6052a20786k5261
19021a46047l18601B0917K26015o4847g0344n7351n6947j5306f0095g089D34727
$$ plain form
19009 -117905 -8693 -147610 -91654 153569 -215598 -44548 -221873 109241 -223475 -216760 -101536
18997 -87324 -58228 129197 -192806 74638 120213 34179 58090 -147200 -38005 -100223 -136522
18986 -136522 156091 29634 -69727 -232445 -207365 -44904 346407 -82015 175188 -185439
18975 -199221 -7781 -144358 -19742 -40616 -161513 -45050 -124651 -87151 59695 88200 256209
18964 256209 -76534 -292900 -348973 156085 -225382 -141333 -263846 -56373 -114713 -239816
18954 -239816 49850 -382327 -166484 29841 96930 337212 -198146 -243107 -46306 33584 -265371
18942 -62731 -4578 -38185 31066 211325 -44550 281416 -100352 148963 391137 231004 -234042
18930 -279905 215636 57365 153321 -19076 29501 18851 -215999 -339951 -192965 -363585
$$ packed form
19009a17905h693j38917N5956A53569b15598d4548j77325A09241b23475O715a01536
18997h7324K9096A29197a92806G4638M5575C4179K3911a47200c8005o2218l6299
18986a36522A56091B9634f9727j62718K5080d4904C46407h2015A75188a85439
18975a99221g781j36577a9742k0874j20897d5050p9601L7500E9695K8505J68009
18964B56209g6534k16366n6073A56085b25382Q4049j22513e6373n8340j25103
18954b39816D9850c82327a66484B9841O7089K40282a98146m4961d6306C3584b65371
18942f2731d578l3607C1066J80259d4550B81416a00352A48963K42174j60133b34042
18930b79905B15636E7365R5956a9076B9501j0650b15999j23952J46986j70620
$$ plain form
18920 -363585 -131633 -97403 148058 -220906 225853 71531 105766 -340619 182106 -110561
18909 -212127 155050 -251459 85393 -8921 163918 264338 -169019 -89235 20822 295435
18899 295435 -115823 57740 -132089 -127081 -194667 -197964 -452146 184212 -25118 56375 133920
18888 133920 -21897 238568 130961 -275784 146947 39351 101003 -224616 2750 83522 -118488
18876 -160143 -294802 119981 -48560 19861 59699 -203063 -158216 315574 -1814 -256789 147834
18864 -167913 250640 54091 -13612 -28001 -176696 -153269 -40793 285595 -90750 -234120 38215
18852 -426683 -69872 310333 -100936 21564 159657 349469 -356755 67707 157979 -97375
18841 48684 -152918 -233305 -367855 8803 289625 -279502 -260043 121451 -230883 130359
$$ packed form
18920c63585a31633L4230A48058b20906B25853G1531L4235c40619A82106a10561
18909b12127A55050b51459H5393h921A63918J00420a69019P9784B0822K74613
18899B95435a15823E7740a32089N008o7586l297k54182A84212b5118E6375P7545
18888A33920b1897B38568j07607b75784A46947C9351O1652b24616B750Q0772a18488
18876a60143j34659A19981d8560A9861L9838b03063M4847C15574a814k54975A47834
18864a67913B50640E4091a3612j4389j48695K3427d0793B85595i0750j43370C8215
18852d26683f9872C10333a00936B1564J38093J89812c56755F7707R0272i7375
18841D8684a52918q0387j34550H803K80822b79502J9459A21451b30883A30359
$$ plain form
18830 4983 113467 141803 -368069 -13126 -24691 -34195 -85320 -211206 24117 -110718 -103324
18819 -103324 193578 -10891 -21002 149479 -189572 196898 212161 -104415 222514 -92710
18808 -121293 -256933 54850 84880 -157375 -219940 41079 -31925 -212863 -189721 94079 75108
18797 75108 -83630 231937 -162342 -112239 -1529 -420994 -346002 106486 38330 -182345 -65204
18785 35217 -16514 -148813 92786 106047 -120114 -280955 -69430 -111438 -141335 -385071 201756
18773 62272 -133311 -470891 -245719 -68631 -140886 -117100 -153218 168442 -297642 55888 -1011
18761 -172453 -112558 55352 -145317 -493251 160335 -185224 -404094 108666 93785 -387542
18750 31005 210770 -142469 -187961 181942 -70729 -274028 -101446 28469 -41836 -113622 184376
$$ packed form
18830D983J08484K8336c68069a3126j1565r504n1125j25886B4117a10718P394
18819a03324A93578a0891j0111A49479a89572A96898J5263a04415B22514i2710
18808a21293j35640E4850L0030a57375o2565D1079c1925j80938K3142I4079j8971
18797G5108h3630B31937a62342N0103a529m19465P4992A06486C8330a82345f5204
18785C5217a6514j32299I2786J3261a20114j60841f9430m2008k9897k43736B01756
18773F2272a33311l37580K25172f8631p2255K3786l6118A68442b97642E5888a011
18761a72453N9895E5352a45317l47934A60335a85224k18870A08666j4881c87542
18750C1005J79765a42469m5492A81942g0729k03299a01446B8469d1836p1786A84376
$$ plain form
18738 17914 222575 187294 -159906 -131226 -159437 -31282 -24112 249244 214691 -25799 52824
18726 188005 257659 -92698 -153911 -467010 -82138 15825 -272165 193178 -35346 46188 -18565
18714 -164108 -44854 -39733 -348479 -285524 222154 -349997 -133294 67091 -208885 -782 157662
18702 -101561 221877 -48608 -39853 311133 -165332 159058 -179477 37677 -193356 -378639
18692 -378639 -66575 170293 76746 -80238 107256 4007 -11609 -79824 196574 -89489 52093
18680 -182769 -92465 -135291 -107893 52889 42171 21628 -165748 -119808 179717 32472 -147909
18668 -123761 85398 96992 -265605 65604 92195 -150593 -187257 92623 -139790 109493 -29300
18656 68203 44381 58446 -998 239402 -70109 -146763 -54773 -92634 13894 -189471 13678 -229462
$$ packed form
18738A7914K04661l5281a59906K8680k8211c1282P170B49244l4553b5799E2824
18726A88005O9654i2698o1213l13099h2138A5825b72165A93178c5346D6188a8565
18714a64108d4854N121l08746O2955B22154c49997a33294F7091b08885g82A57662
18702a01561B21877d8608Q755C11133a65332A59058a79477C7677a93356j85283
18692c78639f6575A70293G6746h0238A07256D007a1609o8215A96574h9489E2093
18680a82769R0304m2826K7398E2889j0718k0543a65748M5940A79717C2472a47909
18668a23761H5398J1594b65605F5604K6591a50593l6664I2623a39790A09493b9300
18656F8203k3822J4065i98B39402g0109p6654e4773l7861A3894a89471A3678b29462
$$ plain form
18643 67892 -3181 -153008 -114130 111877 -44281 -39213 -27613 -72756 -91539 61627 -12765 138347
18630 -253325 55478 -94824 -165474 -36279 119709 30427 -7172 -26976 17659 118415 -322491
18618 -259714 237852 -104568 18778 403471 -11022 -420074 -17475 64409 36052 106749 54966
18607 54966 222350 -143520 -52555 292459 237374 -251028 -191014 -67459 -146372 -262209 -66679
18595 -142811 -223997 80444 119941 -172879 -148479 -337490 211240 -385269 136016 170360
18585 170360 284370 -212353 -220268 -127453 -5064 -42064 -152812 -179718 29164 122350 18030
18573 129653 -248281 211591 -270676 75346 -195743 -210406 -232923 120871 79949 -209976
18562 -75942 -132351 127950 153404 -361664 206282 5797 -152509 58100 114937 223320 164155
$$ packed form
18643F7892c181j49827L8878A11877d4281N068J1600m5143j8783F1627a2765A38347
18630b53325E5478i4824p0650c6279A19709C0427g172j9804A7659J00756c22491
18618b59714B37852a04568A8778L84693a1022m09052a7475F4409k8357P0697n1783
18607E4966J67384a43520e2555B92459n5085b51028O0014f7459p8913j15837f6679
18595a42811q1186H0444L9497a72879K4400j89011B11240c85269A36016L4344
18585A70360J14010b12353p915R2815e064l7000j10748k6906B9164R3186A8030
18573A29653b48281B11591b70676G5346a95743j4663k2517A20871m0922b09976
18562g5942n6409A27950K5454c61664B06282E797a52509E8100N6837J08383n9165
$$ plain form
18551 164155 -61856 -80508 -227014 -268781 97923 13646 216075 73876 -332792 54232 -50734
18539 -89951 -171789 -58468 23525 -158390 105920 -14427 -190207 -576357 -33930 43941 -250937
18527 93440 -98467 -151555 270418 -65888 168281 -105 -337331 100286 81539 -195616 39539
18515 -178294 -178077 89330 114429 -104127 -176071 13752 -13278 -169556 25665 58041 5681 -108801
18502 -160460 81471 118987 247169 -100136 -89635 -338370 -190595 -114627 3134 -340297 -115286
18490 28405 135392 -178990 -183624 34391 -177793 227409 233359 -47777 -134453 153096 31802
18478 83306 3477 -64123 55824 -46306 75036 -24043 -23207 -229252 -18369 -201696 -247818 -103545
18465 -155010 -408568 -117746 126937 -488146 28005 -45231 215292 -145420 137908 104873
$$ packed form
18551A64155f1856j8652j46506m1767I7923A3646K02429G3876c32792E4232e0734
18539h9951q1838e8468B3525a58390A05920a4427j75780l86150c3930D3941b50937
18527I3440i8467n3088B70418f5888A68281a05l37226A00286j8747a95616C9539
18515a78294K17H9330K5099a04127p1944A3752a3278j56278B5665L2376E681a08801
18502a60460H1471L7516J28182a00136J0501k48735J47775P5968C134c40297a15286
18490B8405J06987a78990m634C4391a77793B27409N950d7777q6676A53096C1802
18478H3306C477f4123E5824d6306G5036b4043Q36k06045a8369j83327m6122a03545
18465a55010k53558a17746A26937d88146B8005d5231B15292a45420A37908l3035
$$ plain form
18455 104873 105789 180342 222648 -152532 114160 178985 104066 -90653 -42343 17794 286213
18444 286213 -109712 -397973 -179092 -130436 44067 -184817 40628 27970 379778 187641
18433 22552 69097 263948 90823 103025 123092 -6154 -12427 232958 -191830 -2549 338516
18421 -50160 51017 -60286 -141986 -20910 -112415 -60489 121946 144849 -57982 11001 -36953
18409 132205 -192347 110345 -122713 -19634 32625 -195361 -43152 120491 36100 77612
18399 77612 158653 -217574 -176969 -271362 255634 89998 -401981 31800 -261137 274667 22306
18387 -93428 272989 -12536 262009 -245417 196990 -92604 -74620 -168023 -14281 -161813 105570
18375 8158 -27641 -16016 -265952 -112644 164570 62512 -132840 -23043 6607 112941 -140789
$$ packed form
18455A04873R16P4553M2306a52532A14160O4825p4919i0653d2343A7794K68419
18444B86213a09712k88261a79092M8656D4067a84817D0628j2658L51808A87641
18433B2552M6545J94851I0823J2202K0067f154o273B32958a91830b549C38516
18421e0160E1017f0286q1700b0910r1505N1926A21946K2903e7982A1001c6953
18409A32205a92347A10345a22713a9634C2625a95361d3152A20491C6100M1512
18399G7612Q1041b17574M0605r4393B55634H9998d01981C1800b61137B74667B2306
18387i3428B72989a2536B62009b45417A96990i2604J7984r3403a4281j47532A05570
18375H158b7641J1625k49936a12644A64570F2512a32840b3043F607J06334a40789
$$ plain form
18363 57077 409279 182763 4469 -167821 -59587 354855 -151695 76228 66477 -79936 -9946
18351 -610 60543 -146421 -201625 268835 -127788 -56793 159980 85567 5311 -204778 -662 -102302
18339 -102302 -71200 -283905 -44519 -284725 -412340 -16594 16385 -260771 -136994 -209315
18329 -209315 -237413 -152619 -74778 149712 124329 35785 -23758 90284 -203579 116345 -100224
18317 -203834 375150 -82948 -164122 49246 -38651 -324549 68975 204647 -178701 -188688 -44794
18305 72166 260000 -114904 62719 -25954 64425 209929 -11786 -141235 -84282 -181007 -140078
18294 -140078 -186961 -98607 -20345 -2789 -213279 123951 -16321 -293836 335179 50940 -170297
18282 43726 -215009 -130263 55558 102124 -102294 -17618 84 -47327 372533 11208 118740
$$ packed form
18363E7077L52202A82763D469a67821e9587C54855a51695G6228r751g9936i946
18351f10F0543a46421n5204B68835a27788e6793A59980p4413E311b04778f62j01640
18339a02302L1102k12705d4519k40206j27615a6594A6385b60771J23777p2321
18329b09315k8098Q4794g4778A49712k5383C5785b3758I0284b03579A16345a00224
18317b03834C75150h2948q1174D9246c8651k85898F8975J35672a78701r987d4794
18305G2166J87834a14904F2719b5954F4425J45504a1786j29449N6953r6725M0929
18294a40078m6883Q8354b0345b789k10490A23951a6321k77515C35179E0940a70297
18282D3726b15009Q4746E5558M6566a02294a7618H4d7327C72533A1208J07532
$$ plain form
18271 118740 134452 -368963 -224297 38918 199508 -84717 -181636 -95278 62555 292075 175333
18260 175333 -284689 -23754 197635 -153300 187170 -307528 -228441 -15067 -72971 -41904
18250 -41904 -4867 -92479 -150627 277422 -73556 -37798 -486308 241214 86783 238254 -8961
18238 -145270 81462 161813 122162 -240432 -15774 48 -12611 294979 -2487 -302054 166399
18226 -101617 -90502 78951 -48226 -29698 22893 -314459 155028 451101 195293 -137958
18215 -134281 -10558 -110709 -426065 -110644 -29954 -82386 -200354 31632 19355 15478 -24672
18203 63296 -409562 177892 -184036 -20505 35286 -217831 50481 21096 75604 701 -111306
18191 159973 -299272 89522 356990 243582 -32230 -330752 -179521 39396 209249 -41653
$$ packed form
18271A18740J5712c68963J44666C8918J60590h4717r6919Q6358F2555K29520j16742
18260A75333b84689b3754A97635a53300A87170c07528P9087a5067n7904L1067
18250d1904d867q7612n8148B77422g3556L5758m48510B41214H6783J51471h961
18238a45270H1462Q0351l9651b40432a5774D8a2611B94979b487k99567A66399
18226a01617J1115G8951d8226J8528B2893c14459A55028K96073A95293a37958
18215a34281a0558j00151l15356a10644b9954n2432j17968C1632j2277l877b4672
18203F3296d09562A77892a84036b0505C5286b17831E0481B1096N4508G01a11306
18191A59973b99272H9522K67468j13408c2230k98522J51231C9396J69853d1653
$$ plain form
18180 92840 -54887 157609 -151634 20074 -52344 50392 43912 -36329 -193734 298343 -131204
18168 -221212 100586 -447269 72506 82191 33985 -119734 -51064 -50048 -174142 -169194 375806
18156 -16268 203344 -78278 -19706 40982 -180877 4902 -3256 24857 222066 95496 -157224
18144 -64463 -201061 46619 41211 219287 234723 327530 14505 -44800 -254846 37289 -25974
18132 41096 47485 -507133 -61527 -82316 221418 -18128 -181278 -83073 161193 129183 -171953
18120 -2314 208310 -201767 32810 63657 161478 -88551 -16457 -11247 111694 70882 389241
18109 389241 8792 7245 20623 30433 224213 -151550 -26411 -358862 -108840 -143891 -200021
18098 -200021 27495 -36915 244465 -274363 -129366 309263 -65740 -148467 -4050 -7025 -349545
$$ packed form
18180I2840e4887A57609a51634B0074e2344E0392o480c6329j57405B98343a31204
18168b21212A00586d47269G2506R685C3985a19734e1064J016j24094M948C75806
18156a6268B03344g8278a9706D0982a80877D902c256B4857J97209I5496a57224
18144f4463j36598D6619n408J78076J5436R2807A4505d4800k10046C7289b5974
18132D1096O389e07133f1527k0789B21418a8128j63150h3073A61193l2010a71953
18120b314B08310b01767C2810L0847R7821h8551a6457N210A11694m0812L18359
18109C89241H792j547J3378R810J93780a51550b6411l32451a08840l5051n6130
18098b00021B7495c6915B44465b74363a29366C09263f5740q2727d050k975l42520
$$ plain form
18087 -349545 -84230 -16051 -75467 -314802 -118867 -49547 58185 282342 107503 66485 -216057
18075 -400228 41894 -76672 -168743 359223 -294272 -195711 24676 -87688 52554 -275087 46242
18063 147620 -15876 79306 264847 -161651 -325662 38403 121173 -180060 20883 -36207 -55002
18052 -55002 -69852 -167529 -147781 -192919 148367 81373 4608 -30179 164864 113150 -86765
18040 -96927 -260616 110483 -349003 340331 6285 98133 -226066 92436 -299514 293777
18029 263196 152581 -423490 -26714 -224899 65686 74805 141205 29226 -60607 257755 -158208
18017 -370958 -87376 70419 102533 75856 -93360 -17629 113172 -204761 -118876 -111703 -114489
18006 -114489 122882 -61826 -121315 331894 103206 92783 211035 -25737 155677 143495
$$ packed form
18087c49545h4230a6051n9416k39335a18867d9547E8185K24157A07503m1018b16057
18075d00228D1894g6672r2071C59223b94272R8561B4676h7688E2554b75087D6242
18063A47620a5876G9306J85541a61651j64011C8403Q2770a80060B0883c6207j8795
18052e5002j4850r7677J9748m5138A48367o6994D608c0179A64864n1714h6765
18040i6927j63689A10483c49003C40331F285R1848b26066I2436b99514B93777
18029B63196j10615d23490b6714j98185F5686R119O6400B9226f0607B57755a58208
18017c70958h7376G0419L2114k6677i3360a7629A13172b04761Q5885P173k786
18006a14489A22882f1826n9489C31894A03206j0423J18252b5737A55677j2182
$$ plain form
17996 143495 18459 1026 252215 130732 -121634 -228651 -205547 -234271 112594 17079 -143797
17984 -76301 166302 -33926 184415 -60277 95047 109496 174282 -27195 222107 -28886 -15861
17973 -15861 -27848 -395388 -66320 -152523 -33317 -451905 367 62791 -95543 -61234 122094
17961 -22005 145508 -69923 47981 144434 -283676 -134252 102936 252012 -267011 127230
17950 -89693 405941 -259381 298419 40636 28207 -15644 328942 239108 -173972 393650
17939 -158139 277812 -222878 -143617 -48384 409113 -155435 -31032 307384 -129191 -4414
17928 99344 -92952 138268 -107459 252018 184724 -309074 17152 -375136 -249177 211281
17917 430940 -98780 48019 448786 222808 143877 -248876 267691 -48802 -185487 5437 -28523
$$ packed form
17996A43495A8459A026K51189j21483a21634j07017K3104k8724A12594A7079a43797
17984g6301A66302c3926A84415f0277I5047J4449O4786b7195B22107b8886J3025
17973a5861j1987l67540f6320q6203c3317m18588C67O2424i5543L4309A22094
17961b2005A45508f9923D7981R6453b83676a34252A02936J49076b67011A27230
17950h9693D05941b59381B98419D0636j2429a5644C28942q9834a73972C93650
17939a58139B77812b22878P9261d8384D09113a55435c1032C07384a29191d414
17928I9344i2952A38268a07459B52018o7294c09074A7152c75136J25959B11281
17917D30940i8780D8019M00767B22808p8931b48876B67691d8802j36685E437b8523
$$ plain form
17905 124414 -281748 -233801 -32555 -168004 -64631 -32735 -4562 -394400 -109240 68937 -154008
17893 272144 28153 371212 128066 30572 78867 86694 -76167 285626 -210714 353109 194018
17882 194018 -36960 -202122 5555 120926 1403 -78265 -86861 205145 -237638 220932 197337
17871 197337 -28125 -180597 90961 112247 42516 -50820 -134080 -127168 -178501 165033 176441
17860 176441 34606 -84456 92275 193924 126387 83489 108488 589567 54489 -328024 276586
17848 -179915 -172352 -230962 -111604 -30630 -70042 -280648 67963 -83426 -113357 205332 -73949
17836 -1685 -85202 140853 194098 -29280 61883 -9344 -28772 22349 -90042 -18844 -167530 147953
17823 245330 -185304 -153632 -207292 -95636 72716 -431688 -128172 -179719 -68223 42056 201664
$$ packed form
17905A24414b81748M7947c2555j35449f4631L1896d562l89838a09240F8937a54008
17893B72144B8153L43059A28066C0572M8295P827g6167B85626b10714C53109j59091
17882A94018c6960j65162E555J15371A403g8265q596B05145b37638B20932k3595
17871A97337b8125j52472I0961K1286D2516e0820q3260O912n1333A65033J1408
17860A76441C4606h4456I2275J01649o7537m2898K4999M81079E4489c28024B76586
17848a79915P563n8610a11604c0630l9412k10606F7963h3426k9931B05332g3949
17836a685q3517A40853N3245b9280F1883i344j9428B2349i0042a8844j48686A47953
17823B45330a85304L1672n3660i5636G2716d31688a28172n1547f8223D2056J59608
$$ plain form
17812 201664 -344817 6439 141345 -225181 -312681 -285875 158475 69351 81743 309335 -155098
17800 33583 -180417 -161754 76621 83960 -46372 217793 96379 97047 -9198 -256738 422842 19861
17787 -222964 198392 129276 -17079 173344 49604 239276 156169 -199163 83837 -120709
17776 -90909 -89984 205739 253278 214429 61227 2069 -151637 -236606 166502 -69642 -316672
17765 -316672 79566 -214038 -389657 -140947 347424 -36991 37150 124166 96840 136971 -95294
17753 244238 385537 90803 12652 140147 229410 245619 -421267 -126490 -23326 28074 347533
17742 347533 -91582 245123 -87785 84898 -114821 75920 255869 -40135 -191595 -77891 -274605
17731 -274605 31079 86053 67646 -37845 118673 17122 -108931 -2342 148937 -284894 173940
$$ packed form
17812B01664c44817F439J34906b25181q7500K6806A58475F9351J2392K27592a55098
17800C3583a80417J8663G6621P339d6372B17793I6379O68i198k47540D22842A9861
17787b22964A98392o9116a7079A73344D9604J89672q3107a99163H3837a20709
17776i0909R25B05739M7539l8849F1227B069a51637q4969A66502f9642k47030
17765c16672G9566b14038j75619a40947C47424c6991C7150Q7016k7326M0131i5294
17753B44238J41299I0803A2652J27495Q9263J6209d21267a26490b3326B8074L19459
17742C47533i1582B45123h7785H4898a14821G5920J79949d0135j51460g7891j96714
17731b74605C1079N4974j8407c7845A18673A7122a08931b342A48937b84894A73940
$$ plain form
17719 -57189 81844 -15921 197038 -246578 227623 -103079 292121 246494 74775 49429 248652
17708 248652 -162806 42606 155563 -87308 127934 -189549 434706 -32093 1686 197506
17698 197506 140365 275356 37479 252904 -39839 126904 -156218 -62979 94249 163333 -164286
17686 113167 -162470 -89928 608014 234346 -259909 43018 -250840 -254891 -198462 -39336 -99802
17675 -99802 111407 -284099 95395 89978 -76260 -14997 41373 -93859 -181659 86607 -22061
17663 61457 229483 253813 181561 96357 -82384 -698 166034 -52270 21056 90041 -233955
17651 71658 177792 225874 180498 -214502 -216403 135623 -96695 19188 81714 -25971 -187147
17640 -187147 -53269 161202 290948 -177463 248588 263947 179902 63857 2578 150440 -126350
$$ packed form
17719e7189H1844a5921A97038b46578B27623a03079B92121m5627G4775k5346J99223
17708B48652a62806D2606J12957h7308A27934a89549D34706c2093A686J95820
17698A97506n7141J34991C7479K15425c9839A26904a56218f2979I4249O9084a64286
17686A13167a62470P2542F08014B34346b59909D3018b50840m051N6429c9336o0466
17675i9802A11407b84099I5395n417g6260a4997D1373i3859q7800H6607b2061
17663F1457J68026K4330p2252q5204h2384f98A66034e2270B1056O8985b33955
17651G1658J06134M8082m5376b14502j901A35623i6695A9188O2526b5971j61176
17640a87147e3269A61202J29746a77463B48588J5359q4045F3857B578J47862a26350
$$ plain form
17628 250934 15602 103948 -50968 -1555 -51936 1404 -372346 136205 17705 -136211 106105
17616 148235 296861 280531 130923 -14267 1640 54632 -104001 -58889 -107471 116847 26457
17604 -28436 -92059 169999 161875 54858 -8636 4294 214772 -18372 104263 -22699 106692
17592 -139268 23389 -68913 -106705 -24947 78189 -117645 132270 358109 171737 319751
17582 319751 349397 97094 161391 250580 -354675 259520 101911 -126140 118398 265109
17572 265109 225448 82268 16713 69963 -135148 188144 130147 59384 209093 -135003 15548
17560 180691 90576 143682 199448 229416 84850 23892 53843 46304 -68496 24816 6780 -158608
17547 213794 234341 239070 200162 -80495 100638 -97154 -58481 247540 -22178 258930 240215
$$ packed form
17628B50934A5602Q8346e0968a555n0381A404c72346A36205A7705a36211A06105
17616A48235J48626j6330A30923a4267A640N2992a04001M5112m8582A16847B6457
17604b8436o3623A69999q124E4858h636D294K10478a8372A04263b2699A06692
17592a39268B3389f8913l7792b4947G8189a17645A32270K25839A71737J48014
17582C19751K9646I7094O4297Q9189c54675B59520A01911a26140A18398J46711
17572B65109l9661H2268A6713N3250a35148A88144n7997E9384J49709a35003A5548
17560A80691r0115N3106N5766K9968H4850B3892K9951p539f8496B4816F780a58608
17547B13794K0547M729l8908h0495A00638i7154L8673B47540b2178B58930j8715
$$ plain form
17536 240215 -149761 -210990 61778 76094 -132295 -27293 116412 68864 -105035 222282
17525 52356 -53057 278393 -50878 110830 505783 50235 -2072 151234 404193 49289 23775
17513 144252 305168 517403 180659 131939 41696 264536 213958 278829 440648 239721
17503 239721 290978 305016 137672 204885 230337 -75917 -32986 -213130 123711 291289 213998
17492 213998 197754 -29542 95227 220796 245062 166639 229713 172452 -95317 52481 161879
17481 161879 181406 -79091 430865 -82917 -39357 259158 95787 142161 177833 195429 354622
17470 354622 100153 438367 382514 -90089 316620 -227606 131038 -130700 165386 125317
17460 125317 144964 151504 275289 147735 106672 175271 182728 227547 -2082 -60216 193132
$$ packed form
17536B40215a49761o1229F1778J4316a32295b7293A16412m7548a05035B22282
17525E2356e3057B78393e0878A10830L94953E0235b072A51234K52959D9289B3775
17513A44252J60916K12235A80659m8720D1696K22840n0578O4871J61819k00927
17503B39721N1257J4038A37672O7213K5452g5917c2986j80144A23711J67578p7291
17492B13998j6244b9542I5227J25569K4266p8423O3074n7261i5317E2481J09398
17481A61879J9527g9091D30865h2917c9357B59158I5787M6374L5672J7596J59193
17470C54622A00153L38214n5853i0089C16620b27606A31038a30700A65386m0069
17460A25317J9647O540J23785j27554m1063O8599P457M4819b082n8134A93132
$$ plain form
17448 348605 329384 97226 91115 285973 187767 392295 361065 105631 307794 487509 42490
17436 663290 -80375 218849 115893 144372 63388 127729 151780 224385 270398 368384 347194
17425 347194 310208 516456 522415 257269 -57402 134948 286007 159071 171860 100218 118605
17414 118605 279121 165225 324936 325841 -154536 132698 276419 345238 106714 -28314
17403 -7253 172878 155238 353874 -8159 485729 199129 -14392 187495 16924 352826 119511
17391 230875 112952 129104 290188 108621 328999 157103 106072 106479 20035 59452 135864
17380 135864 58055 340678 181158 -56068 186761 142082 37910 181572 -82609 292866
17369 246281 -9425 58188 238883 9096 -28596 -74620 99431 -117721 161862 -188789 117424
$$ packed form
17448C48605j9221I7226o111J94858r8206K04528l1230A05631K02163J79715D2490
17436F63290h0375B18849j02956K8479F3388O4341K4051P2605M6013R7986k1190
17425C47194l6986K06248N959B57269e7402A34948J51059j26936J2789p1642J8387
17414A18605J60516j13896J59711R05a54536A32698J43721O8819A06714b8314
17403g253A72878j7640J98636h159D85729A99129a4392A87495A6924L35902A19511
17391B30875A12952J6152J61084A08621K20378A57103n1031M07B0035L9417P6412
17380A35864E8055K82623j59520e6068A86761m4679C7910J43662h2609B92866
17369B46281i425E8188J80695I096b8596m6024I9431a17721A61862a88789A17424
$$ plain form
17357 -183973 -9481 313916 141584 130537 209004 46071 300535 -14741 108764 -160548 190821
17345 -61631 157238 316104 23823 -218163 -167440 28931 -149697 269509 93981 6992 358924
17334 358924 109748 162449 58562 366340 107473 110508 195962 51829 342429 372315 21141
17322 216704 476681 73869 -129685 404532 302996 66890 206213 44234 54735 -163487
17311 128049 70664 313372 -87944 489223 350490 -77707 178636 -7124 295022 329983 81863
17299 219687 416460 128943 402298 20883 274661 115587 229020 129821 341834 178227
17289 178227 -15772 42892 222010 160042 -4452 192978 166121 136123 55360 247907 79617
17277 334191 212519 299955 23524 210404 102546 -400668 340846 235291 -128992 -38822
$$ packed form
17357a83973i481C13916A41584j1047P8467D6071K54464a4741A08764a60548A90821
17345f1631A57238J58866B3823b18163N0723B8931a49697B69509I3981F992L51932
17334C58924A09748N2701E8562L07778A07473L035Q5454E1829K90600K9886B1141
17322B16704K59977G3869a29685D04532j01536F6890J39323D4234J0501a63487
17311A28049n7385K42708h7944D89223j38733g7707A78636g124B95022L4961H1863
17299B19687J96773A28943K73355B0883K53778A15587J13433r9199K12013j63607
17289A78227a5772D2892J79118o1968d452A92978k6857k9998E5360J92547G9617
17277C34191j21672Q7436B3524J86880A02546d00668C40846j05555a28992c8822
$$ plain form
17266 -111959 160508 190807 13111 -38027 183459 -109698 87322 79521 167382 246098 108600
17254 219158 197878 159752 72560 23656 200417 -161905 200954 134113 -122279 270130
17243 322436 99086 97600 -228142 321329 404281 -9997 240139 498345 488858 -44014 327070
17231 167394 112281 160829 68178 223735 224255 255328 -14013 153400 393998 134977 -89999
17219 323425 99106 272488 280710 321106 26921 4292 -25 55684 18380 321239 258174 276479
17207 276479 125776 174157 137560 194908 414826 285752 456956 135450 348806 -162112
17196 240216 507827 418610 -25607 258636 466290 -2075 86819 41580 213342 48966 120267
17185 120267 178429 -58661 405346 465416 450773 240756 336879 358673 -206486 346970 106738
$$ packed form
17266a11959A60508L0299A3111c8027A83459a09698H7322p801Q7861P8716A08600
17254B19158k1280l8126G2560B3656J76761a61905B00954o6841a22279B70130
17243C22436I9086j486b28142C21329Q2952i997B40139K58206r487d4014C27070
17231A67394n5113M8548F8178J55557N20L1073a4013A53400K40598A34977h9999
17219C23425I9106J73382Q222M0396B6921D292b5E5684A8380L02859o3065J8305
17207B76479A25776M8381l6597N7348K19918j29074J71204A35450K13356a62112
17196B40216K67611q9217b5607B58636K07654b075H6819D1580J71762D8966P1301
17185A20267N8162e8661D05346O0070j4643k10017R6123K1794b06486C46970A06738
$$ plain form
17173 391388 66684 187928 139856 228926 549933 149692 30767 317790 201768 392364
17163 392364 283419 399298 182079 58588 594482 200901 75376 223299 -30332 588637
17152 495076 516027 347138 704210 317527 297662 96187 105326 292571 174300 181203 85057
17140 100636 510956 557058 450500 254215 461608 247394 446501 305071 368413 548555
17130 548555 501358 321972 -56553 399554 490775 330507 282099 449697 218723 175924
17120 175924 243371 283821 192369 537743 739165 155734 382258 330205 421651 475630 448952
17109 448952 252962 259837 301936 122675 471055 164464 379744 638759 271672 244210
17099 244210 470043 739147 547123 438881 216790 319659 353095 304767 383626 504864
$$ packed form
17173C91388F6684J21244m8072Q9070L21007A49692C0767K87023j16022J90596
17163C92364j08945J15879A82079E8588N35894B00901G5376J47923c0332E88637
17152D95076K0951j68889L57072C17527j9865I6187R139J87245j18271O903H5057
17140A00636M10320M6102j06558j96285K07393k14214J99107j41430O3342J80142
17130E48555m7197j79386e6553C99554R1221j60268m8408J67598B18723m2799
17120A75924O7447M0450r1452L45374K01422A55734K26524n2053R1446N3979k6678
17109D48952j95990O875M2099A22675L48380A64464K15280K59015B71672k7462
17099B44210K25833K69104j92024j08242B16790J02869L3436m8328P8859J21238
$$ plain form
17089 504864 644023 377911 262774 108846 93149 394363 16495 565243 344422 190872
17079 190872 434462 422623 327789 166749 632407 264414 249707 301429 249580 336747 763883
17068 763883 281283 329485 518236 198879 431459 465328 412675 543014 908501 496879
17058 496879 382470 339576 342891 427860 258242 715458 712423 274484 735356 634964 478594
17047 478594 494147 421363 234100 234346 575396 337440 716291 784300 439290 457025 546945
17036 546945 453024 326660 534968 647095 927386 567739 379347 614834 838243 559319
17026 559319 634118 556841 564119 709198 792521 471149 692192 916152 544901 501788 524213
17015 524213 722904 518053 586879 575991 575554 262463 490707 1219916 814694 606842
$$ packed form
17089E04864J39159k66112j15137A08846j5697L01214A6495N48748k20821j53550
17079A90872K43590j1839r4834j61040M65658B64414j4707N1722n1849Q7167M27136
17068G63883B81283M8202J88751A98879K32580L3869n2653J30339L65487m11622
17058D96879j14409m2894L315Q4969j69618M57216l035B74484M60872j00392j56370
17047D78594J5553p2784j87263K46L41050k37956L78851O8009l45010J7735Q9920
17036E46945r3921j26364K08308J12127K80291l59647j88392K35487K23409k78924
17026E59319P4799p7277P278J45079Q3323l21372K21043K23960l71251m3113K2425
17015E24213J98691k04851O8826j0888m37B62463K28244P29209m05222k07852
$$ plain form
17005 606842 710930 865512 466455 686483 790165 760431 531031 800476 964811 841742
16995 841742 999986 865637 775264 634627 617530 456243 884791 883484 1039274 1193724
16985 1193724 539693 678223 693912 379538 643517 760664 932490 955852 1045611 601570
16975 601570 1027166 821068 869033 887774 788404 810543 635105 867835 1002096 926611
16965 926611 837668 705111 866571 799568 981106 1054894 938821 643426 1087584 817695
16955 817695 912775 1121379 976208 1150526 1057708 885585 1052417 1019169 1117414 811137
16945 811137 1432750 1128521 1086740 931183 896878 1201454 1189103 1415456 966263 1182189
16935 1182189 988235 1104969 1074530 1567581 1146418 1259829 1093469 1198494 1024048 1518031
$$ packed form
17005F06842J04088J54582l99057K20028J03682k9734k29400K69445J64335j23069
16995H41742J58244j34349r0373j40637j7097j61287M28548j307J55790J54450
16985A193724E39693J38530J5689l14374K63979J17147J71826K3362Q9759m44041
16975F01570M25596k06098M7965J8741r9370K2139j75438K32730J34261p5485
16965I26611q8943j32557J61460o7003J81538P3788j16073k95395M44158k69889
16955H17695R5080K08604j45171J74318r2818j72123J66832l3248R8245l06277
16945H11137O21613l04229m1781j55557l4305L04576j2351K26353m49193K15926
16935A182189j93954J16734l0439M93051m21163J13411j66360J05025j74446M93983
$$ plain form
16925 1518031 1692673 1101740 1251085 1389973 1243770 1408695 1619133 1761822 1437272
16916 1437272 1488039 1295676 1568079 1550246 1589981 1323262 1396086 1233415 1638008 2094729
16906 2094729 1599510 1684723 1755963 1660039 1739607 1829888 1647779 1886386 1740783 2031583
16896 2031583 1623204 1726648 1796637 1386725 2001703 2007363 1801559 2226136 1976285 1888134
16886 1888134 2450936 1777977 2626699 2387769 2478087 2601597 2472055 2121324 2261485 2227956
16876 2227956 2333575 2745081 2576607 2589787 2636392 2710511 2630387 2706195 2358037 3118185
16866 3118185 2874136 2587932 3093906 3189253 2954763 3095115 3017388 3103387 3128565 3302623
16856 3302623 3522639 3304053 3216235 3483037 3728098 3553248 3525912 3541355 3766037 3645666
$$ packed form
16925A518031J74642n90933J49345J38888j46203J64925K10438J42689l24550
16916A437272N0767j92363K72403j7833L9735k66719P2824j62671M04593M56721
16906B094729m95219Q5213P1240r5924P9568R0281j82109K38607j45603K90800
16896B031583m08379J03444O9989m09912O14978N660k05804M24577k49851q8151
16886A888134N62802o72959Q48722k38930R0318J23510j29542l50731J40161l3529
16876B227956J05619M11506j68474J3180M6605P4119q0124P5808l48158P60148
16866C118185k44049k86204N05974R5347k34490J40352p7727Q5999K5178J74058
16856C302623K20016k18586q7818K66802K45061j74850k7336J5443K24682j20371
$$ plain form
16846 3645666 3930447 3904617 3938330 4228480 4209277 4495397 4222287 4273667 4274546 4196247 4565943
16835 4565943 4327893 4455060 4716359 4978916 4989699 4650089 4878771 5447190 5268103 5593738
16825 5593738 5665280 5718200 5695024 6082870 5823332 6198971 6439712 6598215 6659212 6449836
16815 6449836 6836232 7063352 7296287 7281310 7828091 7492883 7903468 7995511 8140207 8441453
16805 8441453 9018002 8752845 9063295 9577725 9441861 9716264 9838095 10176637 10646722
16796 10646722 10410578 11112340 11569438 11626741 11899973 12532677 12545416 13368263 13447362 13861825
16786 13861825 13987345 14495861 15077893 15431150 16010093 16173953 17488718 17833365 18326967
16777 18326967 18842969 19366128 20311530 20718502 21621442 22340427 22845599 24027164 24750211
$$ packed form
16846C645666K84781k5830L3713K90150j9203K86120k73110N1380Q79p8299L69696
16835D565943k38050J27167K61299K62557J0783l39610K28682N68419j79087L25635
16825E593738P1542N2920k3176L87846k59538L75639K40741J58503O0997k09376
16815F449836L86396K27120K32935j4977N46781l35208M10585R2043J44696L01246
16805H441453N76549k65157L10450N14430j35864K74403J21831L38542M70085
16796A0646722k36144P01762M57098N7303K73232O32704J2739Q22847P9099M14463
16786A3861825J25520N08516N82032L53257N78943J63860J314765L44647M93602
16777A8326967N16002N23159R45402M06972R02940P18985N05172J181565P23047
$$ plain form
16768 24750211 25527687 26666349 27644745 28285545 30046779 30710900 31967078 33669531 34853917
16759 34853917 36175563 37664176 39615834 41142507 42815401 44916052 46844611 48700520
16751 48700520 50710273 53043792 55626954 57993345 60773624 63687154 66308965 69259778
16743 69259778 72593863 75972911 79222181 82680739 86512898 89950053 93982031 97607834
16735 97607834 101409047 105334543 109129048 112481502 115535979 118840817 121855251 124086228
16727 124086228 126576547 128344419 129832259 129833365 130508395 130638864 129918010 128773281 127448467
16718 127448467 125087145 123007187 119885549 117248286 113913926 110328435 107078752 102903522
16710 102903522 99513986 95852556 91843190 88214193 84760802 81387936 77530556 74667695
$$ packed form
16768B4750211P77476J138662R78396O40800J761234O64121J256178J702453J184386
16759C4853917J321646J488613J951658J526673J672894K100651J928559J855909
16751D8700520K009753K333519K583162K366391K780279K913530K621811K950813
16743F9259778L334085L379048L249270L458558L832159L437155M031978L625803
16735I7607834L801213L925496L794505L352454L054477L304838L014434K230977
16727A24086228K490319J767872J487840J106O75030J30469p20854j144729j324814
16718A27448467k361322k079958l121638k637263l334360l585491l249683m175230
16710A02903522l389536l661430m009366l628997l453391l372866l857380k862861
$$ plain form
16702 74667695 71350377 68088276 65361381 63056217 59687795 57345166 54971784 52563737
16694 52563737 50267001 48281365 46230192 44382517 42595048 41180517 39455344 37806806
16686 37806806 36302132 35012522 33699619 32187928 31119532 30105266 28856643 27868632
16678 27868632 26727681 26058311 25138880 24273293 23500393 22814216 21666654 21147542 20883594
16669 20883594 19795220 19400523 18797490 18123613 17845148 17208792 16637832 16261876 15544059
16660 15544059 15089817 15054584 14317092 13950309 13462554 13503582 13023984 12722528 12355667 12083850
16650 12083850 11714277 11543362 11342892 10803152 10770416 10107915 10243402 9880772 9738637
16641 9738637 9346713 9281195 9478026 8667340 8764836 8425409 8299717 8228369 7884435 7506101
$$ packed form
16702G4667695l317318l262101k726895k305164l368422k342629k373382k408047
16694E2563737k296736j985636k051173j847675j787469j414531j725173j648538
16686C7806806j504674j289610j312903j511691j068396j014266j248623r88011
16678B7868632j140951o69370r19431q65587p72900o86177j147562n19112k63948
16669B0883594j088374l94697o03033o73877k78465o36356n70960l75956p17817
16660A5544059m54242l5233p37492l66783m87755M1028m79598l01456l66861k71817
16650A2083850l69573j70915k00470n39740l2736o62501J35487l62630j42135
16641I738637l91924o5518J96831q10686R7496l39427j25692p1348l43934l78334
$$ plain form
16631 7506101 7680020 7588901 7256362 7259761 7249304 7072778 6973309 6653516 6316559 6328588
16621 6328588 6437277 6299793 6147045 5958314 5715051 5769831 5651976 5421216 5588388 5310976
16611 5310976 5064449 4983082 5275584 4984585 5136189 4900072 4860734 4771243 4540914 4751252
16601 4751252 4091693 4563854 4069568 4133771 4132926 4254827 3917135 4107400 3570671 3703878
16591 3703878 3988265 3660858 3829971 3694672 3415327 3766831 3319686 3578464 3320470
16582 3320470 3633980 3078209 3403991 3538627 3242960 2804754 3210591 3002531 3596501
16573 3596501 3043340 3025224 3222274 2869434 2750253 2678210 3168948 2554128 2535900 2645311
16563 2645311 2809400 2381818 2669365 2451805 2590388 2366924 2381149 2300543 2238725 2333645
$$ packed form
16631G506101J73919r1119l32539L399j0457j76526r9469l19793l36957J2029
16621F328588J08689j37484j52748j88731k43263N4780j17855k30760J67172k77412
16611E310976k46527q1367K92502k90999J51604k36117l9338q9491k30329K10338
16601D751252o59559M72161m94286O4203q45J21901l37692J90265n36729J33207
16591C703878K84387l27407J69113j35299k79345L51504m47145K58778k57994
16582C320470L13510n55771L25782J34636k95667m38206M05837k08060N93970
16573C596501n53161j8116J97050l52840j19181p2043M90738o14820j8228J09411
16563B645311J64089m27582K87547k17560J38583k23464J4225q0606o1818R4920
$$ plain form
16553 2333645 2261322 2258533 2384755 2203019 2248039 2185596 1790035 2403365 2472657 1959835
16543 1959835 2273851 1954374 2035430 2287260 2120638 2009861 1798280 2235039 1925526 1715936
16533 1715936 1927104 1864946 2025715 1820068 1809755 2083565 1738656 2001230 1872366 1863526
16523 1863526 1883689 1613794 1690018 1763674 1760665 1600923 1763616 1557389 1578327 1850911
16513 1850911 1896950 1264455 1449323 1451439 1652848 1487850 1598047 1399047 1510362 1645584
16503 1645584 1709639 1856877 1478730 1327643 1320359 1443462 1288599 1580441 1324417 1382792
16493 1382792 1219263 1294791 1493920 1423906 1320649 1372520 1621101 1443855 1548771 1380119
16483 1380119 1506474 1542508 1219609 1388260 1141718 1362311 1061817 1159514 1524747 1001176
$$ packed form
16553B333645p2323k789J26222j81736M5020o2443l95561O13330O9292n12822
16543A959835L14016l19477Q1056K51830j66622j10777k11581M36759l09513k09590
16533A715936K11168o2158J60769k05647j0313K73810l44909K62574j28864q840
16523A863526K0163k69895P6224P3656l009j59742J62693k06227K0938K72584
16513A850911M6039o32495J84868K116K01409j64998J10197j99000J11315J35222
16503A645584O4055J47238l78147j51087p284J23103j54863K91842k56024N8375
16493A382792j63529P5528J99129p0014j03257N1871K48581j77246J04916j68652
16483A380119J26355L6034l22899J68651k46542K20593l00494R7697L65233n23571
$$ plain form
16473 1001176 1385385 1054006 1269990 1254245 1405869 1281263 1309446 1097726 908928 1257378
16463 1257378 1037670 1287341 1143747 871713 1017722 1009299 1235924 1413830 1028066 1286000
16453 1286000 863730 1051407 1428130 1020779 1257614 997511 813424 1294954 674864
16444 674864 1181685 1026890 1146556 1011335 1037060 1223477 878775 711960 991497 1079709
16434 1079709 1120772 780431 757527 1108582 1034988 987157 893622 960877 1004369 877203 780517
16423 780517 1091306 931525 862708 1134512 921262 1100640 835688 791489 863656 688149
16413 688149 1167662 843657 949713 988117 1137490 764626 1025454 816058 1006094 529349
16403 529349 745813 955122 826409 562204 980390 812588 759695 732220 738695 833614
$$ packed form
16473A001176L84209l31379K15984j5745J51624j24606K8183k11720j88798L48450
16463A257378k19708K49671j43594k72034J46009q423K26625J77906l85764K57934
16453A286000m22270J87677L76723m07351K36835k60103j84087M81530o20090
16444F74864N06821j54795J19666j35221K5725J86417l44702j66815K79537Q8212
16434A079709M1063l40341k2904L51055p3594m7831r3535O7255M3492j27166r6686
16423G80517L10789j59781o8817K71804k13250J79378k64952m4199P2167j75507
16413F88149M79513l24005J06056L8404J49373l72864K60828k09396J90036m76745
16403E29349K16464K09309j28713k64205M18186j67802n2893k7475O475R4919
$$ plain form
16393 833614 1011481 602876 478336 949864 791023 854591 892048 783825 1001157 810260
16383 810260 672094 1186872 687671 660621 893690 856287 843894 911170 821616 805046 767360
16372 767360 794974 640044 965856 783680 691047 840708 1077699 921502 874011 449118
16362 449118 901146 923052 604562 382493 936410 799617 747086 722527 533699 1034260
16352 1034260 867489 675449 730658 763149 646974 745613 872228 510090 955502 584164
16342 584164 942328 587332 792571 424232 933842 581240 607449 669574 914562 647147
16332 647147 563606 520052 475281 355143 477400 678764 591867 694404 694393 632979 584431
16321 584431 597779 924332 721686 664006 812615 473504 555225 870030 607998 592229
$$ packed form
16393H33614J77867m08605j24540M71528j58841O3568L7457j08223K17332j90897
16383H10260j38166N14778m99201k7050K33069l7403j2393O7276q9554j6570l7686
16372G67360K7614j54930L25812j82176r2633J49661K36991j56197m7491m24893
16362D49118M52028K1906l18490k22069N53917j36793n2531k4559j88828N00561
16352A034260j66771j92040N5209L2491j16175R8639J26615l62138M45412l71338
16342E84164L58164l54996K05239l68339N09610l52602K6209O2125K44988k67415
16332F47147q3541m3554m4771j20138J22257K01364q6897J02537j1o1414m8548
16321E84431J3348L26553k02646n7680J48609l39111Q1721L14805k62032j5769
$$ plain form
16311 592229 653089 559458 583100 686989 835567 444535 885642 520443 612060 481852
16301 481852 325740 494099 484415 741936 549470 882461 588756 546852 713978 757530
16291 757530 512831 611417 464431 803609 419834 367200 723114 542349 253862 734400
16281 734400 881220 631940 605031 552602 391802 585047 446883 687858 649707 783811
16271 783811 750577 527749 202075 216756 587958 593036 504175 741963 444868 505187 777467
16260 777467 383137 449450 305017 557353 391032 456059 231904 697339 733054 812278
16250 812278 402034 334073 581008 650468 781125 148071 674286 613849 487406 281720
16240 281720 394019 611669 476949 299432 97603 388734 429484 455792 329532 243953
$$ packed form
16311E92229O0860r3631K3642J03889J48578l91032M41107l65199R1617j30208
16301D81852j56112J68359r684K57521j92466L32991k93705m1904J67126M3552
16291G57530k44699R8586j46986L39178l83775n2634L55914j80765B53862M80538
16281G34400J46820k49280k6909n2429j60800J93245j38164K40975l8151J34104
16271G83811l3234k22828B02075J4681L71202N078q8861K37788k97095O0319K72280
16260G77467C83137O6313j44433K52336j66321O5027k24155M65435L5715P9224
16250H12278D02034o7961K46935O9460J30657A48071N26215o0437j26443k05686
16240B81720J12299K17650j34720j77517I7603K91131M0750K6308j26260q5579
$$ plain form
16230 243953 592550 360147 265801 429703 481264 702062 595186 520390 319227 113696
16219 350161 319781 641789 259166 616431 429337 462660 239787 484910 466333 552442
16209 552442 89190 249953 345546 403959 423841 359817 90379 284825 460987 465586 -26374
16197 582432 219534 179620 163883 181231 529624 -63110 537851 189828 403268 378977
16187 378977 531984 307239 446625 19506 270210 345125 264187 462729 183344 247556
16177 247556 255025 522621 297961 347509 55291 580171 476243 179321 539273 127157
16166 373776 417397 407787 487817 178579 384767 181301 240852 244189 580818 503490 386801
16155 386801 299599 308329 172229 119804 140441 477031 265564 340570 93662 163727 352699
$$ packed form
16230B43953L48597k32403r4346J63902N1561K20798j06876p4796k01163A13696
16219C50161l0380L22008B59166L57265j87094L3323k22873K45123j8577Q6109
16209E52442H9190J60763R5593N8413J9882o4024I0379J94446J76162M599b6374
16197E82432B19534l9914j5737J7348L48393f3110E37851A89828K13440k4291
16187C78977J53007k24745J39386A9506K50704P4915q0938J98542A83344O4212
16177B47556P469K67596k24660M9548E5291N24880j03928A79321L59952A27157
16166C73776M3621r610Q0030A78579K06188A81301N9551L337L36629p7328j16689
16155C86801q7202Q730j36100n2425K0637L36590k11467P5006I3662P0065J88972
$$ plain form
16144 352699 -29731 232948 309260 68795 410001 488973 220865 -57826 275555 -40871 143360
16132 268025 176896 369730 106131 63215 256295 291249 339711 -25380 428899 371159 199419
16121 199419 189353 154034 191329 56479 -6639 -146295 50661 331262 218078 101690 119271
16110 119271 54714 335686 192214 95650 190743 -8485 34148 257501 250189 279778 50243
16098 197121 95687 141508 156336 152141 459655 -349652 151767 254476 -187956 524218
16087 228199 30656 -58322 48045 118649 82842 -29168 296171 -74608 459831 146051 364926
16076 364926 12131 309728 110165 172745 58947 61964 -124663 283933 29408 58589 -143231
16064 339157 83775 31278 -38914 -75349 -18498 -147260 71492 120822 113406 238495 -195217
$$ packed form
16144C52699b9731B32948P6312F8795L41206P8972B20865e7826B75555d0871A43360
16132B68025r1129J92834A06131m2916J93080L4954M8462b5380D28899n7740j71740
16121A99419j0066l5319L7295E6479f639j39656E0661K80601j13184A01690J7581
16110A19271E4714K80972j43472I5650R5093h485C4148K23353p312K9589E0243
16098A97121I5687M5821J4828m195L07514c49652A51767J02709a87956E24218
16087B28199C0656e8322D8045P0604l5807b9168B96171g4608D59831A46051K18875
16076C64926A2131K97597A10165O2580E8947L017a24663B83933B9408K9181a43231
16064C39157H3775C1278c8914l6435a8498j28762G1492M9330p416J25089a95217
$$ plain form
16052 311698 40220 212715 34875 -255802 476740 84907 49462 -44102 154062 -125953
16041 -10927 73752 138734 194854 111736 87360 278994 448299 181546 179165 -331098 85713
16029 -90113 -108762 272692 153914 -27441 280827 61773 308454 187116 287210 108643
16018 175570 -46402 79342 307918 -40254 -146538 174661 -68618 -172849 37954 133509 104870
16007 104870 186217 78744 -21279 -149492 -87795 87611 70562 274574 -65685 93290 -133060
15995 106059 14057 -18339 -104507 259786 270822 -139517 168520 494041 236430 -6472 354454
15983 221698 302172 236374 340547 429289 419742 145354 -72041 403935 181220 98960 231542
15972 231542 242157 -177705 -13896 19784 207382 -4235 55208 -318979 267398 12612 -212347
$$ packed form
16052C11698D0220J72495C4875b55802D76740H4907l5445d4102A54062a25953
16041a0927G3752O4982N6120q3118k4376J91634J69305A81546k381c31098H5713
16029i0113j8649B72692j18778b7441B80827F1773K46681j21338J00094A08643
16018A75570d6402G9342K28576d0254j06284A74661f8618j04231C7954R5555k8639
16007A04870Q1347G8744b1279j28213O1697H7611j7049K04012f5685I3290a33060
15995A06059A4057a8339q6168B59786J1036a39517A68520L25521B36430f472C54454
15983B21698Q0474o5798J04173Q8742r547A45354g2041D03935A81220q2260J32582
15972B31542J0615a77705a3896A9784J87598d235E5208c18979B67398A2612b12347
$$ plain form
15960 -401867 156411 51106 -188876 11856 280276 -18716 138149 186397 185988 -2499 145164
15948 -337860 -59772 -237757 -661668 -246335 -104949 339466 -154030 -138082 -199214 -83977
15937 102729 139246 21132 -12062 64027 -5356 146453 223970 -90931 -141049 188507 146332
15926 146332 -28215 54713 -247754 91577 67065 82796 -23219 -10254 114872 -94219 217758
15914 27468 -3084 109623 138087 -11257 -226808 -161818 39810 -86627 75311 -154209 29797
15902 70834 -196122 -196377 31484 -43422 -332017 -271950 221352 -128336 146438 165994 -43150
15890 9953 94396 159923 295756 63352 -72767 87874 -337441 -27118 138264 224455 -183988
15878 -15242 333098 340430 42184 92177 -119040 142443 -117240 -216864 -147115 122335 152583
$$ packed form
15960d01867A56411E1106a88876A1856K68420a8716A38149M8248m09b499A45164
15948c37860e9772j77985m23911b46335a04949C39466a54030J5948o1132h3977
15937A02729L6517B1132a2062F4027e356A46453P7517i0931n0118A88507m2175
15926A46332b8215E4713b47754I1577k4512J5731b3219a0254A14872i4219B17758
15914B7468c084A09623K8464a1257k15551O4990C9810h6627G5311a54209B9797
15902G0834a96122k55C1484d3422k88595O0067B21352a28336A46438J9556d3150
15890I953Q4443O5527J35833F3352g2767H7874c37441b7118A38264Q6191a83988
15878a5242C33098P332D2184M9993a19040A42443a17240r9624O9749A22335L0248
$$ plain form
15867 152583 -513269 184023 54183 26652 -131449 161609 -48393 -154737 -123316 -212783
15857 -212783 -131639 -240285 125100 174702 377137 -120794 -154129 350399 -73006 188160
15846 177178 -29211 74452 94214 64753 -231324 162534 -96332 -82708 156624 -209925 47811
15834 -127208 70534 127397 92136 -109946 -100111 93273 -195246 -13586 222337 -109078 94929
15822 -25594 198911 -25999 -55702 114101 8422 28628 -204522 26649 60011 -82350 -92200
15811 -92200 -113709 116913 2539 -108910 110203 -242746 61317 -233496 -119798 -88404 -114287
15800 -114287 127249 -58446 -168488 141475 -6748 -219884 -179266 -205044 124168 -183911
15789 -152099 207500 -14921 -3204 6806 -81848 -263384 15041 -25360 -174567 -325666 -198911
$$ packed form
15867A52583e13269A84023E4183B6652a31449A61609d8393j06344L1421q9467
15857b12783Q1144j08646A25100M9602K02435a20794l3335C50399g3006A88160
15846A77178b9211G4452J9762k9461b31324A62534i6332J3624A56624b09925D7811
15834a27208G0534N6863l5261a09946R835I3273a95246a3586B22337a09078I4929
15822b5594A98911b5999k9703A14101H422K0206b04522B6649L3362h2350r850
15811i2200k1509A16913B539a08910A10203b42746F1317b33496J13698L1394k5883
15800a14287A27249e8446j10042A41475f748k13136M0618k5778A24168a83911
15789a52099B07500a4921c204F806h1848j81536A5041b5360j49207j51099J26755
$$ plain form
15778 -198911 -86201 -114359 -150363 156004 -105904 -205889 -26702 -158616 104141 5271 -191441
15766 -244254 -487186 30723 242367 -62276 63374 26772 42099 -21497 -156250 248302 -378943
15754 -128212 139337 -86084 100902 -67790 36665 68751 -55981 -194165 -194021 14002 105738
15743 105738 -115174 102860 94117 83613 33895 -259393 148188 44801 -383510 -19665 -222187
15732 -222187 -178612 187253 35681 -333256 -51528 104932 46731 242845 -218305 -922 -136390
15721 -136390 146417 -322947 127290 144676 -188767 -146893 235296 -161990 58298 -161116
15710 -11395 -132324 -47925 153312 -182588 42129 -114223 -150499 178293 -163447 -61382
15699 -137279 323520 56974 34357 72771 -394766 -19819 247997 64913 -211458 -102415
$$ packed form
15778a98911h6201k8158l6004A56004a05904r9985b6702j31914A04141E271a91441
15766b44254k42932C0723K11644f2276F3374B6772J5327b1497j34753B48302c78943
15754a28212A39337h6084A00902f7790C6665L2086e5981j38184J44A4002R1736
15743A05738a15174A02860q743j0504C3895b59393A48188D4801c83510a9665k02522
15732b22187M3575A87253C5681c33256e1528A04932D6731J96114b18305i22j35468
15721a36390A46417c22947A27290J7386a88767M1874B35296a61990E8298a61116
15710a1395j20929d7925A53312a82588D2129a14223l6276A78293a63447f1382
15699a37279C23520E6974k2617L8414c94766a9819B47997F4913b11458a02415
$$ plain form
15688 194376 -53563 -63479 1334 161024 -24996 -324883 48639 286859 -56095 -86006 -69300
15677 -69300 -28996 -67999 61789 -169098 -102709 -19497 -289526 122747 241871 -134416 -47788
15665 -161522 -226567 33097 -210440 -54590 183659 -204225 -320543 -24732 104529 -63323
15654 -32063 -166533 -89008 -269938 -310153 -181217 -340660 -169152 -240105 -150614 8401 -268805
15642 159898 -125179 -26526 -77061 185057 -312543 24855 -118473 -41576 -234087 52549
15631 104564 -241463 -143446 224521 -201705 -118892 344913 68021 51286 152618 -212983
15620 229333 -325452 -356926 74699 -40962 -154851 -69472 -404008 -247698 -76119 51719 -69519
15608 93454 -304872 -196643 -214465 397752 -76611 160482 -111154 -431578 113336 -157248
$$ packed form
15688A94376e3563r916A334J59690b4996k99887D8639K38220e6095k9911J6706
15677f9300b8996l9003F1789a69098O6389a9497k70029A22747J19124a34416d7788
15665a61522o5045C3097b10440e4590A83659b04225j16318b4732A04529f3323
15654c2063j34470P7525j80930m0215J28936j59443a69152p0953Q9491H401b68805
15642A59898a25179b6526n0535A85057c12543B4855a18473d1576j92511E2549
15631A04564b41463R8017B24521b01705Q2813C44913F8021j6735J01332b12983
15620B29333c25452l1474G4699d0962j13889f9472l34536J56310g6119E1719f9519
15608I3454c04872J08229j7822C97752g6611A60482a11154l20424A13336a57248
$$ plain form
15597 246189 28916 84715 -323860 -24223 83254 -93265 -26691 -18577 -12223 -339643 -384925
15586 -384925 -7998 87150 -322965 158854 -148975 402037 -266271 18383 215753 208610 -32624
15574 -199540 178678 -317405 -86638 -143352 31671 -190677 -17839 -66927 -127436 -186123 -146558
15563 -146558 118910 -119102 111125 -74022 186424 201904 321897 40730 98162 -5560 -86847
15552 -86847 -82823 60842 80030 56016 7439 -92760 -55468 28975 138002 -42191 -63630 69369
15539 220191 43927 288875 -2415 226984 163104 158028 -59669 66665 195962 -66590 43267
15527 -171229 262811 -189814 -199188 -23650 -120611 252293 348921 161960 111968 -293737 22249
15515 -233907 -107215 -28547 197628 38961 88187 189318 29187 -154345 -93754 223015
$$ packed form
15597B46189B8916N5799c23860b4223H3254i3265b6691Q114O354l27420m5282
15586c84925g998H7150c22965A58854a48975D02037b66271A8383J97370p143c2624
15574a99540A78678c17405h6638n6714C1671a90677a7839m9088o0509n8687L9565
15563a46558A18910a19102A11125g4022A86424J5480J19993D0730N7432e560q1287
15552h6847M024F0842J9188k4014G439i2760L7292B8975J09027d2191k1439F9369
15539B20191D3927K44948b415B26984o3880n076e9669F6665J29297f6590D3267
15527a71229B62811a89814r374b3650r6961B52293R6628A61960m9992b93737B2249
15515b33907a07215b8547A97628C8961M9226J01131B9187a54345O0591B23015
$$ plain form
15504 -134069 107592 105746 36274 -70068 -192552 62851 214849 191127 296865 14367 346808
15493 346808 58643 -214721 -179440 -181023 -170721 -36490 -73346 -168358 207177 228931 -74672
15481 51223 273644 -22772 -168724 -20902 57176 4738 353528 21605 439018 6583 292225
15470 292225 -81371 213325 451451 -59420 66255 17258 79962 -85451 11064 -110430 -25434
15458 8355 -125885 -366748 -47384 -83664 -60917 385096 209851 204133 264549 -31044 -170147
15447 -170147 40078 239366 -37567 124675 -63587 157032 -70433 235427 79867 118062 89944
15436 89944 381802 168730 413462 409798 126577 78689 405753 -11664 -242274 279008
15425 -186338 -15871 447118 245045 134281 -117112 -349769 98077 -340476 14150 -257531
$$ packed form
15504a34069A07592j846C6274g0068j22484F2851J51998k3722J05738A4367L32441
15493C46808E8643b14721L5281j583J0302c6490l6856r5012B07177K1754g4672
15481E1223K22421b2772j45952b0902E7176D738L48790B1605M17413F583K85642
15470B92225h1371B13325K38126e9420F6255A7258O2704h5451A1064a10430b5434
15458H355a25885k40863d7384l6280K2747C85096j75245n718O0416c1044j39103
15447a70147D0078J99288c7567A24675f3587A57032g0433B35427G9867L8195k8118
15436H9944K91858A68730K44732l664A26577m7888L27064a1664k30610B79008
15425a86338a5871D47118k02073j10764a17112k32657I8077c40476A4150b57531
$$ plain form
15414 -120336 289103 -201333 7636 -303646 73070 -75239 -205043 -325230 -26934 -13419 -67392
15403 -67392 119622 -230189 139471 411447 55759 165741 -88729 44385 -165988 352925
15392 -102059 -361017 -10504 228569 -107077 94208 142182 90719 -394 113753 -240312 -54976
15380 45087 -112542 211728 9212 317815 361776 80042 475684 78094 -25702 -151062 190629
15368 -199505 22576 40782 32914 24090 -67934 385253 -190843 -303834 169298 -172669 146320
15356 132381 146241 -97522 -196875 30195 -13864 -199561 -139877 -276812 29601 146756 199398
15345 199398 -219931 365580 22407 -79716 49794 -48854 -19059 -30795 56601 262384 -107594
15333 150494 211555 165333 -37391 8707 163694 -42844 35248 -292177 470956 -81925 63265
$$ packed form
15414a20336B89103b01333G636c03646G3070g5239j29804j20187b6934a3419n3973
15403f7392A19622b30189A39471K71976E5759J09982h8729D4385a65988C52925
15392a02059k58958a0504B28569a07077I4208M7974n1463c94A13753b40312e4976
15380D5087a12542B11728I212L08603M3961H0042L95642G8094b5702j25360A90629
15368a99505B2576J8206p868q824f7934C85253a90843j12991A69298a72669A46320
15356A32381J3860i7522r9353C0195a3864j85697N9684j36935B9601J17155N2642
15345A99398b19931C65580B2407g9716D9794d8854a9059j1736E6601K05783a07594
15333A50494O1061m6222c7391H707J54987d2844C5248b92177D70956h1925F3265
$$ plain form
15321 -27354 -30241 240573 -31037 -452186 -225873 -34736 121687 -342779 63211 49737 147888
15310 147888 111760 400694 -128067 -56305 8936 396525 -112475 71735 -22815 199141 -37161
15298 -76320 138426 200640 86669 -183575 337846 -25748 -34660 -6956 -107036 88430 209519
15287 209519 62709 367795 -3886 287430 83245 -70067 114414 -118925 68987 124038 -56947
15275 53483 22992 131398 -33393 184421 -280121 58661 -30971 -333468 85298 -31708 -110729
15264 -110729 130410 -275558 255016 215066 -188777 177531 -20624 85346 -52573 122447
15253 2007 -112821 -96002 165194 320948 763629 1028098 704266 1345415 745539 503854
15243 503854 108402 -144470 -133538 139797 322929 53844 -190290 62713 -6925 -103108 -201226
$$ packed form
15321b7354k887B40573c1037m21149b25873c4736A21687c42779F3211j3474R8151
15310A47888l6128K88934a28067e6305H936L87589a12475G1735b2815A99141c7161
15298g6320A38426O2214H6669a83575C37846b5748q912f956j00080H8430J21089
15287B09519F2709L05086c886B87430H3245g0067A14414a18925F8987N5051e6947
15275E3483B2992J08406c3393A84421b80121E8661c0971l02497H5298c1708p9021
15264a10729A30410b75558B55016l9950a88777A77531b0624H5346e2573A22447
15253B007a12821J6819A65194J55754M42681K64469l23832O41149n99876k41685
15243E03854A08402a44470J0932A39797J83132E3844a90290F2713f925r6183r8118
$$ plain form
15232 -201226 6372 -272897 5919 -94516 -132591 287183 211908 -138212 69196 205691 -121951
15220 49098 -111553 91445 -91596 174647 -93564 282377 -314327 -186312 117540 207333
15210 207333 83905 47378 -143899 75110 98329 337114 21921 505874 -54231 -96325 -258041
15199 -258041 187741 54271 100511 -131154 73691 5580 212419 -268151 133637 210040 -5215
15187 112474 62083 139175 221014 28054 260736 114598 14698 126700 -117870 305463
15176 67794 248648 -200373 -55634 -316075 99548 291056 56585 147341 63660 -7387 337849
15164 -256521 -9569 40409 -122995 254232 257295 323023 115976 192794 115099 282491 363652
15153 363652 64457 242400 240409 -10049 -24465 38165 -6927 -60457 132206 48997 135095
$$ packed form
15232b01226F372b72897E919i4516l8075B87183p5275a38212F9196J36495a21951
15220D9098a11553I1445i1596A74647i3564B82377c14327J28015A17540Q9793
15210B07333H3905l6527a43899G5110K3219K38785B1921M83953e4231m2094j61716
15199b58041A87741E4271M6240a31154G3691E580K06839b68151A33637P6403e215
15187A12474n0391P7092Q1839B8054K32682A14598A4698J12002a17870C05463
15176F7794J80854b00373e5634k60441I9548J91508E6585R0756F3660g387C37849
15164b56521i569D0409a22995B54232L063O5728A15976P6818p7695J67392Q1161
15153C63652F4457J77943j991a0049j4416C8165f927n3530A32206D8997Q6098
$$ plain form
15142 135095 173646 -17918 59686 -52332 -80635 126290 194278 175714 352537 -143532 258452
15130 87334 -38757 142278 -173162 204464 101575 116236 -168488 87232 122182 254103
15120 254103 175964 -192692 47881 466038 224429 141281 472656 225691 87346 339316
15110 339316 28143 39390 414946 329304 5721 -73303 196123 -112747 106888 134068 134709
15099 134709 40924 127877 -60467 -292793 127378 12732 79998 -120899 118844 119778 -141164
15087 97800 -331112 31051 413619 152215 223623 31724 -20026 96560 369538 266996 484972
15076 484972 -152077 338578 345236 -161 266049 303422 103791 46118 143420 -2780 -112211
15065 -112211 64860 544683 327849 43650 487751 286260 386352 -13813 455435 157820
$$ packed form
15142A35095L8551a7918E9686e2332k8303A26290O7988j8564J76823a43532B58452
15130H7334c8757A42278a73162B04464A01575J4661a68488H7232L4950J31921
15120B54103p8139a92692D7881M18157B24429q3148L31375B25691H7346K51970
15110C39316B8143J1247L75556q5642E721g3303A96123a12747A06888K7180O41
15099A34709D0924Q6953f0467k32326A27378A2732O7266a20899A18844R34a41164
15087I7800c31112C1051L82568A52215P1408C1724b0026I6560K72978j02542K17976
15076D84972a52077C38578O658a61B66049L7373A03791D6118R7302b780j09431
15065a12211F4860M79823k16834D3650M44101k01491J00092a3813D55435A57820
$$ plain form
15054 -29082 -78941 -111482 71055 182879 218366 -2684 242200 -29644 -31460 203490 76222
15042 476513 253990 334061 289811 221394 196143 288912 159615 -97138 362527 209511 -82493
15030 -99534 168053 354064 355613 369666 12965 322258 261366 331099 299032 264402 -33170
15018 198787 278755 335799 321267 9278 310639 239045 150070 105287 332352 71311 35483
15006 223925 228400 92004 310829 450582 327282 290776 305110 228917 7766 -113452 217685
14994 -3308 18788 383641 320297 84736 433182 520514 89271 102207 445808 239306 230755
14983 230755 469963 194708 246273 317197 -119113 247356 204840 250191 515629 521966 32984
14971 230219 286060 120627 126193 338556 -57474 221103 465966 116883 -117418 415753
$$ packed form
15054b9082m9859l2541G1055J11824L5487b684B42200b9644j816B03490G6222
15042D76513k22523Q0071m4250o8417k5251R2769j29297i7138C62527j53016h2493
15030i9534A68053J86011J549J4053A2965L09293o0892O9733l2067l4630c3170
15018A98787P9968N7044j4532I278L01361p1594q8975m4783K27065G1311C5483
15006B23925M475I2004K18825J39753j23300l6506J4334p6193G766a13452B17685
14994c308A8788L64853o3344H4736L48446Q7332H9271J2936L43601k06502q551
14983B30755K39208A94708N1565P0924a19113B47356m2516M5351K65438O337C2984
14971B30219N5841A20627N566K12363e7474B21103K44863A16883a17418D15753
$$ plain form
14960 91037 301385 64015 535443 172448 504767 161833 -10520 228593 272234 148127
14950 148127 217399 256915 69611 206774 4750 29322 36405 327966 344092 183249 532622
14939 532622 353550 65680 466804 436866 91964 430746 626464 427801 191296 426058
14929 426058 423976 418342 553745 471982 702274 557642 696166 784157 425431 56699 495732
14918 495732 635953 401436 340059 771142 689648 739701 894705 740018 795242 328817
14907 706425 397326 591092 247798 41372 67453 612084 265905 529647 -75089 252948
14896 374947 320724 594945 169016 277143 347405 247883 248022 262419 720162 209818 226589
14885 226589 243981 410460 200090 287996 575108 556683 365843 316945 632646 528396
$$ packed form
14960I1037K10348F4015M71428A72448L32319A61833a0520B28593M3641j24107
14950A48127O9272L9516F9611J37163D750K4572P083K91561J6126j60843L49373
14939E32622j79072F5680M01124k9938I1964L38782J95718j98663A91296K34762
14929D26058k082n634J35403q1763K30292j44632J38524Q7991l58726E6699M39033
14918D95732J40221k34517o1377M31083q1494N0053J55004j54687N5224C28817
14907G06425l09099J93766B47798D1372K6081N44631B65905K63742g5089B52948
14896C74947n4223K74221A69016J08127P0262r9522J39J4397M57743B09818J6771
14885B26589J7392J66479B00090Q7906K87112j8425j90840m8898L15701j04250
$$ plain form
14875 528396 451615 138777 303999 343144 621050 142842 606696 516455 299235 236286
14865 236286 252693 473215 101327 618378 315251 482742 233025 70723 565160 177997
14854 261472 331264 610563 525370 252021 345554 211531 489042 270688 261244 380212
14844 380212 751421 145346 302649 278769 238508 248504 416898 308248 406701 708840
14834 708840 717082 442763 738224 490858 385634 501339 270257 251844 658122 149728
14823 740120 516582 591144 274403 275093 328214 232017 343455 455700 682591 532376 417393
14812 417393 803436 295585 324393 496804 453807 458849 267976 437495 438952 483684 390061
14801 390061 322508 258109 382769 594557 355628 627019 539664 289184 263778 685714
$$ packed form
14875E28396p6781A38777J65222L9145K77906A42842M63854r0241k17220o2949
14865B36286J6407K20522A01327N17051l03127J67491B33025G0723M94437A77997
14854B61472O9792K79299q5193B52021R3533j34023K77511k18354r444J18968
14844C80212L71209A45346J57303k3880m0261R996J68394j08650R8453L02139
14834G08840Q242k74319K95461k47366j05224J15705k31082j8413M06278A49728
14823G40120k23538P4562B74403O90N3121r6197J11438J12245K26891j50215j14983
14812D17393L86043B95585K8808J72411m2997N042j90873J69519J457M4732r3623
14801C90061o7553o4399J24660K11788k38929K71391q7355k50480k5406M21936
$$ plain form
14791 685714 249119 726933 432450 399838 390610 328814 602724 612605 324520 671042 215122
14779 343940 619113 255135 480939 163302 568001 534366 305820 350251 561418 695641
14769 695641 565368 130642 731544 633306 445308 506954 393882 595150 355157 431253
14759 431253 398929 635674 803954 978922 564707 759290 840657 344645 519956 876254
14749 876254 476674 785886 490838 475101 146703 576090 924418 625279 815562 774360
14739 774360 910359 523987 712292 586816 499388 644636 426071 623807 682544 687244
14729 687244 594089 545726 903629 559305 846469 923847 645374 488624 1007962 763244
14719 763244 926813 804558 640014 795217 795163 903392 945174 802922 765787 523203 1054303
$$ packed form
14791F85714B49119M77814k94483l2612r228o1796K73910R881k88085L46522B15122
14779C43940K75173B55135K25804A63302M04699l3635k28546M4431K11167J34223
14769F95641j30273A30642O00902r8238j87998O1646j13072K01268k39993P6096
14759D31253l2324K36745J68280J74968m14215J94583Q1367C44645J75311L56298
14749H76254l99580L09212k95048j5737A46703M29387L48328k99139J90283m1202
14739G74360J35999l86372J88305j25476q7428J45248k18565J97736N8737M700
14729F87244r3155m8363L57903l44324K87164P7378k78473j56750N19338k44718
14719G63244J63569j22255j64544J55203n4J08229M1782j42252l7135k42584N31100
$$ plain form
14708 1054303 766169 621571 671402 622951 629520 330738 614282 609220 698230 738520 726090
14697 726090 906533 893743 1074491 1210968 974899 831830 901051 564469 837267 524804
14687 524804 425267 1017934 739806 959201 543862 660907 854569 672848 492202 868698
14677 868698 1019774 847374 848792 876358 700378 852678 905594 706460 882273 1180432
14667 1180432 759974 1059495 801375 974511 1168905 684918 988694 838383 506680
14658 506680 955592 1002556 497397 1079585 955297 935026 961230 672272 781015 964401
14648 964401 920523 1165292 1107364 1067901 1055029 1112548 868210 1072569 1239937 986181
14638 986181 1064449 1094352 912544 1020509 1214106 1180216 1252435 1232032 770613 1103919
$$ packed form
14708A054303k88134j44598M9831m8451O569k98782K83544n062Q9010M0290j2430
14697G26090J80443j2790J80748J36477k36069j43069O9221l36582K72798l12463
14687E24804r9537N92667k78128K19395m15339J17045J93662j81721j80646L76496
14677H68698J51076j72400J418K7566j75980J52300N2916j99134J75813K98159
14667A180432m20458K99521k58120J73136J94394m83987L03776j50311l31703
14658E06680M48912M6964D97397N82188j24288k0271K6204k88958J08743J83386
14648I64401m3878K44769n7928l9463j2872N7519k44338K04359J67368k53756
14638I86181P8268K9903j81808J07965J93597l3890P2219k0403m61419L33306
$$ plain form
14628 1103919 968740 1250633 1040415 1294079 1172396 1133568 1350723 977209 1200529 1209029
14618 1209029 1064737 1012155 1532388 1403523 1235392 1268473 1269580 1072132 1184299 1508351
14608 1508351 1401920 1137502 1038821 1265009 1192556 1238629 1311776 1526116 1331321 1430741
14598 1430741 1291981 954602 1488913 1226664 1533476 1218393 1473210 1531949 1435779 1496926
14588 1496926 1527996 1614818 1475174 1600824 1410967 1542856 1641214 1394688 1536623 1410928
14578 1410928 1605401 1352028 1802494 1667896 1863404 1608617 1620071 1669855 1791833 1743032
14568 1743032 1927245 1929907 2025959 1797701 1932178 1914447 1923805 1878100 2204140 2465576 2367100
14557 2367100 2498223 2613408 3219002 3170627 3311013 3833159 4887955 5909779 8330421
$$ packed form
14628A103919j35179K81893k10218K53664j21683l8828K17155l73514K23320Q500
14618A209029j44292n2582N20233j28865j68131L3081J107j97448J12167L24052
14608A508351j06431k64418r8681K26188p2453M6073P3147K14340j94795R9420
14598A430741j38760l37379N34311k62249L06812l15083K54817N8739r6170O1147
14588A496926L1070Q6822j39644J25650j89857J31889R8358k46526J41935j25695
14578A410928J94473k53373M50466j34598J95508k54787J1454M9784J21978m8801
14568A743032J84213K662R6052k28258J34477j7731R358m5705L26040K61436r8476
14557B367100J31123J15185O05594m8375J40386N22146J054796J021824K420642
$$ plain form
14548 8330421 12691702 20642013 30405510 31426188 17671259 8124996 4323111 3147781
14540 3147781 2534441 2171928 2115124 1947925 1800610 1643944 1910617 1756903 1620292 2083671
14530 2083671 1816115 1907185 2084920 2134845 1971816 1778383 1782533 1770646 1938854 1805802
14520 1805802 1938810 2138464 2271532 2137200 2191812 2195165 2378871 2215214 1969074 2233944
14510 2233944 2543964 2327416 2379322 2360493 2117708 2377897 2497759 2622557 2642655 2533231
14500 2533231 2777504 2630108 2628969 2711101 2549617 2941550 2494152 2601138 2992930 2616092
14490 2616092 2845811 2779009 3201262 2704263 2840739 3030023 2816607 3242599 3133525 2926584
14480 2926584 3123473 2976140 3041295 3321220 3072880 3356608 3297081 3403875 3408293 3635487
$$ packed form
14548H330421M361281P950311R763497J020678j3754929H124996l801885j175330
14540C147781o13340l62513n6804j67199j47315j56666K66673j53714j36611M63379
14530B083671k67556R1070J77735M9925j63029j93433M150j1887J68208j33052
14520A805802J33008J99654J33068j34332N4612L353J83706j63657k46140K64870
14510B233944L10020k16548N1906j8829k42785K60189J19862J24798K0098j09424
14500B533231K44273j47396j139Q2132j61484L91933m47398J06986L91792l76838
14490B616092K29719o6802M22253m96999J36476J89284k13416M25992j09074k06941
14480B926584J96889j47333O5155K79925k48340K83728n9527J06794M418K27194
$$ plain form
14470 3635487 3134206 3591206 3387771 3532606 3715613 3659125 4040133 3491659 3729603 3844791
14460 3844791 3578803 4249031 4275358 4086001 4192121 4006881 4338576 4090793 4076176 4280611
14450 4280611 4558521 4173272 4265104 4711788 4677161 4740201 4680015 4877448 4855217 4518249
14440 4518249 4740757 5287070 5133991 5206651 5282002 5307774 5182033 5598810 5698807 5589106
14430 5589106 5563851 5614676 5724073 5865999 5941046 6353654 6050413 6527615 6313776 6302424
14420 6302424 6364501 6735087 6630604 6914434 6798045 7228944 7402479 7232083 7326119 7281611
14410 7281611 7566009 7871450 8052470 7913397 8358710 8265447 8090839 8339771 8511861 8445308
14400 8445308 8487801 8917771 8938381 9225679 9411070 9940765 9549782 9740318 10013259 10104297
$$ packed form
14470C635487n01281M57000k03435J44835J83007n6488L81008n48474K37944J15188
14460C844791k65988O70228K6327j89357J06120j85240L31695k47783j4617K04435
14450D280611K77910l85249R1832M46684l4627O3040o0186J97433k2231l36968
14440D518249K22508N46313j53079P2660P5351K5772j25741M16777R9997j09701
14430E589106k5255N0825J09397J41926P5047M12608l03241M77202k13839j1352
14420F302424O2077L70586j04483K83830j16389M30899J73535j70396R4036m4508
14410G281611K84398L05441J81020j39073M45313r3263j74608K48932J72090o6553
14400H445308M2493M29970K0610K87298J85391N29695l90983J90536K72941R1038
$$ plain form
14390 10104297 10318060 10522987 10507348 10695851 11087924 11150045 11665083 11917523 12026865 12404392
14380 12404392 12220764 12379536 12892816 13171876 13633590 13760134 13365979 14184229 14744316
14371 14744316 14816661 14826226 15076209 15713926 16150850 16185196 16527719 16738198 17237484 17111530
14361 17111530 18162910 18334368 18747002 19132232 19908852 20413412 20754992 21213244 21823868
14352 21823868 22220121 22755787 23123372 23699873 24437418 25150458 25759577 26364943 27463448
14343 27463448 27731152 28231719 29305806 29935322 30981922 31778803 32707602 33788616 35024163
14334 35024163 35597849 36843096 38137893 39148533 40472076 41626609 43035355 44869098
14326 44869098 45850322 47894064 49328613 50711056 52516659 54379546 56451358 58710966
$$ packed form
14390A0104297K13763K04927j5639J88503L92073O2121N15038K52440J09342L77527
14380A2404392j83628J58772N13280K79060M61714J26544l94155Q18250N60087
14371A4744316P2345R565K49983O37717M36924L4346L42523K10479M99286j25954
14361A7111530J051380J71458M12634L85230P76620N04560L41580M58252O10624
14352B1823868L96253N35666L67585N76501P37545P13040O09119O05366J098505
14343B7463448K67704N00567J074087O29516J046600P96881R28799J081014J235547
14334C5024163N73686J245247J294797J010640J323543J154533J408746J833743
14326D4869098R81224K043742J434549J382443J805603J862887K071812K259608
$$ plain form
14318 58710966 60992352 63203922 65529386 68025040 70861964 73792520 76594079 79883136
14310 79883136 83477868 87109372 90857207 95291841 99609045 103669521 108771326 113825869
14302 113825869 119483320 125591747 131570502 138602430 145498056 153293431 161410041 169799957
14294 169799957 178976532 188753873 199202393 210050932 221874846 234227815 247561107
14287 247561107 260768910 274912939 289577793 304709807 320268157 335940301 351400566
14280 351400566 366833441 381786583 396043358 408763283 420289494 429925213 436857852
14273 436857852 438970957 438766055 437749029 436904535 435530093 431986678 425931403 416653084
14265 416653084 405208683 392485576 378377028 363439185 347570875 331393861 315410766
$$ packed form
14318E8710966K281386K211570K325464K495654K836924K930556K801559L289057
14310G9883136L594732L631504L747835M434634M317204M060476N101805N054543
14302A13825869N657451O108427N978755P031928O895626P795375Q116610Q389916
14294A69799957R176575R777341J0448520J0848539J1823914J2352969J3333292
14287B47561107J3207803J4144029J4664854J5132014J5558350J5672144J5460265
14280C51400566J5432875J4953142J4256775J2719925J1526211R635719O932639
14273D36857852K113105k04902j017026q44494j374442l543415o055275r278319
14265D16653084j1444401j2723107j4108548j4937843j5868310j6177014j5983095
$$ plain form
14258 315410766 299516958 284290805 269586183 255810200 242106647 229270452 217006667
14251 217006667 205173482 194477216 184417631 174371169 165738912 157146251 149428587
14244 149428587 141951822 134835725 128114325 122283909 116096779 111057304 105837869 101349395
14236 101349395 96849942 92357911 88391277 84410831 81144074 78073306 75013648 71882339
14228 71882339 68973575 66220421 63768998 60966625 59027938 56665580 54661773 52893714
14220 52893714 50986269 49183475 47801760 45995239 44556388 43285212 41805015 40355977
14212 40355977 39353571 38217906 36871461 35815987 34895229 34316299 33130570 32095778
14204 32095778 31322388 30102475 29267037 28588550 27948284 27127473 26176610 25687207 24950574
$$ packed form
14258C15410766j5893808j5226153j4704622j3775983j3703553j2836195j2263785
14251B17006667j1833185j0696266j0059585j0046462q632257q592661p717664
14244A49428587p476765p116097o721400n830416o187130n039475n219435m488474
14236A01349395m499453m492031l966634l980446l266757l070768l059658l131309
14228G1882339k908764k753154k451423k802373j938687k362358k003807j768059
14220E2893714j907445j802794j381715j806521j438851j271176j480197j449038
14212D0355977j002406j135665j346445j055474r20758n78930j185729j034792
14204C2095778p73390j219913q35438o78487o40266q20811r50863m89403p36633
$$ plain form
14195 24950574 24264090 24268157 23578223 22781357 22091643 21496603 21355454 21027636 20211706 19645814
14185 19645814 19229100 18653324 18086769 18263672 17352212 17151301 16724353 16608442 16276405
14176 16276405 16060625 15677475 15428867 14661797 14436813 14487644 14007516 13798384 13314836
14167 13314836 13228377 13118830 12819482 12156971 12530716 12016226 11873181 11796146 11578887 11511785
14157 11511785 10632227 11029237 10553449 10581851 10509976 9963946 9791145 9949443 9389857 9574232
14147 9574232 9281055 9294615 8956491 8984840 8742517 8899775 8452515 8322566 8410351 8211252
14137 8211252 8177637 8107772 7856641 7672991 7526119 7523247 7100209 7439477 7216702 6651666
14127 6651666 6621995 6902932 6653352 6821847 6666396 6664136 6319185 6253592 6120909 6040690
$$ packed form
14195B4950574o86484M067o89934p96866o89714n95040j41149l27818q15930n65892
14185A9645814m16714n75776n66555J76903r11460k00911m26948j15911l32037
14176A6276405k15780l83150k48608p67070k24984N0831m80128k09132m83548
14167A3314836q6459j09547k99348o62511L73745n14490j43045p7035k17259o7102
14157A1511785q79558L97010m75788K8402p1875n46030j72801J58298n59586J84375
14147I574232k93177J3560l38124K8349k42323J57258m47260j29949Q7785j99099
14137H211252l3615o9865k51131j83650j46872k872m23038L39268k22775n65036
14127F651666k9671K80937k49580J68495j55451k260l44951o5593j32683q0219
$$ plain form
14117 6040690 6373071 6107745 5928475 5942446 5925120 5565145 5582092 5849599 5534218 5195431
14107 5195431 5273925 5312466 5168600 5023583 5138574 4964413 5115114 4781256 4778976 4702939
14097 4702939 4441674 4594543 4571246 4369022 4426085 4518055 4407150 4516738 4392814 4431590
14087 4431590 4368945 4015601 4198440 4069916 3841008 4037235 3805894 3711226 4005687 3917816
14077 3917816 3694262 3699266 3615299 3650296 3776248 3487941 3404408 3389358 3425239 3355616 3440171
14066 3440171 3269372 3304151 3114844 3159416 3091465 3468368 3361479 2896090 3209025 2790724
14056 2790724 3074631 3229724 2985159 3089390 3074013 2755628 2794551 2906080 2834631 2852973
14046 2852973 2820947 2414838 2845591 2461244 2393267 2950379 2593350 2489841 2580964 2487238
$$ packed form
14117F040690L32381k65326j79270J3971j7326l59975J6947K67507l15381l38787
14107E195431P8494L8541j43866j45017J14991j74161J50701l33858k280p6037
14097D702939k61265J52869k3297k02224N7063R1970j10905J09588j23924L8776
14087D431590o2645l53344J82839j28524k28908J96227k31341r4668K94461q7871
14077C917816k23554N004q3967L4997J25952k88307q3533j5050L5881o9623Q4555
14066C440171j70799L4779j89307M4572o7951L76903j06889m65389L12935m18301
14056B790724K83907J55093k44565J04231j5377l18385L8923J11529p1449J8342
14046B852973l2026m06109M30753l84347o7977N57112l57029j03509R1123r3726
$$ plain form
14036 2487238 2456319 2314024 2607383 2878794 2526701 2397164 2741540 2447839 2673379 2305465
14026 2305465 2150283 1807487 2391980 2387678 2008879 2222807 2102429 2406023 1864349 2118047
14016 2118047 1858352 1926859 1799749 2317483 1841226 1900009 2029714 1817904 1909563 1911823
14006 1911823 2027450 2088323 2087971 1942235 1855880 1828501 1960665 1800580 1609776 1732259
13996 1732259 1966260 1559702 1926591 1965760 2275850 2199039 3451508 5239607 8394183
13987 8394183 14904514 25376684 30594725 21260378 11846235 7707513 5540804 4382358
13979 4382358 3886406 3288172 2952677 2806045 2323702 2233753 1847180 2055617 2304061 2166238
13969 2166238 2055549 1985404 1864603 2198693 1736271 2027225 1918399 1514342 1559933 1870977
$$ packed form
14036B487238l0919j42295K93359K71411l52093j29537L44376k93701K25540l67914
14026B305465j55182l42796N84493m302l78799K13928j20378L03594n41674K53698
14016B118047k59695O8507j27110N17734m76257N8783J29705k11810R1659K260
14006A911823J15627O0873l52j45736q6355k7379J32164j60085j90804J22483
13996A732259K34001m06558L66889L9169L10090p6811J252469J788099L154576
13987H394183O510331J0472170N218041r334347r414143m138722k166709j158446
13979D382358m95952n98234l35495j46632m82343q9949l86573K08437K48444j37823
13969B166238j10689p0145j20801L34090m62422K90954j08826m04057M5591L11044
$$ plain form
13959 1870977 1762845 1544607 1526855 1520046 1938501 1568671 1783167 1491526 1409491 1467328
13949 1467328 1606074 1525083 1491134 1547490 1381916 1699617 1368160 1359830 1608320 1605274 1605221
13938 1605221 1716882 1332461 1485044 1247693 1366239 1465861 1111248 1157358 1642863 1092402
13928 1092402 1305866 1637789 1497986 923279 1225003 1115290 1419888 1134531 1024011
13919 1024011 1100626 1376925 1198393 1071762 1170023 1143213 1277125 1332248 1415617 1346964
13909 1346964 1279456 1110350 1044773 1069633 930475 805552 1233861 1177607 673953 924350
13899 924350 1074404 924884 1124700 1160355 844234 1018160 1059239 937191 1170059 969165
13889 969165 643998 1122081 959577 916449 819649 996476 1084491 1234490 725940 781546
$$ packed form
13959A870977j08132k18238j7752o809M18455l69830K14496k91641q2035N7837
13949A467328J38746q0991l3949N6356j65574L17701l31457q330K48490l046n3
13938A605221J11661l84421J52583k37351J18546R9622l54613M6110M85505n50461
13928A092402K13464L31923j39803n74707L01724j09713L04598k85357j10520
13919A024011P6615K76299j78532j26631R8261k6810J33912N5123Q3369o8653
13909A346964o7508j69106o5577K4860j39158j24923M28309n6254n03654K50397
13899I24350J50054j49520J99816L5655l16121J73926M1079j22048K32868k00894
13889I69165l25167M78083j62504m3128r6800J76827Q8015J49999n08550N5606
$$ plain form
13879 781546 1295866 1062784 545446 907675 903952 872703 852474 1150071 1090393 945652
13869 945652 1058464 1131827 1204345 882840 785724 799511 625799 843237 581535 504570
13859 504570 571754 989435 990030 802527 804618 845282 911132 1119492 703295 500654 589641
13848 589641 894646 726317 921921 414362 658842 887970 776270 823257 903866 947366
13838 947366 760378 1091098 856107 947648 733713 503860 875049 739299 573195 496957
13828 496957 486452 759297 1049278 591025 684488 581112 712305 570155 646768 624972
13818 624972 674569 781245 760338 362980 684194 554912 557070 731598 558196 862537
13808 862537 672507 637202 513042 578409 557447 616657 457669 800877 575792 827638
$$ packed form
13879G81546N14320k33082n17338L62229l723l1249k0229K97597n9678j44741
13869I45652J12812P3363P2518l21505r7116J3787j73712K17438k61702p6965
13859E04570O7184M17681N95j87503K091M0664O5850K08360m16197k02641Q8987
13848E89641L05005j68329J95604D14362K44480K29128j11700M6987Q0609M3500
13838I47366j86988L30720k34991R1541k13935k29853L71189j35750j66104p6238
13828D96957j0505K72845K89981m58253R3463j03376J31193j42150P6613k1796
13818F24972M9597J06676k0907C62980L21214j29282K158J74528j73402L04341
13808H62537j90030l5305j24160O5367k0962N9210j58988L43208k25085K51846
$$ plain form
13798 827638 430506 511048 813429 561741 712052 769492 601778 792171 623635 604307
13788 604307 846816 666461 328994 569108 775737 765223 490165 567547 649351 412273
13778 412273 502403 702373 446218 667958 420816 558611 485289 525620 644163 553008
13768 553008 493827 599493 721570 583231 453815 452798 654122 759498 407462 484441
13758 484441 372535 618009 716770 155287 525051 280227 474434 636104 266079 753358
13748 753358 664757 360213 743303 274359 401434 453904 408527 638068 595069 631623
13738 631623 487249 608796 313268 432722 525893 714914 601049 642828 346673 369954
13728 369954 470314 368039 290759 228725 385550 564829 435934 307459 469441 506368
$$ packed form
13798H27638l97132Q0542L02381k51688J50311N7440j67714J90393j68536j9328
13788F04307K42509j80355C28994K40114K06629j0514k75058P7382Q1804k37078
13778D12273R0130J99970k56155K21740k47142J37795p3322M0331J18543r1155
13768E53008n9181J05666J22077j38339j29416j017K01324J05376l52036P6979
13758D84441j11906K45474R8761A55287L69764k44824J94207J61670B66079M87279
13748G53358q8601l04544L83090B74359J27075N2470m5377K29541m2999L6554
13738F31623j44374J21547k95528J19454R3171J89021j13865M1779k96155K3281
13728C69954J00360j02275p7280o2034J56825J79279j28895j28475J61982L6927
$$ plain form
13718 506368 342327 474345 370285 777536 334507 309835 565102 383263 352742 387950
13708 387950 518720 558719 725950 322554 464427 298627 491332 513882 534894 315975
13698 315975 -13429 464432 536928 212144 349783 305367 279758 158722 543741 583462
13688 583462 306971 567981 437341 253518 377096 64095 450563 424790 243947 396826
13678 396826 381873 250864 555774 284284 109924 225546 431284 74624 130376 728833
13668 728833 230636 582991 460693 518195 373728 410700 14543 667839 545311 308111
13658 308111 374325 9868 191094 378545 484412 566583 341978 286604 164072 338124
13648 338124 576397 465615 368865 278957 272049 418686 465748 148613 418379 388876 283435
$$ packed form
13718E06368j64041J32018j04060M07251C34507k4672K55267j81839l0521L5208
13708C87950J30770L9999J67231C22554J41873j65800J92705K2550K1012k18919
13698C15975a3429D64432P2496B12144J37639m4416k5609j21036L85019L9721
13688E83462k76491K61010j30640j83823J23578F4095L86468k5773j80843J52879
13678C96826j4953j31009L04910k71490A09924J15622K05738G4624N5752N98457
13668G28833B30636L52355j22298N7502j44467L6972A4543O53296j22528k37200
13658C08111O6214I868J81226J87451J05867Q2171k24605n5374j22532J74052
13648C38124K38273j10782r6750q9908o908J46637M7062A48613K69766k9503j05441
$$ plain form
13637 283435 359383 272408 59609 45564 504184 214804 548121 235778 521292 440659
13627 440659 372162 406478 373921 428244 531023 309428 251602 361529 338774 224722 256049
13616 256049 476844 402016 311113 364174 456317 360231 278800 98003 311859 457679 85101
13604 187571 205570 560399 72527 425432 237895 362074 357382 85776 496749 285141
13594 285141 431678 330468 148283 402162 169564 212928 203373 196819 317110 -43688 384417
13582 525620 482023 -159081 430602 146626 451530 334276 232347 365222 251986 299664
13572 299664 59183 261823 349486 350064 284836 91218 174625 296026 74106 254651 98357
13560 489192 18024 360894 -26267 286647 99906 267021 193089 386198 44995 328320
$$ packed form
13637B83435P5948q6975E9609j4045M58620B14804L33317B35778K85514q0633
13627D40659o8497L4316l2557N4323J02779k21595n7826J09927k2755j14052L1327
13616B56049K20795p4828r0903N3061R2143r6086q1431I8003K13856J45820H5101
13604A87571J7999L54829G2527L52905j87537J24179m692H5776M10973k11608
13594B85141J46537j01210A48283K53879A69564M3364r555o554J20291d3688C84417
13582E25620m3597a59081D30602A46626L04904j17254j01929J32875j13236M7678
13572B99664E9183K02640Q7663N78o5228I1218Q3407J21401G4106J80545I8357
13560D89192A8024L42870b6267B86647I9906J67115p3932J93109D4995K83325
$$ plain form
13550 328320 187869 253552 205871 404205 -102082 214298 311699 188611 67682 346199
13540 346199 195512 10142 162379 131543 241995 321577 221461 145195 421948 208846
13529 277477 21079 236490 416099 184476 55608 -260508 -153350 64781 165990 147214
13519 147214 268055 489767 114628 202319 400178 209984 331799 272563 186076 190235
13509 190235 212697 334446 368404 76378 32841 336325 -38804 48238 128534 -192844 41370
13497 -241486 -20786 -241108 159191 228816 84066 -42562 600544 71755 284534 157400
13487 157400 31448 270408 198246 -70414 303970 168787 -117774 263370 140668 300901
13477 300901 373731 94600 90319 261080 164018 269252 131827 414722 148889 306729
$$ packed form
13550C28320j40451O5683m7681J98334a02082B14298R7401j23088F7682K78517
13540C46199j50687A0142J52237l0836J10452P9582j00116p6266K76753B08846
13529B77477B1079K15411J79609A84476E5608b60508J07158F4781J01209j8776
13519A47214J20841K21712A14628Q7691J97859j90194J21815n9236q6487M159
13509A90235K2462J21749L3958G6378C2841L03484c8804D8238Q0296a92844D1370
13497b41486b0786k20322A59191O9625H4066d2562F00544G1755K12779j27134
13487A57400C1448K38960p2162g0414C03970j35183a17774B63370j22702J60233
13477C00901P2830I4600m281J70761r7062J05234A31827K82895A48889J57840
$$ plain form
13467 306729 225718 55111 -111587 -141472 147829 47828 125351 281355 381262 22286 182690
13456 182690 169656 303203 24140 176339 70431 387678 100851 297353 21529 356838
13446 356838 124938 -197023 253687 368900 195639 238175 256597 139176 198081 -37105
13435 391785 240463 -413666 -154405 122851 -61576 122985 73521 116513 149691 -65657
13424 196815 417017 220609 154518 126512 -185995 279549 269218 -176888 -33449 193531
13413 203584 66667 296350 161487 243816 -11826 -19106 186697 123390 243575 -344214 181489
13401 558409 328207 250262 261708 -76161 59477 69532 8489 473170 -28012 181855 123602
13390 123602 302692 270537 -51141 216288 147744 245302 47388 159475 218163 -35566 177466
$$ packed form
13467C06729q1011E5111a11587k9885A47829D7828P7523J56004R9907B2286J60404
13456A82690j3034J33547B4140J52199G0431L17247A00851J96502B1529L35309
13446C56838A24938a97023B53687J15213j73261M2536J8422j17421N8905c7105
13435C91785j51322d13666a54405A22851f1576A22985m9464M2992L3178f5657
13424A96815K20202j96408o6091k8006a85995B79549j0331a76888c3449A93531
13413B03584F6667K29683j34863Q2329a1826p280A86697o3307J20185c44214A81489
13401E58409k30202p7945J1446g6161E9477J0055H489M64681b8012A81855n8253
13390A23602J79090l2155e1141B16288o8544R7558D7388J12087N8688c5566A77466
$$ plain form
13378 -301393 203515 6701 -86536 196377 267530 140212 89572 152315 331655 144212 58548
13366 141014 422648 45949 155526 545324 -153669 158440 45435 165675 102579 153804
13356 153804 145744 320488 65426 -75641 247362 252678 273332 -15596 108901 99495 315731
13345 315731 245348 454148 243833 522466 -28312 246253 215102 217782 250582 92999 319047
13334 319047 49431 234330 -148334 22979 380424 15173 -176965 296886 191291 285169
13324 285169 294732 110114 141396 12389 -45983 384443 -103207 205591 493718 324585
13314 324585 399859 -187373 59028 -122520 15544 347146 -98661 -131585 566807 236696
13303 180614 170001 391022 121760 196328 207794 29618 -47706 220170 -65583 326448 151833
$$ packed form
13378c01393B03515F701h6536A96377P1153j27318n0640O2743J79340A44212E8548
13366A41014K81634D5949J09577L89798a53669A58440D5435J20240o3096N1225
13356A53804q060J74744F5426g5641B47362N316K0654a5596A08901r406K16236
13345C15731p0383K08800k10315K78633b8312B46253l1151K680L2800I2999K26048
13334C19047D9431J84899a48334B2979L57445A5173a76965B96886j05595R3878
13324B85169R563A10114L1282A2389d5983C84443a03207B05591K88127j69133
13314C24585P5274a87373E9028a22520A5544L31602i8661l2924E66807B36696
13303A80614j0613K21021A21760P4568J1466B9618d7706B20170f5583C26448A51833
$$ plain form
13291 309771 68762 -26540 530440 367432 62943 71004 -35759 95840 382197 146311 -11355
13279 299298 338141 -359976 -160080 343510 276551 -107910 158950 184785 284157 -176627
13268 -18922 389420 82145 163082 224713 165781 31628 -19260 106859 -106978 116068 23592
13256 -38548 332103 234315 64147 247072 344385 90272 49831 -186230 208340 58536 47983
13245 47983 105096 -112996 7192 106639 90958 171412 163502 -261403 53111 9343 298059 19265
13232 -356428 382112 220996 -50758 81754 74796 40345 -47870 155410 81894 104024 212024
13221 212024 297995 90763 -49579 -202378 179026 147296 -76847 -183690 -147516 -24292 281254
13209 -204839 -57776 443979 -17748 -61296 102518 130914 222479 -27975 -57840 -362099 -64752
$$ packed form
13291C09771F8762b6540E30440j63008F2943Q061c5759I5840K86357A46311a1355
13279B99298L8843c59976a60080C43510o6959a07910A58950K5835R9372a76627
13268a8922C89420H2145Q0937O1631n8932C1628a9260A06859a06978A16068B3592
13256c8548C32103r7788F4147J82925R7313I0272m0441a86230B08340E8536j0553
13245D7983N7113a12996G192R9447j5681Q0454p910b61403E3111I343K88716A9265
13232c56428C82112j61116e0758H1754o958l4451d7870A55410p3516K2130J08000
13221B12024Q5971I0763d9579j52799A79026l1730g6847j06843L6174b4292B81254
13209b04839e7776D43979a7748m3548A02518K8396R1565b7975k9865l04259f4752
$$ plain form
13197 298109 191942 73245 -150100 -100667 43021 349793 89770 -244364 293371 -353164
13186 173420 211196 -69474 63396 -295216 -35822 -232736 88559 -51287 44995 76965 -10872
13174 -69518 336699 161070 -54212 45881 387694 37665 -144737 -179690 47058 153436 -29454
13162 -69567 95708 -99928 -155140 -36302 293438 -65566 -43952 141892 269287 79774 -272851
13150 26900 174170 -117823 347711 -106453 -150712 242019 -19161 -90443 -43276 147249
13139 -253803 -130121 -7906 -73687 -235033 -114152 99766 -272329 4477 105731 162256 -40646
13127 -243199 -148500 301005 -129705 85740 269172 71029 204119 250871 17737 -101924
13116 152600 258311 4044 396772 62375 51427 -223453 199096 -16714 140603 -190072
$$ packed form
13197B98109j06167G3245a50100M9433D3021L06772H9770b44364B93371c53164
13186A73420L7776f9474F3396b95216c5822j96914H8559e1287D4995L1970a0872
13174f9518C36699A61070e4212D5881L41813C7665a44737l4953D7058J06378b9454
13162f9567I5708i9928n5212c6302B93438f5566K1614A41892J27395G9774b72851
13150B6900J47270a17823C47711a06453m4259B42019a9161p1282d3276A47249
13139b53803J23682g906o5781j61346a14152I9766b72329D477J01254N6525d0646
13127b43199R4699C01005a29705H5740J83432G1029J33090M6752A7737a01924
13116A52600J05711D044L92728F2375j0948b23453A99096a6714A40603a90072
$$ plain form
13105 352532 117712 151946 74485 -191174 4810 93657 225 -50397 -230840 316250 57367
13093 215193 -77908 -106268 29698 154747 232456 370604 -66152 20714 -132313 192984 -111907
13081 78085 -104374 -201563 8147 -39992 -117891 -49510 -211383 206463 313696 -18755 46168
13069 -192686 72614 232749 -1579 -93671 319485 185691 142456 33649 62184 37507 74530
13058 74530 28052 -10692 66292 -203145 219397 -176698 111563 109966 -181378 170271 -121289
13046 -38687 93651 -8551 23390 102365 245365 -755 29206 128151 169425 -302059 -172736 -198363
13034 -198363 121923 102600 52700 -7837 178118 231847 -148631 -338640 326388 -350351
13023 45021 -679 -126322 175021 24336 -89503 187534 -168318 -254785 6508 107421 104798
$$ packed form
13105C52532A17712L4234G4485a91174D810Q8847B25e0397j80443C16250E7367
13093B15193g7908k8360B9698J25049P7709J38148f6152B0714a32313A92984a11907
13081G8085a04374r7189H147c9992p7899d9510j61873B06463J07233a8755D6168
13069a92686G2614J60135a579r2092C19485j33794m3235C3649K8535k4677L7023
13058G4530B8052a0692F6292b03145B19397a76698A11563j597a81378A70271a21289
13046c8687I3651h551B3390P8975J43000g55B9206R8945M1274c02059J29323k5627
13034a98363A21923j9323m9900g837A78118N3729a48631j90009C26388c50351
13023D5021f79j25643A75021B4336h9503A87534a68318q6467F508J00913k623
$$ plain form
13012 104798 17953 -72895 173950 144422 553433 -99823 -19700 95428 21543 101150 193013
13001 193013 121180 75274 -56416 401538 -246070 -147431 24009 78893 -45835 28230 -127697
12989 45650 -119573 -14757 -112057 78141 218895 -67872 -8284 -99097 -263301 -197754 -13989
12977 145369 134431 33771 12020 100883 -97454 -227356 -82500 129557 59656 114845 45393
12965 50542 18303 -166310 32409 51182 -21573 -84193 219588 193672 -116150 148233 10571
12953 -38850 74307 -216276 203749 315658 -132256 14615 52714 17147 212684 -191549
12942 20116 -102999 257792 77800 -144042 121971 390365 -174663 35145 145805 173153
12932 173153 456358 -121766 -136841 -57730 74880 219707 172927 124117 -92121 -7557 -77749
$$ packed form
13012A04798A7953g2895A73950k9528M09011i9823a9700I5428B1543P9607R1863
13001A93013p1833m5906e6416D01538b46070R8639B4009N4884d5835B8230a27697
12989D5650a19573a4757r7300G8141J40754f7872h284r0813j64204O5547a3989
12977A45369j0938C3771A2020Q8863i7454j29902h2500A29557E9656N5189D5393
12965E0542A8303a66310C2409J8773b1573o2620B19588k5916a16150A48233A0571
12953c8850G4307b16276B03749J11909a32256A4615L8099A7147J95537a91549
12942B0116a02999B57792G7800a44042A21971K68394a74663C5145J10660K7348
12932A73153K83205a21766j5075e7730G4880J44827m6780m8810i2121g557p0192
$$ plain form
12921 -77749 421910 -253433 153845 56892 -147812 367670 -243014 -109384 -46642 67559
12910 -202640 158942 68162 191141 -232993 -243641 47903 253595 -78658 27588 -72038 -216602
12899 -216602 151183 -330882 -273221 250315 -12130 -176293 -39831 -223768 83677 -27657
12888 347171 -245003 23153 -69631 242657 229340 -69473 18160 -216857 155482 -291008
12877 -94586 -308966 -225358 -21191 -298565 -12665 15578 131971 144828 76828 35652 96770
12866 96770 -186608 119280 61027 49260 106190 -76541 3915 184122 -453770 29766 29777 -125515
12853 -122705 -133701 -50794 50158 -172302 -31462 190789 131908 -59147 -176957 67582 -28198
12841 -2095 -23445 -50827 74153 81166 182211 33154 -392685 -8876 -43956 113302 89325 -183615
$$ packed form
12921g7749D21910b53433A53845E6892a47812C67670b43014a09384d6642F7559
12910b02640A58942F8162J22979b32993j0648D7903K05692g8658B7588g2038j44564
12899b16602A51183c30882N7661B50315a2130j64163c9831j83937H3677b7657
12888C47171b45003B3153f9631B42657j3317f9473A8160b16857A55482b91008
12877i4586k14380Q3608b1191k77374a2665A5578J16393J2857o8000C5652O1118
12866I6770a86608A19280n8253j1767N6930g6541C915J80207d53770B9766J1a25515
12853a22705j0996e0794E0158a72302c1462A90789n8881e9147j17810F7582b8198
12841b095k1350k7382G4153P013J01045C3154c92685h876l5080A13302k3977a83615
$$ plain form
12828 75860 186779 81351 -204393 -120296 -251892 244748 33695 -316640 363461 -53896
12817 104201 -214305 -117600 146342 -72191 129576 136573 -130372 123172 -130363 -106742
12807 -106742 103867 -48085 58552 282591 -240056 -99179 65800 -48346 59725 -94238 200912
12795 90616 -358908 14817 -52156 41091 192290 -38030 -340430 66999 106261 196408 147
12783 168444 -4867 29066 33305 114878 -16984 -119374 47758 -191073 -45117 -183837 60187
12771 -152745 1639 186874 -207121 -23210 -415454 -55940 -37992 36658 238970 -418214 -396417
12760 -396417 8277 102558 57653 -152407 121576 -48070 87620 -119886 -158421 175944 16227
12748 221939 -1564 -104344 181849 -477269 -390815 -248692 331639 193484 164032 -363149
$$ packed form
12828G5860J10919H1351b04393Q4097j31596B44748C3695c16640C63461e3896
12817A04201b14305R6705A46342g2191A29576O997a30372A23172a30363K3621
12807a06742A03867d8085E8552K24039b40056i9179F5800d8346E9725i4238B00912
12795I0616c58908A4817e2156D1091J51199c8030l02400F6999L9262R0147A47
12783A68444d867B9066M239Q1573a6984j02390D7758a91073d5117j38720F0187
12771a52745A639J85235b07121b3210l92244e5940J7948C6658K02312d18214K1797
12760c96417H277R4281m4905a52407A21576d8070H7620a19886l8535A75944A6227
12748B21939a564j02780A81849d77269Q6454J42123C31639j38155k9452c63149
$$ plain form
12737 -124470 120622 -118622 -8198 -92215 36072 -32738 144334 -93918 124700 -96323 -314172
12726 -314172 -144513 111888 78930 -191673 -44238 71415 121574 294026 149111 200895
12716 200895 -68141 142974 64392 283237 -145707 348100 -205929 -123654 -113185 -175020
12706 -175020 -81034 61079 -193497 280033 -277576 -159874 -147306 -175467 717 352403 -186794
12694 296440 -82236 190438 -149694 -28071 -49550 -135222 255650 45770 -20502 -59097 36144
12682 -42513 83796 -296209 292315 -330757 22379 -11779 -9355 165634 68480 10617 10145
12671 10145 -173034 33858 95620 140932 -34906 -98095 144059 178169 -94016 297486 97306
12659 126243 -110861 -27270 59428 -22688 151401 143605 -61893 -114624 -206196 212976 247145
$$ packed form
12737a24470A20622a18622h198q4017C6072c2738A44334i3918A24700i6323k17849
12726c14172a44513A11888l2958a91673d4238G1415N0159J72452j44915N1784
12716B00895f8141A42974F4392K18845a45707C48100b05929Q2275J0469o1835
12706a75020h1034F1079a93497B80033b77576J17702J2568k8161G17L51686a86794
12694B96440h2236A90438a49694b8071k1479q5672B55650D5770b0502l8595C6144
12682d2513H3796b96209B92315c30757B2379a1779K424A65634F8480A0617m72
12671A0145a73034C3858O1762M5312c4906o3189A44059L4110i4016B97486I7306
12659A26243a10861b7270E9428b2688A51401p796f1893n2731r1572B12976L4169
$$ plain form
12648 247145 -147051 228162 184688 240669 -173763 -18118 -212695 109740 -154501 333560
12637 210333 -56582 305401 -83767 74395 8642 311202 125031 258254 109018 170253 218612
12626 218612 112145 -96314 170119 327850 39463 282389 218820 143005 -102625 -8860 128354
12614 -138974 74966 -161087 184597 -139247 -15824 -51299 154829 99942 -72863 39120 -240008
12602 190076 13253 -11316 227930 524150 327480 -12977 298666 114592 -21982 99045
12591 136522 57526 -116289 -215635 -316709 -163349 316045 -130737 -46881 -92647 -272348
12581 -272348 -97886 -305695 -295381 -331951 -75926 -47369 -15052 256507 -303981 109156 -192214
12569 -146089 -40284 268893 -91544 132422 -564464 -103871 46171 -227158 38775 -82278
$$ packed form
12648B47145a47051B28162m3474N5981a73763a8118j94577A09740a54501C33560
12637B10333e6582C05401h3767G4395H642L02560A25031J33223A09018O1235M8359
12626B18612j06467i6314A70119J57731C9463K42926o3569p5815a02625h860A28354
12614a38974G4966a61087A84597a39247a5824l5475A54829n4887g2863C9120b40008
12602A90076A3253a1316B27930K96220j96670a2977B98666A14592b1982I9045
12591A36522E7526a16289r9346j01074J53360C16045a30737d6881m5766j79701
12581b72348i7886k07809J0314l6570g5926K8557a5052B56507c03981A09156a92214
12569a46089d0284B68893i1544A32422e64464a03871D6171b27158C8775h2278
$$ plain form
12558 -144040 5321 17735 90426 127920 -244375 -35604 124949 -319082 267394 -124906 61646
12546 52967 82825 82363 172872 28338 73972 -239817 192436 -204743 -96400 -34140 58611
12534 148274 219851 42594 -154832 82149 110597 -94678 3484 -207843 347456 101646 8144
12522 -69838 201311 88592 -45952 189247 68149 430217 -15888 17052 85021 182818 193918
12511 193918 -151364 287460 24951 164132 71736 -308690 -152012 -17266 -63212 69940
12500 -13199 2385 -79114 132068 -184873 5617 -352728 45786 17253 209817 -175831 36895
12488 110130 11839 -23382 233886 -69946 132799 1806 69768 -177336 -66233 4528 -91788
12476 36658 275419 46342 -13971 367372 -125614 121720 -49993 22216 -375021 -218636
$$ packed form
12558a44040E321J2414P2691L7494b44375c5604A24949c19082B67394a24906F1646
12546E2967K9858m62R0509B8338M5634b39817A92436b04743i6400c4140E8611
12534A48274P1577D2594a54832H2149K8448i4678C484b07843C47456A01646H144
12522f9838B01311H8592d5952A89247F8149L62068a5888A7052O7969R7797J1100
12511A93918a51364B87460B4951J39181G1736c08690a52012a7266m5946F9940
12500a3199B385g9114A32068a84873E617c52728D5786A7253J92564a75831C6895
12488A10130A1839b3382B33886f9946A32799A806O7962a77336f6233D528i1788
12476C6658K38761D6342a3971C67372a25614A21720d9993B2216c75021J56385
$$ plain form
12466 -218636 -181892 -380931 190013 -8161 15840 -207000 179326 -30234 -36918 20806 -400026
12454 97150 84285 -21650 -311128 -272862 24173 21469 -74718 100453 -380267 398635 -267015
12442 88853 -268501 -39732 -4385 115472 -29434 167793 9000 -29726 24958 55053 -92165
12430 -169026 -239727 -19966 -143707 -94267 55790 -210686 -207763 59259 -188531 -222933 142549
12418 94169 -149452 33861 -86724 69729 -100516 -82907 -4634 123020 115735 -340319 19569
12406 200691 -352456 141316 -447547 190434 -95631 148793 -17211 20880 65285 -160741
12395 -186918 179502 -204218 -93451 285078 151877 -44668 -176199 -159851 -227101 149497
12384 -6769 -19047 189957 24067 -140656 -86943 -415995 -277113 439836 -88738 -26442 -9305
$$ packed form
12466b18636L6744j99039A90013h161A5840b07000A79326c0234o684B0806d00026
12454I7150j2865b1650k89478L8266B4173k704g4718A00453c80267C98635b67015
12442H8853b68501c9732d385A15472b9434A67793I000b9726B4958L0095i2165
12430a69026p0701a9966j23741M9440E5790b10686K923E9259a88531l4402A42549
12418I4169a49452C3861h6724F9729a00516J7609d634A23020p285c40319A9569
12406B00691c52456A41316d47547A90434i5631A48793a7211B0880M4405a60741
12395a86918A79502b04218i3451B85078j33201d4668j31531J6348o7250A49497
12384f769j2278A89957B4067a40656N3713l29052J38882D39836h8738b6442i305
$$ plain form
12372 -217223 69482 178204 -58931 -230532 205928 66275 -162073 90213 256328 -243337
12361 94376 -508900 -30527 -365605 412681 -223181 200957 17629 21911 -60426 -88689 276949
12349 -14896 -183516 88408 -34613 -6551 -44924 -280641 121290 22079 204259 203486 -172826
12337 23686 -138217 -23911 69465 10516 -174047 303358 -72157 -170451 168921 -179738 -35726
12325 145091 41116 26781 75364 148896 42911 -57782 -114103 158237 24836 -63847 338805
12313 130760 80646 164713 -862 110758 -97124 261472 98665 -5379 185468 -138864 -87031
12302 -87031 -201321 -39313 91116 60816 244863 193355 203017 -3593 136178 -99937 306430
12290 -203770 -348024 71129 -5062 -30843 -169823 158549 182021 -150470 -110812 -17629 -206020
$$ packed form
12372b17223F9482J08722e8931j71601B05928F6275a62073I0213J66115b43337
12361I4376e08900c0527l35078D12681b23181B00957A7629M282f0426k8263B76949
12349a4896j68620H8408c4613f551l8373k35717A21290B2079J82180p73a72826
12337B3686a38217b3911F9465A0516a74047C03358g2157r8294A68921a79738c5726
12325A45091D1116j4335M8583P3532D2911e7782n6321A58237B4836f3847C38805
12313A30760n0114Q4067h62A10758i7124B61472I8665e379A85468a38864N1833
12302h7031j14290c9313I1116l0300J84047n1508R662c593A36178i9937C06430
12290b03770j44254G1129e062k5781j38980A58549K3472a50470L9658a7629j88391
$$ plain form
12279 -206020 60848 -23245 -72038 -6470 -24667 15116 -47557 -30036 -77369 -152066 392568
12267 83269 102568 -64239 -27576 -117624 95037 220531 65762 248527 131908 102918 -211538
12255 302640 36278 -210213 147847 30932 76611 -166997 14508 -307275 354884 205025
12245 205025 -39630 75408 215004 -154615 87065 -13482 -53110 -84101 128520 -2295 -70691
12234 -70691 85424 -154944 -46466 222183 29652 275675 13748 43800 171712 288688 1478
12222 426279 337744 157657 78409 203661 241815 403878 166822 53367 112627 71222 54912
12211 54912 109577 223678 96402 -23958 -101259 134833 63594 75636 433289 234115 108001
12199 70226 -38291 200315 157842 142205 150882 400802 414766 285279 255426 36886 45585
$$ packed form
12279b06020F0848b3245m8793f470j8197A5116d7557J7521m7333p4697C92568
12267H3269J9299f4239b7576r0048I5037J25494F5762J82765j16619k8990b11538
12255C02640C6278b10213A47847C0932M5679a66997A4508c07275C54884j49859
12245B05025c9630G5408J39596a54615H7065a3482l9628l0991A28520b295o8396
12234g0691H5424a54944d6466B22183B9652K46023A3748L0052J27912J16976A478
12222D26279q8535A57657G8409J25252L8154J62063A66822E3367N9260m1405j6310
12211E4912N4665J14101I6402b3958p7301A34833F3594J2042L57653j99174A08001
12199G0226c8291B00315m2473j5637Q677K49920J3964j29487k9853C6886Q699
$$ plain form
12188 45585 212227 326183 114784 224335 64463 345993 -109240 -90255 278745 -173662
12177 217099 -11098 340798 67878 -33151 100763 153154 49723 131105 214440 175518 354
12165 199330 188573 -23969 -6418 81409 182307 320326 273771 42987 -351110 -76902 49 -336311
12152 -42142 -60517 26323 -29491 143882 9721 -351091 173696 122502 45424 -38218 174534
12140 82186 36074 -201816 -132455 107958 103053 191087 -34803 -22546 168171 -296333 20093
12128 351136 -188124 -10512 -187087 151916 184301 -63980 -188933 -210396 149269 106796
12118 106796 56160 -5212 212301 -288323 -76820 214615 76664 308486 -225252 204707
12107 -139050 17789 -243 351105 -57125 180487 129574 -161706 -23360 -76426 208384 64166
$$ packed form
12188D5585J66642J13956A14784J09551F4463K81530a09240J8985B78745a73662
12177B17099a1098C40798F7878c3151A00763N2391D9723Q1382Q3335l8922C54
12165A99330j0757b3969f418H1409J00898J38019m6555D2987c51110g6902D9c36311
12152d2142j8375B6323b9491A43882I721c51091A73696n1194D5424c8218A74534
12140H2186C6074b01816O9361A07958m905Q8034c4803J2257A68171b96333B0093
12128C51136a88124a0512j76575A51916L2385f3980j24953k1463A49269m2473
12118A06796n0636e212B12301b88323g6820B14615G6664K31822b25252B04707
12107a39050A7789b43C51105e7125A80487n0913a61706b3360n3066B08384F4166
$$ plain form
12095 -71195 -261840 -257425 11088 184906 -276771 258667 -35810 143838 -242266 -69001 -174465
12084 -174465 194705 -127687 59983 49610 164505 6953 48030 -219445 212641 -8305 -167515
12073 -167515 288176 -227180 64338 165625 -46592 -306341 -159297 -7435 37955 -104452
12062 -213358 -278837 -192934 205603 -98561 103462 11933 268705 166545 -17188 140468
12051 271363 -163720 -179246 331770 -141706 206265 20149 120759 -23641 -140755 -175141
12041 -175141 -258661 50996 34022 234564 -21420 19316 6659 -274349 -67030 -180014 164068
12029 -169697 36458 133532 -159153 -30560 -117038 -15555 104154 18387 -82594 -69533 78465
12017 -12355 219397 -20970 58204 193428 57457 -13888 38994 38226 932 17542 -165676 91938
$$ packed form
12095g1195j90645M415A1088J73818b76771B58667c5810A43838b42266f9001j05464
12084a74465A94705a27687E9983j0373J14895F953M1077b19445B12641h305j59210
12073a67515B88176b27180F4338J01287d6592k59749J47044g435C7955a04452
12062b13358o5479Q5903B05603i8561A03462A1933K56772j02160a7188A40468
12051B71363a63720j5526C31770a41706B06265B0149J00610b3641j17114l4386
12041a75141q3520E0996j6974K00542b1420A9316F659b74349f7030j12984A64068
12029a69697C6458R7074a59153c0560q6478a5555A04154A8387h2594J3061G8465
12017a2355B19397b0970E8204J35224E7457a3888C8994p68I32J6610a65676I1938
$$ plain form
12004 -209656 19219 -172647 47432 -14766 -203163 -195160 -207478 -92353 -106707 11226 -173907
11992 -187404 83341 123948 11180 -210846 72308 26185 5054 32781 -80939 -141259 -215037
11981 -215037 21038 144864 -126977 -84577 76831 -251110 -127958 -207401 204062 146403
11971 146403 121267 -35362 242838 -112941 113415 201373 -9491 -18996 -75011 -75754 -259502
11960 -259502 -114803 -15823 -147801 124962 161299 137376 -22145 1680 -147036 -265456 71661
11948 23812 -37639 -4196 -270682 -206892 -167865 -15559 -94329 54611 -94223 -1891 -253941 -125941
11935 -314164 -192889 -11561 -32739 111183 -25565 89024 -49000 -170926 -7206 4433 73138
11924 73138 41769 12833 -61212 103725 101424 165569 126241 -15436 -21915 -300870 -79 -187687
$$ packed form
12004b09656A9219a72647D7432a4766j88397Q003j2318i2353j4354A1226a73907
11992a87404H3341M0607A1180b10846G2308B6185E054K7727h0939o0320p3778
11981b15037B1038J23826a26977M2400G6831b51110J23152p9443B04062n7659
11971A46403k5136c5362B42838a12941A13415Q7958i491r505n6015p43j83748
11960b59502a14803a5823j31978A24962L6337k3923b2145A680a47036j18420G1661
11948B3812c7639d196k66486O3790L9027a5559p8770E4611i4223a891k52050a25941
11935c14164J21275a1561k1178A11183b5565H9024d9000j21926g206D433O8705
11924G3138l1369A2833f1212A03725k301O4145l9328a5436o479k78955g9j87608
$$ plain form
11912 -187687 8925 248045 -191155 -175895 232122 -64217 -141504 32119 -43160 -12388 -114698
11901 -114698 91763 -200338 162255 -102807 166396 -191714 -251866 -237789 79228 -277869
11890 -116097 2194 -1794 -271181 -30948 -23375 178883 14336 43487 125117 -63012 158889
11878 -187373 -108457 -384310 14681 -24114 33509 -99776 105351 -94132 8016 239225 -316597
11866 305673 -394921 63862 7300 -84374 179062 -82269 -176419 -114497 -39112 -156592 -35564
11854 -24829 -106272 -83884 -289896 182905 132257 -42619 247277 -88043 -139629 53289 -24278
11842 -25633 -273454 -77458 -157571 -36082 -275911 211329 109229 -50774 207471 107458
11832 107458 38374 -93641 -81680 -240821 -139939 -99567 -12206 -51493 -92761 -51049 -270610
$$ packed form
11912a87687H925K39120a91155J5260B32122f4217p7287C2119d3160a2388j02310
11901a14698I1763b00338A62255a02807A66396a91714o0152J4077G9228b77869
11890a16097B194a794k69387c0948P573A78883A4336K9151Q1630f3012A58889
11878a87373P8916k75853A4681b4114C3509i9776A05351i4132H016K31209c16597
11866C05673c94921F3862G300h4374A79062h2269r4150O1922c9112j17480c5564
11854b4829q1443K2388k06012A82905n0648d2619B47277h8043n1586E3289b4278
11842b5633k47821g7458q0113c6082k39829B11329j02100e0774B07471j00013
11832A07458C8374i3641J1961j59141J00882M0372a2206l9287m1268M1712k19561
$$ plain form
11821 -270610 -45882 -74889 78878 -59107 -53223 -281751 109285 -119412 -38104 -187883 60380
11809 -165724 159744 -256296 -183810 -140921 290132 -478742 99534 -48763 -255226 -55066
11798 72239 -246790 -76773 131127 4661 -309163 119987 -78473 -72817 373025 -269460 -433717
11787 -433717 111977 -23940 15497 -287304 -74718 214512 -128333 -48960 151760 -111782
11776 124534 1877 -72500 -260620 -216303 78729 -272182 -178951 248726 157414 -27095 104757
11764 -74831 88237 -10670 17437 -218980 112022 7059 -269129 -179430 -270353 87837 63046
11753 63046 152493 -286555 348789 149169 48198 101900 -227298 83024 186680 95448 -129321
11741 -54455 55093 3004 -115668 -181261 240897 207969 -331824 -150373 -63436 112805 -97846
$$ packed form
11821b70610d5882k9007G8878e9107N884k28528A09285a19412c8104j49779F0380
11809a65724A59744b56296P2486M2889B90132d78742I9534d8763k06463e5066
11798G2239b46790g6773A31127D661c09163A19987g8473N656C73025b69460j64257
11787d33717A11977b3940A5497b87304g4718B14512a28333d8960A51760a11782
11776A24534A877g2500j88120M4317G8729b72182R3231B48726r1312b7095A04757
11764g4831H8237a0670A7437b18980A12022G059b69129Q9699r0923H7837k4791
11753F3046Q9447b86555C48789A49169D8198N3702b27298H3024J03656r1232a29321
11741e4455E5093C004a15668o5593B40897l2928c31824a50373f3436A12805i7846
$$ plain form
11729 122323 111107 -251418 -306602 117899 -42171 -148348 -404367 -20120 -154073 -75216
11718 163811 -345401 -20954 -330081 146136 -89142 -146341 282361 -128866 28189 196629
11708 196629 14179 -63784 -4342 -75981 96004 -113490 -282529 55591 -69056 -266842 -213955
11697 -213955 -60366 -117974 -171434 88709 -121175 -137160 -8696 -82110 148852 -296221 -108464
11685 -100010 -105114 -120421 -48634 57934 33961 11192 -120611 -140640 58496 3152 -192720
11673 -76970 124375 24858 -41305 -35728 97403 211228 -181516 282161 -124864 -237805 -119132
11662 -119132 78812 216408 -28773 27472 -121795 306454 -35593 -122472 -63481 -134600 -127750
11651 -127750 -78519 -498979 -341053 86717 -79316 118658 -61886 -167928 -372534 3200 -296060
$$ packed form
11729A22323j1216b51418n5184A17899d2171j06177k56019b0120j33953g5216
11718A63811c45401b0954l09127A46136h9142n7199B82361a28866B8189J68440
11708A96629A4179f3784d342p1639I6004a13490j69039E5591f9056j97786N2887
11697b13955f0366n7608n3460H8709a21175j5985h696p3414A48852b96221a08464
11685a00010n104j5307d8634E7934k3973A1192a20611k0029E8496C152a92720
11673g6970A24375B4858d1305N577I7403J13825a81516B82161a24864j12941J18673
11662a19132G8812J37596b8773B7472a21795C06454c5593q6879N8991p1119O850
11651a27750M9231m20460J57926H6717g9316A18658f1886j06042k04606C200b96060
$$ plain form
11639 236610 25408 433326 6614 67687 131295 185051 -230924 228353 -72391 143096 267553
11628 267553 106383 -293378 10000 138652 248690 40819 27702 -18954 -137249 -122693
11618 -122693 -153444 -74131 399520 26777 -151220 -327188 81629 -132602 -289405 94730
11607 -98083 46009 14938 49954 105386 64817 216598 -106834 78405 -87796 234449 -14099
11595 -47576 39396 -203476 5183 -59542 307506 156112 -47859 -77132 79914 -21784 189332
11583 376366 -16586 16738 115288 247005 165891 -40076 -29073 -62935 -53222 -145270 122271
11571 141732 218548 105046 52151 31722 -23534 -191715 -29263 145899 -10042 215574 -159662
11559 -40677 392815 -192392 -18250 16481 611905 59151 134822 5822 290334 -390561 -44238
$$ packed form
11639B36610B5408M07918F614O1073O3608N3756b30924B28353g2391A43096J24457
11628B67553A06383b93378A0000J28652J10038D0819j3117a8954j18295J4556
11618a22693l0751g4131C99520B6777a51220j75968H1629a32602j56803I4730
11607i8083D6009A4938L5016N5432m0569J51781a06834G8405h7796B34449a4099
11595d7576C9396b03476E183e9542C07506j51394d7859k9273G9914b1784A89332
11583C76366a6586A6738R8550J31717q1114d0076J1003l3862R713r2048A22271
11571A41732P6816A05046E2151k0429b3534j68181b9263A45899a0042B15574a59662
11559d0677C92815a92392a8250A6481N95424E9151P5671E822K84512c90561d4238
$$ plain form
11547 -127532 -238450 205362 -64819 -286641 554395 -173692 407281 90998 260780 -381217
11536 -216561 281238 43333 -190855 23946 298934 149055 15821 -306540 145418 129698
11526 129698 160749 234494 174534 49036 307074 -163286 -226334 10681 200123 438277 97735
11514 150371 -93867 98225 -75149 83870 264253 -322532 243695 -150976 -91395 102225
11503 -213057 289652 175521 68272 -108364 59879 268865 152743 37208 -53457 330890
11492 416131 -118942 46644 -312411 97331 258762 98944 -50654 199539 252740 201372 108994
11481 108994 201768 -111369 -25093 95669 133739 -40871 335864 -2825 273392 -54810 -141007
11470 -141007 91834 243321 -111090 167626 179801 316816 85178 311455 111536 -45687
$$ packed form
11547a27532j10918B05362f4819k21822E54395a73692D07281I0998J69782c81217
11536b16561B81238D3333a90855B3946K74988A49055A5821c06540A45418j5720
11526A29698L1051P3745n9960D9036K58038a63286o3048A0681J89442K38154I7735
11514A50371i3867I8225g5149H3870J80383c22532B43695a50976N9581A02225
11503b13057B89652j14131F8272a08364E9879K08986j16122C7208e3457C30890
11492D16131a18942D6644c12411I7331J61431I8944e0654A99539N3201n1368r2378
11481A08994R2774a11369b5093I5669L8070d0871C35864b825B73392e4810q6197
11470a41007I1834J51487a11090A67626J2175J37015H5178K26277A11536d5687
$$ plain form
11459 40234 60864 172644 41151 31659 309898 -7065 246817 203464 129019 261937 -141242
11447 -30860 -221632 306314 91179 -98380 235613 -1846 -84232 92988 174104 190485 14800
11435 133836 2122 245880 210959 31029 65738 223324 98970 -268208 303182 187583 139079
11424 139079 449808 -139346 150535 153752 -250455 -167846 17621 -4125 258507 -179364 -87303
11412 13744 -64241 -118791 -241238 -293081 -85436 89492 -62946 307977 9621 118674 152587
11401 152587 291931 -125622 -206964 -14328 -165733 12254 -279157 -112461 439036 91940
11390 -255336 -85411 142598 -329524 285260 -168368 -238216 177424 -88457 -62321 102099
11379 -136210 -408872 -213539 -196054 95174 -257344 -74682 209220 -73190 -57702 -142526 -459887
$$ packed form
11459D0234K0630J11780D1151r492K78239g065B46817m3353p4445J32918a41242
11447c0860j90772C06314I1179i8380B35613a846q2386I2988Q1116J6381A4800
11435A33836B122K43758l4921C1029L4709J57586I8970b68208C03182j15599m8504
11424A39079L10729a39346A50535L217b50455Q2609A7621d125B58507a79364h7303
11412A3744f4241n4550j22447n1843h5436H9492f2946C07977I621J09053L3913
11401A52587J39344a25622q1342a4328j51405A2254b79157a12461D39036I1940
11390b55336h5411A42598c29524B85260a68368o9848A77424h8457K6136A02099
11379a36210k72662J95333J7485I5174b57344g4682B09220g3190J5488q4824l17361
$$ plain form
11368 -459887 -231752 83572 39490 31296 52020 -55104 -191764 -152000 -96481 -5723 -242192
11357 -242192 -287832 -178197 -135211 81120 -131566 -18976 -136508 -20759 -155102 73960 -183836
11345 -73438 202355 -40079 -155336 123013 -18645 -85299 -96406 -40212 82046 58568 198055
11334 198055 -222163 -260701 260111 -165015 -191599 101317 -138703 202371 118304 -40140
11323 221894 227234 58103 133558 -326533 -17605 27955 -57761 -58694 46061 -114633 -42032 8715
11310 283097 2882 124597 -90474 38948 -376599 -213343 -771 -341629 167703 -296528 -237276
11299 -237276 37637 -370235 198166 -81760 -88772 -108248 313073 -132184 218725 -98756 -217113
11288 -217113 205380 -279420 -245110 -124285 176524 -141688 -55968 163527 -79635 30266
$$ packed form
11368d59887K28135H3572C9490q194K0724e5104j36660L9764N5519e723k36469
11357b42192m5640J09635M2986H1120a31566a8976j17532b0759j34343G3960a83836
11345g3438B02355d0079j15257A23013a8645o6654j1107d0212H2046k3478J39487
11334A98055b22163l8538B60111a65015k6584A01317a38703B02371q4067d0140
11323B21894N340E8103P5455c26533a7605B7955e7761r33D6061a14633d2032H715
11310B83097B882J21715i0474C8948c76599J63256g71l40858A67703b96528N9252
11299b37276C7637c70235A98166h1760p012j9476C13073a32184B18725i8756j18357
11288b17113B05380b79420L4310J20825A76524a41688e5968A63527g9635C0266
$$ plain form
11277 -27472 -34222 -141954 -153889 61039 142420 -133002 -300043 109510 -76216 41857 92145
11266 92145 -191853 -199164 -254783 -154826 172553 -188278 5811 -85979 109799 -137422 -348953
11255 -348953 303551 -278441 -168073 292300 370359 -82943 -99200 -184125 -158129 -210196 140058
11243 49917 -128551 61286 -62037 139311 -319297 29881 -233015 13096 11091 -420800 264244
11231 2661 -24761 -55068 60504 -171921 -60711 -88239 6850 8827 67006 107993 -206187 -262912
11219 -262912 -184206 -37946 -131142 -13064 -53778 129566 -270723 28221 -260447 -12590 305735
11207 -181427 -40153 80886 39382 245882 -100588 -43214 -119862 -73007 36176 157021 116575
11196 116575 -16587 19961 -151699 47054 176084 14463 64781 77422 -131437 255566 -204300
$$ packed form
11277b7472o750j07732j1935F1039Q1381a33002j67041A09510g6216D1857N0288
11266I2145a91853p311n5619R9957A72553a88278E811h5979A09799a37422k11531
11255c48953C03551b78441J10368B92300P8059h2943j6257q4925K5996n2067A40058
11243D9917a28551F1286f2037A39311c19297B9881b33015A3096k005d20800B64244
11231B661b4761l0307F0504a71921f0711k7528F850J977N8179M0987b06187n6725
11219b62912P8706c7946r3196a3064m0714A29566b70723B8221b60447a2590C05735
11207a81427d0153H0886C9382K06500a00588d3214p6648M6855C6176J20845m0446
11196A16575a6587A9961a51699D7054J29030A4463N0318J2641a31437B55566b04300
$$ plain form
11184 -181767 -127786 -26194 125699 252111 -237309 31937 39055 76067 43301 18657 182449
11173 182449 -200861 -184477 -263389 -312824 -67554 174255 -303215 31890 -131749 -313865
11163 -313865 -92387 -42053 -35912 38893 -42337 -188851 -16350 -189423 -84767 -231541 -21183
11151 120523 76146 -311013 -169612 41288 80620 -11898 193387 -75827 -163219 -344663 -318140
11140 -318140 -14907 -105028 250974 -139277 66715 116870 283828 65191 -56557 55082 -254941
11128 445021 781 -100884 252499 -29320 3676 -119267 159753 315847 67478 146066 133389
11117 133389 -87892 189331 -187820 47088 -119513 -5934 22497 -158895 168912 46803 88789
11106 88789 91535 -250519 456184 489506 101109 379661 117409 218763 202059 -105535
$$ packed form
11184a81767N3981b6194A25699J26412b37309C1937P118L7012l2766A8657J63792
11173A82449b00861J6384p8912m9435f7554A74255c03215C1890a31749j82116
11163c13865i2387d2053O141C8893d2337j46514a6350j73073h4767j46774b1183
11151A20523m4377c11013J41401D1288L9332a1898A93387g5827q7392j81444K6523
11140c18140a4907r0121B50974a39277F6715N0155J66958F5191e6557E5082b54941
11128D45021G81a00884B52499b9320C676a19267A59753J56094F7478P8588j2677
11117A33389h7892A89331a87820D7088a19513e934B2497a58895A68912D6803M1986
11106H8789K746b50519D56184L3322A01109K78552A17409J01354j6704a05535
$$ plain form
11095 276326 486544 343366 -195235 81666 155451 172473 -37484 218225 145783 325744
11085 325744 -23669 362388 131104 23979 167414 210378 140511 -1346 339142 578258 419465
11074 419465 48779 264909 6589 420642 240415 543804 258357 451063 462525 233611
11064 233611 342751 144364 824527 309405 361227 716451 91651 947028 732946 514347
11054 514347 647788 702842 667189 582729 890531 451565 440957 724640 660118 363055
11044 363055 893443 815427 898947 645051 727816 855139 745333 1040658 692216 607490
11034 607490 739159 804564 893202 940905 386404 641235 816235 621846 950163 599370
11024 599370 682721 1036629 694678 614292 348185 228682 667607 539593 473178 611957
$$ packed form
11095B76326K10218j43178a95235H1666P3785J7022c7484B18225p2442J79961
11085C25744b3669C62388A31104B3979J43435M2964o9867a346C39142K39116j58793
11074D19465D8779K16130F589M14053j80227L03389B58357J92706J1462k28914
11064B33611J09140A44364O80163C09405N1822L55224I1651Q55377k14082k18599
11054E14347J33441N5054l5653q4460L07802m38966j0608K83683o4522k97063
11044C63055N30388p8016Q3520k53896Q2765J27323j09806K95325l48442q4726
11034F07490J31669O5405Q8638M7703C86404K54831J75000j94389L28317l50793
11024E99370Q3351L53908l41951q0386k66107j19503M38925j28014o6415J38779
$$ plain form
11014 611957 244948 519366 402860 726315 637145 441787 617674 550876 505871 977707
11004 977707 150515 543747 559407 812647 564374 466402 620336 809085 273956 712441
10994 712441 419014 599951 468224 807214 498871 836361 497719 890095 805594 744495
10984 744495 784137 1132565 667590 1180163 1232928 1044444 1582780 1380997 1337570 1952081
10974 1952081 2152631 2162009 2994964 3320276 3216085 3209844 3215353 3292004 2989089 2418038 1935534
10963 1935534 1652086 1413522 1438099 984793 969448 1243215 1184080 1046959 654081 1005461
10953 1005461 725363 963308 708105 672588 588751 637610 357253 201804 338812 352366
10943 352366 146033 150785 172370 -51673 172824 170736 162716 159429 242857 236066 171078 -18446
$$ packed form
11014F11957B44948K74418j16506L23455q9170j95358J75887o6798m5005M71836
11004I77707A50515L93232J5660K53240k48273r7972J53934J88749B73956M38485
10994G12441k93427J80937j31727L38990l08343L37490l38642L92376q4501o1099
10984G44495L9642L48428m64975N12573N2765j88484N38336k01783m3427O14511
10974A952081K00550R378Q32955L25312j04191o241N509P6651l02915n71051m82504
10963A935534k83448k38564K4577m53306j5345K73767n9135j37121l92878L51380
10953A005461k80098K37945k55203l5517q3837M8859k80357j55449J37008J3554
10943C52366A46033M752K1585e1673A72824k088q020l287Q3428o791o4988a8446
$$ plain form
10930 137711 135273 -38532 -242002 -46993 -88947 159375 97608 238772 533185 -49986 -282972
10919 -282972 -95500 -244026 -163473 -100132 15898 101527 -84429 20744 93659 -10348 106279
10907 -34272 -84827 -167466 -111061 54719 203583 28406 12098 -114183 -45581 87582 -159562
10895 -14768 204161 -196735 -152353 130514 -106590 -218308 -306430 52245 -118955 -183652
10885 -183652 -327771 -226997 -111359 -202954 -285393 127365 172518 331039 46365 110432
10875 110432 -63503 -73172 -143486 94317 -62037 143133 -23859 -97302 -13704 218191 81822
10863 -108757 63511 194867 -334584 981 40015 211968 -19644 100606 46875 -75895 -58068
10852 -58068 -76437 -155663 192081 108449 -279747 369429 -55780 -18059 104262 -77351 48799
$$ packed form
10930A37711k438c8532k03470d6993m1954A59375o1767J41164K94413d9986k32986
10919b82972i5500j48526Q0553O3341A5898Q5629h4429B0744P2915a0348A06279
10907c4272n0555q2639N6405E4719J48864B8406A2098a14183d5581H7582a59562
10895a4768B04161a96735M4382A30514a06590j11718q8122E2245a18955o4697
10885a83652j44119J00774a11359r1595q2439A27365M5153J58521D6365O4067
10875A10432f3503r669p0314I4317f2037A43133b3859p3443a3704B18191H1822
10863a08757F3511J31356c34584I81L9034J71953a9644A00606D6875g5895J7827
10852e8068j8369p9226A92081q3632b79747C69429e5780a8059A04262g7351D8799
$$ plain form
10840 88797 -28590 -137495 -175360 38238 -310483 -61489 -239446 -95468 -71043 -90148 -229478
10829 -229478 -51380 -80723 226179 90199 -128196 -94844 -145891 -114058 -7993 237395 -26471
10817 68380 -45070 68259 -112053 -54142 -56760 -70102 237553 131708 170022 -275400 -169336
10806 -169336 -47 22716 -279302 143451 -181562 62188 -166744 -340230 -245167 259034 -10022
10794 -187519 -127930 -33829 212619 -122066 134413 -339281 -119834 21437 -144437 7000
10783 7211 -134097 -67437 30312 155895 -81821 183860 -193545 -197681 -17029 -23264 -129606
10772 -129606 -182758 -62761 -176151 328186 280998 38541 -283441 -13184 -251515 258513
10761 -20679 -8053 187459 -224193 -47469 -121399 -335242 -287939 105392 8999 -292615 -134150
$$ packed form
10840H8797b8590j08905l7865C8238c10483f1489j77957i5468K4425j9105j39330
10829b29478e1380k9343B26179I0199a28196L3352n1047L1833g993B37395b6471
10817F8380d5070F8259a12053e4142k618j3342B37553j05845L8314b75400J06064
10806a69336d7B2716b79302A43451a81562F2188a66744j73486R5063B59034a0022
10794a87519N9589c3829B12619a22066A34413c39281a19834B1437a44437G000
10783G211a34097O6660C0312J25583h1821A83860a93545m136a7029o235j06342
10772a29606n3152f2761j13390C28186m7188C8541b83441a3184k38331B58513
10761b0679h053A87459b24193d7469p3930k13843M7303A05392H999b92615a34150
$$ plain form
10749 -114727 -74174 -49447 -52053 142303 65092 -133172 -153406 200691 207945 -42153 4667
10737 235014 -121538 104828 -2570 -89441 -270506 -243607 -216602 -129312 -100827 227577 -134350
10725 -166856 7006 203833 -162921 -289456 -54137 -157463 80301 172756 -233038 50252 -148707
10713 60584 83695 -262608 -546 -31820 -102628 -266890 -321243 -129493 -393582 -11178 -120835
10702 -120835 239446 118269 -197579 48932 -75051 -35077 -50689 138864 173394 115463 -97149
10690 -27026 -176838 169944 30761 -114556 -267051 29331 -241909 189558 50349 -72634
10679 -93967 -26617 -265687 39979 131689 -219014 -155980 -405281 -82904 -43030 -40402 -3571
10667 91236 34080 87721 245309 -248513 -85141 57441 114170 161990 210523 -58031 135562
$$ packed form
10749a14727M0553K4727k606A42303F5092a33172k0234B00691P254d2153D667
10737B35014a21538A04828b570q6871j81065K6899K7005Q7290K8485B27577a34350
10725a66856G006J96827a62921j26535e4137j03326H0301R2455b33038E0252a48707
10713F0584K3111b62608e46l1274p0808j64262n4353a29493k64089a1178j09657
10702a20835B39446A18269a97579D8932g5051c5077j5612A38864L4530n7931i7149
10690b7026j49812A69944C0761a14556j52495B9331b41909A89558E0349g2634
10679i3967b6617k39070C9979R1710b19014O3034k49301h2904L9874K628c571
10667I1236C4080N3641J57588b48513h5141E7441N6729M7820M8533e8031A35562
$$ plain form
10655 -195984 -74966 -234242 -328744 -167087 -108865 -378674 231015 -203229 -356449 -42988
10644 -303414 -102278 -11005 -127472 42130 201509 -206396 -133612 -168965 338974 -60825
10633 -282132 128836 294332 -68870 -7098 189583 385374 -430 -285901 374540 62557 179437
10622 179437 -24074 -70680 9067 63298 228265 -81236 235925 -124943 -39881 -284487 -139300
10610 36375 -47053 -154586 -486278 -185883 -53705 -52219 116186 -300039 8961 -207441 -117115
10599 -117115 -128028 -77275 -77619 194801 171213 -149755 53389 -152382 -94558 410918 187558
10587 75403 131323 -30082 -261835 269978 -89566 -132869 295489 -143709 -62488 129159 -94773
10575 282636 16272 -70715 -107556 -91609 -57983 -51856 -53731 -133590 30551 -348283 51227 224948
$$ packed form
10655a95984g4966j59276r4502J61657N8222k69809B31015b03229j53220d2988
10644c03414a02278a1005j16467D2130J59379b06396P2784l5353C38974f0825
10633b82132A28836J65496f8870g098A89583J95791d30k85471C74540F2557J16880
10622A79437b4074m6606I067N4231J64967h1236B35925a24943c9881k44606a39300
10610C6375d7053j07533l31692a85883e3705J486A16186c00039H961b07441R0326
10599a17115j0913N0753l44A94801k3588a49755E3389a52382N7824D10918A87558
10587G5403N5920c0082k31753B69978h9566m3303B95489a43709f2488A29159i4773
10575B82636A6272g0715l6841J5947L3626O127j875p9859C0551c48283E1227J73721
$$ plain form
10563 224948 10301 -279433 54568 108502 -241711 42909 -305762 -131808 -363673 284855
10552 15833 256358 213703 -362814 35667 -137852 -236529 -6584 -277812 62446 -215393 65628
10540 -159734 74468 -48516 44996 92958 38647 -74163 123127 -51993 108810 -244056 149191
10528 11567 -170392 5474 -150368 93829 -8722 129465 -28742 96633 -116124 104279 -99994
10516 47756 -93338 -98924 -219 132680 83572 -311702 -11248 13703 -46939 -297317 191265
10504 -196518 -172798 42470 -317518 -96477 -47719 -41434 45276 -68731 -79032 -133098 -35407
10492 192832 -329747 70005 137890 -397554 245874 -115843 -198647 -417904 -34375 -53667
10482 -53667 364443 -62148 354234 74785 258071 -14081 114790 -123291 -174828 88378 92811
$$ packed form
10563B24948A0301b79433E4568N3934b41711D2909c05762a31808k31865B84855
10552A5833K40525m2655c62814C5667a37852r8677f584k71228F2446b15393F5628
10540a59734G4468d8516D4996M7962C8647g4163A23127e1993A08810b44056A49191
10528A1567a70392E474a50368I3829h722A29465b8742I6633a16124A04279i9994
10516D7756i3338n586b19A32680m9108c11702a1248A3703d6939k50378A91265
10504a96518K3720D2470c17518i6477d7719O285D5276f8731j0301n4066c5407
10492A92832c29747G0005O7885c97554B45874a15843q2804k19257c4375j9292
10482e3667C64443f2148C54234G4785J83286a4081A14790a23291n1537H8378M433
$$ plain form
10471 92811 37171 -370811 270478 14831 -148206 -228647 192657 495001 -130239 -257537
10461 -257537 236570 -199652 60390 -100580 -246178 22312 -150280 -96963 -18235 -18777 -46540
10450 -46540 47979 -58698 -301855 -122985 -213603 42369 -18556 -174620 -177574 -172389 94118
10438 73879 -282854 -91881 -290902 -184410 -292354 -420472 367700 -100438 833 -81766 78866
10426 -72494 -20532 61419 110670 65658 -200623 167847 23012 -27786 -347236 -48515 99297
10414 -92385 119677 -102992 -121506 -182111 -164755 -283894 166669 242655 -290227 33594 -225963
10402 116998 -165383 7294 234929 267501 108035 59619 -40957 43038 -27380 293099 52636
10390 278572 162448 272530 152596 88689 72449 -106503 286887 284742 -214142 7535 401305
$$ packed form
10471I2811C7171c70811B70478A4831a48206q0441A92657L02344a30239j27298
10461b57537B36570a99652F0390a00580j45598B2312a50280N3317a8235n42k7763
10450d6540D7979e8698k43157a22985r0618D2369a8556j56064k954N185I4118
10438G3879b82854i1881j99021J06492j07944j28118C67700a00438H33h1766G8866
10426g2494b0532F1419M9251m5012b00623A67847B3012b7786l19450d8515I9297
10414i2385A19677a02992j8514o0605J7356j19139A66669P5986b90227C3594b25963
10402A16998a65383G294K27635L2572A08035m8416d0957D3038b7380B93099E2636
10390B78572j16124J10082j19934o3907j6240a06503B86887k145b14142G535L93770
$$ plain form
10379 401305 380103 354111 -14374 129275 306929 71612 12817 165117 25089 339430 631156
10368 631156 283425 425176 390402 523749 648745 627141 290368 355288 -213287 342608
10357 269298 252566 17451 135351 -15099 62499 197725 360444 689520 517143 567020
10347 567020 368944 250688 639590 289322 180889 142814 -22176 145354 147270 97779
10337 97779 -160448 177729 181415 86551 185011 77768 -12423 237587 47323 67448 -132917
10325 34638 70512 59098 93961 -35299 219061 475775 330206 367584 75144 -13932 -36499
10314 -36499 -51216 5679 85967 138847 20769 -187191 38604 -13073 -25103 89607 -800 98458
10301 30841 10144 -22335 -209632 62861 64710 -43920 -56222 336686 193887 192349 -96151
$$ packed form
10379D01305k1202k5992a4374A29275J77654G1612A2817J52300B5089L14341K91726
10368F31156B83425J41751l4774J33347J24996k1604B90368O4920b13287C42608
10357B69298j6732A7451J17900a5099F2499J35226J62719L29076j72377M9877
10347E67020j98076j18256L88902B89322j08433l8075b2176A45354J916m9491
10337I7779a60448A77729L686H6551R8460G7768a2423B37587D7323K0125a32917
10325C4638L5874j1414L4863c5299B19061K56714j45569L7378G5144a3932k2567
10314c6499j4717E679Q0288N2880B0769a87191C8604a3073j2030H9607h00I8458
10301C0841A0144b2335j87297F2861J849d3920j2302C36686j42799j538i6151
$$ plain form
10289 254275 -100839 -223789 -130947 -122869 -193464 -404002 169728 -149271 -331389 -296555
10279 -296555 -125460 -154567 -22678 -232569 254983 226371 -147567 21453 143525 -280582
10268 -72094 56846 -31168 -88551 -201577 -157105 6285 96082 -18796 -108798 211517 302370
10257 302370 196305 -86609 -123597 85399 -151716 38111 23219 -25780 86120 -512429 -96985
10245 427570 64169 100168 -180238 83035 -227030 165098 -188900 124330 58708 -269838
10234 -153413 -26557 -133715 -63507 66560 162722 96584 8505 -330878 -69149 76109 -93883
10222 -472189 -234845 -33976 -95270 7328 121925 -406128 12741 -87233 9183 -90623 45108
10210 -143905 65821 140567 -77521 -56733 -105843 -152946 -55904 -108698 -227791 1454 -36265
$$ packed form
10289B54275a00839j22950R2842Q078p0595k10538A69728a49271j82118L4834
10279b96555a25460k9107b2678k09891B54983k8612a47567B1453J22072b80582
10268g2094E6846c1168n7383j13026M4472F285Q9797a8796r0002B11517R0853
10257C02370j06065h6609l6988H5399a51716C8111j4892b5780H6120e12429i6985
10245D27570F4169L5999a80238H3035b27030A65098a88900A24330E8708b69838
10234a53413b6557j07158f3507F6560R6162o6138H505c30878f9149G6109i3883
10222d72189b34845c3976o1294G328J14597d06128A2741h7233I183i0623D5108
10210a43905F5821P4746g7521K0788m9110m7103e5904n2794j19093A454c6265
$$ plain form
10198 225440 -84531 260288 -283995 -224194 -166574 -235809 -281351 147239 -71948 18441 -180099
10186 -230426 78929 -211102 -140585 -24408 -15809 -8993 -233262 19636 184074 -364088 277553
10174 134004 -410359 131147 -73153 -30258 -54568 -74117 21156 166046 304071 -90709 -189796
10163 -189796 -248994 93481 -236602 -70009 29136 66037 9903 -77646 -260478 257953 -36775
10151 -179623 120736 68773 -176656 55825 -16062 -142472 -41736 -118415 -65272 -70706 127137
10139 -15073 -83324 16515 258257 79169 -265250 -290710 -128612 -125875 -103555 -92537 -77320
10128 -77320 -165832 168052 -59595 97713 -47860 -42677 -143237 60157 -292263 -277740 -296214
10117 -296214 -89998 -215897 -171190 -148608 -233351 -22564 -172833 270736 -12094 -156809 -10440
$$ packed form
10198B25440h4531B60288b83995N9801N7620o9235m5542A47239g1948A8441a80099
10186b30426G8929b11102P0517b4408Q599O816k24269A9636J64438c64088B77553
10174A34004d10359A31147g3153c0258k4310j9549B1156J44890J38025i0709r9087
10163a89796n9198I3481b36602g0009B9136L6901I903g7646j82832B57953c6775
10151a79623A20736n1963a76656E5825a6062j26410d1736p6679N3143n434A27137
10139a5073o8251A6515K41742G9169b65250k5460a28612K737K2320J1018J5217
10128g7320q8512A68052e9595I7713d7860N183j00560F0157b92263J4523j8474
10117b96214h9998j25899M4707K2582q4743b2564j50269B70736a2094j44715a0440
$$ plain form
10105 -266783 2707 150780 -34727 113866 -41782 -326700 -293359 -43067 42645 -104518 22312
10093 -40404 -135814 -122681 -107324 228720 -49853 -235847 -130485 54845 -4997 -305805 -96641
10081 -219514 -188441 -249700 -40548 -11759 25635 -11510 200845 -83509 -128156 -199246 -48564
10069 -164889 55922 -73625 1771 -208253 168938 87344 107024 152121 -188524 284645 -69360
10057 71481 161089 209013 19113 -19009 216878 -125774 -65975 25996 -340480 -158725 -280225
10046 -280225 126941 139790 -24079 391695 -324192 -226366 77526 117490 -216220 84850 21525
10034 914 21807 -275680 111402 -155786 -46405 299089 -28378 132811 -39420 -184437 -244344
10023 -244344 -5556 -80594 -67185 188167 -5434 -56279 159181 55361 -76007 141502 8444
$$ packed form
10105b66783B707J48073c4727A13866d1782k84918L3341d3067D2645a04518B2312
10093d0404r5410J3133J5357B28720d9853j85994J05362E4845d997l00808i6641
10081b19514L1073o1259d0548a1759B5635a1510B00845h3509m4647p1090d8564
10069a64889E5922g3625A771b08253A68938q1594J9680M5097a88524B84645f9360
10057G1481Q9608M7924A9113a9009B16878a25774N9799B5996c40480a58725j21500
10046b80225A26941J2849b4079C91695c24192R7826G7526L9964b16220H4850B1525
10034I14K0893b75680A11402a55786d6405B99089b8378A32811c9420j45017n9907
10023b44344e556p5038J3409A88167e434n0845A59181E5361g6007A41502H444
$$ plain form
10011 -155518 -19716 -192106 -180260 -101079 -113786 -161075 -227541 100429 97947 -27972 -108442
10000 -108442 -137850 81901 76652 -32735 -174305 278361 -179872 161215 -162084 49205 -10678
9988 -292557 -120802 -147234 -239883 -125832 -214023 115928 73836 -63572 43061 95822 -59742
9976 -40436 -2089 -98910 129710 136765 335583 -90242 -119597 19130 117220 -115456 -19134 218121
9963 -140742 8441 -154240 -107437 147599 -53158 -27535 89207 80877 -78564 175816 -74118
9951 -148060 -96674 33461 -198214 -160537 -260551 -34385 25885 61111 -126209 -90647 59183
9939 -55797 -371278 -188006 2609 162031 -313512 29346 -193041 -265157 -117780 -72870 -451838
9928 -451838 -149184 -323473 -42660 -113736 -246096 -92747 -108769 -36853 -232731 -204043 -236251
$$ packed form
10011a55518a9716j72390J1846P9181j2707m7289o6466A00429k482b7972q0470
10000a08442k9408H1901n249c2735j41570B78361a79872A61215a62084D9205a0678
9988b92557a20802k6432r2649J14051q8191A15928m2092f3572D3061N2761e9742
9976d0436b089r6821A29710P055J98818i0242k9355A9130R8090a15456a9134B18121
9963a40742H441a54240M6803A47599e3158K5623H9207q330g8564A75816g4118
9951a48060N1386C3461a98214L7677j00014c4385B5885L5226a26209L5562E9183
9939e5797l15481J83272B609J59422c13512B9346a93041p2116a17780M4910l78968
9928d51838a49184j74289d2660p1076j32360i2747j6022c6853j95878K8688l2208
$$ plain form
9917 -236251 -75779 127988 139162 12366 -258552 -196934 -207606 -91452 107038 -105219 -116505
9906 -116505 -54436 -27205 -175090 -212648 -124086 136453 217086 -380843 92800 -303920 -170115
9895 -170115 740 120700 27452 -73333 171549 -285699 52670 -34227 -132825 -188503 -229553
9884 -229553 -258852 78893 -57490 -125067 130272 103506 234294 -61717 -106496 -174283 -255141
9873 -255141 -83042 2138 -117275 275764 -69762 -418080 61822 -405097 254093 -85381 -125218
9862 -125218 -327050 -184972 -20334 247721 -54191 -187407 -180438 24766 -31444 -390433 24997
9850 -38985 66824 74197 -235214 -58301 70490 -404679 159166 -100247 -50748 -304948 92684
9838 -203886 21420 38436 81471 -140284 -240902 -123870 -318682 -174732 -128916 -124879 24148
$$ packed form
9917b36251g5779A27988J1174A2366b58552O1618j0672i1452A07038a05219j1286
9906a16505e4436b7205j47885l7558Q8562A36453Q0633c80843I2800c03920J33805
9895a70115G40J19960B7452g3333A71549b85699E2670c4227r8598n5678m1050
9884b29553k9299G8893e7490o7577A30272k6766J30788f1717m4779o7787q0858
9873b55141h3042B138a17275B75764f9762l48318F1822d05097B54093h5381l9837
9862a25218k01832J42078b0334B47721e4191j33216O969B4766c1444l58989B4997
9850c8985F6824P373b35214e8301G0490d04679A59166a00247M9499k54200I2684
9838b03886B1420J7016M3035a40284j00618J17032j94812J43950M5816M037B4148
$$ plain form
9826 40562 143086 -220496 -106704 -235731 4683 110188 92566 -45940 40116 122707 -162553
9814 -298508 -128259 24064 -159531 126429 246386 -189935 35292 74177 -358049 -275628
9804 -275628 -246270 -333795 231058 -117852 -119226 -58361 183981 104148 112277 13691 -412151
9792 -82794 75602 -134597 -478257 120457 61265 258489 49673 -503460 -243938 -55538 -296786
9781 -296786 -401550 67259 -160964 -131861 -32249 -8299 102723 12565 -75375 -618350 -112512
9769 126432 -34520 202820 255040 -191995 -37515 47195 140573 83376 146917 -269432 69222
9757 -9670 102634 -62908 160491 -21345 86031 346773 194284 -327510 -210010 -382899 -12711
9745 -151263 -301985 33125 26851 -115752 -101451 -45699 337983 -389431 -37238 -251762 37243
$$ packed form
9826D0562J02524b20496a06704j29027D683J05505j7622d5940D0116Q2591a62553
9814b98508a28259B4064a59531A26429J19957a89935C5292L8885c58049Q2421
9804b75628K9358q7525B31058a17852j374e8361A83981p9833Q129A3691d12151
9792h2794G5602a34597l43660A20457n9192J97224D9673e03460b43938e5538k41248
9781b96786j04764F7259a60964K9103c2249h299A02723A2565g5375n42975a12512
9769A26432c4520B02820N2220a91995c7515D7195R3378n7197O3541b69432F9222
9757i670A02634f2908A60491b1345H6031K60742j52489c27510J17500j72889a2711
9745a51263j50722C3125o274a15752J4301d5699C37983c89431c7238k14524C7243
$$ plain form
9733 -193567 -216539 -110725 33165 26134 -25571 -263849 -79414 98000 161358 -198859 -32778
9721 -181867 -201341 -8147 -306138 -30749 2976 -448255 -319503 -19959 -71482 120898 -153190
9709 111206 37566 6241 219216 -144371 79948 11863 -93340 -190824 -291645 10194 -143218
9697 -99498 58856 -144465 -142292 203444 -140457 -135715 110186 -79525 -187496 -5645 223856
9685 -246080 -53045 111855 -377796 -40769 97739 -142957 -20527 436188 22043 -97563 -7296
9673 -255592 210018 -207606 135977 -46326 -191280 -161794 -92729 159071 -278748 21246
9662 188843 -99607 99655 -155731 29515 -185409 -172625 172684 230765 -178578 38860 -119699
9650 -230163 18646 138686 97619 93230 -81553 -1336 -226868 -329608 -125987 47078 250114
$$ packed form
9733a93567k2972J05814C3165p031b5571k38278g9414I8000O3358a98859c2778
9721a81867j9474h147k97991c0749B976d48255J28752a9959n1523A20898a53190
9709A11206C7566F241K12975a44371G9948A1863i3340r7484j00821A0194a43218
9697i9498E8856a44465K173B03444a40457M742A10186g9525j07971e645B23856
9685b46080e3045A11855c77796d0769I7739a42957b0527D36188B2043i7563g296
9673b55592B10018b07606A35977d6326j44954K9486O9065A59071b78748B1246
9662A88843i9607I9655a55731B9515a85409J2784A72684N8081a78578C8860a19699
9650b30163A8646J20040m1067m389h1553a336k25532j02740a25987D7078K03036
$$ plain form
9639 250114 -71569 117408 -30792 111694 277213 401597 37110 -49572 141842 -245242
9628 -40593 -101243 -60658 177675 -379078 -116809 -307398 -92375 122893 -177117 -340641
9618 -340641 -144668 -54370 -126381 53554 -157013 -27009 139664 137395 143014 -155921 -345456
9607 -345456 -102066 21204 -157692 -113995 -25350 21255 -31179 -153767 -88692 4265 2584
9596 2584 -252483 -160337 56184 -29465 -141339 -158434 -81425 -313428 -275327 -221458 -18427
9584 -32434 -124591 -182214 220773 -338787 -576861 42838 -191131 -257340 155177 -17929 8016
9572 -259325 -83339 -119939 -305908 102864 238723 -444191 -74591 270211 -165965 140549
9561 -373063 -151197 50817 -191610 136527 -102668 -169304 -207155 15348 -102972 -18661 -108863
$$ packed form
9639B50114g1569A17408c0792A11694J65519J24384C7110d9572A41842b45242
9628d0593o0650M0585A77675c79078a16809j90589i2375A22893a77117j63524
9618c40641a44668e4370p2011E3554a57013b7009A39664k269N619a55921j89535
9607c45456a02066B1204a57692M3697b5350B1255c1179j22588O5075D265j681
9596B584b52483R2146E6184b9465j11874j7095P7009k32003L8101N3869a8427
9584c2434r2157n7623B20773c38787k38074D2838a91131o6209A55177a7929H016
9572b59325h3339l6600j85969A02864J35859d44191g4591B70211a65965A40549
9561c73063a51197E0817a91610A36527a02668o6636l7851A5348a02972a8661r0202
$$ plain form
9550 -108863 -185769 -255124 -195744 -123931 106584 86574 29416 27454 -238534 65688 -339609
9538 -10827 11754 -41438 -160018 38917 -61749 -263696 -56817 -408266 -174449 66987 -203491
9526 85111 -179207 -7676 131899 248450 111586 -334977 -66558 -58757 -153781 -105993 -296150
9515 -296150 -216579 268154 16659 -166937 109942 -223472 -23848 81080 -282247 78953 39715
9504 39715 -387906 -456768 -15192 -163957 -201629 -58838 -168840 -201618 -349100 -129035 134621
9492 2721 108787 60529 328733 -31950 116849 -173931 -260824 359865 98011 -158801 -9933
9480 -149237 122802 -144631 -106609 46115 -165351 -164500 110855 -152429 136043 -139582 10484
9468 -97405 -336201 45188 -47953 -36269 238060 -123670 -123534 -89528 116978 -82131 -37079
$$ packed form
9550a08863p6906o9355N9380P1813A06584k0010B9416j962b38534F5688c39609
9538a0827A1754d1438j18580C8917f1749k01947e6817l51449a74449F6987b03491
9526H5111a79207g676A31899J16551A11586c34977f6558P801r5024M7788j90157
9515b96150P9571B68154A6659a66937A09942b23472b3848H1080b82247G8953l9238
9504C9715c87906o8862a5192j48765l7672e8838j10002l2778j47482a29035A34621
9492B721J06066m8258K68204c1950A16849a73931q6893C59865I8011a58801i933
9480a49237A22802a44631L8022D6115a65351Q51A10855a52429A36043a39582A0484
9468i7405k38796D5188d7953J1684B38060a23670J36L4006A16978h2131c7079
$$ plain form
9456 204510 66875 -24611 -135928 148161 -6538 -280717 6552 270965 -46413 2641 -144231
9444 -161416 193776 84118 -183818 -232599 -20243 129499 -225054 -41893 -56609 -52463 -174437
9433 -174437 62331 -155291 -71324 92130 -108989 131292 -39684 -311992 -163061 -234549 76160
9421 -39062 -11900 -206651 -82301 34377 -268918 -24320 159478 -397651 22075 115085 -139188
9409 193000 118732 -53303 -15053 -193422 172909 -85182 66651 -203118 150960 -47357 164417
9397 165542 -181311 -19601 71749 -246412 -16406 -29308 -12848 6124 183677 160158 108506
9386 108506 119936 -265220 -56195 -328022 30317 -6824 -48972 194407 -272552 39846 -42931
9374 10112 -116339 -401153 -76539 -268217 -157443 -56119 -347302 -343549 -10846 -23354 71957
$$ packed form
9456B04510F6875b4611j11317A48161f538k74179F552K64413d6413B641a44231
9444a61416A93776H4118a83818m8781b0243A29499b25054d1893j4716M146j21974
9433a74437F2331a55291g1324I2130a08989A31292c9684k72308J48931p1488G6160
9421c9062a1900j94751h2301C4377b68918b4320A59478c97651B2075R3010a39188
9409A93000p4268e3303a5053j78369A72909h5182F6651b03118A50960d7357A64417
9397A65542a81311a9601G1749b46412a6406j2902a2848F124J77553k3519n1652
9386A08506J1430b65220e6195k71827C0317f824m2148A94407b72552C9846d2931
9374A0112a16339k84814g6539j91678J10774e6119k91183L753a0846j2508G1957
$$ plain form
9362 -267426 92504 292444 253365 -194987 156813 308239 -54459 -48173 22617 -215926 156625
9350 797 57128 -219623 -12569 -18679 61652 319040 -225958 279195 -163351 -307040 -39137
9338 10626 -62474 -283887 -41374 -6375 86183 57891 -16456 67837 -78294 86729 -162465 -40982
9325 -198254 -378029 230566 -301700 -116629 -6949 44130 -256947 -430956 -157886 -45986
9314 -12017 83650 -46517 -136115 -2532 214891 -196407 138968 -269151 23729 76736 -4161
9302 65452 -106019 -70201 -378202 325711 168749 706 -165377 -228934 -120346 -393506 -148799
9290 93828 -136015 -38245 46572 80286 -84539 -124066 -142405 107764 -467958 212051 241783
9279 241783 -74710 -268753 -329463 194411 -166385 -64773 -255637 44807 -71386 102242 -189807
$$ packed form
9362b67426I2504J99940l9079a94987A56813J51426e4459O286B2617b15926A56625
9350G97N6331b19623a2569o110F1652K57388b25958B79195a63351j43689c9137
9338A0626f2474k21413d1374f375H6183k8292a6456F7837g8294H6729a62465d0982
9325a98254j79775B30566c01700a16629f949D4130b56947j74009a57886d5986
9314a2017H3650d6517q9598b532B14891a96407A38968b69151B3729N3007d161
9302F5452a06019L5818l08001C25711j56962G06a65377o3557J08588k73160a48799
9290I3828a36015c8245D6572L3714h4539l9527j8339A07764d67958B12051K9732
9279B41783g4710j94043o0710A94411a66385f4773j90864D4807g1386A02242a89807
$$ plain form
9267 7612 290233 -105891 -116962 -109604 -177509 60914 -27581 -106576 88768 -120733 -52491 -140368
9255 -140368 -45360 219133 201635 -236967 6370 115849 28666 -61920 -453312 16819 -14333
9243 -194935 33989 105942 -419234 -258747 -166329 -255320 -100909 -65082 -216243 -271206 164850
9231 -70685 10021 -266494 144881 -34314 -141071 -138336 -101098 154153 18394 -44075 -187167
9220 -187167 -143558 274574 133616 -94228 -397861 156093 -47547 144321 -333225 -723218
9210 -723218 -126606 176622 -455725 -216001 423888 -33463 -143571 312293 -90750 -110641
9200 -110641 -83568 -255937 260110 -86605 270229 95397 45803 50618 38310 -82095 55983
9188 74197 198263 -14823 47057 -267383 -64334 -229094 -134243 288939 255700 246012 -46734
$$ packed form
9267G612K82621a05891j1071P358o7905F0914b7581p8995H8768a20733e2491q7877
9255a40368d5360B19133j7498b36967F370J09479B8666f1920l91392A6819a4333
9243a94935C3989P1953d19234J60487R2418q8991a00909L5827j51161n4963A64850
9231g0685A0021b66494A44881c4314j06757K735L7238A54153A8394d4075j43092
9220a87167M3609B74574A33616i4228l03633A56093d7547A44321c33225l89993
9210g23218a26606A76622d55725b16001D23888c3463j10108C12293i0750j9891
9200a10641K7073j72369B60110h6605B70229I5397D5803M815j2308h2095E5983
9188G4197J24066a4823D7057b67383f4334j64760R4851B88939l3239r688d6734
$$ plain form
9176 -206508 -210355 -180016 -182780 12293 -251630 72493 121901 55138 111039 -48192 196640 -155021
9163 95284 -121208 -79290 -118288 387953 -6831 243530 -200448 104502 -53656 -310197 -332645
9152 -332645 -187315 14800 -151738 134204 -310027 116562 -5383 -33756 -332360 157508
9141 -229851 -82873 259643 -151473 -89785 -98252 -92476 55206 -12090 210519 -188346 -139839
9130 -139839 37137 -91806 65724 -25243 362059 -80592 113842 173040 -68937 310035 -311691
9118 -148100 -64046 229564 162902 1617 314639 -10248 -56760 -70288 10172 -167686 3975
9106 202557 -58812 347356 -75020 30007 -119726 -328808 -134961 -168791 -27209 131869 252230
9095 252230 -5931 21885 -229544 236010 32613 17026 -418326 117641 276602 -259 -124640
$$ packed form
9176b06508l847L0339k764A2293b51630G2493M9408E5138N5901d8192A96640a55021
9163I5284a21208M1918l8998C87953f831B43530b00448A04502e3656k56541k2448
9152c32645J45330A4800a51738A34204c10027A16562e383k8373k98604A57508
9141b29851h2873B59643a51473O1688q467N776E5206a2090B10519a88346M8507
9130a39839C7137i1806F5724b5243C62059h0592A13842N9198f8937C10035c11691
9118a48100f4046B29564o6662A617L13022a0248m6512j3528A0172a67686C975
9106B02557e8812C47356g5020C0007a19726k09082a34961l3830b7209A31869J20361
9095B52230e931B1885b29544B36010C2613j5587d18326A17641J58961b59j24381
$$ plain form
9084 -124640 195882 12869 57525 -123570 263232 -177042 -51621 -187953 9637 -341303 26578
9072 -169052 144514 -177597 -100220 -12115 292919 96162 133224 835 -285872 -39021 84099
9060 -12196 -99806 -47197 -184110 206535 -61683 69629 -19154 51103 -237160 36799 -36691
9048 14916 -283711 46356 1854 -78974 -176163 -159063 17086 -38954 -51800 123807 -197689
9036 146448 -577977 -303359 104294 -62880 -59532 24671 103038 -177745 -103088 38845 -306688
9024 -222677 -328849 -139896 -25703 118201 -210583 -193054 -1819 -302626 169114 269707
9014 269707 -80657 46836 -363967 -143134 -29700 -443573 312079 -136986 320493 69891
9003 -8725 151121 69343 -122465 -58084 -139368 -330931 -329587 -149557 88011 194416 87598
$$ packed form
9084a24640A95882A2869M4656a23570B63232a77042e1621j36332I637c41303B6578
9072a69052A44514a77597P7377a2115B92919I6162L7062H35b85872c9021H4099
9060a2196q7610d7197j36913B06535f1683F9629a9154E1103b37160C6799c6691
9048A4916b83711D6356A854g8974r7189J7100A7086c8954j2846A23807a97689
9036A46448e77977K74618A04294f2880L348B4671P8367a77745P4657C8845c06688
9024b22677j06172a39896b5703A18201b10583J7529a819l00807A69114J00593
9014B69707h0657D6836c63967a43134b9700m13873C12079a36986C20493F9891
9003h725A51121F9343a22465e8084q1284j91563J344a49557H8011J06405H7598
$$ plain form
8991 5128 -298159 98819 -67766 11841 -422194 -129464 -188565 51596 -13307 -131285 -36388
8979 -178731 -101827 -352224 -414862 -73416 171109 72210 283720 -54012 -22735 96205 -11533
8967 283968 -129910 35742 76046 -142198 24400 -395271 117758 -66811 216327 -290499
8956 -319682 -80957 10373 285688 -29545 190757 87593 152879 391951 -109978 314369 -225437
8944 -69091 -231766 171617 -197976 -100875 -69609 192697 -273276 -23051 97250 -298754 8384
8932 -158103 27251 -63057 -54564 -160695 -230825 85650 -163552 217691 46798 172946 640674
8921 640674 1934834 2452682 303967 -134054 45864 110488 405873 -106929 23131 -228363
8910 -85247 175675 7536 -83030 109847 -46052 -136259 -180660 140836 126269 -231615 -72797
$$ packed form
8991E128b98159I8819f7766A1841d22194a29464n9101E1596a3307j17978c6388
8979a78731P6904k50397o2638g3416A71109G2210K11510e4012b2735I6205a1533
8967B83968a29910C5742M0304a42198B4400c95271A17758f6811B16327b90499
8956c19682h0957A0373K75315b9545A90757H7593O5286K39072a09978C14369b25437
8944f9091j62675A71617a97976R7101L1266A92697b73276b3051I7250b98754H384
8932a58103B7251f3057Q493j06131p0130H5650a63552B17691D6798J26148M67728
8921F40674J294160N17848C03967a34054D5864O4624K95385a06929B3131b28363
8910h5247A75675G536h3030A09847d6052r0207m4401A40836j4567b31615g2797
$$ plain form
8898 209581 60085 143715 341091 -79768 210579 91098 4564 -276548 105542 296755 -214571
8886 206745 -107809 -148239 -293550 249597 -41717 -342962 -216533 -380968 -210764 -64967
8875 -195055 32979 -72753 -161753 116715 261963 -143749 -293881 -88837 246027 -19422 51391
8863 -281854 132790 38905 148245 61384 -121992 12189 -26595 719 -305908 101526 95032
8852 95032 208917 -131251 215892 199734 -74252 -486104 21844 -164431 302792 -39861 46737
8840 -77166 10694 -230379 -122596 -46297 180457 -127191 -45937 -354904 -147899 8216 -226215
$$ packed form
8898B09581F0085Q3630J97376g9768B10579I1098D564b76548A05542J91213b14571
8886B06745a07809m0430j45311B49597d1717l01245J26429j64435J70204f4967
8875a95055C2979g2753q9000A16715J45248a43749j50132h8837B46027a9422E1391
8863b81854A32790C8905J09340F1384a21992A2189b6595G19c05908A01526o494
8852I5032J13885a31251B15892j6158g4252m11852B1844a64431C02792c9861D6737
8840g7166A0694b30379J07783d6297A80457a27191d5937l08967a47899H216b26215
$$ [...]
##END NTUPLES=NMR SPECTRUM
##END=
