##TITLE=NES1067_Nhol10909_9883707_NhqFqdgz2h
##JCAMPDX= 6.0         $$ Bruker NMR JCAMP-DX V2.0
##DATA TYPE= NMR SPECTRUM
##DATA CLASS= NTUPLES
##ORIGIN= BRUKER
##OWNER= Administrator
$$ 1.72 TOPSPIN		Version 2.1
$$ 2016-08-26 23:40:06.336 -0500  Administrator@X
$$ Compression mode = diff/dup
##.OBSERVE FREQUENCY= 400.02188249412
##.OBSERVE NUCLEUS= ^1H
##.ACQUISITION MODE= SIMULTANEOUS (DQD)
##.ACQUISITION SCHEME= undefined
##.AVERAGES= 64
##.DIGITISER RES= 22
##SPECTROMETER/DATA SYSTEM= spect
##.PULSE SEQUENCE= noesygpps1d.comp
##.SOLVENT NAME= COFFEE_meoh
##.SHIFT REFERENCE= INTERNAL, COFFEE_meoh, 1, 14.96157
##AUDIT TRAIL= $$ (NUMBER, WHEN, WHO, WHERE, PROCESS, VERSION, WHAT)
$$ ##TITLE= Audit trail, TOPSPIN		Version 2.1
$$ ##JCAMPDX= 5.01
$$ ##ORIGIN= Bruker BioSpin GmbH
$$ ##OWNER= Administrator
$$ $$ E:\/data/COFFEE/nmr/NES1067_Nhol10909_9883707_NhqFqdgz2h/12/pdata/1/auditp.txt
$$ ##AUDIT TRAIL=  $$ (NUMBER, WHEN, WHO, WHERE, PROCESS, VERSION, WHAT)
(   1,<2016-08-26 23:40:01.133 -0500>,<Administrator>,<X>,<go>,<TOPSPIN 2.1>,
      <created by zg
	started at 2016-08-26 23:28:30.273 -0500,
	POWCHK enabled, PULCHK disabled,
       configuration hash MD5:
       21 0F 79 D6 B3 7B B4 F6 88 20 88 DB 03 48 BD 9F
       data hash MD5: 64K
       19 3C 4A 49 C4 35 57 CB 1F 55 E2 12 EE C7 85 41>)
(   2,<2016-08-26 23:40:04.289 -0500>,<Administrator>,<X>,<proc1d>,<TOPSPIN 2.1>,
      <Start of raw data processing
       efp LB = 0.3 FT_mod = 6 PKNL = 1 PHC0 = 0 PHC1 = 0 SI = 128K 
       data hash MD5: 128K
       C1 F4 7D 6B D5 14 A0 5C 7E F8 55 9A E3 59 23 9F>)
(   3,<2016-08-26 23:40:05.164 -0500>,<Administrator>,<X>,<proc1d>,<TOPSPIN 2.1>,
      <pk PHC0 = -85.9021 PHC1 = 0 
       data hash MD5: 128K
       1C 66 87 21 B4 6A C1 3A 86 5B 87 06 59 8E 40 D4>)
(   4,<2016-08-26 23:40:05.523 -0500>,<Administrator>,<X>,<proc1d>,<TOPSPIN 2.1>,
      <abs ABSG = 1 
       data hash MD5: 128K
       94 2A 0C 70 68 51 E3 1B 69 06 BE 33 5B 31 96 20>)
(   5,<2016-08-26 23:40:05.633 -0500>,<Administrator>,<X>,<proc1d>,<TOPSPIN 2.1>,
      <abs ABSG = 2 
       data hash MD5: 128K
       FD BC 91 E9 DF AD 15 62 6E 2B 69 5B 6F B8 62 3B>)
(   6,<2016-08-26 23:40:05.711 -0500>,<Administrator>,<X>,<proc1d>,<TOPSPIN 2.1>,
      <abs ABSG = 3 
       data hash MD5: 128K
       4F AF 2B C7 0A 12 AC 42 1F 7D A0 65 7C 31 E8 0A>)
(   7,<2016-08-26 23:40:05.820 -0500>,<Administrator>,<X>,<proc1d>,<TOPSPIN 2.1>,
      <abs ABSG = 4 
       data hash MD5: 128K
       8F 2B CB 85 50 EA 3D 26 79 4F 0D 41 07 44 8A 01>)
(   8,<2016-08-26 23:40:06.039 -0500>,<Administrator>,<X>,<proc1d>,<TOPSPIN 2.1>,
      <abs ABSG = 5 
       data hash MD5: 128K
       09 10 2F 31 ED 96 55 C5 CC E1 59 6E 6B 63 C8 44>)
$$ ##END=
$$ 
$$ $$ hash MD5
$$ $$ 38 6F 67 CB 29 FA 3A FF D7 50 92 84 57 56 42 27
##$RELAX= 
##$RELAX= 
##$RELAX= 
##$RELAX= 
##$RELAX= 
##$RELAX= 
##$RELAX= 
##$RELAX= 
$$ Bruker specific parameters
$$ --------------------------
##$DU= <E:\>
##$EXPNO= 12
$$ [...]
##$TP07= 0
##$TPNAME0= <>
##$TPNAME1= <>
##$TPNAME2= <>
##$TPNAME3= <>
##$TPNAME4= <>
##$TPNAME5= <>
##$TPNAME6= <>
##$TPNAME7= <>
##$TPOAL= (0..7)
0.5 0.5 0.5 0.5 0.5 0.5 0.5 0.5
##$TPOFFS= (0..7)
0 0 0 0 0 0 0 0
##$TUNHIN= 0
##$TUNHOUT= 0
##$TUNXOUT= 0
##$USERA1= <user>
##$USERA2= <user>
##$USERA3= <user>
##$USERA4= <user>
##$USERA5= <user>
##$V9= 5
##$VALIST= <valist>
##$VCLIST= <CCCCCCCCCCCCCCC>
##$VD= 0
##$VDLIST= <DDDDDDDDDDDDDDD>
##$VPLIST= <PPPPPPPPPPPPPPP>
##$VTLIST= <TTTTTTTTTTTTTTT>
##$WBST= 2048
##$WBSW= 25
##$XGAIN= (0..3)
0 0 0 0
##$XL= 0
##$YL= 0
##$YMAX_a= 6316568
##$YMIN_a= -11065201
##$ZGOPTNS= <>
##$ZL1= 120
##$ZL2= 120
##$ZL3= 120
##$ZL4= 120
##$ABSF1= 14.96157
##$ABSF2= -5.596612
##$ABSG= 5
##$ABSL= 3
##$ALPHA= 0
##$AQORDER= 0
##$ASSFAC= 0
##$ASSFACI= 0
##$ASSFACX= 0
##$ASSWID= 0
##$AUNMP= <proc_prof1d_extract.lims>
##$AXLEFT= 0
##$AXNAME= <>
##$AXNUC= <1H>
##$AXRIGHT= 0
##$AXTYPE= 0
##$AXUNIT= <>
##$AZFE= 0.1
##$AZFW= 0.1
##$BCFW= 0
##$BC_mod= 0
##$BYTORDP= 0
##$COROFFS= 0
##$CY= 15
##$DATMOD= 1
##$DC= 0
##$DFILT= <>
##$DTYPP= 0
##$F1P= 0
##$F2P= 0
##$FCOR= 0.5
##$FTSIZE= 131072
##$FT_mod= 6
##$GAMMA= 0
##$GB= 0
##$INTBC= 1
##$INTSCL= 1
##$ISEN= 128
##$LB= 0.3
##$LEV0= 0
##$LPBIN= 0
##$MAXI= 10000
##$MC2= 0
##$MEAN= 0
##$ME_mod= 0
##$MI= 0
##$NCOEF= 0
##$NC_proc= -2
##$NLEV= 6
##$NOISF1= 0
##$NOISF2= 0
##$NSP= 0
##$NTH_PI= 0
##$NZP= 0
##$OFFSET= 14.96157
##$PC= 1
##$PHC0= -85.9021
##$PHC1= 0
##$PH_mod= 1
##$PKNL= yes
##$PPARMOD= 0
##$PPDIAG= 0
##$PPIPTYP= 0
##$PPMPNUM= 2147483647
##$PPRESOL= 1
##$PSCAL= 4
##$PSIGN= 0
##$PYNMP= <proc.py>
##$REVERSE= no
##$SF= 400.020009408805
##$SI= 131072
##$SIGF1= 0
##$SIGF2= 0
##$SINO= 400
##$SIOLD= 131072
##$SPECTYP= <>
##$SREGLST= <1H.CDCl3>
##$SSB= 0
##$STSI= 131072
##$STSR= 0
##$SW_p= 8223.68421052631
##$SYMM= 0
##$S_DEV= 0
##$TDeff= 65536
##$TDoff= 0
##$TI= <>
##$TILT= no
##$TM1= 0
##$TM2= 0
##$TOPLEV= 0
##$USERP1= <user>
##$USERP2= <user>
##$USERP3= <user>
##$USERP4= <user>
##$USERP5= <user>
##$WDW= 1
##$XDIM= 131072
##$YMAX_p= 329193165
##$YMIN_p= -11787
##$CURPLOT= <Network HP LaserJet P1505>
##$CURPRIN= <$Network HP LaserJet P1505>
##$DFORMAT= <normdp>
##$LAYOUT= <+/1D_H.xwp>
##$LFORMAT= <normlp>
##$PFORMAT= <normpl>
##$SURQMSG= 1
$$ End of Bruker specific parameters
$$ ---------------------------------
##NTUPLES= NMR SPECTRUM
##VAR_NAME=  FREQUENCY,     SPECTRUM/REAL,   SPECTRUM/IMAG
##SYMBOL=    X,             R,               I
##VAR_TYPE=  INDEPENDENT,   DEPENDENT,       DEPENDENT
##VAR_FORM=  AFFN,          ASDF,            ASDF
##VAR_DIM=   131072,        131072,          131072
##UNITS=     HZ,            ARBITRARY UNITS, ARBITRARY UNITS
##FACTOR=    0.0627417313425164, 1,          1
##FIRST=     8223.62146879497, 817,          -53941
##LAST=      0,             4330,            -53707
##MIN=       0,             -11787,          0
##MAX=       8223.62146879497, 329193165,    0
$$ Real data points
##PAGE= N=1
##DATA TABLE= (X++(R..R)), XYDATA
$$ [...]
67897 41431 40043 39594 39687 39850 40159 40654 40891 40513 39787 39204 38896 38763 38823 39045 39224 39334 39683 40317 40646
67878 40646 40104 38941 37882 37251 36943 36965 37365 37755 37651 37338 37719 39033 40344 40633 39894 38803 37780
67861 37780 36929 36595 37236 38654 39868 40056 39379 38587 38004 37236 35919 34410 33438 33204 33243 33161 33127 33404 33830
67842 33830 34116 34352 34734 34976 34613 33855 33552 34175 35333 36440 37306 37833 37742 37042 36391 36434 37027 37551 37755
67823 37755 37773 37515 36670 35349 34212 33749 33787 33867 33815 33777 33912 34222 34580 34772 34636 34203 33712 33469 33745 34625
67803 34625 35798 36678 36986 37084 37414 37799 37763 37411 37357 37656 37519 36460 35150 34521 34495 34287 33715 33390 33601
67784 33601 33867 33800 33673 33662 33208 31886 30464 30203 31139 31961 31819 31476 32138 33725 35039 35364 35120 34977
67766 34977 35040 35119 35162 35047 34419 33229 32107 31733 32028 32421 32756 33424 34624 35967 36906 37135 36546 35252
67748 35252 33827 33096 33399 34287 35178 35949 36643 36971 36583 35668 34860 34591 34860 35550 36576 37688 38492 38768
67730 38768 38577 38012 37111 36049 35094 34254 33236 31940 30792 30374 30819 31709 32502 32909 32945 32760 32512 32350
67712 32350 32465 32987 33743 34282 34370 34339 34641 35167 35451 35525 35997 37015 37732 37290 35973 34796 34236 34015 34041
67693 34041 34751 36290 37965 38914 38977 38557 37917 36988 35778 34635 34048 34284 35124 35927 36095 35595 34866 34230
67675 34230 33667 33191 33044 33297 33630 33778 33924 34367 35119 36143 37582 39272 40374 40198 39247 38778 39293 40108
67657 40108 40451 40345 40202 40178 40268 40531 40842 40876 40682 40827 41546 42173 41939 41071 40537 40873 41763 42615 42975 42497
67637 42497 41171 39761 39464 40828 43196 45376 46622 46934 46722 46420 46252 46161 45983 45673 45306 44900 44447
67620 44447 44034 43800 43834 44321 45569 47524 49352 50030 49458 48588 48267 48332 48057 47168 46127 45603 45907 46803
67602 46803 47690 48058 47898 47571 47234 46653 45637 44395 43294 42516 42101 42053 42220 42360 42558 43235 44426 45361
67584 45361 45232 44233 43369 43295 43782 44327 44832 45467 46185 46608 46337 45238 43556 41782 40375 39585 39515 40157
67566 40157 41185 41896 41717 40820 40038 40126 41190 42747 44117 44788 44687 44184 43727 43469 43372 43491 43895 44318
67548 44318 44258 43494 42337 41291 40681 40615 41007 41574 42070 42624 43586 44894 45902 46026 45381 44551 43928 43506
67530 43506 43213 43108 43224 43399 43356 42935 42282 41818 41874 42324 42714 42801 42796 42924 42977 42559 41664 40785 40427 40748 41634
67509 41634 42849 43988 44534 44264 43604 43305 43638 44050 43819 43033 42573 43029 43905 44160 43365 42027 40907 40429
67491 40429 40722 41719 43034 44110 44775 45320 45813 45726 44656 43129 42154 42077 42373 42555 42768 43378 44432 45724
67473 45724 47066 48225 48908 49098 49147 49248 49053 48172 46846 45689 44834 43871 42712 41999 42354 43588 44999
67456 44999 46172 47062 47538 47387 46797 46314 46211 46297 46465 46994 47982 48920 49241 49024 48809 48893 49230 49786 50512
67437 50512 51057 51086 50846 50917 51296 51334 50716 49997 49819 50070 50209 50118 50221 50943 52362 54258 56144 57394 57655
67418 57655 57059 55883 54270 52514 51348 51404 52470 53651 54315 54515 54541 54474 54290 54071 53901 53761 53645 53663
67400 53663 53906 54317 54746 55049 55122 54947 54641 54369 54216 54195 54314 54543 54758 54848 54796 54586 54171 53669 53381 53400 53342
67379 53342 52810 52017 51633 51961 52636 53186 53619 54236 55069 55729 55834 55466 55158 55352 55931 56383 56443 56389 56670 57506
67359 57506 58871 60539 61950 62473 62112 61618 61562 61692 61615 61572 61834 61804 60737 59170 58487 58938 59199 58300 56993
67340 56993 56577 57226 58170 58874 59164 58780 57723 56752 56694 57429 58330 59453 61337 63705 65371 65733 65518 65668
67322 65668 66185 66532 66605 66671 66728 66535 66172 66070 66474 67215 68042 68880 69685 70275 70457 70268 69981 69874 69949 69924 69602
67301 69602 69207 69181 69628 70172 70518 70939 71885 73217 74213 74407 74111 73884 73747 73308 72541 71988 72103 72780 73729
67282 73729 74946 76472 77903 78651 78643 78395 78384 78671 79097 79466 79512 79144 78862 79426 80879 82280 82713 82213 81410
67263 81410 80700 80167 79944 80071 80225 80159 80246 81037 82369 83552 84457 85658 87306 88542 88538 87607 86755 86449 86423
67244 86423 86476 86747 87109 86996 86266 85784 86543 88309 89725 89895 89382 89325 89973 90582 90627 90487 90784 91533 92291
67225 92291 92899 93657 94787 95981 96605 96333 95562 95094 95289 95715 95883 96096 97067 98761 100292 101136 101741 102570
67207 102570 103269 103403 103418 104021 104948 105298 104966 104808 105324 106049 106548 107168 108296 109499 110021 109865 109760 110219
67189 110219 111057 111896 112772 114045 115831 117729 119230 120324 121448 122718 123599 123637 123188 122935 122916 122702 122464
67172 122464 123094 125049 127692 130066 131809 133055 133958 134781 135976 137629 139057 139434 138782 138042 138199 139525
67156 139525 141498 143279 144458 145478 147117 149398 151322 151899 151205 150135 149450 149332 149628 150145 150812 151809
67140 151809 153391 155397 157207 158491 159708 161570 164156 166874 169071 170389 170804 170736 170920 171760 172940
67125 172940 173992 175034 176432 177927 178750 178646 178302 178604 179907 182078 184804 187614 189974 191654 192872
67110 192872 193980 195172 196584 198394 200612 202928 204986 206757 208538 210633 213053 215501 217619 219317
67096 219317 220836 222467 224282 226201 228203 230321 232481 234496 236233 237732 239255 241212 243852 246897
67082 246897 249686 251846 253619 255413 257314 259337 261841 265187 269108 272867 276059 278874 281562 284132
67068 284132 286670 289520 292845 296256 299165 301405 303391 305697 308588 311887 315276 318693 322356 326333
67054 326333 330264 333738 336820 339957 343382 346921 350396 353984 357992 362390 366692 370387 373521 376794
67040 376794 380805 385263 389255 392456 395622 399596 404230 408812 413180 417794 422852 428077 433430 439311
67026 439311 445815 452255 457816 462423 466787 471805 477964 485042 492250 498935 505215 511718 518748 525952
67012 525952 532771 538862 544144 548934 554066 560398 568019 576246 584508 592816 601385 610271 619465 628850
66998 628850 637954 646270 654012 662048 670896 680292 689902 699784 709850 719542 728597 737578 747164 757347
66984 757347 767872 778977 791046 803931 817231 830901 844872 858327 870251 880736 891134
66973 891134 902757 915880 929955 944275 958334 972002 985538 999202 1012899 1026481 1040302
66962 1040302 1055036 1070946 1087646 1104555 1121320 1137934 1154779 1172406 1190901 1209565 1227658
66951 1227658 1245278 1263074 1281234 1299376 1317341 1335428 1353738 1371966 1390062 1408564 1427956
66940 1427956 1448083 1468460 1488783 1508918 1528789 1548545 1568607 1589242 1610273 1631292 1652002
66929 1652002 1672355 1692631 1713343 1734653 1755881 1776075 1795154 1813959 1833079 1852203 1870831
66918 1870831 1888997 1906931 1924553 1941795 1958920 1976012 1992609 2008371 2023704 2039076 2054099
66907 2054099 2067952 2080512 2092302 2103549 2114054 2123913 2133462 2142358 2149571 2154694 2158635 2162623 2166958
66894 2166958 2171058 2174201 2175789 2175361 2172970 2169388 2165479 2161458 2157077 2152297 2147304 2141966 2135819 2128630
66880 2128630 2120575 2111755 2101847 2090411 2077366 2063084 2048207 2033378 2018877 2004407 1989382 1973496
66868 1973496 1956872 1939695 1922008 1903899 1885550 1866925 1847724 1827883 1807860 1788165 1768817
66857 1768817 1749556 1730344 1711273 1692164 1672741 1653095 1633484 1613727 1593364 1572545 1552146
66846 1552146 1532742 1514004 1495408 1476951 1458601 1439624 1419337 1398320 1377961 1358785 1340052
66835 1340052 1321218 1302916 1285999 1270273 1254867 1239392 1224001 1208572 1192600 1175973 1159215
66824 1159215 1142796 1126645 1110483 1094223 1077884 1061535 1045539 1030491 1016656 1003657 990896
66813 990896 977953 964462 950105 935151 920582 907098 894241 881075 867555 854532 842469
66802 842469 830993 819874 809579 800347 791442 782030 772366 763331 755022 746620 737566 728096 718536
66789 718536 708801 698891 689207 679992 670921 661737 652894 645066 638239 631786 625319 618945 612667 606034
66775 606034 598620 590638 582824 575733 569250 562803 556039 549225 542914 537319 532172 527136 522118 517157
66761 517157 512253 507385 502382 496754 490087 482769 475883 470037 464710 459140 453395 447994 442871 437555
66747 437555 432254 427844 424601 421688 418267 414493 410968 407728 404312 400551 396705 392978 389326 385730
66733 385730 382239 378717 374835 370462 365862 361440 357383 353574 349838 346200 342884 339919 336860 333152
66719 333152 328891 324909 321923 319749 317652 315252 312737 310301 307839 305317 303067 301414 300195 298903
66705 298903 297255 295348 293286 290954 288306 285664 283423 281513 279420 276841 274056 271476 268994 266092
66691 266092 262546 258786 255556 253327 252015 251048 249670 247452 244649 241989 240064 238955 238348 237812 236972
66676 236972 235671 234060 232424 230855 229232 227503 225767 224040 222140 219913 217407 214834 212531 210917
66662 210917 210174 209878 209281 208096 206699 205447 204191 202752 201436 200612 200038 199158 197906 196726 195801 194779
66646 194779 193364 191695 189972 188157 186285 184705 183657 182838 181794 180606 179852 179877 180366 180674 180363 179415
66630 179415 178137 176984 176259 175866 175455 174915 174565 174664 174857 174363 172776 170475 168137 166070 164141 162196
66614 162196 160309 158599 157052 155581 154220 153134 152455 152062 151549 150537 149056 147533 146368 145676 145453
66599 145453 145664 145930 145475 143866 141694 140066 139413 139214 138948 138783 139106 139852 140656 141373 141999 142254 141701 140324
66581 140324 138678 137412 136793 136723 136983 137288 137204 136329 134725 133096 132200 131979 131559 130344 128783 127676 127046
66564 127046 126333 125509 125155 125312 125210 124513 124012 124388 124951 124479 122896 121207 119958 118769 117385 116289 115912
66547 115912 115957 115988 116180 116949 118041 118468 117415 115046 112427 110654 110000 109898 109769 109673 109971 110579 110946 110709
66529 110709 110029 109327 108995 109280 110049 110700 110735 110434 110496 110971 111091 110338 109152 108273 107793 107243 106255 104735 102601
66510 102601 99854 96909 94570 93527 93897 95122 96294 96816 96868 97106 97810 98591 98993 99070 99153 99358 99618 99937
66492 99937 100294 100441 100134 99473 98765 98114 97408 96676 96185 96110 96238 96052 95104 93422 91595 90314 89748 89523
66474 89523 89311 89205 89385 89699 89824 89660 89333 88968 88674 88580 88642 88581 88234 87825 87584 87281 86441 84980 83315
66455 83315 81877 80764 79869 79104 78469 78045 77885 77805 77461 76787 76203 76168 76683 77481 78461 79572 80459 80712 80399
66436 80399 79893 79201 77992 76400 75256 75247 76149 77183 77840 78130 78265 78428 78736 79181 79599 79778 79588 79038
66418 79038 78370 78059 78425 79183 79657 79524 79085 78707 78348 77844 77341 77086 77002 76789 76334 75758 75207 74854 74969
66399 74969 75612 76355 76655 76522 76507 76965 77579 77679 76836 75142 73181 71755 71382 71859 72513 72951 73367 73993
66381 73993 74529 74407 73489 72193 70984 70018 69359 69226 69794 70806 71551 71337 70017 68120 66515 65836 66083
66364 66083 66732 67228 67371 67255 67007 66798 66954 67731 68799 69280 68627 67366 66579 66670 66987 66812 66290 66045 66136
66345 66136 65870 64713 63039 61808 61652 62381 63254 63643 63511 63305 63379 63546 63330 62609 61788 61241 60853 60285
66327 60285 59574 59190 59518 60462 61618 62666 63455 63794 63393 62130 60384 58913 58308 58576 59327 60263 61308
66310 61308 62339 63098 63471 63597 63560 63222 62554 61928 61776 62136 62820 63863 65355 66892 67711 67507 66721 65837
66292 65837 64807 63439 62014 61120 61042 61625 62581 63607 64314 64392 63847 62902 61755 60678 60153 60443 61052 61076
66274 61076 60218 59156 58737 59108 59807 60422 60859 61150 61246 61041 60479 59645 58762 57973 57128 56024 54936 54642
66256 54642 55635 57457 59031 59647 59478 59175 59220 59703 60479 61367 62137 62475 62121 61147 60017 59252 59052 59330
66238 59330 60015 61005 61871 61983 61159 59984 59269 59337 60044 61185 62512 63504 63635 63005 62310 61957 61503 60297
66220 60297 58500 57089 56780 57271 57743 57810 57662 57413 56815 55815 55008 55123 56153 57378 58242 58829 59431 59998
66202 59998 60225 59961 59310 58516 57946 58052 59083 60817 62649 63956 64391 64008 63211 62480 62087 62102 62585 63462
66184 63462 64239 64216 63167 61536 59816 58092 56338 54786 53632 52775 52235 52475 53725 55203 55686 54893
66168 54893 53760 53244 53361 53531 53412 53114 52897 52938 53261 53720 54163 54582 54990 55208 55092 54906 55079 55513 55543
66149 55543 54808 53856 53633 54524 56063 57427 58070 58004 57630 57240 56739 55973 55197 54902 55203 55714 56131 56594 57397
66130 57397 58581 59902 60907 61061 60184 58860 57955 57609 57133 56034 54630 53391 52285 51229 50683 51146
66114 51146 52362 53582 54451 55127 55696 56053 56284 56614 57002 57237 57404 57734 57988 57538 56231 54735 53803 53533
66096 53533 53520 53403 53071 52592 52203 52224 52763 53591 54330 54726 54774 54741 54990 55572 56080 56122 55868 55807 56046 56268 56354
66075 56354 56576 57044 57422 57378 56976 56395 55645 54853 54447 54643 54979 54778 53995 53243 53010 53145 53162 52835 52417 52379
66055 52379 52958 53953 54987 55913 56771 57379 57347 56696 56101 56174 56736 57156 57203 57135 57052 56778 56454 56703 57811 59056
66035 59056 59301 58207 56612 55663 55782 56468 56905 56708 56184 55989 56489 57371 57875 57443 56111 54283 52267
66018 52267 50199 48379 47367 47528 48612 49957 51053 51749 52027 51907 51565 51276 51156 51137 51223 51462 51631 51347
66000 51347 50659 50189 50384 50939 51318 51515 51826 52112 51904 51208 50622 50525 50661 50695 50676 50705 50613 50382 50467 51170 51938
65979 51938 51838 50726 49466 48924 49159 49682 50126 50397 50427 50129 49587 49072 48829 48857 48926 48797 48446 48027 47562
65960 47562 46809 45624 44422 43930 44363 45045 45068 44261 43328 43115 43844 45035 46058 46710 47320 48259 49402 50210
65942 50210 50368 50076 49575 48681 47147 45305 43929 43368 43199 42830 42150 41449 41035 41101 41731 42798 44013 45249
65924 45249 46571 47815 48507 48555 48650 49449 50533 50782 49777 48248 47052 46302 45749 45418 45414 45520 45492 45497 45783
65905 45783 46123 46066 45617 45198 45000 44897 45009 45765 47181 48481 48786 47990 46778 45977 46057 46987 48302 49393
65887 49393 49976 50224 50371 50331 49882 49104 48400 48075 48031 47885 47373 46650 46158 46057 45837 44804 42997 41324 40581
65868 40581 40651 40917 41150 41523 41963 42039 41580 40993 40815 41216 42024 42926 43546 43634 43395 43422 44081 45052 45603 45249
65848 45249 44119 42882 42332 42825 43951 44886 45151 44865 44310 43562 42694 41922 41336 40794 40346 40454 41352 42464
65830 42464 42911 42500 41766 41193 40867 40877 41427 42372 43170 43566 43993 44967 46392 47724 48657 49363 50144 51125 52176
65811 52176 52980 53230 52908 52299 51637 50894 50034 49277 48894 48828 48691 48112 47014 45716 44877 45151 46627 48634
65793 48634 50266 51075 51159 50819 50340 50009 50041 50397 50777 50797 50168 48910 47498 46619 46563 46955 47225 47127 46672 45887
65773 45887 45029 44714 45310 46356 47101 47494 48012 48531 48258 47040 45961 46024 46768 46950 46303 45851 46498 48001
65755 48001 49496 50456 50822 50593 49798 48749 47966 47729 47873 48037 47968 47521 46557 45105 43604 42704 42639 42984
65737 42984 43223 43383 43787 44329 44494 44151 43834 43990 44355 44400 44061 43656 43321 42935 42418 41688 40539 39006 37777
65718 37777 37669 38627 39708 40159 40139 40263 40865 41848 42902 43628 43825 43845 44369 45526 46584 46821 46358 45763
65700 45763 45168 44315 43306 42665 42567 42563 42270 41885 41701 41502 40840 39785 38939 38675 38694 38481 38016 37781 38110 38788
65680 38788 39405 39923 40655 41691 42590 42860 42554 42194 42160 42440 42967 43872 45207 46655 47781 48538 49302 50383
65662 50383 51592 52358 52136 50789 48751 46837 45704 45374 45337 45176 44917 44735 44538 44099 43473 42968 42748 42684
65644 42684 42594 42332 41630 40261 38584 37587 37994 39455 40924 41724 41921 41831 41667 41687 42141 42825 43054 42434 41388
65625 41388 40605 40231 39966 39767 39942 40536 41065 41102 40826 40725 40928 41123 41100 41091 41387 41790 41712 40883 39772 39084
65605 39084 39010 39150 39151 39084 39189 39574 40349 41684 43473 45148 46135 46352 46046 45382 44542 44010 44235 45021 45672
65586 45672 45773 45432 44789 43794 42639 41867 41770 42004 42070 41874 41556 41122 40609 40350 40684 41525 42522 43481 44313
65567 44313 44735 44454 43600 42647 41909 41401 41167 41402 42186 43286 44244 44590 44109 43111 42300 42159 42582 43243 43993
65548 43993 44573 44341 42919 40943 39602 39443 40148 41313 42667 43608 43515 42788 42635 43327 43530 42115 39886
65531 39886 38618 38840 39556 39884 39966 40193 40526 40850 41319 42003 42629 42967 43109 43229 43378 43614 43952 44128 43849
65512 43849 43333 43173 43495 43756 43539 43094 42824 42730 42676 42793 43176 43532 43509 43122 42521 41637 40481 39538 39376 40020
65492 40020 41067 42226 43320 44026 44157 44105 44421 45008 45313 45292 45536 46258 46755 46235 44700 42737 40886 39600
65474 39600 39374 40327 41841 43136 44114 45172 46320 47054 47223 47400 48079 48895 49109 48651 48255 48526 49268 49850
65456 49850 49956 49759 49536 49396 49317 49260 49181 49054 48905 48738 48424 47854 47215 46946 47299 48057 48780 49215 49418 49647
65436 49647 50226 51326 52618 53341 53041 52224 51986 52991 55062 57652 60291 62472 63605 63448 62421 61191
65420 61191 60118 59284 58820 58852 59265 59821 60476 61252 61916 62124 61842 61232 60185 58473 56444 55020 54688 54960
65402 54960 55194 55481 56205 57060 57247 56539 55485 54483 53342 51940 50665 49851 49359 49158 49757 51428 53415
65385 53415 54657 55141 55787 57067 58517 59677 60729 61855 62653 62736 62502 62811 64098 66141 68410 70309
65369 70309 71392 71815 72402 73847 75964 78067 79813 81276 82443 83236 83889 84724 85602 86245 87098 89068
65353 89068 92141 94930 96080 95622 94496 93229 91694 89851 87961 86095 84083 82081 80656 80015 79540
65338 79540 78431 76614 74712 73196 71883 70301 68245 65884 63497 61356 59787 59071 59145 59563 59842 59753
65322 59753 59268 58452 57558 56967 56756 56504 55806 54864 54214 54040 54131 54431 55117 56099 56980 57628 58261 58804 58779 58199
65302 58199 58073 59421 62080 64998 67452 69453 71111 72213 72522 72096 71199 70126 69128 68265 67399 66503
65286 66503 65800 65306 64482 62778 60409 58135 56336 54794 53335 52138 51294 50590 49905 49416 49209 49092 48942
65269 48942 48843 48692 48131 47207 46645 47069 48191 49136 49358 48900 47999 46875 45828 45144 44884 44913 45027 44897 44137
65250 44137 42760 41366 40526 40150 39845 39680 40073 40966 41751 42156 42664 43738 45063 45959 46232 46188 45986 45497
65232 45497 44801 44322 44231 44032 43121 41648 40485 40266 40703 41093 41275 41723 42675 43596 43841 43598 43728 44621 45645
65213 45645 45925 45395 44721 44362 44085 43432 42341 41152 40284 40104 40875 42447 44055 44806 44522 43887 43640 43847
65195 43847 44180 44618 45449 46621 47598 48035 48306 49007 50118 51054 51509 51893 52771 54141 55497 56456 57003 57201
65177 57201 57024 56653 56566 57031 57660 57809 57356 56740 56259 55785 55267 54991 55028 54792 53637 51672 49566 47722
65159 47722 46124 44854 44181 44061 44077 43998 43935 43794 43101 41673 40106 39234 39327 40090 41157 42277 43242 43972
65141 43972 44558 45012 45130 44844 44505 44555 45022 45567 45831 45515 44438 42849 41487 40864 40636 40092 39181 38584
65123 38584 38761 39399 39928 40188 40416 40873 41658 42681 43702 44502 45049 45374 45327 44755 43886 43221 42938 42674 42068
65104 42068 41289 40855 41036 41580 41963 41889 41593 41625 42243 43175 44146 45452 47629 50601 53572 55833 57352 58486
65086 58486 59518 60662 62175 64125 66179 67809 68663 68719 68319 68056 68333 68918 69207 69003 68691 68536 68227
65069 68227 67431 66390 65567 64981 64306 63431 62468 61300 59636 57566 55716 54694 54547 54827 54956 54559 53641
65052 53641 52561 51698 51085 50411 49367 47930 46382 45134 44459 44336 44624 45375 46719 48316 49236 48730 47006
65035 47006 45018 43585 42938 42882 43004 42794 41997 40932 40175 39926 39937 40073 40535 41408 42270 42512 41910 40816
65017 40816 39897 39693 40241 41104 41936 42927 44396 45981 46783 46509 46018 46296 47210 47758 47385 46531 45885 45640
64999 45640 45649 45911 46476 47101 47382 47185 46686 45965 44883 43478 42196 41508 41440 41743 42377 43500 44936 46092
64981 46092 46594 46759 47146 47829 48431 48714 48784 48712 48405 47989 47932 48468 49108 49072 48135 46798 45657 44900 44471 44353
64961 44353 44440 44337 43688 42747 42266 42597 43135 42985 42068 41215 41078 41315 41122 40356 39780 40220 41736 43689 45415
64942 45415 46678 47548 48048 48052 47502 46602 45677 44896 44269 43869 43827 44062 44271 44329 44508 45067 45853 46512 46934 47174
64922 47174 47048 46204 44661 43026 42051 42043 42695 43329 43345 42669 41816 41363 41390 41547 41562 41472 41405 41398 41423 41358 40978 40284
64900 40284 39822 40304 41774 43435 44441 44608 44222 43485 42434 41180 39962 39032 38619 38847 39493 39998 39898
64883 39898 39241 38502 38225 38742 39943 41154 41557 41017 40244 39895 39780 39312 38475 37770 37301 36561 35385 34528
64865 34528 34880 36283 37586 37820 37027 36000 35496 35777 36634 37659 38582 39485 40594 41803 42595 42685 42574
64848 42574 43058 44092 44599 43717 41933 40523 40033 39863 39359 38713 38459 38547 38487 38247 38447 39500 40889 41574
64830 41574 40996 39552 38126 37330 37246 37705 38554 39637 40770 41924 43261 44715 45687 45552 44502 43547 43512
64813 43512 44296 45210 45754 45829 45475 44747 43811 42938 42379 42287 42631 43093 43257 43041 42760 42639 42504 42180 41938 42176
64793 42176 42756 43047 42641 41778 40969 40466 40196 40077 40230 40832 41773 42590 42906 42954 43387 44437 45521 45893 45490
64774 45490 44860 44434 44224 44146 44228 44438 44549 44344 43859 43367 43171 43330 43522 43309 42670 42106 42009 42133 42001 41705
64754 41705 41858 42687 43545 43567 42629 41434 40719 40602 40783 41241 42392 44332 46182 46778 46087 45423 45887 47011
64736 47011 47411 46513 45089 44266 44572 45849 47487 48639 48727 47993 47195 46690 46126 45113 43813 42717 42212
64719 42212 42506 43649 45379 47161 48547 49400 49721 49535 49013 48456 48046 47822 47889 48352 49054 49671 50081 50358
64701 50358 50410 50070 49486 48976 48434 47451 46135 45185 44945 45018 45148 45801 47327 49061 49959 49780 49052 48161 47164
64682 47164 46334 46183 46870 48066 49454 50926 52310 53333 53923 54167 54041 53511 52876 52594 52799 53337 54144
64665 54144 55081 55449 54344 51786 49002 47194 46372 45692 44687 43738 43470 44021 44939 45637 45934 46214 46981
64648 46981 48194 49134 49066 47983 46620 45771 45672 45995 46331 46597 46924 47269 47352 47030 46551 46233 46031 45695 45341
64629 45341 45495 46432 47668 48347 48070 47213 46444 46069 45910 45677 45356 45195 45444 46108 46893 47343 47217 46842 46928
64610 46928 47781 48794 49049 48346 47317 46573 46243 46384 47218 48669 50200 51571 53250 55563 57854 59172
64594 59172 59549 59784 60083 59762 58456 56857 55832 55395 54980 54321 53557 52705 51616 50407 49562 49482 50143 51222
64576 51222 52409 53467 54137 54221 53831 53401 53230 53074 52527 51804 51684 52423 53158 52872 51609 50273 49502 49368
64558 49368 49938 51273 52811 53602 53453 53206 53523 54051 54226 54285 54880 56105 57455 58471 58902 58546 57570 56770
64540 56770 56874 57626 58170 58258 58391 58714 58551 57400 55757 54453 53584 52706 51804 51386 51569 51668 50976 49568
64522 49568 48061 46941 46473 46960 48459 50277 51343 51323 50924 50878 51072 51051 50874 50912 51066 50909 50539 50540 50996
64503 50996 51157 50378 48888 47341 46072 45137 44712 44980 45751 46519 46824 46486 45722 45111 45163 45771 46407 46926
64485 46926 47683 48632 48923 47906 46113 44679 44120 44190 44576 45055 45216 44850 44561 45256 46884 48396 49084 49320
64467 49320 49692 50110 50206 50104 50144 50161 49638 48540 47502 47139 47495 48226 49015 49636 49824 49360 48306 47078 46184
64448 46184 45891 46098 46517 46943 47350 47785 48207 48504 48675 48933 49452 49991 50020 49433 48918 49246 50315 51312 51797
64429 51797 52065 52347 52326 51800 51263 51292 51743 52113 52346 52679 52947 52814 52535 52677 53060 52741 51294 49466 48296
64410 48296 48110 48618 49435 50080 49968 48908 47417 46215 45567 45342 45454 45942 46759 47708 48462 48594 47898 46801
64392 46801 46102 46101 46322 46260 45992 45822 45832 46183 47356 49424 51397 52017 51172 49984 49518 49949 50978 52404
64374 52404 54001 55280 55708 55034 53321 50930 48613 47269 47314 48323 49432 50071 50365 50927 52285 54267
64358 54267 55977 56566 56081 55344 55025 55137 55465 55998 56633 56817 55981 54303 52639 51669 51409 51637 52378 53653
64340 53653 55022 55830 55983 56144 56933 58151 59051 59231 58977 58764 58767 58964 59364 59879 60216 60212 60198 60653 61484 61934
64320 61934 61388 60160 59298 59588 60782 61812 61830 61067 60642 61472 63461 65782 67810 69565 71362 73317
64304 73317 75272 77022 78469 79724 81174 83395 86818 91348 96341 101010 104996 108568 112180 115768
64290 115768 118608 120001 120012 119335 118475 117320 115544 113178 110565 107974 105422 102821 100055 96966 93483
64275 93483 89839 86492 83734 81485 79545 77899 76630 75692 74981 74566 74525 74504 73813 72202 70329 69173
64259 69173 69110 69816 70820 71720 71963 71109 69537 68397 68457 69271 69810 69634 69030 68301 67496 66795 66494 66488 66239
64240 66239 65573 65145 65778 67532 69696 71560 72872 73641 73834 73399 72431 71206 70102 69453 69372 69652 69945
64223 69945 70067 70069 69992 69691 69063 68346 67979 68089 68263 68002 67293 66583 66298 66573 67366 68507 69536 69859 69316
64204 69316 68441 67912 67874 68024 68235 68689 69373 69796 69473 68559 67773 67700 68294 69145 70064 71245 72820 74536 76075
64185 76075 77564 79394 81560 83558 85144 86819 89235 92339 95441 98014 100100 102044 104227 107029
64171 107029 110620 114676 118557 121904 124853 127628 130133 132079 133282 133691 133258 131878 129492 126256 122640
64156 122640 119214 116159 113106 109645 105873 102191 98728 95357 92224 89793 88322 87637 87494 87764 88150
64141 88150 88199 87837 87547 87707 88063 88121 87835 87583 87610 87795 87850 87586 87079 86675 86660 86787 86405 85323 84252 84130
64121 84130 85076 86309 87008 87019 86826 87041 87861 88907 89661 90118 90839 92285 94366 96756 99242 101614 103592
64104 103592 105304 107497 110766 114734 118444 121471 124178 126932 129557 131655 133060 133801 133882 133290 132108
64089 132108 130504 128620 126434 123759 120582 117414 114954 113228 111471 109199 106971 105626 105128 104786 104322
64074 104322 104022 103916 103651 103227 103151 103692 104580 105615 106930 108464 109803 110883 112274 114395 116995 119719
64058 119719 122653 125816 128620 130462 131524 132439 133389 134096 134476 134737 134873 134591 133748 132475 130894 129094
64042 129094 127402 126281 125833 125596 124906 123360 121032 118476 116506 115708 116085 117190 118525 119775 120927
64027 120927 122278 124104 126173 127825 128756 129383 130156 130862 131043 130897 131199 132398 134180 135911 137126 137646
64011 137646 137640 137690 138557 140762 144432 149281 154524 159096 162451 165110 168048 171707 175913 180486 185387 190404
63995 190404 195358 200528 206323 212572 218804 225201 232484 240717 249055 257031 265352 274981 286108 298552
63981 298552 312519 328262 345436 363492 382374 402204 422616 443195 464363 487027 511355
63970 511355 536657 562569 589651 618584 649426 682038 716886 755174 798554 848944 908184
63959 908184 977433 1057098 1147716 1250894 1369182 1505131 1660613 1836829 2034522 2253959
63949 2253959 2494693 2755367 3033850 3327727 3634676 3952096 4276190 4601462 4921129
63940 4921129 5227850 5514050 5772145 5995250 6177970 6316482 6407966 6450354 6442664 6385166
63930 6385166 6278983 6125910 5929000 5693095 5424269 5128784 4812992 4484094 4150088
63921 4150088 3818292 3494091 3181335 2883446 2603478 2343440 2104334 1886966 1692084
63912 1692084 1519548 1367986 1235505 1120294 1020343 933303 857182 790821 733183 682530
63902 682530 636927 595393 557982 524802 495431 469239 445700 424241 404182 385004 366436
63891 366436 348341 330812 314313 299255 285357 271829 258301 245226 233262 222672 213465 205684
63879 205684 199191 193421 187750 182044 176698 172170 168545 165398 162063 158210 154248 150924 148545 146833
63865 146833 145493 144535 143958 143599 143448 143632 143779 142878 140262 136430 132426 128658 124841 120891 117229 114145
63849 114145 111412 108707 106056 103679 101687 100082 98859 97941 97141 96325 95494 94698 93924 93115 92209 91187
63833 91187 90145 89235 88454 87644 86818 86241 85958 85496 84408 83024 82197 82287 82782 83028 82954 82912 83090 83330 83377
63814 83377 83150 82788 82447 82058 81441 80792 80705 81316 81710 80814 78887 77369 77092 77322 76956 76041 75476 75682 76251
63795 76251 76750 77148 77447 77484 77231 76898 76540 75859 74639 73177 72136 72012 72737 73785 74674 75394 76227 77143
63777 77143 77694 77682 77580 77954 78703 79273 79454 79492 79539 79522 79514 79717 79984 79876 79301 78643 78057 77128 75569 73833
63757 73833 72725 72620 73390 74765 76435 77996 79163 80030 80916 82019 83323 84689 85938 87075 88495
63742 88495 90644 93319 95731 97499 99160 101330 103831 106182 108624 111980 116615 122158 128167 134488
63728 134488 141013 147709 154963 163235 172144 180399 186902 191513 194600 196354 196812 196072 194123 190847 186462
63713 186462 181560 176397 170564 163770 156591 149966 144225 139120 134558 130763 127813 125532 123801 122603
63699 122603 121758 121041 120544 120563 121102 121868 122740 123884 125354 126922 128348 129502 130267 130662 131142 132377 134579
63682 134579 137321 140081 142696 145242 147877 151000 155199 160736 167232 174033 180718 187177 193398 199367
63668 199367 204977 209908 213732 216199 217194 216413 213463 208461 202183 195387 188278 180853 173442 166472 159932
63653 159932 153467 146972 140820 135617 131987 130404 130791 132262 133561 133972 133750 133738 134661 136613 138994 141002
63637 141002 142362 143599 145532 148643 152994 158429 164543 170731 176685 182865 190153 199091 209614 221333
63623 221333 233823 246807 260475 275487 292229 310151 328309 346494 365340 385303 406030
63612 406030 426759 446706 464823 479779 490660 497468 500741 501043 499060 495706 491665 487037 481758
63599 481758 476123 470540 464977 459002 452223 444362 435101 424275 412137 399153 385616 371810 358390
63586 358390 346165 335461 326031 317567 310048 303556 298174 294154 291862 291332 292047 293378 295130 297506
63572 297506 300592 304141 307983 312517 318505 326194 334877 343624 352367 361823 372364 383530 394857
63559 394857 406607 419275 432860 447218 462723 479837 498151 516558 534306 551200 566730
63548 566730 579795 589555 596006 599481 600253 598940 596733 594697 593186 592306 592476 593986 596313 598442 599694
63533 599694 599761 598108 593954 586834 576754 563831 548282 530809 512428 493657 474252 454017 433585
63520 433585 414044 395929 378890 362399 346569 332223 320205 310685 303061 296488 290482 285068
63508 285068 280418 276403 272516 268289 263807 259679 256363 253634 250998 248474 246597 245605 245117 244801 244862
63493 244862 245446 246066 246258 246571 248184 251490 255745 260264 265349 271610 278838 286125 292914 299440 306113
63478 306113 312826 318955 323758 326650 327331 325902 322839 318675 313622 307566 300489 292791 285061 277646
63464 277646 270635 264224 258770 254360 250654 247437 245071 244063 244269 244880 245192 245199 245523 246979 250019 254265
63448 254265 258609 262153 265038 268053 271612 275630 280287 286155 293333 301105 308923 317225 326865 338074
63434 338074 350563 364320 379751 397119 416357 437397 460249 484699 510366 537148 565292
63423 565292 594880 625421 655994 685478 712501 735416 752725 763757 768962 769452 766133 759359
63411 759359 749564 738070 726816 717075 708736 700912 692798 683628 672390 658315 641627 623296 604140
63398 604140 584554 564939 545729 527021 508840 491875 477263 465399 455531 446907 439737 434535
63386 434535 430961 428008 425175 422845 421496 421112 421536 422973 425878 430518 436919 445069 454923 466200
63372 466200 478397 491202 504793 519554 535519 552320 569781 588326 608506 630240 652725
63361 652725 675034 696526 716642 734608 749414 760065 765933 767141 764543 759097 751308 741497 730420
63348 730420 719173 708516 698737 689995 682131 674038 664063 651508 637167 621956 605582 587219
63336 587219 567137 546878 527928 510734 494922 479962 465577 451892 439271 427855 417453
63325 417453 408067 400026 393172 386401 378778 370832 363929 358451 353447 348047 342346 336717 331225 326071
63311 326071 321786 318434 315266 311655 307813 304060 300082 295615 291296 287976 285541 283231 280908 279078
63297 279078 277696 275912 273230 270156 267358 264794 262092 259248 256497 253821 251051 248236 245460 242452
63283 242452 238792 234546 230387 226947 224216 221693 219053 216576 214830 213923 213227 211957 209958 207765 205940
63268 205940 204616 203638 202857 202201 201745 201742 202316 203025 203126 202535 202131 202742 204118 205378 206300 207580 209839 212970
63250 212970 216659 220979 226071 231588 236983 242271 248066 254836 262456 270569 279126 288406 298714 310184
63236 310184 322770 336214 350063 363891 377551 391172 404918 418812 432755 446581 459999
63225 459999 472643 484363 495500 506714 518428 530533 542720 554888 566991 578573 588833
63214 588833 597312 604217 609759 613408 614140 611408 605447 596619 584874 570191 553195 534948 516168
63201 516168 497071 477966 459607 442753 427637 414163 402491 393091 386135 381127 377291 374249
63189 374249 372148 371201 371367 372510 374636 377718 381417 385274 389238 393766 399235 405425 411777 418076 424601
63174 424601 431571 438609 444910 449850 453397 456001 458216 460332 462238 463525 463715 462453 459600 455227
63160 455227 449547 442694 434519 424687 413197 400841 388978 378652 369927 362157 354842 348064 342095
63147 342095 336865 332003 327265 322682 318308 314107 310131 306600 303616 300927 298176 295395 293050 291494
63133 291494 290442 289168 287314 285380 284258 284263 284860 285379 285741 286257 286987 287703 288404 289382 290677 291846 292519
63116 292519 292843 293137 293367 293299 293003 292910 293405 294534 296019 297323 297892 297641 297170 297215 297818 298273 297940 296973 296226
63097 296226 296528 297978 299832 301123 301532 301630 302226 303666 305863 308659 311804 314763 317022 318634 320137
63082 320137 321928 324022 326430 329411 333203 337727 342677 347758 352809 357859 363048 368404 373839 379527
63068 379527 386028 393687 402105 410654 419342 428685 438885 449833 461874 475719 491393 508011 525023
63055 525023 543012 562814 584401 607213 631043 655964 681729 707942 734621 761914 789355
63044 789355 816061 841696 866713 891634 916558 941379 965958 989976 1013072 1035298 1057025
63033 1057025 1078175 1097835 1114854 1128625 1139056 1145871 1148086 1144234 1133186 1114913 1090436 1060976
63021 1060976 1027260 989774 949435 907717 866140 825891 787854 752666 720630 691766 666048
63010 666048 643518 624210 608076 594923 584374 576060 569986 566479 565564 566548 568456 570762 573569
62997 573569 577337 582636 589720 597944 605944 612960 619707 627377 635998 644439 651856 658317 663967 668378
62983 668378 670992 671522 669572 664436 655671 643546 628688 611618 592786 572535 550800 527376 502829
62970 502829 478624 455973 434921 414953 396051 378615 362735 348117 334606 322326 311375
62959 311375 301728 293284 285743 278612 271653 265128 259326 254118 249267 244813 240720 236536 231958 227504
62945 227504 223923 221065 217990 214217 210263 206821 204035 201727 199785 198047 196291 194633 193580 193309
62931 193309 193232 192639 191607 190936 191250 192405 193718 194552 194692 194368 193953 193607 193203 192541 191496 189985 188049
62914 188049 186092 184794 184528 184941 185280 185097 184485 183710 182859 181948 181173 180859 181156 181865 182629 183303 184116 185397
62896 185397 187075 188505 188943 188294 187298 186850 187240 188144 189251 190524 191833 192764 193094 193207 193695 194702 195961
62879 195961 197293 198621 199583 199696 198943 197770 196425 194761 192835 191107 189789 188511 186981 185503 184414
62864 184414 183457 182292 181228 180808 180908 180913 180688 180684 181068 181378 181164 180453 179416 178129 176849 176045 175805 175590
62846 175590 174876 173855 173152 173061 173284 173354 173076 172592 172156 171927 172021 172716 174314 176581 178591 179592 179949 180714
62828 180714 182302 184114 185588 187009 188983 191610 194609 197892 201488 205086 208165 210525 212368 213900
62814 213900 215234 216662 218665 221426 224510 227190 229143 230794 232967 236127 240020 244151 248528 253675
62800 253675 259925 267016 274474 282145 290229 299108 309357 321572 335883 351828 369001 387594 408014
62787 408014 430277 454256 480355 509415 541921 577789 616932 659488 705194 752991 801611
62776 801611 850389 899168 947552 994515 1038687 1078753 1113559 1142045 1163244 1176369 1180936 1176844
62764 1176844 1164309 1143793 1116125 1082676 1045051 1004328 960701 914211 865803 817286 770113
62753 770113 724525 680198 637400 597079 559920 525845 494570 466147 440674 417854 397235
62742 397235 378657 362051 346993 332955 319946 308392 298373 289411 281173 273900 267897 262984
62730 262984 258769 255140 252172 249734 247510 245332 243262 241499 240308 239858 239943 240106 240280 241021 242800 245357
62714 245357 248195 251491 255954 261875 268818 276255 283990 291942 300122 309099 319927 333175 348349
62701 348349 364675 382195 401628 423251 446403 470094 493701 516893 539224 560117 579211
62690 579211 596446 611697 624357 633408 638014 638006 633759 625579 613410 597247 577696 555942 533100
62677 533100 509726 486019 462342 439315 417364 396365 375963 356238 337855 321447 307001
62666 307001 294018 282259 272048 263712 256870 250535 244005 237502 231778 227159 223207 219361 215619
62653 215619 212318 209456 206645 203783 201321 199624 198377 196953 195201 193573 192544 192175 192154 192000 191330
62638 191330 190239 189380 189322 189827 190154 190084 190238 191196 192693 193981 194696 194990 195008 194663 194010 193553 193977 195577
62620 195577 197957 200296 201975 203015 203814 204558 205138 205683 206836 209211 212829 217312 222477 228369 234826
62605 234826 241539 248687 257192 268041 281424 296621 312654 329022 345975 364191 384167 405819
62593 405819 428624 452054 475693 499062 521582 542712 561840 577958 589835 596800 599184 597710
62581 597710 592613 583675 570967 555082 536607 515815 493139 469582 446254 423682 401907 381154
62569 381154 361997 344776 329166 314479 300215 286263 272862 260546 249846 240758 232683 225151
62557 225151 218413 212969 208708 204971 201402 198141 195140 191965 188629 186009 184836 184597 184086 182812 181251
62542 181251 179827 178473 177266 176701 176914 177253 177117 176810 177032 177860 178863 180063 182137 185531 189853 194297
62526 194297 198405 202340 206645 211823 217974 224779 231970 239692 248220 257490 267211 277340 288039 299218
62512 299218 310553 321964 333610 345293 356318 366104 374484 381234 385773 387700 387257 384977 381201
62499 381201 376142 369991 362560 353269 341928 329184 315776 301851 287648 274332 263242 254432
62487 254432 246815 239650 232982 226671 220119 213375 207578 203645 201144 199032 196917 194941 192930 190449
62473 190449 187552 184745 182312 180168 178337 177014 176178 175547 174992 174619 174459 174389 174394 174622 175204 176253 177937
62456 177937 180197 182450 183890 184187 183683 183003 182682 183045 184072 185361 186484 187386 188213 188922 189423 189967 190918
62439 190918 192161 193169 193742 194177 194612 194685 194124 193303 192923 193356 194483 195875 196920 197071 196289 195116 194094
62422 194094 193334 192810 192749 193328 194126 194361 193798 193159 193431 194875 196820 198435 199638 201169 203755 207278 210831
62405 210831 213521 215143 216197 217452 219485 222380 225815 229479 233309 237231 240929 244247 247625 251696
62391 251696 256434 261238 265825 270542 275673 280979 286203 291518 297182 303220 309758 317206 325648 334486
62377 334486 343174 352005 361659 372335 383891 396597 411087 427662 446175 466525 488717 512545
62365 512545 537824 564935 594569 626882 661464 698188 737434 779208 822509 865732 907238
62354 907238 945383 978678 1006352 1028380 1044632 1054426 1057289 1053762 1044919 1031404 1013465 991717
62342 991717 967202 940562 911623 880044 846220 811368 776753 742943 709896 677817 647765
62331 647765 620993 597690 576694 556724 537585 519985 504437 490713 478208 466513 455671
62320 455671 446086 438060 431258 424835 418316 412137 406984 402785 398869 395017 391876 390131 389633 389557 389271
62305 389271 388921 389174 390394 392094 393366 394011 394971 397345 401127 405310 409087 412474 415756 418919 421932
62290 421932 425181 429219 434176 439644 445099 450328 455508 460987 466906 472967 478759 484341 490460 498097
62276 498097 507795 519318 531841 544621 557709 571961 588164 606365 626373 648666 674136 702909
62264 702909 734036 766668 801000 837772 877290 919385 963928 1010723 1058889 1106768 1152479
62253 1152479 1194362 1231013 1261272 1284331 1299828 1307881 1308984 1303632 1291958 1274034 1250612 1223203
62241 1223203 1193173 1161153 1127552 1093177 1058898 1025138 992264 961138 932623 906767 883146
62230 883146 861882 843574 828316 815480 804594 795759 789081 784339 781314 779747 778849 777615 775960
62217 775960 774857 774941 775663 776264 776828 777765 778970 780349 782677 786921 792884 799446 806046 813083 820883 829211
62201 829211 838028 847892 859228 871826 885456 900348 916602 933713 951256 969632 989453 1010438
62189 1010438 1031640 1052657 1073860 1095269 1115952 1135001 1152608 1169507 1185555 1199576 1210810
62178 1210810 1219975 1228553 1237367 1246392 1255836 1266720 1280119 1296212 1314527 1334957 1358081 1384324
62166 1384324 1413097 1442940 1472386 1500438 1526217 1548441 1565642 1577024 1582927 1584233 1581442 1574515
62154 1574515 1563464 1548639 1530355 1508682 1483898 1456907 1428889 1400690 1372745 1345357 1318764
62143 1318764 1293080 1268490 1245456 1224442 1205567 1188677 1173632 1160160 1147663 1135653 1124420
62132 1124420 1114855 1107430 1101639 1096625 1092091 1088406 1085968 1084713 1084264 1084468 1085626 1088074 1091607 1095625
62118 1095625 1099898 1104708 1109883 1114107 1115800 1114584 1111373 1107179 1102503 1097841 1093851 1090490 1086485 1080155
62104 1080155 1070619 1058095 1043534 1028368 1014151 1001782 991069 981338 972405 964788 959213 956176
62092 956176 955709 957176 959529 962206 965700 970913 978087 986759 996628 1007892 1020706 1034821 1049942
62079 1049942 1065999 1082761 1099567 1115840 1131719 1147743 1163973 1179787 1194680 1208887 1222942
62068 1222942 1236831 1249951 1261819 1272383 1281527 1288719 1293430 1295568 1295085 1291374 1283560 1271256 1254676
62055 1254676 1234179 1210314 1184142 1156675 1127806 1096605 1063048 1028705 995174 962511 929945
62044 929945 897569 866342 836677 808126 780628 755152 732732 713391 696431 681390 668338
62033 668338 657463 648679 641547 635416 629702 624114 618559 612882 606865 600386 593370 585696 577407 568914
62019 568914 560652 552630 544671 536945 529806 523213 516913 511281 507346 505776 506328 508547 512402 517870
62005 517870 524510 532048 540961 551737 563705 575192 584741 591680 595655 596435 594387 590454 585231 578409
61991 578409 569512 558794 546953 534162 520044 504683 489115 474549 461422 449566 438973 429882
61979 429882 422197 415401 409265 404152 400291 397097 393750 390287 387609 386435 386664 387846 389773 392402
61965 392402 395589 399244 403530 408639 414506 420934 427845 435267 443258 452065 462196 474055 487590
61952 487590 502490 518593 535926 554520 574544 596552 621288 649176 680186 714112 750695
61941 750695 789465 829808 871338 913944 957277 1000434 1042411 1082749 1121504 1158680 1193975
61930 1193975 1227034 1257613 1285305 1309407 1329361 1345278 1357755 1367294 1374289 1379615 1384837 1391520
61918 1391520 1400621 1412813 1429157 1450971 1479104 1513720 1554775 1602256 1655898 1715135 1779423
61907 1779423 1848159 1920018 1992881 2064900 2135424 2204571 2272263 2338198 2402576 2466167 2529569
61896 2529569 2592806 2655664 2717821 2778372 2835553 2887132 2930823 2964240 2984963 2991157 2981972 2957061
61884 2957061 2915989 2858628 2786114 2700916 2605840 2503263 2395482 2285295 2175757 2069322
61874 2069322 1967448 1870998 1780707 1697226 1620957 1552044 1490474 1436115 1388773 1348331 1314723
61863 1314723 1287718 1266869 1251936 1243247 1241352 1246234 1257142 1273287 1294504 1321023 1352775 1389144
61851 1389144 1429286 1472383 1517583 1563882 1610122 1654911 1696458 1732731 1761996 1783219 1795969
61840 1795969 1800154 1796121 1784970 1768490 1748611 1727034 1705473 1686042 1670955 1661638 1658217 1660026
61828 1660026 1666475 1677183 1691318 1707091 1722070 1733885 1740583 1740526 1732354 1715156 1688708 1653525
61816 1653525 1610808 1562349 1510322 1456900 1403771 1351830 1301351 1252631 1206511 1164241 1126802
61805 1126802 1094491 1067168 1044634 1026589 1012382 1001223 992730 987139 984895 986205 991003 999115
61793 999115 1010276 1024102 1040248 1058640 1079501 1103173 1130006 1160356 1194641 1233345 1276898
61782 1276898 1325390 1378431 1435588 1497261 1564983 1640462 1724245 1815602 1913855 2019486 2133672
61771 2133672 2256965 2388851 2528563 2675873 2830752 2992378 3158629 3326453 3492557
61762 3492557 3653723 3806553 3947052 4070667 4172947 4250282 4299983 4319918 4308563 4265675
61752 4265675 4192767 4092740 3969220 3826393 3669042 3502061 3329617 3154913 2980776 2810107
61742 2810107 2645507 2488617 2340096 2200291 2069767 1949178 1838683 1737678 1645116 1560038
61732 1560038 1481729 1409531 1342814 1281286 1225087 1174312 1128496 1086750 1048337 1012912 980313
61721 980313 950388 923036 898118 875198 853566 832663 812375 792786 773779 754992 736089
61710 736089 716973 697708 678258 658335 637644 616431 595686 576506 559170 543053 527498
61699 527498 512617 499034 487008 476061 465528 455289 445823 437547 430298 423510 416767 409955 403020
61686 403020 395971 389215 383422 378759 374566 370127 365512 361203 357170 352907 348319 343968 340322 337217
61672 337217 334167 330798 326887 322467 318064 314405 311691 309526 307642 306206 305234 304259 302960 301619 300601
61657 300601 299820 299159 298986 299772 301504 304026 307605 312546 318405 324230 329548 334623 339771 344883 349613
61642 349613 353604 356510 358182 358837 358721 357689 355490 352332 348652 344386 339086 332933 327092 322771 320219
61627 320219 318828 317910 317151 316580 316416 316897 318123 320088 322806 326179 329737 332762 334732 335481 335013 333413
61611 333413 330916 327731 323707 318496 312130 305200 298376 292057 286532 282055 278440 274904 270720 266094
61597 266094 262122 259793 259095 259182 259333 259581 260292 261321 262004 262054 262008 262471 263301 264037 264864 266541 269392 272902
61579 272902 276360 279396 281870 283831 285881 289054 293911 299944 306173 312214 318561 325900 334328 343215
61565 343215 351842 360190 368973 378757 389328 400169 411191 422421 433206 442515 450073 456508 462247
61552 462247 467057 470936 474650 478822 483012 486311 488484 490077 491677 493579 495872 498372 500665 502631
61538 502631 504713 507314 510168 512685 514657 516199 517249 517579 517125 515902 513804 510945 507964 505553 503875
61523 503875 502934 503157 504950 507840 510903 514130 518701 525660 534922 545866 558388 572977 590064 609648
61509 609648 631481 655337 681131 708885 738631 770554 805301 843785 886279 931862 979262
61498 979262 1028067 1078558 1130385 1182128 1232243 1279770 1323869 1363344 1397092 1424486 1444851
61487 1444851 1457119 1460645 1456069 1444742 1427543 1404911 1377918 1348482 1318345 1288396 1259177 1231440
61475 1231440 1205835 1182459 1161215 1142359 1126189 1112337 1099931 1088568 1078715 1070883 1064745 1059363
61463 1059363 1054112 1049055 1044518 1040744 1037983 1036527 1036350 1036934 1037704 1038628 1040298 1043573 1049229 1057657 1068590
61448 1068590 1081219 1094954 1110044 1127212 1146708 1167955 1190080 1212456 1234702 1256464 1277377
61437 1277377 1297005 1314760 1330106 1342899 1353246 1360953 1365518 1366998 1366511 1365464 1364367 1362813 1360532
61424 1360532 1358015 1356029 1354854 1354224 1353797 1353464 1353226 1352814 1351446 1347968 1341442 1331678 1319149 1304470 1288131
61409 1288131 1270657 1252649 1234473 1216202 1198100 1180910 1165311 1151204 1137904 1125034 1112898
61398 1112898 1102002 1092598 1084830 1078901 1074882 1072606 1072044 1073582 1077710 1084628 1094378 1107120 1122944
61385 1122944 1141602 1162862 1187103 1215148 1247446 1283686 1323197 1365467 1410318 1457842 1508091
61374 1508091 1560433 1613212 1664525 1713410 1759784 1803090 1841580 1873263 1897113 1912979 1920827
61363 1920827 1920773 1913654 1900842 1883297 1861212 1834684 1804353 1771176 1735882 1698884 1660550 1621267
61351 1621267 1581293 1540815 1500264 1460407 1421902 1384805 1348783 1313931 1281063 1250953 1223550
61340 1223550 1198318 1175129 1154206 1135203 1117155 1099683 1083685 1070343 1059786 1051194 1043898 1037819
61328 1037819 1033022 1029429 1027052 1026125 1026906 1029487 1033678 1038892 1044379 1049906 1056055 1063482 1072014 1080836
61314 1080836 1089471 1098144 1107186 1116496 1125614 1133981 1141014 1146173 1149019 1149042 1145569 1138202 1127431 1114585
61300 1114585 1101030 1087461 1073880 1060179 1046755 1034572 1024353 1015674 1007333 998830 990960 984518
61288 984518 978930 972922 966259 960038 955331 952288 950603 950110 950721 952298 954837 958348 962505 966862 971412
61273 971412 976422 981716 986759 991599 997037 1003675 1011354 1019790 1029190 1039926 1052055 1065354 1079265
61260 1079265 1092632 1104188 1113762 1122443 1131234 1140131 1149009 1158695 1170427 1184661 1201083 1219417
61248 1219417 1239473 1260740 1282782 1305943 1330801 1356812 1382096 1404707 1423469 1437370 1444888
61237 1444888 1444627 1436464 1421619 1401492 1376750 1347612 1314739 1279407 1242780 1205392 1167589 1130189
61225 1130189 1094253 1060351 1028575 999205 972773 949328 928133 908214 888640 868120 845247
61214 845247 819766 793113 767090 742390 718941 697196 678159 662335 649485 639489 632711 629305
61202 629305 628756 630433 634192 640158 648030 656863 665437 672772 678398 682180 684038 684005 682619 680942 679891
61187 679891 679640 679751 679670 678967 677433 675270 673001 670898 668697 666087 663243 660506 657825 654863 651495
61172 651495 647866 644089 640184 636088 631485 625889 619293 612439 606069 600196 594494 589047 584159 579746
61158 579746 575671 572508 571157 571652 572893 573604 572972 570377 565266 557545 547587 535630 521616 505819
61144 505819 489162 472621 456625 441231 426535 412740 400106 388990 379663 371937 365184 358847
61132 358847 352721 346781 341079 335843 331357 327616 324321 321293 318629 316448 314779 313750 313589 314390 316043
61117 316043 318423 321466 325125 329407 334332 339673 345000 350219 355674 361281 365958 368604 369339 369061 367855
61102 367855 364724 359011 351468 343706 337063 332001 328029 324158 319974 316282 314182 313671 313813 314138 314962
61087 314962 316365 317898 319477 321570 324153 326454 328162 329947 332265 334538 336139 337326 338505 339409
61073 339409 339824 340454 342105 344442 346420 347602 348295 348723 348922 349221 350112 351707 353874 356739 360562 365294
61057 365294 370669 376467 382256 387339 391541 395687 400668 406323 411794 416762 421759 427537 434686 443587
61043 443587 454069 465321 476707 488475 501261 515251 530416 547193 566264 587891 611966
61032 611966 638413 667009 697320 729472 764455 802883 843906 886319 930366 977618 1029522
61021 1029522 1087083 1151546 1224183 1305540 1396096 1497643 1613205 1746134 1900662 2083107
61011 2083107 2301060 2561302 2869599 3232085 3655572 4147826 4720567 5392008 6183094
61002 6183094 7110967 8189386 9432745 10844307 12382687 13935984 15341408 16447793
60994 16447793 17173955 17523134 17562229 17400023 17172780 17013847 16998154 17096139 17181647 17094121
60984 17094121 16708533 15970635 14896421 13558214 12067003 10545648 9096914 7784428
60976 7784428 6635927 5657125 4840650 4169164 3620046 3171844 2806775 2509054 2264280
60967 2264280 2061021 1890960 1747009 1622819 1514246 1419401 1336496 1262860 1196466 1136966
60957 1136966 1084429 1038117 997099 960981 929126 899949 871872 844494 818092 792418 766616
60946 766616 740057 712688 684846 657215 630778 606347 584112 563769 544864 526959 509864
60935 509864 493957 479904 467818 456943 446476 436423 427421 419992 414189 409738 406204 403206 400596
60922 400596 398312 396022 393247 389994 386925 384657 383151 381981 380906 379917 378936 377835 376675 375720 375192
60907 375192 375003 374674 373569 371409 368424 364835 360426 355137 349855 345824 343134 340524 337008 333008 329430
60892 329430 326313 323152 320046 317653 316179 315156 314292 313906 314346 315456 316780 317905 318491 318267 317273 315904
60876 315904 314626 313691 313120 312801 312590 312431 312368 312350 312179 311798 311486 311547 311982 312674 313705 315170 316795 318109
60858 318109 318916 319276 319110 318232 316822 315466 314628 314350 314469 314797 315048 314928 314388 313501 312107 309983 307421
60841 307421 305113 303275 301374 299004 296563 294639 293175 291744 290308 289038 287653 285647 283239 281377
60827 281377 280574 280289 279741 278908 278404 278714 279917 281851 284142 286175 287502 288248 288911 289772 290745 291697 292608
60810 292608 293433 294062 294479 294760 294934 295084 295490 296344 297307 297693 297247 296463 296005 296042 296297 296373 295825 294246 291700
60791 291700 288936 286839 285663 285007 284326 283170 281137 278179 274994 272663 271609 271187 270466 269196 267817
60776 267817 266769 266065 265431 264570 263232 261242 258619 255675 252940 250901 249749 249376 249570 250145 250898 251696
60760 251696 252688 254222 256266 258159 259257 259731 260340 261471 262817 264000 265093 266370 267959 269913 272287
60745 272287 274942 277525 279783 281545 282314 281441 279031 276203 273930 271968 269490 266479 263811 262026 260732
60730 260732 259354 257846 256351 254629 252249 249213 246067 243439 241596 240387 239533 238946 238749 238950 239240
60715 239240 239256 238843 237851 235891 232784 229226 226455 225037 224320 223368 222147 221432 221684 222380 222560 221865 220879
60698 220879 220391 220442 220287 219359 218033 217189 217181 217595 217909 217996 217911 217615 217068 216329 215477 214727 214665 215926 218396 221121
60678 221121 223337 225248 227454 229938 232110 233660 234864 236048 237183 238091 238743 239254 239844 240803 242227
60663 242227 243722 244657 244876 244992 245827 247598 249715 251317 252007 252186 252743 254318 256761 259272 260999 261534
60647 261534 261035 260097 259385 259143 258932 257975 255862 252890 249731 246849 244211 241536 238833 236613 235433 235214
60631 235214 235269 235115 235009 235435 236304 237087 237617 238295 239386 240540 241272 241717 242570 244279 246439 248130 248867
60614 248867 249167 250039 251860 253954 255429 256190 256857 257877 259190 260716 262609 264782 266543 267021 265844
60599 265844 263308 260062 256775 253834 251119 248162 244749 241256 238315 236309 235304 235220 235795 236480 236668
60584 236668 236039 234624 232683 230595 228705 227025 225254 223354 221984 221992 223473 225547 227135 227709 227306 226199
60568 226199 224801 223677 223285 223671 224552 225713 227142 228739 230165 231245 232406 234310 236946 239461 241136
60553 241136 242193 243271 244454 245481 246783 249455 253942 259408 264814 270052 275619 281759 288622 296796
60539 296796 306840 318449 330895 344257 359469 377107 396896 418560 442351 468314 495570
60528 495570 522741 548559 571686 590444 603377 609889 609979 603727 591589 574938 555653 535141
60516 535141 514155 493418 473855 456124 440464 427196 417015 410448 407249 406564 407617 410155 414407
60503 414407 420866 430093 442449 457799 475350 493911 512572 531172 549910 568325 584904 597939
60491 597939 606714 611696 613779 613702 612137 609863 607592 605727 604419 603752 603874 605083 607900 612997 621060
60476 621060 632792 648967 670297 697261 730267 769941 817009 871777 933894 1002743 1077914
60465 1077914 1159154 1245800 1336127 1426920 1513490 1590253 1651671 1693061 1711069 1704002 1672093
60454 1672093 1617502 1543841 1455552 1357427 1254348 1151081 1051976 960420 878145 804961 739519
60443 739519 680762 628767 584161 546795 515230 487653 463103 441581 423082 406944 392394
60432 392394 379285 367801 357618 348047 339055 331427 325614 321065 317106 313870 311666 309985 308012
60419 308012 305867 304389 303738 303156 302189 301226 300513 299579 298109 296652 295819 295385 294798 294110 293728 293636 293512 293425
60401 293425 293800 294838 296408 298368 300604 302962 305593 308994 313209 317263 320053 321656 323153 325270
60387 325270 327791 330198 332250 333920 335387 337130 339473 341995 343895 344981 345733 346468 347117 347889 349321
60372 349321 351447 353584 355279 356803 358355 359466 359697 359421 359399 359947 361005 362555 364408 365894 366408 366209
60356 366209 366188 366948 368475 370553 373039 375797 378722 381831 385043 387998 390407 392462 394580 396789 398636
60341 398636 399655 399705 398993 398009 397275 396851 396213 394901 393157 391643 390709 390321 390518 391357 392370 392562 391252
60324 391252 388729 385903 383389 380978 377929 373792 369000 364493 360717 357268 353708 350375 347955 346523
60310 346523 345503 344498 343681 343369 343637 344382 345357 346153 346540 346858 347608 348643 349292 349433 349821 350997 352340
60293 352340 352761 352056 351052 350500 350257 349687 348489 346911 345243 343343 340737 337212 333235 329690 327166
60278 327166 325547 324259 322900 321648 321096 321638 322980 324426 325653 326961 328627 330410 332127 334364 337962
60263 337962 342797 347678 351582 354436 356520 357782 358242 358629 359916 362274 364931 366991 368004 367856 366739
60248 366739 365498 365511 367645 371384 375400 379076 383106 388389 394698 400996 406949 413512 421812 432050
60234 432050 443845 457110 471912 487807 504156 521127 539723 560688 583902 608963 635769
60223 635769 664337 694602 726648 760588 795874 831164 865286 897984 929429 959408 987380
60212 987380 1012890 1035405 1054018 1067931 1077119 1082161 1083557 1081614 1076770 1069486 1059920 1048261 1035403
60199 1035403 1022783 1011452 1001692 993652 987894 985071 985375 988646 994949 1004754 1018533 1036324 1057804
60186 1057804 1082720 1111062 1142717 1177223 1214087 1253156 1294166 1335960 1376683 1414874 1449815
60175 1449815 1480672 1506094 1525262 1538677 1547150 1550427 1547704 1539221 1526297 1509730 1489123 1464099
60163 1464099 1435437 1404604 1372868 1341428 1311857 1285657 1263477 1245247 1231072 1221600 1217483 1218732
60151 1218732 1224745 1234876 1248884 1266715 1287770 1310516 1333100 1354307 1373710 1390948 1405251
60140 1405251 1415779 1422177 1424696 1424017 1420995 1416183 1409458 1400447 1389488 1377834 1366694 1356449 1347201
60127 1347201 1339779 1335645 1335867 1340658 1350060 1364680 1385456 1412844 1446522 1485942 1531074 1582587
60115 1582587 1641413 1708162 1782739 1864233 1951167 2042142 2136316 2233035 2330889 2427472 2520343
60104 2520343 2607926 2689151 2762561 2826313 2878907 2919331 2946546 2959458 2957518 2940913 2910158
60093 2910158 2866074 2810252 2744888 2671879 2592639 2508989 2423525 2338606 2255619 2175886 2101701
60082 2101701 2035562 1978459 1929639 1888027 1853315 1825730 1805474 1792612 1786995 1787997 1794498 1805274
60070 1805274 1819177 1834964 1851281 1866938 1881023 1892832 1901944 1908267 1911618 1911221 1906079 1895982
60058 1895982 1881783 1864525 1844581 1821713 1795587 1765962 1732785 1696488 1658073 1618586 1578525
60047 1578525 1537981 1497222 1456928 1417928 1380962 1346707 1315788 1288674 1265624 1246828 1232605
60036 1232605 1223486 1220005 1222264 1229707 1241581 1257713 1278568 1304355 1334385 1367685 1404071 1443978
60024 1443978 1487065 1531451 1574656 1614966 1651584 1683802 1710655 1731322 1745270 1751836 1750195 1740110
60012 1740110 1722397 1698270 1668479 1633473 1594177 1552106 1508763 1465380 1423271 1383893 1348364
60001 1348364 1317280 1291191 1270854 1256665 1248142 1244441 1245306 1251196 1262585 1279413 1301290 1327942
59989 1327942 1359382 1395732 1436917 1482453 1531525 1583292 1636965 1691415 1744826 1794998 1840130
59978 1840130 1879305 1912237 1938647 1957888 1969163 1972052 1966728 1953544 1932574 1903898 1868363 1827695
59966 1827695 1783664 1737515 1690449 1644343 1601433 1563305 1530447 1502732 1479986 1462160 1449364
59955 1449364 1441897 1440055 1443834 1452970 1467227 1486449 1510362 1538527 1570427 1605327 1642082 1679431
59943 1679431 1716525 1752965 1788307 1821820 1852771 1880635 1904904 1925019 1940740 1952434 1960864
59932 1960864 1966842 1971209 1974940 1979102 1984804 1993187 2005289 2021837 2043462 2071162 2106250 2149580
59920 2149580 2201133 2260496 2327376 2401206 2480486 2562999 2646669 2729815 2810619 2886820 2956019
59909 2956019 3015932 3064169 3098148 3115664 3115627 3098218 3064500 3015979 2954480 2882303 2802379 2718065
59897 2718065 2632404 2547452 2464480 2384818 2310216 2242263 2181773 2129051 2084455 2048289 2020275
59886 2020275 1999618 1985638 1978081 1976884 1982063 1993860 2012389 2036867 2065626 2097210 2131056 2166623
59874 2166623 2202246 2235497 2264604 2288924 2308042 2320984 2326567 2324058 2313334 2294751 2269125 2237479
59862 2237479 2200586 2158953 2113332 2064895 2014733 1963555 1912071 1861279 1812020 1764668 1719665
59851 1719665 1678035 1640859 1608432 1580364 1556252 1535668 1517677 1501086 1485307 1470441 1456430
59840 1456430 1442659 1428703 1414971 1402187 1390420 1378914 1366793 1353735 1340050 1326317 1313011
59829 1313011 1300502 1289320 1280204 1273682 1269780 1268372 1269585 1273502 1279576 1286826 1294567 1302439 1309716
59816 1309716 1315212 1318106 1318362 1316124 1311275 1304010 1295372 1286657 1278494 1270914 1264037 1258166 1253331 1249221
59802 1249221 1245566 1242239 1239132 1236411 1234859 1235409 1238164 1242219 1246624 1251222 1256402 1262269 1268360 1274039
59788 1274039 1278891 1282738 1285450 1286914 1287224 1286884 1286728 1287547 1289757 1293427 1298590 1305614 1315417 1329305 1348365
59773 1348365 1372890 1402560 1437242 1477365 1523386 1575293 1632954 1696749 1767404 1845211 1929725
59762 1929725 2020057 2114910 2212070 2308098 2398559 2478235 2541174 2581362 2594381 2579021 2537549
59751 2537549 2474694 2396375 2308820 2217920 2128607 2044399 1967330 1898311 1837742 1786025 1743605
59740 1743605 1710532 1686066 1668881 1657699 1651768 1650814 1654756 1663595 1677478 1696528 1720484 1748649
59728 1748649 1780431 1815947 1856017 1901574 1953249 2011427 2076416 2148468 2227837 2314957 2410492
59717 2410492 2515141 2629593 2754688 2891284 3039716 3199563 3370100 3550681 3740323
59708 3740323 3937035 4137954 4340061 4540497 4736298 4924260 5101265 5264654 5412542
59699 5412542 5544278 5660685 5763462 5854166 5933933 6004056 6066210 6121759 6171114 6214070 6250522
59688 6250522 6280608 6304280 6321072 6330327 6331682 6325581 6313434 6297112 6278204 6257970 6238011 6220533
59676 6220533 6207688 6201023 6201936 6212350 6234403 6269579 6318588 6381978 6460346 6553833 6661801 6783110
59664 6783110 6916403 7059908 7211149 7367021 7524064 7678603 7826643 7963583 8084009
59655 8084009 8182074 8252416 8290713 8293354 8257184 8180420 8064030 7911847 7729216 7521789 7295396
59644 7295396 7056282 6811031 6566347 6328764 6103755 5894555 5702008 5525546 5363763
59635 5363763 5213839 5071092 4929757 4784036 4628551 4459102 4274405 4077025 3871867
59626 3871867 3663832 3457372 3257421 3068944 2894981 2736006 2591590 2461768 2346365
59617 2346365 2243999 2152806 2071722 2000240 1937271 1881130 1830629 1785434 1745244 1709269 1676747
59606 1676747 1647530 1621771 1599213 1579026 1560344 1542908 1527114 1513349 1501243 1489761 1478097
59595 1478097 1466195 1454241 1441945 1428740 1414542 1399921 1385500 1371440 1357484 1343266 1328650
59584 1328650 1313960 1299753 1286149 1272584 1258566 1244488 1231271 1219305 1208272 1197985 1188794
59573 1188794 1181029 1174578 1169342 1165624 1163639 1162972 1163020 1163942 1166714 1172131 1179973 1189285 1199392 1210513
59559 1210513 1223415 1238592 1255919 1275115 1296257 1319652 1345370 1373303 1403648 1436930 1473380
59548 1473380 1512564 1553897 1597365 1643561 1693038 1745811 1801483 1859744 1920539 1983528 2047307
59537 2047307 2109391 2167279 2219524 2265715 2305742 2339536 2367377 2389914 2407669 2420769 2429191
59526 2429191 2432920 2431772 2425398 2413580 2396272 2373441 2345282 2312626 2276618 2237867 2196469 2153098
59514 2153098 2109495 2067454 2027710 1990235 1955286 1923808 1897100 1876502 1863085 1857201 1858587 1867278
59502 1867278 1884108 1909925 1944615 1987427 2037919 2096019 2161413 2233536 2311884 2395461 2481848
59491 2481848 2567531 2649325 2724950 2792165 2848103 2889817 2915111 2922793 2912792 2886360 2845542
59480 2845542 2791988 2726694 2651298 2569093 2484175 2399858 2318366 2241714 2171958 2110522 2057885
59469 2057885 2014260 1980141 1955835 1940750 1933548 1933015 1938527 1949627 1965444 1984759 2006519 2029919
59457 2029919 2053829 2076435 2095785 2110609 2120320 2124205 2121048 2109771 2090277 2063449 2030365 1991611
59445 1991611 1947313 1897752 1843907 1787353 1729502 1671080 1612503 1554638 1498787 1445824 1395737
59434 1395737 1348192 1303216 1261028 1221552 1184565 1150279 1119294 1091926 1067917 1046906 1028857
59423 1028857 1013800 1001423 991286 983369 978074 975649 975892 978577 983915 992172 1002791 1014088 1023883
59410 1023883 1030414 1032873 1031681 1028508 1025605 1024571 1025730 1028905 1034479 1043116 1054398 1066331 1076487
59397 1076487 1083402 1086750 1086777 1084192 1080438 1077393 1076476 1078183 1082511 1089515 1099307 1111797 1126794 1144366
59383 1144366 1164799 1188083 1213626 1240705 1269144 1299317 1331574 1365940 1402497 1441611 1483390
59372 1483390 1527146 1571887 1617427 1664584 1714206 1766375 1820822 1877775 1938053 2002494 2071656
59361 2071656 2145996 2225979 2311947 2404264 2503767 2611904 2730058 2858703 2997305 3145088
59351 3145088 3301649 3466684 3639112 3816694 3996498 4175444 4350272 4517317 4672925
59342 4672925 4814329 4939962 5048856 5140003 5212493 5265986 5300641 5316501 5313205 5290443 5248563
59331 5248563 5188552 5111330 5017107 4905493 4776368 4630753 4471022 4300400 4122370 3940393
59321 3940393 3757869 3578025 3403611 3236612 3078259 2929402 2790893 2663530 2547554
59312 2547554 2442353 2346906 2260498 2182800 2113253 2050648 1993666 1941808 1895644 1855909 1822278
59301 1822278 1792968 1765518 1737959 1709271 1678969 1646676 1612408 1577107 1542448 1509919 1480128
59290 1480128 1453042 1428664 1407270 1389053 1373783 1360881 1349762 1340096 1331906 1325609 1321871 1321171
59278 1321171 1323340 1327693 1333756 1341738 1352176 1365309 1381036 1399159 1419102 1439561 1459185 1477768
59266 1477768 1496125 1514442 1531407 1545391 1555803 1562601 1565115 1562379 1554420 1542151 1526011 1505695
59254 1505695 1481446 1454654 1426748 1398209 1369139 1340085 1311676 1284028 1257204 1231939 1209242
59243 1209242 1189439 1172133 1156923 1143639 1131988 1121610 1112541 1105242 1100066 1096976 1095773 1096278 1098273
59230 1098273 1101643 1106627 1113699 1123070 1134405 1147034 1160259 1173605 1187151 1201676 1218134 1236763
59218 1236763 1256913 1277959 1300209 1324595 1351477 1380132 1409763 1440908 1475373 1514552 1558052
59207 1558052 1604370 1652816 1704434 1761076 1824010 1893526 1969385 2051217 2138643 2231417 2329514
59196 2329514 2432925 2541170 2652732 2764684 2872989 2973592 3063483 3140551 3202504 3246396
59186 3246396 3269421 3269896 3247406 3202545 3136955 3053362 2955228 2846394 2730958 2612806 2494779
59175 2494779 2378657 2266252 2160043 2062175 1973287 1892989 1821138 1757890 1702769 1654706 1613111
59164 1613111 1578118 1549451 1525812 1505718 1488426 1473641 1460803 1449161 1438214 1427590 1416638
59153 1416638 1404532 1390792 1375489 1358997 1341605 1323216 1303320 1281490 1257988 1233605 1208886
59142 1208886 1183872 1158771 1134372 1111353 1089543 1068380 1047901 1028732 1011197 995101 980481
59131 980481 967989 958146 950621 944658 940017 937045 935976 936578 938528 941740 946135 951461 957639 965096
59117 965096 974319 985046 996239 1007125 1018110 1030436 1044907 1061129 1077960 1094514 1110552 1126096
59105 1126096 1141093 1155541 1169640 1183423 1196321 1207516 1216837 1225052 1233108 1241333 1249508 1257411
59093 1257411 1265048 1272613 1280606 1289742 1300338 1311908 1323741 1335795 1348605 1362386 1376695 1390917
59081 1390917 1404564 1417082 1427952 1437229 1445478 1452938 1459151 1463631 1466388 1467487 1466533 1462988 1456663
59068 1456663 1447567 1435604 1420777 1403368 1383565 1361253 1336555 1310250 1283152 1255347 1226542
59057 1226542 1197030 1167788 1139668 1112913 1087378 1062890 1039450 1017433 997507 980041 964695
59046 964695 950824 938172 926915 917309 909625 904143 900758 898765 897446 896670 896559 896873 897394 898735
59032 898735 902073 907970 915896 924941 934600 944912 956272 969039 982831 996273 1007863 1016986 1023702
59019 1023702 1027883 1029277 1028321 1026062 1023129 1019434 1014884 1009723 1004113 998191 992705 988765 986640 985477
59005 985477 984472 983565 982669 981112 978480 975250 971867 967752 962011 954691 946495 937657 927985 917894
58991 917894 908456 900273 892986 886117 879885 874965 871874 870798 871641 873986 877273 881328 886607 893681
58977 893681 902531 912384 922195 931113 938584 944180 947533 948448 947031 943648 938839 933293 927738 922675
58963 922675 918177 913998 909773 905092 899703 893985 889082 886154 885317 885501 885419 884586 883515 883134 883937 885535
58947 885535 887121 888525 890547 893985 898684 903995 909861 916770 924751 933152 941481 949789 958080 966019
58933 966019 973557 981244 989591 998531 1007774 1017356 1027588 1038870 1051781 1066934 1084422 1103672 1124007
58920 1124007 1145123 1167065 1190274 1215683 1244172 1275675 1309386 1344987 1383040 1423906 1466955
58909 1466955 1511199 1556009 1600871 1645192 1689015 1733284 1778787 1825429 1873172 1923049 1976352
58898 1976352 2033250 2093066 2155620 2221456 2290982 2364282 2441666 2523608 2610020 2700276 2793924
58887 2793924 2890817 2990501 3092056 3194482 3296642 3396808 3492923 3583457 3667586 3744445
58877 3744445 3812654 3870591 3916673 3949433 3967869 3971928 3962285 3939597 3904266 3856875 3798394 3729888
58865 3729888 3652406 3567190 3475671 3379159 3278822 3175887 3071604 2967106 2863575 2762318
58855 2762318 2664204 2569257 2477304 2388923 2305132 2226225 2151535 2080340 2012427 1947690 1885855
58844 1885855 1826896 1771226 1719255 1671092 1626783 1586364 1549506 1515558 1484209 1455805 1430795
58833 1430795 1409197 1390734 1375138 1362044 1350778 1340539 1330824 1321752 1314114 1308936 1306670 1306863 1308852
58820 1308852 1312555 1318203 1325613 1334433 1345063 1358492 1375018 1393771 1413847 1435324 1458821 1484542
58808 1484542 1512323 1542200 1574393 1608807 1645049 1682984 1723098 1766298 1813408 1864742 1920111
58797 1920111 1979245 2042110 2108643 2178447 2251293 2327895 2409596 2497007 2589348 2685304 2784118
58786 2784118 2885563 2989260 3094403 3199910 3304424 3406269 3503694 3595029 3678462 3751857
58776 3751857 3813117 3860675 3893470 3910576 3911111 3894638 3861549 3813090 3750922 3676535 3591077 3495822
58764 3495822 3392727 3284291 3172888 3060398 2948367 2838137 2730685 2626569 2526145
58755 2526145 2429698 2337377 2249205 2165182 2085216 2009020 1936342 1867241 1801910 1740343 1682565
58744 1682565 1629015 1580222 1536112 1496133 1460076 1428220 1400520 1376243 1354650 1335600 1319111
58733 1319111 1304716 1291616 1279172 1266965 1254614 1241869 1228787 1215635 1202743 1190509 1179284
58722 1179284 1169123 1159886 1151660 1144791 1139421 1135284 1132026 1129258 1126089 1121016 1112638 1100341 1084186
58709 1084186 1064461 1041475 1015482 986604 955136 922074 889003 857222 827166 798719 771695
58698 771695 745974 721700 699551 680299 663869 649366 636334 625464 617608 612598 609536 607767
58686 607767 607025 606944 607104 607397 607854 608150 607687 606057 603159 599091 594270 589367 584722 580107 575473 571581
58670 571581 569398 569125 570372 573037 577324 582987 589143 594871 599523 602570 603654 602914 600841 597809 594072
58655 594072 589973 585607 580440 573943 566641 559829 554158 549139 544200 539495 535328 531442 527496 523837
58641 523837 521178 519621 518505 517163 515494 513766 512203 510837 509612 508470 507429 506647 506430 507146 508910
58626 508910 511257 513279 514411 515103 516369 518609 521154 523237 525138 528038 532692 538524 544171 548855
58612 548855 553065 557918 564032 571194 578997 587425 596688 606799 617681 629530 642714 657343 673297
58599 673297 690671 709817 730801 753179 776543 801056 827136 854780 883527 913078 943620
58588 943620 975424 1008255 1041248 1073234 1103205 1130681 1155799 1178871 1199636 1217015 1229858
58577 1229858 1237938 1242041 1243107 1241555 1237451 1230962 1222431 1212290 1201184 1190001 1179438 1169653 1160481
58564 1160481 1151832 1143633 1135705 1128110 1121394 1115954 1111244 1106135 1100047 1093231 1085879 1077563 1067557 1055083
58550 1055083 1039065 1018453 993383 965502 936646 907455 877727 847662 818139 789981 763620
58539 763620 739435 717865 699013 682457 667571 653917 641429 630447 621491 614744 609802 606044
58527 606044 603093 600724 598500 595811 592138 587163 580868 573836 567180 561669 556933 551891 545975 539626
58513 539626 533635 528349 523613 519202 515145 511714 509140 507321 505954 504997 504814 505696 507462 509782 512741
58498 512741 516735 521923 528012 534515 541040 547447 553987 561173 569241 577856 586599 595585 605264 615697
58484 615697 626366 636632 646030 654197 660974 666673 671837 676529 680080 681708 681214 678909 675063 669690
58470 669690 662866 655027 646821 638628 630345 621687 612633 603480 594535 585957 577899 570576 564094 558320
58456 558320 552951 547693 542540 538043 535052 533766 533191 532068 530346 529102 528999 529535 530077 530894 532657
58441 532657 535468 538974 543013 547604 552578 557845 563796 570972 579517 589325 600395 612667 625912
58428 625912 640304 656637 675229 694797 713057 728210 739265 745398 746098 742059 734997 726306 716496
58415 716496 706073 696176 687922 681629 677023 673823 671798 670645 670252 670897 672889 676099 680062 684502
58401 684502 689631 695912 703500 711917 720372 728392 735902 742635 747907 751317 753327 754730 755789 756290
58387 756290 756220 755817 755129 754028 752664 751481 750825 750880 751810 753516 755454 757182 758932 761059 763138 764395
58371 764395 765069 766532 769751 774261 778984 783523 788195 793150 797981 802239 806088 810344 815838 822650
58357 822650 830063 837379 844603 852125 860005 867972 875997 884466 893754 903918 914778 926073 937621
58344 937621 949572 962327 975955 989871 1003350 1016177 1028485 1040291 1051552 1062373 1072686
58333 1072686 1082001 1090074 1097582 1105551 1114238 1123105 1131809 1140665 1150188 1160648 1172033 1184110 1196628
58320 1196628 1209800 1224308 1240442 1257534 1274740 1292057 1310073 1329125 1349283 1370728 1393358
58309 1393358 1416362 1438942 1461246 1483799 1506339 1528078 1548904 1569358 1589544 1609021 1627693
58298 1627693 1645891 1663582 1680429 1696746 1713574 1731657 1751008 1771491 1793071 1815512 1838612
58287 1838612 1862777 1888665 1916283 1945144 1975237 2007118 2041117 2077225 2115669 2156794 2200414
58276 2200414 2246078 2293855 2344148 2396952 2452134 2510134 2571388 2635331 2701034 2768582 2838666
58265 2838666 2911027 2984513 3058592 3133529 3209061 3284147 3358166 3431222 3503282 3574222 3644816
58254 3644816 3716571 3790502 3867112 3947445 4032981 4124509 4222236 4326865 4439377 4559991 4688581
58243 4688581 4825743 4972059 5126843 5289288 5460452 5642282 5834994 6037418 6249754
58234 6249754 6473979 6711778 6964189 7233104 7520864 7828480 8156565 8507797 8886004
58225 8886004 9293169 9730230 10200719 10710412 11263266 11861148 12508036 13211112 13977271
58216 13977271 14812334 15724753 16726663 17830481 19048456 20396933 21897705 23574439
58208 23574439 25452473 27564243 29951867 32664600 35760442 39313977 43419102 48182121
58200 48182121 53715787 60139493 67576609 76147187 85969592 97174151 109910361 124336017
58192 124336017 140598401 158811252 179010016 201077549 224655269 249043081 273084460
58185 273084460 295104409 313049073 324898010 329193165 325401547 313963070 296104042
58178 296104042 273563253 248289042 222123662 196549394 172585108 150825995 131536115
58171 131536115 114731736 100259668 87878861 77322915 68329292 60652424 54076954
58164 54076954 48424077 43544862 39312261 35621027 32387812 29544749 27033608 24806243
58156 24806243 22824977 21058232 19477360 18058577 16783924 15637595 14603569 13668143
58148 13668143 12821567 12054990 11358189 10721992 10140417 9608355 9119050 8665543 8242882
58139 8242882 7847370 7475292 7123906 6792327 6480169 6186471 5910651 5652898 5412555
58130 5412555 5187472 4975823 4777259 4591564 4417572 4254191 4101090 3957529 3821836
58121 3821836 3692769 3570205 3453834 3342511 3235587 3133627 3037014 2945009 2856879 2772819
58111 2772819 2693045 2616989 2544014 2474020 2406945 2342624 2281460 2224090 2170094 2118192 2067959
58100 2067959 2020056 1974495 1930209 1886797 1845174 1805888 1768365 1732600 1700036 1671645 1646303
58089 1646303 1622125 1598366 1575049 1551763 1527916 1503429 1478222 1451724 1423719 1394961 1366084
58078 1366084 1336608 1305801 1273945 1241991 1210574 1180038 1150889 1123490 1097748 1073531 1050905
58067 1050905 1029588 1008889 988615 969345 951403 934416 918316 903795 891113 879328 867413
58056 867413 855310 843141 830330 816475 802383 789136 776684 764305 752023 740518 729891
58045 729891 719511 709023 698734 689052 680202 672401 665679 659483 652981 645841 638467 631541 625559
58032 625559 620577 616133 611548 606490 601078 595406 589316 582737 575849 568773 561595 554812 549129 544580
58018 544580 540372 535969 531792 528466 525898 523531 521079 518602 516225 514206 512969 512704 513107 513699 514152
58003 514152 514256 514018 513892 514468 515821 517625 519946 523242 527463 531825 535736 539326 542877 546351 549675
57988 549675 552785 555240 556588 557281 558400 560264 562324 564707 568578 574370 580882 587054 593578 601637
57974 601637 610841 619586 626876 632648 636777 638963 639332 638099 634731 628386 619051 607460 594091 579139
57960 579139 563341 547844 533121 518762 504495 490820 478509 467962 459173 451915 445917 441123
57948 441123 437711 435719 434929 435414 437735 442189 448202 454942 462168 470037 478503 487432 496790 506038 513840
57933 513840 519213 522679 525434 527610 528147 526179 521707 515018 506360 496287 485614 474957 464830
57920 464830 456044 449220 443971 439346 435164 432132 430552 429720 428850 427911 427202 426647 425816 424258 421612 417730
57904 417730 412878 407469 401595 395183 388494 381948 375478 368737 362053 356522 352879 350803 349557 348815
57890 348815 348579 348779 349196 349391 348536 345815 341326 336152 331197 326397 321349 316212 311381 306685 301665
57875 301665 296584 292470 290012 288909 288610 289248 291423 295237 300037 305188 310701 316917 323841 331128 338526
57860 338526 345896 352875 358987 364169 368828 373281 377465 381265 384596 387005 387750 386588 384029 380459
57846 380459 375560 369101 361786 354611 347712 340597 333297 326515 320739 315927 312120 309633 308465 308130
57832 308130 308276 308996 310375 312217 314416 317102 320170 323055 325286 326984 328532 330005 331134 331679 331669
57817 331669 331360 330997 330383 328730 325279 320201 314565 309261 304263 299253 294646 291500 290395 290803 291824
57802 291824 293362 296147 300604 306187 312144 318584 326152 334808 343642 351990 359973 367666 374508 380064
57788 380064 384717 388928 392321 394256 394909 394955 394475 393104 391134 389566 388863 388311 386738 383342 377850 370531
57772 370531 362156 353405 344202 334066 323033 311665 300291 289006 278354 269191 261657 255079 248997
57759 248997 243480 238247 232522 226307 220961 217763 216434 215659 214574 213148 211627 210359 209904 210587 212007
57744 212007 213466 214796 216309 218116 219940 221577 223105 224601 225894 226677 226807 226614 226875 228130 229952
57729 229952 231351 232128 233280 235700 238941 241783 243664 244911 245848 246382 246482 246415 246378 246302 246154 246058 245988 245600
57711 245600 244571 242998 241423 240531 240707 241743 243017 244119 245187 246534 248217 250206 252721 255936 259475
57696 259475 262654 265196 267385 269499 271545 273640 276225 279654 283785 288233 292841 297795 303502 310515
57682 310515 319359 330134 342427 355885 370788 387757 406965 428083 451165 477251 507716 543202
57670 543202 583528 628541 678526 733472 792018 851045 906107 952431 986427 1007093 1016118 1016463
57658 1016463 1010937 1002076 992586 984869 979957 977398 976258 975853 975582 974804 973163 970448 965772 957458 944309
57643 944309 926708 905977 882934 857716 830827 803555 776990 751165 725588 700362 676329
57632 676329 654237 634166 615873 599304 584499 571226 559059 547797 537555 528405 520242 513051
57620 513051 507058 502467 499351 497909 498473 500909 504270 507520 510573 514335 519790 527345 536923 548289
57606 548289 561223 575693 591859 609716 628795 648552 668999 690529 713133 736127 758736
57595 758736 780651 801934 822632 842540 861066 877303 890388 899755 904888 905099 899987 890003 876036
57582 876036 858528 837450 813082 786333 758285 729897 702073 675323 649294 623326 597625
57571 597625 573238 550732 529595 509285 490143 472814 457293 443013 429565 416943 405409
57560 405409 395319 386640 378526 369935 360932 352727 346145 340742 335825 331495 328047 325090 322065 319083
57546 319083 316452 313949 311407 309571 309310 310229 311028 311130 311058 311298 311762 312429 313593 315236 316928 318553
57530 318553 320571 323345 326780 330687 334921 339085 342796 346455 351070 357087 363990 371241 378926 387165
57516 387165 395639 404267 413822 425254 438640 453289 468602 484395 500603 517210 534405 552350
57504 552350 570759 588996 606693 624140 641960 660356 678559 695062 708634 719116 727035 732511
57492 732511 734980 734048 730022 723193 713021 698758 680844 661146 641563 622662 603830 584553
57480 584553 565271 546989 530265 514734 499620 484656 470423 457825 447277 438377 430340 422739
57468 422739 415859 410360 406691 404835 404460 405009 405683 405754 405195 404845 405719 408231 412246 417599 424269 432188
57452 432188 441241 451353 462328 473709 485214 497270 510697 525753 541840 558243 574867 592034
57440 592034 609798 627684 644984 661062 675337 687126 695728 700828 702730 701976 698651 692303 682614
57427 682614 669886 654713 637525 618708 598801 578174 556799 534754 512719 491487 471203
57416 471203 451598 432751 415030 398440 382740 368170 355306 344100 333751 323775 314506 306309
57404 306309 298986 292335 286705 282406 278954 275422 271298 266707 262141 258291 255698 254144 252654 250532
57390 250532 248089 245963 244147 242209 240133 238262 236582 234769 232928 231629 231084 230799 230293 229722 229589
57375 229589 230082 230910 231606 231848 231704 231609 231993 232829 233675 234141 234140 233722 232939 231910 230810 229737 228757 228074 227898
57356 227898 228066 228065 227562 226735 226001 225639 225761 226404 227384 228224 228443 227902 226769 225281 223712 222460 221896 222098
57338 222098 222891 224097 225609 227203 228520 229347 229847 230387 231181 232057 232626 232729 232839 233790 235838 238090 239226
57321 239226 238891 238054 237921 238840 240403 242104 243562 244520 245207 246441 248739 251481 253568 254831 256135 258059
57305 258059 260236 262196 264090 266212 268422 270561 272905 275663 278453 280816 282922 285335 288381 292174
57291 292174 296836 302141 307372 312188 317305 323637 331113 339016 347081 355331 363170 369841 375760 382248
57277 382248 389687 396992 403218 408552 413221 416519 417804 417721 417515 417469 416788 414719 411180 406568 401524 396650
57261 396650 391997 387049 381649 376551 372520 369280 366025 362688 359952 358127 356811 355678 354929 354730 354783
57246 354783 354725 354587 354688 355315 356673 358829 361484 363994 365819 367008 368275 370543 374208 378682 382783
57231 382783 385731 387685 389283 390974 392974 395445 398304 401104 403551 405997 408979 412462 415948 419227
57217 419227 422510 425947 429516 433407 437981 443202 448596 453910 459382 465210 471155 476850 482161 487021
57203 487021 491307 495214 499463 504734 510963 517461 523674 529565 535321 540984 546519 552055 557863 564074
57189 564074 570600 577438 584878 593163 601991 610703 619029 627288 635715 644063 652252 661002 671142 682479
57175 682479 694018 705367 717266 730448 744562 758693 772655 787244 803238 820501 838149
57164 838149 855377 871986 888199 904165 919860 935428 951295 967733 984438 1000858 1016816
57153 1016816 1032542 1048226 1063953 1080062 1097093 1115218 1134101 1153560 1174016 1196037 1219754
57142 1219754 1245081 1272349 1302293 1335306 1370967 1408345 1446697 1485825 1525928 1567237 1609787
57131 1609787 1653425 1697847 1742618 1787373 1832265 1878132 1925921 1975889 2027572 2080610 2135392
57120 2135392 2192755 2253163 2316319 2381579 2448720 2518377 2591685 2669463 2751924 2839426 2933345
57109 2933345 3035925 3149373 3275536 3416494 3574984 3754157 3957598 4190156 4458579
57100 4458579 4770933 5135563 5560923 6056048 6630456 7293295 8052710 8915872 9888903
57091 9888903 10976185 12179505 13497671 14926526 16458962 18084482 19787783 21546092
57083 21546092 23326077 25082132 26757399 28287664 29607651 30658910 31397455 31798207
57075 31798207 31854351 31572975 30970575 30070827 28904239 27508171 25926589 24209480 22411144
57066 22411144 20586461 18785923 17051595 15415359 13898834 12513896 11263735 10144799
57058 10144799 9149105 8266045 7483552 6789144 6170971 5618478 5122741 4676859 4276237
57049 4276237 3918073 3600024 3319059 3071416 2853403 2662006 2494696 2348809 2221299
57040 2221299 2109234 2010518 1923964 1848693 1783798 1728733 1683657 1648879 1624096 1608809 1603455
57029 1603455 1609171 1625328 1647060 1665701 1672137 1660274 1628161 1577108 1510604 1433823 1353027 1274134
57017 1274134 1201170 1135791 1078049 1027370 982962 943873 909192 878243 850442 825120 801758
57006 801758 780303 760918 743346 726808 710593 694536 678791 663420 648483 634399 621896
56995 621896 611487 603066 596081 590034 584842 580787 578155 576920 576801 577673 579802 583439 588067 592221
56981 592221 594343 593870 591321 587327 581909 574856 566408 557126 547254 536808 526339 517075 510064 505467
56967 505467 502838 501694 501617 502271 503772 506771 511815 518737 526923 535838 544941 553416 560446 565601 568577
56952 568577 568810 565848 559920 551688 541674 530468 519236 509211 500680 493155 486542 481451 478256
56939 478256 476646 476405 477969 481831 487954 496114 506272 518123 530669 542619 552948 560810 565326
56926 565326 565863 562251 554533 542901 528144 511697 494808 478025 461668 446284 432204 419234
56914 419234 407337 397068 388716 381515 374521 367952 362835 359534 357508 356370 356206 356707 356908 356174 354801
56899 354801 353353 352000 350863 350446 351222 353099 355627 358498 361601 364937 368742 373431 379059 385101 390987
56884 390987 396545 401615 405513 407361 406891 404579 401056 396691 391747 386632 381895 378123 375819 375215 376178
56869 376178 378519 382428 388458 397020 407983 420934 435729 452597 471597 491977 512184 530517
56857 530517 545710 556957 563669 565519 562678 555752 545433 532455 517963 503648 491191 481553
56845 481553 474957 471455 471290 474694 481669 492210 506572 524965 546979 571665 598332 626919 657158
56832 657158 687444 714864 736364 749712 753592 747549 732234 709356 681020 649277 616424 585092
56820 585092 557391 534103 515211 501025 492108 488179 487965 490522 496185 505765 519219 535593 553958
56807 553958 573750 594074 613101 628355 637563 639310 633245 619951 600683 577166 551435 525459
56795 525459 500549 477117 455281 435686 419574 407900 400545 396459 394495 394056 395188 398370 404150
56782 404150 412645 423131 434145 444024 451290 454642 453087 446506 435947 422924 408326 392256 374926
56769 374926 357256 340409 325051 311362 299446 289337 280710 272984 265794 259193 253448 248779 245211
56756 245211 242412 239751 236795 233766 231268 229531 228152 226615 224811 222962 221243 219637 218006 216217
56742 216217 214255 212290 210553 209147 208038 207191 206586 206120 205651 205153 204689 204213 203553 202647 201664 200837 200237
56725 200237 199753 199239 198700 198355 198461 199044 199886 200802 201720 202410 202464 201873 201372 201775 203006 204187 204685 204651 204496
56706 204496 204281 203835 203113 202195 201142 200053 199066 198194 197348 196616 196236 196151 195902 195235 194512 194167 193995 193379
56688 193379 192161 190872 190046 189587 188949 187778 186221 184764 183887 183862 184747 186465 188832 191532 194207 196588
56672 196588 198539 199982 200869 201223 201212 201126 201230 201521 201667 201415 201047 201105 201501 201381 200302 199123 199072 200139
56654 200139 201136 201255 200728 199920 198784 197611 197335 198357 199739 200385 200501 201010 201947 202428 202018 201088 199827
56637 199827 197915 195442 193234 191817 190758 189492 188231 187474 187113 186604 185792 184959 184244 183485 182581 181626
56621 181626 180678 179758 179057 178846 179119 179519 179663 179426 178945 178509 178377 178580 178976 179564 180499 181582 182047 181289
56603 181289 179716 178368 177657 176967 175706 174247 173438 173465 173748 173872 174070 174619 175210 175287 174824 174336 174183 174332
56585 174332 174911 176549 179660 183539 186681 188193 188551 188838 189558 190497 191388 192244 193076 193769 194420 195435 197131
56568 197131 199421 202080 205078 208481 212154 215850 219459 223017 226571 230257 234406 239267 244676 250202
56554 250202 255625 261007 266299 271212 275523 279202 282120 283960 284705 284937 285335 285963 286300 285869 284558 282401
56538 282401 279391 275600 271197 266239 260603 254254 247449 240593 234027 228047 222947 218771 215067 211116
56524 211116 206628 202128 198537 196296 194986 193785 192194 190242 188183 186245 184613 183378 182446 181750 181555
56509 181555 182207 183444 184366 184440 184228 184630 185635 186340 186213 185777 185858 186563 187259 187330 186694 185768 185050 184683 184358
56490 184358 183770 183069 182588 182191 181354 180023 178946 178818 179448 180155 180688 181342 182284 183268 183977 184280 184100 183394
56472 183394 182419 181702 181584 181970 182682 183834 185638 187862 189745 190593 190466 190197 190722 192321 194451 196178
56456 196178 196768 196075 194605 193217 192538 192550 192808 193042 193372 193990 194885 195978 197221 198381 198995 198878 198557
56439 198557 198847 199966 201313 202130 202116 201379 200079 198404 196746 195548 194871 194302 193516 192827 192872 193687 194437
56422 194437 194274 193215 191883 190634 189449 188562 188514 189405 190589 191435 191944 192380 192719 192891 193161 193727 194219
56405 194219 194164 193797 193820 194358 194753 194501 193898 193582 193836 194621 195941 197794 199890 201662 202665 202936 203048 203753
56387 203753 205452 207911 210491 212617 214046 214974 215983 217600 219582 220884 220768 219752 219016 218986 219115 219010
56371 219010 219073 219756 220809 221737 222569 223616 224731 225328 225102 224332 223474 222753 222155 221582 220954 220317 219851 219642
56353 219642 219515 219232 218812 218489 218422 218635 219225 220354 221933 223458 224317 224319 223872 223635 223991 224826 225789 226638 227318
56334 227318 227864 228395 229139 230303 231917 233982 236592 239665 242553 244411 245062 245189 245508 246142 247020 248352
56318 248352 250185 251853 252574 252621 253204 255077 257741 260271 262382 264290 265916 266837 266966 266849 267177 268246
56302 268246 269912 271782 273391 274447 275022 275411 275812 276282 276957 277992 279234 280268 280979 281800 283140 284803
56286 284803 286281 287432 288480 289442 290024 290138 290101 290241 290657 291487 292943 294811 296350 297157 297868 299510 302235
56269 302235 305138 307285 308533 309391 310534 312546 315625 319266 322567 325146 327493 330151 332872 335079
56255 335079 337016 339795 344025 348821 352609 354797 356288 358395 361667 365796 370197 374271 377446 379528
56241 379528 380997 382560 384406 386280 388241 390768 393891 396818 398824 400117 401359 402695 403800 404652
56227 404652 405633 406929 408420 410110 412091 413971 414972 414849 414287 414103 414431 414932 415443 416057 416807 417624 418553
56210 418553 419728 421218 423046 425278 427960 430999 434213 437379 440264 442801 445294 448181 451490 454807
56196 454807 457910 461190 465178 469843 474602 478873 482420 485319 487883 490555 493578 496760 499677 502193
56182 502193 504638 507484 510892 514566 518072 521357 524968 529585 535304 541553 547805 554144 560955 568303
56168 568303 575964 583987 592781 602551 612970 623695 634993 647449 661019 674860 688463 702742
56156 702742 719525 739903 763513 789671 818747 852031 890570 934730 984894 1042033 1107539
56145 1107539 1182949 1269974 1370289 1484841 1613463 1755129 1908035 2068770 2231471 2388467
56135 2388467 2532432 2658524 2765167 2853580 2926904 2989241 3044203 3093159 3134489 3164882 3181702
56124 3181702 3184199 3172978 3149360 3115581 3074510 3027758 2973829 2908679 2828132 2729655 2612744
56113 2612744 2479259 2333893 2183364 2034267 1891597 1758994 1639365 1534655 1445430 1371067
56103 1371067 1310126 1260540 1220145 1187460 1161682 1141825 1126447 1114412 1105277 1098597 1093502 1089470
56091 1089470 1086930 1086541 1088234 1091391 1095458 1099978 1104542 1109316 1115184 1122766 1131620 1140998 1150932 1161983
56077 1161983 1174272 1187465 1201358 1215763 1230048 1243622 1256889 1271005 1286653 1303484 1320694
56066 1320694 1337607 1353843 1369568 1385567 1402497 1420028 1437217 1453714 1470108 1487085 1504844
56055 1504844 1523407 1542887 1563203 1583963 1604959 1626536 1649219 1673106 1697792 1722840 1748291
56044 1748291 1774634 1802249 1831037 1860917 1892530 1926822 1963683 2001593 2039077 2076217 2114421
56033 2114421 2155069 2198652 2244689 2292030 2339656 2387716 2437465 2489857 2544705 2601524 2660501
56022 2660501 2721987 2785754 2851565 2919967 2991678 3066634 3144451 3225331 3309672 3397250 3487814
56011 3487814 3582058 3680922 3784341 3891849 4004167 4122925 4248859 4381450 4520311 4665765
56001 4665765 4818004 4976936 5143174 5318186 5503148 5698400 5904126 6120724 6348470
55992 6348470 6587850 6840476 7108899 7395369 7701561 8029526 8381933 8761219 9169306
55983 9169306 9608338 10081117 10590964 11141974 11739286 12388385 13094478 13863485 14703309
55974 14703309 15623301 16633271 17744654 18972483 20335141 21853071 23549987 25455893
55966 25455893 27608417 30052823 32843866 36048645 39746924 44029225 48995519 54753041
55958 54753041 61411012 69076803 77859629 87878284 99264057 112157017 126697034
55951 126697034 143002736 161131064 181022405 202433047 224836063 247290881 268364357
55944 268364357 286237838 299047312 305328810 304358771 296267784 281949280 262842225
55937 262842225 240648543 217041223 193436979 170886423 150070522 131351856 114843309
55930 114843309 100482777 88104320 77491956 68413533 60643414 53978232 48242877
55923 48242877 43288505 38989822 35243917 31967148 29090079 26554514 24312832 22326052
55915 22326052 20560667 18987404 17581689 16322785 15192103 14173443 13254033 12423177
55907 12423177 11669848 10983152 10354804 9779199 9250909 8763769 8312530 7893708 7504433
55898 7504433 7141795 6803623 6488605 6195237 5921642 5666527 5429186 5208317 5001928
55889 5001928 4808650 4628169 4460023 4302862 4155102 4015494 3882792 3755563 3632628
55880 3632628 3513172 3396518 3282491 3171899 3065800 2964234 2866403 2772000 2681483 2595068
55870 2595068 2512398 2433447 2358802 2288771 2222906 2160694 2102073 2046947 1994705 1944457 1895443
55859 1895443 1847165 1799584 1753206 1708510 1665338 1623275 1582424 1543230 1505704 1469564 1434990
55848 1434990 1402513 1372073 1342822 1313878 1284784 1255466 1226423 1198740 1173065 1148631 1124128
55837 1124128 1099386 1075345 1052502 1030459 1008965 988269 968326 948852 930461 914493 901197
55826 901197 889115 876801 864206 851813 839513 827164 815338 804531 794264 783954 774171 766065
55814 766065 759814 754558 749705 745561 742610 740730 739194 737141 734125 730399 726415 721928 715998 708122
55800 708122 698800 688648 677620 665636 653368 641594 630243 618896 607910 598233 590298 584063
55788 584063 579963 578733 580009 581934 582539 580935 576841 569779 559487 546890 534003 522725 513920
55775 513920 507519 503216 500925 500642 501881 503309 503144 500090 493917 485199 474629 462690 449877 437009
55761 437009 425088 414723 405777 397782 390726 385125 381168 378067 374530 369730 363540 356019 347141 337121
55747 337121 326548 315990 305677 295779 286763 279162 273000 267647 262318 256652 250877 245551 241134
55734 241134 237691 234909 232398 229954 227526 225025 222291 219266 216053 212780 209533 206457 203704 201118
55720 201118 198184 194631 190968 188056 186135 184668 183239 182179 182011 182594 183152 183013 182036 180512 178967
55705 178967 177908 177401 176918 175838 174052 171881 169575 167168 164704 162236 159696 157110 154834 153197 151944
55690 151944 150457 148513 146475 144734 143384 142497 142270 142730 143598 144593 145582 146432 147058 147653 148487 149433 150119
55673 150119 150597 151354 152473 153294 153242 152628 152290 152766 154146 156387 159347 162637 165835 168836 171769 174696
55657 174696 177542 180194 182432 183851 184015 182703 180019 176368 172293 168100 163692 158992 154417 150583
55643 150583 147633 145365 143932 143762 144609 145448 145659 145714 146266 147144 147791 148114 148267 148071 147434 147009 147593 148947
55625 148947 149952 149958 149283 148351 147060 145292 143434 141907 140485 138509 135773 132931 130934 130037 129439 128007
55609 128007 125366 122074 118791 115650 112553 109553 106581 103253 99464 95848 93058 90810 88259 85162
55595 85162 82078 79464 77252 75348 73882 72743 71430 69676 67836 66373 65222 63919 62168 60153
55581 60153 58384 57299 56909 56831 56760 56666 56403 55550 54122 53100 53475 54863 55811 55523 54525 53511 52423 51044
55563 51044 49713 48769 47830 46347 44588 43428 43254 43610 43950 44283 45008 46317 47859 48946 49157 48741 48245
55546 48245 47814 47157 46212 45326 44624 43730 42460 41292 40721 40604 40684 41262 42619 44016 44141 42653 40603
55529 40603 39237 38932 39469 40610 42020 43071 43261 42677 41755 40795 39901 39200 38752 38327 37622 36704 36035 36065
55511 36065 36950 38606 40804 43145 45162 46591 47509 48101 48384 48257 47862 47693 48238 49540 51330 53543
55495 53543 56381 59675 62504 63959 64268 64705 66183 68325 70185 71439 72314 72613 71686 69590 67599 66894
55479 66894 67063 66455 64032 60342 56658 53682 51398 49708 48626 47886 46818 44880 42216 39488 37194
55464 37194 35254 33300 31301 29695 28803 28352 27830 27193 26823 26743 26357 25240 23812 22824 22433 22246 22129
55447 22129 22431 23305 24249 24589 24159 23346 22613 22166 21936 21728 21430 21126 20934 20740 20239 19324 18381 18106 18981
55428 18981 20830 22800 23968 24106 23815 23739 23831 23652 23190 22916 23050 23263 23255 23191 23294 23394 23242 23014 23094 23461
55408 23461 23643 23322 22728 22372 22540 23072 23584 23843 23929 24022 24082 23929 23650 23641 24088 24624 24727 24339 23865 23651 23721
55387 23721 23974 24345 24679 24680 24187 23422 22792 22468 22275 22081 22057 22364 22682 22426 21538 20719 20573 20802 20665 20019
55367 20019 19379 18985 18426 17364 16108 15167 14688 14633 15048 15712 15887 15032 13626 12707 12654 12892 12884 12876 13420 14550
55347 14550 15724 16412 16444 15901 14936 13782 12754 12110 11898 11964 12092 12114 11893 11377 10780 10549 10918 11558 11944
55328 11944 12003 12065 12116 11588 10129 8224 6776 6284 6698 7740 8974 9872 10328 10967 12451 14485 16013
55311 16013 16433 16167 15890 15588 14706 12989 10966 9651 9803 11336 13377 14975 15742 15774 15247 14378 13585
55294 13585 13216 13136 12950 12638 12511 12572 12462 12212 12471 13641 15194 16278 16609 16355 15455 13742 11643 10119
55276 10119 9718 10068 10479 10708 10949 11376 11980 12659 13139 12912 11631 9679 8092 7675 8273 9058 9471 9678
55258 9678 10114 10901 11813 12587 13006 12847 12094 11205 10859 11246 11801 11785 11077 10293 10168 10860 11818 12307 12071 11456
55238 11456 10901 10463 10020 9733 9992 10859 11852 12366 12159 11409 10567 10181 10579 11495 12271 12581 12757 13210 13743
55219 13743 13786 13212 12611 12714 13699 15079 16093 16262 15719 15041 14626 14277 13488 12115 10589 9492 9087 9277
55201 9277 9818 10459 11025 11544 12257 13379 14782 15978 16500 16271 15573 14687 13703 12737 12125 12161 12662 13088 13193
55182 13193 13317 13850 14549 14636 13577 11622 9608 8319 8007 8370 8895 9317 9751 10434 11402 12516 13706
55165 13706 15002 16292 17263 17714 17853 18050 18299 18110 17116 15673 14555 14036 13582 12713 11861 11985 13387
55148 13387 15347 16973 17997 18568 18677 18143 16940 15265 13397 11765 10934 11155 12010 12783 13158 13304 13419
55131 13419 13524 13666 13964 14349 14541 14353 13841 13167 12587 12485 13040 13815 14129 13930 13849 14200 14413 13867 12842
55112 12842 12131 11948 11850 11630 11669 12324 13446 14746 16189 17748 19117 20024 20646 21370 22196 22677 22520 21983
55094 21983 21591 21546 21554 21220 20528 19793 19175 18423 17316 16227 15952 16848 18381 19601 19937 19416 18391 17271
55076 17271 16424 16089 16322 17057 18069 18810 18599 17279 15510 14081 13047 11887 10427 9097 8266 7825
55060 7825 7633 7880 8713 9825 10793 11542 12152 12490 12466 12397 12587 12697 12190 11406 11477 12893 14770 15968 16440
55041 16440 16857 17295 17132 16241 15458 15463 15799 15560 14753 14291 14688 15383 15610 15448 15616 16462 17587 18404 18750
55022 18750 18898 19206 19751 20108 19619 18177 16754 16696 18376 20886 23185 25028 26478 27055 26145 24136 22443
55005 22443 22216 23366 24941 26029 26201 25497 24373 23504 23389 24165 25714 27649 29168 29353 27982 25864
54989 25864 24179 23552 23822 24442 24889 24995 25150 25940 27309 28309 28103 27023 26167 26107 26486 26847 27240 27827
54971 27827 28476 29061 29722 30417 30586 29795 28543 27896 28348 29480 30690 31714 32371 32371 31779 31268 31421 31975
54953 31975 32222 32035 32031 32642 33514 33991 33860 33391 32925 32700 32898 33588 34657 35982 37550 39306 41071 42833
54935 42833 44917 47550 50426 53040 55402 58025 61236 64871 68679 72587 76420 79724 82089 83321
54921 83321 83183 81323 77794 73337 68777 64295 59617 54718 49988 45752 42023 38726 35871 33435 31311
54906 31311 29488 28101 27246 26847 26696 26560 26296 26024 26103 26771 27870 29082 30373 31988 34135 36906 40418
54889 40418 44677 49298 53674 57554 61205 64945 68707 72128 74762 76163 76134 75039 73575 71999 69921
54874 69921 67039 63694 60293 56623 52347 47927 44316 41645 38989 35758 32623 30540 29340 28037
54860 28037 26267 24648 23669 23003 22177 21304 20724 20389 20100 20006 20283 20513 20067 19123 18657 19247 20354 21069
54842 21069 21138 20965 20968 21253 21692 21933 21591 20815 20459 21194 22519 23149 22461 21158 20418 20782 21955 23309 24266
54823 24266 24489 24064 23416 22838 22195 21272 20224 19398 18819 18211 17608 17604 18765 20881 23031 24386 24790 24632
54805 24632 24370 24311 24604 25166 25630 25682 25517 25757 26771 28269 29693 30777 31544 32019 32363 33112 34768 37034
54787 37034 38912 39741 39860 40054 40720 41888 43745 46571 50171 53812 56939 59720 62740 66344 70410
54772 70410 74603 78638 82333 85566 88186 89881 90226 89030 86689 84068 81985 80822 80567 80989 81717
54757 81717 82387 82935 83665 84841 86322 87810 89360 91332 93821 96438 98681 100254 100948 100616 99420 97819
54741 97819 96068 94018 91576 88993 86437 83723 80928 78935 78708 80203 82540 85116 87891 90634 92674
54726 92674 93604 93586 92768 90960 88174 84814 81010 76429 71172 66222 62350 59109 55674 52277 49974
54711 49974 49160 49122 49001 48465 47474 46158 45001 44408 44029 43257 42475 42875 44624 46205 46230 45157 44422 44466
54693 44466 44629 44609 44940 45966 47303 48552 49779 51031 52030 52705 53499 54705 55898 56465 56377 56083 55910
54676 55910 55931 56196 56725 57394 58125 58999 59890 60262 59779 58907 58415 58398 58306 57872 57412 57143 56876 56633 56940 58101
54656 58101 59612 60782 61654 62853 64748 67265 70359 74149 78610 83590 89149 95439 102196 108821 115194
54641 115194 121990 129892 138684 147381 155099 161441 166161 168819 169012 166841 162946 157941 151843 144293
54627 144293 135480 126638 119283 113915 109745 105736 101632 97838 94671 92072 89914 88244 87136 86523
54613 86523 86255 86176 86101 85862 85500 85353 85736 86477 86864 86253 84776 83250 82326 81880 81423 80912 80814 81405 82358
54594 82358 83108 83400 83357 83270 83450 84060 84916 85627 86087 86635 87580 88790 90014 91385 93226 95399 97288 98506
54576 98506 99343 100303 101429 102346 102904 103484 104540 105923 106921 107004 106382 105692 105253 104859 104260 103560 103023 102721
54558 102721 102496 102137 101503 100652 100013 100163 101217 102599 103651 104389 105373 106899 108675 110361 112125 114456
54542 114456 117504 120787 123562 125444 126610 127488 128388 129589 131575 134829 139268 144136 148687 152797 156771
54527 156771 160741 164476 167635 169927 171120 171164 170296 168860 166994 164593 161470 157474 152693 147730 143571
54512 143571 140828 139232 138115 137273 137021 137519 138481 139559 140703 142068 143758 145643 147228 147952 147932 148194
54496 148194 149612 151789 153584 154661 155769 157425 159167 160503 161780 163509 165408 166858 167930 169201
54482 169201 170729 171920 172330 172009 171093 169729 168463 168028 168471 169010 169049 168926 169351 170454 171803 173062 174168
54465 174168 174915 174888 173988 172757 171924 171695 171620 171110 169910 168051 165608 162714 159739 157185 155297 153999
54449 153999 153273 153320 154120 155058 155335 154735 153722 152783 151970 151129 150291 149662 149345 149266 149297 149351 149345 149115 148396 146987
54429 146987 145017 142960 141202 139600 137612 134938 131925 129348 127882 127715 128487 129518 130292 130767 131174
54414 131174 131572 131846 132131 132895 134376 136177 137666 138669 139461 140156 140475 140267 139915 139912 140119 139803 138543 136849
54396 136849 135618 135060 134435 132923 130511 127916 125840 124495 123699 123149 122598 121999 121481 121115 120820 120698 121236
54379 121236 122724 124496 125260 124487 123080 122339 122545 122971 123023 122784 122432 121711 120323 118513 116878 115714 114852
54362 114852 114100 113512 113086 112426 110998 108740 106232 104161 102747 101801 101184 100933 100971 100988 100822 100726 100993 101403
54344 101403 101318 100396 98959 97581 96455 95360 94128 92911 91882 90842 89382 87457 85565 84121 82848
54329 82848 81175 79200 77816 77639 78235 78693 78690 78533 78361 77937 77220 76609 76402 76403 76268 75911 75355 74581 73787
54310 73787 73510 74108 75273 76310 76774 76559 75637 74068 72169 70339 68763 67485 66563 65811 64646 62728
54294 62728 60659 59435 59199 59094 58436 57395 56328 55186 54039 53524 54015 54775 54716 53909 53541 54315 55651
54277 55651 56677 57331 58037 58813 59272 59326 59349 59620 60009 60266 60372 60492 60705 60839 60592 59816 58800 58126 58134 58611
54257 58611 59164 59746 60523 61316 61597 61221 60782 60970 61766 62673 63639 65231 67706 70248 71521 70911 69023
54240 69023 66985 65546 64780 64309 63619 62413 60908 59693 59041 58484 57394 55939 55056 55283 56020 56271 55859
54223 55859 55426 55342 55214 54629 53855 53375 53048 52314 51118 50093 49687 49602 49318 48828 48441 48116 47392 46068 44638
54204 44638 43881 44110 44876 45362 45078 44213 43275 42462 41581 40608 39991 40113 40711 41218 41538 42077 43019 44029 44730
54185 44730 45089 45152 44847 44302 43997 44223 44575 44331 43260 41776 40425 39457 38846 38439 38123 38056 38685 40256
54167 40256 42300 43803 43959 42682 40497 38189 36535 36031 36637 37761 38593 38587 37845 37132 37294 38403 39605
54150 39605 40029 39757 39624 40153 41027 41629 41729 41534 41376 41527 42160 43251 44551 45711 46379 46279 45383 44042
54132 44042 42774 41862 41246 40759 40272 39654 38821 37854 36898 35996 35195 34733 34780 35072 35232 35342 35713 36039 35477
54113 35477 33863 32231 31638 31878 31903 31195 30180 29541 29680 30700 32310 33824 34733 35214 35603 35603 34726 33467
54095 33467 33112 34065 35194 35355 34888 34917 35688 36470 36871 37333 38209 39144 39705 40080 40754 41831 43075 44359
54077 44359 45669 46789 47428 47679 48053 48972 50424 52114 53773 55202 56229 56700 56524 55770 54815 54331 54732
54060 54732 55563 55738 54666 52966 51812 51676 52036 52258 52405 53017 54343 55993 57295 57986 58591 60053 62812
54043 62812 66239 69181 71062 72267 73494 75123 77322 80277 83977 87974 91801 95489 99316 103128
54029 103128 106311 108505 110009 111360 112754 114035 115049 115789 116200 116044 115047 113273 111309 109886 109148
54014 109148 108400 106799 104194 101032 97604 93838 89896 86428 83857 81759 79421 76847 74734 73456
54000 73456 72558 71440 70076 68780 67523 65974 64150 62622 61889 61817 61837 61537 60855 59833 58458 56828
53984 56828 55253 54066 53340 52866 52387 51864 51527 51689 52444 53572 54755 55902 57135 58463 59576 60055
53968 60055 59806 59185 58705 58659 59030 59723 60695 61743 62337 62026 61109 60536 60896 61755 62324 62546 63056 64215 65728
53949 65728 67266 68844 70397 71595 72441 73567 75428 77603 79472 81319 84126 88345 93454 98636 103344
53934 103344 107214 110085 112368 114907 118159 121794 125274 128406 131152 133321 134858 136154 137734 139767
53920 139767 142158 144841 147686 150307 152410 154234 156262 158484 160328 161407 162050 162900 164158 165381 165946
53905 165946 165632 164773 163844 162903 161485 159130 155987 152820 150432 149070 148268 147153 144985 141619 137538
53890 137538 133407 129627 126259 123193 120207 117039 113656 110410 107677 105361 102965 100243 97559 95518
53876 95518 94341 93626 92635 90811 88256 85751 84096 83361 82984 82609 82491 82849 83189 82733 81412 79959 79021
53859 79021 78577 78307 78097 77883 77382 76365 75036 73721 72220 69934 66779 63682 61893 61861 62909 63895
53843 63895 64058 63373 62379 61726 61733 62192 62631 62783 62745 62664 62429 61897 61445 61992 64114 67180 69657 70471 69936
53824 69936 69263 69301 69958 70705 71298 71930 72833 73854 74456 74265 73756 74182 76504 80377 84479 87830 90382
53807 90382 92362 93653 94264 94960 96761 99821 103289 106362 109079 111907 114889 117505 119289 120325 121124
53792 121124 122094 123159 123908 124067 123800 123577 123783 124503 125536 126534 127202 127490 127520 127263 126448 124940 123084 121394
53774 121394 119959 118365 116254 113702 111014 108375 105881 103789 102440 101866 101564 100799 99248 97240 95301
53759 95301 93559 91836 90323 89690 90249 91327 91856 91490 90721 90022 89365 88648 88052 87653 87012 85569 83355
53742 83355 81057 79361 78426 77983 77770 77759 78035 78540 79084 79628 80414 81620 82967 83873 84050 83815 83759 84274
53724 84274 85365 86743 88020 89006 89857 90833 91879 92649 93049 93496 94415 95610 96373 96274 95654 95223 95246 95343
53706 95343 95190 95260 96544 99477 103448 107562 111589 115833 120316 124551 128124 131059 133533 135640 137544
53691 137544 139554 141811 144068 145950 147293 148163 148774 149510 150818 152931 155703 158668 161179 162674 163174
53676 163174 163483 164488 166238 168010 169291 170199 170902 171168 170799 170068 169427 169122 169299 170010 170794 170749 169550
53659 169550 168015 167162 166994 166781 166294 166028 166233 166458 166228 165660 165107 164573 163757 162468 160799 159029 157489
53642 157489 156408 155734 155136 154243 152935 151483 150382 149883 149582 148757 147255 145818 145241 145417 145574 145266 144768
53625 144768 144498 144526 144789 145526 147231 150160 153898 157471 160122 162051 164152 166855 169554 171483 172799
53610 172799 174402 176902 180232 184043 187885 191096 193221 194705 196608 199513 203042 206579 209939 213140
53596 213140 216003 218359 220315 222046 223587 225001 226453 227924 229158 230117 231153 232478 233744 234479 234670
53581 234670 234595 234282 233480 232055 230153 228112 226413 225463 225161 224845 224017 222925 222133 221704 221251 220655 220219
53564 220219 220099 220029 219723 219131 218198 216837 215362 214531 214752 215499 215918 215873 215990 216672 217525 217898 217735 217636 218168
53545 218168 219323 220625 221678 222532 223577 225161 227371 230167 233515 237277 241117 244826 248707 253340
53531 253340 258909 265005 271193 277460 283969 290821 298383 307420 318316 330339 342305 353900 365778
53518 365778 378322 391128 403938 417338 432007 447780 464074 480910 498937 518593 539797
53507 539797 562339 586029 610419 634831 658853 682650 706744 731632 757410 783496 808888
53496 808888 833087 856782 881375 907871 936359 966311 996970 1027571 1057662 1087265 1116488
53485 1116488 1145069 1172572 1198841 1223861 1247328 1268813 1288304 1306198 1322852 1338596 1353999
53474 1353999 1369535 1385019 1399964 1414447 1428952 1443335 1456708 1468540 1479044 1488157 1494876 1498241
53462 1498241 1498419 1496129 1491378 1483411 1471809 1457083 1440269 1422309 1403751 1384578 1364217 1341948
53450 1341948 1317478 1291154 1263782 1236207 1208830 1181451 1153807 1126243 1099489 1073688 1048128
53439 1048128 1022156 995927 970061 945048 921306 899340 879339 860980 844096 829257 817163
53428 817163 807752 800402 794847 791416 790549 792552 797603 805383 814852 825092 836435 850149 866861
53415 866861 885829 906036 927363 950250 974595 999610 1024772 1050451 1077419 1106010 1135993
53404 1135993 1167163 1199759 1234166 1270420 1308313 1347961 1389976 1435002 1483248 1534515 1588435
53393 1588435 1644622 1702835 1763067 1825301 1889119 1953862 2019201 2085163 2151429 2217110 2281499
53382 2281499 2344682 2407034 2468368 2527892 2584733 2638202 2687894 2733937 2776969 2817528 2855636
53371 2855636 2891177 2924250 2954785 2982287 3006503 3027873 3046572 3061365 3070158 3071547 3065044 3049908
53359 3049908 3024787 2988838 2942570 2887282 2824309 2755174 2681899 2606516 2530336 2453918 2377557
53348 2377557 2301608 2226510 2152697 2080432 2009726 1940590 1873263 1807896 1744046 1680906 1618118
53337 1618118 1556094 1495513 1436862 1380515 1326820 1275950 1227964 1183202 1142334 1105858 1073687
53326 1073687 1045289 1020067 997711 978399 962533 949941 939479 929853 920708 912403 904910 897775
53314 897775 891244 886518 884399 884275 884912 885757 887019 888949 891657 895382 900388 906696 914282 923316 933845
53299 933845 945503 957968 971566 986972 1004410 1023510 1043908 1065644 1089025 1114339 1141680
53288 1141680 1170806 1201185 1232336 1264018 1295997 1327859 1359262 1390076 1420006 1448370 1474653
53277 1474653 1499090 1522304 1544558 1565848 1586531 1607097 1627138 1645144 1659700 1670558 1678226
53266 1678226 1682811 1683772 1680676 1673664 1662936 1648078 1628267 1603147 1573273 1539673 1503202 1464432
53254 1464432 1423837 1381775 1338356 1293719 1248432 1203360 1159111 1115988 1074514 1035554 999617
53243 999617 966263 934489 903518 873031 842823 812575 781939 750712 718989 687198 655877
53232 655877 625360 595923 568174 542875 520189 499559 480660 464069 450527 439767 430587 421952
53220 421952 413613 405758 398608 392314 386776 381451 375729 369594 363523 357601 351185 343727 335621 327831
53206 327831 320775 313916 306539 298711 291256 284841 279290 273951 268510 263120 257763 251966 245461 238770
53192 238770 232688 227348 222204 216871 211537 206530 201872 197385 192965 188571 184196 180007 176325 173365
53178 173365 171061 169183 167497 165773 163850 161790 159915 158573 157898 157740 157693 157255 156160 154553 152739
53163 152739 150789 148601 146317 144362 142986 142012 141152 140333 139514 138383 136612 134419 132607 131835 131908 132012
53147 132012 131629 131042 130746 130598 129909 128351 126394 124689 123366 122166 120978 119916 119117 118808 119367 120837
53131 120837 122474 123247 122868 122022 121548 121675 122026 122050 121433 120401 119636 119574 119820 119637 118960 118462 118573 118951 119035
53112 119035 118573 117430 115515 113259 111580 110830 110156 108491 105871 103256 101316 100017 99162 98603 97870 96345
53096 96345 94038 91744 90218 89579 89594 90049 90628 90875 90656 90324 90158 89969 89557 89209 89306 89688 89929 90109 90711
53077 90711 91755 92570 92659 92309 92059 91925 91558 90882 90142 89386 88395 87219 86385 86350 86992 87803 88397 88598 88289
53058 88289 87551 86849 86649 86762 86372 84965 82981 81349 80615 80765 81692 83291 85047 86036 85700 84438 83147
53041 83147 82230 81362 80123 78545 76963 75616 74575 73895 73625 73685 73887 74025 73885 73298 72367 71564 71412 71993
53023 71993 72895 73606 73842 73550 72870 72189 71973 72332 72911 73376 73854 74685 75806 76738 77240 77691 78627 80030
53005 80030 81306 81966 82181 82612 83739 85348 86701 87213 86984 86653 86717 87083 87351 87411 87583 88154 88924 89368
52987 89368 89240 88957 89283 90500 91863 92043 90413 87892 86212 86199 87050 87488 87306 87281 87829 88430 88532 88391
52969 88391 88567 89012 89170 88768 88031 87272 86712 86691 87494 88906 90307 91312 91978 92353 92250 91659 90976 90566
52951 90566 90442 90558 91030 91738 92094 91685 90937 90664 91060 91634 92088 92736 93903 95362 96630 97480 97861 97593
52933 97593 96611 95483 95160 95980 97237 98038 98414 99166 100668 102292 103236 103475 103485 103413 103065 102584 102449 102718
52915 102718 102879 102630 102288 102148 101991 101629 101429 101762 102336 102667 102924 103565 104326 104358 103445 102336 101659 101157 100369
52896 100369 99489 99033 99051 99285 99874 101207 103046 104387 104526 103892 103464 103530 103465 102663 101284 99916 98850 98003
52878 98003 97373 97156 97432 98083 99042 100297 101646 102812 103907 105387 107289 108976 109914 110381 111026 112032
52862 112032 113109 114046 114759 115009 114540 113414 111747 109290 105900 102318 99779 98694 98281 97694 96912 96229
52846 96229 95487 94335 92951 91954 91756 92314 93332 94354 94773 94167 92693 90966 89503 88397 87468 86544
52830 86544 85607 84713 83824 82779 81610 80774 80797 81564 82286 82328 81836 81365 81184 81229 81476 81927 82273 81977 80845
52811 80845 79256 77762 76587 75632 74826 74306 74297 74880 75897 77022 77910 78307 78070 77180 75792 74270 73081
52794 73081 72519 72461 72489 72390 72445 73005 73817 74080 73320 71862 70325 68947 67760 67031 66976 67123 66555 64912 62784
52775 62784 61034 60078 59836 59969 60019 59711 59371 59745 61143 62937 64146 64416 64275 64501 65299 66066 66039 65264
52757 65264 64631 64755 65109 64776 63793 63014 62725 62282 61371 60755 61216 62349 63082 63015 62680 62716 63386 64698 66446
52738 66446 68165 69439 70247 70803 71177 71394 71679 72285 73207 74321 75610 76956 78047 78914 80240 82535
52722 82535 85117 86566 86290 85077 83945 82964 81578 79730 78153 77480 77394 76919 75519 73649 72056 70839
52706 70839 69584 68292 67507 67403 67403 67080 66923 67688 69341 71157 72562 73397 73653 73508 73430 73689 73927 73699
52688 73699 73271 73290 73850 74547 75302 76440 77945 79280 80062 80301 79939 78800 77159 75713 74789 74128 73608
52671 73608 73542 74027 74615 74973 75290 75709 75914 75743 75654 76064 76649 76946 77262 78227 79580 80186 79383 77780 76487
52652 76487 75957 75850 75742 75582 75511 75509 75441 75351 75451 75770 76036 76116 76297 76847 77475 77698 77682 78131 79251 80307 80501
52631 80501 79880 79142 78866 79187 79908 80580 80754 80453 80229 80483 80934 80991 80428 79465 78432 77609 77150 76879 76416
52612 76416 75792 75643 76366 77380 77711 77171 76458 76183 76313 76577 76888 77185 77271 77012 76497 75919 75503 75600 76497
52593 76497 77976 79340 80075 80326 80590 81139 81863 82519 82894 82801 82136 81018 79824 79048 79063 79911 81286 82704
52575 82704 83779 84375 84612 84699 84702 84431 83705 82753 82134 82162 82585 82928 82920 82436 81407 80126 79334 79458 79888 79649
52555 79649 78769 78328 78959 79952 80237 79750 79226 78999 78668 77910 77016 76469 76367 76443 76376 76008 75453 75124 75433 76364
52535 76364 77490 78392 78874 78793 78053 76891 75807 75025 74344 73749 73778 74847 76459 77620 77984 78079 78398 78763
52517 78763 78758 78381 77999 77929 78224 78664 78805 78320 77455 76890 76984 77437 77855 78284 78904 79582 80137 80755 81687 82720
52497 82720 83408 83687 83789 83703 83214 82447 81830 81500 81288 81315 81995 83202 84011 83655 82372 80974 79987 79569 79935
52478 79935 81246 83151 84858 85718 85566 84609 83348 82516 82647 83495 84110 83701 82401 81098 80592 80990 81832
52461 81832 82581 82927 82844 82632 82859 83901 85384 86379 86348 85678 85022 84471 83792 83214 83315 84129 84939 85111 84678
52442 84678 83992 83337 83069 83639 85130 87020 88676 89775 90184 89898 89335 89205 89719 90286 90345 90095 90006 90036 89879
52423 89879 89685 89887 90447 90796 90543 89846 89093 88548 88259 87998 87426 86552 85881 85798 86062 86265 86529 87208 88098
52404 88098 88533 88209 87375 86288 85055 84083 84008 84959 86316 87350 87767 87565 86879 86164 86030 86615 87411 87936
52386 87936 88256 88676 89261 89922 90634 91270 91511 91286 91102 91596 92854 94447 96040 97684 99456 101093 102202
52369 102202 102812 103561 105090 107184 108777 109047 108310 107544 107223 107075 106902 106990 107554 108316 108978 109723 110868 112386
52351 112386 114096 116092 118487 120836 122310 122611 122487 123107 124946 127316 129086 129855 130305 131291 132839 134389
52335 134389 135863 137921 141004 144650 148040 150905 153589 156571 160250 164951 170736 177289 184237 191416
52321 191416 198683 205793 212817 220414 229280 239395 250147 261030 271903 282722 293467 304249
52309 304249 315118 325808 336027 345890 355669 365179 373819 381226 387530 393045 398123 403273 408805
52296 408805 414284 418763 421700 423193 423361 422169 420029 417826 415901 413603 410359 406588 402943 399172
52282 399172 394627 389591 385173 381958 379610 377904 377233 377732 378702 379453 380229 381816 384569 388292 392754
52267 392754 397865 403520 409714 416628 424310 432441 440773 449471 458556 467298 474785 480936 486403 491587
52253 491587 496439 501187 506368 511827 516469 519446 521021 521712 521223 518992 515439 511767 508505 504986 500415
52238 500415 494816 488649 482043 474831 467058 459006 450813 442434 433959 425758 418164 411137 404302 397280
52224 397280 390014 382834 376252 370670 366154 362435 359132 356082 353417 351266 349491 347932 346803 346467
52210 346467 346751 346920 346604 346408 347153 348749 350334 351481 352716 354710 357374 359983 361867 362743 362620 361835
52194 361835 361118 361277 362572 364440 366000 366862 367351 367926 368521 368720 368473 368247 368301 368166 367125 365038 362368
52177 362368 359573 356839 354290 352070 350144 348286 346349 344350 342352 340472 338966 337999 337372 336739 336015
52162 336015 335297 334405 332849 330358 327178 323860 320915 318623 316864 315195 313380 311792 310932 310679 310429
52147 310429 309926 309436 309113 308796 308559 308875 309978 311552 313261 315108 316999 318525 319597 320898 323212 326571
52131 326571 330447 334504 338805 343563 349067 355592 362957 370363 377066 383139 389337 396440 404916 414825
52117 414825 425606 436263 446271 456157 466751 478004 489024 499143 508476 517437 526131 534310
52105 534310 541710 548346 554593 560815 566782 571738 575195 577327 578345 577996 576144 573389 570446 567225
52091 567225 563173 558232 552731 546600 539630 532431 526138 520955 515856 510078 504131 498879 494303 489787
52077 489787 485223 481316 478933 478502 479833 482239 485031 488106 491917 496808 502700 509439 517040 525411
52063 525411 534268 543469 552981 562382 570900 578263 585017 591699 598178 604161 609779 615155 619831 623249
52049 623249 625486 626926 627517 626938 625271 622801 619271 614052 607141 599378 591468 583250 574095 563688
52035 563688 552273 540418 528651 517136 505670 494145 482844 471938 460928 449121 436631
52024 436631 424345 412857 402047 391914 383064 375880 369666 363258 356237 349026 341917 334634 326989
52011 326989 319547 313305 308746 305308 301715 296858 290476 283125 275608 268559 262398 257307 253057 249145
51997 249145 245339 241862 238778 235468 231225 226216 221323 216987 212735 208010 202925 197871 192898 187973
51983 187973 183493 179893 176931 173958 170850 167977 165236 161881 157710 153732 151092 149659 148260 146026
51969 146026 142957 139380 135531 131726 128391 125749 123779 122458 121651 120795 119259 117133 115131 113556 111906
51954 111906 109744 107471 105786 104812 104162 103529 102792 101843 100841 100376 100764 101302 100746 98600 95507 92442
51938 92442 89966 88274 87408 87191 87300 87559 87978 88441 88722 88845 89059 89366 89481 89366 89444 89965 90526 90492 89680
51919 89680 88422 87235 86694 87282 88901 90625 91370 90892 89927 89375 89528 90000 90166 89639 88515 87189 85900
51902 85900 84595 83345 82623 82791 83424 83537 82580 80894 79170 77755 76644 75820 75321 75120 75187 75635 76651
51885 76651 78204 79902 81140 81468 80973 80344 80376 81270 82533 83632 84589 85704 86916 87835 88436 89322 90996
51868 90996 93108 94789 95731 96629 98434 101444 105242 109342 113579 117993 122642 127630 133032 138612 143643
51853 143643 147175 148566 147861 145736 142989 139957 136461 132450 128444 125011 121939 118480 114540 111077
51839 111077 108992 108077 107461 106672 105741 104671 103520 102821 103108 103949 104209 103445 102406 101856 101604 101111 100507
51822 100507 100412 101041 102014 102873 103327 103206 102609 102012 101870 102103 102289 102235 102082 101987 101974 102024 102058 101957 101841 102105 102918
51801 102918 103952 104892 105917 107204 108301 108589 108249 108102 108505 108953 108862 108247 107604 107519 108310 109564 110155 109353
51783 109353 107842 106904 106635 105904 104231 102687 102440 103278 104182 104607 104498 103754 102528 101614 101612 102002 101839 101174
51765 101174 100966 101694 102823 103675 104114 104241 104030 103484 102760 102017 101354 100835 100308 99441 98320 97748 98363 99642
51747 99642 100409 100213 99584 99041 98635 98476 98895 99818 100667 101129 101434 101637 101268 100052 98479 97286 96753 96711
51729 96711 96794 96471 95377 93970 93286 93663 94189 93837 92654 91397 90416 89555 88788 88318 88124 87930 87593 87183
51711 87183 86758 86349 86026 85718 85194 84507 84133 84360 84827 85045 85054 85154 85297 85310 85413 85883 86377 86308 85843 85859 86840
51690 86840 88405 90007 91488 92768 93546 93662 93346 92892 92343 91717 91150 90623 89891 88988 88517 89055 90398
51673 90398 91668 92147 91847 91319 91087 91263 91623 91976 92377 92907 93437 93781 94037 94497 95293 96313 97430 98568
51655 98568 99617 100590 101789 103472 105332 106678 107183 107090 106707 106202 106025 106844 108644 110285 110564 109485 108025
51638 108025 106840 105741 104392 102862 101296 99560 97617 95975 95275 95455 95711 95416 94806 94537 94712 94710 94029
51621 94029 92938 92078 91616 91147 90328 89259 88244 87493 87157 87314 87818 88409 89148 90457 92481 94635 96040
51604 96040 96321 95810 95150 94963 95702 97444 99777 102123 104178 105860 106938 107082 106291 104999 103577 102027
51588 102027 100270 98483 96901 95483 94023 92529 91233 90337 89925 90062 90613 91053 90917 90611 91264 93332
51572 93332 95675 96634 95966 95060 95182 96086 96777 96993 97344 98289 99703 101412 103469 105747 107758 109134 109907
51555 109907 110116 109575 108375 107286 107180 108146 109531 110750 111740 112671 113591 114497 115471 116588 117837 119187
51539 119187 120611 121897 122592 122370 121472 120595 120255 120361 120557 120862 121641 122915 124061 124486 124316 124020 123516
51522 123516 122244 120159 118045 116591 115594 114481 113206 112129 111233 110070 108463 106804 105529 104707 104214
51507 104214 104034 104200 104612 105076 105406 105488 105432 105606 106276 107171 107697 107633 107341 107160 106965 106526 106025 105876 106152 106513
51487 106513 106637 106480 106119 105606 105001 104392 103847 103419 103120 102741 101853 100298 98678 97991 98613 99871 100788 101021
51469 101021 100916 100857 100937 101119 101369 101546 101446 101044 100470 99704 98599 97265 96092 95161 93936 91938 89525
51452 89525 87600 86629 86437 86897 88190 90133 91835 92487 92197 91581 90808 89644 88313 87628 88022 88910 89340
51435 89340 89003 88329 87806 87510 87217 86764 86280 86159 86686 87591 88131 87787 86787 85825 85429 85722 86545 87496 88034
51416 88034 87927 87598 87645 87981 87847 86786 85298 84317 84249 84723 85073 84855 84087 83196 82615 82254 81543 80134 78356
51397 78356 76723 75259 73660 71981 70671 69940 69551 69333 69461 70008 70597 70816 70766 70889 71430 72310 73370
51380 73370 74424 75114 75044 74176 72991 72195 72243 72984 73740 73933 73732 73800 74272 74430 73811 73216 73875 75730 77408
51361 77408 78059 78340 79130 80054 80105 79262 78525 78456 78615 78552 78493 78639 78507 77610 76315 75402 75023 74750 74497 74619
51341 74619 75033 74975 73963 72521 71506 71064 70685 70076 69495 69283 69462 69902 70586 71565 72758 73894 74619 74790
51323 74790 74710 74883 75389 75641 75071 73880 72812 72321 72370 72875 73788 74665 74814 74132 73310 72930 72836 72778 73142 74385
51303 74385 76044 77041 76914 76193 75526 74992 74430 73887 73460 73006 72379 71780 71607 72019 72807 73679 74549 75517 76521
51284 76521 77118 76823 75757 74688 74189 73993 73537 72945 72914 73690 74723 75483 76074 76797 77584 78241 78867 79622
51266 79622 80256 80332 79849 79328 79255 79630 80061 80151 79872 79649 80012 81036 82218 82987 83182 82975 82600 82373 82756
51247 82756 83990 85697 87109 87797 87989 88162 88522 88964 89429 90119 91301 92966 94800 96546 98220 99786
51231 99786 100881 101238 101323 102028 103559 105043 105543 105128 104641 104666 105153 105876 106808 107964 109156 109978 110028 109256
51213 109256 108207 107687 107966 108496 108619 108302 107915 107592 107216 106830 106596 106411 106029 105582 105578 106302 107527 108834
51195 108834 109878 110332 109942 108809 107321 105756 104178 102790 102027 102165 103004 104035 104748 104843 104400 103843 103489
51178 103489 103155 102504 101681 101168 101018 100706 99864 98669 97405 96145 95113 94832 95459 96343 96651 96233 95524
51161 95524 94896 94514 94553 95067 95713 96047 96060 96057 96038 95529 94154 92136 90198 89107 89169 90004 90903 91607 92541 94054
51141 94054 95634 96307 95743 94597 93728 93487 93737 94149 94359 94188 93900 94003 94696 95748 96984 98500 100232
51124 100232 101663 102308 102289 102109 102041 102034 102158 102763 104115 106043 108018 109522 110336 110675 111124 112298 114390 116924
51106 116924 118996 119905 119689 119054 118659 118555 118459 118446 118996 120233 121560 122325 122579 122781 122999 122901 122516 122420 122959
51087 122959 123748 124294 124778 125801 127505 129350 130754 131641 132345 133262 134630 136378 138115 139474 140558 141807
51071 141807 143332 144694 145541 146105 146763 147324 147219 146377 145475 145169 145388 145548 145202 144292 142957 141408 139911
51054 139911 138611 137333 135718 133674 131637 130335 130220 131079 132168 132810 132937 132987 133335 133957 134684 135474 136261
51037 136261 136754 136715 136371 136276 136794 137955 139715 141963 144204 145693 146148 146076 146112 146338 146516 146704 147189 147923
51019 147923 148569 149109 149933 151195 152552 153771 155224 157375 160065 162664 164821 166682 168478 170286 172200
51004 172200 174353 176689 178963 181126 183445 186173 189278 192595 196072 199681 203352 207171 211528 216784
50990 216784 222812 229065 235161 241265 247801 254892 262270 269800 277932 287341 298146 309834 322222
50977 322222 336171 352828 372249 393318 415139 438010 462789 489779 518692 549304 581613
50966 581613 615408 650208 685703 721891 758668 795495 831513 865778 897334 925278 948954
50955 948954 968064 982650 992966 999207 1001200 998510 991033 979416 964726 947870 929564 910594
50943 910594 891715 873303 855505 838696 823430 809859 797484 785497 773089 759552 744621
50932 744621 728827 713022 697346 681004 663286 644361 624812 604801 584172 563118 542207
50921 542207 521804 501910 482621 464411 447822 433060 419991 408418 398233 389366 381643 374810
50909 374810 368754 363607 359470 356069 352951 350026 347653 346042 344881 343761 342758 342342 342870 344346 346519
50894 346519 348977 351318 353476 355794 358522 361309 363436 364546 364981 365449 366533 368457 371096 374184 377581
50879 377581 381320 385401 389710 394354 399835 406641 414685 423377 432268 441512 451774 463824 478097
50866 478097 494434 512318 531458 552077 574654 599694 627907 660198 697066 738330 783870
50855 783870 834355 890596 952291 1018166 1087496 1160777 1238551 1320127 1403921 1488639 1573418
50844 1573418 1656960 1737196 1812016 1879927 1939735 1989845 2028343 2053884 2066339 2066455 2055135 2033355
50832 2033355 2002701 1965457 1923819 1879267 1832964 1786529 1741902 1700553 1663196 1630205 1601762
50821 1601762 1577398 1555778 1535219 1514302 1492006 1467681 1441088 1412196 1380724 1346185 1308558
50810 1308558 1268651 1227537 1185934 1144401 1103844 1065393 1029912 998038 970535 948208 931416
50799 931416 919976 913615 912287 916091 925176 939742 959773 984606 1012971 1043653 1075966 1109468
50787 1109468 1143364 1176385 1207178 1234650 1258000 1276719 1290747 1300612 1307179 1311010 1311865 1308835
50775 1308835 1301063 1288345 1271057 1249660 1224362 1195175 1162133 1125464 1085767 1044113 1001830
50764 1001830 960032 919367 880253 843269 809150 778466 751505 728493 709620 694718 683161
50753 683161 674478 669002 667447 669761 674817 681547 690087 701421 716098 733749 753754 775848 800050
50740 800050 826462 855420 887421 922622 960687 1001371 1044936 1091569 1140550 1190448 1240049
50729 1240049 1288747 1336015 1380999 1422840 1461090 1495465 1525236 1549053 1565383 1573078 1571668 1561391
50717 1561391 1543023 1517663 1486578 1451231 1413325 1374700 1337114 1302091 1270876 1244274 1222382
50706 1222382 1204569 1189902 1177654 1167314 1158221 1149474 1140253 1129983 1118102 1104094 1088052 1070923
50694 1070923 1053682 1036429 1018774 1001076 984720 971070 960754 954222 952400 956171 965584 980202
50682 980202 1000154 1026371 1059774 1100704 1149214 1205405 1269165 1339735 1415834 1496223 1579945
50671 1579945 1665915 1752245 1836182 1915071 1987564 2053704 2113724 2167041 2212676 2250392 2280911
50660 2280911 2305144 2323602 2336498 2343910 2345568 2340813 2329065 2310301 2285156 2254794 2220724 2184470
50648 2184470 2147289 2110357 2075219 2043755 2017551 1997425 1983455 1975112 1971310 1970804 1972799 1976844
50636 1976844 1981857 1985693 1986162 1982364 1974665 1963519 1948752 1929962 1907178 1880968 1852170 1821662
50624 1821662 1790230 1758564 1727508 1698331 1672571 1651476 1635647 1625184 1619987 1619778 1623926 1631447
50612 1631447 1641326 1652854 1665527 1678554 1690571 1700105 1706248 1708504 1705864 1696552 1679121 1653546
50600 1653546 1620784 1581515 1535870 1484406 1428688 1370700 1312121 1254387 1198931 1146879 1098618
50589 1098618 1054003 1012883 975246 941018 909998 881911 856426 833348 812982 796050 782938
50578 782938 773165 765801 760226 756248 753779 752835 753688 756587 761406 767930 776421 787445 801210 817574
50564 817574 836675 859088 885269 915372 949669 988547 1031873 1078998 1129689 1184519 1243876
50553 1243876 1307100 1372998 1440585 1508605 1574859 1637077 1694610 1748625 1800616 1851316 1901011
50542 1901011 1950140 1999287 2048985 2099646 2151227 2202898 2253676 2303622 2353824 2404985 2456779
50531 2456779 2509112 2563419 2621843 2685300 2752883 2822978 2894297 2965797 3036211 3103928 3167039
50520 3167039 3223356 3270625 3306853 3330358 3339605 3333284 3310688 3271910 3217793 3149847 3070032 2980396
50508 2980396 2882964 2780261 2675721 2573135 2475610 2385352 2304352 2234734 2178217 2135616 2107043
50497 2107043 2092245 2090451 2100190 2119583 2146642 2179071 2214000 2248307 2279101 2303564 2318443 2320199
50485 2320199 2306049 2274923 2227535 2165708 2091673 2007806 1916746 1821463 1724870 1629200 1535900
50474 1535900 1446166 1361273 1282094 1208532 1139961 1076293 1018211 966229 919902 878283 840873
50463 840873 807819 779311 755089 734490 716700 700980 686914 674486 663761 654504 646247 638711
50451 638711 631936 625996 620838 616426 612820 610094 608381 608007 609246 611858 615244 619305 624837 632765
50437 632765 643268 656029 671092 688966 709933 733768 760150 788908 819743 852144 885836
50426 885836 921069 958268 997585 1038912 1082090 1126942 1173344 1221428 1271531 1323746 1377681
50415 1377681 1432831 1489036 1546337 1604447 1662463 1719042 1772826 1822898 1868881 1910433 1946680
50404 1946680 1976499 1999364 2015462 2024712 2026056 2018053 1999906 1971662 1933795 1887085 1832706 1771947
50392 1771947 1706011 1636415 1565357 1495159 1427520 1363773 1305658 1255056 1212827 1178508 1151385
50381 1151385 1131410 1118850 1113488 1114455 1120611 1130869 1144319 1160079 1176731 1191946 1203120 1208609
50369 1208609 1208035 1201327 1188020 1167775 1141150 1109429 1073951 1035892 996385 956380 916452 877066
50357 877066 838881 802541 768301 736167 706277 678818 653639 630209 608019 586893 567039
50346 567039 548920 532966 519178 507047 496010 485912 476958 469342 463066 457910 453379 448852 443924
50333 443924 438523 432674 426482 420582 416203 414260 414367 415040 414946 413871 412677 412555 414151 417142 420631
50318 420631 424136 428053 433135 439798 448156 458286 469990 482509 494984 507197 519488 532045
50306 532045 544548 556385 566868 575473 582331 588293 594021 599134 602797 605002 606531 607657 607649 605754
50292 605754 601991 596689 589879 581549 571976 561440 550024 538064 526307 515191 504365 493405
50280 493405 482705 473181 465369 459258 454725 451658 449754 448673 448281 448437 448709 448697 448421 448032 447367 446294
50264 446294 445287 445020 445425 445762 445683 445657 446181 447041 447656 447828 447909 448452 449786 451718 453584 454877 455855 457243
50246 457243 459343 461878 464766 468455 473115 477980 482033 485244 488643 493221 499027 505288 511089 515929
50232 515929 519892 523480 527163 531030 534813 538175 540946 543334 546037 549978 555563 562207 568846 575043
50218 575043 581459 589266 599230 611418 625594 641746 660286 681874 707077 736232 769650 807942
50206 807942 851983 902437 959339 1022349 1091579 1168048 1253101 1347240 1449587 1558409 1671809
50195 1671809 1787618 1902914 2014239 2118566 2213884 2298998 2373370 2437529 2493252 2542583
50185 2542583 2586378 2623850 2653254 2672493 2678962 2669327 2640134 2589025 2515600 2421438 2309519
50174 2309519 2183591 2047867 1907044 1766204 1630176 1502619 1385601 1279935 1185724 1102539
50164 1102539 1029429 965184 908746 859301 816085 778337 745413 716735 691598 669290 649458
50153 649458 632045 616676 602482 588890 576338 565715 557172 549990 543572 537949 533149 528734 524474
50140 524474 521005 519162 518851 519165 519482 519900 520702 521986 523900 526584 529732 532779 535778 539599 544953
50125 544953 551677 559288 567735 577139 587206 597510 608177 619789 632651 646553 661126 676018
50113 676018 690822 705311 719742 734584 749918 765414 780849 796323 812059 828436 846226
50102 846226 866288 888872 913474 939553 967244 997428 1031386 1070244 1114407 1163538 1217526
50091 1217526 1277451 1345187 1422132 1508930 1606414 1716037 1839016 1975674 2126058 2290606
50081 2290606 2469484 2661390 2863400 3071701 3281992 3489519 3689628 3878696 4054601
50072 4054601 4216566 4365054 4501642 4628240 4745679 4852620 4945344 5018325 5065288 5080475
50062 5080475 5059609 5000301 4902227 4767354 4599855 4405390 4190301 3961190 3724550 3486081
50052 3486081 3250322 3021046 2801752 2595350 2403612 2227349 2067041 1922889 1794393
50043 1794393 1680419 1579730 1491150 1413378 1345147 1285607 1234093 1189565 1150713 1116556 1086379
50032 1086379 1059076 1033304 1008543 985392 964338 944683 925113 905021 884803 865073 846055
50021 846055 827657 809727 792108 774654 757294 740119 723433 707626 692883 679122 666361
50010 666361 654960 645120 636323 627849 619843 613201 608208 603991 599677 595507 592252 590028 588348 586991
49996 586991 586196 586150 586838 588270 590243 591979 592596 592115 591605 592228 594414 597899 602169 606843 611996 618251
49980 618251 626323 636427 648331 661877 677205 694584 714451 737599 764910 796813 833305 874545
49968 874545 921185 974197 1034693 1103829 1182376 1270290 1367060 1472487 1586623 1708729 1836675
49957 1836675 1967423 2097579 2223349 2340683 2446304 2538741 2618312 2686407 2745063 2796620
49947 2796620 2842836 2883651 2916621 2937415 2940949 2922534 2878705 2807564 2708995 2585150 2440824
49936 2440824 2282774 2118028 1952595 1791372 1638398 1496475 1366844 1249794 1145588
49927 1145588 1054402 975584 907606 848811 797796 753085 713193 677406 646052 619465 596923
49916 596923 577050 559124 543349 529811 517691 505911 494206 483052 472697 462817 453216 444300
49904 444300 436466 429409 422509 415702 409384 403506 397422 390841 384439 379153 375252 372375 370099 367999
49890 367999 365467 362065 358050 354107 350520 347049 343620 340692 338696 337394 336047 334048 331275 328002
49876 328002 324634 321445 318464 315606 312963 310830 309442 308711 308264 307685 306838 306035 305795 306190 306571 306175
49860 306175 305018 303879 303433 303697 304332 305063 305652 305876 305774 305683 305759 305729 305349 304851 304637 304719 304805 304758 304631 304408
49840 304408 304141 304185 304800 305492 305314 303950 302061 300341 298739 296966 295421 295009 296109 298114 300014 301191
49824 301191 301659 301873 302382 303431 304774 305969 306866 307684 308648 309735 310809 311777 312536 312965 313132 313361 313963
49807 313963 314998 316385 318060 319801 321022 321064 319827 317943 316196 314831 313548 312127 310851 310198 310171
49792 310171 310176 309642 308604 307523 306611 305674 304608 303731 303430 303678 304108 304403 304371 303799 302651 301352 300577 300535
49774 300535 300684 300287 299133 297664 296466 295750 295200 294349 293187 292324 292355 293025 293379 292881 292121 292183 293520 295670
49756 295670 297844 299418 299967 299372 298098 297058 296890 297453 298141 298587 298832 298897 298519 297497 296170 295286 295269
49739 295269 295769 296146 296300 296773 297919 299284 300045 299957 299579 299622 300351 301630 303243 304907 306186 306699 306516
49722 306516 306213 306464 307554 309251 311092 312807 314491 316364 318395 320199 321365 321839 321968 322211 322819 323774
49706 323774 324971 326465 328483 331178 334333 337420 340025 342191 344327 346779 349504 352081 353993 354947
49692 354947 355132 355196 355817 357130 358611 359666 360258 360830 361701 362863 364362 366444 369079 371685 373732 375419
49676 375419 377234 379019 380155 380738 381817 384041 386647 388412 389221 390033 391480 393186 394475 395130 395364
49661 395364 395561 396207 397573 399256 400482 401032 401476 402296 403306 404188 405093 406240 407431 408551 410182 412991
49645 412991 416664 420152 422988 425696 428824 432206 435435 438465 441345 443856 445857 447710 449907 452453
49631 452453 454973 457272 459426 461506 463587 465953 468807 471856 474634 477302 480592 484746 488999 492534
49617 492534 495560 498967 503118 507546 511789 515878 519849 523408 526544 530023 534639 540116 545364 549873
49603 549873 554307 559546 565619 571890 577863 583365 588180 592095 595367 598797 603138 608574 614714 620919
49589 620919 626711 632108 637552 643269 648797 653465 657379 661455 666370 671857 677343 682862 688891 695437
49575 695437 701813 707403 712339 717299 722848 729061 735559 741755 747129 751482 755073 758561 762713 767913
49561 767913 773799 779487 784325 788417 792340 796456 800631 804510 807810 810420 812487 814431 816623 818992
49547 818992 821149 822908 824424 825784 826801 827453 828181 829394 830781 831528 831251 830449 829902 829910 830302 831009 832321
49530 832321 834470 837115 839419 840753 841304 841964 843566 846236 849481 852803 856089 859421 862670 865494 867723
49515 867723 869626 871688 874202 877173 880560 884386 888473 892163 894542 895032 893792 891542 888985 886256
49501 886256 882802 877888 871420 864266 857626 852027 847066 842075 836757 831094 824976 818264 811105 803918
49487 803918 797075 790733 784869 779291 773648 767740 761814 756329 751346 746415 741137 735602 730085 724615
49473 724615 719162 714122 710156 707350 704843 701512 696979 691848 687055 683127 679918 676787 673043 668522
49459 668522 663882 660122 657608 655693 653471 650745 648026 645729 643827 642275 641277 640863 640539 639758 638586
49444 638586 637559 636971 636617 636239 635899 635893 636519 637912 639847 641738 643130 644268 645893 648397 651515 654979
49428 654979 659112 664454 670991 678045 684785 690570 694989 697863 699202 698949 696921 693357 689399 686572
49414 686572 685616 686116 687338 689117 691801 695672 700728 706824 713694 720964 728393 736074 744197 752658 761095
49399 761095 769232 776977 784314 791387 798640 806509 814875 823153 830978 838453 845488 851343 855336 857911
49385 857911 860484 864164 868905 873912 878480 882289 885317 887788 890082 892451 894917 897531 900459 903638
49371 903638 906649 909364 912451 916757 922206 927791 932693 937010 941294 945888 950941 956628 962917 969332
49357 969332 975340 980880 986259 991741 997563 1004131 1011703 1019785 1027262 1033332 1038139 1042501 1047230 1052815
49343 1052815 1059420 1066922 1075007 1083369 1091844 1100350 1108853 1117410 1126124 1134995 1143881 1152584 1160878 1168538
49329 1168538 1175569 1182391 1189482 1196734 1203543 1209645 1215470 1221363 1226834 1231150 1234490 1237867 1241824 1245778
49315 1245778 1248902 1251151 1253089 1255018 1256812 1258402 1259908 1261288 1262269 1262777 1263044 1263220 1263171 1262877 1262652 1262667
49299 1262667 1262504 1261576 1259884 1257993 1256318 1254803 1253270 1251668 1249827 1247396 1244342 1241247 1238732 1236712
49285 1236712 1234513 1231664 1228291 1224857 1221868 1219791 1218769 1218230 1217122 1214845 1211785 1208728 1205960 1203264
49271 1203264 1200582 1198147 1195857 1192949 1188652 1182968 1176501 1169614 1162053 1153478 1144066 1134397 1124893 1115616
49257 1115616 1106502 1097565 1088805 1080123 1071493 1063064 1054934 1046874 1038427 1029327 1019715 1009970 1000412 991189
49243 991189 982272 973396 964045 953677 942162 930038 918277 907625 898069 888889 879281 868983 858417
49230 858417 848307 839180 831089 823748 816940 810837 805834 802012 798911 795964 793095 790722 789140 788066
49216 788066 786878 785192 783180 781355 780110 779422 778971 778527 778139 777885 777579 776969 776188 775763 776068 776927 777894
49199 777894 778795 779790 781063 782660 784633 787112 790142 793584 797242 801051 805053 809207 813318 817210 820996
49184 820996 825067 829737 834879 840017 844844 849536 854511 860025 866062 872532 879379 886512 893761 900945
49170 900945 907922 914631 921197 927959 935175 942659 949856 956433 962701 969365 976850 984962 993124 1000848
49156 1000848 1007965 1014609 1021164 1028128 1035802 1043975 1052052 1059679 1067202 1075259 1083895 1092337 1099801 1106381
49142 1106381 1112940 1120255 1128497 1137423 1146706 1155915 1164483 1171991 1178444 1184199 1189663 1195096 1200594 1206078
49128 1206078 1211390 1216504 1221624 1226957 1232429 1237706 1242473 1246643 1250341 1253778 1257094 1260280 1263302 1266278
49114 1266278 1269369 1272431 1274993 1276768 1277952 1278771 1278964 1278181 1276735 1275401 1274373 1273075 1271319 1270077 1270519
49099 1270519 1272620 1275295 1277785 1280275 1283145 1286253 1289206 1291862 1294252 1296379 1298436 1300943 1304265 1308081
49085 1308081 1311628 1314452 1316810 1319439 1323002 1327518 1332056 1335230 1336391 1336293 1336320 1337091 1338126 1338745 1338855 1338789
49069 1338789 1338709 1338412 1337521 1335785 1333410 1331161 1329792 1329236 1328626 1327323 1325616 1324188 1323170 1322165 1321038
49054 1321038 1320182 1319917 1320024 1320099 1320144 1320627 1322039 1324521 1327822 1331566 1335581 1340053 1345284 1351321 1357861 1364543
49038 1364543 1371238 1378060 1385232 1392932 1401134 1409546 1417870 1426144 1434709 1443753 1453075 1462432 1472073 1482745
49024 1482745 1495173 1509526 1525345 1541913 1558866 1576481 1595209 1614932 1634931 1654767 1674842
49013 1674842 1695748 1717293 1738688 1759668 1780858 1802854 1825407 1847851 1869994 1892154 1914483
49002 1914483 1936695 1958489 1979926 2001310 2022870 2044585 2066169 2087129 2106891 2124864 2140444
48991 2140444 2153237 2163472 2171989 2179566 2186321 2191970 2196484 2200125 2202978 2204886 2205852 2206068 2205406 2203311
48977 2203311 2199394 2193839 2187000 2178963 2169809 2160065 2150511 2141608 2133377 2125759 2118834 2112775 2107887 2104632
48963 2104632 2103289 2103489 2104287 2104927 2105501 2106797 2109457 2113345 2117798 2122487 2127808 2134241 2141597 2149287 2157260
48948 2157260 2166119 2176138 2186831 2197865 2209917 2224027 2240331 2258043 2276644 2296547 2318530
48937 2318530 2342939 2369573 2398000 2427819 2458841 2491112 2524690 2559552 2595941 2634526 2675710
48926 2675710 2718879 2762823 2807013 2851972 2898259 2945634 2993499 3041715 3090558 3140126 3190224
48915 3190224 3240783 3292049 3344307 3397573 3451588 3506067 3560943 3616364 3672388 3728781 3785289
48904 3785289 3842022 3899267 3956896 4014174 4070219 4124417 4176403 4226013 4273418 4319008 4362998
48893 4362998 4405259 4445619 4484056 4520482 4554565 4585880 4614060 4638740 4659583 4676388 4688893
48882 4688893 4696511 4698634 4695311 4687231 4674939 4658392 4637417 4612124 4582699 4549305 4512446 4472945
48870 4472945 4431212 4386900 4339648 4289704 4237479 4182995 4126255 4067747 4008073 3947426 3886038
48859 3886038 3824748 3764442 3705192 3646714 3589482 3534572 3482394 3432388 3384093 3337818 3294099
48848 3294099 3253203 3215455 3181434 3151320 3124478 3100111 3078163 3059281 3044101 3032788 3025129
48837 3025129 3020766 3019402 3020871 3025017 3031596 3040485 3051924 3066232 3083256 3102359 3122986 3145038
48825 3145038 3168694 3194133 3221368 3250078 3279640 3309661 3340388 3372204 3404848 3437628 3470376
48814 3470376 3503591 3537531 3571812 3606155 3640908 3676455 3712553 3748695 3784786 3821098 3857818
48803 3857818 3895035 3932957 3971772 4011482 4052105 4093794 4136492 4179735 4223097 4266583 4310232
48792 4310232 4353648 4396370 4438523 4480603 4522627 4563935 4603806 4641894 4677921 4711314 4741370
48781 4741370 4767753 4790755 4811015 4828860 4843854 4855208 4862756 4867255 4869460 4869108 4865214 4857293 4845894
48768 4845894 4831854 4815365 4795943 4773139 4746976 4717573 4684483 4646664 4603302 4554501 4500890
48757 4500890 4442729 4379936 4313075 4243718 4173407 4102662 4031461 3960376 3890673 3823412 3758934
48746 3758934 3697177 3637948 3580835 3525331 3471346 3419381 3370048 3323530 3279485 3237334 3196697
48735 3196697 3157797 3121360 3087909 3057156 3028382 3001245 2975928 2952556 2931014 2911435 2894381
48724 2894381 2880227 2868602 2858672 2849831 2841992 2835375 2830156 2826131 2822627 2818990 2815296 2812290 2810428
48711 2810428 2809211 2807768 2805868 2804022 2802700 2801907 2801539 2801790 2802977 2805168 2808167 2811757 2815829 2820323 2825170
48696 2825170 2830232 2835259 2839969 2844312 2848563 2853000 2857516 2861725 2865518 2869342 2873790 2879018 2884716 2890575
48682 2890575 2896604 2902938 2909516 2916069 2922463 2928991 2936269 2944720 2954102 2963585 2972337 2979981 2986543 2992188
48668 2992188 2997133 3001509 3004977 3006641 3005690 3002083 2996269 2988339 2977888 2964752 2949311 2931889 2912267
48655 2912267 2890125 2865654 2839406 2811727 2782594 2751823 2719293 2685238 2650455 2615929 2582007
48644 2582007 2548266 2514422 2480916 2448290 2416451 2385103 2354511 2325147 2296799 2268734 2240685
48633 2240685 2213032 2186033 2159567 2133746 2109086 2085854 2063844 2043092 2024166 2007361 1992088
48622 1992088 1977582 1963855 1951436 1940394 1930159 1920305 1911090 1903124 1896766 1891886 1888061 1884932 1882474
48609 1882474 1880923 1880399 1880706 1881513 1882612 1883906 1885350 1887077 1889402 1892534 1896355 1900648 1905411 1910750 1916521
48594 1916521 1922358 1928127 1934166 1940982 1948729 1957083 1965559 1973885 1982031 1989999 1997733 2005243 2012612 2019771
48580 2019771 2026429 2032421 2038022 2043707 2049707 2056002 2062621 2069608 2076681 2083277 2089033 2094003 2098312 2101904
48566 2101904 2104661 2106507 2107242 2106579 2104574 2101795 2098794 2095537 2091582 2086700 2081105 2075144 2068982 2062574
48552 2062574 2055821 2048733 2041499 2034328 2027164 2019618 2011297 2002146 1992420 1982412 1972259 1961895 1951099
48539 1951099 1939701 1927825 1915848 1903990 1892049 1879694 1866981 1854399 1842254 1830077 1816873
48528 1816873 1802200 1786931 1772585 1759716 1747244 1733719 1718977 1704106 1689976 1676451 1663076
48517 1663076 1649840 1636932 1624232 1611469 1598627 1585810 1572998 1560268 1548001 1536433 1525178
48506 1525178 1513622 1501717 1489957 1478591 1467303 1455836 1444581 1434315 1425407 1417429 1409535 1401177
48494 1401177 1392512 1384145 1376598 1370077 1364542 1359689 1354827 1349188 1342561 1335453 1328494 1321978 1316074 1311020
48480 1311020 1306756 1302693 1298340 1293948 1290053 1286466 1282250 1276790 1270496 1264346 1259046 1254646 1250640 1246286
48466 1246286 1241051 1234910 1228161 1221028 1213593 1205984 1198278 1190252 1181562 1172297 1163093 1154575 1146860 1139630
48452 1139630 1132442 1124882 1116708 1108036 1099253 1090655 1082238 1073873 1065501 1057079 1048554 1039961 1031429 1023037
48438 1023037 1014821 1006943 999599 992687 985745 978413 970852 963621 957241 951861 947194 942705 938043 933304
48424 933304 928790 924548 920397 916370 912755 909575 906461 903295 900655 899193 898728 898369 897507 896342 895436
48409 895436 895066 895049 894875 893950 892053 889778 888260 888165 888991 889611 889419 888716 888036 887435 886594 885409 884206 883379
48391 883379 882963 882609 881931 880850 879557 878130 876279 873706 870787 868588 867917 868490 869343 869932 870441 871037
48375 871037 871415 871363 871258 871557 872016 871930 871142 870365 870471 871685 873495 875053 875637 875111 874115 873610 874043 875031
48357 875031 875906 876387 876604 876638 876249 875089 873075 870538 867999 865802 863966 862419 861191 860324 859734 859312
48341 859312 859060 858976 858951 859123 860174 862758 866443 869619 870789 869786 867534 864783 861420 856909 850992 843835
48325 843835 835764 827160 818508 810279 802638 795361 788166 781091 774440 768385 762757 757203 751447 745376
$$ [...]
##END NTUPLES=NMR SPECTRUM
##END=
