##TITLE=NES1067_Nhol10909_9883707_NhqFqdgz2h
##JCAMPDX= 6.0         $$ Bruker NMR JCAMP-DX V2.0
##DATA TYPE= NMR SPECTRUM
##DATA CLASS= NTUPLES
##ORIGIN= BRUKER
##OWNER= Administrator
$$ 1.72 TOPSPIN		Version 2.1
$$ 2016-08-27 02:16:07.758 -0500  Administrator@X
$$ Compression mode = diff/dup
##.OBSERVE FREQUENCY= 400.02188249412
##.OBSERVE NUCLEUS= ^1H
##.ACQUISITION MODE= SIMULTANEOUS (DQD)
##.ACQUISITION SCHEME= undefined
##.AVERAGES= 8
##.DIGITISER RES= 22
##SPECTROMETER/DATA SYSTEM= spect
##.PULSE SEQUENCE= zg30
##.SOLVENT NAME= COFFEE_meoh
##.SHIFT REFERENCE= INTERNAL, COFFEE_meoh, 1, 14.98509
##AUDIT TRAIL= $$ (NUMBER, WHEN, WHO, WHERE, PROCESS, VERSION, WHAT)
$$ ##TITLE= Audit trail, TOPSPIN		Version 2.1
$$ ##JCAMPDX= 5.01
$$ ##ORIGIN= Bruker BioSpin GmbH
$$ ##OWNER= Administrator
$$ $$ E:\/data/COFFEE/nmr/NES1067_Nhol10909_9883707_NhqFqdgz2h/20/pdata/1/auditp.txt
$$ ##AUDIT TRAIL=  $$ (NUMBER, WHEN, WHO, WHERE, PROCESS, VERSION, WHAT)
(   1,<2016-08-27 02:16:00.664 -0500>,<Administrator>,<X>,<go>,<TOPSPIN 2.1>,
      <created by zg
	started at 2016-08-27 02:14:53.836 -0500,
	POWCHK enabled, PULCHK disabled,
       configuration hash MD5:
       21 0F 79 D6 B3 7B B4 F6 88 20 88 DB 03 48 BD 9F
       data hash MD5: 64K
       40 61 56 A8 96 01 68 FE B0 22 04 86 BA 8E 19 07>)
(   2,<2016-08-27 02:16:03.726 -0500>,<Administrator>,<X>,<proc1d>,<TOPSPIN 2.1>,
      <Start of raw data processing
       efp LB = 0 FT_mod = 6 PKNL = 1 PHC0 = 0 PHC1 = 0 SI = 32K 
       data hash MD5: 32K
       16 74 D3 21 A8 95 88 88 77 05 6C A2 68 F3 3B 18>)
(   3,<2016-08-27 02:16:04.008 -0500>,<Administrator>,<X>,<proc1d>,<TOPSPIN 2.1>,
      <pk PHC0 = 94.65271 PHC1 = 0 
       data hash MD5: 32K
       67 5E 22 04 D8 94 DA 11 E9 42 65 A8 14 A7 1F 11>)
(   4,<2016-08-27 02:16:04.133 -0500>,<Administrator>,<X>,<proc1d>,<TOPSPIN 2.1>,
      <abs ABSG = 1 
       data hash MD5: 32K
       32 1C 04 F0 DF 46 0D C7 60 E5 DC A1 1F 24 A9 81>)
(   5,<2016-08-27 02:16:04.195 -0500>,<Administrator>,<X>,<proc1d>,<TOPSPIN 2.1>,
      <abs ABSG = 2 
       data hash MD5: 32K
       55 91 89 02 D1 91 CF F4 8A 82 7C 34 B1 21 9C 83>)
(   6,<2016-08-27 02:16:04.258 -0500>,<Administrator>,<X>,<proc1d>,<TOPSPIN 2.1>,
      <abs ABSG = 3 
       data hash MD5: 32K
       CC 7D BD F5 B6 B9 74 FD CC 6B 8A 21 0B 37 47 5A>)
(   7,<2016-08-27 02:16:04.304 -0500>,<Administrator>,<X>,<proc1d>,<TOPSPIN 2.1>,
      <abs ABSG = 4 
       data hash MD5: 32K
       0C 8A 98 7A 62 93 1B 2F 8C A6 39 20 E1 78 93 BC>)
(   8,<2016-08-27 02:16:04.367 -0500>,<Administrator>,<X>,<proc1d>,<TOPSPIN 2.1>,
      <abs ABSG = 5 
       data hash MD5: 32K
       FD 12 0E CE 73 05 95 C7 CF 5B 3D 57 01 EB 24 0D>)
$$ ##END=
$$ 
$$ $$ hash MD5
$$ $$ 06 2A 82 5B 42 2C C7 B0 CC 80 E5 F6 BA 8D DC CA
##$RELAX= 
##$RELAX= 
##$RELAX= 
##$RELAX= 
##$RELAX= 
##$RELAX= 
##$RELAX= 
$$ Bruker specific parameters
$$ --------------------------
##$DU= <E:\>
##$EXPNO= 20
##$NAME= <NES1067_Nhol10909_9883707_NhqFqdgz2h>
$$ [...]
##$TP= (0..7)
150 150 150 150 150 150 150 150
##$TP07= 0
##$TPNAME0= <>
##$TPNAME1= <>
##$TPNAME2= <>
##$TPNAME3= <>
##$TPNAME4= <>
##$TPNAME5= <>
##$TPNAME6= <>
##$TPNAME7= <>
##$TPOAL= (0..7)
0.5 0.5 0.5 0.5 0.5 0.5 0.5 0.5
##$TPOFFS= (0..7)
0 0 0 0 0 0 0 0
##$TUNHIN= 0
##$TUNHOUT= 0
##$TUNXOUT= 0
##$USERA1= <user>
##$USERA2= <user>
##$USERA3= <user>
##$USERA4= <user>
##$USERA5= <user>
##$V9= 5
##$VALIST= <valist>
##$VCLIST= <CCCCCCCCCCCCCCC>
##$VD= 0
##$VDLIST= <DDDDDDDDDDDDDDD>
##$VPLIST= <PPPPPPPPPPPPPPP>
##$VTLIST= <TTTTTTTTTTTTTTT>
##$WBST= 2048
##$WBSW= 25
##$XGAIN= (0..3)
0 0 0 0
##$XL= 0
##$YL= 0
##$YMAX_a= 604760
##$YMIN_a= -511378
##$ZGOPTNS= <>
##$ZL1= 120
##$ZL2= 120
##$ZL3= 120
##$ZL4= 120
##$ABSF1= 14.98509
##$ABSF2= -5.573092
##$ABSG= 5
##$ABSL= 3
##$ALPHA= 0
##$AQORDER= 0
##$ASSFAC= 0
##$ASSFACI= 0
##$ASSFACX= 0
##$ASSWID= 0
##$AUNMP= <proc_prof1d_extract_pilot.lims>
##$AXLEFT= 0
##$AXNAME= <>
##$AXNUC= <1H>
##$AXRIGHT= 0
##$AXTYPE= 0
##$AXUNIT= <>
##$AZFE= 0.1
##$AZFW= 0.1
##$BCFW= 0
##$BC_mod= 0
##$BYTORDP= 0
##$COROFFS= 0
##$CY= 15
##$DATMOD= 1
##$DC= 0
##$DFILT= <>
##$DTYPP= 0
##$F1P= 0
##$F2P= 0
##$FCOR= 0.5
##$FTSIZE= 32768
##$FT_mod= 6
##$GAMMA= 0
##$GB= 0
##$INTBC= 1
##$INTSCL= 1
##$ISEN= 128
##$LB= 0
##$LEV0= 0
##$LPBIN= 0
##$MAXI= 10000
##$MC2= 0
##$MEAN= 0
##$ME_mod= 0
##$MI= 0
##$NCOEF= 0
##$NC_proc= -8
##$NLEV= 6
##$NOISF1= 0
##$NOISF2= 0
##$NSP= 0
##$NTH_PI= 0
##$NZP= 0
##$OFFSET= 14.98509
##$PC= 1
##$PHC0= 94.65271
##$PHC1= 0
##$PH_mod= 1
##$PKNL= yes
##$PPARMOD= 0
##$PPDIAG= 0
##$PPIPTYP= 0
##$PPMPNUM= 2147483647
##$PPRESOL= 1
##$PSCAL= 4
##$PSIGN= 0
##$PYNMP= <proc.py>
##$REVERSE= no
##$SF= 400.02
##$SI= 32768
##$SIGF1= 0
##$SIGF2= 0
##$SINO= 400
##$SIOLD= 32768
##$SPECTYP= <>
##$SREGLST= <1H.CDCl3>
##$SSB= 0
##$STSI= 32768
##$STSR= 0
##$SW_p= 8223.68421052631
##$SYMM= 0
##$S_DEV= 0
##$TDeff= 65536
##$TDoff= 0
##$TI= <>
##$TILT= no
##$TM1= 0
##$TM2= 0
##$TOPLEV= 0
##$USERP1= <user>
##$USERP2= <user>
##$USERP3= <user>
##$USERP4= <user>
##$USERP5= <user>
##$WDW= 1
##$XDIM= 32768
##$YMAX_p= 440700827
##$YMIN_p= -695090
##$CURPLOT= <Network HP LaserJet P1505>
##$CURPRIN= <$Network HP LaserJet P1505>
##$DFORMAT= <normdp>
##$LAYOUT= <+/1D_H.xwp>
##$LFORMAT= <normlp>
##$PFORMAT= <normpl>
##$SURQMSG= 1
$$ End of Bruker specific parameters
$$ ---------------------------------
##NTUPLES= NMR SPECTRUM
##VAR_NAME=  FREQUENCY,     SPECTRUM/REAL,   SPECTRUM/IMAG
##SYMBOL=    X,             R,               I
##VAR_TYPE=  INDEPENDENT,   DEPENDENT,       DEPENDENT
##VAR_FORM=  AFFN,          ASDF,            ASDF
##VAR_DIM=   32768,         32768,           32768
##UNITS=     HZ,            ARBITRARY UNITS, ARBITRARY UNITS
##FACTOR=    0.250966925370066, 1,           1
##FIRST=     8223.43324360094, -91818,       -212057
##LAST=      0,             8749,            5446
##MIN=       0,             -695090,         0
##MAX=       8223.43324360094, 440700827,    0
$$ Real data points
##PAGE= N=1
##DATA TABLE= (X++(R..R)), XYDATA
$$ [...]
19522a79856l332F3100a26162H6576e1020J8266a1820j40828A07157c31695a18444
19510B390i6202A9109c53073d1631F8137i9601r4932A26366B3672d5420A2771
19498a07452D6031g7011A98181J62452b04962b0678j37950a8461k9600J6014o6424
19487i8471J5733J8114D66528A13792C69i592n553k29185a21422h7G7362a72646
19474a61445k04484i3969K7601j07681B76645a53220k8383k3555A71573b23728
19463A0506f6849k4610O519n3363A76692n1471c937j67909E5589i0493A83J98099
19451A98282q1404l8191b12162h5776K7638I2718d20990J06662A05506Q8036G3987
19439a96864h2706k1359M3605l7541F2011f7864k04233A12342A7766c72010c092
$$ y = [-179856, -183188, 63100, -126162, 86576, -51020, -32754, -11820, -152648, 107157, -331695, -118444, 2390, -96202, 19109, -353073, -41631, 68137, -99601, -194533, 126366, 23672, -45420, 12771, -107452, 46031, -77011, 198181, 360633, -204962, -20678, -158628, -18461, -48061, -32047, -98471, -82738, -64624, 466528, 113792, 369, -9592, -15145, -244330, -121422, -87, 77362, -172646, -161445, -365929, -93969, -66368, -174049, 276645, -153220, -181603, -205158, 171573, -223728, 10506, -66849, -91459, -84940, -138303, 176692, 125221, -3937, -171846, 55589, -90493, 183, 198282, 116878, 78687, -212162, -85776, -58138, 92718, -420990, -314328, 105506, 193542, 73987, -196864, -82706, -104065, -60460, -98001, 62011, -67864, -272097, 112342, 17766, -372010, -3092]
19427c94598J77702d7564k41828G4735J81915b50527j34443b1838k16538b8790
19416b86687n3845m5084A96791r4361M3349b30414k2770H4956a52313l1026M4429
19405a38910m5377P4310H1115N0378N4647a61556D1997a1611j72372p1585R1009
19394a64559A2606b22051M9827D9581d9925l432o3632A64347B1999J93105C7610
19382i5942k6772D3168M1632a4235r9455H3456a9623l3445D470a03740p7779C9307
19369A1097b9668h212A7410a63031F1396a70563g8902j18687d8907j12303N1358
19358a09852F0806b29843A06016R583j9698j0455d400q4020A18566J33601e7045
19346b85113A83270A4617f2861C3315a97511B01772b31010G0555B8914e7946B9910
$$ y = [-394598, -216896, -47564, -289392, 74735, 256650, -250527, -384970, -21838, -238376, -28790, -286687, -340532, -385616, 196791, 102430, 145779, -230414, -253184, 84956, -152313, -183339, -138910, -184287, -109977, 81115, 131493, 186140, -161556, 41997, -11611, -183983, -255568, -164559, 12606, -222051, -172224, 49581, -49925, -53357, -116989, 164347, 21999, 215104, 37610, -95942, -122714, 43168, 84800, -14235, -113690, 83456, -19623, -53068, 4470, -103740, -181519, 39307, 11097, -29668, -8212, 17410, -163031, 61396, -170563, -78902, -197589, -48907, -161210, -109852, 60806, -229843, 106016, 115599, 95901, 85446, -4400, -88420, 118566, 252167, -57045, -285113, 183270, 14617, -62861, 33315, -197511, 201772, -231010, 70555, 28914, -57946, 29910]
19334F7083a63395C52884a12066e4734C0327a37592e5039p747k8250B15053a46911
19322b10286A41780P8542c72252a36461A56498Q5306b51355B48915q4103b57108
19311a32296c9467A7824e3215j23823c9357m6405k4450p204B34850f2997A44539
19299d0113A17017P783Q0679b07881A7111J35863a85481j8059R2198j14157B25786
19287b36787a16382j0370b0294j0950l69593J02417B7345c08531d9981A43011
19276a55565j1774A55622b03812o4525J5441R312E763J8612H401J07442L8994
19265A54837c0835j08146j92079B7783f5759B6143M0223g70H9636j3391e4201
19253a4095j35722l0203K7645j93115A25538A801a3600B32638b33523i5261J1491
$$ y = [67083, -163395, 352884, -112066, -54734, 30327, -137592, -55039, -62786, -91036, 215053, -146911, -210286, 141780, 220322, -372252, -136461, 156498, 241804, -251355, 248915, 164812, -257108, -132296, -39467, 17824, -53215, -177038, -39357, -85762, -110212, -117416, 234850, -62997, 144539, -40113, 117017, 124800, 205479, -207881, 17111, 152974, -185481, -203540, -111342, -225499, 225786, -236787, -116382, -126752, -20294, -31244, -400837, -298420, 27345, -308531, -49981, 143011, -155565, -167339, 155622, -203812, -268337, -252896, -243584, 5763, 24375, 8401, 115843, 154837, -30835, -138981, -331060, 27783, -65759, 26143, 66366, -770, 89636, 76245, -54201, -14095, -149817, -180020, -152375, -345490, 125538, 1801, -13600, 232638, -233523, -95261, -83770]
19242h3770o7718k7734P8459C16183D2764d76696a90231A11323b07136f3902H9320
19230E1943J62863a09420j40434j56640a01547l80765K16468A76317F6748D178
19219E5548g5728k42418B69258n0616c7100l11482f0370p3714d5404A0270N6402
19208F6672M7927b66934A36467c23746A93435c10448A3711a77709B6359g1213
19197a74682A1913a89008Q3508B3774f7900B64182A1410b3434j86070r1753R2570
19186b08687B91391l4672a59381j1140F4054e4309j10306e3911k07198a7491k03884
19175b21375o2008E417g7260o0997p0606B73457h4331B13040m996c16787O6804
19164b49983C9051A4141a33927o7478L8445j27184e7281r7222N9325F4102a02913
$$ y = [-83770, -151488, -179222, -100763, 316183, 42764, -476696, -190231, 111323, -207136, -63902, 89320, 51943, 214806, -109420, -249854, -406494, -101547, -482312, -265844, 176317, 66748, 4178, 55548, -75728, -318146, 269258, 218642, -37100, -348582, -60370, -134084, -45404, 10270, 66672, 114599, -266934, 136467, -323746, 193435, -310448, 13711, -177709, 26359, -71213, -174682, 11913, -189008, -105500, 23774, -67900, 264182, 11410, -23434, -209504, -301257, -208687, 291391, 256719, -159381, -170521, 64054, -54309, -164615, -53911, -261109, -17491, -221375, -283383, 5417, -77260, -138257, -208863, 273457, -84331, 213040, 208044, -316787, -249983, 39051, 14141, -133927, -201405, -162960, -290144, -57281, -154503, -95178, 64102, -102913]
19152c29471J36392B00270a52359l2813L6497P0207j19117B87321G5855f6523
19141a07140n16432C01705a45920c0520D12831A03527d6539j25612A65078d3689
19130a32461K9568k6508A12347a18233M0751k6982K0026B5059g9464j7561c4406
19118a39915b1104n6502H6394K11453D8334J01869F6638c03947a41964b7833H3229
19106b17202J03101H7150l2152e7792k20279A57678C612K58663f1574A59152e3978
19094A22296K1073m1658J66488i5227n3487j33812c2560k2304J3121a9611k9975
19083d9586d597p2800a152l98009B46182e011A07263e9231m295J4868a2922n6729
19071f9651C33509j62775a13121n186q7515a02448o4476g5074A23279a82051M3677
$$ y = [-329471, -193079, 200270, -152359, -185172, -148675, -78468, -197585, 287321, 75855, -66523, -107140, -623572, 301705, -145920, -30520, 412831, 103527, -46539, -172151, 165078, -43689, -132461, -102893, -129401, 112347, -118233, -77482, -104464, -84438, 25059, -79464, -97025, -34406, -139915, -21104, -77606, 86394, 297847, 48334, 150203, 66638, -303947, -141964, -27833, 83229, -217202, -114101, 87150, 54998, -57792, -278071, 157678, 3612, 262275, -61574, 159152, -53978, 122296, 143369, 101711, 268199, -95227, -148714, -282526, -32560, -54864, -41743, -19611, -49586, -4597, -77397, -1152, -399161, 246182, -5011, 107263, -59231, -63526, -48658, -12922, -69651, 333509, 170734, -113121, -118307, -205822, -102448, -166924, -75074, 123279, -182051, -138374]
19060a38374I3975l6320B7712J99586b38945C70960g9264j27835m3669h593A72004
19048G3811b8232p1427L3899H869M691a58879A43468A0592i2199I5027J0223h2249
19035i9808k3487e3316E701L01066C9815a23958A54386j3278a76557n1149H2694
19023a61364E808a21726r669A52996c13308A95260a92631I2130d79319A41655
19012i7966D9340a91075l6793Q6411A77789d6905j06847k5685m5415f9203k4777
19001i3980j33196G2277a83517l15499c8284K956n151j32367B67638D6186d0826
18989a34170j56720C56906A2937d3848H8719b05695n6523N5315j54999A0853b5362
18977A82493A5665J9983c4449j0477I581b04031m1617K2003L4686B5029Q2717
$$ y = [-138374, 93975, 57655, 27712, 227298, -238945, 370960, -79264, -207099, -250768, -8593, 172004, 73811, -28232, -99659, -65760, 8869, 13560, -158879, 143468, 10592, -92199, 95027, 105250, -82249, -99808, -123295, -53316, 5701, 306767, 39815, -123958, 154386, 141108, -176557, -227706, 82694, -161364, 5808, -121726, -131395, 152996, -313308, 195260, -192631, 92130, -479319, 141655, -97966, 49340, -191075, -227868, -141457, 177789, -46905, -153752, -179437, -224852, -69203, -93980, -227176, 72277, -183517, -499016, -38284, -35328, -40479, -172846, 267638, 46186, -40826, -134170, -290890, 356906, 12937, -43848, 88719, -205695, -262218, -206903, -361902, 10853, -25362, 182493, 15665, 35648, -34449, -44926, 9581, -204031, -245648, -223645, -188959, 25029, 107746]
18966A07746K30992j02380A01698O2028a72656A42458b09904C40095C5070d5037
18955a87424B71443G7116a53785e9156B87058b7153B2286J60438i652D166a42314
18943f0120n7155B4535b86967l7557r7122B01188b64821a13304E4327F895b09383
18931A51554a31982c6660l7423J3636b9373n4439H7498a95441B48410d080l56475
18920c60555P9130A2J71110b58215a18024A02458J23778b85983g9731l0862j68214
18909b78807N4945k51012C6494J90416i7503p6245A19338J12864a06935j85151
18899b92086A38421J47032b9112I0982b39170a5772A26637g1964B0404J535c68462
18887G51a27555M7904K5244l9978m869A27835D6477a85741l5944J7749p1165e204
$$ y = [107746, 338738, 236358, 101698, 163726, -172656, 142458, -209904, 340095, 35070, -45037, -187424, 271443, 77116, -153785, -59156, 287058, -27153, 22286, 182724, -9652, 4166, -142314, -60120, -117275, 24535, -286967, -324524, -421646, 201188, -264821, -113304, 54327, 6895, -209383, 151554, -131982, -36660, -74083, -60447, -29373, -83812, 87498, -195441, 248410, -4080, -360555, -281425, 12, 171122, -258215, -118024, 102458, 226236, -285983, -79731, -110593, -278807, -223862, -474874, 36494, 226910, -97503, -173748, 119338, 232202, -106935, -292086, 138421, 285453, -29112, 90982, -239170, -15772, 126637, -71964, 20404, 21939, -368462, 751, -127555, -79651, -54407, -94385, -99254, 127835, 46477, -185741, -221685, -203936, -275101, -5204]
18874g0033B0224i6742k16157f7753o6424l4519M7B24506D7900B2028a9956J842
18862a8114c920n3710B63618a8312D2632J20201c034j20815A84951g753j07634
18851a15387E3361j7052Q4246c9838E5747N6035a13317Q337B6905a79793e0166
18839a15627m4270c553A63116f5922A91582c51294c5905j55810l5575d3763A10894
18827I9271h3819L8597g430j31479A99519b7835j96769A67486L5243j3349A9938
18815E6601B4254e10294A68673J2180a63007D4208a43954B24727c0042G5755a74562
18803b05221b039k18574e7220b5619o0538j88426J36059j69185a7284k14780a7951
18791A82941o7575b95494H1352@b10002C0808d46937G1886a09485j43890A95619
$$ y = [-70033, 20224, -96742, -312899, -67753, -134177, -168696, -168649, 224506, 47900, 22028, -19956, -18114, -3920, -57630, 263618, -18312, 42632, 162833, -3034, -123849, 184951, -7753, -115387, 53361, 36309, 120555, -39838, 55747, 111782, -113317, -104980, 26905, -179793, -50166, -115627, -159897, -3553, 163116, -65922, 191582, -351294, -35905, -191715, -227290, -43763, 110894, 99271, -83819, -45222, -7430, -138909, 199519, -27835, -224604, 167486, 202729, 189380, 19938, 56601, 24254, -510294, 168673, 180853, -163007, 44208, -143954, 224727, -30042, 75755, -174562, -205221, -2039, -220613, -57220, -25619, -86157, -274583, -138524, -307709, -17284, -232064, -17951, 182941, 115366, -295494, 81352, 0, -210002, 30808, -446937, 71886, -109485, -253375, 195619]
18779b1599j89933o1181B6517N5147b59754F6938a70050O1433A90608c20238I062
18767A21197Q2420n3846e4019k63199Q3177E9126b04928A21592O8586q4331B8996
18755a32933k79338b9197C05266c59702J30343A30585b84538g9813o9048A8014
18744i9988J0648a4026k521j70561D6588R8908a25684K6909K7022A56926B6469
18732e056A39369h4347l00905D3585K99461c04858a8384o2448j27243Q2314L2072
18721i3689j16457k27205a850m4127C51833I0890c23318A20327b53857O6219K6899
18710a60739A05926a56539O7224A82572J9057B7819P7529a79224A71796h9842
18699B7731K26651g1714J8427A17843m1955B5803N4083d1390N410A63288a55793
$$ y = [-21599, -211532, -272713, 26517, 81664, -259754, 66938, -170050, -108617, 190608, -320238, 9062, 121197, 203617, 149771, -54019, -317218, -234041, 59126, -204928, 121592, 190178, 105847, 28996, -132933, -412271, -29197, 305266, -359702, -229359, 130585, -284538, -79813, -148861, 18014, -99988, -89340, -14026, -16547, -187108, 46588, 145496, -125684, -98775, -71753, 156926, 26469, -5056, 139369, -84347, -385252, 43585, 343046, -304858, -18384, -80832, -208075, -125761, -93689, -210146, -437351, -1850, -45977, 351833, 90890, -323318, 120327, -253857, -187638, -160739, 105926, -156539, -89315, 182572, 201629, 27819, 105348, -179224, 171796, -89842, 27731, 254382, -71714, -53287, 117843, 75888, 25803, 79886, -41390, -35980, 163288, -155793]
18687A14670B247M7352c7035B20021k438b16087A06310a90458b086I6958a82132
18675f4002a356p2868L783l70867c4033j9777B2325a23625a6372r2147D37269
18663c40414a4795F1092P4993b90286i563k12975D8350e97784a43474f7368C08242
18651h8372D0878g4617J3386k98149a1015B34056i0137r3249d5465k5813o3295
18640a34573e6183K2809B91046c96243a64006F109K97584f4446n8096E912b75339
18628d41823H4218a77512j0320e0201B55112e4211p1537d2671m3000d2797r3041
18617a35838A48733c97255J72545g6657e136q3161E4011c35795c9497P458A98662
18605a74860h6758A07336a90273b7221f577m89198a68911l619j01888e4180l39632
$$ y = [114670, 2247, 49599, -37035, 220021, 217583, -216087, 106310, -190458, -2086, 96958, -182132, -64002, -1356, -74224, -70441, -441308, -34033, -53810, 22325, -123625, -16372, -108519, 437269, -340414, -14795, 61092, 136085, -290286, -9563, -222538, 48350, -597784, -143474, -67368, 308242, -88372, 40878, -74617, -61231, -359380, -11015, 234056, -90137, -183386, -45465, -71278, -134573, -56183, -33374, 291046, -396243, -164006, 6109, 303693, -64446, -122542, 5912, -275339, -441823, 84218, -177512, -187832, -50201, 255112, -54211, -125748, -42671, -85671, -42797, -135838, 148733, -397255, -224710, -76657, -5136, -88297, 54011, -335795, -39497, -32039, 198662, -174860, -86758, 107336, -190273, -27221, -6577, -495775, -168911, -172530, -274418, -54180, -393812]
18594c93812e836l3760C9875b86848D4515c24692c5836a3041j47220r7838J1458
18583b46641D4224b64733l6376J11950a7842K123E104d0717I7796K12452a18113
18571C9673e2241j21265f788l85552a53535B69111a37416I0322b34187Q3601J0203
18560a40383D0243a02775a4279k17219C3045f8243D1406J9792L1692P2225a10282
18548a14510m0693f26l51814R9756A37083b8374A11826d7765n4356G7615a03718
18536b502A3940J62249d22716a89802K3548A31284b1617B70451A06820Q9056b79631
18524B42065Q4620M7180g7486r448c1745j94380r6713a00757n1549K5349C49817
18512d5775F5247c40124g5912p518p4679C4474a43912L9272j70242B48953I7861
$$ y = [-393812, -5836, -39596, 39875, -286848, 44515, -324692, -35836, -13041, -160261, -258099, -246641, 44224, -264733, -301109, -189159, -17842, -15719, 5104, -40717, 97796, 310248, -118113, 39673, -52241, -173506, -6788, -392340, -153535, 269111, -137416, 90322, -234187, -150586, -140383, 40243, -102775, -14279, -231498, 33045, -68243, 41406, 61198, 92890, 165115, -110282, -114510, -155203, -626, -352440, -252684, 137083, -28374, 111826, -47765, -102121, 77615, -103718, -2502, 13940, 176189, -422716, -189802, -166254, 131284, -21617, 270451, 106820, 195876, -279631, 242065, 326685, 373865, -77486, -86934, -31745, -226125, -322838, -100757, -152306, -126957, 349817, -45775, 65247, -340124, -75912, -83430, -158109, 34474, -143912, -104640, -274882, 248953, 97861]
18500b64167i2402A16638b09276N5416C09795d5563m4534P765A22799J49655a72691
18488B04920a53084A22213e8318C5775J4073B725R123a8359C89327D7962i8708
18476B47006f9781c497j59401J9921j45785C1940b53497D7128J7838a9074k31070
18465b50144A47999e43014A22987l7887a64651a6927D992N3093B6589J32837J978
18454A61404g232n2712I8531A8425J56381e8585l1080A08073a05706A56172M589
18443A60761E7570c6524k99419g9310H537i9779H6594a24820H9525J72203a74458
18431d2337j10226P0832B3520J5881J13103f376j43650m6266b0366E9643L1943
18420I1586B7538J35447k1373a0569l25543a62062I3548a22008B38536h1581j16555
$$ y = [-264167, -92402, 116638, -209276, -153860, 309795, -45563, -90097, -82332, 122799, 272454, -172691, 204920, -153084, 122213, -58318, 35775, 49848, 2725, 11848, -18359, 389327, 47962, -98708, 247006, -69781, -3497, -162898, -142977, -288762, 31940, -253497, 47128, 64966, -19074, -250144, 147999, -543014, 122987, 85100, -164651, -16927, 4992, 58085, 26589, 159426, 161404, -7232, -59944, 98531, 18425, 174806, -58585, -89665, 108073, -105706, 156172, 160761, 57570, -36524, -335943, -79310, 8537, -99779, 86594, -124820, 89525, 261728, -174458, -42337, -152563, -81731, 23520, 39401, 152504, -6376, -150026, -196292, -20366, 59643, 91586, 27538, 162985, 141612, -10569, -336112, -162062, 93548, -122008, 238536, -81581, -198136]
18409a98136j8002K0279A3801J72480a18882J531E0503K1267A0397K0838a47326
18397E9005f0158G2981a02913c0025A5101K75800a33822A79593c69016J79125
18387a89891b5596A86610b67876A04941b24250H446J79631a98677j22324a9383
18376c22885a48193B04761C9776i9274A04636c04433A2753d2748C49967c6549
18365A97674e2581A30518J69763d4065R215E6020a69688J6176m6810A09704h9376
18353g349k53010A19415a60153n3243a6812l16378e7062j44011H0475N1194a51730
18341a96636j581j51197A58030p5332e4891A0688O4716b41969f1549I5870h5724
18329a89737G4789C2652Q8453m7783J03610L0221a39195K2482B6895J9068a57856
$$ y = [-198136, -216138, -195859, 13801, 186281, -118882, -117351, 50503, 71770, 10397, 31235, -147326, 59005, -60158, 72981, -102913, -30025, 15101, 290901, -133822, 179593, -369016, -189891, -25596, 186610, -267876, 104941, -224250, 8446, 188077, -198677, -321001, -19383, -322885, -148193, 204761, 39776, -99274, 104636, -304433, 12753, -42748, 349967, -36549, 197674, -52581, 130518, 300281, -44065, -34850, 56020, -169688, -153512, -200322, 109704, -89376, -7349, -260359, 119415, -160153, -213396, -16812, -333190, -57062, -201073, 80475, 131669, -151730, -196636, -198217, -349414, 158030, 82698, -54891, 10688, 75404, -241969, -61549, 95870, -85724, -189737, 74789, 32652, 121105, 73322, 176932, 207153, -139195, -116713, 26895, 45963, -157856]
18317F3171b5303n4089B42185G8054J3403C4065M4923a79278C0137a25364B07304
18305g5953B33732c78006E3630J25550i9137j11991a8023n5574D42610b272m6764
18294d9036j26446B9856a80671b3630q7200k59828i8682B6458a0787m5384k972
18283e9143A15864a70681p7042g799B56045B0371J57980a93599E40781a19937
18272A29352b45332a06192A05490r743m2570d3763C6576M0089b4605m9146k64599
18261c38350r0496J31687R6585K4915h6071k67771a12922k71155A5634K92476
18251C08110a66554E0720a57308C63476A60554a20687k5074d2297l07839C3274
18240a92001D70027i7514o808C2975a4209n9463j88382C57838C9028a12268D8871
$$ y = [63171, -25303, -79392, 242185, 78054, 91457, 34065, 78988, -179278, 30137, -125364, 207304, -75953, 233732, -378006, 53630, 179180, -99137, -211128, -18023, -73597, 442610, -2272, -49036, -175482, 29856, -180671, -23630, -110830, -370658, -98682, 26458, -10787, -56171, -59143, 115864, -170681, -247723, -7799, 256045, 20371, 178351, -193599, 540781, -119937, 129352, -245332, -106192, 105490, 95747, 53177, -43763, 36576, 76665, -24605, -73751, -338350, -428846, -297159, -200574, -175659, -86071, -353842, -112922, -384077, 15634, 308110, -166554, 50720, -157308, 363476, 160554, -120687, -145761, -42297, -350136, 33274, -192001, 470027, -97514, -104322, 32975, -14209, -73672, -262054, 357838, 39028, -112268, 48871]
18228A15576R4174a49805B29307O326h7879p7136f1521J1642A40886M4521P3964
18217B59371c2563q4392L0283n039j69775A03083h9045B32569C1343a86464A6598
18205B13162b2012A13489K75467I7680c02520H91c4330A20310c8417B47797A17325
18193a32357D20893D2740a21512C8508D83L5969h9306c5628o10968F3331b02536
18181c1700A19710J85196j31845n3498A423f3058A7464i2795L6289k14263A52088
18169B66539b63542B7875G878J08694a81804g3442B3089i933n2977j95230G7647
18157E6218c99781d3131m5330j97798j50642A86060a20584j65186J40615A40733
18146b36076h6595j45307J07142B47952Q012H8543R8545i3344j32555i2508n2003
$$ y = [115576, 209750, -149805, 229307, 235633, -87879, -165015, -61521, -49879, 140886, 185407, 259371, -32563, -116955, -86672, -91711, -261486, 103083, -89045, 232569, 31343, -186464, 16598, 213162, -22012, 113489, 388956, 97680, -302520, 891, -34330, 120310, -38417, 247797, 117325, -132357, 420893, 42740, -121512, 38508, 483, 36452, -89306, -35628, -646596, 63331, -202536, -31700, 119710, 304906, 173061, 119563, 1423, -63058, 17464, -92795, -56506, -270769, 152088, 266539, -263542, 27875, 7878, 116572, -181804, -73442, 23089, -9933, -62910, -258140, 77647, 56218, -399781, -43131, -88461, -286259, -436901, 186060, -120584, -285770, -145155, 140733, -236076, -86595, -231902, -124760, 247952, 255964, 88543, 187088, -93344, -225899, -92508, -144511]
18135a44511A33584n3171a50671A33868f8944H3047c41503g423C3488J57325a65931
18123a91300f7599a900A57188a33310E1519J53203j00308i1004j29275J08849
18113a11430A4968M058J16913F0845K4059a56087p5746A29563K55509b4066q8618
18102a12684l6751f5273H9649h95k22316h6504A73412h1462j96565A30267A8345
18090G5610c10683a42875A07225B7108b68694H3751d1392A70006B0811a69309
18079I3961l4617a17757b2393a026G5920a47418a258A55014O0530E6685a55024
18067b07842K1514k96367F9349J54068J62265a42600B06751g9126B9550a92195
18056B6201a24548A12243j9303l5074k5529a00477A55142L5139n9528a3537k09447
$$ y = [-144511, 133584, 80413, -150671, 133868, -68944, 83047, -341503, -7423, 33488, 190813, -165931, -191300, -67599, -1900, 157188, -133310, 51519, 204722, 104414, -91004, -220279, -111430, 14968, 19026, 135939, 60845, 84904, -156087, -231833, 129563, 385072, -24066, -112684, -149435, -65273, 89649, -895, -223211, -86504, 173412, -81462, -278027, 130267, 18345, 75610, -310683, -142875, 107225, 27108, -268694, 83751, -41392, 170006, 20811, -169309, 93961, 59344, -117757, -22393, -1026, 75920, -147418, -1258, 155014, 215544, 56685, -155024, -207842, -186328, -482695, 69349, 223417, 385682, -142600, 206751, -79126, 29550, -192195, 26201, -124548, 112243, 92940, 57866, 32337, -100477, 155142, 190281, 130753, -13537, -222984]
18045b22984j6828Q7875k35022A89054c07385e3572k5003O500J7225l9923a0778
18033b27869C51243a08697d2904D6234J50508b1567j88619A74388f5997j82126
18023b48123F7246C002J82485h9708a1456B6899L6158k087a33985d4363E4742
18011b0509n0855k1139B65804f5987j08694I3179q463f328l91544e9408m14091
18000d73499f5344l15491a24313k12398c7481C52303h8289A07960a45068e5901
17989b3349B1971i3275F1133c9292j74807A9605H284L00596j36731E1955a31292
17977C5510J75725J40394b23479g4409F1850K76499a62505A69868B8119H470f9762
17965a81487e1415j09204K3345K1182A74234o9064l9287g1463E8172a34389m5275
$$ y = [-222984, -239812, -151937, -386959, 189054, -307385, -53572, -78575, -72075, -54850, -94773, -10778, -227869, 351243, -108697, -42904, 46234, 196742, -21567, -210186, 174388, -65997, -248123, 67246, 3002, 185487, -89708, -11456, 26899, 63057, 60970, -133985, -44363, 54742, -20509, -71364, -92503, 265804, -65987, -174681, 93179, 84716, -6328, -397872, -59408, -473499, -65344, -380835, -124313, -336711, -37481, 352303, -88289, 107960, -145068, -55901, -23349, 21971, -93275, 61133, -39292, -214099, 19605, 8284, 308880, 172149, 51955, -131292, 35510, 211235, 351629, -223479, -74409, 61850, 338349, -162505, 169868, 28119, 8470, -69762, -181487, -51415, -160619, -137274, -116092, 174234, 105170, 65883, -71463, 58172, -134389, -179664]
17954a79664I5468R0743a94037B43397A7362a50987n9809g7184C8710e5538D1472
17942d5871p8118N0215A24177J92209e8597A06901N9540a02931A31819a61689
17931h7690j66901F234j597b10985A81256c0809C8227c14450E1890B1952Q7161
17920A09113a25551j77272B33391m9311p965n8091m9511a92585R244O1104A30291
17908b42557O6051g1324B45344F0347a08762p1042B31873E4974A7064K03996g616
17896e1577A27475a38591A07204d4932B01608r4816a20461a6147P000A3098b589
17884A09366a60948A38476J40281j12754f3416A05825L84470b25418A86330C1852
17873A83635b06250A16276a64530C1043C434c12299N9870I1289K06727a26549
$$ y = [-179664, 95468, 186211, -194037, 243397, 17362, -150987, -210796, -77184, 38710, -55538, 41472, -45871, -123989, -73774, 124177, 316386, -58597, 106901, 166441, -102931, 131819, -161689, -87690, -254591, 6234, 4637, -210985, 181256, -30809, 38227, -314450, 51890, 21952, 109113, -125551, -302823, 233391, 184080, 176115, 118024, 68513, -192585, -183341, -122237, 130291, -242557, -176506, -71324, 245344, 60347, -108762, -179804, 231873, 54974, 17064, 221060, -7616, -51577, 127475, -138591, 107204, -44932, 201608, 106792, -120461, -16147, -9147, 13098, -2589, 109366, -160948, 138476, 278757, 166003, -63416, 105825, 490295, -225418, 186330, 31852, 183635, -206250, 116276, -164530, 31043, 3434, -312299, -252429, 91289, 298016, -126549]
17862e4208C5015a08431A36633l4310j9220a10943A61831a3102C7139I853b51489
17850C3843a165C09870C0908c24994e694F5141M5128m2499L389B5000F96K46736
17838B47432o1106a68058j6603R639B61640a8422D954a50350N3861c7639r6509
17827a34148A77695C7339a36007A55057m7978m5938a56439c0103j98277P8712
17817a49668k6297a5833F6004J70251b04186B26153E5202a25163A80030e1538
17806c97766e4498j7974F8585N5631b56280o1616C54007a7481j70639K0820A84195
17794a44615M1093J3397r7592A05848B8460f177E7540m528b7938k64242c7806
17782e8767k13686B4065b16589B3659Q4995D5810j8696n589c54590A17890E0590
$$ y = [-54208, 35015, -108431, 136633, 102323, 83103, -110943, 161831, -13102, 37139, 9853, -251489, 33843, -1165, 309870, 30908, -324994, -5694, 65141, 110269, 67770, 71159, 25000, 696, 247432, 186326, -168058, -184661, -175022, 261640, -18422, 4954, -150350, -96489, -37639, -134148, 177695, 37339, -136007, 155057, 107079, 61141, -156439, -30103, -228380, -149668, -175965, -15833, 66004, 236255, -204186, 226153, 55202, -125163, 180030, -51538, -397766, -54498, -72472, 68585, 124216, -256280, -317896, 354007, -17481, -188120, -167300, 184195, -144615, -103522, -90125, -187717, 105848, 28460, -6177, 57540, 53012, -27938, -292180, -37806, -58767, -272453, 24065, -216589, 23659, 108654, 45810, 27114, 21525, -354590, 117890, 50590]
17770C14165A52033g7022j58877a01160l8536r3518C9998L54954j38115h2341
17759c0511j48553C6682O7522B1691J80611q4513O2466f6338C02020a24817B98865
17747C5753M9648M42729A79742G7992e09617A68584l3096R9856e5465F8308a7365
17735G0432f130m7534B9119a79581B1784d5606A74532m3359A7625K08463o8062
17724A58026M98b2372k17442D2732O1214O1961E9915c8843B64692J9023j16619
17713A67096b3218A81430k9647n7806c5814B20215n2035a75831k8432A2655c2158
17701A21870a5068m8265C64548O8432E6972N8811e18823A34286O3265j7674d5317
17689F4006f4756n2140o1406P1633A99993a5741B18678a37648B59187Q1441h5421
$$ y = [314165, 152033, -77022, -235899, -101160, -139696, -233214, 39998, 394952, 256837, -82341, -30511, -179064, 36682, 104204, 21691, 202302, 117789, 180255, -66338, 302020, -124817, 298865, 35753, 85401, 528130, 179742, 77992, -509617, 168584, 135488, 235344, -55465, 68308, -17365, 70432, -6130, -53664, 29119, -179581, 21784, -45606, 174532, 131173, 17625, 226088, 158026, 158524, -22372, -239814, 42732, 103946, 165907, 59915, -38843, 264692, 283715, 167096, -23218, 181430, 151783, 93977, -35814, 220215, 168180, -175831, -204263, 12655, -32158, 121870, -15068, -63333, 364548, 432980, 56972, 115783, -518823, 134286, 197551, 179877, -45317, 64006, -64756, -116896, -178302, -106669, 199993, -15741, 218678, -137648, 259187, 340628, -85421]
17677a32673A1974J83418J03059L5558E1111h7573B76314G6957J46603j06252
17667A17308J24802o8378a12846H8048J06836m5395d6701a5792m6794A7843K12627
17656B30470f4526D16092f1232A65994M5205a05193A08028a39412L9464J2263
17646h7685B77094A08746E1166d8507G3415B4471R9600J53942a37453A2133a3552
17634A50649a36824d2652k24323I7165f1985q3525A16611k7136D948K2009a79231
17622A91658N0950e5551m05248A46515p552J50108a21978A81568p2118A4133J04847
17611A18980a20993n899H9970P4738N0131a48746j498h200m38889A63774J16753
17600B80527A13081c07635B5018J38309a74436h373H3655a12813I4880d8238m742
$$ y = [-132673, 11974, 195392, 298451, 334009, 51111, -87573, 276314, 76957, 223560, 117308, 242110, 173732, -112846, 88048, 194884, 149489, -46701, -15792, -62586, 17843, 230470, -64526, 416092, -61232, 165994, 211199, -105193, 108028, -139412, -99948, -87685, 277094, 108746, 51166, -48507, 73415, 24471, 124071, 278013, -137453, 12133, -13552, 150649, -136824, -42652, -266975, 97165, -61985, -145510, 116611, 89475, 4948, 26957, -179231, 191658, 242608, -55551, -460799, 146515, 138963, 289071, -121978, 181568, 109450, 14133, 118980, -120993, -126892, 89970, 164708, 214839, -148746, -150244, -8200, -447089, 163774, 280527, 113081, -307635, 25018, 163327, -174436, -8373, 83655, -112813, 94880, -48238, -52980]
17589e2980A92102a72408c3279n2375J7611C1299N6540A358a02102B66467j2519
17578B53948I4247J48187p5876J4311Q2948e8945D3347L788K18615a80070A727
17566B89424J18339j86804h2064j34573I5721c4078A30530C7205K89793j59136
17556A67862a6813A04141M312a5870k2337A11707O7391K3180d09196J80865B36660
17544e5543A38175K12191b7057q1996C3991a09189A25582O5499A8096J02418a426
17532a13003C26640j04355b926k0333D97357H1546K84222D9822a5511E56504j26770
17521D29734j93831O20416k21851p4806j67717I8866K50202M5830A34310L4905
17511A69215E0954K89624o1989k1750M41301k80546J91214k38961O6948k02514
$$ y = [-52980, 192102, -172408, -33279, -85654, -68043, 31299, 87839, 1358, -102102, 266467, 253948, 94247, 242434, 166558, 180869, 263817, -58945, 43347, 47135, 265750, -180070, 1727, 289424, 407763, 220959, -82064, -216637, 95721, -34078, 130530, 37205, 326998, 167862, -16813, 104141, 108453, -15870, -38207, 111707, 179098, 202278, -409196, -228331, 236660, -55543, 138175, 350366, -27057, -109053, 33991, -109189, 125582, 191081, 18096, 120514, -1426, -113003, 326640, 222285, -2926, -23259, 497357, 81546, 365768, 49822, -15511, 556504, 429734, 235903, 856319, 634468, 559662, 391945, 98866, 349068, 394898, 134310, 169215, 50954, 340578, 278589, 256839, 698140, 417594, 608808, 369847, 436795, 234281]
17501B34281o7010N9111H9957J84354A20437J76691j05473I5553M91098j16911
17491D69740k06293r3619E2566a2742I0765h6524C30580A37474J32302j7710A02494
17479B23654L8905q514F1514K32299F3993a76475A48954J62519A16531n3367B6401
17467a41841A48110a60731G4193J29163a09240B74176a74511F7125L24427D7619
17456A73654n9610D9453J22059F1247K63273I8242J79447J10748J03148j19893
17446C71692J03993m6625i1658C02995g8816E22665D7480a26464A33715N9496
17436A93211J31520b9770B96052j03357J09174k2187A02343J27520l5257J76885
17426C71491A12101M33281c654B80842a39714A55211M4788n0802j8059J71961
$$ y = [234281, 167271, 226382, 89957, 274311, 120437, 297128, 191655, 95553, 586651, 469740, 263447, 169828, 52566, -12742, 90765, -86524, 330580, 137474, 269776, 252066, 102494, 223654, 262559, 254045, 61514, 293813, 63993, -176475, 148954, 311473, 116531, 63164, 26401, -141841, 148110, -160731, 74193, 203356, -109240, 274176, -174511, 67125, 391552, 47619, 173654, 114044, 49453, 171512, 61247, 324520, 98242, 277689, 388437, 491585, 371692, 475685, 429060, -91658, 302995, -78816, 522665, 47480, -126464, 133715, 193211, 324731, -29770, 296052, 192695, 301869, 279682, 102343, 229863, 194606, 371491, 112101, 545382, -3654, 280842, -139714, 155211, 199999, 149197, 131138, 303099]
17416C03099K1561j47859M04516l6323j63262A08600K33942K67742I5222L13227
17406D08449B7942J46202m3223B9103K6172L9090d8091A37271L77380A56771N7724
17395B14495K34718A72587L2035P8268J39456A2800e7782H1469l9265K64295A02641
17383G8622d831C28854A13504K08058H7978J02652J74949N2851j40063L1805A51803
17371D14441F8265c7305B17915j08687J96093A45442k7872N6463e0439A13965
17360C56223A77630F0559a51169J3933c0526B7452L11929q8838q2054J49919F7471
17348A86163P3164B5498B307O4007K02633B6613K74605a8837A79581K15475n5251
17337C39805A3724L05426c697B57516A2007J68725o6148C8883g633A39664n4047
$$ y = [303099, 324660, 176801, 581317, 544994, 381732, 108600, 342542, 610284, 95222, 408449, 27942, 174144, 130921, 29103, 55275, 94365, -48091, 137271, 514651, 156771, 214495, 449213, 172587, 204622, 282890, 422346, 12800, -57782, 81469, 42204, 306499, 102641, 78622, -4831, 328854, 113504, 321562, 87978, 190630, 365579, 418430, 278367, 310172, 151803, 414441, 68265, -37305, 217915, 109228, 305321, 145442, 117570, 174033, -50439, 113965, 356223, 177630, 60559, -151169, -137236, -30526, 27452, 339381, 250543, 168489, 318408, 67471, 186163, 259327, 25498, 2307, 66314, 268947, 26613, 301218, -18837, 179581, 395056, 339805, 13724, 319150, -3697, 257516, 12007, 180732, 114584, 38883, -7633, 139664, 85617]
17326H5617M79005p6179k25455a04792A18886d7034A72814G3384J05478J89482
17316C68344D0635K14741N1540A13613a43301C34031B3291J4477P8168G029c6341
17304C54891A34387K797L49267j59941E0004M51514A01999j5027J01597K38934
17294D27503G5763a469A41303K6896e2879A95293k6024F6639L09101A80570m9540
17283A31030o3804K35101D7005a14559E377P9771a21939A18160K01420A16653
17272H9031J24181f7738C43126j01212a2176B64891N203B6365J44053N9064C5514
17260B43048J07679j8065j42341L4009K10500L2425A71049J46507j7312j27847
17250A72397H0890K77743N5151b9922A61598k6433o4319K99747o9747G7710L6742
$$ y = [85617, 564622, 488443, 262988, -104792, 118886, -47034, 172814, 73384, 178862, 368344, 40635, 255376, 306916, 113613, -143301, 334031, 23291, 37768, 115936, 7029, -36341, 354891, 134387, 137184, 486451, 326510, 50004, 501518, 101999, 86972, 188569, 427503, 75763, -1469, 141303, 168199, -52879, 195293, 169269, 66639, 375740, 180570, 131030, 67226, 302327, 47005, -114559, 5377, 85148, -121939, 118160, 319580, 116653, 89031, 213212, -67738, 343126, 241914, -12176, 264891, 270094, 26365, 170418, 229482, 35514, 243048, 350727, 332662, 190321, 224330, 434830, 467255, 171049, 317556, 300244, 172397, 80890, 358633, 413784, -29922, 161598, 135165, 70846, 370593, 300846, 77710, 114452]
17239A14452J09963K15694M1845A78449L10756h6302G6406J50471H7866K78535
17229C66401j31548m0330L907L6633L7318D4703b546C67773l9261K298A55078
17217C6580O7662J01506l6554i0586B91646n9623K15139I9493K37596j29077L82765
17206E90777k81598j11072p0484R1983r2836D5696J95386K01860j47693q2492
17196B12757h63B4155N84882B42361a0412I9048L96537q2307j5224b7294C16125
17184A69756K60324L4545j86580J26135m5701A11029L40578i3292B7042K31521
17174B58563j24404K60763K42411A55213K04210o857j18360K11177r0189j63667
17164A91527G7413K73586A44222K39171k0541A24080K04693m5002L4479p3276
$$ y = [114452, 224415, 440109, 481954, 178449, 489205, -86302, 76406, 226877, 87866, 366401, 234853, 194523, 198430, 235063, 272381, 44703, -2546, 367773, 328512, 330810, 155078, 36580, 104242, 205748, 169194, -90586, 291646, 232023, 447162, 99493, 337089, 208012, 590777, 309179, 198107, 127623, 219606, 126770, 45696, 241082, 442942, 295249, 212757, -863, 24155, 609037, 242361, -10412, 99048, 495585, 413278, 398054, -27294, 316125, 169756, 430080, 464625, 278045, 404180, 358479, 111029, 451607, -93292, 27042, 258563, 134159, 394922, 637333, 155213, 359423, 352566, 234206, 445383, 355194, 191527, 77413, 350999, 144222, 383393, 362852, 124080, 328773, 283771, 318250, 244974]
17154B44974n5076L57172j08442P5451A53167K31981j03005K00267k28182N1032
17144C05260J89338j90904R143L74578A17657O8105E9152K18875N9051J30731
17134D67809k2808J34512A90478L13597j42843q9416J41124K05453k14492l7829
17124C66072J8087L3658k5152J43668B57509A08464N5645L28899P2875K57792
17114H23675C53458R3696L510r473j12788L54158j26691k62543K76149k53575
17104C15901J82018Q550k16623J22951j14670j23243K23612J47762B00970M73469
17094F74439k12518k3700p5243J86249Q0122p7973A97899K18975K95851l39994
17084C72731K30707k33725J59126j35105J26530m7400M9935M4792j03151j46537
$$ y = [244974, 189898, 547070, 438628, 514079, 153167, 385148, 282143, 482410, 254228, 305260, 494598, 303694, 312837, 687415, 117657, 185762, 59152, 278027, 337078, 467809, 445001, 579513, 190478, 504075, 361232, 271816, 412940, 618393, 403901, 366072, 384159, 417817, 392665, 536333, 257509, 108464, 164109, 493008, 565883, 823675, 353458, 447154, 450664, 441191, 328403, 682561, 555870, 293327, 569476, 315901, 497919, 506469, 289846, 412797, 298127, 174884, 398496, 546258, 200970, 674439, 461921, 438221, 362978, 549227, 629349, 551376, 197899, 416874, 712725, 372731, 603438, 369713, 528839, 393734, 520264, 472864, 522799, 567591, 464440, 317903]
17074C17903K72048k10845L48746j30959j05779O9668m9537K5758j88237P312
17064C56078q9358A07773K31803A68334N66212C44366K40955J08725k3504C05013
17053B77326L81849o6364l6855L8727j72986J56336j36827K90640m727k51562
17043D75557K41363o0104r2269J26064p4702k0834J36507K9441j90401j62914
17033D07708K51591q55o8754j21576j24076L20197K35141k93943p2491K66443
17023G99385j35562M47030l92113L32058l10704K10916l49443j75450K80400P3835
17013G80352k13571K8705K23094q4330J88043L1857l64674j3722K03374k133j61183
17002F15812M17551o7170M28635m31912R3208j97676k1129r6156P7538j92968
$$ y = [317903, 589951, 379106, 727852, 596893, 491114, 560782, 511245, 537003, 348766, 356078, 266720, 107773, 339576, 168334, 734546, 344366, 585321, 694046, 670542, 305013, 277326, 659175, 592811, 555956, 594683, 421697, 578033, 441206, 731846, 727119, 475557, 716920, 656816, 564547, 690611, 615909, 595075, 731582, 761023, 570622, 407708, 659299, 658444, 589690, 468114, 344038, 664235, 899376, 605433, 532942, 799385, 663823, 1110853, 718740, 1050798, 740094, 951010, 601567, 426117, 706517, 780352, 566781, 595486, 818580, 734250, 922293, 954150, 589476, 575754, 779128, 776995, 615812, 1033363, 966193, 1394828, 962916, 1056124, 858448, 837319, 741163, 818701, 625733]
16992F25733J66252M80801E32441N86195k27694L6417m0766L1033n8851J30945
16982I89720R3660j23103J6126n6049K99413m0136l01625P2924K14154k53993
16972I11091L39769n10699K22919J57476j20796K4225M00362n43252l0497K8983
16962H79581J8517J82381K02312l59564N57066l91592K44590m4103m30778K5753
16952H84163J43885J98409o3585Q1514O3179K16095l52083J88846l11269j57481
16942H91673L95589N7863j24963Q3081O5472R8629J09315m38559N76257k85234
16932A429123l1115J36645J61103n57819N25233o0520m15839L53243J75487P1477
16922A787018k66691J68076L26394l08089O7960k92954K95101J23362J09422m15417
$$ y = [625733, 791985, 1272786, 532441, 1118636, 890942, 927359, 886593, 917626, 858775, 989720, 1083380, 960277, 976403, 920354, 1219767, 1179631, 878006, 950930, 1165084, 911091, 1250860, 740161, 963080, 1120556, 999760, 1023985, 1424347, 881095, 850598, 879581, 898098, 1080479, 1282791, 923227, 1480293, 1088701, 1333291, 1289188, 858410, 884163, 1028048, 1226457, 1162872, 1244386, 1307565, 1523660, 1171577, 1360423, 1049154, 891673, 1287262, 1345125, 1220162, 1303243, 1368715, 1467344, 1576659, 1138100, 1714357, 1429123, 1398008, 1534653, 1695756, 1137937, 1663170, 1602650, 1186811, 1540054, 1715541, 1787018, 1520327, 1688403, 2014797, 1706708, 1774668, 1481714, 1776815, 1900177, 2009599, 1594182]
16912A594182L5217M18152j40219K3534j01192j01834M7551M91539m89803M8493
16902A825620K58337r4445L85464l20147k1162J48100K1987j9189J64499O7612
16892B416676k61440j95490R09901n20032M9427J06015O5598j200J2153K1502
16882B603110n1178L96383L7916n91818M01868K01731p7523J94043k37001N256
16872B882787k0968K93802J77395m6566N8305N4846K6690o8460M37885j89924
16862C605792K10952j88427K0540j1163L98206k85591L56515p3956j3872L02649
16852D321645m28810K12995N48473n53121L96804P5185p4390M47649m0522J38099
16842E044007q9388L69402N2861K3716J18038J60002J31862j01283o8027L25352
$$ y = [1594182, 1629399, 2047551, 1907332, 1930866, 1829674, 1727840, 1775391, 2266930, 1777127, 1825620, 2083957, 1989512, 2374976, 2054829, 2033667, 2181767, 2203754, 2184565, 2349064, 2416676, 2155236, 1959746, 2869647, 2349615, 2399042, 2505057, 2570655, 2569455, 2581608, 2603110, 2551932, 2948315, 2986231, 2394413, 2796281, 2998012, 2920489, 3114532, 2877531, 2882787, 2861819, 3155621, 3333016, 3286450, 3344755, 3399601, 3426291, 3357831, 3795716, 3605792, 3816744, 3628317, 3648857, 3637694, 4035900, 3750309, 4106824, 4032868, 4018996, 4321645, 3892835, 4105830, 4654303, 4101182, 4497986, 4573171, 4498781, 4946430, 4905908, 5044007, 4954619, 5324021, 5376882, 5400598, 5518636, 5678638, 5810500, 5709217, 5641190, 5966542]
16832E966542l4548K2777L90442K9627J83052J87633J73431p4390P2222M15203
16822G331991r7242L31267L43768j54056J49136K86522J83079O3856J51200M75161
16812I064682J79131j09428O02092k24192M92396J3665k45913P67289J9718P21254
16802A1280694q9485N37609K56970O73000m94372P16548M54376L57973K94865
16793A3988178N87487j41069P47547O81573J97876M51326M47472N83509P40467
16784A8284366L17465M75175P64435K31421J100792N98111Q12303M20470J013011
16775B4017549M82179J040131Q40023P58603J340887P90308J451448R51714J194285
16766C2867127J240297Q51541J750422J455715J239859J692183J612117J895884
$$ y = [5966542, 5931994, 5954771, 6345213, 6374840, 6557892, 6745525, 6918956, 6844566, 6916788, 7331991, 7234749, 7566016, 7909784, 7755728, 7904864, 8191386, 8374465, 8438321, 8589521, 9064682, 9243813, 9134385, 9736477, 9512285, 10004681, 10018346, 9772433, 10539722, 10559440, 11280694, 11191209, 11728818, 11985788, 12658788, 12164416, 12880964, 13335340, 13693313, 13988178, 14575665, 14434596, 15182143, 15863716, 16061592, 16512918, 16960390, 17543899, 18284366, 18601831, 19077006, 19841441, 20072862, 21173654, 21771765, 22584068, 23004538, 24017549, 24499728, 25539859, 26379882, 27138485, 28479372, 29269680, 30721128, 31672842, 32867127, 34107424, 34958965, 36709387, 38165102, 39404961, 41097144, 42709261, 44605145]
16758D4605145J655433K041919J989643K059250K227822K127902K204513K709705
16750F1621332L005189K420080K901254K906714L126629K961753L336091L087046
16742H5366088L679319L418081L182343L753322L212849L663219L352445K790487
16734A12418153L149298K845217K060960K744180J607559J505464J233460R34018
16726A28498309L74046m56552o59915m22052j516113j811881k008172k358427
16718A19639243k690840k600209l460336k958254l192284l450907l668422l448850
16710I4169141l518037k879782l739985l502376k831670k701446l099579k795003
16702F9101263k752482k849610k286034k607939k377088j930356k373556j838082
$$ y = [44605145, 46260578, 48302497, 50292140, 52351390, 54579212, 56707114, 58911627, 61621332, 64626521, 67046601, 69947855, 72854569, 75981198, 78942951, 82279042, 85366088, 89045407, 92463488, 95645831, 99399153, 102612002, 106275221, 109627666, 112418153, 115567451, 118412668, 120473628, 123217808, 124825367, 126330831, 127564291, 128498309, 128872355, 128415803, 127755888, 127333836, 125817723, 124005842, 121997670, 119639243, 116948403, 114348194, 110887858, 107929604, 104737320, 101286413, 97617991, 94169141, 90651104, 87771322, 84031337, 80528961, 77697291, 74995845, 71896266, 69101263, 66348781, 63499171, 61213137, 58605198, 56228110, 54297754, 51924198, 50086116]
16694E0086116k145513j878482j690017j763978j596671j414832j750802j207520
16686C6638301j256118j367065j101561j031228j172601r00302p90494j223026
16678B7795906r58835q69748p02537m41187j414009m77595q55202m68972p10198
16669B0897623n84041m30030p08173o17959n04965n30918m96221k53943l97656
16660A6373717n65192r9827o86884o41116j05775j33260n86256k35778m14403
16651A2905226j61591n13397m58404o6889j95124o6651n16597l46752n5595l57879
16641A0166347j84979k44506j7230n40796P1880r9019k50061j54828o1032n17059
16631H168717k63132k5652j54837j3584j40962j72291q9143m25285j36448j93797
$$ y = [50086116, 47940603, 46062121, 44372104, 42608126, 41011455, 39596623, 37845821, 36638301, 35382183, 34015118, 32913557, 31882329, 30709728, 29809426, 29018932, 27795906, 26837071, 25967323, 25264786, 24823599, 23409590, 22931995, 22076793, 21607821, 20897623, 20313582, 19883552, 19175379, 18557420, 18052455, 17521537, 17025316, 16771373, 16373717, 15808525, 15708698, 15021814, 14380698, 14274923, 14141663, 13555407, 13319629, 12905226, 12743635, 12230238, 11771834, 11704945, 11509821, 11443170, 10926573, 10579821, 10524226, 10166347, 9981368, 9736862, 9719632, 9178836, 9250716, 9151697, 8901636, 8746808, 8685776, 8168717, 7905585, 7879933, 7725096, 7711512, 7570550, 7398259, 7309116, 6883831, 6747383, 6553586]
16621F553586K47595k59095J53612k07255j39117l57094J81976n733m15753J46276
16611E898998l10742j40679J95172j02897l52422M22213n02419k75639K95578
16602E127163J30735k98340j58001J44529n18913k6044n1232N3283L7771l14919
16592D126032K80731p6450l57179J80975k7903M855m4867m6747j43479j3734j00533
16581C781701J37702j98635k93736q7102K2279J04438l77164M91561k30568j91927
16571C158549Q5941L44230l03450r2864j28915K21854r2667m7370J5925j83905
16561B977328p2860l44198L15465p6134j84226K44985j8800j77265L4591K7056
16551B725942o5269Q1590j05960M9093j57601J58962j36872q5331j52557M0714
$$ y = [6553586, 6801181, 6542086, 6695698, 6488443, 6349326, 5992232, 6174208, 6168475, 5752722, 5898998, 5588256, 5447577, 5642749, 5539852, 5187430, 5609643, 5107224, 4831585, 5127163, 5257898, 4959558, 4801557, 4946086, 4427173, 4401129, 4349897, 4403180, 4440951, 4126032, 4406763, 4330313, 3973134, 4154109, 4126206, 4131061, 4086194, 4039447, 3895968, 3882234, 3781701, 3919403, 3720768, 3427032, 3339930, 3362209, 3466647, 3089483, 3581044, 3350476, 3158549, 3244490, 3588720, 3285270, 3192406, 3063491, 3285345, 3192678, 3145308, 3161233, 2977328, 2904468, 2560270, 2875735, 2799601, 2615375, 2860360, 2841560, 2664295, 2698886, 2725942, 2660673, 2742263, 2636303, 2685396, 2527795, 2686757, 2549885, 2464554, 2311997, 2352711]
16541B352711K2265L22017m44783J27611J15677m50220L97026l65784P3910K60751
16531B411181m04167K64724j03569L6342q007l02576J28792K78717j06090r4162
16521B101185j10127j99898j27210J50020O4410j10608M65442j46938l26429k6940
16511A732907j25117K14678j83986L430J29032O924j04418L42138k13150k31710
16501A570728J81844j79308O5605R5700k7056j28457j10885K68573j04963l87470
16491A244311K77068K7864J10317n3237j27950J65775k43197K88428n30671n7236
16481A101472L79529o2267p4682R0725O5877J27912k88348J75062L61929o67587
16471A209622J94855J34483j53513K05955k54780O7041J54405m42927J75614k0222
$$ y = [2352711, 2374976, 2696993, 2252210, 2379821, 2495498, 2045278, 2442304, 2076520, 2150430, 2411181, 2007014, 2271738, 2168169, 2204511, 2196504, 1893928, 2022720, 2301437, 2195347, 2101185, 1991058, 1791160, 1663950, 1813970, 1878380, 1767772, 2233214, 2086276, 1759847, 1732907, 1607790, 1822468, 1638482, 1641912, 1770944, 1777868, 1673450, 2015588, 1802438, 1570728, 1752572, 1573264, 1638869, 1734569, 1707513, 1579056, 1468171, 1736744, 1631781, 1244311, 1521379, 1549243, 1659560, 1606323, 1478373, 1644148, 1400951, 1689379, 1158708, 1101472, 1481001, 1418734, 1344052, 1434777, 1500654, 1628566, 1340218, 1515280, 1877209, 1209622, 1404477, 1538960, 1385447, 1591402, 1336622, 1403663, 1558068, 1115141, 1290755, 1270533]
16461A270533j57775K53007J68675l30822m3592o4270J20041P2853k09899m5804
16451A032947L51622j68012l1175J04756K3872k18184K85859o8169k75149K99935
16441A338302j37590M6912O6277J2769l32754N7674J9461L9535p0528K82755N7382
16430A380195p4204j41628J19883k41474M7780Q5906L8786K04836m52656k9914
16420I37510J51735N3089k1523j8337j63637J76008k39438J91478l93189J00769
16410G74465J98007j8048R6133k69844K37244L69639m81690J07075n1029K45114
16400A207066l44286K35737R9794m98041L21990r940J7532k44691o3139M75613
16390A197635k15750R8616J6743l14994M53787m65093o099R2662j19129K85961
$$ y = [1270533, 1112758, 1365765, 1534440, 1203618, 1160026, 1095756, 1215797, 1288650, 1078751, 1032947, 1384569, 1216557, 1185382, 1290138, 1314010, 1095826, 1381685, 1313516, 1038367, 1338302, 1200712, 1247624, 1313901, 1326670, 993916, 1051590, 1071051, 1110586, 1040058, 1322813, 1380195, 1305991, 1164363, 1284246, 1042772, 1090552, 1176458, 1215244, 1420080, 967424, 937510, 1089245, 1142334, 1120811, 1102474, 938837, 1114845, 875407, 1066885, 673696, 774465, 972472, 954424, 1050557, 780713, 1017957, 1387596, 905906, 1012981, 961952, 1207066, 862780, 1098517, 1198311, 700270, 1022260, 1012320, 1029852, 785161, 722022, 1197635, 981885, 1080501, 1097244, 782250, 1236037, 770944, 764845, 857507, 738378, 1024339]
16380A024339k79205j46580K06928j7954l9756j10967K03536J46137j55182K32141
16370A063437l05841j69538J72396j552J8797J23023l48701L27902j0024m5811
16360H24088K04504l42982M7375L09975p2608l85831L36728k41448K77585C56487
16349F96722J14434m2733j55893P6382K10557k47248R1189J49090R4352k99023
16339F87829J82802P9211j50576k35149M5121l1344M44281l32436n9616J77986
16329H08109J2512j36190k98672M77202j66270r4921k1961j660M19917l02207
16319F95859J983J74018m13557l1955J71416J48331J7507k06804R948M12705k30064
16308G49387l7350J85411l29176J47818j65484J57712J2726p6400J64247Q4064
$$ y = [1024339, 745134, 598554, 805482, 787528, 747772, 636805, 840341, 986478, 831296, 1063437, 757596, 588058, 760454, 758902, 777699, 900722, 552021, 879923, 869899, 824088, 1028592, 685610, 732985, 1042960, 970352, 584521, 921249, 679801, 957386, 356487, 696722, 811156, 768423, 612530, 688912, 899469, 652221, 743410, 892500, 986852, 687829, 870631, 949842, 799266, 564117, 609238, 577894, 1022175, 689739, 630123, 808109, 820621, 684431, 385759, 862961, 696691, 601770, 579809, 578149, 998066, 695859, 697842, 871860, 458303, 426348, 597764, 746095, 763602, 556798, 566746, 979451, 749387, 712037, 897448, 568272, 716090, 550606, 708318, 721044, 644644, 808891, 892955]
16298H92955q5088L11034m44428L98983D72683K84470o7610n195L7725j92694
16288E29379J7084n7806O4312N2348B95430N15508k65779K60296k09716N0925
16278F46664j43642j56162J5482L85315j99589J07871Q5029C21319L25924p8121
16268E69122K20384l34703K30668B50364L28939k78700L13502j86134o3875K10780
16258E74876l2605p9516B19657N84413n2500l07820A77371L37255P6137k9520
16248E61243J6910k84080O06675D13573J05346Q2181k3073k1404l2539j1902A55077
16236C69582o8426J31806j50729M91934l83618K80770j47023J47929B34733J78456
16226D13189P2906m6254K26173j56496M961q5867f134F4658P1779J52142J86671
$$ y = [892955, 807867, 1118901, 674473, 1073456, 472683, 757153, 689543, 684348, 722073, 529379, 546463, 488657, 552969, 605317, 295430, 810938, 545159, 805455, 595739, 646664, 503022, 346860, 362342, 747657, 548068, 655939, 740968, 321319, 647243, 569122, 789506, 454803, 685471, 250364, 579303, 300603, 614105, 427971, 364096, 574876, 542271, 462755, 219657, 804070, 751570, 443750, 177371, 514626, 590763, 561243, 578153, 294073, 900748, 413573, 518919, 601100, 578027, 556623, 524084, 512182, 155077, 369582, 301156, 432962, 282233, 774167, 390549, 671319, 524296, 672225, 234733, 413189, 486095, 439841, 666014, 509518, 514479, 428612, -6134, 64658, 136437, 288579, 475250]
16215D75250r7431K32819o7652R5403k47186A79539k154J95732I4093L33813p7643
16204C50263j58192K55197l469j42819M39331B71055R9543L06201l09583K56642
16194F23858j66951j10061N6416L49706j31520B86024J34984M5672j20900l5602
16184C10178m4414J5855J58494j89663A16015K36649j3004J2406L95670A10449
16173C31645A59639O6490O2909J5210j36070J63044r0537F5370L31943A59464
16162E14126m8748Q6269J92369C28897A12507J15832P839n4692J61538k8246Q9349
16151D04127n5612d5919A61960K17651o4066J40548g3450C83968M702C5572M70096
16140E05668F3016R8243B5657K11823K75493J2663p640I0028K84828K1850Q7318
$$ y = [475250, 377819, 610638, 542986, 638389, 391203, 179539, 177385, 373117, 94093, 427906, 350263, 192071, 447268, 443799, 300980, 740311, 271055, 370598, 676799, 367216, 623858, 456907, 346846, 403262, 752968, 621448, 286024, 421008, 466680, 345780, 310178, 265764, 281619, 440113, 250450, 116015, 352664, 339660, 352066, 747736, 110449, 331645, 159639, 226129, 289038, 304248, 168178, 331222, 240685, 65370, 397313, 159464, 514126, 465378, 551647, 744016, 328897, 112507, 228339, 236178, 181486, 343024, 314778, 404127, 348515, -45919, 161960, 379611, 315545, 456093, -73450, 383968, 388670, 35572, 505668, 63016, 161259, 25657, 237480, 512973, 525636, 517996, 90028, 374856, 396706, 484024]
16129D84024k20455e5193B00801L69836B24031J9451c9428B8230J51207Q5550
16119B64987K85903B45842b7659A0490a83184A62370C7433L42577A26488j8947
16109A07541M9994M5865F7591a40077A05354i0342B48634a99003A37095F0269
16098A6675K18958A09308J76592p8481a3879B85227o3017k9908a7222j06158F9381
16086B26609D3573K53620j8969E5873J48920J62409b30579I5747J38185c3487
16075A16378R9542d2945A46889P4185p760J0919A8917g541k72711B20944H0175
16063B66461E7204L741k1616J30582B8046J87822j4225f9814B08924H7891f0517
16051A53881E5639O9012k2561A2258g0015A66574F6976J30668D606J76910k2588
$$ y = [484024, 263569, -55193, 200801, 570637, 224031, 243482, -39428, 28230, 179437, 264987, 550890, 245842, -27659, 10490, -183184, 162370, 37433, 380010, 126488, 107541, 157535, 203400, 67591, -140077, 105354, -90342, 248634, -199003, 137095, 60269, 16675, 235633, 109308, 285900, 207419, -13879, 285227, 222210, 192302, -17222, -123380, 69381, 226609, 43573, 297193, 278224, 55873, 204793, 367202, -230579, 95747, 233932, -33487, 116378, 215920, -42945, 146889, 221074, 213314, 224233, 18917, -7541, -280252, 220944, 80175, 266461, 57204, 60945, 39329, 169911, 28046, 215868, 201643, -69814, 208924, 87891, -60517, 153881, 55639, 124651, 102090, 12258, -70015, 166574, 66976, 197644, 4606, 181516, 158928]
16040A58928K6838c7919A47322l5054N03125A16392L00774A81895f1565H862L17378
16029C26240P1850A8604J73216B9573J15167n4277l1258N2874k7443a08791R029
16018i9762J7789O90p7286B45881f4383H4341J56714I694J22829a19672H908K15406
16006B24314g4846E4765K3133J6591a84959d6151C81514f1835o5331m7492B67489
15994B22405O8556G3968L2924l899a2734A23457K95017A096N79390A94481L38096
15983E32577j61203O01200B83740C9066b80072C97908A21923a33988B51716F6185
15972a58132I9893K3249N2967O0243a01878A0515J47349B3445J00657m4895J5190
15961I4397l7879e5741A16749c192o58j78721l4938I5161L1678E4584K18138g0592
$$ y = [158928, 185766, -37919, 147322, 112268, 615393, 116392, 417166, 181895, -61565, 8862, 326240, 398090, 18604, 191820, 29573, 144740, 90463, 59205, 112079, 84636, -108791, -99762, -81973, -81283, -158569, 245881, -64383, 84341, 241055, 9694, 132523, -119672, 8908, 224314, -74846, 54765, 77898, 94489, -184959, -46151, 381514, -61835, -127166, -174658, 267489, 222405, 290961, 73968, 106892, 102993, -12734, 123457, 418474, 1096, 580486, 194481, 532577, 371374, 972574, 283740, 39066, -280072, 397908, 121923, -133988, 251716, 66185, -158132, 99893, 123142, 176109, 236352, -101878, 10515, 157864, 23445, 124102, 79207, 94397, 56518, -55741, 116749, -3192, -3850, -182571, -217509, 95161, 126839, 54584, 272722, -70592]
15948a4318B1289a12506C17996j25105a14239k77516c5606j6035A30545A4134
15937A85051N411H7068d03584J82147M1890E3345M6519m2396b33971H9826G422
15925B48796I9172J64305H9149h1588F0993j8063a50999e2179K3659O298A95640
15913a46736B83629A7039P5045b04392C2433J07008b1331j2818l3126l4787A0523
15901A9230N6485K37587A0103J95732b97459B88338I959b98982A21276A6686M4355
15890F1041K08693F656R4411L5710o821K140M6974K6870F530b13134C18825a0431
15877D46267B1781a56164A66001a9447A54374n4706F627b0551j23816A54681h3377
15865C603K25184a5473j02580A9646b33613I4411A0340b32980E7164O0955B8133
$$ y = [-14318, 21289, -112506, 317996, 192891, -114239, -391755, -35606, -51641, 130545, 14134, 185051, 190462, 87068, -403584, -221437, -179547, 53345, 99864, 57468, -233971, 89826, 7422, 248796, 99172, 263477, 89149, -81588, 60993, 42930, -150999, -52179, -28520, -22222, 195640, -146736, 283629, 17039, 92084, -204392, 32433, 139441, -21331, -34149, -67275, -102062, 10523, 19230, 75715, 313302, 10103, 205835, -297459, 288338, 9959, -298982, 121276, 16686, 61041, 269734, 6656, 101067, 136777, 129956, 132096, 179070, 205940, 6530, -213134, 318825, -10431, 446267, 21781, -156164, 166001, -19447, 154374, 99668, 6627, -20551, -144367, 154681, -83377, 3603, 228787, -15473, -118053, 19646, -233613, 94411, 10340, -232980, 57164, 118119, 28133]
15853f9729C1915F233f769l8345A75040h1425A31725J51074a46885C526c53848
15841A482a13953H8464f6931J5675A14566J79996C5167d6276G4814d5247I7686
15829A23458b76502f6536j99004I4119h9087C9039a30242c2431m16654J81727
15819b67358P9156h9213q1626C0298M6675B1858b27775I3987a30578B19420b33928
15807a57151B57827c11625a7957H7459d4143F2473a71227H2005h2788A01206j380
15796I9826D4806c18832b0676A26113a63180A13838K52992a19673C8225L60904
15786C99129h2458l8975j46738I5269a9780k06645j10545A37194B076J52777f9401
15774E2128b07262N940O0281m34j35332A58316a43588O3648J605j21853B03747
$$ y = [-69729, 31915, 6233, -6769, -45114, 175040, -81425, 131725, 282799, -146885, 3526, -353848, 1482, -113953, 88464, -66931, -51256, 114566, 294562, 35167, -46276, 74814, -45247, 97686, 123458, -276502, -66536, -265540, 94119, -89087, 39039, -130242, -32431, -449085, -267358, -188202, -89213, -170839, 30298, 76973, 21858, -227775, 93987, -130578, 219420, -233928, -157151, 257827, -311625, -17957, 87459, -44143, 62473, -171227, 82005, -82788, 101206, 99826, 44806, -318832, -20676, 126113, -163180, 113838, 366830, -119673, 38225, 399129, -82458, -121433, -268171, 95269, -19780, -226425, -336970, 137194, 2076, 154853, -69401, 52128, -207262, -201322, -141041, -141475, -276807, 158316, -143588, -79940, -78335, -200188, 203747]
15762a38974F144J62925O9814j7333a75793h0188B88562D6405k0924J96452P6154
15751B98087b43337d8109B29702b25557K7350q458H8886c3936D0487A3861O2757
15740G6618a43923f6449m506B26141E6462b53299J08819j17827i3191A55767J0177
15729A65944A1429K37138A09293C5190A6503a00501j88276a03351p6904K4785
15719a55470k00389O3434k30260A13960n3730k1187r244O4705b58432A5882a40889
15707B03287a97611j12439o7029D0801a2577l69948I8718a85510e6190j86071
15697b42261R4853N2641I3764b9578q4260E0303N7822a36464j65273B20575b61016
15685a15397o4086d7778r0665j61562B33055a29188j09116B5748M4154b14325
$$ y = [-138974, 6144, 169069, 238883, 221550, -175793, -80188, 288562, 46405, 25481, 221933, 298087, -243337, -48109, 229702, -225557, -198207, -206665, 88886, -33936, 40487, 13861, 76618, -143923, -66449, -70955, 226141, 56462, -253299, -144480, -262307, -93191, 155767, 165944, 11429, 248567, 109293, 35190, 16503, -100501, -288777, -103351, -180255, -155470, -355859, -292425, -522685, 113960, 60230, 39043, 29799, 94504, -258432, 15882, -140889, 203287, -197611, -310050, -377079, 40801, -12577, -382525, 98718, -185510, -56190, -242261, -147408, -94767, 93764, -29578, -113838, 50303, 108125, -136464, -301737, 220575, -261016, -115397, -179483, -47778, -138443, -300005, 233055, -129188, -238304, 25748, 69902, -214325]
15674A83187h9631c7430p1686o3221h357E4574g3154R490B03068c5061B6122e6157
15661g7573D9194c31887A06329J65549a02925a4498D69602D6238j1183d123j93888
15650a98011A8227g7532k3935b3750r6205p3049B6292J4629a12571k8954A35119
15638A67453j7425b54089B9810h004A4112f5830B6700a39409E21719d0999m6711
15627h7710A71799c9277j02224m4938d8215A69743C4554J086a22658E3652a38822
15615A3960b57028F1897a4723A31499o418h5660B25688A11974a90368P6084A02771
15603B4184J46826c22759B0716a07167B57594o8714a96372A83269a02736n3398
15593a56134j42680a29953M5823a4405A12920j5260b08602i4447D7101J48198
$$ y = [183187, -89631, -37430, -109116, -172337, -8357, 54574, -73154, -63664, 203068, -35061, 26122, -56157, -77573, 49194, -331887, 106329, 271878, -102925, -14498, 469602, 46238, 35055, -4123, -198011, 18227, -77532, -101467, -23750, -119955, -193004, 26292, 40921, -112571, -141525, 135119, 167453, 150028, -254089, 29810, -8004, 14112, -65830, 26700, -139409, 521719, -40999, -87710, 171799, -39277, -141501, -186439, -48215, 169743, 34554, 35640, -122658, 53652, -138822, 13960, -257028, 61897, -14723, 131499, 125081, -85660, 225688, 111974, -190368, -114284, 102771, 24184, 171010, -322759, 20716, -107167, 257594, 188880, -196372, 183269, -102736, -156134, -298814, -129953, -84130, -14405, 112920, 97660, -208602, -94447, 47101, 195299]
15583A95299a9761k41912A20549J38786a0425j88047A21211a73996H3311b3986
15572a65588n1791H983K66624a6431l5272k16651A48833A40a77768A15083K9127
15561A44210K24634g5176q3992J4321B30357a08006l1253j3889J0063A80532L12184
15550D92716a44689B48157c07141d6943C77441c9922a7609k93147A66252E626
15539B2102b02946D18704A56902h4082j6171j39885B04423l4953C6886a93830
15528G5619B9184b41506E1157b41317H7277a15680a956r5894J1005m6278g556
15516b76972A07601C6408N0077a52221A51551n82B5037M0154a38056A93836A34
15504A81604b12580A0136a31261G5226a31133D15244b03228L0004A62567J48918
$$ y = [195299, -19761, -261673, 120549, 259335, -10425, -198472, 121211, -173996, 83311, -23986, -165588, -217379, 8983, 275607, -16431, -51703, -268354, 148833, 140, -177768, 115083, 144210, 368844, -75176, -159168, -144847, 230357, -108006, -139259, -153148, -143085, 180532, 492716, -144689, 248157, -307141, -46943, 377441, -39922, -17609, -310756, 166252, 5626, 22102, -202946, 418704, 156902, -84082, -100253, -240138, 204423, 169470, 36886, -193830, 75619, 29184, -241506, 51157, -241317, 87277, -115680, -1956, -97850, -86845, -133123, -7556, -276972, 107601, 36408, 86485, -152221, 151551, 150969, 25037, 65191, -138056, 193836, 134, 181604, -212580, 10136, -131261, 75226, -131133, 415244, -203228, -173224, 162567, 311485]
15494C11485H6011a09048r2449n7904a07394B7014e0700j40770E1819L5319J25657
15483B12795l7284O3663r6132a7483F6705B2799R5336P6259a6838K365C67781
15471c8784k13756A2442a4101A64385A8575a62535B69663B7173L3045o620a3546
15459B8004i1670j47673B005b72619A62707e448j65938A47g7658B3263P3749l2807
15447F4205a63534H4505a83911K3582B57885A25259Q2502E3863J64010A2721L72226
15436C84947j15305K47080I9649R8317E5759a20050b2817A99572B9413J425a24470
15424B64692a01291b6411j63349C51715b23537F7612J80828D4087d3307A59964
15413I5006K6033m8741M1118f0216C8177a21357J3036C81010a19593A4331K63932
$$ y = [311485, 86011, -109048, -201497, -259401, -107394, 27014, -50700, -191470, 51819, 87138, 212795, 175511, 239174, 143042, -17483, 66705, 22799, 118135, 194394, -16838, -14473, 367781, -38784, -252540, 12442, -14101, 164385, 18575, -162535, 269663, 27173, 60218, 53598, -13546, 28004, -91670, -239343, 2005, -272619, 162707, -5448, -171386, 147, -77658, 23263, 97012, 64205, -163534, 84505, -183911, -160329, 257885, 125259, 207761, 53863, 217873, 12721, 384947, 269642, 516722, 99649, 197966, 55759, -120050, -22817, 199572, 29413, 30838, -124470, 264692, -101291, -26411, -189760, 351715, -223537, 67612, 248440, 44087, -43307, 159964, 95006, 121039, 72298, 113416, -60216, 38177, -121357, -108321, 381010, -119593, 14331, 278263]
15402B78263A38197L9640d1019m65807H4682c2412l4408A51545A4409a24670E371
15390c15840A49311o5176A3192b96638l7689C09792j05326a62280E1970b21262
15379a32179j34697I3037D1165i0659c8132j68500F3545a36119R066A95993a03807
15367B90431f903r0848A68415E1862a22365C407N43486A3772N5987K53237B7566
15355B38486N5142A7310a62759A1086b4085A36775a11267B38394H9720O6132m783
15344A51069o1703a08559B8640O11880a21220C02180Q6862j68032j01874a99063
15333e7837o5482C28091A02189J31565E0101K22899a73241g8075A0352f7226C1552
15321c4238o4748B05056l8614a02648D3488K43807A1672L4355J12976J15453j35139
$$ y = [278263, 138197, 177837, -41019, -506826, 84682, -32412, -66820, 151545, 14409, -124670, 5371, -315840, 149311, 84135, 13192, -296638, -334327, 309792, 204466, -162280, 51970, -221262, -132179, -266876, 93037, 41165, -90659, -38132, -206632, 63545, -136119, -127053, 195993, -103807, 290431, -6903, -97751, 168415, 51862, -122365, 3407, 546893, 13772, 69759, 322996, 27566, 238486, 293628, 17310, -162759, 11086, -24085, 136775, -111267, 238394, 89720, 155852, 151069, 89366, -108559, 28640, 640520, -121220, 302180, 389042, 221010, 119136, -199063, -57837, -123319, 328091, 102189, 233754, 50101, 273000, -173241, -78075, 10352, -67226, 31552, -34238, -98986, 205056, 166442, -102648, 43488, 287295, 11672, 46027, 159003, 274456, 139317]
15310A39317c4346p0109A79095k8592L52251D9837a88283M7726E92509A81801
15299c4823C15869e2623B84534i3620D8935b5026C45365A18034D904J21217A1537
15287b1729j21690L1766B3999M7218j6709a92585b0442E093K23361a0344r7974
15276a08318b5549k19218N905g6322L7536B16078H1942b02055M9000A28482k3894
15265A04588b53740g6837N083I7635a26971L5026A92137E3006a14276C5142g1426
15253B81530a38972B99515L1647a7765H60284M22712k56406Q9751k52573B16132
15242I8514J34231E2596O6829J91267E3608O0433M2967a5552j35526H5681h5344
15230B52053f9263c3361k44092B18484b9335E9709L52295k05409H8983a06087
$$ y = [139317, -34346, -104455, 179095, 150503, 502754, 49837, -188283, -140557, 592509, 181801, -34823, 315869, -52623, 284534, -93620, 48935, -25026, 345365, 118034, 4904, 126121, 11537, -21729, -143419, -111653, 23999, 71217, 54508, -192585, -20442, 5093, 228454, -10344, -108318, -25549, -244767, -238862, -76322, -38786, 216078, 81942, -202055, -153055, 128482, 104588, -253740, -76837, -71754, 97635, -126971, -91945, 192137, 53006, -114276, 35142, -71426, 281530, -138972, 299515, 331162, -17765, 860284, 1282996, 1026590, 1116341, 863768, 216132, 98514, 232745, 52596, 119425, 310692, 53608, 114041, 157008, -15552, -151078, 85681, -85344, 252053, -69263, -33361, -277453, 218484, -29335, 59709, 412004, 206595, 88983, -106087]
15219F5237a74794H455N0166f3811A61073e9064j3975j14436f049E7997j1994
15208D6003K50i1508B90829A30213a20135c0526K396C92624g8049C6479K17440
15197B53919g6594I412J16425b93898g1671k29320F6651J12909f3034a4099A2580
15185B5649L73847A8061J11248K79928e8759A17617f1336n43577K67431B14436
15174A56188c28185B84875h7183G5147L95520D0416b36622B80399a71118K2160
15164a48958B36510e835A639b04688C2323K46655j38216b8110J381A28139A2851
15152a61065g5105J8183A17627L8716e8683k1167D40914A00904A3165Q6550f56
15140A22679J00813h8824b417C47437j01593q0786J01358A05008i2940D67707
$$ y = [65237, -174794, 8455, 58621, -63811, 161073, -59064, -73039, -187475, -6049, 57997, 46003, 46253, -91508, 290829, 130213, -120135, -30526, -28130, 392624, -78049, 36479, 253919, -76594, 9412, 125837, -293898, -71671, -300991, 66651, 179560, -63034, -14099, 12580, 25649, 399496, 18061, 129309, 409237, -58759, 117617, -61336, -604913, -337482, 214436, 156188, -328185, 284875, -87183, 75147, 470667, 40416, -236622, 280399, -171118, -148958, 236510, -5835, 1639, -204688, 32323, 278978, 140762, -28110, -26729, 128139, 12851, -161065, -75105, -56922, 117627, 156343, -58683, -79850, 440914, 100904, 13165, 99715, -656, 122679, 223492, -88824, -2417, 347437, 245844, 165058, 266416, 105008, -92940, 467707]
15129C04473a39241m6778D44511g3424A46546a34657b042A36261N8663E2921e5503
15117F2297a02298A14341j2543i7163B49878c4728J2208B51847a02389A43464
15106a17537a910B11690G5505b22193R0019B90255d0681H513L04473A37166E8296
15094A79058H6913r165A3800M5608J49386K20042G5821N1130K62629C7743L96614
15083D34357D5049H99K19298J10347I4659c6660H4669b53539C413K73773J17939
15072C95125e9410C52857A01377b8588J1357B81003p3203F1556N3645n1049Q9327
15061A53479J6724E4578a35942A15741P4346K62703H3826a37742B77361E0443
15050i5290G3028J66220C3900K45590K76433A41396J37075j30560K556J91265
$$ y = [304473, -139241, -186019, 444511, -73424, 146546, -134657, -2042, 136261, 194924, 52921, -55503, 62297, -102298, 114341, 101798, -97163, 249878, -34728, -22520, 251847, -102389, 143464, -117537, -1910, 211690, 75505, -222193, -132174, 290255, -40681, 8513, 312986, 137166, 58296, 179058, 86913, 77748, 13800, 59408, 208794, 428836, 75821, 126951, 389580, 37743, 434357, 45049, 899, 220197, 330544, 94659, -36660, 84669, -253539, 3413, 277186, 395125, -59410, 352857, 101377, -28588, -17231, 281003, 207800, 61556, 115201, 64152, 153479, 170203, 54578, -135942, 115741, 190087, 452790, 83826, -137742, 277361, 50443, -95290, 73028, 239248, 33900, 279490, 555923, 141396, 278471, 147911, 150467, 341732]
15040C41732A4478O0876K20221h4670c6171j1028J5380B7445N4975i879A35317
15028B07823o0326K02164A04406O0033K67258j02221j16996k700J81919G7501
15017B66135J26875K9016A83670O230J46793J00292k13513p2461J92679A55701
15006D96801A69803L10882P5769k36783j44697N9993J72219A96101J94565j07665
14996B83001K8224C7455M8996K23903J1323j4362G5232K77604J06613M9809O6522
14985E75780j98382p053j25221P995j7622c0918A86213I2132M1315M09611A94782
14973C78470j50995r9467Q4461K41739R9575q1310N4793A0680L06078A38899N75035
14962G13934C26525I2938K32133a25839C18569K03922B22090F9444J78052d8438
$$ y = [341732, 14478, 75354, 295575, -84670, -36171, -47199, -31819, 27445, 82420, -9879, 135317, 207823, 147497, 349661, 104406, 164439, 431697, 329476, 212480, 209780, 391699, 77501, 266135, 393010, 422026, 183670, 189900, 336693, 436985, 223472, 151011, 343690, 155701, 496801, 169803, 480685, 556454, 319671, 174974, 234967, 407186, 196101, 390666, 283001, 311225, 37455, 86451, 310354, 321677, 307315, 75232, 352836, 459449, 509258, 575780, 377398, 370345, 245124, 253119, 235497, -30918, 186213, 92132, 133447, 543058, 194782, 378470, 227475, 128008, 212469, 454208, 553783, 472473, 527266, 10680, 316758, 138899, 713934, 326525, 92938, 325071, -125839, 318569, 522491, 222090, 69444, 247496, -48438]
14951i6131A41900O9145K00189j22586j36653A6506Q1548L27107A60758J06209
14941B66967l8557J14624J67808l1837A71587L04257I7851J22667I0678M67271
14931E57949J54008B09101L67200k49078M39169C44228R7892q5360L92933L4535
14921G84228p4509q1376l6805K0410J7121l6173P740J62780J5951C83300K9045
14910D12345A58166K69080j07638n2899J99100p9965j10784P2319B8971Q6897
14900A15868l4234N34137j5702B18943r706K73158K33638k64780k07120L63581
14890F07714B91254K05660N9928p8482j28415K46500B02759O5734J98916o0918
14880D06491J1748j35345K3608m9681j17853L68013B17308J59410L30880l34841
$$ y = [-96131, 141900, 211045, 411234, 288648, 151995, 16506, 98054, 425161, 160758, 266967, 228410, 343034, 510842, 479005, 171587, 475844, 97851, 220518, 90678, 557949, 711957, 209101, 576301, 327223, 766392, 344228, 442120, 356760, 749693, 784228, 709719, 628343, 591538, 611948, 629069, 592896, 600636, 763416, 779367, 383300, 412345, 158166, 427246, 319608, 266709, 465809, 385844, 275060, 347379, 28971, 115868, 81634, 615771, 600069, 218943, 209237, 482395, 716033, 451253, 244133, 607714, 291254, 496914, 556842, 478360, 349945, 596445, 202759, 268493, 467409, 406491, 418239, 282894, 306502, 256821, 138968, 506981, 217308, 376718, 707598, 372757]
14870C72757Q2188k1200K16872C02190j3749M3163J89888k36483L00896B71035
14859E86657B09449j03504K85464J10233j41605j06140J04473K22085B73667K53906
14849E27573k45753K08616Q8009j86752L7722I7673L24617H8473M57417B44889
14838F70927r450B60006M35578k42281K14112J82934o6369C04909J63584k09142
14828B59351L13144j55538j72766L94062k21609r664A03807L65091L46278k48215
14818E66961j93174P8165L01107B31521M27092k62009K81516B24674O56822B34867
14807E21179j40477j07271M14477k58856M8477k6771J71050q0168k65271J95232
14797D71601Q8267J95210C55275J27523A83442L64490n4695j90459J15711J52675
$$ y = [372757, 454945, 433745, 650617, 302190, 288441, 331604, 521492, 285009, 585905, 271035, 586657, 209449, 105945, 391409, 501642, 360037, 253897, 358370, 580455, 273667, 527573, 281820, 490436, 578445, 391693, 429415, 97673, 422290, 88473, 545890, 244889, 670927, 661477, 260006, 695584, 453303, 667415, 850349, 783980, 304909, 468493, 259351, 572495, 416957, 244191, 638253, 416644, 406980, 103807, 468898, 815176, 566961, 373787, 451952, 753059, 231521, 658613, 396604, 678120, 224674, 881496, 234867, 521179, 380702, 273431, 687908, 429052, 477529, 450758, 621808, 541640, 276369, 471601, 559868, 755078, 355275, 482798, 183442, 547932, 493237, 302778, 418489, 571164]
14787E71164j76698J04038N2315j12672J09659J8196j6279k68425J45039C7746
14776E27655J05091j34473J2049j1489K05403J10052k37924k73738J85927J61263
14766F49816j19271j55134L29182k17278l3701N9661K25623k00408j56302L69882
14756G52070C51960l9038J49387K06401k68511K53056C12711M15098j6862k14312
14746D96635M6203K29851R3075l25450R2107j45933J73996K06667m25647j2818
14736D28686l2452K81889K27876m26983L20783o0402k70007L9205L11058M9948
14726H69601m5645O5494k30458r8052M46436K2351J0618j21193J45079K74222
14716A338453F03027K40577o2310J90849r0697l99353K63780j10866J16359O1917
$$ y = [571164, 394466, 498504, 550819, 438147, 547806, 566002, 549723, 281298, 426337, 37746, 527655, 632746, 498273, 510322, 498833, 704236, 814288, 576364, 302626, 488553, 649816, 530545, 375411, 704593, 487315, 453614, 513275, 738898, 538490, 382188, 752070, 351960, 312922, 462309, 668710, 400199, 653255, 312711, 727809, 710947, 496635, 542838, 772689, 865764, 540314, 632421, 486488, 660484, 867151, 441504, 428686, 396234, 678123, 905999, 479016, 799799, 739397, 469390, 508595, 819653, 869601, 823956, 889450, 658992, 560940, 1007376, 1029727, 1040345, 919152, 1064231, 1338453, 603027, 843604, 781294, 972143, 881446, 482093, 745873, 635007, 751366, 813283]
14706H13283j70076K34188j33250K5397J46698Q6843l7471k27827N8520L56841
14696A153146n0484J10504n01821N46146j90719l9459O7476l22375Q8942j08398
14686G52958N31501n94778J7675N10827m00367k00712J14626Q8404J912L29131
14676A151177l73615J98749J58112l41137J96869j18366m3039J18423k0312J78189
14666A105050l1292p4797j04641J5733L52090p7486N3866k97438J45428k12593
14656H73920J76756r9101K26676n72740J87268J18036J88171K01187m64743K76282
14646A111712Q868l76898J4832M16881j63406N2660J03326N5320l57643J83795
14636A049447J08478J41169O9581k02609k42511L5837L24440j96956K82235j82633
$$ y = [813283, 643207, 877395, 744145, 769542, 916240, 1003083, 965612, 737785, 796305, 1153146, 1102662, 1213166, 711345, 1257491, 1066772, 1027313, 1094789, 772414, 861356, 752958, 1284459, 689681, 707356, 1218183, 817816, 617104, 731730, 820134, 822046, 1151177, 777562, 976311, 1134423, 793286, 990155, 871789, 828750, 947173, 926861, 1105050, 1073758, 998961, 894320, 910053, 1262143, 1184657, 1238523, 941085, 1086513, 873920, 1050676, 951575, 1178251, 605511, 792779, 910815, 1098986, 1300173, 835430, 1111712, 1120580, 743682, 758514, 1175395, 1011989, 1064649, 1167975, 1223295, 865652, 1049447, 1157925, 1299094, 1368675, 1166066, 923555, 959392, 1283832, 1086876, 1369111, 1186478]
14626A186478J8583L40922o12372R8469N62371n68232Q5470j3463L45714l20558
14616A123382K0058K17879Q2969j41674j61615K40096j25111j69893L98358l15384
14606A169065L17631p5072K62536k56279J10469l741j03497n6932K5693K21827
14596A611700J3732n5258J91273m43898L84507n35504K45390L99644k51453J47537
14586A707670j78967p4419L82465m87128j2211O06929m18678K75241j73154K63347
14576A891095J19645k4777N234j48880J73431r6373O01j92877M59360j05377N5878
14565B136960J2006J85131L2308k8222j04775P0121M0610M97641J87781j65195
14555B864366M07282m953L05437M23450R78727R76164K241414M439465R874720
$$ y = [1186478, 1205061, 1545983, 933611, 1032080, 1594451, 1026219, 1111689, 1098226, 1443940, 1123382, 1143440, 1361319, 1444288, 1302614, 1140999, 1381095, 1255984, 1086091, 1484449, 1169065, 1486696, 1411624, 1674160, 1417881, 1528350, 1524609, 1421112, 1364180, 1389873, 1611700, 1625432, 1570174, 1761447, 1317549, 1702056, 1166552, 1411942, 1811586, 1560133, 1707670, 1528703, 1454284, 1836749, 1349621, 1337410, 1944339, 1525661, 1800902, 1627748, 1891095, 2010740, 1985963, 1991197, 1842317, 2015748, 1919375, 1919976, 1727099, 2186459, 2081082, 2136960, 2148966, 2334097, 2366405, 2338183, 2233408, 2303529, 2344139, 2841780, 3029561, 2864366, 3271648, 3266695, 3572132, 3995582, 4974309, 5950473, 8191887, 12631352, 22506072]
14546B2506072J4337357l550573j6609735G934205l513026q08487j264335L35232
14538B683589m05303k59171o27n6041o3477L8448N4674q6693K57790k54939O9985
14527A978235O199J89006l7869l0070n9979K89641J13155j65471j2170K46897
14517B517574n78819O62018l22468K59453k39347J18101K84286j26312n4283k56553
14507B263650M19300J24023k71541P4580k1741J71424K8576k14230R0959K35270
14497B900270O1966K61690k02833k13524M61779l03687O1716J33070q0809L53149
14487C432787k37366k24005L58198l56160M66623Q9393P097k76186J25495R7451
14477C483327K3609J34359K03065j77294m8617K12484J9329m592L26844l67473
$$ y = [22506072, 36843429, 33292856, 16683121, 7934205, 4421179, 3612692, 2348357, 2683589, 2278286, 2019115, 2018488, 1962447, 1898970, 1937418, 1992092, 1905399, 2163189, 1908250, 1978235, 1984434, 2173440, 2135571, 2105501, 2045522, 2335163, 2448318, 2282847, 2270677, 2517574, 1938755, 2600773, 2278305, 2537758, 2298411, 2416512, 2700798, 2574486, 2520203, 2263650, 2682950, 2806973, 2535432, 2610012, 2588271, 2759695, 2788271, 2574041, 2665000, 2900270, 2962236, 3223926, 3021093, 2807569, 3269348, 2965661, 3027377, 3160447, 3079638, 3432787, 3195421, 2971416, 3329614, 2973454, 3440077, 3529470, 3536567, 3260381, 3385876, 3483327, 3506936, 3641295, 3844360, 3667066, 3618449, 3830933, 3850262, 3845670, 4172514, 3805041]
14467C805041K98773K26898j67900K50405l09901L33143l77902M76560k40533
14458D294584Q4094J65374P9054L5795j52213P6507P7318K17522n5802j02690
14448D719543L47257N4308k45576O19144m22700K52788R8887L30218l70134j65002
14438E218733K11812M22767N6454n444J53794k39819j13265N30384k2787M2982
14428F255611K44015P7643J08590K43669L8099R0012N079J47439m7856q6001N71642
14417G647942j23873L29504j43805L72077Q6833l35492N16730K39175k54321J14364
14407H449134K01174L02597j08115M01609j0020J18386M61603p7897K72264M15686
14397A0426421j50434j6101L04630M7404L88095R3524L54912k34876Q32348l9412
$$ y = [3805041, 4103814, 4330712, 4162812, 4413217, 4103316, 4436459, 4058557, 4535117, 4294584, 4378678, 4544052, 4623106, 4658901, 4506688, 4583195, 4660513, 4878035, 4822233, 4719543, 5066800, 5121108, 4875532, 5494676, 5071976, 5324764, 5423651, 5753869, 5383735, 5218733, 5430545, 5853312, 5909766, 5904322, 6058116, 5818297, 5705032, 6235416, 6212629, 6255611, 6499626, 6577269, 6685859, 6929528, 6967627, 7057639, 7062718, 7210157, 7162301, 7076300, 7647942, 7524069, 7853573, 7709768, 8081845, 8168678, 7833186, 8349916, 8589091, 8334770, 8449134, 8650308, 8952905, 8844790, 9246399, 9236379, 9354765, 9816368, 9738471, 10010735, 10426421, 10275987, 10259886, 10564516, 10611920, 11000015, 11093539, 11448451, 11213575, 12045923, 12006511]
14387A2006511j05333J88124L06033K58934K79127J66955L77512M65961L1885
14378A3975709K45213J42650M59488M32540M8191O78217K03212L09891o2680K72688
14368A6705119L26606M32363O12332L00302K84614K89414P06252L05932O02410
14359B0565344N17128K70832K91392Q82560M16865L14092O48044L20197R54820
14350B5181274L69806O61326P07257M67780Q83017P62620O88199N91877J083085
14341C1396241Q33589R36270M81073J443664Q17519J098992Q53505J250926J238841
14332D0350620J160827J234237J298064J104624K123322J034048J932927J561469
14324E1800138J735958J936024J600878K048611K023299K391798K432663K567869
$$ y = [12006511, 11901178, 12089302, 12395335, 12654269, 12933396, 13100351, 13477863, 13943824, 13975709, 14220922, 14363572, 14823060, 15255600, 15303791, 15982008, 16185220, 16495111, 16432431, 16705119, 17031725, 17464088, 18076420, 18376722, 18661336, 18950750, 19657002, 19962934, 20565344, 21082472, 21353304, 21644696, 22527256, 22944121, 23258213, 23906257, 24226454, 25181274, 25551080, 26212406, 26919663, 27387443, 28270460, 29033080, 29721279, 30313156, 31396241, 32229830, 33166100, 33647173, 35090837, 35908356, 37007348, 37860853, 39111779, 40350620, 41511447, 42745684, 44043748, 45148372, 47271694, 48305742, 50238669, 51800138, 53536096, 55472120, 57072998, 59121609, 61144908, 63536706, 65969369, 68537238]
14316F8537238K246886K822967K778699K911323L348955L400183L941056L183165
14308I3170472M117562M118773M518773N165541M491337N420432N582588N837683
14300A32423161O515219O561711P372307P630702P868678Q614673R069427R428236
14292A95484114R988929J0777312J1165506J1395167J2461360J2812581J3550180
14285B77635149J3634763J4130953J4418140J4421707J4433664J4076975J4324714
14278C77076065J3471455J2695397J1600424J0070777Q156912N292535K202016
14271D40565581J35246l5012k302090m035798n979574p416578q901750j0520799
14263D01509226j2240603j3476533j4568305j5078003j4910291j5593934j4560720
$$ y = [68537238, 70784124, 73607091, 76385790, 79297113, 82646068, 86046251, 89987307, 93170472, 97288034, 101406807, 105925580, 111091121, 115582458, 121002890, 126585478, 132423161, 138938380, 145500091, 152872398, 160503100, 168371778, 176986451, 186055878, 195484114, 205473043, 216250355, 227415861, 238811028, 251272388, 264084969, 277635149, 291269912, 305400865, 319819005, 334240712, 348674376, 362751351, 377076065, 390547520, 403242917, 414843341, 424914118, 433071030, 438363565, 440565581, 440700827, 440665815, 438363725, 434327927, 428348353, 420931775, 412030025, 401509226, 389268623, 375792090, 361223785, 346145782, 331235491, 315641557, 301080837]
14256C01080837j4914828j3038841j3655939j3074179j2212481j2082472j1173068
14249B10929029j0457050j0415308r271722r082064q345960p326769p782964o941979
14241A41305213o617562o308205n591329n021893n316639m987750m659802m001292
14233I8800741m880953k973626m005454l201364l943957l010703k645544k869193
14225G1269947k779720k421000k579187k116680j925170k066984j879942j831344
14217E3669920j939692j842411j499328j620951j118531j450570j092566j324180
14209D1781691j619218r60841q20680j097239j199454r80831j009266j161753
14201C2932409o98437o53682p61423q27979j124801n90022o33115o47128o85886
$$ y = [301080837, 286166009, 273127168, 259471229, 246397050, 234184569, 222102097, 210929029, 200471979, 190056671, 180784949, 171702885, 163356925, 156030156, 148247192, 141305213, 134687651, 128379446, 122788117, 117766224, 112449585, 107461835, 102802033, 98800741, 93919788, 90946162, 86940708, 83739344, 79795387, 76784684, 74139140, 71269947, 68490227, 66069227, 63490040, 61373360, 59448190, 57381206, 55501264, 53669920, 51730228, 49887817, 48388489, 46767538, 45649007, 44198437, 43105871, 41781691, 40162473, 39201632, 38380952, 37283713, 36084259, 35103428, 34094162, 32932409, 32233972, 31580290, 30818867, 29990888, 28866087, 28276065, 27642950, 26995822, 26309936]
14192B6309936m27478n39671j169165l24919q87505l41172l42309o86967k66451
14183B1324299p04922m61863k90007k45616l91037o99382m68486r7298o37650
14174A7328038l70557J07732n56495l45520k12002l24783m53347j09134k19023
14165A4844909o31550k31810q3719p8096k54792n69953L6545l30590j10005k95054
14155A2295885k27451j70437k16367k53507l8065m59115L97574l14340m38729
14146A0575448R1259l48395m723k71877k40323l42314L91076k91110k34588n6943
14136I267510k27146n0936k22486Q7704p8087o10468p6780K0727l67512P8646
14126G821172l64459M42634k92242j72339k08789R7856r4102j02771k45336r8606
$$ y = [26309936, 25882458, 25342787, 24173622, 23848703, 22961198, 22620026, 22277717, 21590750, 21324299, 20619377, 20157514, 19867507, 19621891, 19230854, 18531472, 18062986, 17965688, 17328038, 16957481, 17065213, 16508718, 16163198, 15951196, 15626413, 15173066, 15063932, 14844909, 14213359, 13981549, 13897830, 13819734, 13564942, 12994989, 13031534, 12700944, 12590939, 12295885, 12068434, 11897997, 11681630, 11428123, 11390058, 10930943, 11328517, 11014177, 10575448, 10666707, 10318312, 10313589, 10041712, 9801389, 9459075, 9850151, 9559041, 9324453, 9267510, 9040364, 8989428, 8766942, 8854646, 8776559, 8166091, 8089311, 8110038, 7742526, 7821172, 7456713, 7899347, 7607105, 7434766, 7225977, 7323833, 7229731, 7126960, 6881624, 6783018]
14116F783018n1230j49137J17140J356L4063m32000Q0318l00356l80586L26434
14106F029020J85733l32542j32939p5655J29619k53685p9275l3936P858J78185
14096E622383o02342K20137K27123j70304o5140j24565j95641N9268l85273J49139
14086D734785J49002j32899k50824K4940J7276j80019j90659R4832m3344j20488
14076D102602J45485l06410K45821Q374J58396m71575L9139K95039m91413J55378
14066C880836k01779O9676k42553L6042K22844j05877j31237N90895l08403q0232
14056C730212l331k62505j60929N9305k0372K1217J74353j82914j86868K86149
14046C454317m06555K03253k39992J39233m159j95790r9202L61973m05774J73413
$$ y = [6783018, 6731788, 6582651, 6699791, 6701147, 6735210, 6303210, 6383528, 6083172, 5702586, 6029020, 6214753, 5882211, 5749272, 5673617, 5803236, 5549551, 5470276, 5436340, 5444198, 5622383, 5020041, 5240178, 5467301, 5296997, 5231857, 5107292, 4911651, 4970919, 4585646, 4734785, 4883787, 4750888, 4500064, 4525004, 4542280, 4362261, 4171602, 4266434, 4223090, 4102602, 4248087, 3941677, 4187498, 4195872, 4354268, 3882693, 3921832, 4216871, 3725458, 3880836, 3679057, 3748733, 3506180, 3542222, 3765066, 3659189, 3527952, 4118847, 3810444, 3730212, 3726881, 3464376, 3303447, 3362752, 3342380, 3363597, 3537950, 3355036, 3168168, 3454317, 3047762, 3251015, 3011023, 3150256, 3146097, 2950307, 2851105, 3213078, 2807304, 2980717]
14036B980717q2403k1094M0162K9992k39729J98921P4527N8709l16250j30015
14026B593537j2906K56034j46014k01827j19921m2410M41932n28969N18125l92018
14016B365563n9976J40271P7719j53822j52310l48961K67874J39954j17901O2802
14006B221213j16451J8847K8294j64514j6854R1566j238L73591k28287j86990
13996B019177j80734K19441J88466k4385M21490J71044O28083Q96817L716517
13987H055916P630047J5110265M363080j4661745q688568m252683j414736j467314
13979D674262q15294q6074q20306J24923l39078k99455L62032k53968k03191j6130
13969B327721R9898l6002j08253L0422m82261M78570j73243O7765k10789n2381
$$ y = [2980717, 2898314, 2877220, 2917382, 2947374, 2707645, 2906566, 2981093, 3039802, 2723552, 2593537, 2580631, 2836665, 2690651, 2488824, 2368903, 2326493, 2768425, 2239456, 2757581, 2365563, 2305587, 2445858, 2523577, 2369755, 2217445, 1868484, 2136358, 2276312, 2158411, 2221213, 2104762, 2123609, 2151903, 1987389, 1970535, 2062101, 2060863, 2434454, 2206167, 2019177, 1838443, 2057884, 2246350, 2221965, 2643455, 2814499, 3442582, 4339399, 8055916, 15685963, 30796228, 35159308, 20497563, 11808995, 7556312, 6141576, 4674262, 3858968, 3772894, 2952588, 3077511, 2738433, 2438978, 2801010, 2547042, 2343851, 2327721, 2427619, 2391617, 2283364, 2313786, 1831525, 2310095, 2136852, 2204617, 1993828, 1941447]
13959A941447M44138m32494K00962m33606L67859p0194m23184K99629j61845J10976
13949A843688j25005J67347k11292J64344k22973K73562j86045k29770J26520
13940A600376M2478J15530l68013L16697j01158J76507o56892K13040L73093j61568
13930A550090l0842P4611j88781K70302j68657k54554K77558j74489J37166k05818
13920A286586J79559k04219K03616j00046j38718K59792r7950k6957m32682K94184
13910A223165J81969j25687o4995q5788J65553q0978j1850N8640k54653M10910
13900A416286k2247k80889J30980l02570K2826O80522k11136k67391o3046j5922
13890A087413K39197j48973L58743m47647k0068J93798J5058j95870q7031K45288
$$ y = [1941447, 2385585, 1953091, 2154053, 1720447, 2088306, 2018112, 1594928, 1894557, 1732712, 1843688, 1718683, 1886030, 1674738, 1839082, 1616109, 1889671, 1703626, 1473856, 1600376, 1642854, 1758384, 1390371, 1707068, 1605910, 1782417, 1125525, 1338565, 1711658, 1550090, 1519248, 1593859, 1405078, 1675380, 1506723, 1252169, 1529727, 1355238, 1492404, 1286586, 1466145, 1261926, 1465542, 1365496, 1226778, 1486570, 1388620, 1361663, 928981, 1223165, 1405134, 1279447, 1214452, 1128664, 1294217, 1213239, 1201389, 1260029, 1005376, 1416286, 1394039, 1113150, 1244130, 941560, 964386, 1644908, 1433772, 1166381, 1103335, 1087413, 1326610, 1177637, 1536380, 1088733, 1068665, 1262463, 1277521, 1081651, 994620, 1239908]
13880A239908J83210l54321J11849P9509k92705J07762K43543j88987l24268L61447
13870A166947K22679m05392J81525k99639L91536o3559j14175l9740l938j81580
13860H54664j5602J75652j29429j6574N34704k50605J67594m33254L838M4844
13850I35832J4934m5196k91713L7578J79226R6781M10066l69772Q9677j63165
13840H94248j88344o7361k98183L13966L04020m0286Q7921r6983j33592O9618
13830H45024K96679k24774j35519K81288l35866j24121Q8818j2361K36865m23754
13820D92279L03354K11114L189j04020k63739j88994N07572m07671r2787K31417
13810F91714J63134J37822o4024m9580n7810L1620k67793l1526J52105K94782
$$ y = [1239908, 1423118, 1068797, 1180646, 1260155, 967450, 1075212, 1318755, 1129768, 805500, 1166947, 1389626, 984234, 1165759, 866120, 1257656, 1194097, 1079922, 1040182, 1036244, 854664, 839062, 1014714, 885285, 868711, 1403415, 1152810, 1320404, 887150, 890988, 935832, 950766, 905570, 613857, 651435, 830661, 927442, 1337508, 967736, 1057413, 894248, 705904, 638543, 340360, 654326, 958346, 918060, 1005981, 908998, 775406, 845024, 1141703, 916929, 781410, 1062698, 726832, 602711, 691529, 679168, 916033, 492279, 795633, 1006747, 1009936, 905916, 642177, 453183, 960755, 553084, 460297, 691714, 854848, 992670, 928646, 879066, 821256, 852876, 585083, 553557, 705662, 1000444]
13800A000444l40089l10799L80373q8267k12216J93465K33193k22096j95337L92392
13790H31063k61081q0319L26285l3958o7882j9709j3122L7537N8074J55003k16748
13779G15143O5039o7299m4759P1177J15617k01905K2734K25221l72660k0013j10015
13768C98280L94366J36977k76157B94176k3109K30304o5140K93684K83861m88342
13758E25434l7831J95911J36080k55298L86833j70073C75335J32334J14987j78475
13748D44181P596K12647k2882l16778M37273k60652j6464K33524j55414L24270
13738H87301j96404j07836p9788k43101K20137A75600M65226j6415j09587K1362
13728E36186F1526L89246P2384K17140m4740k43447J88479B62568O69215C46287
$$ y = [1000444, 660355, 349556, 729929, 641662, 429446, 622911, 856104, 634008, 438671, 831063, 569982, 489663, 815948, 781990, 714108, 694399, 681277, 718814, 776888, 931891, 715143, 780182, 712883, 668124, 739301, 854918, 653013, 675747, 900968, 528308, 508295, 398280, 792646, 929623, 653466, 294176, 271067, 501371, 436231, 729915, 1013776, 525434, 487603, 683514, 819594, 564296, 951129, 781056, 375335, 507669, 622656, 444181, 451777, 664424, 641542, 324764, 762037, 501385, 484921, 718445, 563031, 887301, 690897, 583061, 503273, 260172, 480309, 175600, 640826, 624411, 514824, 536186, 61526, 450772, 523156, 740296, 695556, 452109, 640588, 262568, 931783, 346287]
13717F94144q1979M3129A80133J73733A39595M20442J42094k34757K08110B54478
13706C83985J53852o3043j88985M90126k21938J09920j13123B41038J3645K27325
13696D82008k0465k05689K22958M1340B31314K80580m9646k3087J97690B34861
13685A49136L58350L2126J08931k47268n1226J83474R5092k71500p6442K03628
13675D84301B41162L01975R448L52938C85389r9278J02752A92450K87524k2137
13665D57837j78455J84738k11812L17660j79070P5190j24585E1045M72665P7188
13655F00898j59665n8667J6870N2716m0269J79614J6487B79191J16544J56791
13645E52526L484k75366L79286A31464o1043K27393J68720K28710B22907K50743
$$ y = [694144, 612165, 655294, 180133, 353866, 139595, 560037, 702131, 467374, 675484, 254478, 383985, 537837, 474794, 285809, 775935, 553997, 663917, 550794, 241038, 254683, 482008, 461543, 255854, 478812, 520152, 231314, 511894, 462248, 439161, 636851, 234861, 149136, 507486, 539612, 648543, 401275, 350049, 533523, 628615, 357115, 280673, 484301, 241162, 543137, 552585, 905523, 385389, 286111, 388863, 192450, 479974, 457837, 279382, 464120, 252308, 569968, 390898, 466088, 341503, 51045, 523710, 600898, 441233, 382566, 399436, 452152, 411883, 591497, 607984, 279191, 395735, 552526, 556010, 280644, 659930, 131464, 70421, 297814, 466534, 695244, 222907, 473650]
13635D73650J21643k93828K01881k02833K77336B25014M47712B32388J09063L5308
13625C76759j58491o5212j9169L8396M03545B52683J33K12446K0815o3088Q5544
13614E08533n738j55898J81332n1997k10984O990A20873L74325B40959p7202P8836
13603B42593M19390k36278J251K22145B70451L3330M42b5375B85034k4002J25637
13592C86669j68925J39059A57744E8986L04371L817M6181J49061A65293L98153
13582E63446j41989m8630P3j44622m4137L35392j52458j64436K08515k02131n4375
13571A54648J74280d4969C81189J69234k36061L64371k80836A43803L2116R6925
13561B72844J56645q323j78279J17608A61804K16981f3828A46650g5745I8421
$$ y = [473650, 595293, 301465, 503346, 300513, 577849, 225014, 672726, 232388, 341451, 376759, 218268, 153056, 133887, 172283, 575828, 252683, 252816, 465262, 486077, 422989, 508533, 502795, 346897, 528229, 476232, 265248, 272238, 120873, 495198, 240959, 163757, 242593, 661983, 425705, 426956, 649101, 270451, 303781, 304223, -25375, 285034, 261032, 386669, 217744, 356803, 157744, 58986, 363357, 367174, 413355, 562416, 165293, 563446, 421457, 372827, 372900, 228278, 184141, 519533, 367075, 202639, 411154, 209023, 154648, 328928, -44969, 381189, 550423, 314362, 678733, 397897, 143803, 175919, 272844, 429489, 421166, 242887, 360495, 161804, 378785, -63828, 146650, -75745, 98421]
13550D00578j04101K57961A96856L53621j69293r4408J57219L24670d1787A14460
13539F76745k97681n2563j02216b1567C97623J17503q5846m8449J61062B64614
13528D79543I3201K03896K34926A36449K28247A72893M21617k29702A15673J80707
13518B96380n2353I5509d9408B69605q6886b90428C84571l8773J51146H4337J10939
13507A95276q4065K73656R7113a935F2069J02741J3699J90405j7805J5932j8221
13496C48820j41182K28590A03424B3552a13769I2880J05781L1745J17458N2991
13486D00855j87843a7995B23210o2422a5337E0667J49756b9871C92809j54519
13476B38290K42074j40273C8027M52475k33175K31051P2187A49500K08671p105
$$ y = [400578, 296477, 554438, 196856, 550477, 381184, 286776, 443995, 768665, -41787, 114460, 676745, 379064, 326501, 224285, -21567, 397623, 515126, 429280, 380831, 541893, 264614, 479543, 93201, 297097, 532023, 136449, 364696, 172893, 594510, 364808, 115673, 296380, 244027, 95509, -49408, 269605, 182719, -290428, 384571, 345798, 496944, 84337, 195276, 111211, 384867, 481980, -1935, 62069, 164810, 178509, 368914, 351109, 367041, 348820, 207638, 436228, 103424, 23552, -113769, 92880, 198661, 230406, 347864, 400855, 213012, -17995, 223210, 160788, -15337, 50667, 200423, -29871, 392809, 238290, 480364, 340091, 38027, 490502, 257327, 488378, 560565, 149500, 358171, 351066]
13466C51066E3710O48430B45700j0133H5121K16821M0180I8749J59650k2290J11225
13455C47334a1516r2210B37430G4412P3887J13327a44800m0041a7502B52102J04622
13444C56724b808k3661A83630h1519a1245D03243a6725B27912Q1666G8756m147
13433G4609J62615L1036a28765E5805K86615A2647L58180J1746a77164B77102
13422C95389l7555A11269H821J45058G5288K7583K68500f1970A94380r5009L26462
13411D25833F7198M15356r9118j49284q0727J90143H51K34419M10717A92076C7189
13399D489J39238K80165j52846q7438L67829k18709j20016N4701G0923J09579
13389A80502N2766R9553j57269a8882j15367A38255j2354K69847j94753L87455
$$ y = [351066, 53710, 702140, 245700, 235567, 85121, 301942, 342122, 98749, 258399, 236109, 347334, -11516, -103726, 237430, 74412, 148299, 261626, -144800, -184841, -17502, 252102, 356724, -2808, -26469, 183630, -81519, -11245, 403243, -16725, 227912, 309578, 78756, 74609, 237224, 268260, -128765, 55805, 342420, 12647, 370827, 382573, -177164, 277102, 395389, 357834, 111269, 8821, 153879, 75288, 102871, 371371, -61970, 194380, 99371, 425833, 67198, 482554, 383436, 234152, 153425, 343568, 851, 235270, 645987, 192076, 37189, 4489, 143727, 423892, 271046, 183608, 551437, 332728, 212712, 267413, 70923, 180502, 233268, 332821, 175552, -18882, -134249, 138255, 125901, 395748, 200995, 588450]
13379E88450q3548g2418B00999Q8690q2502M1508P7677A48008J05555j20677A017
13367E18911A77523o7268l5240J00185J30728c8389E21K89180f3074D31090A47035
13355B76506h29A02435A7341J97251k4147J12043P7017j73264J07892J08137L47894
13344G70164A29367L94711B4572M71975A14696E6033J2717K36473B8954K65563
13334B94517I3225j9597h2154B13870J33771A49175c12061B87171J6810a45946
13323A01926J2975L50022n4623A87159K76054B05426J21353A47866K41962n5640
13313C34188j8617j40894J46413M545j10198J66075E8452J0275c3341k3753A76291
13301A61443L7340p8123J10749a29886A27513A9459O4474K05171h0190C08651
$$ y = [588450, 504902, -72418, 200999, 289689, 207187, 248695, 326372, 148008, 253563, 132886, 1017, 518911, 177523, 110255, 75015, 175200, 305928, -38389, 521, 289701, -63074, 431090, 147035, 276506, -829, 102435, 17341, 214592, 190445, 302488, 379505, 206241, 314133, 422270, 770164, 129367, 524078, 24572, 496547, 114696, 56033, 68750, 305223, 28954, 294517, 93225, 73628, -82154, 213870, 347641, 149175, -312061, 287171, 303981, -145946, 101926, 114901, 464923, 410300, 187159, 463213, 205426, 326779, 147866, 389828, 334188, 315571, 174677, 321090, 325635, 215437, 381512, 58452, 68727, -33341, -57094, 176291, 161443, 198783, 120660, 231409, -129886, 127513, 19459, 83933, 289104, -80190, 308651]
13290B03290k6056n4633a85650A67294M6233N1090n3216H0443p497a79791A30984
13278A56346k5814m4932J04038I0263K19758H8724M3994o4162J28777K37251B13670
13266D25899A14232a44150d8793A59713a01344B43299i321B892b0602q4843C20402
13254a10518b6528K848m11291B30302M7973l9675b16404D1710K59276m3514J19712
13243C77184C3320b78529A38200c12757D51388G5333k6868J86623J02126j29225
13233B07989o3426a03820A88686b7609P079A89055M0550e6023j54165A65840k3037
13222A42803M0003r489M124a27314C6850A4812d0718q6139E20680A1517a99778
13210A76998c0041I3380K87868E846b3475A94209A2883O6237g9842A07966Q4790
$$ y = [203290, 177234, 122601, -185650, 167294, 213527, 264617, 211401, 80443, 72946, -179791, 130984, 156346, 130532, 85600, 189638, 90263, 310021, 88724, 132718, 68556, 197333, 434584, 213670, 425899, 114232, -144150, -48793, 159713, -101344, 243299, -9321, 2892, -20602, -105445, 320402, -110518, -26528, -23680, -434971, 230302, 278275, 238600, -216404, 41710, 300986, 257472, 377184, 33320, -278529, 138200, -312757, 451388, 75333, 48465, 235088, 337214, 207989, 144563, -103820, 188686, -27609, -20530, 189055, 229605, -56023, -210188, 165840, 142803, 182806, 173317, 177441, -127314, 36850, 14812, -40718, -126857, 520680, 11517, -199778, 176998, -30041, 93380, 381248, 5846, -23475, 194209, 12883, 79120, -79842, 107966, 192756]
13199A92756F1954R5203d7285I0787L99667j63615e0047G4514J47620f4386k5507
13188h9893b6755B57191j25058n4996a13060B23961I5831a32050H3006J07317
13178A90323j1845N0777F4100j5463c4490k5590C39342B13K59265d38449D07094
13166a197A24310J05402I1198K16987g517G2922j2733J19980h1747C10316a07493
13154D29929e608A89930k10A8546M0634Q5146M066a7958B35967d2852k61188a19575
13141a40560C54702j1352B3915a10256d720n3226I9968Q1631a0389E6423N6349
13130A12772b8833j39097A79724L5699H8181J69629r5223n8354a82409B14369
13119A819J35665J06456L7033N7897j18789d7263L140p3445A91384I0342P9365
$$ y = [192756, 61954, 157157, -47285, 90787, 490454, 326839, -50047, 74514, 222134, -64386, -89893, -26755, 257191, 132133, 77137, -113060, 223961, 95831, -132050, 83006, 190323, 178478, 229255, 64100, 48637, -34490, -60080, 339342, 213, 259478, -438449, 407094, -1197, 124310, 229712, 91198, 308185, -7517, 72922, 60189, 180169, -81747, 310316, -107493, 429929, -5608, 189930, 189720, 18546, 59180, 144326, 148392, -17958, 235967, -42852, -304040, -119575, -140560, 354702, 343350, 23915, -110256, -4720, -57946, 99968, 181599, -10389, 56423, 112772, -28833, -167930, 179724, 215423, 88181, 257810, 162587, 104233, -182409, 214369, 1819, 137484, 243940, 280973, 338870, 220081, -47263, -44123, -117568, 191384, 90342, 169707]
13108A69707P8663j05260b41425A31755L2758m1541n9688N8210a0934o2494C44623
13096I9986c20110C56771A29082J89223C6616J52495a20375C9279a9485m1454
13086f0939C6432a12957i104A24407C7785M5653K47004a87192j5363G6045J23318
13075A99363k0667J12034a15244H5750b9159C44165c839B00846d8293r3628E3640
13063h0575r0046B0113J61711f7079k46868d8972A80868g823D1622a78443g6955
13051A1411N2371b01968a6682A27956F2306L18515a22822D0801R989J53826c67684
13039G6079c2037G7888J18128c9072B08779r8087c25073I3054b5576n501A34125
13027B37693b53038A9605K92739a6328A21372O2347a72140m0653L867A0470J18588
$$ y = [169707, 248370, 143110, -241425, 131755, 164513, 122972, 63284, 121494, -10934, -73428, 344623, 99986, -320110, 356771, 129082, 318305, 36616, 189111, -120375, 39279, -19485, -60939, 36432, -112957, -9104, 124407, 37785, 83438, 330442, -187192, -202555, 76045, 199363, 178696, 290730, -115244, 85750, -29159, 344165, -3839, 200846, -48293, -141921, 53640, -80575, -170621, 20113, 181824, -67079, -313947, -48972, 180868, -7823, 41622, -178443, -76955, 11411, 63782, -201968, -16682, 127956, 62306, 380821, -122822, 40801, 50790, 204616, -367684, 76079, -32037, 77888, 196016, -39072, 208779, 110692, -325073, 93054, -25576, -31077, 134125, 237693, -253038, 19605, 312344, -16328, 121372, 183719, -172140, -212793, -208926, 10470, 129058]
13016A29058J78032c43375G4799J5416a09363A8230h0228j8634F8342K11073F0425
13004a73683D8952K06908a1165A16632f2929A75307a55691e4043B6912J29964
12994A56876A597J14664a73029A71730q445a49429A40687D4822b86135G0599Q1234
12983A51833f36119a0103o8751B17198d3994c393A29104c56708A70048D9874c7943
12971A5704K4234J33813e971k6485j11041c8759J5329H250J06680Q4090O3112
12960B62132a67397I3434P021h8347C30521j53722c9514B1887J27068D2468K5528
12949F7996c19306I4502g1810j20052i744k7782D0474J45757a55916I4930a33759
12937A19172m3938k4569L1826k2492a05307p3279a4225A25782a97417Q7501F9106
$$ y = [129058, 307090, -343375, 74799, 90215, -109363, 18230, -80228, -98862, 68342, 279415, 60425, -173683, 48952, 255860, -11165, 116632, -62929, 175307, -155691, -54043, 26912, 156876, 1597, 116261, -173029, 171730, 163285, -149429, 140687, 44822, -286135, 70599, 151833, -636119, -10103, -78854, 217198, -43994, -3393, 129104, -356708, 170048, 49874, -37943, 15704, 39938, 173751, -5971, -32456, -143497, -38759, -23430, 8250, 114930, 199020, 262132, -167397, 93434, 100455, -88347, 330521, 176799, -39514, 21887, 148955, 42468, 67996, -319306, 94502, -71810, -191862, -9744, -37526, 40474, 186231, -155916, 94930, -133759, 119172, 75234, 50665, 82491, 59999, -105307, -178586, -14225, 125782, -197417, -109916, 69106]
12925G3580J00122R0345f297A09010D53K96605A9905L5443b41182J5279B0710
12913b11736c8134H2208M2109i9770E11331a40326B29641c09843d6790A05531
12902B32265h6168A42333F1647b5045A05779a10231A02535A2905M31198b5170
12891a34325A30434J46456a17866C2375g2505b7110n07276B6245q536P0896M7195
12880A35800E8614a37655A8964h9131C5383i1871j96711A14118j0238K60121d6110
12868B22270A00325a07869L8808a5962B31477H3220C1133a2924A48155a84134
12857C34810a47358A80794i5316A29678C979J29317a59841N9769A75721D6502
12846A24770f1970L973E1385c16425D3449a8054G4752e0298j07673O5953L703
$$ y = [73580, 173702, 264047, -6297, 109010, 453, 297058, 19905, 55348, -241182, -225903, 20710, -211736, -38134, 82208, 124317, -99770, 511331, -140326, 229641, -309843, -46790, 105531, 232265, -86168, 142333, 61647, -25045, 105779, -110231, 102535, 12905, 444103, -25170, -134325, 130434, 276890, -117866, 32375, -72505, -27110, -534386, 26245, 17709, 88605, 135800, 58614, -137655, 18964, -89131, 35383, -91871, -288582, 114118, 103880, 364001, -46110, 222270, 100325, -107869, -69061, -15962, 231477, 83220, 31133, -12924, 148155, -184134, 334810, -147358, 180794, -95316, 129678, 3979, 133296, -159841, -100072, 175721, 46502, 124770, -61970, -57997, 51385, -316425, 43449, -18054, 74752, -50298, -157971, -92018, -88315]
12835h8315L379l49619A2341J76423N8739D3820L8154l9129b02415E8509a93465
12823B81637f2381D2743a29070K6327A3645a26139G4215j4561i8154l5453f5433
12811A95757g4586E1124J62397g1132L4551j10970A04559P9609a83911j13628
12801b97539A41923B2163a01542C86480e3823q2067E546K140N4507J34769H4416
12789B17652d26606G9502b81848J10708K2197j00861B37447H3216a71387B06044
12778i6825F6277A9262g4176D249K67647A2217e2541B091b95184D06367i0751
12766b66763A28111J5089o1093c31406g1636A53036J01683e8498E6072f0474B40477
12754d3324j49037E9412a20982A27421o1124L8341e763B01201a18537B48957h4747
$$ y = [-88315, -84936, -434555, 12341, 188764, 247503, 43820, 81974, 42845, -202415, 58509, -193465, 281637, -62381, 42743, -129070, -102743, 13645, -126139, 74215, 59654, -98154, -133607, -65433, 195757, -74586, 51124, 213521, -71132, -36581, -147551, 104559, 184168, -183911, -297539, 141923, 22163, -101542, 386480, -53823, -135890, 5546, 7686, 62193, 196962, 84416, 217652, -426606, 79502, -281848, -171140, -148943, -249804, 237447, 83216, -171387, 206044, -96825, 66277, 19262, -74176, 4249, 271896, 12217, -52541, 2091, -295184, 406367, -90751, -266763, 128111, 143200, 82107, -331406, -71636, 153036, 254719, -58498, 56072, -60474, 240477, -43324, -192361, 59412, -120982, 127421, 66297, 104638, -5763, 201201, -118537, 248957, -84747]
12742a11327p4513R0063A46916o5724b82542C21566L5147b52720a0312k140l59605
12731c72057h6390B0892M02746F078c7515J2256A26655C4936K35949h9375C002
12719H0604j9295a07290n4784A91112B0592J20914b76227P0563G8611L065J39011
12708B20687d8461j81831e2805B65579A2282R6798c12181C8328K07532a50898
12697B11596c6331A04402B0444L7347h570m594A83433D2055b03465A55264d3431
12685B1598L66479l2149g8775B96372b92037A17477m8476J98399a75421A66473
12674D4521J01695h4143A23109k1043D148J92089G7341i1972m8645A04094P5090
12663A79184F2829L95826b2013H4751J81645f4544I7080J2777N7975c69477c7573
$$ y = [-111327, -185840, -95777, 146916, 81192, -282542, 321566, 356713, -252720, -10312, -12452, -372057, -86390, 20892, 423638, 6078, -37515, -25259, 126655, 34936, 270885, -89375, 3002, 80604, 61309, -107290, -162074, 191112, 20592, 141506, -276227, -205664, 78611, 81676, 220687, -48461, -230292, -52805, 265579, 12282, 109080, -312181, 38328, 245860, -150898, 211596, -36331, 104402, 20444, 57791, -8570, -13164, 183433, 42055, -203465, 155264, -43431, 21598, 388077, 355928, -78775, 296372, -292037, 117477, 69001, 267400, -175421, 166473, 44521, 146216, -84143, 123109, 102066, 4148, 196237, 77341, -91972, -140617, 104094, 179184, 62829, 458655, -22013, 84751, 266396, -64544, 97080, 109857, 167832, -369477, -37573]
12651b01082A13005j2786K86604b887l11807h916A72585E0330K58494A06084a55425
12639a54721A50603d40465A22646a15842C23406j51295o0423J3786e3180D3553
12628B35578O3013c3294I3564L66352A16886K07111A6938J96966i8183B19104
12617c02677C5532N5210O8274d5661j38386A44734L7897C4799h3925j28684C01358
12605E6800J08475K1271q4231b16819B41339a32038l8274H3049J09585K18580
12595D11214e4225o1766d9367m5103j28504D5003R3744c2453A48186b93987F5054
12583F4057K4338A2072a68032L914H5932P2455L3910G7198c78511C85719D3015
12571A28751J8668N9952b04015A1674e8609A49790a00090d2695m4262F1256a526
$$ y = [-201082, 113005, 100219, 386823, -2887, -314694, -8916, 172585, 50330, 308824, 106084, -155425, -154721, 150603, -440465, 122646, -115842, 323406, 172111, 111688, 125474, -53180, 43553, 235578, 298591, -33294, 93564, 459916, 116886, 323997, 16938, 213904, -98183, 219104, -302677, 35532, 90742, 159016, -45661, -184047, 144734, 182631, 34799, -83925, -212609, 301358, 56800, 165275, 186546, 102315, -216819, 241339, -132038, -170312, 83049, 192634, 411214, -54225, -115991, -49367, -94470, -222974, 45003, 138747, -32453, 148186, -293987, 65054, 64057, 88395, 12072, -168032, -164118, 85932, 158387, 192297, 77198, -378511, 385719, 43015, 128751, 147419, 207371, -204015, 11674, -58609, 149790, -100090, -42695, -86957, 61256, -1526]
12559B5869K45712a83776F5746C2208a9945o4760E4255e4145D8019d6725A34721
12547A34005J75673j01875M1970D7407M2774Q2322m4603J48193q0202l2764c10484
12535c38222C0781a98276A15806Q486i8903A77708o804R4811a41199e0281A99890
12523a52404C05882b27306B41122A10379j8668L45060b39805G19602k37857d3211
12512A74989l13D7179m264L3468d6454C9681a3147B01861H6671i044B3981J2813
12500C6794a30514p1128D1798R3141h8676j4013K1019A35691o2987K67654a77289
12488B3949a24630a2090B5418a5560B62983l9910r4695D5958O4041K4266a51625
12476a91507B0205a5806b461k69342g4067E102a83123f0847A03015a16550m9041
$$ y = [25869, 271581, -183776, 65746, 32208, -19945, -84705, 54255, -54145, 48019, -46725, 134721, 134005, 309678, 207803, 249773, 47407, 90181, 172503, 127900, 276093, 195891, 163127, -310484, -338222, 30781, -198276, 115806, 124292, -98903, 177708, 170904, 265715, -141199, -50281, 199890, -152404, 305882, -227306, 241122, 110379, 91711, 436771, -239805, 719602, 481745, -43211, 174989, 174676, 47179, 42915, 76383, -46454, 39681, -13147, 201861, 86671, -9044, 23981, 36794, -130514, -201642, 41798, 134939, -88676, -102689, -81670, 135691, 72704, 340358, -177289, 23949, -124630, -12090, 25418, -15560, 262983, 223073, 128378, 45958, 109999, 134265, -151625, -191507, 20205, -15806, -2461, -271803, -74067, 5102, -183123, -60847, 103015, -116550, -165591]
12465a65591r2481a28713B25520j6307E5592b48535k9634a25643p5535C4818R1394
12454A26212b9703C1405e7819A86178a03155r0293c7701a10j19006e6637K1483
12443c5154a1678j4295m3395j15580B14731b81997F3833a05773b6907N387n850
12432b7370C06121a2875j51603i317l9110A0511l935J16749a27650j5797p6102
12421b19549n2694A32115L4592k0218a49641p1070C92635a77825A00910a28452
12410A16415a18059L0844p5813A89002g0548p4812c5343p4639a3365j52523H5945
12398E1920e2102o4176B35570E9056J93953n1336A3153b95458a4728N79k39932
12387b54081A73735J32737H1462L00342N2317B0092R6182m8863d7838q5558j83808
$$ y = [-165591, -258072, -128713, 225520, 209213, 55592, -248535, -278169, -125643, -201178, 34818, 126212, -29703, 31405, -57819, 186178, -103155, -193448, -37701, -110, -119116, -56637, -35154, -11678, -25973, -69368, -184948, 214731, -281997, 63833, -105773, -26907, -21520, -27370, 306121, -12875, -164478, -9317, -48427, 10511, 6576, 123325, -127650, -143447, -219549, -272243, 132115, 166707, 146489, -149641, -220711, 392635, -177825, 100910, -128452, 116415, -118059, -87215, -163028, 189002, -70548, -145360, -35343, -109982, -13365, -165888, 85945, 51920, -52102, -116278, 235570, 59056, 253009, 201673, 13153, -295458, -14728, -14149, -254081, 173735, 306472, 81462, 381804, 434121, 20092, 116274, 67411, -47838, -133396, -317204]
12376c17204G9232g4705p2213j7247A58170A6822J21761K8969k1015c87k97269
12365b97656H6356l0017a378r5804C8797g2557l7139P179B66522a18978o4519
12354a83497e4843A53278J52436b0459I8669a30611A58906f6228j31089A96485
12343c8878D8613J840b23358B57442H4994C8022a14314O478G9658N9660m7122
12332I2196R056a9385j73340E5396f6837a9904A30814j4367K482J8236M00486
12321E37651k52100G9985a8017A75113N834F5859J618J37835F3235a51138O7236
12310h3902j2709q576B6579M0235b43406I4884b3395f667B40744a01390A19371
12298A13817c63971A50452R0499A2873K1488a49222j6475b3856B8590b8181H9439
$$ y = [-317204, 79232, -74705, -146918, -164165, 158170, 16822, 138583, 167552, 146537, -387, -297656, 86356, 56339, -1378, -97182, 38797, -72557, -109696, -102517, 266522, -118978, -183497, -54843, 153278, 305714, -20459, 98669, -130611, 158906, -66228, -197317, 196485, -38878, 48613, 50453, -223358, 257442, 84994, 38022, -114314, -107836, 79658, 139318, 92196, 101252, -19385, -192725, 55396, -66837, -19904, 130814, 116447, 118929, 137165, 537651, 285551, 79985, -18017, 175113, 180947, 65859, 67477, 205312, 63235, -151138, -83902, -96611, -105187, 26579, 66814, -243406, 94884, -23395, -6667, 240744, -101390, 119371, 113817, -363971, 150452, 240951, 12873, 34361, -149222, -165697, -23856, 28590, -28181, 89439]
12286A12876E74K82318F7296J39478l448N2241b4213q0200A39170b58179I1970
12274b26236B12146M6617I8529a94803E344L6342g88k28517B1872J10155P5291
12263B07318a91153B0373h7252j82232h1456k23139P5007I0707h952A4051J12279
12252A26330k612j3910J96383j34737a70486B91140N034a6953A4614a52636A70783
12240A63300c1196G9635a59986H4707J30578r252A101J64191j3353l2707C918
12228d27890C41986j01272K53489j59423B3011L31751j74124L7688L17040A89369
12217D61807k06704A18041m112E4743M51524A53290d5281B66758a85251B02977
12206C4218J39428q0833h5044D15793j57096J49447j45878D1204J96300E5686
$$ y = [112876, 574, 282892, 67296, 206774, 203326, 255567, -24213, -104413, 139170, -258179, 91970, -226236, 212146, 258763, 98529, -194803, 5344, 41686, -788, -229305, 21872, 132027, 207318, -191153, 20373, -87252, -269484, -81456, -304595, -229588, 90707, -8952, 14051, 126330, 123718, 109808, 306191, 171454, -170486, 291140, 296174, -16953, 14614, -152636, 170783, 163300, -31196, 79635, -159986, 84707, 215285, 206033, 1101, 165292, 151939, 119232, 3918, -427890, 341986, 240714, 494203, 334780, 23011, 354762, 180638, 218326, 535366, 189369, 461807, 255103, 118041, 113929, 54743, 506267, 153290, -45281, 266758, -185251, 202977, 34218, 173646, 92813, -85044, 415793, 258697, 408144, 262266, 41204, 237504, 55686]
12195B94037J84381j44530j01034f0463E78010A88955K62194B00301q492L09260
12185E01069j66427A60682o9k6368A4191K19517C2855L91138j21493a27657A73488
12173A13279J81744F3281c3544B52590M6087K50494A65504m5633k2884C5805g4845
12161G5148K24116f1363B63715q8951m6796e3624a9667A84244a70841H64a34845
12149A40144J647i231l4174j51162j98639B29387l7905g9758A24565a64507C13903
12137a30292B24142a62636b7639B29204j00433a18461A85776A9138a26287k07020
12127c33307a17149A41785J2397c9065B23332E410e2820A92720F0296c42781A84783
12115G298B518i8827F0046b81721B38028b3938n7923A09736b8637C1308K28660
$$ y = [294037, 478418, 333888, 232854, -60463, 578010, 188955, 451149, 200301, 191809, 501069, 334642, 160682, 160613, 134245, 14191, 233708, 32855, 423993, 302500, -127657, 173488, 113279, 295023, 63281, -33544, 252590, 298677, 549171, 165504, 119871, 96987, 35805, -74845, 75148, 299264, -61363, 263715, 174764, 127968, -53624, -19667, 184244, -170841, 864, -134845, 140144, 141791, -9231, -43405, -194567, -393206, 229387, 191482, -79758, 124565, -164507, 313903, -130292, 224142, -162636, -27639, 229204, 128771, -118461, 185776, 19138, -126287, -333307, -117149, 141785, 154182, -39065, 223332, 5410, -52820, 192720, 60296, -342781, 184783, 7298, 2518, -98827, 60046, -281721, 238028, -23938, -81861, 109736, -28637, 31308, 259968]
12104B59968a73718F9377Q6542B7055e1396j44621H2444G287Q501a51965j73339
12093c25304K7789J35780P6219C8799R9523F8005d1749A65712j7403g7673A84221
12081A37732N4996B0662J9719b05127D23000j72519m0480b02704A33509F5717
12070a46624j0401j03998H554K60755C6368P6567R4883G2122Q922a48663O8954
12059g9709b5881j50063B16330c6687B36775a05744B5675R1657a0803B1833a00819
12047a07251b3527D3337k1625b77081J24325g6321j94520j02825e2632j8961A7326
12035A36967C269K91332a2864j27793o6810A4445K5302L9612c6524k9380j76201
12024b42105k84303b40045b5072r3076A03888d09962e0302C1483a24144H4758
$$ y = [259968, -173718, 69377, 155919, 27055, -51396, -196017, 82444, 7287, 15788, -151965, -325304, -297515, -161735, -85516, 38799, 138322, 68005, -41749, 165712, 148309, -77673, 184221, 137732, 192728, 20662, 40381, -205127, 423000, 250481, 210001, -202704, 133509, 65717, -146624, -157025, -261023, 8554, 269309, 36368, 112935, 207818, 72122, 81044, -148663, -79709, -25881, -175944, 216330, -36687, 236775, -105744, 25675, 117332, -10803, 21833, -100819, -107251, -23527, 43337, 21712, -277081, -152756, -76321, -270841, -373666, -52632, -71593, 17326, 136967, 3269, 294601, -12864, -140657, -207467, 14445, 39747, 79359, -36524, -65904, -242105, -526408, -240045, -25072, -118148, 103888, -409962, -50302, 31483, -124144, 84758]
12013d8157n3037A16527b26548p863B90697c46472A75972j5483l1829k4811k412
12002A01437g9867b3704B46832a18612r7250j57634m2376c759l7443o671C63964
11990h788B12318b46824c2955j27319n1796A28609K20947A70321F1791a50055
11979A44293E7009J35850c19243f5328j41749c2098j17737j9013j13995I4036
11968d5657A45813g9445A6798a23846o331C10806a4657j13715M6806B19331c325
11956A9515a3180A44961J4982M1183l6268G7075a55872k8642a827B52575a6767
11944E7516R152k9755a65272O8993A48740c03277a34127K7753E6104b99568A23487
11932B13623A01692J1414b06582B7718c50310G1637L6707J50600e3741F486J49768
$$ y = [-48157, -101194, 116527, -226548, -234411, 290697, -346472, 175972, 160489, 128660, 103849, 101437, -79867, -23704, 246832, -118612, -215862, -373496, -415872, -3759, -41202, -47873, 363964, -8788, 212318, -246824, -32955, -160274, -212070, 128609, 349556, 170321, 61791, -150055, 144293, 57009, 192859, -319243, -65328, -207077, -32098, -149835, -168848, -282843, 94036, -45657, 145813, -79445, 16798, -123846, -130177, 310806, -14657, -128372, -81566, 219331, -3325, 19515, -13180, 144961, 159943, 201126, 164858, 77075, -155872, -184514, -1827, 252575, -16767, 57516, 66668, 36913, -165272, -96279, 148740, -303277, -134127, -106374, 56104, -299568, 123487, 213623, 101692, 113106, -206582, 27718, -350310, 71637, 108344, 258944, -53741, 6486, 156254]
11921A56254a1564G0781d4083k54614N2053a17777e1042k62124a8742j45667A11306
11909c5535j87563A64469g5403Q233J1239m4838k92016f3986j54852B1470P25
11898B2195e37783b36850b5880a2673M471l1283B3418d37406a35925G3357J5007
11887H8364K50504c63063J63766E9513b1261H6205l5116R8418a42375B39843b26998
11875a1694j47644A12767F600e7365k25485A1283J81030c24860a17446I2794L9804
11864A32598a84133A84926f4321A33455r238d61729d9436j2588j83933a01590
11853a55254F0043j9127h0773A03055D3812J11724b33346J2109A14070D2943g2458
11841D8265a30596D8297a32735k0882O7350Q779j45144C04151b32783m4687h4787
$$ y = [156254, -11564, 70781, -44083, -298697, -246644, -117777, -51042, -313166, -18742, -164409, 111306, -35535, -223098, 164469, -75403, -67170, -55931, -100769, -392785, -63986, -218838, 21470, 22195, -537783, -236850, -25880, -12673, -8202, -39485, 23418, -437406, -135925, 73357, 88364, 338868, -363063, -199297, 59513, -21261, 86205, 51089, 149507, -142375, 239843, -226998, -11694, -159338, 112767, 6600, -57365, -282850, 11283, 192313, -324860, -117446, 92794, 132598, -184133, 184926, -64321, 133455, 124217, -461729, -49436, -62024, -245957, -101590, -155254, 60043, 40916, -80773, 103055, 43812, 155536, -233346, -221237, 114070, 42943, -72458, 48265, -130596, 48297, -132735, -153617, -86267, -77488, -222632, 304151, -232783, -277470, -84787]
11829d27787b08761j43151a48596G2411i0755j99042a22009M3143p5582G8669
11818f9870b8162q7387E2295A3412a16769A94742b27019P4798B15618a29949l9466
11807a69415A61918c42442A9997p264K47701c1686A46430o7904Q7514b85320A46012
11795A44410B0285e0683A4352K94193J629a25585I1026a07599r8898g9089j83688
11784b62777b3376j9855k37807A77615m0112h5747j53355C45264E1429E992R724
11773A5716d77442b06865K6555f1684A66384c37024B3067a84722P1416l1991O7629
11762g7668A29067a41212k12998a01905B8210M9060c3563j02444A58078P1289
11752B29367e960C22605d3922A45016m3883c75576B5688a89589A69551i9906A04353
$$ y = [-427787, -208761, -351912, -148596, 72411, -90755, -289797, -122009, -78866, -154448, 78669, -69870, -28162, -115549, 52295, 13412, -116769, 194742, -227019, -152221, 215618, -129949, -169415, 161918, -342442, 19997, 12733, 260434, -31686, 146430, 78526, 166040, -285320, 146012, 144410, 20285, -50683, 14352, 308545, 310174, -125585, 91026, -107599, -206497, -79089, -262777, -23376, -43231, -281038, 177615, 137503, -85747, -239102, 345264, 51429, 5992, 15716, -477442, -206865, -180310, -61684, 166384, -337024, 23067, -184722, -113306, -145297, -77668, 129067, -141212, -354210, -101905, 28210, 77270, -33563, -136007, 158078, 229367, -5960, 322605, -43922, 145016, 101133, -375576, 25688, -189589, 169551, -99906, 104353]
11740B04302b69198H7414c9024j68676L5073I6249B8109f6946A02633A6046b5050
11728a10075a7752m0350m3223A89222a40631e3876A44399Q4418I8193M4054m7017
11717I5230B6214a56779M2754Q193o4877P1160j27361A76807q1735C8649a64124
11705c8462I3940b18537Q4559J2866d0670H8484J35076l8816f2030l0328j01156
11694a93514B43043B8073M6664a41446N2113k88814a2728j09509B66702J34405
11684D01107I2937K44529q73b5285l5314B01160d9234l92013B50860A06902C2412
11672b00629A1572d6440d491A95842a12188B84781d8698H4547b2624j63335q7305
11661b73264A70978H5198K06162F2290b77369A60651j0291F7874J63763a06464
$$ y = [204302, -269198, 87414, -39024, -207700, -172627, 96249, 28109, -66946, 102633, 16046, -25050, -110075, -17752, -58102, -101325, 189222, -140631, -53876, 144399, 228817, 98193, 142247, 95230, 26214, -156779, -114025, -105832, -170709, -99549, -226910, 176807, 95072, 38649, -164124, -38462, 93940, -218537, -133978, -121112, -40670, 88484, 223560, 184744, -62030, -92358, -193514, 243043, 28073, 74737, -141446, -89333, -378147, -12728, -122237, 266702, 401107, 92937, 337466, 336593, -25285, -60599, 201160, -49234, -441247, 250860, 106902, 32412, -200629, 11572, -46440, -4491, 195842, -112188, 284781, -48698, 84547, -22624, -185959, -273264, 170978, 85198, 291360, 62290, -277369, 160651, 150360, 67874, 231637, -106464]
11650A09941J5613n2797h8740a8629k23459E4867i4069A26503i895k14496A67188
11638a91334A5030a52111B90238B1984K31476d7699J2870R877p6163j72128B5560
11626G4936b21517B22553H072a11139A36685g74C30468E6432k6489c3655A04296
11614b04429h9785A43376b43602P05J10915r4197E247a4843m40954E32517b2622
11602I1387a48701d752k89381f6059n4780B53466A08198a49841d2025A59257K529
11591A61786h5907D9259b9258B46866L56441a32249A07675L0529P4468A5212J03458
11580A18670l9939K51598j51248K7208h0962n1797A08104g9993j58406A66585
11569B74128a94664H5946a72746A34956L04409b31433P5050j0108f3674j97252
$$ y = [109941, 125554, 72757, -88740, -18629, -242088, 54867, -94069, 126503, -9895, -224391, 167188, -191334, 15030, -152111, 290238, 21984, 253460, -47699, -34829, -24952, -101115, -273243, 25560, 74936, -221517, 222553, 8072, -111139, 136685, -774, 330468, 56432, 29943, -33655, 104296, -204429, -89785, 143376, -243602, -242897, -131982, -226179, 5247, -14843, -455797, 532517, -22622, 91387, -148701, -4752, -294133, -66059, -120839, 253466, 108198, -149841, -42025, 159257, 161786, -85907, 49259, -29258, 246866, 603307, -132249, 107675, 138204, 212672, 15212, 118670, 78731, 330329, 179081, 206289, -80962, -132759, 108104, -79993, -238399, 166585, 274128, -194664, 85946, -172746, 134956, 439365, -231433, -156383, -166491, -63674, -260926]
11559b60926J17861G2884M95815A46549J09217B8370b75386O5835B56733a56459
11548F6220k9357J12090B6641a67959F0583L7845J05400O4732N3244A4019b63868
11536C7293b47577K4135h9827b8213B49699f8097A68953K8164N9906j14346F4880
11524H8543M2337m3646a51252c1935L992C35142d62171f3691B75050q8841L611
11513A89820M7240p3598j0768f7615B70627g114D9728L38626j92936q0172K11597
11502C26843j10893j394r8373l4421Q6686L21856A88660M4461l0918J4846D8291
11490A50387R0197j3549c3147B18644d5505A31989q199b502C75018h2163D1233
11478A64686K30331a05557d0492C52731A72217L08751e8825A86642E6725F75M50108
$$ y = [-260926, -143065, 72884, 568699, 146549, 255766, 28370, -275386, -209551, 256733, -156459, 66220, 36863, 148953, 26641, -167959, 60583, 98428, 203828, 268560, 321804, 14019, -263868, 37293, -247577, -223442, -89827, -28213, 249699, -68097, 168953, 197117, 257023, 142677, 64880, 88543, 130880, 87234, -151252, -31935, -27943, 335142, -462171, -63691, 275050, 186209, 189820, 237060, 163462, 152694, -67615, 270627, -7114, 49728, 388354, 195418, 115246, 326843, 215950, 214556, 116183, 81762, 168448, 490304, 188660, 233121, 202203, 217049, 48291, 150387, 240584, 227035, -33147, 218644, -45505, 131989, 123790, -2502, 375018, -82163, 41233, 164686, 395017, -105557, -40492, 352731, 172217, 480968, -58825, 186642, 56725, 675, 450783]
11467D50783A09558J50182M4533J10045C7234i9503F8588a08792D4466J49280
11457A93746J80521C9552d6363B78914r2030q4245d2789j66400B05309g3941k02417
11446b76358B44202A21478a09669D5285A7226g6948B83551I7644Q3639a5529o1519
11435g7048C1746P4840b50152A33021a3395A73406i0274B0682a08259A3903J61916
11424A75819l2119J45078j21478b55689d9434j5402B67128g4559p1269I345K6350
11413C5695b15171O5261n0394R5474k7384M3364F4426K90955j39135j07563b30324
11401f7676A76755a21543A7998O003K05560a70342d217A4695c40578b7420k3777
11390e1197H819J36163E3692b39901B8744a74848A6422h0333C25657c10413M5699
$$ y = [450783, 109558, 259740, 304273, 414318, 37234, -99503, 68588, -108792, 44466, 193746, 374267, 39552, -46363, 278914, 186884, 102639, -42789, -209189, 205309, -73941, -276358, 244202, 121478, -109669, 45285, 17226, -76948, 283551, 97644, 181283, -15529, -77048, 31746, 106586, -250152, 133021, -13395, 173406, -90274, 20682, -108259, 13903, 175819, 143700, 288778, 167300, -255689, -49434, -64836, 267128, -74559, -145828, 9345, 35695, -215171, -149910, -200304, -104830, -132214, -88850, 64426, 355381, 216246, 108683, -230324, -67676, 176755, -121543, 17998, 24001, 229561, -170342, -4217, 14695, -340578, -27420, -51197, 8819, 144982, 53692, -239901, 28744, -174848, 16422, -80333, 325657, -310413, -264714]
11379b64714A64187B7435d09200A92679a90902M7492e6958k29872e8386B29555
11368c85475F9679L4292M65001a0507B18015a81685E734b11801g9994C7797a75128
11356b32612H1753K4746m2501a03903a8385I0045b21211r2090Q1570C25146a2320
11344a16934m1670A6435J5993e1869l8261j19838B88436A0400a19351D1825d2992
11332D6694a10426r4281e6260r804B98955d8575a3631E8218J01699c8623m7677
11321h6300r0041A2306L4645a66810e2130F8962b45576g1770j475A60125a88726
11309A15784f3525F7497b29515L2347E4978a63372j3750r5997r53B21437a59590
11297A00616a64713H3785a79152H256c07642P9995I0308b60182C24561d22025
$$ y = [-264714, 164187, 27435, -409200, 192679, -190902, -143410, -56958, -286830, -58386, 229555, -385475, 69679, 103971, 568972, -10507, 218015, -181685, 5734, -211801, -79994, 37797, -175128, -232612, 81753, 106499, 63998, -103903, -18385, 90045, -221211, -313301, -231731, 325146, -12320, -116934, -158604, 16435, 32428, -51869, -90130, -209968, 288436, 10400, -119351, 41825, -42992, 46694, -110426, -204707, -56260, -66064, 298955, -48575, -13631, 58218, 159917, -38623, -86300, -176341, 12306, 46951, -166810, -52130, 68962, -245576, -71770, -73245, 160125, -188726, 115784, -63525, 67497, -229515, -197168, 54978, -163372, -177122, -273119, -274072, 221437, -159590, 100616, -164713, 83785, -179152, 8256, -307642, -227647, 90308, -260182, 324561, -422025]
11286b51935i5694B58740B3074b265D8199d4959o9331E3757c67097a5979j29593
11275a45572j317B64533a19170F4956D923J62146a16747k1732a837k7931A08344
11263E0547a92134Q5092K4075I4974Q6910o2455C2330M8741O4911c84534A14281
11251a74147m0659d2771A56809a4353k73147A25272a26516C6950J13930K462A3347
11239B12522c32885P0078C56681b37417Q6991D51515i2276n8529d1399A65119
11228C1698i7607k09564d8765B9343a45896B39708a67513G9731M43b75558Q7285
11217a88273N5326J3171a1792G5495b7706A23109R673E6224J52758E3446a6110
11205B12944a34884L7602B2072L27026n4129b50930I2595c36613D4573a88003
$$ y = [-251935, -95694, 258740, 23074, -2265, 48199, -44959, -114290, 53757, -367097, -15979, -145572, -146889, 264533, -119170, 64956, 4923, 167069, -116747, -138479, -1837, -29768, 108344, 50547, -192134, -107042, -82967, 94974, 181884, 119429, 32330, 81071, 145982, -384534, 114281, -174147, -214806, -42771, 156809, -14353, -287500, 125272, -126516, 36950, 150880, 153342, 13347, 212522, -332885, -262807, 356681, -237417, -150426, 451515, -92276, -150805, -41399, 165119, 31698, -97607, -307171, -48765, 29343, -145896, 239708, -167513, 79731, 80174, -275558, -188273, -132947, -119776, -11792, 75495, -27706, 123109, 132782, 56224, 208982, 53446, -16110, 212944, -134884, -97282, 22072, 349098, 294969, -250930, 92595, -336613, 44573, -188003]
11194b8266m8841p7838B1429R5938g3814a3908l3632n377A65116o7512B9019a37303
11181B3160g0648K7406C4987Q1908m65a69734E19307a02935C24685A09450G099
11169b2942l541A68621n8919A0532O1420l3866J50801b56185h1344B27679d6717
11157a00203B62076c24249b9666r250j25266O1843A16547b95295A00302P578m8794
11146E9086J28678H4299e2488D578b49588F6320c40888a04304A2920b62289D1679
11134b02982A54399M3501p8909M5030a62175A13163O225a5861F28917B26325A12181
11122A86462D5248J22271d1294k09045B178L8390e2326o882C34416o9980a29690
11110A79794J00567R7378p7288A03225j4105M5131l9116J18833j00520M86006
$$ y = [-28266, -77107, -154945, 21429, 117367, -73814, -13908, -47540, -52917, 165116, 97604, 29019, -137303, 23160, -70648, -43242, 34987, 116895, 116430, -169734, 519307, -102935, 324685, 109450, 7099, -22942, -26483, 168621, 109702, 10532, 71952, 38086, 188887, -256185, -81344, 227679, -46717, -100203, 262076, -324249, -29666, -38916, -164182, -102339, 116547, -295295, 100302, 107880, 59086, 187764, 84299, -52488, 4578, -249588, 66320, -340888, -104304, 12920, -262289, 41679, -202982, 154399, 197900, 118991, 164021, -162175, 113163, 119388, -15861, 628917, 226325, 112181, 186462, 45248, 167519, -41294, -250339, 2178, 40568, -52326, -59208, 334416, 264436, -129690, 179794, 280361, 377739, 300451, 103225, 89120, 134251, 95135, 213968, 113448, 599454]
11100E99454k92338J11626b2874C08313D2298K77880J98195o4831B4578J74556
11090A99134R2081q4735l1176P2694b20877B01274K1903R3516J96975j69591J1411
11079C55488M6642j36679J02580j03189b1775B54259M08936F5780K21645L28055
11069F15480k41545M1000A7247M72638j35710L73980l34445R6600k6724J47019
11059F10605q10j45350K19069L6781k36141L98192q7251j13109J0536J81402L2378
11048I06302k7484K0714j96453K05031L06459r0768k88200j15249K07140j30313
11038G97179P0308r7287J72536N2121j78149k8471j97191N2021M23623l85675
11028F81015m7450M00336j27342J65633l94743K6562O222J31262J25556n6684
$$ y = [599454, 307116, 418742, -22874, 308313, 42298, 320178, 518373, 453542, 24578, 199134, 291215, 206480, 175304, 247998, -220877, 201274, 223177, 316693, 513668, 344077, 355488, 402130, 265451, 368031, 264842, -21775, 254259, 663195, 65780, 287425, 615480, 373935, 414935, 17247, 489885, 354175, 728155, 393710, 490310, 463586, 610605, 609795, 464445, 683514, 720295, 484154, 882346, 795095, 681986, 692522, 873924, 906302, 878818, 899532, 703079, 908110, 1214569, 1123801, 835601, 720352, 927492, 797179, 867487, 770200, 942736, 994857, 816708, 788237, 591046, 643067, 1066690, 681015, 633565, 1033901, 906559, 1072192, 677449, 704011, 710233, 841495, 967051, 910367]
11018I10367D21073Q7220K91599j8686j54849J07268L3979J47912l81146M368
11008E38738J04796N0800J72808j71918J1393J83760j51799j41743M34562l31964
10998F99433J42266r7911k56864M88972l48705j4677K24187R659k40032J25993
10988G32321n8863J2772Q6423k708J50381K52137j71469j14509N17921p8840P2051
10977A397617J52418M80254j41550P13787K10706K97213K48197M05332j86K86339
10967D050127j46326l01601l69381j027934j64593l77247j52852J89269k61154
10958A438308k15033q9289J78976l96110K41800k50480O4509m80211L65187m06400
10948D51257L0106a03509F21148C04681K72906q5140a30030D21128H9088K3646
$$ y = [910367, 421073, 508293, 799892, 781206, 626357, 733625, 767604, 915516, 534370, 538738, 643534, 694334, 867142, 695224, 706617, 890377, 738578, 596835, 1031397, 699433, 841699, 743788, 486924, 975896, 627191, 612514, 836701, 846360, 606328, 732321, 673458, 686230, 772653, 769945, 920326, 1172463, 1000994, 886485, 1404406, 1325566, 1397617, 1550035, 2030289, 1888739, 2602526, 2813232, 3110445, 3358642, 3763974, 3763788, 4050127, 3903801, 3602200, 3232819, 2204885, 2040292, 1663045, 1510193, 1699462, 1438308, 1223275, 1133986, 1312962, 916852, 1158652, 908172, 972681, 492470, 857657, 451257, 481363, -103509, 621148, 304681, 577587, 492447, -130030, 421128, 89088, 112734]
10938A12734a01659B20766J63452j63973F8545J60060G3620M5669a14140B75627
10927d2455B51920r1235c9372B18622c48930C82476A11322M07343a41763O4761
10917g7002r26k30826b4873k12297g6875Q628j90180a00226L3346A93826G2863
10905h5431q071q9690G5482L4870a4755k7821L591j61720A25557k6246J00737
10894B00048b86170C0660J33477c6777B97855a14699A714J28916b39959A20024
10883h0279k05282B7373f1341J8447p2623j22377F1407M6725b12884d6187F9583
10871h5395h694j75560c1624j23531A40286A8941K49318o7459I2443g7352A30563
10859B9698g4614k42510P5903I0098e30091J93987M1758G3141b20897Q0821A6416
$$ y = [112734, -101659, 220766, 384218, 220245, 68545, 228605, 73620, 119289, -114140, 275627, -42455, 251920, 160685, -39372, 218622, -348930, 382476, 111322, 518665, -141763, -77002, -77928, -308754, -24873, -237170, -76875, -68247, -258427, -100226, -66880, 193826, 72863, -85431, -93502, -183192, 75482, 110352, -14755, -42576, -38985, -200705, 125557, 99311, 200048, -286170, 30660, 164137, -36777, 297855, -114699, 1714, 130630, -239959, 120024, -80279, -285561, 27373, -61341, -42894, -115517, -237894, 61407, 108132, -212884, -46187, 69583, -85395, -8694, -184254, -31624, -155155, 140286, 18941, 268259, 200800, 92443, -77352, 130563, 29698, -74614, -317124, -241221, 90098, -530091, -336104, -294346, 73141, -220897, -140076, 16416]
10847B95g9675k2128H7589M7289B2253b00139h0076a2280j39746g1148H3786a31914
10834g7957A5985b75034H082R6508b50227d0706F357c9056G5127Q1755D1400a23241
10821B56383A5366a32330K5627o6336E9825b35510P2744I9959e8340l04793E6782
10809A933O0066a24344j44515C6080d53192a13743B8552b62557k3832b3065l6327
10798e9392r9307A52640J14699A28925g2921K2663b3499D18678A0730c40277J29511
10787b10766A32215b05637k72603g6158j30044i3680A55643J8833c1304l8771
10777g0075A22143a82653B41319A20159K71247b80877J23969C51110e415l08306
10767c13721A81116h3373q1576K1761H0074J3849b93592e2903H5470a93311l20021
$$ y = [295, -79675, -101803, 87589, 134878, 22253, -200139, -80076, -12280, -152026, -71148, 83786, -131914, -77957, 15985, -275034, 8082, 104590, -250227, -40706, 6357, -39056, 75127, 156882, 41400, -123241, 256383, 15366, -132330, -106703, -173039, 59825, -235510, -162766, 99959, -58340, -363133, 56782, 1933, 61999, -124344, -268859, 36080, -453192, -113743, 28552, -262557, -286389, -23065, -59392, -158699, 152640, 267339, 128925, -72921, -50258, -23499, 418678, 10730, -340277, -210766, 132215, -205637, -478240, -76158, -206202, -93680, 155643, 174476, -31304, -70075, 122143, -182653, 241319, 120159, 391406, -280877, -156908, 351110, -5415, -313721, 181116, -83373, -164949, -143188, 80074, 93923, -293592, -52903, 85470, -193311, -513332]
10756e13332a16526H7171a28665i682m2567O671A32928h3175E6664B8137b23766
10744a71644j92680J55538j24362C6020a7993A38927f4818E7805L88596i1318
10733E2245O4372a57404O8994A43764a38725C6288a81419I3678d4766N990l26591
10722c65367B07985L0371d5350k67904a21677m9182j46271h1366I33a76557M2887
10711a33670A90149c20025a29612A46296c21025G9317c10988N7384f4863K7197
10701c7666m66490D2559d33663K02398M5903l863F3856c36617D8092a726G5972
10689e206E9521j8744d7531H6060J53200a68487O2530A78715c82289A23281h7146
10677B14055c19757O2252R8096o327A39525N2238H9711B5606K34386a35725F4680
$$ y = [-513332, -116526, 87171, -128665, -9682, -52249, -45578, 132928, -83175, 56664, 28137, -223766, -171644, -364324, -208786, -333148, 36020, -17993, 138927, -64818, 57805, 446401, -91318, 52245, 116617, -157404, -88410, 143764, -138725, 36288, -181419, 93678, -44766, -38776, -365367, 207985, 238356, -45350, -313254, -121677, -170859, -317130, -81366, 933, -176557, -133670, 190149, -320025, -129612, 146296, -321025, 79317, -310988, -253604, -64863, -37666, -504156, 42559, -433663, -231265, -185362, -189225, 63856, -336617, 48092, -1726, 75972, -5206, 59521, 40777, -47531, 86060, 239260, -168487, -105957, 178715, -382289, 123281, -87146, 214055, -319757, -257505, -159409, -165736, 139525, 191763, 89711, 25606, 259992, -135725, 64680]
10665H9894i7974j67132a21378b2252p803A86204A8870R9289J59230a36085j61791
10654b97876R8808b0038A36125E4468M1421f9286H8024c8021q2639M8230a4490
10642A35593a13595d1754j37134P5657I5210a17674l73076a14768C01253L4549
10632C35802j2756F4144c73271B04797a23955F4194a02338r6069c2623j7013q6381
10621a36017b804D7951B3519A0544b22920f0789J1178a2615A18446c22395a10614
10609A42509b38777p1571A1740L3394a22422A1296a3992A28086i5624b6389k4667
10598e1056j50344k8136H1831b85339a4272j57409k31640J6933a1675l23929b3699
10586d9254B5150J34959c137q6290q5294f6247i20k6718C5848c34830d683m5888
$$ y = [89894, -97974, -265106, -121378, -22252, -30055, 186204, 18870, 118159, 277389, -136085, -297876, -199068, -20038, 136125, 54468, 95889, -69286, 88024, -38021, -120660, -72430, -14490, 135593, -113595, -41754, -178888, -103231, 95210, -117674, -490750, -114768, 301253, 335802, 323046, 64144, -373271, 204797, -123955, 64194, -102338, -198407, -32623, -49636, -136017, -2804, 47951, 23519, 10544, -222920, -60789, -49611, -12615, 118446, -322395, -110614, 142509, -238777, -310348, 11740, 45134, -122422, 11296, -13992, 128086, -95624, -26389, -51056, -201400, -229536, 81831, -285339, -14272, -171681, -403321, -386388, -11675, -335604, -23699, -49254, 25150, 160109, -3137, -89427, -174721, -66247, -920, -27638, 35848, -334830, -4683, -50571]
10574e0571j08862n2354j52165a43601k3405N1621K932H3448c36068g94B3357
10562b22457g7784j01056C22328j36201F6113c376j78049n4298a03348j61188
10552b64536a06029A55613n070F7265a77458A98005I6501d6093E5838O4957K0579
10541A41374a31254C0567b1463A35148d1408C13954A16834d0653j4066j36572
10531a91291f766j06940C6054a82158A199J57338L73162A6915M068p800c42775
10519f6272B40405j4950I9102i7174k80713c0626F2910a57405B38398F6052a6091
10507B1526h218C51109e3812B847g6189c605o9770A94059p6023k9432c0595f193
10494d8944E0720b11666Q803h0617l682I834f6626E1834M17351a01965A5146a73252
$$ y = [-50571, -159433, -211787, -363952, -143601, -167006, -115385, -112453, 83448, -336068, -794, 23357, -222457, -77784, -178840, 322328, 186127, 66113, -3376, -181425, -235723, -103348, -264536, -106029, 155613, 150543, 67265, -177458, 198005, 96501, -46093, 55838, 120795, 141374, -131254, 30567, -21463, 135148, -41408, 313954, 116834, -40653, -54719, -191291, -6766, -113706, 36054, -182158, 1199, 158537, 531699, 16915, 20983, 13183, -342775, -66272, 240405, 225455, 99102, -97174, -377887, -30626, 62910, -157405, 238398, 66052, -16091, 21526, -8218, 351109, -53812, 2847, -76189, -3605, -73375, 194059, 118036, 88604, -30595, -6193, -48944, 50720, -211666, -202863, -80617, -84299, 9834, -66626, 51834, 469185, -101965, 15146, -173252]
10481B25087A9719N4928L29900m269A10931J89828j17740E0036j8931a6744D2162
10469A75772a69327l1134D97116H5407a28945J7493p2146K3625A3487a58634a1494
10457A4896d2819j91495A37453a17999A39016d18718D4936b55824A92880H6790
10446A32031c40531f8758j10623L5550A70563F9257a54889n9982j2595A16623
10435G154a42289M957q2473f6044b5039q760k18581J09091A82090D7002a07144
10423E9326a30620D220c30395a30202b991E9678J49528e4287l6723F2164i1502
10411a29818k36192A5183J29524a41795B29415a79492B1066K20516F9819L6929
10401A06748k5138e4632A28034b37614A16803L1669n3293J51130a88465B86878
$$ y = [225087, 19719, 74647, 404547, 400278, 110931, 300759, 183019, 50036, 31105, -16744, 42162, 175772, -169327, -200461, 497116, 85407, -128945, -111452, -183598, -159973, 13487, -158634, -11494, 14896, -42819, -234314, 137453, -117999, 139016, -418718, 44936, -255824, 192880, 86790, 132031, -340531, -68758, -179381, -143831, 170563, 69257, -154889, -214871, -227466, 116623, 7154, -142289, -137332, -219805, -66044, -25039, -33799, -252380, -143289, 182090, 47002, -107144, 59326, -130620, 4220, -330395, -130202, -2991, 59678, 209206, -54287, -91010, 62164, -91502, -129818, -366010, 15183, 144707, -141795, 229415, -179492, 21066, 241582, 69819, 106748, 81610, -54632, 128034, -237614, 116803, 148472, 95179, 246309, -188465, 286878]
10390C67890E7931J13618Q4364A07756O2910L26881b8088B51665j05677J17976
10380B63964A08425A6464L34810j4880K890j0278o7364B4805M1339n923J02352
10369A62573i9171E46137B54112J62138o5922l6250N7233Q1752n3242Q6183k18024
10358B67980m4950m4691J21541J3066R5991P5636r7226L01937j72474K22184r5008
10347F43986l11518M442L2457q6141r523A19727a18253G388J93612K93625f5149
10335D01261o4344a22202C08855k8508A21111J18686C5349K36581a72172j6143
10325a88315B42981k516P029q7655l102M043p1072a52905A29390a5553j38280
10314a53833I5997A3937K178M7799Q4045a97741K9097r2092b3830A64692G3761
$$ y = [367890, 57931, 171549, 255913, 107756, 170666, 497547, -28088, 251665, 145988, 263964, 108425, 16464, 351274, 336394, 339284, 329006, 261642, 24805, 66144, 60221, 162573, -99171, 546137, 254112, 416250, 350328, 314078, 371311, 453063, 399821, 486004, 267980, 223030, 178339, 299880, 312946, 408937, 484573, 387347, 689284, 516810, 738994, 643986, 332468, 336910, 369367, 283226, 273703, 119727, -118253, 7388, 201000, 494625, -65149, 401261, 336917, -122202, 308855, 280347, 121111, 239797, 35349, 271930, -172172, -188315, 242981, 240465, 247494, 159839, 156737, 160780, 89708, -152905, 129390, -15553, -153833, 95997, 13937, 16115, 63914, 147959, -197741, -168644, -260736, -23830, 164692, 73761]
10302a59565d9236A12013m9929L5875O9266J87141b41865h7209c1484A62580m3393
10291A19187a21902j69138A75575b11183g473A36141h8131l70405C6433a71869
10280E1467j3940e2379C04354a05222D7477a39638H8650J12444C2552J41639i3809
10268I606N8877a59826C55236a52618G6566A5645J9431L8A4769M40149A47023
10256A34026e6367G677O0859J49066a39761k75658A92489c49746a12954D5836
10245a46338k78715a73851h2831B727P3973R3168M1173a94826A73974a60000m7903
10234b07903g5387m793n8175f771B2821d2512k58748B807h4022C1918a56993L4434
10222a22559E2498b30118f6661B01470g6479q5359K3971B2524e5541k15925M6634
$$ y = [-159565, -49236, 112013, 62084, 97959, 167225, 354366, -241865, -87209, -31484, 162580, 119187, -121902, -291040, 175575, -211183, -7473, 136141, -88131, -458536, 36433, -171869, 51467, 37527, -52379, 304354, -105222, 47477, -139638, 88650, 201094, 32552, 174191, -93809, 9606, 68483, -159826, 355236, -152618, 76566, 15645, 35076, 35114, 14769, 454918, 147023, 134026, -56367, 7677, 68536, 217602, -139761, -415419, 192489, -349746, -112954, 45836, -146338, -425053, -173851, -82831, 2727, 76700, 169868, 211041, -194826, 173974, -160000, -207903, -75387, -80180, -138355, -6771, 22821, -42512, -301260, 2807, -84022, 31918, -156993, -122559, 52498, -230118, -66661, 201470, -76479, -161838, -137867, 22524, -55541, -271466, -224832]
10211b24832K7500C8329g2463A08896b12716K6759P5412A00465a57059e6167B76346
10199d8796o3822j3604n5388o1485e1848A17879d1840k06853C6566a33375a9946
10187a08305m271B8179a17139j93508q511l6212d4984q7233B64003b95195C43567
10175A37534J60552j28992C1222K07501a59522A15575m706b27346r4203a11088
10164b36699N7812f0813G8270h3912G2202f7811k01484e2337k0366o0625j67851
10153c01179A68437B1437a92847A78013b16286B39900A6206J09076e8071n8395
10143a16466A00180a55342F1965c8588r8065j4886r590k2065p2107c2077A5992
10131a38367a3479k61176b7947I9347A9480b86969a17448J6464M0755A32363B404
$$ y = [-224832, -197332, 38329, -72463, 108896, -212716, -185957, -110545, 100465, -157059, -56167, 276346, -48796, -112618, -126222, -181610, -243095, -51848, 117879, -41840, -248693, 36566, -133375, -19946, -108305, -112576, 28179, -117139, -310647, -319158, -355370, -44984, -132217, 264003, -295195, 343567, 137534, 298086, 169094, 31222, 238723, -159522, 115575, 110869, -227346, -321549, -111088, -236699, -178887, -60813, 78270, -83912, 72202, -67811, -269295, -52337, -72703, -133328, -301179, 168437, 21437, -192847, 178013, -216286, 239900, 16206, 125282, -58071, -116466, 100180, -155342, 61965, -38588, -136653, -151539, -161129, -183194, -255301, -32077, 15992, -138367, -13479, -274655, -27947, 99347, 19480, -286969, -117448, -100984, -60229, 132363, 2404]
10119b04207D8998A9699a59764j11092a4073k78479d5984a8320k882j90408F2512
10107a47758L4654p7521e2590E8384J84552g75j16213j13087J10695e4570C0426
10095d11468a35867E1722B5570J7312J47409b70981J10380k5676C33870b97235
10084a86421M9552A81649a44653k20571A15935f2979r7809D5318N1418a89331
10073E0705b44368I1256d32044a20767j45672D3755f6106k35992A64850b37677
10062a5632g485j65655B6577e0617D7981J38492C6730R6281m5056e2850j83143
10051b35993D9980e6421G4457a76468P9544A9059J34390A0295J40343a6144k7532
10040d3676B8402J00916n1665a94146A68225Q3145k2958a57320D61428f5339k56944
$$ y = [-204207, 48998, 19699, -159764, -270856, -14073, -292552, -45984, -18320, -21202, -211610, 62512, -147758, -113104, -190625, -52590, 58384, 242936, -775, -116988, -230075, -119380, -54570, 30426, -411468, -135867, 51722, 25570, 42882, 190291, -270981, -160601, -186277, 333870, -297235, -186421, -136869, 181649, -144653, -365224, 115935, -62979, -160788, 45318, 96736, -189331, 50705, -244368, 91256, -432044, -120767, -266439, 43755, -66106, -302098, 164850, -237677, -15632, -7485, -173140, 26577, -50617, 47981, 186473, 36730, 133011, 87955, -52850, -235993, 49980, -56421, 74457, -176468, -96924, 19059, 153449, 10295, 150638, -16144, -43676, 28402, 129318, 77653, -194146, 168225, 251370, 228412, -157320, 461428, -65339, -322283]
10029c22283f6163k30774K8909K3624B98467h766B40535m6093a28653d2145F9801
10017c98620H1091E603K77082C599f2232j01977B9130N693J3963b9458C3087a68992
10004f8334F4091a12626d509j54173l7572k1051K7218P2901G5460c42723a43886
9992c9B70092J45530A13774a77649C72063h2005j66050A8971e4714B22137C9868
9980c40450A38053e0367j02661A26620A1382e8899A066a75003N6399n1958j62331
9969c32893g7331j15214B78142C8085d6090B3557a35424B8104M5809b299q5180
9958h7479j48985a5621j75706Q7188l21545a48929k25723A47738A1154O9576Q5771
9947A66501F4892B0168b1441o5326l5249D5655J38813N0792c82687K6188J77706
$$ y = [-322283, -66163, -296937, -268028, -244404, 298467, -8766, 240535, 194442, -128653, -42145, 69801, -398620, 81091, 5603, 282685, 3599, -62232, -164209, 29130, 34823, 48786, -29458, 33087, -168992, -68334, 64091, -112626, -4509, -158682, -196254, -217305, -190087, -117186, 75460, -342723, -143886, -39, 270092, 415622, 113774, -177649, 372063, -82005, -248055, 18971, -54714, 222137, 39868, -340450, 138053, -50367, -153028, 126620, 11382, -58899, 1066, -175003, -118604, -170562, -332893, -77331, -192545, 278142, 38085, -46090, 23557, -135424, 28104, 73913, -2299, -87479, -236464, -15621, -191327, -104139, -425684, -148929, -374652, 147738, 11154, 80730, 166501, 64892, 20168, -21441, -86767, -122016, 45655, 184468, 235260, -382687, -356499, -178793]
9936a78793L8578f7294G2010k3160c903H7242a39912k29365a66358P4512B94316
9924A93663g775j35539m8609k15669n7993a35346j95626C6240c65967i4042M0775
9913e3267j76207d9692j664j53506j19712A35804b3218r1767E7676a50553j9509
9902a70062l4371j21485a34814J3928j49135O9171Q6222A38162a16946M1440B48129
9890A68862F0334c29663A09104b63413B3432b3492j9155q1370k25333K8033C6859
9878A27893J3904D3843b53694e0679A35727b91578g8179G3021a4907k35175O4683
9867a85399Q9621k58163B06785J13984d6453C9632b16681i0550J9235m4865P434
9856a08746k0684H53b08642e1507A70609D6494b76825i1220E1350a13666l87141
$$ y = [-178793, -140215, -67294, 72010, 48850, -3903, 87242, -139912, -369277, -166358, -91846, 294316, 193663, -7775, -143314, -191923, -407592, -465585, -135346, -330972, 36240, -365967, -94042, -53267, -229474, -49692, -51356, -204862, -324574, 135804, -23218, -114985, 57676, -150553, -170062, -204433, -325918, -134814, -120886, -270021, -200850, -114628, 138162, -116946, -75506, 248129, 168862, 60334, -329663, 109104, -263413, 23432, -23492, -42647, -124017, -349350, -321317, 36859, 127893, 141797, 43843, -253694, -50679, 135727, -291578, -78179, 73021, -14907, -250082, -185399, -95778, -353941, 206785, 320769, -46453, 39632, -216681, -90550, -71315, -116180, -108746, -129430, 853, -208642, -51507, 170609, 46494, -276825, -91220, 51350, -113666, -500807]
9845e00807A5200h2920A19687b4905j17232c795G4873J202i835o4858A42910b89642
9832a20526k4873d3783o3804J9539C2787J7798m981b2769A15560a30826f3786
9820a17661A32123b84897A59276p0199a2820o8939k98206G8914c67116E7197a36291
9808b61713B30661c4794j92826H8137c48710a36332p3628a220p6936A25360a05920
9796a33288j16280B0068b41579a5430I7697a07704K2330F710i5384m9925g1199
9784C24263A30134a56330m4658O9710j66215h8543n5859B3984a02408E6689P5712
9773A32401b18715r4655L4561B67241a22623b955D9684e9577b1599j05531D8938
9761a58153b932H1476a30118L431b9940p0203j77666A32351D7587c0067n768B25673
$$ y = [-500807, 15200, -82920, 119687, -24905, -142137, -3795, 74873, 76075, -9835, -74693, 142910, -289642, -120526, -145399, -43783, -107587, -88048, 32787, 50585, 45604, -22769, 115560, -130826, -63786, -117661, 132123, -284897, 159276, 89077, -12820, -81759, -379965, 78914, -367116, 57197, -136291, -261713, 230661, -34794, -227620, 88137, -348710, -136332, -209960, -1220, -78156, 125360, -105920, -133288, -249568, 20068, -241579, -15430, 97697, -107704, -85374, 6710, -95384, -145309, -71199, 324263, 130134, -156330, -200988, -131278, -297493, -88543, -144402, 23984, -102408, 56689, 132401, -218715, -313370, -278809, 267241, -122623, -2955, 49684, -59577, -21599, -127130, 48938, -158153, -2932, 81476, -130118, -126687, -29940, -100143, -277809, 132351, 47587, -30067, -35835, 225673]
9748g4129B35426H2227b20470i3517H1028f8809A02347g2643B56864b7151q7204
9737a14355n5753k7580F7150B6951a7090j60396A195M6473c15412a23013B06019
9725a47043B00727b61463A0628a94004h2385k18607J27894e4863l5912j30557
9715b21332f1927b186n3222G9989Q9307a30138A47754f7960j53793j3304L0132
9704b04925l4036D622b22141I4574b60252b46j41617B53301D8372M0071h6974
9692c8222J146p8175l9543j94893B0874b2349A54803b17879j84584f2216m6088
9681a08304I8080C8370a52744D136g5269p0798A28366a64232n4229A75070J83771
9670C58841c33916c3293B75940a03372k11647D919Q169b17793A07791a94120k5505
$$ y = [-74129, 235426, 82227, -220470, -93517, 81028, -68809, 102347, -72643, 256864, -27151, -114355, -170108, -197688, 67150, 26951, -17090, -177486, 1195, 47668, -315412, -123013, 206019, -147043, 200727, -261463, 10628, -194004, -82385, -300992, -173098, -54863, -90775, -221332, -61927, -2186, -55408, 79989, 169296, -130138, 147754, -67960, -221753, -235057, -204925, -238961, 4622, -222141, 94574, -260252, -246, -141863, 253301, 48372, 88443, -86974, -38222, -37076, -115251, -154794, -349687, 20874, -22349, 154803, -217879, -402463, -62216, -108304, 98080, 38370, -152744, 4136, -75269, -146067, 128366, -164232, -218461, 175070, 358841, -333916, -33293, 275940, -103372, -315019, 4919, 13088, -217793, 107791, -194120, -219625]
9659b19625J09267j75084d0059H4505i8324b9504j43331B98049b3049A10797a39962
9647g8802a7180j46468A086a78975A12650D0114J8331d66275e1183r4807H7455
9635i0181B75753O1907d0397k00380C2143d1213j42731g678B17799b0068A82783
9623B3626K77848n8520a24332M8853A4596b65346A35655e7309J5567r8118D6754
9611b63641A15955C293O299a67163a9310A5014L134g73k95377b9800A08524a87562
9598a59015A26711J26027k1665b99191A25956k1934a64792b8848l6873K4846j28598
9587a69473A23589a33552j61470a09171j52835a6909m11770A09007c9078o9279
9577a08357H1478d2912p9173A85757a39898l66197a87301f2325B02691a00775
$$ y = [-219625, -110358, -285442, -40059, 84505, -98324, -29504, -172835, 298049, -23049, 110797, -139962, -78802, -17180, -163648, 1086, -178975, 112650, 40114, 58445, -466275, -51183, -145990, 87455, -90181, 275753, 337660, -40397, -240777, 32143, -41213, -183944, -7678, 217799, -20068, 182783, 23626, 301474, 242954, -124332, -75479, 14596, -265346, 135655, -57309, -41742, -139860, 46754, -263641, 115955, 3293, 9592, -167163, -19310, 15014, 18148, -773, -296150, -29800, 108524, -187562, -159015, 126711, 252738, 231073, -299191, 125956, 104022, -164792, -28848, -65721, -40875, -169473, 123589, -133552, -295022, -109171, -262006, -16909, -428679, 109007, -39078, -108357, 81478, -42912, -122085, 185757, -139898, -506095, -187301, -62325, 202691, -100775]
9566f2553o5832j8679j0272B22331E1363L55393i621n1393B2249b14035P7508
9555a36527k3603f0456A33922a66808F7130g5827i206A1432R1210k3925c34288
9543B16036d3751j42997F9767c30718g4682j60165A09235b19304B97599A5995
9532F5368g9490A99398i1488A00206m8162f1071H5477a56860j1913L3204d6464
9520H5952c1270k69233g3331k88008a66752e8814K0179A25738A7487c19378A8627
9508B84518P1800h6729k02056d6994A87040c9680d43p2091a7255A40403L7047
9497A77450p3493i2498K5596l40579a13430k44749i4154G3779f4003q1495b7892
9485F4643b71328J16556K6183M5820a7142k12545G852J16545a44364j32105I1411
$$ y = [-62553, -128385, -147064, -157336, 222331, 51363, 406756, -9621, -61014, 22249, -214035, -136527, -160130, -60456, 133922, -166808, 67130, -75827, -9206, 11432, 102642, 78717, -334288, 216036, -43751, -186748, 69767, -330718, -74682, -234847, 109235, -219304, 297599, 15995, 65368, -79490, 199398, -91488, 100206, 52044, -61071, 85477, -156860, -168773, -135569, -46464, 85952, -31270, -300503, -73331, -361339, -166752, -58814, -38635, 125738, 17487, -319378, 18627, 284518, 356318, -86729, -288785, -46994, 187040, -39680, -443, -72534, -17255, 140403, 177450, 103957, -92498, -66902, -407481, -113430, -358179, -94154, 73779, -64003, -145498, -27892, 64643, -271328, -154772, -128589, -82769, -17142, -229687, 7852, 124397, -144364, -276469, 91411]
9473g9502j5804l13659I0416J23668R4919b10702J01463A45924e5758A20155b34594
9461H9004f95090f5285j62232k32786a507o4819l78899a61200P9045k7750K9183
9450h0722j98877f9999n8640J5723M7899j41281Q0364B70354b10054A04554m2883
9439F1671K21094b82968e2807j7714n3788e9030n1180D9843a48589l714F6969
9427a11209k88642g1265j0237J7474B3294b46985e7273j12089g0789k25623B16279
9415b12590B33119H0616M923e4118B52112d56985F970b0401j48595A31296h9016
9403C02089D4533K32517a86465I9122J83332P6520a38839j23624O9864j37962
9393c30561h936A9868J49808n2839h795B44937B0506e3539p1643e6882j17986
$$ y = [-79502, -95306, -408965, 90416, 214084, 309003, -210702, -109239, 145924, -55758, 120155, -234594, 89004, -695090, -65285, -227517, -460303, -1507, -66326, -445225, -161200, -82155, -109905, -80722, -279599, -69999, -128639, -112916, -65017, -206298, -125934, 270354, -210054, 104554, 61671, 282765, -282968, -52807, -70521, -124309, -59030, -110210, 49843, -148589, -152303, 66969, -111209, -399851, -71265, -81502, -64028, 23294, -246985, -57273, -169362, -70789, -296412, 216279, -212590, 233119, 80616, 85539, -54118, 252112, -456985, 6970, -20401, -168996, 131296, -89016, 302089, 44533, 277050, -186465, 99122, 282454, 358974, -138839, -262463, -192599, -330561, -8936, 19868, 169676, 116837, -8795, 244937, 20506, -53539, -125182, -56882, -174868]
9382a74868A97634c34244J53161K756p7747A7931a48261k7651A7577a09067J9072
9371h9995h782k12528i3549k72381d4895b0925j04955b8018o0062B1657M8088
9360F9745J19617c30634a07636j5591A46146b8446m34522A35757i302D7395R0327
9349A37722d9872k24443n1544A26497J441b77320c2083B26655a40894J4555l9531
9338a65870O3509p7845C867c61101b87A57414n6894k3847a56174K9217F4999i9024
9325A0903b29065j51915A21627a71009m0015O0141A08962b17925A46775j2020
9315A34755c5935H913e2851p0819J5438F8317a19901e1005j02130D6271e7134
9303c2158c05B19044E8672d4283j9118o7064B65070a20629N9581B50134J82937
$$ y = [-174868, 197634, -334244, -181083, -178327, -256074, 17931, -148261, -175912, 17577, -109067, -89995, -8782, -221310, -93549, -365930, -44895, -20925, -125880, -28018, -88080, 21657, 69745, 189362, -330634, -107636, -123227, 146146, -28446, -462968, 135757, -9302, 47395, 137722, -49872, -274315, -325859, 126497, 127938, -277320, -32083, 226655, -140894, -126339, -165870, -102361, -180206, 3867, -361101, -287, 157414, 100520, 76673, -156174, -126957, 64999, -99024, 10903, -229065, -380980, 121627, -171009, -211024, -150883, 108962, -217925, 146775, 134755, -35935, 8913, -52851, -123670, -108232, 68317, -119901, -51005, -153135, 46271, -57134, -32158, -305, 219044, 58672, -44283, -63401, -130465, 265070, -120629, -61048, 250134, 433071]
9292D33071F2596J73118A1477a10927A02326R297e8430C5000h8872A89582a66883
9280b68290e9904m6131j8925r5493A0576b76266F089J94598C8896f9596A62843
9268a19327B87736H3937i2622D3379d11898b7538E1052a74423c4515P875k39935
9257b66575f2937k76393A61589b35001q395J8784f8161I5083a65185E126e5047
9245d4817k18168q1355F5450l2171a59797f9671E4387A029K04768c5541B10133
9233A97891j929A0729K70340i7460A46261J09118H196a11420b4481o5678A11737
9221a16156q1040n0655d4519k24177J11714C2527L78746A31710g0817B0196a30269
9209a87589c3196B37213H9603b02762o7417a9102A20427b45385B20776a88233
$$ y = [433071, 62596, 235714, 11477, -110927, 102326, 111623, -58430, 35000, -88872, 189582, -166883, -268290, -59904, -106035, -124960, -220453, 10576, -276266, 6089, 200687, 38896, -69596, 162843, -119327, 287736, 83937, -92622, 43379, -411898, -27538, 51052, -174423, -34515, -26640, -266575, -62937, -339330, 161589, -235001, -243396, -224612, -68161, 95083, -165185, 5126, -55047, -44817, -262985, -344340, 65450, 33279, -159797, -69671, 54387, 1029, 205797, -35541, 210133, 197891, 195962, 10729, 281069, -97460, 146261, 255379, 8196, -111420, -24481, -90159, 111737, -116156, -197196, -247851, -44519, -268696, -156982, 32527, 411273, 131710, -70817, 20196, -130269, -187589, -33196, 237213, 89603, -202762, -270179, -19102, 120427, -245385, 220776, -188233]
9198A13720K30031d2751k3508k34474g5348k53328B086J61452a34786m0814F79
9186g803k2977j369I3412k7838R1395c9829j55161N3446I0296J57626d54995A96217
9173E0388c6172k74248a40564N2097k46506I2541J63794b6527C3702c70183E6910
9161b32075A50388F4860h5654k8076k2708d7344j80577R7443j6618C2801a52615
9149a1490j69989a8718k10450B0179i0119r8259C0561b20041f2489a737k92689
9138b94426i077B94751A16517a85229J6842P8772K698C99949A31533a73126j34448
9127c07574L1975A34198A8861i5972H4706a58411A73151a00123k9386H6777a62153
9115a02440k8240O0728A44801c43737N1838N0771i7045c9649j21853N8360p0161
$$ y = [113720, 343751, -42751, -66259, -300733, -75348, -328676, 2086, 163538, -134786, -175600, 679, -7803, -30780, -32149, 93412, 65574, 156969, -39829, -194990, -141544, 90296, 247922, -454995, 196217, 50388, -36172, -310420, -140564, -88467, -334973, 92541, 256335, -26527, 33702, -370183, 56910, -232075, 150388, 64860, -85654, -113730, -136438, -47344, -227921, -130478, -147096, 32801, -152615, -11490, -181479, -18718, -229168, 20179, -90119, -188378, 30561, -220041, -62489, -1737, -294426, -9077, 294751, 116517, -185229, -168387, -89615, -86917, 399949, 131533, -173126, -307574, -275599, 134198, 18861, -95972, 84706, -158411, 173151, -100123, -129509, 86777, -162153, -102440, -130680, -69952, 144801, -343737, -291899, -241128, -97045, -39649, -161502, -103142, -173303]
9104a73303J3984A22793a07314b2152j24138k62992B61148b76501j74438B10751
9093a35959A53515a29782o0031b7202C12005b2705q6083m86154c1864j69927d5562
9081H3226K81767c7441o2174c3191H2438J0077P8220f6213j60766a07780A34347
9069a31012B06877c4092r195B8250a77843M1417e7150B74733h7642C7547a91777
9057g3209l83193H5742d19671a06651F4033b04363e7287j92316R7777F6158J36158
9046B02316i074j06689K759d5262A47759g808B04154c5754B1029F092K2016L379
9034C1487d6788b1548j87902B1968a57576A10182A5074a24461L9044c5620E9524
9022A0004b33502i8725d6146E2411a63897c4336l28317A07726b14224c565A54353
$$ y = [-173303, -159319, 122793, -107314, -22152, -146290, -409282, 261148, -276501, -450939, 210751, -135959, 153515, -129782, -189813, -27202, 312005, -22705, -108788, -594942, -31864, -201791, -45562, 83226, 364993, -37441, -99615, -33191, 82438, 92515, 170735, -66213, -226979, -107780, 134347, -131012, 206877, -34092, -43287, 28250, -177843, -136426, -57150, 274733, -87642, 37547, -191777, -73209, -456402, 85742, -419671, -106651, 64033, -204363, -57287, -249603, -151826, 66158, 202316, -9074, -115763, -113004, -45262, 147759, -7808, 204154, -35754, 21029, 6092, 28108, 31487, -46788, -21548, -209450, 21968, -157576, 110182, 15074, -124461, -85417, -35620, 59524, 10004, -233502, -98725, -46146, 52411, -163897, -34336, -362653, 107726, -214224, -3565, 154353]
9010g2203K9947n8395c7990A45243e016k16066m9581A061K9538a09186j9290d2096
8997b98085J44147m70624E3232e0393A58882o5495P2D4121b48715A3960J30359
8986A44319Q67k0018r521a45345o942e4063B85251a30303K7192E2771a30822A71767
8973a59749j66816j7463A9999f7565j21461h5042l85781g037A40666n9790d6957
8961b42075A26213b36611I9431l6399M632g5059o1325C06552I3497C0960e9559
8949A47591P2518l3144a373B27196g5687D1553J96526B3083e5064F1675a03061
8937B46685l5971a30971e6122B40709P1279N2954I6476M2864D2188m172J9302
8926E7318b30629C13626n1302g6003E91085J791412p9784D96543B08038I0563
$$ y = [-72203, -42256, -100651, -37990, 145243, -5016, -221082, -270663, 1061, 30599, -109186, -128476, -42096, -298085, -153938, -624562, 53232, -50393, 158882, 93387, 93459, 44121, -248715, 13960, 144319, 145186, 125168, 115647, -145345, -152287, -54063, 285251, -130303, -103111, 52771, -130822, 171767, -159749, -326565, -344028, 19999, -67565, -189026, -85042, -470823, -7037, 140666, 80876, -46957, -242075, 126213, -236611, 99431, 63032, 67664, -75059, -136384, 306552, 93497, 30960, -59559, 147591, 220109, 186965, -1373, 227196, -75687, 41553, 238079, 23083, -55064, 61675, -103061, 246685, 210714, -130971, -56122, 240709, 311988, 364942, 96476, 139340, 42188, 38016, 57318, -230629, 313626, 262324, -76003, 591085, 2382497, 2302713, 496543, 208038, 90563]
8915b694e94l66467a9386l01462Q3330m142C34796A00616K42244A26402b72715
8903B799a18106E397f6230j2930A12497D0378B981d39771A17587c1914h171j37196
8891a45367A5075a33232J104f2620A00827a09703J7301j755j11149j16610C36849
8879a76244b1148A83887a62893J990D5304a22557I9350k813k4894N9782M4956
8868A76381a02617I661J33399a92131l843d9141F2908Q3688G833J0304a9399A8824
8855A32859b0758l08627a08156j36023L0108n3862J29003l73005a37915c2763
$$ y = [-2694, -594, -367061, -19386, -320848, -237518, -241660, 334796, 100616, 342860, 126402, -272715, 2799, -118106, 5397, -66230, -79160, 112497, 40378, 2981, -439771, 117587, -31914, -8171, -145367, 15075, -133232, -132128, -62620, 100827, -109703, -92402, -94157, -205306, -321916, 336849, -176244, -21148, 183887, -162893, -160903, 45304, -122557, 99350, 96537, 71643, 131425, 176381, -102617, 9661, 143060, -192131, -195974, -49141, 62908, 146596, 7833, 18137, -19399, 18824, 132859, -20758, -329385, -108156, -244179, -214071, -267933, -138930, -511935, -137915, -32763]
$$ [...]
##END NTUPLES=NMR SPECTRUM
##END=
