##TITLE=NES1067_Nhol10909_9883707_NhqFqdgz2h
##JCAMPDX= 6.0         $$ Bruker NMR JCAMP-DX V2.0
##DATA TYPE= NMR SPECTRUM
##DATA CLASS= NTUPLES
##ORIGIN= BRUKER
##OWNER= Administrator
$$ 1.72 TOPSPIN		Version 2.1
$$ 2016-08-27 02:29:12.492 -0500  Administrator@X
$$ Compression mode = diff/dup
##.OBSERVE FREQUENCY= 400.02188249412
##.OBSERVE NUCLEUS= ^1H
##.ACQUISITION MODE= SIMULTANEOUS (DQD)
##.ACQUISITION SCHEME= undefined
##.AVERAGES= 64
##.DIGITISER RES= 22
##SPECTROMETER/DATA SYSTEM= spect
##.PULSE SEQUENCE= noesygpps1d.comp
##.SOLVENT NAME= COFFEE_meoh
##.SHIFT REFERENCE= INTERNAL, COFFEE_meoh, 1, 14.96148
##AUDIT TRAIL= $$ (NUMBER, WHEN, WHO, WHERE, PROCESS, VERSION, WHAT)
$$ ##TITLE= Audit trail, TOPSPIN		Version 2.1
$$ ##JCAMPDX= 5.01
$$ ##ORIGIN= Bruker BioSpin GmbH
$$ ##OWNER= Administrator
$$ $$ E:\/data/COFFEE/nmr/NES1067_Nhol10909_9883707_NhqFqdgz2h/22/pdata/1/auditp.txt
$$ ##AUDIT TRAIL=  $$ (NUMBER, WHEN, WHO, WHERE, PROCESS, VERSION, WHAT)
(   1,<2016-08-27 02:29:07.242 -0500>,<Administrator>,<X>,<go>,<TOPSPIN 2.1>,
      <created by zg
	started at 2016-08-27 02:17:36.851 -0500,
	POWCHK enabled, PULCHK disabled,
       configuration hash MD5:
       21 0F 79 D6 B3 7B B4 F6 88 20 88 DB 03 48 BD 9F
       data hash MD5: 64K
       57 A3 25 88 02 04 92 F2 69 0D 47 E6 38 87 D3 F5>)
(   2,<2016-08-27 02:29:10.398 -0500>,<Administrator>,<X>,<proc1d>,<TOPSPIN 2.1>,
      <Start of raw data processing
       efp LB = 0.3 FT_mod = 6 PKNL = 1 PHC0 = 0 PHC1 = 0 SI = 128K 
       data hash MD5: 128K
       64 47 F5 3C 67 17 73 49 37 47 20 57 F8 70 AC 1D>)
(   3,<2016-08-27 02:29:11.289 -0500>,<Administrator>,<X>,<proc1d>,<TOPSPIN 2.1>,
      <pk PHC0 = -82.64465 PHC1 = 0 
       data hash MD5: 128K
       36 FC 2E 5D 7D B3 F8 FA DC F5 1A 3B 3F 5D 35 14>)
(   4,<2016-08-27 02:29:11.664 -0500>,<Administrator>,<X>,<proc1d>,<TOPSPIN 2.1>,
      <abs ABSG = 1 
       data hash MD5: 128K
       2F C1 72 1D 60 A2 B5 42 3E 89 00 8B 2B 88 93 32>)
(   5,<2016-08-27 02:29:11.773 -0500>,<Administrator>,<X>,<proc1d>,<TOPSPIN 2.1>,
      <abs ABSG = 2 
       data hash MD5: 128K
       81 D6 2F 24 9E 24 05 A8 82 82 F2 E8 2B 8C 06 65>)
(   6,<2016-08-27 02:29:11.851 -0500>,<Administrator>,<X>,<proc1d>,<TOPSPIN 2.1>,
      <abs ABSG = 3 
       data hash MD5: 128K
       9E DD 0A 34 B9 A9 A0 E2 3B 2C 7C 87 49 1E DB 88>)
(   7,<2016-08-27 02:29:11.945 -0500>,<Administrator>,<X>,<proc1d>,<TOPSPIN 2.1>,
      <abs ABSG = 4 
       data hash MD5: 128K
       D2 CA 85 D4 44 13 C8 39 49 B0 20 66 89 74 25 CC>)
(   8,<2016-08-27 02:29:12.039 -0500>,<Administrator>,<X>,<proc1d>,<TOPSPIN 2.1>,
      <abs ABSG = 5 
       data hash MD5: 128K
       2F 43 96 7E 1E F3 E1 6D 58 5D 9B B8 FA CE 1E 17>)
$$ ##END=
$$ 
$$ $$ hash MD5
$$ $$ 99 BF 83 C6 38 0E B7 40 82 97 39 77 22 6E 41 10
##$RELAX= 
##$RELAX= 
##$RELAX= 
##$RELAX= 
##$RELAX= 
##$RELAX= 
##$RELAX= 
##$RELAX= 
$$ Bruker specific parameters
$$ --------------------------
##$DU= <E:\>
##$EXPNO= 22
$$ [...]
##$TP07= 0
##$TPNAME0= <>
##$TPNAME1= <>
##$TPNAME2= <>
##$TPNAME3= <>
##$TPNAME4= <>
##$TPNAME5= <>
##$TPNAME6= <>
##$TPNAME7= <>
##$TPOAL= (0..7)
0.5 0.5 0.5 0.5 0.5 0.5 0.5 0.5
##$TPOFFS= (0..7)
0 0 0 0 0 0 0 0
##$TUNHIN= 0
##$TUNHOUT= 0
##$TUNXOUT= 0
##$USERA1= <user>
##$USERA2= <user>
##$USERA3= <user>
##$USERA4= <user>
##$USERA5= <user>
##$V9= 5
##$VALIST= <valist>
##$VCLIST= <CCCCCCCCCCCCCCC>
##$VD= 0
##$VDLIST= <DDDDDDDDDDDDDDD>
##$VPLIST= <PPPPPPPPPPPPPPP>
##$VTLIST= <TTTTTTTTTTTTTTT>
##$WBST= 2048
##$WBSW= 25
##$XGAIN= (0..3)
0 0 0 0
##$XL= 0
##$YL= 0
##$YMAX_a= 6972037
##$YMIN_a= -12709175
##$ZGOPTNS= <>
##$ZL1= 120
##$ZL2= 120
##$ZL3= 120
##$ZL4= 120
##$ABSF1= 14.96148
##$ABSF2= -5.596702
##$ABSG= 5
##$ABSL= 3
##$ALPHA= 0
##$AQORDER= 0
##$ASSFAC= 0
##$ASSFACI= 0
##$ASSFACX= 0
##$ASSWID= 0
##$AUNMP= <proc_prof1d_extract.lims>
##$AXLEFT= 0
##$AXNAME= <>
##$AXNUC= <1H>
##$AXRIGHT= 0
##$AXTYPE= 0
##$AXUNIT= <>
##$AZFE= 0.1
##$AZFW= 0.1
##$BCFW= 0
##$BC_mod= 0
##$BYTORDP= 0
##$COROFFS= 0
##$CY= 15
##$DATMOD= 1
##$DC= 0
##$DFILT= <>
##$DTYPP= 0
##$F1P= 0
##$F2P= 0
##$FCOR= 0.5
##$FTSIZE= 131072
##$FT_mod= 6
##$GAMMA= 0
##$GB= 0
##$INTBC= 1
##$INTSCL= 1
##$ISEN= 128
##$LB= 0.3
##$LEV0= 0
##$LPBIN= 0
##$MAXI= 10000
##$MC2= 0
##$MEAN= 0
##$ME_mod= 0
##$MI= 0
##$NCOEF= 0
##$NC_proc= -2
##$NLEV= 6
##$NOISF1= 0
##$NOISF2= 0
##$NSP= 0
##$NTH_PI= 0
##$NZP= 0
##$OFFSET= 14.96148
##$PC= 1
##$PHC0= -82.64465
##$PHC1= 0
##$PH_mod= 1
##$PKNL= yes
##$PPARMOD= 0
##$PPDIAG= 0
##$PPIPTYP= 0
##$PPMPNUM= 2147483647
##$PPRESOL= 1
##$PSCAL= 4
##$PSIGN= 0
##$PYNMP= <proc.py>
##$REVERSE= no
##$SF= 400.020009446058
##$SI= 131072
##$SIGF1= 0
##$SIGF2= 0
##$SINO= 400
##$SIOLD= 131072
##$SPECTYP= <>
##$SREGLST= <1H.CDCl3>
##$SSB= 0
##$STSI= 131072
##$STSR= 0
##$SW_p= 8223.68421052631
##$SYMM= 0
##$S_DEV= 0
##$TDeff= 65536
##$TDoff= 0
##$TI= <>
##$TILT= no
##$TM1= 0
##$TM2= 0
##$TOPLEV= 0
##$USERP1= <user>
##$USERP2= <user>
##$USERP3= <user>
##$USERP4= <user>
##$USERP5= <user>
##$WDW= 1
##$XDIM= 131072
##$YMAX_p= 376163388
##$YMIN_p= -12810
##$CURPLOT= <Network HP LaserJet P1505>
##$CURPRIN= <$Network HP LaserJet P1505>
##$DFORMAT= <normdp>
##$LAYOUT= <+/1D_H.xwp>
##$LFORMAT= <normlp>
##$PFORMAT= <normpl>
##$SURQMSG= 1
$$ End of Bruker specific parameters
$$ ---------------------------------
##NTUPLES= NMR SPECTRUM
##VAR_NAME=  FREQUENCY,     SPECTRUM/REAL,   SPECTRUM/IMAG
##SYMBOL=    X,             R,               I
##VAR_TYPE=  INDEPENDENT,   DEPENDENT,       DEPENDENT
##VAR_FORM=  AFFN,          ASDF,            ASDF
##VAR_DIM=   131072,        131072,          131072
##UNITS=     HZ,            ARBITRARY UNITS, ARBITRARY UNITS
##FACTOR=    0.0627417313425164, 1,          1
##FIRST=     8223.62146879497, 495,          -58991
##LAST=      0,             3266,            -58956
##MIN=       0,             -12810,          0
##MAX=       8223.62146879497, 376163388,    0
$$ Real data points
##PAGE= N=1
##DATA TABLE= (X++(R..R)), XYDATA
$$ [...]
61260A321663R326O863N950N881N639N299N675P047R023J1493J4829J9086K3722
$$ 1321663 1330989 1337852 1343802 1349683 1355322 1360621 1366296 1373343 1382366 1393859 1408688 1427774 1451496
61247A451496K8232L2491L6275L8833L9214L6705L0961K2181J1404L07r654j7987
$$ 1451496 1479728 1512219 1548494 1587327 1626541 1663246 1694207 1716388 1727792 1728099 1718445 1700458
61235A700458k5122l1698l7789m2723m5844m7455m8608m9650m9478m6862m2232
$$ 1700458 1675336 1643638 1605849 1563126 1517282 1469827 1421219 1371569 1322091 1275229 1232997
61224A232997l7367l3284k9342k4795k0554j8670k0167k3948k7936l0885l2803
$$ 1232997 1195630 1162346 1133004 1108209 1087655 1068985 1048818 1024870 996934 966049 933246
61213I33246l3880l3638l1476k7638k3145j8762j4559j0480o689l197L54M090
$$ 933246 899366 865728 834252 806614 783469 764707 750148 739668 732979 729782 730136 734226
61201G34226P588J0453J2694J4102J3799J1151O817K366r84k756k806j360O12
$$ 734226 741814 752267 764961 779063 792862 804013 810830 813196 812212 809456 806650 805290 805902
61188H05902J837J810J101N43L97K05p81k809n029o054n494m520m355m755m734
$$ 805902 807739 809549 810650 811193 811590 811795 811014 808205 803176 797122 791628 787108 782753 777998 773264
61173G73264m263m215m874n606o095o777p856q821r327r678j0011r779q536o673
$$ 773264 769001 764786 759912 754306 748211 741434 733578 724757 715430 705752 695741 685962 677426 670753
61159F70753m810k947p08J877M201N364M418Q46m758j0704j5379j8279j9847k0698
$$ 670753 665943 662996 662288 664165 668366 673730 678148 678994 674236 663532 648153 629874 610027 589329
61145E89329k1146k1161k0425j8678j6287j4208j3101j2617j1811j0199q237o884
$$ 589329 568183 547022 526597 507919 491632 477424 464323 451706 439895 429696 421459 414575
61133D14575o618o915o747n742m586m052l982l662k887k000j106l1R75J362J235
$$ 414575 407957 401042 394295 388553 383967 379915 375933 372271 369384 367384 366278 366247 367222 368584 369819
61118C69819J414K256L224L947M888O405P847Q391Q289Q351Q366O973L414j229
$$ 369819 371233 373489 376713 380660 385548 391953 399800 408191 416480 424831 433197 440170 443584 442355
61104D42355m981o916p675q209q552q154o930n376l725j840r9N21j77q96l86R13
$$ 442355 437374 430458 422783 414574 406022 397868 390938 385562 381837 379997 379898 380419 380242 379346 378960 379873
61088C79873J634J484J317J440J213M03k82l61k24j40L38J443K487K759K452K080
$$ 379873 381507 382991 384308 385748 386961 387364 387082 386721 386497 386357 386695 388138 390625 393384 395836 397916
61072C97916J633R90O39J139K197K938K983K752K711K866K942K828K681K728K958
$$ 397916 399549 400539 401178 402317 404514 407452 410435 413187 415898 418764 421706 424534 427215 429943 432901
61057D32901L132L189L469M218N130N722O003O268O506O568O730P437Q593R768
$$ 432901 436033 439222 442691 446909 452039 457761 463764 470032 476538 483106 489836 497273 505866 515634
61043E15634J0906J2148J3170J3582J3794J4643J6265J8196K0268K2517K4500
$$ 515634 526540 538688 551858 565440 579234 593877 610142 628338 648606 671123 695623
61032F95623K5926K7694L0929L5176L8905M1537M3390M4091M3140M2069M3634
$$ 695623 721549 749243 780172 815348 854253 895790 939180 983271 1026411 1068480 1112114
61021A112114M8494N4876O1920P0723Q1372R1696J00168J07600J15047J23130
$$ 1112114 1160608 1215484 1277404 1348127 1429499 1521195 1621363 1728963 1844010 1967140
61011A967140J34793J55152J86398K26320K74275L34568M10798N02008O09686
$$ 1967140 2101933 2257085 2443483 2669803 2944078 3278646 3689444 4191452 4801138
61002D801138P43859R16122J132958J403967J741131K114966K399491K398221
$$ 4801138 5544997 6461119 7594077 8998044 10739175 12854141 15253632 17651853
60994A7651853J981828J224974L90886k40365n34267n11378k48708J71302O13423
$$ 17651853 19633681 20858655 21249541 21009176 20474909 19963531 19714823 19886125 20499548
60985B0499548Q60176P09725J34686o70885j419702j911923k110144k084877j926995
$$ 20499548 21359724 22069449 22204135 21533250 20113548 18201625 16091481 14006604 12079609
60976A2079609j706215j470095j247505j049316q76010p27436o03774n01706m15960
$$ 12079609 10373394 8903299 7655794 6606478 5730468 5003032 4399258 3897552 3481592
60967C481592l44134k86358k41273k05694j77358j55156j37393j22387j10024
$$ 3481592 3137458 2851100 2609827 2404133 2226775 2071619 1934226 1811839 1701815
60958A701815j00410r1822q2285p2420o4276n7993n1987m6078m1898m0286m0346
$$ 1701815 1601405 1509583 1427298 1354878 1290602 1232609 1180622 1134544 1092646 1052360 1012014
60947A012014m1136m2303m2902m1558l8326l4864l2404l0651k8851k6718k4237
$$ 1012014 970878 928575 885673 844115 805789 770925 738521 707870 679019 652301 628064
60936F28064k1603j9431j8006j6485j3989j1187r539r106q599p506o633o322n732
$$ 628064 606461 587030 569024 552539 538550 527363 517824 508718 500119 492613 485980 479658 473926
60923D73926m328k785j824j283q78q70j365j800j742j480j389j334j130j068j544
$$ 473926 469598 466813 464989 463706 462828 461958 460593 458793 457051 455571 454182 452848 451718 450650 449106
60908D49106k583l881m972n321m843m304m555n337n586m915m112l962m363m718
$$ 449106 446523 442642 437670 432349 427506 423202 418647 413310 407724 402809 398697 394735 390372 385654
60894C85654m581l748k360j060m73m83n30n67j001j734k165k145k085k045j623
$$ 385654 381073 377325 374965 373905 373432 372949 372419 371852 370851 369117 366952 364807 362722 360677 359054
60879C59054q95n20o67p39m49k23k57o0N65J009P95L11O7k2j20L1N47R99J093
$$ 359054 358159 357639 356972 356233 355784 355561 355304 355244 355809 356818 357613 357924 357991 357969 357849 357880 358427 359426 360519
60860C60519J080J025M40p69j758j892j682j735j555l22J554K808K939K432J588
$$ 360519 361599 362624 363064 362295 360537 358645 356963 355228 353673 353351 354905 357713 360652 363084 364672
60845C64672K19j430k492k529k093j955k250k679l000l097k869k375j808j242
$$ 364672 364891 363461 360969 358440 356347 354392 352142 349463 346463 343366 340497 338122 336314 335072
60831C35072o00L7L84L29J58J97M40O31O72P52J099J619J914J690J107O27N35
$$ 335072 334472 334509 334893 335222 335380 335577 336017 336648 337320 338072 339171 340790 342704 344394 345501 346128 346663
60814C46663P39R76J054Q84N29K41K36L87L17j62q61j494j857j841j594j605k250
$$ 346663 347402 348378 349432 350316 350845 351086 351322 351709 352026 351864 351003 349509 347652 345811 344217 342612 340362
60797C40362l238l873l871l446k745j709o69k79o41j065j038q79j100j629k080
$$ 340362 337124 333251 329380 325934 323189 321480 320811 320532 319891 318826 317788 316909 315809 314180 312100
60782C12100k319k357k129j730j443j224p21j17j89j015j448o84L80L82m53p46
$$ 312100 309781 307424 305295 303565 302122 300898 300177 300060 299871 298856 297408 296724 297104 297486 297033 296287
60766B96287q6N80O91Q11J291J410N48o44j044n66r6k04n13k48R30K622L955M263
$$ 296287 296201 296781 297472 298283 299574 300984 301532 300888 299844 299278 299182 298978 298465 298217 299147 301769 305724 309987
60748C09987L642K788K185J723J120M26j53o77j368k195k834l115l242l451l530
$$ 309987 313629 316417 318602 320325 321445 321871 321718 321041 319673 317478 314644 311529 308287 304836 301306
60733C01306l012j912j036j210k233l072l093k722k639k872k991k830k519k141
$$ 301306 298294 296382 295346 294136 291903 288831 285738 283016 280377 277505 274514 271684 269165 267024
60719B67024j730j446j289j012n82m93j001j518j364p95n60p10o94m75o16j210
$$ 267024 265294 263848 262559 261547 260965 260472 259471 257953 256589 255794 255234 254524 253830 253355 252739 251529
60703B51529j647j608j398j159o09J54M61Q3l11j63K15L60M29P58J207J495J644
$$ 251529 249882 248274 246876 245717 245108 245262 245723 245806 245495 245332 245547 245907 246336 247094 248301 249796 251440
60686B51440J633J209N51M69J299K188K208J664J533J994K335K090J507J048J064
$$ 251440 253073 254282 254833 255302 256601 258789 260997 262661 264194 266188 268523 270613 272120 273168 274232
60671B74232J728K629K777J749N29L60J044J323P94L22M96Q23P80O43P23O65R0
$$ 274232 275960 278589 281366 283115 283644 284004 285048 286371 287165 287487 287983 288806 289586 290229 290952 291617 291707
60654B91707o27q50m68K34J010J519J338N70l8j26l34j327k610l133k736k206
$$ 291707 291080 290230 289762 289996 291006 292525 293863 294433 294395 294269 293935 292608 289998 286865 284129 281923
60638B81923k016j840j410j040j036j138r36m34J32O15R19Q85N84M40P31J204
$$ 281923 279907 278067 276657 275617 274581 273443 272507 272073 272205 272820 273739 274624 275208 275648 276379 277583
60622B77583J443J446J399J161M90k60k72O85J813K271K120J978K059K090J954
$$ 277583 279026 280472 281871 283032 283522 283262 282990 283675 285488 287759 289879 291857 293916 296006 297960
60607B97960J769J464Q74L35M76J177J446P00m10r92j150j599k433l113l490l949
$$ 297960 299729 301193 302067 302402 302878 304055 305501 306201 305791 304799 303649 302050 299617 296504 293014 289065
60591B89065m506m567l796k629j646j001o59o74r17j038r65j016j253j245q37
$$ 289065 284559 279992 276196 273567 271921 270920 270261 269587 268670 267632 266667 265651 264398 263153 262316
60576B62316n83q72j171p88m4J41l66p96o89m24l32J8J110K562L343K815J317
$$ 262316 261733 260861 259690 258902 258858 258999 258633 257837 257148 256724 256392 256410 257520 260082 263425 266240 267557
60559B67557o1k68Q69K335K790K004J151J397K523L367L351K960K829L006L387
$$ 267557 267496 267228 268097 270432 273222 275226 276377 277774 280297 283664 287015 289975 292804 295810 299197
60544B99197M153N336O339O554O335O817Q654J1381J4075J6288J8219K0386K3372
$$ 299197 303350 308686 315025 321579 327914 334731 343385 354766 368841 385129 403348 423734 447106
60531D47106K7467L2154L6168L8400L8552L6665L2476K5799J7292Q139r36r665
$$ 447106 474573 506727 542895 581295 619847 656512 688988 714787 732079 740218 739282 729617
60519G29617j7333k2823k5820k7164k7565k6730k4314k1047j8020j5295j2174
$$ 729617 712284 689461 663641 636477 608912 582182 557868 536821 518801 503506 491332
60508D91332q649n573l328j230J494M804Q333J2067J6080J9991K3182K5302K6209
$$ 491332 482683 477110 473782 472552 474046 478850 487183 499250 515330 535321 558503 583805 610014
60495F10014K5664K3550K0211J6219J1893P398L147k53k503l746m230m191m069
$$ 610014 635678 659228 679439 695658 707551 714949 718096 717843 715340 711594 707364 703173 699104
60482F99104m441n462o547o795n694l349j27L781Q506J4269K0963K8047L5063
$$ 699104 694663 689201 682654 675859 670165 666816 666689 670470 678976 693245 714208 742255 777318
60469G77318M2267N0523O0396P1571Q3400R5628J08024J19381J27436J29991J25689
$$ 777318 819585 870108 930504 1002075 1085475 1181103 1289127 1408508 1535944 1665935 1791624
60458A791624J13607R2951O3957K8885q603m4966p7342j03054j20003j28032j29098
$$ 1791624 1905231 1998182 2062139 2091024 2082421 2037455 1960113 1857059 1737056 1609024 1479926
60447A479926j25446j18159j07979r6623q6077p6813o7826n8565m9837m2608l6826
$$ 1479926 1354480 1236321 1128342 1031719 945642 868829 801003 742438 692601 649993 613167
60436F13167l2010k8196k5572k3620k1480j9013j6828j5210j3683j1771r705q052
$$ 613167 581157 552961 527389 503769 482289 463276 446448 431238 417555 405784 396079 388027
60424C88027o944n944m636l071j713r90r81j401j905k335k690k982l190l245k957
$$ 388027 381083 375139 370503 367432 365719 364729 363748 362347 360442 358107 355417 352435 349245 346000 343043
60409C43043k056o06P02J018L16m38l43M16R58R66J052J725K628L135L320L733
$$ 343043 340987 340381 341083 342101 342417 341979 341636 342052 343010 343976 345028 346753 349381 352516 355836 359569
60393C59569M375M597M140L637L725M107M012L319K644K404K370K193J901J632
$$ 359569 363944 368541 372681 376318 380043 384150 388162 391481 394125 396529 398899 401092 402993 404625
60379D04625J320R23O80Q09J062R75N11J72L48Q56J222J273J197J071P16J18k73
$$ 404625 405945 406868 407548 408357 409419 410394 410905 411077 411425 412281 413503 414776 415973 417044 417760 417878 417605
60362D17605qO95J125J015Q87J277J972K389K408K441K740L177L702M538N672
$$ 417605 417597 418292 419417 420432 421319 422596 424568 426957 429365 431806 434546 437723 441425 445963 451635
60347D51635O524O393N126L235J509N58M54N87J73r79k248k898k807k417k170
$$ 451635 458159 464552 469678 472913 474422 474980 475434 476021 476194 475215 472967 470069 467262 464845 462675
60332D62675k197k356k371k000j323p84q31j454k221k689k809k925l357l935m028
$$ 462675 460478 458122 455751 453751 452428 451644 450813 449359 447138 444449 441640 438715 435358 431423 427395
60317D27395l313k342j992k341k651k500k327k464k372j469k58K63J28L84J478
$$ 427395 424082 421740 419748 417407 414756 412256 409929 407465 405093 403624 403366 403629 403757 404141 405619
60302D05619K571K825K596K751L239L129J935L54n07l00K13j4j250k714l493l589
$$ 405619 408190 411015 413611 416362 419601 422730 424665 425019 424512 424212 424425 424411 423161 420447 416954 413365
60286D13365l771m409m942m739m072l683l704l518k656j391l66L7j34m55l13O87
$$ 413365 409594 405185 400243 395504 391432 387749 384045 380527 377871 376480 376114 376151 376017 375562 375249 375936
60270C75936K298L830M831N335N479N177M364L316K482K135K256K603K787K563
$$ 375936 378234 382064 386895 392230 397709 402886 407250 410566 413048 415183 417439 420042 422829 425392
60256D25392K098J792J699J420P11j17n85n19M0J092K442L585M248M801N747P018
$$ 425392 427490 429282 430981 432401 433112 432995 432410 431891 431931 433023 435465 439050 443298 448099 453846 460864
60240D60864Q251R540J1216J3038J4277J4837J5561J7196J9477K1591K3132K4294
$$ 460864 469115 478655 489871 502909 517186 532023 547584 564780 584257 605848 628980 653274
60228F53274K5516K7225K9652L2584L5477L7957M0034M1657M2513M2468M1777
$$ 653274 678790 706015 735667 768251 803728 841685 881719 923376 965889 1008357 1050134
60217A050134M0584L8507L5133L0667K5815K1163J6905J2841Q400L130k469p039
$$ 1050134 1090718 1129225 1164358 1195025 1220840 1242003 1258908 1271749 1280149 1283279 1280810 1273771
60205A273771r774j1372j3038j4895j6005j5751j4365j2221r348n841k074J679
$$ 1273771 1263997 1252625 1239587 1224692 1208687 1192936 1178571 1166350 1157002 1151161 1149087 1150766
60193A150766N476R439J3628J8241K3409K8812L3872L8422M2729M6743M9845N1438
$$ 1150766 1156242 1165681 1179309 1197550 1220959 1249771 1283643 1322065 1364794 1411537 1461382 1512820
60181A512820N1364M9670M6439M2023L6990L1647K5897J9594J2721N230k747j0518
$$ 1512820 1564184 1613854 1660293 1702316 1739306 1770953 1796850 1816444 1829165 1834395 1831648 1821130
60169A821130j7273k2964k8089l2527l5467l6730l7239l7578l6905l4088k9300
$$ 1821130 1803857 1780893 1752804 1720277 1684810 1648080 1610841 1573263 1536358 1502270 1472970
60158A472970k3691j7892j1808n537N07O337J2370J8455K3668K7291K9456L0527
$$ 1472970 1449279 1431387 1419579 1414042 1414549 1420886 1433256 1451711 1475379 1502670 1532126 1562653
60146A562653L0361K8529K4910J9827J3844P658J962k858o843j0180j2910j4928
$$ 1562653 1593014 1621543 1646453 1666280 1680124 1687782 1689744 1686886 1680043 1669863 1656953 1642025
60134A642025j6111j6353j5620j4091j2099r853p247m023q4M476R577J5358K2017
$$ 1642025 1625914 1609561 1593941 1579850 1567751 1557898 1550651 1546628 1546544 1551020 1560597 1575955 1597972
60121A597972K9500L7473M5685N4276O3491P3206Q2944R2300J01073J08976J15552
$$ 1597972 1627472 1664945 1710630 1764906 1828397 1901603 1984547 2076847 2177920 2286896 2402448
60110B402448J20393J23172J23459J20896J15633J08231R8938Q7469P3729N8292
$$ 2402448 2522841 2646013 2769472 2890368 3006001 3114232 3213170 3300639 3374368 3432660
60100C432660M1909K4895P299j0633k8518m5952o2198p6126q6982r4970j00676
$$ 3432660 3474569 3499464 3506763 3496130 3467612 3421660 3359462 3283336 3196354 3101384 3000708
60089C000708j04144j05040j03414r9703r4129q6707p7851o8371n8767m8968l8854
$$ 3000708 2896564 2791524 2688110 2588407 2494278 2407571 2329720 2261349 2202582 2153614 2114760
60078B114760k8642j8725r399q23P105J4717K1991K8047L1706L2646L1624K9433
$$ 2114760 2086118 2067393 2057994 2057171 2064276 2078993 2100984 2129031 2160737 2193383 2225007 2254440
60066B254440K6144K1515J5699R205K438m387j1045j7293k3064k8411l3350l7812
$$ 2254440 2280584 2302099 2317798 2327003 2329441 2325054 2314009 2296716 2273652 2245241 2211891 2174079
60054B174079m1829m5600m9238n2445n4610n5416n5253n4661n3461n0928m6948
$$ 2174079 2132250 2086650 2037412 1984967 1930357 1874941 1819688 1765027 1711566 1660638 1613690
60043A613690m2414l8121l3774k8616k2587j6257r931l489L092R707J6469K3404
$$ 1613690 1571276 1533155 1499381 1470765 1448178 1431921 1421990 1418501 1421593 1431300 1447769 1471173
60031A471173L0024L5836M1169M6591N1617N4924N5949N5313N3349M9353M2887
$$ 1471173 1501197 1537033 1578202 1624793 1676410 1731334 1787283 1842596 1895945 1945298 1988185
60020A988185L4923K6802J8645R688k26j0416k0430l0342l9843m7762n2905n5076
$$ 1988185 2023108 2049910 2068555 2078243 2078017 2067601 2047171 2016829 1976986 1929224 1876319 1821243
60008A821243n5069n3808n1651m8367m3700l7948l1875k6001k0178j4035p606
$$ 1821243 1766174 1712366 1660715 1612348 1568648 1530700 1498825 1472824 1452646 1438611 1431005
59997A431005j311M600J0348J6426K3222L0711L8375M5589N2206N8490O4324O8838
$$ 1431005 1429694 1434294 1444642 1461068 1484290 1515001 1553376 1598965 1651171 1709661 1773985 1842823
59985A842823P1197P1424O9956O6600O0656N2166M2363L2499K2738J2564J936
$$ 1842823 1914020 1985444 2055400 2122000 2182656 2234822 2277185 2309684 2332422 2344986 2346922
59974B346922q577j8639k8472l8147m6920n3618n7550n8874n8241n6254n3106
$$ 2346922 2338345 2319706 2291234 2253087 2206167 2152549 2094999 2036125 1977884 1921630 1868524
59963A868524m8583m2532l5497k8646k2703j7175j1002l966L133R670J5913K2312
$$ 1868524 1819941 1777409 1741912 1713266 1690563 1673388 1662386 1658420 1661553 1671223 1687136 1709448
59951A709448K8641L4340L9206M3225M6044M7233M6908M5519M3121L9424L4561
$$ 1709448 1738089 1772429 1811635 1854860 1900904 1948137 1995045 2040564 2083685 2123109 2157670
59940B157670K9205K3893J8712J3764R391N743K548m06k816m039l484p69M106
$$ 2157670 2186875 2210768 2229480 2243244 2252635 2258378 2260926 2260520 2257704 2253665 2250181 2249412 2253518
59927B253518J0586J7872K5644L4305M4343N5650O7573P9384R0517J00491J08868
$$ 2253518 2264104 2281976 2307620 2341925 2386268 2441918 2509491 2588875 2679392 2779883 2888751
59916B888751J15215J19091J20074J17813J11871J01642Q6633O6995M3702J8348
$$ 2888751 3003966 3123057 3243131 3360944 3472815 3574457 3661090 3728085 3771787 3790135
59906C790135p217l1345n3064p2054q8001j00212j08129j11938j12314j09786
$$ 3790135 3782918 3751573 3698509 3626455 3538454 3438242 3330113 3218175 3105861 2996075
59896B996075j04856r8361r1054q2933p3717o3829n4158m4859l5324k5431j5907
$$ 2996075 2891219 2792858 2701804 2618871 2545154 2481325 2427167 2382308 2346984 2321553 2305646
59885B305646p179J330J0222J9165K7369L4476M0459M5237M8777N1110N1853N0192
$$ 2305646 2298467 2299797 2310019 2329184 2356553 2391029 2431488 2476725 2525502 2576612 2628465 2678657
59873B678657M5773L9072L0599K0403Q873k772j3535k3568l3277m2120m9296n5111
$$ 2678657 2724430 2763502 2794101 2814504 2823377 2820605 2807070 2783502 2750225 2708105 2658809 2603698
59861B603698o0606o5891o9925p1907p2020p0631o7699o3257n7799n1806m5336
$$ 2603698 2543092 2477201 2407276 2335369 2263349 2192718 2125019 2061762 2003963 1952157 1906821
59850A906821l8369l1186k4300j8356j4166j2362j2844j4823j7384j9736k1035
$$ 1906821 1868452 1837266 1812966 1794610 1780444 1768082 1755238 1740415 1723031 1703295 1682260
59839A682260k0614j8487j5261j1567q090n977o312q708j1082j1361r196n757
$$ 1682260 1661646 1643159 1627898 1616331 1608241 1602264 1595952 1587244 1576162 1564801 1555605 1549848
59827A549848k247R45L935O812R304J0662J0065P412L647j12l545o934j0199j2675
$$ 1549848 1547601 1548546 1552481 1559293 1568597 1579259 1589324 1596736 1600383 1600271 1596726 1589792 1579593 1566918
59813A566918j3852j3912j3307j2310j1127j0035r084q005o827o188o396o433
$$ 1566918 1553066 1539154 1525847 1513537 1502410 1492375 1483291 1475286 1468459 1462271 1455875 1449442
59801A449442m792j408K069M301N702P267Q721Q932P741O224N059L693J551q40
$$ 1449442 1444650 1443242 1445311 1449612 1455314 1462581 1471302 1480234 1487975 1494199 1499258 1502951 1504502 1503662
59787A503662k453k967k824k440j821o98J312M451Q539J3140J8148K3826L0183
$$ 1503662 1501209 1498242 1495418 1492978 1491157 1490459 1491771 1496222 1504761 1517901 1536049 1559875 1590058
59774A590058L6815M3562N0804N8867O7713P7479Q8658J01218J14114J26117J36385
$$ 1590058 1626873 1670435 1721239 1780106 1847819 1925298 2013956 2115174 2229288 2355405 2491790
59763B491790J43325J43473J32730J09131P4265L2461j0812n0221q1788j03605
$$ 2491790 2635115 2778588 2911318 3020449 3094714 3127175 3116363 3066142 2984354 2880749
59753B880749j15583j18708j14820j06500r6178q5189p4041o3293n3539m4778
$$ 2880749 2765166 2646458 2531638 2425138 2328960 2243771 2169730 2106437 2052898 2008120
59743B008120l6581k8922k2096j5875r552k907L480R124J4169J8891K3248K7179
$$ 2008120 1971539 1942617 1920521 1904646 1895094 1892187 1895667 1904791 1918960 1937851 1961099 1988278
59731A988278L0961L5038L9773M5381N1704N8175O4513P1303P9347Q8615R8582
$$ 1988278 2019239 2054277 2094050 2139431 2191135 2249310 2313823 2385126 2464473 2553088 2651670
59720B651670J09436J21954J36092J50812J65572J80906J96905K12213K25327
$$ 2651670 2761106 2883060 3019152 3169964 3335536 3516442 3713347 3925560 4150887
59711D150887K36016K44381K49188K48366K41121K28571K12424J93955J74451
$$ 4150887 4386903 4631284 4880472 5128838 5369959 5598530 5810954 6004909 6179360
59702F179360J55581J38805J24715J13293J04369R7565R2061Q6875Q1312P5053
$$ 6179360 6334941 6473746 6598461 6711754 6816123 6913688 7005749 7092624 7173936 7248989
59692G248989O7883N9530M9733L8482K6152J3436J025j0604k1037k9612l5455
$$ 7248989 7316872 7376402 7426135 7464617 7490769 7504205 7505230 7494626 7473589 7443977 7408522
59681G408522l7860l6664l2268k5354j6459n657P359K2777M0234N8989P8546R8953
$$ 7408522 7370662 7333998 7301730 7276376 7259917 7254260 7261619 7284396 7324630 7383619 7462165 7561118
59669G561118J20353J42312J63734J83507K00913K15289K25465K29939K27546
$$ 7561118 7681471 7823783 7987517 8171024 8371937 8587226 8812691 9042630 9270176
59660I270176K17680J99751J72972J36929R2219M0416j6207p4707j31602j83637
$$ 9270176 9487856 9687607 9860579 9997508 10089727 10130143 10113936 10039229 9907627 9723990
59650I723990k28447k64433k90365l05642l10712l06777k95114k77042k54290
$$ 9723990 9495543 9231110 8940745 8635103 8324391 8017614 7722500 7445458 7191168
59641G191168k28913k03092j79741j63096j57549j65115j84053k09794k36647
$$ 7191168 6962255 6759163 6579422 6416326 6258777 6093662 5909609 5699815 5463168
59632E463168k59080k73030k77328k73553k63885k49293k30313k08845j87957
$$ 5463168 5204088 4931058 4653730 4380177 4116292 3866999 3636686 3427841 3239884
59623C239884j69682j53679j38479j23467j09316r6904q6375p7256o9055o1585
$$ 3239884 3070202 2916523 2778044 2654577 2545261 2448357 2361982 2284726 2215671 2154086
59613B154086n4897m9125m4368m0515l7077l3387k9095k4578k0671j8050j6778
$$ 2154086 2099189 2050064 2005696 1965181 1928104 1894717 1865622 1841044 1820373 1802323 1785545
59602A785545j6394j6253j5944j5520j5385j5807j6568j7165j7358j7311j7318
$$ 1785545 1769151 1752898 1736954 1721434 1706049 1690242 1673674 1656509 1639151 1621840 1604522
59591A604522j7459j7527j7169j6217j4986j4157j4168j4790j5417j5657j5438
$$ 1604522 1587063 1569536 1552367 1536150 1521164 1507007 1492839 1478049 1462632 1446975 1431537
59580A431537j4769j3704j2402j0983r468q063p244p025o501m750k144l0J004
$$ 1431537 1416768 1403064 1390662 1379679 1370211 1362148 1354904 1347879 1341378 1336628 1334484 1334454 1335458
59567A335458J875L680O317Q932J1210J3548J6118J8456K0084K1122K2185K3856
$$ 1335458 1337333 1341013 1347330 1356262 1367472 1381020 1397138 1415594 1435678 1456800 1478985 1502841
59555A502841K6340K9404L2564L5584L8761M2576M6883N0816N3813N6560O0372
$$ 1502841 1529181 1558585 1591149 1626733 1665494 1708070 1754953 1805769 1859582 1916142 1976514
59544A976514O5620P1404P7052Q2969Q8915R2054Q8561P7798O3778N1567M3005
$$ 1976514 2042134 2113538 2190590 2273559 2362474 2454528 2543089 2620887 2684665 2736232 2779237
59533B779237L6672L0912K5323J9766J3739P205Q24n209j1703j9252k7157l4167
$$ 2779237 2815909 2846821 2872144 2891910 2905649 2912854 2913678 2908469 2896766 2877514 2850357 2816190
59521B816190l9823m4626m9117n3201n6119n6934n5333n2018m8036m3649l8272
$$ 2816190 2776367 2731741 2682624 2629423 2573304 2516370 2461037 2409019 2360983 2317334 2279062
59510B279062l1523k3707j5221o062L696J3668K3778L4676M6951O0208P3346Q5544
$$ 2279062 2247539 2223832 2208611 2202549 2206245 2219913 2243691 2278367 2325318 2385526 2458872 2544416
59498B544416R6551J06047J13132J16535J15338J09464R9415Q5486O7486M5522
$$ 2544416 2640967 2747014 2860146 2976681 3092019 3201483 3300898 3386384 3453870 3499392
59488C499392K0880m336k8404n0505p0268q7305j01047j10617j15041j14268j09760
$$ 3499392 3520272 3515936 3487532 3437027 3366759 3279454 3178407 3067790 2952749 2838481 2728721
59477B728721j03314r5387q5405p3596o1387m9774l8444k7038j6141o388K574
$$ 2728721 2625407 2530020 2444615 2371019 2309632 2259858 2221414 2194376 2178235 2171847 2174421
59466B174421J1326J9548K6468L1974L6470L9966M1996M2201M0385L6252K9685
$$ 2174421 2185747 2205295 2231763 2263737 2300207 2340173 2382169 2424370 2464755 2501007 2530692
59455B530692K1158J1456J143r416j9952l0532m1408n2032o0751o6241o9022p0903
$$ 2530692 2551850 2563306 2564449 2555033 2535081 2504549 2463141 2411109 2350358 2284117 2215095 2144192
59443B144192p2983p4744p4982p3095o9481o5194o1239n7971n5051n2025m8714
$$ 2144192 2071209 1996465 1921483 1848388 1778907 1713713 1652474 1594503 1539452 1487427 1438713
59432A438713m5014m0745l6099l1857k8716k6467k4226k1283j7611j3679j0013
$$ 1438713 1393699 1352954 1316855 1284998 1256282 1229815 1205589 1184306 1166695 1153016 1143003
59421A143003o754l566nM046Q516J3247J7347J8844J6150J0098L577j073l392
$$ 1143003 1136249 1132683 1132678 1136724 1145240 1158487 1175834 1194678 1210828 1220926 1224503 1223430 1220038
59408A220038l634j793J604N247Q681J2929J8118K1573K0059J3631N813J38k353
$$ 1220038 1216404 1214611 1216215 1221462 1230143 1243072 1261190 1282763 1302822 1316453 1322266 1322404 1320051
59395A320051k418j023J243M193P911J2192J6179J9211K1724K4583K7717L0327
$$ 1320051 1317633 1316610 1317853 1322046 1329957 1342149 1358328 1377539 1399263 1423846 1451563 1481890
59383A481890L2224L4037L6132L8245M0262M2444M4839M7193M9476N1767N3695
$$ 1481890 1514114 1548151 1584283 1622528 1662790 1705234 1750073 1797266 1846742 1898509 1952204
59372A952204N4804N5451N6528N8244O0033O1696O3788O6814P0928P6553Q4331
$$ 1952204 2007008 2062459 2118987 2177231 2237264 2298960 2362748 2429562 2500490 2577043 2661374
59361B661374R4222J05440J17597J31112J46228J62338J78550J94124K07979K18563
$$ 2661374 2755596 2861036 2978633 3109745 3255973 3418311 3596861 3790985 3998964 4217527
59351D217527K24789K26618K24320K17694K06517J91425J73865J55271J36414
$$ 4217527 4442316 4668934 4893254 5110948 5317465 5508890 5682755 5838026 5974440
59342E974440J17338R7663P7140N5858L3906J1119j2515l6562o0863q6075j12713
$$ 5974440 6091778 6189441 6266581 6322439 6356345 6367464 6354949 6318387 6257524 6171449 6058736
59331F058736j39791j65262j87636k06379k20870k30155k33878k32534k26697
$$ 6058736 5918945 5753683 5566047 5359668 5138798 4908643 4674765 4442231 4215534
59322D215534k16934k04617j91612j78762j65634j52193j39610j28778j19097
$$ 4215534 3998600 3793983 3602371 3423609 3257975 3105782 2966172 2837394 2718297
59313B718297j09564j00249r1782q4156p6965p0346o4630n9416n3849m7779m1765
$$ 2718297 2608733 2508484 2416702 2332546 2255581 2185235 2120605 2061189 2007340 1959561 1917796
59302A917796l6063l0262k4098j8220j4091j3294j6512k2625k8998l3128l4120
$$ 1917796 1881733 1851471 1827373 1809153 1795062 1781768 1765256 1742631 1713633 1680505 1646385
59291A646385l2516k9202k4971k0730j7237j4459j1722q625n525k919p17J699
$$ 1646385 1613869 1584667 1559696 1538966 1521729 1507270 1495548 1486923 1481398 1478479 1477762 1479461
59279A479461M797Q501J2396J6168J9709K2878K5461K7539K9589L1794L3385L3162
$$ 1479461 1484258 1492759 1505155 1521323 1541032 1563910 1589371 1616910 1646499 1678293 1711678 1744840
59267A744840L0756K6987K2908J8723J3778P439r9p680j4042j8994k3493k8236
$$ 1744840 1775596 1802583 1825491 1844214 1857992 1865431 1865332 1857652 1843610 1824616 1801123 1772887
59255A772887l2531l5170l6061l6155l5876l4713l2462k9877k7597k5320k2616
$$ 1772887 1740356 1705186 1669125 1632970 1597094 1562381 1529919 1500042 1472445 1447125 1424509
59244A424509j9844j7560j5501j2907r644o405l878k079m81J463L773N896P346
$$ 1424509 1404665 1387105 1371604 1358697 1349053 1342648 1338770 1336691 1336210 1337673 1341446 1347342 1354688
59231A354688Q444J0008J2255J4542J6260J7427J8292J8985J9831K1233K2931
$$ 1354688 1363132 1373140 1385395 1399937 1416197 1433624 1451916 1470901 1490732 1511965 1534896
59220A534896K4044K4403K5119K7136K9835L1892L3066L4313L6361L9135M2575
$$ 1534896 1558940 1583343 1608462 1635598 1665433 1697325 1730391 1764704 1801065 1840200 1882775
59209A882775M7097N2943N9699O6809P4305Q2710R2342J02939J13912J24739J34907
$$ 1882775 1929872 1982815 2042514 2109323 2183628 2266338 2358680 2461619 2575531 2700270 2835177
59198B835177J43452J48874J49820J45733J36559J22099J02236P7745N0097K0442
$$ 2835177 2978629 3127503 3277323 3423056 3559615 3681714 3783950 3861695 3911792 3932234
59188C932234j0530m1567p0575r5809j16706j33112j44426j50139j50638j46801
$$ 3932234 3921704 3880137 3809562 3713753 3597047 3463935 3319509 3169370 3018732 2871931
59178B871931j39320j29113j17822j07004r6926q6981p7031o7619n9027n1040
$$ 2871931 2732611 2603498 2485676 2378672 2281746 2194765 2117734 2050115 1991088 1940048
59168A940048m3737l7643l2922k8992k5299k1975j9450j7770j6651j5955j5855
$$ 1940048 1896311 1858668 1825746 1796754 1771455 1749480 1730030 1712260 1695609 1679654 1663799
59157A663799j6593j8231k0566k3210k5800k8173l0330l2277l3883l4893l5087
$$ 1663799 1647206 1628975 1608409 1585199 1559399 1531226 1500896 1468619 1434736 1399843 1364756
59146A364756l4548l3668l2683l1373k9510k7413k5612k4003k2009j9644j7612
$$ 1364756 1330208 1296540 1263857 1232484 1202974 1175561 1149949 1125946 1103937 1084293 1066681
59135A066681j6067j4086j0981p540n152m042l154j648K70J947L155M172N409
$$ 1066681 1050614 1036528 1025547 1018007 1012855 1008813 1005659 1004011 1004281 1006228 1009383 1013555 1018964
59122A018964P113R107J0872J2091J3116J4567J6579J8680K0378K1602K2569K3517
$$ 1018964 1026077 1035184 1046056 1058147 1071263 1085830 1102409 1121089 1141467 1163069 1185638 1209155
59110A209155K4505K5341K5637K5136K3885K2077J9843J7351J4900J2728J0833
$$ 1209155 1233660 1259001 1284638 1309774 1333659 1355736 1375579 1392930 1407830 1420558 1431391
59099A431391R125P679O719O529P347R084J1124J2741J3889J5250J7275J9452
$$ 1431391 1440516 1448195 1454914 1461443 1468790 1477874 1488998 1501739 1515628 1530878 1548153 1567605
59087A567605K0798K0838J9926J8836J8184J8038J7937J7465J6729J5983J4905
$$ 1567605 1588403 1609241 1629167 1648003 1666187 1684225 1702162 1719627 1736356 1752339 1767244
59076A767244J2848R812O480L150o74n316j0302j5095j9774k4490k8845l2365
$$ 1767244 1780092 1789904 1796384 1799534 1798860 1793544 1783242 1768147 1748373 1723883 1695038 1662673
59064A662673l5095l7184l8404l8713l8708l8902l8975l8404l7372l6234l4603
$$ 1662673 1627578 1590394 1551990 1513277 1474569 1435667 1396692 1358288 1320916 1284682 1250079
59053A250079l1893k8487k5461k3207k1156j8820j6339j3944j1691r789q520p661
$$ 1250079 1218186 1189699 1164238 1141031 1119875 1101055 1084716 1070772 1059081 1049292 1040772 1033111
59041A033111o569n011l374j879j32K297N185P808R650J0899J2306J4436J6901
$$ 1033111 1026542 1021531 1018157 1016278 1016146 1018443 1023628 1031436 1041086 1051985 1064291 1078727 1095628
59028A095628J8530J8512J7076J4868J2089Q776N439K712N51j536l564n067n877
$$ 1095628 1114158 1132670 1149746 1164614 1176703 1185479 1190918 1193630 1194181 1192645 1189081 1184014 1178137
59015A178137o263o226n475m166l071k570k104r96M95J459J461R74N94J77r75
$$ 1178137 1171874 1165648 1160173 1156007 1152936 1150366 1148262 1147266 1147761 1149220 1150681 1151655 1152249 1152426 1151451
59000A151451l129n649p734r298j0750j2086j2809j2754j2316j1649j0363q357
$$ 1151451 1148322 1142673 1134939 1125641 1114891 1102805 1089996 1077242 1064926 1053277 1042914 1034557
58988A034557o297m761l440j677O65L392O396R304J1147J1183R716P552N034K227
$$ 1034557 1028260 1023499 1020059 1018382 1019047 1022439 1028835 1038139 1049286 1060469 1070185 1077737 1082771 1084998
58974A084998m47k559m331o126p675q574r206j0153j0922j0324q156n472l221
$$ 1084998 1084551 1081992 1077661 1071535 1063860 1055286 1046080 1035927 1025005 1014681 1006525 1001053 997832
58961I97832j509l33L5k72m66n7O26J123J517K038K544K859L242M138N613P297
$$ 997832 996323 995990 996025 995753 995287 995230 995856 996979 998496 1000534 1003078 1005937 1009179 1013317 1018930 1026227
58945A026227Q738R708J0272J0620J0762J0561J0095R635R075P963O465N777O803
$$ 1026227 1034965 1044673 1054945 1065565 1076327 1086888 1096983 1106618 1115693 1123656 1130121 1135898 1142701
58932A142701Q864J0561J1549J2603J4130J5657J6854J8103J9724K1556K3541
$$ 1142701 1151565 1162126 1173675 1186278 1200408 1216065 1232919 1251022 1270746 1292302 1315843
58921A315843K6076K9391L3138L6876M0535M4152M7492N0111N1509N1365N0043
$$ 1315843 1341919 1371310 1404448 1441324 1481859 1526011 1573503 1623614 1675123 1726488 1776531
58910A776531M8689M8215M8354M8323M8361M9647N2668N6501O0039O3183O6434
$$ 1776531 1825220 1873435 1921789 1970112 2018473 2068120 2120788 2177289 2237328 2300511 2366945
58899B366945O9980P3703P7647Q2045Q6980R2354R8041J04029J10497J17586J24849
$$ 2366945 2436925 2510628 2588275 2670320 2757300 2849654 2947695 3051724 3162221 3279807 3404656
58888C404656J31229J35925J38997J40596J40014J36281J29419J20222J08944
$$ 3404656 3535885 3671810 3810807 3951403 4091417 4227698 4357117 4477339 4586283
58879D586283R5210P9236O2088M4532K6529Q103j0226k8223m6248o4218q1008
$$ 4586283 4681493 4760729 4822817 4867349 4893878 4901981 4891755 4863532 4817284 4753066 4672058
58868D672058r5415j07284j17196j25539j32232j36943j39238j38931j36545j33087
$$ 4672058 4576643 4469359 4352163 4226624 4094392 3957449 3818211 3679280 3542735 3409648
58858C409648j29160j24714j19709j14436j09027j03352r7651r2689q8853q5565
$$ 3409648 3280488 3155774 3036065 2921629 2812602 2709250 2611599 2518910 2430057 2344492
58848B344492q1892p7460p2526o7593o3095n9097n5133n0732m6100m1797l7802
$$ 2344492 2262600 2185140 2112614 2045021 1981926 1922829 1867696 1816964 1770864 1729067 1691265
58837A691265l3607k9207k5268k2101j9243j6317j3593j1402r650q264p343o539
$$ 1691265 1657658 1628451 1603183 1581082 1561839 1545522 1531929 1520527 1510877 1502613 1495270 1488731
58825A488731m935k079J398M618P403J0006J2473J4746J7011J9403K1693K3589
$$ 1488731 1483796 1481717 1483115 1487733 1495136 1505142 1517615 1532361 1549372 1568775 1590468 1614057
58813A614057K5138K6562K8059K9915L2365L5219L8006M0698M3745M7294N0939
$$ 1614057 1639195 1665757 1693816 1723731 1756096 1791315 1829321 1870019 1913764 1961058 2011997
58802B011997N4432N8112O2305O6921P1930P7634Q4068R0642R6873J02989J09390
$$ 2011997 2066429 2124541 2186846 2253767 2325697 2403331 2487399 2578041 2674914 2777903 2887293
58791B887293J15871J21843J27101J31952J36687J41003J43873J44063J41029
$$ 2887293 3003164 3125007 3252108 3384060 3520747 3661750 3805623 3949686 4090715
58782D090715J35271J27412J17186J03800Q7107O7750M6377K3479j10k3460m6260
$$ 4090715 4225986 4353398 4470584 4574384 4661491 4729241 4775618 4799097 4798987 4775527 4729267
58771D729267o8408q8908j06232j19894j30582j38619j43484j45199j44963j43782
$$ 4729267 4660859 4571951 4465719 4345825 4215243 4076624 3933140 3787941 3642978 3499196
58761C499196j41471j37679j32922j27879j22448j16304j09792j03621r8159r3436
$$ 3499196 3357725 3220046 3087124 2959245 2836797 2720493 2610701 2507080 2408921 2315485
58751B315485q9203q4748p9375p3428o7985o3203n8007n1830m5562m0111l5128
$$ 2315485 2226282 2141534 2062159 1988731 1920746 1857543 1799536 1747706 1702144 1662033 1626905
58740A626905k9995k5020k0754j7048j3848j1898j1623j1985j1752j1196j1426
$$ 1626905 1596910 1571890 1551136 1534088 1520240 1508342 1496719 1484734 1472982 1461786 1450360
58729A450360j2527j3573j4087j4256j3997j2917j1114r035o761m250k105j193
$$ 1450360 1437833 1424260 1410173 1395917 1381920 1369003 1357889 1348854 1342093 1337843 1335738 1334545
58717A334545j619l002n574j0066j6400k3333k9496l4303l7823m0320m1939m2483
$$ 1334545 1332926 1329924 1324350 1314284 1297884 1274551 1245055 1210752 1172929 1132609 1090670 1048187
58705A048187m1651l9684l7451l5470l3310l0464k7246k4249k1422j8420j5438
$$ 1048187 1006536 966852 929401 893931 860621 830157 802911 778662 757240 738820 723382
58694G23382j2869j0538q021n421l116j073Q03J979J851O98p22k326m477o815
$$ 723382 710513 699975 691954 686533 683417 682344 683147 685126 686977 687675 686953 684627 680150 673335
58680F73335q318q648q495q352p798o383m497k880j594k2K233M814O995Q423R242
$$ 673335 665017 656369 647874 639522 631724 625341 620844 617964 616370 616348 618581 623395 630390 638813 648055
58665F48055R560R171Q066O786N639L900P08l339o505p980q529q826q417p014
$$ 648055 657615 666786 674852 681638 687277 691177 691885 688546 682041 674061 665532 656706 648289 641275
58651F41275n659n465o042o201n752n532o025o808p190o784n696m590m203m418
$$ 641275 635616 630151 624109 617908 612156 606624 600599 593791 586601 579817 574121 569531 565328 560910
58637E60910m309l416k189q57J025L275M524L997K847K510K654K114R84L39M03
$$ 560910 556601 553185 550996 550139 551164 554439 558963 562960 565807 568317 570971 573085 574069 574408 574811
58622E74811O00J032K294M025N143N528O035O827P115O779O847P880R091R619
$$ 574811 575411 576443 578737 582762 587905 593433 599468 606295 613410 620189 627036 634916 644007 653626
58608F53626R708J0155J1332J3177J5465J7696J9303K0360K1631K3613K5945K8018
$$ 653626 663334 673489 684821 697998 713463 731159 750462 770822 792453 816066 842011 870029
58596H70029K9782L1721L4269L7416M0674M3383M5146M5982M6046M5435M4239
$$ 870029 899811 931532 965801 1003217 1043891 1087274 1132420 1178402 1224448 1269883 1314122
58585A314122M2338L9117L3960K7250K0262J3875P968K291k965p746j2253j5971
$$ 1314122 1356460 1395577 1429537 1456787 1477049 1490924 1498892 1501183 1498218 1490472 1478219 1462248
58573A462248j7768j7640j7224j7650j8007j7116j5581j4652j3956j2164r406
$$ 1462248 1444480 1426840 1409616 1391966 1373959 1356843 1341262 1326610 1312654 1300490 1291084
58562A291084p156n964m847l172j650j263k287m650q309j2998j8259k3803k9287
$$ 1291084 1283928 1277964 1273117 1269945 1268295 1267032 1264745 1260095 1251786 1238788 1220529 1196726 1167439
58549A167439l3932l7022l8595l9094l8618l7130l4856l1910k8080k3735k0120
$$ 1167439 1133507 1096485 1057890 1018796 980178 943048 908192 876282 848202 824467 804347
58538H04347j7883j6078j3681j1312j0190j0150j0066r681r572r690r483r141
$$ 804347 786464 770386 756705 745393 735203 725053 714987 705306 695734 686044 676561 667420
58526F67420r356j0017j0340j0112r685r098q276p664p482o921n338l625l011
$$ 667420 658064 648047 637707 627595 617910 608812 600536 592872 585390 578469 573131 569506 566495
58513E66495l133k832k184k001j964j151pJ92l89m24K13N00O01J956M683O993
$$ 566495 563362 560530 558346 556345 554381 553230 553223 553415 553026 552602 552815 553315 553916 555872 560555 567548
58497E67548P656P413P373P772Q596R893J1007J1040J0427J0562J1640J2473J2619
$$ 567548 575204 582617 589990 597762 606358 616251 627258 638298 648725 659287 670927 683400 696019
58484F96019J2915J3556J3487J2248J0718R415P690N226K796Q75j108l495n777
$$ 696019 708934 722490 735977 748225 758943 768358 776048 781274 784070 784945 783837 780342 774565
58471G74565p753r883j1955j2822j2112j0927j0278j0088j0112j0520j1039j0908
$$ 774565 766812 756929 744974 732152 720040 709113 698835 688747 678635 668115 657076 646168
58459F46168j0114r445r042q299p382p196p543p030n324l751l123k665j766j033
$$ 646168 636054 626609 617567 609268 601886 594690 587147 580117 574793 571042 567919 565254 563488 562455
58445E62455q16l30Q76K077K758L392M151M430M334N005O662P977Q361R202J1771
$$ 562455 561639 561309 562185 564262 567020 570412 574563 578993 583327 588332 594994 602971 611332 620534 632305
58430F32305J5272J8236K0473K2607K4737K6505K7440K6353K1697J3447L727n072
$$ 632305 647577 665813 686286 708893 733630 760135 787575 813928 835625 849072 852799 847727
58418H47727j1847j6113j7441j6329j4296j2266r981p427n360l869j996N17K644
$$ 847727 835880 819767 802326 785997 771701 759435 749454 742027 736667 732798 730802 731319 733963
58405G33963L927N254P074Q526R154R778J0714J0856R585P886O528M765K061n10
$$ 733963 737890 743144 750218 758744 767898 777676 788390 799246 808831 816717 823245 828010 830071 829561
58391H29561j820k243k443k119j043J1N68J288K496L301L285L507M618N465M838
$$ 829561 827741 825498 823055 820936 819893 819904 820472 821760 824256 827557 830842 834349 838967 844432 849270
58376H49270L282J938R20k5n27m76n59r73q59K8O19M38O06J850L191L758M265
$$ 849270 852552 854490 855410 855385 854858 854382 853823 852850 851991 852019 852638 853076 853682 855532 858723 862481 866746
58359H66746N388O307O234N894O164O689P098Q069R951J1789J2889J3872J5040
$$ 866746 872134 878441 884675 890569 896733 903422 910520 918589 928540 940329 953218 967090 982130
58346I82130J5385J4411J3274J2942J2830J2419J2352J2749J2319J0532Q795Q123
$$ 982130 997515 1011926 1025200 1038142 1050972 1063391 1075743 1088492 1100811 1111343 1120138 1128261
58334A128261P629O690O431P443Q219P644P075Q076R903J1125J1846J2617J2938
$$ 1128261 1135890 1142580 1149011 1156454 1164673 1172317 1179392 1187468 1197371 1208496 1220342 1232959 1245897
58321A245897J2698J3305J5569J8118J9599K0639K2047K3103K3295K3721K5020
$$ 1245897 1258595 1271900 1287469 1305587 1325186 1345825 1367872 1390975 1414270 1437991 1463011
58310A463011K5947K5710K5531K6148K6130K4453K2361K0865J8958J6259J4611
$$ 1463011 1488958 1514668 1540199 1566347 1592477 1616930 1639291 1660156 1679114 1695373 1709984
58299A709984J4908J5255J4574J5006J8068K1493K2832K3259K4630K5759K5117
$$ 1709984 1724892 1740147 1754721 1769727 1787795 1809288 1832120 1855379 1880009 1905768 1930885
58288A930885K4471K6131K8968L0860L2740L6406M0525M2722M3787M5977M8984
$$ 1930885 1955356 1981487 2010455 2041315 2074055 2110461 2150986 2193708 2237495 2283472 2332456
58277B332456N1228N3343N6759O0504O2909O4710O7096O8789O8526O8240P0072
$$ 2332456 2383684 2437027 2493786 2554290 2617199 2681909 2749005 2817794 2886320 2954560 3024632
58266C024632P2376P2500P1202P0492O9362O5899O1525N9008N8200N7694N8482
$$ 3024632 3097008 3169508 3240710 3311202 3380564 3446463 3507988 3566996 3625196 3682890 3741372
58255C741372O1912O6342O9912P4140Q0710Q7498R2255R7248J05365J14585J21488
$$ 3741372 3803284 3869626 3939538 4013678 4094388 4181886 4274141 4371389 4476754 4591339 4712827
58244D712827J27335J35246J44176J51467J58621J68665J80309J90562K00607
$$ 4712827 4840162 4975408 5119584 5271051 5429672 5598337 5778646 5969208 6169815
58235F169815K13180K26843K38948K51485K67707K85918L02987L20815L42732
$$ 6169815 6382995 6609838 6848786 7100271 7367978 7653896 7956883 8277698 8620430
58226H620430L66909L90351M15854M47470M82849N17981N55610O00742O51913
$$ 8620430 8987339 9377690 9793544 10241014 10723863 11241844 11797454 12398196 13050109
58217A3050109P05661P65228Q35626R14719R99246J094601J208162J338519J483034
$$ 13050109 13755770 14520998 15356624 16271343 17270589 18365190 19573352 20911871 22394905
58208B2394905J650115J851010K085527K350094K654029L013641L438353L940554
$$ 22394905 24045020 25896030 27981557 30331651 32985680 35999321 39437674 43378228
58200D3378228M551766N310128O240000P364717Q729355J0386061J2367830J4704607
$$ 43378228 47929994 53240122 59480122 66844839 75574194 85960255 98328085 113032692
58192A13032692J7448398K0636822K4220890K8016086L1616051L4216363L4574504
$$ 113032692 130481090 151117912 175338802 203354888 234970939 269187302 303761806
58185C03761806L1443120K4359918J4125464K473080q762282j8245512k5224050
$$ 303761806 335204926 359564844 373690308 376163388 367401106 349155594 323931544
58178C23931544k9405970l0931420l0340589k8367697k5670065k2708039j9781006
$$ 323931544 294525574 263594154 233253565 204885868 179215803 156507764 136726758
58171A36726758j7074067j4668171j2570962j0769548r247614p970007o888525
$$ 136726758 119652691 104984520 92413558 81644010 72396396 64426389 57537864
58164E7537864n968652n191621m534101l967633l477004l059775k707435k403125
$$ 57537864 51569212 46377591 41843490 37875857 34398853 31339078 28631643 26228518
58156B6228518k137045j908569j713263j541366j388712j256461j140431j032391
$$ 26228518 24091473 22182904 20469641 18928275 17539563 16283102 15142671 14110280
58148A4110280r31398q42735p66181o95745o30208n73474n24808m78818m35451
$$ 14110280 13178882 12336147 11569966 10874221 10244013 9670539 9145731 8666913 8231462
58139H231462m00516l75559l55510l36874l20329l04821k86891k66759k48352
$$ 8231462 7830946 7455387 7099877 6763003 6442674 6137853 5850962 5584203 5335851
58130E335851k32617k16938k01202j88189j77841j67235j56281j47688j41241
$$ 5335851 5103234 4886296 4685094 4496905 4319064 4151829 3995548 3847860 3706619
58121C706619j33859j25322j18354j13112j07056j00306r5604r2807q8827q3242
$$ 3706619 3572760 3447438 3329084 3215972 3108916 3008610 2913006 2820199 2731372 2648130
58111B648130p8824p6152p2740o7998o4203o1967n9316n5834n3264n1596m8746
$$ 2648130 2569306 2493154 2420414 2352416 2288213 2226246 2166930 2111096 2057832 2006236 1957490
58100A957490m4664m1607l9933l7664l4543l2474l1479k9270k5439k2229k0568
$$ 1957490 1912826 1871219 1831286 1793622 1759079 1726605 1695126 1665856 1640417 1618188 1597620
58089A597620j9095j7719j8312k1105k3972k6154k9226l3501l6784l7788l7772
$$ 1597620 1578525 1560806 1542494 1521389 1497417 1471263 1442037 1408536 1371752 1333964 1296192
58078A296192l7829l7325l5901l4382l2860l0385k7184k4832k3658k2341k0439
$$ 1296192 1258363 1221038 1185137 1150755 1117895 1087510 1060326 1035494 1011836 989495 969056
58067I69056j8979j8141j6814j4881j3637j3439j3121j2106j1113j0575j0285
$$ 969056 950077 931936 915122 900241 886604 873165 860044 847938 836825 826250 815965
58056H15965j0640j2172j3894j4180j3156j2254j1801j1167j0757j1388j2159
$$ 815965 805325 793153 779259 765079 751923 739669 727868 716701 705944 694556 682397
58045F82397j1546j0236j0141j0903j0325q160o458o061n649m552l711l451k995
$$ 682397 670851 660615 650474 639571 629246 621086 614628 608567 602918 598366 594655 591204 588209
58032E88209k538l193m545m909m351m745o398p395o859o160o166n994n312n270
$$ 588209 585671 582478 577933 573024 568673 563928 557530 550135 543276 537116 530950 524956 519644 514374
58018E14374o135o442n438m189l343j996K05J981K406K132J821J249O62J018K104
$$ 514374 508239 501797 496359 492170 488827 486831 487036 489017 491423 493555 495376 496625 497287 498305 500409
58003E00409K394J490Q21J225J866K235L124M772O096O698P613R129R899R175
$$ 500409 502803 504293 505114 506339 508205 510440 513564 518336 524432 531130 538743 547872 557771 566946
57989E66946Q070P543P053O255O056O789P159O329N429N736O792P593Q151Q759
$$ 566946 575016 582559 589612 595867 601923 608712 615871 622200 627629 633365 640157 647750 655901 664660
57975F64660Q965Q480P899P507O568M624K193n84m476r421j3779j6425j8146j9874
$$ 664660 673625 682105 690004 697511 704079 708703 710896 710312 705836 696415 682636 666211 648065 628191
57961F28191k0941k0408j8802j7237j5804j4128j2475j1162r703p697n738m470
$$ 628191 607250 586842 568040 550803 534999 520871 508396 497234 487531 479834 474096 469626
57949D69626l473k024j79J792M102O752Q908R959J0482J1317J2345J2950J2943
$$ 469626 466153 464129 463950 465742 469844 476596 485504 495463 505945 517262 529607 542557 555500
57936E55500J2341J0833Q303N242K101j185m566p494r632j1286j2647j3386j3284
$$ 555500 567841 578674 586977 592219 594320 593135 588569 581075 571443 560157 547510 534124 520840
57923E20840j2595j1392r436p013m970l519j913L01K499L775L744K418K36j703
$$ 520840 508245 496853 487417 480404 475434 471915 470002 470303 472802 476577 480321 482739 482975 481272
57909D81272k544k921m124o065p460q089r044j0493j1052j0131q999q549p758
$$ 481272 478728 475807 471683 465618 458158 450069 441025 430532 419480 409349 400350 391801 384043
57896C84043n596k983j383o84J09R83J057l2j894l936n365n479m730m629n847
$$ 384043 378447 375464 374081 373397 373506 374489 375546 375514 373620 369684 364319 358840 354110 349481 343634
57881C43634p269p704p448p248o830n609l988k737j776n67R05K388L991N653O714
$$ 343634 336365 328661 321213 313965 307135 301526 297538 294801 293025 292458 293363 295751 299742 305395 312109
57866C12109O887O994P903R304J0383J1021J1449J1356J0277Q478O693N266M027
$$ 312109 318996 325990 333893 343197 353580 364601 376050 387406 397683 406161 412854 418120 422147
57853D22147K673Q77j417l567m838n548o637p925q151p177o640p538q629q261
$$ 422147 424820 425697 424280 420713 415875 410327 403690 395765 387614 380437 373797 366259 357630 349369
57839C49369o638n037l938l090k547k296j613K8J946L174L723M000L802K878J778
$$ 349369 342731 337694 333756 330666 328119 325823 324210 324238 326184 329358 333081 337081 340883 343761 345539
57824C45539J104N74k61j108j625k132k644k268o90O51K17j564l146l910m020
$$ 345539 346643 347217 346956 345848 344223 342091 339447 337179 336489 337140 337357 335793 332647 328737 324717
57809C24717l170j097J232K653L569N201P436Q997R497R773J0223J0335R918R504
$$ 324717 321547 320450 321682 324335 327904 333105 340541 349538 359035 368808 379031 389366 399284 408788
57795D08788R345R091Q545P777O578M790K959J724P94m21j518j703j412j911l340
$$ 408788 418133 427224 435769 443546 450124 454914 457873 459597 460391 459970 458452 456749 455337 453426 450086
57780D50086m589n213o055p694r533j0866j1758j2464j2931j3324j4105j5116
$$ 450086 445497 440284 434229 426535 417002 406136 394378 381914 368983 355659 341554 326438
57768C26438j5392j4351j2596j1127j0317r914r483q598p077n292l863l018k547
$$ 326438 311046 296695 284099 272972 262655 252741 243258 234660 227583 222291 218428 215410 212863
57755B12863k305k207j912j126k03K11J09L0J58K13K28N73J189J547J608K011
$$ 212863 210558 208351 206439 205313 205110 205321 205430 205460 205618 205831 206059 206632 207821 209368 210976 212987
57739B12987L024L966M042L241K070R22Rm22k53L40J127K036K995L709L773L001
$$ 212987 216011 219977 224019 227260 229330 230252 230261 229839 229586 229926 231053 233089 236084 239793 243566 246567
57723B46567J664L66l71n27m96n80p79j033j349j607j623j517j509j342m89Q57
$$ 246567 248231 248597 248226 247699 247203 246623 245844 244811 243462 241855 240232 238715 237206 235864 235375 236232
57707B36232J740J706J422J641K268K940L736M719N475N846O395P393Q059P648
$$ 236232 237972 239678 241100 242741 245009 247949 251685 256404 261879 267725 274120 281513 289572 297220
57693B97220O622N799N043L861K780K823L898M912N385N874O897Q503J0752J3664
$$ 297220 303842 309641 314684 318545 321325 324148 328046 332958 338343 344217 351114 359617 370369 384033
57679C84033J6574J8584J9787K1238K3738K7406L2378L8982M7187N6702O7605
$$ 384033 400607 419191 438978 460216 483954 511360 543738 582720 629907 686609 754214
57668G54214P9705R0833R6594R2642P7591N4188K8313O328p907j4301j5133j2754
$$ 754214 833919 924752 1021346 1113988 1191579 1245767 1274080 1280408 1272501 1258200 1243067 1230313
57656A230313q840m945k493k114l677o904j1370j6291k1087k5947l1003l5303
$$ 1230313 1221473 1216528 1214035 1211921 1208244 1201340 1189970 1173679 1152592 1126645 1095642 1060339
57644A060339l7603l8082l8121l8376l8120l6669l4441l2169k9905k7279k4248
$$ 1060339 1022736 984654 946533 908157 870037 833368 798927 766758 736853 709574 685326
57633F85326k1244j8820j7230j6110j4747j2876j0953r292p569n701m422m137
$$ 685326 664082 645262 628032 611922 597175 584299 573346 564054 556485 550784 546362 542225
57621E42225l860k477m86P95J351K372M275O334Q184J0211J2276J3597J4267J5497
$$ 542225 538365 535888 535402 536197 537548 539920 544195 550529 558713 568924 581200 594797 609064 624561
57607F24561J7864K0564K2853K5068K7562K9788L1198L2156L3261L4341L4661
$$ 624561 642425 662989 685842 710910 738472 768260 799458 831614 864875 899216 933877
57596I33877L3616L0946K6860K2072J7087J1493M736k597r357j5549k2056k8507
$$ 933877 967493 998439 1025299 1047371 1064458 1075951 1080687 1078090 1068733 1053184 1031128 1002621
57584A002621l3078l4937l5412l6007l6581l6359l5449l4307l2733l0493k8216
$$ 1002621 969543 934606 899194 863187 826606 790247 754798 720491 687758 657265 629049
57573F29049k6590k5335k3760k1800j9777j7812j6143j5246j4931j4120j2330
$$ 629049 602459 577124 553364 531564 511787 493975 477832 462586 447655 433535 421205
57562D21205j0547r744r350q286o743n701n210m466l384k828l216l870l905l091
$$ 421205 410658 400914 391564 383278 376535 370834 365624 361158 357774 354946 351730 347860 343955 340864
57548C40864j790n83L3lk32k26L1M43J039J632J835J823K324L376L930L444L023
$$ 340864 339074 338491 338524 338521 338289 338063 338094 338537 339576 341208 343043 344866 347190 350566 354496 357940 360963
57531C60963L939N587O212N337M312M472N816P567R063R899R948R642R694J0418
$$ 360963 364902 370489 376701 382038 386350 390822 396638 404205 413268 423167 433115 442757 452451 462869
57517D62869J1657J3232J5004J6559J7540J8238J9297K0835K2401K3807K5317
$$ 462869 474526 487758 502762 519321 536861 555099 574396 595231 617632 641439 666756
57506F66756K6912K7971K8016K7285K6303K5151K3393K0587J6641J1828O569J241
$$ 666756 693668 721639 749655 776940 803243 828394 851787 872374 889015 900843 907412 908653
57494I08653l905q712j3138j7294k1125k4169k5859k6168k5634k4753k3719k2727
$$ 908653 904748 896036 882898 865604 844479 820310 794451 768283 742649 717896 694177 671450
57482F71450k1943k1066j9631j7890j6642j5887j4534j1978r181p401o601n943
$$ 671450 649507 628441 608810 590920 574278 558391 543857 531879 522698 515297 508696 502753
57470E02753n246m885m669l947k675j389j29J611L806N633O557P011P750R082
$$ 502753 497507 492622 487953 484006 481331 479942 479813 481424 485230 490863 497420 504431 512181 521263
57456E21263J0825J2532J3610J3818J3789J4602J6604J9093K1203K2754K4010
$$ 521263 532088 544620 558230 572048 585837 600439 617043 636136 657339 680093 704103
57445G04103K5093K5853K6109K5846K5226K4349K2846J9997J5583J0354N253L61
$$ 704103 729196 755049 781158 807004 832230 856579 879425 899422 915005 925359 930612 930973
57433I30973m773r960j4302j7397j9951k2747k5570k7490k7969k7315k6191k5011
$$ 930973 926200 916240 901938 884541 864590 841843 816273 788783 760814 733499 707308 682297
57421F82297k3757k2242k0402j8472j6809j5591j4679j3762j2693j1632j0826
$$ 682297 658540 636298 615896 597424 580615 565024 550345 536583 523890 512258 501432
57410E01432j0103q873o986n261m617m769m545l591k872l123l649l333k138q55
$$ 501432 491329 482456 475470 470209 465592 460823 456278 452687 449815 446692 443043 439710 437572 436717
57396D36717M7N57O09K96K17Q04J546J738J648K045K790K995K459J965K032K376
$$ 436717 436764 437321 437930 438226 438443 439247 440793 442531 444179 446224 449014 452009 454468 456433 458465 460841
57380D60841K682K972L093K779K425K844L962M649M267L530L393L928M681N321
$$ 460841 463523 466495 469588 472367 474792 477636 481598 486247 490514 494044 497437 501365 506046 511367
57366E11367N442M607L227K579L243M237M438M112M137M409M207L717L831M520
$$ 511367 516809 521416 524643 527222 530465 534702 539140 543252 547389 551798 556005 559722 563553 568073
57352E68073M693L964L428M139N585O340N778M622M017M512N746O803O987O459
$$ 568073 572766 576730 580158 584297 589882 596222 602000 606622 610639 615151 620897 627700 634687 641146
57338F41146N979N959O050N839N566N794O538P243P549P695Q006Q310Q152P397
$$ 641146 647125 653084 659134 664973 670539 676333 682871 690114 697663 705358 713364 721674 729826 737223
57324G37223O407N641N270N253N623O501P759Q817R000Q284P457P362P967Q499
$$ 737223 743630 749271 754541 759794 765417 771918 779677 788494 797494 805778 813235 820597 828564 837063
57310H37063Q450Q192Q338Q898R351R396R265R360R860J0677J1488J1824J1574
$$ 837063 845513 853705 862043 870941 880292 889688 898953 908313 918173 928850 940338 952162 963736
57297I63736J1287J1647J2549J3179J3072J2696J2749J3315J4036J4702J5312
$$ 963736 975023 986670 999219 1012398 1025470 1038166 1050915 1064230 1078266 1092968 1108280
57286A108280J5802J6070J6202J6380J6662J6984J7211J7038J6190J4848J3592
$$ 1108280 1124082 1140152 1156354 1172734 1189396 1206380 1223591 1240629 1256819 1271667 1285259
57275A285259J2689J1830J0769R734Q870P813O354N017M315L873L082K289K354
$$ 1285259 1297948 1309778 1320547 1330281 1339151 1346964 1353318 1358335 1362650 1366523 1369605 1371894 1374248
57262A374248L192L773L748L971N066O381O975O942P075P671Q354Q797Q994R026
$$ 1374248 1377440 1381213 1384961 1388932 1393998 1400379 1407354 1414296 1421371 1429042 1437396 1446193 1455187 1464213
57248A464213R007R196R695J0168J0266J0228J0570J1253J1661J1466J1062J0915
$$ 1464213 1473220 1482416 1492111 1502279 1512545 1522773 1533343 1544596 1556257 1567723 1578785 1589700
57236A589700J0858J0357R395Q642Q777R738J0805J1328J1310J1248J1485J1861
$$ 1589700 1600558 1610915 1620310 1628952 1637729 1647467 1658272 1669600 1680910 1692158 1703643 1715504
57224A715504J1989J1770J1503J1462J1542J1450J1144J0950J1178J1783J2443
$$ 1715504 1727493 1739263 1750766 1762228 1773770 1785220 1796364 1807314 1818492 1830275 1842718
57213A842718J2833J2756J2177J1325J0665J0514J0729J0919J0925J0874J0850
$$ 1842718 1855551 1868307 1880484 1891809 1902474 1912988 1923717 1934636 1945561 1956435 1967285
57202A967285J0781J0660J0620J0647J0530J0100R361Q351P180O219N864O043
$$ 1967285 1978066 1988726 1999346 2009993 2020523 2030623 2039984 2048335 2055515 2061734 2067598 2073641
57190B073641O317O545O964P480P481O729N979O169P278Q448R036R099Q983Q904
$$ 2073641 2079958 2086503 2093467 2100947 2108428 2115157 2121136 2127305 2134583 2143031 2152067 2161166 2170149 2179053
57176B179053Q875Q701Q145P282O580O372O485O654O905P172O949N832M265L161
$$ 2179053 2187928 2196629 2204774 2212056 2218636 2225008 2231493 2238147 2245052 2252224 2259173 2265005 2269270 2272431
57162B272431K906L174L555L908M185M426M800N323N658N669N874O725P721P957
$$ 2272431 2275337 2278511 2282066 2285974 2290159 2294585 2299385 2304708 2310366 2316035 2321909 2328634 2336355 2344312
57148B344312P475P230P716Q461R029R642J0442J0963J0911J0903J1706J3027
$$ 2344312 2351787 2359017 2366733 2375194 2384223 2393865 2404307 2415270 2426181 2437084 2448790 2461817
57136B461817J3742J3225J2014J1061J0757J0775J0710J0602J0846J1728J3179
$$ 2461817 2475559 2488784 2500798 2511859 2522616 2533391 2544101 2554703 2565549 2577277 2590456
57125B590456J5020J7182J9595K2121K4789K7871L1400L4923L8066M1120M4607
$$ 2590456 2605476 2622658 2642253 2664374 2689163 2717034 2748434 2783357 2821423 2862543 2907150
57114B907150M8481N2294N6092O0629O6758P5039Q5902R9593J15999J35037J57335
$$ 2907150 2955631 3007925 3064017 3124646 3191404 3266443 3352345 3451938 3567937 3702974 3860309
57103C860309J84013K15909K53616K98297L51851M16071M92227N81535O85296
$$ 3860309 4044322 4260231 4513847 4812144 5163995 5580066 6072293 6653828 7339124
57094G339124Q04076R37057J082309J236928J396440J554478J703565J836039
$$ 7339124 8143200 9080257 10162566 11399494 12795934 14350412 16053977 17890016
57086A7890016J943878K018068K048991K027944J948417J806149J598619J325903
$$ 17890016 19833894 21851962 23900953 25928897 27877314 29683463 31282082 32607985
57078C2607985R93707O16499K16800j80466n54634q92038j184438j426626j615454
$$ 32607985 33601692 34218191 34434991 34254525 33699891 32807853 31623415 30196789 28581335
57069B8581335j749597j829457j857765j840343j785409j701614j597058j479790
$$ 28581335 26831738 25002281 23144516 21304173 19518764 17817150 16220092 14740302
57061A4740302j357712j237036j121287j012217r11045q18493p34563o59110n92128
$$ 14740302 13382590 12145554 11024267 10012050 9101005 8282512 7547949 6888839 6296711
57052F296711n33071m80477m32971l90073l51568l16745k84925k56141k30477
$$ 6296711 5763640 5283163 4850192 4460119 4108551 3791806 3506881 3250740 3020263
57043C020263k07311j85955j66635j49895j35352j21903j08940r6580q4826p3318
$$ 3020263 2812952 2626997 2460362 2310467 2175115 2053212 1944272 1847692 1762866 1689548
57033A689548o1862n0425l8654k5949j1820M559K4343M6492O4479O7474M7788
$$ 1689548 1627686 1577261 1538607 1512658 1500838 1505397 1529740 1576232 1640711 1708185 1755973
57022A755973Q364l7633p5530r8034j06570j05995r9804q9986p8838o8696o0267
$$ 1755973 1764337 1726704 1651174 1553140 1446570 1340575 1240771 1150785 1071947 1003251 942984
57011I42984n2780m5890m0208l5815l1741k7471k3792k1436j9865j8247j6790
$$ 942984 890204 844314 804106 768291 736550 709079 685287 663851 643986 625739 608949
57000F08949j6169j6235j6306j6087j5568j4483j2815j1309j0502r797q395o618
$$ 608949 592780 576545 560239 544152 528584 514101 501286 489977 479475 469678 461283 454665
56988D54665n176l704j352J451L312L856L868L413J393k472o580r275j0680j1833
$$ 454665 449489 445785 444433 445884 449196 453052 456920 460333 461726 459254 452674 443399 432719 420886
56974D20886j2755j2473j0655q278o589n843n185l633j150J332L093M514O417
$$ 420886 408131 395658 385003 376725 370136 364293 359108 355475 354325 355657 358750 363264 369681
56961C69681Q820J0990J2620J4037J5204J5254J3389R663M728n97n327q665j0695
$$ 369681 378501 389491 402111 416148 431352 446606 459995 469658 474386 473789 468462 459797 449102
56948D49102j2183j3356j3558j2393j0564q978p632n957l760j286J365M232P173
$$ 449102 436919 423563 410005 397612 387048 378070 370438 364481 360721 359435 360800 365032 372205
56935C72205J0006J2793J5511J7680J8627J7990J5582J1190M934k266r044j4394
$$ 372205 382211 395004 410515 428195 446822 464812 480394 491584 496518 494252 485208 470814
56923D70814j7926j9653j9933j9440j8771j8001j6848j5150j3017j0753q822p651
$$ 470814 452888 433235 413302 393862 375091 357090 340242 325092 312075 301322 292500 284849
56911B84849p136o652n851n160n096n370n201m376l377k569j846j152o92l92K86
$$ 284849 277713 271061 265210 260050 254954 249584 244383 240007 236630 234061 232215 231063 230371 229979 230265
56896B30265J555K777L274L424M332O374Q640J0088J0764J1493J2614J3500J3274
$$ 230265 231820 234597 237871 241295 245627 252001 260641 270729 281493 292986 305600 319100 332374
56883C32374J1546Q459M537O82k212m008n344o602p232o578n016l526k298n77
$$ 332374 343920 352379 356916 357598 355386 351378 346034 339432 332200 325622 320606 317080 314782 314205
56869C14205K036M888P235R246J1540J4261J7158K0299K3932K7513K9434K8041
$$ 314205 316241 321129 328364 337610 349150 363411 380569 400868 424800 452313 481747 509788
56857E09788K2864J4856N642l290j0858j6351j9457k0371j9616j7665j4781j1270
$$ 509788 532652 547508 553150 549860 539002 522651 503194 482823 463207 445542 430761 419491
56845D19491p648m278r94K715P132J2107J7332K2649K8178L4185M0630M6513M9795
$$ 419491 411843 407565 406571 409286 416418 428525 445857 468506 496684 530869 571499 618012 667807
56832F67807M8335M1075K8448J2141n260k0838l2419l9343m2104m1485l8384l4026
$$ 667807 716142 757217 785665 797806 792546 771708 739289 699946 657842 616357 577973 543947
56820E43947k9530k5185k0597j5576j0363n147P3N108R745J4294J9360K4870K9840
$$ 543947 514417 489232 468635 453059 442696 437549 437622 442730 452475 466769 486129 510999 540839
56807E40839L3136L3745L0468K2367J0171l506j5820k5301l1714l5238l6232l5223
$$ 540839 573975 607720 638188 660555 670726 667220 651400 626099 594385 559147 522915 487692
56795D87692l2530k8348k3511j9343j6215j2983q672m079o91J478L859P309J1180
$$ 487692 455162 426814 403303 383960 367745 354762 346090 342011 341320 342798 346657 353966 365146
56782C65146J4496J6926J8221J7478J3725P078j105r065j5530j9973k2360k2832
$$ 365146 379642 396568 414789 432267 445992 453070 451965 442900 427370 407397 385037 362205
56770C62205k1747j9780j7608j5406j3030j0759r296q768q334p338o273n920n945
$$ 362205 340458 320678 303070 287664 274634 263875 254579 245811 237477 230139 223866 217946 212001
56757B12001n305l847k597k308k561k572k242k004k114k430k643k498k005j618
$$ 212001 206696 202849 200252 197944 195383 192811 190569 188565 186451 184021 181378 178880 176875 175257
56743A75257j833k425k478j468r7L98l52j446j786j222m47LK57N61O79L03k16
$$ 175257 173424 170999 168521 167053 166956 167354 167002 165556 163770 162548 162101 162104 162361 162922 163601 163904 163688
56726A63688j34O38J320J344J093J175J507J577J287Q76L15n37j297j212j42J139
$$ 163688 163554 164192 165512 166856 167949 169124 170631 172208 173495 174371 174686 174149 172852 171640 171498 172637
56710A72637J738J442O50j40o67r30r62o62L2O82N68l47j079p68J68O41L53m4
$$ 172637 174375 175817 176467 176327 175660 174730 173768 173106 173138 173820 174388 174041 172962 172194 172362 173003 173356 173312
56692A73312j24j82n03q80j103j274j444j407j108p36k48O45J743K195J508K62
$$ 173312 173188 173006 172503 171623 170520 169246 167802 166395 165287 164551 164303 164948 166691 168886 170394 170656
56676A70656o03q72r62j056r30n53k84l55m61j12P06J418J454Q85K56j22m27o93
$$ 170656 170053 169181 168219 167163 166233 165680 165396 165041 164580 164468 165174 166592 168046 168931 169187 169065 168638 167945
56658A67945m27O83J976K371J679P31K05nj19P8P01J242J084K96n56j143j550
$$ 167945 167518 168201 170177 172548 174227 174958 175163 175158 175039 175117 175818 177060 178144 178440 177884 176741 175191
56641A75191j875k020j851j386q20m50m26o10p93r62j101r25k49M06K71n64j174
$$ 175191 173316 171296 169445 168059 167239 166789 166363 165753 164960 163998 162897 161972 161723 162129 162400 161836 160662
56624A60662j123j006j274j373p43K9n7r10j458j133l31M32J005J193P56N0j65
$$ 160662 159539 158533 157259 155886 155143 155172 155115 154205 152747 151614 151283 151715 152720 153913 154669 154719 154554
56607A54554K26M51L1n08n63m17n93p92k86P89J409R80L7n35m21J90J039J804
$$ 154554 154780 155231 155262 154754 154191 153774 153181 152389 152103 152892 154301 155281 155318 154783 154362 154552 155591 157395
56589A57395K101J860J487J276R00J2r17r27J86J524K139J988J642J477J514J714
$$ 157395 159496 161356 162843 164119 165019 165031 164114 163187 163373 164897 167036 169024 170666 172143 173657 175371
56573A75371K012K211K160J999J949K020K127K381K951L713M441N143N954O678
$$ 175371 177383 179594 181754 183753 185702 187722 189849 192230 195181 198894 203335 208478 214432 221110
56559B21110O900O565O172O211O642O985O826O127N169M236L362K456J644J170
$$ 221110 228010 234575 240747 246958 253600 260585 267411 273538 278707 282943 286305 288761 290405 291575
56545B91575R26M23n23j485k094k575l257l977m562n424o897q321q709q156p642
$$ 291575 292501 292924 292401 290916 288822 286247 282990 279013 274451 269027 262130 253809 245100 236944 229302
56530B29302p483p015n999n170n038n097m785m330l971l262j931p30m44o36l81
$$ 229302 221819 214804 208805 203635 198597 193500 188715 184385 180414 177152 175221 174491 174047 173411 173030
56515A73030J95J16p69j474j290o46k51j28R3M86Q07Q62N57j32r78j413j006J8
$$ 173030 173225 173341 172572 171098 169808 169162 168911 168783 168876 169362 170169 171031 171588 171456 170478 169065 168059 168077
56497A68077Q90J075P99O74Q58Q90M84Q4K06N25K86m63r01p21n74q72j087p72
$$ 168077 168967 170042 170841 171515 172373 173263 173747 173831 174037 174562 174848 174385 173484 172763 172189 171317 170230 169458
56479A69458m57p09r93m60N77J027O25J78K48N51P74J090J595J963J998J957K110
$$ 169458 169001 168292 167299 166839 167416 168443 169068 169246 169494 170045 170819 171909 173504 175467 177465 179422 181532
56462A81532K351K443K244J676Q89M19O30J046Q46M3n20m55k75l93m47n4M86P47
$$ 181532 183883 186326 188570 190246 191135 191554 192184 193230 194076 194119 193599 193144 192869 192476 192029 191975 192461 193208
56444A93208Q31R72J019Q81R59J467J754J069k27j029r68p83j161j834k138j889
$$ 193208 194039 195011 196030 196911 197870 199337 201091 202160 201933 200904 199936 199153 197992 196158 194020 192131
56428A92131j443j129r53p31l58K6Q5l10p87q20l91k0l8j03K54Q90J145P06J1
$$ 192131 190688 189559 188606 187875 187517 187543 187628 187318 186531 185711 185320 185300 185262 185159 185413 186303 187448 188154 188165
56409A88165l18k28j51l03l51O6Q04J342J423J279J212J217J141J030J056J165
$$ 188165 187847 187619 187468 187165 186814 186880 187684 189026 190449 191728 192940 194157 195298 196328 197384 198549
56393A98549J086P27L38J51O9m9K6O56J671K366K302J766J273R09N26K30K56N45
$$ 198549 199635 200362 200700 200851 200920 200871 200897 201553 203224 205590 207892 209658 210931 211840 212366 212596 212852 213397
56375B13397Q55J110J218Q04k93j370j491p69k47m11o17k93J95L23L06N15O73
$$ 213397 214252 215362 216580 217384 217091 215721 214230 213461 213214 212803 212186 211893 212088 212411 212717 213232 213905
56358B13905L80oK04R72J595J655J314R44R38J586K516K628J297n86j515j098
$$ 213905 214285 214279 214483 215455 217050 218705 220019 220963 221901 223487 226003 228631 229928 229342 227827 226729
56342B26729j86M38O50M62r3n04j31Q37J564J788K046K532K668K118J436J247
$$ 226729 226543 226981 227631 228093 228000 227496 227365 228202 229766 231554 233600 236132 238800 240918 242354 243601
56326B43601J464J703J866J916J644J120Q07Q83R35P18O54J063J525J523J292
$$ 243601 245065 246768 248634 250550 252194 253314 254121 255004 255939 256657 257311 258374 259899 261422 262714
56311B62714J386J733J774J328P32K26j91l51Q5J006J650J334L30l38l5P49J078
$$ 262714 264100 265833 267607 268935 269667 269893 269702 269351 269436 270442 272092 273426 273756 273418 273383 274132 275210
56294B75210Q28O94R66R85L26k47J60J100J418J084J149J926K471K206J794J854
$$ 275210 276038 276732 277698 278683 279009 278762 278922 280022 281440 282524 283673 285599 288070 290276 292070 293924
56278B93924J852J064j24p57o29k91j17ML36J092K263L367L768L587L623M125
$$ 293924 295776 296840 296716 295959 295330 295039 294922 294926 295262 296354 298617 301984 305752 309339 312962 317087
56262C17087M305L588K604K271K550K795K805K759K595K187J859J963K284K456
$$ 317087 321392 324980 327584 329855 332405 335200 338005 340764 343359 345546 347405 349368 351652 354108
56248C54108K564K761K803K622K770L438L675K682J431J703L631N431N762N127
$$ 354108 356672 359433 362236 364858 367628 371066 374741 377423 378854 380557 384188 389619 395381 400508
56234D00508M658M556M278L542K515J439N20l4j86p5K11O20R49R97R03R39R88
$$ 400508 405166 409722 414000 417542 420057 421496 422016 421982 421796 421721 421932 422552 423501 424498 425401 426340 427328
56217D27328O43j10o83n10M13J591K439K676K538K498K650K674K555K846L740
$$ 427328 427971 427861 427178 426668 427081 428672 431111 433787 436325 438823 441473 444147 446702 449548 453288
56202D53288M448M230L599L621M239M349L536K718K742L231L286K760K264K243
$$ 453288 457736 461966 465565 469186 473425 477774 481310 484028 486770 490001 493287 496047 498311 500554
56188E00554K531K624K241J673J575K225L095L515L575L889M573N120N285N465
$$ 500554 503085 505709 507950 509623 511198 513423 516518 520033 523608 527497 532070 537190 542475 547940
56174E47940O007O764P563Q510R524J0110J0076J0012J0565J1559J2335J2748
$$ 547940 553947 560711 568274 576784 586308 596418 606494 616506 627071 638630 650965 663713
56162F63713J3249J4030J4735J5205J5974J7611J9868K2059K4134K6816L0516
$$ 663713 676962 690992 705727 720932 736906 754517 774385 796444 820578 847394 877910
56151H77910L4824L9565M5703N4445O5830P9213R4917J14139J36947J61399J84862
$$ 877910 912734 952299 998002 1052447 1118277 1197490 1292407 1406546 1543493 1704892 1889754
56140A889754K04856K17923K19371K06261J80707J49286J19265R5814Q1610P6582
$$ 1889754 2094610 2312533 2531904 2738165 2918872 3068158 3187423 3283237 3364847 3441429
56130C441429P7057P6483O8701N1470K7413K219j8323l0812l5402l5484l6483
$$ 3441429 3518486 3594969 3663670 3715140 3742553 3744772 3726449 3695637 3660235 3624751 3588268
56119C588268m4101o2064r0140j23999j57236j83867j99779k03495j96567j82586
$$ 3588268 3544167 3482103 3391963 3267964 3110728 2926861 2727082 2523587 2327020 2144434
56109B144434j64911j45393j25278j06148q9145p4143o0820m9841m1797l5602
$$ 2144434 1979523 1834130 1708852 1602704 1513559 1439416 1378596 1328755 1286958 1251356
56099A251356k9321k2501j6470j2425j0177q824p561n868l747j776l70Q35K250
$$ 1251356 1222035 1199534 1183064 1170639 1160462 1151638 1144077 1138209 1134462 1132686 1132316 1133151 1135401
56086A135401L553M404N355O913Q399Q993R328J0612J2525J3661J3829J4185J5078
$$ 1135401 1138954 1143358 1148713 1155626 1164025 1173018 1182346 1192958 1205483 1219144 1232973 1247158 1262236
56073A262236J5476J4867J4065J3709J3389J2799J2447J2663J3035J3319J3946
$$ 1262236 1277712 1292579 1306644 1320353 1333742 1346541 1358988 1371651 1384686 1398005 1411951
56062A411951J5103J6294J7190J8040J8971J9787K0653K1992K3523K4420K4553
$$ 1411951 1427054 1443348 1460538 1478578 1497549 1517336 1537989 1559981 1583504 1607924 1632477
56051A632477K4611K4932K5259K5723K6862K8484K9703L0291L0863L1659L2303
$$ 1632477 1657088 1682020 1707279 1733002 1759864 1788348 1818051 1848342 1879205 1910864 1943167
56040A943167L2858L3801L4926L5585L6094L7482L9723M1641M2738M3711M5018
$$ 1943167 1976025 2009826 2044752 2080337 2116431 2153913 2193636 2235277 2278015 2321726 2366744
56029B366744M6430M8155N0786N3895N6246N7676N9301O1629O4080O6529O9589
$$ 2366744 2413174 2461329 2512115 2566010 2622256 2679932 2739233 2800862 2864942 2931471 3001060
56018C001060P3122P6207P8828Q1906Q5516Q8850R2059R6189J01134J05731J09957
$$ 3001060 3074182 3150389 3229217 3311123 3396639 3485489 3577548 3673737 3774871 3880602 3990559
56007C990559J14932J20687J26292J32185J39645J47875J54569J59824J66308
$$ 3990559 4105491 4226178 4352470 4484655 4624300 4772175 4926744 5086568 5252876
55998E252876J74954J83719J91621K00617K12170K25006K37800K51184K65744
$$ 5252876 5427830 5611549 5803170 6003787 6215957 6440963 6678763 6929947 7195691
55989G195691K80931K97191L16273L38228L61158L85035M12371M44075M78351
$$ 7195691 7476622 7773813 8090086 8428314 8789472 9174507 9586878 10030953 10509304
55980A0509304N14867N55967O02362O52123P05593P66718Q37552R16344J003275
$$ 10509304 11024171 11580138 12182500 12834623 13540216 14306934 15144486 16060830 17064105
55971A7064105J102892J218512J349679J498049J670336J872579K107716K382129
$$ 17064105 18166997 19385509 20735188 22233237 23903573 25776152 27883868 30265997
55963C0265997K708433L098890L563725M120095M795213N617142O612048P814542
$$ 30265997 32974430 36073320 39637045 43757140 48552353 54169495 60781543 68596085
55955F8596085R269465J1017924J3093784J5537279J8389478K1649883K5221350
$$ 68596085 77865550 88883474 101977258 117514537 135904015 157553898 182775248
55948A82775248K8830489L1875072L3288858L1713747K6143910J6702157M883770
$$ 182775248 211605737 243480809 276769667 308483414 334627324 351329481 356213251
55941C56213251p039840j7034081k4000986k7831325k9038214k8359490k6506770
$$ 356213251 349173411 332139330 308138344 280307019 251268805 222909315 196402545
55934A96402545k4046124k1368136j8718770j6245917j4026370j2081929j0402944
$$ 196402545 172356421 150988285 132269515 116023598 101997228 89915299 79512355
55927G9512355q969072p753260o721090n839801n086897m445743l898196l427155
$$ 79512355 70543283 62790023 56068933 50229132 45142235 40696492 36798296 33371141
55919C3371141l021580k673189k371610k107368j876161j675628j500740j345997
$$ 33371141 30349561 27676372 25304762 23197394 21321233 19645605 18144865 16798868
55911A6798868j209143j089105r82917q87876q04019p31402o67403o09442n57759
$$ 16798868 15589725 14500620 13517703 12629827 11825808 11094406 10427003 9817561 9259802
55902I259802n12859m72818m35741m02305l73214l46660l20952k97323k77311
$$ 9259802 8746943 8274125 7838384 7436079 7062865 6716205 6395253 6097930 5820619
55893E820619k59511k41717k24435k09435j96388j83592j70788j58801j47300
$$ 5820619 5561108 5319391 5094956 4885521 4689133 4505541 4334753 4175952 4028652
55884D028652j35276j23120j12634j05467j02469j03263j05535j06231j04669
$$ 4028652 3893376 3770256 3657622 3552155 3449686 3346423 3240888 3134657 3029988
55875C029988j02902j02103j00534r6399r0609q5034p9802p4187o8525o3456n8660
$$ 3029988 2927086 2824983 2724449 2628050 2537441 2452407 2372605 2298418 2229893 2166437 2107777
55864B107777n4145n1364n1271n2423n2756n2052n1122m9771m7391m4543m2192
$$ 2107777 2053632 2002268 1950997 1898574 1845818 1793766 1742644 1692873 1645482 1600939 1558747
55853A558747m0159l7806l5507l4007l3096l2198l1518l1406l1439l1160l0840
$$ 1558747 1518588 1480782 1445275 1411268 1378172 1345974 1314456 1283050 1251611 1220451 1189611
55842A189611l0548k9505k7476k5562k4531k3562k1840k0148j9461j9129j7996
$$ 1189611 1159063 1129558 1102082 1076520 1051989 1028427 1006587 986439 966978 947849 929853
55831I29853j6268j4821j3585j2076j0654r806q998p645o434o255o609o492o106
$$ 929853 913585 898764 885179 873103 862449 852643 843645 836000 829566 823311 816702 810210 804104
55818H04104o230o506n882m326k801j884j527j760k639l897n436p578j0113j2029
$$ 804104 797874 791368 785486 781160 778359 776475 774948 773188 770549 766652 761216 753638 743525 731496
55804G31496j2954j3813j5105j5720j4664j2807j1597j1147j0937j1209j2020
$$ 731496 718542 704729 689624 673904 659240 646433 634836 623689 612752 601543 589523
55793E89523j2025j0050o957m160j124L437Q400J0467P760J594n231j0441j2851
$$ 589523 577498 567448 560491 556331 555207 558644 567044 577511 585271 586865 581634 571193 558342
55780E58342j2604j1089r472p381l974L24M359P775J0233R860M757l865j2050
$$ 558342 545738 534649 525177 517796 513822 514146 518505 526280 536513 546373 551130 547265 535215
55767E35215j6949j8863j9294j8832j7530j5738j3678j1167q315n727l726k236
$$ 535215 518266 499403 480109 461277 443747 428009 414331 403164 394849 389122 385396 383160
55755C83160j554k294m305o608q498r900j0628j0344r348q404p731o996o325o251
$$ 383160 381606 379312 375007 368399 359901 350001 339373 329029 319681 311277 303546 296550 290225 283974
55741B83974o658o861o765o832o825n893m135k855k794l203l093k428j653r77
$$ 283974 277316 270455 263690 256858 250033 244140 240005 237150 234356 231153 228060 225632 223979 223002
55727B23002o51j050k030k846l178l503m082m362l801k709j761j249j112j167
$$ 223002 222351 221301 219271 216425 213247 209744 205662 201300 197499 194790 193029 191780 190668 189501
55713A89501j024k84P84J298P63l84j374j814j604q04J19L58n32k172l717m495
$$ 189501 188477 188193 188977 190275 191038 190654 189280 187466 185862 185058 185177 185535 185003 182831 179114 174619
55697A74619m345l608k783k043j253n15k77n58o89k84J08Oq7L97Q63M43m06m29
$$ 174619 170274 166666 163883 161840 160587 160072 159795 159237 158548 158264 158372 158378 158291 158688 159551 159994 159588 159159
55679A59159N32J432J703J724J646J116M08N02J632K773L009K598K301K442K929
$$ 159159 159691 161123 162826 164550 166196 167312 167720 168222 169854 172627 175636 178234 180535 182977 185906
55664A85906L438L423K622J634J184R64J52j043j662j825k749m609n898n554m405
$$ 185906 189344 192767 195389 197023 198207 199171 199323 198280 196618 194793 192044 187435 181537 175983 171578
55649A71578l629l102k215j281r65j019p01K5O65J116J561J800J482Q45N13P07
$$ 171578 167949 164847 162632 161351 160386 159367 158666 158691 159356 160472 162033 163833 165315 166160 166673 167380
55633A67380J155J556J726J513R24K12m49j143j887k461k748k825k696k325k041
$$ 167380 168535 170091 171817 173330 174254 174466 174017 172874 170987 168526 165778 162953 160257 157932 155891
55618A55891k323l002l298k838k074j486j067q66j294k468l804m639m838m589
$$ 155891 153568 150566 147268 144430 142356 140870 139803 138937 137643 135175 131371 126732 121894 117305
55604A17305m161l988m338m709m301l294k772l116l436k937j958j107l79K11J36
$$ 117305 113144 109156 104818 100109 95808 92514 89742 86626 83190 80253 78295 77188 76809 77020 77156
55589G7156p12j350r52p3J74k85o44n73n11q03j292j577j275l22O38O83j94r14
$$ 77156 76444 75094 74142 74069 74243 73958 73314 72741 72230 71427 70135 68558 67283 66961 67599 68282 68088 67174
55571F7174q42o37r87j376j051m57n43j107j106l85P3l01r61j180r30n75m11n72
$$ 67174 66332 65695 64708 63332 62281 61824 61281 60174 59068 58683 58756 58455 57494 56314 55384 54809 54398 53826
55553E3826r33r84l30O90J290J129N20j04m87m75r7L10M62M64M59K60k44p11q04
$$ 53826 52893 51909 51579 52269 53559 54688 55208 55104 54617 54142 54045 54355 54817 55281 55740 56000 55756 55045 54241
55534E4241p32q10q37n47k45k87k94K22P51L73o08p58M91J878J862M46j054j613
$$ 54241 53509 52699 51862 51315 51070 50783 50489 50711 51462 51835 51227 50469 50960 52838 54700 55146 54092 52479
55516E2479j319q32m68M0J001K137K693K282J330N36J59J65N97J373K000K053
$$ 52479 51160 50328 49860 49900 50901 53038 55731 58013 59343 59879 60038 60203 60800 62173 64173 66226
55500F6226J798J821K213K577K663K539K235J793J424J222Q86K94p1J39K38p12
$$ 66226 68024 69845 72058 74635 77298 79837 82072 83865 85289 86511 87397 87691 87620 87759 87997 87285
55484H7285k411l562l600l227l079k929k483k115k194k395k334k269k594k954
$$ 87285 84874 81312 77712 74485 71406 68477 65994 63879 61685 59290 56956 54687 52093 49139
55470D9139k639j657q39q23j388j873j974j943k087k248j925r98k0L97L10K20
$$ 49139 46500 44843 44004 43181 41793 39920 37946 36003 33916 31668 29743 28745 28725 29122 29432 29652
55454B9652K61J00l70p16n17J21P29Q88M45l65r59q83l48L4O1R0L60N88M19r0
$$ 29652 29913 30013 29643 28927 28410 28531 29260 30148 30593 30228 29269 28386 28038 28072 28133 28223 28583 29171 29590 29500
55434B9500o36r89r51l96M30R37Q09L28o0k57l28j96J45M03L75L38O44J035Q98
$$ 29500 28864 27875 26924 26528 26958 27895 28704 29032 28972 28715 28387 28191 28336 28739 29114 29452 30096 31131 32029
55415C2029J94l79l67j83m20q79q29j67K85j11r05j186q04l92k41J24J033J907
$$ 32029 32223 31844 31477 31294 30874 29995 29166 28999 29284 29173 28268 27082 26278 25886 25645 25769 26802 28709
55397B8709J922J108K99J06M15Q17J045R49N06L1L9O55J336J425Q87K60j5l9k12
$$ 28709 30631 31739 32038 32144 32559 33376 34421 35370 35876 35907 35946 36601 37937 39362 40249 40509 40494 40455 40243
55378D0243o65j117j200q83m98l72n16o26m71k16l20r59j586j425m93K48L3p59
$$ 40243 39578 38461 37261 36378 35880 35508 34992 34366 33895 33679 33359 32400 30814 29389 28896 29144 29177 28418
55360B8418j247j251j228j242r10l57l09r14j317q67p3K31Q7P8K74K57n5k69j56
$$ 28418 27171 25920 24692 23450 22540 22183 21874 20960 19643 18776 18703 18934 19021 19099 19373 19630 19575 19306 19150
55341A9150J42M12M82J05p57j609j804j223l57K05J80k68n85k72M45P26J73o10
$$ 19150 19292 19704 20186 20291 19534 17925 16121 14898 14541 14746 14926 14658 14073 13801 14246 14972 15145 14535
55323A4535q65o28l96k90j15J09L04O85J356J795J420M64k76m07j28K91O76Q39
$$ 14535 13670 13042 12646 12356 12241 12350 12654 13339 14695 16490 17910 18374 18098 17691 17563 17854 18530 19369
55305A9369Q16R88J429J565J035M51M91P70N22m9k02q4m34j059r95k50J1o19j035
$$ 19369 20185 21173 22602 24167 25202 25653 26144 26914 27436 27387 27185 27101 26667 25608 24613 24363 24374 23755 22720
55286B2720l16Q95J380Q50j47j001j193m62O34R67J99p02q15m21l28o43q90p45
$$ 22720 22404 23299 24679 25529 25382 24381 23188 22726 23360 24327 24526 23824 23009 22588 22260 21617 20727 19982
55268A9982j81O22J048L89j040j807j092J39M51q6k28N21J284J095L2j075j494
$$ 19982 19801 20423 21471 21860 20820 19013 17921 18060 18511 18425 18197 18718 20002 21097 21129 20054 18560
55251A8560j117m31o2p7L3N51J058J085Q11O35M45j57j059j684j685j164l88L47
$$ 18560 17443 17012 16950 16873 16906 17457 18515 19600 20411 21046 21491 21334 20275 18591 16906 15742 15354 15701
55233A5701O49L41k34n83o35o29n57j57O07J366J666J322N03k94n67l17j12m06
$$ 15701 16350 16691 16457 15874 15239 14610 14053 13896 14503 15869 17535 18857 19360 19066 18499 18182 18070 17664
55215A7664r63j184q17j17N09Q02P37N18L94M00M31N43Q10R68O89K81M19J015
$$ 17664 16701 15517 14700 14583 15092 15894 16631 17149 17543 17943 18374 18917 19727 20695 21384 21665 22084 23099
55197B3099J081J17j051j372q99l86q2K72O52P14L84j10o50j115j111m22M57Q05
$$ 23099 24180 24297 23246 21874 20975 20589 20507 20779 21431 22145 22529 22419 21769 20654 19543 19121 19578 20383
55179B0383N56K04J4p2NL37O49O36N00O09P84N41m4l87k67J4K42M06L13k06p17
$$ 20383 20939 21143 21157 21085 21090 21427 22076 22712 23212 23821 24605 25146 25102 24715 24448 24462 24704 25110 25423 25217 24500
55158B4500n29K81Q56O51o2q33j447j663j284p06o55j137j336p72P7O13Q31Q21
$$ 24500 23971 24252 25108 25759 25697 24864 23417 21754 20470 19764 19109 17972 16636 15864 15941 16554 17385 18206
55140A8206L50n02r04k18J021J758J724J505J479J386R73M49J39J9j88n76q81
$$ 18206 18556 18054 17150 16932 17953 19711 21435 22940 24419 25805 26778 27227 27366 27385 27197 26621 25740
55123B5740p51k07K50J59l11n67l68k4J97L54M18P9o50j124p91N8P34R98R88O67
$$ 25740 24989 24782 25032 25191 24880 24313 23945 23921 24118 24472 24890 24969 24319 23195 22404 22462 23196 24194 25182 25849
55103B5849n3p13n59M70J517J783J300N75r4o83j125j347j403j359j081m80J68
$$ 25849 25796 25083 24524 24994 26511 28294 29594 30169 30075 29392 28267 26920 25517 24158 23077 22597 22765
55086B2765M14J65k20l62k07J06M13N11J95m55j000j083q01m79j85K11N47M09
$$ 22765 23179 23344 23124 22762 22555 22661 23074 23585 23780 23325 22325 21242 20441 19962 19777 19988 20535 20944
55068B0944k89j015j182p40o4N78J152J587J617R85k38j513k107j721q59l57m25
$$ 20944 20655 19640 18458 17718 17654 18232 19384 20971 22588 23573 23335 21822 19715 17994 17135 16778 16353
55051A6353m36J37R50J215O71k32q99j012n25L23J010J136Q12M63K67R6q4j24
$$ 16353 15917 16054 17004 18219 18890 18658 17759 16747 16222 16545 17555 18691 19503 19966 20233 20329 20245 20121
55033B0121j0J21L38Q47J500J743J302O36M01O88J014R82O68L37O1k82o30o09
$$ 20121 20111 20232 20570 21417 22917 24660 25962 26598 26999 27687 28701 29683 30351 30688 30749 30467 29837 29228
55015B9228k9O30N37m80j569j760j046k03K80O05R79J159R08N54O78J336J864
$$ 29228 29199 29829 30366 29886 28317 26557 25511 25308 25588 26193 27172 28331 29239 29793 30471 31807 33671
54998C3671J594N75m40p96o34n81q19p72j5Q74R20P1o02k17R07J762J769J081
$$ 33671 35265 35840 35400 34604 33970 33389 32570 31798 31783 32657 33577 33648 33046 32829 33736 35498 37267 38348
54980C8348J31o40q22k31P90J555J663J270O98J4q10j533j675j038O8J138J839
$$ 38348 38479 37839 37017 36786 37576 39131 40794 42064 42762 42776 41966 40433 38758 37720 37788 38926 40765
54963D0765J948J300J10q47q95k45L18M78N54O11J54r55j935j996j270l31O85
$$ 40765 42713 44013 44123 43276 42381 42136 42454 42932 43486 44097 44251 43296 41361 39365 38095 37764 38449
54946C8449J796K461K063R58J22q7l7K58J331L155M770N455N586N894O450O822
$$ 38449 40245 42706 44769 45727 45849 45762 45725 45983 47314 50469 55239 60694 66280 72174 78624 85446
54930H5446O673N790L972J494p10j979k781m070n852p031o751n477m450m331m647
$$ 85446 92119 97909 101881 103375 102665 100686 97905 93835 87983 80952 74201 68724 64274 59943 55296
54915E5296m579m027l594l607l555k805j586o93m18k89O8M14M21K49K46N00R19
$$ 55296 50717 46690 43096 39489 35934 33129 31543 30850 30432 30143 30211 30625 31046 31295 31541 32041 32960
54898C2960J522K340L262M120M766N038M935M864N286N990O208N647M866M390
$$ 32960 34482 36822 40084 44204 48970 54008 58943 63807 69093 75083 81291 86938 91804 96194
54884I6194L866K565M38j799l403m169m464m918n890o967p293o548n291m158l189
$$ 96194 100060 102625 103063 101264 97861 93692 89228 84310 78420 71453 64160 57612 52321 48163 44974
54869D4974k284j770j906k209j911r99k22o9k95m32m15n00q16j144j092n65PJ32
$$ 44974 42690 40920 39014 36805 34894 33895 33673 33604 33309 32877 32462 31962 31146 30002 28910 28345 28352 28484
54851B8484m4O3N44P11J13p14r46n34p6L5j49m37n39q2Q05J269O76l80p58k73
$$ 28484 28440 28503 29047 29758 29871 29157 28211 27677 27601 27636 27487 27050 26511 26429 27234 28503 29179 28799 28041 27768
54831B7768K69L66L67N60O31L48P2J49K80Kn91j024j078r34q24q23q00m11O47
$$ 27768 28037 28403 28770 29330 29961 30309 30381 30530 30810 30812 30221 29197 28119 27185 26361 25538 24738 24327 24974
54812B4974K061K845K251O86o19r04n66m25n64k97O91J626J503M46l81k29M21
$$ 24974 27035 29880 32131 32817 32198 31294 30728 30303 29739 29442 30133 31759 33262 33708 33327 33098 33519
54795C3519P56P01O46O34M77L54O44J285J878K282K577K631K379K351L213M797
$$ 33519 34275 34976 35622 36256 36733 37087 37731 39016 40894 43176 45753 48384 50763 53114 56327 61124
54779F1124O314P420Q253Q447P231M872K911K325K209J115r69k844l813m204m364
$$ 61124 67438 74858 83111 91558 98789 103661 106572 108897 111106 112221 111252 108408 104595 100391 96027
54764I6027m037k998j577l54M15R38J659K870M328N410N792N726N409M458K574
$$ 96027 91990 88992 87415 87061 87476 88414 90073 92943 97271 102681 108473 114199 119608 124066 126640
54749A26640L86j066j629k105k985l822m067l855l572l106k068n35R39J900K287
$$ 126640 127026 125960 124331 122226 119241 115419 111352 107497 103925 100819 98751 98216 99155 101055 103342
54734A03342K262K121K220K621K764J927M4k128l745m528m638m351m050m186m842
$$ 103342 105604 107725 109945 112566 115330 117257 117301 115173 111428 106900 102262 97911 93861 89675 84833
54719H4833n403n112l938k631j863j662j728j928k212k324j979j242m90mJ84K00
$$ 84833 79430 74318 70380 67749 65886 64224 62496 60568 58356 56032 54053 52811 52321 52317 52501 52701
54703E2701K31M58P79P02j46j354j958j456l16O15R69R41P79N61L70L60N88R14
$$ 52701 52932 53390 54169 54871 54725 53371 51413 49957 49641 50256 51225 52166 52945 53506 53876 54236 54824 55738
54685E5738J193J402J516J410J027N91M05M09J78m64j028r03j92L88M63L64M05
$$ 55738 56931 58333 59849 61259 62286 62877 63282 63691 63869 63405 62377 61474 61282 61670 62133 62497 62902
54668F2902L58N8n0M74J172J253Q37Q33J520K066J768J089R13J358J898K363L074
$$ 62902 63260 63318 63268 63742 64914 66167 67004 67837 69357 71423 73191 74280 75193 76551 78449 80812 83886
54651H3886M201N526O893Q359R814J0832J1160J1051J0917J0852J0668J0204R306
$$ 83886 88087 93613 100506 108865 118679 129511 140671 151722 162639 173491 184159 194363 203669
54638B03669P588M626O02l416o222p541q163q968j0041j0813j0764r783q150o421
$$ 203669 211257 215883 216485 213069 206847 199306 191143 182175 172134 161321 150557 140774 132624 126203
54624A26203n142m324l405k100j046j060j959k719k759k368j838j048j62P8o02
$$ 126203 121061 116737 113332 111232 110186 109126 107167 104448 101689 99321 97483 96435 96273 96351 95749
54609I5749j353j229m89r6k95m09oN22O25L14m9k10j09J84M48M32J56m5J35P46
$$ 95749 94396 93167 92678 92582 92287 91878 91872 92394 93019 93333 93284 93074 92965 93149 93597 94029 94185 94140 94275 95021
54589I5021J616K462K936K838K333J865J789K092K439K494K267K143K369K516
$$ 95021 96637 99099 102035 104873 107206 109071 110860 112952 115391 117885 120152 122295 124664 127180
54575A27180J845L66r03j043l11L38M00J01k82o63q66o54j65J07q2m36n09j04
$$ 127180 129025 129391 128488 127445 127134 127472 127872 127973 127691 127028 126162 125508 125343 125450 125368 124932 124423 124319
54557A24319N80R91N91m33j042n01N55Q66K73j35L57J220J717J928K181K293K071
$$ 124319 124899 125890 126481 126048 125006 124505 125060 125926 126199 126064 126421 127641 129358 131286 133467 135760 137831
54540A37831K046K879M356N644O349O595O362N492M364L725L694L571K847J829
$$ 137831 139877 142756 147112 152756 159105 165700 172062 177554 181918 185643 189337 192908 195755 197584
54526A97584R75J83q38j877k428k452k432k716l122l292l122k723k154j429p34
$$ 197584 198559 198742 197904 196027 193599 191147 188715 185999 182877 179585 176463 173740 171586 170157 169423
54511A69423l35k58j94R5M55O03O16Q59J399J763J502P64J91L36J277K613L642
$$ 169423 169088 168830 168636 168731 169186 169789 170405 171264 172663 174426 175928 176692 176883 177219 178496 181109 184751
54494A84751L762K904J594M12m60j063j322j130o59j98K19P51J359J789J945J935
$$ 184751 188513 191417 193011 193423 192963 191900 190578 189448 188789 188591 188810 189561 190920 192709 194654 196589
54478A96589J747J218M09k80n47m83l18j50l6j25m40o27k76N42J204J076J01j125
$$ 196589 198336 199554 199963 199683 199136 198653 198335 198185 198149 198024 197584 196957 196681 197223 198427 199503 199604 198479
54460A98479j871j887j552j372j433j445j263j088j138j360j571j671j614j340
$$ 198479 196608 194721 193169 191797 190364 188919 187656 186568 185430 184070 182499 180828 179214 177874
54446A77874q66l11K28O54P00J23q21j421j334j012r79j022n95J57L85m37j891
$$ 177874 177008 176697 176925 177579 178279 178402 177581 176160 174826 173814 172835 171813 171218 171375 171760 171323 169432
54429A69432l185l859l845l271k454j759j237o69o2K50K01K81Q25J470J697J625
$$ 169432 166247 162388 158543 155272 152818 151059 149822 149153 149091 149341 149542 149823 150648 152118 153815 155440
54413A55440J643J608J090L41K05Q77J477J205L30l85p23q89p99k79J83k75j730
$$ 155440 157083 158691 159781 160122 160327 161204 162681 163886 164216 163831 163108 162219 161420 161141 161324 161049 159319
54396A59319l173l686l359k782k114j218l74j36m73o58k29L84N41L01K58N90Q02
$$ 159319 156146 152460 149101 146319 144205 142987 142613 142477 142004 141346 141117 141501 142042 142343 142601 143191 143993
54379A43993M71k05p81j132j356j356r26j82L87M13m9o96j242j459j258q83q13
$$ 143993 144464 144259 143478 142346 140990 139634 138708 138526 138913 139326 139277 138581 137339 135880 134622 133739 132926
54362A32926j267j915k229k034j590j262j206j293j237q77m10j94k33r1M90J079
$$ 132926 131659 129744 127515 125481 123891 122629 121423 120130 118893 118016 117606 117412 117179 117088 117578 118657
54346A18657R87J48p87j165r15m26j12j74n53j049j564k178k855l195k852k105
$$ 118657 119644 119792 119005 117840 116925 116499 116387 116213 115660 114611 113047 110869 108014 104819 101967 99862
54330I9862j642j716j893j756j424j202j079q99p33o78n16M3Q24J278J073M21
$$ 99862 98220 96504 94611 92855 91431 90229 89150 88251 87518 86840 86324 86367 87191 88469 89542 89963
54314H9963k27n45m46j52p5m97j195j677j717j545j433j390j315j235j248j363
$$ 89963 89736 89191 88745 88593 88518 88021 86826 85149 83432 81887 80454 79064 77749 76514 75266 73903
54298G3903j527j696j759j516r29l25j31l71n64l27J04J08n31j282j383o87K02
$$ 73903 72376 70680 68921 67405 66476 66151 66020 65649 65085 64758 64862 64970 64439 63157 61774 61087 61289
54281F1289N82L61Q7L49J185K018K265J926J502J298J057M80k10n09k71K29P10
$$ 61289 61871 62232 62319 62668 63853 65871 68136 70062 71564 72862 73919 74399 74189 73680 73409 73638 74348
54264G4348R46O10l99j449j638q63Q3O01Q56J094J154J075J399K260K780K142
$$ 74348 75294 75904 75505 74056 72418 71555 71638 72239 73095 74189 75343 76418 77817 80077 82857 84999
54248H4999Q18j26m48o61q50o49k33k57p13q58m46j69n28j121j428j460j309q47
$$ 84999 85817 85691 85243 84582 83732 83083 82850 82593 81880 81022 80576 80407 79879 78758 77330 75870 74561 73714
54230G3714l09l69j078j470q75L8K72p0k08rL1j63j71O4J26q5j95n8l0l60q77
$$ 73714 73405 73036 71958 70488 69613 69651 69923 69853 69645 69636 69667 69504 69333 69397 69523 69438 69243 69185 69155 68795 67918
54209F7918j331j669j841j739j426j162j164j416j649j425n18N76J012P37O23
$$ 67918 66587 64918 63077 61338 59912 58750 57586 56170 54521 53096 52578 53154 54166 54903 55526
54194E5526J017R23m64k090k152n98Q18R69M82K07o7o81j072o39J26K58l80j154
$$ 55526 56543 57466 57002 54912 52760 52162 52980 53949 54431 54638 54571 53890 52818 52179 52305 52563 52183 51029
54176E1029j657j891j834j445r13l99J74P11P27P1n27l80Q3j01r71j539j088O6
$$ 51029 49372 47481 45647 44202 43289 42890 43064 43775 44502 44573 44046 43666 43749 43648 42677 41138 40050 40116
54158D0116J143J622J360N63j93l75m2L35N40O60N89O9o90j013o41n4K82N49J087
$$ 40116 41259 42881 44241 44804 44611 44236 44194 44529 45069 45729 46318 46387 45697 44684 44043 43989 44271 44820 45907
54139D5907J709J916J564R97N50K35j17o55j352j967k200j996j591j146n56K54
$$ 45907 47616 49532 51096 52093 52643 52878 52761 52106 50754 48787 46587 44591 43000 41854 41298 41552
54123D1552R12Q18j68j399j954j471m56L04N14M72M56L38n7m29k47M54R89Q41
$$ 41552 42464 43282 43114 41715 39761 38290 37834 38138 38652 39124 39580 39918 39861 39432 39185 39639 40628 41469
54105D1469L27J45M41O58L59j72l52j11J05L9n3O0J37j38n67p11n88o04p74n88
$$ 41469 41796 41941 42382 43040 43399 43227 42875 42764 42869 42908 42855 42915 43052 42914 42347 41636 41048 40444 39670 39082
54085C9082J59R68J330J454J843K449K641K014Q67LP8J047K058K218J532Q19N85
$$ 39082 39241 40209 41539 42993 44836 47285 49926 51940 52807 52810 52888 53935 55993 58211 59743 60562 61147
54068F1147N19K65N3J26J54j14k23K10N68J01o90o67R4L96n2p6R75J989J735O93
$$ 61147 61666 61931 61984 62110 62264 62150 61927 62137 62705 62806 62116 61449 61543 61939 61887 61811 62786 64775 66510 67203
54048F7203K54P13J258J536K048K964L593L411K860K721L071L269K861K188K043
$$ 67203 67457 68170 69428 70964 73012 75976 79569 82980 85840 88561 91632 94901 97762 99950 101993
54033A01993K763L800M338M243M010L831L227J953O76K41N25O86L70L3K3pn42
$$ 101993 104756 108556 112894 117137 121147 124978 128205 130158 130834 131075 131600 132286 132656 132689 132712 132705 132163
54016A32163j508k444l067l418l564l465l071k513k093k068k382k668k655k446
$$ 132163 130655 128211 125144 121726 118162 114697 111626 109113 107020 104952 102570 99902 97247 94801
54002I4801k299k218j988j578j239j214j436j553j222m43L08L83l48j231j527
$$ 94801 92502 90284 88296 86718 85479 84265 82829 81276 80054 79611 79919 80302 79954 78723 77196
53987G7196j231r73j097j259j040n84l69m50l85L8L65L2p61j191q52k77j00j27
$$ 77196 75965 74992 73895 72636 71596 71012 70643 70193 69808 69846 70211 70243 69482 68291 67439 67162 67062 66935
53969F6935K16Q09R07L65p8P0L17J22j31K17R59J347J268J275J562J741J627J531
$$ 66935 67151 67960 68867 69232 69154 69224 69541 69663 69532 69749 70708 72055 73323 74598 76160 77901 79528 81059
53951H1059J582J466J081Q78J213J853K380K662K730K617K539K877L576M091M087
$$ 81059 82641 84107 85188 86066 87279 89132 91512 94174 96904 99521 102060 104937 108513 112604 116691
53936A16691L890L910M072M197M396M595M206K892J406Q13J040J020L30j84K93
$$ 116691 120581 124491 128563 132760 137156 141751 145957 148849 150255 151068 152108 153128 153458 153274 153567
53921A53567J351K034K207K524L290M037M278M132L911L530K734J642O58j61j132
$$ 153567 154918 156952 159159 161683 164973 169010 173288 177420 181331 184861 187595 189237 189895 189734 188602
53906A88602k242k793k183q16J74J48n02j036j212j293j555k051k677l196l368
$$ 188602 186360 183567 181384 180568 180742 180890 180388 179352 178140 176847 175292 173241 170564 167368 164000
53891A64000l271l333l778m225m155l698l542l999m558m515l809k967k403k036
$$ 164000 160729 157396 153618 149393 145238 141540 137998 133999 129441 124926 121117 118150 115747 113711
53877A13711j652j346j491k202l014l215k600j688j186j282j603j710j474j006
$$ 113711 112059 110713 109222 107020 104006 100791 98191 96503 95317 94035 92432 90722 89248 88242
53863H8242n05j71j20k20k54k06k73n06o73n98m33m18m93m27k43k69o81j230j514
$$ 88242 87737 87566 87446 87226 86972 86766 86493 85987 85314 84716 84283 83865 83372 82945 82702 82433 81752 80522 79008
53844G9008j347q01mQ41J382J334Q11L06J85L72N36M85K32j83o81j046j021o08
$$ 79008 77661 76860 76856 77697 79079 80413 81224 81530 81715 82087 82623 83108 83340 83157 82476 81430 80409 79801
53826G9801r9K35L32K39jk46k46O6M13N05M55O29J109J577J783J914K295K873
$$ 79801 79702 79937 80269 80508 80507 80261 80015 80081 80494 80999 81454 82083 83192 84769 86552 88466 90761 93634
53808I3634L210L019K541K342K687L307L740L861L908M027M007L600K863K066
$$ 93634 96844 99863 102404 104746 107433 110740 114480 118341 122249 126276 130283 133883 136746 138812
53794A38812J293M85j86l17J92Q96J268J239J054O91j37j388k370k326j278n4
$$ 138812 140105 140590 140404 140087 140279 141175 142443 143682 144736 145427 145290 143902 141532 139206 137928 137874
53778A37874N15K46n36j443k146k302j816j133q86j094j146p39m11p63j519j956
$$ 137874 138389 138635 138099 136656 134510 132208 130392 129259 128373 127279 126133 125394 124983 124220 122701 120745
53762A20745j971k024k141j783q94k82n14j089j247j055j043j189j034n93l64
$$ 120745 118774 116750 114609 112826 111932 111650 111136 110047 108800 107745 106702 105513 104479 103886 103522
53747A03522m99o25n40m55m77m38l66n08q37j020j045j200j380j110m59j42l61
$$ 103522 103023 102398 101858 101403 100926 100488 100122 99614 98777 97757 96712 95512 94132 93022 92563 92421 92060
53730I2060l24M81J328J313P54N38O45L60k63l09N52J555J992K014J968J774J385
$$ 92060 91736 92217 93545 94858 95612 96150 96795 97155 96892 96583 97135 98690 100682 102696 104664 106438 107823
53713A07823J211J440J473O25q17j772j478j53J389K454K936L247L753M331M615
$$ 107823 109034 110474 111947 112572 111755 109983 108505 108352 109741 112195 115131 118378 122131 126462 131077
53698A31077M573M487M376L959L280K789K532J910O54m85n48L99J461K099K518
$$ 131077 135650 140137 144513 148472 151752 154541 157073 158983 159637 159152 158604 159003 160464 162563 165081
53683A65081K928L078K706K033J595J690K133K393K064J315P95R11J329J355P47
$$ 165081 168009 171087 173793 175826 177421 179111 181244 183637 185701 187016 187811 188722 190051 191406 192153
53668A92153j09o76p21l71JK3l22n73k68N26J294J625J441Q14j24j077j619j517
$$ 192153 192044 191368 190647 190276 190277 190300 189978 189405 189137 189663 190957 192582 194023 194837 194713 193636 192017 190500
53650A90500r62m78n61j256k022k162j506m92M00J038J366J188M92l10q62j264
$$ 190500 189538 189060 188499 187243 185221 183059 181553 181061 181461 182499 183865 185053 185545 185235 184373 183109
53634A83109j720k064k084k004k120k203j771q72k8M59O72O89O12Q63J738K690
$$ 183109 181389 179325 177241 175237 173117 170914 169143 168271 168243 168702 169374 170063 170675 171538 173276 175966
53618A75966K797K073J577K007K896L461L571L426K981K297J913K214K747K853
$$ 175966 178763 180836 182413 184420 187316 190777 194348 197774 200755 203052 204965 207179 209926 212779
53604B12779K707L052L939M522M125L103K314K231K690L287L683L713L386K808
$$ 212779 215486 218538 222477 226999 231124 234227 236541 238772 241462 244749 248432 252145 255531 258339
53590B58339K064J238N42K02J28j18p59j348j196l65J85k31j002r64p0M87L7n25
$$ 258339 260403 261641 262183 262385 262513 262395 261636 260288 259092 258727 258912 258681 257679 256715 256645 257132 257169 256644
53572B56644q9Q90R96j24j366j827j798j783j538o55N29J290J352R18K68k32j64
$$ 256644 256555 257445 258441 258317 256951 255124 253326 251543 250005 249350 249879 251169 252521 253439 253707 253475 253311
53555B53311L33M15m23j488j688r48p0N31J165J924K216J583M55k32J33J464L091
$$ 253311 253644 254059 253636 252148 250460 249512 249442 249973 251138 253062 255278 256861 257316 257084 257217 258681 261772
53538B61772M103M023L317K982L472M295M802M949N118N459N819O079O344O831
$$ 261772 265875 269898 273215 276197 279669 283964 288766 293715 298833 304292 310111 316190 322534 329365
53524C29365P739R129J0729J2050J2867J3403J3916J4261J4179J3834J3771J4334
$$ 329365 337104 346233 356962 369012 381879 395282 409198 423459 437638 451472 465243 479577
53512D79577J5463J7016J8942K1005K2736K3885K4740K5700K6769K7742K8577
$$ 479577 495040 512056 530998 552003 574739 598624 623364 649064 675833 703575 732152
53501G32152K9208K9203K8254K7012K6721K7742K9062K9647K9774L0371L1567
$$ 732152 761360 790563 818817 845829 872550 900292 929354 959001 988775 1019146 1050713
53490A050713L2711L3588L4586L5598L5697L4406L2444L0694K9002K6693K3934
$$ 1050713 1083424 1117012 1151598 1187196 1222893 1257299 1289743 1320437 1349439 1376132 1400066
53479A400066K1717K0572K0025J9473J9030J9201K0059K1055K1579K1392K0570
$$ 1400066 1421783 1442355 1462380 1481853 1500883 1520084 1540143 1561198 1582777 1604169 1624739
53468A624739J9230J7461J5451J3438J1406Q914N483J199l298p411j0953j3901
$$ 1624739 1643969 1661430 1676881 1690319 1701725 1710639 1716122 1717321 1714023 1706612 1695659 1681758
53456A681758j6069j7349j8121j9036k0446k2135k3794k5549k7835l0601l2854
$$ 1681758 1665689 1648340 1630219 1611183 1590737 1568602 1544808 1519259 1491424 1460823 1427969
53445A427969l3456l2419l1045l0557l0878l1171l1087l0913l0748l0264k9335
$$ 1427969 1394513 1362094 1331049 1300492 1269614 1238443 1207356 1176443 1145695 1115431 1086096
53434A086096k8101k6460k4112k1289j8664j6389j3991j1432r347p798n758k545
$$ 1086096 1057995 1031535 1007423 986134 967470 951081 937090 925658 916311 908513 902755 900210
53422I00210R66L508N210P251J0101J3055J5409J7220J8866K0605K2530K4400
$$ 900210 901176 904684 909894 917145 927246 940301 955710 972930 991796 1012401 1034931 1059331
53410A059331K5582K5790K5827K6879K9114L1536L3294L4436L5402L6492L8005
$$ 1059331 1084913 1110703 1136530 1163409 1192523 1224059 1257353 1291789 1327191 1363683 1401688
53399A401688M0297M3336M6673M9990N3359N6869O0371O3697O6672O8919P0101
$$ 1401688 1441985 1485321 1531994 1581984 1635343 1692212 1752583 1816280 1882952 1951871 2021972
53388B021972P0512P1011P2200P3975P5832P7183P7360P5895P3026O9590O6222
$$ 2021972 2092484 2163495 2235695 2309670 2385502 2462685 2540045 2615940 2688966 2758556 2824778
53377B824778O2977N9679N6285N2866M9696M7377M6282M5836M4865M2842M0338
$$ 2824778 2887755 2947434 3003719 3056585 3106281 3153658 3199940 3245776 3290641 3333483 3373821
53366C373821L8065L5945L3197K8858K2057J2346O7j3908k8810m3813n7396o7783
$$ 3373821 3411886 3447831 3481028 3509886 3531943 3544289 3544356 3530448 3501638 3457825 3400429 3332646
53354C332646p4509p8852q2255q4842q6021q5923q5460q5234q5002q4163q2337
$$ 3332646 3258137 3179285 3097030 3012188 2926167 2840244 2754784 2669550 2584548 2500385 2418048
53343B418048p9619p6684p4465p3474p3460p3893p4381p4407p3211p0459o6756
$$ 2418048 2338429 2261745 2187280 2113806 2040346 1966453 1892072 1817665 1744454 1673995 1607239
53332A607239o3002n9401n5580n1428m7277m3261l9110l4620l0009k5632k1668
$$ 1607239 1544237 1484836 1429256 1377828 1330551 1287290 1248180 1213560 1183551 1157919 1136251
53321A136251j8137j5138j2891j1533j0814j0105q937p502o317n451m581l732
$$ 1136251 1118114 1102976 1090085 1078552 1067738 1057633 1048696 1041194 1034877 1029426 1024845 1021113
53309A021113l315l129k167P3K640M270N030N970P459Q837R735J0768J2559J4833
$$ 1021113 1017798 1014669 1012502 1012575 1015215 1019485 1024515 1030485 1037944 1046781 1056516 1067284 1079843 1094676
53295A094676J6915J8668K0376K2101K3611K4952K6548K8660L0961L2828L3998
$$ 1094676 1111591 1130259 1150635 1172736 1196347 1221299 1247847 1276507 1307468 1340296 1374294
53284A374294L4779L5602L6437L6760L6062L4320L2016K9881K8533K8056K7893
$$ 1374294 1409073 1444675 1481112 1517872 1553934 1588254 1620270 1650151 1678684 1706740 1734633
53273A734633K7402K6591K5958K5483K4216K1187J6547J1410O715K585j377n543
$$ 1734633 1762035 1788626 1814584 1840067 1864283 1885470 1902017 1913427 1920142 1922727 1921350 1915807
53261A915807j0110j5213k0904k6944l2681l7298m0456m2653m4741m7080m9367
$$ 1915807 1905697 1890484 1869580 1842636 1809955 1772657 1732201 1689548 1644807 1597727 1548360
53250A548360n1194n2259n2120n0366m7304m3976m1125l8609l6165l4237l3471
$$ 1548360 1497166 1444907 1392787 1342421 1295117 1251141 1210016 1171407 1135242 1101005 1067534
53239A067534l3799l4649l5784l7280l8832l9671l9360l8183l6742l5374l3931
$$ 1067534 1033735 999086 963302 926022 887190 847519 808159 769976 733234 697860 663929
53228F63929l1877k8736k4664k0481j6852j3791j1165r316q558q460q248p782
$$ 663929 632052 603316 578652 558171 541319 527528 516363 507047 498489 490029 481781 473999
53216D73999p531p702q032q419r063r887j0366j0110r273q322p773q009q829r268
$$ 473999 466468 458766 450734 442315 433252 423365 412999 402889 393616 385294 377521 369512 360683 351415
53202C51415q537p189o582p061p452o816n859n923p057p934p613o575n912o006
$$ 351415 342878 335689 329107 322046 314594 307778 301919 295996 288939 281005 273392 266817 260905 254899
53188B54899o370o472o280o037n795n430m941m521m254l959l467k876k425k241
$$ 254899 248529 242057 235777 229740 223945 218515 213574 209053 204799 200840 197373 194497 192072 189831
53174A89831k257k261j996j439j002j122j589j623q86K1K94k32j240k427l367
$$ 189831 187574 185313 183317 181878 180876 179754 178165 176542 175656 175677 175971 175739 174499 172072 168705
53159A68705l446k557j502j051j027q83p46j032j361r74p4L09j25n94n78m82o36
$$ 168705 165259 162702 161200 160149 159122 158239 157493 156461 155100 154126 154052 154361 154236 153642 153064 152582 151946
53142A51946p21o15q95j761k352j915j008o95r77r13q0Q96J250R16L80P1M4M8
$$ 151946 151225 150610 149715 147954 145602 143687 142679 141984 141007 140094 140014 140910 142160 143076 143456 143527 143571 143619
53124A43619j66n59q75j020j045q78l93K22N78O41O24L22p85k488l571l167j862
$$ 143619 143453 142894 142019 140999 139954 139076 138683 138905 139483 140124 140748 141070 140285 137797 134226 131059 129197
53107A29197r49r70j439j747j744j607j548j579j449r58m89p06j516j946j448
$$ 129197 128248 127278 125839 124092 122348 120741 119193 117614 116165 115207 114718 114012 112496 110550 109102
53092A09102p30p00j122j068l74K25K79J27J55K03n5n75r70q76k35N40Q04K98
$$ 109102 108372 107672 106550 105482 105108 105333 105612 105739 105894 106097 106042 105467 104497 103621 103386 103926 104730 105028
53074A05028n00q65n49J62Q21J100Q93M49J90J99J68J3L4K13J2o53r24k09O98
$$ 105028 104528 103663 103114 103276 104097 105197 106090 106539 106729 106928 107096 107109 107143 107356 107368 106715 105791 105582 106280
53055A06280O78l1k88N5Qp97j429j164o00o38j207j690j947k163k092j298j1Q40
$$ 106280 106958 106927 106639 106694 106702 105905 104476 103312 102712 102074 100867 99177 97230 95067 92975 91677 91666 92506
53037I2506N92n19j674k145j701o69L36Q07O37P8m39n47j80M04R24J350J663J526
$$ 92506 93098 92579 90905 88760 87059 86390 86726 87533 88170 88248 87809 87262 87082 87486 88410 89760 91423 92949
53019I2949O10p76j729j629p50J07L94K36K19Q56K017K910K799J737M40m84r25
$$ 92949 93559 92783 91054 89425 88675 88782 89176 89412 89631 90487 92504 95414 98213 99950 100390 99906 98981
53002I8981r69o43K3Q36J498J670J167K49m61o20n90q52j245j220p17j55L14Q95
$$ 98981 98012 97369 97392 98228 99726 101396 102563 102812 102351 101731 101141 100289 99044 97824 97107 96952 97266 98161
52984I8161J470J488Q34J95K36Q14J269J209P24J65j34j16j24m41p66n09L19R80
$$ 98161 99631 101119 101953 102148 102384 103198 104467 105676 106400 106565 106431 106315 106191 105750 104984 104475 104794 105774
52966A05774R19L76m0Q0P85J654J804O85q84j287j07J233J268K52n81p62p37o99
$$ 105774 106693 107069 107029 107109 107894 109548 111352 112037 111153 109866 109759 110992 112260 112512 111931 111169 110432 109733
52948A09733l90Q2J59k70o18m21O6L40K77J73L81J003J738K069J766J162O81L56
$$ 109733 109343 109425 109584 109314 108696 108275 108341 108681 108958 109131 109512 110515 112253 114322 116088 117250 117931 118287
52930A18287M7j04J19N27P46P71Q27P92L00n32j080r79n22j29J43M18O87Q63R07
$$ 118287 118334 118230 118349 118876 119622 120393 121220 122012 122312 121780 120700 119721 119199 119070 119213 119631 120318 121181 122088
52911A22088P38K78l02o03l33M19J289J842J752J027Q5n98q76q46n81k20p7k71
$$ 122088 122826 123104 122802 122199 121866 122285 123574 125416 127168 128195 128280 127682 126806 125960 125379 125159 125082 124811
52893A24811l91l9M75M59j17n47m08q8r6l82o36q13r60r03m87N7L54K63o0l79
$$ 124811 124420 124381 124856 125315 125198 124651 124243 124155 124059 123677 123041 122228 121268 120365 119878 119935 120289 120552 120492 120113
52873A20113m70k14K14N22P29J162J899K553K799K776K740K627K201J418M19o05
$$ 120113 119643 119429 119643 120165 120894 122056 123955 126508 129307 132083 134823 137450 139651 141069 141488 140883
52857A40883j389j781k058k663l435l629k960k141j868j875j566j096j038j318
$$ 140883 139494 137713 135655 132992 129557 125928 122968 120827 118959 117084 115518 114422 113384 112066
52843A12066j344j062r16q48l13N30O39l95j531j594q42m43q26j324j280p83k63
$$ 112066 110722 109660 108744 107896 107583 108113 108752 108357 106826 105232 104390 103947 103121 101797 100517 99734 99471
52826I9471K1o9n98j327j788j712j230n79J26O94P89L30k39m16k48j86l84n17
$$ 99471 99492 99423 98825 97498 95710 93998 92768 92189 92315 93009 93798 94128 93889 93473 93225 93039 92655 92138
52808I2138l91l79q54j429j292l51L86l9j326k243k020r57K69J316K055K200J626
$$ 92138 91747 91368 90514 89085 87793 87442 87828 87789 86463 84220 82200 81243 81512 82828 84883 87083 88709
52791H8709P29J17n1m8l7J13M19N57K58l61r43j299j454j474j404j334j377j521
$$ 88709 89438 89555 89504 89456 89419 89532 89951 90508 90766 90405 89462 88163 86709 85235 83831 82497 81120 79599
52773G9599j632j580j302p73l0P40J196J087N36Lj19J13K64K2m46p02n26j52M0
$$ 79599 77967 76387 75085 74312 74282 75022 76218 77305 77841 77844 77725 77838 78102 78124 77678 76976 76450 76298 76338
52754G6338n5j67lM04P04O55L99K98N16Q85J142J139Q39L13j63k43J41O79J099
$$ 76338 76283 76116 76113 76517 77221 77876 78275 78573 79089 79974 81116 82255 83094 83407 83244 83001 83142 83821 84920
52735H4920J433J741J821J508J153J312J965K421K151J394P28L47K3l72o89p97
$$ 84920 86353 88094 89915 91423 92576 93888 95853 98274 100425 101819 102547 102894 102917 102545 101856 101059
52719A01059q58j130j585j822j497q45n83j002j442r77L10J328J321O68J28k00
$$ 101059 100201 99071 97486 95664 94167 93322 92739 91737 90295 89318 89628 90956 92277 92945 93073 92873
52703I2873n99r33q46n19m65o04l93J02R7n97j021m06O46J046P81O58Q18N98q1
$$ 92873 92274 91341 90495 89976 89511 88907 88514 88616 88713 88116 87095 86689 87335 88381 89162 89820 90638 91236 91155
52684I1155k83N38J573J760J191O85M55L6o19q92n20pK62N99J279J785J410K79
$$ 91155 90872 91410 92983 94743 95934 96619 97074 97110 96491 95599 95079 95072 95334 95933 97212 98997 100407 100686
52666A00686q49j528j780j481m65P42J055J45j057j529j347j189j116o14L32R82
$$ 100686 99837 98309 96529 95048 94583 95325 96380 96525 95468 93939 92592 91403 90287 89673 90005 90987
52650I0987P62q2r14j328j224o90k8L91N45P47J112J350J294J254J534J858J673
$$ 90987 91749 91667 90753 89425 88201 87511 87483 87874 88419 89166 90278 91628 92922 94176 95710 97568 99241
52633I9241R05J4o11r55j043p60j68K58J3q21j528j436o22J39K90J42M23J168
$$ 99241 100146 100160 99549 98594 97551 96791 96623 96881 96894 96073 94545 93109 92487 92626 92916 93058 93481 94649
52615I4649J529R00j57n88k02J24l45j275j700j100J78J330J765J442P60J38k33
$$ 94649 96178 97078 96921 96333 96131 96255 95910 94635 92935 91835 92013 93343 95108 96550 97310 97448 97215
52598I7215l03j6M69O69K84k61k33M26R91R45N39J85j38m74m49J55Q26R26O80
$$ 97215 96912 96896 97365 98034 98318 98057 97824 98250 99241 100186 100725 100910 100772 100298 99849 100004 100830 101756 102436
52579A02436P46J031P69k30j180j407j085o01mN39M68l29r96p84j68j13n55o01
$$ 102436 103182 104213 104982 104752 103572 102165 101080 100479 100475 101014 101482 101153 100157 99373 99205 99092 98537 97936
52561I7936q4J10o02j640k109j841j217n50r4j28n41o92j29Q26J558J890J953
$$ 97936 97852 97962 97360 95720 93611 91770 90553 90003 89909 89781 89240 88548 88419 89245 90803 92693 94646
52544I4646J676R32j3o56q04n45M0P73J170Q84K12l20p22j294j768j481m53M14
$$ 94646 96322 97254 97241 96585 95781 95236 95276 96049 97219 98103 98315 97995 97273 95979 94211 92730 92277 92691
52526I2691N35L41M46P34P06L52N1n6q9J8M27R24R48K64p18j296j069k29N51P08
$$ 92691 93226 93567 94013 94747 95453 95805 95856 95800 95711 95729 96156 97080 98028 98292 97574 96278 95209 94980 95531 96239
52506I6239M07M16J082J658J163k58j295r92J86J038R62K80n21j252j742j626
$$ 96239 96646 97062 98144 99802 100965 100707 99412 98420 98606 99644 100606 100886 100365 99113 97371 95745
52490I5745p68L40R91J035Q70P23L33m10r98q49o3P02R66O33k39j293j670p06
$$ 95745 94977 95317 96308 97343 98213 98936 99269 98859 97861 97012 96949 97651 98617 99250 99011 97718 96048 95342
52472I5342J043K154J915R45J04m55p95o20J01O52N02K16M94Q07R5j333j851o78
$$ 95342 96385 98539 100454 101399 101503 101048 100253 99633 99734 100386 100888 101104 101598 102405 102500 101167 99316 98638
52454I8638J064J879J554Q69L51kk68m87p81j129j277j135j018j146j168n77O57
$$ 98638 99702 101581 103135 104004 104355 104353 104085 103598 102817 101688 100411 99276 98258 97112 95944 95367 96024
52437I6024J937K509J918M25r02j009M5J137J463J241R37M84j31k81M42J254J055
$$ 96024 97961 100470 102388 102813 101911 100902 100947 102084 103547 104788 105725 106209 106078 105797 106239 107493 108548
52420A08548N0m89o0M45J85m60o45k74Q3J02l6j44k40l63l91j96J60M68O15P66
$$ 108548 108598 108109 108049 108494 108679 108219 107574 107300 107383 107485 107449 107305 107065 106702 106311 106115 106275 106743 107358 108124
52400A08124J112J428J193L81k61j24L74L72j92o18n91n01n07k20M46Q73O86L67
$$ 108124 109236 110664 111857 112238 111977 111853 112227 112599 112407 111789 111198 110697 110190 109970 110416 111289 111975 112342
52382A12342L93M23K2m25l26O9J10j3M29J278J469O40k08q3P41J411J735K009
$$ 112342 112735 113158 113180 112755 112429 112498 112608 112595 113024 114302 115771 116411 116203 116120 116861 118272 120007 122016
52364A22016K173J905J373J095J066O93k26j065j116m16M79J165J591J801J823
$$ 122016 124189 126094 127467 128562 129628 130321 130095 129030 127914 127498 127977 129142 130733 132534 134357
52349A34357J735J560J220P61N27P69J133J002L90N9M91J145J175O33L66P89J359
$$ 134357 136092 137652 138872 139633 140160 140929 142062 143064 143454 143513 144004 145149 146324 146957 147323 148112 149471
52332A49471J485J388J725K674L884N079O214P134P524P369P077P068P384P860
$$ 149471 150956 152344 154069 156743 160627 165706 171920 179054 186578 193947 201024 208092 215476 223336
52318B23336Q381Q835R070R058R058R368R978J0584J0964J1229J1625J2149J2420
$$ 223336 231717 240552 249622 258680 267738 277106 287084 297668 308632 319861 331486 343635 356055
52305C56055J2144J1626J1604J2355J3117J2732J0902Q580P057O847P439P860
$$ 356055 368199 379825 391429 403784 416901 429633 440535 449115 456172 463019 470458 478318
52293D78318P371N900L994K270R04k93j343k032k410k910l687m264m214l891l953
$$ 478318 485689 491589 495583 497853 498757 498464 497121 495089 492679 489769 486082 481818 477604 473713 469760
52278D69760m377m470l900l136k699k483k065j338m53N81J890L346M501N014N030
$$ 469760 465383 460913 457013 453877 451178 448695 446630 445292 444839 445420 447310 450656 455157 460171 465201
52263D65201N090N674O758P815Q369Q560Q949R737J0428J0422R722Q859Q290Q076
$$ 465201 470291 475965 482723 490538 498907 507467 516416 526153 536581 547003 556725 565584 573874 581950
52249E81950P938P434O253M660L420K914K522J386l32j605k039k426l544n079
$$ 581950 589888 597322 603575 608235 611655 614569 617091 618477 618145 616540 614501 612075 608531 603452
52235F03452o238o961p756q651r170r233r358r785j0064r750r033q390q033p912
$$ 603452 597214 590253 582497 573846 564676 555443 546085 536300 526236 516486 507453 499063 491030 483118
52221D83118p876p574o625n273m417m575n129n073m264l375k830k418j922j518
$$ 483118 475242 467668 461043 455770 451353 446778 441649 436576 432312 428937 426107 423689 421767 420249
52207D20249j323j056m18N20J401J888J787J217P47R41J697K199J837Q71R3L7
$$ 420249 418926 417870 417452 417972 419373 421261 423048 424265 425012 425953 427650 429849 431686 432557 432650 432687
52191D32687O59J478J866J440M40m54p63o02l24j56k16o15j295k007k614l163
$$ 432687 433346 434824 436690 438130 438570 438116 437353 436751 436427 436271 436055 435440 434145 432138 429524 426361
52175D26361l514l295k447j496r83r43j153j557k125k634k902k990k852k271j507
$$ 426361 422847 419552 417105 415609 414626 413683 412530 410973 408848 406214 403312 400322 397470 395199 393692
52160C93692j438k398l415l397k654k305k473k285j600j396k067k579k004q80
$$ 393692 392254 389856 386441 383044 380390 378085 375612 373327 371727 370331 368264 365685 363681 362801
52146C62801k08N4N56J153J123M31k18m99p19q90m90O04J693K121K022J852J739
$$ 362801 362593 362647 363203 364356 365479 365910 365692 365193 364474 363584 363094 363698 365391 367512 369534 371386 373125
52129C73125J716K172L429N030O002N936N436N379O058P217Q624J0200J1634J2405
$$ 373125 374841 377013 380442 385472 391474 397410 402846 408225 414283 421500 430124 440324 451958 464363
52115D64363J2433J2348J2752J3376J3457J2825J2100J1728J1470J1041J0748
$$ 464363 476796 489144 501896 515272 528729 541554 553654 565382 576852 587893 598641
52104E98641J0986J1489J1589J1042J0070Q809P209N408L751K357J091o7r85j740
$$ 598641 609627 621116 632705 643747 653817 662626 669835 675243 678994 681351 682442 682375 681390 679650
52090F79650k612l693m816n918p029p850p940p474p353q142r194r318q139o412
$$ 679650 677038 673345 668529 662611 655582 647732 639792 632318 624965 616823 607629 598311 590172 583760
52076E83760n048m196l413k397j323n48j54Q9M89J251K484M191O076P623Q521
$$ 583760 578712 574516 571103 568706 567383 566835 566681 566770 567259 568510 570994 575185 581261 588884 597405
52061E97405Q951R273R579R729R708R662R568R212Q574P944P579P400P070O282
$$ 597405 606356 615629 625208 634937 644645 654307 663875 673087 681661 689605 697184 704584 711654 717936
52047G17936M980L498K349J682R69m35k430m273n487o324p186q099q973r980j1246
$$ 717936 722916 726414 728763 730445 731414 730979 728549 724276 718789 712465 705279 697180 688207 678227 666981
52032F66981j2479j3231j3471j3505j3511j3433j3298j3296j3514j3797j3900
$$ 666981 654502 641271 627800 614295 600784 587351 574053 560757 547243 533446 519546
52021E19546j3653j3028j2204j1528j1187j0906j0161q827p524p115p831q925
$$ 519546 505893 492865 480661 469133 457946 447040 436879 428052 420528 413413 405582 396657
52009C96657r401q991q293p887p691p306o694o096n575n096m969n580o672p419
$$ 396657 387256 378265 369972 362085 354394 347088 340394 334298 328723 323627 318658 313078 306406 298987
51995B98987p363o808o190n626n236n272n588n564m942m307m220m403m249l748
$$ 298987 291624 284816 278626 273000 267764 262492 256904 251340 246398 242091 237871 233468 229219 225471
51981B25471l307l019k707k440k405k507k647l088l992m829m958m571m328m290
$$ 225471 222164 219145 216438 213998 211593 209086 206439 203351 199359 194530 189572 185001 180673 176383
51967A76383m041l683l774m253m346l725k881k165j424p94r06j741k290j951j517
$$ 176383 172342 168659 164885 160632 156286 152561 149680 147515 146091 145297 144391 142650 140360 138409 136892
51952A36892j966k986l540l315k780k182j486j007j112j392j027n6N81L54k37
$$ 136892 134926 131940 128400 125085 122305 120123 118637 117630 116518 115126 114099 114043 114624 114978 114741
51937A14741n56n77n16l55j70l11q56j274j100n81l05m10n88o55o79o57l92J88
$$ 114741 114185 113608 113092 112737 112567 112256 111400 110126 109026 108445 108140 107730 107142 106487 105808 105151 104759 104947
51919A04947Q74J344J368R18K10l71n97o16p80j199j597j646j296p69k51K49P57
$$ 104947 105821 107165 108533 109451 109661 109290 108693 108077 107297 106098 104501 102855 101559 100790 100539 100788 101545
51902A01545J136J115N99j70p95j050r74p31m55k07j0J11J02m6j53L5M69O99L80
$$ 101545 102681 103796 104395 104225 103430 102380 101406 100675 100220 100013 100003 100114 100216 100170 100017 100052 100521 101220 101600
51883A01600j80k48M45J319J552R96K61l3R0J70M6J34Q75K064K976L178K968K959
$$ 101600 101420 101172 101617 102936 104488 105484 105745 105712 105802 105972 106018 106152 107027 109091 112067 115245 118213 121172
51865A21172L425M168M858N282N378N226M973M716M514M421M381L999K822R45
$$ 121172 124597 128765 133623 138905 144283 149509 154482 159198 163712 168133 172514 176513 179335 180280
51851A80280r75k502l826n107n880n630m671l835l456l212k858k493k139j692
$$ 180280 179305 176803 172977 167870 161990 156360 151689 147854 144398 141186 138328 135835 133696 132004
51837A32004j332j370j592j427q03k40K2L13O81O26J2m97m63m09q38j194o74L88
$$ 132004 130672 129302 127710 126283 125480 125240 125262 125575 126256 126882 126894 126397 125934 125525 124687 123493 122819 123207
51819A23207R02O09K50K76L02J4k16j7L30L39L4j84j16N9N3k25n75o51l33J11
$$ 123207 124109 124718 124968 125244 125546 125560 125344 125327 125657 125996 126030 125846 125730 125789 125842 125617 125042 124391 124058 124169
51799A24169M13O03P01L99m36j171r93n8O22N30J85J44K14R0J9L03O15M38r5m72
$$ 124169 124582 125185 125886 126285 125849 124678 123685 123627 124249 124779 124964 125108 125322 125412 125431 125734 126349 126787 126692 126220
51779A26220n99p63q70m94K53N59j06j191j661j135j98L49K87J8qK44M43L41%
$$ 126220 125621 124858 123988 123494 123747 124306 124200 123009 121348 120213 120015 120364 120651 120669 120661 120905 121348 121689 121689
51760A21689l80p41j104j381j375j023n49k70k91m12m53n18q06j159j102m37M26
$$ 121689 121309 120568 119464 118083 116708 115685 115136 114866 114575 114163 113710 113192 112386 111227 110125 109688 110114
51743A10114J026J368J662J710J095j22j302j887j797j248n94k76m04m47J16Q75
$$ 110114 111140 112508 114170 115880 116975 116853 115551 113664 111867 110619 110025 109749 109345 108898 109014 109889
51727A09889Q60j5p24n81j34j71n56p10o13o05o67o45p35j049j044k63P01Q66
$$ 109889 110749 110734 110010 109429 109295 109124 108568 107858 107245 106640 105973 105328 104593 103544 102500 102237 102938 103804
51709A03804K77j86k76n65j181j412r36l69k34k00M4P4m57r15m41P66J766K135
$$ 103804 104081 103895 103619 103054 101873 100461 99525 99156 98922 98722 98766 98840 98383 97468 97027 97793 99559 101694
51691A01694K201K175J829J097L66j9j14o5J62N82R40Q95L47m77j126j191o49
$$ 101694 103895 106070 107899 108996 109362 109343 109229 109164 109326 109908 110848 111743 112090 111613 110487 109296 108647
51674A08647kJ34l82j052j264q78k36K84O36R62J246J309J199J307J855K418K331
$$ 108647 108645 108779 108397 107345 106081 105203 104967 105251 105887 106849 108095 109404 110603 111910 113765 116183 118514
51657A18514J551P31L83L83M87P95J360J688J295N42K93O45O49m32k059l023k881
$$ 118514 120065 120796 121179 121562 122049 122844 124204 125892 127187 127729 128022 128667 129316 128884 126825 123802 120921
51640A20921k235j720j301p60l12k65l45PO82Q16j6j066j304p26k26l27o17m85
$$ 120921 118686 116966 115665 114905 114593 114328 113983 113990 114672 115488 115472 114406 113102 112376 112150 111823 111206 110721
51622A10721P5N70N63o1j007j621j328l16M77L83k57n52j16O55J220J419J328
$$ 110721 110796 111366 111929 111868 110861 109240 107912 107596 108073 108456 108199 107647 107531 108186 109406 110825 112153
51605A12153R05J13o95p19O01K823M574M717L372J576J12r85j831k213k028j715
$$ 112153 113058 113171 112476 111757 112358 115181 119755 124472 127844 129420 129532 128547 126716 124503 122475 120760
51589A20760j788k111k100j568r45o60o20n07l56m82q42q40L1J394K216J927J063
$$ 120760 118972 116861 114761 113193 112248 111588 110968 110461 110105 109623 108781 107941 107972 109366 111582 113509 114572
51572A14572N37N89P90Q58Q70P91L95j48k41K81P59N79O6P3Q67J828K211J907
$$ 114572 115109 115698 116488 117346 118216 119007 119402 119254 119013 119294 120053 120632 120698 120771 121638 123466 125677 127584
51554A27584J444J420J844K056J460L39m34m62j83j3K87R95J739J918J547J168
$$ 127584 129028 130448 132292 134348 135808 136147 135713 135251 135068 135055 135342 136337 138076 139994 141541 142709
51538A42709J070J086J034R30P96N92L22%l56n85m91k74m82j257j985k083j767
$$ 142709 143779 144865 145899 146829 147625 148217 148539 148539 148183 147598 147107 146833 146351 145094 143109 141026 139259
51521A39259j612j733j811j657j283p73n12j067k267k957k418j494j386j760j306
$$ 139259 137647 135914 134103 132446 131163 130390 129878 128811 126544 123587 121169 119675 118289 116529 115223
51506A15223O8J032Q86M37M49N09J02l22k29j3j98l51K00J064J237N49k10m85
$$ 115223 115291 116323 117209 117646 118095 118604 118706 118384 118155 118142 117944 117593 117793 118857 120094 120643 120433 119948
51488A19948m45l55j89J7J36L18Q27J375J235K51p40q70k57K26O1m66q13q76r45
$$ 119948 119503 119148 118959 118976 119112 119430 120257 121632 122867 123118 122378 121508 121251 121477 121538 121072 120259 119383 118438
51469A18438j144j202q48k32K48L91K32j96q71j533j807j626j255q68m24PJ93
$$ 118438 117294 116092 115244 115012 115260 115651 115883 115687 114816 113283 111476 109850 108595 107727 107303 107310 107503
51452A07503J42J42K53J60k23m91l52j42k83n96n84j82J90K21l4m11p51q81p11
$$ 107503 107645 107787 108040 108200 107977 107486 107134 106992 106709 106113 105529 105347 105537 105758 105724 105313 104562 103681 102970
51433A02970l97j86j64l10o09r51j085r08o35m75l26q3L9j91n86p16l95K30R37
$$ 102970 102573 102387 102223 101913 101304 100353 99268 98360 97725 97250 96924 96841 96880 96689 96103 95387 94992 95222 96159
51414I6159J482J578J183O61L71K10j46p29j271j564j513j078m79k83q10j598
$$ 96159 97641 99219 100402 101063 101434 101644 101498 100769 99498 97934 96421 95343 94864 94581 93771 92173
51398I2173j868j453q44m35j60J36M13N46M52R2l81o30n59n19p10p15j73L83J01
$$ 92173 90305 88852 88008 87573 87413 87549 87962 88508 88960 89052 88671 88041 87482 86963 86253 85538 85365 85748 85849
51379H5849q83j475j075k26L48N35M91K16j33r3M15Q52Q49P24P47N23k71j047
$$ 85849 84966 83491 82416 82190 82538 83073 83564 83780 83647 83554 83969 84821 85670 86394 87141 87664 87393 86346
51361H6346r73j47O28J010J304J599J536J049O07M41J42o33j537j927j712j319
$$ 86346 85373 85226 85854 86864 88168 89767 91303 92352 92959 93400 93542 92909 91372 89445 87733 86414
51345H6414j063q60n23p2L06M54M32M51O28P82N86m5p66j071p03J15Q41J070R06
$$ 86414 85351 84491 83968 83896 84202 84656 85088 85539 86167 86949 87535 87490 86724 85653 84950 85065 85906 86976 87882
51326H7882Q07R81J089P48J08k86j92J35L72M44L39j6n55j023j264j289j032l57
$$ 87882 88689 89670 90759 91507 91615 91329 91137 91272 91644 92088 92427 92411 91856 90833 89569 88280 87248 86891
51308H6891M68P55J88o89j120j025p84m80L2M91L87k25o81o35m04j93K87J044
$$ 86891 87359 88114 88302 87613 86493 85468 84684 84204 84236 84727 85114 84889 84208 83573 83169 82976 83263 84307
51290H4307J390Q42j8l03m2O7j18o3M26Q40P70L95Ml47m73L9J173K149K253J651
$$ 84307 85697 86539 86521 86218 86176 86243 86125 86062 86488 87328 88098 88493 88497 88150 87677 87716 88889 91038 93291 94942
51270I4942J044P80O56M20N8l44p52j129j340j132l06R04J737J622R55O71R99
$$ 94942 95986 96766 97422 97842 97900 97556 96804 95675 94335 93203 92897 93801 95538 97160 98115 98786 99785
51253I9785J160N83k01l11L10R84J277J260J064O97L20J55R9j80o48p79j11J147
$$ 99785 100945 101528 101327 101016 101326 102310 103587 104847 105911 106608 106928 107083 107182 107002 106354 105575 105464 106611
51235A06611K185K219J223N2l20K28R88J363J379J202P79K90K59Q03J251J047
$$ 106611 108796 111015 112238 112290 111970 112198 113186 114549 115928 117130 117909 118199 118458 119261 120512 121559
51219A21559N82M59M82J41k70m6O77J075J012J184J759J916J119J4m28l2P17J372
$$ 121559 122141 122600 123082 123223 122953 122907 123584 124659 125671 126855 128614 130530 131649 131663 131235 131203 131920 133292
51201A33292J603J148J68o67q48n50k17RJ59J17k28p43j217j599j897k022j892
$$ 133292 134895 136043 136211 135544 134696 134146 133929 133938 134097 134214 133986 133243 132026 130427 128530 126508 124616
51184A24616j482q10p8K74L3l48k94J2l3l78m06j53m11j277j670q94K17M56j46
$$ 124616 123134 122324 122246 122520 122553 122205 121911 121923 121890 121512 121106 120953 120542 119265 117595 116701 116918 117374 117228
51165A17228o91q18q01p57o48p37j127j177k96R01J203N30K7L40P48L54o26j235
$$ 117228 116537 115719 114918 114161 113513 112776 111649 110472 110176 111077 112280 112810 112837 113177 113925 114279 113653 112418
51147A12418r12R2J097J478J091M07R5L61Q41J099R37M02j86k25N79J644J995
$$ 112418 111506 111598 112695 114173 115264 115671 115766 116127 116968 118067 119004 119406 119220 118995 119574 121218 123213
51130A23213J345K90n81j175j466j230m63M42J253K118K925K970J835K55n06r3
$$ 123213 124558 124848 124267 123092 121626 120396 119933 120375 121628 123746 126671 129641 131476 131731 131225 131132
51114A31132O02O36R3k13J89Q93J223J056Q83J085J483J710J703J634J446R44
$$ 131132 131734 132370 132463 132250 132439 133332 134555 135611 136494 137579 139062 140772 142475 144109 145555 146499
51098A46499J81n13r29j051p88n7Q55J412J455J358J440J500J194N52Lp9L03P24
$$ 146499 146680 146167 145238 144187 143399 143342 144197 145609 147064 148422 149862 151362 152556 153108 153111 153032 153335 154059
51080A54059O71J98J14J108K627L243K348R59M27Q36J189Q35J07m00n06l72j73
$$ 154059 154730 154928 155042 156150 158777 162020 164368 165327 165754 166590 167779 168614 168721 168321 167815 167443 167270
51063A67270RJ22J64N9l57j022j462j249o28l33o95j300j610j509j102l98M64
$$ 167270 167279 167401 167565 167624 167267 166245 164783 163534 162906 162573 161878 160578 158968 157459 156357 155959 156423
51046A56423J023R39N26M09P09R65Q51N50L14J06r7l0M83J104J260Q26J92k05
$$ 156423 157446 158385 158911 159320 160029 160994 161845 162395 162709 162815 162718 162688 163171 164275 165535 166361 166553 166348
51028A66348k19P4M75P65R07J114J490J798J844J890K247K645K570K125J940K072
$$ 166348 166129 166203 166678 167443 168350 169464 170954 172752 174596 176486 178733 181378 183948 186073 188013 190085
51012A90085J865J172Q87J721L021L552L055K340K078K280K781L514M211M470
$$ 190085 191950 193122 194009 195730 198751 202303 205358 207698 209776 212056 214837 218351 222562 227032
50998B27032M271M021L991M078M183M385M680M926N151N570O226O995P893R031
$$ 227032 231303 235324 239315 243393 247576 251961 256641 261567 266718 272288 278514 285509 293402 302433
50984C02433J0183J0879J1102J1505J2707J4680J6902J8964K0815K2671K4824
$$ 302433 312616 323495 334597 346102 358809 373489 390391 409355 430170 452841 477665
50973D77665K7403L0205L2843L5050L6791L8261L9865M1937M4157M5560M5522
$$ 477665 505068 535273 568116 603166 639957 678218 718083 760020 804177 849737 895259
50962H95259M4417M2771M0280L6343L1337K6307K1526J6269J0192L872k160p885
$$ 895259 939676 982447 1022727 1059070 1090407 1116714 1138240 1154509 1164701 1168573 1166413 1158528
50950A158528j2921j6374j8171j9558k1336k2556k1932j9865j7892j6629j5505
$$ 1158528 1145607 1129233 1111062 1091504 1070168 1047612 1025680 1005815 987923 971294 955789
50939I55789j4256j3458j3426j3678j3814j4141j5065j6463j7967j9413k0823
$$ 955789 941533 928075 914649 900971 887157 873016 857951 841488 823521 804108 783285
50928G83285k2204k3524k4602k5147k5155k5058k5002k4294k2277j9580j7632
$$ 783285 761081 737557 712955 687808 662653 637595 612593 588299 566022 546442 528810
50917E28810j6823j6034j4296j2071j0414r501q619p284n743m501l757l292k749
$$ 528810 511987 495953 481657 469586 459172 449671 441052 433768 428025 423524 419767 416475 413726
50904D13726k025j366q83j75J084K285K325J134K3N1P57J110J117J608K719L583
$$ 413726 411701 410335 409452 409277 410361 412646 414971 416105 416128 416179 416936 418046 419163 420771 423490 427073
50888D27073L596L186L062L340L738M118M464M658M672M819N405O225O761O880
$$ 427073 430669 433855 436917 440257 443995 448113 452577 457235 461907 466726 472131 478356 485117 491997
50874D91997P050P802R136J0595J1807J2857J4104J5767J7745J9868K2263K5361
$$ 491997 499047 506849 515985 526580 538387 551244 565348 581115 598860 618728 640991 666352
50862F66352K9390L4001L8555M2831M7317N2572N8535O4623P0488P6304Q2246
$$ 666352 695742 729743 768298 811129 858446 911018 969553 1034176 1104664 1180968 1263214
50851A263214Q8001R2971R6829R9635J01552J02542J02168R9496R3413Q3450P0320
$$ 1263214 1351215 1444186 1541015 1640650 1742202 1844744 1946912 2046408 2139821 2223271 2293591
50840B293591N5418L9845K4100Q519o403k0177l2405m2628n0398n5568n8202n8130
$$ 2293591 2349009 2388854 2412954 2421473 2415070 2394893 2362488 2319860 2269462 2213894 2155692 2097562
50828B097562n5088m9528m2869l6478l0678k5228k0635j8260j8905k1809k5373
$$ 2097562 2042474 1992946 1950077 1913599 1882921 1857693 1837058 1818798 1799893 1778084 1752711
50817A752711k8727l2180l6242m0677m4752m8011n0445n1971n2264n1234m9255
$$ 1752711 1723984 1691804 1655562 1614885 1570133 1522122 1471677 1419706 1367442 1316208 1266953
50806A266953m6611m3001l8019l1990k5810j9935j4022p704j271M813J0659J6805
$$ 1266953 1220342 1177341 1139322 1107332 1081522 1061587 1047565 1039861 1038590 1043403 1054062 1070867
50794A070867K3344K9682L5145L9516M2757M4489M4101M1414L7059L2060K7053
$$ 1070867 1094211 1123893 1159038 1198554 1241311 1285800 1329901 1371315 1408374 1440434 1467487
50783A467487K2110J7266J2868R200N966K464j715o420j1347j6365k1477k6718
$$ 1467487 1489597 1506863 1519731 1528931 1534897 1537361 1535646 1529226 1517879 1501514 1480037 1453319
50771A453319l2222l7965m3289m7107m8837m8967m8405m7489m5897m3309l9840
$$ 1453319 1421097 1383132 1339843 1292736 1243899 1194932 1146527 1099038 1053141 1009832 969992
50760I69992l5870l1693k7382k2818j7968j3133q795n080j676J583M383O517Q454
$$ 969992 934122 902429 875047 852229 834261 821128 812333 807253 805577 807160 811543 818060 826514
50747H26514J0796J3390J5548J7152J9006K1951K6059L0793L5622M0251M4545
$$ 826514 837310 850700 866248 883400 902406 924357 950416 981209 1016831 1057082 1101627
50736A101627M8501N2122N5275N7736N9371O0090N9750N8404N6431N3965N0315
$$ 1101627 1150128 1202250 1257525 1315261 1374632 1434722 1494472 1552876 1609307 1663272 1713587
50725A713587M4500L6471K7119J7012N885o252j8263k8786l7388m4121m8419m9406
$$ 1713587 1758087 1794558 1821677 1838689 1844574 1838322 1820059 1791273 1753885 1709764 1661345 1611939
50713A611939m7169m2896l7729l2157k6593k1635j7496j3804j0371p724o524o883
$$ 1611939 1564770 1521874 1484145 1451988 1425395 1403760 1386264 1372460 1362089 1354365 1347841 1340958
50701A340958q530j1242j4741j8468k1866k4663k6593k7187k6232k4077k1103
$$ 1340958 1332428 1321186 1306445 1287977 1266111 1241448 1214855 1187668 1161436 1137359 1116256
50690A116256j7199j2313p174k748J086N636J1990J9908K8320L6532M4680N3321
$$ 1116256 1099057 1086744 1079570 1076822 1077908 1083544 1095534 1115442 1143762 1180294 1224974 1278295
50678A278295O2841P3051Q3129R1995R8960J03898J06756J07160J04615R8976
$$ 1278295 1341136 1414187 1497316 1589311 1688271 1792169 1898925 2006085 2110700 2209676
50668B209676R0608Q0393O9617N9603N1021M3683L7130L1163K5463J9064J0862
$$ 2209676 2300284 2380677 2450294 2509897 2560918 2604601 2641731 2672894 2698357 2717421 2728283
50657B728283Q32r767j9675k8718l7302m5127n1017n4047n4349n2643m9319m4388
$$ 2728283 2729115 2719348 2699673 2670955 2633653 2588526 2537509 2483462 2429113 2376470 2327151 2282763
50645B282763l8097l1014k3511j5617p653p32L888N788N503L703O06l698q766
$$ 2282763 2244666 2213652 2190141 2174524 2166871 2166139 2170027 2175815 2181318 2185021 2185627 2181929 2173163
50632B173163j3935j8803k3328k7497l1073l3803l5701l6910l7231l5909l2235
$$ 2173163 2159228 2140425 2117097 2089600 2058527 2024724 1989023 1952113 1914882 1878973 1846738
50621A846738k6458j9801j3454p734k446K274O042Q931J1465J3750J5245J5622
$$ 1846738 1820280 1800479 1787025 1779291 1776845 1779119 1785161 1794092 1805557 1819307 1834552 1850174
50609A850174J5297J4612J2929R112K780n459j4869k5062l5565m5447n3658n9552
$$ 1850174 1865471 1880083 1893012 1902124 1904904 1899445 1884576 1859514 1823949 1778502 1724844 1665292
50597A665292o2952o4021o3262o1469n9368n7224n4736n1391m7037m2240l7927
$$ 1665292 1602340 1538319 1475057 1413588 1354220 1296996 1242260 1190869 1143832 1101592 1063665
50586A063665l4536l1689k8802k5760k2690j9422j5794j2344r967q654p255m842
$$ 1063665 1029129 997440 968638 942878 920188 900766 884972 872628 862661 854007 846752 841910
50574H41910j876M64J813K910M605P063R995J3184J6557K0012K3421K6830L0562
$$ 841910 840034 840498 842311 845221 849826 856889 866884 880068 896625 916637 940058 966888 997450
50561I97450L5100M0749M7314N4146O0660O6662P2128P6659P9448P9781P7563
$$ 997450 1032550 1073299 1120613 1174759 1235419 1302081 1374209 1450868 1530316 1610097 1687660
50550A687660P3321O7916O2267N7233N3546N1620N1416N2426N3847N4852N4838
$$ 1687660 1760981 1828897 1891164 1948397 2001943 2053563 2104979 2157405 2211252 2266104 2320942
50539B320942N3633N1562M9135M6565M3824M1358M0480M2505M7439N3885O0301
$$ 2320942 2374575 2426137 2475272 2521837 2565661 2607019 2647499 2690004 2737443 2791328 2851629
50528B851629O5977P0731P4313P6471P7167P6248P3098O7078N8167M6783L3146
$$ 2851629 2917606 2988337 3062650 3139121 3216288 3292536 3365634 3432712 3490879 3537662 3570808
50517C570808J7338j34j8341l6538n4295p1016q5821r8081j07632j14211j17122
$$ 3570808 3588146 3588012 3569671 3533133 3478838 3407822 3322001 3223920 3116288 3002077 2884955
50506B884955j15780j10382j01708r0541p7481o3193m8360l3429j8689m537Q535
$$ 2884955 2769175 2658793 2557085 2466544 2389063 2325870 2277510 2244081 2225392 2220855 2229390
50495B229390K0164L0063L7822M2965M5182M4170L9210K9293J4107n134k5975
$$ 2229390 2249554 2279617 2317439 2360404 2405586 2449756 2488966 2518259 2532366 2527232 2501257
50484B501257m5965o3631p8454r0192r8436j02825j03590j01760r8620r4946r0665
$$ 2501257 2455292 2391661 2313207 2223015 2124579 2021754 1918164 1816404 1717784 1622838 1532173
50473A532173q5414p9348p3286o7950o3213n8306n2803m7095m1842l7235l3020
$$ 1532173 1446759 1367411 1294125 1226175 1162962 1104656 1051853 1004758 962916 925681 892661
50462H92661k9027k5336k2073j9376j7438j6180j4883j2724r880p602o780o823
$$ 892661 863634 838298 816225 796849 779411 763231 748348 735624 725744 718142 711362 704539
50450G04539o426n128l557k227r17N88J820K244K214K726M254O327Q332J0357
$$ 704539 698113 692985 689428 687201 686284 686872 688692 690936 693150 695876 700130 706457 714789 725146
50436G25146J2912J6111J9474K2589K5614K8919L2388L5411L7559L9101M0652
$$ 725146 738058 754169 773643 796232 821846 850765 883153 918564 956123 995224 1035876
50425A035876M2502M4437M6126M7548M9011N0939N3489N6331N8801O0535O1737
$$ 1035876 1078378 1122815 1168941 1216489 1265500 1316439 1369928 1426259 1485060 1545595 1607332
50414A607332O2697O3179O2675O1136N8956N6130N2054M6479M0211L4330K8867
$$ 1607332 1670029 1733208 1795883 1857019 1915975 1972105 2024159 2070638 2110849 2145179 2174046
50403B174046K2741J4932N347n446j6838k8417l9865n0793o0646o8789p4822p8720
$$ 2174046 2196787 2211719 2217066 2211620 2194782 2166365 2126500 2075707 2015061 1946272 1871450 1792730
50391A792730q0540q0135p7415p2664o6323n8632m9900m0964l2702k5047j7101
$$ 1792730 1712190 1632055 1554640 1481976 1415653 1357021 1307121 1266157 1233455 1208408 1191307
50380A191307q450J68P680J3676J8238K1327K2747K2333J9735J4457O681k253
$$ 1191307 1182857 1183025 1190705 1204381 1222619 1243946 1266693 1289026 1308761 1323218 1329899 1327646
50368A327646j0789j8428k5459l1745l6531l9514m1197m2047m1943m0851l9398
$$ 1327646 1316857 1298429 1272970 1241225 1204694 1165180 1123983 1081936 1039993 999142 959744
50357I59744l8246l7278l5887l3913l1807k9983k8316k6372k3876k0976j8249
$$ 959744 921498 884220 848333 814420 782613 752630 724314 697942 674066 653090 634841
50346F34841j6302j5231j4489j3456j2096j0903j0287j0133r944r254p979o443
$$ 634841 618539 603308 588819 575363 563267 552364 542077 531944 522000 512746 504767 498324
50334D98324n151m399m039l635k834j671n95j42l90p94o78R2J096J957K781L854
$$ 498324 493173 488774 484735 481100 478266 476595 476000 475858 475468 474674 473996 474088 475184 477141 479922 483776
50318D83776N227O712Q121R380J0515J1660J2964J4321J5382J5913J6026J5902
$$ 483776 489003 495715 503836 513216 523731 535391 548355 562676 578058 593971 609997 625899
50306F25899J5449J4390J2667J0630Q827P650P021O410N313L781K298J075l15
$$ 625899 641348 655738 668405 679035 687862 695512 702533 708943 714256 718037 720335 721410 721095
50293G21095k433n370q773j2196j5137j7036j7676j7456j6924j6068j4456j2067
$$ 721095 718662 713292 704519 692323 677186 660150 642474 625018 608094 592026 577570 565503
50281E65503r591p726o528n600m663l650k461r26Q17K162K390J291m93j848j950
$$ 565503 555912 548186 541658 536058 531395 527745 525284 524358 525175 527337 529727 531018 530525 528677 526727
50266E26727q24P51J833J959J334N68J11k7p8j11M9N44J264J949K378K455K314
$$ 526727 525903 526654 528487 530446 531780 532348 532459 532432 532354 532243 532292 532836 534100 536049 538427 540882 543196
50249E43196K289K590L031L265L268L234L064K473J715J629K607L974M887N430
$$ 543196 545485 548075 551106 554371 557639 560873 563937 566410 568125 569754 572361 576335 581222 586652
50235E86652O207P166P588P207O611O357O271N935N448N304N691O294O774P156
$$ 586652 592859 600025 607613 614820 621431 627788 634059 639994 645442 650746 656437 662731 669505 676661
50221F76661P680Q343Q883R329J0347J2580J5690J8628K1077K3950K8047L2875
$$ 676661 684341 692684 701567 710896 721243 733823 749513 768141 789218 813168 841215 874090
50209H74090L7583M2507M8740N6456O4839P3694Q3915R5881J08528J20558J31534
$$ 874090 911673 954180 1002920 1059376 1124215 1197909 1281824 1377705 1486233 1606791 1738325
50198A738325J40966J47171J48202J43625J34515J22142J07704R3123Q0830P2295
$$ 1738325 1879291 2026462 2174664 2318289 2452804 2574946 2682650 2775773 2856603 2928898
50188B928898O7281O4573O2620N9200N1392L6767J4647j3866m6616q0786j13062
$$ 2928898 2996179 3060752 3123372 3182572 3233964 3270731 3285378 3271512 3224896 3144110 3031048
50177C031048j40251j60129j71839j75779j73335j66347j56390j44406j31134
$$ 3031048 2890797 2730668 2558829 2383050 2209715 2043368 1886978 1742572 1611438
50168A611438j17625j04898r3246q2278p1782o2212n4101m7356m1429l6100l1731
$$ 1611438 1493813 1388915 1295669 1213391 1141609 1079397 1025296 977940 936511 900411 868680
50157H68680k8673k6645k4830k2548j9765j7049j5029j3886j3215j2344j0773
$$ 868680 840007 813362 788532 765984 746219 729170 714141 700255 687040 674696 663923
50146F63923q543o351n156n282n802n291l451j561q92j133j082m42R7M76J617
$$ 663923 655380 649029 643873 638591 632789 627498 624047 622486 621594 620461 619379 618937 619034 619510 621127
50131F21127L770N675O240O081O421P253P793Q215R520J1781J3881J5062J5649
$$ 621127 624897 630572 636812 642893 649314 656567 664360 672575 682095 693876 707757 722819 738468
50118G38468J6055J6252J6492J7311J8436J8765J8024J7357J7617J8118J7945
$$ 738468 754523 770775 787267 804578 823014 841779 859803 877160 894777 912895 930840
50107I30840J7548J7996J9366K0976K2735K5087K7908L0542L2841L5294L8249
$$ 930840 948388 966384 985750 1006726 1029461 1054548 1082456 1112998 1145839 1181133 1219382
50096A219382M1743M6024N1439N7925O5332P4112Q4892R7509J11352J26544J43919
$$ 1219382 1261125 1307149 1358588 1416513 1481845 1555957 1640849 1738358 1849710 1976254 2120173
50085B120173J63733J85252K07513K29371K48498K61487K65731K60961K48891
$$ 2120173 2283906 2469158 2676671 2906042 3154540 3416027 3681758 3942719 4191610
50076D191610K32167K14015J97864J86090J79047J75372J72800J68344J58265
$$ 4191610 4423777 4637792 4835656 5021746 5200793 5376165 5548965 5717309 5875574
50067E875574J38841J07720O4918J3047m3335r9214j50659j95190k31261k58103
$$ 5875574 6014415 6122135 6187053 6200100 6156765 6057551 5906892 5711702 5480441 5222338
50057E222338k76151k86798k91229k89826k82896k71408k56674k39741k21401
$$ 5222338 4946187 4659389 4368160 4078334 3795438 3524030 3267356 3027615 2806214
50048B806214k02386j83180j64039j45497j28467j13511j00454q8893p8675o9540
$$ 2806214 2603828 2420648 2256609 2111112 1982645 1869134 1768680 1679787 1601112 1531572
50038A531572o1019n3101m6488m1597l7767l4062l0428k7446k5321k3794k2760
$$ 1531572 1470553 1417452 1370964 1329367 1291600 1257538 1227110 1199664 1174343 1150549 1127789
50027A127789k2276k2150k2156k2439k3099k3595k3283k2352k1507k0817j9730
$$ 1127789 1105513 1083363 1061207 1038768 1015669 992074 968791 946439 924932 904115 884385
50016H84385j8217j6983j6274j5347j3605j1620j0422j0101r739q630p046n754
$$ 884385 866168 849185 832911 817564 803959 792339 781917 771816 762077 753447 746401 740647
50004G40647n087m699m167l561l224l100k669j703p41l97m81k04Q01K136L117
$$ 740647 735560 730861 726694 723133 719909 716809 714140 712437 711696 711299 710818 710614 711415 713551 716668
49989G16668L300K586J369N61R56K440M236N941P922J0547J3554J6345J8624K0496
$$ 716668 719968 722554 723923 724484 725440 727880 732116 738057 745979 756526 770080 786425 805049 825545
49975H25545K2306K4645K8183L3198L9385M6311N3930O2532P2322Q3248R5214
$$ 825545 847851 872496 900679 933877 973262 1019573 1073503 1136035 1208357 1291605 1386819
49964A386819J08274J22467J37326J51423J62584J68739J68633J61915J49150
$$ 1386819 1495093 1617560 1754886 1906309 2068893 2237632 2406265 2568180 2717330
49955B717330J32145J13906R7553Q5115P7318P3944P3597P3324O9314N8366L8545
$$ 2717330 2849475 2963381 3060934 3146049 3223367 3297311 3370908 3444232 3513546 3571912 3610457
49944C610457R137k8820p1740j14291j51666j80899k00322k09203k08582k01388
$$ 3610457 3619594 3590774 3519034 3404743 3253077 3072178 2871856 2662653 2454071 2252683
49934B252683j90497j77023j61143j43975j27490j12838r9754q7665p6514o6419
$$ 2252683 2062186 1885163 1724020 1580045 1452555 1339717 1239963 1152298 1075784 1009365
49924A009365n7405m9739m3860l9604l5961l2006k7794k4148k1741k0531j9786
$$ 1009365 951960 902221 858361 818757 782796 750790 722996 698848 677107 656576 636790
49913F36790j8599j6655j4590j3228j2486j1509r982q748q655r250r286q312p147
$$ 636790 618191 601536 586946 573718 561232 549723 539741 530993 522338 513088 503802 495490 488343
49900D88343o721o991p323p382p276o998o272n093l963l422l482l732l827l694
$$ 488343 481622 474631 467308 459926 452650 445652 439380 434287 430324 426902 423420 419688 415861 412167
49886D12167l409l119l004l118l291l341l342l426l485l303k888k373j703r01
$$ 412167 408758 405639 402635 399517 396226 392885 389543 386117 382632 379329 376441 374068 372365 371464
49872C71464m63r30k005k706k609k236j943j219K70J671J911J270R27J105P58
$$ 371464 371001 370071 368066 365360 362751 360515 358572 357353 357623 359294 361205 362475 363402 364507 365265
49857C65265o43k075k221j066L49J271J604J332M38o11r35j73R89J480Q78l49
$$ 365265 364622 362547 360326 359260 359609 360880 362484 363816 364254 363643 362708 362535 363524 365004 365882 365533
49841C65533j477k126k311k136j665j045n48l52l64k94L6N36R59J083R16P19Q30
$$ 365533 364056 361930 359619 357483 355818 354773 354225 353873 353509 353215 353251 353787 354746 355829 356745 357464 358294
49824C58294J314J811J802J122J86l77l45o6M8J37O68J624K265J999J157N23K99
$$ 358294 359608 361419 363221 364343 364529 364152 363807 363741 363789 363926 364594 366218 368483 370482 371639 372162 372461
49807C72461J00j59j20K52M86M06M02N82L40o41j592j601q54k01J02L47L72l35
$$ 372461 372561 372402 372282 372534 373020 373426 373828 374410 374750 374109 372517 370916 370062 369861 369963 370310 370682 370347
49789C70347j599k507k603k316k048j596q61l45m63r31j200j186j171j334j662
$$ 370347 368748 366241 363638 361322 359274 357678 356817 356472 356009 355078 353878 352692 351521 350187 348525
49774C48525k028k172j857j239o92k38M24J200J517J156N49M9m47q25n13N56J422
$$ 348525 346497 344325 342468 341229 340537 340299 340723 341923 343440 344596 345145 345194 344747 343922 343409 343965 345387
49757C45387J285O38M50P24P48M11K60L99L66J03J52O68J060Q65L31j17l56k91
$$ 345387 346672 347310 347760 348484 349232 349643 349903 350302 350668 350771 350923 351591 352651 353516 353847 353730 353374 353083
49739C53083K49R88J240Q39N02Q35J407J461J036Q20J092J464J561J408J160R70
$$ 353083 353332 354320 355560 356399 356901 357736 359143 360604 361640 362460 363552 365016 366577 367985 369145 370115
49723C70115J116J743K378K252J270L09J96P89J306J366J282J502K098K813L269
$$ 370115 371231 372974 375352 377604 378874 379183 379379 380168 381474 382840 384122 385624 387722 390535 393804
49708C93804L207K761K493K788L235L014K059J299J487K234K650K555K438K438
$$ 393804 397011 399772 402265 405053 408288 411302 413361 414660 416147 418381 421031 423586 426024 428462
49694D28462K200J734J652K220K826K807K322J933J763J601J531J809K271K483
$$ 428462 430662 432396 434048 436268 439094 441901 444223 446156 447919 449520 451051 452860 455131 457614
49680D57614K403K365K386K064J319P60R60J752K477K752K723K644K492K031J174
$$ 457614 460017 462382 464768 466832 468151 468911 469871 471623 474100 476852 479575 482219 484711 486742 487916
49665D87916K86k5M37J109J200O29J15L24J155J959K242K012J615J437J638K018
$$ 487916 488202 488177 488614 489723 490923 491552 491667 491991 493146 495105 497347 499359 500974 502411 504049 506067
49649E06067K246K272K424K915L409L339K670K067K143K708L014K732K302K264
$$ 506067 508313 510585 513009 515924 519333 522672 525342 527409 529552 532260 535274 538006 540308 542572
49635E42572K488K515K372K588L320M015M143L828L483L275L197L368L764M019
$$ 542572 545060 547575 549947 552535 555855 559870 564013 567841 571324 574599 577796 581164 584928 588947
49621E88947L973M075M656N063M366K876K083K916M730O269O947O820O024M907
$$ 588947 592920 596995 601651 606714 611080 613956 616039 618955 623685 629954 636901 643721 649745 654652
49607F54652M268M639N484N746N100M243L907M138M587N065N509N750N637N303
$$ 654652 658920 663559 669043 674789 679889 684132 688039 692177 696764 701829 707338 713088 718725 724028
49593G24028N078N157N448N723N843N877O021O428P015P439P366O856O301N946
$$ 724028 729106 734263 739711 745434 751277 757154 763175 769603 776618 784057 791423 798279 804580 810526
49579H10526N540M764L906L681M309N156N593N744O019O292O114N559N221N393
$$ 810526 816066 820830 824736 828417 832726 837882 843475 849219 855238 861530 867644 873203 878424 883817
49565H83817N800O140O338O200N510M579M179M541M991M815M076L277K697K397
$$ 883817 889617 895757 902095 908295 913805 918384 922563 927104 932095 936910 940986 944263 946960 949357
49551I49357K444K673K610K049J397J080R19N50Q8p2J94P71J536K128J934Q77
$$ 949357 951801 954474 957084 959133 960530 961610 962529 963079 963167 963095 963289 964060 965596 967724 969658 970535
$$ [...]
##END NTUPLES=NMR SPECTRUM
##END=
