##TITLE=NES1082_T14_9885048_D2eOf7YFWr
##JCAMPDX= 6.0         $$ Bruker NMR JCAMP-DX V2.0
##DATA TYPE= NMR SPECTRUM
##DATA CLASS= NTUPLES
##ORIGIN= BRUKER
##OWNER= Administrator
$$ 1.72 TOPSPIN		Version 2.1
$$ 2016-08-27 20:03:17.461 -0500  Administrator@X
$$ Compression mode = diff/dup
##.OBSERVE FREQUENCY= 400.02188249412
##.OBSERVE NUCLEUS= ^1H
##.ACQUISITION MODE= SIMULTANEOUS (DQD)
##.ACQUISITION SCHEME= undefined
##.AVERAGES= 8
##.DIGITISER RES= 22
##SPECTROMETER/DATA SYSTEM= spect
##.PULSE SEQUENCE= zg30
##.SOLVENT NAME= COFFEE_meoh
##.SHIFT REFERENCE= INTERNAL, COFFEE_meoh, 1, 14.98509
##AUDIT TRAIL= $$ (NUMBER, WHEN, WHO, WHERE, PROCESS, VERSION, WHAT)
$$ ##TITLE= Audit trail, TOPSPIN		Version 2.1
$$ ##JCAMPDX= 5.01
$$ ##ORIGIN= Bruker BioSpin GmbH
$$ ##OWNER= Administrator
$$ $$ E:\/data/COFFEE/nmr/NES1082_T14_9885048_D2eOf7YFWr/10/pdata/1/auditp.txt
$$ ##AUDIT TRAIL=  $$ (NUMBER, WHEN, WHO, WHERE, PROCESS, VERSION, WHAT)
(   1,<2016-08-27 20:03:10.258 -0500>,<Administrator>,<X>,<go>,<TOPSPIN 2.1>,
      <created by zg
	started at 2016-08-27 20:02:04.476 -0500,
	POWCHK enabled, PULCHK disabled,
       configuration hash MD5:
       21 0F 79 D6 B3 7B B4 F6 88 20 88 DB 03 48 BD 9F
       data hash MD5: 64K
       93 24 9E 5C 88 3D 22 DC F2 15 92 F4 7A FC 62 01>)
(   2,<2016-08-27 20:03:13.383 -0500>,<Administrator>,<X>,<proc1d>,<TOPSPIN 2.1>,
      <Start of raw data processing
       efp LB = 0 FT_mod = 6 PKNL = 1 PHC0 = 0 PHC1 = 0 SI = 32K 
       data hash MD5: 32K
       DC E5 DB 40 D9 3B 25 BD 68 89 4E 8A 7D AD EB B9>)
(   3,<2016-08-27 20:03:13.664 -0500>,<Administrator>,<X>,<proc1d>,<TOPSPIN 2.1>,
      <pk PHC0 = 91.66443 PHC1 = 0 
       data hash MD5: 32K
       98 10 DB 0A 0D F1 B1 A8 0D 8F 3E 13 18 D3 74 0F>)
(   4,<2016-08-27 20:03:13.773 -0500>,<Administrator>,<X>,<proc1d>,<TOPSPIN 2.1>,
      <abs ABSG = 1 
       data hash MD5: 32K
       18 D2 5C 74 F4 44 E0 76 50 B6 77 A5 C1 53 A6 13>)
(   5,<2016-08-27 20:03:13.836 -0500>,<Administrator>,<X>,<proc1d>,<TOPSPIN 2.1>,
      <abs ABSG = 2 
       data hash MD5: 32K
       46 DA 78 F2 81 3B D5 6A 34 3E 86 2A 00 3A 95 CF>)
(   6,<2016-08-27 20:03:13.898 -0500>,<Administrator>,<X>,<proc1d>,<TOPSPIN 2.1>,
      <abs ABSG = 3 
       data hash MD5: 32K
       2B 8E 37 90 67 C9 F7 6E BE 96 C5 13 1F 4A 9F FE>)
(   7,<2016-08-27 20:03:13.961 -0500>,<Administrator>,<X>,<proc1d>,<TOPSPIN 2.1>,
      <abs ABSG = 4 
       data hash MD5: 32K
       C0 15 42 1B E3 4B F7 7D 42 6E 83 41 BC B5 7A 53>)
(   8,<2016-08-27 20:03:14.008 -0500>,<Administrator>,<X>,<proc1d>,<TOPSPIN 2.1>,
      <abs ABSG = 5 
       data hash MD5: 32K
       D8 8B ED 1C 75 E4 7A BB D9 B4 15 E7 D2 A7 67 27>)
$$ ##END=
$$ 
$$ $$ hash MD5
$$ $$ D3 36 9C 0F 93 C3 1D F6 64 E8 A5 F8 31 1E 52 80
##$RELAX= 
##$RELAX= 
##$RELAX= 
##$RELAX= 
##$RELAX= 
##$RELAX= 
##$RELAX= 
$$ Bruker specific parameters
$$ --------------------------
##$DU= <E:\>
##$EXPNO= 10
##$NAME= <NES1082_T14_9885048_D2eOf7YFWr>
##$PROCNO= 1
$$ [...]
150 150 150 150 150 150 150 150
##$TP07= 0
##$TPNAME0= <>
##$TPNAME1= <>
##$TPNAME2= <>
##$TPNAME3= <>
##$TPNAME4= <>
##$TPNAME5= <>
##$TPNAME6= <>
##$TPNAME7= <>
##$TPOAL= (0..7)
0.5 0.5 0.5 0.5 0.5 0.5 0.5 0.5
##$TPOFFS= (0..7)
0 0 0 0 0 0 0 0
##$TUNHIN= 0
##$TUNHOUT= 0
##$TUNXOUT= 0
##$USERA1= <user>
##$USERA2= <user>
##$USERA3= <user>
##$USERA4= <user>
##$USERA5= <user>
##$V9= 5
##$VALIST= <valist>
##$VCLIST= <CCCCCCCCCCCCCCC>
##$VD= 0
##$VDLIST= <DDDDDDDDDDDDDDD>
##$VPLIST= <PPPPPPPPPPPPPPP>
##$VTLIST= <TTTTTTTTTTTTTTT>
##$WBST= 1024
##$WBSW= 4
##$XGAIN= (0..3)
0 0 0 0
##$XL= 0
##$YL= 0
##$YMAX_a= 601107
##$YMIN_a= -503276
##$ZGOPTNS= <>
##$ZL1= 120
##$ZL2= 120
##$ZL3= 120
##$ZL4= 120
##$ABSF1= 14.98509
##$ABSF2= -5.573092
##$ABSG= 5
##$ABSL= 3
##$ALPHA= 0
##$AQORDER= 0
##$ASSFAC= 0
##$ASSFACI= 0
##$ASSFACX= 0
##$ASSWID= 0
##$AUNMP= <proc_prof1d_extract_pilot.lims>
##$AXLEFT= 0
##$AXNAME= <>
##$AXNUC= <1H>
##$AXRIGHT= 0
##$AXTYPE= 0
##$AXUNIT= <>
##$AZFE= 0.1
##$AZFW= 0.1
##$BCFW= 0
##$BC_mod= 0
##$BYTORDP= 0
##$COROFFS= 0
##$CY= 15
##$DATMOD= 1
##$DC= 0
##$DFILT= <>
##$DTYPP= 0
##$F1P= 0
##$F2P= 0
##$FCOR= 0.5
##$FTSIZE= 32768
##$FT_mod= 6
##$GAMMA= 0
##$GB= 0
##$INTBC= 1
##$INTSCL= 1
##$ISEN= 128
##$LB= 0
##$LEV0= 0
##$LPBIN= 0
##$MAXI= 10000
##$MC2= 0
##$MEAN= 0
##$ME_mod= 0
##$MI= 0
##$NCOEF= 0
##$NC_proc= -8
##$NLEV= 6
##$NOISF1= 0
##$NOISF2= 0
##$NSP= 0
##$NTH_PI= 0
##$NZP= 0
##$OFFSET= 14.98509
##$PC= 1
##$PHC0= 91.66443
##$PHC1= 0
##$PH_mod= 1
##$PKNL= yes
##$PPARMOD= 0
##$PPDIAG= 0
##$PPIPTYP= 0
##$PPMPNUM= 2147483647
##$PPRESOL= 1
##$PSCAL= 4
##$PSIGN= 0
##$PYNMP= <proc.py>
##$REVERSE= no
##$SF= 400.02
##$SI= 32768
##$SIGF1= 0
##$SIGF2= 0
##$SINO= 400
##$SIOLD= 32768
##$SPECTYP= <>
##$SREGLST= <1H.CDCl3>
##$SSB= 0
##$STSI= 32768
##$STSR= 0
##$SW_p= 8223.68421052631
##$SYMM= 0
##$S_DEV= 0
##$TDeff= 65536
##$TDoff= 0
##$TI= <>
##$TILT= no
##$TM1= 0
##$TM2= 0
##$TOPLEV= 0
##$USERP1= <user>
##$USERP2= <user>
##$USERP3= <user>
##$USERP4= <user>
##$USERP5= <user>
##$WDW= 1
##$XDIM= 32768
##$YMAX_p= 446706533
##$YMIN_p= -682429
##$CURPLOT= <Network HP LaserJet P1505>
##$CURPRIN= <$Network HP LaserJet P1505>
##$DFORMAT= <normdp>
##$LAYOUT= <+/1D_H.xwp>
##$LFORMAT= <normlp>
##$PFORMAT= <normpl>
##$SURQMSG= 1
$$ End of Bruker specific parameters
$$ ---------------------------------
##NTUPLES= NMR SPECTRUM
##VAR_NAME=  FREQUENCY,     SPECTRUM/REAL,   SPECTRUM/IMAG
##SYMBOL=    X,             R,               I
##VAR_TYPE=  INDEPENDENT,   DEPENDENT,       DEPENDENT
##VAR_FORM=  AFFN,          ASDF,            ASDF
##VAR_DIM=   32768,         32768,           32768
##UNITS=     HZ,            ARBITRARY UNITS, ARBITRARY UNITS
##FACTOR=    0.250966925370066, 1,           1
##FIRST=     8223.43324360094, 107943,       -122501
##LAST=      0,             -55479,          -71058
##MIN=       0,             -682429,         0
##MAX=       8223.43324360094, 446706533,    0
$$ Real data points
##PAGE= N=1
##DATA TABLE= (X++(R..R)), XYDATA
$$ [...]
23762 -130378 107387 13666 -153078 137574 -71400 72439 -273233 -24130 -76081 250091
23751 -250155 141577 -417011 -29626 -109725 162703 62751 49464 -39344 -353359 281320
23740 -155275 23153 -44407 323561 150188 -108403 36622 -64530 -57167 -188997 7863 -301296
23728 -75330 -132491 -128832 32323 -186947 -348198 194871 89368 -32211 -312787 -79060 -384945
23717 -384945 -563758 123190 -163412 -141245 -57442 279072 -45743 25712 71187 -310534
23706 115982 107439 -110663 29824 54622 60879 12941 -30217 177159 50104 -205683 24945
23694 1402 97333 -51001 27592 -126944 194491 245805 -27243 -71933 -37284 -91770 93979
23682 -104208 3409 -30464 6472 -136888 59956 -124228 -96455 34975 85634 -28848 32544
23670 -103728 36510 -274357 -217124 109493 275236 69354 102399 191287 -327672 -263686 -298395
23659 -298395 80875 462909 223467 -229118 -52690 163307 57760 -267571 -310714 158752
23648 -219868 29163 -263479 -40184 -166013 -200831 -91157 -108851 -316838 111792 149656 -155176
23636 164250 -33868 -75620 -28116 -183861 -39865 -36107 -80536 -210077 17302 402591 -31211
23624 -31709 140079 -142004 -36864 105057 -285 62325 -145836 62266 -28298 144323 18820
23612 -80680 103914 -189450 254202 224022 23988 -114008 23972 298076 98287 72053 86405
23601 86405 209813 147027 59123 86028 115100 -177656 -232033 86993 416987 360934 61139
23589 25868 267183 284449 211461 200385 88147 36104 -157146 -84550 180447 430895 -105868
23577 49876 129466 321010 -164731 65462 270865 -7659 135166 62087 -43121 -146985 -74628
23566 -74628 45517 -120649 53578 -34119 -218197 72688 -124445 -400518 -273008 25659 -74656
23554 60672 204499 -64055 -124496 -219467 17010 87995 -51702 85587 -224224 164834 -127685
23542 148686 263887 73195 106458 132813 71451 -24805 70280 -224388 8578 42913 -33557
23530 -150312 32273 78378 -328549 -408912 -12582 100047 -79371 76498 6835 57675 137000
23519 137000 332956 169257 75266 84484 -175675 221453 -66452 -3161 -174739 27838 -73296
23507 69615 219907 -315880 36730 2269 214812 -195369 7287 -315750 48647 51211 80699
23496 80699 -204681 -165086 -60115 323502 -15268 5924 97461 168483 168881 -49125 -69182 -173204
23484 -173204 -136638 -81315 -348616 -232821 -167564 201661 7627 -29302 -92568 -60505 -3696
23472 -95117 160562 139350 -37156 -112840 -247102 -109360 90423 -110309 -212090 464 -15263
23460 100782 123775 -28605 -35716 200147 -42077 168910 -892 -195970 90233 -84778 -178682
23449 -178682 -287592 51095 -204693 131698 -102834 -22435 58745 -71075 4036 -33449 -296022
23438 -296022 -58006 76131 -267568 -136618 -50494 -405967 10068 -145945 -108469 -167779 212901
23426 40308 -61465 241254 85185 52547 -124814 258692 -134932 -177625 -42863 228605 -309744
23414 -44605 -12606 -240798 -45440 374119 145209 -168777 269604 -11536 238390 110774
23403 189456 -179072 -115855 -153799 -53086 -68763 -105732 -124980 3439 -109424 -123884 141364
23391 -104902 52317 135816 9021 114670 -10163 63546 -124005 -96244 111976 -114596 -99659
23380 -99659 -27290 171484 94599 88148 -366540 164772 355093 -433227 212291 -75678 35815
23368 -243983 189934 -139794 178468 -126954 -98832 385082 -246916 115510 137865 -115859
23357 -141540 -50529 180599 -315715 224661 180414 -120142 293235 -100707 -109183 111287
23346 -244196 9743 296519 -114618 -89702 -83592 12491 -67834 186846 -47153 314974 -341915
23334 -70740 329379 263657 49820 8712 250921 -284104 145735 108957 46576 8772 148052
23323 148052 177609 -97032 -189815 -55997 219503 79491 -254307 -325216 -202230 -119520 179203
23311 105378 251868 -129752 -37515 272332 -290857 124533 188234 135078 -224444 91053
23300 138826 -111298 61896 -33869 -72711 55126 171582 -124686 -39697 -170569 277978
23289 151449 -343796 21952 72812 -43551 -135115 23479 45392 51809 -258304 -195996 -51357
23277 46641 1309 -172478 -392191 -182590 -237417 -176144 174909 -177863 -36839 352065 132141
23265 270426 -58160 89040 -62334 -98251 -51521 -170348 -336361 72945 -107443 27426 -54211
23253 13336 -4607 -98768 -53323 247627 32353 -108407 54204 -66951 204670 188374 -316636
23241 -55916 -32564 -25719 30339 24400 -140083 119838 110815 -3685 32867 -195027 43503 171326
23229 171326 4563 -142009 -80850 55271 81258 -235669 316825 55258 153069 243141 -154616
23217 53651 -129159 -230942 -90602 -29623 45300 55825 9991 -21178 143651 -161562 -171752
23206 -171752 -154720 -100478 19778 -18258 -142705 -107137 89922 5490 16455 -273832 -33248
23194 -6979 -260179 -88542 -69693 -122915 -140578 141120 -140502 -213073 -65994 26793 103128
23183 103128 262386 247683 54955 20243 177544 -10551 127159 -105474 -538725 -273915
23173 -273915 -103681 5635 121234 80249 -100379 -134772 -42095 -162041 32511 -155416 28354
23161 -111219 208526 101760 118871 88285 -147580 -195418 82898 110419 -57700 -42426 -109332
23150 -109332 -156521 -283055 34536 -7258 -40731 81228 -288640 -195248 25557 -67872 -38383
23139 -38383 59800 84655 -100671 54467 66595 -87272 183210 149797 105576 -356252 -61114
23127 343874 89082 200410 -58324 -59705 -262737 202961 239999 -73596 -171823 4633 72475
23116 72475 -29984 91323 -239251 -183052 2397 -124289 -87069 127620 205848 192567 -103178
23104 335733 14335 -77383 91782 -9316 -84850 -420176 372131 39774 170900 -60818 191191
23092 387598 386108 83107 252164 40021 134623 159683 119963 106729 -21904 -26985 -314378
23081 -314378 -160460 3044 -54396 10915 -139169 7409 114243 -207411 -258985 -61619 126510
23069 297137 -207460 -381520 -98506 15316 29649 -161994 -287420 292262 10404 314997
23059 314997 -249483 -139040 109063 22406 299749 140662 134498 96619 -5132 -197445 -28237
23047 257204 -36644 -80559 -356723 -123318 -168419 -29816 -134486 392333 51305 139935 -51366
23035 -297656 -30439 -209865 6945 99217 -289097 142219 205945 -202754 121593 -106328
23024 -47797 153841 378081 147795 -315259 -85296 -45844 102226 69634 272409 -37376
23013 -166600 -446679 25302 138447 -93364 -7751 253408 46751 -53483 -228139 -422269 47139
23001 -74243 21348 40470 212067 148337 222869 13385 -279809 -250351 -273398 176978 287146
22990 287146 -167091 -55085 164286 -305271 -208138 -252466 -224187 29572 -192652 -148535 -100560
22979 -100560 114966 69894 95778 9682 -70689 -81511 102862 96642 145617 -133454 3036
22967 -98805 -10359 35245 -17165 -254098 -271925 -110225 -168103 126991 -204837 -216333 149225
22955 39669 266991 -92786 -53681 7078 326993 44847 -123290 -151709 -140552 -22804 -74659
22944 -74659 24633 -222354 -36367 -507582 126909 -294188 10679 -40856 -177777 -424342
22934 -424342 -62021 -198107 -72383 -162515 -148508 -290655 20213 -123271 62539 -258855 245939
22922 123852 -227742 16934 -172917 45378 -242621 -121854 205011 41045 48618 113856 176802
22911 176802 239271 -249851 -194496 16259 216335 128871 -47437 -49769 -78853 -39975 -267873
22900 -267873 -116637 20881 23571 194396 -193388 90274 102564 -412040 -170942 -117090 -307732
22889 -307732 22454 -42645 111439 -123207 390155 6058 -156793 -19853 86828 -197074 327019
22877 151268 389760 165949 -228462 -148106 -243959 71578 208386 -33947 23011 -121729
22866 -36446 150579 149583 -266356 5347 64385 31614 29824 -149131 198428 283897 247760 -177393
22853 -9241 -98523 66274 116365 156303 50660 -90247 87012 71982 9584 -116088 -124529 -72945
22841 -72945 -126446 -33459 -44903 -100855 162544 -62457 133608 186091 -310126 -168016 18585
22829 -87348 -83967 48639 -160408 27061 -346327 31696 -401849 -229766 82233 45824 -130791
22817 -109658 -82851 -61651 118292 313718 -143819 -114037 -149495 127069 -173523 -275024
22807 -275024 -230602 167470 -90376 183218 152128 -37085 2218 182629 -104696 97523 -73479
22795 -244928 -81769 -63786 36633 95510 64915 -21575 -64289 -276298 -99141 124795 404936
22784 404936 5525 128834 -60662 -85079 -235397 116823 -113796 -74798 -177445 147735
22773 -11629 68243 -65667 -255225 -92828 262079 -19357 -129972 -370663 141375 150546 -19565
22761 -168333 -321527 -34282 239966 132836 84964 134183 263836 24849 160093 -137479
22750 73285 -464751 309412 -242717 373878 -15212 -28352 -249412 -218384 23007 160351
22740 160351 -217910 -43695 -89769 -94725 -110014 -37596 25731 70095 -122868 287165 127745
22728 -165021 -194654 -61618 143382 24131 52347 55495 -384043 70708 -168810 -6962 193963
22716 -34432 -20793 39119 61839 -36024 -68583 138931 123647 86568 -98874 -146757 -57976
22704 -162276 -188595 47222 423505 -185443 187815 -193662 -337238 -19785 -337563 -59257
22693 -280693 107890 9307 -60107 -230831 45377 -28315 22021 -52948 30895 -58973 -607968
22682 -607968 -200061 76399 -3369 -108818 -127073 -127115 -105832 79687 123365 66356 194413 -344827
22669 -85895 -368975 68647 -38885 351922 -196903 160700 -295346 8840 44074 -241710 65377
22657 448044 -361099 -115789 -43657 -132284 -232333 137108 276299 249872 -8262 157791
22646 54021 -37004 43877 -166538 58306 304416 162561 67777 156502 -276775 70870 57879
22635 57879 -255805 -337051 -127970 58713 -175028 -227662 -119601 -90053 51882 -221336 2395
22623 91345 -149257 -196383 32775 -61986 -385947 33000 -284913 -119952 -56042 174769 272101
22612 272101 -38754 298628 115944 -267226 -13033 95033 -273118 3524 25635 171058 262573
22601 262573 37728 -37997 -435553 186730 -34540 74095 50590 -108727 -87462 -3239 -106422
22590 -106422 102342 -211425 93139 -240959 -63658 54256 140592 -235583 469682 -138306
22579 -247862 358008 165717 -112276 384288 -137701 -143261 16300 -292231 348882 -108367
22568 97482 -197725 -195269 -163754 275975 163944 -301393 105139 163638 -31841 -178905 -142472
22557 -142472 63531 53387 -82985 -65732 -13398 -31630 231147 140500 99651 -218961 -286620
22546 -286620 -140351 201361 97853 -274936 104104 -287950 -90071 11081 -73179 197879
22535 -248704 -343495 93399 -169973 -291616 161243 -35658 63652 140371 -253270 -222163 97947
22523 372263 -142699 -125602 -185090 -297024 10308 -82305 -47499 -153112 271921 -229185
22512 -46718 71780 282179 -72986 -276860 158094 106194 -137511 -46063 -12364 430956 -42263
22500 -9418 -41268 -445409 -269490 4448 -400075 -51703 -324840 269354 -109893 165236 5391
22488 -22395 -222240 27343 -159066 4496 27459 128873 -163960 20072 -196040 -140717 -37257
22476 -172975 202724 54635 219090 -330607 -136602 -258716 153277 253423 -122433 -158793
22466 -158793 -210325 93260 -18342 123976 -97003 -107095 10114 51745 50060 -312839 -423119
22455 -423119 -96633 168995 47753 -91289 -204395 -141164 129183 -47919 -35649 -241174 101416
22443 -177086 -98672 256021 -12619 -35595 -83357 192044 -48312 49841 -436171 83423 -18193
22431 -152974 -116737 198784 -79786 -342627 -321182 273598 -68338 7024 -116927 -16884 -105312
22420 -105312 -159201 112904 -77846 -199830 -122209 -44186 168782 -15250 303459 -203569
22409 -52060 -123302 -111849 -96802 -211522 -205865 277795 -141198 -212794 -238811 -280373 -174085
22398 -174085 137312 -338775 -106632 -15930 -93553 -77381 -121422 -244487 35537 -187217
22387 -333320 -146781 164096 104754 -207846 -181315 71764 111185 39775 -184430 -326170
22377 -326170 70564 135925 234939 -181544 -32930 69527 97948 27028 -36221 120561 141250
22366 141250 54603 124418 37710 32294 166390 369894 45957 30083 -44826 51818 -399163
22354 203076 -176181 -97483 -351835 123622 140758 -126514 121355 -75295 486700 189849
22343 83066 -150210 70919 -236902 -303517 -398231 21735 66754 -156437 88249 -206285 63094
22331 -249702 216839 -26042 173257 95142 270807 -427666 -314487 -278076 -78658 -158183
22321 -158183 -272836 -86087 28544 348773 -128129 -29617 185299 63194 -146475 -146759 -240364
22310 -240364 -396492 -247413 -177914 -250466 -181061 -166028 -280005 -142198 171361 173811 -69122
22298 52464 -276505 41996 291388 50247 198732 -26752 215046 78380 87783 56156 146573
22287 146573 -32931 273046 -369279 17209 -91912 89114 14684 45270 -242077 -7500 59466
22275 -116092 -299203 -91462 -147621 -209115 -353236 -28177 -384461 -181517 -383055 -143048
22264 -23701 -369588 318171 -231223 -217233 140224 137600 144943 -279266 227842 -260436 -21658
22252 161037 -41881 -304890 -268686 -339087 -4602 104289 -276942 -88920 -151709 -200610 213900
22240 -170203 -154545 116171 -166230 315400 147089 -230809 -66786 69506 57858 -38898
22229 163924 -338502 225936 -10880 -106637 -17932 -65735 137534 -230478 55772 -393575
22218 -222295 -85587 91408 -281055 -163722 -96589 -110894 110598 -53484 -247536 -139333
22208 -139333 -195246 151137 11250 -68398 200742 117973 -97868 -100770 -88923 158419 -276542
22196 -48245 -198987 18579 346871 118448 -114975 26103 -155738 7119 84515 188112 54165
22184 -292945 -286522 -90334 -23298 -82881 -121880 34475 506997 137544 -38590 139826 84616
22173 84616 -51695 1365 -67214 7437 -100304 51097 -173449 40527 -32997 -73251 -290646
22162 -290646 94540 -100188 -163629 -132690 198256 -64707 -164877 159923 20291 -548039
22151 66180 -145992 100595 -166737 -17790 193773 -189950 -103758 -91607 -166083 -158648 -198162
22140 -198162 -176760 -25353 -185064 87864 -288443 -209787 -219533 63439 117383 60305 47221
22129 47221 114277 284753 -270587 -315167 -282713 -190929 -116835 4815 107036 -165772 110667
22117 -48603 -66854 -295941 -286428 -373452 -300395 -121711 32856 302349 -23344 -2155 14311
22105 -106035 -86891 -166206 -252069 243615 -213115 -170152 209118 -45689 -168424 193049
22094 -91915 -309685 -58715 55344 112922 -196727 -244322 -145851 -19023 32083 -182912 -141100
22083 -141100 -288765 -403206 -155869 40018 -95807 -254281 -359395 -37245 -112773 -334520
22073 -334520 -152123 -67629 -53228 -90450 -157488 -116714 133637 68948 -188692 -83160 -329578
22062 -329578 132576 -38360 -87568 248129 -229255 127712 -115781 -192441 -356813 -57909
22051 145348 -297264 -68206 -368346 -217996 -433299 -56528 127141 98516 -49881 272823
22040 148265 290126 101353 -67487 176969 -26906 106304 -97466 -28699 123676 218843
22030 218843 -1676 125007 -211512 113159 -306941 -88561 -345448 -57212 -45160 -26011 152460
22018 -185247 -101056 415858 -173584 -313263 -71919 -67313 -229223 -128519 -31051 -76082 -116330
22007 -116330 -51897 -88600 218161 81882 -64359 -81625 58537 -162879 -92142 44307 158763
21996 158763 -72705 -243674 184777 115385 100666 -11766 24714 -279851 -191940 -87541 -157167
21985 -157167 124738 -18437 132712 -197507 -78577 305124 145227 -143116 18546 135043
21975 135043 -332463 51164 24148 -85441 36055 41538 102443 -179986 -23449 1495 -142134
21963 -155402 -202275 -403847 191564 -174350 226105 -276289 -33136 175846 -257672 148446
21952 100405 -312178 40010 -206736 -95137 -38314 -158061 -279926 77777 45882 59703 -402881
21940 -159499 -461646 -197256 -12308 247205 -131233 -48766 -262673 66205 -292550 -173889
21930 -173889 -31861 51356 -57945 -43891 398191 138770 113431 -256832 -69511 5874 -75711
21918 -50114 55696 -159635 351443 -357784 -161047 -141209 -72606 81344 50284 -100055 -9432
21906 19742 -174209 61382 35535 -220014 -13535 258975 229014 -153014 -13189 16829 37717
21895 37717 136191 40015 -147927 65606 -126858 3130 -319790 -163538 37637 31901 -186948
21883 -78508 -244423 69048 -342540 6510 -225181 135200 56699 16241 -9393 -149716 69077
21871 238693 -14905 38713 369916 -78268 49324 70651 -192551 115271 -242429 -111567
21860 -105206 -99843 -193878 -119836 97573 -232337 139015 5615 -40753 199487 -116474 -103677
21849 -103677 177444 91555 -80475 -219675 -104591 -192372 194061 91093 -86852 129144
21838 -53793 26238 -330100 -77697 -136711 -108683 -255205 129198 -123746 201412 -241341
21827 -76572 -25394 91296 127943 21535 -129367 -34603 -246895 -158548 -164726 6463 -29594 -164018
21815 -164018 -147595 -427772 -91701 -93407 -19139 119428 227562 149940 -187455 -34821 -192196
21804 -192196 70235 -109937 28799 -13050 -330774 -31666 -457778 -95861 54775 84540 -63485
21792 29663 -302987 -277853 -175551 417809 149569 267170 -387460 -85782 -99309 -92880 206819
21780 -68619 -180347 -163904 -292942 103304 79216 12613 -40166 -171781 154598 -174176
21769 -10343 -104645 174153 221444 29671 -263609 -162393 159924 56150 521227 -156081
21758 115223 -175995 93941 132687 -270605 -171363 130843 -122577 36509 -305656 20465
21747 159836 -73258 198959 -195093 -123123 -245269 -68145 -133787 -23847 265523 269058 -296961
21735 114788 321800 -30438 -63577 79177 -42528 200082 -29193 -79259 73383 202293 8668
21723 150442 92680 -195819 -450764 178533 -144679 91594 348280 -258550 -320928 -4708
21712 148948 -108123 -259965 99948 2781 -146045 -269060 -100636 196924 -91989 224910
21701 -155780 154618 184930 109845 125128 -38872 -45246 36217 -75306 161088 -196693 -172804
21690 -172804 -86738 -281621 -66374 336101 -140774 -88348 -127140 31376 247421 36458 -63
21678 152679 -124112 -73102 -60210 -421836 -177880 -97078 -86987 -58083 -3778 -56134 -208946
21667 -208946 -512352 90399 -228283 97972 -163996 84180 324927 -92824 -106927 -50022 -87723
21656 -87723 79156 -98822 244722 -16054 101657 27291 105630 -81590 -1058 70160 -176562
21644 -256315 137521 56628 -105345 60857 -117793 -46540 -19733 -121377 -133310 138862
21633 -154223 4534 -295207 -64795 269757 -81530 208151 245907 25375 -286047 -259979 -126452
21621 -95076 -300833 97733 37676 40388 128906 24769 -60795 111063 177950 23982 87008
21610 87008 55265 -161656 -38856 -415101 -99319 -57167 -459822 -352317 209635 -98002 72095
21598 -87272 106082 -452626 -106516 111135 -169603 -56874 39067 103799 -132667 95498
21587 15095 84177 -202916 -95237 59668 115641 61511 -160998 -319312 -90796 -268111 58738
21575 -249700 -156456 33466 -198090 -110712 317461 -108080 5932 -70426 213386 -260584 -226996
21564 -226996 91279 -71914 -210161 349956 -228165 -191470 -9385 -167596 -49371 -17131 -164505
21553 -164505 346764 -82646 -186822 242310 -226637 -56525 -235815 -94278 36634 40314 -370467
21541 2756 97806 -36930 -129081 -122948 -36201 -146915 5310 -23960 -142052 -184844 -55342 -57867
21529 -57867 -193849 -71848 -23044 -184602 -231778 -26536 182236 310832 -198417 -141377 111799
21517 -511514 -138332 -160989 -124489 -295792 -16626 -226271 8150 -31210 -268153 -1507 -3336
21506 -3336 -79047 100618 -286161 -51148 -162150 -59587 -142539 -272113 -243582 -29059 47333
21494 4048 80594 123627 236101 -245316 -200154 707 -200246 15775 -47509 -39702 -335853 -521149
21482 -521149 -252272 -161726 -251570 -98303 -141738 211431 -242976 -34336 -139563 -182238 -54144
21470 -268836 68356 -261452 112917 -12330 -82125 -72209 15957 53872 -184176 -122782 298141
21458 271467 -271870 52982 -4850 -276835 -16129 -53735 79753 414239 53077 175820 -27444
21446 -73817 -170402 200346 -62309 153929 -14673 176907 -97707 136417 272589 -46454 259011
21434 -239991 -164543 145525 -180564 86383 -149313 16805 138982 -4701 -68054 242761 -224278
21422 226742 94975 43031 -182930 -36604 -272623 126266 -201706 -230644 101465 -129859
21411 -117522 140119 -345156 -81120 -335627 -90540 58478 -16981 -328868 275838 -197734
21400 177219 -20614 94260 -102315 -114564 -208648 -4649 67773 -315569 -159941 -273061 47960
21388 -260068 -25404 -195074 198550 -293035 106658 -271397 -183832 -148276 327703 -65996
21377 -48478 86911 -10531 -77481 -52723 -448364 -241263 102191 -127644 -198474 -58584 101403
21365 -205422 301512 -402237 -154269 26522 -155165 15459 -358006 96173 121837 89673
21355 89673 -160677 80114 -57603 -13812 -27273 -171735 105675 -199913 50104 64587 -177456
21343 75538 61174 -247911 -230091 -54757 -71163 -178574 -298995 157963 122068 19319 -148229
21331 -307203 -128406 -334205 -132587 -178739 5489 -21363 -80900 51052 92322 -69879 -52946
21320 -52946 42319 -128611 -202383 -194716 -290747 -204484 7937 -66572 41477 101682 -188764 -11809
21307 -251419 -204339 -117128 -168070 -8440 23847 -109837 116973 -135056 -57497 31520 97179
21296 97179 -295179 -37321 43769 112618 181242 66963 -121585 29749 -400411 132180 41436
21284 -114810 303099 133903 19113 142112 -213955 -81483 20343 186320 19390 279701
21274 279701 -283464 128809 128115 -356301 -438470 -236455 -79358 122113 -2512 -59657 136781
21262 60573 -366542 -6323 -102511 19918 -373223 -288456 -143393 -249999 -149022 -166215 -278910
21251 -278910 -100302 -66813 290565 -84791 246252 -351828 -228617 -137463 33105 65282
21241 65282 -269103 241082 140105 281561 343438 -148241 -135642 -101972 117881 105495
21231 105495 -24085 109497 -26558 -71293 -315736 -58565 111271 100009 32832 -204978 -76660
21219 60292 293008 -171722 78983 118483 -345247 -122879 -117303 -162580 -51711 -35795 -58175
21208 -58175 -116514 27461 142283 -17263 71488 -240963 110025 -216660 -146863 102882 2263
21196 97759 -44186 -139408 -102693 -191997 -67657 -204821 311833 -27581 -59031 -70348 -154585
21185 -154585 98277 24552 -137347 129190 -404323 -150536 -289536 -174342 -180807 -108358
21175 -108358 67177 40095 -12902 -81904 154225 2155 -120447 127226 -479283 35174 -141118
21163 38504 51366 -109108 -219515 -165091 -303879 -271842 -126299 230315 -186230 -365918
21153 -365918 208980 -9204 -21796 -219 -337342 -291292 -316772 -203514 153845 -195104 -109148
21142 -109148 18815 -314505 -94603 49237 -145918 130552 -8909 9958 194349 163512 133040
21131 133040 7660 148105 172875 221348 -1358 145115 98915 109133 4808 138141 262885
21120 262885 -101121 -161090 -328152 31281 -222205 -66096 -227650 42646 215249 -262226
21109 -17702 57632 -72163 274843 -194616 -108717 -78947 24537 30645 -111782 218073 -41318
21097 -73541 91177 -92740 299699 -95441 -67161 -299139 -142725 10376 115185 172490 253853
21086 253853 -364891 166491 -195288 70403 -324834 -59338 -241370 15730 38729 -289689
21075 89499 -117914 9832 -94902 123151 -223689 -91062 -27783 108305 86503 -130352 -86297
21064 -86297 168253 -279564 -29421 -203906 -90770 108287 64119 25799 -77386 -351749 65348
21052 -275178 -29267 -233506 -250028 21880 -480709 -213177 117385 -85889 -298543 -230662
21042 -230662 261452 171732 -423292 -158017 83361 -27041 94770 18947 43254 366125 71657
21030 82262 168873 74322 -76561 34793 -138971 -63280 90543 71467 39306 -145215 57375
21018 -9020 55796 -30996 -27616 69581 -111375 -184611 150327 51941 -137722 208739 191845
21007 191845 347072 395079 81756 318367 15034 -54586 -157580 -337277 -83738 72784 -60535
20995 -62642 -122140 -93010 -221311 -116329 -23855 19559 -165011 -86004 120671 59311 -40158
20983 118609 -163829 -81046 202534 144806 72703 87233 -105195 -160202 125853 17956 -138521
20971 -591 -193027 -149112 140751 69764 57189 -42714 301274 45498 199580 -219517 219876
20959 -197181 52806 35310 214215 -99573 108900 -11965 18556 -38239 -287029 -196949 -106884
20948 -106884 81702 135806 -2098 317134 110730 10755 360565 -155015 -298976 11703 242658
20937 242658 -79403 4537 232408 -256717 94193 40679 -357477 -379411 -68672 3549 -182926
20925 86484 55134 11295 285051 71324 63618 38670 -335971 -6218 189321 38511 100076
20914 100076 55202 113043 5190 -211207 -374350 91977 11432 123844 -256571 -52976 -155071
20903 -155071 63579 182157 -9252 106525 36393 -153700 207903 360409 -14794 -45120 -33424
20892 -33424 -193701 225344 45977 -350736 -167172 112781 -52489 -55884 -44899 -231219 -281523
20881 -281523 169496 -87025 -152226 302265 221016 240973 76519 -162490 98448 128956 -200183
20869 -114684 51483 -74537 -239346 -27793 272936 -713 -165435 245563 -274889 -112433 134417
20857 -172170 -10011 -2629 211094 -78883 -55393 -62781 234810 145039 -134180 -71196 -11406
20845 -144289 -200111 -121009 -34971 -11075 -144043 -2785 42956 323631 -355737 -178729 -159015
20834 -159015 -109412 -375007 23539 36492 -137906 -392173 -125413 118078 -154144 160699
20823 -184466 -105275 156907 -203270 -134896 -272156 189094 -359309 -42109 -317865 -163745
20813 -163745 -79228 -11509 -24479 -40540 -106172 -149053 -160057 -57423 -7243 -372745 -190886
20802 -190886 -50333 35464 87182 74311 180252 -280879 -54521 224292 -139253 -49522 -139175
20791 -139175 -106041 -299001 -389498 -76843 -312738 -153551 182836 -275483 -27469 -131293
20781 -131293 -36293 -267389 62186 94112 -113205 -84887 -201915 -9891 -164694 129737 46658
20769 -54049 232193 -175241 -141500 -120391 -181546 -91781 -193608 106291 -18913 -357598 81527
20757 251535 -43058 -136575 13188 24952 -112503 -191070 -223186 -263749 59110 3965 -63332
20745 110558 113463 -115488 -127753 -116595 -103505 43869 -152057 17081 -321739 -241656 136857
20733 -233683 -93183 32646 136812 89068 -141274 147464 -125916 174067 -373404 120036
20722 -226449 106434 -6890 62443 -130609 104354 77987 -325512 50356 -88726 118620 -163929
20710 -128807 -35773 -130638 -268006 81318 -189669 -162535 68364 -77211 -4063 -144343 23245
20698 -184483 54023 -88704 -327962 85322 110144 -65340 -198789 183476 -19377 -152310 -338729
20687 -338729 155030 -273684 -85525 16689 -151691 -410459 184733 -58710 -64196 326871
20676 -4936 234510 34068 -287064 -101859 -169281 2456 -223121 300002 -136443 -103438 -15401
20664 121368 -280998 -202736 -128876 72586 -87976 -7597 7630 90671 -42522 156616 -271257
20652 177471 -53414 79094 -319948 -374641 164944 -96365 -129947 -27112 30248 -107593 -124827
20641 -124827 207145 -215682 -308658 -322275 182765 -252030 -72078 34736 -289577 -57771
20630 -115416 -64406 -232091 -36128 -10923 171778 272140 116265 -75221 -122053 212293
20619 45733 383162 105129 -82352 -133936 -389331 206066 -42723 58169 -58739 22128 142765
20608 142765 -190811 -62165 -15137 -107667 -204679 -27502 -209768 -293341 83868 -6387 -23663
20597 -23663 -13163 5426 190874 -172039 286858 -209689 280433 -170692 124502 -169161
20586 -33681 106952 168258 -280695 292476 35079 -17572 113575 -16874 17130 196557 -108589
20574 -155300 -60046 186325 -156418 -60818 23692 -258344 -8971 -173200 188388 114173 -107483
20562 -168479 156512 -5124 -352940 15736 26834 -301332 -83086 114987 -132073 -77926 -151468
20551 -151468 97812 56105 -133866 81995 -253117 -156727 178233 7756 35090 -27297 -44924
20540 -44924 260303 113136 5124 -63743 -26728 -157351 -79586 -95936 136308 -8674 -22628
20529 -22628 35000 311352 153303 -68206 79274 200410 -160524 -72725 -237998 394073
20518 302126 5215 22939 89764 -342017 -55138 -53000 -2872 -217319 -179475 -249877 -150683 -190829
20506 -190829 16736 51344 -123616 -24064 -70706 -239022 -135959 39677 -320034 -154744
20495 -154907 281384 -242251 9131 21432 66067 78548 95622 -81898 -84075 -139561 -290323
20484 -290323 226645 -23549 -172055 -53792 13167 190519 -57100 -365537 -117879 -166697
20474 -166697 -300600 274612 -132850 -110573 -111557 160410 61262 -216648 67869 127587 -73965
20462 136888 5933 7080 39422 -82028 107748 183216 31644 16421 -167162 121537 -375188
20450 39383 5453 -143331 35413 -65459 -256579 143768 -193055 -122722 -55459 -225041 -43330
20438 -267251 30813 131530 52403 -68089 5739 -223774 -107559 -92859 93622 -139264 -1027
20426 224170 -321569 -198140 110839 -56470 -22647 165738 138853 20443 -27884 95213 -329687
20414 -160440 -144705 -187910 158720 168435 -191861 -79271 -130008 -355413 9046 -291515 103220
20402 -1263 -130949 -53961 84449 -39449 -63427 -23337 151842 -117310 -70047 202171 -24020
20390 -264472 83112 42084 -11346 -38177 -54534 187703 -75972 -2792 -120229 -47317 -50034
20379 -50034 -125927 84669 187041 152186 -16830 -98296 -199980 102054 269573 -120220 -244239
20368 -244239 100287 -75392 -86271 54946 88332 -159003 -148924 37020 -233423 -238974 -49061
20356 -95600 -263804 -66978 340313 -42719 -323390 -99749 -376166 -203644 19491 -93321 -59086
20345 -59086 -125577 -327530 149721 -277010 -19126 -104479 -124559 55816 -356 -189312 93277
20333 -380063 -311441 -57007 -55406 -57623 -77184 -244325 21875 172303 -232536 -54214 -509089
20322 -509089 53705 390190 -206044 199537 -340808 -249201 -14964 -83713 62416 41731 -178934
20310 -80559 298863 -116952 158040 202154 -37105 -191567 -222433 -93824 -140268 -10341 94792
20298 -167855 -82661 -306874 -259215 89502 -352837 -77801 -110808 -127367 303299 -3643 -149285
20287 -149285 -184698 -215812 -435545 -140404 -82716 48488 321587 19133 98106 212201 -191686
20275 209351 -16381 136459 -97052 -301914 -115984 -88819 62443 -201949 -22530 -69113 138448
20263 -57740 -69719 -159659 -73768 -64036 -14709 -70070 -141509 -28794 -218180 -166832 171182
20251 -328990 -293775 98381 66422 49974 -26661 -423103 33373 -267737 -322372 -127363 -67886
20240 -67886 70508 -292441 331184 -158967 -28346 244719 -229564 -366406 10821 13957 -210790
20228 -326517 100290 83825 -110430 -14010 194191 -14104 -18174 -142535 11096 -159194 -11636
20216 -103270 -372920 -62998 -141196 -3606 37628 -14763 62641 -147443 140985 139761 4668
20204 312313 -332109 140982 -119692 265363 147646 444811 261833 -30625 -144053 -150785
20194 -150785 -122515 162999 137531 99976 -21064 5702 -336703 -230643 26308 268621 -121910
20182 -131412 20193 -171721 -95219 55593 145399 -194414 46893 172161 95870 -28971 -36591
20171 -36591 -73426 -127011 98377 -434595 97770 142756 286850 -29422 -28173 88237 30469
20159 130115 -81331 271346 -103874 224604 183969 590450 202682 286944 393244 129026
20148 15196 384827 -193006 166393 -21136 348559 -75465 307922 519301 137535 -329293
20137 -346 96479 -122615 3519 -130948 334908 -413000 -6158 -53966 -28698 -235154 -142165
20126 -142165 -267003 177797 -29975 33735 35447 11006 -18340 -38801 -20274 -56271 196989
20114 210966 -70551 86736 -41757 114381 170190 190056 53446 -148597 -384280 -50007 -108108
20103 -108108 -86862 237531 191331 -224356 -1519 -22781 188242 -221131 -362053 -246000
20093 -246000 -247434 39035 239372 -87892 -129913 -81526 -162229 -229699 47149 300763 -208032
20081 -124336 853 -346842 65585 -76056 74273 161760 -10959 -186397 -23893 -148048 -1257
20069 -312905 -156793 -115092 111718 -52047 -230034 -139785 -37264 28781 36959 -256963 -115462
20057 -18249 107585 -158399 309 85593 -137894 -152452 -37051 120600 59844 -100351 -342984
20046 -342984 -42189 -231931 31480 155710 -85436 -117833 122392 -11466 -205313 -28292 52561
20034 182316 -276167 -42989 -111670 -53513 181572 -69905 -75113 53975 -156997 -169691 19245
20022 -97270 325474 -155840 -187543 -23655 -129768 43386 10490 86253 35470 -127134 61147
20010 -379828 124757 -313671 -325999 37085 96681 -37993 -198098 -74168 -144816 166952 283650
19999 283650 101322 59765 -46365 85958 -105223 93444 -169299 46450 48981 287010 122749
19987 -66928 -48110 -59038 2794 183569 101715 -330076 -201830 -50149 16984 85545 -218056
19975 -57496 -396200 127336 106290 152003 104610 -13103 -61670 270216 -114899 222254 169260
19964 169260 -200970 290570 -175445 113006 203625 -20647 106755 303914 59165 89893
19954 89893 398313 216066 -380189 11230 -62986 22441 -181301 -100600 -226654 90948 -111787
19942 -297262 6651 41756 4550 -64800 -133850 29240 -344697 -189027 -38504 36647 -131639
19930 -191171 -29918 -71538 -60156 192016 -77506 -50899 -187642 42760 20861 -424806 -124080
19918 -128066 -380373 -26688 -6050 280316 -123321 190136 -19287 -64625 -8407 -181630 -22731
19906 68117 12570 -2478 -375516 -207612 19296 -107898 28776 -18701 -1222 72063 -478278
19894 -35167 33745 -311794 -56387 -294192 -159845 -123466 -138935 1469 3651 -12820 -229642
19883 -229642 51685 45323 -138804 -315548 -44805 -91490 -132303 -268526 -29587 -360898 -128175
19871 -378817 112532 12689 112691 6346 -50770 94023 -389733 -91060 36869 -143938 77428
19859 198558 -97403 -55536 -10477 129167 -35899 -116903 98818 -218870 191207 102117 -225715
19847 256445 125641 -104855 -30034 -169856 555064 -39314 48572 -134661 29028 143564
19837 143564 -291513 -68010 -183988 -93331 459911 244073 -221293 36699 -49226 -206889
19827 -206889 16454 -149856 32418 -302424 -250544 214769 -168006 -219050 -193851 -540936
19817 -540936 -233009 -239063 26016 -372859 -15179 -137657 -80613 51645 20067 -74671 197901
19805 94529 -252301 -106766 -16614 -394420 -91221 -405375 -199639 -25452 -5686 2445 -144226
19793 -212571 -147860 -120533 -286422 -10964 20938 -87391 -103115 165431 -115561 -7570 125095
19781 145530 -57237 150573 -152764 52389 -27813 128436 -353401 -66674 -182195 88862
19770 -186762 131931 -156931 -25165 77989 -188731 -145492 -105644 -64988 82942 -20834 585259
19758 -352620 108927 -217200 17871 140274 -26867 -73712 -39313 195918 243622 68372 -236079
19746 320715 -308302 373190 -35873 -433524 -368511 294313 -11099 219650 -83425 -352705
19736 -352705 -19117 14630 26152 14566 410716 181970 -20033 -151882 284474 -20035 -1140
19724 -265282 126829 -362631 52044 -41933 209186 224211 56105 -49330 19115 -50344 -79467
19713 -79467 -349788 -152089 -273167 25082 136999 -57301 -62544 -45378 -81162 39549 217656
19702 217656 -9201 141161 533759 170414 399618 -282728 -17790 -61682 279346 -352929
19691 261749 -170923 187970 -217619 -209167 284151 7400 224857 -142569 39707 -235934
19680 42328 -97508 -119428 239507 112511 44573 -110044 28403 -234000 -33971 -135520 -102702
19669 -102702 259990 -89840 -120706 -169820 188619 -286211 180532 32307 -157959 -261928
19659 -261928 230971 -307417 -131448 12407 70269 -255686 -143399 -80491 -114486 -131860
19649 -131860 65944 253817 -10697 -148948 -35224 -142214 -256045 -126419 1779 -76432 102839
19637 -232737 -115826 -7076 -156826 77063 -164070 -53008 190186 -169985 -25115 -162966
19627 -162966 34010 -19117 -271150 -168854 38403 64294 -90172 36481 -170098 183314 -115825
19615 -175182 -209472 -389706 -66639 6061 -296373 -16700 -83940 -72276 10306 -8982 -138756
19604 -138756 104190 -23338 -150016 330006 -61797 68759 105115 148732 -30399 -88756 27556
19592 -133950 -251303 157909 39489 -47892 139667 -59835 -173429 150963 -28884 -198336
19582 -198336 -199820 48540 -332854 -337917 5820 -126246 113069 -19245 -204221 -403408 203132
19570 -46850 -161073 -332979 -345339 -53016 -679022 -53415 204250 113747 -115342 160976
19559 -152799 -170316 87001 -288133 -12900 15702 -483286 15193 34179 -3207 -174632 305844
19547 -107733 127277 -173659 -272654 166296 -76736 -99550 -24748 -101331 -54074 -61488 -105984
19536 -105984 -5452 -359284 5279 -153160 272 139550 11791 66078 -208671 -318618 -148374
19524 33953 -187242 120986 -139066 58683 170012 -66076 -44706 -280548 -24435 -247470
19514 -247470 112935 -164953 148808 -202348 148912 9978 -182097 54300 47544 -63911 118900
19502 143054 -55277 151046 74672 31242 -322421 108556 79670 -34457 8118 -110489 -33507
19490 55679 -59037 -186741 -201135 -115749 -188313 -91843 305912 -31483 78806 -140139 -94368
19479 -94368 -54788 -117832 -227689 -168198 -228708 161836 182115 -76205 -57070 70143 214672
19468 214672 52600 261539 83394 4001 118617 -229228 -120873 -173815 -84859 -85389 -278733
19457 -278733 -180008 8825 16370 -163634 -37791 -127024 -5466 -17871 -203285 218575 -164156
19445 -10901 -54592 -111552 -48350 3166 -84412 -14836 -95302 -271260 -77978 -41340 -276242
19434 -276242 -141226 -156112 -269205 -11145 -45413 -1109 -122521 50689 23834 -208136 126484
19422 -256248 -69296 243539 -180721 -381168 26987 87089 -300759 -202541 12767 -206623
19411 -31603 145636 237639 -55163 27404 -313811 -16642 -98587 230938 -167187 46163 -61467
19399 -127232 -58322 -178763 384106 197018 62707 -206265 -236163 3273 44991 226667 183526
19388 183526 41208 -144570 152481 77010 -87080 59395 41158 23398 -309397 -8212 -109836
19377 -109836 -292800 -22352 -174668 -157513 -531600 -181295 -150221 -106098 -224183 -220084 32500
19365 151382 -105501 258675 -176252 -11008 -208266 -27229 27318 61664 -272620 -220661
19355 -220661 233300 -331078 -249605 -73316 96800 -4299 163707 10824 85815 -343795 -21358
19343 134224 -66609 -325973 11749 -81119 68983 -87444 -164277 -11935 -15723 -27076 -173294
19332 -173294 -190793 37699 -80084 -127377 -5617 -158219 -317925 332114 301422 179224 64607
19320 33667 132474 282581 -82735 -112666 -126369 -191502 46302 -138617 -37335 -190661 125161
19308 187258 -7866 -7097 64739 94472 -104413 -14196 33776 -248158 -193258 129435 -90328
19296 151167 -77806 18707 -13241 -12363 116312 254331 154261 -167566 -145513 -4097 -313002
19285 -313002 -262474 -328734 -167671 -274407 70246 171821 -334937 -213249 168377 -198443
19274 -199631 -106138 101457 -51217 -244027 -197438 151119 -579519 119923 -279002 -450648
19264 -450648 -27498 -7703 239005 -4415 495 -140153 -387967 -11802 -341998 357198 6932
19252 -43332 -300855 -153054 -141005 43978 -138364 -238317 -293075 -316061 -644159 -57081 55915
19240 -182455 75682 -199708 -102219 126501 21931 -78104 -170544 -31137 140084 85332 -7057
19228 -79775 123202 -105812 -438778 1900 -203534 -5265 -70103 60297 -19422 -319587 -120541
19216 11342 108951 184338 -242016 84624 -30513 -56707 -28975 -501615 139486 -166777 -156705
19205 -156705 39469 -57927 125321 67796 -166747 -94774 271845 -1201 7823 -99544 66603
19193 72186 -108479 140061 -287234 174587 -9994 -201417 -356027 -130766 -719 212832 -62235
19181 145968 -42631 -120195 17721 -237575 6029 -323703 -139239 47434 -131584 -207763 31289
19169 -188595 -81163 -60530 -241602 34635 -122668 107329 -41331 -195141 -87002 1650 -78754
19157 105196 128383 -49997 -329246 86164 -193211 -244245 -40591 197264 -96447 134827 -161365
19145 21286 -468106 -159293 304085 148292 -211098 -228398 -140398 20138 -112138 -37931
19134 -347465 62996 -561404 -56223 -26659 -261148 -99383 109451 -20008 15264 -104164 -59452
19123 -59452 -224050 -99137 53009 -115728 -134445 148625 -123104 -241189 82220 -309436
19112 -122738 59195 -191383 -309256 7888 88135 -27355 -216829 -138875 48312 84297 258820
19101 258820 -41190 53893 -120760 98558 -74550 -52263 -238438 50278 -197447 -38803 -131900
19090 -131900 -102188 -51541 85682 -210152 136451 250896 109783 -247240 -92712 41405
19079 -189279 -206918 -31306 -322190 54044 -39498 276584 35434 -46646 -14588 246966 116645
19067 -406273 310729 -353233 -30501 -131403 197236 -151123 139667 166021 71060 -259164
19056 120116 192116 -38026 -121922 -92117 -306383 -158351 -140703 402736 160806 -317777
19045 45526 -40392 -57700 -57884 -6204 -169508 29214 48754 15361 -71977 -79134 -236847 -137926
19033 -137926 -237358 385299 -35623 -112998 -144342 392841 -154039 112730 69395 62957 196448
19022 196448 24917 1086 169577 -269859 -182319 -10358 -167136 -61034 -114876 87979 183758
19011 183758 -125049 -243049 -230737 39737 14476 112374 31294 143922 254157 37654 -244434
18999 140364 302636 194046 146083 -33570 -14133 -29409 -227330 -90160 -256588 -11400 -153210
18988 -153210 -207851 55537 -197662 -290258 30721 209449 -229026 -230453 -294909 -182259 58973
18976 528196 -99614 -40956 289043 619086 421383 73149 88001 -105339 443038 -101580
18965 -117116 -133720 187579 -146734 214653 -12923 -45700 89144 127187 -30366 -92647 -123376
18954 -123376 -22609 -156838 -87659 78207 -98237 -39329 -425692 -157107 126112 -236974
18943 -382487 34019 37776 -81355 -217249 144606 368621 290582 222712 -107042 -159129 -229514
18932 -229514 -19015 -61633 211962 17632 10164 -157297 313711 -352045 -13215 -37390 -48137
18921 -48137 -89735 8319 -27172 -174979 -337658 126817 402968 190016 -144649 -32446 -4305
18909 86474 340754 215066 8523 83548 -476 -84653 -22021 -85134 47816 -24449 -12273 -237829
18897 -237829 -56972 902 -6830 -12004 -166431 -289330 135285 -192598 -197970 227935 -270322
18885 92914 -76803 89737 -256186 241298 -258496 -195782 -124892 33238 -284128 123969 -232520
18873 -245113 -157270 193590 -151660 -17946 75964 55431 24112 256008 207693 -156253 -157481
18862 -157481 143903 -181185 -155411 -152832 -149153 -205620 -79047 138910 229190 -18200 300815
18850 -252157 33874 161820 -240751 -149574 42843 -13204 -239411 -22304 49979 -110937 -52001
18838 -120448 -282863 -55254 261192 -66586 -23487 50206 -213106 -204263 -271539 -62684 -54177
18827 -54177 -43823 -54446 31257 -160616 40632 207076 -42182 97001 -74203 -75410 -20912
18815 -199784 116381 -32190 -16107 -170128 349434 -105100 98752 91979 -12629 -24194 4279
18803 -217961 96803 122048 -201301 -152032 304004 -185381 81898 -97936 178380 62273 20601
18791 -57537 -187629 76249 -261201 67392 -241533 78085 201126 -116548 -40959 -109693 66667
18779 -27624 93221 -116211 -221261 155087 -175580 -90664 113643 114473 -101731 -265957 -133474
18768 -133474 90864 -149167 -199301 -124358 -391 -143844 -141714 -130299 76612 -128717 -230363
18757 -230363 308 -102950 -15099 116558 114345 -179850 -79243 -12858 51575 -81915 -540029
18746 -540029 -435106 -116110 35505 -70749 -449490 96914 -280843 86575 -260483 48212
18735 -222029 -392538 -45337 -1495 -165019 102334 -128794 -107919 215042 219280 337440 -396541
18723 -138735 29944 -128602 -6914 77003 -270537 73643 -15192 115187 186686 -177217 -302187
18712 -302187 10544 -126734 82707 215557 -75381 -24229 27671 -135702 127029 -97558 154179
18700 -180184 47570 105542 -15132 260628 -139956 30893 -338079 62541 41566 -36623 39085
18688 -171519 56878 -195961 295329 -54789 -14165 -184509 -263979 142355 166483 -245012
18677 -260268 -295136 -184341 -14944 -122380 305873 -77852 -80387 262164 -236181 -259426 -191888
18666 -191888 386974 114137 230894 -49861 30257 -189159 12492 54177 -439487 -36505
18655 -4873 33877 -204144 -75939 -46356 43413 36168 14561 -6867 40636 -15397 150326 84721
18643 84721 -33243 -337621 -49559 -103279 -506902 -187038 -257780 -71914 88429 44259 -128433
18631 -248069 228131 -15962 -268052 -106643 -40409 253076 -187151 -147847 -7080 51502 -62749
18619 -191402 108914 -32344 110689 -6832 -246732 -131580 -143040 -267501 -115227 -267620
18609 -267620 318919 28008 -19454 -137147 -265329 -19221 -250619 19378 -45877 46032 110351
18598 110351 -124784 -297922 38465 214043 51758 -86967 -260007 -5930 -330922 -290319 -236494
18587 -236494 3755 -311226 21021 374886 43818 -180766 -104266 23037 88520 -172696 63598
18575 53758 -92653 228375 -293006 -143120 18354 -175324 -49451 -116270 14139 -80497 -112901
18564 -112901 -254031 -24512 239345 -37759 -482193 -79006 41172 72642 246557 -285015
18553 -120819 400527 -304 207286 54741 -163128 -239517 26672 -81711 -202082 -239612 229124
18541 -112349 62168 31017 -112186 -264093 -257784 308650 -27765 73470 -197492 -11609 112538
18529 170574 86871 -16703 -158973 -202866 -191335 -266959 -105357 -49889 -31218 340076 146581
18517 -137865 -144247 -62659 -468552 58296 -25760 -216150 -102933 -202108 449 -105362 -342965
18506 -342965 -130530 -99685 -356266 -121175 146364 119144 -262046 10277 -117689 204380
18495 16273 -277105 -117178 -69691 275 -42296 -142187 9879 -128684 -316539 -177970 -332991
18484 -332991 183630 -165939 -258978 -338518 21800 159829 -154957 -38690 94157 -188876
18473 -142543 24267 131538 -76774 -318324 -73153 -180328 -53006 142962 277075 -196028
18462 -69358 126159 70271 -195200 194835 -148312 164868 56019 -122973 -91370 -8082 -288866
18451 -288866 -126455 -173034 42139 -281916 -235981 27881 80773 504325 157959 116791 -132791
18439 149098 89379 -89265 89989 71835 -263770 -115378 -323826 210528 -71371 -105775 29479
18427 -132759 -63244 -239580 -98814 113777 39524 -194936 -360416 56069 -162613 -76209
18416 144969 -800 -165954 -5890 -315378 270411 -57585 47065 -488703 81612 -157308 -127007
18405 -127007 -178737 -99448 -124843 7117 -425436 -174899 -28984 -105405 -248645 173717 -86422
18393 266961 -268049 -22949 -60867 208030 -86580 28431 -203866 -107125 22712 47121 66186
18382 66186 126992 151616 105517 91007 -88547 112471 -131313 187826 -299402 203194 -108525
18370 132734 10934 -91400 9470 -5753 -66264 -200156 59402 52562 -174295 -143217 -12450 185737
18357 2263 21697 -107304 -1325 162264 -187391 -37436 303662 -185215 -38810 -13142 -261915
18346 -261915 -9962 163056 81380 -124588 -288615 -202 -53961 -343601 -370181 -128477 -113750
18335 -113750 -55437 201969 -14639 28577 -125116 -123731 -246460 99310 -99146 -788 -1895 -130155
18323 -130155 -193075 63180 44837 -413994 -2550 46163 -210805 13752 121738 146984 150345
18312 150345 -166336 117345 81161 -106050 58226 246608 -109475 -26280 15310 -212790
18301 215753 -153342 -335498 -9262 77595 -83777 -75712 -258552 -132526 339387 140674 -205161
18289 -59881 53251 -427645 68262 -98161 300547 -136894 -134995 -437805 228445 -185696 134014
18277 20392 30794 108594 -50429 -190585 -4141 166209 -88538 -33558 52678 95349 67845
18266 67845 238492 66032 -132052 -115506 -94699 -120215 -252717 -5613 -331749 -243156 357249
18254 139817 -164472 -101797 -77919 5490 80217 45990 352925 15259 -179436 -340332 23879
18242 8164 -26996 283725 -222634 -262234 146503 4098 -81867 -31129 158098 172712 14251
18230 75927 -147927 250855 -92499 -17197 -324247 30859 -135755 63404 189186 81309 -347419
18218 -168018 158524 -60093 -63121 119284 200812 -440365 -240795 198334 55693 -25226 97298
18206 -115058 -100198 -81852 207371 -119663 11644 186406 171975 -110091 -32872 292116
18195 151170 180816 241860 -164673 -89999 -54715 -217852 -155747 24011 -258516 498430 -44876
18183 108231 -92210 175866 -64885 181379 376053 -151269 150611 -168103 -293366 -237258
18173 -237258 253943 -7986 189823 -325053 100640 242032 169087 152896 -303860 20569
18162 46003 -4732 76345 -243377 120952 202276 -447959 26604 103185 1117 207791 132658
18151 132658 25106 21664 85011 -95502 -260651 -444121 -133686 173820 204040 73807 -97620
18139 208297 -60419 12112 80222 -8103 -300494 -66782 20970 -176136 79218 93916 -352391
18127 -113600 150241 -142456 -72647 -375709 -64145 79242 -252414 -205787 -74192 -294935
18117 -294935 -18069 92606 -163323 2816 -298618 -41503 -52979 180698 -156988 -52401 -177146
18106 -177146 -41866 -187243 -87738 -246993 -135727 -375958 6784 -281329 150160 131551
18096 131551 -16208 -16528 -49118 -189146 -19245 316287 -72977 -295151 -280960 10836 -8229
18084 13872 -1243 108999 -58206 -9124 -110503 32629 -25183 -192243 -22620 -344363 33057
18072 -25201 -353122 -420252 -120024 120235 -372032 201034 -19612 80767 4155 -128585 -130737
18061 -130737 -630789 35388 -264258 -47434 3190 -204456 175229 66106 -165881 -157638 -24781
18049 -81426 -3600 138691 106992 228347 -15597 10220 -241138 201642 27789 -20990 151502
18037 -120143 13349 -126229 -16427 -276612 -173231 151739 -17325 25655 108581 -73476 -84644
18026 -84644 334729 36784 -91373 -43582 66298 192346 -241375 -362870 86613 -218772 95418
18014 -121560 -137317 -184281 -89065 -312588 -33102 160611 -259563 -55200 -58615 187518 -85976
18002 230488 -305555 6698 -393377 85800 189518 17656 -24356 192174 -280622 98572 -176814
17990 103345 -56533 -37240 -153784 -44995 -293870 424822 335783 136285 -48589 -388570
17980 -388570 222660 266525 92654 34097 -48812 -155919 -234136 17186 215081 -138961 131665
17968 -122634 176035 -162910 -72047 -121864 21792 159256 -51763 -119072 90348 254802 217179
17957 217179 176166 -469111 -192885 -133957 28614 -220534 147849 -97283 160355 209220
17947 209220 116002 223308 167193 -54846 158831 98340 114767 -72184 -354883 357855 37494
17935 -18670 14256 189598 -133193 -188592 -71169 -77404 -15838 -113173 -148024 8991 297267
17924 297267 38705 -98182 -72904 266661 -23327 124256 134704 -251527 -15420 -195097 311476
17912 -43830 -19713 150322 -272987 81578 -144153 169798 56421 -51894 75495 79118 -108163
17900 75519 93298 384505 -163596 -399026 -247246 -77916 -443984 26650 12055 45868 -169410
17888 196873 -361640 -89577 132413 -91098 -79236 -93797 126501 51179 -29754 326807 90208
17876 97971 -32117 102631 -200161 -146060 7479 189146 -134223 -210111 209563 109830 17962
17864 -165949 -318573 -3171 105081 4064 38258 -155265 147781 -11329 251560 153504 304258
17853 304258 -214597 415395 -228729 -16808 -250335 -8047 -78450 -6988 115709 60931 -34850
17841 84965 92783 58869 158002 185542 -84586 -67171 213737 -321718 332889 143333 -112574
17829 -189027 38130 292788 339326 -241367 43512 60677 -138532 -96842 188955 2206 -92668
17817 -7001 153628 230564 -16046 51064 -85998 147910 -111112 -172383 -175843 141403 35026
17805 44456 -45444 105529 277038 400191 -24817 -110302 -796 12431 202568 89253 -142178
17793 270792 -182 705 -63016 156666 -299244 -61433 267053 17417 -284810 260189 68575
17781 25445 66116 -125991 205863 40075 30669 -131122 484390 239929 -49612 12922 -197810
17769 79576 336827 85188 -75668 -60597 -183335 116671 159142 -39817 100327 -40099 149264
17757 28541 290303 116133 -28823 52712 114583 9193 150989 153081 72263 264555 15587
17745 -399931 456226 97310 71840 16567 209107 -71934 143530 -18507 -203810 201158
17734 216459 135036 84026 429454 120442 -261698 153361 244472 124188 -50881 214515
17723 -128059 41974 216474 190089 140045 -159452 116783 -13788 -100056 154576 43948 -131968
17711 69936 -76677 149793 30997 95607 147075 88599 -34430 51449 -70216 176705 291492
17700 291492 263633 8851 -10653 39875 -153500 10828 -160269 305576 168573 391625 -383838
17688 349433 291080 -107766 235209 -38992 202348 -25303 226078 -101549 -57051 275087
17677 32412 -137526 245872 -9023 488236 237108 -179670 355328 -209485 -36914 -129760
17667 -129760 175430 -240305 -107711 219961 38612 43668 158107 216073 79874 -50650 74719
17655 -111695 260753 43559 -269151 254338 -142074 66326 110109 52620 -127513 -62875
17644 -13916 119005 -80141 93435 128935 40544 62906 85120 -68259 -336567 -133929 -42684
17632 26768 -106260 146649 -50323 207923 230587 -49439 173077 -135830 148232 170196
17622 170196 -112886 128741 304189 74103 37681 7532 82749 7393 278383 156284 296519
17611 296519 38100 -73375 67982 -265533 -162630 334474 338517 -166836 -99681 -70269 398941
17599 71646 -31784 -130225 188676 94984 -162575 -232975 9543 181107 139141 226868 259061
17588 259061 220467 124895 -24780 151512 403672 337407 341698 98056 -59728 -3854 -120239
17577 -120239 172680 324455 -76585 539360 206194 9206 32849 -50854 138029 -17488 74494
17565 -73193 135509 297602 17000 211846 -114406 349555 57318 275740 359345 262254
17555 262254 279072 107853 140341 133174 235512 265562 51753 -81487 192690 -116279 221325
17543 12608 -149252 136497 416290 121495 411887 289881 64125 367695 137635 82310
17533 82310 169523 143293 163595 31690 237528 346075 134369 81052 357146 159021 435696
17522 435696 840908 839447 671997 300169 481177 183460 262546 185440 191055 477076 101593
17510 177146 419823 485448 926529 881927 574030 482869 350978 395466 422354 319582
17500 319582 278843 365085 519369 99898 127301 170335 206845 171007 289381 313663 -27049
17488 239700 35660 284419 208317 156518 320682 569018 149569 403967 75708 119101
17478 119101 102580 359454 414999 74935 434463 136929 277931 175475 52037 275566
17468 275566 124983 -98869 268719 217363 428676 294669 388126 408702 210052 115436
17458 115436 -7237 -188684 -194167 38092 229533 211436 374725 170721 355590 219415 596959
17447 596959 314914 454537 445741 325274 139572 513196 264365 498709 168518 408294
17437 408294 429300 469883 -33949 628306 -238105 264246 539707 248622 84591 192011
17427 192011 223602 188817 523276 228339 271143 4706 257552 422950 206212 304423 372549
17416 372549 83175 105403 440008 298313 286442 367546 284140 400176 80204 177903 312885
17405 312885 137908 284378 101150 621273 13729 325212 318676 117451 29297 434179
17395 434179 2374 322325 42649 75292 262522 239226 2518 239787 327460 114241 193055
17384 193055 172499 210487 326454 -221551 337478 579456 -35770 116190 -4434 350569
17373 130847 327977 309248 566249 56374 99385 348838 -109222 421185 -34224 88700
17362 285324 41596 266484 255056 33828 119995 126138 331668 248042 383908 -73285 44007
17350 71526 70106 130241 40483 398074 -64798 177208 577674 502776 24207 268532 144463
17339 144463 322246 356818 -225737 395266 235852 299383 228171 42471 196223 229809
17329 229809 229946 301452 280270 -9663 184434 339621 -40678 80761 418805 37472 139144
17318 139144 354953 180789 367636 475650 111993 62017 95216 471271 233481 403814
17308 403814 33787 253323 148697 88536 -977 157408 394734 142785 444826 475487 317852
17297 317852 45108 182022 344472 205431 399382 427858 218212 296061 140875 201043
17287 201043 19138 287383 289409 140285 -27797 267572 89214 -25813 172831 172315 85797
17275 366345 214317 216864 535256 387925 554074 82925 -59319 240809 141270 -66330 -49756
17264 -49756 134856 449560 249087 126682 412594 296744 678563 -96871 562485 446786
17254 446786 148589 216092 -6241 452313 -43127 611927 7418 347530 133852 420006 268235
17243 268235 456762 391107 269438 344185 348485 513727 494875 283727 255283 367235 -60779
17231 384915 296221 408194 291083 138413 127607 394552 263697 106603 195923 37297
17220 138681 296913 659671 338773 293262 427070 271038 239274 351427 195712 393112
17210 393112 344505 199770 150259 566790 256138 280457 329204 213857 388037 181694
17199 214857 102228 428788 389469 320682 123372 150732 527044 494041 141240 306947
17189 306947 -32969 607068 200959 587807 317021 488854 197016 196455 802366 324270
17178 459206 409048 372570 313324 655490 313421 497455 418788 740945 521284 612637
17168 612637 642328 537975 742985 528914 330061 706649 595418 288631 136040 571293
17158 571293 515076 592684 191646 387012 620368 327672 288638 518981 381391 732616
17148 732616 353346 669113 639954 735616 613021 288690 552080 264781 549241 534539
17138 534539 410607 672421 448086 482338 352410 413854 210813 566890 707717 551888
17128 551888 472386 603648 421156 648020 643827 343763 360771 244572 546929 877698
17118 877698 475798 656913 328548 402001 655440 789964 767094 674874 505050 592281
17108 592281 555287 479879 380275 620928 664150 441484 646297 407473 648354 602988
17098 602988 458112 494015 438179 579516 209201 444431 575372 608748 428959 494979
17088 494979 525466 834363 580134 896379 207718 961821 484323 624766 507955 581163
17078 581163 499552 533710 809984 889785 632126 364952 665336 501579 894575 815609
17068 815609 575771 571139 715114 636121 841733 499794 959229 994013 911687 712032
17058 712032 969870 640456 630448 660187 823886 973798 850906 494807 846571 853333
17048 853333 394367 757232 913032 670981 930297 610013 699295 705022 567823 864822
17038 864822 569112 946772 649062 1053964 1093745 1062509 958655 748108 916113 816108
17028 816108 852136 860639 1029976 1053659 683146 1240072 999254 943127 766509 1125211
17018 1125211 1190620 1114092 770229 1113476 755185 872059 1049716 870845 977846 1269448
17008 1269448 1075402 1151790 1455411 1144889 1004370 1147442 1168507 909999 1208234 1366016
16998 1366016 846410 1590303 1275211 1369907 1444691 1227621 1069418 1288773 1218801 1285410
16988 1285410 1414228 1466793 1354987 1528800 1318254 1132859 1165819 1482885 1457287 1153110
16978 1153110 1419489 1540690 1778594 1338872 1265943 1626012 1107863 1557429 1252298 1356268
16968 1356268 1443427 1659533 1487037 1533470 1489466 1509061 1723925 1558333 1450913 1238769
16958 1238769 1754197 1718624 1535802 1727182 1563958 1686971 1679538 1848667 1952253 1654121
16948 1654121 1648639 1963851 1675527 2028981 1710842 1832716 1550844 1872917 1842909 1722936
16938 1722936 2206409 2032025 1882894 1899410 1941395 1986644 1702695 2079489 1883013 2016446
16928 2016446 1874625 2215106 2457838 2195145 2183084 2304184 2166760 2271869 2532078 2210372
16918 2210372 2697284 2400849 2407403 2318132 2542495 2281484 2410395 2396163 2275709 2688047
16908 2688047 2603140 2782045 2572605 2926131 2571064 2810195 2582971 2870204 2942931 2596241
16898 2596241 3143498 2932338 2827327 3116059 3200726 2856582 3155333 3292192 3167131 3482552
16888 3482552 3181050 3392398 3212294 3606491 3778074 3577615 3381968 3774745 3803527 3385648
16878 3385648 3900375 3903168 3912059 4243810 3991985 4201777 4179150 4078617 4167212 4312315
16868 4312315 4231349 4274534 4085298 4677349 4638758 4755465 4520990 5182344 4599881 5170151
16858 5170151 4832449 5110322 5107378 5383751 5113827 5292530 5347106 5601091 5842944 5886110
16848 5886110 5479619 6175482 5905816 5847252 6295129 6177706 6627384 6405887 6570832 6695093
16838 6695093 6679653 6633226 6790869 7029160 7336948 7510404 7548085 7623278 7863393 7806544
16828 7806544 8258272 8193645 8580579 8515441 8976889 8854856 8851591 8923928 9538301 9892203
16818 9892203 9670744 10145785 10274009 10155970 10727735 10874851 11197885 11159372 11719349 11646000
16808 11646000 12132356 12586123 13074690 12558007 13355817 13762755 14177823 13965252 14280925
16799 14280925 14883411 15157657 15481809 15830450 16207132 16612043 17083232 17848322 17897058
16790 17897058 18515604 18863521 19461219 19915496 20436936 20837313 21619725 21743819 22753705
16781 22753705 23540152 24277308 24821514 25379791 26094491 27251224 27832225 28627877 29402730
16772 29402730 30499657 31310106 32362571 33293485 34311144 35567899 36869617 37651849
16764 37651849 38784693 40289373 41557724 43157747 44430679 45756848 47590187 48955449
16756 48955449 50602811 52277095 54129193 56086283 57763944 59259400 61289794 63483170
16748 63483170 65644184 67657283 70122605 71890154 74099317 76418483 78506789 80602736
16740 80602736 82744679 85303441 87289617 89131212 91047484 93087131 94356990 96115448
16732 96115448 97672379 99039811 99938382 100977080 101906032 102729151 102976892 102944866 102999311
16723 102999311 102822647 102680118 101999223 100756667 99811145 98404580 97290656 95551064
16715 95551064 93870037 92383844 90425832 88217473 86608639 84392317 82488623 80088140
16707 80088140 78134742 75350756 73952998 71534055 69398627 67410278 65218211 63073605
16699 63073605 61349450 59458498 57542265 55682696 53782184 52612221 50391494 49295999
16691 49295999 47428356 45943922 44665270 43083120 42216030 40595991 38918514 38040056
16683 38040056 36906212 35679672 34864754 34055851 32661083 31660338 31062920 30317305 29397500
16674 29397500 28408508 27370933 26835634 26116540 25364707 24898014 23823421 23451592 22823248
16665 22823248 22255098 21540288 21051264 20890933 20444870 19634715 19266041 18517947 18244027
16656 18244027 18149437 17525923 16895652 16377994 16067303 15904652 15560727 15151170 14790977
16647 14790977 14496084 14329763 13860362 13529737 13288815 13138931 12523316 12415874 12395124
16638 12395124 11868693 11594816 11404028 11322987 11216155 10982150 10845276 10440928 10122739
16629 10122739 10156495 9994753 9970376 9232326 9175941 9152703 8991844 8830216 8869813 8459143
16619 8459143 8249709 8635094 8326275 8195932 7747096 7707536 7647627 7665783 7626036 7068944
16609 7068944 7392052 7042411 6944231 7205908 6736734 6597244 6510153 6445864 6320669 6233844
16599 6233844 6288468 5867319 6194048 6144665 5909028 5737687 6102483 5738830 5812721 5878619
16589 5878619 5526329 5316048 5425478 5248101 5109591 5126542 5078617 4987259 4836391 4714602
16579 4714602 4691756 4731322 4826071 4717556 4354745 4262926 4285228 4203027 4149468 4399794 4216435
16568 4216435 3859560 4098656 4142176 3932350 3899291 3781832 4104829 3858183 4153258 3593557
16558 3593557 3873384 3737948 3501563 3908148 3708711 3757167 3774749 3499683 3517278 3224958
16548 3224958 3353857 3348819 3107110 3254109 3332319 3148668 2924724 3239415 3328636 3215347
16538 3215347 3175856 3053295 3102917 2948523 2916078 3022916 2951509 2677069 3001511 2686596
16528 2686596 2639989 2733104 2709743 2503833 2806568 2477509 2750691 2965143 2435016 2355942
16518 2355942 2765393 2212843 2571505 2140056 2689392 2521265 2554381 2367847 2891448 2276667
16508 2276667 2387079 2348290 2273318 2188310 2259425 2085841 2296275 2228223 2173479 2433752
16498 2433752 2116655 1872190 2162645 2140718 2205707 2057135 2208458 2238656 2035079 2320863
16488 2320863 1824453 2048970 2146427 1918707 2124412 1956922 1767877 2078270 1967188 2123912
16478 2123912 1704140 1906621 1895053 1843012 2136900 1805627 1608730 1828079 1854121 1561505
16468 1561505 1603795 1825327 1583983 1718851 1662616 1614078 1754312 1871249 1801497 1443407
16458 1443407 1327816 1592200 1605502 1389484 1605268 1312933 1719599 1583663 1558275 1520778
16448 1520778 1277294 1567486 1555400 1529612 1549084 1346273 1097010 1174518 1355095 1465842
16438 1465842 1142157 1234313 1135080 1176062 1311774 1164179 1489240 1157630 1590634 1617767
16428 1617767 992481 1445078 1508507 1368122 1220595 1576220 1337475 1355292 1240256 1548421
16418 1548421 1353669 1437581 1427438 1265709 1471218 1344364 1117602 988713 899031 1441216
16408 1441216 1321011 946298 1170795 1072797 1168756 1084388 1127838 1191312 1050133 1072623
16398 1072623 1136527 1154363 1236856 1122006 1189132 1135376 902303 1189824 1155998 1383132
16388 1383132 936904 1007293 983700 1084330 1023980 1443406 938537 1119878 991064 972354
16378 972354 1083901 973445 1080766 985072 983781 1322645 816503 967644 981764 1079032
16368 1079032 939640 1033454 1119192 758352 703193 866490 927504 693625 950153 972537
16358 972537 1038357 849539 606329 493373 1109874 759151 1026648 795823 1006323 846932
16348 846932 1178841 826956 967617 775689 652331 557336 1103893 926834 758233 823564
16338 823564 654953 835041 823917 821238 711305 551838 1043583 1040477 648335 890296
16328 890296 846995 462671 773390 554714 788577 802212 675722 791247 868340 1204420
16318 1204420 704229 1036122 797283 617040 929550 682975 598973 793897 576468 619355
16308 619355 610587 718306 601908 719917 795646 611447 870971 725666 358471 619452
16298 619452 587430 686868 471605 455833 867609 514588 456834 549885 529349 637261 741804
16287 741804 299839 494384 949341 768997 668554 532755 15299 707191 813193 321498
16276 315702 259395 708844 304886 789360 564584 240301 964547 559899 526301 486544
16266 486544 883953 516728 442098 379447 833771 559866 845614 199664 635692 488815
16256 488815 800933 338142 479184 586876 381637 728243 360881 562952 616284 474854
16246 474854 951148 568323 384277 267366 744180 679176 779853 511069 547200 548649
16236 548649 362669 312578 324921 677591 522956 358860 367757 412290 321085 191606 339060
16225 339060 706851 183748 233779 593771 221190 526647 541401 113233 487078 130401
16214 140719 474912 656986 199107 196262 472716 333525 283024 502236 608893 640606
16204 640606 463040 346783 588997 604423 408273 407108 435057 290732 252768 52229 187807
16193 187807 709539 38566 135811 589230 620315 268062 462488 420954 393876 54772 96634
16182 96634 331884 233376 720309 392430 94693 275428 422859 219699 381373 22510
16171 287757 351726 348746 383410 742219 226307 288835 293782 425155 289207 439652 440720
16160 440720 337676 231871 323302 366122 286098 510175 422384 317791 265014 400334
16150 400334 236862 -1682 358545 221318 51735 311918 275350 528789 377389 149667
16139 243356 466433 278070 173079 113560 217096 180373 -137743 107001 359051 209311
16129 209311 167998 362695 364490 208440 124526 183594 35786 345183 274744 510453 305460
16118 305460 297246 70382 213017 293743 64009 319069 469612 218845 402341 364562 313252
16107 313252 250396 156230 397166 248908 217434 427624 321861 92825 298631 371604
16097 371604 58221 186063 483414 234290 429357 314249 201357 201863 204957 289557 431491
16086 431491 332944 -173643 68297 35229 124597 198049 389510 208267 147458 203050 -58513
16074 281571 130160 103771 98238 219841 280608 498815 339199 70609 -247390 60790 206915
16063 206915 -19031 -96588 53797 175123 164785 281514 305955 483091 146577 99983 -106621
16051 3620 -81769 183260 44377 272454 309212 176881 59311 -132838 -904 -119989 117805
16039 117161 167068 263676 100203 68528 22488 180332 100812 115019 -27321 95409 -159437
16027 242557 182486 -17421 89413 67482 -28560 139950 65858 142394 -3885 174227 86178
16015 358268 110856 -103467 100330 -64591 314018 190397 7490 399326 294044 -36524
16004 388403 -3474 236465 -33895 160999 -103975 366482 305088 -207114 -15028 -162734
15994 -162734 -162240 390381 201280 -177295 188003 424591 518887 1100052 1048640 968181 1127749
15983 1127749 763153 902286 519783 376668 123832 -204719 107279 660844 19467 -110083
15972 280565 107581 327813 167942 554390 -51049 176520 -21828 -150398 382234 232587
15962 232587 227025 57671 78347 -122282 -169211 91883 148383 -75234 126258 -45013 24103
15950 247953 202181 370491 245321 -86559 -8757 465005 -34402 49766 66933 -60996 76168
15938 122930 -126067 273736 49883 293218 208576 150851 8164 -65335 -26826 103616 65305
15927 65305 -185687 159957 222976 44303 35614 -51552 279824 298283 599533 34079 -249840
15915 23917 252462 159099 -161794 -29251 -66292 22790 -188134 299084 55678 388502 46465
15903 -186583 248611 -525747 -41856 -236924 151625 -83666 -21339 135150 41331 182376
15893 182376 -136464 105143 383919 144794 -164173 75328 -276094 175619 158375 84 -95565
15881 -57506 284571 223460 4250 201918 -127412 -69060 -115957 -14642 84867 27867 29932
15870 29932 93733 122825 -249916 19303 229905 3923 -34200 35207 245410 -6749 119198
15858 -197840 137506 180696 121876 123062 8400 58184 -146639 -9809 82603 158919 11678 12306
15846 12306 -106669 -244719 26909 143142 43699 216667 187829 -396031 -153434 -185053
15836 -185053 124759 46072 303567 111079 147897 -188153 -49064 111788 -195466 -73457
15825 165438 -326960 -140792 269898 78456 157129 -72708 85178 -351881 -138321 -186594
15815 -186594 16229 64220 -148801 -92860 -85201 -175188 62225 -350374 -113927 54717 173093
15804 173093 91924 38717 -137318 -115706 -250785 -82256 -87970 -336421 194881 -71510 -93155
15793 -93155 73243 134360 -35602 40014 244878 -241560 245711 63507 163398 -162509 126105
15781 -9906 -320476 29732 7804 89193 215530 -36251 -50276 -141970 -122929 24009 159927
15770 159927 194593 347904 -269448 -170559 399245 131066 -239213 505032 101535 23182
15759 72045 24101 -73621 195288 278262 -145500 155928 -74461 91887 -202380 -232514 150960
15747 -24152 -83496 205237 39870 241663 412530 306765 -97712 23494 143559 51334 -118871
15735 -250519 146341 401150 -242021 171896 23104 46704 -103302 -35621 -65211 -116889
15725 -116889 -54092 60199 50044 -57661 -289798 10040 -430121 20748 58035 -41657 30398
15713 -92480 228859 138278 -43746 389100 -108060 -2206 -28060 -102162 35452 104100 -191942
15701 -257466 84244 -102971 60239 67758 86785 180937 -135326 -108699 -71577 -208441 146151
15689 -106473 -195509 -61180 -29594 67687 -161335 30546 209243 -238112 -104713 -206444
15679 -206444 -179387 -20208 31237 63879 -324406 27613 -28298 87053 -251682 -57928 22054
15667 -16728 43984 -7040 234070 -22554 -216040 -224284 82791 -209575 260116 192391 56180
15655 163225 -116590 -150781 10217 -118127 221611 99680 -146305 -248006 -116521 141293
15644 -131448 -89620 -423849 -223029 -43695 -265771 46330 132638 -82724 35369 -119491 199650
15632 18959 -229406 113152 -116317 -117537 41852 -117256 -191874 -2996 -190344 168763 205617
15621 205617 -84691 -131819 180083 -34524 199189 66381 -51490 -44993 34176 156779 104674
15610 104674 -97364 21112 56987 -43987 -358041 -15810 -57480 -161685 -87036 -185709 -157052
15599 -157052 40387 133995 263196 210897 211623 -28783 338330 -260542 634 118610 -136751
15587 -244754 -20154 81014 -203599 -25698 -147543 -140116 -80143 -62926 -111750 -228710 -35592
15575 130574 28847 -136810 -344928 -110250 303711 116462 -243191 -96945 56349 4855
15564 -34943 396236 79301 -92329 92426 -178982 109170 -33043 18263 -175370 108792 75820
15553 75820 -103090 -175102 -573240 -186734 111266 -236528 -58152 2794 -128496 -169502 -85822
15542 -85822 -59283 -137041 -38828 145580 -183973 540719 85965 -143237 291028 366152 169166
15530 93094 -247298 -60226 -17394 44184 -29010 -10920 62042 -151974 50014 19680 -12720
15518 311658 359705 -115217 28807 175033 49058 99053 80090 -179287 37903 180556 138117
15507 138117 240712 158529 226680 -30611 159709 120184 -40947 84996 165639 158989 331774
15496 331774 -267774 376666 186378 54437 -84320 193032 109180 -15320 165960 -177646
15485 -157851 366055 65620 -91593 159629 483169 -174092 -59546 179131 -176987 493842
15474 264579 224658 451621 203800 215235 -56190 169968 207947 -85223 -255612 -151770
15464 -151770 196664 330551 -38190 220167 355050 518682 -239356 183951 -100463 -19492
15453 3905 5574 231421 -216938 205607 -205257 54013 343635 -89592 324609 -11792 594170
15441 355470 739037 991729 347398 -4465 37721 -107368 47407 78487 -187904 -30223 419547
15429 102681 117791 122179 157200 -252258 215144 -67729 17536 17314 -169241 108115 124235
15418 124235 228491 330152 26755 187986 180103 -171707 100424 104630 -181521 52479 132264
15407 132264 8544 30631 99443 167969 -247660 58475 119378 256328 241215 237207 19357
15395 17714 257949 168885 24355 -27307 56677 -254898 -154618 7709 63176 -84555 -133980
15384 -133980 34233 111885 -45096 -10859 -47970 -160043 15167 18705 144782 73755 217520
15373 217520 -37710 294344 477199 251006 80447 307863 394228 291071 270486 -124277
15362 3536 22006 -157749 -147372 226975 326070 -39798 110655 345250 393609 104933 46966
15350 236656 325493 184326 88627 195826 -58767 359615 198953 149875 -29056 -143891
15340 -143891 413229 231660 272364 194994 -121144 -247271 -28404 8492 -21934 105962 -52047
15328 165032 25257 173380 117053 266635 93352 -53859 -124026 189687 91748 184788 411086
15317 411086 347299 188363 230382 246915 37950 161679 40411 -224256 127143 218434 62497
15305 38779 -14961 -174634 -20261 -351153 308683 -123441 -211972 337461 175996 68777
15294 -32144 6849 -65834 -86691 -80769 -303015 6066 216445 61608 -158266 -44956 -68153 -47148
15282 -47148 -311344 -224101 32586 -199281 -155439 183735 208289 39086 31661 -134266 279283
15270 -150556 -294174 27661 206392 77661 -35338 165993 -34514 63642 183479 586496
15260 586496 -268821 378757 119831 -112674 144304 78441 205081 -201668 284167 35066
15249 55308 390065 169640 290698 846027 1332687 1036737 1340567 809885 203209 325892
15239 325892 -143719 152808 -18062 166601 222407 2849 23228 133997 81117 362800 254892
15228 254892 -26891 167069 209736 1765 13282 -195588 98626 97989 -67111 -29071 373200
15216 -162641 228052 -100478 119877 -89125 303788 -256273 131121 4500 -227961 105542
15205 111318 83784 -203750 250141 -95939 -34764 18198 -136530 236072 62039 69080 -194580
15193 10603 202137 95656 -238717 188236 16943 211646 -260015 67729 15910 -129098
15182 266537 142437 -43136 -162529 209618 -238575 -58182 110152 -89820 -116496 165363
15171 11340 37693 -35563 371813 135750 62422 171632 -177167 55417 -309706 -166526
15161 -166526 -63348 -177878 -277725 253333 183536 153707 -355627 107426 -98960 281769
15150 125464 185499 -88702 432445 168544 271399 218932 28270 103270 99724 126796 84324
15139 84324 100865 257763 83397 14429 78640 19598 138882 234943 60973 -161991 -104900
15128 -104900 47703 -89897 -36083 372322 212039 -19888 125973 454676 483430 163044
15117 47597 464784 76465 110644 -163052 228904 310626 5033 297039 124723 67682 60021
15106 60021 75787 45792 -64163 -122360 224879 225157 259685 199315 90954 356960 -12520 387162
15093 194931 -167325 364194 -113111 480680 156225 92862 183807 -240641 144301 57387
15082 12904 157069 -157023 265713 -176391 259208 -63729 -103688 1175 331653 235923 71194
15070 -181727 -47851 -1247 177441 171164 113104 192010 153692 216394 -38445 194786 272600
15059 272600 108722 436131 219058 96088 362269 64582 84332 31550 278974 508331
15049 508331 130794 275623 74913 34286 88243 -79001 201569 2385 263505 129734 280234
15038 280234 322347 129863 543101 28534 -48624 325898 289725 274726 83584 106152 820083
15027 820083 637769 487886 450512 164890 208108 422688 352388 244240 287417 337018
15017 337018 270564 482104 186270 653866 536432 228674 -112224 201283 696007 10782
15006 182622 331619 363075 595550 540313 255659 70047 247738 166641 85514 506552
14996 506552 351192 318104 319988 326514 253384 168563 428145 259820 236609 242679 297192
14985 297192 356690 368882 218975 398944 460211 615708 559615 552862 454641 488344 672399
14974 672399 196867 444029 206991 320893 268023 572077 518665 500691 436952 398366
14964 398366 56425 229964 38974 247184 312111 26910 89959 477472 218574 323323
14954 323323 404385 243456 340626 293051 101911 218435 -3717 249020 255463 244907 608675
14943 608675 481910 585028 270975 245497 560252 726699 275371 554948 420413 409330
14933 409330 429576 512174 610104 492062 977438 1235869 517661 1025167 1228847 1189883
14923 1189883 1181212 1069792 1401291 771549 1071456 1418616 1665528 1623249 1620669 1433045
14913 1433045 1213251 778896 674234 603068 455009 560136 419286 303944 153735 271187
14903 271187 280001 288108 681896 636673 -86906 290343 194615 596466 618865 373388 441067
14892 441067 595692 354461 375304 130404 314852 635764 365495 475499 529403 527671
14882 527671 396490 716385 628972 522437 517765 392114 639059 440343 672608 414358
14872 414358 276767 510948 264897 256806 353497 602587 640105 716079 811142 579062 483406
14861 483406 683249 551514 401743 170041 207085 355318 505742 471979 295410 307464
14851 307464 150126 705620 524120 216801 588538 509480 527135 457031 399919 864355
14841 864355 704496 1102483 1012961 572452 720347 662260 469704 596081 690915 572342
14831 572342 359329 59816 540761 54186 588778 173294 331993 611082 610526 828491
14821 828491 604113 366683 831651 647420 670670 425348 562483 779142 508999 358177
14811 358177 910317 432978 684781 489484 642961 333713 467399 584065 522273 694560
14801 694560 876636 887763 765725 609498 439822 296576 641338 379967 361790 443278
14791 443278 594530 355682 317900 460000 347276 779257 328581 777105 466198 324105
14781 324105 677655 452418 670390 615790 489380 452330 607371 891512 678205 890417
14771 890417 691930 698654 718040 635747 745625 500731 535482 682723 391003 767954
14761 767954 583992 526778 342394 897787 464675 472315 789546 558813 645018 519062
14751 519062 483305 794243 485140 538068 510966 630761 524292 642974 669252 779523
14741 779523 695190 731483 705457 808234 711239 667918 610422 690161 638762 854363 1008039
14730 1008039 488204 1189186 851875 968983 1380176 1082365 1134909 1331187 1315680 1292078
14720 1292078 522315 584178 709683 937284 799855 851943 938467 702995 718011 775368
14710 775368 779177 881205 1009339 495552 780346 943464 993584 1082073 1013820 948926 1371413
14699 1371413 1382790 1257702 983550 1185763 1177301 967169 675422 822168 725500 1134064
14689 1134064 1083384 923129 663876 956643 791195 907267 662848 929905 931102 789915
14679 789915 926297 704622 1245562 630179 904757 1270884 909829 892431 838397 1043535
14669 1043535 964789 971089 951071 1068310 993733 704309 638260 878227 899467 1124922 765771
14658 765771 869467 710473 1119373 999968 1068281 835458 980447 883585 1120235 974594
14648 974594 790043 919705 1100756 1001608 1212444 949704 1060991 1018095 992063 1151450
14638 1151450 1160790 1093645 870455 1212500 1141519 1072337 955908 1046529 1175470 1066892
14628 1066892 1395450 1236040 1266410 1126024 1161698 1497108 1058789 1174290 1254874 1266885
14618 1266885 1274591 1122198 1025487 1444893 1215383 1630059 1222413 1213029 1350032 1358968 1320473
14607 1320473 1129872 1502118 1183098 1141904 1200120 1250536 1599077 1338675 1355652 1354249
14597 1354249 1218993 1720122 1373835 1624304 1566136 1566097 1784697 1227542 1500977 1574130
14587 1574130 1423072 1543089 1587127 1517390 1391923 1781572 1825667 1820014 2018910 1564643
14577 1564643 1856677 2040919 1813341 1963330 1793784 1593314 1675282 2073871 1649423 1845122
14567 1845122 2024580 1822833 2352917 2149019 2271004 2072297 2363388 2045667 2228775
14558 2228775 2569637 2688564 2639116 3022316 2828272 3401464 3647133 3847004 4703561 6208184
14548 6208184 9835451 16734371 33074004 41704259 19256344 11368144 8556491 5029640
14540 5029640 3104169 2168756 2002701 2018567 1840711 1903179 1656400 1845634 1979372 1851505
14530 1851505 1921863 1829582 1758025 2029134 2137995 1775913 1914505 1959298 1957777 2264878
14520 2264878 2080345 2145107 2377159 1943975 2638133 2200410 2005088 2615426 2257280 2356191
14510 2356191 2417264 2421712 2482251 2728060 2773978 2536723 2522870 2469327 2600007 2688322 2867723
14499 2867723 2925573 2892345 2551166 3038983 2889685 2656375 2796697 3124867 3067033 2976400
14489 2976400 3063432 3156196 3396052 2944973 3272973 3285544 3642556 3421591 3434043 3355719
14479 3355719 3615260 3622364 3439186 3449646 3443923 3428103 3385825 3684470 3990889 4157482 3863011
14468 3863011 4129240 3969818 3693487 4156198 3890334 4079155 4044771 4202520 4203021 4281374
14458 4281374 4308738 4450511 4350136 4346463 4484512 4475194 4499379 4701159 5088164 4847869
14448 4847869 4764626 4978739 5046589 4891474 5130375 5044575 5285006 5029481 5567927 5651477
14438 5651477 5779511 5944985 5462178 5554949 5760703 6328748 5861370 6361025 6058624 6254850
14428 6254850 6340435 6526200 6591193 6433434 6846608 6998068 6885006 7070461 7287470 7625634
14418 7625634 7751928 7710601 7835486 7537193 7666169 7897628 8075230 8129536 8473959 8350557
14408 8350557 8861583 8301245 8843391 9082536 9087570 9349682 9356996 9478539 9623561 9921600
14398 9921600 9922354 10253619 10126646 10515178 10656794 10391716 10779266 10979919 11035264 11428597
14388 11428597 11686655 11689376 11898924 12162029 12458805 12823787 13023213 13345600 13505957 13931688
14378 13931688 13847812 14488539 14359197 14594638 14655246 15229881 15647177 15735534 16093913 16650424
14368 16650424 16516166 17246384 17525268 18002738 18542694 18707252 19203099 19234204 20055913
14359 20055913 20517712 20662557 21121596 21878969 22134519 22479023 23103877 23795608 24240256
14350 24240256 24454854 25287848 25933604 26619458 27348725 27810005 28729433 29739679 30050134
14341 30050134 31438439 32016113 32917066 34076828 34956088 35777807 36778553 37753862 39216726
14332 39216726 40178067 41377265 42726275 44291757 45370694 47185027 48662687 50184877
14324 50184877 52081530 53830816 55814016 57634741 59691531 61710746 64120656 66336532
14316 66336532 68641004 71514049 74236523 77242894 80083865 83661651 87384313 91115788
14308 91115788 94888515 99374078 103685002 108033672 113203956 118509493 124295071 129981607
14300 129981607 136403292 142973047 150144493 157827538 165704938 174435424 183224854 193093809
14292 193093809 203318609 213968849 225238632 237346418 249735797 262983687 276312021
14285 276312021 290585924 304999628 319623959 334647200 349588004 364944158 379535254
14278 379535254 393691981 407323940 419215220 430215527 439136775 445144999 446706533
14271 446706533 446006935 444737770 442548439 435751181 425887994 418018098 411787909 404548845
14263 404548845 393943139 382133609 367478337 352367207 336557061 320295680 304942599
14256 304942599 289781970 274962254 260980184 247294848 235345717 223392172 211667500
14249 211667500 200913555 190802648 181069931 171455139 163503226 155959336 148385862 140877967
14241 140877967 134555518 128090299 122242259 117005552 112142565 106583162 102146413 97839797
14233 97839797 93544087 89815575 86856900 83224973 79902694 76609945 73803112 70922362
14225 70922362 68399789 65561453 63184670 61448504 58859786 56877020 55025463 53145119
14217 53145119 51321534 49677182 48195026 46932399 45496280 44075052 42381939 41400697
14209 41400697 40048251 38953705 38047615 37045770 35972196 34442744 34038557 32958249
14201 32958249 31998114 31351278 30532300 29654201 28854435 27998198 27171562 26700621 26106660
14192 26106660 26055753 24560469 24137522 23586859 22960090 22545373 22017675 21520602 21206386
14183 21206386 20634881 20018312 20018170 19179998 18618638 18415344 17933739 17868520 17115682 17098810
14173 17098810 16699000 16119487 16181702 15569316 15398338 15189043 14620607 14551254 14276591 13957001
14163 13957001 13538746 13361379 13268634 13162017 12793680 12689727 12476475 12230096 11783601
14154 11783601 11706470 11429115 11002537 11295497 11309192 10897755 10609684 10611359 10234107 10291727
14144 10291727 10327594 9619701 9449543 9518244 9396351 9220660 9113691 8799817 8739642 8708817
14134 8708817 8625538 8303906 8430052 8016050 8105268 7878625 7803030 7745553 7298249 7560782
14124 7560782 7385712 7528531 7473847 7119605 7263815 6818382 6990320 6963385 6815756 6308559
14114 6308559 6620413 6714617 6198871 6362106 6404263 6329745 6134468 6237023 5843509 5806826
14104 5806826 5767314 5866526 5402423 5502159 5340630 5467058 5541491 5427289 5438426 5150472
14094 5150472 5199225 4947833 5239365 4985760 4960060 5044143 4778083 5039767 4625487 4921323
14084 4921323 4896101 4413496 4452212 4557732 4351152 4412051 4596847 4399099 4153497 3810722
14074 3810722 3980045 4223796 4350095 3818456 4089345 3753882 3835061 4193135 4066513 3868961
14064 3868961 3684778 4022944 3725384 3953317 3799593 3691871 3788626 3365908 3427540 3478987
14054 3478987 3492620 3177397 3492434 3227910 3085866 3218521 3490102 2965879 3148942 3192734
14044 3192734 3138658 3397865 3008966 2949523 2783659 2848470 2550240 2634357 2740695 3130645
14034 3130645 2963742 2666886 2953327 2779012 2871351 3087242 2831531 2641689 3002015 2369469
14024 2369469 2549863 2583843 2466957 2717517 2223544 2550850 2188370 2696714 2430255 2525100
14014 2525100 2390978 2481353 2052458 2235472 2404622 2547293 2150555 2306435 2180948 1990517
14004 1990517 2032556 2103651 2102180 2178693 1738027 1976179 1819682 1984184 1951900 1713817
13994 1713817 1647253 1863826 1658141 1947877 1973993 2911577 4897876 9824769 23522727
13985 23522727 43969500 25445406 15297922 9880211 6752312 5329332 4033510 3707787
13977 3707787 3052983 3073364 2607301 2232953 2602874 2565797 2525143 2433522 1907414 2309130
13967 2309130 2051283 2151161 2493196 2097164 2106374 2194924 1886371 2323766 2050388 1984337
13957 1984337 2153843 1799299 1847259 1907061 1993093 1970547 2027787 1681950 1688768 1997233 1670908
13946 1670908 1690220 1873636 1802240 1474133 1772802 1779761 1573577 1768760 1530201 1586729
13936 1586729 1392778 1429570 1512725 1237108 1261223 1711438 1388655 1486178 1431026 1529765
13926 1529765 1306705 1290787 1379284 1337307 1384871 1506252 1646785 1314382 1231953 1720637
13916 1720637 1684941 1198350 1396048 1423717 1520770 1205647 1095827 1081230 1244956 1153706
13906 1153706 1634885 1410157 1461094 1085501 1159970 1403013 1439597 1482079 1130137 1119339
13896 1119339 1310742 1306555 1282199 1408217 948406 1355674 1314706 1417160 1456079 1297777
13886 1297777 997660 956522 1249978 1316344 1119443 1132854 1113788 1150401 904028 1101302
13876 1101302 1270063 932433 1231668 996351 918005 1094851 1194581 1247783 1084033 1109298
13866 1109298 1090583 971519 1137302 1018776 1087637 1173991 907993 1046572 945231 1101122
13856 1101122 1030970 560452 860536 833896 1094227 943425 916052 801488 962269 936724
13846 936724 953817 1228942 1069418 845475 1038452 762618 847439 936431 1097837 721233
13836 721233 955491 973597 592660 914550 1031332 977082 899426 797888 974210 798181
13826 798181 866661 812510 855458 943115 844171 787780 626896 601904 841241 658068 696488
13815 696488 763869 695205 780975 1151054 653172 862410 711820 789120 656691 845258
13805 845258 566038 790375 1034932 868583 826586 490100 630528 778019 662132 1027058
13795 1027058 728087 780023 801721 683213 703534 817363 926550 852218 642166 190591
13784 607251 1020309 742552 474210 701550 992857 536792 750699 747499 567640 691189
13774 691189 936345 604746 638345 705439 777352 537004 864015 1000847 644381 422380
13764 422380 715194 659314 677079 495462 605058 651572 656602 703081 687394 611086 526896
13753 526896 551501 346946 473006 510432 410409 603771 641994 463576 600061 243174
13742 879616 468346 614626 513023 516024 642389 484267 579812 482545 650193 397336
13732 397336 595314 415314 386837 718003 629922 419432 559511 515307 202649 317990
13722 317990 532341 294862 470657 176538 502794 234762 214906 684769 613455 663755
13712 663755 403526 327441 435329 442885 309709 550425 769214 504213 268652 493161
13702 493161 883343 672339 450968 349057 372005 286739 632278 149873 441093 565373
13692 565373 456697 426952 587896 635630 552582 295491 761084 594764 393407 399915
13682 399915 488555 516533 433010 323775 42518 557252 559074 361071 83801 610957 530487
13671 530487 126555 235710 476613 459270 291173 328993 136023 481800 353184 668162
13661 668162 177031 590911 384846 507587 510050 300007 42829 624148 338141 235035
13651 235035 416456 181296 621946 344299 483469 56975 752739 619084 354033 410478
13641 410478 430912 271639 587491 393663 790950 333864 477024 150293 126684 191935
13631 191935 664629 559387 596709 369614 201737 538622 188131 272032 621368 517929
13621 517929 233579 436327 474530 294418 702241 84212 230567 460125 246142 437905
13611 437905 203338 253614 387282 377642 258584 440758 175154 599320 271839 444291
13601 444291 26407 247737 460886 707424 67715 391335 536213 486948 234977 634353
13591 634353 333209 259580 445210 311103 585035 367619 226001 646318 301790 435982
13581 435982 24786 622506 219711 377716 5533 23874 511452 282509 -142811 432763
13570 381097 377247 432777 208044 446829 260667 393764 314778 -37111 371012 290984 253746
13559 253746 303076 336894 319627 572819 282955 484247 397650 291250 97835 444518
13549 444518 544190 386101 370003 109021 -58371 419077 146810 229729 400019 181056
13538 482906 281811 354687 335495 105881 430280 501381 248011 275958 171522 9164 344776
13527 344776 610730 373604 56086 287959 141441 292537 191983 270367 346895 143028
13516 37373 262027 293382 313528 25946 324950 541379 125010 235356 301576 109769
13505 350979 148685 394496 135402 405195 238609 123910 565445 111695 411767 449508
13495 449508 366056 262489 -18747 157204 268809 395471 296581 245692 85871 77667 383098
13484 383098 150821 36823 333467 361449 -11405 -191717 172698 27111 438278 233675
13474 233675 152547 422113 264479 258269 174875 444189 244629 35429 114400 90983 494242
13463 494242 266430 235301 295312 -30268 107200 297253 287701 -55103 389022 405967 195791
13451 282621 100913 213697 583873 332043 245172 193781 131790 240444 3151 178656
13441 178656 131854 105080 96811 -160430 34702 252577 264968 321478 344637 -15007 140280
13429 57773 176164 151820 323807 137477 170875 -71132 146629 24104 64972 -193501 180873
13417 -79546 126231 72584 317693 433559 173460 419099 472270 -92534 171195 314198
13407 314198 146794 178716 299722 100009 93729 224111 249650 497848 251773 385329
13397 385329 208443 2423 66336 230200 -180966 412444 229496 282906 -84889 149543
13386 -62048 131024 215624 205982 158925 313077 -45183 220997 -1305 76025 -171019 111941
13374 422388 494104 203723 144478 190229 232139 518485 322233 95674 136524 184558 195274
13363 195274 324967 359535 198985 215690 271805 227660 411859 53876 101415 57435 113037
13352 113037 294519 61511 321723 96816 -121957 182844 -271151 326693 315598 90884
13341 171917 398442 521329 343015 121795 134794 595734 281323 40633 135137 200990
13331 200990 205813 204178 273624 354038 90431 92295 238557 -123276 1598 -139333 -153735 -131134
13319 -131134 94955 43166 203203 315637 225219 258262 63191 150995 575910 14168 317354
13308 317354 286703 137332 174542 219093 116408 -29585 31639 374797 -16540 -52413 92634
13296 261611 78007 215893 203430 125172 13775 779254 364360 83994 212254 236068 42630
13284 244123 264275 88249 229425 -169670 259141 13998 504409 225714 -111146 -33910
13273 159062 -73181 48637 -164066 354431 158086 316307 156230 256242 157692 8783
13262 133173 248035 151154 153721 196084 189182 29273 -94368 246987 119499 281654 120940
13250 7360 449202 225838 -164686 -82254 -121132 215326 -251043 128083 20659 121425
13240 121425 91191 158786 96231 145904 18432 504367 41034 90854 -94072 94633 190221
13229 190221 131181 53871 381650 -59265 35023 43247 268017 -249995 219687 407786 294032
13218 294032 196512 179661 10501 -178874 71349 130446 -60372 129322 461667 -49678 -139448
13207 -139448 52655 226322 180308 15185 164933 27989 -363651 -34384 47794 -445226 65326
13195 54954 56872 81318 -167619 49953 -201071 220735 322308 -84591 399781 234263 165648
13184 165648 -109641 283133 5047 115052 134738 -161033 106031 301696 -21668 -89547
13174 -89547 158059 413519 498168 248459 148273 96182 -73814 139045 -85383 143486
13163 154695 -10178 -140250 -27885 68606 -82511 -59054 86791 94410 -200164 -11857 152108
13151 74351 135905 -468058 -45239 123844 455597 67178 162480 227700 496113 527605 233532
13139 194816 -157753 -306848 96898 4325 132855 85980 15583 122697 -177473 63112 34892
13128 34892 250934 110610 -242920 163328 52666 48729 -72084 77528 -83080 -80819 181181
13116 54248 -52495 -300043 13881 -97296 190397 159037 218793 17574 -134304 47617 -348265
13104 29912 -1032 28440 181465 147073 4600 52185 -81981 23758 -97734 126235 -213626
13092 -95963 24119 99729 -10870 -169500 -105081 -107755 -15311 -15645 -16167 -154533 183936 37281
13079 -240083 97310 -36011 406938 -151728 182601 236541 233951 147987 266756 361722 103007
13067 33775 226207 159612 -188953 264225 -53856 -118411 -80700 56036 105133 -28500 39928
13055 131698 186576 76881 -300390 28485 -11962 227535 133199 179042 4732 95229 289364
13044 289364 286325 13720 103718 -125517 -15367 22917 -58087 102621 222862 157990 159422
13033 159422 432131 177602 183762 92582 -44128 -72401 116840 120525 112613 -97719 113901
13021 20544 -70868 190704 365840 -75815 68288 -28463 -88544 40041 -39886 96675 307992
13010 307992 91884 -77370 277051 208146 -63778 120433 282423 -291143 53021 7959 -30615
12998 254895 -220573 145100 -90289 -24580 70603 32195 -17040 -74473 56975 -11185 -70467
12987 -70467 275947 66605 70698 223693 -180187 124735 46765 105649 -69145 -67451 -20919
12975 138185 156678 272318 263988 -391213 -107566 110741 64473 -125034 2495 -77747 339397
12963 83136 -4444 -276987 130017 15250 10398 -237305 182881 -175066 98061 -108467 -187736
12952 -187736 -197505 -236956 220437 -342727 52024 126763 252823 -187422 -190060 649866 222331
12940 308935 103148 130860 566810 -162689 -66402 173768 129277 85336 -162519 40623
12929 82903 240467 14444 56338 -103416 -9291 207909 -139752 -37258 -111966 -61324 -2732
12917 -208411 34440 100172 15213 310161 -156326 17803 -132330 -83448 508737 293562
12907 293562 54628 -29905 118024 65654 -33581 102903 180628 293243 -10621 -598653 149460
12895 -75163 1031 118834 272751 44788 46336 216692 216591 23677 -57688 297388 24398 -24862
12882 -91194 -92065 272420 -69164 -176652 -68309 -92573 -241247 16327 15209 -95542 347869
12870 -120795 -131487 139150 88461 62506 -88221 -64595 676 -149839 -23843 -58955 129976
12858 5897 146788 -81038 327084 89199 -296933 237868 -165081 70777 -149146 -54971 -88881
12847 -88881 154283 86389 148514 -323771 -167663 -90657 -174154 90988 -28901 -374607 -209166
12836 -209166 30879 -508328 149606 218106 158339 -187370 -25262 335123 -58363 -57739 166394
12824 259373 -37808 -228923 140670 117201 221969 -124374 -17967 251302 272109 36599
12813 152453 -187764 -32452 -229470 274894 -118400 111625 167064 68757 20053 45002
12803 45002 -45181 -238049 460347 -20401 -43263 -110775 -365919 31389 -1086 60607 20578
12791 281988 -214720 -439033 -26808 386583 -58937 -278565 -400090 -28188 -83201 -166526
12781 -166526 143290 -143680 -299128 -84107 124844 111296 -32109 -96128 302755 94317
12770 -44594 67516 165216 185860 161339 -67811 287257 -194510 109291 2867 -23895 24170
12758 372199 60985 -143630 -14193 192750 -57587 -366675 -215261 -44937 301415 315823
12748 315823 -134704 72730 -79981 -309668 169052 -273234 8125 57072 265255 346997 1457
12736 13393 -173247 -15483 -249049 -116875 433429 -56493 46498 207468 -35226 62249 -456215
12724 -117532 -152455 134450 -131183 -46790 142547 26590 -24721 -358561 214321 -42900
12713 33414 90780 108897 148518 -89414 396941 202844 -131427 22015 520460 393628 368559
12702 368559 173249 -269687 -82771 151191 -72668 -27336 -151969 -408626 52940 106449
12692 106449 -148353 178477 -192462 151492 190855 -2673 108444 234070 -249246 150392
12681 167260 148248 232426 -246883 129616 83300 234046 -38665 -33139 54713 196046 11881
12669 35592 -20097 -18006 -162487 -5694 77313 -70648 273307 179304 232304 187732 53945 -52819
12656 -226971 12495 250447 -207711 227029 -89099 169093 96269 -99096 5433 86432 63213
12645 63213 -25794 -47306 -223631 -162254 -208641 -45458 -105328 36665 -17816 -168272 -56392
12633 -53798 -114371 235861 -119922 -360431 99151 -136863 223050 218095 72948 116956 326790
12622 326790 12984 82279 120525 94787 -209100 -50531 110887 -67326 30038 38655 3419
12610 -142760 296283 119446 197319 -49272 163089 54126 91821 290020 181189 259893
12600 259893 93453 31016 207606 143422 244666 -306501 -238930 -34918 19204 107652 201479
12589 201479 -88590 -76490 185146 176504 -6288 -84329 -184536 179053 -246540 -176942 -65479
12577 -260966 162709 170078 130368 240019 -21505 5499 -14797 114061 -409815 27129 -204389
12565 217530 -67464 -229224 113440 -38086 -23480 -36551 200118 220771 225204 87325 26659
12553 173814 91916 121993 318171 146243 -114269 191233 35392 -223425 230628 -142562
12542 22173 245137 -131168 -165290 -247977 -174046 -43852 -130015 18890 -171127 174120 10690
12530 -294413 173504 -176344 -96236 -89496 -186163 268012 387646 -41917 -234650 217068
12519 -195359 -71171 385828 -48184 -142388 -287130 233300 -88053 167961 45532 -146694
12508 169498 95650 -247519 -86728 -143934 77008 -16837 159736 -115299 112385 91256 -152396
12496 -13875 -12472 -315428 -82775 -17931 -179928 -52694 214482 -71402 -212329 -88552 17735
12484 -113459 -244444 -151509 -245224 112453 69732 160015 -56222 16299 90223 -60000 10442
12472 -237153 -159009 104537 83392 -77038 -139014 56683 -96449 -141526 238840 104654 -37785
12460 -141783 164540 -102066 -260897 22557 142410 -281154 157282 -1434 -84158 7743 -151050
12448 169482 -372701 -300481 -88489 56366 121390 -33119 141359 325653 145081 -46286 246994
12436 107047 119445 98227 -331399 249376 -292902 16108 -197139 84650 199196 64145
12425 -75281 78769 -32020 -412902 -20297 229127 -53036 136131 225848 -48657 96314 60641
12414 60641 -170125 21892 124067 -46211 150842 363440 265020 -89994 93268 -293191 -49235
12402 173430 -257651 230567 -5677 62942 -42445 -244287 5051 288330 121388 65440 -318838
12390 -67421 -16125 221757 -118980 205992 170706 2722 113161 -218169 147764 -57193 94538
12378 -50214 -107281 -5262 -235960 7753 -198496 108159 -20735 126329 -39166 -24548 -80403
12367 -80403 -116824 158523 -147603 79172 -118797 14629 -136350 -79262 203809 22060 210573
12356 210573 151162 -197948 116776 -154697 32020 -84520 183086 -444015 -91782 285411
12345 -270256 219873 -147984 72773 -108694 99717 177108 -9942 -128714 -375567 -39511 44097
12333 -78978 43808 -116683 -72078 139375 -222095 88146 171546 134906 -104359 -57489 217625
12321 -98894 43775 91398 -315122 333212 281978 -11970 167286 106723 -64151 51368 255358
12310 255358 216638 90408 -92404 -2259 -56083 -101251 -75093 31287 227598 -42007 90966
12298 223788 -272476 25727 112193 77121 72354 85332 -222155 -43591 -214279 184927 -101114
12286 206868 222857 350667 278408 140149 455977 -81103 383505 36760 -961 242662 173523
12275 173523 150862 -63814 -53391 128891 -73388 275735 225648 -49136 106849 -149589 322097
12263 467292 294180 353190 190925 41649 23822 299926 95070 173475 206216 149493 -88172
12251 103122 -313860 113182 390877 172777 135982 -97966 -23789 -52529 134746 38980
12240 -140722 -71017 149773 228720 -51643 422413 299943 245389 284734 87660 -80649 43385
12228 94044 197277 10490 -135512 114721 321133 -42749 216669 341516 321148 349286
12218 349286 343981 96091 225463 19011 343581 332032 130350 -43785 121062 -100470 20613
12206 -21995 42079 -20732 328703 166510 360199 22974 227313 67693 408692 122183
12195 -156260 85610 40819 119183 213427 315999 602297 -150076 -34406 129443 195865 106108
12184 106108 178077 -282763 -101559 286754 -93339 -91981 -92921 86059 41419 75793 165682
12173 165682 253524 -17461 7524 -64625 153084 228313 447847 12017 395061 334768 141083
12161 92675 1272 326842 164555 -125466 248521 209064 196993 -59239 -82939 232932 -175854
12149 -92607 109628 359163 93392 389199 94561 -185479 256479 58498 152521 240456 148509
12138 148509 -50170 89174 81788 -109852 -373382 -265226 28247 176835 -38869 48931 207780
12127 207780 -270551 19526 211545 130464 321461 -121593 -2475 60298 175967 210766 186426
12116 186426 -51684 43990 275124 -66543 -373314 -20180 -81624 -142607 84241 120193 -136399
12104 106516 -174035 348814 57766 -21275 145676 302964 111746 123595 166777 73896
12093 61961 186593 -7198 -66793 15896 746 138986 -240181 302505 69088 26856 -8844 285122
12080 54204 364727 218691 118408 293919 284739 88741 -103840 79144 164127 63767 252837
12069 252837 372717 393172 -81104 139231 11098 50814 -65199 -33526 -353545 109293 25175
12057 193775 118764 -156113 -8394 150666 20666 -230471 150733 64151 -40612 201569 91586
12045 -167439 -26528 -213634 18703 286358 126286 -17192 171543 149095 33381 -185407
12034 -95244 -127112 -227721 -112783 22138 -46473 144869 -24200 -58124 -148603 46874 -336445
12022 137993 -70070 -12200 62782 -101346 73013 101667 -62445 -44057 110539 90944 12149
12010 143251 109469 167088 -20029 -61088 -25306 -239378 69872 21606 404808 -99723 -26638
11998 -69695 150644 -263992 -104429 -66568 83161 -163634 153744 -244899 89663 418840
11988 418840 -41819 -222396 -113385 266338 61482 171645 117848 273771 20134 31469
11978 31469 86646 -138905 -118960 -124607 317969 -152130 95878 7886 -113223 -218705 285106
11966 100389 153051 14304 -63594 -171870 112553 330743 19293 -49302 92668 254193 -164278
11954 -179100 104879 -138273 62237 -17939 69605 85415 -238199 -227228 360924 153451
11943 -104327 -10354 456781 -55027 -92750 131104 84937 -140378 -166813 39811 -359718 -184826
11932 -184826 -180434 218446 -201514 104010 138896 140152 483 -117512 -176881 -124598 -261799
11921 -261799 11878 6789 38516 -68213 262745 -175283 -175600 23666 -100206 397666 101466
11909 -51717 -125029 42972 -403621 -74251 124656 -111596 -149209 246583 97600 -131459 185729
11897 19734 -21727 -54008 150425 24466 186958 94568 65259 -183278 -441960 -127621 16536
11885 33822 131457 234879 -47824 86301 -161388 -59583 -366432 -31374 -7429 -5665 76289
11873 -91278 -10395 152047 37643 50807 -21670 61426 -132640 1351 90841 191863 -52305
11861 187407 11135 25669 -48137 -126535 113749 42663 -158029 98502 -189708 55699 -232883
11849 -49808 -93763 -312049 109980 4552 -371228 -104022 -192060 -202614 -177004 -59786 -115927
11838 -115927 -90528 108949 -25888 -58068 241181 -94743 47578 -12338 -156044 86676 -28297
11826 13896 -81226 -59767 -69070 -78279 199206 -64511 -57722 -133054 -116661 -38886 -226239 -266689
11814 -266689 -248298 151952 -66757 -55205 -137341 -179730 -144947 -6265 -107566 -240724 223222
11802 94607 -148067 -66280 160685 -71562 -11216 -180092 -140329 -178581 -140605 -399802 97916
11790 -270026 89016 -69994 320947 -241998 -254020 -218005 244475 -291201 107679 -16028
11779 217231 254383 -272395 -42157 -142140 -17716 -219728 30354 -81290 128822 -189367 -181256
11768 -181256 23122 765 113223 42676 121984 51889 -303117 76959 39907 64539 -268851
11756 -96691 -55510 -184848 -66717 -134199 -209990 -123175 39119 138766 -196360 -773 141120
11744 182659 -102610 58851 -165894 -78331 7590 -130665 -13590 -26466 -233969 -20081 -349084
11733 -349084 174193 32810 -108884 110631 -102436 -115602 126674 231054 -196233 7773
11722 188199 -131256 -192765 -210525 -125814 77659 131863 184445 472979 -285816 256334 12156
11710 -190123 -233420 189691 -234719 -34950 78930 5770 -46909 -123883 -17352 198436 -99163
11698 112521 -199184 -180497 246457 121816 -57600 59706 -69903 5088 99190 305056 -208457
11686 -36108 -63516 -44386 50692 107597 113321 -2645 6890 -108907 -6259 -189876 74008 126957
11674 126957 -72767 47650 143323 171990 -41170 -23275 6001 202746 -227375 280554 83698
11662 63687 -246567 -107764 158138 -63172 -136597 62987 46150 166062 138352 -136127 362673
11650 -26726 -19529 -166161 -218350 50178 274146 -78984 -20375 13480 -99824 30192 255377
11639 255377 6845 107193 59180 -171069 -57192 -134398 -561742 -136392 -155667 13050 -18048
11627 -78968 280382 330069 48943 131308 88159 30669 -8303 62825 39448 284601 53056
11615 120332 110976 60185 25718 -167227 271673 9195 155886 -17777 -201675 366825 -59242
11603 -31023 269117 -83730 115522 -37832 55575 61068 15021 283976 -68807 266051 -55216
11591 -89172 67313 -81781 49844 -161166 42712 -254426 128974 -94228 269776 -238257 98928
11579 -44164 -84413 -85814 221866 -93367 151603 -7381 54943 27950 102787 129572 138170 365496
11567 365496 114979 124110 -40414 254653 -220013 31490 -56159 287407 318615 -318180 365076
11555 409513 99202 37242 50937 -276546 302443 -274850 24941 30682 -21969 -79620 60849
11543 58229 -3897 -229059 179974 -66788 -71799 39294 40146 309416 290041 -68593 194973 -87805
11530 115296 -24998 198142 99127 30667 224262 288918 -60051 417232 -248670 31967 44524
11519 44524 -15564 -129995 -133738 -139527 142024 18978 178011 353537 -54897 109200 -60624
11507 164152 143217 44294 -176160 191099 -193518 49849 417929 105213 13028 85415
11497 85415 7357 -341921 -66748 126117 163355 67817 -1387 305949 224269 215509 137606 218206
11485 218206 171553 138683 -47995 -91831 94640 -108516 461008 -67188 295459 173381 290932
11474 290932 296881 244502 105091 516766 186229 150594 -104192 298989 -61977 276218
11463 10180 -168992 64523 87634 288350 70810 5001 170141 121507 119053 347024 28287
11451 208893 142162 -123536 276066 74507 -337541 -49614 78726 -7372 34144 101133 191041
11440 191041 59164 -221800 105833 36778 -80927 193241 10912 -17950 48079 -42757 -144837
11429 -144837 159768 113627 168767 140978 149746 54547 -214070 -53819 190763 -12911 -48039
11418 -48039 118215 -129137 117464 79675 -326602 -171375 116309 -142495 -78548 -31598
11407 -253722 23154 9406 -43408 -5801 -5980 52457 -480344 -42252 35571 -137382 -67300 -65794
11395 -65794 -6231 136175 -94552 -50478 105969 -469585 -315866 -177835 93425 314279 -214356
11383 -110679 -79505 184928 -163393 -402640 426459 59946 113805 205978 130844 -52977 -33494
11372 -33494 144469 -139486 81088 -224102 -281895 78142 24680 362830 178543 -171223
11361 -258757 136140 137032 -252451 -161680 -29736 -56427 -62502 24037 -104001 -169386 122724
11349 -293084 -26929 -113395 20659 57510 -27796 -185697 127007 -443324 -23308 -490906 222511
11337 129568 -132843 -95688 50699 -233266 187097 -91520 -7248 -62579 -183399 -284663 -36627
11325 -48133 62545 -280443 -194204 131902 20811 -21074 149191 -208959 369399 -194166
11314 -263311 169875 -60211 74311 -357831 -144406 53848 223907 -33531 220810 -26397
11303 -212777 136700 28278 218584 -180929 -283748 -185239 -273343 64515 -156469 292177
11292 -69119 -239793 54950 -250611 95708 -68357 161082 -169862 -226345 35222 -120486 -195991
11281 -195991 -236619 -81459 -30277 -200379 312126 72397 -78531 -34489 -20024 -27136 -14344
11270 -14344 -178563 -97005 -285690 427035 94062 -165786 -66647 181852 110037 -194277
11259 25325 241658 -117939 -404527 22985 20144 17401 -243697 10445 84671 87651 131510
11248 131510 151591 212029 -72089 98814 -221384 -289497 2451 -266880 -199093 -69019 -99633
11237 -99633 -43464 -133350 -166085 169988 -21600 -155313 -85639 100968 -269473 229396 15360
11225 206367 -79522 -70533 162844 -188794 -280291 -921 -188035 -267890 91641 -95745 -35356
11213 80624 -270219 -114338 -273798 -312613 -247724 -137639 48604 99392 323479 -124767
11202 313725 -177033 75592 339395 186216 -2927 -173267 -147839 169256 212006 104940
11191 -34956 -380493 -186823 195519 -167980 89716 -99956 -126622 -96493 -79800 -203763 -62255
11179 185534 -64437 -59735 -8782 -168539 -141119 -100237 -197919 316410 -219122 -5079 -403214
11168 -403214 -352939 -188739 330409 159260 166520 270024 181520 -302805 28584 -96739 -27821
11156 -23842 108663 -139472 181233 57452 -406349 59771 -179568 -98511 143906 -249916
11145 71460 4602 -220575 67166 25888 146312 107798 21204 100215 -220000 36204 -344274
11133 65415 96542 -26651 -147741 -213172 -111586 -345096 -349 120872 -141213 -58440 -155686
11122 -155686 -13319 -40068 66163 -210082 337019 -49193 -232485 -128157 95931 -63277 403226
11110 186578 -148452 -87864 503502 -201806 51297 -91742 -264891 -181805 319530 64185
11099 10822 -56827 323449 115515 465421 228338 196030 334148 176306 -186538 61888
11088 85324 -43589 123375 112967 428288 153706 -89978 -26750 19573 103035 64201 428468
11077 428468 176709 175653 -168317 261506 101868 17629 99992 228176 333590 -188898
11066 388909 4318 343766 471005 445343 333017 226089 312908 242841 403196 -57353 645808
11054 335664 510106 247340 545440 89558 299568 588499 451840 534986 581253 483379
11044 483379 401400 586143 359243 477989 616200 944423 753013 620095 945453 402603
11033 810172 401875 587019 544344 608072 587673 534207 313361 337035 606582 686718 498689
11022 498689 483500 729508 650061 -59204 520840 521023 553062 690422 319871 497779 554374
11011 554374 330095 532644 393533 595816 75615 458126 626213 612805 200651 454809
11001 454809 773122 440143 542997 593706 242252 683124 298724 577264 419475 415036
10991 415036 667868 519158 486535 377923 500442 537132 512408 688659 874313 1155700
10981 1155700 729041 899572 909330 976818 1032894 804002 916242 1029974 1130070 1247662
10971 1247662 1380356 1867200 1940082 1718001 2129012 2286192 2096747 2142133 2104301 2157961
10961 2157961 1647065 1336942 1350599 1274623 1357385 1241967 1101871 1510014 1405409 1571660
10951 1571660 1327996 1115494 1301013 1261256 984996 1006037 346034 400135 417024 292072
10941 292072 151396 313162 302731 239531 216321 30799 94598 393014 -11612 128577 14057
10929 -181947 188652 96465 319651 205081 -59183 63809 178619 129523 -208947 -39502
10918 88690 -101167 74487 38688 32690 -204738 -377201 183965 31450 -171767 -21636 258334
10906 -128587 27053 88214 -389244 -307176 -264237 183246 -318206 -225988 97045 -107400 -26142
10894 -106478 -819 -274661 60482 -118646 -160837 -154972 252761 -123407 -3672 -151855 -17404
10882 168604 144895 40233 -94165 28169 -23091 43533 -964 -1214 -112140 60747 252500 -259529
10869 120673 -284469 -355914 29642 -15862 -70983 -116863 -162115 -331446 -180086 375313 -117096
10857 334189 98493 135214 -24913 -36608 24846 -188568 -133848 -43860 9621 347468 -69953
10845 -181550 -111712 190736 181251 208162 -228811 79423 179598 261418 144811 -318967 11250
10833 126087 -278097 -39312 -76404 133472 -155927 -3191 326893 -318833 110528 99270
10823 99270 102219 119388 -27880 -11314 -42330 -147120 50475 -71559 47005 -143265 23288
10811 -284515 117187 -300282 -81804 309928 -268528 -37964 -19538 -210518 -286204 340285
10800 228268 -49345 -153847 179363 132774 23580 -218087 -156586 -11040 125263 -90851 24755
10788 -16497 168495 -168325 -86870 -109559 -78308 -13908 -45974 -1337 77043 -9631 -16255 83222
10775 173726 -16351 -104020 86485 -45557 -335451 337958 -205419 106344 -4165 -86773 -60889
10764 -60889 2437 -18354 -262484 369963 367728 -5282 70487 65391 40979 204989 -191419 -423666
10752 -423666 -278320 189571 202820 99429 -165775 1415 -242481 -242348 -251533 10601 133784
10741 133784 -106585 -153693 -89492 -124507 305267 -65638 -114873 -118682 -180514 3654 163766
10730 163766 273969 58841 79083 -119205 65350 -134837 -74188 -77821 192650 83427 -31732
10718 -452681 -32441 -5696 171304 -1806 -107797 13515 -212949 -187994 107965 -350094 -270420
10707 -270420 155861 -89322 307638 72563 317946 -257865 -93112 38918 -15802 174697
10696 -172599 -63086 -185061 -262882 -259145 39663 -241558 -180518 169851 -120183 86178 -141969
10684 -345502 -212849 53174 65878 -397034 125427 71070 178920 -108825 68729 -52844
10673 -175389 -45291 125842 -247054 -52251 -46452 53402 55416 443608 94898 -82028 -36945
10661 27368 -88593 113761 -104650 35883 -269960 -88489 -294 -306094 25816 71178 -51145
10649 -206394 -40827 -34776 -368938 170860 200881 122921 24317 -108954 -11525 -71381 -389969
10638 -389969 320490 -148479 171631 -24334 16083 -265047 105076 -49702 -40519 -77782 -309545
10627 -309545 135985 -97737 147066 -92095 -384815 231506 49363 -387561 -35158 -17992
10617 -17992 -21376 10621 -14536 93167 -84207 -31070 213456 -52254 -5745 -265230 14930 99905
10605 99905 -87626 -19595 -169916 -101702 -35624 94318 -41967 -171561 144012 -262296 -232837
10594 -232837 335683 -281659 143786 23449 37124 -48299 -108429 -109524 -176671 -168285 168090
10582 -13134 258495 38039 -149666 -114857 246525 -203849 17664 -106372 54743 198805
10572 198805 -13851 59541 -87586 368904 -346480 -80118 -105877 -242311 139692 138799 76828
10561 76828 53316 56519 -204068 -234239 82545 166543 -18913 -60771 -30226 -203753 67548
10549 -176312 59723 95066 -420623 -142697 155764 -172086 -137189 174097 -292161 -44289
10538 -83471 100199 -156582 -30449 -77717 -116237 9565 147192 -356124 -14921 293950 -125372
10526 -169665 -27925 -38691 -279180 -94589 74141 -110748 -377918 -52700 -5464 91193 170332
10515 170332 -546 -120715 -42004 -192389 37444 82386 -203158 106785 226659 -110340 -300945
10504 -300945 79604 -15118 -234056 131627 984 -42086 -119020 14374 -180259 -24040 -50958
10493 -50958 -133857 9209 113098 -221785 -82512 -35762 -51998 -172751 146856 51585 -67310
10481 38361 289806 -29556 -219379 103532 261247 447305 244674 225005 231446 77258 23468
10469 154241 5547 -216214 157820 -53437 -36479 -131859 -64085 59758 221278 67018 -60870
10457 26628 -89832 -118727 -29285 170636 73189 -173861 105048 -9978 104604 134541 -118102
10445 -17377 135343 75989 -228272 -210923 -103270 -14296 35168 -157958 55416 181223 -113062
10433 -111847 -203815 -33046 -531634 109079 98459 221743 -254967 -33563 -65711 -210116
10423 -210116 -261445 -255532 16122 107785 -339426 279331 160182 -33056 -82915 -37390 -162681
10412 -162681 120195 -42148 -24673 -310408 -134212 -65349 -39605 -250736 -354774 46750
10401 -347250 -290107 -247741 -242571 -17877 -96240 362191 46347 92485 31662 220285 -13660
10389 343368 34241 369486 -205338 -116267 -103834 -139901 71535 -45921 100146 337299 -94097
10377 432304 150618 159672 -44894 205926 -18721 221122 -169659 -25746 138361 -129388
10366 281890 406074 -15400 424126 429337 289301 436876 -102737 309981 79203 139427
10356 139427 410354 372784 394927 396 136123 387538 176878 397908 482061 504801 341038
10345 341038 254981 721942 408168 -263627 416510 198699 93831 -37643 198470 438250
10335 438250 378874 -151956 127164 -21762 -13410 127510 347536 176908 -98839 202705
10324 422791 45502 -116549 33109 -263971 -25676 -46328 38171 67459 -79725 164528 184169
10313 184169 73439 55825 -114969 96095 -50351 -208307 115628 -121620 -83877 -240903
10303 -240903 -82788 -167942 277934 123835 -258647 -26032 -83341 53408 282865 178429
10293 178429 96173 139985 -16100 56957 -166698 116563 -199600 -28967 140462 -12004 -104866
10282 -104866 -26897 275109 -116514 163732 -273086 274017 -30730 -117079 47698 -97033
10271 -46999 199702 -192589 -187123 -119886 116311 116879 -87848 151653 69451 -90939 -6937 -386256
10259 -386256 12876 224215 -58074 -104974 239267 32133 386661 226520 149707 172347 8203
10247 -43772 -78833 75948 -90397 50571 109665 -258348 259610 -130857 -198411 119606 -232481
10235 80161 304820 87183 -208809 -24846 -173855 -341481 -229099 67307 188398 -18931
10224 -263992 -136777 -330162 160605 6325 107068 -69308 30451 162485 -325025 101665
10213 -43166 -81125 146256 -101504 -107514 -126613 -34212 -216392 78402 -98819 -280141 -65050
10201 -38838 48720 159518 -31394 17889 -43827 -307739 -354596 65509 157568 -150904 -65603
10189 148680 125771 -237219 -148170 -142697 -200905 1164 -176946 -76871 -147827 -14140 -154617
10178 -154617 77076 63338 -5396 -188575 -257431 -179294 82257 -152372 -268408 -329102 56529
10166 -61624 42324 -131870 56278 90493 107961 -340533 -87075 -393541 -74158 157380 -49757
10154 -214229 -346802 -294118 -25390 73003 -132128 -194625 -150522 -331499 -159169 -194706 181570
10142 -143017 -237737 -14210 -158306 -253111 11204 -348806 -106936 241567 -250202 153986
10131 114762 -55503 -315379 -2487 -91176 -325195 1996 261053 -151430 307216 -48381 15728
10119 -233377 -146034 -396278 -249481 -72231 -219702 -19556 -329791 234892 -295625 490717
10108 -80137 224571 -165481 -43020 -61388 -203263 51719 47480 83497 -799 -136595 17904
10096 -325881 -109079 140125 206899 -216683 474140 287123 141197 -243407 8037 151966
10086 151966 -267956 82140 -302007 -166704 25673 77309 -177458 -108437 58195 14503 -103918
10074 6098 -309893 -54235 33156 -9385 -94220 -499220 70310 156467 41019 73571 -7768 -103499
10062 -103499 -9847 -118971 88615 164934 -201056 -50654 310682 -303635 -308693 -188317 261269
10050 24352 2111 149399 -209290 -262661 -130335 151668 -175913 -284727 -284702 -307398 -272251
10039 -272251 100664 -546540 -392074 64532 404247 24677 -86991 -275243 -233577 80015
10028 -182732 -253599 -348912 102450 -174159 -264867 1471 -72577 -350848 9036 -23277 -145345
10017 -145345 88090 117464 -178465 -33241 -29204 -60232 42231 -7137 38228 53368 131084 21849
10004 416514 63912 131884 -22027 -86258 406480 -170215 -118293 -498802 147840 285736
9994 285736 157144 190905 -520690 -288891 213907 -573939 227935 -220573 -154483 -175332
9984 -175332 -171625 96693 -162313 -28099 -59317 108777 -307054 -155205 -340162 39814 -272549
9972 -239091 2674 -289512 288147 146338 -233257 -112609 165502 32289 -329508 90042
9961 -194981 -10084 -42380 -238885 -34897 -256649 -4264 -231579 -312120 -49622 -188200 115301
9949 -236171 -99519 -120931 40010 -161841 38232 -210885 -372417 -291675 53147 -85374 -141667
9938 -141667 -34454 -39666 -32081 271997 -32545 -229281 64490 -15098 -355842 -415627 -162034
9926 -43120 169024 6959 8432 239239 179148 -278702 36807 -14262 -96857 -51102 -42214 9871
9913 -139328 122922 -86599 79880 -273165 -127125 376659 164015 -291114 74600 -104268
9902 -395463 -343482 25313 86117 111638 10691 -202829 -207861 18553 -132883 -14310 38970
9890 -191287 -383741 -85344 -55686 192272 69991 254218 130277 205578 2453 65608 -134757
9878 111795 -3941 -296740 4229 285628 -93579 -138295 -453194 247109 65061 -286272 -261498
9867 -261498 -138588 -142988 -568551 42189 -54663 149993 -409708 -239585 -174949 107169 -53016
9855 80154 -182065 74022 -216020 4858 -400518 -18577 -295101 -184366 -53219 67126 254456
9844 254456 -60848 -223010 67284 -344153 -246071 -291148 11089 -46440 -186076 -29260 -124024
9833 -124024 -132838 -245842 22468 112940 -245677 -38760 -215942 162400 -371324 20414 -8532
9821 194680 -169859 -215034 134636 178773 -14353 191497 403064 -228334 -28567 84225 -43759
9809 -52606 37820 -10162 -44641 -506835 6269 -90888 17071 -110013 -200877 -336915 -252313
9798 -252313 -232978 55130 109670 -35147 -132168 -351922 134508 -94222 -81431 -276046 -184815
9787 -184815 126938 -322742 -156533 -185343 -342787 -212140 -183994 -146494 248890 142867
9777 142867 127045 38686 -135726 -270767 -31339 351362 53346 -257660 -86865 358801 -149042
9765 -118171 -69087 111547 -94685 -283363 141678 -230778 -422799 -27468 -98942 -134733 -85134
9754 -85134 25793 65492 102504 71832 206836 -130883 -87991 -239413 105408 108370 -110170
9742 -174218 -203630 -26396 106716 -193201 -220843 -44401 274493 2613 -110812 -93486 76007
9730 -343986 304556 -292957 -125670 -119036 194072 -370762 -104365 64828 -223248 296292
9719 123663 -204737 -107650 -87816 -34906 11623 17831 -57398 -235177 -74170 -181096 -409009
9708 -409009 98311 -117399 -42799 -85071 -80121 535039 -30635 11131 47630 -1704 5623 -23594
9695 142659 -35028 -215153 244184 65479 -290826 -253043 232603 -436409 -51233 -175817
9685 -175817 114608 93295 45754 38373 -53249 6212 -11402 -75105 28322 740 462732 -207236
9672 -243225 -98632 -72919 -39606 -3044 -139510 -389312 131424 82183 185996 76811 187595
9661 187595 413 -203341 -187510 191887 -127508 42437 -38422 229050 -134714 -311984 311862
9649 -8098 -87246 -538517 -82089 -297593 83061 -330975 -112426 183260 -358395 -282786 -319651
9638 -319651 128842 -4410 182846 75535 123649 225963 -133427 -252633 -96732 8465 -17855
9626 100015 133072 24624 -245016 241407 -32190 93248 -191809 -192351 -179810 77200 -79463
9614 -38665 -35520 -58857 -80857 -50545 -127367 146315 -529630 -328374 77568 -155650 -101019
9603 -101019 -43344 -394184 32510 -103757 68849 -29015 53183 -170484 -55662 32446 109187
9592 109187 -87575 68623 -375960 -262718 -7387 -71652 -84904 -166240 -130954 -106836 637 344635
9580 344635 -253405 39900 13423 -32153 174960 -246834 3309 -17543 -253776 -194833 -46692
9568 32495 213980 -102175 336899 -94237 198763 -16751 -108621 41907 46104 52842 77161
9557 77161 -209679 -69296 -222338 -369912 -66110 95550 181975 46623 16321 -150593 -85072
9546 -85072 -307899 -55370 -80351 178681 -331690 -130715 45341 -13043 -293868 -89365 -31485
9534 44891 -557317 74017 -94807 -53004 -181459 54053 166953 -261352 -121047 -351642 -90448
9522 -20156 -1399 25914 20443 -64835 -271536 174387 48097 1544 123743 157376 -392344 -372734
9510 -372734 -113651 -91233 -136889 -326658 128255 -284119 86104 192897 -101332 -293758
9500 -293758 -65754 -49624 200807 -239980 -5149 -171984 57226 -205465 -139485 -86961 -229672
9489 -229672 230833 -111083 -165310 -200335 283414 -29809 38283 -103155 -196690 -261880 -91639
9477 -223276 -171356 225685 134146 -22043 234262 152576 -81015 71113 -240855 -37250 -103385
9466 -103385 184702 214153 86927 -192695 48386 58379 -172198 -144207 -105132 -109028 120914
9454 -106691 -23153 -16926 -322922 102937 -21104 -131516 -171136 53615 -13842 -59387 -41519
9443 -41519 -166360 311280 -71641 -180960 57317 -9114 -40095 121587 -33850 -354923 -321264
9432 -321264 55181 15049 -200637 -370562 -111794 -131332 121520 -31539 -91388 -254738 -140685
9421 -140685 249902 -5952 -358501 -97985 79894 -123991 68983 69756 -399 32308 -107530 152705
9408 -6776 -315813 -2006 -372438 -26347 1339 -116777 -100438 22235 20228 -209215 -357011 -147870
9395 -7218 -98869 159951 -194424 104490 -170283 -147196 -413764 -215536 11762 -149180 21091
9383 -123009 -120342 2183 -115726 -119825 -304231 -174191 160920 -286741 -390557 918 -36062
9371 -372646 36033 109910 -233502 -59788 159397 12258 97771 149526 -23974 2688 48912
9360 48912 -210138 84514 -324232 150658 313816 -66328 -142202 261511 88357 -82544 203162
9348 224386 -5130 -40309 75328 95077 -80176 -143315 21348 98665 -184612 -34807 -136249
9337 -136249 -232939 -139618 193499 -21012 -74637 215076 155616 -14194 -27702 -73303 50255
9325 -102599 -51325 -1360 -303990 167858 183611 -215430 -166552 -36579 12468 186381 176252
9314 176252 -23119 -173252 -269698 235408 -146981 -224437 -70948 13226 -62114 309018 -23606
9302 -69153 156442 -200819 -218181 -231244 -189825 100664 -162512 -37763 -281011 186846 -349568
9290 -223623 -228441 -76977 105559 -77682 59784 99316 -68121 -36770 -73465 28872 67345 328404
9278 328404 -102298 -104373 -276700 90430 -329169 -35151 -313224 144668 -68781 -332017 -194943
9267 -194943 -92898 -501000 -407503 -458924 18751 164502 298271 -109710 -130030 -158589 -34583
9255 149121 -191138 -70660 11151 -80287 -193796 120460 -250071 -221419 -249234 -56686 44316
9243 175870 124397 -26879 -271277 -103126 -116314 25256 -169903 -112964 60980 9568 -139350
9231 -92902 -367415 -6893 -21728 -517476 -316664 87992 219984 -254491 -147230 -350224 -279837
9220 -279837 -192687 63229 -221293 -53010 -60751 111647 -152359 -116037 286698 -11874 -182100
9209 -182100 -125483 -43026 72755 41323 -64916 185515 5274 -20511 94558 -295254 119324
9197 -19949 166680 -95350 -259308 -294497 -140768 -91543 82303 58439 -327891 -221694 -201984
9186 -201984 8081 -322820 145804 -148010 2586 -371910 191921 276937 48525 -192195 -6352
9174 -339973 -118734 76529 -223198 -196752 -22172 -170992 -387099 274753 49764 181117
9164 181117 83539 -153170 -70344 -231191 458879 -103014 -3773 147277 105579 25502 -35561
9152 -46801 44709 57089 57280 -90248 139399 -46298 -94212 -64662 -329861 -172787 -45536 -187249
9140 -187249 146950 -122717 -267645 177304 -196481 7863 -37066 -94040 63707 211383 -106573
9128 19699 -273999 7442 35534 21360 74393 -205811 -81619 -83059 -160472 -78398 53729 -57233
9115 124684 -14406 89097 160794 -82132 -81104 -140770 -110213 -336029 201143 -204147 -91545
9103 -3085 -272975 -251210 286147 60395 235097 -137525 -521410 263213 -158910 375078
9092 -360185 152068 -148574 -178325 -213085 -161807 61788 -96154 -13058 -138768 -122472 -45009
9080 -106219 -180615 66357 -57991 144894 246334 85669 11275 74357 249238 103416 -443042
9068 -148456 221505 -46708 15436 -79357 66584 1503 -279002 -93447 43635 243692 -171173
9056 -13462 173746 -121048 -71834 31613 -53427 -186442 181688 -168612 -194457 -208648 -33355
9044 -183976 -332444 13361 28309 -323984 -308016 126109 250290 -240089 -21676 -256395
9034 -256395 258410 -100190 -149271 -357721 37724 314206 -60659 -318630 -172414 -4199 152576
9022 -332099 -249117 12668 -41864 -114847 77153 -40431 -302232 -277296 -236109 161835 -143892
9010 143970 -183894 -375990 6805 -3930 51787 -239132 -88983 -125145 -68322 -127743 12354
8998 -239366 -132897 -56157 1569 5164 261246 -37708 -181733 -682172 -176524 163046 148286
8987 148286 208583 26313 -260439 -84071 -117684 -123833 -202663 216933 180108 -102961 -161937
8976 -161937 -364277 69118 20708 163365 -98080 287067 70523 234971 45539 145808 -274396
8964 -244358 -213438 38365 65144 -65791 -159118 -268620 -157171 -18713 -343981 97026 295366
8953 295366 -11302 109008 -230095 17092 190216 -16164 144572 -96862 -164658 -226798 -74574
8941 87354 -158937 230416 -220237 -19508 210718 -52526 -64570 102088 -121311 -42631 -77755
8930 -77755 250113 -25193 97058 61971 -102389 -200752 -33623 52918 225388 40867 -196917
8918 1292739 1070163 412001 592 -188286 -45881 -44459 23759 -203586 89377 63987 17394
8906 21697 228864 21186 255583 197579 40357 238465 151332 -316239 28452 -386529 -143171
8894 26835 8272 -192919 62249 -120911 -225734 -68774 -147316 -57011 91177 148573 -113210
8882 -134132 -44065 124752 -14965 -195742 5089 -70839 69067 -67332 -34273 90952 -213877
8870 -276049 36670 -37351 -273375 -10174 93269 -71307 -228349 -204349 -290609 -47432 24954
8858 -25 167395 397760 -218298 28660 -171949 -206531 -29519 103591 -156520 -64563 112953
8846 -7341 -16784 17142 -236043 99127 -109985 -136393 -157837 -96578 -5064 -85253 -167384 75738
8833 -149127 -37529 -19660 -258781 8459 26631 40489 18992 -24736 -192535 -163818 -215768
8822 -215768 245635 -219929 198276 -256553 76298 -103178 -393862 -5670 4404 -301268 -19832
8810 -39439 -311750 -179212 157001 -52111 -63901 -43297 -197397 -245692 -185777 -62848 -27167
8798 -142137 -65511 153956 -44825 -115891 -75574 -414531 198203 -137842 139898 -173011
8787 -303269 254008 -55462 -123050 21345 174349 -174602 11705 -187205 -259561 -74390 -32114
8775 147728 79332 -94249 -100399 116224 -194471 -119862 248683 173925 189644 -186997 -76975
8763 80466 -331406 67962 -185731 -27661 46877 -97945 -248879 -227953 -44053 -106794 -235305
8752 -235305 -189713 165698 75114 -26868 108213 -267356 159183 11700 -60083 64553 248959
8741 248959 114284 -335436 -235540 -156612 -154994 -128686 -284164 7171 -178479 82089 -53974
8729 -154395 -96385 -126106 100814 -65427 -22023 33425 -101085 39602 -122914 -183499 -137701
8718 -137701 70926 117418 40695 -118007 -97860 -287721 -221213 -28368 3144 -78725 -223022
8707 -223022 -308704 -117008 -61684 -241868 258084 -206358 -359276 -298036 -295130 -176222 -119773
8696 -119773 11161 -159962 -23863 -463810 -111813 -6183 177179 194050 -50105 122549 -67205
8684 -92568 92354 -78091 339177 103799 145561 -143717 -20593 -36589 119856 66635 38724
8673 38724 34645 -282979 -473 97808 -35831 -99542 -35511 13635 19780 -40151 -35880 99951 42502
8659 140703 52726 -4402 -64618 -194266 120696 -32972 50487 -97536 -96493 80328 -48697 -2555
8646 -132297 107654 7812 -300411 -313020 -284010 -73872 246858 -8605 -280761 -126167 418464
8634 -204909 159067 -120242 -256656 166409 -80889 115404 -190610 -7084 -388778 149769
8623 103445 -61404 -39969 129401 87675 -16791 -213902 145038 -254168 -148560 -95033 28102
8611 -168527 265415 154223 -125861 -335179 -196620 85660 -256392 143388 226069 61261
8600 -182707 29350 144896 -133848 164264 -23304 -129014 -118518 14174 129568 -36672 65464
8588 89770 -140576 40437 -532688 -387338 -139411 133284 112870 -8568 -130052 63713 -76596
8576 169271 -136181 -27530 -73146 232054 -172140 -249756 -457748 -83047 39887 128723 -57590
8564 58811 31632 -68289 -28586 81613 40742 -60388 224783 -27211 69178 -170604 -292853
8553 -292853 -89273 -11650 -143152 -325389 5558 179232 16691 50762 -278773 79156 -234363
8541 -40414 80544 -201846 -29117 129396 -3332 46386 -101485 -250372 -81566 -12278 -252671
8530 -252671 -91943 51458 -182847 356323 140038 107522 -74654 125504 42350 -154898 170079
8518 8612 291698 371567 29444 87603 -66829 -83399 -6752 -75759 -105852 341956 -117382 -284803
8506 -284803 -50368 -219320 -163845 41265 -133347 -125024 22118 65462 163561 -339424 -176018
8495 -176018 -83842 -136687 223 52713 -13530 4340 -61234 -26907 -660360 4985 -163030 -259940
8483 -259940 9813 -253554 435154 -113932 88217 193537 -58129 44566 -100498 394250 8262
8471 69131 95270 106859 -102923 -184432 -242008 10071 75919 -285829 64863 -111926 -153557
8460 -153557 -178236 209439 -188537 -283386 76022 -296226 -197022 -258160 -171375 -47351 -98900
8449 -98900 -37314 -234208 -47671 -266747 -102005 128528 -48243 18383 189278 -97847 -320479
8438 -320479 41095 -176542 -190874 -140908 -163411 294810 59431 -352821 4363 67979 -328940
8426 -373039 -104380 157228 -97369 -405054 -106401 74332 -172778 73907 -80266 -115766 -179868
8415 -179868 -123738 184993 120202 26629 -134162 -134391 -148340 62122 -223283 -170284 37283
8403 -134203 8848 -138636 -134472 138367 159620 180822 -479113 -85721 -418865 9311 1399 4166
8391 4166 -194030 -10540 -181661 -77044 -110344 -210226 -24588 95960 -38911 -230023 -165857
8380 -165857 17372 -44738 210077 357526 -88134 131692 -267483 289719 147160 26676
8369 -59273 194138 142219 531238 -33125 122237 -219855 95892 200527 9226 -43255 25706
8357 -196397 107683 -44998 81479 77731 185880 236939 125037 -83929 -132431 -337011 -283474
8346 -283474 109201 58109 -54507 -70276 264494 24461 -6743 -151293 -111115 -113560 -15643
8334 -298069 28703 20568 -266157 77358 -208440 -184565 47393 -495451 -112295 220450 23230
8322 96122 215089 -187897 -184338 7090 54284 -69790 198909 133967 -139192 -49147 -52043 -87512
8310 -87512 -32354 -21402 -166010 35517 92762 -151337 25671 -48725 -97704 -212353 60543
8298 74523 -121751 -195563 -36564 -320495 145241 -82830 -28459 -71353 84889 154276 -90788
8286 176195 50523 9714 64764 -201882 -109341 -290887 -93610 326797 -202771 -53714 166535
8274 -112131 -88064 -106027 -31429 54384 -22118 154307 25763 259445 20944 10748 -170117
8262 -142618 71617 127593 -47108 -9703 -148963 122393 -3808 -17385 -146902 -109393 -32451
8250 -439595 28821 76351 -194375 105610 203678 -280236 152332 358065 -240407 105618
8239 -52583 154505 -146093 242096 -52231 206153 -41625 185926 -65699 -33162 171656 -249389
8227 -55806 -463579 63321 147988 -228475 126322 66591 75310 70159 -45760 -168623 -141669
8216 -141669 312997 162296 106136 -299827 -284050 -24504 -209923 173674 -83140 -101244 -74808
8205 -74808 -121108 69862 88449 -110936 -175057 -145481 161600 220 72836 -310426 -2040 -213900
8193 -213900 -60760 44024 -153151 -36645 -175621 -380237 -67830 -83676 76086 38229 -97586
8181 183809 59297 -32771 3955 70732 212831 19721 110260 21411 -74031 -98481 -55796 55522
8168 30189 -82393 -139956 164670 112108 232253 -93379 -82136 -190317 -547854 -110713 -42396
8156 -352034 188254 -101149 -13687 -3269 72133 224054 7223 67589 -47923 39955 -214706
8144 -78794 213351 21554 -41822 -310275 -63470 168530 -168063 22841 66684 77098 101617
8133 101617 -44508 184133 -262687 164598 -63739 -242926 71430 -57821 32405 75486 -285009
8121 -55243 123832 -8693 -172251 -107046 -41383 -15305 -8399 -387169 -109183 -87776 85024
8109 35754 -72086 -268735 -363650 -162452 -120997 -193351 12382 95720 -261955 -32351 -15760
8097 -149005 -294845 48617 35690 -133394 -35375 -91471 -227693 -163243 -279647 -130053 -23083
8085 194163 76177 -305851 47791 -426593 111146 -1950 -240702 313865 -195952 105734
8074 -105528 -164519 226182 -301065 79403 -17076 121726 368026 -441564 108730 349820
8064 349820 -94937 -63456 202942 92276 -37352 -340010 -144165 28927 44940 -150203 -167401
8053 -167401 279386 -18286 180598 -57420 -88492 -170828 -66832 49226 -41558 -215976 5509
8041 -363766 -103020 -74254 -34059 -278610 -314445 294059 -245772 176705 -26007 -107302 47683
8029 -231774 57834 30456 -15638 -346828 -366750 126760 125365 -123720 -59835 -310585 68222
8017 40330 -4953 -300264 86138 119001 171600 196481 -30251 25604 -105038 -151852 -127226 8299
8004 310121 140026 -114214 -27798 -135931 -130846 -89725 218403 -28391 -113639 70851 -161652
7992 -97328 256588 -376124 -178558 449261 157746 -219760 -52565 -197477 -261709 -71838
7981 151380 -186526 144107 -108438 185372 162261 -175673 -64680 -203985 -161836 -14887
7970 -88629 -32920 36339 165802 -49738 -302663 -38602 -188027 156962 90373 348417 18474
7958 -183956 -47461 -53167 -56547 -200620 -32390 269222 -187639 -27051 99619 -75251 123737
7946 132011 77889 -316242 -88238 114614 -263153 56606 428 444511 47013 44541 343670
7935 343670 -129675 -196689 -64963 129970 -72703 -382784 -340502 -33272 92749 -3839 166350
7923 75253 90395 161470 -147696 -23475 47751 146935 -112080 -95659 67981 38568 -243949
7911 -26671 -112426 -322024 -158165 -98052 -101475 -212819 -264320 119367 -152744 -234344 -40946
7899 -54951 170937 42466 -20996 -88586 -4079 -200562 114061 11363 106361 52361 167977
7888 167977 362485 18104 5169 118366 -71930 -116020 143369 -167981 -97430 67384 66295
7877 66295 211834 -98458 -100552 114666 -193389 68600 42663 -138170 -81705 20495 202545
7866 202545 -46718 319390 169034 -39578 1185 -107932 -319935 -233027 365212 319671 -160978
7854 -113234 -198660 -105291 -7605 159631 -26078 367226 226 -99360 -86758 129443 92453 286941
7842 286941 -118014 -75203 -149979 266300 -2989 -97498 139621 68436 -64500 -257476 47499
7830 -67202 157669 203052 -93657 207607 -290928 167001 23696 46271 8488 -232407 -147034
7819 -147034 -107656 -31017 -143642 78420 -210292 -150766 97569 -47228 -191804 -224690 -314987
7808 -314987 -139476 488153 -219339 -2578 -343828 33060 62147 -61454 152297 -105313 -44686
7796 294198 -159746 273498 124447 -268396 -155889 201735 -36806 319716 56023 233259
7786 233259 318780 212122 -61014 119298 -299206 242656 151916 307901 -25186 18595 -276215
7774 -23917 -166436 112818 69790 75398 -179864 104811 94884 -163102 -138597 -210528 -246449
7763 -246449 -220321 273853 21539 172324 -288805 -100831 69705 102702 22854 -120221 -556471
7752 -556471 -92942 -139038 -171286 -100101 -213777 -203093 -570586 -84003 330636 -212080 -233477
7741 -233477 -19555 106762 -107387 216053 94423 9095 26603 64413 -98552 -215938 330083
7729 116453 -5106 -120981 118720 -165897 -285326 -565571 -123016 -177836 121806 -76441
7718 56257 17690 -21704 23844 12226 104609 -197881 -159353 -30479 74469 10689 -186478
7706 -170830 -205797 -45750 -6856 -87649 -350964 -96895 -93132 48540 -127138 39417 -198886
7694 28160 -79165 85936 92759 -203880 -15119 32930 -55393 -122247 -20942 -53467 -111665 177562
7681 -423987 -124348 94585 -443374 -140659 -49307 102350 -32516 -195394 81810 -59419 170767
7669 101648 -218878 -112672 -125657 61266 213398 -19587 2423 -344880 50069 191027 -96811
7657 206234 -121696 -102469 52065 239729 -148223 186050 -319093 116025 -147760 -88078
7647 -88078 -65075 10016 -16419 -258113 130760 -332027 40045 -55629 352682 -90495 -256630
7636 -256630 -22219 -37935 -307610 238277 57041 132851 -93863 -199512 141653 108461 83148
7625 83148 -121955 -220357 -229312 -239286 -217406 39449 447792 -400483 94564 -23541 108481
7613 59099 1340 191531 144807 -125290 28071 -171140 -160256 76521 41547 -27649 139320
7601 -184409 48427 -131738 -181547 26198 122853 101410 -91034 -125013 -174214 27876 -69090
7589 88103 135391 81330 15142 -212965 146988 -301070 -155512 -70948 124529 66348 386845
7578 386845 -119159 -119032 -162550 317089 -269898 -35875 94183 24268 -244952 -252980 164061
7566 -45641 84235 -62948 19936 -24456 130976 -34951 -2624 -61567 -200428 -181002 -300630
7555 -300630 -55166 108119 57771 -28064 139755 -317543 164670 -12292 151641 -177124
7544 31001 183725 -150091 76875 -208993 156645 -213024 364207 58515 59422 -192606 -187532
7533 -187532 211094 155856 9174 374434 -24717 194321 -229027 -241176 -22850 -56442 -417861
7522 -417861 -60959 5727 -352273 24529 -12045 27680 180117 -47120 146136 -84181 -78472
7511 -78472 -161998 84697 67506 -132466 -19126 8654 -100321 -431561 92230 -293343 -67778
7499 -16338 173041 -161262 183026 122930 -69361 459818 103493 -195764 -3031 -172264 273231
7487 20292 -76542 -210308 281593 17185 54136 259594 -73794 218372 -169987 50618 -45270
7475 -59275 214531 396489 78629 39299 143325 62032 -253662 -112928 -226725 -223085 33013
7463 22010 -138606 -362011 -228997 404345 67474 -97578 -194502 -142820 -136578 199887 468446
7452 468446 -166954 -15612 -22191 -1143 496901 -317255 115276 121621 -77806 -73635 -50695 -112450
7440 -112450 190859 -30144 -109353 -407120 -66522 109313 -108491 -102813 -58950 -114061 85972
7428 90107 111408 -25020 112850 -113741 23950 -193843 -61996 222229 235276 -61753 80841
7416 261081 -88074 -22137 -189558 -116210 65885 70552 109306 36401 -109758 -29313 11341
7404 -124707 -442903 5921 -140452 139721 -190679 88681 -56071 126393 -114419 78899 127739
7393 127739 67355 -100478 -65364 201725 26381 -169812 -16486 185179 212506 -139941 -90552
7382 -90552 -10318 156382 -123871 14500 12538 132464 -76473 -193695 104281 -267101 184706
7370 -79073 -88866 -235855 24827 -154263 105159 264810 -82922 251367 -121388 -139198 -2102
7358 -195996 168240 -128331 131534 88208 -60645 -167459 -255928 -455875 199245 -246428
7347 -141630 -186178 -109582 -31003 146735 -173324 -22670 -189877 -304106 39215 -79446 12510
7335 42858 -8463 -52030 87075 -38752 103136 -16674 -21679 -75520 13221 -252171 33998 -134359
7322 209488 363011 -278573 -211247 31693 118809 134162 18253 179820 206267 -316287 -218776
7311 -218776 132780 368916 -86995 18069 336434 -135246 60321 166384 39500 153230
7301 153230 -93729 4641 92624 221094 -42196 -11606 -26156 249331 -214073 -168869 -286408
7290 -286408 197082 37736 117352 -101906 -31269 -11193 -69400 -93471 -16433 127322 -543135
7278 -324438 473174 -24666 -310594 -124487 53983 -284516 57711 -136447 -253935 -373734
7268 -373734 100501 -201390 -346768 -60810 -112128 -138549 -86708 33982 -116079 161178 256906
7257 256906 -316993 224435 -319849 49426 16224 -56211 -214554 -287556 -229907 157965 -13522
7245 -76751 91250 118288 -155671 -271740 -224016 -89357 42088 177351 294265 82542 -166295
7233 -180055 99706 -219966 -116501 23718 -51009 -50966 77135 -347686 12793 115151 -78556
7221 -137103 -104738 -210942 65161 -231337 -159940 -122037 115578 -116267 -21200 119634 -150588
7209 -120240 -75251 136776 30184 -400848 -1011 -239323 -39082 195752 -68691 -343429 109537
7197 151266 3808 5189 58992 -205118 -179079 -87887 90588 102888 -139909 -90106 61895 168242
7185 168242 59367 -83067 -45278 -54393 87669 -266979 17295 -228058 28 -108734 -93268 -2179
7172 1175 57063 -64206 173992 -48694 111157 110331 -33896 -157096 -42141 157984 -109285
7160 -135139 -78472 125301 -109356 87335 210064 144230 -211377 -59598 -269463 -222335 -130442
7149 -130442 254387 359271 -109042 -152759 -96536 -18005 123688 322730 147996 74133
7139 74133 -265391 -190593 144788 185566 -235221 -101909 44112 -48315 -450590 92037 -57085
7127 225057 -46209 15163 -317595 -52380 -36830 -28954 -135172 120860 211020 -225781 -252713
7116 -252713 56638 -178556 223918 266971 -18821 99700 -153271 -166245 -180105 -43725 -72352
7105 -72352 61989 -116272 165199 155164 125619 180720 -301850 28750 -243740 49074 144710
7094 144710 70683 112993 -299165 -60815 -207694 526741 -251835 56101 -99330 -108116 -27173
7082 11667 133107 219697 -4871 -304914 -127175 -230562 -100751 36051 245740 39728 -148923
7070 -20310 -75599 -224331 -205386 -43219 -98517 -250108 16229 227385 76071 -78215 -81320
7059 -81320 -282346 373076 57398 91836 13966 -168457 -137531 21403 277260 -236347 123864
7047 13344 -211052 162769 13485 -95039 -213417 -183775 -9317 287447 51496 -62111 138615
7035 64760 -5243 117100 58626 -317745 83530 -145425 -3951 -211338 -259567 208699 190863
7024 190863 -28245 -172069 -173244 137360 89575 49667 227402 -222059 -19812 -320909 119307
7012 68756 106868 183033 -110728 54787 -74829 2839 -95600 -62800 45605 -145908 -51950 -22122
6999 66897 -281136 -76887 21810 -105091 -28598 270254 -203432 106925 152916 225442 -395659
6987 -233570 -146803 64244 -88707 -107629 115860 -84499 -513470 -5584 -317026 -47451 12637
6975 206499 77701 -196166 -150322 292912 -178253 -240565 207710 65263 -14480 31226 223698
6964 223698 35425 54372 -34662 -58717 -257165 -233429 -128535 -72145 -231269 -17383 156418
6952 -54411 -134644 -5788 -32130 95554 -102539 -107226 136958 -131444 59556 -74572 -4911 103050
6939 -75262 -185347 -138779 -59587 11418 -85601 139000 -14215 -4225 -211721 76986 66299
6928 66299 -71955 -77424 -39288 50603 133242 -205454 -369734 23424 195841 21623 44457
6917 44457 -233013 -24817 191834 -244011 206779 -159385 -79986 -64919 98965 393464 185660
6905 204537 235213 -50450 -50142 -139579 -233754 -246920 -34755 5381 188401 35056 -186843 -136626
6893 -136626 122739 66458 -304605 21941 70786 205719 203566 38826 220567 -423130 -80429
6881 92682 -221937 52632 -19509 -168785 -236552 -31776 -128784 -120945 -115606 255655 213453 -94872
6868 -86335 -45960 38966 -203910 -348697 -61851 137732 361497 -92908 49547 -7069 127997
6856 235103 -97215 -202680 -36093 -423617 -28263 102782 113733 -263293 -8661 73437 246570
6845 246570 -138982 -27509 -102286 95876 -23841 111094 77371 163458 270892 105515 -352828
6833 -130146 -81134 84329 37652 205386 -59105 -96624 59224 165595 -71823 -71996 -123626 -31493
6820 12525 115493 -140188 -475451 60654 74100 -268912 -23954 205168 -134838 -145780 -248797
6809 -248797 28176 -236326 135364 -19415 -59171 113596 -63922 -99106 -66168 83054 -142673
6797 49441 -516526 109824 -135784 -60515 91855 -244871 -162229 -59155 -244194 -266104 -161661
6786 -161661 -181850 -119340 149987 88405 -72601 314241 135564 -458260 245656 121457
6775 -319185 117872 70331 32472 -9972 -184815 -159631 -57830 21823 -297752 -113688 -62821
6764 -62821 -185602 213236 26732 82042 -48548 206547 -23469 72357 36111 -119866 215707
6752 236042 -135687 19605 87866 165860 -242287 -194910 -16300 44837 358243 -34378 -263426
6741 -263426 -128707 -359572 -267106 -129763 66225 370761 295013 -95994 139385 55917 184843
6730 184843 -248867 100444 52717 154600 168992 -64492 -45708 29812 -350465 -89061 83617
6718 110559 33365 83023 153061 38229 70959 27356 -142849 79088 -167092 157478 212883
6707 212883 -143746 -158779 -414318 206927 -434655 -270915 149630 7943 326409 -112058
6696 -36854 -119305 48876 -170046 90062 -196365 121455 -261996 263892 -92503 -111698 -2501
6684 207199 133170 -40184 194252 187604 44138 170145 164843 67070 -36850 -330329 77356
6672 313 -269437 177479 -21092 47368 -105377 32685 -328598 145217 154761 -54409 -99084
6661 -99084 186006 -63312 -73010 -245526 -151029 -34043 4203 -267284 -40490 -196407 -103458
6650 -103458 -122922 149485 293223 -123049 -216275 114301 186470 52562 136891 -168976 79415
6638 -263093 -175745 16632 -48992 95827 -278280 244078 -308859 194823 -2259 -249659 -48871
6626 78730 -214846 -147410 57263 456821 -230704 90860 117503 112700 -37904 2543 -102699
6614 108506 49954 -99592 39706 369336 216175 -248623 100613 41080 -117710 29516 147293
6603 147293 390699 153573 76139 -268699 -14772 -39841 -175476 51086 -110024 -17169 39023
6591 -269372 -78500 -21113 3333 -60332 -249940 100699 -106607 56366 79943 329080 -270771
6579 -146538 163374 -130637 -19993 82446 -15262 -76744 -201386 -339057 60356 342497 240287
6568 240287 -453024 -163146 -62656 50207 1384 -135370 204053 96319 154313 264107 -248776
6556 -205934 -42787 -54666 -98737 10312 -186709 -204574 -92445 -93636 -41496 280767 -260944
6544 -49864 4073 -119166 -297541 -75600 70479 -315534 -142725 43806 94391 34743 91678
6533 91678 -78166 -122293 -113659 -324262 321334 270607 -127092 -279552 85286 -82064 92302
6521 18420 73657 -31412 -336751 72160 -219722 179033 173259 -63914 -197955 -117543 24850
6509 -27668 125511 272994 46167 202199 -93224 41861 202509 92993 48500 -101208 85322
6497 -104733 221749 117158 72420 -8060 6250 21247 -422225 -310803 194672 -138919 -118702
6486 -118702 155141 173215 -84377 7457 -108135 71200 -55614 -15155 284543 -72323 -93174
6475 -93174 -11896 182396 -256181 39005 173440 -196265 129257 197098 -142909 -128519 191009
6463 -501099 -20258 -89095 -4817 -32610 -141418 35852 -31257 -82843 -196736 17499 -126634
6451 687 23440 113926 280063 -498099 -229903 49407 136786 -149938 102303 -36586 -67820
6440 -67820 -398867 -18850 39446 -337013 -14283 -123512 -35123 31495 117323 360684 -238986
6428 30611 -455217 117184 71028 208045 -275943 178862 37083 -103539 83328 -231311
6417 247283 21370 -100979 116877 -133401 27613 67281 159399 -228817 142873 43814 -109133
6405 53958 178140 115100 154957 76025 -431208 -387624 39280 -38830 -97167 23154 -36241
6393 -201146 -317740 -96789 -40583 -332036 123257 -45691 4752 84603 -22549 194861 29234
6381 92510 -84271 36133 18753 -99002 144135 145100 49914 98995 -390886 -161651 256310
6369 -192059 28576 128188 -193557 184664 98248 -209292 589965 99775 176649 231752 -282976
6357 -1472 60989 -108788 -59606 -219373 277120 -104238 -143566 -63271 243046 -49793 120866
6345 -26303 -10871 527143 -223878 -249458 -113187 -93721 132997 -65358 104772 156071 -61222
6333 -101952 81230 -121008 -72383 -38486 -315691 169107 -33468 -9761 -79180 -94334 58105
6321 -18877 -381922 52482 104563 149369 -89567 -8817 -181300 257075 -263048 170351 -93923
6309 193946 186753 18935 -269956 -26744 36429 32571 -193610 -107754 250790 196063 30908
6297 127836 -206004 219498 3368 142724 74848 239848 125567 -188504 55538 -85137 -113880
6286 -113880 220722 72631 -34298 -54139 165476 -149033 64890 32938 175958 -253415 -83938
6274 445013 38394 -92923 -77731 170855 62560 -326985 32269 -49206 140513 -27558 177768
6262 -136244 -128436 -14978 251202 -24462 -70288 21931 78760 -495259 -11178 559962 -27324
6250 -122775 -129209 51895 -62549 -32044 -164660 285261 -140008 -165051 205579 112897 202904
6239 202904 -57456 -29331 -7895 -212356 379761 -190279 37439 301423 -181739 -148007 -24735
6227 -304790 3694 -8146 -247311 -45401 -32515 -270422 -13324 159154 -73084 -18551 92474
6215 27279 -156680 -252259 76514 -64304 -266836 271447 -302511 -215541 -161923 -104223 27328
6203 -165876 -129173 -208558 211346 49546 -316550 127892 -156852 -157815 12585 114449 -114992
6191 352830 8821 10963 -6866 -260519 -5570 -105729 -32727 127262 229613 9354 103184 -196036
6178 -225376 -98526 -185530 15530 111272 -61277 -13751 -97011 84064 -96959 -183356 65670 -225139
6165 -241815 -88246 17544 145173 48855 -207259 -61626 -19351 -58622 -235561 97930 270216
6154 270216 26468 96408 31349 2136 324323 -26495 -67708 -125144 126716 234519 -120779
6142 81364 -28384 -221550 133020 101757 157913 128756 -254758 94860 -143781 -162791 256019
6130 233003 -396941 25047 -65576 -146169 -102312 143418 -164576 -93678 109958 -173859 -46495
6118 -21800 6159 -58944 109040 33441 -250317 -219826 -228400 222203 110040 102064 149323 -56511
6105 460022 139418 -6616 41649 65627 163682 74818 -123856 -232555 37916 300701 82281
6093 -11460 -430734 102894 -46832 -140029 -352288 34795 -61178 120512 -156244 215454 -148283
6081 -103566 20348 -147395 170926 -48913 -102724 302489 -209166 148376 -338295 -251791
6071 -251791 -7313 -87456 303894 -47955 -211533 -190882 199332 268 399427 -128382 -63892
6059 126888 -146956 -194366 -267227 -249389 -131818 233367 34527 146550 -28358 43613 -10708
6047 -167496 66729 -8567 -69254 -238066 -151951 49745 -203947 76314 -49987 102518 57161
6036 57161 -39360 -461596 -76661 -56731 -152094 101052 304390 -50204 99231 200387 -175242
6024 244401 91361 223 -133108 22230 -278574 39255 404487 133258 14206 -203059 -77052
6012 -202234 -184397 41598 98308 78277 -143876 74875 40351 197988 144423 45525 53626
6001 53626 -185353 -65738 98600 315336 -225865 113427 -90519 15426 2283 159341 175204
5990 175204 -103358 -73802 21964 -198477 388521 118979 -27912 119257 -122441 -173235
5980 -173235 98518 191279 -1912 -331741 -29243 200514 134974 -96950 139173 46787 185275
5969 185275 -47412 69822 148460 315719 -168376 77585 -40606 49633 -93233 -2395 211247
5957 4434 -199029 -68638 75565 -158917 140440 20097 472095 -400333 -95967 130571 215285
5946 215285 346867 100738 11007 33408 -100908 -21075 84379 -146144 174632 -182 337557
5934 515679 88593 29226 165978 51090 136117 151804 160995 180288 19940 58909 135842 -185700
5921 63898 235138 63190 -11527 252353 216397 -115822 133228 -177696 -20341 15150 221964
5910 221964 187078 140470 198830 -100923 99132 296663 -5907 323481 34090 111558 -286592
5898 -80880 -93242 -41378 -284974 178353 40658 -62907 107859 6094 -25061 136887 -81222
5886 87519 223052 120050 61028 202312 77607 -84777 71304 23164 404834 65006 -104244
5874 -75817 -198629 -192291 -150269 -99260 -270382 -53163 -13446 282920 -63457 219381 -236152
5862 198865 -103268 -172541 191377 -185866 -52291 -45256 -18419 19626 85051 -257680 -239044
5851 -239044 -43303 178569 -16348 -7617 178536 152134 45940 -45313 86429 -158812 -167510
5840 -167510 -10087 -81268 -207255 -93613 -159178 -188593 556 -127172 94356 -119490 -94493
5829 -94493 -217198 32178 71276 116988 9016 -243540 75520 -338917 -376364 -190178 -7979
5817 -68490 -245156 -325121 31457 247587 -107347 -260490 82342 -31013 -158388 92730 203981
5806 203981 -376286 3957 197057 -64552 32468 -90720 252796 -98284 178701 -13983 103709
5794 -84114 -114786 61707 -84402 -44928 -1002 -152323 -142538 41382 -186984 -48316 160493 112933
5782 112933 147693 47806 -31302 322193 151619 -97590 -60158 -33018 109587 184606 120044
5771 120044 -80192 310103 137666 -186249 51955 83131 186972 -183646 154311 309302
5761 309302 -52156 -31487 13922 -66190 -170334 74822 254656 -121887 60744 -48378 -2736
5749 -90469 318769 59876 -475638 50062 -142188 212692 -66600 109925 6898 -161935 -9632
5737 -38733 473175 79084 238132 27837 -241575 148716 107207 -15347 -67933 -114116 -61296
5726 -61296 6528 76498 300086 -135078 49514 64700 177305 -9130 -10559 -173773 -348257
5715 -348257 -138532 377497 -65450 -78922 -8838 -108679 53714 32048 -226655 -275998 166978
5703 -136487 41300 97739 204979 -37355 -68141 -192305 32257 85719 153486 35011 26298
5692 26298 62874 99679 18665 252576 92928 193977 -100014 33437 268609 -413299 170710
5680 56427 -7658 152417 53997 -40805 15756 -19330 218190 -48420 -90716 190056 62310
5668 -177926 -127455 -180052 -159718 -119832 29721 66848 40537 -87276 128821 59651 155772
5657 155772 -71476 217009 76494 -170889 182798 108161 85388 -277379 -92565 181791 -168558
5645 -184287 127464 -310337 -176354 -3549 -215512 221974 198379 -118950 90504 247688
5635 247688 -103824 162245 -60465 210212 -310458 -103304 -258376 -62629 -46897 2084 214479
5624 214479 -65140 -104553 74860 145280 -81283 -71050 -175825 45526 173201 -369754 -98299
5612 89540 -302402 -133526 48174 -24630 -105442 -227490 -224974 59522 -184490 -33224 -198811
5601 -198811 -155320 264915 129598 167483 -324861 66018 76656 38019 -79766 82772 309143
5590 309143 -115996 -18188 127833 37891 -192604 160015 -39596 38219 -44948 -42567 36065
5578 240073 -111592 -23618 157351 -86340 -63265 109033 -34220 -119179 80563 31204 34587
5567 34587 -412883 -39951 -31944 -36679 65393 -61410 42325 -148864 -118966 15777 90430 109985
5555 109985 145677 245188 -136750 -172719 -121747 -12794 -8515 239885 112919 176509 -59434
5543 -421772 -74555 84132 31989 60402 -138916 62149 4942 -159686 -123819 528146 156513
5531 -141928 -112787 272099 -138286 -91987 -298569 328410 111791 21472 -118756 33965
5520 -15075 351003 -128944 -196015 146693 37923 123310 -64158 128009 104603 -133133 31880
5508 -51435 369350 228762 62173 -137787 198215 -163547 159488 -118946 -65537 35018
5497 157957 259067 43570 134913 308987 91043 123003 66797 87983 -155348 -164845 -36567
5485 16924 20564 -103981 -105193 -85633 -148577 5583 -87193 69377 31141 -240923 -362164 25142
5472 537958 -243496 -131295 -343748 116694 32573 -134551 19169 -118419 -203782 136328
5461 -262036 -148949 -225103 148443 266524 -73397 74298 109238 168191 -120715 -81329 -2913
5449 -17413 232036 39241 99452 319061 194677 50705 223523 -423857 207138 -186716
5438 -116881 283009 -26433 -54926 30535 41022 -130729 -187068 9862 -150918 22190 29288
5427 29288 -70502 109517 14695 -146163 282439 -192316 -122053 -65374 105029 -6761 316970
5415 -226759 20893 211247 152002 -223047 13405 202495 -187173 -18575 -134531 116594
5404 272936 -116181 -77765 21363 76098 134868 -42564 -95630 -142876 107506 42618 -2519
5392 -458500 6409 -57893 -58352 36463 41792 269800 -58103 158496 -215889 111243 134992 -2025
5379 141768 -98528 -32601 7492 44059 -102266 55164 149795 -105810 -82528 -311062 24017
5367 -38111 -100890 4356 -202789 -279898 38873 24594 287293 -218081 59001 -128748 29918
5355 -123736 -164170 -12881 242634 253230 202791 -11306 90819 5574 43166 -232660 51574
5343 190441 227189 134264 145339 106976 25514 39000 146418 -28109 -10915 -229672 171072
5331 55934 -8338 79058 67347 -19356 8369 33938 22860 101615 -14013 -440662 16330 23471
5319 23471 -88199 -266377 146450 -192964 107387 96909 -941 55723 -204868 2648 274116
5308 274116 -17774 -2178 281587 21994 51637 -121297 127166 169472 -95559 20984 -1310
5296 -3701 136458 134248 -255659 11147 44863 50949 35310 55510 -268230 -38907 140787 44497
5283 352135 -51078 -130081 -197870 -255609 -251630 27673 -95936 228687 -11595 -117524 -59094
5272 -59094 16036 264042 139899 49908 -5880 3696 -212300 -36880 -54504 -3002 30755 264667
5260 264667 -114507 156402 -97965 81880 65559 23837 -338645 -99762 -123523 302067 -10874
5248 24223 76700 -8376 -32534 458788 -12587 191599 -136975 278818 -10877 -4080 -72605
5237 -72605 -356468 18334 397814 24639 203857 132533 -123169 131316 -146337 58247 185010
5226 185010 -215878 232661 169561 -22057 75026 -283843 -24708 -236840 166516 33905 34994
5215 34994 -234662 -65057 -46556 -105209 32234 443843 -18936 109339 217192 113543 -15093
5203 -20408 361801 -160651 -46356 -348654 -64625 160514 195633 126489 -232840 191233 110766
5192 110766 216932 -289743 191447 253013 -62332 -20450 -92458 -108340 -73786 -151833 140890
5180 -36810 133379 175624 23288 33066 -274052 -56665 244767 -181800 -98858 243398 84445
5168 105170 -183365 179416 70090 -149859 167615 161862 -92101 366777 -3323 -64654 208869
5156 125173 94881 200751 -50216 211545 -144994 -49574 -137447 -76155 270431 50718 111040
5145 111040 -201265 29054 287964 -7997 33766 62948 40856 -143703 -11076 -191748 188508
5133 -227907 -76378 38200 26828 -53422 269357 243026 65500 9864 197630 124510 -32815
5121 -431057 216737 151017 59928 36385 -280526 108338 99189 159271 -153202 172129 -107467
5109 -249418 -82206 53685 -227562 79382 56983 -84308 -129358 227163 -76753 -270217 35356
5097 -14387 156882 -173522 231507 -284470 125202 -337737 439893 364829 -114833 76270
5086 104707 -192019 11087 -372098 -34524 240106 -143717 155073 -55025 92017 -224824
5075 224170 -318569 -181906 11568 131147 -239937 -381327 81572 -153387 -36480 -193737
5065 -193737 138412 178912 50592 9512 90227 279837 -54970 -231573 129376 -3713 2288
5053 -94047 180864 136020 81522 544474 -452778 -39482 -107270 122067 -167416 -295228 -26254
5041 38191 -52634 -45919 -30852 -137599 -106284 -144766 12020 -85628 227487 45952 28234 15964
5029 15964 -465834 34689 85685 55968 -420839 -67324 -266183 -225770 32944 35645 -214931
5017 269115 -112291 18126 109127 362122 -207680 221504 14807 292617 159531 74430
5006 -328228 -116900 250026 70427 -98652 -292083 226878 -6595 205480 -261780 -158768
4996 -158768 190367 228942 -109851 -90574 -84234 188899 277952 182543 112420 15761 259746
4985 259746 287725 -16617 -91576 122707 -103564 51202 -203451 -171552 104507 -223976 97803
4973 -130337 -298044 114980 -148980 -346390 -192683 170708 219984 -265159 213857 30360
4962 -123418 -27533 100625 -299285 -107997 117122 125601 392760 134416 10362 -81548 -122368
4951 -122368 -24951 28376 -99054 8370 -4220 -237970 116220 28247 -241219 59520 57347 -143012
4938 -5239 -201929 -129121 58154 -65965 -162776 190110 122024 110013 -98847 302928 -105175
4926 38018 15021 90325 -149296 20642 -84380 71559 172547 111664 8228 -85574 -15614 274322
4913 58430 136684 -9088 324378 -67863 -56752 -144645 -162013 -341550 34130 228924 216835
4902 216835 100360 -175170 -74315 250849 -60565 29809 95099 -177508 140469 -98716 161477
4890 285807 -37961 259596 -95077 -166344 -31542 162773 344941 7994 37512 187990 -222619
4878 181342 314400 -315736 137302 144876 194046 -146810 -217463 -275027 -225165 -103841 -32689
4866 -180409 -103576 -314482 57366 145708 29695 -117189 133484 -18755 104204 -181382 -85474
4854 75532 -4916 -74976 361893 55454 183679 -115334 20503 -260663 -195878 25042 84006
4843 84006 9454 -153698 -94773 107709 -7037 115709 -32064 242480 70980 301897 239747
4832 239747 388603 -269200 21697 -81822 150097 -94054 -590230 40880 212803 115199 309700
4821 309700 -97201 234403 -172310 -111516 -232239 -220238 -122081 -53462 -57219 -37009 -58950
4810 -58950 -147194 -44558 -24003 -178358 99767 -106019 49091 99872 -98605 146691 -3880
4798 -48987 14273 -2318 -254763 50605 -29596 -375626 102441 273026 307577 -433251 60441
4786 -182327 -121462 223676 101476 366329 251272 -235034 77312 193795 -84280 -24185
4775 126565 -52134 -226138 -20210 92798 18922 230907 203877 -9852 131381 516447 -214077
4763 159178 59039 79075 -20698 -27797 -60073 49372 -71040 67172 -53308 -33834 105184 -22539
4750 118208 -59887 274862 55122 270827 248367 -35937 381792 -161714 -115857 -268351 -300226
4739 -300226 -99978 99116 156382 -49674 95188 240510 -36370 2190 -119486 -119042 29662 241884
4727 241884 -121915 333128 66800 -51343 335735 64228 -233807 5876 -242560 204562 -211260
4715 -41210 28535 158885 296259 -46174 123823 216579 463403 190950 243773 -329633 267097
4703 -103134 65983 222411 212992 49798 -33770 -535977 -136969 185353 16057 274652 -40962
4691 102013 93612 45899 261849 -205849 -51611 -424100 -159997 -262184 -10102 -12934 -42821
4680 -42821 -184258 -92578 135709 175150 -45081 108156 335737 -75026 145702 6809 187390
4669 187390 -212471 -61465 -217231 -249674 152355 -247186 35398 -31126 392219 95329 70106
4658 70106 227709 69825 -254130 48842 175402 -96510 87466 139641 -78171 45060 102174
4647 102174 31480 -81535 -286849 -23504 -49521 60482 139100 15151 216830 -123237 212583
4635 124655 241891 -81695 -182960 306892 -69625 -128744 -14966 -525338 32203 229704 52671
4623 -97844 338822 148672 -334486 285476 38314 185847 92630 -127465 65371 390912
4613 390912 206919 -102647 203887 60492 127296 -252888 -35996 188498 120018 36810 -64659
4601 -27328 275034 -45065 -6587 -64491 -51453 72157 106462 -125882 144625 62060 -31439
4589 -21950 208172 -225713 133731 51091 87548 13369 117514 195969 -87387 -190217 154827
4577 89679 79207 -58186 -280364 275588 -319073 -249110 -120191 89260 -258518 -18304 -260915
4566 -260915 -342659 3059 239151 213776 181479 -137676 -304900 -135279 47705 289464 -45992
4554 41052 -231762 -182469 131393 -211423 -202659 -41454 27485 -123180 14411 -148607 142397
4542 -76081 -291444 -65782 287993 60887 -272565 -86450 181525 -95016 38860 -132285 -145992
4531 -145992 51945 58114 203083 -107009 -74334 -16901 296182 -56537 -94022 215679 35320
4519 126751 -211181 39716 -78565 -345482 39293 48059 210741 83165 -44501 -223811 -85151
4507 112359 164586 189172 239908 70834 160952 -271211 173698 -376400 260842 -7475 43513
4495 19647 127203 9665 142963 165626 -84310 -54992 -175584 -40178 10774 -234913 29083
4483 228504 66491 270902 158303 263917 -13669 -268311 -298584 -64373 139773 -129643
4472 -84992 35796 89837 271941 123581 -21260 139757 -149060 74903 11046 -104372 66834
4460 178495 131194 -74679 -146938 393971 378384 88781 -103272 113176 -64470 -2889 -84174
$$ [...]
##END NTUPLES=NMR SPECTRUM
##END=
