##TITLE=NES1082_T14_9885048_D2eOf7YFWr
##JCAMPDX= 6.0         $$ Bruker NMR JCAMP-DX V2.0
##DATA TYPE= NMR SPECTRUM
##DATA CLASS= NTUPLES
##ORIGIN= BRUKER
##OWNER= Administrator
$$ 1.72 TOPSPIN		Version 2.1
$$ 2016-08-27 20:16:20.429 -0500  Administrator@X
$$ Compression mode = diff/dup
##.OBSERVE FREQUENCY= 400.02188249412
##.OBSERVE NUCLEUS= ^1H
##.ACQUISITION MODE= SIMULTANEOUS (DQD)
##.ACQUISITION SCHEME= undefined
##.AVERAGES= 64
##.DIGITISER RES= 22
##SPECTROMETER/DATA SYSTEM= spect
##.PULSE SEQUENCE= noesygpps1d.comp
##.SOLVENT NAME= COFFEE_meoh
##.SHIFT REFERENCE= INTERNAL, COFFEE_meoh, 1, 14.9627
##AUDIT TRAIL= $$ (NUMBER, WHEN, WHO, WHERE, PROCESS, VERSION, WHAT)
$$ ##TITLE= Audit trail, TOPSPIN		Version 2.1
$$ ##JCAMPDX= 5.01
$$ ##ORIGIN= Bruker BioSpin GmbH
$$ ##OWNER= Administrator
$$ $$ E:\/data/COFFEE/nmr/NES1082_T14_9885048_D2eOf7YFWr/12/pdata/1/auditp.txt
$$ ##AUDIT TRAIL=  $$ (NUMBER, WHEN, WHO, WHERE, PROCESS, VERSION, WHAT)
(   1,<2016-08-27 20:16:15.242 -0500>,<Administrator>,<X>,<go>,<TOPSPIN 2.1>,
      <created by zg
	started at 2016-08-27 20:04:45.664 -0500,
	POWCHK enabled, PULCHK disabled,
       configuration hash MD5:
       21 0F 79 D6 B3 7B B4 F6 88 20 88 DB 03 48 BD 9F
       data hash MD5: 64K
       B9 83 19 80 51 D2 EE 69 93 66 62 7D F8 E4 F7 2A>)
(   2,<2016-08-27 20:16:18.351 -0500>,<Administrator>,<X>,<proc1d>,<TOPSPIN 2.1>,
      <Start of raw data processing
       efp LB = 0.3 FT_mod = 6 PKNL = 1 PHC0 = 0 PHC1 = 0 SI = 128K 
       data hash MD5: 128K
       4C 2F D8 49 72 FB 88 D9 73 85 98 56 64 42 F2 88>)
(   3,<2016-08-27 20:16:19.242 -0500>,<Administrator>,<X>,<proc1d>,<TOPSPIN 2.1>,
      <pk PHC0 = -85.55054 PHC1 = 0 
       data hash MD5: 128K
       52 BA 04 E5 11 85 94 87 99 3E 26 32 32 57 BD 72>)
(   4,<2016-08-27 20:16:19.617 -0500>,<Administrator>,<X>,<proc1d>,<TOPSPIN 2.1>,
      <abs ABSG = 1 
       data hash MD5: 128K
       58 24 60 34 0F 0F FC E5 9D D1 66 6D A9 5B B7 96>)
(   5,<2016-08-27 20:16:19.711 -0500>,<Administrator>,<X>,<proc1d>,<TOPSPIN 2.1>,
      <abs ABSG = 2 
       data hash MD5: 128K
       6C 89 4C 22 92 C6 98 13 8C 0A 2F 47 BC 55 F6 20>)
(   6,<2016-08-27 20:16:19.804 -0500>,<Administrator>,<X>,<proc1d>,<TOPSPIN 2.1>,
      <abs ABSG = 3 
       data hash MD5: 128K
       90 09 D1 2A 1F 4F 76 2A 14 42 DB F0 B9 2A 41 B2>)
(   7,<2016-08-27 20:16:19.898 -0500>,<Administrator>,<X>,<proc1d>,<TOPSPIN 2.1>,
      <abs ABSG = 4 
       data hash MD5: 128K
       6B C1 5B 31 35 CF BF B1 B4 11 69 05 DA 7C 04 85>)
(   8,<2016-08-27 20:16:20.023 -0500>,<Administrator>,<X>,<proc1d>,<TOPSPIN 2.1>,
      <abs ABSG = 5 
       data hash MD5: 128K
       99 DC 05 98 B3 8A 95 CA B5 F7 47 89 0C B4 84 79>)
$$ ##END=
$$ 
$$ $$ hash MD5
$$ $$ F7 FF 88 95 13 A6 82 A1 1D 25 E8 15 B4 C7 FD 52
##$RELAX= 
##$RELAX= 
##$RELAX= 
##$RELAX= 
##$RELAX= 
##$RELAX= 
##$RELAX= 
##$RELAX= 
$$ Bruker specific parameters
$$ --------------------------
##$DU= <E:\>
##$EXPNO= 12
$$ [...]
150 150 150 150 150 150 150 150
##$TP07= 0
##$TPNAME0= <>
##$TPNAME1= <>
##$TPNAME2= <>
##$TPNAME3= <>
##$TPNAME4= <>
##$TPNAME5= <>
##$TPNAME6= <>
##$TPNAME7= <>
##$TPOAL= (0..7)
0.5 0.5 0.5 0.5 0.5 0.5 0.5 0.5
##$TPOFFS= (0..7)
0 0 0 0 0 0 0 0
##$TUNHIN= 0
##$TUNHOUT= 0
##$TUNXOUT= 0
##$USERA1= <user>
##$USERA2= <user>
##$USERA3= <user>
##$USERA4= <user>
##$USERA5= <user>
##$V9= 5
##$VALIST= <valist>
##$VCLIST= <CCCCCCCCCCCCCCC>
##$VD= 0
##$VDLIST= <DDDDDDDDDDDDDDD>
##$VPLIST= <PPPPPPPPPPPPPPP>
##$VTLIST= <TTTTTTTTTTTTTTT>
##$WBST= 1024
##$WBSW= 4
##$XGAIN= (0..3)
0 0 0 0
##$XL= 0
##$YL= 0
##$YMAX_a= 6797607
##$YMIN_a= -14024222
##$ZGOPTNS= <>
##$ZL1= 120
##$ZL2= 120
##$ZL3= 120
##$ZL4= 120
##$ABSF1= 14.9627
##$ABSF2= -5.595482
##$ABSG= 5
##$ABSL= 3
##$ALPHA= 0
##$AQORDER= 0
##$ASSFAC= 0
##$ASSFACI= 0
##$ASSFACX= 0
##$ASSWID= 0
##$AUNMP= <proc_prof1d_extract.lims>
##$AXLEFT= 0
##$AXNAME= <>
##$AXNUC= <1H>
##$AXRIGHT= 0
##$AXTYPE= 0
##$AXUNIT= <>
##$AZFE= 0.1
##$AZFW= 0.1
##$BCFW= 0
##$BC_mod= 0
##$BYTORDP= 0
##$COROFFS= 0
##$CY= 15
##$DATMOD= 1
##$DC= 0
##$DFILT= <>
##$DTYPP= 0
##$F1P= 0
##$F2P= 0
##$FCOR= 0.5
##$FTSIZE= 131072
##$FT_mod= 6
##$GAMMA= 0
##$GB= 0
##$INTBC= 1
##$INTSCL= 1
##$ISEN= 128
##$LB= 0.3
##$LEV0= 0
##$LPBIN= 0
##$MAXI= 10000
##$MC2= 0
##$MEAN= 0
##$ME_mod= 0
##$MI= 0
##$NCOEF= 0
##$NC_proc= -2
##$NLEV= 6
##$NOISF1= 0
##$NOISF2= 0
##$NSP= 0
##$NTH_PI= 0
##$NZP= 0
##$OFFSET= 14.9627
##$PC= 1
##$PHC0= -85.55054
##$PHC1= 0
##$PH_mod= 1
##$PKNL= yes
##$PPARMOD= 0
##$PPDIAG= 0
##$PPIPTYP= 0
##$PPMPNUM= 2147483647
##$PPRESOL= 1
##$PSCAL= 4
##$PSIGN= 0
##$PYNMP= <proc.py>
##$REVERSE= no
##$SF= 400.020008955398
##$SI= 131072
##$SIGF1= 0
##$SIGF2= 0
##$SINO= 400
##$SIOLD= 131072
##$SPECTYP= <>
##$SREGLST= <1H.CDCl3>
##$SSB= 0
##$STSI= 131072
##$STSR= 0
##$SW_p= 8223.68421052631
##$SYMM= 0
##$S_DEV= 0
##$TDeff= 65536
##$TDoff= 0
##$TI= <>
##$TILT= no
##$TM1= 0
##$TM2= 0
##$TOPLEV= 0
##$USERP1= <user>
##$USERP2= <user>
##$USERP3= <user>
##$USERP4= <user>
##$USERP5= <user>
##$WDW= 1
##$XDIM= 131072
##$YMAX_p= 403831571
##$YMIN_p= -10761
##$CURPLOT= <Network HP LaserJet P1505>
##$CURPRIN= <$Network HP LaserJet P1505>
##$DFORMAT= <normdp>
##$LAYOUT= <+/1D_H.xwp>
##$LFORMAT= <normlp>
##$PFORMAT= <normpl>
##$SURQMSG= 1
$$ End of Bruker specific parameters
$$ ---------------------------------
##NTUPLES= NMR SPECTRUM
##VAR_NAME=  FREQUENCY,     SPECTRUM/REAL,   SPECTRUM/IMAG
##SYMBOL=    X,             R,               I
##VAR_TYPE=  INDEPENDENT,   DEPENDENT,       DEPENDENT
##VAR_FORM=  AFFN,          ASDF,            ASDF
##VAR_DIM=   131072,        131072,          131072
##UNITS=     HZ,            ARBITRARY UNITS, ARBITRARY UNITS
##FACTOR=    0.0627417313425164, 1,          1
##FIRST=     8223.62146879497, -1626,        -50385
##LAST=      0,             106,             -51962
##MIN=       0,             -10761,          0
##MAX=       8223.62146879497, 403831571,    0
$$ Real data points
##PAGE= N=1
##DATA TABLE= (X++(R..R)), XYDATA
$$ [...]
$$ plain form
61065 488087 490617 494011 497032 498263 497625 496448 495784 495508 495428 496213 498453 501665 505103 508831 513146 517666
61049 517666 522003 526721 532529 538936 544804 549937 555126 560917 567382 574837 583676 593584 603844 614359
61035 614359 625517 637266 649265 661717 675124 689411 704265 720052 737321 755711 774528
61024 774528 794202 815881 839779 865299 892633 922676 955308 989360 1024413 1061020 1098950
61013 1098950 1137062 1175504 1216436 1262052 1313474 1372072 1439850 1517487 1603690 1697534 1800052
61002 1800052 1913110 2039185 2183757 2355978 2565753 2822305 3136646 3522025 3989946
60993 3989946 4550338 5220662 6033197 7031532 8266072 9794402 11659422 13817963 16061927
60984 16061927 18034783 19388317 19978405 19934994 19556162 19143925 18921138 19032030 19524882
$$ packed form
61065D88087K530L394L021J231o38j177o64k76q0P85K240L212L438L728M315M520
61049E17666M337M718N808O407N868N133N189N791O465P455Q839R908J0260J0515
61035F14359J1158J1749J1999J2452J3407J4287J4854J5787J7269J8390J8817
61024G74528J9674K1679K3898K5520K7334L0043L2632L4052L5053L6607L7930
61013A098950L8112L8442M0932M5616N1422N8598O7778P7637Q6203R3844J02518
61002A800052J13058J26075J44572J72221K09775K56552L14341L85379M67921
60993C989946N60392O70324Q12535R98335J234540J528330J865020K158541K243964
60984A6061927J972856J353534N90088m3411l78832m12237k22787J10892M92852
$$ plain form
60975 19524882 20281044 20987445 21251650 20808469 19652114 17993641 16108337 14211732 12429420
60966 12429420 10822876 9414517 8199841 7159882 6274237 5525040 4893955 4362129 3913864
60957 3913864 3537061 3220001 2950476 2718271 2516169 2338339 2179790 2037634 1910896
60948 1910896 1798386 1697972 1608103 1528530 1459032 1398529 1345627 1298804 1255711 1213502 1170457
60937 1170457 1126600 1082587 1038966 996651 956809 919616 883982 849070 815364 783869 755055
60926 755055 729026 705801 684772 664704 645011 626517 610262 596053 582852 570118 558065
60915 558065 546966 536892 527917 519945 512531 505381 498828 493296 488530 483918 479375 475286 471700 468226
60901 468226 464733 461518 458620 455499 451711 447568 443823 440885 438635 436885 435744 435399 435743 436476 437602
$$ packed form
60975A9524882P56162P06401K64205m43181j156355j658473j885304j896605j782312
60966A2429420j606544j408359j214676j039959q85645p49197o31085n31826m48265
60957C913864l76803l17060k69525k32205k02102j77830j58549j42156j26738
60948A910896j12510j00414q9869p9573o9498o0503n2902m6823m3093m2209m3045
60937A170457m3857m4013m3621m2315l9842l7193l5634l4912l3706l1495k8814
60926G55055k6029k3225k1029k0068j9693j8494j6255j4209j3201j2734j2053
60915E58065j1099j0074q975p972p414p150o553n532m766m612m543m089l586l474
60901D68226l493l215k898l121l788m143l745k938k250j750j141l45L44P33J126
$$ plain form
60886 437602 439614 442999 447737 453459 459910 466911 474082 481105 488211 495831 503740 511102 517529 523447
60872 523447 529098 533816 536806 538219 538874 539189 538920 537761 535620 532412 528102 523057 517991 513422 509362
60857 509362 505584 502043 499026 497002 496288 496834 498387 500811 504047 507841 511844 515983 520366 524847 529164
60842 529164 533504 538287 543261 547599 551242 555407 561214 568423 576134 584117 592684 601730 610799 619861
60828 619861 629221 638812 648248 657380 666158 674234 681470 688615 696532 704825 712150 717957 723003 727979
60814 727979 732532 736001 738381 740049 741053 741106 739932 737356 733366 728287 722493 715814 707639 697814 687017
60799 687017 676073 665292 654679 644430 635002 626930 620662 616214 612933 610045 607554 606178 606283
60786 606283 607363 608769 610445 612654 615346 618169 620864 623388 625794 628110 630252 632033 633456 634850
$$ packed form
60886D37602K012L385M738N722O451P001P171P023P106P620P909P362O427N918
60872E23447N651M718K990J413O55L15k69j159k141l208m310n045n066m569m060
60857E09362l778l541l017k024p14N46J553K424L236L794M003M139M383M481M317
60842E29164M340M783M974M338L643M165N807P209P711P983Q567R046R069R062
60828F19861R360R591R436R132Q778Q076P236P145P917Q293P325N807N046M976
60814G27979M553L469K380J668J004N3j174k576l990n079n794o679q175r825j0797
60799F87017j0944j0781j0613j0249r428q072o268m448l281k888k491j376J05
60786F06283J080J406J676K209K692K823K695K524K406K316K142J781J423J394
$$ plain form
60772 634850 636434 637918 638950 639873 641448 643904 646812 649888 653212 656634 659738 662694 666451 671675
60758 671675 678042 684893 692042 699577 707432 715604 724304 733471 742572 751280 759906 768665 776925 783699
60744 783699 788593 791841 793701 794333 794107 793569 793170 793233 793963 795201 796402 797100 797242 796903 796002 794450 792200
60727 792200 788911 784036 777521 770013 762061 753550 744250 734407 724300 713704 702367 690664 679146
60714 679146 667790 656263 644693 633482 622534 611363 599977 589052 579216 570637 563397 557733
60702 557733 553732 551121 549520 548736 548770 549726 551760 554986 559394 564888 571246 577995 584563 590649 596233
60687 596233 601131 604931 607487 608978 609189 607239 602504 595386 586721 576837 565847 554482 543810 534105
60673 534105 524656 514881 505141 496365 489228 483832 479834 476722 474155 472154 470939 470660 471334 472796 474556
$$ packed form
60772F34850J584J484J032R23J575K456K908L076L324L422L104K956L757N224
60758F71675O367O851P149P535P855Q172Q700R167R101Q708Q626Q759Q260O774
60744G83699M894L248J860O32k26n38l99O3P30J238J201O98J42l39r01j552k250
60727G92200l289m875o515p508p952q511r300r843j0107j0596j1337j1703j1518
60714F79146j1356j1527j1570j1211j0948j1171j1386j0925r836q579p240n664
60702E57733m001k611j601p84L4R56K034L226M408N494O358O749O568O086N584
60687E96233M898L800K556J491K11j950m735p118q665r884j0990j1365j0672r705
60673E34105r449r775r740q776p137n396l998l112k567k001j215k79O74J462J760
$$ plain form
60658 474556 476024 477169 478710 481280 484621 487950 490896 493688 496552 499383 501973 504180 505898 507132
60644 507132 508103 509105 510342 512080 514717 518448 522990 527857 532790 537839 543323 549876 558108 567940
60630 567940 578637 589687 601147 612855 624083 634599 645351 657194 669398 680475 690182 699593
60618 699593 709254 718445 726530 734014 741767 749914 758029 765869 773380 780310 786250 790804 793490 793703
60604 793703 791083 785728 777934 767887 755775 741953 726828 710797 694427 678539 663984 651376
60592 651376 641009 632852 626633 622050 618875 616804 615417 614530 614398 615286 616912 618604 620032 621527 623743
60577 623743 627072 631210 635174 637993 639619 640894 642447 644016 645107 645796 646345 646460 645620 643871 641638
60562 641638 638929 635404 631149 626751 622634 618892 615705 613343 611773 610812 610695 611935 614710 618956 625082
$$ packed form
60658D74556J468J145J541K570L341L329K946K792K864K831K590K207J718J234
60644E07132R71J002J237J738K637L731M542M867M933N049N484O553Q232R832
60630E67940J0697J1050J1460J1708J1228J0516J0752J1843J2204J1077R707R411
60618F99593R661R191Q085P484P753Q147Q115P840P511O930N940M554K686K13
60604G93703k620n355p794j0047j2112j3822j5125j6031j6370j5888j4555j2608
60592F51376j0367q157o219m583l175k071j387q87j32Q88J626J692J428J495K216
60577F23743L329M138L964K819J626J275J553J569J091O89N49J15q40j749k233
60562F41638k709l525m255m398m117l742l187k362j570r61j17J240K775M246O126
$$ plain form
60547 625082 633973 646157 661458 679561 700563 725042 753979 788246 827383 868765 908565 943552
60535 943552 971566 990709 999291 996868 984637 964604 938994 910477 881946 855431 831702 811186
60523 811186 794652 782735 775398 772259 773034 777321 784327 793013 802170 810432 816959 822387 828443 836324
60509 836324 846001 857326 871086 888488 910261 936848 969106 1008365 1056087 1113831 1183195 1265489
60497 1265489 1361692 1472789 1599637 1742420 1901018 2076434 2271376 2489161 2732303 3001625
60487 3001625 3294389 3601022 3903438 4177745 4399721 4549133 4611731 4580700 4458344 4256523
60477 4256523 3994665 3695981 3383201 3074946 2783829 2516749 2276527 2063463 1876245
60468 1876245 1712556 1569565 1444343 1334276 1237437 1152424 1077759 1011619 952291 898636
$$ packed form
60547F25082Q891J2184J5301J8103K1002K4479K8937L4267L9137M1382L9800L4987
60535I43552K8014J9143Q582k423j2231k0033k5610k8517k8531k6515k3729k0516
60523H11186j6534j1917p337l139P75M287P006Q686R157Q262O527N428O056P881
60509H36324R677J1325J3760J7402K1773K6587L2258L9259M7722N7744O9364Q2294
60497A265489R6203J11097J26848J42783J58598J75416J94942K17785K43142K69322
60487C001625K92764L06633L02416K74307K21976J49412O2598l1031j22356k01821
60477D256523k61858k98684l12780l08255k91117k67080k40222k13064j87218
60468A876245j63689j42991j25222j10067r6839q5013p4665o6140n9328n3655
$$ plain form
60458 898636 849999 805963 766320 730987 699723 672138 647993 627077 608624 591350 574371
60447 574371 557774 542114 527755 514943 503953 494646 486246 478021 469976 462614 456327 451347 447824
60434 447824 445421 443133 440045 436086 431628 426610 420668 414027 407707 402766 399667 398428 399008 401407
60420 401407 405473 410605 415653 419382 421240 421618 421336 421188 421931 424090 427389 430812 433711 436606 440450
60405 440450 445409 450797 456004 460926 465627 470115 474603 479635 485718 492894 500578 507867 514204 519825
60391 519825 525290 530569 535022 538392 541240 544080 546703 548854 551036 553913 557219 559978 561703 562666
60377 562666 563030 562397 560423 557357 553708 549676 545227 540569 536360 533231 531066 528899 525953 522781 520883
60362 520883 520994 522250 523430 524431 525942 528144 530552 532979 535854 539466 543531 547587 551358 554638
$$ packed form
60458H98636m8637m4036l9643l5333l1264k7585k4145k0916j8453j7274j6979
60447E74371j6597j5660j4359j2812j0990r307q400q225q045p362o287m980l523
60434D47824k403k288l088l959m458n018n942o641o320m941l099j239N80K399
60420D01407M066N132N048L729J858L78k82j48P43K159L299L423K899K895L844
60405D40450M959N388N207M922M701M488M488N032O083P176P684P289O337N621
60391E19825N465N279M453L370K848K840K623K151K182K877L306K759J725R63
60377E62666L64o33j974l066l649m032m449m658m209l129k165k167k946l172j898
60362E20883J11J256J180J001J511K202K408K427K875L612M065M056L771L280
$$ plain form
60348 554638 557254 559231 560624 561175 560600 559221 557754 556310 554124 550564 545988 541263 536822 532658 528987
60333 528987 526310 524740 523756 522919 522601 523633 526245 529638 532728 535067 536907 538627 540456 542628 545363
60318 545363 548608 552068 555513 558747 561267 562417 562093 560981 559852 558857 557642 555912 553668 551135 548653
60303 548653 546446 544366 542049 539370 536539 533694 530711 527443 523859 519986 516140 513110 511466 510620
60289 510620 509293 507114 505048 503966 503642 503665 504477 506700 510063 513879 518126 523138 528536 533419 537586
60274 537586 541697 546210 550878 555436 560163 565487 571452 577715 583849 589632 595248 601154 607545 614229
60260 614229 621243 629207 638612 649088 659933 671100 683086 696104 710013 724929 741237 759053
60248 759053 778272 799105 821983 846973 873873 902936 934948 970597 1010345 1054861 1104932
$$ packed form
60348E54638K616J977J393N51n75j379j467j444k186l560m576m725m441m164l671
60333E28987k677j570r84q37l18J032K612L393L090K339J840J720J829K172K735
60318E45363L245L460L445L234K520J150l24j112j129r95j215j730k244k533k482
60303E48653k207k080k317k679k831k845k983l268l584l873l846l030j644q46
60289E10620j327k179k066j082l24K3Q12K223L363L816M247N012N398M883M167
60274E37586M111M513M668M558M727N324N965O263O134N783N616N906O391O684
60260F14229P014P964R405J0476J0845J1167J1986J3018J3909J4916J6308J7816
60248G59053J9219K0833K2878K4990K6900K9063L2012L5649L9748M4516N0071
$$ plain form
60237 1104932 1160775 1221985 1288295 1359905 1436868 1518597 1604111 1692267 1781583 1870228 1956436
60226 1956436 2038726 2115724 2186217 2249401 2304694 2351189 2387724 2413600 2428880 2433978 2429398 2416044
60214 2416044 2395361 2368996 2338627 2306150 2273574 2242504 2214009 2189136 2169193 2155343 2148175
60203 2148175 2147836 2154472 2168533 2190908 2222762 2264886 2317162 2378896 2449573 2528763 2615273 2706890
60191 2706890 2801107 2895523 2987324 3073038 3149534 3215146 3269424 3311907 3341526 3357117 3358080 3344379
60179 3344379 3316211 3274002 3218803 3152685 3078713 3000529 2921771 2845528 2774007 2708586 2650296
60168 2650296 2600306 2559941 2530283 2511930 2505066 2509500 2524654 2549864 2584749 2628925 2681157 2739065
60156 2739065 2799727 2860175 2917229 2967587 3008738 3039627 3060098 3070014 3069301 3058483 3038650 3011093
$$ packed form
60237A104932N5843O1210O6310P1610P6963Q1729Q5514Q8156Q9316Q8645Q6208
60226A956436Q2290P6998P0493O3184N5293M6495L6535K5876J5280N098m580j3354
60214B416044k0683k6365l0369l2477l2576l1070k8495k4873j9943j3850p168
60203B148175l39O636J4061K2375L1854M2124N2276O1734P0677P9190Q6510R1617
60191B706890R4217R4416R1801Q5714P6496O5612N4278M2483K9619J5591R63j3701
60179C344379k8168m2209n5199o6118p3972p8184p8758p6243p1521o5421n8290
60168B650296m9990m0365k9658j8353o864M434J5154K5210L4885M4176N2232N7908
60156B739065O0662O0448N7054N0358M1151L0889K0471R916p13j0818j9833k7557
$$ plain form
60144 3011093 2977424 2939828 2900735 2862393 2827093 2797512 2776195 2764717 2763730 2773680 2795161 2828910
60132 2828910 2875980 2937737 3015164 3108247 3216609 3340639 3481599 3640717 3818580 4015170
60122 4015170 4229836 4461275 4707866 4967804 5238345 5515099 5792694 6066027 6330341
60113 6330341 6580359 6810291 7015022 7190869 7335152 7445532 7519826 7556027 7552488 7508513
60103 7508513 7424837 7303330 7146635 6958710 6745511 6514417 6272924 6028149 5786947 5555241
60093 5555241 5337035 5134814 4951009 4788282 4648302 4531197 4436640 4364798 4315909 4289633
60083 4289633 4285269 4302080 4338853 4393310 4462228 4541835 4627936 4716002 4801448 4879752 4946478
60072 4946478 4997734 5030960 5045209 5040803 5018929 4981227 4929084 4863174 4783985 4692616 4590648
$$ packed form
60144C011093l3669l7596l9093l8342l5300k9581k1317j1478r87R950K1481L3749
60132B828910M7070O1757P7427R3083J08362J24030J40960J59118J77863J96590
60122D015170K14666K31439K46591K59938K70541K76754K77595K73333K64314
60113F330341K50018K29932K04731J75847J44283J10380P4294L6201l539m3975
60103G508513q3676j21507j56695j87925k13199k31094k41493k44775k41202k31706
60093E555241k18206k02221j83805j62727j39980j17105r4557p1842m8889k6276
60083D289633m364J6811L6773N4457O8918P9607Q6101Q8066Q5446P8304O6726
60072D946478N1256L3226J4249m406k1874l7702n2143o5910p9189r1369j01968
$$ plain form
60061 4590648 4479526 4360703 4236298 4108931 3980968 3854476 3731701 3614832 3505390
60052 3505390 3404594 3314234 3236265 3171480 3119487 3080112 3053925 3041317 3042086 3056257 3084329
60041 3084329 3126244 3180926 3247330 3325088 3413453 3510147 3611717 3714487 3814710 3908469 3992138
60030 3992138 4062748 4117721 4154829 4172819 4171619 4151522 4112618 4055353 3981176 3892340 3791563
60019 3791563 3682191 3568174 3453396 3341279 3235013 3137372 3049843 2972484 2905134 2848376
60009 2848376 2803096 2769728 2748416 2739381 2742674 2757974 2785088 2824380 2876460 2941884 3021377 3115677
59997 3115677 3224594 3346459 3478641 3618015 3760646 3901626 4035872 4158890 4266851
59988 4266851 4356703 4426717 4476378 4505237 4512278 4496610 4458196 4397707 4316561 4217741 4105901
$$ packed form
60061D590648j11122j18823j24405j27367j27963j26492j22775j16869j09442
60052C505390j00796r0360p7969o4785n1993l9375k6187j2608P69J4171K8072
60041C084329M1915N4682O6404P7758Q8365R6694J01570J02770J00223R3759Q3669
60030C992138P0610N4973L7108J7990j200k0097l8904n7265p4177q8836j00777
60019C791563j09372j14017j14778j12117j06266r7641q7529p7359o7350n6758
60009B848376m5280l3368k1312r035L293J5300K7114L9292N2080O5424P9493R4300
59997C115677J08917J21865J32182J39374J42631J40980J34246J23018J07961
59988D266851Q9852P0014M9661K8859P041j5668l8414o0489q1146r8820j11840
$$ plain form
59977 4105901 3985970 3862043 3738004 3618323 3507241 3407446 3320198 3246381 3186747 3141468
59967 3141468 3110224 3092726 3088740 3097777 3119208 3152511 3197115 3252208 3316901 3390164 3470339 3555168
59955 3555168 3642570 3730813 3817690 3900261 3975978 4043369 4101174 4147652 4181679 4203907 4215890
59944 4215890 4218469 4212001 4197951 4179317 4159568 4142014 4130190 4127917 4138651 4165188 4210046 4275609
59932 4275609 4363809 4476137 4614116 4779410 4973289 5196111 5447227 5725009 6026589 6347273
59922 6347273 6679987 7015267 7342017 7648182 7920767 8146094 8311678 8408871 8433933 8387188
59912 8387188 8272389 8097127 7872530 7611284 7325676 7027018 6725465 6429285 6144682
59903 6144682 5876733 5629848 5406841 5208416 5034459 4885432 4761974 4663912 4590549 4541644
$$ packed form
59977D105901j19931j23927j24039j19681j11082r9795q7248p3817n9634m5279
59967C141468l1244j7498l986R037K1431L3303M4604N5093O4693P3263Q0175Q4829
59955C555168Q7402Q8243Q6877Q2571P5717O7391N7805M6478L4027K2228J1983
59944D215890K579o468j4050j8634j9749j7554j1824k273J0734K6537M4858O5563
59932D275609Q8200J12328J37979J65294J93879K22822K51116K77782L01580L20684
59922F347273L32714L35280L26750L06165K72585K25327J65584R7193K5062m6745
59912H387188j14799j75262k24597k61246k85608k98658l01553k96180k84603
59903F144682k67949k46885k23007j98425j73957j49027j23458r8062p3363m8905
$$ plain form
59893 4541644 4517341 4517446 4541319 4588147 4656902 4746397 4855608 4983183 5125975 5278576 5434636
59882 5434636 5587849 5731244 5856723 5956413 6023983 6054248 6042883 5988140 5892363 5760800
59872 5760800 5599478 5415096 5215753 5009709 4803280 4600898 4406680 4224380 4055898
59863 4055898 3901220 3759848 3631193 3513743 3405279 3304189 3209614 3120379 3035101 2953617
59853 2953617 2877257 2807493 2745153 2690994 2645959 2610551 2584699 2568282 2560822 2560593 2564985 2571892
59841 2571892 2579855 2586841 2590089 2587589 2578839 2563759 2541740 2512197 2475452 2432831 2386576 2339789
59829 2339789 2295541 2255453 2219500 2187123 2157786 2130412 2103476 2076371 2050224 2026988 2008216
59818 2008216 1994947 1988122 1988586 1996912 2013367 2037655 2068607 2104572 2144198 2186453 2229905 2272541
$$ packed form
59893D541644k4303J05K3873M6828O8755Q9495J09211J27575J42792J52601J56060
59882E434636J53213J43395J25479R9690O7570L0265j1365n4743r5777j31563
59872E760800j61322j84382j99343k06044k06429k02382j94218j82300j68482
59863D055898j54678j41372j28655j17450j08464j01090r4575q9235q5278q1484
59853B953617p6360o9764o2340n4159m5035l5408k5852j6417p460k29M392O907
59841B571892P963O986L248k500q750j5080k2019k9543l6745m2621m6255m6787
59829B339789m4248m0088l5953l2377k9337k7374k6936k7105k6147k3236j8772
59818B008216j3269o825M64Q326J6455K4288L0952L5965L9626M2255M3452M2636
$$ plain form
59806 2272541 2312380 2347847 2377620 2400664 2416483 2425068 2426880 2423458 2417592 2412031 2408135 2406450 2408193
59793 2408193 2415155 2428422 2448472 2476582 2515004 2565612 2629499 2708057 2803306 2916964 3050509
59782 3050509 3206607 3389228 3601611 3844798 4118192 4419550 4742289 5072351 5387871
59773 5387871 5662042 5868013 5985181 6005013 5932850 5784416 5580303 5342068 5089844 4839929
59763 4839929 4603067 4384999 4188440 4014459 3862899 3732804 3622849 3531318 3456150 3395580
59753 3395580 3348624 3314670 3292901 3282427 3282662 3293191 3313605 3343814 3384279 3435568 3497860 3571099
59741 3571099 3655426 3751352 3859829 3982201 4119699 4272948 4442496 4629963 4838085 5069448
59731 5069448 5325742 5608371 5919030 6259207 6629536 7029820 7458818 7913284 8387356
$$ packed form
59806B272541L9839L5467K9773K3044J5819Q585J812l422n866n561l896j685J743
59793B408193O962J3267K0050K8110L8422N0608O3887P8558R5249J13658J33545
59782C050509J56098J82621K12383K43187K73394L01358L22739L30062L15520
59773E387871K74171K05971J17168J9832p2163j48434k04113k38235k52224k49915
59763D839929k36862k18068j96559j73981j51560j30095j09955r1531p5168o0570
59753C395580m6956l3954k1769j0474K35J0529K0414L0209M0465N1289O2292P3239
59741C571099Q4327R5926J08477J22372J37498J53249J69548J87467K08122K31363
59731E069448K56294K82629L10659L40177L70329M00284M28998M54466M74072
$$ plain form
59722 8387356 8873022 9360726 9839651 10298796 10729142 11125224 11485173 11810661 12107607
59713 12107607 12385923 12657109 12931661 13218598 13525961 13859799 14222076 14609994 15017206
59704 15017206 15434949 15852020 16254798 16628418 16958637 17233350 17443441 17583313 17651409
59695 17651409 17650628 17588029 17473530 17318523 17135526 16938467 16741989 16559641 16402758 16280925
59685 16280925 16202725 16175525 16205043 16295811 16451999 16677558 16975813 17349199 17798953 18324376
59675 18324376 18921992 19585003 20302587 21058643 21830553 22588889 23298360 23920093 24415269
59666 24415269 24749552 24897209 24844425 24591711 24154357 23559807 22842832 22041133 21192490
59657 21192490 20332252 19490509 18690311 17947614 17271355 16662090 16110221 15596121 15093223
$$ packed form
59722H387356M85666M87704M78925M59145M30346L96082L59949L25488K96946
59713A2107607K78316K71186K74552K86937L07363L33838L62277L87918M07212
59704A5017206M17743M17071M02778L73620L30219K74713K10091J39872O8096
59695A7651409p81o2599j14499j55007j82997j97059j96478j82348j56883j21833
59685A6280925p8200k7200K9518R0768J56188K25559K98255L73386M49754N25423
59675A8324376N97616O63011P17584P56056P71910P58336P09471O21733M95176
59666B4415269L34283J47657n2784k52714m37354n94550p16975q01699q48643
59657B1192490q60238q41743q00198p42697o76259o09265n51869n14100n02898
$$ plain form
59648 15093223 14573712 14015559 13408463 12755650 12070782 11372428 10679198 10006638 9365767
59639 9365767 8763234 8202600 7685355 7211092 6777851 6383250 6025249 5701656 5409399
59630 5409399 5144975 4905590 4689563 4495714 4322630 4168469 4031324 3909798 3803118
59621 3803118 3710431 3630160 3560548 3500756 3450668 3409427 3374805 3344327 3316362 3289672 3262421
59610 3262421 3232301 3197468 3156982 3110589 3058425 3000810 2938182 2871464 2802513 2733705 2666763
59599 2666763 2602254 2540321 2481436 2426248 2375274 2329161 2288804 2254740 2226629 2203651 2185184
59588 2185184 2170985 2161051 2155582 2154759 2158269 2165198 2174562 2185740 2198400 2212346 2227552 2244003 2261408
59575 2261408 2279261 2297171 2314880 2332276 2349865 2369020 2391166 2416909 2446521 2480876 2520985
$$ packed form
59648A5093223n19511n58153o07096o52813o84868o98354o93230o72560o40871
59639I365767o02533n60634n17245m74263m33241l94601l58001l23593k92257
59630E409399k64424k39385k16027j93849j73084j54161j37145j21526j06680
59621C803118r2687q0271o9612n9792n0088m1241l4622l0478k7965k6690k7251
59610C262421l0120l4833m0486m6393n2164n7615o2628o6718o8951o8808o6942
59599B666763o4509o1933n8885n5188n0974m6113m0357l4064k8111k2978j8467
59588B185184j4199r934n469q23L510O929R364J1178J2660J3946J5206J6451J7405
59575B261408J7853J7910J7709J7396J7589J9155K2146K5743K9612L4355M0109
$$ plain form
59564 2520985 2566860 2617981 2674849 2738952 2811109 2891120 2979317 3077212 3186175 3306619 3438969
59553 3438969 3584217 3742774 3913715 4095790 4288188 4489689 4697948 4910229 5123927
59544 5123927 5335964 5542973 5742646 5933121 6109662 6263542 6386514 6476324 6536727 6572786
59534 6572786 6587614 6582944 6560586 6522656 6471603 6410646 6343578 6274052 6205698 6142938 6090926
59523 6090926 6054623 6038494 6046944 6084068 6152465 6252441 6382182 6538225 6715493 6906950 7103058
59512 7103058 7291875 7460643 7598106 7695367 7744929 7740278 7677347 7556008 7379767 7154867
59502 7154867 6890148 6596565 6285333 5966406 5648809 5341058 5049805 4778470 4528274
59493 4528274 4300247 4095373 3913451 3753218 3613602 3493938 3393200 3310030 3243537 3193366
$$ packed form
59564B520985M5875N1121N6868O4103P2157Q0011Q8197R7895J08963J20444J32350
59553C438969J45248J58557J70941J82075J92398K01501K08259K12281K13698
59544E123927K12037K07009J99673J90475J76541J53880J22972Q9810O0403L6059
59534F572786J4828m670k2358l7930n1053o0957o7068o9526o8354o2760n2012
59523F090926l6303j6129Q450L7124O8397R9976J29741J56043J77268J91457J96108
59512G103058J88817J68768J37463R7261M9562m651o2931j21339j76241k24900
59502G154867k64719k93583l11232l18927l17597l07751k91253k71335k50196
59493D528274k28027k04874j81922j60233j39616j19664j00738q3170o6493n0171
$$ plain form
59483 3193366 3159250 3141119 3139243 3153467 3182799 3226642 3285949 3362100 3455093 3563934 3688305
59472 3688305 3828444 3983460 4150979 4328354 4512864 4700506 4885693 5062328 5224281
59463 5224281 5364839 5477037 5555229 5595866 5596889 5557419 5478526 5363647 5217920 5047355
59453 5047355 4858316 4656814 4447964 4236371 4026684 3822976 3627698 3441983 3266754
59444 3266754 3102748 2949816 2807332 2675386 2554655 2445054 2345465 2254839 2172704 2098591
59434 2098591 2031913 1972527 1920554 1875536 1836578 1803336 1775988 1754242 1737324 1724940 1717217
59423 1717217 1713560 1712612 1713590 1716791 1722739 1731904 1745154 1762848 1782700 1799737 1809528 1811205 1807275
59410 1807275 1801487 1797304 1797156 1801920 1811451 1826265 1848069 1877702 1912783 1948187 1979146 2004010
$$ packed form
59483C193366l4116j8131j876J4224K9332M3843N9307P6151R2993J08841J24371
59472C688305J40139J55016J67519J77375J84510J87642J85187J76635J61953
59463E224281J40558J12198P8192M0637J023l9470p8893j14879j45727j70565
59453E047355j89039k01502k08850k11593k09687k03708j95278j85715j75229
59444C266754j64006j52932j42484j31946j20731j09601r9589r0626q2135p4113
59434B098591o6678n9386n1973m5018l8958l3242k7348k1746j6918j2384p723
59423A717217l657r48R78L201N948R165J3250J7694J9852J7037R791J677l930
59410A807275n788m183j48M764R531J4814K1804K9633L5081L5404L0959K4864
$$ plain form
59398 2004010 2024690 2045092 2068919 2098245 2133724 2175800 2225358 2283301 2350048 2425777 2511003
59387 2511003 2606863 2714999 2837094 2974287 3127213 3296906 3485411 3695181 3928348 4187135
59377 4187135 4474484 4793248 5144690 5528212 5941843 6381561 6839991 7306853 7771230
59368 7771230 8223071 8653223 9054031 9421076 9753782 10053760 10323030 10563914 10779521
59359 10779521 10973209 11147433 11302980 11438570 11550722 11634296 11683322 11691164 11650440 11554217
59349 11554217 11398198 11181797 10907562 10580619 10208757 9801695 9369211 8919991 8462186
59340 8462186 8004074 7553468 7116858 6699349 6304795 5935469 5591958 5273840 4980422
59331 4980422 4711086 4465553 4243848 4045441 3868385 3710035 3568602 3443306 3333110
$$ packed form
59398B004010K0680K0402K3827K9326L5479M2076M9558N7943O6747P5729Q5226
59387B511003R5860J08136J22095J37193J52926J69693J88505K09770K33167K58787
59377D187135K87349L18764L51442L83522M13631M39718M58430M66862M64377
59368G771230M51841M30152M00808L67045L32706K99978K69270K40884K15607
59359A0779521J93688J74224J55547J35590J12152Q3574M9026P842m0724r6223
59349A1554217j56019k16401k74235l26943l71862m07062m32484m49220m57805
59340H462186m58112m50606m36610m17509l94554l69326l43511l18118k93418
59331D980422k69336k45533k21705j98407j77056j58350j41433j25296j10196
$$ plain form
59322 3333110 3236417 3152215 3080400 3020454 2970761 2929823 2897304 2873263 2857049 2847672 2844728 2848436
59310 2848436 2859242 2877828 2904786 2939617 2980556 3025974 3075577 3129686 3187765 3248084 3308433
59299 3308433 3366675 3421108 3470872 3515853 3555884 3590437 3619378 3643557 3664369 3683254 3701924
59288 3701924 3722192 3744639 3767778 3789390 3808863 3827994 3849873 3877511 3913258 3958620 4013983
59277 4013983 4078401 4149713 4225043 4301376 4375718 4444687 4504356 4551023 4582124 4596276 4592914
59266 4592914 4572635 4537539 4490268 4432670 4366180 4293404 4218147 4143590 4071404 4002928 3940013
59255 3940013 3884020 3834919 3792257 3756335 3727649 3705610 3688632 3675146 3663871 3653396 3642192
59244 3642192 3629099 3613436 3594811 3573108 3548490 3521318 3492384 3463318 3436258 3412860 3394084
$$ packed form
59322C333110r6693q4202p1815n9946m9693m0938l2519k4041j6214r377k944L708
59310B848436J0806J8586K6958L4831M0939M5418M9603N4109N8079O0319O0349
59299C308433N8242N4433M9764M4981M0031L4553K8941K4179K0812J8885J8670
59288C701924K0268K2447K3139K1612J9473J9131K1879K7638L5747M5362N5363
59277D013983O4418P1312P5330P6333P4342O8969N9669M6667L1101J4152l362
59266D592914k0279l5096m7271n7598o6490p2776p5257p4557p2186o8476o2915
59255C940013n5993m9101m2662l5922k8686k2039j6978j3486j1275j0475j1204
59244C642192j3093j5663j8625k1703k4618k7172k8934k9066k7060k3398j8776
$$ plain form
59233 3394084 3381198 3376389 3382038 3399888 3431276 3477786 3541270 3623676 3727285 3854737 4008356
59222 4008356 4189564 4399018 4636774 4901804 5191320 5500369 5821388 6143879 6455094
59213 6455094 6741741 6991365 7192775 7336368 7414821 7423556 7360895 7228664 7032894 6783269
59203 6783269 6491421 6169741 5831041 5487579 5149275 4823013 4513732 4225410 3960642
59194 3960642 3720098 3503035 3308026 3133085 2975892 2834528 2707650 2593774 2490929
59185 2490929 2397273 2311465 2232330 2158935 2091290 2030152 1975737 1927262 1883973 1845841 1812874
59174 1812874 1784638 1760880 1741755 1726951 1715509 1707108 1702645 1702752 1706500 1712366 1719920 1729771 1742441
59161 1742441 1758040 1776671 1798453 1823443 1851990 1884693 1921596 1961933 2005098 2051311 2100937
$$ packed form
59233C394084j2886m809N649J7850L1388M6510O3484Q2406J03609J27452J53619
59222D008356J81208K09454K37756K65030K89516L09049L21019L22491L11215
59213F455094K86647K49624K01410J43593P8453Q735o2661j32231j95770k49625
59203F783269k91848l21680l38700l43462l38304l26262l09281k88322k64768
59194C960642k40544k17063j95009j74941j57193j41364j26878j13876j02845
59185B490929r3656q5808p9135p3395o7645o1138n4415m8475m3289l8132l2967
59174A812874k8236k3758j9125j4804j1442q401m463J07L748N866P554R851J2670
59161A742441J5599J8631K1782K4990K8547L2703L6903M0337M3165M6213M9626
$$ plain form
59150 2100937 2153798 2209537 2267876 2327997 2388461 2448392 2507964 2567057 2624177 2677429 2725766
59139 2725766 2768473 2804212 2831654 2850576 2861444 2864409 2859654 2848342 2832271 2812824 2790936 2767747
59127 2767747 2744539 2722436 2702928 2688265 2680458 2680108 2686903 2700983 2723114 2753831 2793237 2841457
59115 2841457 2898599 2964307 3037821 3118244 3204387 3294797 3388518 3485475 3585681 3688647 3794253
59104 3794253 3903710 4018930 4141318 4271745 4411034 4559376 4715288 4875703 5036693
59095 5036693 5193256 5338677 5465062 5564858 5631876 5661582 5651448 5601344 5513377 5391495
59085 5391495 5241239 5069016 4880784 4681381 4475233 4266874 4060182 3857556 3660440
59076 3660440 3470225 3288227 3115342 2952311 2799796 2657682 2524939 2400824 2285698
$$ packed form
59150B100937N2861N5739N8339O0121O0464N9931N9572N9093N7120N3252M8337
59139B725766M2707L5739K7442J8922J0868K965m755j1312j6071j9447k1888k3189
59127B767747k3208k2103j9508j4663p807l50O795J4080K2131L0717L9406M8220
59115B841457N7142O5708P3514Q0423Q6143R0410R3721R6957J00206J02966J05606
59104C794253J09457J15220J22388J30427J39289J48342J55912J60415J60990
59095E036693J56563J45421J26385R9796O7018K9706j0134n0104q7967j21882
59085E391495j50256j72223j88232j99403k06148k08359k06692k02626j97116
59076C660440j90215j81998j72885j63031j52515j42114j32743j24115j15126
$$ plain form
59067 2285698 2180002 2083019 1993325 1909982 1832670 1761184 1695420 1635347 1580407 1529593 1482568
59056 1482568 1439951 1401826 1366995 1334621 1305666 1281494 1261739 1244716 1229339 1215381 1202408
59045 1202408 1189897 1178178 1167988 1159105 1150528 1141920 1133878 1126840 1120679 1115389 1111401 1109235 1109446
59032 1109446 1112662 1118970 1127572 1137756 1149811 1164146 1179873 1195205 1209023 1221217 1231783 1240584
59020 1240584 1247863 1254198 1260042 1265963 1273022 1282130 1293246 1305752 1319181 1332920 1345870 1357340
59008 1357340 1367729 1377282 1384661 1387859 1386218 1380506 1371489 1359633 1345903 1331418 1316293 1299960
58996 1299960 1282734 1266063 1251144 1238198 1227076 1217660 1209611 1202584 1196860 1193100 1191463 1191490 1192670
58983 1192670 1194567 1196714 1199049 1202126 1206239 1210708 1214747 1218587 1223012 1228294 1234319 1241146 1248571 1255824
$$ packed form
59067B285698j05696r6983q9694q3343p7312p1486o5764o0073n4940n0814m7025
59056A482568m2617l8125l4831l2374k8955k4172j9755j7023j5377j3958j2973
59045A202408j2511j1719j0190q883q577q608q042p038o161n290l988k166K11
59032A109446L216O308Q602J0184J2055J4335J5727J5332J3818J2194J0566Q801
59020A240584P279O335N844N921P059R108J1116J2506J3429J3739J2950J1470
59008A357340J0389R553P379L198j641n712r017j1856j3730j4485j5125j6333
58996A299960j7226j6671j4919j2946j1122r416q049p027n724l760j637K7J180
58983A192670J897K147K335L077M113M469M039L840M425N282O025O827P425P253
$$ plain form
58969 1255824 1262803 1270952 1281794 1295159 1310018 1326438 1345251 1366271 1388350 1410949 1434258 1457933
58957 1457933 1481127 1503714 1526165 1548248 1569066 1588291 1606231 1622896 1638296 1653542 1670371
58946 1670371 1689537 1710723 1733837 1759222 1786876 1816779 1849903 1887594 1930066 1976703 2027575
58935 2027575 2083282 2143528 2207425 2275112 2347577 2424926 2506368 2592026 2683283 2781294 2886709
58924 2886709 3000924 3125993 3263066 3412416 3575240 3753840 3949724 4163124 4394873
58915 4394873 4647263 4922540 5221956 5546914 5899686 6282293 6695620 7139915 7614814
58906 7614814 8118105 8645257 9190199 9745317 10300236 10841732 11355181 11825197 12235180
58897 12235180 12568438 12811354 12955451 12996987 12936301 12778271 12532131 12209983 11825558 11393509
$$ packed form
58969A255824O979Q149J0842J3365J4859J6420J8813K1020K2079K2599K3309K3675
58957A457933K3194K2587K2451K2083K0818J9225J7940J6665J5400J5246J6829
58946A670371J9166K1186K3114K5385K7654K9903L3124L7691M2472M6637N0872
58935B027575N5707O0246O3897O7687P2465P7349Q1442Q5658R1257R8011J05415
58924B886709J14215J25069J37073J49350J62824J78600J95884K13400K31749
58915D394873K52390K75277K99416L24958L52772L82607M13327M44295M74899
58906G614814N03291N27152N44942N55118N54919N41496N13449M70016M09983
58897A2235180L33258K42916J44097M1536o0686j58030k46140l22148l84425m32049
$$ plain form
58887 11393509 10927708 10439308 9937282 9430729 8929228 8440780 7970950 7524207 7104287
58878 7104287 6712684 6348474 6010453 5698158 5410296 5143876 4895969 4665229 4450985
58869 4450985 4252066 4067268 3895793 3736522 3587936 3449426 3321573 3204549 3097322
58860 3097322 2998956 2909386 2828223 2754027 2685533 2622559 2565124 2512798 2465523 2423915 2388082
58849 2388082 2357278 2331260 2310779 2296108 2286375 2281055 2280828 2286175 2296285 2310180 2327849 2349576
58837 2349576 2375279 2405184 2439970 2479504 2522673 2569289 2621006 2679512 2744927 2816753 2895295
58826 2895295 2981261 3075030 3177116 3288386 3409191 3539360 3679708 3832386 3999177 4180782
58816 4180782 4378508 4595218 4833706 5095415 5381661 5694711 6036563 6407835 6808749
$$ packed form
58887A1393509m65801m88400n02026n06553n01501m88448m69830m46743m19920
58878G104287l91603l64210l38021l12295k87862k66420k47907k30740k14244
58869D450985j98919j84798j71475j59271j48586j38510j27853j17024j07227
58860C097322r8366q9570q1163p4196o8494o2974n7435n2326m7275m1608l5833
58849B388082l0804k6018k0481j4671r733n320k27N347J0110J3895J7669K1727
58837B349576K5703K9905L4786L9534M3169M6616N1717N8506O5415P1826P8542
58826B895295Q5966R3769J02086J11270J20805J30169J40348J52678J66791J81605
58816D180782J97726K16710K38488K61709K86246L13050L41852L71272M00914
$$ plain form
58807 6808749 7239764 7699931 8185599 8691552 9211883 9738253 10258364 10757376 11219958
58798 11219958 11630090 11970780 12226505 12386401 12444828 12400392 12256121 12020006 11703992 11322297
58788 11322297 10890489 10424312 9937614 9441697 8946946 8463612 7999817 7560041 7146829
58779 7146829 6762956 6410776 6090534 5800384 5536583 5292225 5057341 4822972 4585624
58770 4585624 4347243 4111992 3884219 3667998 3466046 3278736 3105283 2945544 2799685
58761 2799685 2666808 2545265 2433879 2331860 2238230 2152569 2075719 2008461 1949989 1898744
58751 1898744 1854067 1815822 1783059 1754354 1729034 1706922 1687415 1669944 1654696 1641712 1629842
58740 1629842 1617702 1605015 1591804 1576975 1559032 1537722 1513714 1487191 1458097 1427271 1395979
$$ packed form
58807F808749M31015M60167M85668N05953N20331N26370N20111M99012M62582
58798A1219958M10132L40690K55725J59896N8427m4436j44271k36115l16014l81695
58788A1322297m31808m66177m86698m95917m94751m83334m63795m39776m13212
58779G146829l83873l52180l20242k90150k63801k44358k34884k34369k37348
58770D585624k38381k35251k27773k16221k01952j87310j73453j59739j45859
58761B799685j32877j21543j11386j02019r3630q5661p6850o7258n8472n1245
58751A898744m4677l8245l2763k8705k5320k2112j9507j7471j5248j2984j1870
58740A629842j2140j2687j3211j4829j7943k1310k4008k6523k9094l0826l1292
$$ plain form
58729 1395979 1364616 1333055 1301945 1272425 1244822 1218644 1193563 1169413 1145641 1121767 1098104
58718 1098104 1075160 1052819 1030924 1010075 990950 973416 957203 942730 930271 919114 908670
58707 908670 899707 893165 888313 883228 876678 868492 858695 847453 835396 822952 809803 795816 781851
58694 781851 768685 755986 743316 731260 720399 710115 699779 690276 682963 677799 673932 671427
58682 671427 670938 672230 674517 677841 682829 689628 698386 710156 725793 744349 764008 784272 805959
58669 805959 829513 854907 883084 916128 955728 1001828 1051875 1100174 1138640 1159958 1160739 1141946
58657 1141946 1107575 1063601 1016519 970826 927987 888473 853595 824282 799485 777634 758785
58646 758785 743804 732389 723637 717668 714911 714549 715481 718114 723354 730464 737852 745466 754530 765381
$$ packed form
58729A395979l1363l1561l1110k9520k7603k6178k5081k4150k3772k3874k3663
58718A098104k2944k2341k1895k0849j9125j7534j6213j4473j2459j1157j0444
58707I08670q963o542m852n085o550q186r797j1242j2057j2444j3149j3987j3965
58694G81851j3166j2699j2670j2056j0861j0284j0336r503p313n164l867k505
58682F71427m89J292K287L324M988O799Q758J1770J5637J8556J9659K0264K1687
58669H05959K3554K5394K8177L3044L9600M6100N0047M8299L8466K1318P81j8793
58657A141946l4371m3974m7082m5693m2839l9514l4878k9313k4797k1851j8849
58646G58785j4981j1415q752n969k757l62R32K633N240P110P388P614R064J0851
$$ plain form
58632 765381 777453 791051 807176 825770 845870 867414 891353 918190 947955 981332 1019291
58621 1019291 1061884 1108785 1160688 1218747 1283174 1353896 1432120 1519673 1617285 1724899 1843001
58610 1843001 1971955 2110631 2257263 2410888 2570094 2730897 2887607 3035008 3167806
58601 3167806 3278927 3361023 3409817 3424435 3405409 3354724 3277375 3180197 3068721 2946727 2818281
58590 2818281 2687853 2558478 2431851 2310141 2195695 2089019 1989045 1895402 1808677 1728731
58580 1728731 1654744 1586653 1524747 1468210 1416128 1369396 1329391 1295206 1264535 1236879 1213376
58569 1213376 1193810 1176525 1161245 1149186 1140189 1132403 1125135 1119400 1115201 1110737 1104788 1097564 1088838
58556 1088838 1077748 1065104 1053575 1044904 1038751 1034433 1031350 1027262 1018678 1003946 984232 961251
$$ packed form
58632G65381J2072J3598J6125J8594K0100K1544K3939K6837K9765L3377L7959
58621A019291M2593M6901N1903N8059O4427P0722P8224Q7553R7612J07614J18102
58610A843001J28954J38676J46632J53625J59206J60803J56710J47401J32798
58601C167806J11121Q2096M8794J4618j9026n0685p7349r7178j11476j21994j28446
58590B818281j30428j29375j26627j21710j14446j06676r9974r3643q6725p9946
58580A728731p3987o8091o1906n6537n2082m6732m0005l4185l0671k7656k3503
58569A213376j9566j7285j5280j2059q997p786p268n735m199m464n949p224q726
58556A088838j1090j2644j1529q671o153m318l083m088q584j4732j9714k2981
$$ plain form
58544 961251 936163 910790 887248 865706 844784 824699 807572 794057 782285 770993 761260 754086
58532 754086 748563 743585 739323 735914 732631 729319 726843 725239 723198 720047 716363 711986 705515 696579
58518 696579 686636 676728 666393 655547 645371 636481 628151 620187 613700 609223 605932 603391 602113
58505 602113 601771 600944 599370 598386 598361 597903 596357 594862 594005 592746 590740 589571 590442 592563 594944 597879
58489 597879 601576 605182 608214 611277 614460 616878 618548 620661 623112 623869 621906 618782 616239 614164
58475 614164 612032 610442 609986 610206 610717 611843 613393 614508 615345 617139 620009 622619 624470 626402 628316
58460 628316 628713 627170 624942 622372 618143 611938 605479 600017 595097 590537 587109 584426 580847 576460
58446 576460 573504 572813 572570 571726 571741 573587 575856 577435 579376 582485 585640 588073 590820 594246 596634
$$ packed form
58544I61251k5088k5373k3542k1542k0922k0085j7127j3515j1772j1292r733p174
58532G54086n523m978m262l409l283l312k476j604k041l151l684m377o471q936
58518F96579r943r908j0335j0846j0176q890q330p964o487m477l291k541j278
58505F02113l42q27j574r84k5m58j546j495q57j259k006j169Q71K121K381K935
58489E97879L697L606L032L063L183K418J670K113K451P57j963l124k543k075
58475F14164k132j590m56K20N11J126J550J115Q37J794K870K610J851J932J914
58460F28316L97j543k228k570m229o205o459n462m920m560l428k683l579m387
58446E76460k956o91k43q44J5J846K269J579J941L109L155K433K747L426K388
$$ plain form
58431 596634 596808 595729 594035 590694 585771 581802 580463 580311 579605 578949 579335 580124 580894 582972 587186 592360
58415 592360 597723 604442 613033 621813 629778 638502 649237 660616 671174 681687 693021 704085 713820
58402 713820 722747 730592 735048 735028 732696 730289 727439 723564 720004 717527 714430 709516 704362 700321 696019
58387 696019 690307 684998 682069 680673 679506 679534 681699 684436 686226 688267 691910 695846 698443 700497 703101
58372 703101 705287 706451 708527 712930 717869 721535 725399 731417 738427 744398 749910 756392 763188 769333
58358 769333 775973 784071 791963 798016 803488 810039 816842 822868 829349 837068 843891 847960 850718 853893
58344 853893 856370 857114 858168 861416 865275 867944 870959 876133 882045 887137 893146 901625 910213 916460
58330 916460 922393 931131 941865 952344 963355 976345 989481 1000588 1011388 1024285 1037657 1048886
$$ packed form
58431E96634J74j079j694l341m923l969j339j52p06o56L86P89P70K078M214N174
58415E92360N363O719Q591Q780P965Q724J0735J1379J0558J0513J1334J1064R735
58402G13820Q927P845M456k0k332k407k850l875l560k477l097m914n154m041m302
58387F96019n712n309k929j396j167K8K165K737J790K041L643L936K597K054K604
58372G03101K186J164K076M403M939L666L864O018P010N971N512O482O796O145
58358G69333O640Q098P892O053N472O551O803O026O481P719O823M069K758L175
58344H53893K477P44J054L248L859K669L015N174N912N092O009Q479Q588O247
58330I16460N933Q738J0734J0479J1011J2990J3136J1107J0800J2897J3372J1229
$$ plain form
58318 1048886 1059448 1072283 1086596 1099893 1112731 1126799 1140742 1152472 1163244 1174934 1185930
58307 1185930 1194336 1202435 1213168 1225003 1235297 1245775 1259449 1274943 1289284 1303571 1320354 1338186
58295 1338186 1354509 1371261 1391738 1414349 1435392 1455541 1477676 1500721 1521773 1542141 1565189
58284 1565189 1590366 1615235 1641136 1670828 1702959 1734860 1768386 1806979 1849622 1893697 1940728
58273 1940728 1992785 2046315 2096388 2143989 2192183 2238463 2278457 2314073 2350240 2386633 2420573
58262 2420573 2454939 2494748 2538649 2582190 2626765 2676819 2731144 2785799 2842786 2906732 2975769
58251 2975769 3044928 3115776 3193236 3275836 3358894 3444416 3537760 3637519 3738955 3844271 3958776
58240 3958776 4080264 4203397 4331188 4470466 4619494 4772270 4931390 5103749 5287205
$$ packed form
58318A048886J0562J2835J4313J3297J2838J4068J3943J1730J0772J1690J0996
58307A185930Q406Q099J0733J1835J0294J0478J3674J5494J4341J4287J6783J7832
58295A338186J6323J6752K0477K2611K1043K0149K2135K3045K1052K0368K3048
58284A565189K5177K4869K5901K9692L2131L1901L3526L8593M2643M4075M7031
58273A940728N2057N3530N0073M7601M8194M6280L9994L5616L6167L6393L3940
58262B420573L4366L9809M3901M3541M4575N0054N4325N4655N6987O3946O9037
58251B975769O9159P0848P7460Q2600Q3058Q5522R3344R9759J01436J05316J14505
58240C958776J21488J23133J27791J39278J49028J52776J59120J72359J83456
$$ plain form
58231 5287205 5475202 5671123 5883863 6112727 6351520 6604011 6879670 7177503 7490495
58222 7490495 7822707 8185031 8577570 8994133 9440629 9930235 10464213 11037491 11659347
58213 11659347 12347423 13105495 13929810 14833129 15838581 16955171 18186400 19558695 21113598
58204 21113598 22878557 24878104 27169221 29833430 32944864 36590046 40916146 46119185
58196 46119185 52395588 59956055 69075546 80073141 93270167 109067919 128084782
58189 128084782 151154808 179196902 213044985 252940084 297317456 341544601 378286654
58182 378286654 400277869 403831571 390307883 364585364 332261897 297811934 264237667
58175 264237667 233362458 206115090 182819362 163483003 147835120 135143145 124237800
$$ packed form
58231E287205J87997J95921K12740K28864K38793K52491K75659K97833L12992
58222G490495L32212L62324L92539M16563M46496M89606N33978N73278O21856
58213A1659347O88076P58072Q24315R03319J005452J116590J231229J372295J554903
58204B1113598J764959J999547K291117K664209L111434L645182M326100N203039
58196D6119185O276403P560467R119491J0997595J3197026J5797752J9016863
58189A28084782K3070026K8042094L3848083L9895099M4377372M4227145L6742053
58182C78286654K1991215L553702j3523688k5722519l2323467l4449963l3574267
58175B64237667l0875209k7247368k3295728j9336359j5647883j2691975j0905345
$$ plain form
58168 124237800 113954220 103636565 93261052 83169788 73736410 65191153 57604500
58161 57604500 50944055 45137805 40104444 35752991 31986764 28721416 25889816 23428413
58153 23428413 21274650 19381355 17718620 16257526 14964873 13815369 12793992 11883268
58145 11883268 11061563 10315872 9642559 9033154 8472549 7953093 7477242 7043814 6644174
58136 6644174 6274162 5937197 5632790 5353647 5096623 4865180 4658387 4468177 4289710
58127 4289710 4123916 3967923 3813898 3660045 3512630 3374621 3242103 3113986 2995071
58118 2995071 2886647 2783596 2683774 2591109 2506508 2424632 2342835 2264903 2192889 2123342 2054573
58107 2054573 1989774 1929862 1870818 1811135 1754691 1703296 1653489 1603620 1557183 1516159 1477713
$$ packed form
58168A24237800j0283580j0317655j0375513j0091264r433378q545257p586653
58161E7604500o660445n806250n033361m351453l766227l265348k831600k461403
58153B3428413k153763j893295j662735j461094j292653j149504j021377r10724
58145A1883268q21705p45691o73313o09405n60605n19456m75851m33428l99640
58136F644174l70012l36965l04407k79143k57024k31443k06793j90210j78467
58127D289710j65794j55993j54025j53853j47415j38009j32518j28117j18915
58118B995071j08424j03051r9822r2665q4601q1876q1797p7932p2014o9547o8769
58107B054573o4799n9912n9044n9683n6444n1395m9807m9869m6437m1024l8446
$$ plain form
58096 1477713 1440496 1407765 1381207 1357646 1334735 1314085 1296057 1277243 1255845 1234177 1213437
58085 1213437 1191468 1168008 1146535 1128343 1110081 1089626 1069192 1050215 1030466 1008806 987835
58074 987835 969222 951092 932440 915485 901356 888035 874673 863333 854333 844684 833407 823751
58062 823751 817761 813210 808253 804512 803016 801468 798178 794607 791584 787031 779845 772090 765012 756928
58048 756928 747377 739215 734012 729379 723468 718211 715376 713226 710073 707666 707996 709839 711320 713018
58034 713018 715839 718623 720418 722453 725399 727227 726064 722758 718626 713242 706393 699526 693265 686062
58020 686062 677148 668197 660386 652601 644206 636636 630513 624261 617451 612377 610223 608710 605771 602616
58006 602616 600859 599601 597817 596913 598274 600765 603102 606387 611907 618642 625212 632084 639664 646445
$$ packed form
58096A477713l7217l2731k6558k3561k2911k0650j8028j8814k1398k1668k0740
58085A213437k1969k3460k1473j8192j8262k0455k0434j8977j9749k1660k0971
58074I87835j8613j8130j8652j6955j4129j3321j3362j1340r000r649j1277r656
58062H23751n990m551m957l741j496j548l290l571l023m553p186p755p078q084
58048G56928r551q162n203m633n911n257k835k150l153k407L30J843J481J698
58034G13018K821K784J795K035K946J828j163l306m132n384o849o867o261p203
58020F86062q914q951p811p785q395p570o123o252o810n074k154j513k939l155
58006F02616j757j258j784r04J361K491K337L285N520O735O570O872P580O781
$$ plain form
57992 646445 651195 654785 657752 658415 655610 651044 646663 641916 635881 629907 625660 622495 619133 616113
57978 616113 614400 613287 611813 610456 609503 607692 604544 602040 601823 602664 602866 603278 605643 609782 614659
57963 614659 620468 627368 633746 638009 640576 642040 641008 636042 628237 619758 611254 602755 595438 590263
57949 590263 586294 582566 580192 580472 582312 583723 584506 585384 585861 585157 583960 583141 582017 579959 578290 578349
57933 578349 579009 578359 576534 574485 571174 564648 555072 544391 533633 522652 511737 501347 491002
57920 491002 480443 471149 464723 460543 456919 453706 451866 451396 451825 453898 458520 464621 470217 475134
57906 475134 480740 487419 494183 500366 505901 510327 513210 515085 516437 516296 513396 508123 501777 494723
57892 494723 486860 479060 472284 465971 459115 452322 446973 442933 438868 434308 429739 425323 421296 418942
$$ packed form
57992F46445M750L590K967O63k805m566m381m747o035n974m247l165l362l020
57978F16113j713j113j474j357r53j811l148k504k17Q41K02M12K365M139M877
57963F14659N809O900O378M263K567J464j032m966p805q479q504q499p317n175
57949E90263l969l728k374K80J840J411P83Q78M77p04j197q19j124k058j669N9
57933E78349O60o50j825k049l311o526r576j0681j0758j0981j0915j0390j0345
57920D91002j0559r294o426m180l624l213j840m70M29K073M622O101N596M917
57906D75134N606O679O764O183N535M426K883J875J352j41k900n273o346p054
57892D94723p863p800o776o313o856o793n349m040m065m560m569m416m027k354
$$ plain form
57878 418942 419231 420988 422372 423761 427272 433689 441705 449996 458235 466206 473641 480931 488582 495988
57864 495988 502049 506720 510748 514241 516794 518515 519546 519070 516273 511792 506799 501154 493922 485281
57850 485281 476413 467990 460115 453233 447658 442726 437827 433663 431031 429219 427218 425638 425521 425997 425168
57835 425168 422801 420108 417331 413695 409379 405274 400889 394758 386940 379046 371613 363592 354715 346288
57821 346288 339094 332338 325326 318612 312888 308095 304153 301373 299764 298985 299172 300727 303361 306524 310585
57806 310585 316095 321957 326003 327586 328142 329084 330736 333515 338400 345563 353895 362509 371680 381924
57792 381924 393213 405329 417970 430328 441634 452181 462701 472679 480443 484865 485735 482589 474825
57779 474825 463295 450260 437291 424354 411162 398078 385380 372951 361165 350801 341741 333009
$$ packed form
57878D18942K89J757J384J389L511O417Q016Q291Q239P971P435P290P651P406
57864D95988O061M671M028L493K553J721J031m76k797m481m993n645p232q641
57850D85281q868q423p875o882n575m932m899m164k632j812k001j580j17M76q29
57835D25168k367k693k777l636m316m105m385o131p818p894p433q021q877q427
57821C46288p194o756p012o714n724m793l942k780j609p79J87J555K634L163M061
57806C10585N510N862M046J583N56R42J652K779M885P163Q332Q614R171J0244
57792C81924J1289J2116J2641J2358J1306J0547J0520R978P764M422Q70l146p764
57779D74825j1530j3035j2969j2937j3192j3084j2698j2429j1786j0364r060q732
$$ plain form
57767 333009 324527 317543 312870 309868 307699 306404 306137 306440 306933 307781 308950 309911 310676 312284 315628 320441
57751 320441 325941 331833 338216 344992 351769 358051 363495 368317 373214 378352 382795 385698 387570 389436
57737 389436 391292 392610 393908 396212 399169 401327 402353 403387 405031 406696 408277 410794 414786 419568
57723 419568 424747 431050 438819 447051 454825 462559 470931 479551 487736 495836 504849 515233 526778 539148
57709 539148 551955 564815 577883 591922 607588 625026 644271 665427 688373 712995 739706
57698 739706 768906 800044 832353 866692 905477 950459 1001680 1059001 1123493 1196698 1279472
57687 1279472 1372224 1475547 1590113 1716565 1855781 2008342 2173269 2347928 2529236 2713902
57677 2713902 2897110 3072015 3231378 3369655 3484207 3576176 3650995 3717201 3783965 3858867
$$ packed form
57767C33009q482o984m673l002k169j295k67L03M93Q48J169R61P65J608L344M813
57751C20441N500N892O383O776O777O282N444M822M897N138M443K903J872J866
57737C89436J856J318J298K304K957K158J026J034J644J665J581K517L992M782
57723D19568N179O303P769Q232P774P734Q372Q620Q185Q100R013J0384J1545J2370
57709E39148J2807J2860J3068J4039J5666J7438J9245K1156K2946K4622K6711
57698G39706K9200L1138L2309L4339L8785M4982N1221N7321O4492P3205Q2774
57687A279472R2752J03323J14566J26452J39216J52561J64927J74659J81308J84666
57677B713902J83208J74905J59363J38277J14552R1969P4819O6206O6764P4902
$$ plain form
57667 3858867 3944886 4034737 4106511 4128630 4074708 3937420 3730509 3479665 3211352 2946084
57657 2946084 2696615 2469189 2265999 2087071 1930973 1795468 1678523 1578565 1493746 1421839
57647 1421839 1361043 1310059 1267194 1230590 1199696 1175322 1157714 1145829 1139121 1138553 1144738 1156328
57635 1156328 1171549 1190521 1214810 1245454 1282674 1326938 1378977 1438945 1506704 1582858 1668626
57624 1668626 1764764 1871166 1987274 2112192 2244419 2381650 2520397 2655423 2780114 2887849
57614 2887849 2972730 3029292 3053049 3042465 2999816 2929529 2836255 2724822 2600689 2469188 2334727
57603 2334727 2201216 2072204 1949726 1833911 1724764 1623443 1530775 1445574 1365900 1291353
57593 1291353 1222683 1159719 1101367 1047405 998671 955342 916354 880777 848630 820007 794303
$$ packed form
57667C858867Q6019Q9851P1774K2119n3922j37288k06911k50844k68313k65268
57657B946084k49469k27426k03190j78928j56098j35505j16945r9958q4819p1907
57647A421839o0796n0984m2865l6604l0894k4374j7608j1885o708n68O185J1590
57635A156328J5221J8972K4289L0644L7220M4264N2039N9968O7759P6154Q5768
57624A668626R6138J06402J16108J24918J32227J37231J38747J35026J24691J07735
57614B887849Q4881N6562K3757j0584m2649p0287r3274j11433j24133j31501j34461
57603B334727j33511j29012j22478j15815j09147j01321r2668q5201p9674p4547
57593A291353o8670o2964n8352n3962m8734m3329l8988l5577l2147k8623k5704
$$ plain form
57582 794303 770737 748947 728867 710444 693588 677983 663096 648807 635806 624766 615399 606975
57570 606975 599434 593129 587680 582066 575984 570383 566417 564381 563739 563737 563936 564528 566149 569148 573198 577818
57554 577818 582945 588699 595100 602511 611817 623492 636883 651109 666323 683350 702397 722963
57542 722963 744883 768620 794597 822989 854305 889543 929616 974978 1025822 1082314 1144717
57531 1144717 1213603 1289793 1373821 1465685 1565191 1671912 1784332 1899400 2013355 2122368
57521 2122368 2221939 2306473 2370484 2410177 2423645 2410560 2372671 2313949 2239020 2151585 2055079
57510 2055079 1954054 1853286 1755514 1661217 1570649 1484981 1405371 1332140 1265216 1204513 1149598
57499 1149598 1099805 1055065 1015935 982520 953992 929366 908137 889989 874586 861945 852480
$$ packed form
57582G94303k3566k1790k0080j8423j6856j5605j4887j4289j3001j1040r367q424
57570F06975p541o305n449n614o082n601l966k036o42kJ99N92J621K999M050M620
57554E77818N127N754O401P411R306J1675J3391J4226J5214J7027J9047K0566
57542G22963K1920K3737K5977K8392L1316L5238M0073M5362N0844N6492O2403
57531A144717O8886P6190Q4028R1864R9506J06721J12420J15068J13955J09013
57521B122368R9571Q4534O4011L9693J3468j3085l7889n8722p4929q7435r6506
57510B055079j01025j00768r7772r4297r0568q5668p9610p3231o6924o0703n4915
57499A149598m9793m4740l9130l3415k8528k4626k1229j8148j5403j2641r465
$$ plain form
57488 852480 846325 842964 841732 842409 845351 851315 861039 874567 891168 910351 932724 959350 990636
57475 990636 1026560 1067567 1114288 1166605 1224169 1287844 1359503 1440083 1528737 1624127 1725440
57464 1725440 1831544 1939883 2046707 2147756 2238230 2312764 2366210 2394606 2395677 2369360 2318323
57453 2318323 2247276 2161105 2063756 1958853 1850442 1742374 1637300 1536740 1441777 1353126
57443 1353126 1270879 1194857 1125253 1062512 1006547 956362 910608 868454 829941 795490 765039
57432 765039 737710 712460 688905 667357 648156 631199 616026 602098 589104 577219 566898
57421 566898 558178 550409 542956 535859 529416 523514 517917 512859 508646 504918 501104 497471 494855 493332
57407 493332 492032 490415 488946 488228 488173 488291 488229 487832 487254 487225 488527 490984 493571 495781 498251 501653 505616
$$ packed form
57488H52480o155l361j232O77K942N964R724J3528J6601J9183K2373K6626L1286
57475I90636L5924M1007M6721N2317N7564O3675P1659Q0580Q8654R5390J01313
57464A725440J06104J08339J06824J01049R0474P4534N3446K8396J071k6317n1037
57453B318323p1047q6171r7349j04903j08411j08068j05074j00560r4963q8651
57443A353126q2247p6022o9604o2741n5965n0185m5754m2154l8513l4451l0451
57432G65039k7329k5250k3555k1548j9201j6957j5173j3928j2994j1885j0321
57421E66898q720p769p453p097o443n902n597n058m213l728l814l633k616j523
57407D93332j300j617j469p18n5J18o2l97n78k9J302K457K587K210K470L402L963
$$ plain form
57390 505616 509251 512276 515136 518298 521773 525138 527781 529434 530602 532135 534300 536674 538908 540990
57376 540990 542695 543619 544089 545270 547805 550949 553684 556161 559361 563705 568652 573520 578027 582113 585822
57361 585822 589452 593466 598178 603661 609832 616359 622675 628427 633847 639407 645185 650898 656463 662134
57347 662134 667997 673677 678874 683998 689886 696732 703620 709446 714225 719052 724787 731270 737993 744909
57333 744909 752137 759413 766481 773702 781529 789626 797258 804440 811938 820173 828859 837761 847028 856627
57319 856627 866148 875486 885106 895461 906644 918745 931916 945891 959997 973867 987583 1001118
57307 1001118 1014332 1027748 1042487 1059096 1077085 1095942 1115850 1136940 1158564 1179916 1200954
57296 1200954 1222221 1244274 1267687 1293022 1320241 1348583 1377487 1407173 1437897 1469173 1500271
$$ packed form
57390E05616L635L025K860L162L475L365K643J653J168J533K165K374K234K082
57376E40990J705R24M70J181K535L144K735K477L200M344M947M868M507M086L709
57361E85822L630M014M712N483O171O527O316N752N420N560N778N713N565N671
57347F62134N863N680N197N124N888O846O888N826M779M827N735O483O723O916
57333G44909P228P276P068P221P827Q097P632P182P498Q235Q686Q902R267R599
57319H56627R521R338R620J0355J1183J2101J3171J3975J4106J3870J3716J3535
57307A001118J3214J3416J4739J6609J7989J8857J9908K1090K1624K1352K1038
57296A200954K1267K2053K3413K5335K7219K8342K8904K9686L0724L1276L1098
$$ plain form
57285 1500271 1530952 1561053 1589815 1616271 1640012 1660918 1678467 1691920 1701014 1706004 1707361 1705956
57273 1705956 1703185 1700133 1696799 1692745 1688349 1684777 1682801 1682304 1682967 1684867 1688254 1693163 1699442 1706946
57259 1706946 1715685 1725847 1737538 1750380 1763574 1776632 1789812 1803652 1818428 1834257 1851314
57248 1851314 1869508 1888261 1907070 1925979 1945145 1964303 1983127 2001770 2020560 2039488 2058584
57237 2058584 2078437 2099621 2121726 2143633 2164745 2185373 2205962 2226549 2247084 2267763 2288887
57226 2288887 2310692 2333338 2356785 2380772 2405265 2430801 2457947 2486439 2515298 2543764 2571744
57215 2571744 2599418 2626894 2654262 2681556 2708511 2734717 2760092 2784986 2809730 2834377 2858896
57204 2858896 2883379 2907936 2932578 2957255 2981994 3007076 3033137 3060843 3090224 3120475 3150606
$$ packed form
57285A500271L0681L0101K8762K6456K3741K0906J7549J3453R094M990J357j405
57273A705956k771l052l334m054m396l572j976m97O63J900L387M909O279P504
57259A706946Q739J0162J1691J2842J3194J3058J3180J3840J4776J5829J7057
57248A851314J8194J8753J8809J8909J9166J9158J8824J8643J8790J8928J9096
57237B058584J9853K1184K2105K1907K1112K0628K0589K0587K0535K0679K1124
57226B288887K1805K2646K3447K3987K4493K5536K7146K8492K8859K8466K7980
57215B571744K7674K7476K7368K7294K6955K6206K5375K4894K4744K4647K4519
57204B858896K4483K4557K4642K4677K4739K5082K6061K7706K9381L0251L0131
$$ plain form
57193 3150606 3180166 3209257 3238193 3267403 3297319 3327954 3358784 3389358 3419747 3450111 3480200
57182 3480200 3509697 3538746 3567580 3595923 3623348 3650023 3676427 3702465 3727555 3751593 3775221
57171 3775221 3799043 3823162 3847585 3872499 3897925 3923598 3949423 3975671 4002509 4029662 4056708
57160 4056708 4083364 4109350 4134372 4158592 4182778 4207594 4232819 4257506 4280866 4302742 4323253
57149 4323253 4342198 4359046 4373467 4385680 4396092 4404734 4411388 4416327 4420654 4425684 4432151 4440169 4449738
57136 4449738 4461097 4474731 4491239 4511085 4534342 4560822 4590453 4623276 4658886 4696248 4734351
57125 4734351 4772900 4812134 4852198 4892924 4934071 4975618 5018061 5062662 5111249 5165590 5227131
57114 5227131 5297225 5377139 5467550 5568497 5680339 5804711 5944524 6103479 6286114 6498383
$$ packed form
57193C150606K9560K9091K8936K9210K9916L0635L0830L0574L0389L0364L0089
57182C480200K9497K9049K8834K8343K7425K6675K6404K6038K5090K4038K3628
57171C775221K3822K4119K4423K4914K5426K5673K5825K6248K6838K7153K7046
57160D056708K6656K5986K5022K4220K4186K4816K5225K4687K3360K1876K0511
57149D323253J8945J6848J4421J2213J0412Q642O654M939M327N030O467Q018R569
57136D449738J1359J3634J6508J9846K3257K6480K9631L2823L5610L7362L8103
57125D734351L8549L9234M0064M0726M1147M1547M2443M4601M8587N4341O1541
57114E227131P0094P9914R0411J00947J11842J24372J39813J58955J82635K12269
$$ plain form
57104 6498383 6748204 7045601 7402425 7831919 8349011 8971846 9723551 10633104 11735817
57095 11735817 13074268 14698159 16661152 19015820 21809559 25081655 28859909 33157423
57087 33157423 37970537 43274987 49017654 55108208 61414675 67754705 73873044 79422664
57079 79422664 83991419 87192244 88774792 88688063 87062570 84141639 80211301 75553983
57071 75553983 70424970 65044052 59595645 54229863 49061152 44168862 39603783 35396773
57063 35396773 31563560 28106385 25016445 22276831 19863627 17746645 15892634 14269472
57055 14269472 12847870 11601006 10504884 9539182 8686516 7930949 7258118 6656340 6116284
57046 6116284 5629586 5188811 4788478 4424845 4094380 3793192 3517877 3265963 3035335
$$ packed form
57104F498383K49821K97397L56824M29494N17092O22835P51705R09553J102713
57095A1735817J338451J623891J962993K354668K793739L272096L778254M297514
57087C3157423M813114N304450N742667O090554O306467O340030O118339N549620
57079G9422664M568755L200825J582548q6729j625493k920931l930338m657318
57071G5553983n129013n380918n448407n365782n168711m892290m565079m207010
57063C5396773l833213l457175l089940k739614k413204k116982j854011j623162
57055A4269472j421602j246864j096122r65702q52666p55567o72831o01778n40056
57046F116284m86698m40775m00333l63633l30465l01188k75315k51914k30628
$$ plain form
57037 3035335 2823929 2630135 2452901 2291270 2144187 2010656 1889593 1779631 1679542
57028 1679542 1588792 1507259 1434597 1370386 1314609 1267316 1227998 1196114 1172401 1159034 1158436 1172736
57016 1172736 1204527 1256364 1326752 1405155 1472002 1506470 1497097 1446606 1367631 1274398 1177535
57005 1177535 1083621 996319 917023 845717 782188 726247 677013 633002 593198 557318 524966
56994 524966 495494 468866 445659 425848 408554 393268 380301 369602 360321 352275 346819 345403
56982 345403 347849 352486 356978 358487 354378 344113 329918 314704 299849 285635 272784 262301
56970 262301 254386 248586 244638 242306 240966 240319 241045 243830 248329 254029 261506 271777 285020 301009
56956 301009 320043 341816 363577 380846 390165 390450 382297 367447 348817 329456 310914 293328
$$ packed form
57037C035335k11406j93794j77234j61631j47083j33531j21063j09962j00089
57028A679542r0750q1533p2662o4211n5777m7293l9318l1884k3713j3367n98J4300
57016A172736L1791N1837P0388P8403O6847L4468r373n0491p8975r3233r6863
57005A177535r3914q7302p9296p1306o3529n5941m9234m4011l9804l5880l2352
56994E24966k9472k6628k3207j9811j7294j5286j2967j0699r281q046n456j416
56982C45403K446M637M492J509m109j0265j4195j5214j4855j4214j2851j0483
56970B62301p915n800l948k332j340o47P26K785M499N700P477J0271J3243J5989
56956C01009J9034K1773K1761J7269R319K85q153j4850j8630j9361j8542j7586
$$ plain form
56944 293328 276905 262302 249716 238924 230346 224940 222863 223311 226004 231820 241707 255904 274562
56931 274562 298172 326774 358962 391559 419729 437939 442413 433385 414445 389649 361835 333196
56919 333196 305693 280206 256390 234084 214068 196975 182404 169781 159267 151044 144305 137827
56907 137827 131209 124916 119361 114550 110444 107158 104802 103369 102634 102061 101113 99877 99126 99567 101242
56892 101242 103766 106873 110579 115144 121114 129257 140253 154354 171042 188646 204428 215596 220614
56879 220614 219638 214010 205612 196310 187339 179063 171602 165486 161348 159265 158970 160631 164813 171778 181376
56864 181376 193693 209343 229153 254008 284872 322203 364849 409421 450598 482305 499739
56853 499739 501518 490085 469705 444141 416180 388293 362528 339962 321092 306614 297164 292729
$$ packed form
56944B93328j6423j4603j2586j0792q578n406k077M48K693N816R887J4197J8658
56931B74562K3610K8602L2188L2597K8170J8210M474r028j8940k4796k7814k8639
56919C33196k7503k5487k3816k2306k0016j7093j4571j2623j0514q223o739o478
56907A37827o618o293n555m811m106l286k356j433p35n73r48j236p51M41J675
56892A01242K524L107L706M565N970Q143J0996J4101J6688J7604J5782J1168N018
56879B20614r76n628q398r302q971q276p461o116m138k083k95J661M182O965R598
56864A81376J2317J5650J9810K4855L0864L7331M2646M4572M1177L1707J7434
56853D99739J779j1433k0380k5564k7961k7887k5765k2566j8870j4478r450m435
$$ plain form
56841 292729 293118 298716 309950 326564 348542 377422 415527 464002 522474 589694 662234 732170
56829 732170 788139 820453 825511 805910 767955 719242 666620 614523 565025 519496 479424 445523
56817 445523 417278 394109 376289 364275 357952 357159 362302 373995 392782 419614 455685 500806
56805 500806 551820 602541 644908 670924 675587 659403 627777 587369 543019 497733 453956 413776
56793 413776 378401 348209 323112 302676 286412 274311 266647 263216 263459 267481 276165 290090 309101
56780 309101 332881 360504 388832 412512 426600 428937 419996 401655 376765 348681 319960 291731
56768 291731 264711 240091 218857 200994 185932 173174 162072 151889 142654 135061 128933 122768
56756 122768 115614 108497 103068 99630 97386 95839 94820 93748 92039 89990 88340 87187 86068 84813
$$ packed form
56841B92729L89N598J1234J6614K1978K8880L8105M8475N8472O7220P2540O9936
56829G32170N5969L2314N058j9601l7955m8713n2622n2097m9498m5529m0072l3901
56817D45523k8245k3169j7820j2014o323p93N143J1693J8787K6832L6071M5121
56805E00806N1014N0721M2367K6016M663j6184l1626m0408m4350m5286m3777m0180
56793D13776l5375l0192k5097k0436j6264j2101p664l431K43M022Q684J3925J9011
56780C09101K3780K7623K8328K3680J4088K337q941j8341k4890k8084k8721k8229
56768B91731k7020k4620k1234j7863j5062j2758j1102j0183r235p593o128o165
56756A22768p154p117n429l438k244j547j019j072j709k049j650j153j119j255
$$ plain form
56742 84813 83603 82457 81243 79951 78529 76895 75473 75060 75626 75881 74687 72349 69971 68179 67047
56727 67047 66501 66106 65168 63762 62967 63411 64384 65150 66199 68188 70533 72247 73438 74682 75495 74924 73342
56710 73342 72262 72367 72896 73008 72677 72217 71865 71980 72840 74171 75474 76799 78555 80675 82574 83829
56694 83829 84377 84277 83880 83944 84977 86683 88578 90690 93043 94974 95828 96005 96447 97303 97901 97818 97244 96525
56676 96525 95994 96037 96675 97407 98088 99460 102047 104929 106524 106281 104806 102737 100385 98139 96245 94313
56660 94313 91889 89246 86842 84429 81647 79179 78209 78822 79919 80581 80643 80150 79241 78454 78170 77851 76795
56643 76795 75499 75223 76242 77591 78578 79449 80425 81103 81158 80827 80385 79833 79259 78870 78490 77672 76501 75688
56625 75688 75718 76328 76910 76983 76337 75179 74080 73356 72730 72045 71890 72831 74328 75244 75269 75103 75381 76161 77397
$$ packed form
56742H4813j210j146j214j292j422j634j422m13N66K55j194k338k378j792j132
56727F7047n46l95r38j406p95M44R73P66J049J989K345J714J191J244Q13n71j582
56710G3342j080J05N29J12l31m60l52J15Q60J331J303J325J756K120J899J255
56694H3829N48j00l97O4J033J706J895K112K353J931Q54J77M42Q56N98q3n74p19
56676I6525n31M3O38P32O81J372K587K882J595k43j475k069k352k246j894j932
56660I4313k424k643k404k413k782k468r70O13J097O62O2m93r09p87k84l19j056
56643G6795j296k76J019J349R87Q71R76O78N5l31m42n52n74l89l80q18j171q13
56625G5688L0O10N82P3o46j158j099p24o26o85j55R41J497R16K5j66K78P80J236
$$ plain form
56606 77397 79140 81255 83500 85760 87711 88568 87892 86422 85381 85134 85148 85003 84746 84527 84621 85531 87268
56589 87268 88854 89336 89089 89326 90593 92503 94629 96777 98593 99838 100883 102205 103651 104869 106093
56574 106093 107667 109258 110441 111600 113272 115086 116419 117674 119801 122954 126791 131574 137645 144161
56560 144161 149806 154574 159420 164393 168647 172258 176415 181551 186682 190914 194331 197064 198678 198883
56546 198883 197869 195723 192454 188707 185434 182691 179683 176045 172054 167647 162381 156498 151007 146496
56532 146496 142776 139603 136763 133608 129696 125868 123536 122938 123180 123759 124737 125555 125246 123887 122426 120978
56516 120978 118731 115636 112693 110357 108143 106010 104622 103935 103003 101567 100363 99524 98228 96338 94899
56501 94899 94450 94290 93971 94068 94857 95598 95831 96112 96864 97690 98478 99885 102045 103967 104898 105232 105571 105962
$$ packed form
56606G7397J743K115K245K260J951Q57o76j470j041k47J4j45k57k19R4R10J737
56589H7268J586M82k47K37J267J910K126K148J816J245J045J322J446J218J224
56574A06093J574J591J183J159J672J814J333J255K127L153L837M783O071O516
56560A44161N645M768M846M973M254L611M157N136N131M232L417K733J614K05
56546A98883j014k146l269l747l273k743l008l638l991m407n266n883n491m511
56532A46496l720l173k840l155l912l828k332n98K42N79R78Q18l09j359j461j448
56516A20978k247l095k943k336k214k133j388o87r32j436j204q39j296j890j439
56501I4899m49j60l19R7P89P41K33K81P52Q26P88J407K160J922R31L34L39L91
$$ plain form
56483 105962 106566 107865 109704 111236 112328 113902 116440 119342 122112 124863 127260 128508 128964 130327 133426
56468 133426 137152 140302 143199 146685 150752 154972 159155 162903 165607 167553 169938 173165 176288 178572
56454 178572 180308 181559 181612 180424 179198 178770 178659 178379 178218 177991 176608 173869 171231 169744 168536 166420
56438 166420 163687 161221 159034 156818 154876 153387 151756 149612 147465 145598 143396 140596 138024 136286
56424 136286 134939 133717 133228 133564 133655 132990 132593 133245 134170 134560 134966 135922 136598 136179 135381 135294 135808 136363 137025
56405 137025 137648 137267 135645 134129 133651 133185 131628 129932 129775 131192 133123 135235 137582 139362 139740 139280
56389 139280 139179 139666 140335 141245 142457 143320 143404 143308 143486 143238 142063 140942 141020 142049 143316 145013 147381
56372 147381 149683 151394 153288 155945 158389 159727 160868 163009 165557 167341 168732 170739 172941 174234
$$ packed form
56483A05962O04J299J839J532J092J574K538K902K770K751K397J248M56J363L099
56468A33426L726L150K897L486M067M220M183L748K704J946K385L227L123K284
56454A78572J736J251N3j188j226m28j11k80j61k27j383k739k638j487j208k116
56438A66420k733k466k187k216j942j489j631k144k147j867k202k800k572j738
56424A36286j347j222m89L36R1o65l97O52R25L90M06R56O76m19p98q7N14N55O62
56405A37025O23l81j622j516m78m66j557j696j57J417J931K112K347J780L78m60
56389A39280j01M87O69R10J212Q63Q4r6J78k48j175j121P8J029J267J697K368
56372A47381K302J711J894K657K444J338J141K141K548J784J391K007K202J293
$$ plain form
56358 174234 174869 175931 177517 179113 181043 183771 186496 188192 189389 191204 193290 194506 195012 195935 197446
56343 197446 198874 200226 201925 203499 204133 204139 204432 205047 205647 206868 209573 213294 216969 220729 225456 231029
56327 231029 236493 241517 246315 250640 254204 257533 261125 264462 267102 269940 273997 278813 283423 287996
56313 287996 293005 297772 301482 304691 308140 311056 312385 312806 313708 315047 316037 317000 318563 319919 320002 319641
56297 319641 320455 322337 324119 326035 329241 333464 337394 341106 345920 352101 358705 365460 372860 380649
56283 380649 388128 395785 404881 415735 427986 442039 458487 476641 495400 515067 536642 560070
56271 560070 585124 613181 646037 683514 724363 768984 819184 875798 938666 1008470 1086490
56260 1086490 1172935 1267383 1370259 1481933 1601152 1726472 1858350 1997325 2140779 2283919
$$ packed form
56358A74234O35J062J586J596J930K728K725J696J197J815K086J216N06R23J511
56343A97446J428J352J699J574O34OK93O15O00J221K705L721L675L760M727N573
56327B31029N464N024M798M325L564L329L592L337K640K838M057M816M610M573
56313B87996N009M767L710L209L449K916J329M21R02J339R90R63J563J356Q3l61
56297C19641Q14J882J782J916L206M223L930L712M814O181O604O755P400P789
56283C80649P479P657R096J0854J2251J4053J6448J8154J8759J9667K1575K3428
56271E60070K5054K8057L2856L7477M0849M4621N0200N6614O2868O9804P8020
56260A086490Q6445R4448J02876J11674J19219J25320J31878J38975J43454J43140
$$ plain form
56250 2283919 2423433 2557725 2684098 2798348 2897048 2978164 3039981 3081825 3105367 3112941 3105178
56239 3105178 3082473 3047752 3004817 2954712 2896652 2831942 2763683 2692842 2617858 2538220 2455360
56228 2455360 2369875 2280877 2188515 2094448 1999572 1903783 1808109 1714486 1623345 1533921 1446917
56217 1446917 1364173 1285866 1210793 1139354 1073365 1012942 956580 904372 858067 817682 781123
56206 781123 747530 717988 692552 669497 648057 629053 612327 596388 581112 568017 557364
56195 557364 547580 537911 529009 520703 512099 504139 499037 496781 495045 492871 491394 490747 489570 488123
56181 488123 488563 491333 494421 496991 500660 506312 512600 518508 524634 531223 537704 544709 553709 564174
56167 564174 574010 583147 593549 605296 616089 625213 634484 644523 653583 661063 668809 677959 687731
$$ packed form
56250B283919J39514J34292J26373J14250R8700Q1116O1817M1844K3542P574p763
56239C105178k2705l4721m2935n0105n8060o4710o8259p0841p4984p9638q2860
56228B455360q5485q8998r2362r4067r4876r5789r5674r3623r1141q9424q7004
56217A446917q2744p8307p5073p1439o5989o0423n6362n2208m6305m0385l6559
56206G81123l3593k9542k5436k3055k1440j9004j6726j5939j5276j3095j0653
56195E57364r784r669q902q306q604p960n102k256j736k174j477o47j177j447
56181D88123M40K770L088K570L669N652O288N908O126O589O481P005R000J0465
56167E64174R836R137J0402J1747J0793R124R271J0039R060P480P746R150R772
$$ plain form
56154 687731 698313 711658 728504 747761 769697 796473 828815 865681 908063 959579 1022406
56143 1022406 1096377 1183043 1286677 1409693 1550311 1705459 1871730 2041902 2204632 2350262
56133 2350262 2474917 2578856 2664986 2740058 2812489 2885911 2956969 3020069 3070865 3104838 3117886
56122 3117886 3111082 3091333 3065136 3034338 2998376 2955713 2901102 2826131 2725807 2602254 2460963
56111 2460963 2307438 2148966 1994870 1851932 1722408 1607872 1510975 1431714 1366260 1311742
56101 1311742 1268419 1235402 1208577 1184983 1165092 1148703 1132818 1115808 1099383 1084197 1067838
56090 1067838 1049482 1032051 1017253 1002884 987557 973696 963174 954364 946108 940183 937238 934786
56078 934786 931893 931286 934194 937808 940584 945113 952820 960759 966827 973252 981814 990551 998449 1008283
$$ packed form
56154F87731J0582J3345J6846J9257K1936K6776L2342L6866M2382N1516O2827
56143A022406P3971Q6666J03634J23016J40618J55148J66271J70172J62730J45630
56133B350262J24655J03939Q6130P5072P2431P3422P1058O3100N0796L3973J3048
56122C117886o804j9749k6197l0798l5962m2663n4611p4971j00324j23553j41291
56111B460963j53525j58472j54096j42938j29524j14536r6897p9261o5454n4518
56101A311742m3323l3017k6825k3594j9891j6389j5885j7010j6425j5186j6359
56090A067838j8356j7431j4798j4369j5327j3861j0522q810q256n925k945k452
56078I34786k893o07K908L614K776M529P707P939O068O425Q562Q737P898R834
$$ plain form
56064 1008283 1021403 1034703 1046272 1059022 1075192 1092314 1108211 1124833 1143479 1161430 1177124
56053 1177124 1193502 1212462 1231231 1247947 1265339 1285092 1304257 1321169 1339111 1360134 1381254
56042 1381254 1400927 1422898 1449182 1475697 1499719 1525233 1555962 1589669 1624511 1664150 1710768
56031 1710768 1759546 1805876 1851730 1899298 1945252 1987372 2030011 2076670 2123827 2168358 2214065
56020 2214065 2264428 2316002 2365701 2417422 2474628 2533733 2591741 2652859 2720404 2790124 2858888
56009 2858888 2931753 3012716 3096995 3180494 3268014 3363739 3462920 3561998 3667281 3783892 3905955
55998 3905955 4027963 4155945 4296543 4445156 4596299 4755448 4928585 5110385 5295365
55989 5295365 5490459 5703610 5930525 6166051 6417512 6692738 6986399 7292851 7620612
$$ packed form
56064A008283J3120J3300J1569J2750J6170J7122J5897J6622J8646J7951J5694
56053A177124J6378J8960J8769J6716J7392J9753J9165J6912J7942K1023K1120
56042A381254J9673K1971K6284K6515K4022K5514L0729L3707L4842L9639M6618
56031A710768M8778M6330M5854M7568M5954M2120M2639M6659M7157M4531M5707
56020B214065N0363N1574M9699N1721N7206N9105N8008O1118O7545O9720O8764
56009B858888P2865Q0963Q4279Q3499Q7520R5725R9181R9078J05283J16611J22063
55998C905955J22008J27982J40598J48613J51143J59149J73137J81800J84980
55989E295365J95094K13151K26915K35526K51461K75226K93661L06452L27761
$$ plain form
55980 7620612 7978915 8362631 8766819 9202922 9683441 10204691 10763182 11374380 12055582
55971 12055582 12805793 13623491 14527901 15540576 16664315 17905385 19298270 20883055
55963 20883055 22680335 24718771 27066461 29806000 33008108 36770514 41259178 46674142
55955 46674142 53208271 61085188 70600246 82076354 95842029 112347308 132281324
55948 132281324 156519335 185983577 221434973 262774881 307669011 350554078 383707935
55941 383707935 400510433 398633239 380638942 351865275 317717826 282236114 247996425
55934 247996425 216454899 188246046 163476936 142003782 123560397 107782209 94272299
55927 94272299 82692011 72767075 64240062 56875507 50498264 44978368 40185778 35995534
$$ packed form
55980G620612L58303L83716M04188M36103M80519N21250N58491O11198O81202
55971A2055582P50211Q17698R04410J012675J123739J241070J392885J584785
55963B0883055J797280K038436K347690K739539L202108L762406M488664N414964
55955D6674142O534129P876917R515058J1476108J3765675J6505279J9934016
55948A32281324K4238011K9464242L5451396M1339908M4894130M2885067L3153857
55941C83707935J6802498j877194j7994297k8773667l4147449l5481712l4239689
55934B47996425l1541526k8208853k4769110k1473154j8443385j5778188j3509910
55927I4272299j1580288r924936q527013p364555o377243n519896m792590m190244
$$ plain form
55919 35995534 32322171 29109473 26293917 23808873 21613212 19683268 17983470 16471576
55911 16471576 15123989 13929483 12865310 11903634 11034079 10256873 9560275 8925849 8348757
55902 8348757 7831717 7365134 6933142 6533351 6171510 5842288 5533767 5245597 4984625
55893 4984625 4747112 4522509 4310538 4117906 3941925 3773449 3612636 3466402 3333306
55884 3333306 3205527 3082937 2971189 2868670 2768935 2673501 2589210 2515284 2445340 2379457
55874 2379457 2322018 2270331 2217612 2164709 2116737 2070379 2016555 1954025 1889053 1823548 1754858
55863 1754858 1685562 1621900 1563351 1504316 1445132 1391220 1342552 1294350 1247413 1207658 1175872
55852 1175872 1147477 1121842 1102406 1088038 1073410 1057631 1043773 1030573 1013527 993739 976799
$$ packed form
55919C5995534l673363l212698k815556k485044k195661j929944j699798j511894
55911A6471576j347587j194506j064173r61676q69555p77206o96598o34426n77092
55902H348757n17040m66583m31992l99791l61841l29222l08521k88170k60972
55893D984625k37513k24603k11971j92632j75981j68476j60813j46234j33096
55884C333306j27779j22590j11748j02519r9735r5434q4291p3926o9944o5883
55874B379457n7439n1687n2719n2903m7972m6358n3824o2530o4972o5505o8690
55863A754858o9296o3662n8549n9035n9184n3912m8668m8202m6937l9755l1786
55852A175872k8395k5635j9436j4368j4628j5779j3858j3200j7046j9788j6940
$$ plain form
55841 976799 963032 947485 929418 913199 899658 885002 868701 854364 842196 828324 812278
55830 812278 797795 785641 772808 759283 748572 740941 732916 723905 716595 710410 701295 688664 676127
55817 676127 664859 652529 639239 628204 619940 611783 603644 598345 595933 593574 591350 592150 595535
55804 595535 597773 598352 600436 604415 607111 607896 609504 611839 611092 606085 599808 593556 585241 574810 565818
55789 565818 560106 556039 553472 555379 562778 572307 580148 584342 582771 573635 559011 543572 528886
55776 528886 513122 496615 482714 472303 462460 451806 442426 435087 426998 416027 403215 389757
55764 389757 375264 360218 346494 334368 322390 310907 302195 296522 291692 286912 283405 280870 277203
55751 277203 272148 267385 262782 256564 249315 243492 238708 231995 223250 215827 210989 206417 201131 197216
$$ packed form
55841I76799j3767j5547j8067j6219j3541j4656j6301j4337j2168j3872j6046
55830H12278j4483j2154j2833j3525j0711p631q025r011p310o185r115j2631j2537
55817F76127j1268j2330j3290j1035q264q157q139n299k412k359k224Q00L385
55804E95535K238N79K084L979K696P85J608K335p47n007o277o252q315j0431q992
55789E65818n712m067k567J907P399R529P841M194j571r136j4624j5439j4686
55776E28886j5764j6507j3901j0411r843j0654r380p339q089j0971j2812j3458
55764C89757j4493j5046j3724j2126j1978j1483q712n673m830m780l507k535l667
55751B77203n055m763m603o218p249n823m784o713q745p423m838m572n286l915
$$ plain form
55737 197216 195383 193289 189798 186809 185405 184092 182224 181329 181663 181237 179499 178260 177795 175891 171967
55722 171967 168292 165839 162861 158880 156112 155337 154228 151462 148825 147599 146459 144629 143591 143986 144212
55707 144212 143673 144049 145813 147001 147068 148331 151789 154949 155759 155349 155026 153901 151499 149498 148759 147686
55691 147686 145516 144240 145211 146808 147495 148233 149792 150571 149391 147740 147024 146176 144188 142585 143092 145018
55675 145018 147011 149280 152113 154328 155214 156108 158255 160934 163183 165418 167983 170251 172525 176510 182491
55660 182491 188369 192941 197732 204124 211187 217894 224887 232224 237937 240883 242778 245409 247901 248647
55646 248647 247871 246378 243797 239994 236344 233719 230895 226668 221824 217474 213285 208851 204890 201575
55632 201575 197562 192151 186463 181100 174778 166849 159006 152765 147244 141107 134739 128834 122836 116514
$$ packed form
55737A97216j833k094l491k989j404j313j868q95L34m26j738j239m65j904l924
55722A71967l675k453k978l981k768p75j109k766k637j226j140j830j038L95K26
55707A44212n39L76J764J188O7J263L458L160Q10m10l23j125k402k001p39j073
55691A47686k170j276R71J597O87P38J559P79j180j651p16q48j988j603N07J926
55675A45018J993K269K833K215Q86Q94K147K679K249K235K565K268K274L985N981
55660A82491N878M572M791O392P063O707O993P337N713K946J895K631K492P46
55646B48647p76j493k581l803l650k625k824m227m844m350m189m434l961l315
55632B01575m013n411n688n363o322p929p843o241n521o137o368n905n998o322
$$ plain form
55618 116514 111217 107893 105682 103851 103084 103336 102742 100340 97718 96211 94664 91900 89055 87346 85674
55603 85674 82720 79490 77501 76287 74910 74160 74814 75377 74037 71487 69555 68296 66660 64793 63493
55588 63493 62445 60997 59611 58790 57762 56004 54735 55038 55815 55503 54506 54056 53947 53391 52935 53533 54811
55571 54811 56151 58418 62724 68417 73987 78972 83348 86205 86788 85897 84641 82843 80143 77381 75295
55556 75295 73112 70067 67028 64929 62923 59911 56612 54324 52812 51234 49935 49471 49124 48262 47994
55541 47994 49481 51746 53094 53664 54638 55946 56767 57403 58694 60397 61914 63744 66496 69422 71679
55526 71679 74045 77577 81611 84900 87685 90721 93355 94628 95370 97099 99632 101786 103641 106084 108792
55511 108792 110695 111835 112790 112931 111199 108021 104534 100481 94781 87816 81299 76191 72224 68902 65472
$$ packed form
55618A16514n297l324k211j831p67K52n94k402k622j507j547k764k845j709j672
55603H5674k954l230j989j214j377p50O54N63j340k550j932j259j636j867j300
55588F3493j048j448j386q21j028j758j269L03P77l12r97m50j09n56m56N98J278
55571E4811J340K267M306N693N570M985M376K857N83q91j256j798k700k762k086
55556G5295k183l045l039k099k006l012l299k288j512j578j299m64l47q62k68
55541D7994J487K265J348N70R74J308Q21O36J291J703J517J830K752K926K257
55526G1679K366L532M034L289K785L036K634J273P42J729K533K154J855K443K708
55511A08792J903J140R55J41j732l178l487m053n700o965o517n108l967l322l430
$$ plain form
55496 65472 60704 54362 48226 43966 40891 37487 34121 32213 31550 30708 29552 29089 29218 28833 27910 27442
55480 27442 27467 27047 26091 25377 24852 23685 21914 20480 19697 19196 19154 20045 21316 21784 21207 20190 18940 17414
55462 17414 16230 15970 16049 15613 15030 15062 15212 14471 13154 12329 12020 11578 11309 11985 13161 13728 13742 14079 14635
55443 14635 14580 14071 14043 14523 14689 14344 13887 13272 12419 12142 13120 14446 14785 14398 14421 14831 14873 14927 15983 17712
55423 17712 18896 19392 19815 19819 18666 17132 16737 17348 17536 17159 17508 18942 20487 21866 23957 26964 29816
55406 29816 31595 32136 31289 29176 27029 26110 25967 25342 24478 24696 25995 27054 27480 27943 28142 26789 23893
55389 23893 21075 19279 17966 16794 16241 16275 16140 15811 15966 16296 15574 13684 11886 10768 9612 8066
55373 8066 6751 5840 4705 3329 2475 2194 1753 1301 1844 3263 4109 3855 3670 4446 5605 6431 7044 7542
$$ packed form
55496F5472m768o342o136m260l075l404l366j908o63q42j156m63J29l85r23m68
55480B7442K5m20r56p14n25j167j771j434p83n01m2Q91J271M68n77j017j250j526
55462A7414j184k60P9m36n83L2J50p41j317q25l09m42k69O76J176N67J4L37N56
55443A4635n5n09k8M80J66l45m57o15q53k77R78J326L39l87K3M10M2N4J056J729
55423A7712J184M96M23Mj153j534l95O11J88l77L49J434J545J379K091L007K852
55406B9816J779N41q47k113k147r19j43o25q64K18J299J059M26M63J99j353k896
55389B3893k818j796j313j172n53L4j35l29J55L30p22j890j798j118j156j546
55373H066j315r11j135j376q54k81m41m52N43J419Q46k54j85P76J159Q26O13M98
$$ plain form
55355 7542 7593 7458 7995 9170 9854 9507 8746 7950 6738 5210 4250 4145 4283 4565 5717 7731 9386 9841
55337 9841 9475 8829 8019 7506 8025 9269 9910 9351 8288 7320 6357 5600 5606 5973 5427 3665 1834 816 368
55317 278 959 2456 4106 5528 6737 7214 6376 5134 5315 7076 8553 8534 7833 7438 6953 5706 3984
55300 3984 2315 704 -707 -1329 -1042 -389 530 2157 4179 5466 5685 5667 5835 5678 5187 5277 6221 7056 7096
55281 7096 6714 6179 5158 3894 3461 4239 5420 6409 7369 8069 7781 6766 6240 6404 6221 5656 6200 8344
55263 8344 10349 10609 9629 8655 7806 6676 5415 4209 2953 2252 3295 5870 7974 8352 7983 8121 8422
55246 8422 8116 7515 7070 6317 5002 3975 3740 3407 2356 1643 2418 4076 5411 6537 8218 10183 11524
55229 11524 12092 12221 11805 10743 9686 9243 9074 8643 8182 8107 8301 8687 9541 10553 10671 9710 8925 9076
$$ packed form
55355G542N1j35N37J175O84l47p61p96j212j528r60j05J38K82J152K014J655M55
55337I841l66o46q10n13N19J244O41n59j063r68r63p57OL67n46j762j831H16C68
55317B78O81J497J650J422J209M77q38j242J81J761J477j9p01l95m85j247j722
55300C984j669G04g07o22K87c89E30J627K022J287K19j8J68j57m91R0R44Q35M0
55281G096l82n35j021j264m33P78J181R89R60P00k88j015n26J64j83n65N44K144
55263H344K005K60r80r74q49j130j261j206j256p01J043K575K104L78l69J38L01
55246H422l06o01m45p53j315j027k35l33j051p13P75J658J335J126J681J965J341
55229A1524N68J29m16j062j057m43j69m31m61p5J94L86Q54J012J18r61p85J51
$$ plain form
55211 9076 9218 8463 7588 7647 8252 8637 9277 10821 12354 12410 11129 9934 9536 9558 9661 9840 9909 9712 9481
55192 9481 9281 8753 8066 8197 9390 10369 10073 9145 8626 8313 7684 7389 8245 9537 9893 9270 8695 8612 8824
55173 8824 9470 10647 11561 11420 10730 10465 10479 10027 9334 9202 9496 9396 8881 8572 8412 7803 6906 6471 6529 6486
55153 6486 6399 6976 8308 9660 10528 10993 11132 10979 10964 11500 12271 12646 12533 12103 11120 9418 7618 6411
55135 6411 5555 4526 3752 4024 5028 5621 5410 5018 4904 4961 5230 6016 7296 8769 10431 12303 13829
55118 13829 14363 14152 14057 14429 15009 15682 16520 17219 17268 16702 16069 15774 15914 16502 17341 17978 18230 18405 18630 18576
55098 18576 18272 18449 19420 20387 20606 20472 20638 20908 20938 21179 22013 22635 22088 20834 20107 20215 20688 21579 23259
55079 23259 25269 26700 27534 28365 29015 28654 27272 25931 25507 26056 27219 28398 28816 28340 27899 28197 28455
$$ packed form
55211I076J42p55q75N9O05L85O40J544J533N6j281j195l98K2J03J79O9j97k31
55192I481k00n28o87J31J193R79k96r28n19l13o29k95Q56J292L56o23n75q3K12
55173H824O46J177R14j41o90k65J4m52o93j32K94j00n15l09j60o09q97m35N8m3
55153F486q7N77J332J352Q68M65J39j53j5N36P71L75j13m30r83j702j800j207
55135F411q56j029p74K72J004N93k11l92j14N7K69P86J280J473J662J872J526
55118A3829N34k11r5L72N80O73Q38O99M9n66o33k95J40N88Q39O37K52J75K25n4
55098A8576l04J77R71R67K19j34J66K70L0K41Q34O22n47j254p27J08M73Q91J680
55079B3259K010J431Q34Q31O50l61j382j341m24N49J163J179M18m76m41K98K58
$$ plain form
55062 28455 27561 25954 25093 25329 25661 25459 25113 25020 25161 25737 27019 28450 28940 28242 27149 26332 25903 25995
55044 25995 26735 27617 27876 27536 27226 27080 26754 26405 26583 27193 27576 27610 27748 28036 28128 28191 28726 29504 29789 29664
55024 29664 30028 31156 32353 33220 34153 35365 36422 37102 37800 38707 39392 39573 39579 39747 39919 39785 39209 38173
55006 38173 36837 35617 34710 33760 32562 31734 31908 32597 32774 32292 31753 31249 30361 29270 28704 28785 28980 29173
54988 29173 29672 30193 30057 29531 29727 30889 31902 31884 31255 30878 31093 31944 33431 35155 36506 37542 38953
54971 38953 40996 43309 45882 49168 52945 56120 58168 59822 61919 64465 67449 71697 78106 86546
54957 86546 96195 106593 117922 130644 145275 162128 180846 200357 219484 237232 252350 263135
54945 263135 268103 266792 259795 248277 233549 216869 199441 182432 166658 152158 138565 126104
$$ packed form
55062B8455q94j607q61K36L32k02l46r3J41N76J282J431M90o98j093q17m29R2
55044B5995P40Q82K59l40l10j46l26l49J78O10L83L4J38K88R2O3N35P78K85j25
55024B9664L64J128J197Q67R33J212J057O80O98R07O85J81OJ68J72j34n76j036
55006C8173j336j220r07r50j198q28J74O89J77m82n39n04q88j091n66Q1J95J93
54988B9173M99N21j36n26J96J162J013j8o29l77K15Q51J487J724J351J036J411
54971C8953K043K313K573L286L777L175K048J654K097K546K984M248O409Q440
54957H6546R649J0398J1329J2722J4631J6853J8718J9511J9127J7748J5118J0785
54945B63135M968j311o997j1518j4728j6680j7428j7009j5774j4500j3593j2461
$$ plain form
54933 126104 115623 107257 99872 92543 85859 80854 77266 74011 70924 68769 67786 67462 67659 68796 70897
54918 70897 73585 77048 81986 88534 96192 104764 114455 125186 136894 150328 166292 184084 201830
54905 201830 218185 232406 242902 247537 245822 239353 229644 216980 201843 185848 170334 155311
54893 155311 140643 127113 115358 104814 94774 85644 78169 72087 66583 61520 57358 54199 51770
54880 51770 50029 49061 48586 48079 47246 46107 44871 43954 43730 44059 44413 44509 44314 43521 41802 39675 38246
54863 38246 37780 37386 36407 35356 35004 35325 35789 36036 35814 34883 33480 32336 31850 31707 31559 31449 31329 30850
54845 30850 29918 28802 27387 25117 22082 19428 18191 18265 18948 19882 21034 22341 23815 25550 27287 28457
54829 28457 28925 29162 29480 29726 29911 30442 31438 32466 33278 34136 35189 36203 37202 38672 40865 43473 46158
$$ packed form
54933A26104j0481q366p385p329o684n005l588l255l087k155r83l24J97J137K101
54918G0897K688L463M938O548P658Q572R691J0731J1708J3434J5964J7792J7746
54905B01830J6355J4221J0496M635j715o469r709j2664j5137j5995j5514j5023
54893A55311j4668j3530j1755j0544j0040r130p475o082n504n063m162l159k429
54880E1770j741r68m75n07q33j139j236r17k24L29L54R6j95p93j719k127j429
54863C8246m66l94r79j051l52L21M64K47k22r31j403j144m86j43j48j10j20m79
54845C0850r32j116j415k270l035k654j237P4O83R34J152J307J474J735J737J170
54829B8457M68K37L18K46J85N31R96J028Q12Q58J053J014R99J470K193K608K685
$$ plain form
54812 46158 48734 50820 52243 53856 56880 61190 65395 69002 73307 79635 87872 97451 108615 121829
54798 121829 136852 153284 171148 189962 207921 222980 234201 241320 243754 241037 233799 223376
54786 223376 210819 196992 183124 170353 158955 148673 139492 131438 124076 116964 110334 104687 99909
54773 99909 95457 91185 87531 84981 83738 83653 84230 85021 86243 88524 91865 95458 98870 102738 107911
54758 107911 114619 123020 133833 147674 164144 182141 200627 218573 234653 247522 256104 259374
54746 259374 256628 248498 237092 224451 211273 197521 183565 170061 157299 145447 134995 126246
54734 126246 118700 111553 104502 97646 91009 84651 78842 73677 68955 64762 61565 59337 57296 55055
54720 55055 53332 52825 53041 52934 52162 51022 49657 48118 46778 45976 45549 45228 45097 45208 45271 45242 45594 46467
$$ packed form
54812D6158K576K086J423J613L024M310M205L607M305O328Q237R579J1164J3214
54798A21829J5023J6432J7864J8814J7959J5059J1221P119K434k717p238j0423
54786B23376j2557j3827j3868j2771j1398j0282r181q054p362p112o630n647m778
54773I9909m452m272l654k550j243q5N77P91J222K281L341L593L412L868N173
54758A07911O708Q401J0813J3841J6470J7997J8486J7946J6080J2869Q582L270
54746B59374k746q130j1406j2641j3178j3752j3956j3504j2762j1852j0452q749
54734A26246p546p147p051o856o637o358n809n165m722m193l197k228k041k241
54720E5055j723n07K16j07p72j140j365j539j340q02m27l21j31J11O3k9L52Q73
$$ plain form
54702 46467 47198 47327 47373 47873 48369 48199 47689 47652 48141 48570 48663 48472 47832 46618 45249 44229 43543 43108 43300
54683 43300 44330 45601 46445 46993 47590 47977 47975 48335 49837 51966 53603 54703 56207 58550 61353 64421
54667 64421 67884 71336 73931 75517 76882 78707 80905 82988 84440 84758 83807 82177 80672 79504 78444
54652 78444 77452 76590 75621 74443 73654 73957 75127 76282 76990 77484 78054 78945 80594 83165 85942 87986 89233
54635 89233 90288 91328 92049 92578 93579 95352 97476 99337 100490 100629 99789 98434 96800 94418 90943
54620 90943 87135 84230 82523 81322 80100 78850 77471 75744 73993 73047 73442 75147 77843 80813 82831
54605 82831 83088 82146 81173 80351 78900 76608 74330 72768 71662 70449 69015 67494 65960 64551 63460
54590 63460 62596 61618 60337 58727 56710 54417 52458 51317 50548 49273 47351 45465 44127 43317 43018 43272
$$ packed form
54702D6467P31J29M6N00M96j70n10l7M89M29R3j91o40j214j369j020o86m35J92
54683D3300J030J271Q44N48N97L87kL60J502K129J637J100J504K343K803L068
54667F4421L463L452K595J586J365J825K198K083J452L18r51j630j505j168j060
54652G8444r92q62r69j178p89L03J170J155P08M94N70Q91J649K571K777K044J247
54635H9233J055J040P21N29J001J773K124J861J153J39q40j355j634k382l475
54620I0943l808k905j707j201j222j250j379j727j751r46L95J705K696K970K018
54605H2831K57r42r73q22j451k292k278j562j106j213j434j521j534j409j091
54590F3460q64r78j281j610k017k293j959j141p69j275j922j886j338q10k99K54
$$ plain form
54574 43272 43645 43397 42401 41331 40807 40877 41349 42031 42549 42509 42026 41654 41723 42092 42510 42747 42468 41501 40264
54555 40264 39472 39442 40061 41180 42515 43376 43148 42046 40790 39679 38504 37243 36180 35383 34676 34124 33949
54538 33949 34037 34056 34065 34430 35168 35922 36536 37191 38053 39237 40917 43011 44973 46455 47909 49944 52400 54704
54520 54704 56780 58821 60453 60977 60307 58879 56846 54219 51588 49692 48307 46502 44102 41959 40669
54505 40669 39888 39103 38329 37789 37546 37662 38171 38785 39090 39083 39050 39070 39137 39538 40482 41525 42077 42275 42667 43242
54485 43242 43520 43437 43373 43503 43825 44601 45969 47423 48450 49335 50447 51225 51013 50485 50944 52449 53945 55027
54467 55027 56139 57128 57212 56490 55996 55968 55550 54542 53919 54149 54388 53967 53350 53011 52597 51862 51279 51067 50720
54448 50720 50137 50044 50599 50751 49799 48469 47624 46970 46042 45445 46007 47428 48782 49715 50231 49999 48896 47694
$$ packed form
54574D3272L73k48r96j070n24P0M72O82N18m0m83l72O9L69M18K37k79r67j237
54555D0264p92l0O19J119J335Q61k28j102j256j111j175j261j063p97p07n52j75
54538C3949Q8J9RL65P38P54O14O55Q62J184J680K094J962J482J454K035K456K304
54520E4704K076K041J632N24o70j428k033k627k631j896j385j805k400k143j290
54505D0669p81p85p74n40k43J16N09O14L05pl3K0O7M01R44J043N52J98L92N75
54485D3242K78q3o4J30L22P76J368J454J027Q85J112P78k12n28M59J505J496J082
54467E5027J112R89Q4p22m94k8m18j008o23K30K39m21o17l39m14p35n83k12l47
54448E0720n83r3N55J52r52j330q45o54r28n97N62J421J354R33N16k32j103j202
$$ plain form
54430 47694 47235 47261 46890 45883 44707 43729 43087 43037 43707 44742 45760 46843 48158 49469 50498 51321 51998
54413 51998 52334 52468 53135 54751 56755 58428 59911 61808 64207 66687 68990 71137 73177 75217 77402
54398 77402 79645 81778 84214 87768 92458 97108 100587 102880 104513 105614 106095 106118 105792 104909 103460 101877
54382 101877 100290 98165 95170 91740 88348 84917 81546 78879 77055 75112 72386 69769 68507 68281
54368 68281 67606 65835 63732 62212 61434 61092 60806 60200 59179 58113 57399 57076 57156 57790 58682 58980 58429 58044
54350 58044 58884 60736 62848 65341 68778 72764 76295 79424 83310 88364 93369 96865 98671 99701 100786
54335 100786 102034 102958 102961 101887 100134 98100 95724 92818 89576 86347 83217 80253 77797 75909 73802
54320 73802 70622 66715 63401 61475 60506 59620 58346 56583 54386 52066 50071 48523 47081 45398 43484
$$ packed form
54430D7694m59K6l71j007j176r78o42n0O70J035J018J083J315J311J029Q23O77
54413E1998L36J34O67J616K004J673J483J897K399K480K303K147K040K040K185
54398G7402K243K133K436L554M690M650L479K293J633J101M81K3l26q83j449j583
54382A01877j587k125k995l430l392l431l371k667j824j943k726k617j262k26
54368F8281o75j771k103j520p78l42k86o06j021j066p14l23Q0O34Q92K98n51l85
54350E8044Q40J852K112K493L437L986L531L129L886N054N005L496J806J030J085
54335A00786J248R24Lj074j753k034k376k906l242l229l130k964k456j888k107
54320G3802l180l907l314j926r69q86j274j763k197k320j995j548j442j683j914
$$ plain form
54305 43484 41600 40017 38937 38407 38294 38419 38641 38724 38266 36999 35054 32894 31181 30692 31852 34054
54289 34054 35935 36764 37242 38447 40269 41443 41000 39226 37248 36105 36158 37005 37800 37870 37165 36201 35680
54272 35680 36054 37152 38215 38680 38945 39925 41760 43536 44403 44377 43830 42883 41739 40976 40942 41287 41606 42084
54254 42084 42988 43997 44627 44991 45556 46379 47104 47533 47726 47770 47810 48102 48736 49550 50519 51792 53061 53495 52771
54235 52771 51699 51284 51541 51758 51549 51086 50643 50426 50585 50957 51074 50761 50359 50063 49541 48564 47475 46577
54217 46577 45723 44933 44742 45257 45598 45081 44341 44449 45361 46143 46316 46139 45868 45616 45648 46048 46353 46202 46013
54198 46013 46312 46815 47009 47192 47984 49105 49656 49429 49035 48887 48935 49227 49798 50128 49584 48361 47209 46384
54180 46384 45683 45289 45562 46070 45840 44637 43145 41837 40515 39016 37539 36213 35120 34747 35583 37217
$$ packed form
54305D3484j884j583j080n30j13J25K22Q3m58j267j945k160j713m89J160K202
54289C4054J881Q29M78J205J822J174m43j774j978j143N3Q47P95P0p05r64n21
54272C5680L74J098J063M65K65R80J835J776Q67k6n47r47j144p63l4L45L19M78
54254D2084R04J009O30L64N65Q23P25M29J93M4M0K92O34Q14R69J273J269M34p24
54235E2771j072m15K57K17k09m63m43k17J59L72J17l13m02k96n22r77j089q98
54217D6577q54p90j91N15L41n17p40J08R12P82J73j77k71k52L2M00L05j51j89
54198D6013K99N03J94J83P92J121N51k27l94j48M8K92N71L30n44j223j152q25
54180D6384p01l94K73N08k30j203j492j308j322j499j477j326j093l73Q36J634
$$ plain form
54164 37217 38641 39475 40130 40776 41044 40812 40411 39884 38951 37799 37074 36887 36681 36297 36311 37051 38039 38709 38943
54145 38943 38666 37684 36225 35011 34454 34376 34549 34849 34751 33647 31957 31066 31705 33119 34294 35174 36104 36791
54127 36791 36660 35874 35266 35343 35817 36122 36083 36097 36676 37699 38292 37847 36997 37048 38394 40098 41092 41196 40816
54108 40816 40240 39568 38871 38201 37710 37808 38729 39977 40763 41041 41477 42286 42800 42410 41384 40446 40039 40233 40865
54089 40865 41519 41808 41847 42060 42414 42337 41487 40142 38783 37808 37670 38622 40166 41375 41936 42310 42850 43473
54071 43473 44293 45702 47479 48667 48818 48693 49280 50704 52483 54201 55465 55847 55506 55317 55880 56827 57612
54054 57612 58445 59779 61377 62694 63893 65681 68119 70323 71528 71990 72640 74157 76668 80219 85124
54039 85124 91516 98615 104951 109688 113450 117447 122079 126887 131605 136430 141424 146441 151643 157190
$$ packed form
54164C7217J424Q34O55O46K68k32m01n27r33j152p25j87k06l84J4P40R88O70K34
54145C8943k77r82j459j214n57p8J73L00r8j104j690q91O39J414J175Q80R30O87
54127C6791j31p86o08P7M74L05l9J4N79J023N93m45q50N1J346J704R94J04l80
54108D0816n76o72o97o70m91R8R21J248P86K78M36Q09N14l90j026r38m07J94O32
54089D0865O54K89L9K13L54p7q50j345j359r75j38R52J544J209N61L74N40O23
54071D3473Q20J409J777J188J51j25N87J424J779J718J264L82l41j89N63R47P85
54054E7612Q33J334J598J317J199J788K438K204J205M62O50J517K511L551M905
54039H5124O392P099O336M737L762L997M632M808M718M825M994N017N202N547
$$ plain form
54025 157190 162301 165639 167048 168000 169797 172034 173472 173809 173824 174163 174653 174663 173722 171930 169972 168389
54009 168389 166679 163659 159008 153876 149547 146091 142838 139576 136612 134059 131794 129846 128152 126137
53995 126137 123250 119866 117021 115245 114097 112919 111536 110201 109157 108429 107771 106801 105369 103786 102534
53980 102534 101823 101563 101646 101998 102403 102539 102236 101594 100829 100091 99412 98786 98236 97785 97355 96797 96111 95445 94813
53961 94813 94043 93213 92782 92946 93205 93026 92623 92520 92621 92461 92205 92493 93285 93794 93841 94340 96005 98352 100583
53942 100583 102837 105827 109641 113553 116950 119965 123289 127670 133501 140657 148686 157198 165879 174219
53928 174219 181595 187626 192152 194918 195805 195316 194318 193229 192064 191338 192164 195076 199323 203678 207546
53913 207546 211039 214499 218298 222706 227616 232677 237840 243315 248852 253589 256859 258691 259322 258749 257050
$$ packed form
54025A57190N111L338J409R52J797K237J438L37J5L39M90J0r41j792j958j583
54009A68389j710l020m651n132m329l456l253l262k964k553k265j948j694k015
53995A26137k887l384k845j776j148j178j383j335j044p28o58r70j432j583j252
53980A02534p11k60Q3L52M05J36l03o42p65p38o79o26n50m51m30n58o86o66o32
53961I4813p70q30m31J64K59j79m03j03J01j60k56K88P92N09M7M99J665K347K231
53942A00583K254K990L814L912L397L015L324M381N831P156Q029Q512Q681Q340
53928A74219P376O031M526K766Q87m89r98j089j165p26Q26K912M247M355L868
53913B07546L493L460L799M408M910N061N163N475N537M737L270J832O31n73j699
$$ plain form
53898 257050 254656 252001 249318 246921 245130 243683 241704 238527 234170 228933 223122 217266 211804 206333
53884 206333 199895 192345 184728 177992 172034 166329 160766 155447 150394 145803 141926 138379 134448 130400
53870 130400 127398 125610 123524 119936 115582 111785 108552 105157 101818 99393 97876 96535 95307 94819
53856 94819 95098 95299 94723 93304 91193 88657 86326 84763 83832 83077 82471 82173 81900 81341 80851 80855 80850 79972 78427
53837 78427 77338 77178 77256 76820 75821 74466 72909 71541 70882 70988 71552 72642 74618 77237 79577 81094
53821 81094 82069 82781 82902 82086 80683 79553 79464 80814 83440 86484 88785 89773 89934 90376 92065 95275 99397
53804 99397 103353 106540 109337 112459 116075 119962 124259 129356 135038 140425 144944 148918 152969 157191
53790 157191 161112 164338 167079 170021 173532 176986 179280 180177 180651 181516 182286 181974 180522 178555 176052
$$ packed form
53898B57050k394k655k683k397j791j447j979l177m357n237n811n856n462n471
53884B06333o438p550p617o736n958n705n563n319n053m591l877l547l931m048
53870A30400l002j788k086l588m354l797l233l395l339k425j517j341j228m88
53856I4819K79K01n76j419k111k536k331j563r31p55o06k98k73n59m90Mnq78j545
53837G8427j089j60P8m36r99j355j557j368o59J06N64J090J976K619K340J517
53821H1094R75P12J21q16j403j130q9J350K626L044K301R88J61M42J689L210M122
53804I9397L956L187K797L122L616L887M297N097N682N387M519L974M051M222
53790A57191L921L226K741K942L511L454K294Q97M74Q65P70l12j452j967k503
$$ plain form
53775 176052 172278 167116 161558 156641 152541 148931 145565 142188 138452 134452 131043 129167 128827 128917 128164
53760 128164 126239 123985 122506 122049 121926 121393 120187 118218 115462 112461 110272 109372 109110 108686 108132 107717
53744 107717 107098 105900 104625 103957 103529 102436 100757 99453 98750 97751 95824 93413 91224 89482 88280
53729 88280 87757 87559 86826 85253 83609 82830 83025 83626 84070 84036 83526 82989 82978 83531 84317 85559 88129 92344
53711 92344 97192 101226 103873 105444 106150 105722 104035 101762 100221 100590 103233 107715 113322 119356 125022
53696 125022 129510 132598 134804 136602 137735 137783 137093 136532 136460 136544 136532 136595 136889 137339 137940 138798 139845 140909
53678 140909 142066 143500 145090 146553 147906 149328 150677 151633 152205 152564 152571 152039 151375 151269 151761 152236 152325
53661 152325 152171 151863 151266 150494 149869 149391 148764 147946 147108 146187 145208 144829 145725 147445 148844 149629 150443 151334
$$ packed form
53775A76052l774n162n558m917m100l610l366l377l736m000l409j876l40R0p53
53760A28164j925k254j479m57j23n33j206j969k756l001k189r00k62m24n54m15
53744A07717o19j198j275o68m28j093j679j304p03r99j927k411k189j742j202
53729H8280n23j98p33j573j644p79J95O01M44l4n10n37j1N53P86J242K570M215
53711I2344M848M034K647J571P06m28j687k273j541L69K643M482N607O034N666
53696A25022M488L088K206J798J133M8o90n61p2Q4j2O3K94M50O01Q58J047J064
53678A40909J157J434J590J463J353J422J349R56N72L59Pn32o64j06M92M75Q9
53661A52325j54l08n97p72o25m78o27q18q38r21r79l79Q96J720J399P85Q14Q91
$$ plain form
53643 151334 151371 150192 148869 148630 149536 150965 152525 153864 154334 153685 152586 151832 151482 151249 151229 151674 152539
53626 152539 153835 155963 159083 162536 165481 167831 170017 172150 173916 175084 175673 175863 176160 177360 179824
53611 179824 182929 185656 187569 188955 190270 191858 193999 196792 200062 203621 207497 211711 216003 220007
53597 220007 223572 226770 229831 233133 236971 241192 245361 249340 253421 257833 262507 267360 272323 277020
53583 277020 280999 284397 287789 291198 293977 295939 297831 300212 302556 304096 304989 305933 307065 307964 308515
53568 308515 309094 309988 311152 312392 313424 313940 313968 313970 314309 314887 315618 316734 318155 319041 318707 317733 317420 318180
53550 318180 319077 318983 317685 315818 314166 313156 312680 312278 311630 310812 309991 309156 308450 308375 309199 310319 310768 310430
53532 310430 310294 311401 313861 316937 319752 321811 323176 324397 326162 328830 332277 336158 340269 344584
$$ packed form
53643A51334L7j179j323k39R06J429J560J339M70o49j099p54l50k33k0M45Q65
53626A52539J296K128L120L453K945K350K186K133J766J168N89J90K97J200K464
53611A79824L105K727J913J386J315J588K141K793L270L559L876M214M292M004
53597B20007L565L198L061L302L838M221M169L979M081M412M674M853M963M697
53583B77020L979L398L392L409K779J962J892K381K344J540Q93R44J132Q99N51
53568C08515N79Q94J164J240J032N16K8KL39N78P31J116J421Q86l34r74l13P60
53550C18180Q97r4j298j867j652j010m76m02o48q18q21q35p06p5Q24J120M49l38
53532C10430j36J107K460L076K815K059J365J221J765K668L447L881M111M315
$$ plain form
53518 344584 349068 353585 358119 362994 368704 375464 383171 391892 401986 413414 425263 436508 447104
53505 447104 457842 469218 481068 493280 506217 520273 535570 552161 569978 588508 607176
53494 607176 626243 646617 668540 691120 713475 735653 757982 780188 801758 822736 843596
53483 843596 864640 885876 907149 928118 948528 968804 989828 1011843 1034170 1056365 1078861
53472 1078861 1101923 1124789 1146575 1167409 1187830 1207674 1226414 1244151 1261281 1277529 1292306
53461 1292306 1305755 1318444 1330177 1340110 1348040 1354669 1360529 1365501 1369389 1372073 1372947 1371126 1366495
53448 1366495 1359803 1351527 1341429 1329578 1316971 1304537 1292057 1278647 1263841 1247725 1230439 1212155
53436 1212155 1193321 1174374 1155233 1135521 1115236 1094829 1074608 1054468 1034303 1014437 995406
$$ packed form
53518C44584M484M517M534M875N710O760P707Q721J0094J1428J1849J1245J0596
53505D47104J0738J1376J1850J2212J2937J4056J5297J6591J7817J8530J8668
53494F07176J9067K0374K1923K2580K2355K2178K2329K2206K1570K0978K0860
53483H43596K1044K1236K1273K0969K0410K0276K1024K2015K2327K2195K2496
53472A078861K3062K2866K1786K0834K0421J9844J8740J7737J7130J6248J4777
53461A292306J3449J2689J1733R933P930O629N860M972L888K684Q74j821m631
53448A366495o692q276j0098j1851j2607j2434j2480j3410j4806j6116j7286j8284
53436A212155j8834j8947j9141j9712k0285k0407k0221k0140k0165j9866j9031
$$ plain form
53425 995406 977473 960597 944868 930656 918189 907157 897022 887628 879190 871739 864987 858864
53413 858864 853814 850306 848399 847970 849031 851462 854766 858554 863119 869157 877000 886485 897474 910099
53399 910099 924452 940310 957258 974920 993075 1011770 1031336 1052264 1074961 1099562 1125822
53388 1125822 1153288 1181809 1211810 1243719 1277238 1311716 1347191 1384301 1423022 1462397 1502111
53377 1502111 1543491 1587996 1635124 1682757 1729336 1774838 1819763 1864218 1908261 1952213 1996088
53366 1996088 2039126 2080307 2119049 2155113 2188108 2217477 2242935 2264697 2283171 2298440 2310152
53355 2310152 2318030 2322419 2324017 2323036 2319017 2311637 2301209 2287986 2271481 2251114 2227235 2200787 2171923
53342 2171923 2139657 2103080 2062565 2019587 1975708 1931926 1888790 1846816 1806551 1768117 1730840
$$ packed form
53425I95406j7933j6876j5729j4212j2467j1032j0135r394q438p451o752o123
53413H58864n050l508j907m29J061K431L304L788M565O038P843R485J0989J2625
53399I10099J4353J5858J6948J7662J8155J8695J9566K0928K2697K4601K6260
53388A125822K7466K8521L0001L1909L3519L4478L5475L7110L8721L9375L9714
53377A502111M1380M4505M7128M7633M6579M5502M4925M4455M4043M3952M3875
53366A996088M3038M1181L8742L6064L2995K9369K5458K1762J8474J5269J1712
53355B310152P878M389J598r81m019p380j0428j3223j6505k0367k3879k6448k8864
53342B171923l2266l6577m0515m2978m3879m3782m3136m1974m0265l8434l7277
$$ plain form
53331 1730840 1693732 1656506 1619721 1583783 1548239 1512512 1476872 1442172 1408857 1376730 1345547
53320 1345547 1315345 1286289 1258662 1232951 1209566 1188553 1169796 1153268 1138718 1125397 1112529
53309 1112529 1099799 1087016 1073713 1059779 1046151 1034108 1023951 1015048 1007034 1000156 994450 989467
53297 989467 985062 981774 980129 980064 981272 983566 986666 990053 993347 996525 999639 1002814 1006681 1012412 1020889
53282 1020889 1032062 1045326 1060262 1076791 1094766 1113698 1132879 1151742 1170202 1188627 1207367
53271 1207367 1226364 1245278 1263843 1281891 1299226 1315663 1331027 1344979 1357132 1367552 1376747
53260 1376747 1384825 1391166 1395407 1398269 1400662 1402332 1402162 1399620 1395058 1388748 1380551 1370535 1359062 1346067
53246 1346067 1331056 1314050 1295893 1277409 1258801 1239896 1220300 1199364 1176873 1153903 1132019
$$ packed form
53331A730840l7108l7226l6785l5938l5544l5727l5640l4700l3315l2127l1183
53320A345547l0202k9056k7627k5711k3385k1013j8757j6528j4550j3321j2868
53309A112529j2730j2783j3303j3934j3628j2043j0157q903q014o878n706m983
53297I89467m405l288j645o5J208K294L100L387L294L178L114L175L867N731Q477
53282A020889J1173J3264J4936J6529J7975J8932J9181J8863J8460J8425J8740
53271A207367J8997J8914J8565J8048J7335J6437J5364J3952J2153J0420R195
53260A376747Q078O341M241K862K393J670j70k542m562o310q197j0016j1473j2995
53246A346067j5011j7006j8157j8484j8608j8905j9596k0936k2491k2970k1884
$$ plain form
53235 1132019 1111364 1090479 1068430 1046089 1024764 1004567 984982 966214 948909 932921 917390
53224 917390 901868 886580 871725 857195 842897 828759 814558 800332 786833 774947 764691
53213 764691 755345 746511 738530 731802 726241 721453 716921 711818 705176 696646 686938 677248 668235 659606
53199 659606 650544 640578 630108 620084 611065 602667 594128 585269 576588 568446 560500 552125 543135 533934
53185 533934 525086 516901 509320 501964 494282 485804 476403 466359 456195 446448 437463 429255 421542 414000
53171 414000 406621 399727 393529 387704 381578 374729 367313 359815 352634 345915 339561 333373 327350 321894
53157 321894 317415 313648 309651 304737 299222 294029 289688 285967 282310 278426 274535 271212 268850 267103
53143 267103 265002 261837 257770 253424 249114 244776 240512 236809 234149 232477 231052 228896 225655 222050
$$ packed form
53235A132019k0655k0885k2049k2341k1325k0197j9585j8768j7305j5988j5531
53224I17390j5522j5288j4855j4530j4298j4138j4201j4226j3499j1886j0256
53213G64691r346q834p981o728n561m788m532n103o642q530r708r690r013q629
53199F59606r062r966j0470j0024r019q398q539q859q681q142p946q375q990r201
53185E33934q848q185p581p356p682q478r401j0044j0164r747q985q208p713p542
53171D14000p379o894o198n825o126o849p416p498p181o719o354o188o023n456
53157C21894m479l767l997m914n515n193m341l721l657l884l891l323k362j747
53143B67103k101l165m067m346m310m338m264l703k660j672j425k156l241l605
$$ plain form
53129 222050 219133 217103 215297 213361 211721 210626 209540 208049 206682 206020 205533 204219 202062 199933 198209
53114 198209 196433 194292 192059 189962 187907 185955 184419 183360 182568 182024 181762 181354 180335 179230 179318 181109
53098 181109 183709 185910 187330 188308 189318 190693 192362 193766 194576 195468 197371 199917 201576 201588 200719 199742
53082 199742 198228 195563 192270 189337 186846 184155 181040 177791 174431 170703 166801 163438 161107 159690
53068 159690 158742 157812 156608 155258 154278 153928 153686 152702 150702 148149 145627 143387 141450 139838 138669 138155
53052 138155 138446 139349 140261 140478 139584 137669 135330 133389 132269 131647 130964 130166 129610 129358 129111 128843 128905 129331
53034 129331 129614 129366 128729 127932 126969 125958 125288 125052 124750 123898 122570 121113 119757 118752 118439 118750 118987
53017 118987 118467 117174 115621 114360 113799 114097 114965 115882 116602 117109 117108 116235 114876 114010 113970 114065 113793 113546 113625
$$ packed form
53129B22050k917k030j806j936j640j095j086j491j367o62m87j314k157k129j724
53114A98209j776k141k233k097k055j952j536j059p92n44k62m08j019j105Q8J791
53098A81109K600K201J420R78J010J375J669J404Q10Q92J903K546J659J2q69r77
53082A99742j514k665l293k933k491k691l115l249l360l728l902l363k331j417
53068A59690r48r30j204j350r80l50k42r84k000k553k522k240j937j612j169n14
53052A38155K91R03R12K17q94j915k339j941j120o22o83p98n56k52k47k68O2M26
53034A29331K83k48o37p97r63j011o70k36l02q52j328j457j356j005l13L11K37
53017A18987n20j293j553j261n61K98Q68R17P20N07jq73j359q66m0R5k72k47P9
$$ plain form
52998 113625 113408 112353 111108 110718 111105 111308 110948 110594 110711 111032 111046 110588 109821 109056 108597 108546 108803 109453 110790
52979 110790 112699 114427 115349 115640 115792 115937 116161 116943 118556 120316 121210 121166 121013 121313 121948 122812 124202
52962 124202 126314 128833 131154 132804 133735 134534 136113 138692 141269 142662 142987 143559 145380 148316 151748
52947 151748 155337 158921 162307 165536 168985 172778 176331 178804 179970 180432 180958 181766 182474 182600 181965 180629
52931 180629 178712 176506 174491 172845 171065 168582 165776 163721 162748 161905 160208 157908 156017 155018 154517
52916 154517 153893 152799 151225 149504 148074 147026 146069 145145 144639 144722 144968 144987 144968 145141 145210 144847 144362 144289 144654
52897 144654 145169 145760 146317 146322 145515 144627 144721 145918 147367 148344 148746 148703 148353 147955 147658 147258 146656 146331 146795
52878 146795 147779 148593 149062 149469 149757 149647 149434 149851 151032 152245 152803 152660 152100 151390 150780 150344 149779 148858
$$ packed form
52998A13625k17j055j245l90L87K03l60l54J17L21J4m58p67p65m59n1K57O50J337
52979A10790J909J728R22K91J52J45K24P82J613J760Q94m4j53L00O35Q64J390
52962A24202K112K519K321J650R31P99J579K579K577J393L25N72J821K936L432
52947A51748L589L584L386L229L449L793L553K473J166M62N26Q08P08J26o35j336
52931A80629j917k206k015j646j780k483k806k055r73q43j697k300j891r99n01
52916A54517o24j094j574j721j430j048r57r24n06Q3K46J9j9J73O9l63m85p3L65
52897A44654N15N91N57Nq07q88R4J197J449R77M02m3l50l98k97m00o02l25M64
52878A46795R84Q14M69M07K88j10k13M17J181J213N58j43n60p10o10m36n65r21
$$ plain form
52860 148858 148028 147988 148753 149738 150681 151822 153164 154298 155094 155890 156817 157510 157704 157596 157501 157642 158402 160165
52842 160165 162624 164726 165581 165158 164024 162770 161766 161042 160276 159255 158408 158483 159634 161207 162452 163117
52826 163117 163386 163680 164524 166160 168242 170254 172154 174179 176196 177802 178893 179495 179170 177407 174646
52811 174646 172084 170259 168565 166418 164103 162053 159947 157160 153726 150372 147758 145962 144510 142727
52797 142727 140289 137538 135074 133070 131280 129603 128125 126655 124772 122447 120082 117896 115781 113824
52783 113824 112383 111491 110771 110067 109577 109177 108288 106711 105058 103983 103441 103032 102642 102365 102173 101942 101586
52766 101586 100991 100124 99288 98851 98660 98182 97296 96373 95469 94125 92240 90433 89142 87975 86404 84610
52750 84610 83070 81765 80301 78549 76683 74837 73140 71895 71334 71349 71658 72033 72154 71630 70480 69312
$$ packed form
52860A48858q30m0P65R85R43J141J342J134P96P96R27O93J94j08r5J41P60J763
52842A60165K459K102Q55m23j134j254j004p24p66j021q47P5J151J573J245O65
52826A63117K69K94Q44J636K082K012J900K025K017J606J091O02l25j763k761
52811A74646k562j825j694k147k315k050k106k787l434l354k614j796j452j783
52797A42727k438k751k464k004j790j677j478j470j883k325k365k186k115j957
52783A13824j441q92p20p04m90m00q89j577j653j075n42m09l90k77j92k31l56
52766A01586n95q67q36m37j91m78q86r23r04j344j885j807j291j167j571j794
52750H4610j540j305j464j752j866j846j697j245n61J5L09L75J21n24j150j168
$$ plain form
52734 69312 68703 68604 68550 68163 67224 65645 63735 62241 61779 62295 63197 63826 63716 62815 61700 61184 61429 61727
52716 61727 61367 60417 59397 58548 57824 57303 57196 57465 57668 57227 55938 54384 53759 54861 57235 59678 61539
52699 61539 63017 64246 64867 64749 64471 64603 64950 64905 64216 63130 62165 61950 62816 64294 65449 66005 66666 68082
52681 68082 70056 72091 74098 76104 77867 79348 81095 83559 86438 89249 92112 95293 98352 100437
52667 100437 101255 101130 100263 98581 96239 93720 91399 89373 87674 86297 85134 84169 83555 83223 82653 81374
52651 81374 79370 76700 73164 68896 64963 62601 61970 62191 62535 62968 63590 64168 64442 64461 64470 64683 65158 65640
52633 65640 65609 64758 63407 62160 61274 60635 60182 59986 60004 60108 60319 60677 60979 60995 60844 60846 61079 61419 61946 62864
52613 62864 63974 64607 64235 62942 61296 59955 59387 59653 60361 60940 61103 61003 61032 61469 62227 62831 62810 62183
$$ packed form
52734F9312o09r9n4l87r39j579j910j494m62N16R02O29j10r01j115n16K45K98
52716F1727l60r50j020q49p24n21j07K69K03m41j289j554o25J102K374K443J861
52699F1539J478J229O21j18k78J32L47m5o89j086r65k15Q66J478J155N56O61J416
52681F8082J974K035K007K006J763J481J747K464K879K811K863L181L059K085
52667A00437Q18j25q67j682k342k519k321k026j699j377j163r65o14l32n70j279
52651H1374k004k670l536m268l933k362o31K21L44M33O22N78K74J9RK13M75M82
52633F5640l1q51j351j247q86o39m53j96J8J04K11L58L02J6j51KK33L40N27R18
52613F2864J110O33l72j293j646j341n68K66P08N79J63j00K9M37P58O04k1o27
$$ plain form
52595 62183 61465 61086 60985 60880 60725 60757 61218 62096 63025 63558 63748 64308 65738 67461 68473 68855 69773 71764
52577 71764 73919 75251 75987 76804 77627 78108 78701 80085 81832 82772 82661 82478 82960 83769 84359 84804 85426 86239
52559 86239 87160 88241 89316 89850 89513 88585 87559 86660 86008 85866 86390 87334 88307 89218 90254 91578 93225
52542 93225 95181 97349 99454 101122 102073 102271 101986 101723 101998 103062 104772 106660 108157 108915 109069 109105 109368
52525 109368 109799 110183 110467 110702 110850 110842 110744 110693 110777 111102 111839 113049 114509 115830 116654 116753 116146 115168 114211 113360
52505 113360 112554 112059 112294 113078 113554 113179 112341 111650 111077 110259 109248 108395 107752 107142 106655 106562 106841 107204 107513
52486 107513 107746 107745 107424 107146 107369 108005 108610 109194 110322 112282 114546 116242 116955 116991 117036 117515 118172 118372 117990
52467 117990 117786 118612 120342 121921 122424 121834 120858 120225 120160 120342 120348 120174 120158 120372 120402 119914 119129 118571 118592 119284
$$ packed form
52595F2183p18l79j01j05j55L2M61Q78R29N33J90N60J430J723J012L82R18J991
52577G1764K155J332P36Q17Q23M81N93J384J747R40j11j83M82Q09N90M45O22Q13
52559H6239R21J081J075N34l37r28j026q99o52j42N24R44R73R11J036J324J647
52542I3225J956K168K105J668R51J98k85k63K75J064J710J888J497P58J54L6K63
52525A09368M31L84K84K35J48qr8n1Q4L25P37J210J460J321Q24R9o07r78r57q51
52505A13360q06m95K35P84M76l75q38o91n73q18j011q53o43o10m87r3K79L63L09
52486A07513K33jl21k78K23O36O05N84J128J960K264J696P13L6M5M79O57K00l82
52467A17990k04Q26J730J579N03n90r76o33o5J82Oj74j6K14L0m88p85n58K1O92
$$ plain form
52447 119284 120471 121589 122003 121763 121661 122212 123036 123529 123643 123533 122997 121883 120640 119853 119551 119482 119633 119822
52429 119822 119291 117607 115623 114629 114725 114968 115012 115563 117031 118679 119492 119304 118706 118311 118319 118416 118007 116934 115974
52410 115974 116175 117635 119406 120642 121418 122380 124027 126288 128407 129368 128919 128168 128625 130696 133525 136194
52394 136194 138470 140512 142484 144461 146188 147007 146624 145769 145436 145578 145373 144640 144074 144041 144066 143719 143108 142263
52376 142263 140916 139237 137958 137420 137238 137264 138013 139662 141446 142664 143610 144902 146493 148043 149698 151773
52360 151773 154029 156004 157836 160096 162964 166098 169192 172217 175176 178022 180725 183171 185138 186666
52346 186666 188216 190200 192508 194805 197077 199612 202592 205896 209196 212046 214111 215495 216679 217990
52332 217990 219377 220792 222428 224330 226151 227616 229067 231190 234293 238056 241933 245684 249536 253875
$$ packed form
52447A19284J187J118M14k40j02N51Q24M93J14j10n36j114j243p87l02o9J51J89
52429A19822n31j684j984r94R6K43M4N51J468J648Q13j88n98l95QR7m09j073r60
52410A15974K01J460J771J236P76R62J647K261K119R61m49p51M57K071K829K669
52394A36194K276K042J972J977J727Q19l83q55l33J42k05p33n66l3K5l47o11q45
52376A42263j347j679j279n38j82K6P49J649J784J218R46J292J591J550J655K075
52360A51773K256J975J832K260K868L134L094L025K959K846K703K446J967J528
52346A86666J550J984K308K297K272K535K980L304L300K850K065J384J184J311
52332B17990J387J415J636J902J821J465J451K123L103L763L877L751L852M339
$$ plain form
52318 253875 258744 263786 268809 274095 279778 285252 289869 294110 299289 305990 313574 321431 329928 339693
52304 339693 350636 362253 374402 387165 400278 413237 425800 438029 450143 462657 476319
52293 476319 491398 507247 522964 538310 553573 568746 583372 597184 610475 623716 637029
52282 637029 650122 662625 674425 685619 696140 705626 713885 721317 728410 734892 739869 742893 744460
52269 744460 745342 745889 746124 746018 745436 744234 742657 741248 740172 739047 737674 736506 736153 736796 738311 740553
52253 740553 743294 746334 749879 754311 759407 764463 769583 776160 785394 796750 808553 819814 830826
52240 830826 842144 853717 865146 876314 887495 898974 910655 922077 932893 943182 953003 961748
52228 961748 968448 972789 975339 976699 976931 975984 974040 971168 967210 962381 957438 952832 948155 942731 936300
$$ packed form
52318B53875M869N042N023N286N683N474M617M241N179O701P584P857Q497R765
52304C39693J0943J1617J2149J2763J3113J2959J2563J2229J2114J2514J3662
52293D76319J5079J5849J5717J5346J5263J5173J4626J3812J3291J3241J3313
52282F37029J3093J2503J1800J1194J0521R486Q259P432P093O482M977L024J567
52269G44460Q82N47K35j06n82j202j577j409j076j125j373j168l53O43J515K242
52253G40553K741L040L545M432N096N056N120O577R234J1356J1803J1261J1012
52240H30826J1318J1573J1429J1168J1181J1479J1681J1422J0816J0289R821Q745
52228I61748O700M341K550J360K32r47j944k872l958m829m943m606m677n424o431
$$ plain form
52213 936300 928848 920370 911236 902214 893628 884909 875474 865605 856097 847564 840430 834913 830390 825485
52199 825485 819549 813544 808724 805008 801523 798191 795754 794452 793740 793233 793020 793071 793131 793270 793801 794516 794705
52182 794705 794025 792791 791310 789484 787177 784549 781910 779575 777799 776481 775093 773282 771385 769837
52168 769837 768287 765923 762593 758994 755750 752834 749921 746753 743122 738984 734638 730476 726596 723032
52154 723032 720129 718167 716715 714971 712690 710226 707744 705002 701955 698958 696235 693602 690847 687995
52140 687995 685147 682436 680127 678369 676895 675333 673726 672352 671161 669863 668421 666968 665340 663281
52126 663281 660948 658670 656338 653745 651349 649956 649638 649758 650096 651145 653102 655446 657780 660354 663414
52111 663414 666722 670136 674067 678895 684431 690422 697167 705207 714737 725664 737865 751047 764711
$$ packed form
52213I36300p452q478r134r022q586q719r435r869r508q533p134n517m523m905
52199H25485n936o005m820l716l485l332k437j302p12n07k13N1O0J39N31P15J89
52182G94705o80j234j481j826k307k628k639k335j776j318j388j811j897j548
52168G69837j550k364l330l599l244k916k913l168l631m138m346m162l880l564
52154G23032k903j962j452j744k281k464k482k742l047k997k723k633k755k852
52140F87995k848k711k309j758j474j562j607j374j191j298j442j453j628k059
52126F63281k333k278k332k593k396j393l18J20L38J049J957K344K334K574L060
52111F63414L308L414L931M828N536N991O745Q040R530J0927J2201J3182J3664
$$ plain form
52098 764711 778698 793525 809834 827674 846579 866056 885721 905175 924125 942523 960356
52087 960356 977354 993013 1006894 1018867 1029230 1038560 1047199 1054933 1061326 1066195 1069450 1070749 1069977
52074 1069977 1067954 1065876 1063874 1060873 1056118 1050168 1043984 1037681 1030761 1023066 1014904 1006510 998032 989885
52060 989885 982642 976583 971636 967635 964382 961656 959450 958040 957534 957636 958191 959705 962801 967263 972098
52045 972098 976596 980941 985686 991032 996865 1003256 1010479 1018391 1026036 1032184 1036407 1039422 1042211 1044904
52031 1044904 1046788 1047258 1046446 1044920 1043097 1041047 1038576 1035367 1031269 1026547 1021540 1016037 1009307 1000918
52017 1000918 991179 980678 969665 958154 946232 933900 920870 906959 892566 878356 864442
52006 864442 850272 835323 819606 803346 786505 768958 751077 733730 717506 702020 686235
$$ packed form
52098G64711J3987J4827J6309J7840J8905J9477J9665J9454J8950J8398J7833
52087I60356J6998J5659J3881J1973J0363R330Q639P734O393M869L255J299p72
52074A069977k023k078k002l001m755n950o184o303o920p695q162q394q478q147
52060I89885p243o059m947m001l253k726k206j410n06J02N55J514L096M462M835
52045I72098M498M345M745N346N833O391P223P912P645O148M223L015K789K693
52031A044904J884M70q12j526j823k050k471l209m098m722n007n503o730q389
52017A000918r739j0501j1013j1511j1922j2332j3030j3911j4393j4210j3914
52006H64442j4170j4949j5717j6260j6841j7547j7881j7347j6224j5486j5785
$$ plain form
51995 686235 669506 652137 634910 618295 602254 586571 571031 555427 539728 524336 509873
51984 509873 496534 483759 470662 456812 442594 428868 416264 404779 394012 383639 373514
51973 373514 363520 353763 344892 337696 332130 327196 322066 316846 311897 306992 301804 296786 292736 289677
51959 289677 286896 283982 281050 278018 274494 270561 266871 263672 260398 256539 252341 248305 244479 240727
51945 240727 237317 234747 233093 231751 229853 226926 223389 220261 218101 216352 214149 211595 209597 208530
51931 208530 207802 206875 205869 204938 203809 202391 201130 200219 199057 197105 194780 192872 191482 190207 189049
51916 189049 188438 188453 188642 188565 188033 186873 184963 182590 180369 178740 177728 177127 176660 176027 175092 174113 173608
51899 173608 173934 174939 175895 175851 174387 172099 170081 168823 167993 167323 167115 167583 168244 168515 168536 168845 169527 170240
$$ packed form
51995F86235j6729j7369j7227j6615j6041j5683j5540j5604j5699j5392j4463
51984E09873j3339j2775j3097j3850j4218j3726j2604j1485j0767j0373j0125
51973C73514r994r757q871p196n566m934n130n220m949m905n188n018m050l059
51959B89677k781k914k932l032l524l933l690l199l274l859m198m036l826l752
51945B40727l410k570j654j342j898k927l537l128k160j749k203k554j998j067
51931B08530p28r27j006r31j129j418j261r11j162j952k325j908j390j275j158
51916A89049o11J5J89p7n32j160j910k373k221j629j012o01m67o33r35r79n05
51899A73608L26J005R56m4j464k288k018j258q30o70k08M68O61K71K1L09O82P13
$$ plain form
51881 170240 170885 171649 172440 172812 172544 171870 171123 170526 170398 171137 172798 174864 176592 177510 177634 177399 177361 177812
51863 177812 178637 179543 180345 180960 181381 181847 182874 184796 187343 189855 191859 193240 194022 194289 194266 194236 194314 194486
51845 194486 194816 195425 196227 196897 197151 196975 196582 196187 195814 195318 194670 194189 194274 194807 195016 194147 192250 190177
51827 190177 188845 188534 188777 188864 188480 187875 187421 187222 187326 188110 189955 192586 195153 197079 198431 199337 199558
51810 199558 198976 198117 197796 198352 199458 200471 200754 199964 198422 197079 196807 197668 198959 199890 200186 200237 200710
51793 200710 201794 202827 202926 202032 201005 200580 200697 200969 201325 201919 202812 204017 205529 206999 207878 208229 208975
51776 208975 210878 213566 216006 217628 218576 219108 219335 219380 219329 219171 219110 219751 221447 223688 225611 226996 228287
51759 228287 229730 231091 232293 233856 236429 240093 244209 247926 250821 253095 255013 256198 255886 253959
$$ packed form
51881A70240O45P64P91L72k68o74p47n97j28P39J661K066J728R18J24k35l8M51
51863A77812Q25R06Q02O15M21M66J027J922K547K512K004J381P82K67k3l0P8J72
51845A94486L30O09Q02O70K54j76l93l95l73m96o48m81Q5N33K09q69j897k073
51827A90177j332l11K43Q7l84o05m54j99J04P84J845K631K567J926J352R06K21
51810A99558n82q59l21N56J106J013K83p90j542j343k72Q61J291R31K96N1M73
51793B00710J084J033R9q94j027m25J17K72L56N94Q93J205J512J470Q79L51P46
51776B08975J903K688K440J622R48N32K27M5n1j58o1O41J696K241J923J385J291
51759B28287J443J361J202J563K573L664M116L717K895K274J918J185l12j927
$$ plain form
51745 253959 251210 248368 245416 242294 239632 238089 237377 236704 235953 235610 235707 235658 235168 234537 233954 233220 232369
51728 232369 231898 232089 232579 232895 232958 232845 232469 231830 231242 230989 230887 230384 228939 226309 222739 218992 215911
51711 215911 213818 212449 211409 210418 209233 207827 206673 206400 206932 207333 206668 204768 202096 199270 196927
51696 196927 195625 195407 195611 195446 194779 194196 194340 195342 196804 198236 199568 201310 204221 208688 214327 220033
51680 220033 224416 226487 226222 224536 222562 220926 219686 218740 218140 218128 219085 221272 224454 227933 231130 233955
51664 233955 236372 237926 238127 237139 235648 234097 232434 230530 228418 226065 223346 220322 217275 214363 211481
51649 211481 208468 205244 201815 198407 195495 193405 191905 190504 189033 187636 186392 185310 184508 183869 182705
51634 182705 180395 177339 174643 172833 171491 170199 169050 168016 166589 164585 162704 161770 161724 161869 161835 161845
$$ packed form
51745B53959k749k842k952l122k662j543p12o73p51l43R7m9m90o31n83p34q51
51728B32369m71J91M90L16O3j13l76o39n88k53j02n03j445k630l570l747l081
51711B15911k093j369j040r91j185j406j154k73N32M01o65j900k672k826k343
51696A96927j302k18K04j65o67n83J44J002J462J432J332J742K911M467N639N706
51680B20033M383K071k65j686j974j636j240r46o00j2R57K187L182L479L197K825
51664B33955K417J554K01r88j491j551j663j904k112k353k719l024l047k912k882
51649B11481l013l224l429l408k912k090j500j401j471j397j244j082q02o39j164
51634A82705k310l056k696j810j342j292j149j034j427k004j881r34m6J45l4J0
$$ plain form
51618 161845 162191 162851 163535 163852 163532 162666 161574 160381 159020 157767 157306 157993 159325 160489 161142 161387 161348
51601 161348 161181 161210 161608 162097 162373 162670 163504 165032 167048 169457 172281 175283 178090 180708 183471 186464
51585 186464 189523 192828 196922 201862 206889 211333 215426 219741 224135 227840 230529 232631 234491 235724
51571 235724 235645 233987 230981 227185 223540 221178 220469 220389 219424 217210 214844 213471 213096 213033 213050 213605 215183
51554 215183 217791 221055 224523 227974 231653 236081 241405 247030 252112 256305 259861 263153 266315 269211
51540 269211 271508 272900 273458 273641 273804 273881 273735 273575 273698 274110 274768 275938 277836 280015 281600 282128 281804
51523 281804 280995 279906 278706 277519 276222 274566 272506 270139 267388 264105 260431 256683 252976 249333
51509 249333 246071 243539 241523 239441 237225 235409 234182 232875 230742 227894 225160 223264 222334 221982 221706
$$ packed form
51618A61845L46O60O84L17l20q66j092j193j361j253m61O87J332J164O53K45l9
51601A61348j67K9L98M89K76K97Q34J528K016K409K824L002K807K618K763K993
51585A86464L059L305M094M940N027M444M093M315M394L705K689K102J860J233
51571B35724p9j658l006l796l645k362p09q0r65k214k366j373l75o3J7N55J578
51554B15183K608L264L468L451L679M428N324N625N082M193L556L292L162K896
51540B69211K297J392N58J83J63P7j46j60J23M12O58J170J898K179J585N28l24
51523B81804q09j089j200j187j297j656k060k367k751l283l674l748l707l643
51509B49333l262k532k016k082k216j816j227j307k133k848k734j896r30l52k76
$$ plain form
51494 221706 221317 221053 221139 221327 221238 221058 221485 222924 225138 227712 230397 232875 234682 235630 236064 236526 237379
51477 237379 238718 240303 241594 242278 242774 243759 245211 246502 247518 249002 251539 254851 258455 262420 266923
51462 266923 271504 275336 278088 280099 281846 283537 285086 286291 287185 288274 290012 291941 292818 291919 289831
51447 289831 287676 286037 284991 284624 284891 285308 285390 285260 285279 285302 284815 283705 282298 280544 277754 273358 267671
51430 267671 261634 255911 250421 244731 238758 232893 227427 222192 217052 212491 209154 206876 204798 202573
51416 202573 200795 199949 199518 198608 197026 195303 194041 193701 194666 196956 200011 203153 206148 209049 211795
51401 211795 214278 216526 218419 219547 219707 219284 218720 217891 216451 214507 212453 210277 207502 203672 198594
51386 198594 192354 185563 179299 174280 170225 166388 162501 158787 155400 152426 150165 148790 147811 146470
$$ packed form
51494B21706l89k64Q6J88q9j80M27J439K214K574K685K478J807R48M34M62Q53
51477B37379J339J585J291O84M96R85J452J291J016J484K537L312L604L965M503
51462B66923M581L832K752K011J747J691J549J205Q94J089J738J929Q77q99k088
51447B89831k155j639j046l67K67M17Q2j30J9K3m87j110j407j754k790m396n687
51430B67671o037n723n490n690n973n865n466n235n140m561l337k278k078k225
51416B02573j778q46m31r10j582j723j262l40R65K290L055L142K995K901K746
51401B11795K483K248J893J128J60m23n64q29j440j944k054k176k775l830n078
51386A98594o240o791o264n019m055l837l887l714l387k974k261j375r79j341
$$ plain form
51372 146470 144542 142266 139671 136671 133673 131387 129987 129017 128048 126836 125012 122457 120007 118916 119351
51357 119351 120123 120144 119459 118598 117752 117044 116880 117325 117652 117173 116193 115516 115305 115100 114819 115019 116031 117368
51339 117368 118245 118404 118235 118247 118618 119159 119567 119699 119697 119940 120844 122545 124777 127199 129917 133407 137690 141906
51321 141906 145159 147622 150321 153791 157485 160595 162942 164837 166541 168217 170021 171759 172649 171892 169445
51306 169445 165972 162134 158204 154266 150398 146587 142708 138690 134603 130597 126910 123888 121760 120314
51292 120314 118918 117046 114737 112509 110861 109912 109480 109390 109585 109962 110203 109890 108832 107320 106074 105859
51276 105859 106952 108872 110682 111671 111774 111390 110982 110851 111070 111443 111662 111709 111947 112609 113332 113497 113045 112671
51258 112671 113094 114280 115492 116046 115955 115820 116092 116526 116516 115901 115136 114587 114083 113410 112833 112661 112566 111959 110949
$$ packed form
51372A46470j928k276k595l000k998k286j400r70r69j212j824k555k450j091M35
51357A19351P72K1o85q61q46p08j64M45L27m79r80o77k11k05k81K00J012J337
51339A17368Q77J59j69J2L71N41M08J32kK43R04J701K232K422K718L490M283M216
51321A41906L253K463K699L470L694L110K347J895J704J676J804J738Q90p57k447
51306A69445l473l838l930l938l868l811l879m018m087m006l687l022k128j446
51292A20314j396j872k309k228j648r49m32r0J95L77K41l13j058j512j246k15
51276A05859J093J920J810R89J03l84m08j31K19L73K19M7K38O62P23J65m52l74
51258A12671M23J186J212N54r1j35K72M34j0o15p65n49n04o73n77j72r5o07j010
$$ plain form
51239 110949 110352 110693 111672 112689 113388 113595 113266 112770 112748 113347 113954 113944 113337 112430 111245 109831 108734 108584
51221 108584 109320 110339 111272 112111 112701 112801 112733 113279 114608 115841 116097 115590 115232 115469 116049 116705 117397 117887
51203 117887 117739 116989 116337 116385 117090 118184 119636 121202 121993 121177 119051 116804 115213 114163 113433 113198 113482
51186 113482 113773 113657 113362 113133 112420 110366 107019 103535 101151 100318 100809 102143 103736 105086 106097 107080
51170 107080 108238 109333 110002 110247 110359 110400 110043 109073 107847 106992 106640 106240 105281 103933 102736 101824 100867
51153 100867 99716 98620 97751 97002 96428 96413 97097 98008 98607 98879 99066 99135 98958 98765 98968 99655 100658 101942
51135 101942 103550 105278 106856 108310 109750 110897 111293 110938 110278 109563 108648 107450 106178 105019 103947
51120 103947 102983 102290 101889 101496 100789 99670 98332 97211 96814 97323 98405 99619 100846 102083 103071 103618
$$ packed form
51239A10949n97L41R79J017O99K07l29m96k2N99O07j0o07r07j185j414j097j50
51221A08584P36J019R33Q39N90J00o8N46J329J233K56n07l58K37N80O56O92M90
51203A17887j48p50o52M8P05J094J452J566P91q16k126k247j591j050p30k35K84
51186A13482K91j16k95k29p13k054l347l484k384q33M91J334J593J350J011R83
51170A07080J158J095O69K45J12M1l57r70j226q55l52m00r59j348j197r12r57
51153A00867j151j096q69p49n74j5O84R11N99K72J87O9j77j93K03O87J003J284
51135A01942J608J728J578J454J440J147L96l55o60p15r15j198j272j159j072
51120A03947r64o93m01l93p07j119j338j121l97N09J082J214J227J237R88N47
$$ plain form
51104 103618 104133 105266 106995 108579 109517 110081 110798 111816 112974 114068 114910 115394 115676 116016 116406 116657 116871
51087 116871 117367 118088 118527 118456 118280 118440 118773 118708 117910 116602 115470 115252 116100 117307 117988 118097 118376 119340
51069 119340 120757 122160 123258 123689 123118 121873 120934 120848 121119 121107 121004 121414 122327 123129 123396 123213 122917 122993
51051 122993 123988 126037 128567 130828 132595 134014 135033 135514 135748 136315 137401 138603 139402 139492 138816 137675
51035 137675 136776 136753 137572 138657 139528 140031 140126 139948 140053 141101 143170 145734 148330 150871 153198 154823 155386
51018 155386 155092 154474 153977 153926 154595 155987 157703 159266 160546 161759 163229 165346 168496 172708 177351 181532
51002 181532 184910 187945 191249 194924 198744 202763 207356 212672 218397 224231 230314 236982 244390 252663
50988 252663 262100 272771 284023 295009 305846 317792 332078 348930 367866 388518 410885 435232
$$ packed form
51104A03618N15J133J729J584R38N64P17J018J158J094Q42M84K82L40L90K51K14
51087A16871M96P21M39p1j76J60L33o5p98j308j132k18Q48J207O81J09K79R64
51069A19340J417J403J098M31n71j245r39q6K71j2j03M10R13Q02K67j83k96P6
51051A22993R95K049K530K261J767J419J019M81K34N67J086J202P99R0o76j141
51035A37675q99k3Q19J085Q71N03R5j78J05J048K069K564K596K541K327J625N63
51018A55386k94o18m97n1O69J392J716J563J280J213J470K117L150M212M643M181
51002A81532L378L035L304L675L820M019M593N316N725N834O083O668P408Q273
50988B52663R437J0671J1252J0986J0837J1946J4286J6852J8936K0652K2367K4347
$$ plain form
50976 435232 462174 492540 526711 564229 604437 647297 693212 742271 794111 848357 904597
50965 904597 961957 1019162 1075074 1128703 1178740 1223754 1263129 1297291 1326716 1351107 1369892
50954 1369892 1383104 1391278 1394834 1394128 1390040 1383933 1377044 1370270 1364526 1360704 1359040 1358828 1358955 1358447 1356447
50939 1356447 1352152 1345149 1335433 1322766 1306302 1285285 1259890 1230748 1197801 1160222 1117684 1071175
50927 1071175 1022441 973021 923945 875804 828800 783129 739614 699505 663376 630667 600743
50916 600743 573854 550468 530122 511802 495196 480753 468480 457583 447529 438758 432010 427406
50904 427406 424463 422559 421106 419673 418256 417130 416264 415216 413752 412208 411008 410250 409978 410485 411969
50889 411969 414168 416622 419128 421744 424582 427792 431479 435505 439730 444562 450781 458462 466575 474159
$$ packed form
50976D35232K6942L0366L4171L7518M0208M2860M5915M9059N1840N4246N6240
50965I04597N7360N7205N5912N3629N0037M5014L9375L4162K9425K4391J8785
50954A369892J3212Q174L556p06m088o107o889o774n744l822j664k12J27n08k000
50939A356447m295p003r716j2667j6464k1017k5395k9142l2947l7579m2538m6509
50927A071175m8734m9420m9076m8141m7004m5671m3515m0109l6129l2709k9924
50916F00743k6889k3386k0346j8320j6606j4443j2273j0897j0054q771o748m604
50904D27406k943j904j453j433j417j126q66j048j464j544j200p58k72N07J484
50889D11969K199K454K506K616K838L210L687M026M225M832O219P681Q113P584
$$ plain form
50875 474159 481610 490318 501207 514126 528503 544172 561544 581298 603955 629568 657904 689087
50863 689087 723887 763229 807612 857270 912675 974583 1043678 1120425 1205108 1297763 1398150
50852 1398150 1505911 1620568 1741204 1866415 1994725 2124687 2254264 2380333 2499061
50843 2499061 2606553 2699215 2774360 2831249 2871229 2896175 2906961 2903997 2888988 2865405 2837228
50832 2837228 2807811 2779882 2755836 2737637 2726691 2723801 2728678 2739326 2752340 2764061 2771349 2771398
50820 2771398 2761501 2739352 2703458 2653228 2588995 2511996 2423975 2326569 2221250 2109792 1994502
50809 1994502 1877909 1762531 1650825 1544882 1445906 1354185 1269666 1192461 1122925 1061588
50799 1061588 1008877 964422 926659 893721 864875 840686 821599 806935 795548 786902 780989 777514
$$ packed form
50875D74159P451Q708J0889J2919J4377J5669J7372J9754K2657K5613K8336L1183
50863F89087L4800L9342M4383M9658N5405O1908O9095P6747Q4683R2655J00387
50852A398150J07761J14657J20636J25211J28310J29962J29577J26069J18728
50843B499061J07492R2662P5145N6889L9980K4946J0786k964j5009k3583k8177
50832B837228k9417k7929k4046j8199j0946k890M877J0648J3014J1721P288M9
50820B771398r897k2149l5894n0230o4233p6999q8021r7406j05319j11458j15290
50809A994502j16593j15378j11706j05943r8976r1721q4519p7205o9536o1337
50799A061588n2711m4455l7763l2938k8846k4189j9087j4664j1387q646n913l475
$$ plain form
50787 777514 775741 775044 775176 775942 776891 777390 776843 774914 771681 767501 762551 756566 749165 740376 730648 720372
50771 720372 709502 697720 684871 671267 657598 644639 633031 623254 615605 610069 606325 604021
50759 604021 602999 603154 604216 605957 608629 613008 619987 630186 643806 660580 679908 701330 725044
50746 725044 751808 782299 816755 855288 898381 946861 1001382 1061931 1127910 1198726 1274195
50735 1274195 1354172 1437797 1523440 1609475 1694692 1777689 1856260 1927854 1990378 2042223 2081802
50724 2081802 2107719 2119311 2116614 2100169 2071533 2033862 1991099 1946400 1901835 1859466 1821701
50713 1821701 1790240 1765463 1747322 1736087 1731571 1732123 1735044 1737768 1738223 1734465 1724655 1707285 1681134
50700 1681134 1645313 1599915 1546403 1486837 1422840 1355723 1287268 1219611 1154295 1091991 1033254
$$ packed form
50787G77514j773o97J32P66R49M99n47j929l233m180m950n985p401q789r728j0276
50771G20372j0870j1782j2849j3604j3669j2959j1608r777p649n536l744k304
50759F04021j022J55J062J741K672M379O979J0199J3620J6774J9328K1422K3714
50746G25044K6764L0491L4456L8533M3093M8480N4521O0549O5979P0816P5469
50735A274195P9977Q3625Q5643Q6035Q5217Q2997P8571P1594O2524N1845L9579
50724B081802K5917J1592k697j6445k8636l7671m2763m4699m4565m2369l7765
50713A821701l1461k4777j8141j1235m516N52K921K724M55l758r810j7370k6151
50700A681134l5821m5398n3512n9566o3997o7117o8455o7657o5316o2304n8737
$$ plain form
50689 1033254 979061 930379 887548 850219 817684 789258 764700 744407 728982 718480 712298
50678 712298 709720 710326 713812 719802 728029 738427 750848 764836 779879 795759 812427 829549 846309
50665 846309 861743 875309 887136 897719 907351 915926 923316 929762 935672 941143 945978 950203 954349
50652 954349 959103 964954 972386 982225 995457 1012525 1032966 1055949 1081177 1109151 1140398 1174597
50640 1174597 1210635 1247449 1284483 1321279 1356982 1390554 1421258 1448684 1472439 1492163 1507779
50629 1507779 1519423 1527230 1531604 1533735 1535386 1537928 1541853 1547410 1555322 1566467 1581023 1598288 1617209
50616 1617209 1636698 1655421 1671782 1684445 1692781 1696778 1696723 1693121 1686678 1677911 1666704 1652369 1634224
50603 1634224 1612003 1585657 1554885 1519073 1477739 1431057 1379967 1325864 1270210 1214376 1159595
$$ packed form
50689A033254n4193m8682m2831l7329l2535k8426k4558k0293j5425j0502o182
50678G12298k578O06L486N990Q227J0398J2421J3988J5043J5880J6668J7122J6760
50665H46309J5434J3566J1827J0583R632Q575P390O446N910N471M835M225M146
50652I54349M754N851P432R839J3232J7068K0441K2983K5228K7974L1247L4199
50640A174597L6038L6814L7034L6796L5703L3572L0704K7426K3755J9724J5616
50629A507779J1644P807M374K131J651K542L925N557P912J1145J4556J7265J8921
50616A617209J9489J8723J6361J2663Q336L997n5l602o443q767j1207j4335j8145
50603A634224k2221k6346l0772l5812m1334m6682n1090n4103n5654n5834n4781
$$ plain form
50592 1159595 1106755 1056198 1007838 961642 917944 877167 839351 804211 771744 742560 717400
50581 717400 696255 678135 661790 646707 633400 622761 615138 610102 607049 605864 606857 610130 615216
50568 615216 621452 628620 637098 647368 659477 673023 687627 703281 720225 738639 758597 780206
50556 780206 803450 827940 853166 879121 906195 934135 961558 987037 1010499 1033014 1055349
50545 1055349 1077434 1099263 1121606 1145479 1171511 1200100 1231664 1266256 1303349 1342524 1384134
50534 1384134 1428894 1477135 1528995 1585093 1646311 1712829 1783834 1858253 1935272 2013989 2092947
50523 2092947 2170287 2244234 2313337 2376340 2431906 2478421 2514118 2537603 2548285 2546313 2532220
50512 2532220 2506697 2470540 2424605 2369900 2307912 2240714 2170716 2100446 2032599 1969829 1914068
$$ packed form
50592A159595n2840n0557m8360m6196m3698m0777l7816l5140l2467k9184k5160
50581G17400k1145j8120j6345j5083j3307j0639p623n036l053j185R93L273N086
50568F15216O236P168Q478J0270J2109J3546J4604J5654J6944J8414J9958K1609
50556G80206K3244K4490K5226K5955K7074K7940K7423K5479K3462K2515K2335
50545A055349K2085K1829K2343K3873K6032K8589L1564L4592L7093L9175M1610
50534A384134M4760M8241N1860N6098O1218O6518P1005P4419P7019P8717P8958
50523B092947P7340P3947O9103O3003N5566M6515L5697K3485J0682j972j4093
50512B532220k5523l6157m5935n4705o1988o7198o9998p0270o7847o2770n5761
$$ plain form
50501 1914068 1866218 1826735 1796164 1774715 1761654 1755634 1755485 1760292 1769086 1781239 1797055 1817148
50489 1817148 1840932 1866109 1889609 1908387 1919277 1918964 1904903 1876266 1833863 1779444 1715237 1643747
50477 1643747 1567531 1489055 1410644 1334187 1260772 1190871 1124944 1063606 1007162 955436 908251
50466 908251 865730 827940 794546 765080 739377 717592 699945 686474 676794 670053 665424 662682
50454 662682 662031 663396 666340 670711 676907 685269 695595 707466 720649 735036 750529 767160 784963
50441 784963 803559 822380 841491 861699 883404 905818 927693 948498 968470 987919 1007088
50430 1007088 1026389 1046204 1066462 1086862 1107429 1128490 1150170 1172260 1194567 1217197 1240620
50419 1240620 1265732 1293664 1325060 1359541 1396063 1433761 1472247 1511241 1550272 1588667 1625543
$$ packed form
50501A914068m7850l9483l0571k1449j3061o020j49M807Q794J2153J5816K0093
50489A817148K3784K5177K3500J8778J0890l13j4061k8637m2403n4419o4207p1490
50477A643747p6216p8476p8411p6457p3415o9901o5927o1338n6444n1726m7185
50466I08251m2521l7790l3394k9466k5703k1785j7647j3471r680o741m629k742
50454F62682o51J365K944M371O196Q362J0326J1871J3183J4387J5493J6631J7803
50441G84963J8596J8821J9111K0208K1705K2414K1875K0805J9972J9449J9169
50430A007088J9301J9815K0258K0400K0567K1061K1680K2090K2307K2630K3423
50419A240620K5112K7932L1396L4481L6522L7698L8486L8994L9031L8395L6876
$$ plain form
50408 1625543 1659763 1690158 1715900 1736641 1752440 1763538 1769915 1770734 1764406 1749524 1725769 1693830
50396 1693830 1654649 1608942 1557219 1499970 1437956 1372565 1305824 1239863 1176429 1116894 1062370
50385 1062370 1013475 970229 932526 900579 874650 854643 840388 832128 830201 834216 843024 855502
50373 855502 871024 889068 908734 928741 947518 963096 973292 976517 972487 962031 946187 925647
50361 925647 901131 874026 846231 819127 792892 767094 741784 717677 695354 674808 655827
50350 655827 638310 621996 606404 591477 577875 566174 556048 546681 537894 530350 524699 520914
50338 520914 518508 517097 516592 517045 518448 520748 524108 529020 535878 544366 553582 562866 572236 581968 592249
50323 592249 603384 615750 629193 642955 656692 671042 686563 702546 717670 731619 745242
$$ packed form
50408A625543L4220L0395K5742K0741J5799J1098O377Q19o328j4882k3755l1939
50396A693830l9181m5707n1723n7249o2014o5391o6741o5961o3434n9535n4524
50385A062370m8895m3246l7703l1947k5929k0007j4255q260j927M015Q808J2478
50373H55502J5522J8044J9666K0007J8777J5578J0196L225m030j0456j5844k0540
50361I25647k4516k7105k7795k7104k6235k5798k5310k4107k2323k0546j8981
50350F55827j7517j6314j5592j4927j3602j1701j0126r367q787p544n651l785
50338E20914k406j411n05M53J403K300L360M912O858Q488R216R284R370R732J0281
50323E92249J1135J2366J3443J3762J3737J4350J5521J5983J5124J3949J3623
$$ plain form
50312 745242 759145 772912 785948 798393 810857 823676 836778 850035 863467 877107 890694
50301 890694 903464 914411 923089 930003 935937 940971 944546 946364 946671 945563 942361 935941 925462 910738
50287 910738 892252 871013 848295 825285 802831 781295 760504 739976 719378 698761 678390
50276 678390 658652 640243 623992 610187 598354 587962 578978 571429 564898 559038 554204 550941 549078
50263 549078 547948 547274 547170 547476 547907 548759 550623 553365 556177 558772 561744 565524 569694 573592 576897
50248 576897 579309 580375 580142 579464 579039 578491 576859 573795 569889 565951 562310 558715 554751 550348 545869
50233 545869 541585 537261 532562 527738 523393 519697 516343 513294 510993 509773 509644 510662 512849 515673
50219 515673 518390 521148 524954 530220 536019 541185 545440 548975 551693 553509 554767 555653 555697 554564 552899
$$ packed form
50312G45242J3903J3767J3036J2445J2464J2819J3102J3257J3432J3640J3587
50301H90694J2770J0947Q678O914N934N034L575J818L07j108l202o420j0479j4724
50287I10738j8486k1239k2718k3010k2454k1536k0791k0528k0598k0617k0371
50276F78390j9738j8409j6251j3805j1833j0392q984p549o531n860m834l263j863
50263E49078j130o74j04L06M31Q52J864K742K812K595K972L780M170L898L305
50248E76897K412J066k33o78m25n48j632l064l906l938l641l595l964m403m479
50233E45869m284m324m699m824m345l696l354l049k301j220j29J018K187K824
50219E15673K717K758L806N266N799N166M255L535K718J816J258Q86M4j133j665
$$ plain form
50204 552899 551630 550709 549238 546589 542732 537811 532163 526563 521690 517330 512746 507752 502830 498250
50190 498250 493752 489100 484290 479195 473566 467526 461499 455578 449492 443334 437785 433387 430021 427293
50176 427293 425089 423549 422798 422806 423202 423198 422014 419543 416255 412435 407861 402303 395903 388950 381646 374294
50160 374294 367321 360939 355120 349992 345852 342571 339474 336135 332860 330043 327440 324624 321823 319674
50146 319674 318264 317009 315533 314091 313021 312295 311822 311765 312210 312837 313303 313775 314652 315858 316850 317395 318017
50129 318017 319426 321782 324786 328370 332947 338842 345696 352583 358751 364158 369359 374924 380952 387093
50115 387093 392955 398500 404027 409864 416107 422606 429085 435243 440834 445761 450152 454378 458883 463830
50101 463830 468817 473069 476151 478443 480743 483392 485970 487957 489474 491183 493545 496435 499505 502704
$$ packed form
50204E52899j269r21j471k649l857m921n648n600m873m360m584m994m922m580
50190D98250m498m652m810n095n629o040o027n921o086o158n549m398l366k728
50176D27293k204j540p51QL96mj184k471l288l820m574n558o400o953p304p352
50160C74294o973o382n819n128m140l281l097l339l275k817k603k816k801k149
50146C19674j410j255j476j442j070p26m73n7M45O27M66M72Q77J206R92N45O22
50129C18017J409K356L004L584M577N895O854O887O168N407N201N565O028O141
50115C87093N862N545N527N837O243O499O479O158N591M927M391M226M505M947
50101D63830M987M252L082K292K300K649K578J987J517J709K362K890L070L199
$$ plain form
50087 502704 506140 509547 512304 514252 516317 519811 525087 531272 537540 544213 552228 561848 572493 583624
50073 583624 595105 606596 617384 627260 637064 647819 659608 671802 684153 697083 710905 725346
50061 725346 740006 754842 769965 785263 800563 815995 831864 848178 864564 880736 896847
50050 896847 913273 930146 947271 964564 982482 1001845 1023140 1046131 1070325 1095865 1123639
50039 1123639 1154241 1186894 1219645 1250596 1278617 1302891 1322415 1336551 1345969 1352563 1358388 1364958
50027 1364958 1373392 1384479 1398235 1413621 1428880 1441846 1449935 1450525 1441983 1424206 1397994 1364237
50015 1364237 1324016 1278959 1230875 1181212 1131338 1083065 1038144 997238 959870 925369 893364
50004 893364 863535 835556 809369 785012 762114 740109 718966 699071 680331 662093 644197
$$ packed form
50087E02704L436L407K757J948K065L494N276O185O268O673Q015R620J0645J1131
50073E83624J1481J1491J0788R876R804J0755J1789J2194J2351J2930J3822J4441
50061G25346J4660J4836J5123J5298J5300J5432J5869J6314J6386J6172J6111
50050H96847J6426J6873J7125J7293J7918J9363K1295K2991K4194K5540K7774
50039A123639L0602L2653L2751L0951K8021K4274J9524J4136R418O594N825O570
50027A364958Q434J1087J3756J5386J5259J2966Q089N90q542j7777k6212l3757
50015A364237m0221m5057m8084m9663m9874m8273m4921m0906l7368l4501l2005
50004H93364k9829k7979k6187k4357k2898k2005k1143j9895j8740j8238j7896
$$ plain form
49993 644197 627396 612373 598834 585986 573475 561430 549993 539200 529022 519201 509423 499933
49981 499933 491568 484813 479202 474050 469395 465689 462902 460456 457915 455321 452950 451124 450085 449709
49967 449709 449442 448806 447802 446596 445131 443394 441758 440569 439654 438735 438089 438266 439240 440381 441220 441825
49951 441825 442439 443230 444394 446105 448391 451338 455317 460541 466556 472691 479029 486386 495282 505470
49937 505470 516622 528993 543155 559476 578174 599600 624214 652439 684652 721120 761875
49926 761875 806912 856632 911721 972297 1037205 1104167 1170444 1233496 1291536 1343932 1391061
49915 1391061 1433761 1473068 1510452 1547771 1586556 1627344 1669746 1712825 1754933 1793306 1824290
49904 1824290 1844326 1850924 1843005 1820788 1785580 1739484 1684944 1624247 1559244 1491375 1421853 1351833
$$ packed form
49993F44197j6801j5023j3539j2848j2511j2045j1437j0793j0178r821r778r490
49981D99933q365o755n611n152m655l706k787k446k541k594k371j826j039l76
49967D49709k67o36j004j206j465j737j636j189r15r19o46J77R74J141Q39O05
49951D41825O14P91J164J711K286K947L979N224O015O135O338P357Q896J0188
49937E05470J1152J2371J4162J6321J8698K1426K4614K8225L2213L6468M0755
49926G61875M5037M9720N5089O0576O4908O6962O6277O3052N8040N2396M7129
49915A391061M2700L9307L7384L7319L8785M0788M2402M3079M2108L8373L0984
49904A824290K0036O598p919k2217l5208m6096n4540o0697o5003o7869o9522p0020
$$ plain form
49892 1351833 1282415 1214511 1148638 1084920 1023427 964575 909081 857403 809367 764565 723044
49881 723044 685292 651550 621460 594482 570349 548957 530177 514003 500516 489280 479051
49870 479051 468559 457583 446863 436978 427717 418637 409748 401369 393543 385971 378558 371718 366000
49857 366000 361477 357719 354387 351576 349397 347445 345139 342527 340278 338709 337306 335442 333161 330878
49843 330878 328651 326258 323744 321451 319580 318140 317199 316807 316766 316825 317035 317539 318176 318698 319255 320149 321249
49826 321249 322188 323141 324753 327193 329912 332601 335763 339985 345130 350752 357007 364586 373863 384550
49812 384550 396194 408759 422690 438635 457092 478250 502232 529467 560576 595697 634206
49801 634206 675426 719288 765773 813615 860078 902304 938703 968992 993384 1012332 1027046
$$ packed form
49892A351833o9418o7904o5873o3718o1493n8852n5494n1678m8036m4802m1521
49881G23044l7752l3742l0090k6978k4133k1392j8780j6174j3487j1236j0229
49870D79051j0492j0976j0720r885r261r080q889q379p826p572p413o840n718
49857C66000m523l758l332k811k179j952k306k612k249j569j403j864k281k283
49843C30878k227k393k514k293j871j440r41l92m1N9K10N04O37N22N57Q94J100
49826C21249R39R53J612K440K719K689L162M222N145N622O255P579R277J0687
49812C84550J1644J2565J3931J5945J8457K1158K3982K7235L1109L5121L8509
49801F34206M1220M3862M6485M7842M6463M2226L6399L0289K4392J8948J4714
$$ plain form
49790 1027046 1039692 1052733 1068076 1086750 1108859 1133304 1157604 1178395 1192347 1196705 1189325 1168829
49778 1168829 1135020 1089134 1033687 972225 908810 846922 788389 733557 682594 636253 595224
49767 595224 559265 527514 499381 474764 453537 435204 419005 404154 390181 377321 366323
49756 366323 357570 350598 344736 339854 336013 332723 329193 325296 321667 318811 316540 314409 312308 310538
49742 310538 309554 309656 310647 311861 312793 313608 314707 316012 317127 318102 319441 321337 323343 324905 325776 325915
49726 325915 325444 324785 324375 324084 323352 322066 320896 320542 320956 321461 321411 320695 319861 319711 320447 321298 321399 320996
49708 320996 321204 322524 324237 325431 325985 326252 326331 326206 326248 327059 328886 331453 334246 336760 338600 339547 339589
49691 339589 338979 338359 338539 339709 341045 341630 341662 342098 343159 343985 343945 343462 343214 343262 343424 343787 344242 344118 342989
$$ packed form
49790A027046J2646J3041J5343J8674K2109K4445K4300K0791J3952M358p380k0496
49778A168829l3809m5886n5447o1462o3415o1888n8533n4832n0963m6341m1029
49767E95224l5959l1751k8133k4617k1227j8333j6199j4851j3973j2860j0998
49756C66323q753o972n862m882l841l290l530l897l629k856k271k131k101j770
49742C10538r84J02R91J214R32Q15J099J305J115R75J339J896K006J562Q71J39
49726C25915m71o59m10k91p32j286j170l54M14N05n0p16q34j50P36Q51J01m03
49708C20996K08J320J713J194N54K67P9j25M2Q11J827K567K793K514J840R47M2
49691C39589o10o20J80J170J336N85L2M36J061Q26m0m83k48M8J62L63M55j24j129
$$ plain form
49672 342989 341470 340597 340686 341329 342101 342692 342739 342230 341892 342478 343837 345223 346298 347186 347793 347914 348050 349240
49654 349240 351749 354542 356380 357049 357248 357624 358190 358470 357976 356719 355351 354658 354895 355747 356906 358397
49638 358397 360334 362656 365178 367649 369719 371079 371716 371854 371651 371207 370843 370980 371659 372471 373113 373671 374234
49621 374234 374570 374552 374671 375694 377758 380198 382376 384440 386955 389966 392864 395274 397748 401195 405798
49606 405798 410866 415782 420647 425882 431566 437492 443666 450322 457527 465062 472721 480545 488746 497487
49592 497487 506761 516360 526112 536208 547182 559374 572527 586097 599877 614112 629090 644851
49580 644851 661318 678466 696368 715181 735156 756495 779141 802845 827492 853332 880770
49569 880770 909886 940132 970578 1000586 1030266 1060193 1090748 1121970 1153950 1186954 1220861
$$ packed form
49672C42989j519q73Q9O43P72N91M7n09l38N86J359J386J075Q88O07J21J36J190
49654C49240K509K793J838O69J99L76N66K80m94j257j368o93K37Q52J159J491
49638C58397J937K322K522K471K070J360O37J38k03m44l64J37O79Q12O42N58N63
49621C74234L36j8J19J023K064K440K178K064K515L011K898K410K474L447M603
49606D05798N068M916M865N235N684N926O174O656P205P535P659P824Q201Q741
49592D97487R274R599R752J0096J0974J2192J3153J3570J3780J4235J4978J5761
49580F44851J6467J7148J7902J8813J9975K1339K2646K3704K4647K5840K7438
49569H80770K9116L0246L0446L0008K9680K9927L0555L1222L1980L3004L3907
$$ plain form
49558 1220861 1254793 1287726 1319457 1350614 1381655 1412043 1440533 1466042 1488166 1507012 1522763
49547 1522763 1535379 1544559 1549937 1551437 1549519 1544976 1538324 1529469 1518143 1504622 1489746 1474239 1458408
49534 1458408 1442704 1428112 1415558 1405145 1396388 1389004 1383031 1378419 1375150 1373758 1375132 1379643 1386886
49521 1386886 1396331 1407760 1421078 1436275 1453723 1473874 1496442 1520322 1544574 1568907 1593035
$$ packed form
49558A220861L3932L2933L1731L1157L1041L0388K8490K5509K2124J8846J5751
49547A522763J2616R180N378J500j918m543o652q855j1326j3521j4876j5507j5831
49534A458408j5704j4592j2554j0413q757p384n973m612l269j392J374M511P243
49521A386886R445J1429J3318J5197J7448K0151K2568K3880K4252K4333K4128
$$ [...]
##END NTUPLES=NMR SPECTRUM
##END=
