##TITLE=NES1083_IC_9885136_LPl463uOHN
##JCAMPDX= 6.0         $$ Bruker NMR JCAMP-DX V2.0
##DATA TYPE= NMR SPECTRUM
##DATA CLASS= NTUPLES
##ORIGIN= BRUKER
##OWNER= Administrator
$$ 1.72 TOPSPIN		Version 2.1
$$ 2016-08-27 18:58:25.820 -0500  Administrator@X
$$ Compression mode = diff/dup
##.OBSERVE FREQUENCY= 400.02188249412
##.OBSERVE NUCLEUS= ^1H
##.ACQUISITION MODE= SIMULTANEOUS (DQD)
##.ACQUISITION SCHEME= undefined
##.AVERAGES= 8
##.DIGITISER RES= 22
##SPECTROMETER/DATA SYSTEM= spect
##.PULSE SEQUENCE= zg30
##.SOLVENT NAME= COFFEE_meoh
##.SHIFT REFERENCE= INTERNAL, COFFEE_meoh, 1, 14.98509
##AUDIT TRAIL= $$ (NUMBER, WHEN, WHO, WHERE, PROCESS, VERSION, WHAT)
$$ ##TITLE= Audit trail, TOPSPIN		Version 2.1
$$ ##JCAMPDX= 5.01
$$ ##ORIGIN= Bruker BioSpin GmbH
$$ ##OWNER= Administrator
$$ $$ E:\/data/COFFEE/nmr/NES1083_IC_9885136_LPl463uOHN/20/pdata/1/auditp.txt
$$ ##AUDIT TRAIL=  $$ (NUMBER, WHEN, WHO, WHERE, PROCESS, VERSION, WHAT)
(   1,<2016-08-27 18:58:18.695 -0500>,<Administrator>,<X>,<go>,<TOPSPIN 2.1>,
      <created by zg
	started at 2016-08-27 18:57:12.351 -0500,
	POWCHK enabled, PULCHK disabled,
       configuration hash MD5:
       21 0F 79 D6 B3 7B B4 F6 88 20 88 DB 03 48 BD 9F
       data hash MD5: 64K
       86 33 23 FF 3F F0 C0 62 4B 48 54 92 28 07 A1 33>)
(   2,<2016-08-27 18:58:21.773 -0500>,<Administrator>,<X>,<proc1d>,<TOPSPIN 2.1>,
      <Start of raw data processing
       efp LB = 0 FT_mod = 6 PKNL = 1 PHC0 = 0 PHC1 = 0 SI = 32K 
       data hash MD5: 32K
       90 66 2F CE 7B 96 18 DE 79 78 95 01 41 80 8F 1E>)
(   3,<2016-08-27 18:58:22.054 -0500>,<Administrator>,<X>,<proc1d>,<TOPSPIN 2.1>,
      <pk PHC0 = 93.31238 PHC1 = 0 
       data hash MD5: 32K
       15 B6 96 65 9F 41 7C CD CA C4 93 77 5E 22 CE A2>)
(   4,<2016-08-27 18:58:22.179 -0500>,<Administrator>,<X>,<proc1d>,<TOPSPIN 2.1>,
      <abs ABSG = 1 
       data hash MD5: 32K
       1E 9B EA D9 CA E4 63 17 12 5A 58 36 B9 25 B5 6E>)
(   5,<2016-08-27 18:58:22.242 -0500>,<Administrator>,<X>,<proc1d>,<TOPSPIN 2.1>,
      <abs ABSG = 2 
       data hash MD5: 32K
       22 5D 86 78 F6 04 D0 71 CD 44 3A 5B F9 25 0B 93>)
(   6,<2016-08-27 18:58:22.289 -0500>,<Administrator>,<X>,<proc1d>,<TOPSPIN 2.1>,
      <abs ABSG = 3 
       data hash MD5: 32K
       8C 5F 44 A0 60 F7 66 8B E2 86 61 FB D7 AC 89 0D>)
(   7,<2016-08-27 18:58:22.351 -0500>,<Administrator>,<X>,<proc1d>,<TOPSPIN 2.1>,
      <abs ABSG = 4 
       data hash MD5: 32K
       DD 59 11 EB B1 24 DE FF C2 95 3E 5C 10 7D FB 45>)
(   8,<2016-08-27 18:58:22.398 -0500>,<Administrator>,<X>,<proc1d>,<TOPSPIN 2.1>,
      <abs ABSG = 5 
       data hash MD5: 32K
       B7 69 60 6F A8 78 47 95 D4 B9 22 8F A3 58 79 DE>)
$$ ##END=
$$ 
$$ $$ hash MD5
$$ $$ 8B CE DC DB F5 FA F4 F7 7C 79 63 F1 E4 AB 2E 1E
##$RELAX= 
##$RELAX= 
##$RELAX= 
##$RELAX= 
##$RELAX= 
##$RELAX= 
##$RELAX= 
$$ Bruker specific parameters
$$ --------------------------
##$DU= <E:\>
##$EXPNO= 20
##$NAME= <NES1083_IC_9885136_LPl463uOHN>
##$PROCNO= 1
$$ [...]
##$TP= (0..7)
150 150 150 150 150 150 150 150
##$TP07= 0
##$TPNAME0= <>
##$TPNAME1= <>
##$TPNAME2= <>
##$TPNAME3= <>
##$TPNAME4= <>
##$TPNAME5= <>
##$TPNAME6= <>
##$TPNAME7= <>
##$TPOAL= (0..7)
0.5 0.5 0.5 0.5 0.5 0.5 0.5 0.5
##$TPOFFS= (0..7)
0 0 0 0 0 0 0 0
##$TUNHIN= 0
##$TUNHOUT= 0
##$TUNXOUT= 0
##$USERA1= <user>
##$USERA2= <user>
##$USERA3= <user>
##$USERA4= <user>
##$USERA5= <user>
##$V9= 5
##$VALIST= <valist>
##$VCLIST= <CCCCCCCCCCCCCCC>
##$VD= 0
##$VDLIST= <DDDDDDDDDDDDDDD>
##$VPLIST= <PPPPPPPPPPPPPPP>
##$VTLIST= <TTTTTTTTTTTTTTT>
##$WBST= 1024
##$WBSW= 4
##$XGAIN= (0..3)
0 0 0 0
##$XL= 0
##$YL= 0
##$YMAX_a= 597336
##$YMIN_a= -499391
##$ZGOPTNS= <>
##$ZL1= 120
##$ZL2= 120
##$ZL3= 120
##$ZL4= 120
##$ABSF1= 14.98509
##$ABSF2= -5.573092
##$ABSG= 5
##$ABSL= 3
##$ALPHA= 0
##$AQORDER= 0
##$ASSFAC= 0
##$ASSFACI= 0
##$ASSFACX= 0
##$ASSWID= 0
##$AUNMP= <proc_prof1d_extract_pilot.lims>
##$AXLEFT= 0
##$AXNAME= <>
##$AXNUC= <1H>
##$AXRIGHT= 0
##$AXTYPE= 0
##$AXUNIT= <>
##$AZFE= 0.1
##$AZFW= 0.1
##$BCFW= 0
##$BC_mod= 0
##$BYTORDP= 0
##$COROFFS= 0
##$CY= 15
##$DATMOD= 1
##$DC= 0
##$DFILT= <>
##$DTYPP= 0
##$F1P= 0
##$F2P= 0
##$FCOR= 0.5
##$FTSIZE= 32768
##$FT_mod= 6
##$GAMMA= 0
##$GB= 0
##$INTBC= 1
##$INTSCL= 1
##$ISEN= 128
##$LB= 0
##$LEV0= 0
##$LPBIN= 0
##$MAXI= 10000
##$MC2= 0
##$MEAN= 0
##$ME_mod= 0
##$MI= 0
##$NCOEF= 0
##$NC_proc= -8
##$NLEV= 6
##$NOISF1= 0
##$NOISF2= 0
##$NSP= 0
##$NTH_PI= 0
##$NZP= 0
##$OFFSET= 14.98509
##$PC= 1
##$PHC0= 93.31238
##$PHC1= 0
##$PH_mod= 1
##$PKNL= yes
##$PPARMOD= 0
##$PPDIAG= 0
##$PPIPTYP= 0
##$PPMPNUM= 2147483647
##$PPRESOL= 1
##$PSCAL= 4
##$PSIGN= 0
##$PYNMP= <proc.py>
##$REVERSE= no
##$SF= 400.02
##$SI= 32768
##$SIGF1= 0
##$SIGF2= 0
##$SINO= 400
##$SIOLD= 32768
##$SPECTYP= <>
##$SREGLST= <1H.CDCl3>
##$SSB= 0
##$STSI= 32768
##$STSR= 0
##$SW_p= 8223.68421052631
##$SYMM= 0
##$S_DEV= 0
##$TDeff= 65536
##$TDoff= 0
##$TI= <>
##$TILT= no
##$TM1= 0
##$TM2= 0
##$TOPLEV= 0
##$USERP1= <user>
##$USERP2= <user>
##$USERP3= <user>
##$USERP4= <user>
##$USERP5= <user>
##$WDW= 1
##$XDIM= 32768
##$YMAX_p= 439632248
##$YMIN_p= -732886
##$CURPLOT= <Network HP LaserJet P1505>
##$CURPRIN= <$Network HP LaserJet P1505>
##$DFORMAT= <normdp>
##$LAYOUT= <+/1D_H.xwp>
##$LFORMAT= <normlp>
##$PFORMAT= <normpl>
##$SURQMSG= 1
$$ End of Bruker specific parameters
$$ ---------------------------------
##NTUPLES= NMR SPECTRUM
##VAR_NAME=  FREQUENCY,     SPECTRUM/REAL,   SPECTRUM/IMAG
##SYMBOL=    X,             R,               I
##VAR_TYPE=  INDEPENDENT,   DEPENDENT,       DEPENDENT
##VAR_FORM=  AFFN,          ASDF,            ASDF
##VAR_DIM=   32768,         32768,           32768
##UNITS=     HZ,            ARBITRARY UNITS, ARBITRARY UNITS
##FACTOR=    0.250966925370066, 1,           1
##FIRST=     8223.43324360094, -234323,      95200
##LAST=      0,             -3380,           -3257
##MIN=       0,             -732886,         0
##MAX=       8223.43324360094, 439632248,    0
$$ Real data points
##PAGE= N=1
##DATA TABLE= (X++(R..R)), XYDATA
$$ [...]
19471a39620L9017A80571a78694b0020l6256A1871d5253j71351j15987p844R4384
$$ -139620 -100603 180571 -178694 -20020 -56276 11871 -45253 -216604 -332591 -340435 -246051
19460b46051i4637K6770B4568c02007B16182c66203C4305O736H973J87602G6210
$$ -246051 -94637 -67867 24568 -302007 216182 -366203 34305 41041 8973 196575 76210
19448A00479C41g1786l11237a71749A4847L053b7901q9960B07709b15963L5455
$$ 100479 341 -71786 -383023 -171749 14847 17900 -27901 -117861 207709 -215963 -180508
19437a80508C3645K7101J2110J16682b33742a16862C3667N2109g8952j76658h8651
$$ -180508 33645 60746 72856 189538 -233742 -116862 33667 85776 -78952 -255610 -88651
19425a32579A80770E7110K18375j6768a3050A66667d346F44c1270A08269h5244
$$ -132579 180770 57110 275485 258717 -13050 166667 -4346 644 -31270 108269 -85244
19413A89753a10045A80358B8047d6683k04111a02562k78742a19288n8987j8876
$$ 189753 -110045 180358 28047 -46683 -250794 -102562 -381304 -119288 -178275 -197151
19403a97151j0763q9306a00500B0174J39870g5960K1489k13582a29439D4818d6119
$$ -197151 -207914 -297220 -100500 20174 160044 -75960 -54471 -268053 -129439 44818 -46119
19391c87189e9589H0619N2993h8684l7346l32857b27875B04786E6002L2566L2501
$$ -387189 -59589 80619 133612 -88684 -126030 -458887 -227875 204786 56002 88568 121069
19380A21069a51741C51242b02488A73988b63207A03969h2750l22419C37545a09057
$$ 121069 -151741 351242 -202488 173988 -263207 103969 -82750 -405169 337545 -109057
19369B33730a51208b8566k88918N2825i0449A14159a51941b0056j90682j34097
$$ 233730 -151208 -28566 -317484 -264659 -90449 114159 -151941 -20056 -210738 -344835
19359c44835E0556i8150a5512G0357L5514E618c27766A44889a40769o9105e43
$$ -344835 50556 -98150 -15512 70357 105871 5618 -327766 144889 -140769 -209874 -543
19347f202l22950C2338I105a93221n9922h4473j88501E6343B2463B283J93328
$$ -6202 -329152 32338 9105 -193221 -253143 -84473 -272974 56343 22463 2283 195611
19336A95611c60492g5743m368j42917e9392B30733D208J87032I2667b93297A6510
$$ 195611 -360492 -75743 -80111 -223028 -59392 230733 4208 191240 92667 -293297 16510
19324b54250c5949F6792c7881j09627B5670b74131A19444i1321L6972M519k91749
$$ -254250 -35949 66792 -37881 -147508 25670 -274131 119444 -91321 -54349 -49830 -341579
19313c41579g0115J6523k71705D6244a64512R09K5847l68255C3049J8391b06917
$$ -341579 -70115 -53592 -325297 46244 -164512 -163603 -137756 -506011 33049 51440 -206917
19301a40249M3430L4421k06342O2495D0766j8938a28397E2115i5826B26612A11140
$$ -140249 -96819 -62398 -268740 -206245 40766 21828 -128397 52115 -95826 226612 111140
19289c77578d5865l35075I7545a65266H3778N336a49899F2529K49118a66967p1889
$$ -377578 -45865 -380940 97545 -165266 83778 89114 -149899 62529 311647 -166967 -238856
19278b38856F8670a27120A93980c74424g5924k9312m7664d966o3218D6083b206
$$ -238856 68670 -127120 193980 -374424 -75924 -105236 -152900 -4966 -68184 46083 -2206
19266b48248A30125c06050A37986f7074m4294h91A14114f3911B16681i355B55737
$$ -248248 130125 -306050 137986 -67074 -111368 -891 114114 -63911 216681 -9355 255737
19254I7173e9992C9022J063a41173c8729p8334q00F8781i665A63593A2389c29543
$$ 97173 -59992 39022 40085 -141173 -38729 -117063 -117863 68781 -9665 163593 12389 -329543
19241a14791N3027l34536H6440k5183j8080a51165A45920a9837j26589K5847L2759
$$ -114791 -61764 -396300 86440 61257 43177 -151165 145920 -19837 -146426 -120579 -87820
19230h7820l79732d5884j25084D57K81938a67045A99501a20730p1518N3781Q23
$$ -87820 -467552 -45884 -170968 457 282395 -167045 199501 -120730 -192248 -138467 -137644
19219a37644A96525d7202o2128G4575g9399j34586B9266J0794b2996p5849a5877
$$ -137644 196525 -47202 -109330 74575 -79399 -213985 29266 40060 -22996 -98845 -15877
19207e9940D1147a20279M4355k18775f7406Q078l4663j81243p854C4480a67962
$$ -59940 41147 -120279 -75924 -294699 -67406 -59328 -93991 -275234 -283088 34480 -167962
19195b1119B06299b50223C1889d0885j1699j87723e069B5919J20118E3336c81648
$$ -21119 206299 -250223 31889 -40885 -52584 -240307 -5069 25919 146037 53336 -381648
19183g0551p0874C46909a82360r7267r2171a81936o4995Q5961d0157p3828B72183
$$ -70551 -141425 346909 -182360 -279627 -371798 -181936 -246931 -160970 -40157 -113985 272183
19171c61670a4974A38761b21622M6072d1308k49278g3306A99037a84804h7703
$$ -361670 -14974 138761 -221622 -175550 -41308 -290586 -73306 199037 -184804 -87703
19160A90947M3493a83461J9201g8447k3376b6083n0716j40486B55625a10556L4467
$$ 190947 234440 -183461 -164260 -78447 -101823 -26083 -76799 -217285 255625 -110556 -76089
19149g6089n323q0443H8850g6709D9458K9424a1367j55291A43612A7881b11678
$$ -76089 -81412 -161855 88850 -76709 49458 78882 -11367 -166658 143612 17881 -211678
19137B1610L4391c1666E39151A47979a94636g0965l5161G4137a80276M0059D8708
$$ 21610 56001 -31666 539151 147979 -194636 -70965 -106126 74137 -180276 -140217 48708
19125a63595a8434k45980Q9296I6691a10834O924j30871P7798A10864g6130A21177
$$ -163595 -18434 -264414 -175118 96691 -110834 -103910 -234781 -156983 110864 -76130 121177
19113c00897Q4546g0669b1005F9265b07016k1122d2254A40420a8146C0525d75343
$$ -300897 -216351 -70669 -21005 69265 -207016 -228138 -42254 140420 -18146 30525 -475343
19101f3252k16783A98852E1140Q2100o3581a07488k10616R8291A09967c4163A62099
$$ -63252 -280035 198852 51140 133240 69659 -107488 -318104 -219813 109967 -34163 162099
19089a33648j60802A7585c03186A12872f2776A20944e8565o9791B49754c66772
$$ -133648 -294450 17585 -303186 112872 -62776 120944 -58565 -128356 249754 -366772
19078C9005c9657j13502d3139C53869A76420l6093e0190o5096R848q2616A39863
$$ 39005 -39657 -153159 -43139 353869 176420 140327 -50190 -115286 -105438 -188054 139863
19066b10772L1566A96568C0483a88506K3207n5254A18391a51878F5715a92017
$$ -210772 -179206 196568 30483 -188506 -165299 -220553 118391 -151878 65715 -192017
19055a41247B68176d8801A63016J01373b88781h4131H2170J01762c5435D2692
$$ -141247 268176 -48801 163016 264389 -288781 -84131 82170 183932 -35435 42692
19044a16461F0999i6043A0898L213K09361b79699B79902D7088h5192n959j47397
$$ -116461 60999 -96043 10898 14111 223472 -279699 279902 47088 -85192 -91151 -238548
19033b38548g5251L4368p7565p6747e3346j44443b0790A4763B711a1532j07027
$$ -238548 -75251 -40883 -118448 -195195 -53346 -197789 -20790 14763 2711 -11532 -118559
19022a18559D5895c9215j79221m8795a19318a9502m5305k24912J29328A8473g6590
$$ -118559 45895 -39215 -218436 -267231 -119318 -19502 -64807 -289719 -160391 18473 -76590
19010B92638b8448k6376A12089g1910A83859H3125h9441D51308D9111a89442q5297
$$ 292638 -28448 -54824 112089 -71910 183859 83125 -89441 451308 49111 -189442 -274739
18999b74739o9410e7231A10457e479n7872A35282F5056c9729j0641A88460C8256
$$ -274739 -344149 -57231 110457 -5479 -63351 135282 65056 -39729 -50370 188460 38256
18987B78530a37308L943k15943D22086g8157J9989H8871C0079C022c37204p6634
$$ 278530 -137308 -133365 -349308 422086 -78157 -58168 88871 30079 3022 -337204 -413838
18976d13838B84635A17783J16921P8298J63811A15303J74610j29812n5543e097
$$ -413838 284635 117783 234704 313002 476813 115303 289913 160101 104558 -5097
18965b9602B3731a46828e1687j04489f3509F8398d47929E3046b75163I897a56544
$$ -29602 23731 -146828 -51687 -156176 -63509 68398 -447929 53046 -275163 9897 -156544
18953a62234B13260b19741D6600c2461A37470h0828J5469m3144c9881q5813G1079
$$ -162234 213260 -219741 46600 -32461 137470 -80828 -65359 -108503 -39881 -125694 71079
18941a8704q2042a3534H3421a74317C2025c69744A83012a1255A2353L3978J34406
$$ -18704 -100746 -13534 83421 -174317 32025 -369744 183012 -11255 12353 46331 180737
18930A80737L487a52360O4213I639a22725N6204F2003J6026h4151q8024E5809
$$ 180737 184224 -152360 -88147 9639 -122725 -66521 62003 78029 -84151 -172175 55809
18918C36782A53507C0802J20594c8161n1127A24074b12854B93546j7394J56233
$$ 336782 153507 30802 151396 -38161 -89288 124074 -212854 293546 276152 432385
18908D32385j31502b23412p3358A95017G9356M0526O8903H4311b30559A4291K7424
$$ 432385 300883 -223412 -296770 195017 79356 119882 188785 84311 -230559 14291 41715
18897D1715b08731i0405j6009F3136a25501H7769b22318h8969n7589j22325c321
$$ 41715 -208731 -90405 -106414 63136 -125501 87769 -222318 -88969 -146558 -268883 -3321
18885A51665a22746E7757b94377A84512J02813h4792l3795j97021E6299a15864
$$ 151665 -122746 57757 -294377 184512 287325 -84792 -118587 -315608 56299 -115864
18874E8216Q536p232d9025A9687f6011l4325n0395a8582E5995b57640f1119r3415
$$ 58216 66752 59520 -49025 19687 -66011 -100336 -150731 -18582 55995 -257640 -61119 -154534
18862a54534B07082h8157K0651m3411k04491A34600a49434n298j26305a5682B8469
$$ -154534 207082 -88157 -67506 -110917 -315408 134600 -149434 -154732 -281037 -15682 28469
18850A14262c53967e1044k9942j66953A39737o2436f9325H3464K43926j05702
$$ 114262 -353967 -51044 -80986 -247939 139737 77301 -69325 83464 327390 221688
18840B21688c12977A21864B244i7609q3963k2908A32370o3304c9887D18634b37364
$$ 221688 -312977 121864 2244 -97609 -181572 -204480 132370 69066 -39887 418634 -237364
18828a16273j38384C44618q1503a09055M7492p7001J181k7384j14183P0604c990
$$ -116273 -254657 344618 263115 -109055 -61563 -138564 -137383 -164767 -278950 -208346 -3990
18816E2326L736J14639p8224h783j29636B25736j08343O0597J9644a81957A62351
$$ 52326 56062 170701 92477 -8783 -138419 225736 117393 177990 197634 -181957 162351
18804a98494m2491b6841B97288a75577c0551l19793A34931f0130C7957j1580a49282
$$ -198494 -240985 -26841 297288 -175577 -30551 -350344 134931 -60130 37957 26377 -149282
18792G8820a41218j5956P6435k74028R3339J27942F7185e54146a93189q0799a0227
$$ 78820 -141218 -157174 -80739 -354767 -261428 -133486 67185 -554146 -193189 -273988 -10227
18780A66170a08653j16951A27950k863c81327J83901M7224O545j07891A97231
$$ 166170 -108653 -225604 127950 125087 -381327 -197426 -150202 -143657 -251548 197231
18769b34940B63731o9606b61069C35793b3360A31331b76931L0827A7285M6175
$$ -234940 263731 194125 -261069 335793 -23360 131331 -276931 -246104 17285 63460
18759F3460J05290a29006o1297D8785c49821N1146a35806D8482J74720B9925J8949
$$ 63460 168750 -129006 -190303 48785 -349821 -298675 -135806 48482 223202 29925 48874
18748D8874c6540k92780a15010B36603a5723j30407A52052e1889A78241c36189
$$ 48874 -36540 -329320 -115010 236603 -15723 -146130 152052 -51889 178241 -336189
18737B73304b32189j5669j0135A37846D0128e091j04555A99497A7145a35688C16984
$$ 273304 -232189 -247858 -257993 137846 40128 -5091 -109646 199497 17145 -135688 316984
18725c87332i6237E2035c22178A093f6321F6412d1474j01904r1171J00758k5697
$$ -387332 -96237 52035 -322178 1093 -66321 66412 -41474 -143378 -234549 -133791 -159488
18714a59488j12056a04309B80620b71772a14969j24477F9638a22827A43790M09310
$$ -159488 -271544 -104309 280620 -271772 -114969 -239446 69638 -122827 143790 553100
18704E53100b58714R0491C9831O7286a78198Q4910A26535a33180D4481J15703
$$ 553100 -258714 -168223 39831 107117 -178198 -93288 126535 -133180 44481 160184
18694A60184h4875q514I073a38867J5994L6604j87137a14052j69389N7709D4913
$$ 160184 -84875 -93389 9073 -138867 -122873 -86269 -273406 -114052 -283441 -225732 44913
18682g8178c3913A39545l4399l9054J52557b44427n3510R5560A24282k7889a31835
$$ -78178 -33913 139545 105146 66092 218649 -244427 -297937 -202377 124282 96393 -131835
18670A39572n5209h6216o8090F0265J7863a27322H3514d6810A3884h1218r2421
$$ 139572 84363 -86216 -154306 60265 78128 -127322 83514 -46810 13884 -81218 -173639
18659a73639Q1889l2840C9981a46216o535f4021A08158D4770M5155F508a41345
$$ -173639 -91750 -124590 39981 -146216 -152751 -64021 108158 44770 89925 6508 -141345
18647H5354P2590b0932l0442k4320A80869c5246J0686A37429l0452C4932K2339
$$ 85354 157944 -20932 -51374 -75694 180869 -35246 -24560 137429 106977 34932 57271
18636E7271K90585p7513b38771P4583j5062C8690b25938b2305j06154r8901A32702
$$ 57271 347856 270343 -238771 -164188 -179250 38690 -225938 -22305 -128459 -227360 132702
18624c00622D8864f1482A95910i5841K5595A93238a9799A51214i6011A18978h7434
$$ -300622 48864 -61482 195910 -95841 -70246 193238 -19799 151214 -96011 118978 -87434
18612A21599m5830j1881K3229c05148B32629j14732b34278I8186a28067r319A49752
$$ 121599 75769 63888 87117 -305148 232629 117897 -234278 98186 -128067 -137386 149752
18600a59466q0364A35501K858d989l63535a68065r498E26J10978i6139D6313c39190
$$ -159466 -239830 135501 138359 -4989 -368524 -168065 -177563 526 111504 -96139 46313 -339190
18587I0176b46869C8940e0988j57837D9297c57988J75159E5449b14575f3485K033
$$ 90176 -246869 38940 -50988 -208825 49297 -357988 -182829 55449 -214575 -63485 -61452
18576f1452k88355a56811E0631J38347h6158o7549A29965b41321A42578a14429
$$ -61452 -349807 -156811 50631 188978 -86158 -153707 129965 -241321 142578 -114429
18565c46511D2525e396j50733g0141B28777H4050a41336J8117A10236a7691A42594
$$ -346511 42525 -5396 -156129 -70141 228777 84050 -141336 -123219 110236 -17691 142594
18553a60774B42706k9480a27329A13577i1493A20390M4092l6262e9793A61263
$$ -160774 242706 213226 -127329 113577 -91493 120390 164482 128220 -59793 161263
18542c5977B5945Q2400E0396j4120e21541B896P3504g3408j21509D5436f1274
$$ -35977 25945 108345 50396 36276 -521541 2896 76400 -73408 -194917 45436 -61274
18530g2366c4578J1206j13207A73805a98911f3890k21710a11366p828R486B1859
$$ -72366 -34578 -23372 -136579 173805 -198911 -63890 -285600 -111366 -119194 -109708 21859
18518A28038A7636J41262e3110I341a26330l9157I275J29297m5696f4136A57280
$$ 128038 17636 158898 -53110 9341 -126330 -165487 9275 138572 92876 -64136 157280
18506a53298A32561l3462b8205B42465D2029b2636k1696j64554M1553P0463H4607
$$ -153298 132561 99099 -28205 242465 42029 -22636 -44332 -208886 -167333 -96870 84607
18494A56509a69778N4368A03989b76785E0353b58038L7368d7073D4382j7591q130
$$ 156509 -169778 -115410 103989 -276785 50353 -258038 -220670 -47073 44382 26791 18661
18483A8661L45418j67346p8862D41P287d58689H5438a79331C37375B8421N973
$$ 18661 364079 196733 117871 441 7728 -458689 85438 -179331 337375 28421 34394
18472C4394b55419f3148F3036c14455E9405b11657A58598c76867A01876a95917
$$ 34394 -255419 -63148 63036 -314455 59405 -211657 158598 -376867 101876 -195917
18461a16294B21630J34370e2071A15707a8770n9130k48081j37874J98389d2840
$$ -116294 221630 356000 -52071 115707 -18770 -77900 -325981 -463855 -265466 -42840
18450A7239K60350e1045G6810J55823j04197d4117D8682b7806F6460a09278I5994
$$ 17239 277589 -51045 76810 232633 128436 -44117 48682 -27806 66460 -109278 95994
18438A91348a16477p7821O9190N9039H8151c16250a39500K1160p2975C3709c2546
$$ 191348 -116477 -194298 -125108 -66069 88151 -316250 -139500 -118340 -191315 33709 -32546
18426F7608K20829A19283c12821B1776N0815b34287a3912j26178f1335A0338b64076
$$ 67608 288437 119283 -312821 21776 72591 -234287 -13912 -140090 -61335 10338 -264076
18414c97002b6353n9686B57221a13908N0259d463F9316A0532J03071J2729C461
$$ -397002 -26353 -86039 257221 -113908 -63649 -4463 69316 10532 113603 126332 3461
18402h604B5337R378J33969j8488F9799g8028r6355j16822i4945j34027A27665
$$ -8604 25337 34715 168684 150196 69799 -78028 -174383 -291205 -94945 -228972 127665
18390A42792K0376Q9870f4274A76118f1208o9749A31952a13295k5414j24222a6995
$$ 142792 163168 253038 -64274 176118 -61208 -130957 131952 -113295 -138709 -262931 -16995
18378b19218P2986j14109D12057a60368e8271q2821B051b9966p8445C7858d5947
$$ -219218 -146232 -260341 412057 -160368 -58271 -141092 2051 -29966 -108411 37858 -45947
18366B32000B107J60417a34644C32187b70951J33566A2183d9638A54833d14820
$$ 232000 2107 162524 -134644 332187 -270951 -137385 12183 -49638 154833 -414820
18355f5046k51476B68919m4324c21984e3911j89564k2022j54505J92974c1142
$$ -65046 -316522 268919 224595 -321984 -53911 -243475 -265497 -420002 -227028 -31142
18344B068i2963r1402A30868f7248B1373p588K27416a54165q8023D5767O1194
$$ 2068 -92963 -184365 130868 -67248 21373 13785 241201 -154165 -242188 45767 106961
18333A06961C0475e5896k06348C9069g1626p016B8609M6860a53247I9993b05869
$$ 106961 30475 -55896 -262244 39069 -71626 -78642 28609 75469 -153247 99993 -205869
18321A01254a11547b9754o3496d0658I1462j4161b90317H1898a739C79879A28378
$$ 101254 -111547 -29754 -93250 -40658 91462 77301 -290317 81898 -1739 379879 128378
18309A49474a43907q7082B765O3322a06943e0752A88682b46308B03317b5042M849
$$ 149474 -143907 -230989 2765 66087 -106943 -50752 188682 -246308 203317 -25042 -20193
18298b0193E1672K88626a64484m2221l4283e2862i767K575B8367b48867K4189
$$ -20193 51672 340298 -164484 -206705 -240988 -52862 -9767 -7192 28367 -248867 -224678
18287b24678M0580A3750a40502e1770k3037l6474d8590m8052C0102J51386B335
$$ -224678 -184098 13750 -140502 -51770 -74807 -111281 -48590 -96642 30102 181488 2335
18275a50022d8042j28460O9520k15047g5196B68645c1216o4922o7976j12191A15214
$$ -150022 -48042 -176502 -106982 -322029 -75196 268645 -31216 -96138 -164114 -276305 115214
18263a68080k031j14820J34797A64745b12346A43835b01897P2175A30921a66585
$$ -168080 -170111 -284931 -150134 164745 -212346 143835 -201897 -129722 130921 -166585
18252a981j11189n6593e0149K2482j17078k76980B55844a3549p2178j72936C0885
$$ -1981 -113170 -169763 -50149 -27667 -144745 -421725 255844 -13549 -85727 -258663 30885
18240g2951n3571A21596J13757r0000f6799j43112m2823B2661c67432a10531J3084
$$ -72951 -126522 121596 235353 145353 -66799 -209911 -252734 22661 -367432 -110531 -97447
18229i7447b271A09659a11823k15158E1459a818j56989K21A25154d7786B1240
$$ -97447 -2271 109659 -111823 -326981 51459 -1818 -158807 -158586 125154 -47786 21240
18217E4715c4823C0053a22681A2024K26983B1895a61420L4378A26859E7027d2261
$$ 54715 -34823 30053 -122681 12024 239007 21895 -161420 -127042 126859 57027 -42261
18205B33628a67137A34429h1525N095n1244R209C20528h5592E8753M1491i0733
$$ 233628 -167137 134429 -81525 -76430 -127674 -118465 320528 -85592 58753 100244 -90733
18193B448J3762A363h0807A59313h0659n6019l4959A24273j9907c9044k9321j94278
$$ 2448 16210 1363 -80807 159313 -80659 -136678 -171637 124273 104366 -39044 -68365 -262643
18181b62643A38905o4140a6764G0423M4106h1605O951j07364K1454H0327e2044
$$ -262643 138905 74765 -16764 70423 114529 -81605 -74654 -182018 -160564 80327 -52044
18169F9321R0260d079I2761m2911N4264k9897h1757O547L6148q5871B156b28730
$$ 69321 159581 -4079 92761 49850 104114 74217 -81757 -75210 -39062 -124933 2156 -228730
18156b31985D28860b78888B3292J88603J41256e00263B19325C2523b0434A21613
$$ -231985 428860 -278888 23292 211895 353151 -500263 219325 32523 -20434 121613
18145B42306I7275M4468k7672M4810P8589b80742B6865J17497a54319A19896g4967
$$ 242306 97275 141743 114071 158881 237470 -280742 26865 144362 -154319 119896 -74967
18133i7527A20714j7405b27434i8392l4891a0719F2436M31e8230j0410j34989
$$ -97527 120714 103309 -227434 -98392 -133283 -10719 62436 62867 -58230 -68640 -203629
18122b03629J5082B55601a56669a7309l12877A03302b5448H7833J95652h9204
$$ -203629 -188547 255601 -156669 -17309 -330186 103302 -25448 87833 283485 -89204
18111E05332A89845a57183B41074b27901L5955L738H9657A9587a8426n5555A46459
$$ 505332 189845 -157183 241074 -227901 -191946 -188208 89657 19587 -18426 -73981 146459
18099c9337B61799f1637K6250B61456J09077c75956J48938b9714A37838c1939
$$ -39337 261799 -61637 -35387 261456 370533 -375956 -227018 -29714 137838 -31939
18088e1063o5972G8099c1553A42664g938l8312A10000g5819l66029a34045K0539
$$ -51063 -117035 78099 -31553 142664 -7938 -46250 110000 -75819 -441848 -134045 -113506
18077a13506A18593g7257A71878b57720B45962q4694a26161I484K87041L0072
$$ -113506 118593 -77257 171878 -257720 245962 161268 -126161 9484 296525 326597
18067C26597a30162A20682D4964a04063c3411p7933E4674b30499P3492f8971G9762
$$ 326597 -130162 120682 44964 -104063 -33411 -111344 54674 -230499 -157007 -68971 79762
18055c3304J5400k00343D5779R3139c0661E5731b05312A44936O378a66483f1278
$$ -33304 -17904 -218247 45779 138918 -30661 55731 -205312 144936 151314 -166483 -61278
18043B9507J74118A4392c01955f5148B2762K51407b7084A28228a30538J2429p061
$$ 29507 203625 14392 -301955 -65148 22762 274169 -27084 128228 -130538 -118109 -125170
18032a25170H8489c8646j01584b4808D0132A0930K2861a18011H1850b1685A2242
$$ -125170 88489 -38646 -140230 -24808 40132 10930 33791 -118011 81850 -21685 12242
18020a31816B5674c57660B6859K24532c19022j71526A46323j4144G106d70750
$$ -131816 25674 -357660 26859 251391 -319022 -490548 146323 132179 7106 -470750
18009A96780m6086a0682B1432L68542A54745L9710a4267j24585A26126d9633G822
$$ 196780 150694 -10682 21432 389974 154745 194455 -14267 -138852 126126 -49633 7822
17997b30283B63325f8803B11182a53563B44601A0798a78464r625A21988b41751
$$ -230283 263325 -68803 211182 -153563 244601 10798 -178464 -188089 121988 -241751
17986g9210j3003A82248A750J23067a85065I4838e9956p0725M2390A06067j5414
$$ -79210 -92213 182248 1750 124817 -185065 94838 -59956 -130681 -88291 106067 90653
17975I0653a62839A98133P3839i1635A89690l2521o1467a22833I9933a92125l5926
$$ 90653 -162839 198133 271972 -91635 189690 157169 95702 -122833 99933 -192125 -228051
17964b28051A00736a79168L1974k7499H7545N1016a00025A66857C2432d13728
$$ -228051 100736 -179168 -147194 -174693 87545 138561 -100025 166857 32432 -413728
17953B01181o0561a66295B10388i8607p0707q1703A50437J72374A04126f4594
$$ 201181 140620 -166295 210388 -98607 -169314 -251017 150437 322811 104126 -64594
17942A9455J19228a14015j22873g9522D57089i0879N042G7215b61588F0716c2315
$$ 19455 138683 -114015 -236888 -79522 457089 -90879 -85837 77215 -261588 60716 -32315
17930C48460f156j37383A22180D4543j9028L04585H4783g2407A37738h0966E9196
$$ 348460 -6156 -143539 122180 44543 25515 330100 84783 -72407 137738 -80966 59196
17918a1921A19150B0909b8080k34078J18509k46853A53789e6876K2840I8017A451
$$ -11921 119150 20909 -28080 -262158 -143649 -390502 153789 -56876 -34036 98017 1451
17906D57870f9576k68123C6386J34779C0990Q556O9754b46614n9404a22608d9208
$$ 457870 -69576 -337699 36386 171165 30990 39546 109300 -246614 -306018 -122608 -49208
17894C50580q4551a51181A53973J31550f0994a5053G3948P666M0044J02259D0095
$$ 350580 266029 -151181 153973 285523 -60994 -15053 73948 81614 121658 223917 40095
17882B080a4249o879A28078a00688B57946c0473A62947O0525b92717F9001a85812
$$ 2080 -14249 -21128 128078 -100688 257946 -30473 162947 223472 -292717 69001 -185812
17870a12575j41899A16693m833a47170B95124h740B02700a83511A33808g1189
$$ -112575 -254474 116693 111860 -147170 295124 -8740 202700 -183511 133808 -71189
17859C07897f6002k45485D8382a43532A48368b615B71418d9498j26574A64777
$$ 307897 -66002 -311487 48382 -143532 148368 -2615 271418 -49498 -176072 164777
17848C58363A33194M8139f8488A75377D8517J02653r696b04193e5688A97119b62719
$$ 358363 133194 181333 -68488 175377 48517 151170 141474 -204193 -55688 197119 -262719
17836i6131M6180k448B2824K56595F3873a24339A59541h2118C32621b6906A75436
$$ -96131 -49951 -52399 22824 279419 63873 -124339 159541 -82118 332621 -26906 175436
17824A20531n5228J48170b80786F0470K12986H0920e1909j05536A15996N4784
$$ 120531 65303 213473 -280786 60470 273456 80920 -51909 -157445 115996 170780
17814A70780H2781b51420B81335F5179c9479B92202i1805C19111i1242b6800o8594
$$ 170780 82781 -251420 281335 65179 -39479 292202 -91805 319111 -91242 -26800 -95394
17803i5394p485C420a11725D0433K89282m9e0628C00427d0647A30252k9349b023
$$ -95394 -102879 3420 -111725 40433 329715 329666 -50628 300427 -40647 130252 100903 -2023
17790B52007a95777g5491A38046g1984A92357c6983D3045N6490a15925F1683k6909
$$ 252007 -195777 -75491 138046 -71984 192357 -36983 43045 99535 -115925 61683 34774
17779C4774J21222a80936p3051i170B4426J80880G805c16535H4787L1066J06043
$$ 34774 155996 -180936 -253987 -9170 24426 205306 7805 -316535 84787 115853 221896
17768B21896G3024a1076E05936b57711H7135a32166D189J41068O5948F0542Q8351
$$ 221896 73024 -11076 505936 -257711 87135 -132166 4189 145257 211205 60542 148893
17757A48893c091r9105I7999k5224L77386A66585d01469J67133H6632c9969j17018
$$ 148893 -3091 -102196 97999 72775 450161 166585 -401469 -234336 86632 -39969 -156987
17746a56987A00808J77175D7025a16188D0271M44115b383k939k43149e0176r0617
$$ -156987 100808 277983 47025 -116188 40271 484386 -2383 -5322 -248471 -50176 -140793
17735a40793A2801b39281a18874j38033F7385J24161L02827a09798A64145J26845
$$ -140793 12801 -239281 -118874 -256907 67385 191546 494373 -109798 164145 290990
17725B90990a793G3288a37354M710N2053k1590G8175I091C858M06616B3039i3648
$$ 290990 -1793 73288 -137354 -132644 -80591 -102181 78175 9091 3858 410474 23039 -93648
17712d1571B97943d953n3419B02521q2490c2439B946N0649J03917b9533j23872
$$ -41571 297943 -4953 -58372 202521 120031 -32439 2946 53595 157512 -29533 -153405
17701a53405r961A00283J52973a34630B61928G2506J29363m4570K63165A33999
$$ -153405 -163366 100283 253256 -134630 261928 72506 201869 157299 420464 133999
17690e4466H7062M1330Q7507G1670J56859a72171A10144Q5026R744D5697J18637
$$ -54466 87062 128392 215899 71670 228529 -172171 110144 195170 204914 45697 164334
17679A64334a87117A92189g2635E48321I8669J2092B3289e9302B00233F8003k8048
$$ 164334 -187117 192189 -72635 548321 98669 110761 23289 -59302 200233 68003 39955
17668C9955J92393J87730j19857A23214O675l458l1918a23000l2310e8509B4759
$$ 39955 232348 420078 300221 123214 129889 126431 94513 -123000 -155310 -58509 24759
17656A03564C3847K08955r7328m7795J3744K18030i3842C06156A38749b10359
$$ 103564 33847 242802 145474 97679 111423 329453 -93842 306156 138749 -210359
17645A4260c3258C57624A62646M2558A4408J06844P0198a92744J6339A94250j7287
$$ 14260 -33258 357624 162646 205204 14408 121252 191450 -192744 -176405 194250 176963
17634A76963f5332B14859J33592A737Q3747J90069A6356K68107I5348b27601B06160
$$ 176963 -65332 214859 348451 1737 85484 275553 16356 284463 95348 -227601 206160
17622A66828e4904j03373B9618a77070A98535H0384A4352C059a35660A18744C1588
$$ 166828 -54904 -158277 29618 -177070 198535 80384 14352 3059 -135660 118744 31588
17610A97083q9285d7839e2H8986N2849M5446F8542e059B73393A6914L07036j52043
$$ 197083 107798 -47839 -52 88986 141835 187281 68542 -5059 273393 16914 323950 171907
17598A71907A6592J08393K0941c9356A29005J45180j19548C2006K12355C3203
$$ 171907 16592 124985 145926 -39356 129005 274185 154637 32006 244361 33203
17587B64240r1430e1973A6940p567O1542a17779E3561M4081D0176j4126K67579
$$ 264240 172810 -51973 16940 9373 70915 -117779 53561 97642 40176 26050 293629
17576B93629H7986O1215l0638J60792c16464B46175P748o4505m9709a66213A50532
$$ 293629 87986 149201 118563 279355 -316464 246175 253923 189418 139709 -166213 150532
17564A81473D9654M8154J00085B9326M8468a3049A39423A0758J74903q9945J08209
$$ 181473 49654 97808 197893 29326 77794 -13049 139423 10758 185661 95716 203925
17553B03925f021B32455q2363R3402Q639K7206a58005B91556H9056K39668c9249
$$ 203925 -6021 232455 150092 243494 252133 279339 -158005 291556 89056 328724 -39249
17541B09016E4835M26304F8962K13245e8540A79641J8043L0694A10850J60942
$$ 209016 54835 481139 68962 282207 -58540 179641 197684 228378 110850 271792
17531B71792K34825k51919q2505J22258L36698r3911J52963K45009M2424D31294
$$ 271792 506617 254698 172193 294451 631149 537238 690201 935210 977634 431294
17520F14878j06904j86269Q7772j48727j7801A12460K14572R7586m5914j16777
$$ 614878 507974 321705 409477 260750 242949 112460 327032 424618 378704 261927
17510B61927M76999J2405J98650o6277k14901J06802A23698B1088L67098j45960
$$ 261927 738926 751331 949981 883704 668803 775605 123698 21088 388186 242226
17500B42226A14625m8526M43168A91859O1729J62249k02934J54829B3303A1268
$$ 242226 114625 66099 509267 191859 253588 415837 212903 367732 23303 11268
17489A83616F0688R227J57191g6987B10487b6180A66637N2615l3594Q8086J6282
$$ 183616 60688 69915 227106 -76987 210487 -26180 166637 219252 185658 273744 290026
17478B90026B0297J67402J49109j40106a28659F5070M96136o1029k14648J32192
$$ 290026 20297 187699 336808 196702 -128659 65070 561206 500177 285529 417721
17468D17721A21510D7821K20851j08685K27267j01157a13296I4712K46296o8704
$$ 417721 121510 47821 268672 159987 387254 286097 -113296 94712 341008 272304
17458B72304J0826A08320M11963A18662M39108j80257M6701j747j11035A42484
$$ 272304 283130 108320 520283 118662 557770 377513 424214 422467 311432 142484
17447B07350I78N70795j86935j19317R1584E3472L53297A86104J29288n0594K68973
$$ 207350 978 571773 384838 265521 357105 53472 406769 186104 315392 264798 533771
17436E33771A45056C7066J30965a7957D92365a08420C35709A56937K33665J51553
$$ 533771 145056 37066 168031 -17957 492365 -108420 335709 156937 390602 542155
17426E42155k05950A54141E8209J90470m2203K18169l3113F8657N637b65427E94741
$$ 542155 336205 154141 58209 248679 206476 424645 391532 68657 74294 -265427 594741
17414C41702N8871j36376n1651M0587H0808K90520p6094M0481j65316L6993J18224
$$ 341702 400573 264197 212546 253133 80808 371328 295234 335715 170399 207392 325616
17403C25616F4100K2335c6405D27937j89861n2836J46706l5068H8263J5747L49953
$$ 325616 64100 86435 -36405 427937 238076 185240 331946 296878 88263 104010 453963
17392D53963j86895j08586J25656L28359A93046f9664C10109L66561k85805j59883
$$ 453963 267068 158482 284138 612497 193046 -69664 310109 676670 390865 230982
17382B30982F3427L08834j3715j58847J58955G5205L2692K24225g3562A90114
$$ 230982 63427 372261 358546 199699 358654 75205 107897 332122 -73562 190114
17371H4849K16223K5854A22533J64895A28996Q8968n8117K16656F342K1844L04160
$$ 84849 301072 326926 122533 287428 128996 217964 159847 376503 6342 28186 332346
17360C32346j58091K47762f5296C76963K4817A40568K67085j4482j34713O8252
$$ 332346 174255 422017 -65296 376963 401780 140568 407653 393171 258458 326710
17350C26710H0784d3672j30337A74589H6352j3569L38344B6561M4622K41891k4540
$$ 326710 80784 -43672 -174009 174589 86352 72783 411127 26561 71183 313074 288534
17339B88534m4851H6559M1052L7186J72657j33546k1649K39852A91231D0672O0949
$$ 288534 243683 86559 127611 164797 337454 203908 182259 422111 191231 40672 101621
17328A01621K8163J51519J07355A44056J69272E7991J58516J4297k8303N188D2094
$$ 101621 129784 281303 388658 144056 313328 57991 216507 230804 202501 207689 42094
17316D5867O7011L46296A22275J80523j25205M25838A77714a13012A63523J20220
$$ 45867 112878 459174 122275 302798 177593 603431 177714 -113012 163523 283743
17306B83743n415M7402K08613b8536A89621J14168J41922j92037l5183J00993
$$ 283743 278328 325730 534343 -28536 189621 303789 445711 253674 218491 319484
17296C19484j49504J22044k720k0900D5295N00654k33555J28969p2020p0653j8325
$$ 319484 169980 292024 289304 268404 45295 545949 312394 441363 369343 298690 280365
17285B80365J10830A88864J96118Q3964A43053J14237N2143P8948j92396J17712
$$ 280365 391195 188864 384982 468946 143053 257290 309433 388381 195985 313697
17275C13697A41513K51071p5777J69375B16606q0753n0169N0308J53626G4626
$$ 313697 141513 392584 316807 486182 216606 135853 85684 135992 289618 74626
17264F04862k72108R8179J74046A62916J2079J02101j18344K41229o9017j39815
$$ 604862 332754 430933 604979 162916 174995 277096 158752 399981 330964 191149
17254A91149M6624I7738J96008J92094l8181k22715J61272A89255K35310A28372
$$ 191149 237773 97738 293746 485840 447659 224944 386216 189255 424565 128372
17243C59251A65964J12112M1988r0621M73605B06433J53429j14315L7791j38325
$$ 359251 165964 278076 320064 229443 703048 206433 359862 245547 283338 145013
17233A45013K22443J37573k44429L5777j06176L15516a06549E8551L87067L7042
$$ 145013 367456 505029 260600 296377 190201 505717 -106549 58551 445618 482660
17223D82660j61876n1175J940N0273M8182A59859J88060P2072o9532O2131k04345
$$ 482660 320784 269609 271549 321822 370004 159859 347919 419991 350459 412590 208245
17212B08245K82188B08609M1868M80978A96256J9298K22145A64842K9563K11930
$$ 208245 490433 208609 250477 731455 196256 215554 437699 164842 194405 406335
17202D06335j08064C0209M31936L9290N5533A16525L42270B28667J84236J29374
$$ 406335 298271 30209 462145 501435 556968 116525 458795 228667 412903 542277
17192E42277F6093N42747j83552O7108l4040f117C70735j40358K15170J04847
$$ 542277 66093 608840 425288 492396 458356 -6117 370735 230377 445547 550394
17182E50394K5582n7965j66118j32397J84457J07164J93045J20767C93365K51835
$$ 550394 575976 518011 351893 219496 403953 511117 704162 824929 393365 645200
17172F45200j6660j64531L73448l98857L3531k01685K50648j29536K41473O1691
$$ 645200 628540 464009 837457 438600 472131 270446 521094 391558 633031 694722
17162F94722l03403L60006l57754K95385N057j39882K1564j92031J17276k5531
$$ 694722 391319 751325 393571 688956 694013 554131 575695 383664 500940 475409
17152D75409P2770P8827l11736J04176j67918J8839L9328J79636K96458l72772
$$ 475409 548179 627006 315270 419446 251528 270367 309695 489331 785789 413017
17142D13017q7222J48218O2723K66284r4143r4821j92055M8272N36647l00139
$$ 413017 325795 474013 536736 803020 708877 614056 422001 470273 1006920 706781
17132G06781k33456j81472J71200j55051M72584C24937K93552Q0701j61179J14671
$$ 706781 473325 291853 463053 308002 780586 324937 618489 699190 538011 652682
17122F52682C23931j4898j0718M04492C09983L68279P0495K98220A82622N26750
$$ 652682 323931 309033 298315 702807 309983 678262 748757 1046977 182622 709372
17112G09372j72316m3313K45863k66057K9714J88520N4407j75340M1622Q974O3987
$$ 709372 537056 493743 739606 473549 503263 691783 746190 570850 612472 621446 685433
17101F85433J80668j20467j17891A35485K66475L04377Q7745k07054k19541K78241
$$ 685433 866101 745634 627743 135485 401960 706337 794082 587028 367487 645728
17091F45728j25441M56240m22008K77961o7885C73970M10380Q6862k57847P7674
$$ 645728 520287 976527 554519 832480 764595 373970 784350 871212 613365 691039
17081F91039M6501O8485l36347K58935m6694J08391j97411p3009J77963k75394
$$ 691039 737540 806025 469678 728613 681919 790310 592899 519890 697853 422459
17071D22459L25284J87529k66078R5282P545K03983l02567K53336k11855N9864
$$ 422459 747743 935272 669194 764476 772021 976004 673437 926773 714918 774782
17061G74782K543O2660j98606K37384J13313k43214r1178K0623M28935J12163
$$ 774782 777325 839985 641379 878763 992076 748862 657684 678307 1107242 1219405
17051A219405k75565L3951l11269L12411M3460j01203J16628r4428j04577J69505
$$ 1219405 943840 977791 666522 978933 1022393 921190 1037818 943390 838813 1008318
17041A008318J01294O7555l86855r2089J08542k52739M37714q1453N2023P5447
$$ 1008318 1109612 1177167 790312 698223 806765 554026 991740 910287 962310 1037757
17031A037757j51415k0791L19013k57753R1484N884j99552J91342J3170k3258
$$ 1037757 886342 865551 1184564 926811 1018295 1024179 824627 1015969 1029139 1005881
17021A005881M5965j39439j1116M24395j99949j68802j17039j7985L90621K24676
$$ 1005881 1051846 912407 901291 1325686 1125737 956935 839896 821911 1212532 1437208
17011A437208m00886K02077p212O971J18239n2869R617l28489l0798J17569J91712
$$ 1437208 1036322 1238399 1231187 1238158 1356397 1303528 1313145 984656 953858 1071427 1263139
17000A263139p1377q3070K6571J09088K61818P5751k08156q5093k88501K37547
$$ 1263139 1191762 1108692 1135263 1244351 1506169 1581920 1373764 1288671 1000170 1237717
16990A237717l6926J86798k29933J70125J97241m06684P97007n91106K3374M11584
$$ 1237717 1200791 1387589 1157656 1327781 1525022 1118338 1915345 1324239 1347613 1759197
16980A759197k09544K2741K98961k09178o2574r8649k0295M68531o05721K9001
$$ 1759197 1549653 1572394 1871355 1662177 1599603 1500954 1480659 1949190 1343469 1372470
16970A372470R1148k1374R6579l90058L62559l3496M77647n16850L2219M93915
$$ 1372470 1463618 1442244 1538823 1148765 1511324 1477828 1955475 1438625 1470844 1964759
16960A964759l27977R1679K47524k81206R440K96970j77360O482l87315N32134
$$ 1964759 1636782 1728461 1975985 1694779 1704219 2001189 1823829 1830311 1442996 1975130
16950A975130r2698l01912N0876L51899j01798M0950l1185J84895K41899k86115
$$ 1975130 1882432 1580520 1631396 1983295 1881497 1922447 1891262 2076157 2318056 2031941
16940B031941J33176k79800L66724j57908m2392J30492m7782n5700j23405J02693
$$ 2031941 2165117 1885317 2252041 2094133 2051741 2182233 2134451 2078751 1955346 2058039
16930B058039K18359l1730J90679j65951K00838o4030j13608l0448L00984R1485
$$ 2058039 2276398 2244668 2435347 2269396 2470234 2406204 2292596 2262148 2563132 2654617
16920B654617p3351k99454L42795L50532j73909j73379j2059n1702O2927J07478
$$ 2654617 2581266 2281812 2624607 2975139 2801230 2627851 2615792 2564090 2627017 2734495
16910B734495l184J80602l043n14196M58694p2079O5171L22325p7105J39529r008
$$ 2734495 2731311 2911913 2908870 2394674 2853368 2781289 2846460 3168785 3091680 3231209 3222201
16899C222201l70337M7081L73097j18293J48308M7737j83561K29881J54647k7579
$$ 3222201 2851864 2898945 3272042 3153749 3302057 3349794 3166233 3396114 3550761 3523182
16889C523182O8713j14377J0042Q1350j63125J33099K27392K61737r0476Q2653
$$ 3523182 3591895 3477518 3487560 3568910 3405785 3538884 3766276 4028013 3937537 4020190
16879D020190m3450K72019P6491q6048k79122J9360J76550j6468K78088q1402
$$ 4020190 3976740 4248759 4325250 4239202 3960080 3979440 4155990 4139522 4417610 4336208
16869D336208K0240R9651R8829M41606j60602J50947k96259K25173j10620J31833
$$ 4336208 4356448 4456099 4554928 4996534 4835932 4986879 4690620 4915793 4805173 4937006
16859D937006K93135L9699j15320P50690m88310n3433L76579j53913m2523O41726
$$ 4937006 5230141 5269840 5154520 5905210 5416900 5363467 5740046 5586133 5543610 6185336
16849F185336l93003K3135K25536J72914J63009K31842n1826J47682m06180O25788
$$ 6185336 5792333 5815468 6041004 6213918 6376927 6608769 6556943 6704625 6298445 6924233
16839F924233Q2848J33425L60302m1221j55023L82364K16483J31970L95669j51176
$$ 6924233 7007081 7140506 7500808 7459587 7304564 7686928 7903411 8035381 8431050 8279874
16829H279874N2011o9862M35877q1655L6606P59575O1614N5146L22068N7987J89444
$$ 8279874 8331885 8262023 8697900 8616245 8652851 9412426 9474040 9529186 9851254 9909241 10098685
16818A0098685L00150j53457N17772J96924J43504K58714L96407Q5154j7089N54443
$$ 10098685 10398835 10245378 10763150 10960074 11103578 11362292 11758699 11843853 11826764 12381207
16808A2381207J67758N5724O94705K35894K85739J93564M71198J65357O30821
$$ 12381207 12548965 12604689 13299394 13535288 13821027 14014591 14485789 14651146 15281967
16799A5281967J13337L29824j6222Q75700q6281N88277O43527O07804M23937j13350
$$ 15281967 15395304 15725128 15708906 16584606 16498325 17086602 17730129 18337933 18761870 18648520
16789A8648520Q19418O60259J55011O97959Q33350N12985N56292Q45508O6180
$$ 18648520 19467938 20128197 20283208 20981167 21814517 22327502 22883794 23729302 23795482
16780B3795482P50225N03827J284315M46149N20032J214403O01424Q07382Q07610
$$ 23795482 24545707 25049534 26333849 26779998 27300030 28514433 29115857 29923239 30730849
16771C0730849P99511J062200R89360Q37436J119760J156688R69356J103915J335627
$$ 30730849 31530360 32592560 33581920 34419356 35539116 36695804 37665160 38769075 40104702
16762D0104702J133343J106858J801083J083039J172917J289854J681867J570848
$$ 40104702 41238045 42344903 44145986 45229025 46401942 47691796 49373663 50944511
16754E0944511J712958J558810J604107J384985J833939J951272J914763J702421
$$ 50944511 52657469 54216279 55820386 57205371 59039310 60990582 62905345 64607766
16746F4607766J465339J736795J987582K196830J490555J769593K315707J464448
$$ 64607766 66073105 67809900 69797482 71994312 73484867 75254460 77570167 79034615
16738G9034615J560505J771271J622180J464750J516335J218701J400020O30719
$$ 79034615 80595120 82366391 83988571 85453321 86969656 88188357 89588377 90219096
16730I0219096J140422Q39635Q97007O07340J43984L34601K94156m11904m25718
$$ 90219096 91359518 92199153 93096160 93703500 93847484 94182085 94476241 94064337 93638619
16721I3638619l92511n74473q06879p45679j140903j170996j351538j339879j651062
$$ 93638619 93246108 92671635 91864756 91119077 89978174 88807178 87455640 86115761 84464699
16712H4464699j278217j586343j654519j585705k167732j865364j197205k094668
$$ 84464699 83186482 81600139 79945620 78359915 76192183 74326819 73129614 71034946
16704G1034946j856393j875631j572739j906276j825920j824693j448624j542075
$$ 71034946 69178553 67302922 65730183 63823907 61997987 60173294 58724670 57182595
16696E7182595j781878j213091j886724j801665j189646j793626j098127j223964
$$ 57182595 55400717 54187626 52300902 50499237 49309591 47515965 46417838 45193874
16688D5193874j563275j018833j248112j605687p81844j196564q93692j441379
$$ 45193874 43630599 42611766 41363654 39757967 38976123 37779559 36885867 35444488
16680C5444488p18701p99995j066873q65921q83263q39672p48321r80367p40196
$$ 35444488 34725787 33925792 32858919 31992998 31109735 30270063 29521742 28541375 27801179
16671B7801179n71155n28251q72821o14721o16846p03199n50077n73943p42466
$$ 27801179 27230024 26701773 25828952 25214231 24597385 23894186 23344109 22770166 22027700
16662B2027700o03757l37410l64342p13213K12826j117016m06157l21227k40506
$$ 22027700 21423943 21086533 20722191 20008978 20221804 19104788 18698631 18377404 18136898
16653A8136898p44116q9582l39648o22158j41848n07975l80744l06871q7261o12141
$$ 18136898 17392782 17303200 16963552 16341394 16199546 15691571 15310827 15003956 14916695 14304554
16643A4304554L0535k93855l32754j92615n24306k46584j68804o6593m20775l61874
$$ 14304554 14335089 14041234 13708480 13515865 12991559 12744975 12576171 12509578 12088803 11726929
16633A1726929K98189l83230k66144n28067j70480k69738J49984j64004k60973
$$ 11726929 12025118 11641888 11375744 10847677 10677197 10407459 10557443 10393439 10132466
16624A0132466L4283o26175K06223o00112K77507k63538j65222l07471L6884J78045
$$ 10132466 10166749 9540574 9746797 9146685 9424192 9160654 8995432 8687961 8724845 8902890
16614H902890n68525j25749J25579q3108k84249j78042p2130k9916j3199k29931
$$ 8902890 8334365 8208616 8334195 8251087 7966838 7788796 7716666 7686750 7673551 7443620
16604G443620k1511k80986J17263j71156k19761n24958M44606n9020j43099l2090
$$ 7443620 7422109 7141123 7258386 7087230 6867469 6342511 6787117 6728097 6584998 6552908
16594F552908m01382J45185O3937m72849q6678J67689l17696N5322m9314j79013
$$ 6552908 6151526 6296711 6360648 5887799 5801121 5968810 5651114 5706436 5657122 5478109
16584E478109o6406j82086J29700j36125j78887Q0680N5495k91353Q5871Q3970
$$ 5478109 5411703 5229617 5359317 5223192 5044305 5124985 5180480 4889127 4974998 5058968
16574E058968R3219k07501R9841n35702K24761j19785o1891Q5650j86087k42398
$$ 5058968 5152187 4944686 5044527 4508825 4733586 4613801 4551910 4637560 4451473 4209075
16564D209075J46791J77448j53816m53223K31900p1904R3361K7004j54252j76376
$$ 4209075 4355866 4533314 4379498 3926275 4158175 4086271 4179632 4206636 4052384 3876008
16554C876008R112k1443J04423j77092l77255J60344K68678o12510J81861K2264
$$ 3876008 3885120 3863677 3968100 3791008 3413753 3574097 3842775 3230265 3412126 3434390
16544C434390K12424L9586j22309k35533n0284j41085L21590m4731r7684j00235
$$ 3434390 3646814 3686400 3564091 3328558 3278274 3137189 3458779 3414048 3316364 3216129
16534C216129L185m6338j7943J35120m37229K72943j91826J20740M3107j83660
$$ 3216129 3219314 3172976 3155033 3290153 2852924 3125867 2934041 3054781 3097888 2914228
16524B914228K66299l06207M6726k85582J69939K92358m41503J49368J63493n68132
$$ 2914228 3180527 2874320 2921046 2635464 2805403 3097761 2656258 2805626 2969119 2400987
16514B400987K84095K50560l73939J75386J05881k70721j58738R173k6895k287
$$ 2400987 2685082 2935642 2561703 2737089 2842970 2572249 2413511 2422684 2395789 2393502
16504B393502J14970k00100J77801k97832M90273l64135R9210k1580l15169j45081
$$ 2393502 2508472 2308372 2486173 2188341 2678614 2314479 2413689 2392109 2076940 1931859
16494A931859L62740K20478k15921J36460j59302K54046l07582o346k11648N70232
$$ 1931859 2294599 2515077 2299156 2435616 2276314 2530360 2222778 2216432 2004784 2575016
16484B575016l51391J35177N5317m94407J58144L2121K05679k54367J3081q8776
$$ 2575016 2223625 2358802 2414119 1919712 2077856 2109977 2315656 2061289 2074370 1985594
16474A985594n6915J15881p2770L97022l95758N2390k03709L68238j51884k66116
$$ 1985594 1928679 2044560 1971790 2368812 1973054 2025444 1821735 2189973 2038089 1771973
16464A771973M09844l75051j67558J73396l8655P8913r8971L08517l01785k47113
$$ 1771973 2181817 1806766 1639208 1812604 1773949 1852862 1753891 2062408 1760623 1513510
16454A513510N04452q2179k40607K41139M5094p4463q0846m17862J09850K58396
$$ 1513510 2017962 1935783 1695176 1936315 1981409 1906946 1826100 1408238 1518088 1776484
16444A776484l57924Q6500K32224j45632k74254J48703M8838K04691l34530J45459
$$ 1776484 1418560 1505060 1737284 1591652 1317398 1466101 1514939 1719630 1385100 1530559
16434A530559j04312o8509L18253n41062K78457K46749j27549k15471K53882k59657
$$ 1530559 1426247 1357738 1675991 1134929 1413386 1660135 1532586 1317115 1570997 1311340
16424A311340L01668m12512J28546M7604O2456m50246J05848L61652Q8334j72627
$$ 1311340 1613008 1200496 1329042 1376646 1439102 988856 1094704 1456356 1544690 1372063
16414A372063M6121K66478L8595l24128K64728o26626J85952J58132j06516J30926
$$ 1372063 1418184 1684662 1723257 1399129 1663857 1037231 1223183 1381315 1274799 1405725
16404A405725j2017k00050j37480R5295P9802l2k09201P9843K07596J7684k54949
$$ 1405725 1393708 1193658 1056178 1151473 1231275 1231243 1022042 1101885 1309481 1327165 1072216
16393A072216Q9261j23680j8493p1047M44497k61264J11233l44072K25673j32936
$$ 1072216 1161477 1037797 1019304 948257 1392754 1131490 1242723 898651 1124324 991388
16383I91388J76432r837j37787r6563N83665k34079r9211l3726j33975J8795L8067
$$ 991388 1167820 1157983 1020196 923633 1507298 1273219 1174008 1140282 1006307 1025102 1063169
16372A063169L16196k75198j8324m7643J91195j00827O9916j87524M22323j99624
$$ 1063169 1379365 1104167 1085843 1038200 1229395 1128568 1198484 1010960 1433283 1233659
16362A233659k20836j12864j25145N7546J3049R5235J21374k07667k25424N70496
$$ 1233659 1012823 899959 774814 832360 845409 940644 1062018 854351 628927 1199423
16352A199423j74984M5086n1029J02886m08246r8823K66938R5122N6899k76384
$$ 1199423 1024439 1069525 1018496 1121382 713136 614313 881251 976373 1033272 756888
16342G56888l8357m7825N0750L08764k13182M0125J49055j71066K53517r0005
$$ 756888 718531 670706 721456 1030220 817038 857163 1006218 835152 1088669 998664
16332I98664j04788N5603j83854J11675J79495k07738K499j49353o6192K19283
$$ 998664 893876 949479 765625 877300 1056795 849057 851556 702203 636011 855294
16322H55294J1811j62917R9423j27689J49414j20270K86880j0852J72764E21933
$$ 855294 867105 704188 803611 675922 825336 705066 991946 981094 1153858 521933
16311I80323o8639k40369p8232L89431r0690K23482k80112P3898J352k41872B37423
$$ 980323 911684 671315 593083 982514 891824 1115306 835194 909092 910444 668572 237423
16299H02997j63659K86454k96559o1024K84829k46679J78979q613K36993l78610
$$ 802997 639338 925792 629233 568209 853038 606359 785338 776725 1013718 635108
16289F35108K56088D33149K96933L1820J45693j7110L2173j44063p6823o3981
$$ 635108 891196 433149 730082 761902 907595 890485 922658 778595 701772 637791
16279F37791k66200M01595M1490k3708k29752J86345l48232M39710M2830l06565
$$ 637791 371591 773186 814676 790968 561216 747561 399329 839039 881869 575304
16269E75304Q2039K37937j71j79429l45378J08163j82159J31133J38473J93405
$$ 575304 657343 895280 895109 715680 370302 478465 296306 427439 565912 759317
16259G59317k33631M5020J58272k7722k04745L7839R406J48790r4410M0567m3129
$$ 759317 525686 570706 728978 701256 496511 534350 543756 692546 598136 638703 595574
16248E95574k31475J74290J11178J75160l57803R3867B58761L19659J25068k14279
$$ 595574 364099 538389 649567 824727 466924 560791 258761 578420 703488 489209
16238D89209K29176j78523k9100J10995B86590J46502J78377j81904L17098k29204
$$ 489209 718385 539862 510762 621757 286590 433092 611469 429565 746663 517459
16228E17459j02910m6253K50844B09985L82377j0068j98108Q0502n9844N5988
$$ 517459 414549 368296 619140 209985 592362 582294 384186 464688 404844 460832
16218D60832L37896l97305K88025j85466k11804J0360r5068K48697j61613o8453
$$ 460832 798728 401423 689448 503982 292178 302538 207470 456167 294554 226101
16208B26101K03000J66088M4446k17436M09874C51226K74956k6261k20139J00153
$$ 226101 429101 595189 639635 422199 832073 351226 626182 599921 379782 479935
16198D79935j50057Q8742A99954K08103M1877o3680A44678L50200o4142j55086
$$ 479935 329878 418620 199954 408057 449934 386254 144678 494878 430736 275650
16188B75650M6384i0749B97308M00668B47746L61368J4584j71344j38906K48312
$$ 275650 322034 -90749 297308 697976 247746 609114 623698 452354 313448 561760
16178E61760j44142Q7042l5918P6851r5840N7652j50949K85874o7841k80608A27006
$$ 561760 417618 504660 468742 545593 449753 507405 356456 642330 574489 293881 127006
16166B66922m3522J69801E6369R2179J83483n8312K59752j87900J07718B18461
$$ 266922 223400 393201 56369 148548 332031 273719 533471 345571 453289 218461
16155C45515H0915J66814A13726m1600J51625j8734J85162j63551I660M81302
$$ 345515 80915 247729 113726 72126 223751 205017 390179 226628 9660 490962
16145D90962k43774K99031J52455l06329J73360q0355q4587K36530j62597k03669
$$ 490962 247188 546219 698674 392345 565705 485350 400763 637293 474696 271027
16135B71027J0567q1010K89547J0882m5415K28226k51098j40397K20139B24240
$$ 271027 281594 200584 490131 501013 455598 683824 432726 292329 512468 224240
16124h8454A17584K51605A83442J85327I4435K04069J08576A99930K85167j78642
$$ -88454 117584 369189 183442 368769 94435 298504 407080 199930 485097 306455
16114C06455j26225n1929K18557j19165K20798B22387K11445l0756j04772f6255
$$ 306455 180230 128301 346858 227693 448491 222387 433832 403076 298304 -66255
16103B26791j3917J98287G3179J95124Q9503l1706l0415R1059b20413D53664q2098
$$ 226791 212874 411161 73179 268303 357806 326100 295685 386744 -220413 453664 371566
16092C71566A52980l8211K92379A00342J16968q1391K30005A01608K06228H288
$$ 371566 152980 114769 407148 100342 217310 135919 365924 101608 307836 8288
16081F1492O9039J11196j13560J13946q2490E8879J17083q6876J0463Q2261N8164
$$ 61492 130531 241727 128167 242113 159623 58879 175962 89086 99549 181810 239974
16070B39974K6542M9847p8229l9158r7730K25036j25846m2293a12376A60248n7396
$$ 239974 266516 316363 238134 198976 101246 326282 200436 158143 -112376 160248 102852
16059A02852L04078j61186l8767b0217I1169K62839A44290O9275H7085L4041a57633
$$ 102852 406930 245744 206977 -20217 91169 354008 144290 213565 87085 121126 -157633
16047B33274m7706n9910l7662J91941q3231A1160R3697f2001B32394N9030j40078
$$ 233274 185568 125658 87996 279937 196706 11160 104857 -62001 232394 291424 151346
16036A51346L8955m7036F8997O8043C6990a24950B40033I3588l6071a07074A99046
$$ 151346 190301 143265 68997 137040 36990 -124950 240033 93588 57517 -107074 199046
16024C6246F934L55998j7698n7701a84529h8927A57937m3327g1656D4340L83291
$$ 36246 6934 362932 345234 287533 -184529 -88927 157937 114610 -71656 44340 427631
16013D27631A073O4686C452Q8439K58916a705A0219J7612J02658A2892L45065
$$ 427631 1073 65759 3452 91891 350807 -1705 10219 27831 130489 12892 357957
16002C57957b43290B47930d8076B18783q3670J81876a03972A98891O2762M8582
$$ 357957 -243290 247930 -48076 218783 135113 316989 -103972 198891 261653 310235
15992C10235A54393K08218j77470L92604L42197J95069K47095r1800j57384m49409
$$ 310235 154393 362611 185141 577745 919942 1115011 1362106 1270306 1112922 663513
15982F63513l07423K2686j09158J18919q6319a30204b3595O402I9415K73865c97832
$$ 663513 356090 378776 269618 388537 302218 -130204 -23595 -17193 99415 373280 -397832
15970G8997Q4185c3684C01367a9063j96040D57917A59350G0561a47684A67378
$$ 78997 163182 -33684 301367 -19063 -215103 457917 159350 70561 -147684 167378
15959B29054a30158C27940b71128f4851A32221a72369B26878p6870E1136a70810
$$ 229054 -130158 327940 -271128 -64851 132221 -172369 226878 150008 51136 -170810
15948E780b18638E42758A11944a9283A98656a79289j6312D7359a33971L9543A3323
$$ 5780 -218638 542758 111944 -19283 198656 -179289 -195601 47359 -133971 -94428 13323
15936a0483D7946a77768K686j1492A95431a04235A7776J646L5033K1991b14027
$$ -10483 47946 -177768 -175082 -186574 195431 -104235 17776 19422 54455 76446 -214027
15924E1640d139j95466k27698H7899E743a22947k11902c4340B19166b00795f9837
$$ 51640 -4139 -199605 -427303 87899 5743 -122947 -334849 -34340 219166 -200795 -69837
15912A57695K51029b15459C0167K47182i81C22265A37743J41157r474J15932j45659
$$ 157695 408724 -215459 30167 277349 -981 322265 137743 278900 269426 385358 239699
15901B39699f5362A84342d3B46950b16506f7040B98298E1091a01172d2212B14389
$$ 239699 -65362 184342 -43 246950 -216506 -67040 298298 51091 -101172 -42212 214389
15889B8721j239b7448J1613C10046A13934a32424A26268B6507Q1369J9802b4961
$$ 28721 27482 -27448 -15835 310046 113934 -132424 126268 26507 107876 127678 -24961
15877d8322j229A30126L616O1490R5520h9065g002p8702A13776h3257A07234b01440
$$ -48322 -49551 130126 133742 195232 290752 -89065 -7002 -85704 113776 -83257 107234 -201440
15864D1718L4159a38990o1920A47063F2289J63907o7957m0377J38040b98726F837
$$ 41718 75877 -138990 -200910 147063 62289 226196 158239 117862 255902 -298726 6837
15852B29345I4884k3822F111M4294O1499b56756B63476F9651b1429A99549G4285
$$ 229345 94884 71062 6111 50405 111904 -256756 263476 69651 -21429 199549 74285
15840C57064a90810M8283B40731c616E3958P1615F631g8386A61344l710b22098
$$ 357064 -190810 -142527 240731 -3616 53958 125573 6631 -78386 161344 157634 -222098
15828b89249a3349l74116F8104J90331b55558B5975a03779K7342A29459b23892
$$ -289249 -13349 -387465 68104 258435 -255558 25975 -103779 -76437 129459 -223892
15817g753n262C00523B1570P7527i8901B9343c1081C71110j64194G4237h467B5095
$$ -7753 -13015 300523 21570 99097 -98901 29343 -31081 371110 206916 74237 -8467 25095
15804A09393c45344C41461a95825J3911M0556A16247J77664J11888A41545a86042
$$ 109393 -345344 341461 -195825 -181914 -141358 116247 293911 405799 141545 -186042
15793C4899b34815h8272D03217g3671D91878a62292b2331k41847B03181d8108
$$ 34899 -234815 -88272 403217 -73671 491878 -162292 -22331 -264178 203181 -48108
15782a14950B872b18030g7819c8024j89849J10096I8239a9428p89A94913j1151
$$ -114950 2872 -218030 -77819 -38024 -227873 -117777 98239 -19428 -20217 194913 183762
15771A83762F1368a3321o5931j14195P854P5494M7546q7621B4441J51446b56106
$$ 183762 61368 -13321 -79252 -193447 -185593 -110099 -62553 -150174 24441 175887 -256106
15759c72088e8140J7985C23211A03283b25035Q5518c3743E0583Q3600K4252n0353
$$ -372088 -58140 -40155 323211 103283 -225035 -139517 -33743 50583 134183 158435 108082
15748A08082J02564k4230H3449A0287J43443J32569k8967a5323B91452a19320
$$ 108082 210646 186416 83449 10287 153730 286299 257332 -15323 291452 -119320
15737F1895K4685b9840C06474e3987o8460E0588P390J15701A8510g5203B30885
$$ 61895 86580 -29840 306474 -53987 -122447 50588 57978 173679 18510 -75203 230885
15725i3469G741a1624A44533j4611a67302j2808G5640G461O3822C1831a10211
$$ -93469 7741 -11624 144533 129922 -167302 -180110 75640 7461 71283 31831 -110211
15713a91333n1247n459A30710a10167k7551L6169J095o6170I5394J58718b07660
$$ -191333 -242580 -248039 130710 -110167 -137718 -101549 -100454 -166624 95394 254112 -207660
15701B72446p6308e6684C5846j4683J0235a41979N4066A39830B6203O2223J58929
$$ 272446 196138 -56684 35846 21163 31398 -141979 -87913 139830 26203 88426 247355
15690B47355a89933b8012B69272A27549j2370b31755E5766P1617E9276a26555
$$ 247355 -189933 -28012 269272 127549 115179 -231755 55766 127383 59276 -126555
15679e034k38517A57380J59742e1104j73872l19086A3125g343k06209l6178G6496
$$ -5034 -243551 157380 317122 -51104 -224976 -544062 13125 -7343 -213552 -249730 76496
15667b33044A86415a01825F9158b45378A82984b2335A60648l9431b69762a03793
$$ -233044 186415 -101825 69158 -245378 182984 -22335 160648 121217 -269762 -103793
15656D0987a68749c7712B63456m25j30784m8139c50399D7248P2909b09283Q2817
$$ 40987 -168749 -37712 263456 263031 132247 84108 -350399 47248 120157 -209283 -126466
15645a26466C37646d1705N537A7677b81409E3179O892c51212a14662c9704j0699
$$ -126466 337646 -41705 -36168 17677 -281409 53179 60071 -351212 -114662 -39704 -50403
15634e0403j6435B21094g0331k63338A23114g6386o5054A96499E7079a43699C80434
$$ -50403 -66838 221094 -70331 -333669 123114 -76386 -141440 196499 57079 -143699 380434
15622b46979J04834l2306P2632A7822K76294a49116j08686b4332j10694G5157
$$ -246979 -142145 -174451 -101819 17822 294116 -149116 -257802 -24332 -135026 75157
15611A3672L4206a80375A02708c67068M2383A61954i5612c2689B0779J38207c38884
$$ 13672 47878 -180375 102708 -367068 -324685 161954 -95612 -32689 20779 158986 -338884
15599F6533N8699a24626a1331p1563C7910n637c7368C28977h5014H9238J59794
$$ 66533 125232 -124626 -11331 -82894 37910 32273 -37368 328977 -85014 89238 249032
15588B49032F8441a58415A95471N3199f6145B44726A3028f5712j03699N4369p1019
$$ 249032 68441 -158415 195471 248670 -66145 244726 13028 -65712 -169411 -115042 -186061
15577a86061D1978K91491A39398a67738G5180c06905O6133h9849j72415a18994
$$ -186061 41978 333469 139398 -167738 75180 -306905 -240772 -89849 -262264 -118994
15566A47242A150a88185B0022J6306L383A5931M03122a52062C81113c5032A83081
$$ 147242 1150 -188185 20022 36328 39711 15931 419053 -152062 381113 -35032 183081
15554c10964e7927B3711J9975K21396a70207B56997K7634b96716a8662k23220
$$ -310964 -57927 23711 43686 265082 -170207 256997 284631 -296716 -18662 -241882
15544b41882D5280A5924K65624E6575a3223I8695J5507N0696b41293I9809B0715
$$ -241882 45280 15924 281548 56575 -13223 98695 114202 164898 -241293 99809 20715
15532g8259G3127a17271l980A35104b75680L9454I1311Q8087g1572I9879c33015
$$ -78259 73127 -117271 -121251 135104 -275680 -236226 91311 179398 -71572 99879 -333015
15520B75477e6742B55225f990C94092I3458L49321B2643L3273M44618c9359C23644
$$ 275477 -56742 255225 -6990 394092 93458 442779 22643 55916 500534 -39359 323644
15508B19435o1460F7111a25913L806F7601J26869E2107b66779B8924L97065j56784
$$ 219435 157975 67111 -125913 -122107 67601 194470 52107 -266779 28924 425989 269205
15497B69205d1670A7024M4278J7308J8725J27751G3274c6377H85J06607b05872
$$ 269205 -41670 17024 61302 78610 97335 225086 73274 -36377 885 107492 -205872
15485A50515O2104I0998j7695A7707b17992B46871k3245h697B41930M53766j44940
$$ 150515 212619 90998 73303 17707 -217992 246871 223626 -8697 241930 695696 550756
15474E50756q6978p9734j09768a3858B23574b26173A19641a58466A31185J30731
$$ 550756 463778 384044 274276 -13858 223574 -226173 119641 -158466 131185 261916
15464B61916b95845J39325C0077H178K97507c0866A35317J20409c0821J2039j66860
$$ 261916 -295845 -156520 30077 8178 305685 -30866 135317 255726 -30821 -18782 -185642
15453a85642C4380a61479g0684j07804M8860l7617B02414J05610A52780L31425
$$ -185642 34380 -161479 -70684 -178488 -129628 -167245 202414 308024 152780 484205
15443D84205J59799J77350j73134k00206B14018I8492L0135h4198A71294o1504
$$ 484205 644004 821354 648220 448014 214018 98492 128627 -84198 171294 109790
15433A09790b50219A05655L31177A02328J85896C3454a04266A45017a49160A0462
$$ 109790 -250219 105655 436832 102328 288224 33454 -104266 145017 -149160 10462
15422H4389L8675a02788M8593A46684l7205a02202A42413J5001n5646J34987H1662
$$ 84389 123064 -102788 -54195 146684 109479 -102202 142413 157414 101768 236755 81662
15410H8932O2255d66730a0461j31853B85084j05743a22317j05416F0276O6611
$$ 88932 151187 -466730 -10461 -142314 285084 179341 -122317 -227733 60276 126887
15400A26887j6562k8469J22189L6654n7486F9527a21676A9411b06296D6251h6373
$$ 126887 110325 81856 204045 240699 183213 69527 -121676 19411 -206296 46251 -86373
15388a579A89695m9332o4703B7944A47L55978a95160m2764G5572a03189C6468
$$ -1579 189695 140363 75660 27944 147 356125 -195160 -237924 75572 -103189 36468
15376E7883h1015A38334Q3229N2514p7824Q3449q5206a44092A83267g7132D38176
$$ 57883 -81015 138334 221563 274077 196253 279702 194496 -144092 183267 -77132 438176
15364C94377j54261a21056F4730B1119R1547g248B39315H0829J91848a38355M4755
$$ 394377 240116 -121056 64730 21119 112666 -7248 239315 80829 272677 -138355 -93600
15353i3600D16100j95796J29284A64759R7215H951a6643C3517J04382f3506H0487
$$ -93600 416100 220304 349588 164759 261974 8951 -16643 33517 137899 -63506 80487
15341C42961R4920p4651K81647a63897c2290A05751a39809k6469h868p7179C83878
$$ 342961 437881 363230 644877 -163897 -32290 105751 -139809 -166278 -8868 -86047 383878
15329A99320F9742N5426j8930M3805C9R1970L11510A73043f7694B58542A09647
$$ 199320 69742 125168 106238 150043 39 92009 403519 173043 -67694 258542 109647
15317G0613K84074j72668l6504J51194a87426D06178a50017A21615J21910a79842
$$ 70613 354687 182019 145515 296709 -187426 406178 -150017 121615 243525 -179842
15306C54591H9507L09793o6306F4538c22906d414D9312f2766p3596A03317K2256
$$ 354591 89507 399300 332994 64538 -322906 -4414 49312 -62766 -136362 103317 125573
15295A25573b32691a4783F8644J0937i7576A96535C3237b04859c0675A01611B0642
$$ 125573 -232691 -14783 68644 79581 -97576 196535 33237 -204859 -30675 101611 20642
15283B81866J0541H7884a49729A43363a17794A70386b88923i8138R486j19639
$$ 281866 292407 87884 -149729 143363 -117794 170386 -288923 -98138 -88652 -208291
15273b08291F8256N6990M7565b82393J34959r6753D1008M64470E6519A6837c6980
$$ -208291 68256 125246 172811 -282393 -147434 -244187 41008 505478 56519 16837 -36980
15261a01093B90886p1379Q7887H5056B298h5297A40209m2954B5284L80131A35134
$$ -101093 290886 219507 307394 85056 2298 -85297 140209 97255 25284 405415 135134
15249E1418B268L33897K29571l233O51470j58607j31370M62537N2329E74417k72002
$$ 51418 2268 336165 565736 562503 1213973 1055366 923996 1386533 1438862 574417 302415
15238C02415j27391a1807A85911M6757c2133A04154O3376a25155B80689G6209
$$ 302415 175024 -11807 185911 232668 -32133 104154 167530 -125155 280689 76209
15227A53338b11362A46992J46047b6333k05183D07564A55512j0315c4637o7431
$$ 153338 -211362 146992 293039 -26333 -231516 407564 155512 145197 -34637 -102068
15217a02068B02663D2233J61536j3755a87030n4067h5052A32772J4104J19075
$$ -102068 202663 42233 203769 190014 -187030 -241097 -85052 132772 146876 265951
15207B65951j04309L26396c91208c3680I0539j5547M0010a64176A63230m259d6131
$$ 265951 161642 488038 -391208 -33680 90539 74992 115002 -164176 163230 158971 -46131
15195h0315G0900b26321C15582i9960B87231b9881l31405A34348J79696A45793
$$ -80315 70900 -226321 315582 -99960 287231 -29881 -361286 134348 314044 145793
15184I5714B6932P8568N7955l0912O3620d2321A76586o084C016i2237A32063a46506
$$ 95714 26932 105500 163455 132543 196163 -42321 176586 170502 3016 -92237 132063 -146506
15171B9342c26106a03230A66912A7723K2241o375a19348A3774b21D27550a16275
$$ 29342 -326106 -103230 166912 17723 39964 33589 -119348 13774 -221 427550 -116275
15159A81959M1864o6928a73482I5356K3172a23289c7350A07383c47958D35231
$$ 181959 223823 156895 -173482 95356 118528 -123289 -37350 107383 -347958 435231
15148i9159K1846A19284K18746a29569A0579K90742a72041A92335l9184n4832
$$ -99159 -77313 119284 338030 -129569 10579 301321 -172041 192335 153151 98319
15138I8319A6432J25929m6084J69301H994J99816m7882M21061A60892K23482J96267
$$ 98319 16432 142361 96277 265578 8994 208810 160928 581989 160892 384374 580641
15127E80641A99957E3917J43104d3771B18210m6520J79222I2888J77081K28943
$$ 580641 199957 53917 197021 -43771 218210 171690 350912 92888 269969 498912
15117D98912A8513a6626B58107a42038E552K40640n7658a74329A92331J57230
$$ 498912 18513 -16626 258107 -142038 5552 246192 188534 -174329 192331 349561
15107C49561j50752P4752K38400C7851M8144N30g5185b1945A14625d2814k8352
$$ 349561 198809 273561 511961 37851 85995 86525 -75185 -21945 114625 -42814 -71166
15096g1166A1932a5259A63544G2313L5093h0225G2016J29873q1255J26230J24135
$$ -71166 11932 -15259 163544 72313 107406 -80225 72016 201889 120634 246864 370999
15085C70999E6320J25975J86666C1281A010h5171a5115G5248M605b5888j78320
$$ 370999 56320 182295 368961 31281 1010 -85171 -15115 75248 79853 -25888 -204208
15074b04208A07441J80305K744C0354J21752E0600a03566C23938C9852A9731Q0598
$$ -204208 107441 287746 290490 30354 152106 50600 -103566 323938 39852 19731 100329
15063A00329e8283D28026j30628q1399K58502r4042Q7281i7579m6770D25321A24653
$$ 100329 -58283 428026 297398 215999 474501 380459 467740 -97579 -144349 425321 124653
15051E134K73791L5968P4250A02983L95658r0553j91272K48024A03522D1884L33705
$$ 5134 278925 314893 389143 102983 498641 408088 216816 464840 103522 41884 375589
15040C75589H4435K35523J1053N3027j8287A36012j157M00337k64905l0875M1053
$$ 375589 84435 319958 331011 384038 365751 136012 134855 535192 270287 239412 280465
15029B80465J61106Q7106J50619k06017L61487B97705a94566E16619k16383K20963
$$ 280465 441571 528677 679296 473279 834766 297705 -194566 516619 300236 521199
15019E21199A75455L55359j43416J75387l4380k35071E7724K42001A10333N9794
$$ 521199 175455 530814 387398 562785 528405 293334 57724 299725 110333 170127
15009A70127K40814G0320L01801R5279j67627K14045j89199D7251L93606A94630
$$ 170127 410941 70320 372121 467400 299773 513818 324619 47251 440857 194630
14998E36969k56248j15365m3996J89651J02443A91435L94042B10645K03961p1120
$$ 536969 280721 165356 121360 311011 413454 191435 585477 210645 414606 343486
14988C43486j03331J62674A25365M12451A28576c8002B72288K53272O2924N03769
$$ 343486 240155 402829 125365 537816 128576 -38002 272288 525560 588484 1092253
14978A092253n10328m9471B21824K79727J01872k20255H5269J45641K18560j5418
$$ 1092253 581925 532454 221824 501551 603423 383168 85269 230910 449470 434052
14968D34052L52118l74949O4237j77006J82717a1980B84408q9024A6399P6708
$$ 434052 786170 411221 475458 298452 481169 -11980 284408 195384 16399 93107
14958I3107J53148J09474q3815l1112L5569A18965Q3006j6475L32175j90549J12040
$$ 93107 246255 355729 271914 240802 276371 118965 201971 185496 517671 327122 439162
14947D39162p2030J70458q9644j0226J12724k22983K24007A90884N9801n1749
$$ 439162 367132 537590 447946 437720 550444 327461 551468 190884 250685 198936
14937A98936l0595L12243Q0493j36074n1047N26123m8602Q3390J15104j24690
$$ 198936 168341 480584 561077 425003 373956 900079 851477 934867 1049971 925281
14927I25281L34002j57978n2467k29914J85773o2742L78677q562K47750j44301
$$ 925281 1259283 1101305 1048838 818924 1004697 941955 1320632 1312070 1559820 1415519
14917A415519K14008o0552l40510k73908O1929D80404J20651j96016L46926l58855
$$ 1415519 1629527 1568975 1228465 954557 1016486 480404 601055 405039 751965 393110
14907C93110h7967F04058j54329j64834J79072r6072A56279K17949N5883k06249
$$ 393110 -87967 604058 449729 284895 463967 367895 156279 374228 430111 223862
14897B23862l1616M963J63467J95587l6186A82637L66201J79800C27009J8941
$$ 223862 192246 197209 360676 556263 520077 182637 548838 728638 327009 345950
14887C45950N28878q8549j42944p1494K78180l27487m2264J28668L47618o2278
$$ 345950 874828 786279 643335 571841 850021 522534 480270 608938 956556 894278
14877H94278j28589C79031j71667J38423A49227L50918j5528j98222L45828J19263
$$ 894278 765689 379031 207364 345787 149227 500145 484617 286395 632223 751486
14867G51486j70479J62910Q7233l00564j87823H5484M54307L8206j06987j47453
$$ 751486 581007 743917 831150 530586 342763 85484 539791 577997 471010 323557
14857C23557K42555k63815J85920J64645k24847j22625J86921A76726N63699j01773
$$ 323557 566112 302297 488217 652862 428015 305390 492311 176726 740425 638652
14847F38652k17065J68570o3881Q3878j51280M67661k9313N606k82153J55530
$$ 638652 421587 590157 526276 610154 458874 926535 897222 902828 620675 776205
14837G76205J03810k09809C17823K39236B56916L38015A4403K50136k8400J32431
$$ 776205 880015 670206 317823 557059 256916 594931 14403 264539 236139 368570
14827C68570L79993n9630k19015p0254M15826j98602k0520k49121R8953J79158
$$ 368570 748563 688933 469918 399664 815490 616888 596368 347247 446200 625358
14817F25358K88199k97786o0060P9700J04466l08165K6388j58221N55719k81630
$$ 625358 913557 615771 555711 635411 739877 431712 458100 299879 855598 573968
14807E73968J92263j89569K82850p2713j19067j36734k52156P34223m93777k05397
$$ 573968 766231 576662 859512 786799 667732 530998 278842 1013065 519288 313891
14797C13891K27033k67970L20705o1525A64813K09489J2624L33958l9622k38347
$$ 313891 540924 272954 593659 532134 164813 374302 386926 720884 681262 442915
14787D42915R5533K12236j6228k42858m0123J25257K10727k62573L21226l4481
$$ 442915 538448 750684 734456 491598 451475 576732 787459 524886 846112 811631
14777H11631J01131j24303j26693C21496L30417L89926l93014o5313N8482J2450
$$ 811631 912762 788459 661766 321496 651913 1041839 648825 583512 641994 654444
14767F54444j87741j1138L89754k71262k8689L95006l08614k77766j4443K22742
$$ 654444 466703 455565 845319 574057 545368 940374 631760 353994 339551 562293
14757E62293n9021J26032p4756K04362p7422j66299M4552J78057l68714K23772
$$ 562293 503272 629304 554548 758910 681488 515189 559741 737798 369084 592856
14747E92856j27654L46137j42463j58574k8522K80166B94649M04407B93767L79772
$$ 592856 465202 811339 668876 510302 481780 761946 294649 699056 293767 673539
14737F73539l06794K01272k6110l5879L24360P396p9949K52585j32350O67798
$$ 673539 366745 568017 541907 506028 830388 837784 757835 1010420 878070 1545868
14727A545868n45765L2988J78818r421q1061k30218O0003m43333K48851j46225
$$ 1545868 1000103 1033091 1211909 1202488 1121427 891209 951212 507879 756730 610505
14717F10505K09373m1839P2738K4098K7212j9732l08424L05062L16509m50543
$$ 610505 819878 778039 850777 874875 902087 882355 573931 878993 1195502 744959
14707G44959q4118K85965K10335j45587J31269J47523j8662K40315j24986K8666
$$ 744959 660841 946806 1157141 1011554 1142823 1290346 1271684 1511999 1387013 1415679
14697A415679J65407p62841j02564K83400j51277K59312m75397l480J55806j55250
$$ 1415679 1581086 818245 715681 999081 847804 1107116 631719 628239 784045 628795
14687F28795L91026j05029Q926o9320j92866M00785j20965j30423L68074l63137
$$ 628795 1019821 914792 923718 854398 661532 1062317 941352 810929 1179003 815866
14677H15866k81360K95112K37296j73493K2199q5405k0318Q6767m5719j65046
$$ 815866 534506 829618 1066914 893421 915620 830215 809897 896664 850945 685899
14667F85899J57477L53470m04602K16852j01841j67788J29795K13746k95991L32633
$$ 685899 843376 1196846 792244 1009096 907255 739467 869262 1083008 787017 1119650
14657A119650j12392J17502k09112j64301M16855k75734M09259j39205K52855
$$ 1119650 1007258 1124760 915648 751347 1168202 892468 1301727 1162522 1415377
14648A415377n19849O0289m5349j93237K25000L59459r2969r7920j56238L780
$$ 1415377 895528 955817 910468 717231 942231 1301690 1208721 1110801 954563 958343
14638I58343K38870j19588K840j34440Q5228P504K78839N6119l10279L56549l22224
$$ 958343 1197213 1077625 1080465 946025 1031253 1038757 1317596 1373715 1063436 1419985 1097761
14627A097761L12543J242k10873j95140M61534r3593l37158l4841K97580j93209
$$ 1097761 1410304 1411546 1200673 1005533 1467067 1373474 1036316 1001475 1299055 1105846
14617A105846P7159K7874j37599q3959M42852K83617l62763j41657R5816p6069
$$ 1105846 1183005 1210879 1073280 989321 1432173 1715790 1353027 1211370 1307186 1231117
14607A231117K97008k5644j22771J87677o91189P22889m1454k17149M9248J95891
$$ 1231117 1528125 1502481 1379710 1567387 876198 1599087 1557633 1340484 1389732 1585623
14597A585623j65894K1163J11032l58764M91203j88452L01117k65689j63007K59797
$$ 1585623 1419729 1440892 1551924 1193160 1684363 1495911 1797028 1531339 1368332 1628129
14587A628129L2395K5592j65454K7531k31749M66023j98840N4846J05121K24986
$$ 1628129 1660524 1686116 1520662 1548193 1316444 1782467 1583627 1638473 1743594 1968580
14577A968580j73951Q4247k43939M62036j93055k14632K25953O4593M0552l49386
$$ 1968580 1794629 1878876 1634937 2096973 1903918 1689286 1915239 1979832 2020384 1670998
14567A670998M95947P5209l00496L81123m21369L36706J70888K037J49270k8043
$$ 1670998 2166945 2242154 1941658 2322781 1901412 2238118 2409006 2411043 2560313 2532270
14557B532270j9397o5179O86687J47972k55253Q73113M52753J068355K038715
$$ 2532270 2512873 2447694 3134381 3282353 3027100 3900213 4352966 5421321 7460036
14548G460036M734997R189874J8249529m001130A4808698F009658j970659L54330
$$ 7460036 12195033 21384907 39634436 35633306 14808698 6009658 4038999 4393329
14540D393329j00479j695180n50751l22667K72931k1261k21704K70632p615l24958
$$ 4393329 4292850 2597670 2046919 1724252 1997183 1975922 1754218 2024850 2017235 1692277
14530A692277K61747m1462Q6290J02341k02784K99474j91167L32821k35923r8955
$$ 1692277 1954024 1912562 1998852 2101193 1898409 2197883 2006716 2339537 2103614 2004659
14520B004659L62518k37092N54722p19464J51691K22877O2167N5269R8060l13717
$$ 2004659 2367177 2130085 2684807 1965343 2117034 2339911 2402078 2457347 2555407 2241690
14510B241690J93391l16773M32139M56j47764J53567J81754J63761j67431o6629
$$ 2241690 2435081 2118308 2550447 2550903 2403139 2556706 2738460 2902221 2734790 2668161
14500B668161K04378j30805J60654j36880p048K99289k02638l59203N54026k46996
$$ 2668161 2872539 2741734 2902388 2765508 2758460 3057749 2855111 2495908 3049934 2802938
14490B802938M48092m9818r4010j74657M52322k09562N3870j87748K90954K39506
$$ 2802938 3251030 3201212 3107202 2932545 3384867 3175305 3229175 3041427 3332381 3571887
14480C571887j68592M2455J55171k75695L39020l30613L27821n6287j03712L14333
$$ 3571887 3403295 3445750 3600921 3325226 3664246 3333633 3661454 3605167 3501455 3815788
14470C815788L8322j57932P10738o43921L76332k27626J44778K29724l17168p6718
$$ 3815788 3854110 3696178 4406916 3762995 4139327 3911701 4056479 4286203 3969035 3892317
14460C892317N88647j77936K66994L7191k09408M57228j89818k17577J65138p6312
$$ 3892317 4480964 4303028 4570022 4607213 4397805 4855033 4665215 4447638 4612776 4536464
14450D536464K65157m18575L76190K38751J41189K74345k2383k8576j74725N0409
$$ 4536464 4801621 4383046 4759236 4997987 5139176 5413521 5391138 5362562 5187837 5238246
14440E238246K46424J5780J70820K11263k39389L70565n52467L14823L00610j2591
$$ 5238246 5484670 5500450 5671270 5882533 5643144 6013709 5461242 5776065 6076675 6064084
14430F064084J84251k94595L60690J8265K91228j80913K59840J32737M26554k37857
$$ 6064084 6248335 5953740 6314430 6332695 6623923 6443010 6702850 6835587 7262141 7024284
14420G024284R1460N70991m37888M31373l16022K55380q3753K11495K20739k88945
$$ 7024284 7115744 7686735 7248847 7680220 7364198 7619578 7535825 7747320 7968059 7679114
14410G679114L21464L24795k04518K87018K59963j19896P0355J33077M07794j63333
$$ 7679114 8000578 8325373 8120855 8407873 8667836 8547940 8618295 8751372 9159166 8995833
14400H995833M56655j79540J03398J76666L60548K26455P1380J48517L25340j64907
$$ 8995833 9452488 9272948 9376346 9553012 9913560 10140015 10211395 10359912 10685252 10520345
14390A0520345M13646J70158J69688L66463J39002J28829N93890K4994J61669
$$ 10520345 10933991 11104149 11273837 11640300 11779302 11908131 12502021 12527015 12688684
14381A2688684M11609j53870J68882K74126L76079J67978L82897J6952M55613
$$ 12688684 13100293 12946423 13115305 13389431 13765510 13933488 14316385 14333337 14788950
14372A4788950J16119N15852O36160N4912O50859L52307J78353L45161J69286
$$ 14788950 14905069 15420921 16057081 16111993 16762852 17115159 17293512 17638673 17807959
14363A7807959L72546M42875L51404M23709O06112M59466M68671M92349r8558
$$ 17807959 18180505 18623380 18974784 19398493 20004605 20464071 20932742 21425091 21326533
14354B1326533J100148J32917O79568N57089M14957Q93446N26046J102267L70052
$$ 21326533 22426681 22559598 23239166 23796255 24211212 25104658 25630704 26732971 27103023
14345B7103023O00642R66252O81950R89703P14606O75965N86222J312048J010385
$$ 27103023 27703665 28669917 29351867 30341570 31056176 31732141 32318363 33630411 34640796
14336C4640796P48345J208207Q76909J384202J260328J367082J259148R66026
$$ 34640796 35389141 36597348 37474257 38858459 40118787 41485869 42745017 43711043
14328D3711043J629269J616907J345117J495232J958511J964207J898954J806012
$$ 43711043 45340312 46957219 48302336 49797568 51756079 53720286 55619240 57425252
14320E7425252K280521J933715K330431K332004K297561K890485K924012K791912
$$ 57425252 59705773 61639488 63969919 66301923 68599484 71489969 74413981 77205893
14312G7205893L312686L182022L874700L692779L814566M031871M891362M496882
$$ 77205893 80518579 83700601 87575301 91268080 95082646 99114517 104005879 108502761
14304A08502761N085018M983258O070301N845671O498523O519979P422799P903398
$$ 108502761 113587779 118571037 124641338 130487009 136985532 143505511 150928310 158831708
14296A58831708Q118105Q512846R173597R849888J0215170J0784269J1084610
$$ 158831708 166949813 175462659 184636256 194486144 204701314 215485583 226570193
14289B26570193J2205482J2392013J3061704J3270048J4272129J3966614J4091175
$$ 226570193 238775675 251167688 264229392 277499440 291771569 305738183 319829358
14282C19829358J4761456J4396657J4593772J3812729J3339678J2824935J1378616
$$ 319829358 334590814 348987471 363581243 377393972 390733650 403558585 414937201
14275D14937201J0172268Q554525M766702P13561M87991q26197k242807n32323
$$ 414937201 425109469 433663994 438430696 439144257 439632248 438806051 436563244 436030921
14267D36030921n237995q002217j1134561j2639827j3845700j4712910j5475518
$$ 436030921 430792926 422790709 411656148 399016321 385170621 370457711 354982193
14260C54982193j5496642j6047370j5356046j5163691j4691929j4279864j3670015
$$ 354982193 339485551 323438181 308082135 292918444 278226515 263946651 250276636
14253B50276636j3064694j2453055j0705455j0531636j0317793j0405669r448673
$$ 250276636 237211942 224758887 214053432 203521796 193204003 182798334 173349661
14246A73349661q492864q210312p387303p029240o976741o486743o039343n371053
$$ 173349661 164856797 156646485 149259182 142229942 135253201 128766458 122727115 117356062
14238A17356062n046857n174360m609604m507362m454222l752980l419018k986108
$$ 117356062 112309205 107134845 102525241 98017879 93563657 89810677 86391659 83405551
14230H3405551l453946l530433k826812k727229k734762k707254k448711k363764
$$ 83405551 79951605 76421172 73594360 70867131 68132369 65425115 62976404 60612640
14222F0612640j935469j948220j894550j907737j944765j533091j791114j351580
$$ 60612640 58677171 56728951 54834401 52926664 50981899 49448808 47657694 46306114
14214D6306114j618962p25712j732950j183027j781038l11640j248498p50637
$$ 46306114 44687152 43961440 42228490 41045463 39264425 38952785 37704287 36953650
14206C6953650j221269j334250r27204q13886p67056q60811p87215r06189p17781
$$ 36953650 35732381 34398131 33470927 32657041 31889985 31029174 30241959 29335770 28617989
14197B8617989q39119p19898n55879n20872l01235p83952q03959p38743p58390
$$ 28617989 27778870 27058972 26503093 25982221 25680986 24897034 24093075 23354332 22595942
14188B2595942k20087k62376n92120o61167k31481m26301r73406j93969j25579
$$ 22595942 22375855 22113479 21521359 20860192 20628711 20202410 19229004 19035035 18909456
14179A8909456n50290m15128m33888j34552m30896m91146j12314o4176r07718
$$ 18909456 18359166 17944038 17510150 17375598 16944702 16453556 16341242 16277066 15369348
14170A5369348o9956m5705j96370o53165q36k20672n35407J6472j43352n92516
$$ 15369348 15299392 15253687 15057317 14404152 14403316 14182644 13647237 13663709 13520357 12927841
14160A2927841K7757k14976k60445l57232n40432j48720N6356m2954j56518m19847
$$ 12927841 12955598 12740622 12480177 12122945 11582513 11433793 11490149 11447195 11290677 10870830
14150A0870830O3855l20361j06305j97673J60242p88331J83085o588n51534N3054
$$ 10870830 10934685 10614324 10508019 10310346 10470588 9682257 9865342 9858754 9307220 9360274
14140I360274q9932j38938j10742j02939l54064J13608l40474n1414N9108n08944
$$ 9360274 9270342 9131404 9020662 8917723 8563659 8677267 8336793 8285379 8344487 7835543
14130G835543j6559j27018J3046n1275k18122j38394l8693j95676r792L7650j43861
$$ 7835543 7818984 7691966 7705012 7653737 7435615 7297221 7258528 7062852 7053060 7090710 6946849
14119F946849J81074m04118Q8658l74855K62146o8462k63795j6830l33978j39181
$$ 6946849 7127923 6723805 6812463 6437608 6699754 6631292 6367497 6350667 6016689 5877508
14109E877508K15663j59859o1578j40105j93289J16119O906k18396q4596k9674
$$ 5877508 6093171 5933312 5871734 5731629 5538340 5654459 5661365 5442969 5358373 5328699
14099E328699K10388j4440l67950N0903k42757O4857L242l94130J08151m5479
$$ 5328699 5539087 5524647 5156697 5207600 4964843 5029700 5032942 4638812 4746963 4701484
14089D701484L4671J2318m41641L62798k76683Q7843j5204M6807k3556j45196
$$ 4701484 4736155 4748473 4306832 4669630 4392947 4480790 4465586 4512393 4488837 4343641
14079D343641n9669j78098N5944k28691J79381k75169l16507J93004K73584p1957
$$ 4343641 4283972 4105874 4161818 3933127 4112508 3837339 3520832 3713836 3987420 3915463
14069C915463l9380j04306k7467J25950o80q5852n7864K21482l49039K11618K03867
$$ 3915463 3876083 3771777 3744310 3870260 3869580 3783728 3725864 3947346 3598307 3809925 4013792
14058D013792k83892k56186j9073n9821N8246M3175q6492n01993K05965j21364
$$ 4013792 3729900 3473714 3454641 3394820 3453066 3496241 3409749 2907756 3113721 2992357
14048B992357J13351Q009L9520J5918P8970m80610J89204L1324k49302K53796
$$ 2992357 3105708 3113717 3153237 3169155 3248125 2767515 2956719 2988043 2738741 2992537
14038B992537n25971K09432R5266j05711K28807j48133l22645P08609m47628J46533
$$ 2992537 2466566 2675998 2771264 2665553 2894360 2746227 2423582 3132191 2684563 2831096
14028B831096k29128l3678j07081P9365P063q011o4993M1033Q9806l78360K88718
$$ 2831096 2601968 2568290 2461209 2540574 2547637 2539626 2474633 2515666 2605472 2227112 2515830
14017B515830m13021m5132J97326K77156l12976j26579K210J51337p3396k0448
$$ 2515830 2102809 2057677 2255003 2532159 2219183 2092604 2094814 2246151 2172755 2152307
14007B152307K23957k81936m1038J07091k75498J82988J90172j72395j44245j77018
$$ 2152307 2376264 2094328 2053290 2160381 1884883 2067871 2258043 2085648 1941403 1764385
13997A764385L22692m3524k51490K30768J77874J45078K86693O7614J591128K744258
$$ 1764385 2087077 2043553 1792063 2022831 2200705 2345783 2632476 2700090 4291218 7035476
13987G035476O680177J8388025P079364j6173899A0950299m464086j779043p18618
$$ 7035476 13715653 32103678 39183042 23009143 10950299 6486213 4707170 3988552
13979C988552n82577k56323o82362K6082j07684J25804Q0750q2302j85688k47658
$$ 3988552 3405975 3149652 2467290 2493372 2385688 2511492 2592242 2509940 2324252 2076594
13969B076594N8125N6989R8284L4513k09659Q3391k85533R0109o3538L1233O1338
$$ 2076594 2134719 2191708 2289992 2324505 2114846 2198237 1912704 2002813 1939275 1970508 2031846
13958B031846j60664l6824J88752l34793J88366L0575k03511j24840N63263l7211
$$ 2031846 1871182 1834358 2023110 1688317 1876683 1907258 1703747 1578907 2142170 2104959
13948B104959l75823J56543n59599L15794l36111J50518K12048q3602j43076J2879
$$ 2104959 1729136 1885679 1326080 1641874 1305763 1456281 1668329 1584727 1441651 1454530
13938A454530K12303R716k91923j6568R5308J42115j10308K2063j05552N1053
$$ 1454530 1666833 1676549 1384626 1368058 1463366 1605481 1495173 1517236 1411684 1462737
13928A462737p1495K66335o86325K58914K1691K62442k4779k22992J84813k42817
$$ 1462737 1391242 1657577 971252 1230166 1251857 1514299 1489520 1266528 1451341 1208524
13918A208524M20778m82038L17569l44311L85129o27989K43511K05111n1239K1176
$$ 1208524 1629302 1147264 1464833 1120522 1505651 877662 1121173 1326284 1275045 1296221
13908A296221J3718P9382J92904l37514j09120l2564j02651l3088M42057l73260
$$ 1296221 1309939 1389321 1582225 1244711 1135591 1103027 1000376 967288 1409345 1036085
13898A036085K08627p3646o361J83002k69220J27857k15477L92533M9126l56617
$$ 1036085 1244712 1171066 1164705 1347707 1078487 1206344 990867 1383400 1432526 1075909
13888A075909j28982K49425j24666R9181j93425K01569L07799m79760K03703l00461
$$ 1075909 946927 1196352 1071686 1170867 977442 1179011 1486810 1007050 1210753 910292
13878I10292K90894m10518K71538L28799k41025l82157K0932J28885J17487K22875
$$ 910292 1201186 790668 1062206 1391005 1149980 767823 788755 917640 1035127 1258002
13868A258002q3864j4872L436n18620K69109K7922J65159j2031j12683j77144
$$ 1258002 1174138 1159266 1162702 644082 913191 941113 1106272 1094241 981558 804414
13858H04414L58167j94025J6656q3844K19839k48916M6722j0597j72901p9568
$$ 804414 1162581 968556 985212 901368 1121207 872291 919013 908416 735515 655947
13848F55947K18136j03567L53803n48515L97380l26836O01437m17413j27918K28528
$$ 655947 874083 770516 1124319 575804 973184 646348 1247785 830372 702454 930982
13838I30982j36331J34073k8696D28740N45486k23401l7938K15741N8959j88358
$$ 930982 794651 928724 900028 428740 974226 750825 712887 928628 987587 799229
13828G99229J63839l45001o121L20986j99108O614k9170L8528J75472C80220L60924
$$ 799229 963068 618067 611946 932932 733824 740438 711268 749796 925268 380220 741144
13817G41144k34636K81009j75106Q7118k89362K96977K84988j45178O1480J16396
$$ 741144 506508 787517 612411 699529 410167 707144 992132 846954 908434 1024830
13807A024830j81975r7657J28175j0426K7190k17880K15486p2505O5911j6183
$$ 1024830 842855 745198 873373 862947 890137 672257 887743 815238 881149 864966
13797H64966k30196o8868J64792J11925l03885K26208k5427j53956R1182P1162
$$ 864966 634770 565902 730694 842619 538734 764942 739515 585559 676741 747903
13787G47903J65828j42573l09270N8676K82842l36326K42582J5252A33683M57020
$$ 747903 913731 771158 461888 520564 803406 467080 709662 724914 133683 590703
13777E90703L75192D20157L32036j03870j02884k902J59673l24129j25513L99328
$$ 590703 965895 420157 752193 648323 545439 542537 702210 378081 252568 651896
13767F51896B80729M96522K3663j71240j86057K65149J54034B41379N32047k29652
$$ 651896 280729 777251 800914 629674 443617 708766 862800 241379 773426 543774
13757E43774j16030J15827j37857L8817J1427L4049p1242P9106L94131m14371
$$ 543774 427744 543571 405714 444531 455958 490007 418765 497871 892002 477631
13747D77631L09391C29902M85954k18795B45042L16259j86248N5641j4782J59805
$$ 477631 787022 329902 815856 597061 245042 561301 375053 430694 415912 575717
13737E75717J15803B98879K75236O6191M8395K30554j74222q0231n5102B06593
$$ 575717 691520 298879 574115 640306 688701 919255 745033 664802 609700 206593
13726E11362l9603K59990j47102j33702q4995o4912J84766Q3459l6337P5802M039
$$ 511362 471759 731749 584647 450945 365950 301038 485804 569263 532926 608728 612767
13715F12767k55799K04295k01062J54582M1656L3016j03267K5529A54839M55273
$$ 612767 356968 561263 360201 514783 556439 589455 486188 511717 154839 610112
13705F10112Q7027k15132j87275O0169M00731k17898l1777j10745K42801n6408
$$ 610112 697139 482007 294732 354901 755632 537734 505957 395212 638013 581605
13695E81605k64594o2574K31852p4835P1084r7526n2644J78588A51541K61512
$$ 581605 317011 254437 486289 411454 482538 385012 332368 510956 151541 413053
13685D13053K07893C8668M79026J11613k12992j6164K31225o7603B05396J53776
$$ 413053 620946 38668 517694 629307 416315 400151 631376 563773 205396 359172
13675C59172m088L49299o044k83843J56038k41877j473J42573A87153K54325j79970
$$ 359172 355084 704383 698339 414496 570534 328657 327184 469757 187153 441478 261508
13664B61508K07680j61020L8450J93394j80888M4773J37186m0403p4336j22375
$$ 261508 469188 308168 346618 540012 359124 403897 541083 500680 426344 303969
13654C03969k9785K57645a05202C28627M4201C3280a557D00100L9064J8182I7876
$$ 303969 274184 531829 -105202 328627 372828 33280 -1557 400100 439164 457346 97876
13642D46436Q7218p2288j69791M68408A77157B582K35475K3036r9150K52368K12366
$$ 446436 533654 461366 291575 759983 177157 2582 238057 261093 161943 414311 626677
13631F26677j90847G0913L94925j69797m340R5302A54721J61612l9639D2975P48991
$$ 626677 435830 70913 465838 296041 291701 387003 154721 316333 276694 42975 791966
13620G91966B59093J4741O0695q6533L15292C0802K84916J70343A19095J97146
$$ 791966 259093 273834 334529 247996 563288 30802 315718 486061 119095 316241
13610C16241N2286H3121N5725L6370n65M0094j03395J02552L93164o2201B20583
$$ 316241 368527 83121 138846 175216 174651 214745 111350 213902 607066 544865 220583
13598B6623K81629K07836A96531q1943K89298j10996L81243B54980J39271J50751
$$ 26623 308252 516088 196531 114588 403886 292890 674133 254980 394251 545002
13588E45002N3469A67054j103J38519J78016o1205j06531A03973M08461k53156
$$ 545002 598471 167054 165951 304470 482486 421281 314750 103973 512434 259278
13578B59278J73641K26037j73457A82326D9352J22294K27422Q6906o0791j08184
$$ 259278 432919 658956 485499 182326 49352 171646 399068 485974 425183 316999
13568C16999O0052A77165J35543j37036B4008L57672A87528L08424B41112K88876
$$ 316999 377051 177165 312708 175672 24008 381680 187528 495952 241112 529988
13558E29988B27765b46924C54479p4313M6776Q2496A71558Q815J83362Q3027H5025
$$ 529988 227765 -246924 354479 280166 326942 409438 171558 180373 363735 446762 85025
13546B08679E1825N69371B78200A05019K22459L8038a3044B50525A05915J4900
$$ 208679 51825 621196 278200 105019 327478 365516 -13044 250525 105915 120815
13536A20815a5422E15337o7616B02125K05350j81024L8851A26263K00112B7017
$$ 120815 -15422 515337 447721 202125 407475 226451 265302 126263 326375 27017
13525C61802j62610D4688J9181K36835m0380J32008j42598m7528I5891J40164
$$ 361802 199192 44688 63869 300704 260324 392332 249734 202206 95891 236055
13515B36055F9990e0917E15767B26715P4555J0631A44914j924L4133D9126M88435
$$ 236055 69990 -50917 515767 226715 301270 311901 144914 142990 177123 49126 537561
13504E37561j72015j47149O18K75327k31559J98111j30969n8212M05719l24558
$$ 537561 365546 218397 219015 494342 262783 460894 329925 271713 677432 352874
13494C52874j07160C2469J88316J5590b2379D06851F8417a56549A45869K08462
$$ 352874 245714 32469 220785 236375 -22379 406851 68417 -156549 145869 354331
13484C54331P3058J1267p6709A24541J86437m2853n8499L9991j23111l805L0108
$$ 354331 427389 438656 361947 124541 310978 268125 209626 249617 126506 122701 152809
13473A52809P2669l9909I491J70816c3689B66486a77156A17446K27664F1771J26961
$$ 152809 225478 185569 9491 180307 -33689 266486 -177156 117446 345110 61771 188732
13462A88732J70719G1570J40916J96057J03081E1640g193B67914q1509b1587A62793
$$ 188732 359451 71570 212486 408543 511624 51640 -7193 267914 186405 -21587 162793
13450B52259h8005B94198o2821F731L74211R172Q6821i4366A77788H5405J41379
$$ 252259 -88005 294198 231377 6731 380942 390114 476935 -94366 177788 85405 226784
13439B26784P426J62530A14913M11242k60587J25090l8591c4939p7526C283J2217
$$ 226784 234210 396740 114913 526155 265568 390658 352067 -34939 -112465 3283 15500
13428A5500O0153Q0923j940J01791A7753J01189J05000k8418K1571n7280i65B76288
$$ 15500 75653 156576 154636 256427 17753 118942 223942 195524 217095 159815 -965 276288
13415C36931g7446A52291b20536G7192K28075r3644a9699A09714M44855A39665
$$ 336931 -77446 152291 -220536 77192 305267 211623 -19699 109714 554569 139665
13404B75149C4167J99576l8565J25165J9439A46063N783d5614A44330P0659O1431
$$ 275149 34167 233743 195178 320343 339782 146063 151846 -45614 144330 214989 276420
13393B76420I8387N8893K8235k4380g4617B47365f451A22026P505m8654P1640
$$ 276420 98387 157280 185515 161135 -74617 247365 -6451 122026 129531 80877 152517
13382A52517E2385L11150A79630C3426L71963n5272K1555A20797B1880O3250K06546
$$ 152517 52385 363535 179630 33426 405389 350117 371672 120797 21880 85130 291676
13371B91676n6293O0375J15869A473M34397H8206b0924B03008J03810K0617k0768
$$ 291676 235383 295758 411627 1473 435870 88206 -20924 203008 306818 327435 306667
13360C06667j42167a13721a6965C25388r9878Q8323C3401J06947i4580M0068A3806
$$ 306667 164500 -113721 -16965 325388 225510 313833 33401 140348 -94580 -54512 13806
13348b6678B78399A0257g4433B02749G9810K68K39375n4330G8520k5285J91248
$$ -26678 278399 10257 -74433 202749 79810 80078 319453 265123 78520 53235 244483
13337B44483I2927J03307p0382k4473K31595a3566q7271F9461K80742j62368a02264
$$ 244483 92927 196234 125852 101379 332974 -13566 -100837 69461 350203 187835 -102264
13325g464m5068j7194C66966A53312M739n7770K42826r9286I584K26655o3639
$$ -7464 -52532 -69726 366966 153312 158051 100281 343107 243821 9584 236239 172600
13314A72600E2726h3424B59935A03289J97886a66039B17455p9667N151j680e4092
$$ 172600 52726 -83424 259935 103289 301175 -166039 217455 137788 142939 141259 -54092
13302A91313N2464R3113H9046L1968d2587o1604n2288j9355B89737J12810A68252
$$ 191313 243777 336890 89046 121014 -42587 -104191 -156479 -175834 289737 402547 168252
13290B07448L8597n1202a74439A31596J79127J55837j30224c4526O616H3589J76658
$$ 207448 246045 194843 -174439 131596 310723 466560 336336 -34526 -27910 83589 260247
13279B60247g3435H3184c9805B45527c8413C99128R0376D4513K81988l522G9047
$$ 260247 -73435 83184 -39805 245527 -38413 399128 489504 44513 326501 322979 79047
13267B10304J17087F9313b6699B99088A08489e1971B92268c992H4687K2222f7398
$$ 210304 327391 69313 -26699 299088 108489 -51971 292268 -3992 84687 106909 -67398
13255A55483J36561F1752h088B52691J12833A19572L3118C4542Q5857b09122g7478
$$ 155483 292044 61752 -8088 252691 365524 119572 152690 34542 120399 -209122 -77478
13243e5491A51108l8004h5963A4791P6044a69252P2558A36207R483f1160I0845
$$ -55491 151108 113104 -85963 14791 90835 -169252 -96694 136207 145690 -61160 90845
13231a44370H0969C8998L3743L02131L066E6602K48520r3093C118J30498J41572
$$ -144370 80969 38998 72741 374872 377938 56602 305122 212029 3118 133616 275188
13220B75188b7282H968K55443o3705a01507I961i1128A78953L1423h672A69802
$$ 275188 -27282 8968 264411 200706 -101507 9961 -91128 178953 210376 -8672 169802
13208A55266B0084J27526J0727i9683G702b99153B05989C4726a33453D62459A2664
$$ 155266 20084 147610 158337 -99683 7702 -299153 205989 34726 -133453 462459 12664
13196a13972D5161K06178G811a9724j20617O2282A09320m6812O9375E5345h7339
$$ -113972 45161 251339 7811 -19724 -140341 -78059 109320 62508 131883 55345 -87339
13184b79084A52585n6976j8390a24796N6364c1582B75600h2500L5241A22846P209
$$ -279084 152585 95609 77219 -124796 -68432 -31582 275600 -82500 -47259 122846 130055
13173A30055b9396k05497f293A03378b1410k09312C13138a59940A61989e1130
$$ 130055 -29396 -234893 -6293 103378 -21410 -230722 313138 -159940 161989 -51130
13162A9907J37567B7804h8485G6208K19545d5765C41579H2037L7285C0731c1839
$$ 19907 157474 27804 -88485 76208 295753 -45765 341579 82037 119322 30731 -31839
13150A59090b34668A04742d8842C9485J9843J83760D5934K23232n2187d0270A78506
$$ 159090 -234668 104742 -48842 39485 59328 243088 45934 269166 216979 -40270 178506
13138A47673b9076A52940F6285g5157k11119D12628c16547A17292a37006C0821
$$ 147673 -29076 152940 66285 -75157 -286276 412628 -316547 117292 -137006 30821
13127G5280K6125J22823g0042b8329D28831f5887c2067D7379J79618j83j06680
$$ 75280 101405 224228 -70042 -28329 428831 -65887 -32067 47379 226997 226814 120134
13116A20134J66461A1294b3151r2440A76635A2619Q4280D583N641K4643d074A90202
$$ 120134 286595 11294 -23151 -115591 176635 12619 96899 4583 10224 34867 -4074 190202
13103b2977n9733E0752b1981k44131A30550L08519b51610A75369H1629j164L2824
$$ -22977 -82710 50752 -21981 -266112 130550 439069 -251610 175369 81629 80465 113289
13092A13289m8250P2300K898n2092Q6569Q7435I7839c079j18805A00468d3969
$$ 113289 65039 137339 140237 88145 174714 262149 97839 -3079 -121884 100468 -43969
13080a2089r5060A8247a19589E2822J87858E0731O553K90601f7955K2747C00772
$$ -12089 -107149 18247 -119589 52822 240680 50731 57284 347885 -67955 -45208 300772
13068B12885a93114B52089b9271A1393J66145J8625C6952L7777L14509F7101R4057
$$ 212885 -193114 252089 -29271 11393 177538 196163 36952 74729 389238 67101 161158
13057A61158a8855A39901b017C03536m8777a61244P7875C31284C7323J40077E7404
$$ 161158 -18855 139901 -2017 303536 254759 -161244 -83369 331284 37323 177400 57404
13045f2957A92260m4508d1548A76645a15530A43541C1298a235l550k4923C5760
$$ -62957 192260 147752 -41548 176645 -115530 143541 31298 -1235 -4785 -29708 35760
13033a24891l9035b1303B1132J84717a07165q1818e6835B1410J95171j01330m3286
$$ -124891 -163926 -21303 21132 205849 -107165 -188983 -56835 21410 216581 115251 71965
13022G1965K5644N3890J14523M33873A63362a22389A30232h3419N939B78805p3981
$$ 71965 97609 151499 266022 699895 163362 -122389 130232 -83419 -77480 278805 204824
13011B04824F1723k9667c7595C2154J92090a39768C07657a91566D9557J54099
$$ 204824 61723 32056 -37595 32154 224244 -139768 307657 -191566 49557 203656
13001B03656b2468A36421J43594j38541A1582b51563D383K5233J93416b70039
$$ 203656 -22468 136421 280015 141474 11582 -251563 4383 29616 223032 -270039
12990h3129B7505M15652b5634k16653E2743a93366B66103b6333j30974C6620h3025
$$ -83129 27505 443157 -25634 -242287 52743 -193366 266103 -26333 -157307 36620 -83025
12978A9805Q6897i9875A61320i0780J5230C23991b44389C21506A09689k0755a27802
$$ 19805 106702 -99875 161320 -90780 -75550 323991 -244389 321506 109689 88934 -127802
12966c7439C26437I3813a57990j8626e5545A06532A4177a72179A67961c70711
$$ -37439 326437 93813 -157990 -176616 -55545 106532 14177 -172179 167961 -370711
12955D7367c48414A74701P1315F0368c20585A00004O7506m5350a16828n5416B69645
$$ 47367 -348414 174701 246016 60368 -320585 100004 167510 122160 -116828 -172244 269645
12943C9786J11503b6442D2159d07145d588j46336f4904B177d4370A19403D3093
$$ 39786 151289 -26442 42159 -407145 -4588 -150924 -64904 2177 -44370 119403 43093
12931b15916B36345b66411J01104K0421A65994b1820A60296n3974B2900a58057
$$ -215916 236345 -266411 -165307 -144886 165994 -21820 160296 106322 22900 -158057
12920a32892G1709i289k16187G2963J11089n6199O5106A7665d32833A92820a73724
$$ -132892 71709 -9289 -225476 72963 184052 127853 192959 17665 -432833 192820 -173724
12908a45342B61831a28652d3188j40833J7398B27277J08505f4169A2576b1895
$$ -145342 261831 -128652 -43188 -184021 -166623 227277 335782 -64169 12576 -21895
12897A80134J08208c4129B5969a56534A43812B3822K19238o9199J53566j35848
$$ 180134 288342 -34129 25969 -156534 143812 23822 243060 173861 327427 191579
12887A91579P7506h5556B00525a19770A60984b20800F7824g2149j7332d037A98160
$$ 191579 269085 -85556 200525 -119770 160984 -220800 67824 -72149 -89481 -4037 198160
12875a31570A30211i4281r4104B2472J18670B4052e4593B54335D2682J46392D0048
$$ -131570 130211 -94281 -188385 22472 141142 24052 -54593 254335 42682 189074 40048
12863B1517i1898I6470o910a37400p4616A17733a33804l8517Q5775j54424h8488
$$ 21517 -91898 96470 89560 -137400 -212016 117733 -133804 -172321 -86546 -240970 -88488
12851d3405B2085J27815L62239a01221C36669j41094B0223R9813K95799F9149
$$ -43405 22085 149900 512139 -101221 336669 195575 20223 120036 415835 69149
12840A07712a01835m1693J5673j95440C1730b57811i7777A84104q1853q839a16937
$$ 107712 -101835 -143528 -127855 -323295 31730 -257811 -97777 184104 102251 93412 -116937
12828b391B26078a60192j25426J26133n4515M2527P205G0800O7767n0561D706
$$ -2391 226078 -160192 -285618 -159485 -214000 -171473 -164268 70800 138567 88006 4706
12816b52564F9454b22229C9473J20835c3725B1023M2123L32181A12011a62327
$$ -252564 69454 -222229 39473 160308 -33725 21023 63146 395327 112011 -162327
12805D6322a02653B75068A25921B0540J6473a71955e3738j83943B72462a54316
$$ 46322 -102653 275068 125921 20540 37013 -171955 -53738 -237681 272462 -154316
12794b7882k954A65812d4162k49891a5105j6977b244j32599B67009O7432D2997
$$ -27882 -30836 165812 -44162 -294053 -15105 -32082 -2244 -134843 267009 334441 42997
12782b21465A85505d0269k12967E6260k1378d1363B73843a80961K0687Q734I5926
$$ -221465 185505 -40269 -253236 56260 34882 -41363 273843 -180961 -160274 -151540 95926
12770A1696a15169A35702B9820a4503F0000g0314a8231C66344F8685d48470f7523
$$ 11696 -115169 135702 29820 -14503 60000 -70314 -18231 366344 68685 -448470 -67523
12758B3102R494l368a01694j49905A19252a72491A74957q720i9981n4744H029
$$ 23102 32596 29228 -101694 -251599 119252 -172491 174957 166237 -99981 -154725 8029
12746D4623a08542C7384f0581E2129a07157G4699o811h8340B87557C688J54003
$$ 44623 -108542 37384 -60581 52129 -107157 74699 67888 -88340 287557 3688 157691
12735A57691E7049a54061A33546a64804C00935a33670n1784O5695A44590b31527
$$ 157691 57049 -154061 133546 -164804 300935 -133670 -185454 -119759 144590 -231527
12724D60510f5609b559H680a44935D2b1110B28853c33340a60489m9996B79583
$$ 460510 -65609 -2559 8680 -144935 42 -21110 228853 -333340 -160489 -210485 279583
12712H5372L74082j54736A43513J6232D3856K35630H422K59973q0140g2286j8919
$$ 85372 459454 304718 143513 159745 43856 279486 8422 268395 188255 -72286 -91205
12701i1205A61203a51992F2742J71599G8525Q4409B8989K1863b27898C26050g014
$$ -91205 161203 -151992 62742 234341 78525 162934 28989 50852 -227898 326050 -7014
12689B23154b8067n2791A11503J53771f8768A84822B1094L06902A42091b91414
$$ 223154 -28067 -80858 111503 265274 -68768 184822 21094 327996 142091 -291414
12678a60014A60616i8858A16207b4185r0509B49628b5697o0883q98B77617f0569
$$ -160014 160616 -98858 116207 -24185 -114694 249628 -25697 -86580 -87478 277617 -60569
12666a71273b0809j43749d8770B8180R2078n6374a08820B35563l1033C54d8046
$$ -171273 -20809 -164558 -48770 28180 120258 63884 -108820 235563 204530 354 -48046
12654F2237J46559a23434H2982N3540c4988j1806C15035b8936C7777b4766I9949
$$ 62237 208796 -123434 82982 136522 -34988 -46794 315035 -28936 37777 -24766 99949
12642e4448B9395b3817A28418F0084K51589G2760h8539k14614a3788j28913F7696
$$ -54448 29395 -23817 128418 60084 311673 72760 -88539 -303153 -13788 -142701 67696
12630c6392A28506l6920h4335L0654B39349H1838L4250O1370c8224j4436B8791
$$ -36392 128506 91586 -84335 -53681 239349 81838 116088 177458 -38224 -52660 28791
12618i3985p0474A29447a43759B0480L6867a1651H3683L5517N642a2580H6257
$$ -93985 -164459 129447 -143759 20480 57347 -11651 83683 119200 124842 -12580 86257
12606A17015f4240K7399D8073i366m1591F5438K8805l9779j9509f4889j49672
$$ 117015 -64240 -36841 48073 -9366 -50957 65438 94243 54464 34955 -64889 -214561
12595b14561a0701n8818j7494j50850H2422A3115a6052A86252A524O0926k9618
$$ -214561 -10701 -69519 -87013 -237863 82422 13115 -16052 186252 1524 62450 32832
12584C2832K58895G0090b28644A10882C0265L61957A85203R049L7479I0890a54383
$$ 32832 291727 70090 -228644 110882 30265 392222 185203 194252 231731 90890 -154383
12572a13590M6028L0859j86543r7185A79567a46766B81983C6851J01485J6995
$$ -113590 -67562 -36703 -223246 -320431 179567 -146766 281983 36851 138336 155331
12562A55331L2041c7808l13534B38575c56690R6945J3720d6213C0736O9091a71850
$$ 155331 187372 -37808 -351342 238575 -356690 -259745 -246025 -46213 30736 99827 -171850
12550g160r6825C26888q9680b15548G5523b8829F7236P1508m5095i4832Q029j97627
$$ -7160 -103985 326888 237208 -215548 75523 -28829 67236 138744 93649 -94832 -86803 -284430
12538b84430J38837N2251J0161A70372a40068p7496N6389h896m1899j56565B69036
$$ -284430 -145593 -93342 -83181 170372 -140068 -217564 -161175 -8896 -50795 -207360 269036
12526B41a19409A96112q5673a00286B00375J6951C9586M1033a8329j31499j77279
$$ 241 -119409 196112 110439 -100286 200375 217326 39586 80619 -18329 -149828 -327107
12515c27107d9424o7083k60185a46416A96046d831j63912E8516h573B66315e5014
$$ -327107 -49424 -116507 -376692 -146416 196046 -4831 -168743 58516 -8573 266315 -55014
12503a0609A86454L0171I6387O7006p7567E134b1354q5858A2008b17822N7117
$$ -10609 186454 216625 96387 163393 85826 5134 -21354 -107212 12008 -217822 -160705
12492a60705P4782r1451B66547C8547J30274a26397a8000k9962A64245N414c56311
$$ -160705 -85923 -177374 266547 38547 168821 -126397 -18000 -47962 164245 169659 -356311
12480c04921c6060B46429q0615a4386C72682a76270k0265A89238j802d743e1A75490
$$ -304921 -36060 246429 165814 -14386 372682 -176270 -196535 189238 187436 -4743 -51 175490
12467c85638A25623n5050b59307A4334J78637e1279l7065E321a95081A67634j8497
$$ -385638 125623 70573 -259307 14334 192971 -51279 -88344 5321 -195081 167634 149137
12456A49137o9363B1589b20697n1604K1188o3242N0290A32531P5494a62122M3525
$$ 149137 79774 21589 -220697 -272301 -251113 -314355 -264065 132531 208025 -162122 -118597
12445a18597j5545B04249a41351D6474L09788A07743o604a744l20828f0990G0914
$$ -118597 -134142 204249 -141351 46474 356262 107743 101139 -1744 -322572 -60990 70914
12433A71032d2820r6564K4709A1936c15908c4043j02647A77467I886K60508H8920
$$ 171032 -42820 -139384 -114675 11936 -315908 -34043 -136690 177467 9886 270394 88920
12421a2219j26083A38828l1736a6128j52226L2848N687A22204b21912A15879a41452
$$ -12219 -138302 138828 107092 -16128 -168354 -135506 -129819 122204 -221912 115879 -141452
12409B8128J49671a0499k5998C98906B4468K83812a99221K1878E1648R3883n4188
$$ 28128 177799 -10499 -36497 398906 24468 308280 -199221 -177343 51648 145531 91343
12398I1343h5A90139f8258k90063G5828J05514F7772Q5885m8098M2072m9261J8465
$$ 91343 -85 190139 -68258 -358321 75828 181342 67772 153657 105559 147631 98370 116835
12386A16835a14727P539C24696a14097N0413l06880a12445F4517l086J09008i4065
$$ 116835 -114727 -107188 324696 -114097 -63684 -370564 -112445 64517 61431 170439 -94065
12374A10504c7419a0004j41215o401I2821L28942B2114d235H8885b54045I3603
$$ 110504 -37419 -10004 -151219 -157620 92821 421763 22114 -4235 88885 -254045 93603
12362b40385A41500n198J382E6121K35455A11692D5167I383L13561h8048A60834
$$ -240385 141500 136302 137684 56121 291576 111692 45167 9383 322944 -88048 160834
12350g363j25892P825k4180b6657l03256e8813j55416l7741P1444B13265d37653
$$ -7363 -133255 -125430 -149610 -26657 -329913 -58813 -214229 -251970 -180526 213265 -437653
12338i2849E8422b42226A50531b4194O427n0336A13454K87142I8183E739J18557
$$ -92849 58422 -242226 150531 -24194 -17767 -68103 113454 400596 98183 5739 124296
12327A24296E31P0274M2807R6676D5325L3522d723B00810l6423R4061j06959J14855
$$ 124296 531 70805 113612 210288 45325 78847 -4723 200810 164387 258448 151489 266344
12315B66344b76039A25234K11446A50487a00416A53501O1272J91562i2323D69637
$$ 266344 -276039 125234 336680 150487 -100416 153501 214773 406335 -92323 469637
12304a73883r5601C07940a78G3446L12601g4782L5425q1508M6713j32785H5869
$$ -173883 -269484 307940 -178 73446 386047 -74782 -39357 -120865 -74152 -206937 85869
12292a51104F2279i6425E6576a96603F33e4763B70451p4910d9028B01651r9958
$$ -151104 62279 -96425 56576 -196603 633 -54763 270451 195541 -49028 201651 101693
12281A01693c794A39879E9782e4637A70854L1740c9531C70790e1589l3523C30428
$$ 101693 -3794 139879 59782 -54637 170854 202594 -39531 370790 -51589 -85112 330428
12269B13325d882k969A69652K00192B2368d4995A56765e8741l6482A17919j3073
$$ 213325 -4882 -7851 169652 369844 22368 -44995 156765 -58741 -95223 117919 104846
12258A04846j9455R7712J11215i5149D08890j60523q8653F2879J56364h3046M483
$$ 104846 85391 183103 294318 -95149 408890 248367 159714 62879 219243 -83046 -78563
12247g8563B10814K48539r5343A0622K96969A43924b17617J6265G7410K31490
$$ -78563 210814 459353 364010 10622 307591 143924 -217617 -201352 77410 308900
12237C08900L5023b8049H999J04277J44245j13882I664b5943n6503k27884i1878
$$ 308900 343923 -28049 8999 113276 257521 143639 9664 -25943 -82446 -310330 -91878
12225A2732O9305a76446I0967J23707b0222A30350K54244B400L41453G2395L04027
$$ 12732 82037 -176446 90967 214674 -20222 130350 384594 2400 343853 72395 376422
12214C76422a87900A58992o0287A0688K42352d3125E4379J95258I1911a37244
$$ 376422 -187900 158992 98705 10688 253040 -43125 54379 249637 91911 -137244
12203a15429B91922a27661C76274A65965a49512B50448E6787b32624D46197j15388
$$ -115429 291922 -127661 376274 165965 -149512 250448 56787 -232624 446197 330809
12193C30809h2554A1954e2773B45316m7970K89778B07301C3748a90023P7031D3945
$$ 330809 -82554 11954 -52773 245316 197346 487124 207301 33748 -190023 -112992 43945
12181c382F7221O44K10291e9009A70833A0921J1221b48308B932L3501d992j27085
$$ -3382 67221 67865 278156 -59009 170833 10921 22142 -248308 2932 36433 -4992 -132077
12169a32077C74491F9649R9074K07714F2193J81763j6366K2223A20675A8481g7313
$$ -132077 374491 69649 168723 376437 62193 243956 227590 249813 120675 18481 -77313
12157A73978a94238P0538f463A53915e7205p8256l1255M2538o2470F46335a23758
$$ 173978 -194238 -123700 -6463 153915 -57205 -135461 -166716 -124178 -186648 646335 -123758
12145A69811A4176K63994F1432j6186Q5073M1757i6145D6972K1940K82338j15028
$$ 169811 14176 278170 61432 45246 130319 172076 -96145 46972 68912 351250 236222
12134B36222A02610D8039b0956B08530a11654C430a12842c6191J6058j29303B82184
$$ 236222 102610 48039 -20956 208530 -111654 3430 -112842 -36191 -20133 -149436 282184
12122B4928P7003J94106A44763m7116a4273A28260J89519j30373i631B37364d1937
$$ 24928 101931 296037 144763 97647 -14273 128260 317779 187406 -9631 237364 -41937
12110d4127B39794M9114f0458B94199F9611Q0842D6265K66688D2569a15994I9896
$$ -44127 239794 288908 -60458 294199 69611 150453 46265 312953 42569 -115994 99896
12098a07828n7400C49876A32796L25807A27694b1273j26873j41587A70753o4174
$$ -107828 -165228 349876 132796 458603 127694 -21273 -148146 -289733 170753 106579
12088A06579d2687b257j5659A59718K56658b48276C85411A59630a8358A54521
$$ 106579 -42687 -2257 -17916 159718 416376 -248276 385411 159630 -18358 154521
12077B99954E6888b5760A41803K885O6111k6856b19181e6152B59727J39256i1708
$$ 299954 56888 -25760 141803 144688 210799 183943 -219181 -56152 259727 398983 -91708
12065B42427f8980j01375A60092h0585B56119I4870A4188a6663A29962B4549e3484
$$ 242427 -68980 -170355 160092 -80585 256119 94870 14188 -16663 129962 24549 -53484
12053B07022J34592a30661B01862C8001b99018B90950C9050L26590j29692A7051
$$ 207022 341614 -130661 201862 38001 -299018 290950 39050 365640 235948 17051
12042b39266A66741C1258a13949j43302B86087E8561B5917f3756n0583k2379c5163
$$ -239266 166741 31258 -113949 -257251 286087 58561 25917 -63756 -114339 -136718 -35163
12030b49051i9607d4396k32083e4595B41712l0815B3387P8487J16913I7608C6061
$$ -249051 -99607 -44396 -276479 -54595 241712 210897 23387 101874 218787 97608 36061
12018a11942B01326q7881K3597J95953a27154B36263H2802f3292k86756Q7397
$$ -111942 201326 113445 137042 332995 -127154 236263 82802 -63292 -350048 -262651
12008b62651a04203G6141d1458D9589J03905B4677J45925a01914A03541a54939
$$ -262651 -104203 76141 -41458 49589 153494 24677 170602 -101914 103541 -154939
11997A73325e0825B2766J7056J75063a08949b8371A9150f7385p9044D0105e2562
$$ 173325 -50825 22766 39822 214885 -108949 -28371 19150 -67385 -146429 40105 -52562
11985A17247a017j4337k55687P7132R1885l7409B11405b14390A91846b84486I8006
$$ 117247 -1017 -15354 -271041 -193909 -102024 -139433 211405 -214390 191846 -284486 98006
11973f1546j03217D5021J25201e0139j74773B629K71649r6112H8017a95330O7427
$$ -61546 -164763 45021 170222 -50139 -224912 2629 274278 178166 88017 -195330 -127903
11962a27903A10686a70027A73473a13449G4709a90884e3197l21160d4358A6704
$$ -127903 110686 -170027 173473 -113449 74709 -190884 -53197 -374357 -44358 16704
11951A69434n9478a00917A02001e6352l1533B56864i1177A8430P2217J33973R3727
$$ 169434 109956 -100917 102001 -56352 -87885 256864 -91177 18430 90647 224620 318347
11940C18347E2405e2308j62329A94456c37353c4086I6056c3902B6509a47850B37127
$$ 318347 52405 -52308 -214637 194456 -337353 -34086 96056 -33902 26509 -147850 237127
11928b32213C0643c54508A13439f1087b5476B722b39091d7036j57028p2711D310
$$ -232213 30643 -354508 113439 -61087 -25476 2722 -239091 -47036 -204064 -276775 4310
11916F9454g1032B87896A4741M5409A7661a81436A50132B0707L4913B7707p68
$$ 69454 -71032 287896 14741 60150 17661 -181436 150132 20707 55620 27707 26939
11905B6939K1921h7210k45761g684C82508b13635R2757k32436J59039e2838P66
$$ 26939 48860 -87210 -332971 -7684 382508 -213635 -120878 -353314 -194275 -52838 -52072
11894e2072p4950A52366a09893d3063l06024F6175m617A8706i4715q6999h8230
$$ -52072 -127022 152366 -109893 -43063 -349087 66175 61558 18706 -94715 -181714 -88230
11882a63690A01832J04098I7476a42600l3018K3289L3621N7067q2343o886A76172
$$ -163690 101832 205930 97476 -142600 -175618 -152329 -118708 -61641 -143984 -150870 176172
11870d8503A6269J74485a11712b1017A14180c5264p0792c7416j30841g5307j1647
$$ -48503 16269 190754 -111712 -21017 114180 -35264 -106056 -37416 -168257 -75307 -86954
11859h6954b6755l60917a30012A91940a53428K0243A76703k3714a3986k48718
$$ -86954 -26755 -387672 -130012 191940 -153428 -133185 176703 152989 -13986 -262704
11849b62704A24389a53360r0761b0191k29747B95462c7783F4416R1923a35851
$$ -262704 124389 -153360 -244121 -20191 -249938 295462 -37783 64416 156339 -135851
11838A11685c5036O074j94565E3448L4719d16155b00590J5596c6877A6577J98972
$$ 111685 -35036 -28962 -223527 53448 88167 -416155 -200590 -184994 -36877 16577 215549
11827B15549a7433H6341g8488j3979C78439h0395r4889k92135B66689a48928M396
$$ 215549 -17433 86341 -78488 -92467 378439 -80395 -175284 -467419 266689 -148928 -144532
11816a44532j6562a0721j50470g6059B5840b72917D46437A50408f6247j31895
$$ -144532 -161094 -10721 -161191 -76059 25840 -272917 446437 150408 -66247 -198142
11806a98142m0164A27953M1262b36908I562g0799a463o3026p8819O4756I7678
$$ -198142 -238306 127953 169215 -236908 9562 -70799 -1463 -64489 -143308 -78552 97678
11794b1786F2678b30491j5065F5274a99531B09450a41610k1021A30511c9450f758
$$ -21786 62678 -230491 -245556 65274 -199531 209450 -141610 -162631 130511 -39450 -6758
11782I4784R4608G8338M4258m6562P7928e1938j49446J027B86555g6002o2862
$$ 94784 189392 78338 122596 76034 153962 -51938 -201384 -200357 286555 -76002 -138864
11771a38864A0807a92453J3521e910j48375E4363a83336K8579A0356L42573b4071
$$ -138864 10807 -192453 -178932 -5910 -154285 54363 -183336 -154757 10356 352929 -24071
11759A2163M347b44241M4531Q4027K4726F8268K18228H4723a87361o1237e3786
$$ 12163 16510 -244241 -199710 -115683 -90957 68268 286496 84723 -187361 -248598 -53786
11747c33603c8806B52423a50991c3660A61476i9698j80274G0744c9348A48893
$$ -333603 -38806 252423 -150991 -33660 161476 -99698 -279972 70744 -39348 148893
11736h4457A49533C6302A1350O7804J80161N3785I8118J71730A2792c25747b1043
$$ -84457 149533 36302 11350 79154 259315 313100 98118 269848 12792 -325747 -21043
11724a65822E0672J01160c1038B1517J42776P8451k6760A02616K3930N9528P641
$$ -165822 50672 151832 -31038 21517 164293 242744 215984 102616 126546 186074 193715
11713A93715J01638E0907K89978j40945A8750a5677l6177n1182f678j90763L8694
$$ 193715 295353 50907 340885 199940 18750 -15677 -51854 -103036 -6678 -197441 -158747
11702a58747k7155K1819c5930l8565r2681B9713O1755a35017A59613a65963A4400
$$ -158747 -185902 -164083 -35930 -74495 -167176 29713 91468 -135017 159613 -165963 14400
11690C6465L9051a0289m7359p6592c30E0099f4670I8443i663m8419D0631b6321
$$ 36465 75516 -10289 -57648 -134240 -330 50099 -64670 98443 -9663 -58082 40631 -26321
11677a34695k3627o0191K5031N7894A43691b6860q450I7792J0009l1132g7556
$$ -134695 -158322 -218513 -193482 -135588 143691 -26860 -35310 97792 107801 76669 -77556
11665f4739p0269p6951G4901a22890L5545J9010b1522m5938j7568a6491L850r4574
$$ -64739 -135008 -211959 74901 -122890 -87345 -68335 -21522 -67460 -85028 -16491 -12641 -107215
11653a07215A08786L4587o9717j6859a05406r3271I0304a04631j48370a6713n15033
$$ -107215 108786 143373 73656 56797 -105406 -198677 90304 -104631 -253001 -16713 -531746
11642e31746C7779a25219B54184i7180n2223G00K44961g0531p1409k29253a78771
$$ -531746 37779 -125219 254184 -97180 -149403 700 245661 -70531 -141940 -371193 -178771
11630F3326i4538c949F4048f1716A00805m3726K68465c2655A88957A1791K21677
$$ 63326 -94538 -3949 64048 -61716 100805 57079 325544 -32655 188957 11791 233468
11619B33468b89958d7311k01824C4301f4294l002A82656f3451p9094l1154o1992
$$ 233468 -289958 -47311 -249135 34301 -64294 -67296 182656 -63451 -142545 -173699 -235691
11608b35691b4914A91292L6497f9365b1801E3364a51190A46533A0195c4579A35467
$$ -235691 -24914 191292 227789 -69365 -21801 53364 -151190 146533 10195 -34579 135467
11596B42564J52442a54472F6621k0560J39266a31186i010l00078A7867a530j45089
$$ 242564 395006 -154472 66621 46061 185327 -131186 -9010 -309088 17867 -1530 -146619
11585a46619A7249J07215n9589R7347p1742C3535R2103i8240B46611F1917k0999
$$ -146619 17249 124464 64875 162222 90480 33535 125638 -98240 246611 61917 40918
11574D0918b11528D14876G2417N0516f4131D2555N5494k7606P025h0700J6786
$$ 40918 -211528 414876 72417 122933 -64131 42555 98049 70443 77468 -80700 -63914
11563f3914o8254C9432m265g5081A31669o263n3261h181B62192b4471j85478E4292
$$ -63914 -132168 39432 35167 -75081 131669 125406 72145 -8181 262192 -24471 -209949 54292
11550I90b83555B58689D5798J97120d2122m7640a1209j37048d8985B24639l7426
$$ 990 -283555 258689 45798 242918 -42122 -89762 -11209 -148257 -48985 224639 187213
11539A87213q5107b8831A57707h7370j18148a2687B99754e071k09451A88944a17739
$$ 187213 102106 -28831 157707 -87370 -205518 -12687 299754 -5071 -214522 188944 -117739
11527F7661J10406a7479j61786a2510B1410J10872A6879a79226K9976j00271D4988
$$ 67661 178067 -17479 -179265 -12510 21410 132282 16879 -179226 -149250 -249521 44988
11515b44158E3052Q453d80C06380a77691C06059b20987A64976H525J79107R8942
$$ -244158 53052 61505 -480 306380 -177691 306059 -220987 164976 8525 187632 286574
11504B86574Q0547a4883B42389L3004m1674f7377G7489J13291b31866L1712C97611
$$ 286574 367121 -14883 242389 275393 233719 -67377 77489 190780 -231866 -200154 397611
11492C00110b3733B46744N7226H4924b1655A31450b63728C5388e2096A076K2081
$$ 300110 -23733 246744 303970 84924 -21655 131450 -263728 35388 -52096 1076 23157
11481B3157L9853e0263F8169J7809K16370K7882g174j20541k05300A88598O0421
$$ 23157 63010 -50263 68169 85978 302348 330230 -7174 -127715 -333015 188598 249019
11470B49019c29982B18647m7232B9268K04619G5836O1182a2123A27438L3946o7574
$$ 249019 -329982 218647 171415 29268 233887 75836 137018 -12123 127438 161384 93810
11459I3810l9501J38619J37707j41504K5736o7143J08178E999K73589A28954f6257
$$ 93810 54309 192928 330635 189131 214867 147724 255902 5999 279588 128954 -66257
11447A53225C4725a2371l6190A09764L9904K63396i4295a4663B793N575b01877
$$ 153225 34725 -12371 -48561 109764 149668 413064 -94295 -14663 2793 8368 -201877
11435B43277Q4115A59078J53509j9719c4064f01A78265b4088j30658F7868b5021
$$ 243277 327392 159078 312587 292868 -34064 -601 178265 -24088 -154746 67868 -25021
11423A61332o9764b45369G586J46883c4376j6827l14931a5107J653c524j53488
$$ 161332 91568 -245369 7586 154469 -34376 -51203 -366134 -15107 -13454 -3524 -157012
11412a57012F6681k824g3866a9489j91802g6249A22090A731a12097B96c77861
$$ -157012 66681 63857 -73866 -19489 -211291 -76249 122090 1731 -112097 296 -377861
11400C4450L9774J47142b08306g6700A79189a78048J3269K3844L1526a7597m5396
$$ 34450 74224 221366 -208306 -76700 179189 -178048 -164779 -140935 -109409 -17597 -62993
11389f2993A39357A2239l862e7949j0133M087j87237C05806b75997h9689j5343
$$ -62993 139357 12239 8377 -57949 -68082 -63995 -251232 305806 -275997 -89689 -105032
11378a05032q7848g1355m1702C91M74646i0611B7835K44339a16189A14939a31341
$$ -105032 -192880 -71355 -113057 391 475037 -90611 27835 272174 -116189 114939 -131341
11366A2573f3684l8056p660q7699D2c66421h6534B4260c8884B01557m9734F178
$$ 12573 -63684 -101740 -109400 -197099 42 -366421 -86534 24260 -38884 201557 151823 6178
11353a87418l7823a6226r5088b5877M671A73527J72816j54211K7694c7961C5572
$$ -187418 -225241 -16226 -111314 -25877 -21206 173527 346343 192132 219826 -37961 35572
11341B09549P3772B8487L60008i0033B0288P283d23526A37126e3775B4413a12706
$$ 209549 283321 28487 388495 -90033 20288 27571 -423526 137126 -53775 24413 -112706
11329c27131C0533a39832j34380k53886d8675k3116h383j32269K3408J2659A37440
$$ -327131 30533 -139832 -274212 -528098 -48675 -71791 -8383 -140652 -117244 -104585 137440
11317c02924A32994a64537C1210b01056i2046a5192r0531P144D3167c4746A3089
$$ -302924 132994 -164537 31210 -201056 -92046 -15192 -105723 -98579 43167 -34746 13089
11305d64572J30136I7298C0352K5286J41240c50692a00141C27335a60180j31663
$$ -464572 -334436 97298 30352 55638 196878 -350692 -100141 327335 -160180 -291843
11295b91843Q6355a3717q7487r1203E7334k1511a40948N4364n4890B07059a9119
$$ -291843 -205488 -13717 -101204 -192407 57334 35823 -140948 -86584 -141474 207059 -19119
11283C38847a78580o0663c0652A63137J6872C8897F106a63468a3382k1798m0867
$$ 338847 -178580 -239243 -30652 163137 180009 38897 6106 -163468 -13382 -35180 -76047
11272g6047A69475e3981q6499M2814a1526j57869D7827L13901h4467r034A81113
$$ -76047 169475 -53981 -140480 -97666 -11526 -169395 47827 361728 -84467 -93501 181113
11260A54624A3619K2539J93701c4167k9043k47229E1855c12646i1050d0097G3858
$$ 154624 13619 36158 229859 -34167 -63210 -310439 51855 -312646 -91050 -40097 73858
11248A40260d1375l3285G7419k4699A5745g8931B3622b32941H4231C2685a80991
$$ 140260 -41375 -74660 77419 52720 15745 -78931 23622 -232941 84231 32685 -180991
11236A57017e8052I0286J56040b12233I5125a06375b8989l98681d7891j8186j21910
$$ 157017 -58052 90286 246326 -212233 95125 -106375 -28989 -427670 -47891 -66077 -187987
11225a87987C0811c43005J51531b5861G8567c59882b0860D5331A1485J03233n1058
$$ -187987 30811 -343005 -191474 -25861 78567 -359882 -20860 45331 11485 114718 63660
11214F3660c67772f0341B4455f4963G3913b07352B39901A01582a87434n7119I7411
$$ 63660 -367772 -60341 24455 -64963 73913 -207352 239901 101582 -187434 -244553 97411
11202A34727h7638E6967a69478k7790A27984k3839a85522J3045j5132A98566D3035
$$ 134727 -87638 56967 -169478 -197268 127984 104145 -185522 -172477 -187609 198566 43035
11190D1179J2478M0441a84198c8856A05172a91509h6075n4582C9603A3705O916
$$ 41179 53657 94098 -184198 -38856 105172 -191509 -86075 -140657 39603 13705 20621
11179B0621K11420B1111b03230o1221J27360f68j97801G7062a55187I6915f1203
$$ 20621 232041 21111 -203230 -264451 -137091 -668 -198469 77062 -155187 96915 -61203
11167c3561N349j91170e0224B32925C1970a89010c5516a6784A23557e2917A272
$$ -33561 -28212 -219382 -50224 232925 31970 -189010 -35516 -16784 123557 -52917 1272
11155A28190j4905a81466j1301B86399f6347K3446E2669a50482B54817b9086B69764
$$ 128190 113285 -181466 -192767 286399 -66347 -42901 52669 -150482 254817 -29086 269764
11143A44521b34092g7072j00544N3746H4126i9039A00359J2869c3513M650p1450
$$ 144521 -234092 -77072 -177616 -123870 84126 -99039 100359 113228 -33513 -28863 -100313
11132a00313k89106a21795e2836C52753d0587r088A29897E3378c68610a38714
$$ -100313 -389419 -121795 -52836 352753 -40587 -49675 129897 53378 -368610 -138714
11121D8577P3280b02459i9852A7491b2554A07347b14445A60907g9095A87125p6413
$$ 48577 121857 -202459 -99852 17491 -22554 107347 -214445 160907 -79095 187125 110712
11110A10712J69946a38492N7805A89398J96161n8816A05587B9836b96787g0275
$$ 110712 280658 -138492 -80687 189398 385559 326743 105587 29836 -296787 -70275
11099I7811a97884I5772f6368B46942G2138c2808A98323G6895M18119j94271h2870
$$ 97811 -197884 95772 -66368 246942 72138 -32808 198323 76895 495014 300743 -82870
11087I232c80275B2025J47725g640B75051n3789j5790a46998C5844K07192A2700
$$ 9232 -380275 22025 169750 -7640 275051 221262 205472 -146998 35844 243036 12700
11075C89559a8134A38892g303B25283m28J31386B2043h9672C99949q3554K78567
$$ 389559 -18134 138892 -7303 225283 224855 356241 22043 -89672 399949 316395 594962
11064E94962j92750j92137J2266K25298B5826L20951o4554L60815k16049n1268
$$ 594962 402212 210075 222341 447639 25826 346777 282223 643038 426989 375721
11054C75721K3033l6501A24435L91084A68668L70149k05183K45667p9355j11539
$$ 375721 398754 362253 124435 515519 168668 538817 333634 579301 499946 388407
11044C88407K31633K29730j03858j07225B11118K01898K31613J44519k25111q4578
$$ 388407 620040 849770 745912 638687 211118 413016 644629 789148 564037 479459
11034D79459j84004q6809M39763k63372K24565o1335J19815J8874k65994K22226
$$ 479459 295455 208646 648409 385037 609602 548267 668082 686956 420962 643188
11024F43188j96955L01958k42768L797j60783m3761K52825B26714l3015J0395
$$ 643188 446233 748191 505423 509220 348437 304676 557501 226714 193699 204094
11014B04094L09848j36762K36118j58552j21548K86802B89976P9790J88107j11535
$$ 204094 513942 377180 613298 454746 333198 620000 289976 369766 557873 446338
11004D46338J69588j1655A55288M43104j98081k2717J42638k16818J19573J93292
$$ 446338 615926 604271 155288 598392 400311 377594 520232 303414 422987 616279
10994F16279A99703K33564J64339L6351k75811N8437J05882j68288L86054j57393
$$ 616279 199703 433267 597606 633957 358146 416583 522465 354177 740231 582838
10984E82838B58187N1873L77187k83575K81827P1977j40931L52931Q9525l00692
$$ 582838 258187 310060 687247 403672 685499 757476 616545 969476 1059001 758309
10974G58309J45545J05667M71967k05427J41208M24750J87986O6207l5769J88938
$$ 758309 903854 1009521 1481488 1276061 1417269 1842019 2030005 2096212 2060443 2249381
10964B249381o8321R2627o68695l04423R8488Q9023l04596J52856l52140L47609
$$ 2249381 2181060 2273687 1604992 1300569 1399057 1488080 1183484 1336340 984200 1331809
10954A331809p1490l15666J23508K58134p2803P1954N5693m34338N3802l20762
$$ 1331809 1260319 944653 1068161 1326295 1253492 1325446 1381139 946801 1000603 679841
10944F79841P0745k56073j82398D4327L11946j55403q8251J64054e1157A51009
$$ 679841 750586 494513 312115 44327 356273 200870 112619 276673 -51157 151009
10933b65069B16432J9680n4989G4410J44713i1348A74322D0239L88230a60063
$$ -265069 216432 236112 181123 74410 219123 -91348 174322 40239 428469 -160063
10922f011A7704J88991g4848k8880J8879D8365c07011B2601O7520c03986g7734
$$ -6011 17704 206695 -74848 -103728 -84849 48365 -307011 22601 90121 -303986 -77734
10910D1138K21219a70289b3763k5943B84201F0374A4760i3057c2622A29548P6510
$$ 41138 262357 -170289 -23763 -49706 284201 60374 14760 -93057 -32622 129548 206058
10899B06058a71181B3684a76935j87242A99171f5468C15052j6287G0926K74819
$$ 206058 -171181 23684 -176935 -364177 199171 -65468 315052 298765 70926 345745
10889C45745a62901A76257p5356a67335j86228B96590a31248j10865A47433k2850
$$ 345745 -162901 176257 100901 -167335 -353563 296590 -131248 -242113 147433 124583
10879A24583c7522A82011c80164A19890a05386i305j75574F9103i676j59421C7926
$$ 124583 -37522 182011 -380164 119890 -105386 -9305 -184879 69103 -9676 -169097 37926
10867b60734a7481C3427f2775A22179p060a52461C8672o535a86058J2657l33092
$$ -260734 -17481 33427 -62775 122179 115119 -152461 38672 32137 -186058 -173401 -506493
10856e06493E6594J34861a15354A6804a54285j02180J24829A49272Q0108f1818
$$ -506493 56594 191455 -115354 16804 -154285 -256465 -131636 149272 229380 -61818
10845E0220a30860k3429o6776d7377q4965G237a75004A03115a75548p201F9359
$$ 50220 -130860 -154289 -221065 -47377 -132342 7237 -175004 103115 -175548 -182749 69359
10833b38262c490j31693A21499b23227R1283A1480K98463a75140B99242b18776
$$ -238262 -3490 -135183 121499 -223227 -131944 11480 309943 -175140 299242 -218776
10822a33295C1976O5893a96348A84K6921e9346K6557o6959K8088B63210a35573
$$ -133295 31976 97869 -196348 184 27105 -59346 -32789 -99748 -71660 263210 -135573
10810E1491J67942c51470f8043l8793F8486g8469o815A03063a25305K6175p1236
$$ 51491 219433 -351470 -68043 -106836 68486 -78469 -85284 103063 -125305 -99130 -170366
10799a70366B88724N0211a20006B99231d9718k36121E6757J9527d0270D36559
$$ -170366 288724 338935 -120006 299231 -49718 -285839 56757 76284 -40270 436559
10788B0619b79803J36606B68335h6619A45154b20260f1057J5666k15771B60219
$$ 20619 -279803 -143197 268335 -86619 145154 -220260 -61057 -45391 -261162 260219
10777b81028a00493b2298G9370a22062o6196N7295C6251K57268B2002b26629d8325
$$ -281028 -100493 -22298 79370 -122062 -188258 -130963 36251 293519 22002 -226629 -48325
10765A45287m0485a89394A2344L5472b45371B66623b833B4834c13792a44446j4574
$$ 145287 104802 -189394 12344 47816 -245371 266623 -2833 24834 -313792 -144446 -159020
10754a59020e8050C01192H4385B9367P8266k7380b15498L6763f7512D100a63322
$$ -159020 -58050 301192 84385 29367 107633 80253 -215498 -178735 -67512 4100 -163322
10742F2838f2901g246j48720a8445A2339c38867h0912n7006a9952D4237K54715
$$ 62838 -62901 -7246 -155966 -18445 12339 -338867 -80912 -137918 -19952 44237 298952
10731B98952C803L3682a82717J3769f3672l73180H3147c981j05549A86152m7582
$$ 298952 3803 37485 -182717 -168948 -63672 -436852 83147 -3981 -109530 186152 138570
10720A38570l8827c4965k7968B06539G3207D733h6873l95817A06107d2589I4137
$$ 138570 99743 -34965 -62933 206539 73207 4733 -86873 -482690 106107 -42589 94137
10708b31082R6727F4038M4182c91755a7945p4336p0964f3455j20871G1685a64279
$$ -231082 -134355 64038 108220 -391755 -17945 -92281 -163245 -63455 -184326 71685 -164279
10696A93436b43435F3040i2569j14530n5986a13579l7229n3567j12443g3217b4664
$$ 193436 -243435 63040 -92569 -207099 -263085 -113579 -150808 -204375 -316818 -73217 -24664
10684E7129a21006I5070a36758A24982l3760B8663P2100m2997b12841c2036k04568
$$ 57129 -121006 95070 -136758 124982 91222 28663 100763 57766 -212841 -32036 -236604
10673b36604A56223G5788d8025o1360b371C3515a16210B07649e9255j8300J6855
$$ -236604 156223 75788 -48025 -109385 -2371 33515 -116210 207649 -59255 -77555 -60700
10662f0700k1241c5512B62933e14862b27893A373i0643j91901j45041a93989i21
$$ -60700 -81941 -35512 262933 -514862 -227893 1373 -90643 -282544 -427585 -193989 -921
10650A61433b10553a697o8174A30280k2037c32064G5195e4215p5149d3808F2340
$$ 161433 -210553 -1697 -69871 130280 108243 -332064 75195 -54215 -129364 -43808 62340
10638a8278j9008j33311k5995A14735E3325e87l43946E8148i869n2425j02642
$$ -18278 -37286 -170597 -196592 114735 53325 -587 -344533 58148 -9869 -62294 -164936
10627a64936C0140b42484h8261j03362N0336k3972g5062l8645E2655c7156A3965
$$ -164936 30140 -242484 -88261 -191623 -141287 -165259 -75062 -113707 52655 -37156 13965
10615a58612C7533J27746f2726p5016B32500b90446f7559K7037k2923n7247k3964
$$ -158612 37533 165279 -62726 -137742 232500 -290446 -67559 -40522 -63445 -120692 -144656
10604a44656B66663a62948A8237i864n6331r5701d7293j26530A55030f2757A31825
$$ -144656 266663 -162948 18237 -9864 -66195 -161896 -47293 -173823 155030 -62757 131825
10592a51744A7379a90217e8245B8459b21053H7569b56851A5280J52689g370b038
$$ -151744 17379 -190217 -58245 28459 -221053 87569 -256851 15280 167969 -7370 -2038
10580c11317D6154f5618A13016b41470d6434J4893p2266b1689B5340b55722h4014
$$ -311317 46154 -65618 113016 -241470 -46434 -31541 -103807 -21689 25340 -255722 -84014
10568c18436B04289g5256j62929J17903q5494L7266A6584L62996A89485a01812
$$ -318436 204289 -75256 -238185 -120282 -205776 -168510 16584 379580 189485 -101812
10557d3030n7226A91221f0085A29426m3543j6717J01952b32584f2748l14994B29605
$$ -43030 -100256 191221 -60085 129426 85883 69166 171118 -232584 -62748 -377742 229605
10545a47099m5533j8538B98a85858O4687d2168a0207B5819K02367d31425g5671
$$ -147099 -192632 -211170 298 -185858 -121171 -42168 -10207 25819 228186 -431425 -75671
10533b05221f2519j00385P7047A23400b72715i6811k52374a20795b5318p7064
$$ -205221 -62519 -162904 -85857 123400 -272715 -96811 -349185 -120795 -25318 -102382
10523a02382D1726J16037a65799B7651g0095A06597a93429e8325j34919j57845
$$ -102382 41726 157763 -165799 27651 -70095 106597 -193429 -58325 -193244 -351089
10513c51089C07276c3619j47537a8387A39344m5112c04950L4929a1208E1364N4779
$$ -351089 307276 -33619 -181156 -18387 139344 94232 -304950 -270021 -11208 51364 106143
10502A06143c09950f9962A16086a5775n2742k95543d1367r1958F6209Q9697c6094
$$ 106143 -309950 -69962 116086 -15775 -68517 -364060 -41367 -133325 66209 155906 -36094
10490d34327K13891b3327B26177c65646A9213K17256a67267a8265k77960B75238
$$ -434327 -220436 -23327 226177 -365646 19213 236469 -167267 -18265 -296225 275238
10479a35809l7255E5537a34349B67510J71594J9558k8570a0947j78934B43387
$$ -135809 -173064 55537 -134349 267510 439104 458662 430092 -10947 -189881 243387
10468A44621J04918e00403B4411a26694B1950c75690b4198A25657n0752a41876
$$ 144621 249539 -500403 24411 -126694 21950 -375690 -24198 125657 74905 -141876
10457a50670k2370g715A52403c0331D5192K62110A24234b20170B03337c67508
$$ -150670 -173040 -7715 152403 -30331 45192 307302 124234 -220170 203337 -367508
10446D6464c991k08942e0404A46110p1167a50971n6679j60695J57782B74803b29928
$$ 46464 -3991 -212933 -50404 146110 74943 -150971 -207650 -368345 -210563 274803 -229928
10434f4665n1450B79821c28554J43743P7064j90363G3046k5652N0595R6433f1746
$$ -64665 -116115 279821 -328554 -184811 -107747 -298110 73046 47394 97989 194422 -61746
10422A5529a453j60512I1478b40349P3928A94648E8519J75378a60379P6713K387
$$ 15529 -1453 -161965 91478 -240349 -166421 194648 58519 233897 -160379 -83666 -81279
10411h1279a0158o7039A00118a32916l7482e8424k71639C12503f313k12208B44183
$$ -81279 -10158 -77197 100118 -132916 -170398 -58424 -330063 312503 -6313 -218521 244183
10399d3543B28301a26610A31025B7824b2521C35894j00861F973b79851D31841
$$ -43543 228301 -126610 131025 27824 -22521 335894 235033 6973 -279851 431841
10388a04383B67887M1520j1854C9271L0063C1435a7724B05347C2902c1738B85454
$$ -104383 267887 309407 297553 39271 69334 31435 -17724 205347 32902 -31738 285454
10376e2593A0335a5994C29264J12008a08943C83301j50704e0668B68454I5701
$$ -52593 10335 -15994 329264 441272 -108943 383301 232597 -50668 268454 95701
10365D16925n8212N1184J1956j76581K37664A76681k5707F1348c8772E2082O5381
$$ 416925 358713 409897 421853 245272 482936 176681 150974 61348 -38772 52082 117463
10354A17463K28017o735H9628M20648C1257M31671n3166J29178j38083j28335
$$ 117463 345480 338745 89628 510276 31257 462928 409762 538940 400857 272522
10344B72522j34260C9516J32315E570K41922F2129K82125A14732M0776J5449J35639
$$ 272522 138262 39516 171831 5570 247492 62129 344254 114732 155508 170957 306596
10333C06596a84638b669A94719O5077a47111A46333K84757a99339c4124j2378
$$ 306596 -184638 -2669 194719 259796 -147111 146333 431090 -199339 -34124 -46502
10323d6502A02489A8910J3056Q7705J60637M441b452B78210N1663j8867A47142
$$ -46502 102489 18910 31966 119671 280308 284749 -2452 278210 329873 311006 147142
10311b68680j21768c1537F1250e23259c7259j65734A24958B4677Q885b24676O6402
$$ -268680 -390448 -31537 61250 -523259 -37259 -202993 124958 24677 33562 -224676 -158274
10300a58274r9284A12306a76846r7014C3284b19861B3319b96483I4219J39075
$$ -158274 -257558 112306 -176846 -273860 33284 -219861 23319 -296483 94219 233294
10290B33294C0547B972J49185M5523c72609d0731j35344I2815c19221A7322a56352
$$ 233294 30547 2972 152157 197680 -372609 -40731 -176075 92815 -319221 17322 -156352
10278b72536J4574a26529c934A18858c14312b1000A04079b24741C23579b0504
$$ -272536 -257962 -126529 -3934 118858 -314312 -21000 104079 -224741 323579 -20504
10267a27536A07807C2563h1084A86353a85636A16388c5529j3667j6999A12706
$$ -127536 107807 32563 -81084 186353 -185636 116388 -35529 -49196 -66195 112706
10256b35751I4164B6862d4156A55540n6482J87206b1885l2880k99731A46863C3286
$$ -235751 94164 26862 -44156 155540 99058 286264 -21885 -54765 -354496 146863 33286
10244A30367K75012a29833F3877b01958j5087E5633a55229M2787G3481b60003
$$ 130367 405379 -129833 63877 -201958 -217045 55633 -155229 -112442 73481 -260003
10233a13627M3033C7609D048b9957a2303q0261k28974J36626e6355K0880k34367
$$ -113627 -70594 37609 4048 -29957 -12303 -92564 -321538 -184912 -56355 -35475 -269842
10222b69842H3906K21702G1313a15481n2310B483c44064D4308c76752H2467d3193
$$ -269842 83906 305608 71313 -115481 -167791 2483 -344064 44308 -376752 82467 -43193
10210a85329j0648A19784C5804a17406A19615a63396P3934A49833a03862C29362
$$ -185329 -195977 119784 35804 -117406 119615 -163396 -89462 149833 -103862 329362
10199G2814M4522D5198c26570M5473A46141a38790E2643b2096A20545b98769f4621
$$ 72814 117336 45198 -326570 -281097 146141 -138790 52643 -22096 120545 -298769 -64621
10187A12406L5430b35973J07249j16610i2133E7738L0096a60930f2304j14543
$$ 112406 147836 -235973 -128724 -245334 -92133 57738 87834 -160930 -62304 -176847
10177a76847I8625g3352q9175l5807K6106d5636H6402a46259k24078L43B43194
$$ -176847 98625 -73352 -162527 -198334 -172228 -45636 86402 -146259 -370337 -369994 243194
10165a24713B9856d49163D4909b23613P7926k33506a62964j21592L870N8334a02785
$$ -124713 29856 -449163 44909 -223613 -145687 -379193 -162964 -284556 -280686 -222352 -102785
10153B7990c12789a9597F853e9383C6426a15262J0287I867Q4461A8760c05315
$$ 27990 -312789 -19597 6853 -59383 36426 -115262 -104975 9867 94328 18760 -305315
10141i5882E3957g5325l12938d4231l38558F6577b63181A50908J56943b7930m88802
$$ -95882 53957 -75325 -388263 -44231 -382789 66577 -263181 150908 307851 -27930 -516732
10130e16732e7313o0534A56059j3135L7354L84623c47643I9147b49212A12932
$$ -516732 -57313 -117847 156059 142924 180278 564901 -347643 99147 -249212 112932
10119g14592g4416j47026j39045F5902d28241b4705A75397c10838A84651a87478
$$ -714592 -74416 -221442 -360487 65902 -428241 -24705 175397 -310838 184651 -187478
10108b53573Q5491A01452a82224C50259h6720m23645h2636I8006B8163a1109k38661
$$ -253573 -168082 101452 -182224 350259 -86720 -510365 -82636 98006 28163 -11109 -249770
10097b49770R1581p868o2442G0825c01556D6450P8507h1347m0373d3287k84061
$$ -249770 -158189 -166057 -228499 70825 -301556 46450 124957 -81347 -121720 -43287 -327348
10086c27348O0831d3429m3464A51782J07062I1878J0166P462N5505O7164c7572
$$ -327348 -266517 -43429 -86893 151782 258844 91878 102044 109506 165011 232175 -37572
10074B0954a11501b0852j81813m872A46915l654m0331a47725k95128a06099A50731
$$ 20954 -111501 -20852 -202665 -207537 146915 143261 102930 -147725 -442853 -106099 150731
10062B06177f7915A38550m781c67549D15971p2566B8374q251a40138n7329I3882
$$ 206177 -67915 138550 133769 -367549 415971 343405 28374 20123 -140138 -197467 93882
10050E8368b67139b7325j87588A10844l2348d7276F4786M9140b4116k82599a36910
$$ 58368 -267139 -27325 -214913 110844 78496 -47276 64786 113926 -24116 -306715 -136910
10038a98207h0128L0693B05447b90365Q6741a5780B4800h6262D2504K15139g7790
$$ -198207 -80128 -49435 205447 -290365 -203624 -15780 24800 -86262 42504 257643 -77790
10026A16071l5488a8415C83673G4131b00639j4530H4321o896J04910c28365A38679
$$ 116071 80583 -18415 383673 74131 -200639 -215169 84321 77425 182335 -328365 138679
10014a22795H9722a68137O412B541a40335C38591A8826h1581I3370B5883J05254
$$ -122795 89722 -168137 -161725 2541 -140335 338591 18826 -81581 93370 25883 131137
10003A31137a9892j61148A0332N0209c47707A6141g233A05365g2505k89001e0797
$$ 131137 -19892 -181040 10332 60541 -347707 16141 -7233 105365 -72505 -361506 -50797
9991D2831c54504A69638a54618k14080A29915b49498A83842h8933B1248c4448
$$ 42831 -354504 169638 -154618 -368698 129915 -249498 183842 -88933 21248 -34448
9980A852f6704B56368A6834b55182F7162f1206p6985I6639b08996P3981j19776
$$ 1852 -66704 256368 16834 -255182 67162 -61206 -138191 96639 -208996 -135015 -254791
9969b54791p8541I268f3740C3512a47703C210a21631K5445J2642r5213P5610A52103
$$ -254791 -333332 9268 -63740 33512 -147703 3210 -121631 -96186 -83544 -178757 -103147 152103
9956a3383b061A35159F589J51801a02023C3676d467k92393O4204J07257A1333
$$ -13383 -2061 135159 6589 158390 -102023 33676 -4467 -296860 -232656 -125399 11333
9944a74358b486D719a91811A49599a81612l119m58964B59783j26450b63056d7861
$$ -174358 -2486 4719 -191811 149599 -181612 -184731 -643695 259783 133333 -263056 -47861
9932a86275h3418K5135J9100j34022g7722J2471m1235B0313g6913C6347a2791
$$ -186275 -83418 -58283 -39183 -173205 -77722 -65251 -106486 20313 -76913 36347 -12791
9920C01429m2359i3105m0010K850a3635m2587K4992l80963a09273d8029k8490
$$ 301429 259070 -93105 -133115 -130265 -13635 -56222 -31230 -412193 -109273 -48029 -76519
9909g6519A06194a01145K0450N924B3634C928J42450b12946j65445O9858a19216
$$ -76519 106194 -101145 -80695 -74771 23634 3928 146378 -212946 -378391 -308533 -119216
9897e0034j98454B59650c18930J24485N0821O1562j04711E0500J3402b47991I5613
$$ -50034 -248488 259650 -318930 -194445 -143624 -82062 -186773 50500 63902 -247991 95613
9885h3931d0186q9304p5041A28042b42066Q8312b8632n3836A43764A2503b07168
$$ -83931 -40186 -129490 -204531 128042 -242066 -153754 -28632 -82468 143764 12503 -207168
9873A03440E761K0676a51596j22700g5648l1970e0968k46122J07737j2625h6905
$$ 103440 5761 26437 -151596 -274296 -75648 -107618 -50968 -297090 -189353 -201978 -86905
9861e2707N777j47261B210a97417R3641j09100D7012a87920j22198A39044a28977
$$ -52707 -46930 -194191 2210 -197417 -103776 -212876 47012 -187920 -310118 139044 -128977
9849a46646a1031B2986R4653i7293N620j60160A86192l2315f1006o5079A31877
$$ -146646 -11031 22986 117639 -97293 -91673 -251833 186192 153877 -61006 -126085 131877
9837A15014E1036f5736a3458j71542g6793n379E3993c31862a31231B2570Q6566
$$ 115014 51036 -65736 -13458 -185000 -76793 -82172 53993 -331862 -131231 22570 109136
9826A09136k7312B8381c16267L3708g5026J0353j85075H5891a03392j85339F421
$$ 109136 81824 28381 -316267 -282559 -75026 -64673 -249748 85891 -103392 -288731 6421
9814A04382i0503o6293B36069R8075c03907a20183E3520B0948O1550c9778H6572
$$ 104382 -90503 -156796 236069 334144 -303907 -120183 53520 20948 82498 -39778 86572
9802A5968m484b43712Q6295A40712a79408B019L6349L1450h8246c2157m2595A3917
$$ 15968 11484 -243712 -157417 140712 -179408 2019 38368 69818 -88246 -32157 -74752 13917
9789C28470b70439Q5653J384c4337C0551a39408A58989d4200l5599n6882a9581
$$ 328470 -270439 -184786 -183402 -34337 30551 -139408 158989 -44200 -79799 -136681 -19581
9777D1768J22307c0321E698c13462b3784F2045b812H5390J73725j11866L0679
$$ 41768 164075 -30321 5698 -313462 -23784 62045 -2812 85390 259115 147249 177928
9766A77928b85215A35690e2180j9675p410B548J64215J0190E0927e5893l16679
$$ 177928 -285215 135690 -52180 -71855 -79265 2548 166763 176953 50927 -55893 -372572
9755c72572b1638l9793A88884a95145j34810d4891k3670B05570b3554I9289M0686
$$ -372572 -21638 -61431 188884 -195145 -329955 -44891 -68561 205570 -23554 99289 139975
9744A39975J07757a05374n8162j5413B05550h7356K1444b8574k34069B48773c34060
$$ 139975 247732 -105374 -163536 -178949 205550 -87356 -65912 -28574 -262643 248773 -334060
9732A21069b0421o5386q6878H9459c53773J35803a06850j3467a2444D6639A1777
$$ 121069 -20421 -85807 -172685 89459 -353773 -217970 -106850 -120317 -12444 46639 11777
9720A96951b18510d3768A4450h5697j34103l9260d869A03839k4012J2763m0466
$$ 196951 -218510 -43768 14450 -85697 -219800 -259060 -4869 103839 79827 92590 52124
9709E2124c17088j70527E2457c82854J42562R3159e4186I2843a31918B8743b91402
$$ 52124 -317088 -487615 52457 -382854 -240292 -147133 -54186 92843 -131918 28743 -291402
9697B8958g6722n9376d0306j29762e378p3540r1879e2173j12573A19729a43779
$$ 28958 -76722 -136098 -40306 -170068 -5378 -78918 -170797 -52173 -164746 119729 -143779
9685a54147M3175b6794j20531F0139a69814k3001I8827D890a33865H4703c43570
$$ -154147 -110972 -26794 -147325 60139 -169814 -192815 98827 4890 -133865 84703 -343570
9673E5573N0850J15773c84654J90368e5180A83023d2251j71226I5557M9627a18985
$$ 55573 106423 222196 -384654 -194286 -55180 183023 -42251 -213477 95557 145184 -118985
9661c1176I9745c59418R8461A85442a47841l691A30549L7578F940g0623A38514
$$ -31176 99745 -359418 -260957 185442 -147841 -151532 130549 168127 6940 -70623 138514
9649C2727a77692L0973m0288L228A36854g1088j72108q6459B06898D0393a05632
$$ 32727 -177692 -146719 -187007 -183779 136854 -71088 -243196 -329655 206898 40393 -105632
9637a12316a2836A01120a25722F3853a56169A34005n4595b19496A42006k6820
$$ -112316 -12836 101120 -125722 63853 -156169 134005 79410 -219496 142006 115186
9627A15186e6863r5541f0136A58463e2365D2897a37275k02587H224c32101a45704
$$ 115186 -56863 -152404 -60136 158463 -52365 42897 -137275 -339862 8224 -332101 -145704
9615h1966l11663E402a02740J319m0575C37768j46964b34790E4928N1323A8879
$$ -81966 -393629 5402 -102740 -101421 -141996 337768 190804 -234790 54928 106251 18879
9603i1474A7030J47103n6351j9111j4597L3571O8347J62777E3211B265M7423J32471
$$ -91474 17030 164133 107782 88671 74074 107645 175992 338769 53211 2265 49688 182159
9591A82159d8717R301r1975f1833j72753B118J8632a96297L4061l7145A59743
$$ 182159 -48717 -39416 -131391 -61833 -234586 2118 20750 -196297 -162236 -199381 159743
9579c1211A93056a84464r5053h6985C4307b99688A66823L5482G422J1352K57042
$$ -31211 193056 -184464 -279517 -86985 34307 -299688 166823 202305 7422 18774 275816
9568B75816A02230C6780J07347a5130G1748d42193A81609c82308a06493j87061
$$ 275816 102230 36780 144127 -15130 71748 -442193 181609 -382308 -106493 -293554
9558b93554b2730q8309c4379H6848C001b77612J10848k4551d2231k979p9482n09228
$$ -293554 -22730 -111039 -34379 86848 3001 -277612 -166764 -191315 -42231 -45210 -124692 -633920
9546f33920b36028A22733n3870M7478f1782a1406A39471a61788A15522D9745N465
$$ -633920 -236028 122733 68863 116341 -61782 -11406 139471 -161788 115522 49745 55210
9535E5210b87900A40541h2696F359c84295H8410b83954d1438A63969H1784J07175
$$ 55210 -287900 140541 -82696 6359 -384295 88410 -283954 -41438 163969 81784 188959
9524A88959A4637b53591J09448H2208a87662m391H4190d8757l1154j27139Q2559
$$ 188959 14637 -253591 -144143 82208 -187662 -192053 84190 -48757 -79911 -207050 -124491
9513a24491l0247j497l17762C0423a53344k1216B5551J56440E0948c2008n9557
$$ -124491 -154738 -156235 -473997 30423 -153344 -174560 25551 181991 50948 -32008 -91565
9502i1565B1013k348J52154K5497B2864c54540J895F5716b58927n6030J32569
$$ -91565 21013 18665 170819 196316 22864 -354540 -352645 65716 -258927 -314957 -182388
9491a82388B0097J16878o6424a26362F8848f0826A38626b68885e3892j8043r9771
$$ -182388 20097 136975 70551 -126362 68848 -60826 138626 -268885 -53892 -71935 -171706
9480a71706J1889g3762l11283i9929b2769k7716E2979J91686c46921B5953R5577
$$ -171706 -159817 -73762 -385045 -99929 -22769 -50485 52979 244665 -346921 25953 121530
9469A21530n1372b76661J34207E45L3258K40764h3212A2684J960R79b51015f0649
$$ 121530 70158 -276661 -142454 545 33803 274567 -83212 12684 14644 15623 -251015 -60649
9456d27066J97902A86014b07061B4890d0770a9812n956j84620Q6601d7243j0859
$$ -427066 -229164 186014 -207061 24890 -40770 -19812 -25768 -210388 -123787 -47243 -58102
9445e8102m9742B6499b00599B49345D7969i8660j52758F2373b8874m0903E9380
$$ -58102 -107844 26499 -200599 249345 47969 -98660 -251418 62373 -28874 -69777 59380
9433b12223E6797a06524l40645I6469e5805b1635k13567L0564A95522b58960k5424
$$ -212223 56797 -106524 -447169 96469 -55805 -21635 -235202 -204638 195522 -258960 -284384
9422b84384A35679a9794m44675H6248a5590I6622J56701a20085K0356a7185A74875
$$ -284384 135679 -19794 -464469 86248 -15590 96622 253323 -120085 -99729 -17185 174875
9410i2473H3257a73364L3290k42935A63888A7129J88926p7680h6228j39452c2472
$$ -92473 83257 -173364 -140074 -383009 163888 17129 206055 128375 -86228 -225680 -32472
9398D03498c26921a13652j2828o5389B211b78007P8604K0117f0807A75281g4217
$$ 403498 -326921 -113652 -126480 -191869 2211 -278007 -199403 -179286 -60807 175281 -74217
9386h516l07207a35386q2238A91437c6569k58277D45339b41675Q8356j05164D9673
$$ -8516 -315723 -135386 -217624 191437 -36569 -294846 445339 -241675 -153319 -258483 49673
9374e0163A11306a26213D338a5514A00374h6548o9981J3143B53585J8623A17112
$$ -50163 111306 -126213 4338 -15514 100374 -86548 -156529 -143386 253585 272208 117112
9362D6753K86547A24470d4781B94057a30645A46641a64541A33964K595a96322
$$ 46753 333300 124470 -44781 294057 -130645 146641 -164541 133964 136559 -196322
9351F8218r073a42501k7509l6013o6238B20909D872b20062H6660r443c00422O265
$$ 68218 59145 -142501 -170010 -206023 -272261 220909 4872 -220062 86660 77217 -300422 -294157
9339b94157B6350c53742J68601N2443O5743C01565b91922g6044j15811R3079f233
$$ -294157 26350 -353742 -185141 -132698 -66955 301565 -291922 -76044 -191855 -98776 -6233
9327c4484k02243N9286I0101k2579h6517L8340j56044k0062a9044n2151j15210
$$ -34484 -236727 -177441 90101 67522 -86517 -48177 -204221 -224283 -19044 -71195 -186405
9316a86405g5454j72297N6593j92842H2076a3205k32143A38355j3745a00096K7177
$$ -186405 -75454 -247751 -191158 -384000 82076 -13205 -245348 138355 124610 -100096 -72919
9305g2919k26551B19020E8242b15122a02529d6955D800J15377c19001B3800J27196
$$ -72919 -299470 219020 58242 -215122 -102529 -46955 4800 120177 -319001 23800 150996
9294A50996a08544A34342E7269k0924a10336C21440e6365o5982J9816j00368c047
$$ 150996 -108544 134342 57269 36345 -110336 321440 -56365 -122347 -102531 -202899 -3047
9282c5625A49508a03407K7397L4110B10947g3762o4418A90289c11804a42173p0006
$$ -35625 149508 -103407 -76010 -41900 210947 -73762 -138180 190289 -311804 -142173 -212179
9271b12179E6928a99881j71773H8944c0524j77294k9334P1480D52782A75580i1149
$$ -212179 56928 -199881 -371654 88944 -30524 -207818 -237152 -165672 452782 175580 -91149
9259b1451A95947q8869b44121B6671P7552a36391J3474k28138J40733B15610h0726
$$ -21451 195947 107078 -244121 26671 104223 -136391 -122917 -351055 -210322 215610 -80726
9247a70199g5957B63640a06837D6370a01261B4665c44960a0123H4961a83079Q7630
$$ -170199 -75957 263640 -106837 46370 -101261 24665 -344960 -10123 84961 -183079 -95449
9236i5449G5706k2315a18349j18291N3383h3682a6691k60419B03751c15013D0548
$$ -95449 75706 53391 -118349 -236640 -183257 -83682 -16691 -277110 203751 -315013 40548
9224b25175E7419H816O9966O9737e177j0331F7100b67724A87a06979B4476b60515
$$ -225175 57419 8816 78782 148519 -5177 -15508 67100 -267724 187 -106979 24476 -260515
9211H4266J39119a29447j88713D4260a10362R430j5499C08702f9081r0449a9685
$$ 84266 223385 -129447 -318160 44260 -110362 -100932 -116431 308702 -69081 -159530 -19685
9199b67296K6732d4250A37394a28681H9537a26089K2555C731h9133o2334A5112
$$ -267296 -240564 -44250 137394 -128681 89537 -126089 -103534 3731 -89133 -151467 15112
9187F4522a16517D3452O7373a12067b4335k5762p6615Q269L6447p1590m0489j58944
$$ 64522 -116517 43452 110825 -112067 -24335 -50097 -126712 -118443 -81996 -153586 -194075 -353019
9175c53019J30136i5180p9827H2264g3206A10971a1790B714e0756o7879j01695
$$ -353019 -222883 -95180 -175007 82264 -73206 110971 -11790 2714 -50756 -118635 -220330
9164b20330c3738A75492e3927A29496i0709o2999B0524b87555f1293E4988J75033
$$ -220330 -33738 175492 -53927 129496 -90709 -153708 20524 -287555 -61293 54988 230021
9153B30021F4849g8457A44832b44516j79375A7984a76526k59644E5797P4268b486
$$ 230021 64849 -78457 144832 -244516 -423891 17984 -176526 -436170 55797 130065 -2486
9141f8169C5081e7146B15760d9971j47643G2074N7819e7489j93942a07878A00997
$$ -68169 35081 -57146 215760 -49971 -197614 72074 129893 -57489 -251431 -107878 100997
9129A91634i9902B97948A7831k224d9465q5793a8177j81182R6775G7501k9119
$$ 191634 -99902 297948 17831 15607 -49465 -135258 -18177 -199359 -102584 77501 48382
9118D8382d8119C2520j1497a89910C5349g8674A41332a7974B0457K23992b03881
$$ 48382 -48119 32520 21023 -189910 35349 -78674 141332 -17974 20457 244449 -203881
9106B97349a73015p6830c8380A88397d83064F7707e7937j94842A4839c04081J22556
$$ 297349 -173015 -249845 -38380 188397 -483064 67707 -57937 -252779 14839 -304081 -181525
9095a81525j35712d6213I3267L4664R5926a62996m437N8392A40104J73247H0300
$$ -181525 -317237 -46213 93267 127931 223857 -162996 -167433 -109041 140104 313351 80300
9083g4073c5695I4252a1860e88j03707o514A74596b90026A773P4396K8891a05409
$$ -74073 -35695 94252 -11860 -588 -104295 -110809 174596 -290026 1773 76169 105060 -105409
9070b65955f7338A90512b7358j96325k041B89120a82808B07429A938d08010a73489
$$ -265955 -67338 190512 -27358 -223683 -225724 289120 -182808 207429 1938 -408010 -173489
9058F1381A7753a26080K0361C8200N9765a32645d6646A06922E0967a59824C44476
$$ 61381 17753 -126080 -105719 38200 97965 -132645 -46646 106922 50967 -159824 344476
9046a71936B04449a70954m2856I590b51552F5063C2264e8604F7608K40324b40659
$$ -171936 204449 -170954 -213810 9590 -251552 65063 32264 -58604 67608 307932 -240659
9034b39099I5364c09628I566d4822B00328b7674j2809q8221J9621J5697j16382
$$ -239099 95364 -309628 9566 -44822 200328 -27674 -40483 -128704 -109083 -93386 -209768
9023b09768A80561a67078B4222J69949D6749i1679o9774I0736a30805b9493D3828
$$ -209768 180561 -167078 24222 194171 46749 -91679 -161453 90736 -130805 -29493 43828
9011h3974i465k4369l04055C7241A3257b39514B51160B9564a66126j17254B17768
$$ -83974 -9465 -33834 -337889 37241 13257 -239514 251160 29564 -166126 -283380 217768
8999a77200A34984d43392F5911a18825C2272J7242P4784O7873a01905A96478k7883
$$ -177200 134984 -443392 65911 -118825 32272 49514 124298 192171 -101905 196478 168595
8988A68595n6483J46413c2456g682k36527A51176b48701b981m98927a16796A20187
$$ 168595 112112 258525 -32456 -7682 -244209 151176 -248701 -2981 -501908 -116796 120187
8976C8691b52790b6919b23H7090K1284b53631E2913f097j10073I7275A9895h8859
$$ 38691 -252790 -26919 -223 87090 108374 -253631 52913 -6097 -116170 97275 19895 -88859
8963E5286J419b82012K2689J29049H5620C2254K15547f8604E8463a56465l032
$$ 55286 56705 -282012 -259323 -130274 85620 32254 247801 -68604 58463 -156465 -159497
8952a59497G1646d7574A03771b7629B38169a29850j7395H1818A8994J11932j2095
$$ -159497 71646 -47574 103771 -27629 238169 -129850 -147245 81818 18994 130926 118831
8941A18831C2193N0274r169J22819c6031j89433e9658j02320M186c1977m14866
$$ 118831 32193 82467 73298 196117 -36031 -225464 -59658 -161978 -157792 -31977 -446843
8930d46843d767k59074A81340c8083j18611A18296a55383m777b9448B61353G9997
$$ -446843 -4767 -263841 181340 -38083 -156694 118296 -155383 -160160 -29448 261353 79997
8918A685462j57193B49508K91B9219b20154Q1576k2411e6880E9726c5494k62026
$$ 1685462 1528269 249508 249799 29219 -220154 -138578 -160989 -56880 59726 -35494 -297520
8907b97520F8384j0594b79169I099a49977j36738F5648J12146f1154F3491P8165
$$ -297520 68384 57790 -279169 9099 -149977 -286715 65648 177794 -61154 63491 141656
8896A41656a31881G6868J2189b12919r130E6322A576J73721f5291J7053I2567
$$ 141656 -131881 76868 89057 -212919 -222049 56322 1576 175297 -65291 -48238 92567
8884A44279i2103A15541a76374j3394A48633b45612B99480p0422I244Q3660a29879
$$ 144279 -92103 115541 -176374 -189768 148633 -245612 299480 229058 9244 92904 -129879
8872c72867a14534M0300r0013b7697E0571b71727A67550c31398a58519e1291l4435
$$ -372867 -114534 -74234 -164247 -27697 50571 -271727 167550 -331398 -158519 -51291 -85726
8861h5726r1291A92345e6064j60697B00404p3419h6659o203H6659J45568a60651
$$ -85726 -177017 192345 -56064 -216761 200404 126985 -86659 -92862 86659 232227 -160651
8849A36231e3782A17967c78521A82064N704o2209m3695a99807A05051k4507b27636
$$ 136231 -53782 117967 -378521 182064 187768 125559 81864 -199807 105051 80544 -227636
8837b05333A30380e5745C13616a02172p3962E6504d28453a3119l2901B17429b34632
$$ -205333 130380 -55745 313616 -102172 -176134 56504 -428453 -13119 -46020 217429 -234632
8825c13622C1811c979j26212B2229R5545a13009D04636A26480a61857A5334c2690
$$ -313622 31811 -3979 -130191 22229 117774 -113009 404636 126480 -161857 15334 -32690
8813a22406i157j94106B77775b17731d6768k29481B2164b66424a03706A6080d0568
$$ -122406 -9157 -203263 277775 -217731 -46768 -276249 22164 -266424 -103706 16080 -40568
$$ [...]
##END NTUPLES=NMR SPECTRUM
##END=
