##TITLE=NES1083_IC_9885136_LPl463uOHN
##JCAMPDX= 6.0         $$ Bruker NMR JCAMP-DX V2.0
##DATA TYPE= NMR SPECTRUM
##DATA CLASS= NTUPLES
##ORIGIN= BRUKER
##OWNER= Administrator
$$ 1.72 TOPSPIN		Version 2.1
$$ 2016-08-27 19:11:29.664 -0500  Administrator@X
$$ Compression mode = diff/dup
##.OBSERVE FREQUENCY= 400.02188249412
##.OBSERVE NUCLEUS= ^1H
##.ACQUISITION MODE= SIMULTANEOUS (DQD)
##.ACQUISITION SCHEME= undefined
##.AVERAGES= 64
##.DIGITISER RES= 22
##SPECTROMETER/DATA SYSTEM= spect
##.PULSE SEQUENCE= noesygpps1d.comp
##.SOLVENT NAME= COFFEE_meoh
##.SHIFT REFERENCE= INTERNAL, COFFEE_meoh, 1, 14.96275
##AUDIT TRAIL= $$ (NUMBER, WHEN, WHO, WHERE, PROCESS, VERSION, WHAT)
$$ ##TITLE= Audit trail, TOPSPIN		Version 2.1
$$ ##JCAMPDX= 5.01
$$ ##ORIGIN= Bruker BioSpin GmbH
$$ ##OWNER= Administrator
$$ $$ E:\/data/COFFEE/nmr/NES1083_IC_9885136_LPl463uOHN/22/pdata/1/auditp.txt
$$ ##AUDIT TRAIL=  $$ (NUMBER, WHEN, WHO, WHERE, PROCESS, VERSION, WHAT)
(   1,<2016-08-27 19:11:24.383 -0500>,<Administrator>,<X>,<go>,<TOPSPIN 2.1>,
      <created by zg
	started at 2016-08-27 18:59:54.476 -0500,
	POWCHK enabled, PULCHK disabled,
       configuration hash MD5:
       21 0F 79 D6 B3 7B B4 F6 88 20 88 DB 03 48 BD 9F
       data hash MD5: 64K
       C8 1E 51 63 EA C6 26 C2 10 41 01 86 46 2A F3 90>)
(   2,<2016-08-27 19:11:27.523 -0500>,<Administrator>,<X>,<proc1d>,<TOPSPIN 2.1>,
      <Start of raw data processing
       efp LB = 0.3 FT_mod = 6 PKNL = 1 PHC0 = 0 PHC1 = 0 SI = 128K 
       data hash MD5: 128K
       55 94 01 90 E8 28 6C 73 A2 9E 8F 36 23 F6 F6 1F>)
(   3,<2016-08-27 19:11:28.398 -0500>,<Administrator>,<X>,<proc1d>,<TOPSPIN 2.1>,
      <pk PHC0 = -84.40247 PHC1 = 0 
       data hash MD5: 128K
       E4 42 C0 4D 2C 39 CA 04 B6 13 9B BE CD CE FE 1D>)
(   4,<2016-08-27 19:11:28.804 -0500>,<Administrator>,<X>,<proc1d>,<TOPSPIN 2.1>,
      <abs ABSG = 1 
       data hash MD5: 128K
       85 B3 0A 1D 9F 00 94 8A F4 75 AC 0C B5 89 7C 37>)
(   5,<2016-08-27 19:11:28.914 -0500>,<Administrator>,<X>,<proc1d>,<TOPSPIN 2.1>,
      <abs ABSG = 2 
       data hash MD5: 128K
       D4 F9 B8 AE 1D B6 81 A7 96 32 FB A8 39 46 F3 2C>)
(   6,<2016-08-27 19:11:29.023 -0500>,<Administrator>,<X>,<proc1d>,<TOPSPIN 2.1>,
      <abs ABSG = 3 
       data hash MD5: 128K
       8F C5 E0 A4 88 91 6A 3B 5D 6E 82 6B 2F D2 95 51>)
(   7,<2016-08-27 19:11:29.133 -0500>,<Administrator>,<X>,<proc1d>,<TOPSPIN 2.1>,
      <abs ABSG = 4 
       data hash MD5: 128K
       AF EB AC D7 1D C0 0E 76 B4 41 40 F7 7B AF 3B 78>)
(   8,<2016-08-27 19:11:29.461 -0500>,<Administrator>,<X>,<proc1d>,<TOPSPIN 2.1>,
      <abs ABSG = 5 
       data hash MD5: 128K
       C1 1E FF AB E3 79 75 D7 7C FB 3A FD 0C 03 2C 05>)
$$ ##END=
$$ 
$$ $$ hash MD5
$$ $$ F3 ED 6D A7 77 A7 DA 4E 62 87 C6 18 1E 82 6F 2E
##$RELAX= 
##$RELAX= 
##$RELAX= 
##$RELAX= 
##$RELAX= 
##$RELAX= 
##$RELAX= 
##$RELAX= 
$$ Bruker specific parameters
$$ --------------------------
##$DU= <E:\>
##$EXPNO= 22
$$ [...]
##$TP07= 0
##$TPNAME0= <>
##$TPNAME1= <>
##$TPNAME2= <>
##$TPNAME3= <>
##$TPNAME4= <>
##$TPNAME5= <>
##$TPNAME6= <>
##$TPNAME7= <>
##$TPOAL= (0..7)
0.5 0.5 0.5 0.5 0.5 0.5 0.5 0.5
##$TPOFFS= (0..7)
0 0 0 0 0 0 0 0
##$TUNHIN= 0
##$TUNHOUT= 0
##$TUNXOUT= 0
##$USERA1= <user>
##$USERA2= <user>
##$USERA3= <user>
##$USERA4= <user>
##$USERA5= <user>
##$V9= 5
##$VALIST= <valist>
##$VCLIST= <CCCCCCCCCCCCCCC>
##$VD= 0
##$VDLIST= <DDDDDDDDDDDDDDD>
##$VPLIST= <PPPPPPPPPPPPPPP>
##$VTLIST= <TTTTTTTTTTTTTTT>
##$WBST= 1024
##$WBSW= 4
##$XGAIN= (0..3)
0 0 0 0
##$XL= 0
##$YL= 0
##$YMAX_a= 6355693
##$YMIN_a= -14086012
##$ZGOPTNS= <>
##$ZL1= 120
##$ZL2= 120
##$ZL3= 120
##$ZL4= 120
##$ABSF1= 14.96275
##$ABSF2= -5.595431
##$ABSG= 5
##$ABSL= 3
##$ALPHA= 0
##$AQORDER= 0
##$ASSFAC= 0
##$ASSFACI= 0
##$ASSFACX= 0
##$ASSWID= 0
##$AUNMP= <proc_prof1d_extract.lims>
##$AXLEFT= 0
##$AXNAME= <>
##$AXNUC= <1H>
##$AXRIGHT= 0
##$AXTYPE= 0
##$AXUNIT= <>
##$AZFE= 0.1
##$AZFW= 0.1
##$BCFW= 0
##$BC_mod= 0
##$BYTORDP= 0
##$COROFFS= 0
##$CY= 15
##$DATMOD= 1
##$DC= 0
##$DFILT= <>
##$DTYPP= 0
##$F1P= 0
##$F2P= 0
##$FCOR= 0.5
##$FTSIZE= 131072
##$FT_mod= 6
##$GAMMA= 0
##$GB= 0
##$INTBC= 1
##$INTSCL= 1
##$ISEN= 128
##$LB= 0.3
##$LEV0= 0
##$LPBIN= 0
##$MAXI= 10000
##$MC2= 0
##$MEAN= 0
##$ME_mod= 0
##$MI= 0
##$NCOEF= 0
##$NC_proc= -2
##$NLEV= 6
##$NOISF1= 0
##$NOISF2= 0
##$NSP= 0
##$NTH_PI= 0
##$NZP= 0
##$OFFSET= 14.96275
##$PC= 1
##$PHC0= -84.40247
##$PHC1= 0
##$PH_mod= 1
##$PKNL= yes
##$PPARMOD= 0
##$PPDIAG= 0
##$PPIPTYP= 0
##$PPMPNUM= 2147483647
##$PPRESOL= 1
##$PSCAL= 4
##$PSIGN= 0
##$PYNMP= <proc.py>
##$REVERSE= no
##$SF= 400.020008937262
##$SI= 131072
##$SIGF1= 0
##$SIGF2= 0
##$SINO= 400
##$SIOLD= 131072
##$SPECTYP= <>
##$SREGLST= <1H.CDCl3>
##$SSB= 0
##$STSI= 131072
##$STSR= 0
##$SW_p= 8223.68421052631
##$SYMM= 0
##$S_DEV= 0
##$TDeff= 65536
##$TDoff= 0
##$TI= <>
##$TILT= no
##$TM1= 0
##$TM2= 0
##$TOPLEV= 0
##$USERP1= <user>
##$USERP2= <user>
##$USERP3= <user>
##$USERP4= <user>
##$USERP5= <user>
##$WDW= 1
##$XDIM= 131072
##$YMAX_p= 387149145
##$YMIN_p= -15862
##$CURPLOT= <Network HP LaserJet P1505>
##$CURPRIN= <$Network HP LaserJet P1505>
##$DFORMAT= <normdp>
##$LAYOUT= <+/1D_H.xwp>
##$LFORMAT= <normlp>
##$PFORMAT= <normpl>
##$SURQMSG= 1
$$ End of Bruker specific parameters
$$ ---------------------------------
##NTUPLES= NMR SPECTRUM
##VAR_NAME=  FREQUENCY,     SPECTRUM/REAL,   SPECTRUM/IMAG
##SYMBOL=    X,             R,               I
##VAR_TYPE=  INDEPENDENT,   DEPENDENT,       DEPENDENT
##VAR_FORM=  AFFN,          ASDF,            ASDF
##VAR_DIM=   131072,        131072,          131072
##UNITS=     HZ,            ARBITRARY UNITS, ARBITRARY UNITS
##FACTOR=    0.0627417313425164, 1,          1
##FIRST=     8223.62146879497, 2535,         -47243
##LAST=      0,             4327,            -47337
##MIN=       0,             -15862,          0
##MAX=       8223.62146879497, 387149145,    0
$$ Real data points
##PAGE= N=1
##DATA TABLE= (X++(R..R)), XYDATA
$$ [...]
63329B27663L3J7j034j645q05N55P56k69q65M0J657K687K950L081L273L109K405
63312B43608J584J104R88R60Q87Q29P86N29j89j304k445l252l548l272k524j693
63296B33048j265j337j479j244o19R4O30Q56Q29Q18J045J289J141O80M47O36Q24
63279B36393P60P65J071J318J247J312J963K769K953K542K255K406K633K624K500
63264B65511K421K297K070J936K203L000L999M420L696K325J557J970K873L474
63250C03752L970M854N810O148N942N882O289P048Q268J0049J1863J3060J3904
63237D06839J5204J6961J8388J9208K0031K1197K2195K2507K2274K1797K1094
63226F27695K0200J9376J8710J8046J7470J7334J7612J7809J7722J7734J8071
$$ plain form
63329 227663 227696 227713 226679 225034 224229 224784 225540 225271 224406 224446 226103 228790 231740 234821 238094 241203 243608
63312 243608 245192 246296 247284 248244 249131 249960 250746 251275 251086 249782 247337 244085 240537 237265 234741 233048
63296 233048 231783 230446 228967 227723 227104 227198 227828 228684 229513 230331 231376 232665 233806 234486 234933 235569 236393
63279 236393 237153 237918 238989 240307 241554 242866 244829 247598 250551 253093 255348 257754 260387 263011 265511
63264 265511 267932 270229 272299 274235 276438 279438 283437 287857 291553 293878 295435 297405 300278 303752
63250 303752 307722 312576 318386 324534 330476 336358 342647 349695 357963 368012 379875 392935 406839
63237 406839 422043 439004 457392 476600 496631 517828 540023 562530 584804 606601 627695
63226 627695 647895 667271 685981 704027 721497 738831 756443 774252 791974 809708 827779
63215H27779J8303J7815J6425J4313J1641Q461M610k20n999j1930j7009k0971
63203H63218k4216k6891k8667k9419k9467k8993k7763k5628k2840j9829j7017
63192E82488j4766j2959j0789p554l668k36K185L818M907N595O417P866R450J0212
63178E82966J0260J0719J1949J2927J2818J2129J1833J2200J2978J3848J4203
63167G18830J3341J1435R552Q267O913M680J579j945n551q679j0676j1813j3237
63154G22696j5313j6998j7494j7440j7659j7744j6963j5605j4362j3146j1709
63143E48263j0610j0327j0007q558o507n333n206m894l840k848k489k161j286
63130D74197l12R0Q1K61P63J299J743K228K736L009K879K627K809L525M071L746
$$ plain form
63215 827779 846082 863897 880322 894635 906276 914737 919347 919127 913128 901198 884189 863218
63203 863218 839002 812111 783444 754025 724558 695565 667802 642174 619334 599505 582488
63192 582488 567722 554763 543974 536420 532752 532516 534701 538519 543426 549021 555438 563304 572754 582966
63178 582966 593226 603945 615894 628821 641639 653768 665601 677801 690779 704627 718830
63167 718830 732171 743606 753158 761425 768338 773018 774597 772652 767101 758422 747746 735933 722696
63154 722696 707383 690385 672891 655451 637792 620048 603085 587480 573118 559972 548263
63143 548263 537653 527326 517319 508761 502254 496921 491715 486821 482981 480133 477644 475483 474197
63130 474197 473885 473975 474056 474317 475080 476379 478122 480350 483086 486095 488974 491601 494410 497935 502006 505752
63114E05752L017L115M303N353N267M574M262M233L857L310L179L238K876K443
63100E58779K724L318K940J499M55P25J538J895J960K247K474K174J728J820K256
63085E88532K262J748J457J829K445K748K881L471M717O009O553O328O119O530
63071F43629P328P999Q649R834J1586J3264J4398J5259J6380J7957J9865K1955
63059H08103K4182K6500K8777L0732L2206L3623L5840L9104M2429M4663M5884
63048A192043M7043M8380M9108M8782M8043M7548M6930M5490M3438M1742M0956
63037A699503M0696M0283L9460L8493L7742L7089L5760L2887K8341K2649J5996
63026B068899P734k638j4313k5504l5003m2992n0214n6761o1942o5132o6364o6039
$$ plain form
63114 505752 508769 511884 516187 521540 526807 531381 535643 539876 543733 547043 550222 553460 556336 558779
63100 558779 561503 564821 567761 569260 569715 570440 571978 573873 575833 578080 580554 582728 584456 586276 588532
63085 588532 590794 592542 593999 595828 598273 601021 603902 607373 612090 618099 624652 630980 637099 643629
63071 643629 650957 658956 667605 677439 689025 702289 716687 731946 748326 766283 786148 808103
63059 808103 832285 858785 887562 918294 950500 984123 1019963 1059067 1101496 1146159 1192043
63048 1192043 1239086 1287466 1336574 1385356 1433399 1480947 1527877 1573367 1616805 1658547 1699503
63037 1699503 1740199 1780482 1819942 1858435 1896177 1933266 1969026 2001913 2030254 2052903 2068899
63026 2068899 2076633 2073995 2059682 2034178 1999175 1956183 1905969 1849208 1787266 1722134 1655770 1589731
63014A589731o4390o1412n7197n2056m6340m0364l4429k8681k2941j6961j0977
63003A153983n664j335K489O480J0688J4521J7348J8884J9314J9273J9522K0290
62991A295793K1135K1549K1458K0967J9995J8557J6955J5206J2676Q872M333O5
62979A477561l826q202j3636j9657k5400l0447l4861l8751m2086m4635m6125m6531
62967A123404m6175m5217m3310m0239l6656l3597l1316k9212k6905k4671k2653
62956G43453k0336j7262j3852j1073r525r002q757q070o834n701n332n491n219
62943F16999m112k903k508k881l239l178l081l465m271m951n044m573l905l371
62929E65517l034k764k465k239k411l276m696n934o225n551m631m095l968m033
$$ plain form
63014 1589731 1525341 1463929 1406732 1354676 1308336 1267972 1233543 1204862 1181921 1164960 1153983
63003 1153983 1148319 1146984 1149473 1155953 1166641 1181162 1198510 1217394 1236708 1255981 1275503 1295793
62991 1295793 1316928 1338477 1359935 1380902 1400897 1419454 1436409 1451615 1464291 1473163 1477496 1477561
62979 1477561 1473735 1465533 1451897 1432240 1406840 1376393 1341532 1302781 1260695 1216060 1169935 1123404
62967 1123404 1077229 1032012 988702 948463 911807 878210 846894 817682 790777 766106 743453
62956 743453 723117 705855 692003 680930 671405 662403 653646 645576 638742 633041 627709 622218 616999
62943 616999 612887 609984 607476 604595 601356 598178 595097 591632 587361 582410 577366 572793 568888 565517
62929 565517 562483 559719 557254 555015 552604 549328 544632 538698 532473 526922 522291 518196 514228 510195
62915E10195m193m310m106l619l279l135k506r48P74J450Q53j25o57o11k56l9
62899D85488n43j952l506m202m035l890m178m355l934l229k749k488k204j923
62885D42300j798j824j950k188k389k224j583p58r1K54K41Kq3K60P54Q97P05O09
62867D31134O72N42J40j87l08l88k95L37J241J568J077N94Q15J383J603J470J365
62850D42763J308J138R61Q74O54K58K45R81J844J928J306Q67J053J384J283P52
62834D59599J46k36k74p6J0k82p85j095j021o33l4N60P82N73M57R00J519J548
62816D61658J003P18J078J522J550J517J911K421K437K131K290L191M382N508
62802D93317O639P637Q024P868Q057R163J0547J1315J1736J2832J4941J7494K0113
$$ plain form
62915 510195 506002 501692 497586 493967 490688 487553 485047 484099 484873 486323 487176 487051 486394 485783 485527 485488
62899 485488 484945 482993 479487 475285 471250 467360 463182 458827 454893 451664 448915 446427 444223 442300
62885 442300 440502 438678 436728 434540 432151 429927 428344 427586 427495 427749 427990 427992 427909 428169 428923 429820 430525 431134
62867 431134 431806 432348 432488 432301 431993 431605 431310 431647 432888 434456 435533 436127 436942 438325 439928 441398 442763
62850 442763 444071 445209 446170 447044 447698 447956 448201 449182 451026 452954 454260 455127 456180 457564 458847 459599
62834 459599 459745 459509 459235 459159 459169 458887 458102 457007 455986 455353 455319 455879 456661 457234 457691 458591 460110 461658
62816 461658 462661 463379 464457 465979 467529 469046 470957 473378 475815 477946 480236 483427 487809 493317
62802 493317 499956 507593 515617 523485 531542 540705 551252 562567 574303 587135 602076 619570 639683
62789F39683K2950K5894K8444L0745L3805L8202M3259M8013N2369N6729O1107
62778A081200O5230O9072P2602P5457P7341P8270P7913P5287O9782O1976N2685
62767A856815M1847K9249J5734K529j0243k3172l5890m7096n6231o3909p0460
62756A639173p5231p7694p8226p7458p5639p3000o9975o6631o2635n8111n3779
62745H70794m9895m5817m1063l6159l1998k8866k6479k4533k2804k1114j9465
62734E22601j7878j6051j3663j1025q917p657o951o574o479o206n097l296j773
62721D11034j129j057j056p72L45K649N267O640O490O198O793P717Q200Q676R884
62706D75879J1643J3485J5775J9087K3017K6542K9203L1253L3064L5071L7713
$$ plain form
62789 639683 662633 688527 716971 747716 781521 819723 862982 910995 963364 1020093 1081200
62778 1081200 1146430 1215502 1288104 1363561 1440902 1519172 1597085 1672372 1742154 1804130 1856815
62767 1856815 1898662 1927911 1943645 1946174 1935931 1912759 1876869 1829773 1773542 1709633 1639173
62756 1639173 1563942 1486248 1408022 1330564 1254925 1181925 1111950 1045319 982684 924573 870794
62745 870794 820899 775082 734019 697860 665862 636996 610517 585984 563180 542066 522601
62734 522601 504723 488672 475009 463984 455067 447410 440459 433885 427406 421200 416103 412807 411034
62721 411034 409905 408848 407792 407020 407365 410014 415281 421921 428411 434609 441402 449119 457319 465995 475879
62706 475879 487522 501007 516782 535869 558886 585428 614631 645884 678948 714019 751732
62695G51732M0793M3340M4600M4646M3602M1108L7176L2584K7676K1684J4200
62684A143141O305r10q084j6355k5047l2193l7033m0476m3156m4610m4640m4092
62672H12850m3688m3040m1331l8421l4896l1546k8921k7014k5240k3121k0840
62661D54792j8806j6927j4887j2883j1401j0458r723r189r055r066q664p701o403
62648C09629m879l360k557k981l994m447m087l589l298k915k386k145k304k435
62634B64252k346k292k336k192j877j713j545q03M31J223J054O26R54K092L230
62619B58758L668L439L135L308L866M084L493K643K558L613N294O963Q282R122
62605C22226R676J0596J2328J4390J5961J7111J8644K0824K3132K5352K7927L0984
$$ plain form
62695 751732 792525 835865 880465 925111 968713 1009821 1046997 1079581 1107257 1128941 1143141
62684 1143141 1149446 1148536 1140452 1124097 1099050 1066857 1029824 989348 946192 901582 856942 812850
62672 812850 769162 726122 684791 646370 611474 579928 551007 523993 498753 475632 454792
62661 454792 435986 419059 404172 391289 379888 369430 359707 350518 341463 332397 323733 316032 309629
62648 309629 304750 301390 298833 295852 291858 287411 283324 279735 276437 273522 271136 268991 266687 264252
62634 264252 261906 259614 257278 255086 253209 251496 249951 249148 249579 250802 251856 252482 253436 255528 258758
62619 258758 262426 265865 269000 272308 276174 280258 283751 286394 288952 292565 297859 304822 313104 322226
62605 322226 331902 342498 354826 369216 385177 402288 420932 441756 464888 490240 518167 549151
62593E49151L3919L6313L8434M0353M1329M0616L8344L5084L1029K6141K0625
62582I31338J4664Q082P74o683j3413j9062k3898k8162l1641l3939l4909l4850
62570G28301l4320l3640l2639l0988k8768k6405k4149k1912j9684j7710j6155
62559D41931j4906j3807j2851j2074j1498j1172j1083j1007j0736j0353r996r454
62547C02994q385o913n576m655l921l105k301j808j778k012j929r83O17J871K069
62532B64185J678J644K131K625L040L861N163O297O832P128P713Q660R857J1345
62518C42159J3101J4867J6497J8134J9839K1320K2280K2749K3031K3455K4160
62507E61592K4794K4454K2423J8952J4972J0997O763J997k951p402j0971j3754
$$ plain form
62593 549151 583070 619383 657817 698170 739499 780115 818459 853543 884572 910713 931338
62582 931338 946002 954084 954858 948175 934762 915700 891802 863640 831999 798060 763151 728301
62570 728301 693981 660341 627702 596714 567946 541541 517392 495480 475796 458086 441931
62559 441931 427025 413218 400367 388293 376795 365623 354540 343533 332797 322444 312448 302994
62547 302994 294609 287696 282120 277465 273544 270439 268138 266330 264552 262540 260611 259628 260245 262116 264185
62532 264185 265863 267507 269638 272263 275303 279164 284327 290624 297456 304584 312297 320957 330814 342159
62518 342159 355260 370127 386624 404758 424597 445917 468197 490946 513977 537432 561592
62507 561592 586386 610840 633263 652215 667187 678184 684947 686944 683993 676591 665620 651866
62495F51866j6133j8418k0447k1659k1803k1360k0914k0424j9514j8219j6832
62484D36143j5305j3434j1484r911q627p221n710m385l119j698n77l45n17O6J536
62469C55412K756K987K731K670K801L047L776N111O460P249P562P752Q045Q772
62455D27131J0171J1585J1766J0413Q573P091N513L154L68k104m370p050j0085
62442D72156j2598j3858j3827j2999j2083j1494j0948r908q543p641p357o913
62430C43987n842m721m088l502k427j173j19J251L449N657O471N863N339O068
62416C56213P649Q936R422R501R752J0265J0619J0425R776Q904P575N392K735
62403D67164O95k68r63k338m290o014o983p104o514n788n739o413o732n827m171
$$ plain form
62495 651866 635733 617315 596868 575209 553406 532046 511132 490708 471194 452975 436143
62484 436143 420838 407404 395920 386009 377382 370161 364451 360066 356947 355249 354672 354327 353810 353876 355412
62469 355412 358168 361155 363886 366556 369357 372404 376180 381291 387751 395000 402562 410314 418359 427131
62455 427131 437302 448887 460653 471066 479639 486730 492243 495397 495765 493661 489291 482241 472156
62442 472156 459558 445700 431873 418874 406791 395297 384349 374441 365898 358257 350900 343987
62430 343987 338145 333424 329336 325834 323407 322234 322115 323366 326815 332472 338943 344806 350145 356213
62416 356213 363862 372798 382220 391721 401473 411738 422357 432782 442558 451462 459037 464429 467164
62403 467164 467859 467591 466628 464290 460000 453986 447003 439899 433385 427597 421858 415445 408713 402886 398715
62388C98715k790j812o48R03K606M556P058R787J1988J3532J5098J7234J9848
62375D96075K2714K5920K9576L3442L7002L9817M1833M3399M4757M5471M4724
62364I04730M2335L8936L4844K9477K2393J4401O864K93n763j1627j7069k1720
62352A038094k5412k8176l0286l2100l3485l3801l2879l1547l0578k9608k7755
62341G02467k4939k1869j9081j6730j5076j4248j3715j2789j1609j0880j0696
62330E30835j0349r324p851o406n230m351l573k518j165j60p0m78n05q4k3q51
62314D77897k263l692m890n870o855q136r530j0130r336p851o961o904o778o036
62300C82665n094m359l582k501j314k03R96K258L141L483L752M340M964N255N475
$$ plain form
62388 398715 395925 394113 393465 394368 396974 401530 408588 418375 430363 443895 458993 476227 496075
62375 496075 518789 544709 574285 607727 644729 684546 726379 769778 814535 860006 904730
62364 904730 947065 986001 1020845 1050322 1072715 1087116 1093980 1094273 1088510 1076883 1059814 1038094
62352 1038094 1012682 984506 954220 922120 888635 854834 821955 790408 759830 730222 702467
62341 702467 677528 655659 636578 619848 604772 590524 576809 564020 552411 541531 530835
62330 530835 520486 511162 503311 496905 491675 487324 483751 481233 480068 479908 479838 479360 478855 478771 478748 477897
62314 477897 475634 471942 467052 461182 454327 446191 436661 426531 417195 409344 402383 395479 388701 382665
62300 382665 377571 373212 369630 367129 365815 365612 366608 368866 372007 375490 379242 383582 388546 393801 399276
62285C99276O148P239Q185Q683R045R712J0669J1473J1827J1977J2383J3138J4021
62272E33776J5165J7102J9916K2909K5529K8109L1016L3655L5071L5244L4778
62261H32270L3590L0898K6590K1634J6774J1700N825p15p217j3019j7702k1196
62249I19432k4013k6907k9970l2406l3446l3202l2336l1268k9839k7596k4351
62238E94098k0584j7279j4959j3121j1038q960p753p450o967n599l983l143l105
62225D70157l002k255j160m02k94n00m16K04J036J683K150K622L045L361L863
62210D80092M786N760O281O603P429Q780R933J0621J1515J3176J5233J7000J8429
62197F15638J9994K1911K3806K5018K5093K4071K2317J9905J6526J2257Q134N251
$$ plain form
62285 399276 405424 412663 420848 429531 438576 448288 458957 470430 482257 494234 506617 519755 533776
62272 533776 548941 566043 585959 608868 634397 662506 693522 727177 762248 797492 832270
62261 832270 865860 896758 923348 944982 961756 973456 979281 978566 971349 958330 940628 919432
62249 919432 895419 868512 838542 806136 772690 739488 707152 675884 646045 618449 594098
62238 594098 573514 556235 541276 528155 517117 508157 500404 492954 485987 480388 476405 473262 470157
62225 470157 467155 464900 463740 463338 463044 462544 462128 462332 463368 465051 467201 469823 472868 476229 480092
62210 480092 484878 490638 496919 503522 510951 519731 529664 540285 551800 564976 580209 597209 615638
62197 615638 635632 657543 681349 706367 731460 755531 777848 797753 814279 826536 834670 839921
62185H39921L482J897K84n11K39K363N312Q639J1866J4616J7126J9873K2562K4212
62171I71881K4366K3373K1421J8278J4297J0619P826N384K855P26o53j959l883
62158A094531n973p394q179q835r302r248q921q767q513p564o095m866m118l467
62144I93289k774k401k575l077l593l904l838l398k750j866n52Q62J509J185R38
62129I67055J756L301M766O289Q364J0382J1213J1070J1430J2914J4565J5516
62117A078621J6134J7046J8093J8870J9484K0155K0827K1727K3446K5838K7685
62106A307926K8311K8916L1136L4672L7395L7807L6390L4476L2744L1320L0532
62095A671625L0839L2205L4123L6197L8219L9741M0056L8927L7063L5444L4335
$$ plain form
62185 839921 843403 845300 845584 845073 845312 847675 852987 861626 873492 888108 905234 925107 947669 971881
62171 971881 996247 1019620 1041041 1059319 1073616 1084235 1092061 1097445 1100300 1101026 1100373 1098414 1094531
62158 1094531 1088558 1081164 1072985 1064150 1054848 1045600 1036679 1027912 1019399 1011835 1005740 1000874 996756 993289
62144 993289 990515 988114 985539 982462 978869 974965 971127 967729 964979 963113 962561 963423 964932 966117 967055
62129 967055 968811 972112 976878 983167 991531 1001913 1013126 1024196 1035626 1048540 1063105 1078621
62117 1078621 1094755 1111801 1129894 1148764 1168248 1188403 1209230 1230957 1254403 1280241 1307926
62106 1307926 1336237 1365153 1396289 1430961 1468356 1506163 1542553 1577029 1609773 1641093 1671625
62095 1671625 1702464 1734669 1768792 1804989 1843208 1882949 1923005 1961932 1998995 2034439 2068774
62084B068774L3312L2217L1481L1314L1108L0242K9133K8746K9158K9405K8865
62073B403755K8087K7823K7842K7294K5811K3702K1273J8665J6311J4836J4319
62062B649718J4114J3652J3058J2642J2141J0915Q856O741N524N366N585N500
62050B763812N271N629O820Q026Q241P496O817O784O674N414L080Q97k44p59j711
62035B832247l464n342o486o767o833p360q344r167r354r072q706q197p239o080
62021B729836n500n682n630m268j827M70J990L274M982O967Q788J0530J2487J4293
62007B770710J5156J5055J5005J5743J6530J5821J2897Q368L133k436q116j3283
61995B864583j7332k0369k2923k5049k6309k6530k6108k5452k4646k3811k3234
$$ plain form
62084 2068774 2102086 2134303 2165784 2197098 2228206 2258448 2287581 2316327 2345485 2374890 2403755
62073 2403755 2431842 2459665 2487507 2514801 2540612 2564314 2585587 2604252 2620563 2635399 2649718
62062 2649718 2663832 2677484 2690542 2703184 2715325 2726240 2735096 2741837 2747361 2752727 2758312 2763812
62050 2763812 2769083 2774712 2781532 2789558 2797799 2805295 2812112 2818896 2825570 2830984 2834064 2834961 2834717 2833958 2832247
62035 2832247 2828783 2823441 2816955 2810188 2803355 2795995 2787651 2778484 2769130 2760058 2751352 2743155 2735916 2729836
62021 2729836 2724336 2718654 2713024 2708756 2706929 2707399 2709389 2712663 2717645 2724612 2733400 2743930 2756417 2770710
62007 2770710 2785866 2800921 2815926 2831669 2848199 2864020 2876917 2885285 2888418 2885982 2877866 2864583
61995 2864583 2847251 2826882 2803959 2778910 2752601 2726071 2699963 2674511 2649865 2626054 2602820
61984B602820k2962k2673k2331k2448k3333k4403k4729k4082k3017k2104k1522
61973B349216k1298k1398k1574k1434k0882k0231j9817j9653j9445j8871j7817
61962B126796j6408j4859j3310j1916j0938j0486j0199r584q672p864p153o064
61950A999343m528l171k302j359J63J831K999L905N212O886Q400R835J1866J4673
61936B053753J7708K0514K3077K5309K6903K7897K8724K9654L0769L2584L6031
61925B352923M1604M9021N7906O8221P9910R2740J06780J22609J40773J61434
61915C273921J84672K10680K39432K70623L04101L39920L77763M16464M54080
61906F071656M87773N13358N25222N17135M83435M20396L27782K10001P5656o4233
$$ plain form
61984 2602820 2579858 2557185 2534854 2512406 2489073 2464670 2439941 2415859 2392842 2370738 2349216
61973 2349216 2327918 2306520 2284946 2263512 2242630 2222399 2202582 2182929 2163484 2144613 2126796
61962 2126796 2110388 2095529 2082219 2070303 2059365 2048879 2038680 2029096 2020424 2012560 2005407 1999343
61950 1999343 1994815 1991644 1989342 1987983 1988146 1989977 1992976 1996881 2002093 2008979 2017379 2027214 2039080 2053753
61936 2053753 2071461 2091975 2115052 2140361 2167264 2195161 2223885 2253539 2284308 2316892 2352923
61925 2352923 2394527 2443548 2501454 2569675 2649585 2742325 2849105 2971714 3112487 3273921
61915 3273921 3458593 3669273 3908705 4179328 4483429 4823349 5201112 5617576 6071656
61906 6071656 6559429 7072787 7598009 8115144 8598579 9018975 9346757 9556758 9632414 9568181
61896I568181j98237l16225m11023m79393n21509n39711n37875n21098m94423
61887E548687m61441m24460l85788l47848l12086k78832k48355k21082j96667
61878B672128j74100j53235j35188j20665j08765r8070q8079p8989p0827o3497
61868A580713n7011n1112m5259l9501l4576l0708k7106k3248j9720j6986j4363
61857A221123j1203q254o585n803m666l025j874j666j833k000k430l133l499l175
61843A161977k435j499j81J456K833L575L988M516N095N410N413N350N318N059
61829A205875M260L070K280K691M273O222P917R440J0973J2288J3198J4010J5017
61816A311514J5972J6509J6779J7227J8130J9723K2360K6016L0045L3999L8185
$$ plain form
61896 9568181 9369944 9053719 8642696 8163303 7641794 7102083 6564208 6043110 5548687
61887 5548687 5087246 4662786 4276998 3929150 3617064 3338232 3089877 2868795 2672128
61878 2672128 2498028 2344793 2209605 2088940 1980175 1882105 1794026 1715037 1644210 1580713
61868 1580713 1523702 1472590 1427331 1387830 1353254 1322546 1295440 1272192 1252472 1235486 1221123
61857 1221123 1209920 1201666 1195081 1189278 1184612 1181587 1179713 1178047 1176214 1174214 1171784 1168651 1165152 1161977
61843 1161977 1159542 1158043 1157862 1159318 1162151 1165726 1169714 1174230 1179325 1184735 1190148 1195498 1200816 1205875
61829 1205875 1210135 1213205 1215485 1218176 1222449 1228671 1236588 1246028 1257001 1269289 1282487 1296497 1311514
61816 1311514 1327486 1343995 1360774 1378001 1396131 1415854 1438214 1464230 1494275 1528274 1566459
61805A566459M2963M8076N3324N9239O6173P3288P9605Q5691R3143J02534J13023
61794B383518J24065J36364J50893J67899J87176K08661K32469K58966K88938
61785D138949L23170L61825M04777M52378N05180N62971O24845O89942P56881
61776H820918Q22158Q79901R23138R43968R32416Q77256P70282O10657M05777
61767A5986471J69464q0012l22166n37953p13661q42430r23220r59221r56882
61758A0820390r24919q72885q09457p41140o71880o03916n39133m79444m26012
61749D751604l78751l37023l00381k68322k39902k14288j91410j71447j53903
61740B496177j37848j22994j09756r8222q7737p7797o8842o1594n5927n0822m5442
$$ plain form
61805 1566459 1609422 1657498 1710822 1770061 1836234 1909522 1989127 2074818 2167961 2270495 2383518
61794 2383518 2507583 2643947 2794840 2962739 3149915 3358576 3591045 3850011 4138949
61785 4138949 4462119 4823944 5228721 5681099 6186279 6749250 7374095 8064037 8820918
61776 8820918 9643076 10522977 11446115 12390083 13322499 14199755 14970037 15580694 15986471
61767 15986471 16155935 16075923 15753757 15215804 14502143 13659713 12736493 11777272 10820390
61758 10820390 9895471 9022586 8213129 7471989 6800109 6196193 5657060 5177616 4751604
61749 4751604 4372853 4035830 3735449 3467127 3227225 3012937 2821527 2650080 2496177
61740 2496177 2358329 2235335 2125579 2027357 1939620 1861823 1792981 1731387 1675460 1624638 1579196
61729A579196l9905l4952l1095k8231k5948k3967k2286k1055k0394k0222k0164
61718A290977j9685j8571j7187j6146j5584j4991j3819j2196j0861j0410j0787
61707A130740j1501j2181j2779j3320j3715j3889j3871j3690j3346j2975j2855
61696I86618j2902j2492j1165r397q131p616p233o542n880n633n547n209m717
61683H84154m376m057l451k708k283k224k161j982k003k410k829k750k149j607
61669H47164j741k547l377l673l605l664l791l455k662k231k759l788m423m339
61655H01109l856l397l268l530l796l570l029k944l403l427k476j467j489k091
61641G59366j966q05O33J995L606N356O599P268P991Q879R303R130R133R661R890
$$ plain form
61729 1579196 1539291 1504339 1473244 1445013 1419065 1395098 1372812 1351757 1331363 1311141 1290977
61718 1290977 1271292 1252721 1235534 1219388 1203804 1188813 1174994 1162798 1151937 1141527 1130740
61707 1130740 1119239 1107058 1094279 1080959 1067244 1053355 1039484 1025794 1012448 999473 986618
61696 986618 973716 961224 950059 940662 932531 924915 917682 911140 905260 899627 894080 888871 884154
61683 884154 879778 875721 872270 869562 867279 865055 862894 860912 858909 856499 853670 850920 848771 847164
61669 847164 845423 842876 839499 835826 832221 828557 824766 821311 818649 816418 813659 809871 805448 801109
61655 801109 797253 793856 790588 787058 783262 779692 776663 773719 770316 766889 764413 762946 761457 759366
61641 759366 757400 756595 757228 759223 762829 768185 774784 782052 790043 798922 808225 817355 826488 836149 846039
61626H46039Q963P133N141L175J088r30k594m076n626o934p487p382p275p606
61612H21629q314r206j0111j0655j0358r197p881p227p341p565p376p043p142
61599G12213p614p763p194o214n163l959k650j782j616j520q06J90O33N03N73
61584F67831J248K227L236M359N571O633P546Q550R648J0693J1839J3332J4979
61571G67692J6410J7638J8715J9106J8357J7182J6830J7362J7659J7204J6684
61560I60839J6609J6525J6052J5593J5470J5261J4680J4225J4271J4276J3599
61549A127400J2472J1478J0621R571Q280O784M838K307m75l215o008q724j0698
61536A164631j1567j1950j2636j3547j4003j3617j2470j0898r552r033q919p833
$$ plain form
61626 846039 855002 862135 867276 870451 871539 870609 868015 863939 858313 851379 843892 836510 829235 821629
61612 821629 813315 804109 793998 783343 772985 763788 755907 748680 741339 733774 726398 719355 712213
61599 712213 704599 696836 689642 683428 678265 674306 671656 669874 668258 666738 665932 666122 666755 667258 667831
61584 667831 669079 671306 674542 678901 684472 691105 698651 707201 716849 727542 739381 752713 767692
61571 767692 784102 801740 820455 839561 857918 875100 891930 909292 926951 944155 960839
61560 960839 977448 993973 1010025 1025618 1041088 1056349 1071029 1085254 1099525 1113801 1127400
61549 1127400 1139872 1151350 1161971 1171542 1179822 1186606 1191444 1193751 1193276 1190061 1184053 1175329 1164631
61536 1164631 1153064 1141114 1128478 1114931 1100928 1087311 1074841 1063943 1054391 1045358 1036439 1028606
61524A028606n121j818Q45L193O324J0225J3872J6915J9981K3350K6625K9933
61512A172930L4377M0670M8083N5344O2118O9136P7162Q6248R5997J06200J17157
61501A965422J29220J42019J54518J65941J76183J84776J89895J89135J81237
61492C478346J66341J44682J16077Q1140M2379L425l2669o4219r0503j11162j25998
61481C607839j34962j38320j36945j32284j25672j17657j08153r7293q5836p4680
61471B456037o4269n4723m6226l8851l2026k4771j6709q467q34O037J2278J7688
61459B205164K2109K6030L0006L3531L5413L5353L4396L3524L2596L1113K9360
61448B548595K8130K7757K7941K8356K8935K9729L0843L2388L4212L5873L7151
$$ plain form
61524 1028606 1023485 1021667 1022512 1025705 1032029 1042254 1056126 1073041 1093022 1116372 1142997 1172930
61512 1172930 1207307 1247977 1296060 1351404 1413522 1482658 1559820 1646068 1742065 1848265 1965422
61501 1965422 2094642 2236661 2391179 2557120 2733303 2918079 3107974 3297109 3478346
61492 3478346 3644687 3789369 3905446 3986586 4028965 4032390 3999721 3935502 3844999 3733837 3607839
61481 3607839 3472877 3334557 3197612 3065328 2939656 2821999 2713846 2616553 2530717 2456037
61471 2456037 2391768 2337045 2290819 2251968 2219942 2195171 2178462 2169995 2169161 2175198 2187476 2205164
61459 2205164 2227273 2253303 2283309 2316840 2352253 2387606 2422002 2455526 2488122 2519235 2548595
61448 2548595 2576725 2604482 2632423 2660779 2689714 2719443 2750286 2782674 2816886 2852759 2889910
61437B889910L8321L9588M0403L9748L7091L2795K7603K1883J5375P680r74r530
61425C179893j6897k2873k8018l2668l6511l9116m0397m0433l9317l7294l4721
61414B811648l1693k8118k4187k0285j6414j2212p687l325O29M280P241Q542P873
61401B696292O187M496K684K15k586m819o205p137p617o908m342L1N730J2436
61387B688457K0253K9622M0872N3757O7552Q1767R6437J11665J27290J43193J59275
61376C620140J74775J88165J98210K04598K06970K03898J93631J75595J50526
61367E316508J19543Q3970M5894P978k7637n9931q8619j13807j35922j55330j71789
61356D820858j84656j93616j98859k00569j98710j93518j85737j76236j65636
$$ plain form
61437 2889910 2928231 2967819 3008222 3047970 3085061 3117856 3145459 3167342 3182717 3190397 3189423 3179893
61425 3179893 3162996 3140123 3112105 3079437 3042926 3003810 2963413 2922980 2883663 2846369 2811648
61414 2811648 2779955 2751837 2727650 2707365 2690951 2678739 2671052 2667727 2668356 2672636 2679877 2688419 2696292
61401 2696292 2702479 2706975 2709659 2709874 2707288 2702469 2696264 2689127 2681510 2674602 2670260 2670291 2676021 2688457
61387 2688457 2708710 2738332 2779204 2832961 2900513 2982280 3078717 3190382 3317672 3460865 3620140
61376 3620140 3794915 3983080 4181290 4385888 4592858 4796756 4990387 5165982 5316508
61367 5316508 5436051 5520021 5565915 5573893 5546256 5486325 5397706 5283899 5147977 4992647 4820858
61356 4820858 4636202 4442586 4243727 4043158 3844448 3650930 3465193 3288957 3123321
61347C123321j54303j42507j30458j18297j06123r3950q1857p0240n9693n0399
61337B115494m1854l3419k4998j6951r530k690L745R954J5959K1423K5879K9389
61325B092401L2614L5940L8837M0515M0966M0949M1044M1034M0161L7756L3777
61314B515994K8891K3927J9180J4544J0301P203N539M697L972L308K804K041M44
61301B642845k006m919q081j1432j4862j8378k2171k6130k9683l2526l4988l7245
61289B400424l8747l8983l8256l7095l5413l2999l0295k7798k5180k1896j8332
61278B055430j5311j2739r795o431l622k085j731k432m437p716j1651j5639j9383
61265A942458k2404k3992k3931k2693k0687j7780j3762q755k919L749J1086J8672
$$ plain form
61347 3123321 2969018 2826511 2696053 2577756 2471633 2377683 2295826 2225586 2165893 2115494
61337 2115494 2073640 2040221 2015223 1998272 1988742 1986052 1989797 1999751 2015710 2037133 2063012 2092401
61325 2092401 2125015 2160955 2199792 2240307 2281273 2322222 2363266 2404300 2444461 2482217 2515994
61314 2515994 2544885 2568812 2587992 2602536 2612837 2620040 2625579 2630276 2634248 2637556 2640360 2642401 2642845
61301 2642845 2640839 2635920 2627839 2616407 2601545 2583167 2560996 2534866 2505183 2472657 2437669 2400424
61289 2400424 2361677 2322694 2284438 2247343 2211930 2178931 2148636 2120838 2095658 2073762 2055430
61278 2055430 2040119 2027380 2017585 2011154 2007532 2005447 2003716 2001284 1996847 1989131 1977480 1961841 1942458
61265 1942458 1920054 1896062 1872131 1849438 1828751 1810971 1797209 1788454 1785535 1789284 1800370 1819042
61253A819042K6306L4214M2602N1253N9761O7976P6015Q3892R1104R6576R9340
61242B548081R9403R7367R2850Q3914O8771M7833K3361k494k8439n3234p5326
61231B902087r3510j07127j15569j18519j16845j12290j05943r7876q8543p9533
61221A866332p2254o6549o1347n6086n0848m5527l9811l3890k8518k4159k0377
61210A366966j6252j1268n851j056K337M472N968O937O783N177K824R31N9k69
61196A367758q71k019l283m137m597n169o220p669r290j1014j2707j4029j4955
61183A271798j6109j8136k0735k2841k3760k3738k3407k3093k2731k2168k1303
61172A033777k0140j8797j7335j5719j3996j2404j1036r578p789o132n535o420
$$ plain form
61253 1819042 1845348 1879562 1922164 1973417 2033178 2101154 2177169 2261061 2352165 2448741 2548081
61242 2548081 2647484 2744851 2837701 2921615 2990386 3038219 3061580 3059086 3030647 2977413 2902087
61231 2902087 2808577 2701450 2585881 2467362 2350517 2238227 2132284 2034408 1945865 1866332
61221 1866332 1794078 1727529 1666182 1610096 1559248 1513721 1473910 1440020 1411502 1387343 1366966
61210 1366966 1350714 1339446 1333595 1332539 1334876 1339348 1345316 1352253 1359036 1364213 1367037 1367968 1368027 1367758
61196 1367758 1366887 1364868 1361585 1357448 1352851 1347682 1341462 1333793 1324503 1313489 1300782 1286753 1271798
61183 1271798 1255689 1237553 1216818 1193977 1170217 1146479 1123072 1099979 1077248 1055080 1033777
61172 1033777 1013637 994840 977505 961786 947790 935386 924350 914772 906983 900851 895316 888896
61160H88896q226j0065j1707j3759j6801k0379k3107k4037k3702k3327k3149k2333
61148F68304k0567j8762j7626j6391j3888j0291o919m584l034j803p37L18J511
61135E55531K631L376M027N153O697P956Q642R254J0214J1242J1904J2364J3116
61122F62107J4265J5399J6124J6446J6515J6204J5118J3150J0746Q355N866K983
61110H13278k7k556m523o308p821q517q507q687r397r973j0028j0186j0783j0969
61096G04996j0049q896q812r582r777q712p144o271o775q465j0194j0596r621
61083E90102q739q907r232q591p587p456p847p364n839m367l339k134q05k79o31
61068E06985o84J71J085J194Q03O34Q10J181J777K514L025L239L567M271N103
$$ plain form
61160 888896 880670 870605 858898 845139 828338 807959 784852 760815 737113 713786 690637 668304
61148 668304 647737 628975 611349 594958 581070 570779 563860 559276 556242 554439 553702 554020 555531
61135 555531 558162 561538 565565 570718 577415 585371 594013 603267 613481 624723 636627 648991 662107
61122 662107 676372 691771 707895 724341 740856 757060 772178 785328 796074 804429 810295 813278
61110 813278 813251 810695 806172 799864 792043 783526 775019 766332 756935 746962 736934 726748 715965 704996
61096 704996 694947 686051 677239 667657 657880 649168 642024 635753 628978 620513 610319 599723 590102
61083 590102 581363 572456 563224 554633 547046 539590 531743 524379 518540 514173 510834 508700 507895 507616 506985
61068 506985 506301 506472 507557 508751 509554 510188 510998 512179 513956 516470 519495 522734 526301 530572 535675
61053E35675N693N947O054O413P284Q164Q059O962O336P288Q908R487Q843Q242
61039F39355Q492R363J0554J1894J2863J3131J3345J4201J5175J5397J5302J5973
61027G95045J7263J8144J8577J9355K0433K1151K1923K3849K6742K9372L1632
61016A043486L4655L8645M2454M5484M8224N0762N2539N3846N5923N9447O4483
61005A589948P1682Q1643R3243J04672J15971J28561J42741J58313J77349K03523
60995B867646K38831K83822L40179M09154M88167N74253O71585P90765R41534
60986G605936J134008J385529J706584K061207K346147K432142K243130J800908
60978B2715591J201939N67694K0071l25645l92597j98543J22503L77046M12468
$$ plain form
61053 535675 541368 547315 553369 559782 567066 575230 583289 590251 596587 603875 612783 622270 631113 639355
61039 639355 647847 657210 667764 679658 692521 705652 718997 733198 748373 763770 779072 795045
61027 795045 812308 830452 849029 868384 888817 909968 931891 955740 982482 1011854 1043486
61016 1043486 1078141 1116786 1159240 1204724 1252948 1303710 1356249 1410095 1466018 1525465 1589948
61005 1589948 1661630 1743273 1836516 1941188 2057159 2185720 2328461 2486774 2664123 2867646
60995 2867646 3106477 3390299 3730478 4139632 4627799 5202052 5873637 6664402 7605936
60986 7605936 8739944 10125473 11832057 13893264 16239411 18671553 20914683 22715591
60978 22715591 23917530 24485224 24505295 24179650 23787053 23588510 23711013 24088059 24500527
60969B4500527J80973k69746q42598j424099j901372k188713k260685k157354
60961A3636933j949754j698609j440949j199372r88330q11831o65285n43641m44844
60952C894318l66268l03365k53132k14966j87064j65469j47590j33555j23145
60943A999764j14311j05684r7727r0419q2306p3015o4471n8464n4826n2808n2217
60932A153516n2319n1523m9134m6022m2866l9384l5784l3067l1186k8649k4933
60921G18649k1590j9960j9233j7871j5728j3696j2181j0891r504p946o504n828
60909E57717o087o284n388l988l529m069m251l500k634k158j639r69o42l87P81
60894E12973K647L645L200K649L164M278N252O322P719Q755Q874Q485Q052P385
$$ plain form
60969 24500527 24681500 24411754 23569156 22145057 20243685 18054972 15794287 13636933
60961 13636933 11687179 9988570 8547621 7348249 6359919 5548088 4882803 4339162 3894318
60952 3894318 3528050 3224685 2971553 2756587 2569523 2404054 2256464 2122909 1999764
60943 1999764 1885453 1779769 1682042 1591623 1509317 1436302 1371831 1313367 1258541 1205733 1153516
60932 1153516 1101197 1049674 1000540 954518 911652 872268 836484 803417 772231 743582 718649
60921 718649 697059 677099 657866 639995 624267 610571 598390 587499 577995 570049 563545 557717
60909 557717 551630 545346 539958 535970 532441 528372 524121 520621 517987 515829 514190 513221 512579 512192 512973
60894 512973 515620 519265 522465 525114 528278 532556 537808 544130 551849 560604 569478 577963 586015 593400
60880E93400O527O062N918N057L143J234O6j055k857m730n871o571p426q151q292
60865E76454q189q295q208p333n847m246k584r13K64P69J287K402L750M792N729
60850E49832O939Q173R093R967J1050J1796J1547J0590R918J0159J1219J2616
60838F72899J3735J4101J3765J3086J2108J0626Q958P826P329O854O213N951O276
60825G99727O524O173N479M817M177L607L334L051K107O28n34j333k765n136p314
60810H22542q421r062j0016j0889j1141j1330j2182j3099j2821j1096q707o307
60798F97471m213k836k324j990r93O32K238L531M568N122M858L981L141K678K435
60783G18299K134J668J081N29J33j22j36M12J518K392K396K139K768M176N127
$$ plain form
60880 593400 599927 605989 611907 616964 620107 621341 621407 620352 617495 612765 606894 600323 592897 584746 576454
60865 576454 568265 559970 551762 544429 538582 534336 531752 530839 531103 531872 533159 535561 539311 544103 549832
60850 549832 556771 564944 574037 584004 595054 606850 618397 628987 638905 649064 660283 672899
60838 672899 686634 700735 714500 727586 739694 750320 759278 767104 774433 781287 787500 793451 799727
60825 799727 806251 812424 817903 822720 826897 830504 833838 836889 838996 839624 839090 837757 834992 829856 822542
60810 822542 814121 805059 795043 784154 773013 761683 749501 736402 723581 712485 703778 697471
60798 697471 693258 690422 688098 686108 685115 685747 687985 691516 696084 701206 706064 710045 713186 715864 718299
60783 718299 720433 722101 723182 723711 723844 723722 723586 723998 725516 727908 730304 732443 735211 739387 744514
60768G44514N190N314O149P103P552P776Q085Q198Q116Q493R357R653Q866Q021
60754H52387Q155Q760Q832Q415Q020P411O166M784L976L396K238O65m09o95o34
60739I21467m79j59J02k05j290l014n097p001q179q811r676j0877j1607j1728
60725H43446j2409j4289j6110j6424j5689j5343j5566j5461j4890j4521j4332
60714F78412j3601j2295j1111j0154q850p182n728m376k296N24K926M144M773
60701F15186N668O813P723Q283Q646Q792Q628Q134P133N329K797O9k440m809p206
60686F78746r451j1148j2115j2489j2610j2807j3179j3469j3234j2208j0578q907
60674E36551p661o681n350l537j976j281r48r4J092J692J705K110L127L726L377
$$ plain form
60768 744514 749704 755018 761167 768270 775822 783598 791683 799881 807997 816490 825847 835500 844366 852387
60754 852387 860542 869302 878134 886549 894569 901980 908146 912930 916906 920302 922540 923205 922796 922101 921467
60739 921467 920988 920829 920931 920726 919436 916422 911325 904324 896145 887334 877658 866781 855174 843446
60725 843446 831037 816748 800638 784214 768525 753182 737616 722155 707265 692744 678412
60714 678412 664811 652516 641405 631251 622401 615219 609491 605115 602819 603343 606269 610413 615186
60701 615186 620854 627667 635390 643673 652319 661111 669739 677873 685006 690335 693132 693201 690761 685952 678746
60686 678746 669295 658147 646032 633543 620933 608126 594947 581478 568244 556036 545458 536551
60674 536551 528890 522209 516859 513322 511346 510065 509117 509023 510115 511807 513512 515622 518749 522475 525852
60659E25852K995L389L934L726L125L090L743M558N263N614N010L424K123K318
60645E78164L617M829N726O784P759P898P482P797R414J1516J3081J3868J4115
60632F92050J4045J3830J3519J2972J2260J1827J1798J1576J0696R584Q736P766
60620H30659O237M800M352M378L531J683J31l01j27n6j57m18j054j889k419k803
60604H46547l887n911q083r851j1641j3726j5275j5301j4060j2618j1335r595
60592G15264p060m420k614j654p08P30K113K567K140J832K387L501M351M462L809
60577G26700K616J387P25O03K54q69k342l431m098m805n747o750p676q356q404
60562F79807p685o709o092n772n207m121k656j032N58J964L342N086P157Q919
$$ plain form
60659 525852 528847 532236 536170 539896 543021 546111 549854 554412 559675 565289 570299 573723 575846 578164
60645 578164 581781 586610 592336 599120 606879 614777 622259 630056 639470 650986 664067 677935 692050
60632 692050 706095 719925 733444 746416 758676 770503 782301 793877 804573 814157 822893 830659
60620 830659 836896 841696 846048 850426 853957 855640 855771 855470 855343 855287 855130 854712 853658 851769 849350 846547
60604 846547 842660 836749 828666 818815 807174 793448 778173 762872 748812 736194 724859 715264
60592 715264 708204 703784 701170 699516 698808 699538 701651 704218 706358 708190 710577 714078 718429 722891 726700
60577 726700 729316 730703 731428 732031 732285 731416 729074 725643 721545 716740 710993 704243 696567 688211 679807
60562 679807 672122 665413 659321 653549 648342 644221 641565 640533 641091 643055 646397 651483 658640 667559
60548F67559R980J0813J2179J4467J7880K2610K8259L3752L8379M2266M5262M6138
60536I89544M3709L8096L0043J9790P649m884j5814k4195k9987l2915l2589k9599
60524I58848k5309k0542j5329r781m294R67N918R892J2013J2272J1563J0698R932
60511I56848R337Q992R007R779J1959J5689K0444K6082L3270M2181N1731O1123
60499A256442P1331Q3652R7541J11345J24665J38435J53030J68033J83908K02419
60489B590801K24925K51178K79359L05901L25074L30229L15979K79057K18189
60480E120692J35368L7440o5246j62629k46962l12179l53993l71773l69099l51467
60470C060152l23986k91085k56709k23639j93215j66105j42688j22631j05207
$$ plain form
60548 667559 677539 688352 700531 714998 732878 755488 783747 817499 855878 898144 943406 989544
60536 989544 1033253 1071349 1101392 1121182 1128831 1123947 1108133 1083938 1053951 1021036 988447 958848
60524 958848 933539 912997 897668 887887 883593 884560 890478 900370 912383 924655 936218 946916 956848
60511 956848 966185 975177 984184 993963 1005922 1021611 1042055 1068137 1101407 1143588 1195319 1256442
60499 1256442 1327773 1411425 1508966 1620311 1744976 1883411 2036441 2204474 2388382 2590801
60489 2590801 2815726 3066904 3346263 3652164 3977238 4307467 4623446 4902503 5120692
60480 5120692 5256060 5293500 5228254 5065625 4818663 4506484 4152491 3780718 3411619 3060152
60470 3060152 2736166 2445081 2188372 1964733 1771518 1605413 1462725 1340094 1234887
60461A234887r0365p8552o9292o1176n3515m6871m1568l6901l2287k8087k4759
60450F71514k2173k0203j8954j7955j6232j3715j1542j0409r691q752q005p936
60438E05947q076p731o932n943m677l367k927l834n227n906n610m729l397j646
60424D35945Q8J382K309L007L221K848K345K098J894J516J314J644K232K652K966
60409D67461L383L736L739L477L225L088L127L406L814M198M783N766O530O138
60395E25871M773L767L748L832L166K327K289K829K884K090J105O24O90Q31M76
60380E61302n91j846k496k491k626l398m259m441l918l209k599k051j487q33J1
60365E25068R42J690K152K438K556K471K402K574K808K872L054L655M168L911
$$ plain form
60461 1234887 1144522 1065970 996678 935502 881987 835116 793548 756647 724360 696273 671514
60450 671514 649341 629138 610184 592229 575997 562282 550740 540331 530640 521888 513883 505947
60438 505947 497871 490140 483208 477265 472588 469221 466294 462460 457233 451327 445717 440988 437591 435945
60424 435945 436033 437415 439724 442731 445952 448800 451145 453243 455137 456653 457967 459611 461843 464495 467461
60409 467461 470844 474580 478319 481796 485021 488109 491236 494642 498456 502654 507437 513203 519733 525871
60395 525871 530644 534411 538159 541991 545157 547484 549773 552602 555486 557576 558681 559305 559995 560826 561302
60380 561302 560711 558865 556369 553878 551252 547854 543595 539154 535236 532027 529428 527377 525890 525057 525068
60365 525068 526010 527700 529852 532290 534846 537317 539719 542293 545101 547973 551027 554682 558850 562761
60351E62761L279L290L875L834K681J322N63J45l09n90o86j149k018k363j608
60336E73027m24L14N87P37P89Q97J545K648L273K972K525K734L340L753L959M004
60320F06680L438K101O67k41p96j256j445j517k178l428m146l775l248l333l257
60305E84266k257j284j639k745k975k134j507j754k288k636k996l316l039j990
60291E51706p14K15N92M32O1J44R47J856K259K494L136L870L987L623L519L826
60275E81953M111M336M806N354N539N611O261P476Q446Q766Q865R241R945J0889
60261F81599J2033J3190J4228J5403J7025J8877K0480K1820K3225K4807K6505
60250H89192K8527L1130L4109L7098M0171M3656M7595N1923N6863O2534O8466
$$ plain form
60351 562761 566040 569330 573205 577039 579720 581042 581605 581750 581441 580851 580165 579016 576998 574635 573027
60336 573027 572603 572917 573504 574241 575030 575927 577472 580120 583393 586365 588890 591624 594964 598717 602676 606680
60320 606680 610118 612219 612886 612645 611849 610593 609148 607631 605453 602025 597879 594104 590856 587523 584266
60305 584266 582009 580725 579086 576341 573366 571232 569725 567971 565683 563047 560051 556735 553696 551706
60291 551706 550992 551207 551799 552231 552292 552436 553383 555239 557498 559992 563128 566998 570985 574608 578127 581953
60275 581953 586064 590400 595206 600560 606099 611710 617971 625447 633893 642659 651524 660765 670710 681599
60261 681599 693632 706822 721050 736453 753478 772355 792835 814655 837880 862687 889192
60250 889192 917719 948849 982958 1020056 1060227 1103883 1151478 1203401 1260264 1322798 1391264
60239A391264P4148P9673Q5091Q9505R1744R1796R0661Q8882Q5963Q1355P5123
60228B325205O7520N8630M8646L8018K7023J5679M207o742j6405k4333l0452l4977
60216B472019l8143l9830l9531l6854l1951k5403j7933j0172k286O240J5896K6196
60204B278248L6118M5572N5467O5975P5816Q3834R0277R5648R9193R9614R6633
60193C122395R0852Q2591P1911N9397M5836L1293J5510j027j7169l2138m5738
60182C423713n7729o7698p5349q0329q2131q0695p6705p0663o2301n1645l9912
60171B678556k8380j6781m041R760K3190L4985M4785N2575N8426O2607O5011O4554
60159C045247O0175N2329M2702L2576K2218J1685J177r197j9194k8012l4889l9831
$$ plain form
60239 1391264 1465412 1545085 1630176 1719681 1811425 1903221 1993882 2082764 2168727 2250082 2325205
60228 2325205 2392725 2451355 2500001 2538019 2565042 2580721 2584928 2578186 2561781 2537448 2506996 2472019
60216 2472019 2433876 2394046 2354515 2317661 2285710 2260307 2242374 2232202 2229916 2236156 2252052 2278248
60204 2278248 2314366 2359938 2415405 2481380 2557196 2641030 2731307 2826955 2926148 3025762 3122395
60193 3122395 3213247 3295838 3367749 3427146 3472982 3504275 3519785 3518758 3501589 3469451 3423713
60182 3423713 3365984 3298286 3222937 3142608 3060477 2979782 2903077 2832414 2770113 2718468 2678556
60171 2678556 2650176 2633395 2629354 2639114 2662304 2697289 2742074 2794649 2853075 2915682 2980693 3045247
60159 3045247 3105422 3157751 3200453 3233029 3255247 3266932 3268109 3258912 3239718 3211706 3176817 3136986
60147C136986m2912m3291m0029l3645k5643j6621o025O285J9524L3214M7747O3380
60135C098970P9705R6480J14021J32357J50779J68624J85930K02920K19443K35063
60125D684292K49187K60924K69405K74367K75975K73954K67458K55814K38944
60116G050320K17106J90757J60651J27553R1956N4467J6171k1986n9825r7228
60106G729942j33075j65737j94325k18522k37372k49331k53718k51239k42946
60097E783677k29408k11102j88927j64107j37962j11662q5729o0025l4649j0530
60087D549576J1566L1990N1321O8933Q3498R4483J01983J05379J03513R6187Q4285
60076E382714O8441M8893K6781M225j7378l8083n8104p6878r3873j09261j23151
$$ plain form
60147 3136986 3094074 3050783 3010754 2977109 2951466 2934845 2928820 2935105 2954629 2987843 3035590 3098970
60135 3098970 3178675 3275155 3389176 3521533 3672312 3840936 4026866 4229786 4449229 4684292
60125 4684292 4933479 5194403 5463808 5738175 6014150 6288104 6555562 6811376 7050320
60116 7050320 7267426 7458183 7618834 7746387 7838343 7892810 7908981 7886995 7827170 7729942
60106 7729942 7596867 7431130 7236805 7018283 6780911 6531580 6277862 6026623 5783677
60097 5783677 5554269 5343167 5154240 4990133 4852171 4740509 4654780 4594755 4560106 4549576
60087 4549576 4561142 4593132 4644453 4713386 4796884 4891367 4993350 5098729 5202242 5298429 5382714
60076 5382714 5451155 5500048 5526829 5531054 5513676 5475593 5417489 5340611 5246738 5137477 5014326
60065E014326j34857j43501j48830j51028j50250j46713j40771j32632j22311
60056C743433j09977r6018q0884o5173m9675l4770k0003m781J0808K6394M1942
60045C361296N7190P1037Q2535R1943R9728J05019J06382J03627R7457Q7769P4012
60034D337995N7094L9014K0507Q18j9963m0161n8540p5261r0205j02085j10136
60023C959077j15085j17489j16612j12045j05046r7008q7670p6212o3215n0198
60013C018497l7816k5626j3224n11J2728K6615M0755N4785O9028Q3862R8835J12995
60001C440923J25803J37037J45998J51357J51766J46466J35584J20070J01035
59992D656039P9127N4931K9695M884j9070m2644o5689q6909j05018j19467j29723
$$ plain form
60065 5014326 4879469 4735968 4587138 4436110 4285860 4139147 3998376 3865744 3743433
60056 3743433 3633456 3537438 3456554 3391381 3341706 3306936 3286933 3282152 3292960 3319354 3361296
60045 3361296 3418486 3489523 3572058 3664001 3763729 3868748 3975130 4078757 4176214 4263983 4337995
60034 4337995 4395089 4434103 4454610 4455428 4435465 4395304 4336764 4261503 4171298 4069213 3959077
60023 3959077 3843992 3726503 3609891 3497846 3392800 3295792 3208122 3131910 3068695 3018497
60013 3018497 2980681 2955055 2941831 2941320 2954048 2980663 3021418 3076203 3145231 3229093 3327928 3440923
60001 3440923 3566726 3703763 3849761 4001118 4152884 4299350 4434934 4555004 4656039
59992 4656039 4735166 4790097 4819792 4824676 4805606 4762962 4697273 4610364 4505346 4385879 4256156
59981D256156j34983j35163j31240j24054j13650j00332q5383o9997n4315l8194
59971C268845k2159o788Q105K2844L6976M9711O0831P0548P8923Q5943R1578R5186
59959C840543R5509R1956Q5452P7492O8691N8811M7664L5418K2516R871j314j0376
59947D422233j7448k2488k4683k3287j8477j0745M7J4406L2259N2833P5270R9074
59935D578994J24182J50845J79058K08054K36751K64570K91114L14998L33881
59926F682447L45785L49399L42989L24293K92140K47279J91182J25221N1832k4564
59916H928003r8802j66664k24946k71029l03571l23128l31230l29236l18525l01001
59906F259871k78562k52548k24253j95201j66239j37138j07831p9222n1973k5462
$$ plain form
59981 4256156 4121173 3986010 3854770 3730716 3617066 3516734 3431351 3361354 3307039 3268845
59971 3268845 3246686 3239898 3248003 3270847 3307823 3357534 3418365 3488913 3567836 3653779 3745357 3840543
59959 3840543 3936052 4028008 4113460 4190952 4259643 4318454 4366118 4401536 4424052 4433923 4432609 4422233
59947 4422233 4404785 4382297 4357614 4334327 4315850 4305105 4305152 4319558 4351817 4404650 4479920 4578994
59935 4578994 4703176 4854021 5033079 5241133 5477884 5742454 6033568 6348566 6682447
59926 6682447 7028232 7377631 7720620 8044913 8337053 8584332 8775514 8900735 8952567 8928003
59916 8928003 8829201 8662537 8437591 8166562 7862991 7539863 7208633 6879397 6560872 6259871
59906 6259871 5981309 5728761 5504508 5309307 5143068 5005930 4898099 4818877 4766904 4741442
59896D741442J059K7029N1451P4439R6602J17318J34996J48732J58426J63359
59886E714853J61874J52671J35477J10449P7961L9231l443m7377q9993j28804
59876F122899j61627j87156k05001k15262k18313k15057k07009j96044j83920
59867D333510j71718j59604j47588j36530j27741j21369j15862j09531j02022
59858C141545r3848q5201p5932o6135n6053m5733l5316k5349j6370q626k518J151
59846B631615J868k42m977j2232k1084k9650l6507m1587m5030m6085m4137m0087
59834B311865l5577l1316k7130k3190k0039j7564j4972j1709p671k660L495J0379
59822B133911J7230K3710K9863L5447L9862M2683M3856M3561M2201M0170L7241
$$ plain form
59896 4741442 4742501 4769530 4820981 4895420 4992022 5109340 5244336 5393068 5551494 5714853
59886 5714853 5876727 6029398 6164875 6275324 6353285 6392516 6389073 6341696 6251703 6122899
59876 6122899 5961272 5774116 5569115 5353853 5135540 4920483 4713474 4517430 4333510
59867 4333510 4161792 4002188 3854600 3718070 3590329 3468960 3353098 3243567 3141545
59858 3141545 3047697 2962496 2886564 2820429 2764376 2718643 2683327 2657978 2641608 2632982 2630464 2631615
59846 2631615 2633483 2633241 2628264 2616032 2594948 2565298 2528791 2487204 2442174 2396089 2351952 2311865
59834 2311865 2276288 2244972 2217842 2194652 2174613 2157049 2142077 2130368 2122697 2120037 2123532 2133911
59822 2133911 2151141 2174851 2204714 2240161 2280023 2322706 2366562 2410123 2452324 2492494 2529735
59811B529735L2700K6459J9528J2909O660O64m357p431q409p676n174n61O007
59798B601054J3980K3060L3213M4386N6837P1251Q7988J06616J26710J48539J72386
59787C486020J97923K24866K53235K81737L06170L20438L18833K97024K52264
59778E938510J84914J00218P634q2100j59635k18497k56089k73747k74984k63509
59768D702715k42935k17282j90146j63343j37266j12417q9704o9547n1761l6256
59758C392058k2937j1056L66J1494K1919L1869M2268N3615O5558P7634Q9709J01811
59746C854308J14176J27376J41791J57193J73407J90996K10465K31313K52878
59737E453903K75723L01061L28877L57682L86059M13341M38661M60341M76477
$$ plain form
59811 2529735 2562435 2588894 2608422 2621331 2627991 2628655 2624298 2616867 2608458 2600782 2595608 2595047 2601054
59798 2601054 2615034 2638094 2671307 2715693 2772530 2843781 2931769 3038385 3165095 3313634 3486020
59787 3486020 3683943 3908809 4162044 4443781 4749951 5070389 5389222 5686246 5938510
59778 5938510 6123424 6223642 6231276 6149176 5989541 5771044 5514955 5241208 4966224 4702715
59768 4702715 4459780 4242498 4052352 3889009 3751743 3639326 3549622 3480075 3428314 3392058
59758 3392058 3369121 3358065 3358431 3369925 3391844 3423713 3465981 3519596 3585154 3662788 3752497 3854308
59746 3854308 3968484 4095860 4237651 4394844 4568251 4759247 4969712 5201025 5453903
59737 5453903 5729626 6030687 6359564 6717246 7103305 7516646 7955307 8415648 8892125
59728H892125M85436M85729M76225M56819M28625L93707L55242L17618K85392
59719A2576918K61915K49181K48317K59211K79917L07496L39474L73618M06583
59710A5302630M33921M51682M57327M49171M25970L87432L34574K69573J95820
59701A8708100J17958M1049l0551r3285j43900j79733j99478k03063j91016j64522
59691A7661559j25641p6594j8935M6004J16321J90190K66832L45905M26156N05500
59681A9337297N82010O53607P16903P67276P99717Q08557P86983P28677O30601
59672B5811628M93942L23313J26839q3259k92354m86864o55980p91025q85693
59663B3560547r37957r50680r29809q82959q19926p52645o92815o49294o27129
$$ plain form
59728 8892125 9377561 9863290 10339515 10796334 11224959 11618666 11973908 12291526 12576918
59719 12576918 12838833 13088014 13336331 13595542 13875459 14182955 14522429 14896047 15302630
59710 15302630 15736551 16188233 16645560 17094731 17520701 17908133 18242707 18512280 18708100
59701 18708100 18826058 18867107 18836556 18743271 18599371 18419638 18220160 18017097 17826081 17661559
59691 17661559 17535918 17459324 17440389 17486393 17602714 17792904 18059736 18405641 18831797 19337297
59681 19337297 19919307 20572914 21289817 22057093 22856810 23665367 24452350 25181027 25811628
59672 25811628 26305570 26628883 26755722 26672463 26380109 25893245 25237265 24446240 23560547
59663 23560547 22622590 21671910 20742101 19859142 19039216 18286571 17593756 16944462 16317333
59654A6317333o27304o46198o76161p07993p33510p46678p44157p25910o94806
59645A0014616o54748o09223n61282n13686m68199m25244l84842l47492l13749
59636E736151k83447k55843k30292k06547j84722j65054j47455j31171j15377
59627D016243j00098q6071p3675o2602n2623m4064l7266l2102k8218k5469k4032
59616C450023k4395k7133l2259l8992m6407n4080o1583o7884p2010p4077p4866
59605B876337p4634p3064p0174o6373o1689n5873m9211m2505l6214l0258k4523
59594B291819j8935j3344p940l401J94M001Q906J3920J7296J8871J9881K0767
59582B352035K0734J9483J7878J6693J6066J6360J8144K1083K4160K7322L1544
$$ plain form
59654 16317333 15690029 15043831 14367670 13659677 12926167 12179489 11435332 10709422 10014616
59645 10014616 9359868 8750645 8189363 7675677 7207478 6782234 6397392 6049900 5736151
59636 5736151 5452704 5196861 4966569 4760022 4575300 4410246 4262791 4131620 4016243
59627 4016243 3916145 3830074 3756399 3693797 3641174 3597110 3559844 3527742 3499524 3474055 3450023
59616 3450023 3425628 3398495 3366236 3327244 3280837 3226757 3165174 3097290 3025280 2951203 2876337
59605 2876337 2801703 2728639 2658465 2592092 2530403 2474530 2425319 2382814 2346600 2316342 2291819
59594 2291819 2272884 2259540 2251600 2248199 2248393 2252394 2261300 2275220 2292516 2311387 2331268 2352035
59582 2352035 2372769 2392252 2410130 2426823 2442889 2459249 2477393 2498476 2522636 2549958 2581502
59571B581502L6962M2483M7676N3611O1025O9093P6876Q4829R3890J04034J14776
59560C366757J26352J39218J52882J66174J78541J90286K01628K12033K20490
59551D954361K26116K28436K27256K22531K14618K04501J92944J79064J60721
59542F810548J37069J10002Q2272N5118K8951N385j3327k6613l5580m0796m1581
59531G071448l7498k8871j5665K588K5456N1434P9042J06728J31754J50845J62016
59520G699277J64314J56025J35342J02993O2045J4755l8242r5064j51493k03814
59510G846138k50669k90920l21921l41615l50670l50820l42551l26122l03600
59501D967250k78086k51691k25495k00511j77223j55033j33424j12987r4233p6514
$$ plain form
59571 2581502 2618464 2660947 2708623 2762234 2823259 2892352 2969228 3054057 3147947 3251981 3366757
59560 3366757 3493109 3632327 3785209 3951383 4129924 4320210 4521838 4733871 4954361
59551 4954361 5180477 5408913 5636169 5858700 6073318 6277819 6470763 6649827 6810548
59542 6810548 6947617 7057619 7139891 7195009 7223960 7229345 7216018 7189405 7153825 7113029 7071448
59531 7071448 7033950 7005079 6989414 6992002 7017458 7068892 7147934 7254662 7386416 7537261 7699277
59520 7699277 7863591 8019616 8154958 8257951 8319996 8334751 8296509 8201445 8049952 7846138
59510 7846138 7595469 7304549 6982628 6641013 6290343 5939523 5596972 5270850 4967250
59501 4967250 4689164 4437473 4211978 4011467 3834244 3679211 3545787 3432800 3338567 3262053
59491C262053n9224m3032k8569j4942r28J3303K7150M1274N6646P2696Q8069J02754
59479C517250J17778J33150J47740J61030J73409J84623J93336J98310J98960
59470E025586J94551J83899J66169J41345J09941P2987L2223j0357n3155r4701
59460E768488j32971j65749j91723k10855k23740k31025k33196k30593k23739
59451C924897k13749k02004j89225j75474j61168j47338j34505j22202j10082
59442B469150r8712q8602p9209o9704o0231n1701m4669l8904l3698k8296k2552
59431A852872j7248j3233j0073o570k585P69L095N442Q617J1993J4782J7091J8899
59418A883851J9235J7538J4720J1908R192O682N651P338J1462J7165K4405L3028
$$ plain form
59491 3262053 3202829 3159797 3131228 3116286 3115358 3128661 3155811 3197085 3253731 3326427 3414496 3517250
59479 3517250 3635028 3768178 3915918 4076948 4250357 4434980 4628316 4826626 5025586
59470 5025586 5220137 5404036 5570205 5711550 5821491 5894478 5926701 5916344 5863189 5768488
59460 5768488 5635517 5469768 5278045 5067190 4843450 4612425 4379229 4148636 3924897
59451 3924897 3711148 3509144 3319919 3144445 2983277 2835939 2701434 2579232 2469150
59442 2469150 2370438 2281836 2202627 2132923 2072692 2020991 1976322 1937418 1903720 1875424 1852872
59431 1852872 1835624 1822391 1812318 1805748 1803163 1803932 1807027 1812469 1821086 1833079 1847861 1864952 1883851
59418 1883851 1903086 1920624 1935344 1947252 1956444 1963126 1968777 1976115 1987577 2004742 2029147 2062175
59406B062175M1337M7195N0186N1413N1729N1540N1938N4519O0004O8002P8038
59395B668076Q9973J03656J18919J35728J53778J72428J91638K12434K35786K61660
59385D344076K89680L19782L51392L82786M12168M38524M60509M75466M80777
59376G955160M75545M60121M35026M01731L63531L24053K85214K47740K12924
59367A1161045J82242J55608J31464J08326Q5112O0260L1928r34l8471q0445j25819
59356A1670316j72268k17214k59107k96882l28900l53783l71891l84817l93663
59347H891791l98727m00318l98605l93012l82990l69137l52563l33552l11965
59338E550922k88483k64431k40691k17771j96415j76898j58305j39660j21388
$$ plain form
59406 2062175 2103512 2150707 2200893 2252306 2304035 2355575 2407513 2462032 2522036 2590038 2668076
59395 2668076 2758049 2861705 2980624 3116352 3270130 3442558 3634196 3846630 4082416 4344076
59385 4344076 4633756 4953538 5304930 5687716 6099884 6538408 6998917 7474383 7955160
59376 7955160 8430705 8890826 9325852 9727583 10091114 10415167 10700381 10948121 11161045
59367 11161045 11343287 11498895 11630359 11738685 11823797 11884057 11915985 11915051 11876580 11796135 11670316
59356 11670316 11498048 11280834 11021727 10724845 10395945 10042162 9670271 9285454 8891791
59347 8891791 8493064 8092746 7694141 7301129 6918139 6549002 6196439 5862887 5550922
59338 5550922 5262439 4998008 4757317 4539546 4343131 4166233 4007928 3868268 3746880
59329C746880j04521q9119p4693o1510m9986l9300k8211j6978o882J870J0304
59318C287854J8828K6738L3474L9023M3154M5533M6489M6522M5161M1660L6540
59307C710976L1028K5173J7924R106j50q866j6747k3230k7499k9655l0545l0170
59295C627345k7431k1715j3684m290O002J6972K8522M0875N4094O7614Q1004R4649
59283C949957J08455J20348J27480J28775J25045J17017J04928Q9872P3723N7343
59273E002943M0314K2679N534j0269k4645l7165m6877n3609n8265o1391o2619
59262D716630o1880o0067n8124n6427n5366n5519n6855n8672o0543o2571o4619
59251D065987o6207o7266o8077o8338o7173o4141n9474n3360m5760l6838k6686
$$ plain form
59329 3746880 3642359 3553240 3478547 3417037 3367051 3327751 3299540 3282562 3275680 3277550 3287854
59318 3287854 3306682 3333420 3366894 3405917 3449071 3494604 3541093 3587615 3632776 3674436 3710976
59307 3710976 3742004 3767177 3785101 3794207 3794057 3785191 3768444 3745214 3717715 3688060 3657515 3627345
59295 3627345 3599914 3578199 3564515 3560225 3566227 3583199 3611721 3652596 3706690 3774304 3855308 3949957
59283 3949957 4058412 4178760 4306240 4435015 4560060 4677077 4782005 4871877 4945600 5002943
59273 5002943 5043257 5065936 5071470 5061201 5036556 4999391 4952514 4898905 4840640 4779249 4716630
59262 4716630 4654750 4594683 4536559 4480132 4424766 4369247 4312392 4253720 4193177 4130606 4065987
59251 4065987 3999780 3932514 3864437 3796099 3728926 3664785 3605311 3551951 3506191 3469353 3442667
59240C442667j4896j244J3621K9192M6280O5920Q7605J09983J32940J57436J83566
59229D253070K10415K37586K64952K90847L12193L26721L33438L30773L16172
59220F876167K88148K47336J95153J32878O2589j2363q8316j61655k28253k84145
59210G027539l27326l57711l75286l79912l73088l57990l37104l11434k82572
59201C925116k53668k27189k03065j80146j58407j38788j21855j07534r5404q4703
59191B354357p4756o5822n8661n3038m7700m2078l6749l1919k6789k0993j5379
59180A880473j0701o640k708R25M051O879R490J1812J4352J7824K1838K5327K8463
59167B001385L2519L7507M1690M4178M6273M9317N2723N5308N7188N9094O0896
$$ plain form
59240 3442667 3427771 3426527 3440148 3469340 3515620 3581540 3669145 3779128 3912068 4069504 4253070
59229 4253070 4463485 4701071 4966023 5256870 5569063 5895784 6229222 6559995 6876167
59220 6876167 7164315 7411651 7606804 7739682 7802271 7789908 7701592 7539937 7311684 7027539
59210 7027539 6700213 6342502 5967216 5587304 5214216 4856226 4519122 4207688 3925116
59201 3925116 3671448 3444259 3241194 3061048 2902641 2763853 2641998 2534464 2439060 2354357
59191 2354357 2279601 2213779 2155118 2102080 2054380 2012302 1975553 1943634 1916845 1895852 1880473
59180 1880473 1869772 1863132 1860424 1861349 1865400 1872279 1881769 1893581 1907933 1925757 1947595 1972922 2001385
59167 2001385 2033904 2071411 2113101 2157279 2203552 2252869 2305592 2360900 2418088 2477182 2538078
59156B538078O1946O2044O1011N8100N2836M5766L7801K9377K0740J2129L284
59145B983112o178j5456k2894k8091l2385l6601l9710m0569l9514l7253l3518
59134B650943k8102k1987j6133j0073k951M878J2578K0403K9249L9098M9030N8574
59122B785507O8070P7938Q8229R8649J08583J17468J25461J33151J40508J46910
59112C890474J52390J57736J63003J67184J69928J72239J74688J76118J74973
59103E398733J70723J62910J49849J29628J01790O7204K7007j7305o3439j08916
59093F018184j51721j89750k20523k42460k55931k62362k62855k58252k49694
59084C924636k38263k24604k09556j94413j79906j65744j51767j38770j27414
$$ plain form
59156 2538078 2600024 2662068 2723079 2781179 2834015 2879781 2917582 2946959 2967699 2979828 2983112
59145 2983112 2976934 2961478 2938584 2910493 2878108 2841507 2801797 2761228 2721714 2684461 2650943
59134 2650943 2622841 2600854 2584721 2574648 2571697 2576575 2589153 2609556 2638805 2677903 2726933 2785507
59122 2785507 2853577 2931515 3019744 3118393 3226976 3344444 3469905 3603056 3743564 3890474
59112 3890474 4042864 4200600 4363603 4530787 4700715 4872954 5047642 5223760 5398733
59103 5398733 5569456 5732366 5882215 6011843 6113633 6180837 6207844 6190539 6127100 6018184
59093 6018184 5866463 5676713 5456190 5213730 4957799 4695437 4432582 4174330 3924636
59084 3924636 3686373 3461769 3252213 3057800 2877894 2712150 2560383 2421613 2294199
59075B294199j17251j07566r8411r0029q2118p4505o7784o2296n7283n1948m6672
59064A438336m2303l8859l5811l3034l0549k7863k4512k0888j7797j5537j3949
59053A137234j2948j2333j1608j0497r281q210p185o329o121o437o225m708k318
59040A033034O8K156M152O334R024J2266J5265J7010J7715J8575J9844K0258J8852
59027A194553J6188J3288J0498Q019O387N679N211M613M343M598M848M852N042
59014A288119N365N056M082L555M048M705M624L801K192n76l945o419p638q858
59000A298111j0582j1447j0521q946q049p449o364n208m428l257j192O73J305
58987A222646J386J834K070J376O98J305K759L886M737N957P192P842Q414R547
$$ plain form
59075 2294199 2176948 2069382 1970971 1880942 1798824 1724319 1656535 1594239 1536956 1485008 1438336
59064 1438336 1396033 1357174 1321363 1288329 1257780 1229917 1205405 1184517 1166720 1151183 1137234
59053 1137234 1124286 1111953 1100345 1089848 1080567 1072357 1065172 1058843 1052722 1046285 1040060 1035352 1033034
59040 1033034 1033102 1035258 1039410 1045744 1054768 1067034 1082299 1099309 1117024 1135599 1155443 1175701 1194553
59027 1194553 1210741 1224029 1234527 1242546 1248933 1254612 1259823 1264436 1268779 1273377 1278225 1283077 1288119
59014 1288119 1293484 1298540 1302622 1306177 1310225 1314930 1319554 1323355 1325547 1324971 1321026 1314607 1306969 1298111
59000 1298111 1287529 1276082 1265561 1256615 1248566 1241117 1234753 1229545 1225117 1221860 1220668 1221341 1222646
58987 1222646 1224032 1225866 1227936 1229312 1230010 1231315 1234074 1237960 1242697 1248654 1255846 1263688 1272102 1281649
58973A281649J0671J1217J2090J4244J6888J8867K0696K3347K6102K7686K8593
58962A492050L0078L1644L1750L0501K9411K8819K7755K6151K5097K4939K4964
58951A803159K5115K6191K8398L1159L4406L8486M2872M6532M9550N3028N7419
58940B236315O2269O7419P3071P8816Q4060Q9293R5661J03375J11832J21041J31649
58929C254801J43737J56928J71481J87949K05895K24324K43223K63477K85428
58920E137243L08730L33512L60334L89044M18785M48995M79329N08707N35395
58911H920074N57856N74594N83405N81616N66723N36276M88020M21393L38359
58902A3568316K42148J36097K4594q6317j90964k85879l68349m34609m81488n09176
$$ plain form
58973 1281649 1292320 1303537 1315627 1329871 1346759 1365626 1386322 1409669 1435771 1463457 1492050
58962 1492050 1522128 1553772 1585522 1616023 1645434 1674253 1702008 1728159 1753256 1778195 1803159
58951 1803159 1828274 1854465 1882863 1914022 1948428 1986914 2029786 2076318 2125868 2178896 2236315
58940 2236315 2298584 2366003 2439074 2517890 2601950 2691243 2786904 2890279 3002111 3123152 3254801
58929 3254801 3398538 3555466 3726947 3914896 4120791 4345115 4588338 4851815 5137243
58920 5137243 5445973 5779485 6139819 6528863 6947648 7396643 7875972 8384679 8920074
58911 8920074 9477930 10052524 10635929 11217545 11784268 12320544 12808564 13229957 13568316
58902 13568316 13810464 13946561 13971155 13884838 13693874 13407995 13039646 12605037 12123549 11614373
58892A1614373n20543n18710n07203m91382m76741m65433m56072m46553m35313
58883G296423m20492m00603l76421l50346l23697k96338k68969k43716k21987
58874D393854k03314j86609j71215j56548j42259j28970j17543j07568r7817q8115
58864B993896p9377p1842o4741n7730n1299m5673m0530l5733l1210k6339k0656
58853B468766j4811r640m734O89O114J0537J4388J8920K4138K9110L3908L9313
58841B616698M4891M9471N3417N8306O4309O9996P4911Q0455Q7748R6430J05887
58830C402519J16028J26543J36969J47837J60372J74874J90776K08206K27915
58821D892039K49630K72254K95803L21521L49842L79774M10438M41583M72279
$$ plain form
58892 11614373 11093830 10575120 10067917 9576535 9099794 8634361 8178289 7731736 7296423
58883 7296423 6875931 6475328 6098907 5748561 5424864 5128526 4859557 4615841 4393854
58874 4393854 4190540 4003931 3832716 3676168 3533909 3404939 3287396 3179828 3082011 2993896
58864 2993896 2914519 2842677 2777936 2720206 2668907 2623234 2582704 2546971 2515761 2489422 2468766
58853 2468766 2453955 2444315 2439581 2440270 2446384 2456921 2471309 2490229 2514367 2543477 2577385 2616698
58841 2616698 2661589 2711060 2764477 2822783 2887092 2957088 3031999 3112454 3200202 3296632 3402519
58830 3402519 3518547 3645090 3782059 3929896 4090268 4265142 4455918 4664124 4892039
58821 4892039 5141669 5413923 5709726 6031247 6381089 6760863 7171301 7612884 8085163
58812H085163N00587N24734N43281N54061N54318N41903N15162M72047M11113
58803A2702369L33300K41384J38200K7328q5121j91961k88515l72876m42895m95548
58793A1565665n29772n47548n51320n42245n21748m92816m58546m20558l79441
58784G121671l35713k89747k41787j92310j42163r3452n1877k6992k7237n3907
58774E666486j00879j59040k18839k70156l04384l18483l15178k98877k73469
58765C407181k43642k14555j88589j64741j42220j22295j05726r1071p7142o4923
58755A992277n5558m8257m1742l6094l1734k8113k4682k1882k0065j8699j7601
58744A647850j7601j9080k1179k3215k5511k8142l0320l1836l3487l5301l5876
$$ plain form
58812 8085163 8585750 9110484 9653765 10207826 10762144 11304047 11819209 12291256 12702369
58803 12702369 13035669 13277053 13415253 13442581 13357460 13165499 12876984 12504108 12061213 11565665
58793 11565665 11035893 10488345 9937025 9394780 8873032 8380216 7921670 7501112 7121671
58784 7121671 6785958 6496211 6254424 6062114 5919951 5826499 5774622 5747630 5720393 5666486
58774 5666486 5565607 5406567 5187728 4917572 4613188 4294705 3979527 3680650 3407181
58765 3407181 3163539 2948984 2760395 2595654 2453434 2331139 2225413 2134342 2057200 1992277
58755 1992277 1936719 1888462 1846720 1810626 1778892 1750779 1726097 1704215 1684150 1665451 1647850
58744 1647850 1630249 1611169 1589990 1566775 1541264 1513122 1482802 1450966 1417479 1382178 1346302
58733A346302l4423l2039l0004k8198k6087k4049k2688k1902k1295k0669j9742
58722A065206j8428j7525j7761j8166j7016j4500j2597j2058j1496r956q346p658
58710H99699p537p437p493p645p457p260p867q796q661p535o959p224o886n490
58696G95452m390m179l677k316j252j043m44J385L581N518P952J1089J3663J5134
58682H36473J6874J9891K3322K6439L0301L6016M3103N0767N9239O8888P9637
58671A290950R2302J08741J29698J53767J78437J99578K09397J98321J61433J02167
58661B824791K9442m6411j14689j65735j94919k04237j98676j82676j60662j37644
58651A448584j16565r6942p8005o1322m8534l8697l0015k2438j6520j1458o399
$$ plain form
58733 1346302 1311879 1279840 1249836 1221638 1195551 1171502 1148814 1126912 1105617 1084948 1065206
58722 1065206 1046778 1029253 1011492 993326 976310 961810 949213 937155 925659 915703 907357 899699
58710 899699 892162 884725 877232 869587 862130 854870 847003 838207 829546 822011 815052 807828 800942 795452
58696 795452 791062 786883 783206 780890 779638 778595 778151 779536 783117 788635 796587 807676 821339 836473
58682 836473 853347 873238 896560 922999 953300 989316 1032419 1083186 1142425 1211313 1290950
58671 1290950 1383252 1491993 1621691 1775458 1953895 2153473 2362870 2561191 2722624 2824791
58661 2824791 2854233 2807822 2693133 2527398 2332479 2128242 1929566 1746890 1586228 1448584
58651 1448584 1332019 1235077 1157072 1095750 1047216 1008519 978504 956066 939546 928088 921689
58640I21689k096P08L108O344R820J2624J5475J9313K3430K6867L0282L4675L9573
58627A141812M4261M9438N5972O3270P0520P8331Q7616R8097J09144J20738J32385
58616B051584J42749J51507J59737J67232J71432J70302J64087J52716J34069
58607C465415J06955P3818L8244J808l4564o8248r6552j19105j36371j47371j51267
58596B932762j49787j45655j39819j32238j24032j16589j09634j02226r4597q7294
58586A730891p9856p2088o5181n9751n4359m7763m1065l5681l0976k5897k1232
58575A197042j8020j5322j1798p951m764j699J757M248M572M003M288M942M780
58562A166078M567N697P865J0482J4905K2560L2190M1322M8976N4330N4297M5583
$$ plain form
58640 921689 919593 920301 923409 929753 939573 952197 967672 986985 1010415 1037282 1067564 1102239 1141812
58627 1141812 1186073 1235511 1291483 1354753 1425273 1503604 1591220 1689317 1798461 1919199 2051584
58616 2051584 2194333 2345840 2505577 2672809 2844241 3014543 3178630 3331346 3465415
58607 3465415 3572370 3646188 3684432 3686240 3651676 3583428 3486876 3367771 3231400 3084029 2932762
58596 2932762 2782975 2637320 2497501 2365263 2241231 2124642 2015008 1912782 1818185 1730891
58586 1730891 1651035 1578947 1513766 1454015 1399656 1351893 1310828 1275147 1244171 1218274 1197042
58575 1197042 1179022 1163700 1151902 1143951 1139187 1137488 1139245 1143493 1148065 1152068 1156356 1161298 1166078
58562 1166078 1170645 1176342 1184207 1194689 1209594 1232154 1264344 1305666 1354642 1408972 1463269 1508852
58550A508852K8508O538j6916l9048n6538o6967p0840p0116o5633n7928m9121
58539A050791m1487l5069k8941k3689k0448j8606j6756j4941j3923j3405j2925
58528H10601j3188j4562j5643j5377j4985j5754j6627j6151j4976j4163j2918
58517F46257j0499q407q024p905o221m058l469l930l672k883k659k422j291m50
58503E80367j226k360k050j014p10l62J219K795K870K711L900M905L665J640J487
58488E97837K466K118Q51P68J451J019J42Q01K183J979Q13J295L411M863N232
58473F27229N901O535N532L413K092J426l5j840k697l558n906q232q142o726o714
58458F08278p588o869n121m967o077n788m089l338l568k706r90n52r94M0K213
$$ plain form
58550 1508852 1537360 1543898 1526982 1487934 1431396 1364429 1293589 1223473 1157840 1099912 1050791
58539 1050791 1009304 974235 945294 921605 901157 882551 865795 850854 836931 823526 810601
58528 810601 797413 782851 767208 751831 736846 721092 704465 688314 673338 659175 646257
58517 646257 635758 627351 619327 611422 605201 601143 597674 593744 590072 587189 584530 582108 580817 580367
58503 580367 579141 576781 574731 573717 573007 572645 573864 576659 579529 582240 586140 591045 594710 596350 597837
58488 597837 600303 602421 603272 604040 605491 606510 606652 607453 609636 611615 612428 613723 617134 621997 627229
58473 627229 633130 639665 645197 648610 650702 652128 652093 650253 647556 643998 638092 629860 621718 614992 608278
58458 608278 600690 593821 588700 583733 577656 571868 567779 564441 560873 558167 557177 556625 555631 555671 557884
58443E57884L031K636L441N245N450L986L266L361K045l88j198k98l96j771j691
58428E84603N22K441L044L768M748M528L885N270Q121R318Q637Q990J0897J1677
58414F70449J0773J0855J2656J3520J2208J0545R275O730K723n56k536m911p608
58401G44123q415p422p289q346q004n852m686n405n474l643j827j104j10J506
58387F78052K234K145L083M665M421K553K060L506M226L414L285M350M395L078
58373G25467K809M104M679M013M123N091M717L295L678N888O759N748N787P552
58359G93710Q297P382P465R009R146P247O159O675O223M257L425M099L391R74
58345H77459J95J987L344L159L837N814O382N352N900Q402R502Q648R270J1972
$$ plain form
58443 557884 560915 563551 566992 572237 577687 581673 584939 588300 590345 589957 588759 588461 588065 586294 584603
58428 584603 585125 587566 590610 594378 599126 603654 607539 612809 620930 630248 638885 647875 658772 670449
58414 670449 681222 692077 704733 718253 730461 741006 750281 757011 759734 759178 756642 751731 744123
58401 744123 735708 728286 720997 712651 704647 698795 694109 688704 683230 679587 677760 676656 676546 678052
58387 678052 680286 682431 685514 690179 694600 697153 699213 702719 706945 710359 713644 717994 722389 725467
58373 725467 728276 732380 737059 741072 745195 750286 755003 758298 761976 767864 774623 780371 786158 793710
58359 793710 802007 809389 816854 825863 835009 842256 848415 855090 861313 865570 868995 873094 876485 877459
58345 877459 877654 879641 882985 886144 889981 895795 902177 907529 913429 921831 931333 939981 949251 961223
58331I61223J3103J1664J1136J2639J2987J1290J0835J2455J2799J1151J1055
58320A092337J3262J4049J2590J2605J4680J4451J0864Q556R462R824Q205Q458
58308A229343J1643J3120J1128J0353J3342J6142J6183J6641J9185K0235J8384
58297A395699J7799K0362K2064K0969K0886K3403K4423K2482K2155K5268K7164
58286A642674K5823K5910K9590L2243L1722L2706L7242M0250L9250L9104M2175
58275B018689M3481M0761L9375M1797M2439L8610L6265L8809M0823L9165L9476
58264B459690M4966M9612M9653N0787N6710O1571O1478O2283O8009P2943P3305
58253C111007P5094Q2017Q7545Q7696Q9548R7857J05622J07515J10108J18718
$$ plain form
58331 961223 974326 985990 997126 1009765 1022752 1034042 1044877 1057332 1070131 1081282 1092337
58320 1092337 1105599 1119648 1132238 1144843 1159523 1173974 1184838 1193394 1202856 1212680 1220885 1229343
58308 1229343 1240986 1254106 1265234 1275587 1288929 1305071 1321254 1337895 1357080 1377315 1395699
58297 1395699 1413498 1433860 1455924 1476893 1497779 1521182 1545605 1568087 1590242 1615510 1642674
58286 1642674 1668497 1694407 1723997 1756240 1787962 1820668 1857910 1898160 1937410 1976514 2018689
58275 2018689 2062170 2102931 2142306 2184103 2226542 2265152 2301417 2340226 2381049 2420214 2459690
58264 2459690 2504656 2554268 2603921 2654708 2711418 2772989 2834467 2896750 2964759 3037702 3111007
58253 3111007 3186101 3268118 3355663 3443359 3532907 3630764 3736386 3843901 3954009 4072727
58243D072727J26948J29710J33752J44410J54884J59741J65812J78512J90892
58234E457388J97735K06449K22336K37728K47712K61127K83480L05299L20475
58225G739729L38989L67829L97508M21956M52312M95453N39252N75928O18630
58216A1947586O77085P39584P98208Q67854R59554J060707J164020J288810J449623
58207B0953031J633295J833512K076701K385796K753977L186410L730100M427270
58199D2980092N279604O292400P500965Q912494J0491896J2270830J4409740J7096087
58191A25234108K0470971K4693710K9810632L5203522L9191573L9585308L4960914
58184C49150738K5466810J2531597j883818j5693530k6897464l4085364l6990648
$$ plain form
58243 4072727 4199675 4329385 4463137 4607547 4762431 4922172 5087984 5266496 5457388
58234 5457388 5655123 5861572 6083908 6321636 6569348 6830475 7113955 7419254 7739729
58225 7739729 8078718 8446547 8844055 9266011 9718323 10213776 10753028 11328956 11947586
58216 11947586 12624671 13364255 14162463 15030317 15989871 17050578 18214598 19503408 20953031
58207 20953031 22586326 24419838 26496539 28882335 31636312 34822722 38552822 42980092
58199 42980092 48259696 54552096 62053061 70965555 81457451 93728281 108138021 125234108
58191 125234108 145705079 170398789 200209421 235412943 274604516 314189824 349150738
58184 349150738 374617548 387149145 385265327 369571797 342674333 308588969 271598321
58177B71598321l6429446l3631994k9657271k5269724k1004726j7153897j3778188
58170I4673075j0838171q281700o023878l992726k274462j116803p02362r69838
58162F0473135j696654k665513l678632m503709m942730m957962m662883m196665
58154B9168387l654553l109009k618574k202046j846680j547672j310900j125048
58146A1753905r66239q28165p19230o34777n59271m91164m40109m03818l70648
58137F340484l40424l20753l07501k89627k68578k53405k41531k23269k00545
58128C894851j82875j69267j51631j31942j19041j12206j03983r5633r4286r8102
58118B635885r8933r6599r6622r7333r2688q4646p9715p6567o9557o0998n7418
$$ plain form
58177 271598321 235168875 201536881 171879610 146609886 125605160 108451263 94673075
58170 94673075 83834904 75553204 69529326 65536600 63262138 62145335 61442973 60473135
58162 60473135 58776481 56110968 52432336 47928627 42985897 38027935 33365052 29168387
58154 29168387 25513834 22404825 19786251 17584205 15737525 14189853 12878953 11753905
58146 11753905 10787666 9959501 9240271 8605494 8046223 7555059 7114950 6711132 6340484
58137 6340484 6000060 5679307 5371806 5082179 4813601 4560196 4318665 4095396 3894851
58128 3894851 3711976 3542709 3391078 3259136 3140095 3027889 2923906 2828273 2733987 2635885
58118 2635885 2536952 2440353 2343731 2246398 2153710 2069064 1989349 1912782 1843225 1782227 1724809
58107A724809n7034n3196m7063m4797m5256m2420l7266l5633l6699l4891l0864
58096A259690k9775l0782k8855k4916k4005k5408k4457k2039k2593k4755k3583
58085I78522k0091j9254k0566j9810j8109j9846k3451k3509k0463j9240j9772
58074G54411j7808j3787j2076j2472j0951p894p280q570p582m606l828n331n350
58061F36876l660l389m201l117j291k655o450q129p125o824p602o797m904m937
58047E65795o145n032k037o82q57M81K665K213k05l88K055L470L004L249M258
58032E71844L309O62n40j95j222l704m865m715n958q350q964p967q362j0099j0151
58017E00723q489q203r526r429p348n865n426l876j432o84j319k46K674M346M125
$$ plain form
58107 1724809 1667775 1614579 1567516 1522719 1477463 1435043 1397777 1362144 1325445 1290554 1259690
58096 1259690 1229915 1199133 1170278 1145362 1121357 1095949 1071492 1049453 1026860 1002105 978522
58085 978522 958431 939177 918611 898801 880692 860846 837395 813886 793423 774183 754411
58074 754411 736603 722816 710740 698268 687317 679423 672143 663573 655991 651385 647557 642226 636876
58061 636876 633216 629827 625626 622509 621218 618563 612113 603984 596859 590035 582433 575636 570732 565795
58047 565795 559650 554618 552581 551899 551042 551523 554188 556401 556196 555808 557863 561333 564337 567586 571844
58032 571844 575153 575815 575275 575080 573858 570154 565289 560574 554616 546266 537302 529335 520973 510874 500723
58017 500723 492234 484031 474505 465076 457728 451863 446437 442561 441129 440445 439126 438880 441554 445900 450025
58002D50025M484N641M907K117L77N77J80j739l022k882l082l894l359j418l96
57987D48516p82o75J19k08j331q92Q87J197l39j123n59r89l017m383m218m133
57971D28070m408l407j382o22j149n68J297J920Q00K32P09P1j946k856k041j816
57955D12904k852k906j221R3K22R54K620L022J719J269K598L265J814M4o29j314
57939D21602k649l343l238m273o850q678q745q915j0271j1273j1005j0763j0881
57926C20718r498o147l255k358j957o64N91J073J858L407M389M385M926O492P370
57911C31330O806O384P061P610P199O635O010M102J172p59j406k784n311o744
57897C67305o194n686o404o880o399o645q236r042p832o337n911n342l810k730
$$ plain form
58002 450025 454509 460150 465057 467174 467551 468128 468308 466569 463547 460665 457583 453689 450330 448912 448516
57987 448516 447734 447059 447178 446970 445639 444747 445634 446831 446492 445369 444810 443821 440804 436421 432203 428070
57971 428070 423662 420255 418873 418251 417102 416534 417831 419751 420551 420783 421492 421563 419617 416761 414720 412904
57955 412904 410052 407146 405925 406018 406240 407194 409814 412836 414555 415824 418422 421687 423501 423545 422916 421602
57939 421602 418953 415610 412372 408099 401249 392571 383826 374911 364640 353367 342362 331599 320718
57926 320718 311220 305073 301818 299460 297503 296839 297430 298503 300361 303768 308157 312542 317468 323960 331330
57911 331330 338136 344520 351581 359191 366390 373025 379035 383137 384309 383550 382144 379360 374049 367305
57897 367305 361111 355425 349021 342141 335742 329097 320861 311819 303987 297650 291739 286397 282587 279857
57883B79857k702j848P57L140L940M732O724Q284Q097P743Q671R446Q600P467
57869C52908P628P994P020N479M568L516J479l93j161k080m124n797n832n763
57855C65442p272r121r393q741q740q898q031o873o691o736n721m375m012l976
57841B66862k994j801j916k866l047k453k342l022l891m871o093p022p382p898
57827B09264q759q777p441o295o580p149o486n208m659m511l801k951k751k558
57813A31338j483k39J12Q4P32J747K374L034M359N810O810P931R335R611P978
57798A89533O175O124P084P194O560O586P376P975Q281Q597Q161O124L274R30
57784B79974j040l391n638o957p925r470j0952j1201j0695j0711j1066j0566r102
$$ plain form
57883 279857 277155 275307 276064 279204 283144 287876 294600 302884 310981 318724 327395 336841 345441 352908
57869 352908 360536 368530 375550 381029 385597 389113 390592 390199 389038 386958 382834 377037 371205 365442
57855 365442 358170 349049 339656 330915 322175 313277 305246 298373 291682 284946 279225 274850 270838 266862
57841 266862 263868 262067 260151 257285 254238 251785 249443 246421 242530 237659 231566 224544 217162 209264
57827 209264 200505 191728 184287 177992 171412 164263 157777 152569 147910 143399 139598 136647 133896 131338
57813 131338 129855 129616 129728 129812 130544 132291 134665 137699 142058 147868 154678 162609 171944 181555 189533
57798 189533 195708 201832 208916 216110 222670 229256 236632 244607 252888 261485 269646 275770 279044 279974
57784 279974 278934 275543 269905 262948 255023 245553 234601 223400 212705 201994 190928 180362 171260
57771A71260p480n812l770j842p06M6J013J623J184M79O83J504K047K583L719
57756A66531M763M716M166M346M986M972M429M305M531M398M201M668N268M934
57742B31214M027L768M091L808K722J854J806K251K833L338L337K909L126M650
57728B75734O580P881Q949J0374J1344J1021J0543J1588J3729J5217J5753J6430
57716D15143J7369J7659J7381J7717J8987K0414K1794K3785K6531K9524L2764
57705F59068L6625M0759M4551M8429N3296N9006O4806P1041P8850Q8416R8889
57694A343736J09814J21239J32806J44132J55675J67541J77791J83423J82882
57685B719039J76178J62981J42428J14867Q2370M7498J2766j8971m5013o3664
$$ plain form
57771 171260 163780 157968 154198 152356 151650 151696 152709 154332 155516 155995 156678 158182 160229 162812 166531
57756 166531 171294 176010 180176 184522 189508 194480 198909 203214 207745 212143 216344 221012 226280 231214
57742 231214 235241 239009 243100 246908 249630 251484 253290 255541 258374 261712 265049 267958 271084 275734
57728 275734 282314 290195 299144 309518 320862 331883 342426 354014 367743 382960 398713 415143
57716 415143 432512 450171 467552 485269 504256 524670 546464 570249 596780 626304 659068
57705 659068 695693 736452 781003 829432 882728 941734 1006540 1077581 1156431 1244847 1343736
57694 1343736 1453550 1574789 1707595 1851727 2007402 2174943 2352734 2536157 2719039
57685 2719039 2895217 3058198 3200626 3315493 3397863 3445361 3458127 3439156 3394143 3330479
57675C330479p3698p3597o2519m1585j3268J9092M9452O8181O6144M0430m853
57664C304258o2122j22467j75682k12522k28989k27391k12899j90429j64400j38676
57654A568681j15356r4676p6537o1037m7675l5623k5089j6807j0101l108M861
57643A087533J2719J9704K6447L3630M1135M8925N7407O6468P5454Q4435R4271
57632A648128J05142J16199J26784J36630J44767J49593J50207J46301J36666
57623B860417J19553R4797O4246K9858o997m4077p8021j06397j28807j45436j55953
57612B503183j60444j60121j56285j49532j40508j30345j19871j09262r8858q9262
57602A188695q0487p2080o4333n8125n3339m8747m3819l9304l5665l2319k8909
$$ plain form
57675 3330479 3256781 3183184 3120665 3079080 3065812 3084904 3134356 3202537 3268681 3309111 3304258
57664 3304258 3242136 3119669 2943987 2731465 2502476 2275085 2062186 1871757 1707357 1568681
57654 1568681 1453325 1358649 1282112 1221075 1173400 1137777 1112688 1095881 1085780 1082672 1087533
57643 1087533 1100252 1119956 1146403 1180033 1221168 1270093 1327500 1393968 1469422 1553857 1648128
57632 1648128 1753270 1869469 1996253 2132883 2277650 2427243 2577450 2723751 2860417
57623 2860417 2979970 3074767 3139013 3168871 3161874 3117797 3039776 2933379 2804572 2659136 2503183
57612 2503183 2342739 2182618 2026333 1876801 1736293 1605948 1486077 1376815 1277957 1188695
57602 1188695 1108208 1036128 971795 913670 860331 811584 767765 728461 692796 660477 631568
57591F31568k6000k3906k2072k0157j8573j7398j5971j4132j2698j2082j1638
57580D36941j0939j0491j0429r748p667m958k985k220k261k567k547j750n03L85
57566C68261R08J941L697N161N677N956O878Q286R812J1832J4606J7265J8779
57553D79059J9499K0734K3073K5881K8346L0427L2758L6048M0528M5864N1640
57542H33857N7818O4483P1400P8352Q5606R3377J01068J07855J13728J19006J22829
57531A849379J23150J18339J07948R2017P0749M5078J6696j2681m1388o7426q9067
57520B212794j05809j17743j24269j24831j20800j14966j08849j01902r3605q4742
57510A115278p6091o7468n8852n1148m4966l9677l4537k9708k5554k1773j8005
$$ plain form
57591 631568 605568 581662 559590 539433 520860 503462 487491 473359 460661 448579 436941
57580 436941 426002 415511 405082 395334 387667 382709 379724 377504 375243 372676 370129 368379 367876 368261
57566 368261 369169 371110 374807 379968 385645 391601 398479 406765 416577 428409 443015 460280 479059
57553 479059 498558 519292 542365 568246 596592 627019 659777 695825 736353 782217 833857
57542 833857 891675 956158 1027558 1105910 1191516 1284893 1385961 1493816 1607544 1726550 1849379
57531 1849379 1972529 2090868 2198816 2290833 2361582 2406660 2423356 2410675 2369287 2301861 2212794
57520 2212794 2106985 1989242 1864973 1740142 1619342 1504376 1395527 1293625 1200020 1115278
57510 1115278 1039187 971719 912867 861719 816753 777076 742539 712831 687277 665504 647499
57499F47499j4433j1250q272n490l119p57K405O206R465J1804J4297J7773K1681
57486F87809K5373K9350L4293L9888M5519N1295N7508O3882P0159P6739Q3998
57475A265813R1582R8861J05440J10611J13095J11822J06323R6003P9983N8207
57465B237740L1921K753k7700n7125q2727j02941j17936j27968j32512j31766
57455A491739j27624j22006j15227j06908r7539q8112p9065p0545o2908n6138
57445E65667m9645m3460l8666l5714l3290k9980k6145k3085k1107j9517j7895
57434B27163j6196j4345j2601j1712j1759j1543j0151q391p618p782p814p345
57422I9906o822o403n883n482n564n833n681n156m738m453l931l121k335j824
$$ plain form
57499 647499 633066 621816 613544 608054 604935 604178 606583 612789 622254 634058 648355 666128 687809
57486 687809 713182 742532 776825 816713 862232 913527 971035 1034917 1105076 1181815 1265813
57475 1265813 1357395 1456256 1561696 1672307 1785402 1897224 2003547 2099550 2179533 2237740
57465 2237740 2269661 2272414 2244714 2187589 2104862 2001921 1883985 1756017 1623505 1491739
57455 1491739 1364115 1242109 1126882 1019974 922435 834323 755258 684713 621805 565667
57445 565667 516022 472562 433896 398182 364892 334912 308767 285682 264575 245058 227163
57434 227163 210967 196622 184021 172309 160550 149007 138856 130465 122847 115065 107251 99906
57422 99906 93084 86681 80798 75316 69752 63919 58238 53082 48344 43891 39960 36839 34504 32680
57408C2680j810k415l144l029j888p35l88m78l98l27n57p03m84m11q53j247j147
57391A2666j170j881k582k343j425o12j7M06J00j059A67a428j087j689k709k436
57375i349r13J70R8j21L40J034J250Q60Qr95j456r25j4L66K57K53K67j70p47p65
57355a0552l98l27m64k96j50o87j438j272k78L80L73N02J024J221Q29N08O36Q86
57337i503J181J833K493a647e6A364K280L291L745L926M043L697K892K495K999
57322C0732L771M023L764L374L108L311M241N414N985O021O469P615Q606Q799
57308A05233Q594Q621R020R871J1308J2846J3697J4102J5249J7475J9645K0829
57296B66490K1476K2231K2749K2552K2099K2025K1995K1234J9604J7387J4528
$$ plain form
57408 32680 30870 28455 25311 22282 20394 19659 19271 18793 18395 18068 17511 16808 16324 15913 15060 13813 12666
57391 12666 11496 9615 7033 4690 3265 2653 2636 3042 3142 2083 167 -1428 -2515 -4204 -6913 -9349
57375 -9349 -10262 -10092 -9994 -10115 -9775 -8741 -7491 -6631 -6623 -7618 -9074 -9999 -10013 -9647 -9390 -9137 -8870 -9040 -9787 -10552
57355 -10552 -10950 -11277 -11741 -12037 -12187 -12874 -14312 -15584 -15862 -15482 -15109 -14607 -13583 -12362 -11533 -11025 -10389 -9503
57337 -9503 -8322 -6489 -3996 -1647 -56 1364 3644 6935 10680 14606 18649 22346 25238 27733 30732
57322 30732 34503 38526 42290 45664 48772 52083 56324 61738 67723 73744 80213 87828 96434 105233
57308 105233 113827 122448 131468 141339 152647 165493 179190 193292 208541 226016 245661 266490
57296 266490 287966 310197 332946 355498 377597 399622 421617 442851 462455 479842 494370
57285D94370J0890O860K923j060n513j0328j4865j8591k1304k3031k3999k4459
57273C71893k4418k3762k2668k1325j9353j6282j2783j0392r641r284q029o151
57261A87805m745m041l371k409j505r40n03R3Q50J560K108K664L575M864N941
57246A91946O201N874N765O175O585O463N836N054M566M999O633Q714J0005J0264
57232B85080J0452J1269J2270J2795J2927J3113J3472J4029J4961J6149J7009
57221D33526J7237J7283J7711J8523J9436K0300K1017K1476K1860K2467K3128
57210F53964K3380K3350K3644K4255K4526K4506K5215K7036K8975L0177L1306
57199I40334L3355L6039L8320M0021M1720M3538M4979M5788M6075M5925M5563
$$ plain form
57285 494370 505260 512120 515043 513983 508470 498142 483277 464686 443382 420351 396352 371893
57273 371893 347475 323713 301045 279720 260367 244085 231302 220910 211269 201985 193956 187805
57261 187805 183060 179019 175648 173239 171734 170794 170291 170384 171234 172794 174902 177566 181141 186005 191946
57246 191946 198147 204021 209786 215961 222546 229009 234845 239899 244465 249464 256097 264811 274816 285080
57232 285080 295532 306801 319071 331866 344793 357906 371378 385407 400368 416517 433526
57221 433526 450763 468046 485757 504280 523716 544016 565033 586509 608369 630836 653964
57210 653964 677344 700694 724338 748593 773119 797625 822840 849876 878851 909028 940334
57199 940334 973689 1009728 1048048 1088069 1129789 1173327 1218306 1264094 1310169 1356094 1401657
57188A401657M5605M6269M6667M5749M3775M1986M0988M0410M0030M0258M1221
57177A874615M2206M2479M2179M2076M2701M3900M5027M5479M5151M4378M3463
57166B353654M2479M1624M1320M1630M2065M2374M3196M5261M8166N0617N1806
57155B844192N1990N1686N0919M9466M7346M4774M1880L8736L5521L2530K9962
57144C319002K7854K6128K4811K4153K4408K5612K7660L0499L3859L6872L8422
57133C639280L8110L6373L3508K9053K2610J4934P687K228j077k529k671k179
57121C815327j757j888k579l227k724m2M778J0267J4433J6238J6211J5820J6521
57108C897378J9258K4431L2074M2285N5741P3829R8059J29525J69286K19339K82892
$$ plain form
57188 1401657 1447262 1493531 1540198 1585947 1629722 1671708 1712696 1753106 1793136 1833394 1874615
57177 1874615 1916821 1959300 2001479 2043555 2086256 2130156 2175183 2220662 2265813 2310191 2353654
57166 2353654 2396133 2437757 2479077 2520707 2562772 2605146 2648342 2693603 2741769 2792386 2844192
57155 2844192 2896182 2947868 2998787 3048253 3095599 3140373 3182253 3220989 3256510 3289040 3319002
57144 3319002 3346856 3372984 3397795 3421948 3446356 3471968 3499628 3530127 3563986 3600858 3639280
57133 3639280 3677390 3713763 3747271 3776324 3798934 3813868 3821555 3823783 3822706 3820177 3817506 3815327
57121 3815327 3813570 3811682 3809103 3805876 3803152 3803110 3807888 3818155 3832588 3848826 3865037 3880857 3897378
57108 3897378 3916636 3941067 3973141 4015426 4071167 4144996 4243055 4372580 4541866 4761205 5044097
57097E044097L63485M64271N87856P35666R06360J095319J296348J503328J709562
57088A3706292J906577K084675K232986K336809K376947K335844K203453J972123
57080C1155706J628222J162592O00637J7176m93656q72919j123856j290239j416134
57071B9367529j524790j620959j699077j748975j762051j736652j677354j590482
57063A6007189j482605j361805j236387j111812r90920q76789p72920o80725n99230
57054F893996n27472m65304m11854l65307l24663k90040k60943k35771k13262
57045C799380j93131j75149j58900j44545j32441j22008j12222j03201r5874r0077
57035B471832q4557p8913p3993p0058o6128o1577n6971n2865m9050m5482m2595
$$ plain form
57097 5044097 5407582 5871853 6459709 7195375 8101735 9197054 10493402 11996730 13706292
57088 13706292 15612869 17697544 19930530 22267339 24644286 26980130 29183583 31155706
57080 31155706 32783928 33946520 34547157 34564333 34070677 33197758 32073902 30783663 29367529
57071 29367529 27842739 26221780 24522703 22773728 21011677 19275025 17597671 16007189
57063 16007189 14524584 13162779 11926392 10814580 9823660 8946871 8173951 7493226 6893996
57054 6893996 6366524 5901220 5489366 5124059 4799396 4509356 4248413 4012642 3799380
57045 3799380 3606249 3431100 3272200 3127655 2995214 2873206 2760984 2657783 2561909 2471832
57035 2471832 2387275 2308362 2234369 2164311 2098183 2036606 1979635 1926770 1877720 1832238 1789643
57024A789643m0124l6865l2316k7403k2950j8514j3443p971k341M196J2610K3181
57012A627703L6305N2950P2293Q8833R3885Q1442N2760J5101k3444n7631q4866
57001A955331j03500j12658j13116j07058r6730q4057p1314o0781n3063m6735
56991A106319m0404l4228k8819k3758j8348j2904q120l890j48J843O56l145p485
56978I27569j1206j4496j7153j8170j7328j5642j3836j1678r186p124n757m372
56966G81621k532p09Q23K664N227Q002J0544J3237J6268J8599J8709J5942J0587
56953H98982L303m952j2838j9095k3062k4641k4143k2248j9640j6564j3118r828
56941G12156p255n138k667L26L285O021R101J3019J7702K2662K6808K8164K5046
$$ plain form
57024 1789643 1749519 1712654 1680338 1652935 1629985 1611471 1598028 1590057 1587716 1591912 1604522 1627703
57012 1627703 1664008 1716958 1789251 1878084 1971969 2053411 2106171 2121272 2097828 2040197 1955331
57001 1955331 1851831 1739173 1626057 1518999 1422269 1338212 1266898 1206117 1153054 1106319
56991 1106319 1065915 1031687 1002868 979110 960762 947858 939738 935848 935700 937543 938199 935054 927569
56978 927569 916363 901867 884714 866544 849216 833574 819738 808060 798874 791750 785993 781621
56966 781621 779089 778380 779203 781867 787094 795096 805640 818877 835145 853744 872453 888395 898982
56953 898982 902285 897333 884495 865400 842338 817697 793554 771306 751666 735102 721984 712156
56941 712156 704901 699763 697096 697422 700707 706728 715829 728848 746550 769212 796020 824184 849230
56928H49230J7724Q049k599j3769k4279l1711l4468l3435l0893k8471k6505k4553
56916F24320k1923j8418j4934j2692j1696j0787r423q230p519o535m899l568l444
56903D90252l956m014l541l111k747k089j280p87o15l56K37J302L136N886R209
56888D87526J2586J5657J7946J8855J8140J5992J2421P302J276m182q030j0305
56876E85184j1191j0428q157n465l309j468P49L357N928Q451J1256J4471J8152
56863F07530K2636K8215L4478M0129M3181M1561L4307K2503Q505n636j8485k8364
56851H30560l3732l4736l3122l0203k5940k0311j4134p947j408N475J1716J6924
56839F63142K2279K9137L7638M7358N7909O7642P3001P0680N9918M1964J8604
$$ plain form
56928 849230 866954 875003 872404 858635 834356 802645 768177 734742 703849 675378 648873 624320
56916 624320 602397 583979 569045 556353 544657 533870 524447 516217 508698 502163 497264 493696 490252
56903 490252 486296 482282 478741 475630 472883 470794 469514 468727 468112 467756 467993 469295 472431 478317 487526
56888 487526 500112 515769 533715 552570 570710 586702 599123 606425 607701 603519 595489 585184
56876 585184 573993 563565 555408 549943 546634 545166 545915 549272 555200 563651 574907 589378 607530
56863 607530 630166 658381 692859 732988 776169 817730 852037 874540 883045 877409 858924 830560
56851 830560 796828 762092 728970 698767 672827 652516 638382 630435 629027 634502 646218 663142
56839 663142 685421 714558 752196 799554 857463 925105 998106 1068786 1128704 1170668 1189272
56828A189272p448l1941n0800o2500o7728o7473o2690n5063m6484l7776k8965
56817F70404k0429j2723n683J213P893J4203K0939K9196L8718M7700N3837N4907
56805I00175M9069L5879J7108m165k4892m2144n3155n6875n5080n0710m5287l8854
56793F31069l1736k4933j8999j3739q937m412K68N279J0058J4350J8999K4443
56781F01710K8954K9835K6164J9102R844j166j2987k3658l1345l5246l5510l3182
56769E42515l0009k7189k4389k0834j6900j3641j1193r046p410o816o636n611
56757C62841l857k776k915l354l324l003k462j415l22l44j625k813k814k057j503
56742C28257j468j812k391k870k860k539k392k294j683p45l55p02r72o53j88n9
$$ plain form
56828 1189272 1181824 1149883 1099083 1036583 968855 901382 838692 783629 737145 699369 670404
56817 670404 649975 637252 631569 632782 640675 654878 675817 705013 743731 791431 845268 900175
56805 900175 949244 985123 1002231 998066 973174 931030 877875 821000 765920 715210 669923 631069
56793 631069 599333 574400 555401 541662 532725 528313 528581 533860 543918 558268 577267 601710
56781 601710 630664 660499 686663 705765 715609 714443 701456 677798 646453 611207 575697 542515
56769 542515 512506 485317 460928 440094 423194 409553 398360 389314 381904 375088 368452 362841
56757 362841 358984 356208 353293 349939 346615 343612 341150 339735 339413 339069 337444 334631 331817 329760 328257
56742 328257 326789 324977 322586 319716 316856 314317 311925 309631 307948 307203 306848 306146 305174 304521 304333 304274
56726C04274j78m19q97j412j483j134r17j012j113j172j364j362o83K46M24k62
56710B91536r65j279j542j704j179r6N89N05K50R3m11j199j371o14K25N31O92
56693B84061R96R41K96j72J84R89J623K048K305K113J547J283J543J637J087L21
56677C02802k58r85k021k692k474j942j941k356k472j997j249o56n86j150j847
56662B78176j941j414r65q73p10l81n06j249j680j019J73P07J66q99j741j888
56646B63956j283l79K61N71Q58J058P69np86j312j625j534q95l28o62j571j851
56629B55242j110j62L83O54N74k01j103q72N31J601J458R43Q51N73m65j343r72
56612B56582O7L50l54j027r60l55K85N95L49k90p86q41p00n68l05J00L00J65J1
$$ plain form
56726 304274 304096 303677 302780 301368 299885 298751 297834 296822 295709 294537 293173 291811 291128 291374 291798 291536
56710 291536 290571 289292 287750 286046 284867 284771 285360 285865 286115 286208 285797 284598 283227 282613 282838 283369 284061
56693 284061 285057 285998 286294 286122 286306 287295 288918 290966 293271 295384 296931 298214 299757 301394 302481 302802
56677 302802 302544 301559 299538 296846 294372 292430 290489 288133 285661 283664 282415 281759 281173 280023 278176
56662 278176 276235 274821 273856 272983 272273 271892 271386 270137 268457 267438 267611 268318 268484 267585 265844 263956
56646 263956 262673 262294 262555 263126 263984 265042 265811 265806 265020 263708 262083 260549 259654 259326 258664 257093 255242
56629 255242 254132 253970 254353 255007 255581 255380 254277 253405 253936 255537 256995 257938 258789 259362 258897 257554 256582
56612 256582 256649 256999 256645 255618 254658 254303 254588 255183 255532 255242 254456 253615 252915 252347 252042 252142 252442 252607 252618
56593B52618O2K78P10J359J640J015P1p1N28P60L83K96P70R77P65J157K388L107
56575B68813K471J539J497J954K162K547L675M846N130M885M947N128M750M005
56561C18349L561L455L417L624M141M360L882L278L031K613J572N92L68L26l76
56546C56193j405k029k580l736n059n584n421n389n468m901l692k783k789l410
56532C01947m023m152l577k612k018k041k027j504j015j229j832k068j837j541
56518B70471j415j596k271l112l259k434j432r70q32o95q28j272j321n89K48N55
56502B49248O27P87O78J79m1K78M26J69M53J646K413J680M31K16R10J502J936
56485B63538K672L292L190K913L243L675L264K313J813J783J589J307J369J457
$$ plain form
56593 252618 252680 252958 253668 255027 256667 257682 257753 257682 258210 258970 259353 259649 260419 261396 262161 263318 265706 268813
56575 268813 271284 272823 274320 276274 278436 280983 284658 289504 294634 299519 304466 309594 314344 318349
56561 318349 321910 325365 328782 332406 336547 340907 344789 348067 351098 353711 355283 355875 356243 356569 356193
56546 356193 354788 352759 350179 346443 341384 335800 330379 324990 319522 314621 310929 308146 305357 301947
56532 301947 297924 293772 290195 287583 285565 283524 281497 279993 278978 277749 275917 273849 272012 270471
56518 270471 269056 267460 265189 262077 258818 256384 254952 253982 253150 252455 251627 250355 249034 248445 248693 249248
56502 249248 249875 250662 251340 251519 251478 251756 252182 252351 252804 254450 256863 258543 258974 259190 260100 261602 263538
56485 263538 266210 269502 272692 275605 278848 282523 285787 288100 289913 291696 293285 294592 295961 297418
56471B97418J075O77J005J801K374K736L115L145K684K546L163L529K770J704
56457C29742J360J100r1j528j934j725k194l152l322k553j707r40L2M43o83k584
56441C10264l499l153k682k417j692o43k76p55j225j320j379j359r89p47j169
56426B86959j543r39l3k43j381j982j646j258j107o29O2K38L8K27N58R9q98j207
56408B75315o71l40n36m36K72Q64Q20L67k08o60m79L21O20k64j162o84N31R69
56390B74639P89J166J787J358K27J09J274K205K112J623J059J36n48R4J522J978
56374B91530J154M74N75N70R4K3O74J194J117R44Q54M42n7J22Q69J373J585J941
56356C05478J932Q43m03k05J140J848J547J537K280K854K984L385L955L736K885
$$ plain form
56471 297418 298493 299170 300175 301976 304350 307086 310201 313346 316030 318576 321739 325268 328038 329742
56457 329742 331102 332202 332111 330583 328649 326924 324730 321578 318256 315703 313996 313056 313088 313531 312848 310264
56441 310264 306765 303612 300930 298513 296821 296178 295902 295147 293922 292602 291223 289864 288875 288128 286959
56426 286959 285416 284477 284444 284201 282820 280838 279192 277934 276827 276198 276260 276498 276536 276763 277321 277420 276522 275315
56408 275315 274644 274304 273768 273332 273604 274468 275288 275655 275447 274787 274308 274629 275249 274985 273823 273139 273670 274639
56390 274639 275428 276594 278381 279739 279966 280075 281349 283554 285666 287289 288348 288484 287936 288030 289552 291530
56374 291530 292684 293158 293733 294303 294397 294420 295094 296288 297405 298349 299203 299645 299588 299710 300579 301952 303537 305478
56356 305478 307410 308253 307850 307645 308785 310633 312180 313717 315997 318851 321835 325220 329175 332911 335796
56341C35796K561K840K811K660L415M639M841M166M230N195N565N088N169O083
56327C95059O443N895N710O118N733M298L369L616L859L522L542M002L512J799
56313D56477O31J003J765J800J528J348Q04J01K92J255J595J078J043J862K451
56298D75033K743M052O359P856P964Q185R257J0097J0315J1032J2341J2798J2384
56285E90416J3091J5518J7797J8999K0597K3277K5410K6273K7754L1118L4852
56274H45102L7706M1106M6536N2926N8748O4561P1516P9355Q7668R7252J08447
56263A590923J19982J30888J41626J52111J60763J66868J71666J75725J77344
56254B987896J74902J68638J58849J44722J26213J04912Q1821N6652L0319N429
$$ plain form
56341 335796 338357 341197 344008 346668 350083 354722 359563 363729 367959 373154 378719 383807 388976 395059
56327 395059 401502 407397 413107 419225 424958 429256 432625 436241 440100 443622 447164 451166 454678 456477
56313 456477 457108 458111 459876 461676 463204 464552 465356 465457 465749 467004 468599 469677 470720 472582 475033
56298 475033 477776 481828 488187 496043 504007 512192 521449 531546 541861 552893 565234 578032 590416
56285 590416 603507 619025 636822 655821 676418 699695 725105 751378 779132 810250 845102
56274 845102 882808 923914 970450 1023376 1082124 1146685 1218201 1297556 1385224 1482476 1590923
56263 1590923 1710905 1841793 1983419 2135530 2296293 2463161 2634827 2810552 2987896
56254 2987896 3162798 3331436 3490285 3635007 3761220 3866132 3947953 4004605 4034924 4040353
56244D040353j6867l7686n6954p2233q2480q9825r5993j00088j01724j03036j05463
56233C178004j07549j08208j09130j11644j14126j14946j15186j15914j15639
56224B165662j13075j09812j07519j04955j00375r4576q8961q2954p5832o8843
56214A218760o3045n7360n1042m5654m2171l8781l3957k9211k6239k4001k1175
56203G86124j8827j7921j6853j4339j2072j1635j1428r639p573o951o533m700
56191F47653k834k708k967j650Q5K39j56J034L187M413M988O037O763O169N637
56176F75890O575P493O600N236N436O180N474M214M446N588N735N052M747M469
56162G53135L745L996O140Q245Q620Q957J1234J4046J5429J6793K0384K5147K8939
$$ plain form
56244 4040353 4023486 3985800 3928846 3856613 3774133 3684308 3588315 3488227 3386503 3283467 3178004
56233 3178004 3070455 2962247 2853117 2741473 2627347 2512401 2397215 2281301 2165662
56224 2165662 2052587 1942775 1835256 1730301 1629926 1535350 1446389 1363435 1287603 1218760
56214 1218760 1155715 1098355 1047313 1001659 959488 920707 886750 857539 831300 807299 786124
56203 786124 767297 749376 732523 718184 706112 694477 683049 673410 665837 658886 652353 647653
56191 647653 644819 642111 639144 637494 637579 637818 637662 638696 641883 646296 651284 657321 664084 670253 675890
56176 675890 682465 689958 696558 701794 707230 713410 718884 723098 727544 733132 738867 743919 748666 753135
56162 753135 756880 760876 767016 775261 783881 792838 804072 818118 833547 850340 870724 895871 924810
56149I24810L2657L8435M5778N3208O1674P2739Q5488R8705J13677J31041J47152
56138A805364J57391J60804J58138J48363J31473J12127R5858Q3684P4145O7685
56128B995032O4299N9707M9136L3242J6027q22j7052l0214l8205m3695n1227o1758
56116B974470p4170q9357j07697j25016j36278j41288j42128j37809j26898j12648
56106A781181r9698q7887p4922o2709n4898n0345m5179l9474l5876l3519k9487
56095A167187k4592k1665j9734j6032j1912j0647j1045r417o190m423l604j245
56083A026681J364J390N13K175M849M772L302M470P284P753O680P912J0574J0760
56069A100479R339J0328J2908J3007J1440J2463J5447J6051J4557J4966J6896
$$ plain form
56149 924810 957467 995902 1041680 1094888 1156562 1229301 1314789 1413494 1527171 1658212 1805364
56138 1805364 1962755 2123559 2281697 2430060 2561533 2673660 2769518 2853202 2927347 2995032
56128 2995032 3059331 3119038 3168174 3201416 3217443 3216621 3199569 3169355 3131150 3087455 3036228 2974470
56116 2974470 2900300 2810943 2703246 2578230 2441952 2300664 2158536 2020727 1893829 1781181
56106 1781181 1681483 1593596 1518674 1455965 1401067 1350722 1305543 1266069 1230193 1196674 1167187
56095 1167187 1142595 1120930 1101196 1085164 1073252 1062605 1051560 1042143 1035953 1031530 1027926 1026681
56083 1026681 1028045 1029435 1029948 1032123 1036972 1041744 1045046 1049516 1056800 1064553 1071233 1079145 1089719 1100479
56069 1100479 1109818 1120146 1133054 1146061 1157501 1169964 1185411 1201462 1216019 1230985 1247881
56058A247881J6566J4794J5644J8181J7964J5773J6229J8785J8819J6781J7394
56047A434811K0498K1659K1129K3087K6757K7503K6018K7127L0343L1066L0202
56036A720200L2681L7380L8680L7204L8634M2645M3688M1985M2897M6124M6669
56025B168787M5607M8273N2727N2248M8484M9476N5154N7971N7469O0508O7022
56014B763726O9778O8811P1756P8947Q2729Q2656Q6639R5739J02525J05857J12204
56003C721367J21323J26121J27810J34989J46682J53124J54481J61032J73550
55994E020479J82139J86165J95853K12022K24323K32178K46624K68645K87156
55985G055584L01497L23477L53957L80920M04093M36778M79675N19114N55079
$$ plain form
56058 1247881 1264447 1279241 1294885 1313066 1331030 1346803 1363032 1381817 1400636 1417417 1434811
56047 1434811 1455309 1476968 1498097 1521184 1547941 1575444 1601462 1628589 1658932 1689998 1720200
56036 1720200 1752881 1790261 1828941 1866145 1904779 1947424 1991112 2033097 2075994 2122118 2168787
56025 2168787 2214394 2262667 2315394 2367642 2416126 2465602 2520756 2578727 2636196 2696704 2763726
56014 2763726 2833504 2902315 2974071 3053018 3135747 3218403 3305042 3400781 3503306 3609163 3721367
56003 3721367 3842690 3968811 4096621 4231610 4378292 4531416 4685897 4846929 5020479
55994 5020479 5202618 5388783 5584636 5796658 6020981 6253159 6499783 6768428 7055584
55985 7055584 7357081 7680558 8034515 8415435 8819528 9256306 9735981 10255095 10810174
55976A0810174O03142O64401P23363P80506Q55037R49894J048358J151897J284465
55967A8871237J451693J635777J839917K095282K414503K785988L226833L790481
55959C8111711M508170N376658O413155P654141R088525J0681527J2497957J4718401
55951A09050245J7516275K1032588K5445078L0730779L6063397L9581916L9165136
55944C18585414L3675839K3510247J0161083m417888j8092224k8831093l5344614
55937B99246764l7597799l6580710l3557583k9540481k5242420k1161403j7561943
55930I8004425j4492186j1917751r812446q126047o763119n644050m739037m019985
55922C2489804l431688k933740k523922k197567j923814j680651j475120j310554
$$ plain form
55976 10810174 11413316 12077717 12801080 13581586 14436623 15386517 16434875 17586772 18871237
55967 18871237 20322930 21958707 23798624 25893906 28308409 31094397 34321230 38111711
55959 38111711 42619881 47996539 54409694 62063835 71152360 81833887 94331844 109050245
55951 109050245 126566520 147599108 173044186 203774965 239838362 279420278 318585414
55944 318585414 352261253 375771500 385932583 381514695 363422471 334591378 299246764
55937 299246764 261648965 225068255 191510672 161970191 136727771 115566368 98004425
55930 98004425 83512239 71594488 61782042 53655995 46892876 41248826 36509789 32489804
55922 32489804 29058116 26124376 23600454 21402887 19479073 17798422 16323302 15012748
55914A5012748j167606j033841r19881q30797p50961o71382o03852n54382n09085
55905G970961m59525m16906l88326l62533l31615l04548k87099k69429k45395
55896D905585k24340k12452k01127j84478j70321j63475j55545j41496j29701
55887C322650j25609j21299j10951j01418r7958r4144q5252p7599p5624p3048
55877B359748o5686o0021o0613o1393n7663n4491n5225n3762m6184l8595l5672
55866A770443l2745k6749k3698k7546l2498l4015l6810m4208n0042m9047m5547
55855A367538m4156m1308l3767k6350k3544k1941j8213j6152j8683k1174j9718
55844A082532j8162k0141k2014k0452j9115k1137k2589k0107j7569j8515j9285
$$ plain form
55914 15012748 13845142 12811301 11891420 11060623 10309662 9638280 9034428 8480046 7970961
55905 7970961 7511436 7094530 6706204 6343671 6012056 5707508 5420409 5150980 4905585
55896 4905585 4681245 4468793 4267666 4083188 3912867 3749392 3593847 3452351 3322650
55887 3322650 3197041 3075742 2964791 2863373 2765415 2671271 2586019 2508420 2432796 2359748
55877 2359748 2294062 2234041 2173428 2112035 2054372 1999881 1944656 1890894 1844710 1806115 1770443
55866 1770443 1737698 1710949 1687251 1659705 1627207 1593192 1556382 1512174 1462132 1413085 1367538
55855 1367538 1323382 1282074 1248307 1221957 1198413 1176472 1158259 1142107 1123424 1102250 1082532
55844 1082532 1064370 1044229 1022215 1001763 982648 961511 938922 918815 901246 882731 863446
55833H63446j6296j3035j3218j3814j1398q827r189r618p371n613p067q332o599
55820G33069n486q041j0362q535n698n724n996l088J76L1j295m97J24k593o193
55805F69892p151p187q964j0236q442o453p615r504q527o468o535p174n706m003
55791E65927m542m861j805K407M031L976M580L970o04p144j2089j5784j9670k1633
55777D96759j9557j6190j5059j4697j2118q770p782q331p988p688r320j1199j0896
55764C47164r785j0093j0361q518o337o081n939l636j372k079l895l536k276l269
55750B69987n598o258n609n729n755l890j765j815k572j440J74n68k499k554j246
55735B22863j109j659q14N10N7j257j141m83j539l361l547k792l246m168l639
$$ plain form
55833 863446 847150 834115 820897 807083 795685 786858 777669 768051 760680 755067 748000 739668 733069
55820 733069 727583 719542 709180 700645 694947 689223 683227 680139 680315 680346 679051 678554 678678 676085 669892
55805 669892 662741 655554 646590 636354 627912 621459 613844 604340 595813 589345 582810 575636 569930 565927
55791 565927 561385 556524 554719 557126 561157 565133 569713 573683 573079 565935 553846 538062 518392 496759
55777 496759 477202 461012 445953 431256 419138 410368 402586 394255 386267 378579 369259 358060 347164
55764 347164 337379 327286 316925 308407 302070 295989 290050 286414 285042 282963 279068 275532 273256 269987
55750 269987 264389 258131 252522 246793 241038 237148 235383 233568 230996 229556 229730 229162 226663 224109 222863
55735 222863 221754 220095 219281 219791 219848 218591 217450 216967 215428 212067 208520 205728 202482 198314 194675
55720A94675k659l059l336j291J146O39j678k044k68Q12P38J340K340J929R18
55705A90202J658L551L913K602J632J151j00j337q73K19k85j616j470n07j134
55690A97606k882l291k444k324k599j393N73R63K66R67K916L783L526M084N119
55675B04870M421K308J419K246K871K898L628M522L593J382O02J700K482K177
55661B41119K194K729K317R68L36N42J08r49j164o84j070k130k244j665k219l756
55645B34432m279l589l534m596n361n420n795o439o321n849o312p111o551n022
55631A58253m389m575l953k725k600l429l407k501k352l000k978k408k733l520
55617A13683k982j500j193k061k032q21k44o15l61O33P29q1l1R91J197L91K62
$$ plain form
55720 194675 192016 188957 185621 184330 185476 186115 184437 182393 182125 182937 183675 185015 187355 189284 190202
55705 190202 191860 195411 199324 201926 203558 204709 204609 203272 202399 202618 202333 200717 199247 198740 197606
55690 197606 194724 191433 188989 186665 184066 182673 183246 184209 184475 185442 188358 192141 195667 199751 204870
55675 204870 209291 211599 213018 215264 218135 221033 224661 229183 232776 234158 234760 236460 238942 241119
55661 241119 243313 246042 248359 249327 249663 250205 250313 249364 248200 247516 246446 244316 242072 240407 238188 234432
55645 234432 230153 226564 223030 218434 213073 207653 201858 195419 189098 183249 176937 169826 163275 158253
55631 158253 153864 149289 145336 142611 140011 136582 133175 130674 128322 125322 122344 119936 117203 113683
55617 113683 110701 109201 108008 105947 103915 103094 102850 102235 101874 102507 103236 103155 103124 104115 105312 105703 105965
55600A05965R28O01q08j256k63L33j24k17L44Rj377j922j121p49j417j487l77
55583I7062K01n51j042k27P03P53P00J213J740K153L138M280M217L277L419M889
55567A25925N640M663L266K317R63j064k525k921l247l741l439k573k723l908
55553A16633m230l179k508k944k909j621o12q34q96M00K028K640K428J942J101
55538A07439L69Q33K211K816K263K038K669K747J651P56Q76Q60n0p53l80K50M09
55521A27004O72J173P64r79k695l284l290l365l202k787k915l637l987l801l977
55506I1694m456m046k754k069k401k568k267k574l343k865j006M0p50j587j015
55491E8033q7k8j14N05J029O41l3m19j076k072k274j389p24p94l65R89J716R67
$$ plain form
55600 105965 106893 107494 106686 105430 105167 105500 105376 105159 105503 105512 104135 102213 101092 100343 98926 97439 97062
55583 97062 97263 96712 95670 95443 96146 96899 97599 98812 100552 102705 105843 110123 114340 117617 121036 125925
55567 125925 131565 136228 139494 141811 142774 141710 139185 136264 133017 129276 125837 123264 120541 116633
55553 116633 112403 109224 106716 103772 100863 99242 98630 97796 96900 97300 99328 101968 104396 106338 107439
55538 107439 107808 108641 110852 113668 115931 117969 120638 123385 125036 125792 126668 127528 127478 126725 126345 126595 127004
55521 127004 127676 128849 129613 128634 125939 122655 119365 116000 112798 110011 107096 103459 99472 95671 91694
55506 91694 87238 83192 80438 78369 75968 73400 71133 68559 65216 62351 61345 61385 60635 59048 58033
55491 58033 57946 57918 57804 58309 59338 59979 59946 59527 58451 56379 54105 52716 51992 51198 50833 51822 53538 54505
55473E4505K04O00J040L08p41q62m83m61n12l75p34j610j655m27M30j91r81n01
55455D7554M76N81J18M2R5l19p79p97q40j128q19L80J260R58L17K64M03K86M60
55436D8512J024R44j6m54L20R64M52j47K52P95M24j25J04M35l9o19k77N46R60
55417E4055J114J289Q87j99p33o7O06L06j6O11J261P48k94p16p85j099j040m6
55399E5882Q65O30q0j95p4l68n00P1L98k81q21K7J355J557Q89N99N95n3j069j433
55379E7994j193j187j506j776k167k785k860j912q81p81j144j062o72l93J61J152
55363C8988J622J012L64N70P88R8o62m21J70P9j30M24R10J28j190j456p40k24
55345D0330KN84J110O62l66q49p90r31j075n19M17Q53Q71J050J161O82pl50o98
$$ plain form
55473 54505 54709 55309 56349 56657 55916 55054 54571 54110 53598 53223 52489 50879 49224 48797 49227 49036 48055 47554
55455 47554 48030 48611 48729 48771 48866 48547 47768 46971 46131 45003 44184 44564 45824 46782 47099 47363 47766 48052 48512
55436 48512 49536 50480 50464 50010 50330 51294 51746 51599 51851 52646 53070 52945 53049 53484 53445 52826 52549 53095 54055
55417 54055 55169 56458 57345 57146 56413 56346 56952 57258 57242 57853 59114 59862 59568 58852 58067 56968 55928 55882
55399 55882 56747 57377 57297 57102 57028 56660 56160 56231 56629 56348 55527 55554 56909 58466 59355 59954 60549 60496 59427 57994
55379 57994 56801 55614 54108 52332 50165 47380 44520 42608 41727 40946 39802 38740 38068 37675 37836 38988
55363 38988 40610 41622 41986 42556 43344 43442 42780 42359 42529 42608 42478 42902 43812 43940 42750 41294 40554 40330
55345 40330 40332 40916 42026 42688 42322 41473 40683 39752 38677 38158 38575 39428 40299 41349 42510 43192 43185 42835 42137
55326D2137j363j508n23N42M58k10k32J75P5k24J67R24J075O79L19k06j020j094
55308D0171K07J428R39m32o96J77O25K78P8J54j95o85l60M57N83P7M9M99L71l86
55288D3339o75k58j9k06m5O63J087O65k79j232j765j396k65M85J02n49l29L71
55270C9694M62J6j67j13k57j75O32J435J347R56J250J697J214K25r7N8k76q40
55252D7061p78n09j000j715j482p67q17j141k91J248J535M03l11J68O77N01L11
55235D3093L70R0l61m1P76P66k8k1J138J796R07n29j333j630j718j158Q2J016
55217D3215R75M35j1l35m06J67J108J505J016J44o98j304j157j6J161J234M97
55200D7530n6m90j332j864j057K67M25k44N0J239J332o2r65l87J40n51j281p77
$$ plain form
55326 42137 40774 39266 38743 39285 39743 39533 39301 39476 39551 39327 39494 40418 41493 42172 42491 42285 41265 40171
55308 40171 40378 41806 42745 42313 41617 41794 42419 42697 42775 42929 42734 42049 41689 42146 42729 42806 42855 43354 43725 43339
55288 43339 42664 42406 42387 42181 42136 42799 43886 44551 44272 43040 41275 39879 39614 40099 40201 39652 39323 39694
55270 39694 40156 40172 40005 39892 39635 39460 40092 41527 42874 43830 45080 46777 47991 48216 48119 48177 47901 47061
55252 47061 46283 45774 44774 43059 41577 40810 39993 38852 38561 39809 41344 41747 41436 41604 42281 42782 43093
55235 43093 43463 43553 43192 43151 43927 44693 44665 44644 45782 47578 48485 47956 46623 44993 43275 42117 42199 43215
55217 43215 44190 44625 44614 44279 43873 44040 45148 46653 47669 47813 47115 45811 44654 44638 45799 47033 47530
55200 47530 47474 46984 45652 43788 42731 42998 43423 43179 43229 44468 45800 45738 44773 44386 44526 43975 42694 41917
55182D1917J66K74j23m4M66Q71J163J346R78J03m15k74k90q49j074l49N23N39
55164D4928o8m52l22J36O77Q56K84o08r17o11n08q04q27m23k10k76J3O09O01j67
55144D1911p45p04o84q87n24N93J432J366J047J023Q46K59n6L41Q75J081J284
55127D8458J553J247K35o08p73q04j006p51J66P83M03l04m19j6M15Q09J153J117
55109E1658P40N97Q84J175J343J697J981J480M09j31J01J60k94m07K02O67M64
55092F2726K63M62L60m10j003q17m93o03n66K13J253J888K132J967R86m95j274
55075F6589r26m41m74l63K68N31j15o61k19M75L98m4k5J58k01q17j015r56j083
55056F1079j159q15l76j57J85P53P96o5r35r67n89n12n29l28l85q87q09N69K136
$$ plain form
55182 41917 42083 42357 42234 42190 42656 43527 44690 46036 47014 47117 46702 46428 46138 45289 44215 43866 44389 44928
55164 44928 44860 44408 44086 44222 44899 45755 46039 45431 44514 43903 43395 42591 41764 41341 41131 40855 40868 41477 42078 41911
55144 41911 41166 40462 39778 38891 38367 38960 40392 41758 42805 43828 44674 44933 44877 45218 46093 47174 48458
55127 48458 50011 51258 51493 50885 50112 49308 48302 47551 47717 48500 48903 48599 48180 48164 48579 49388 50541 51658
55109 51658 52398 52995 53879 55054 56397 58094 60075 61555 61964 61833 61934 62094 61800 61393 61595 62262 62726
55092 62726 62989 63451 63811 63401 62398 61581 61088 60485 59919 60132 61385 63273 65405 67372 68358 67863 66589
55075 66589 65663 65222 64748 64385 64653 65184 65069 64408 64189 64664 65062 65018 64993 65151 64950 64133 63118 62162 61079
55056 61079 59920 59105 58729 58572 58757 59510 60306 60241 59306 58339 57750 57238 56709 56381 55996 55109 54300 54869 57005
55037E7005K316J258L42J60K48L00L50K23p8J26J245K426K482J433K31n47q74
55020F8646o94j48J50j82o64p98q00r03o60J70Q64P93M80O36R31P36L03J50m4
55001F8966p22j304j012l42m46j386k116j973j158l9J034J511J156O53Q34J551
54985F5207J988J782J197N75K56N77J348J807J683J702K380L105L268L355M026
54970I4256M828M967M770N149O143P121Q082R553J1480J3332J5082J7017J8728
54957B20508J9280J8287J6033J2622P907K208l627q918j3277j6237j7453j7272
54945B20061j6509j5690j4801j3685j2314j0805r362p994o313m134k140j233j200
54932A03881r39j65L24K40M05J211J980K502L763O112Q107Q534Q390R472J1926
$$ plain form
55037 57005 59321 60579 60921 61081 61329 61629 61979 62202 62124 62250 63495 65921 68403 69836 70067 69520 68646
55020 68646 67952 67804 67954 67772 67108 66310 65510 64607 63947 64117 64981 65774 66254 66890 67821 68557 68860 69010 68966
55001 68966 68244 66940 65928 65586 65140 63754 61638 59665 58507 58468 59502 61013 62169 62822 63656 65207
54985 65207 67195 68977 70174 70749 71005 71582 72930 74737 76420 78122 80502 83607 86875 90230 94256
54970 94256 99084 104051 108821 113970 120113 127234 135316 144869 156349 169681 184763 201780 220508
54957 220508 239788 258075 274108 286730 294637 296845 293218 284300 271023 254786 237333 220061
54945 220061 203552 187862 173061 159376 147062 136257 126895 118901 112588 108454 106314 105081 103881
54932 103881 102942 102777 103101 103341 103746 104957 106937 109439 113202 119314 127421 135955 144345 153817 165743
54917A65743J4559J6728J8379J8905J7575J4716J1170O997J895l527q205j1925
54905B63010j5033j7225j7912j7406j6580j5569j3914j1726r624p786o106m911
54893A09218m495m271l472k408j961k157k236j897j457j093q11q31j128j027k22
54878G9752L27l92j837k613k344j732j141m48O7j07q22j540k198k821k793j659
54862E7699k43L23J74J81L03r7o85m91L86Q90P55O71Q14O64K54J78K71k65j240
54843F0542j454o14J07q1m86j91O38J280J475J337R56M94K46L84R62J950K864
54826G0409K830J725P36Q63J402J119L82N99J821K687K740L116M448N774O222
54811A06873O454P556R452J1267J2642J3890J5325J6855J7937J7750J5858J2766
$$ plain form
54917 165743 180302 197030 215409 234314 251889 266605 277775 284772 286667 283140 274935 263010
54905 263010 247977 230752 212840 195434 178854 163285 149371 137645 128021 120235 114129 109218
54893 109218 104723 100452 96980 94572 92611 90454 88218 86321 84864 83771 82960 82129 81001 79974 79752
54878 79752 80079 79687 77850 75237 72893 71161 70020 69572 69639 69532 68710 67170 64972 62151 59358 57699
54862 57699 57456 57779 57953 58134 58437 58340 57655 57164 57550 58440 59195 59866 60680 61344 61598 61776 62047 61782 60542
54843 60542 59088 58474 58581 58500 58014 57823 58461 59741 61216 62553 63509 64003 64249 64633 65595 67545 70409
54826 70409 73239 74964 75700 76563 77965 79084 79466 80065 81886 84573 87313 90429 94877 100651 106873
54811 106873 113327 120883 130335 141602 154244 168134 183459 200314 218251 236001 251859 264625
54799B64625R334N712J426l505q229j1848j3949j4517j4008j3327j3029j2629
54787A76056j1390r511p749o240m682l378k918l001k740k024j507j300q75k11
54773A18530K25O49J859L776N295N874O186O943Q112R518J1237J3102J4680J5825
54759B21811J6492J6046J3830J0257O263J875l283q325j1562j2838j3680j4806
54747B22080j5188j4138j2548j1290r924q060o564o239o416o072n421n213n271
54734A09736m904m223l882l948l933l598k987k021q14m2k61j114j785j943j784
54719G2497j431r27m63j26L18R91J467J227L73l78l94L85J414J887J407M24k97
54702G8374m99m79m09j67J71L49L87N41P22N88J84j11k65n40p58l66O66J691K204
$$ plain form
54799 264625 273959 279671 281097 277592 269363 257515 243566 229049 215041 201714 188685 176056
54787 176056 164666 155155 147406 141166 136484 133106 130188 127187 124447 122423 120916 119616 118741 118530
54773 118530 118755 119404 121263 125039 130334 136208 142394 149337 157449 166967 178204 191306 205986 221811
54759 221811 238303 254349 268179 278436 284699 286574 283291 274966 263404 250566 236886 222080
54747 222080 206892 192754 180206 168916 158992 150932 144368 138129 131713 125641 120220 115007 109736
54734 109736 104832 100609 96727 92779 88846 85248 82261 80240 79426 79384 79123 78009 76224 74281 72497
54719 72497 71066 70139 69676 69550 69868 70859 72326 73553 73926 73548 73154 73539 74953 76840 78247 78671 78374
54702 78374 77875 77396 76987 76820 76991 77340 77727 78268 78990 79578 79762 79651 79386 78846 78088 77722 78388 80079 82283
54683H2283K179J608N09n25o46J65J025J341J363J476J665J858K132K422K574
54668A01429K742L128L397L110K562K439K680K658K307K104J920J087l30j426
54654A29807j743j694j558j157o20l24k5P40J394R14j53n3J448K448J831J005
54638A32260J621L074L734L434L172L182K804J868Q46j28j340k750m033n141o130
54623A36473o671o307n077l423j762m95L2p9l10m47p14r51m67Q48K058K361K045
54606A17114J725J352O22k28p59r81j141j273j413j781k258k371k085k032k497
54591A01994k897k803k687l054l456l150k195j242o94o36j105j772j886j104j03
54576G3210K79N4j95k60l50n21n46l15J4J26k19q35j042l59P72J420J212L89q00
$$ plain form
54683 82283 84462 86070 86579 86054 85408 85573 86598 87939 89302 90778 92443 94301 96433 98855 101429
54668 101429 104171 107299 110696 113806 116368 118807 121487 124145 126452 128556 130476 131563 131233 129807
54654 129807 128064 126370 124812 123655 123035 122711 122686 123426 124820 125734 125581 125528 126976 129424 131255 132260
54638 132260 133881 136955 140689 144123 147295 150477 153281 155149 155995 155867 154527 151777 147744 142603 136473
54623 136473 129802 123495 118418 114995 113233 112738 112770 112691 112381 111934 111220 110269 109802 110650 112708 115069 117114
54606 117114 118839 120191 120813 120585 119826 118845 117704 116431 115018 113237 110979 108608 106523 104491 101994
54591 101994 99097 96294 93607 90553 87097 83947 81752 80510 79816 79180 78075 76303 74417 73313 73210
54576 73210 73489 73543 73348 73088 72738 72217 71671 71356 71370 71496 71277 70442 69400 69041 69813 71233 72445 72834 72034
54557G2034j989k330j346K3M18l1j05L33J97o69j077n62j08j37L57J737K605J974
54539G1324R03O54P09J33n09k23N63R02J104J912K769K660K017K047K668K729
54523I2362K005J282Q01J30n54o27l78p98j904k586k292j718j604j804j752j136
54507G9427o4Q37O85o24j919j984r57J35P33Q68N03j84l65M72J511J624J025P73
54489H2496R48O54l40j213j390j084m72M76J307J267M63r7J29N86N52j4p02j069
54471H2497p84J38J040J184N70q9j50N06J478J964J342K5p96p35p21j351j753
54454H4365j090k16m64j502j921j441r53p35k65L28K58l41m32J80N23K10K6L81
54436G6911N02j25p94p23k17J04L59R27J516J485P42j50n43j83O21J156R91M96
$$ plain form
54557 72034 70045 67715 66369 66392 66810 66779 66674 67007 67204 66535 65458 64896 64788 64651 65008 66745 69350 71324
54539 71324 72227 72881 73590 73723 73214 72991 73554 74456 75560 77472 80241 82901 84918 86965 89633 92362
54523 92362 94367 95649 96450 96580 96026 95399 95021 94223 92319 89733 87441 85723 84119 82315 80563 79427
54507 79427 79363 80200 80885 80261 78342 76358 75401 75536 76269 77137 77640 77456 77091 77563 79074 80698 81723 82496
54489 82496 83444 84098 83758 82545 81155 80071 79599 80075 81382 82649 83112 83015 83144 83730 84282 84268 83566 82497
54471 82497 81713 81851 82891 84075 84645 84556 84406 84912 86390 88354 89696 89721 88925 88190 87469 86118 84365
54454 84365 83275 83059 82595 81093 79172 77731 76778 76043 75778 76106 76364 76023 75591 75771 76294 76504 76530 76911
54436 76911 77413 77288 76494 75771 75554 75658 76017 76944 78460 79945 80687 80537 79994 79811 80432 81588 82579 83075
54418H3075L24N47P47P61P32O59N48P39J322J633J225R69J996L788M671M242L845
54401A11823M330M791M146K725J609J252J529K293L158L351K485J062k30j198
54387A43126j808j879j588j604k203k786k795k586k802l351l648l442k884k067
54373A07683j081l26k76r41j913k775l308l391l019k302j374l68M53Q02P00M92
54357H9056M48N51O92Q26Q95Q42Q01J050J692K492L083L290L294L496M020M384
54341A20912L961K882J969J638J432R45N07M42K78n60j780k661l111l514l883
54326A19457m004m019m068l720k694j780j938k742k882k123j562j778k067j801
54312H2279j429j527j859j964j998k320k691k479j473j02R46J233Q71L95J79Q4
$$ plain form
54418 83075 83399 83946 84693 85454 86186 86845 87393 88132 89454 91087 92312 93281 95277 99065 103736 107978 111823
54401 111823 116153 120944 125090 127815 129424 130676 132205 134498 137656 141007 143492 144554 144324 143126
54387 143126 141318 139439 137851 136247 134044 131258 128463 125877 123075 119724 116076 112634 109750 107683
54373 107683 106602 106276 106000 105059 103146 100371 97063 93672 90653 88351 86977 86609 87062 87864 88564 89056
54357 89056 89504 90055 90747 91573 92468 93310 94111 95161 96853 99345 102428 105718 109012 112508 116528 120912
54341 120912 124873 127755 129724 131362 132794 133739 134246 134688 134966 134406 132626 129965 126854 123340 119457
54326 119457 115453 111434 107366 103646 100952 99172 97234 94492 91610 89487 87925 86147 84080 82279
54312 82279 80850 79323 77464 75500 73502 71182 68491 66012 64539 64437 65383 66616 67487 67882 68061 68145
54296F8145q1q6K45M68L2q25j401j506j457j335j006p16p97r19m81L52Q54R17
54278F0403J065J347J193N24K3J15N02Q40J083J009L45m60m85L72J127J036M57
54261G0496J20K22N36Q18Q40O05N28Q91J177P19j62n09j84Kl76q80j160j313j196
54242G1174m73M25N34j14l94J92P79O36K27J26L7l23m09K59J124J416J268J190
54224G7674J054M21n20j184j369j254q71k38L16M99N09O93R89J028O89K13p3m1
54206G8535J16J4m38q66r55r26j031r79m77K3m8l65k32K33M58N69R62J110K34
54187G5937j033j331q19r64j860j829k74J089Q07k53n66j49K03M67Q34P63mm69
54169G0549J93J139J053R1o74r30j020q63k65K61J61k08l49o13j279j482m43Q77
$$ plain form
54296 68145 68064 67978 68223 68691 68723 67898 66497 64991 63534 62199 61193 60477 59680 58761 58280 58632 59486 60403
54278 60403 61468 62815 64008 64532 64555 64670 65172 66012 67095 68104 68449 67989 67504 67876 69003 70039 70496
54261 70496 70616 70838 71374 72192 73032 73637 74165 75056 76233 76952 76790 76281 76097 76099 75723 74843 73683 72370 71174
54242 71174 70701 71126 71660 71546 71152 71344 72123 72759 72986 73112 73149 72826 72417 72676 73800 75216 76484 77674
54224 77674 78728 79149 78629 77445 76076 74822 73951 73713 74029 74528 75037 75730 76719 77747 78436 78649 78576 78535
54206 78535 78651 78665 78227 77361 76406 75480 74449 73470 72993 73016 72968 72603 72371 72604 73062 73631 74593 75703 75937
54187 75937 74904 73573 72754 71790 69930 68101 67827 68916 69723 69470 68904 68755 68958 69425 70259 71022 71018 70549
54169 70549 70742 71881 72934 73025 72351 71421 70401 69538 69273 69534 69695 69487 69138 68525 67246 65764 65321 66198
54151F6198Q86l16j179r88m32p0K69N82M91J07k4Q9o1m33m80k53m32j149j750
54132F1055j789j453r03r7P17J121J185J295J354J001M99M07M63j32j245j723
54116F1755j115l96m73r13p74mP27J072J175J082O15j40p33q34n29j02L49Q62
54098F1624J278J222O53J83L90R41R31J62n31m68K6L40M48N92O18L38J05L06O45
54079F9803N80K59K71O74R01O07M1l84m41r1M41P00M20j53n85o48k75N32J453
54060G4105J995K124K273K442K018Q68j07j76J95K53K53Q38J754K185K064K004
54044I5088K142K080J849J993K632L310L770M183M601M884N160N671O208O323
54030A49894O081N949O060O107N977N822N606N166M627M163L511K449J500J401
$$ plain form
54151 66198 67084 66768 65589 64601 64169 64099 64368 64950 65441 65548 65524 65613 65552 65119 64639 64386 63954 62805 61055
54132 61055 59266 57813 56910 56813 57530 58651 59836 61131 62485 63486 63985 64392 64855 64723 63478 61755
54116 61755 60640 60244 59771 58858 58084 58080 58807 59879 61054 62136 62751 62611 61878 61044 60515 60413 60762 61624
54098 61624 62902 64124 64777 64960 65350 66291 67222 67384 66853 66385 66411 66751 67199 67791 68409 68747 68852 69158 69803
54079 69803 70383 70642 70913 71587 72488 73095 73136 72752 72311 72220 72661 73361 73781 73628 73043 72395 72120 72652 74105
54060 74105 76100 78224 80497 82939 84957 85825 85718 85542 85737 85990 86243 87081 88835 91020 93084 95088
54044 95088 97230 99310 101159 103152 105784 109094 112864 117047 121648 126532 131692 137363 143571 149894
54030 149894 155975 161924 167984 174091 180068 185890 191496 196662 201289 205452 208963 211412 212912 214313
54016B14313J881J855Q60m24j248j676k206l075m097m819m819m248l954m528n404
54001A78411n504m721l983l862l862l329k424j899k190k956l320k683j484q75
53987A35319j326j961j825j244j128j347r16K87J102O82m04j056q95k88L42Q11
53971A26153J110J354J511J239L15p45j038l35O28J048Q08K77j56k67j04j1k72
53954A31515o53o57j68M08O55M58j09q32j280r71K49K089L903M964N048M825N223
53937A54667O198O787O639O615P302P853P228N793M634L861K793J450M88q1p73
53922B21454j302p50P36J706J333M86M78J539L017M299N126N555N943O520O859
53907B62999O410N446M712M151L007J272m7m76p95j690k640k827k437k266k594
$$ plain form
54016 214313 216194 218049 218909 218485 217237 215561 213355 210280 206183 201364 196545 192297 188343 183815 178411
54001 178411 172907 168186 164203 160341 156479 153150 150726 148827 146637 143681 140361 137678 136194 135319
53987 135319 133993 132032 130207 128963 127835 126488 125572 125859 126961 127643 127239 126183 125288 125000 125342 126153
53971 126153 127263 128617 130128 131367 131682 130937 129899 129564 130192 131240 132048 132325 132169 131902 131798 131787 131515
53954 131515 130862 130205 130037 130445 131100 131558 131449 130617 129337 128366 128615 130704 134607 139571 144619 149444 154667
53937 154667 160865 167652 174291 180906 188208 196061 203289 209082 213716 217577 220370 221820 222308 222227 221454
53922 221454 220152 219402 220138 221844 223177 223663 224141 225680 228697 232996 238122 243677 249620 256140 262999
53907 262999 269409 274855 279567 283718 286725 287997 287950 287474 286679 284989 282349 279522 277085 274819 272225
53892B72225l160l829m612n322n725n913o083o200o154o064o073o097o005n819
53878A95169n549n104m517m022l696l356k937k735l041l751m425m556l890k701
53864A40889j762j668k252k853l118l112k925k623k546k996l578l455k403j189
53850A04409o64q32j006o78o5J30m23j114r97l0Q07Q50N57N03M04p3k83M89J569
53831A03553J573L77p64j093j104j320j416r84k52K91M53K86O7L30J215J926J542
53814A04680M09j62M54J667K701L256L174K500J928K225L105L642L756M167M914
53799A42416N194M882M821N225N182M287L463L435L560L006K084J535J361J168
53785A91619R85R85J044J101J312J384N93r85k217k498k622l312l927l595k775
$$ plain form
53892 272225 269065 265236 260624 255302 249577 243664 237581 231381 225227 219163 213090 206993 200988 195169
53878 195169 189620 184516 179999 175977 172281 168925 165988 163253 160212 156461 152036 147480 143590 140889
53864 140889 139127 137459 135207 132354 129236 126124 123199 120576 118030 115034 111456 108001 105598 104409
53850 104409 103745 102913 101907 101229 101164 101294 100871 99757 98760 98730 99537 100387 100944 101447 101851 101778 101495 101984 103553
53831 103553 105126 105503 104739 103646 102542 101222 99806 98822 98570 98861 99314 99600 99667 99997 101212 103138 104680
53814 104680 105089 104927 105381 107048 109749 113005 116179 118679 120607 122832 125937 129579 133335 137502 142416
53799 142416 147610 152492 157313 162538 167720 172007 175470 178905 182465 185471 187555 189090 190451 191619
53785 191619 192604 193589 194633 195734 197046 198430 199023 198038 195821 193323 190701 187389 183462 179867 177092
53770A77092k495k678k460j789j610k485l848m647m244k862j574j490k569l531
53756A38810l386k467j623j024m02J37K74P2j79l65l74O2Q14J135N30n33j244
53739A30237j332r13j17O80P81mr49j347j284j124q65o34j019k170l144k966j865
53722A11965p15K05J043J514J215N33L61R24J622J900J702J242P78M40j13j375
53706A23241k998l633k423j04J992L455M560N137M724L649K899K896L061K670
53692A49126J644N43J16P12J797K414K325K286K777L177K793K043J827K156K222
53677A77958J595O41k4L2P70J502J403O24K50O57P77k59j639k033j459r02p22
53660A79171o51q47j548k090j623o81o07j443j779q79K69M64j70o10j76R70K023
$$ plain form
53770 177092 174597 171919 169459 167670 166060 163575 159727 155080 150836 147974 146400 144910 142341 138810
53756 138810 135424 132957 131334 130310 129908 130045 130319 130391 130212 129847 129473 129535 130349 131484 132014 131481 130237
53739 130237 128905 127992 127875 128555 129336 129332 128383 127036 125752 124628 123763 123129 122110 119940 116796 113830 111965
53722 111965 111250 111455 112498 114012 115227 115760 116121 117045 118667 120567 122269 123511 124289 124729 124616 123241
53706 123241 120243 116610 114187 114083 116075 119530 124090 129227 133951 137600 140499 143395 146456 149126
53692 149126 150770 151313 151429 152141 153938 156352 158677 160963 163740 166917 169710 171753 173580 175736 177958
53677 177958 179553 180194 180170 180202 180972 182474 183877 184501 184751 185408 186185 185926 184287 182254 180795 179893 179171
53660 179171 178520 177673 176125 174035 172412 171731 171124 169681 167902 167023 167292 167756 167586 166976 166800 167770 169793
53643A69793K070R51l43o84j16M26M56K45j1m00p06n50j41q8l34j88N09J121J248
53624A73258J240J448J652J600J380J132Q84Q38J262J941K320K210J852J358P26
53609A95101L66Q57K063L203L802L977L769L034K121J829K422L267L699L685L539
53594B36734L543L887M433M556L877L068L122L889M217L680L070K993K980K524
53580B86573K041K171K717K972K636J939J218P81Q30J155J266J056R78J317J813
53565C11463K122K228K148J706R25K14p8K3L61P83R96P70L75K80L80K15m6L23
53547C25188J303J878J504R23R12J026M94l45n17M4M46K75J41O26J486K152K529
53530C40065K881L200L167K611J831J318J320J725K329L038L768M369M786N165
$$ plain form
53643 169793 171863 172814 172471 171787 171671 172097 172553 172798 172787 172387 171681 171131 170990 170902 170568 170380 170889 172010 173258
53624 173258 174498 175946 177598 179198 180578 181710 182594 183432 184694 186635 188955 191165 193017 194375 195101
53609 195101 195467 196324 198387 201590 205392 209369 213138 216172 218293 220122 222544 225811 229510 233195 236734
53594 236734 240277 244164 248597 253153 257030 260098 263220 267109 271326 275006 278076 281069 284049 286573
53580 286573 288614 290785 293502 296474 299110 301049 302267 303048 303878 305033 306299 307355 308333 309650 311463
53565 311463 313585 315813 317961 319667 320592 320806 320728 320751 321112 321895 322891 323661 324036 324316 324696 324911 324865 325188
53547 325188 326491 328369 329873 330796 331708 332734 333228 332883 332366 332410 332856 333131 333272 333898 335384 337536 340065
53530 340065 342946 346146 349313 351924 353755 355073 356393 358118 360447 363485 367253 371622 376408 381573
53516C81573N571N811N745N635N897O640P703Q945J0152J0928J1135J1283J1978
53503D88996J3135J4213J5067J5925J6716J7142J7386J7979J8832J9252J9098
53492F73741J9088J9660K0303K0505K0634K1255K2139K2665K2817K3068K3508
53481I09383K3711K3405K2693K1733K0720K0173K0711K2256K3854K4501K4060
53470A157200K3189K2504K1993K1319K0388J9428J8511J7374J5855J4249J2933
53459A364943J1904J0992J0285R935R595Q541O442L725J137q59k315l705n541
53446A425079p750r602j0585j1200j2381j4249j5973j6919j7360j7891j8677j9550
53434A252942k0423k1255k1840k1972k1761k1552k1533k1492k0991j9837j8337
$$ plain form
53516 381573 387144 392955 398700 404335 410232 416872 424575 433520 443672 454600 465735 477018 488996
53503 488996 502131 516344 531411 547336 564052 581194 598580 616559 635391 654643 673741
53492 673741 692829 712489 732792 753297 773931 795186 817325 839990 862807 885875 909383
53481 909383 933094 956499 979192 1000925 1021645 1041818 1062529 1084785 1108639 1133140 1157200
53470 1157200 1180389 1202893 1224886 1246205 1266593 1286021 1304532 1321906 1337761 1352010 1364943
53459 1364943 1376847 1387839 1398124 1408059 1417654 1426195 1432637 1436362 1437499 1436640 1434325 1430620 1425079
53446 1425079 1417329 1407727 1397142 1385942 1373561 1359312 1343339 1326420 1309060 1291169 1272492 1252942
53434 1252942 1232519 1211264 1189424 1167452 1145691 1124139 1102606 1081114 1060123 1040286 1021949
53423A021949j6939j5636j4061j2227j0729r924r359q473p376o460n615m456l073
53410H97621j885r18J08J149J988K858M253O132Q006R765J1729J3831J5529J6587
53396I86753J7400J8340J9393K0450K1490K2426K3247K4249K5649K7126K8285
53385A234808K9426L1102L3107L4723L5843L7005L8375L9583M0594M1829M3275
53374A639670M4416M5150M5870M6486M6437M5744M5088M4482M3030M0446L7791
53363B124610L5967L4478L2306K9273K5778K1932J7755J3713J0251P125L817K61
53351B357266l264o701j0235j3987j7910k1655k4565k6386k8058l0875l4800l8438
53339B100392m0914m2755m4448m5448m5310m4712m4337m3639m1839l9476l7743
$$ plain form
53423 1021949 1005010 989374 975313 963086 952357 942433 933074 924601 917225 910765 905150 900694 897621
53410 897621 895736 894818 894926 896075 898063 900921 905174 911306 919312 929077 940806 954637 970166 986753
53396 986753 1004153 1022493 1041886 1062336 1083826 1106252 1129499 1153748 1179397 1206523 1234808
53385 1234808 1264234 1295336 1328443 1363166 1399009 1436014 1474389 1513972 1554566 1596395 1639670
53374 1639670 1684086 1729236 1775106 1821592 1868029 1913773 1958861 2003343 2046373 2086819 2124610
53363 2124610 2160577 2195055 2227361 2256634 2282412 2304344 2322099 2335812 2346063 2353188 2357005 2357266
53351 2357266 2354002 2347301 2337066 2323079 2305169 2283514 2258949 2232563 2204505 2173630 2138830 2100392
53339 2100392 2059478 2016723 1972275 1926827 1881517 1836805 1792468 1748829 1706990 1667514 1629771
53328A629771l6784l5782l4507l3617l3457l3468l2855l1278k8943k6532k4851
53317A277697k3968k2978k1159j8976j7305j6027j4337j2173j0377r405q799q149
53305A094044p782q088q744r039q655p738o415m670k748j314q89j126j034j12
53291A025690J073J808K242K965L929M656N308O543Q300R759J0751J2063J3998
53278A109085J5738J6658J7263J8136J8975J9473K0113K1139K1600K0554J8612
53267A317346J7172J6536J5887J4690J3069J1129Q944P050N950N289M297K816
53255A440175J120r16l532o233q252r623j0943j2232j3136j4010j5624j7783j9376
53242A309635j9954k0222k0741k1227k1499k1984k2816k3242k2620k1415k0576
$$ plain form
53328 1629771 1592987 1557205 1522698 1489081 1455624 1422156 1389301 1358023 1329080 1302548 1277697
53317 1277697 1253729 1230751 1209592 1190616 1173311 1157284 1142947 1130774 1120397 1110992 1102193 1094044
53305 1094044 1086262 1078174 1069430 1060391 1051736 1043998 1037583 1032913 1030165 1028851 1027962 1026836 1025802 1025690
53291 1025690 1026763 1028571 1030813 1033778 1037707 1042363 1047671 1054214 1062514 1072273 1083024 1095087 1109085
53278 1109085 1124823 1141481 1158744 1176880 1195855 1215328 1235441 1256580 1278180 1298734 1317346
53267 1317346 1334518 1351054 1366941 1381631 1394700 1405829 1414773 1421823 1427773 1433062 1437359 1440175
53255 1440175 1441295 1440379 1436847 1430614 1422362 1412739 1401796 1389564 1376428 1362418 1346794 1329011 1309635
53242 1309635 1289681 1269459 1248718 1227491 1205992 1184008 1161192 1137950 1115330 1093915 1073339
53231A073339k0369k0301j9911j9124j8095j7095j6383j5926j5351j4408j3361
53220H83015j2771j2832j3040j2564j1131r432q399q042p464o101m406l030j960
53207G71843j011n39r72j998k974l791m677n530o158o834p790q487q298p665p627
53192F97492q329q973r121q992q511p361o109o071p562r303j0117j0278j0583
53179E86182j1031j1197j1249j1580j1917j1617j0709r906r606r477r035q254
53167D60604p515p198p425p987q509q732q592q118p344o435n717n448n624n927
53153C60033n929n507n111n309n885n856m743l375k899l394m131m816n681o476
53139B90921o428n434m423m141m274m151l688l210k832k455k071j722j383j153
$$ plain form
53231 1073339 1052970 1032669 1012758 993634 975539 958444 942061 926135 910784 896376 883015
53220 883015 870244 857412 844372 831808 820677 811245 802846 794804 787340 781239 776833 773803 771843
53207 771843 770832 770293 769321 767323 764349 760558 755881 750351 744193 737359 729569 721082 712784 705119 697492
53192 697492 689163 680190 671069 662077 653566 646205 640096 634025 626463 617160 607043 596765 586182
53179 586182 575151 563954 552705 541125 529208 517591 506882 496976 487370 477893 468858 460604
53167 460604 453089 445891 438466 430479 421970 413238 404646 396528 389184 382749 377032 371584 365960 360033
53153 360033 354104 348597 343486 338177 332292 326436 321693 318318 315419 312025 307894 303078 297397 290921
53139 290921 284493 279059 274636 270495 266221 262070 258382 255172 252340 249885 247814 246092 244709 243556
53125B43556j148j092m90N52J189R45M74O86J468J858J404P14N79J019J479J675
53109B54868J908K432K796K154L15j812l077l272l151l431m148m933n459n559
53095B29631n223m688m291m106l957l738l533l321k902k290j909k176k971l677
53081A80849l766l268k670k317k003j281j70O93P01r6j126j834k009j879j941
53066A57883k428k832k355r91L29Q74Q67Q02O37K24j24j49k53q15j362j175m13
53049A48719J79M10N99P14M46oj98l39r49j700j665q21k35n06j035j180j137j238
53031A40058j274j049q45q22o41j69L1m47j086j127n64K7M01P20J045J158Q55
53014A36271J59o40j107j040p63p31q58p15k87J9J25L11M62L3r43j570j207k14
$$ plain form
53125 243556 242408 241316 240826 241378 242567 243512 243986 244672 246140 247998 249402 250116 250695 251714 253193 254868
53109 254868 256776 259208 262004 264158 264473 262661 259584 256312 253161 249730 245582 240649 235190 229631
53095 229631 224408 219720 215429 211323 207366 203628 200095 196774 193872 191582 189673 187497 184526 180849
53081 180849 177083 173815 171145 168828 166825 165544 165374 166067 166768 166672 165546 163712 161703 159824 157883
53066 157883 155455 152623 150268 149277 149606 150480 151347 152149 152786 153010 152886 152737 152484 151669 150307 149132 148719
53049 148719 148898 149308 149907 150621 151067 151061 150863 150524 149575 147875 146210 145389 145154 144648 143613 142433 141296 140058
53031 140058 138784 137735 136890 136068 135427 135258 135289 134842 133756 132629 132065 132092 132493 133213 134258 135416 136271
53014 136271 136430 135790 134683 133643 132880 132149 131291 130576 130289 130308 130433 130744 131206 131239 130296 128726 127519 127305
52996A27305P54J477J866J700J213J186J792K018R68o82j435q53N6K65j96n99
52980A36835m31K20R06J353J769K420L041L131K872L062L861M351L933L351L626
52965A74300M490M870M474L920L409K398P82n67q75n01m10j046k084k977l338
52950A86845k998k134j355j296j982k741k876k353j705j364j281j261j321j533
52936A60645j744j747j583j377j072o68n08q81j397j343o36R5L80L35K24J45K71
52919A49139P71J287J115J90o88q67n79l10n5K94M73K48o8q1N3L3P0N33J184J429
52899A54171J205J003J065J124R75P63N75K35l19p46p04l61j71j89R9J051K160
52882A61936K465J717O66M6l05q06j167q21p5J35l23n46L1R09J467J791K040J779
$$ plain form
52996 127305 128059 129536 131402 133102 134315 135501 137293 139311 140279 139597 138162 137309 137365 137630 137434 136835
52980 136835 136404 136624 137530 138883 140652 143072 146113 149244 152116 155178 159039 163390 167323 170674 174300
52965 174300 178790 183660 188134 192054 195463 197861 198643 198076 197201 196700 196290 195244 193160 190183 186845
52950 186845 183847 181713 180358 179062 177080 174339 171463 169110 167405 166041 164760 163499 162178 160645
52936 160645 158901 157154 155571 154194 153122 152454 151946 151065 149668 148325 147689 147784 148164 148499 148723 148868 149139
52919 149139 149910 151197 152312 152502 151814 150947 150368 150058 150003 150297 150770 151018 150950 150869 150922 150955 151025 151558 152742 154171
52899 154171 155376 156379 157444 158568 159543 160306 160881 161116 160797 160051 159347 158986 158815 158626 158725 159776 161936
52882 161936 164401 166118 166784 166830 166525 165719 164552 163731 163656 163791 163468 162922 162953 163862 165329 167120 169160 170939
52864A70939P27l70m38O24J860K300J671L90p00q10J50J515K635L353L601L201
52848A90648K405K102K778L746M029L623L234L120K892K301J521O91k04j045j609
52833B20232j886k016k042k009k084k234k103j648j500k216l387m174m370m340
52819A84223m125l444k467j857j870k097k201k312k537k645k445k122j910j784
52805A50407j608j348j038p30m98l16k0L69M62j2p32j133j173j247j375j088k42
52788A38678N41M76n10j762k510k408j693r46o00o03n50j09O94J466J566N40j327
52771A30943l028l651l192k299j517j033r32j209j579j684j491j227r55o21m41
52756A06084q06j647k288k162j416n99%M32O57M05l93j279j706j686j678j808
$$ plain form
52864 170939 171666 171296 170858 171482 173342 175642 177313 177703 177003 176193 176343 177858 180493 183846 187447 190648
52848 190648 193053 195155 197933 201679 205708 209331 212565 215685 218577 220878 222399 223090 222886 221841 220232
52833 220232 218346 216330 214288 212279 210195 207961 205858 204210 202710 200494 197107 192933 188563 184223
52819 184223 180098 176654 174187 172330 170460 168363 166162 163850 161313 158668 156223 154101 152191 150407
52805 150407 148799 147451 146413 145683 145185 144869 144849 145218 145680 145668 144936 143803 142630 141383 140008 138920 138678
52788 138678 139219 139695 139185 137423 134913 132505 130812 129866 129266 128663 128113 128004 128698 130164 131730 132270 130943
52771 130943 127915 124264 121072 118773 117256 116223 115291 114082 112503 110819 109328 108101 107146 106525 106084
52756 106084 105278 103631 101343 99181 97765 97166 97166 97598 98255 98660 98267 96988 95282 93596 91918 90110
52740I0110j599p34K66O27L13r1k93m47n00j90J87j35j178j867j430n08k47p17
52722H1567r94n05L61Q60O48m6o09n06J26N55K93l27o70n79k76J11N78R98J276
52703H2861J509J758J892J917K114K565K920K930K823K856K894K782K608K322
52689A16751J629O42l3k35n87j371j920j784j634k080k443j859r35r69j939k629
52673I8604k563k388k448k307j859j617j610j223m33j22o62j203r18j41K89J12
52657G9511m34j101j583j482p85L2O14R70R87L80n90j065o45R4M70N09N42N73
52639G6997N22N19N79L44l56j170j698j898j767j102l1P96R81Q76R02Q59M24j49
52621G5628m06m38o12p91n64J7M40M75K90j09q94j799j999j051M16J297J191P49
$$ plain form
52740 90110 88511 87777 88043 88670 88983 88892 88599 88152 87652 87462 87649 87514 86336 84469 83039 82531 82284 81567
52722 81567 80573 80068 80429 81289 81937 81891 81282 80776 80902 81457 81750 81423 80753 80174 79898 80009 80587 81585 82861
52703 82861 84370 86128 88020 89937 92051 94616 97536 100466 103289 106145 109039 111821 114429 116751
52689 116751 118380 119022 118989 118754 118167 116796 114876 113092 111458 109378 106935 105076 104141 103172 101233 98604
52673 98604 96041 93653 91205 88898 87039 85422 83812 82589 82156 82034 81372 80169 79251 79110 79399 79511
52657 79511 79077 77976 76393 74911 74126 74158 74772 75742 76729 77109 76519 75454 74809 74903 75373 75882 76424 76997
52639 76997 77519 78038 78617 78961 78605 77435 75737 73839 72072 70970 70939 71735 72716 73592 74494 75353 75777 75628
52621 75628 75222 74784 74172 73381 72817 72834 73274 73749 74039 73930 73036 71237 69238 68187 68603 69900 71091 71840
52603G1840Q32J504K045J813R51J76l0K06M27L32m8m91p58p19m55k05k12m51m84
52584G6273J95J490K461K218J017M9O9O96J182J294J139P81M65O40J222J353N35
52567I3079n09p81l72l5J11N51J241J554J323J054R89Q49N90N60P84P91M17Q7
52549A02283J75N91J138J666J873J574J164J158J296R21K34J51Q31J258P16k52
52533A16777p57o75l22K49J024J612J626J201P76O35Q49J210J233O22j53l31Q5
52516A25661L69K23Q0J77J73r9l26m20o84r96p65j0M46K72J47M81O26P1o03o92
52496A24131m89n42o13k85N7j70o82q05n22k06J85P53R71L97l39k91L53O25L76
52477A22904L71P72P85M8n79j51J105K154K356J904J361J089J036R74Q34P75Q25
$$ plain form
52603 71840 72672 74176 76221 78034 78985 79161 79131 79337 79764 80096 80048 79557 78799 78080 77625 77420 77208 76757 76273
52584 76273 76468 77958 80419 82637 83654 83703 83772 84468 85650 86944 88083 88864 89329 89969 91191 92544 93079
52567 93079 92570 91789 91417 91382 91493 92044 93285 94839 96162 97216 98205 99054 99644 100204 100988 101779 102196 102283
52549 102283 102458 103049 104187 105853 107726 109300 110464 111622 112918 113839 114073 114224 115055 116313 117029 116777
52533 116777 116020 115345 115023 115272 116296 117908 119534 120735 121511 122146 122995 124205 125438 126060 125907 125576 125661
52516 125661 126030 126253 126333 126510 126683 126584 126258 125838 125154 124158 123393 123383 123829 124101 124248 124729 125355 125426 124823 124131
52496 124131 123642 123100 122487 122202 122259 122089 121407 120602 120080 119874 120059 120812 121783 122180 121841 121550 121903 122528 122904
52477 122904 123275 124047 124832 124880 124301 124150 125255 127409 129765 131669 133030 134119 135155 136129 136963 137738 138563
52460A38563P62M60J17p3j90l35l88k33L2L27O50P85M19k34n20k75p2j71l3O22
52440A40213J099P73J18j22j29l58l66N18J658J632K67r84r61q1N69N28L9n17
52422A43896p81n40J2M31N71O78R21J224J564K018K438K499K100J473R25P35J074
52405A61238J641J694R25R3P6O20P10J11l99m06n57j434k483k667j784o85k55
52388A56438n84j073j122o40K3N25P64P00L21j49l38k21j53j81J67J029J732J678
52370A58916J244J182J505J699J681J813K115K286K327K416K348J808J067O73
52356A83080N99N36P16J507K347K252J407J118J940K979L373L312L203K844K140
52341B13353J668J821K155K249K398K798K817J981R89P71J109J194J162J817L004
$$ plain form
52460 138563 139325 139785 139902 139829 139639 139304 138916 138683 138715 139042 139692 140477 140896 140662 140142 139867 139795 139624 139591 140213
52440 140213 141312 142085 142203 142081 141952 141594 141228 141746 143404 145036 145303 144319 143358 143277 143846 144374 144413 143896
52422 143896 143115 142575 142587 143018 143589 144267 145188 146412 147976 149994 152432 154931 157031 158504 159429 160164 161238
52405 161238 162879 164573 165498 165591 165667 166287 166997 167108 166709 166303 165746 164312 161829 159162 157378 156693 156438
52388 156438 155854 154781 153659 153019 153042 153567 154331 155031 155352 155203 154865 154644 154491 154310 154477 155506 157238 158916
52370 158916 160160 161342 162847 164546 166227 168040 170155 172441 174768 177184 179532 181340 182407 183080
52356 183080 183679 184215 184931 186438 188785 191037 192444 193562 195502 198481 201854 205166 208369 211213 213353
52341 213353 215021 216842 218997 221246 223644 226442 229259 231240 232229 233000 234109 235303 236465 238282 241286
52326B41286L497K728J612J234J498J645J508J574K118K834L334L540L532L357
52312B75297L159L253L802M569N203N699O293O903P131O954O925P376P874P939
52298C58377P935Q505R462J0046J0250J0850J1994J2728J2414J1823J2092J3195
52286D89671J4177J4486J4357J4136J3966J4032J4420J4752J4520J3830J3289
52275F45636J3096J2865J2384J1927J1588J0857R390P753O886O915P026O492N365
52262G68180M114K989K017J320J054J052Q63K18o63j355j582j345p98j90K49N00
52246G76623P93J291J778J902J744J913K919M565O078O908P223P561Q122Q603
52232H38023Q712Q572Q469Q477Q515Q549Q410P760O592N558N192N000M027K317
$$ plain form
52326 241286 244783 247511 249123 250357 251855 253500 255008 256582 258700 261534 264868 268408 271940 275297
52312 275297 278456 281709 285511 290080 295283 300982 307275 314178 321309 328263 335188 342564 350438 358377
52298 358377 366312 374817 384279 394325 404575 415425 427419 440147 452561 464384 476476 489671
52286 489671 503848 518334 532691 546827 560793 574825 589245 603997 618517 632347 645636
52275 645636 658732 671597 683981 695908 707496 718353 727743 735496 742382 749297 756323 762815 768180
52262 768180 772294 775283 777300 778620 779674 780726 781589 781807 781144 779789 778207 776862 776064 775874 776123 776623
52246 776623 777416 778707 780485 782387 784131 786044 788963 793528 799606 806514 813737 821298 829420 838023
52232 838023 846735 855307 863776 872253 880768 889317 897727 905487 912079 917637 922829 927829 931856 934173
52218I34173R33L14m01j937l611m374m459n027o459p967q848r216r421r534r617
52203H54549r931j0576j1284j1770j1949j1814j1399j0939j0687j0547j0200r573
52191G23880q805p898o761n622m853m419l994l605l573l745l487k684k166k661
52177F59607l768m343l809k712k047k269k893l053k455j710j551j962k381k531
52163F22123k542k395j930j414j459k097k567k284j580j128j085j118r63o49l81
52148E98531m68j069j875k342k355k243k086j545o64j82o08j455j930j999k141
52133E75569k361k131j285m14k63j042k273l093k901j997j439j823k513k532j952
52118E47550j744k235k607k104j097l79l4M47J231K026K726L529M368M845M877
$$ plain form
52218 934173 935106 935420 935019 933082 929471 925097 920638 915611 909152 901185 892337 883121 873700 864166 854549
52203 854549 844618 834042 822758 810988 799039 787225 775826 764887 754200 743653 733453 723880
52191 723880 715075 707177 700416 694794 689941 685522 681528 677923 674350 670605 667118 664434 662268 659607
52177 659607 655839 651496 647687 644975 642928 640659 637766 634713 632258 630548 628997 627035 624654 622123
52163 622123 619581 617186 615256 613842 612383 610286 607719 605435 603855 602727 601642 600524 599561 598912 598531
52148 598531 598063 596994 595119 592777 590422 588179 586093 584548 583884 583702 583094 581639 579709 577710 575569
52133 575569 573208 571077 569792 569378 569115 568073 565800 562707 559806 557809 556370 554547 552034 549502 547550
52118 547550 545806 543571 540964 538860 537763 537384 537350 537797 539028 541054 543780 547309 551677 556522 561399
52103E61399M941N381N989O581P485R045J0930J2529J3760J4903J5860J6271J6317
52090G01391J6628J7305J7760J7733J7717J8068J8391J8258J7863J7409J6548
52079H95071J5089J3676J2943J2456J1361R714Q265P153N789L947K102N53r15
52066I97204k386l609m597n715o971p933q497r019r538r551q925q319q275q520
52052H95349q521q272q037p763p193o262n075l738k470j563r91l61N59J602K589
52037H39853L576M555N353N965O591P144P177O611O029N996O416O821O817O169
52023I25073M885L561L066L516L945L313J516q59l185m933n710n740n928o948
$$ plain form
52103 561399 566340 571721 577710 584291 591776 600821 611751 624280 638040 652943 668803 685074 701391
52090 701391 718019 735324 753084 770817 788534 806602 824993 843251 861114 878523 895071
52079 895071 910160 923836 936779 949235 960596 970310 978575 985728 991517 995464 997566 998119 997204
52066 997204 994818 991209 986612 980897 973926 965993 957496 948477 938939 929388 920463 912144 903869 895349
52052 895349 886828 878556 870519 862756 855563 849301 844226 840488 838018 836455 835464 835103 835662 837264 839853
52037 839853 843429 847984 853337 859302 865893 873037 880214 886825 892854 898850 905266 912087 918904 925073
52023 925073 929958 933519 936585 940101 944046 947359 948875 948016 944831 939898 934188 928448 922520 915572
$$ [...]
##END NTUPLES=NMR SPECTRUM
##END=
