##TITLE=NES1083_IC_9885136_LPl463uOHN
##JCAMPDX= 6.0         $$ Bruker NMR JCAMP-DX V2.0
##DATA TYPE= NMR SPECTRUM
##DATA CLASS= NTUPLES
##ORIGIN= BRUKER
##OWNER= Administrator
$$ 1.72 TOPSPIN		Version 2.1
$$ 2016-08-27 22:44:41.101 -0500  Administrator@X
$$ Compression mode = diff/dup
##.OBSERVE FREQUENCY= 400.02188249412
##.OBSERVE NUCLEUS= ^1H
##.ACQUISITION MODE= SIMULTANEOUS (DQD)
##.ACQUISITION SCHEME= undefined
##.AVERAGES= 8
##.DIGITISER RES= 22
##SPECTROMETER/DATA SYSTEM= spect
##.PULSE SEQUENCE= zg30
##.SOLVENT NAME= COFFEE_meoh
##.SHIFT REFERENCE= INTERNAL, COFFEE_meoh, 1, 14.98509
##AUDIT TRAIL= $$ (NUMBER, WHEN, WHO, WHERE, PROCESS, VERSION, WHAT)
$$ ##TITLE= Audit trail, TOPSPIN		Version 2.1
$$ ##JCAMPDX= 5.01
$$ ##ORIGIN= Bruker BioSpin GmbH
$$ ##OWNER= Administrator
$$ $$ E:\/data/COFFEE/nmr/NES1083_IC_9885136_LPl463uOHN/10/pdata/1/auditp.txt
$$ ##AUDIT TRAIL=  $$ (NUMBER, WHEN, WHO, WHERE, PROCESS, VERSION, WHAT)
(   1,<2016-08-27 22:44:33.883 -0500>,<Administrator>,<X>,<go>,<TOPSPIN 2.1>,
      <created by zg
	started at 2016-08-27 22:43:27.367 -0500,
	POWCHK enabled, PULCHK disabled,
       configuration hash MD5:
       21 0F 79 D6 B3 7B B4 F6 88 20 88 DB 03 48 BD 9F
       data hash MD5: 64K
       54 92 BE D8 8A 7A 17 91 F0 EF BE 97 E6 03 1E C3>)
(   2,<2016-08-27 22:44:37.008 -0500>,<Administrator>,<X>,<proc1d>,<TOPSPIN 2.1>,
      <Start of raw data processing
       efp LB = 0 FT_mod = 6 PKNL = 1 PHC0 = 0 PHC1 = 0 SI = 32K 
       data hash MD5: 32K
       3F AC 7C 62 1D 70 7E D5 B0 A5 4B AA 7C F8 45 13>)
(   3,<2016-08-27 22:44:37.289 -0500>,<Administrator>,<X>,<proc1d>,<TOPSPIN 2.1>,
      <pk PHC0 = 92.8894 PHC1 = 0 
       data hash MD5: 32K
       C3 04 1A 8B 2E 52 4E 5B A8 7D 1D DF 03 D4 33 B7>)
(   4,<2016-08-27 22:44:37.398 -0500>,<Administrator>,<X>,<proc1d>,<TOPSPIN 2.1>,
      <abs ABSG = 1 
       data hash MD5: 32K
       36 CF 03 89 81 55 92 BD 33 F4 5E 88 1F E2 20 20>)
(   5,<2016-08-27 22:44:37.461 -0500>,<Administrator>,<X>,<proc1d>,<TOPSPIN 2.1>,
      <abs ABSG = 2 
       data hash MD5: 32K
       1F F6 1E 1A 56 2F 0E DD A2 7A 5F 98 90 58 CB 42>)
(   6,<2016-08-27 22:44:37.523 -0500>,<Administrator>,<X>,<proc1d>,<TOPSPIN 2.1>,
      <abs ABSG = 3 
       data hash MD5: 32K
       57 AB 0F E7 B4 AD B6 DA E2 49 DB B3 73 06 42 53>)
(   7,<2016-08-27 22:44:37.570 -0500>,<Administrator>,<X>,<proc1d>,<TOPSPIN 2.1>,
      <abs ABSG = 4 
       data hash MD5: 32K
       6B 96 1C 33 9F 91 58 CB 86 17 96 D1 9B 68 45 DC>)
(   8,<2016-08-27 22:44:37.633 -0500>,<Administrator>,<X>,<proc1d>,<TOPSPIN 2.1>,
      <abs ABSG = 5 
       data hash MD5: 32K
       91 0C 52 EE 47 09 4D 29 77 9C 29 F9 41 08 3A 26>)
$$ ##END=
$$ 
$$ $$ hash MD5
$$ $$ 24 C1 7C 91 66 A3 1C 42 FB D3 D8 76 3A CC 1F D4
##$RELAX= 
##$RELAX= 
##$RELAX= 
##$RELAX= 
##$RELAX= 
##$RELAX= 
##$RELAX= 
$$ Bruker specific parameters
$$ --------------------------
##$DU= <E:\>
##$EXPNO= 10
##$NAME= <NES1083_IC_9885136_LPl463uOHN>
##$PROCNO= 1
$$ [...]
##$TP= (0..7)
150 150 150 150 150 150 150 150
##$TP07= 0
##$TPNAME0= <>
##$TPNAME1= <>
##$TPNAME2= <>
##$TPNAME3= <>
##$TPNAME4= <>
##$TPNAME5= <>
##$TPNAME6= <>
##$TPNAME7= <>
##$TPOAL= (0..7)
0.5 0.5 0.5 0.5 0.5 0.5 0.5 0.5
##$TPOFFS= (0..7)
0 0 0 0 0 0 0 0
##$TUNHIN= 0
##$TUNHOUT= 0
##$TUNXOUT= 0
##$USERA1= <user>
##$USERA2= <user>
##$USERA3= <user>
##$USERA4= <user>
##$USERA5= <user>
##$V9= 5
##$VALIST= <valist>
##$VCLIST= <CCCCCCCCCCCCCCC>
##$VD= 0
##$VDLIST= <DDDDDDDDDDDDDDD>
##$VPLIST= <PPPPPPPPPPPPPPP>
##$VTLIST= <TTTTTTTTTTTTTTT>
##$WBST= 1024
##$WBSW= 4
##$XGAIN= (0..3)
0 0 0 0
##$XL= 0
##$YL= 0
##$YMAX_a= 603584
##$YMIN_a= -505004
##$ZGOPTNS= <>
##$ZL1= 120
##$ZL2= 120
##$ZL3= 120
##$ZL4= 120
##$ABSF1= 14.98509
##$ABSF2= -5.573092
##$ABSG= 5
##$ABSL= 3
##$ALPHA= 0
##$AQORDER= 0
##$ASSFAC= 0
##$ASSFACI= 0
##$ASSFACX= 0
##$ASSWID= 0
##$AUNMP= <proc_prof1d_extract_pilot.lims>
##$AXLEFT= 0
##$AXNAME= <>
##$AXNUC= <1H>
##$AXRIGHT= 0
##$AXTYPE= 0
##$AXUNIT= <>
##$AZFE= 0.1
##$AZFW= 0.1
##$BCFW= 0
##$BC_mod= 0
##$BYTORDP= 0
##$COROFFS= 0
##$CY= 15
##$DATMOD= 1
##$DC= 0
##$DFILT= <>
##$DTYPP= 0
##$F1P= 0
##$F2P= 0
##$FCOR= 0.5
##$FTSIZE= 32768
##$FT_mod= 6
##$GAMMA= 0
##$GB= 0
##$INTBC= 1
##$INTSCL= 1
##$ISEN= 128
##$LB= 0
##$LEV0= 0
##$LPBIN= 0
##$MAXI= 10000
##$MC2= 0
##$MEAN= 0
##$ME_mod= 0
##$MI= 0
##$NCOEF= 0
##$NC_proc= -8
##$NLEV= 6
##$NOISF1= 0
##$NOISF2= 0
##$NSP= 0
##$NTH_PI= 0
##$NZP= 0
##$OFFSET= 14.98509
##$PC= 1
##$PHC0= 92.8894
##$PHC1= 0
##$PH_mod= 1
##$PKNL= yes
##$PPARMOD= 0
##$PPDIAG= 0
##$PPIPTYP= 0
##$PPMPNUM= 2147483647
##$PPRESOL= 1
##$PSCAL= 4
##$PSIGN= 0
##$PYNMP= <proc.py>
##$REVERSE= no
##$SF= 400.02
##$SI= 32768
##$SIGF1= 0
##$SIGF2= 0
##$SINO= 400
##$SIOLD= 32768
##$SPECTYP= <>
##$SREGLST= <1H.CDCl3>
##$SSB= 0
##$STSI= 32768
##$STSR= 0
##$SW_p= 8223.68421052631
##$SYMM= 0
##$S_DEV= 0
##$TDeff= 65536
##$TDoff= 0
##$TI= <>
##$TILT= no
##$TM1= 0
##$TM2= 0
##$TOPLEV= 0
##$USERP1= <user>
##$USERP2= <user>
##$USERP3= <user>
##$USERP4= <user>
##$USERP5= <user>
##$WDW= 1
##$XDIM= 32768
##$YMAX_p= 441578010
##$YMIN_p= -751001
##$CURPLOT= <Network HP LaserJet P1505>
##$CURPRIN= <$Network HP LaserJet P1505>
##$DFORMAT= <normdp>
##$LAYOUT= <+/1D_H.xwp>
##$LFORMAT= <normlp>
##$PFORMAT= <normpl>
##$SURQMSG= 1
$$ End of Bruker specific parameters
$$ ---------------------------------
##NTUPLES= NMR SPECTRUM
##VAR_NAME=  FREQUENCY,     SPECTRUM/REAL,   SPECTRUM/IMAG
##SYMBOL=    X,             R,               I
##VAR_TYPE=  INDEPENDENT,   DEPENDENT,       DEPENDENT
##VAR_FORM=  AFFN,          ASDF,            ASDF
##VAR_DIM=   32768,         32768,           32768
##UNITS=     HZ,            ARBITRARY UNITS, ARBITRARY UNITS
##FACTOR=    0.250966925370066, 1,           1
##FIRST=     8223.43324360094, 107436,       -180568
##LAST=      0,             45797,           66650
##MIN=       0,             -751001,         0
##MAX=       8223.43324360094, 441578010,    0
$$ Real data points
##PAGE= N=1
##DATA TABLE= (X++(R..R)), XYDATA
$$ [...]
19477B8353O2146k1332B0076a46166I3489a1902j62050B7806b34706C2619d4517
19465D7843b45364i8886o5936C5463J42778r650o9364b6537k32600b741F6959
19453c1200R385B5828J14906b71305H3158b11451O0545f3798j58345M2156A781
19441b95147o0444G4959a46228q6946D6877c01503a3463A3876c88418a9627A32230
19429b42041q1332J26087c5211C31930g1706A1423b80873H4336a15087j20010
19419b35097g487B7370c7578m7861p6913O0841D7611b492j5696j60700k63914
19408d42802B2772a41304A16372c26718a19795L9771D0594a02418j46811e901
19397a56728B34856a22491j25111B24518a16726A11557b7713r0924N6176k70512
$$ y = [28353, 90499, 69167, 20076, -146166, 93489, -11902, -173952, 27806, -234706, 32619, -44517, 47843, -245364, -98886, -164822, 35463, 178241, 168591, 99227, -26537, -259137, -2741, 66959, -31200, -21815, 25828, 140734, -271305, 83158, -211451, -150906, -63798, -222143, -179987, 1781, -295147, -355591, 74959, -146228, -233174, 46877, -301503, -13463, 13876, -388418, -19627, 132230, -242041, -323373, -197286, -35211, 331930, -71706, 11423, -280873, 84336, -115087, -235097, -7487, 27370, -37578, -85439, -162352, -101511, 47611, -2492, -18188, -178888, -442802, 22772, -141304, 116372, -326718, -119795, -80024, 40594, -102418, -249229, -5901, -156728, 234856, -122491, -247602, 224518, -116726, 111557, -27713, -118637, -62461, -332973]
19387c32973I6368m8034d0931k73206g6467A23807b20276A71511b53738D8940
19376b77260q6700a29160q2968G2841d64573a17669c4365B10674E9511J7917a9384
19364b67791n3954A26823b82339h2023I1414a54300A01305a63003N166L3018j45283
19353b70102b3659n8202A3479c04243k9746B65613b75402L2497M8979j26224F6820
19341A27496c0225A61164F0836d3131a5306A05223J26472a03226J606j91420R2254
19330b00786C04632q3393c32653A6253a57290O6874j62288d1493E9116h7745l2651
19319a20396p228r1890O7056L7225B46936d05656a6741j49460A67657b85914F6973
19307a54596a9019A09018a05638D4765J79625f6555E0674e4473A62491a86521
$$ y = [-332973, 96368, 48334, -40931, -314137, -76467, 123807, -220276, 171511, -253738, 48940, -277260, -363960, -129160, -212128, 72841, -464573, -117669, -34365, 210674, 59511, 77428, -19384, -267791, -321745, 126823, -282339, -82023, 91414, -154300, 101305, -163003, -157837, -124819, -270102, -23659, -81861, 13479, -304243, -333989, 265613, -275402, -242905, -193926, -320150, 66820, 127496, -30225, 161164, 60836, -43131, -15306, 105223, 231695, -103226, -101620, -293040, -200786, 304632, 221239, -332653, 16253, -157290, -90416, -252704, -41493, 59116, -87745, -120396, -127624, -219514, -152458, -115233, 246936, -405656, -16741, -166201, 167657, -285914, 66973, -154596, -19019, 109018, -105638, 44765, 224390, -66555, 50674, -54473, 162491, -186521]
19296b59675j8921F9980C247a88341L898d2195A36919b23329C95058A29544a41310
19284c4927j9133B95261C0105a50641P1402j46612H8165Q1330p1590d0171j04648
19273a44819J1268l6619B22373b04689f9676a0369J753B18829c87246a6775j86901
19262b03676R9458b1342n0110j38677j05180a49781l3707j22566J25249L4110
19252a46695r9587A56799D0738J83272a82859Q2483p8887f0222l37767I5540J07163
19241B02703i7819D6611O575g9671C59750b86174m179a28197B7301a06458J3691
19230i2767j86155G8322c3200j57094C6053a05305A90917c40D2310J352J0312
19219E3974J22074i0652A41551R703a25861B62446a72008A57398b9969B7929N8251
$$ y = [-259675, -278596, 69980, 3247, -188341, -184443, -42195, 136919, -223329, 395058, 129544, -141310, -34927, -54060, 295261, 30105, -150641, -79239, -225851, 88165, 169495, 97905, -40171, -144819, -133551, -170170, 222373, -204689, -69676, -10369, -8616, 218829, -387246, -16775, -203676, -104218, -21342, -71452, -210129, -315309, -149781, -183488, -306054, -180805, -146695, -246282, 156799, 40738, 224010, -182859, -100376, -179263, -60222, -397989, 95540, 202703, -97819, 46611, 53186, -79671, 359750, -286174, -290353, -128197, 27301, -106458, -92767, -278922, 78322, -33200, -190294, 36053, -105305, 190917, -340, 42310, 43662, 53974, 176048, -90652, 141551, 151254, -125861, 262446, -172008, 157398, -29969, 27929, 86180]
19208H6180c14996A60558C9757I828c35307a51598A2767b10062A586a75481L281
19197a72200M3247j61315a20284m6110I2264a36585I5215d3044A90196b9985L104
19186b6881j14233B0993f4892q1622C5413J40929b46206j59907A65740d2741l29957
19175c72698D5579b11921N1708D8243a409n7814C5259P1999K9954h5111k46128
19164c31239b9543j07370N8966D7851J27849a09398k3821H7506f7783K488p2969
19153a38264C8717b826j3248j80122k8832J1453J9031N876p8206J16024O6474
19142h4376B3938a73380j85301a47768B37349c83773d0409l32569J26508C6948
19131a59612a1245p3166C44520d8479k76611g2013A12169C9640O197b9678j36071
$$ y = [86180, -314996, 160558, 39757, 9828, -335307, -151598, 12767, -210062, 1586, -175481, -172200, -128953, -290268, -120284, -166394, 92264, -136585, 95215, -43044, 190196, -29985, -26881, -141114, 20993, -64892, -146514, 35413, 176342, -246206, -406113, 165740, -42741, -372698, 45579, -211921, -160213, 48243, -1409, -59223, 35259, 107258, 137212, -85111, -331239, -29543, -136913, -77947, 47851, 175700, -109398, -133219, 87506, -67783, -65295, -138264, 38717, -2826, -16074, -196196, -225028, -213575, -194544, -188668, -266874, -150850, -84376, 23938, -173380, -358681, -147768, 237349, -383773, -40409, -372978, -246470, 36948, -159612, -11245, -84411, 344520, -48479, -325090, -72013, 112169, 39640, 45837, -29678, -165749]
19120a65749c5616A1991M26a01390G7160A2891N4652a96369c5371k5680A28901
19108d0012k60640K8629a04077j17498R3701A21186a93012C30788a16880p4230
19098a91110c3342A58074a11800a6824C7616K87335a79698q0288d887A6497a23557
19086C6504a19743j50494Q9805O5202b1216F6903O3020a04499o7440K4832F0323
19074a67719g0462j30945a9458n0225A01507c99740d7339B72366b26900J10460
19064a16440K1971E129i4495k69214a3068C7585N8687d9313F058J57863i5757
19052b1982k55543d2825j79911c8804F0686f6403k51755G1237g7878j61403c4602
19040b8752k8250a696A4494i2944l7920j24002k9925i5954A43396Q1954h6943
$$ y = [-165749, -35616, 11991, 12417, -101390, 77160, 12891, 67543, -196369, -35371, -61051, 128901, -40012, -300652, -272023, -104077, -221575, -127874, 121186, -193012, 330788, -116880, -191110, -33342, 158074, -111800, -16824, 37616, 324951, -179698, -259986, -4887, 16497, -123557, 36504, -119743, -270237, -180432, -115230, -21216, 66903, 129923, -104499, -171939, -147107, 60323, -167719, -70462, -201407, -19458, -69683, 101507, -399740, -47339, 272366, -226900, -116440, -94469, 5129, -94495, -363709, -13068, 37585, 96272, -49313, 6058, 163921, -95757, -21982, -277525, -42825, -222736, -38804, 60686, -66403, -318158, 71237, -77878, -239281, -34602, -28752, -57002, -1696, 14494, -92944, -130864, -254866, -284791, -95954, 143396, 225350, -86943]
19028A4214g939j0902l14098J31269A30032L5835a6634k0579J3942G8998c17553
19016h0119a7047A10754b45607F7891L46222b8800l09477H1202O6451j9358E624
19004A03541k0750a24328c2124j89363k6603A34794e8690G8653b30911A57666
18993D508J01022A725O9867c6325G2629a30439j38982m0258B26851m3300E9014
18981a61490M1764A34543m1873c62281J78985C69471m3314J2910K74921P0905
18971F84893A12560c46401I3077c8799k6183k3286G9331A3516b98327a03110L987
18960i9123k12644J03812N9476k96230a30502C74268a0768j28874j18322m4473
18950c02437E3491B0698k945N7940C5582b65451J04453H305a84859e2363h219
$$ y = [14214, -7939, -18841, -332939, -201670, 130032, 165867, -16634, -37213, -23271, 78998, -317553, -80119, -17047, 110754, -245607, 67891, 414113, -28800, -338277, 81202, 147653, 128295, 5624, 103541, 82791, -124328, -32124, -221487, -248090, 134794, -58690, 78653, -230911, 157666, 4508, 105530, 1725, 71592, -36325, 72629, -130439, -269421, -309679, 226851, 183551, 59014, -161490, -119726, 134543, 92670, -362281, -183296, 369471, 326157, 339067, 613988, 684893, 112560, -346401, 93077, -38799, -64982, -88268, 79331, 13516, -298327, -103110, -99123, -311767, -207955, -148479, -444709, -130502, 374268, -10768, -139642, -257964, -302437, 53491, 20698, 17753, 75693, 35582, -265451, -160998, 8305, -184859, -52363, -8219]
18938a15300a529A30322e2395A04563c08028a15880A34636n7768a3074A83563
18927a66976r035A74163h90A29797N0366i8998G8585a18634k01854E752A870N4748
18915E6618i169p0587A65964K994J61626J2116J435j02613E5193b9886j5770k09023
18903b54679J9996A12941J10521C0300d16065F6971a96317A1126d7191A55357
18892b57316N5624h3974C3207b11071D9790c40938A651F07a6781A37564J8980
18881A56544o8611b9285A07015C0525P1485b21918p9454B48308A22697K28965
18871C51662a12435a2497j83146h2717B08128d0097o7317h045k00059h0123O669
18860g3454A40088N0265A6174a08486B57232j15293E1011b11538i2528C7093L2875
$$ y = [-115300, -1529, 130322, -52395, 104563, -308028, -115880, 134636, 76868, -13074, 183563, -166976, -176011, 174163, -890, 129797, 180163, -98998, 78585, -118634, -320488, 5752, 1870, 56618, -9169, -79756, 165964, 168958, 330584, 342700, 344135, 241522, 55193, -29886, -45656, -254679, -234683, 112941, 223462, 30300, -416065, 66971, -196317, 11126, -47191, 155357, -257316, -201692, -83974, 33207, -211071, 49790, -340938, 1651, 607, -16781, 137564, 156544, 87933, -29285, 107015, 30525, 102010, -221918, -301372, 248308, 122697, 351662, -112435, -12497, -195643, -82717, 208128, -40097, -107414, -8045, -208104, -80123, -73454, 140088, 190353, 16174, -108486, 257232, 141939, 51011, -211538, -92528, 37093, 69968]
18849F9968B5838d666A94087j2497b67363b1737l9332L742o0143K9334j30804
18838b18940l0308C1955M9887N6152b64176A20535c52569A05803b05305c0239
18827i0675j75013P9216C52034a65148j71659F5743P7615D6566c53147A41846
18816C63040g8837A73631n5867g1463A92001a8713j1254B8148c14939C56809a2339
18804c4322D3207R07J62832i1352K9724j59823d1441k11566a06186j76631q8998
18793c71815N8805d8626l20928A93969a20976B47952h3087j95449G3973Q9566
18783A63539l916j8301h694j21572B60036A1359g7343c138C34914c480k28928
18772b32408P0184E9549e18262I199K48703a11194d3156A64266d9717p9010k6128
$$ y = [69968, 25838, -4666, 194087, 181590, -267363, -21737, -61069, -57327, -117470, -88136, -218940, -249248, 31955, 81842, 137994, -264176, 120535, -352569, 105803, -205305, -30239, -90675, -265688, -186472, 352034, -165148, -336807, 65743, 143358, 46566, -353147, 141846, 363040, -78837, 173631, 117764, -71463, 192001, -18713, -29967, 28148, -314939, 356809, -12339, -34322, 43207, 44114, 206946, -91352, -61628, -221451, -41441, -253007, -106186, -282817, -371815, -313010, -48626, -369554, 193969, -120976, 247952, -83087, -278536, 73973, 163539, 159623, 141322, -8694, -130266, 260036, 11359, -77343, -3138, 334914, -3480, -232408, -162224, 59549, -518262, 9199, 257902, -111194, -43156, 164266, -49717, -128727, -154855]
18761a54855B06770a91594O1922G3419K61557b5219k43148A2461K36521A6655
18750G315b21856C67750i7656A56757C9042a18983m8931k6984e0321a8922p0865
18739h9787D5083h8199B92086H8405a28992F5042r776e0184B64733a56704j67136
18728c23840h8720A39071B5661P2077d74023e9883B10125a03945D8775f2666G1049
18716f5162r0891b5045p0679E3685j6330a00572k07809a00736F0113K53375a03427
18704e8990b4326q4910I4734L0227b66776A36080b67490c317I8772c73336a79657
18692I7683j9793b99349D1084a24825k20794A17966h6797m5983E20K2820b30288
18680h8837k22209f6385k9149g271j44889M346n8411N1039b6695A47458f0222
$$ y = [-154855, 206770, -191594, -129672, 73419, 334976, -25219, -268367, 12461, 248982, 16655, 7315, -221856, 367750, -97656, 156757, 39042, -118983, -167914, -194898, -50321, -18922, -89787, 45083, -88199, 292086, 88405, -128992, 65042, 55266, -50184, 264733, -156704, -323840, -88720, 139071, 25661, 97738, -474023, -59883, 210125, -103945, 48775, -62666, 71049, -65162, -156053, -25045, -95724, 53685, 37355, -100572, -308381, -100736, 60113, 313488, -103427, -58990, -24326, -109236, 94734, 124961, -266776, 136080, -267490, -3317, 98772, -373336, -179657, 97683, 77890, -299349, 41084, -124825, -345619, 117966, -86797, -132780, 520, 23340, -230288, -88837, -311046, -66385, -95534, -7271, -152160, -147814, -206225, -155186, -26695, 147458, -60222]
18668b60171P4031B15028E0347f7953k8445j80457a07142c4139A28534i599j71847
18657a81446N9599A92685F6007N732h2424L0856j59523Q2890e1075A67852b15505
18645a6415A40058f5102j69746a5691A31149b99447I2791M5644N6430a98099H1131
18633d080k93236h8466r2802C5119Q4608a80124C853L0820b1610q8407a5798O333
18621i465A9271a11897A71335A4832g4480q6789A27909c33110g638p227n6512
18610g1377j40052A83311H2639l2095e4944B172R0171h1738j29366A13332D7020
18598c47968I2800a82701h0304l23336a72379f1751C5965a52390D3507a32765
18587b93571J33682A10251b67132l9697i0599j16501A09882D733K21314b35119
$$ y = [-260171, -186140, 215028, 50347, -67953, -96398, -276855, -107142, -34139, 128534, -9599, -181446, -121847, 192685, 66007, 71739, -82424, -51568, -211091, -128201, -51075, 167852, -215505, -16415, 140058, -65102, -234848, -15691, 131149, -299447, 92791, 138435, 194865, -198099, 81131, -4080, -297316, -88466, -181268, 35119, 119727, -180124, 3853, 34673, -21610, -110017, -15798, -9465, 19271, -111897, 171335, 14832, -74480, -161269, 127909, -333110, -7638, -14865, -71377, -211429, 183311, 82639, 50544, -54944, 2172, 92343, -81738, -211104, 113332, 47020, -347968, 92800, -182701, -80304, -403640, -172379, -61751, 35965, -152390, 43507, -132765, -293571, -159889, 110251, -267132, -306829, -90599, -207100, 109882, 4733, 226047, -235119]
18576A36954b72281L1967b3649o902e44l1365A1549a21913G5114l4991b07319
18564a28169A7050E887J32919c7970k3521j44225j96015a26667A68017a17670
18553F6615j7285M4456P8123g7651j70035A44212J16924b23201c200H634a11068
18541C01958b35402A5613f5090j13774O2484G5455J44207r8612A0269J32143b23987
18529F8504k3073J6426b14390Q2208l3251E1563K36245E3677a24400I3135C4860
18517e412j18161B41219N9479f8631k2040B18467d2967i629k5507j82960c7936
18505h8270I9168b99911B14547B6392N2267J83501g4849n5644k26243J74091A49930
18493I9766J25814h7241E7325b62547A97322m194B7757J29206E8971b22021B20026
$$ y = [136954, -272281, -240314, -23649, -30551, -544, -31909, 11549, -121913, 75114, 40123, -207319, -128169, 17050, 5887, 138806, -37970, -61491, -205716, -401731, -126667, 168017, -117670, 66615, 49330, 93786, 171909, -77651, -247686, 144212, 261136, -223201, -3200, 8634, -111068, 301958, -235402, 15613, -65090, -178864, -116380, 75455, 219662, 121050, 10269, 142412, -223987, 68504, 45431, 61857, -214390, -132182, -165433, 51563, 287808, 53677, -124400, 93135, 34860, -5412, -123573, 241219, 300698, -68631, -90671, 218467, -42967, -9629, -35136, -218096, -37936, -88270, 99168, -299911, 214547, 26392, 78659, 262160, -74849, -130493, -356736, -182645, 149930, 99766, 225580, -87241, 57325, -262547, 197322, 193128, 27757, 156963, 58971, -222021, 220026]
18481c48579E9488L2814A0544J24095l1712F259d7685F8318a73089J4687j39598
18470b98000R2668N8537a1424j28756r2164G5321B0058a99356I4294D0649a8119
18458a92876P6145f996r3803K9375A30541B8381J25132f8930A8520J30709E7603
18446A40172d00148D5651L3578a37206k6651k4188B35509A01224c23648b1452
18435i4183j96959a41459N3465q9332h2946k9646j23972A30551d7256k2991F1568
18423A3385g407A16886a60378j59764C3933b03732A0807D437a39319f6992G9416
18411i2828B5318j1888f3654B21892e4669K2953B01001b91132J44528N5695b1267
18399A061f0836j83696B6922a64114L7085l2470k51417f4780A6222K8598a1427
$$ y = [-348579, 59488, 92302, 10544, 134639, 102927, 6259, -47685, 68318, -173089, -158402, -298000, -205332, -146795, -11424, -140180, -232344, 75321, 20058, -199356, 94294, 40649, -18119, -192876, -116731, -6996, -100799, -71424, 130541, 28381, 153513, -68930, 18520, 149229, 57603, 140172, -400148, 45651, 79229, -137206, -163857, -188045, 235509, 101224, -323648, -21452, -94183, -291142, -141459, -87994, -177326, -82946, -112592, -236564, 130551, -47256, -70247, 61568, 13385, -7407, 116886, -160378, -320142, 33933, -203732, 10807, 4437, -139319, -66992, 79416, -92828, 25318, 13430, -63654, 221892, -54669, -31716, 201001, -291132, -146604, -90909, -21267, 1061, -60836, -244532, 26922, -164114, -127029, -159499, -410916, -64780, 16222, 44820, -11427]
18387e2094A52680J19750f6069j58429B1809K12957a24869r887p2431J01162A9580
18375G637O8155C5319a4544C0021J8288b72071b4782A47889J8045b75437A59461
18363A13778b74121a6952r7739A08088Q3645a31835j1303b5956j14927B03315
18352b38486A53029C182b07655b5465A00662A2209J65659g0003B1908J77675a37103
18340a73235r9238B60251a08684j3867c6879j59625A10330a95058K5452j43276
18330c12882B8973K4157a81649B88359a1786M271o8113k2582b8892A94429K7765
18319B22194m9912b28006A32405e0329q9568F8287d7974F528K49O8181C0011O7279
18307I7290K49559c39258a35843k44223a59387k28889g626j25426m7869Q9A58874
$$ y = [-52094, 152680, 272430, -66069, -224498, 21809, 234766, -124869, -134756, -207187, -106025, 19580, 7637, 75792, 35319, -14544, 30021, 48309, -272071, -24782, 147889, 165934, -275437, 159461, 113778, -274121, -16952, -114691, 108088, 191733, -131835, -143138, -25956, -140883, 203315, -238486, 153029, 3182, -207655, -25465, 100662, 12209, 177868, -70003, 21908, 199583, -137103, -173235, -272473, 260251, -108684, -122551, -36879, -196504, 110330, -195058, -169606, -312882, 28973, 53130, -181649, 288359, -11786, -7515, -75628, -98210, -28892, 194429, 222194, 172282, -228006, 132405, -50329, -139897, 68287, -47974, 6528, 6777, 74958, 30011, 97290, 346849, -339258, -135843, -380066, -159387, -388276, -7626, -133052, -180921, -180832, 158874]
18295c23536g2404B22352D3605b84872B92640i526A06711B8660c9260k2420a2190
18283D7369J1739a62131G6436i5662F8054J11980b80189A08835b07616b2913G6233
18271B8661J34341A7948f4259A48532m7296b02412R9601A7083K2821L19268f9367
18259c24130B1706c8837A40046h6758D6248L4499a2648q465j24433F1336i653
18247C03925a85953d8769A25432a34417B4068b30382B26088g9325n0166A74383
18236b522k32041c0721H7629e7748b8007j17748b0140A21021a27614k9641B33659
18224i402j19608k7519o7808i467B6596L14672o1517e653r8319k55438B55050
18212C5342J66906a70004A52920D783d5128k02018e6985j68221B25615F595O9174
$$ y = [-323536, -72404, 222352, 43605, -284872, 292640, -9526, 106711, 28660, -39260, -61680, -12190, 47369, 59108, -162131, 76436, -95662, 68054, 180034, -280189, 108835, -207616, -22913, 76233, 28661, 163002, 17948, -64259, 148532, 101236, -202412, -102811, 17083, 39904, 359172, -69367, -324130, 21706, -38837, 140046, -86758, 46248, 80747, -12648, -21113, -145546, 61336, -9653, 303925, -185953, -48769, 125432, -134417, 24068, -230382, 226088, -79325, -129491, 174383, -2522, -234563, -30721, 87629, -57748, -28007, -145755, -20140, 121021, -127614, -157255, 233659, -9402, -129010, -156529, -224337, -9467, 26596, 341268, 279751, -5653, -103972, -359410, 255050, 35342, 202248, -170004, 152920, 4783, -45128, -247146, -56985, -225206, 225615, 6595, 75769]
18201G5769l7722A5143L48668I4680d5356A5286J1835N4052K11904d7375I7239
18189D26068b44376C9115L1755J0074e3974J9138o0001A2965Q3788b34251c8720
18177C335L6937a38539j03194J09274M9916p2998M4315H1307c9870j83700L5180
18166a88390D4964b87344M9479A19346n0656b16438A80983a47939a1703G9469
18155b7141e791r6935d4901A68083a99853A01631J02975e1994o7971k3432L2258
18144a11139H9132a39991C2944K178M8653B4012b34167J05801o1554j829l1671
18133b23420j14737c3995j11314D1112a12007K3234k4957j11096A9133J26042
18123A45175M4758F7193d2582a5794m5535k6564C71632A4504a31867B01974K9888
$$ y = [75769, 38047, 15143, 363811, 94680, -45356, 15286, 27121, 81173, 293077, -47375, 97239, 426068, -244376, 39115, 70870, 80944, -53974, -34836, -94837, 12965, 96753, -234251, -38720, 3335, 40272, -138539, -241733, -132459, -82543, -155541, -111226, 81307, -39870, -223570, -188390, 44964, -287344, -237865, 119346, 68690, -216438, 180983, -147939, -11703, 79469, -27141, -5791, -102726, -44901, 168083, -199853, 101631, 204606, -51994, -119965, -143397, -111139, 89132, -139991, 32944, 35122, 83775, 24012, -234167, -128366, -189920, -191749, -223420, -338157, -33995, -145309, 41112, -112007, -88773, -113730, -224826, 19133, 145175, 189933, 67193, -42582, -15794, -61329, -87893, 371632, 14504, -131867, 201974, 231862]
18112B31862r3219F6121f281G0430B8350b66304B57904a86535D7178J30811F372
18100h9796n5616I6306a00644l03642b4753E0813b67548h2319A60704b44563o5633
18089c10196A86526C2544J30092K06361j03068E5602b4318q9416k75801J40455
18079b49080F3209R9680i7412D6105d0049B1681N9838a9566p452A87265m1455
18068A45810o8383K12421G5589b8588A0522J07621b53765I0221C4025b67236A04184
18056a47102e6919j60969O7939E367K26296b21098c3575C434O3300b02619b567
18044e4476C8073c02612A89890b9924A58408b69751D4421N8501Q3750m3998E8329
18032a88752B1160b16605l5176E4644J55924r761H0283M9145a9109j14928B02902
$$ y = [231862, 138643, 66121, -6281, 70430, 28350, -266304, 257904, -186535, 47178, 177989, 6372, -89796, -145412, 96306, -100644, -404286, -24753, 50813, -267548, -82319, 160704, -244563, -310196, 186526, 32544, 162636, 368997, 265929, 55602, -24318, -113734, -389535, -249080, 63209, 162889, -97412, 46105, -40049, 21681, 81519, -19566, -27018, 187265, 145810, 77427, 289848, 75589, -28588, 10522, 118143, -253765, 90221, 34025, -267236, 104184, -147102, -56919, -217888, -149949, 5367, 231663, -221098, -33575, 3434, 66734, -202619, -2567, -54476, 38073, -302612, 189890, -29924, 158408, -269751, 44421, 102922, 186672, 142674, 58329, -188752, 21160, -216605, -251781, 54644, 210568, 200807, 80283, 129428, -19109, -134037, 202902]
18020C28767g094H9549c00261A51928f7135q3275P3961K4812C17785a16371c7041
18008H1199L7432i9553G2993g190o2653o6216j19515h1159g787A92195m9517a8310
17995F2856a7882B59766h3442j07789A32968J66143r1514a99216i3114j35967
17985b29081a2658M77m2739a0909n059H3358B0536g0371j10984C6566b01608i4669
17972e8107j09510C3430a3276l18106g9658L9093C713b33076d7469A53009k7052
17961A25957K9692a87568b4891A2045M26496A45704b54074j65132d0506H497L72504
17950C81001g2071D39653G4548J00741a77928A47417E0368J57410B2259c5732
17939B53736a90562C66K0420a2299m8257l9196A72028J66681a63470k69066g6675
$$ y = [328767, -7094, 89549, -300261, 151928, -67135, -150410, -76449, -51637, 317785, -116371, -37041, 81199, 118631, -99553, 72993, -7190, -69843, -136059, -255574, -81159, -7787, 192195, 142678, -18310, 62856, -17882, 259766, -83442, -191231, 132968, 299111, 207597, -199216, -93114, -229081, -12658, -12181, -54920, -10909, -15968, 83358, 20536, -70371, -181355, 36566, -201608, -94669, -58107, -167617, 33430, -13276, -331382, -79658, -40565, 3713, -233076, -47469, 153009, 125957, 155649, -187568, -24891, 12045, 438541, 145704, -254074, -419206, -40506, 8497, 381001, -72071, 439653, 74548, 175289, -177928, 147417, 50368, 207778, 22259, -35732, 253736, -190562, 366, 20786, -12299, -60556, -99752, 172028, 338709, -163470, -432536, -76675]
17927f9790B3385e7804C56484a60473b8812j3111A90868K04731b10583A58944
17916h5780C4382J59593O234F3324a48319c9786k33115b8805C02445R8100b35785
17904b1228k20234a04734B06332G1928b49581F2911J70902a20115d8338p4050
17894a22388A78075a57264a7692C39960A49832F7943M9403A9354R036L1934k3393
17883C6931J07412a32943n7926A62671a63477H4612d97942G1550b2151H5030a425
17871a89151N3287C0847P7864A3898b1019A2371K3287K87549a79903B08651B8415
17859A20994M3267k6193a19890F2223M1608a92340F5822a86814N5454D9731Q3978
17848A33709a03946B56581m6920A7058J01003D8374a8230n1615A06713i9414m7385
$$ y = [-69790, 23385, -57804, 356484, -160473, -28812, -41923, 190868, 395599, -210583, 158944, -85780, 34382, 193975, 200209, 63324, -148319, -39786, -272901, -28805, 302445, 400545, -235785, -21228, -241462, -104734, 206332, 71928, -249581, 62911, 233813, -120115, -48338, -122388, 178075, -157264, -17692, 339960, 149832, 67943, 117346, 19354, 28390, 60324, 36931, 144343, -132943, -190869, 162671, -163477, 84612, -497942, 71550, -22151, 85030, -1425, -189151, -135864, 30847, 108711, 13898, -21019, 12371, 35658, 323207, -179903, 208651, 28415, 120994, 164261, 138068, -119890, 62223, 103831, -192340, 65822, -186814, -131360, 49731, 133709, -103946, 256581, 209661, 17058, 118061, 48374, -18230, -69845, 106713, -99414, -146799]
17837a46799B94603a67946A49452D9882J31815B5271K76678c69931C1911J02743
17827A34654C1547f3239K4976l4078A16758a34534A03510a38049B9491M1604h959
17815A55707D1519f387B7246J18787c16357A61067O834A9667P5565A8095b69156
17803I8168c2806A81449b3913r0449H8501q612d08746c0868j16310B66237a61283
17791B19768I4079M0844G17b0535D8751K12699g3813j42758e4484q0108C75614
17779a4170l60916f0833q5907h644C2211a75335B06515m4798i5852B71937b54692
17767A26746f8840j66157F162M8466b13148j6886A31872J47212E9631f1381C19051
17755B33951n1766i5593d5829j95539i864m1240B52006D0996L0917B3016g4744
$$ y = [-146799, 294603, -167946, 149452, 49882, 181697, 25271, 301949, -369931, 31911, 134654, 31547, -63239, -38263, -72341, 116758, -134534, 103510, -138049, 29491, 71095, -8959, 155707, 41519, -6387, 27246, 146033, -316357, 161067, 167901, 19667, 95232, 18095, -269156, 98168, -32806, 181449, -23913, -114362, 88501, 79889, -408746, -30868, -147178, 266237, -161283, 219768, 94079, 134923, 717, -20535, 48751, 261450, -73813, -216571, -54484, -134592, 375614, -14170, -375086, -60833, -146740, -8644, 32211, -175335, 206515, 161717, -95852, 271937, -254692, 126746, -68840, -234997, 6162, 54628, -213148, -230034, 131872, 279084, 59631, -61381, 319051, 233951, 182185, -95593, -45829, -241368, -9864, -51104, 252006, 40996, 71913, 23016, -74744]
17743A58408J00019a24350A2613L74747f6547j70403A12311b16733J03672G188
17732A81852H5944c56A80510G3608H272a14299k1925B38016R4330A18624Q427
17721A27051l9715l0407A3891P5115A6592b56412A54509D3150N3564a5037A09750
17709G5428J69562a02701E698K83120d4251K0541A47565J34629R0813J5135A47466
17697B68640A3072d59455d5192I7209C2367J20685J88159E8908K76876j31187
17687B04597J45844b83660C59596A36149o4758a36743I381K02955m9152G3176
17676G727N8641C106J85666O4365g6883A28094a67682Q2281k9890B6269K27068
17665B53337Q194m9388p3976b619G7319O5655l5153M4564A2737a12214C71030
$$ y = [158408, 258427, -124350, 12613, 387360, -66547, -236950, 112311, -216733, -113061, 7188, 181852, 85944, -356, 180510, 73608, 8272, -114299, -136224, 238016, 332346, 118624, 127051, 87336, 56929, 13891, 89006, 16592, -256412, 154509, 43150, 96714, -15037, 109750, 75428, 244990, -102701, 5698, 288818, -44251, -23710, 147565, 282194, 373007, 388142, 147466, 268640, 13072, -459455, -45192, 97209, 32367, 153052, 341211, 58908, 335784, 204597, 350441, -283660, 359596, 136149, 71391, -136743, 9381, 212336, 163184, 73176, 7727, 66368, 3106, 188772, 253137, -76883, 128094, -167682, -85401, -115291, 26269, 253337, 261531, 212143, 138167, -2619, 77319, 142974, 107821, 152385, 12737, -112214, 371030]
17653A87022J04155m1232g6397p5179A40907A3691n826I06h8973A54726b7574
17641B52513j22136i0409d500q2954B61562a68195O3971A10332b35713d3537C3177
17629C72195j76253l5182B0058N9141a05880C32507A32100a46973j2582A84237
17618G2566K3155D1974a57162E4162b810D72904B07898G6650K95455a86779F8378
17606a83520A07781Q3143R4829b42069f1297C3298e2183B49691r9645a54102D56743
17594B25221g7826I9901K58673f386l3617C16030j11713C2285L61016H1328k543
17583G8785J8028O0800P7772I8412k4096L08814G5830f1122C34730l9938E5411
17571A65469a05705l9613C86522F1222J86091A19226L7728f5934D7580L33047
$$ y = [187022, 291177, 249945, -76397, -151576, 140907, 13691, 7865, 906, -88973, 154726, -27574, 252513, 130377, -90409, -4500, -87454, 261562, -168195, -104224, 110332, -235713, -43537, 33177, 372195, 195942, 160760, 20058, 79199, -105880, 332507, 132100, -146973, -159555, 184237, 72566, 95721, 41974, -157162, 54162, -2810, 472904, 207898, 76650, 372105, -186779, 68378, -183520, 107781, 190924, 285753, -242069, -61297, 33298, -52183, 249691, 150046, -154102, 456743, 225221, -77826, 99901, 358574, -6386, -40003, 316030, 204317, 32285, 393301, 81328, 78785, 96813, 157613, 235385, 98412, 74316, 383130, 75830, -61122, 334730, 294792, 55411, 165469, -105705, -145318, 386522, 61222, 247313, 119226, 156954, -65934, 47580, 380627]
17561C80627j66797j03498a41876A24255k9416a07690J7691A41366l2631J34609
17551B43344K30579A28183l1741N1024L4383a01436A29246I25J49336g6862C5546
17539E1826O0844N2133F9409K04544c9518E429J84226J82397o4936M9940j60855
17528A96201L05363A61638K08770M35360J24134l6895j37996j7785k28561A41316
17517D71237p59j52500A45092J9175K29399J69000J05965J49624l88616M84854
17507I14493k33331k88444J13219q4876j17717A08525J05612M5278K42162O7070
17497E68647A77524J89279j74516J48704J9097R1182b8041r3105B60294J31733
17487C92027F038L96743j39225O3299j04869J74221n1876a6727k737D20668A54710
$$ y = [380627, 213830, 110332, -141876, 124255, 94839, -107690, -89999, 141366, 108735, 243344, 473923, 128183, 96442, 147466, 181849, -101436, 129246, 925, 150261, -76862, 35546, 51826, 112670, 164803, 69409, 273953, -39518, 5429, 189655, 372052, 307116, 357056, 196201, 501564, 161638, 370408, 805768, 929902, 893007, 755011, 737226, 508665, 141316, 471237, 470478, 317978, 145092, 164267, 393666, 562666, 668631, 818255, 429639, 914493, 681162, 392718, 505937, 421061, 303344, 108525, 214137, 259415, 501577, 568647, 177524, 366803, 192287, 340991, 360088, 451270, -28041, -121146, 260294, 392027, 6038, 402781, 263556, 326855, 221986, 396207, 344331, -16727, -19464, 420668, 154710]
17475C11616A30487K44560I784J18759Q9254M7789M1981j6967A30442K684K01295
17464C34421F2096K18055b3582B33143J02785g3336C63883K8439b3222C76621
17453D0332K99239l7134o9466D1331L06072b38648E43104k27073J90450A96929
17442D064M09405J70703n511A78970J40670a5188C85628J89223j28096k20839
17432B25916N1713K61960B50527J22562k7643n9738C523L66356o8199A25025K89845
17421D14870a9078B07816K31487o4048l2182o250L1152C3222O64069f0758C9125
17409H778M73035m0836A76147K6043J73778j25010j18577K6310M4448o3033J58050
17398B98156p0254j8867G7084L23031G5405d3224A21811J89997j55417K51963
$$ y = [311616, 130487, 375047, 9784, 128543, 217797, 265586, 307567, 290600, 130442, 133126, 334421, 62096, 280151, -23582, 233143, 335928, -73336, 363883, 392322, -23222, 376621, 40332, 339571, 302437, 232971, 41331, 347403, -238648, 543104, 316031, 506481, 196929, 4064, 413469, 584172, 578661, 178970, 319640, -15188, 385628, 574851, 446755, 225916, 277629, 539589, 250527, 373089, 345446, 285708, 3523, 369879, 301680, 125025, 414870, -19078, 207816, 439303, 375255, 343073, 336823, 367975, 33222, 697291, -60758, 39125, 8778, 481813, 440977, 176147, 202190, 375968, 250958, 132381, 158691, 203139, 140106, 298156, 227902, 209035, 77084, 400115, 75405, -43224, 121811, 311808, 156391, 408354]
17388D08354b1395A85478D8463J70865q9995E8518J28331N226K10958j8046j09195
17377B75792A28397J23948A08528J50701m2236b2273B37883J33585A48434F2117
17366A46788L51891L6500p6611r5985q3655o9822J27330a55538C42375P0549r4463
17355C18461K21211G3120M69409D0760L0052J91788j24098k4737M6032J23755
17345B83552I1886P9647M0455J6093j10298N3580j9241k0462B8978K74061j3940
17334B89099J95948A92249n512a00839A96399J24418A08243K34748q1154a89A46391
17322A07788L13899n7815A36581L57221A47305J26646l7756F4042O0024J89978
17312C14044n1516L7207a7996D99201A76204K07755A82061J72224I8065L72611
$$ y = [408354, -21395, 185478, 48463, 219328, 129333, 58518, 186849, 192075, 403033, 384987, 275792, 128397, 252345, 108528, 259229, 216993, -22273, 237883, 371468, 148434, 62117, 146788, 498679, 535179, 458568, 362583, 278928, 209106, 336436, -155538, 342375, 412924, 318461, 539672, 73120, 542529, 40760, 70812, 262600, 138502, 113765, 159797, 283552, 91886, 171533, 211988, 228081, 117783, 171363, 152122, 131660, 28978, 303039, 289099, 485047, 192249, 186737, -100839, 196399, 320817, 108243, 342991, 261837, -189, 146391, 107788, 421687, 363872, 136581, 493802, 147305, 273951, 236195, 64042, 124066, 314044, 262528, 299735, -17996, 499201, 176204, 383959, 182061, 354285, 98065, 470676]
17302D70676P3320m3105C2702L69050m3645J16312A07291L77577j23416j10380
17292B51072k4386I6659K13354l7077A2425J23057M77123k36495r4827k4525J81261
17281D38019k14217J19966A08838L42612A89704L00912j77289j33199L85771A86205
17270f646B32470J11111j26168O0054p9097J81982j0516q7608l5502o6241K60033
17259D40518k1059l612m9292K1697j61313j00261M5751M27197B40295K58964k45563
17248B53696P7933L9231A73195J10627M42546B19451d52343B60503K3036J59699
17238D43238N6751L8825p8042n4465K30363A18978L73805j33085n772J00179J62241
17227F16346B19424K89346B49074P6213I5257J67917L42501k33989J13254A40602
$$ y = [470676, 543996, 500891, 32702, 401752, 358107, 474419, 107291, 484868, 361452, 251072, 226686, 96659, 310013, 272936, 12425, 135482, 612605, 376110, 281283, 256758, 438019, 223802, 343768, 108838, 451450, 189704, 490616, 313327, 180128, 565899, 186205, -6646, 232470, 343581, 217413, 277467, 198370, 380352, 369836, 282228, 246726, 180485, 440518, 419459, 415847, 366555, 388252, 226939, 126678, 172429, 599626, 240295, 499259, 253696, 331629, 370860, 173195, 283822, 726368, 219451, -452343, 260503, 283539, 443238, 499989, 538814, 460772, 406307, 636670, 118978, 492783, 359698, 353926, 454105, 616346, 219424, 508770, 249074, 325287, 95257, 263174, 605675, 371686, 484940, 140602]
17216D6350K25808O1518j5585J60434j90024J5495M41492k63999j60992L21978
17206F42475k09580A29297L80181R9093k81391N825K06933B60935K06366K1812
17196D89113R3692j14276o8767O716K90197k22411J19758m6747k590l1430Q8324
17185F01579j83630q0378l0677K17872K7061B06653J44501M2461A94529K47604
17175D42133p2841p298j01366K30280j20505J20399K10375k10099J36343j98752
17165D28669R403M312J42543k40200N10215m26586K71222j37235j25682J56l7136
17154C99681J02067O1605n0002o4472M7455j04258K21635m3999K18502l78867
17144D09347m6947L35766l7926p3683J59329k95623Q7519J11534R6730k13582
$$ y = [46350, 272158, 333676, 318091, 478525, 288501, 303996, 745488, 481489, 320497, 642475, 432895, 129297, 509478, 608571, 327180, 333005, 539938, 260935, 467301, 489113, 582805, 468529, 399762, 406478, 696675, 474264, 594022, 547275, 544685, 513255, 601579, 417949, 337571, 306894, 524766, 551827, 206653, 351154, 393615, 194529, 442133, 369292, 361994, 260628, 490908, 370403, 490802, 701177, 491078, 627421, 428669, 438072, 442384, 584927, 344727, 854942, 428356, 699578, 562343, 436661, 436817, 399681, 501748, 563353, 513351, 448879, 496334, 392076, 613711, 569712, 788214, 409347, 362400, 698166, 660240, 586557, 745886, 450263, 537782, 649316, 746046, 532464]
17134E32464l1013o4820j11861J91580P6176J04052r3279k35166K96456J72677
17124H37266k63081J70723B37768L58688o074k08285K46162P5355k03634L0969
17114E30949k54511K67065K41961C80801J16752j4488O2571j5781Q0527M7697
17104F58079J73096k2138j64050j51150J29769N8002J74654L6475j20285B60308
17093F62991M5398r1360p6598r8116L98797r8716j76845O3265P5888K2485O950
17082G34139n6118J19686j53607J38500j42644Q9148j05982J04376R9174L5320
17072H61992r1445J52849j37688j53983k9899j5303m2132J73316J92834O0030
17062I70571k98698L14180k75961K96226k92789J88431O937j26137J59325O4229
$$ y = [532464, 501451, 436631, 324770, 516350, 592526, 696578, 603299, 368133, 664589, 837266, 574185, 744908, 237768, 596456, 590382, 382097, 628259, 703614, 499980, 530949, 276438, 543503, 785464, 380801, 497553, 483065, 545636, 529855, 610382, 658079, 831175, 809037, 644987, 493837, 623606, 681608, 856262, 892737, 772452, 260308, 662991, 708389, 617029, 540431, 442315, 841112, 742396, 565551, 628816, 704704, 727189, 734139, 678021, 797707, 644100, 782600, 639956, 729104, 623122, 727498, 826672, 861992, 770547, 923396, 785708, 631725, 601826, 586523, 544391, 717707, 910541, 970571, 671873, 986053, 710092, 1006318, 713529, 901960, 908897, 782760, 942085, 1006314]
17052A006314m0307J33113l52530j6782L00011M9867k03938L98136m97419M09446
17042A185911j60855O8365j7148j06455P0406j8339j33088N9666k11269N34569
17032A271763n0958k7108k83196n2015L52007K208j6856k50170M08950o11332
17022G43293M09491j21506n9114L88197j09357n80827L73943m0406j13865J0261
17012I00110M60510K2945j67753j35427J41063k26578K81523l19531J12327K67313
17002A336502N367k30175k0178J88192J42927j79468J28952j60811j44519K31062
16992A297851K61402r7593j02618J13339k7335r3768Q5519j07077P7976N3008
16982A460704j19583L45157k92893L0769M4151K8869n1533k25699L52750j4432
$$ y = [1006314, 966007, 1099120, 746590, 729808, 1029819, 1079686, 875748, 1273884, 776465, 1185911, 1025056, 1093421, 1076273, 969818, 1040224, 1021885, 888797, 948463, 737194, 1271763, 1220805, 1193697, 910501, 858486, 1210493, 1212701, 1195845, 945675, 1354625, 743293, 1152784, 1031278, 972164, 1360361, 1251004, 670177, 1044120, 1003714, 889849, 900110, 1360620, 1383565, 1215812, 1080385, 1221448, 994870, 1276393, 956862, 1069189, 1336502, 1341869, 1111694, 1091516, 1279708, 1422635, 1243167, 1372119, 1211308, 1066789, 1297851, 1559253, 1461660, 1359042, 1472381, 1445046, 1351278, 1436797, 1329720, 1407696, 1460704, 1341121, 1686278, 1393385, 1424154, 1468305, 1497174, 1445641, 1219942, 1572692, 1558260]
16972A558260j62693k3580N309R6943N0884K22141J56157r7269l2730K483j27498
16961A648407l5567J55640P8025k5795j93736K69407k63104L69107l64045L71765
16951B010104k34259J13392p1601L65487r6938n46693M47102o104J11827N4484
16941B146801J6295j20669j2706M9318p3095L13512j64205L20043r5302k05937
16931B174055O1591k1082J11860J23437j36649Q1032k30364K17657J58476o2994
16921B477019R7659N4671l19581N04350r3275J99630l25707K60274k39694K14675
16911B830021O6156m89840J20631M18925J56751l00564L60374m21491K1915M40516
16901C203394O6043M6119N98703m56902k45514J93531j55441K71885j81512K06358
$$ y = [1558260, 1395567, 1371987, 1377296, 1474239, 1525123, 1747264, 1903421, 1806152, 1773422, 1775905, 1648407, 1612840, 1768480, 1846505, 1820710, 1626974, 1896381, 1633277, 2002384, 1638339, 2010104, 1775845, 1889237, 1817636, 2183123, 2086185, 1539492, 1986594, 1980490, 2092317, 2146801, 2163096, 2042427, 2029721, 2079039, 2005944, 2319456, 2155251, 2475294, 2379992, 2174055, 2235646, 2214564, 2326424, 2449861, 2313212, 2394244, 2163880, 2381537, 2540013, 2477019, 2574678, 2629349, 2309768, 2814118, 2720843, 2920473, 2594766, 2855040, 2615346, 2830021, 2896177, 2406337, 2526968, 2945893, 3102644, 2802080, 3162454, 2740963, 2762878, 3203394, 3269437, 3315556, 3914259, 3457357, 3211843, 3405374, 3249933, 3521818, 3340306, 3546664]
16891C546664j3562K96381j17398j5507j2180O0714j76619M10052M01694l54659
16881D025580K01860l21417K93732q9161J58063N1239J70400j30650p501J05843
16871D457988L74729l52059J3202j56948M42614L0599n1509K26629k38202K74045
16861E021088P7764K42114Q5378K79668j6715m3524j7027J73457R7903j19646
16851E780460K20674J8067N28783j44061r844J79901J40705K50642k54952K51159
16841F961534j16165M49915K58744m55729N11787M37289k58593J61395L35972
16832H286149K07202N9382M18033m38947J17321L46703M34483L98958m16865M89116
16822I901535m5817J98005L52264K02482J09109K28081M96969J79903K65461n732
$$ y = [3546664, 3533102, 3829483, 3712085, 3696578, 3684398, 3745112, 3568493, 3978545, 4380239, 4025580, 4227440, 3906023, 4199755, 4110594, 4268657, 4319896, 4490296, 4359646, 4352145, 4457988, 4832717, 4480658, 4493860, 4336912, 4779526, 4810125, 4758616, 4985245, 4747043, 5021088, 5098852, 5340966, 5426344, 5706012, 5689297, 5645773, 5628746, 5802203, 5900106, 5780460, 6001134, 6019201, 6547984, 6403923, 6394079, 6573980, 6714685, 6965327, 6710375, 6961534, 6845369, 7295284, 7554028, 7098299, 7610086, 8047375, 7788782, 7950177, 8286149, 8493351, 8552733, 8970766, 8531819, 8649140, 8995843, 9430326, 9829284, 9412419, 9901535, 9855718, 10053723, 10405987, 10608469, 10717578, 10945659, 11442628, 11622531, 11887992, 11882260]
16812A1882260K94676Q3253L43819M49369M60718j42631N45233J61878K71182
16803A4349757P23153K51601L46722L95701L88909L33284K02417O57057M67040
16794A8115641K00807L82777O43242N03526K41882P40152O66693M41150L15773
16785B2251643Q30736O18574O13469N88112N77483O81847P47655O46311J117550
16776B8673380M39659J155994O77670R37417R97155Q47174R51059J399818M91086
16767C6570412J425983J155632J171195J144849J554817P85557J607388J259613
16759D6675446J885526J260496J165884J846786J584938J578737J265628K171102
16751E9434543J651702J699066K170771J841490J718498J821874K002830J699067
$$ y = [11882260, 12176936, 12260189, 12604008, 13053377, 13514095, 13371464, 13916697, 14078575, 14349757, 15072910, 15324511, 15671233, 16066934, 16455843, 16789127, 16991544, 17648601, 18115641, 18316448, 18699225, 19342467, 19845993, 20087875, 20828027, 21494720, 21935870, 22251643, 23082379, 23700953, 24314422, 24902534, 25480017, 26161864, 26909519, 27555830, 28673380, 29113039, 30269033, 30946703, 31884120, 32881275, 33728449, 34679508, 36079326, 36570412, 37996395, 39152027, 40323222, 41468071, 43022888, 43808445, 45415833, 46675446, 48560972, 49821468, 50987352, 52834138, 54419076, 55997813, 57263441, 59434543, 61086245, 62785311, 64956082, 66797572, 68516070, 70337944, 72340774, 74039841]
16743G4039841J975807J833807J591146J466928K264522J399181J527579J558388
16735H7657199J108996J670987J092249R99043Q55368Q65623K76844P17681J57090
16726I5401080J06822l9402j43026k92622o42011r26000q75615q95698j016444
16717I0677084j362572j566955j567097j368402j842411j150939k214296j555914
16709G8048498j776864k102092j439001k119016j815652j475415k136395j886657
16701F3297406j559492k111415j818801j358689j591615j709459j698725j233802
16693E0215408j526065j439940j437108j204897j614653q65616j315949j098830
16685C9712350j334989r49050r72443j079026p64553j219214q00509j135137q93033
$$ y = [74039841, 76015648, 77849455, 79440601, 80907529, 83172051, 84571232, 86098811, 87657199, 88766195, 90437182, 91529431, 92528474, 93383842, 94249465, 94526309, 95243990, 95401080, 95507902, 95468500, 95325474, 95032852, 94390841, 93464841, 92589226, 91693528, 90677084, 89314512, 87747557, 86180460, 84812058, 82969647, 81818708, 79604412, 78048498, 76271634, 74169542, 72730541, 70611525, 68795873, 67320458, 65184063, 63297406, 61737914, 59626499, 57807698, 56449009, 54857394, 53147935, 51449210, 50215408, 48689343, 47249403, 45812295, 44607398, 42992745, 42127129, 40811180, 39712350, 38377361, 37428311, 36455868, 35376842, 34612289, 33393075, 32592566, 31457429, 30564396]
16676C0564396o33200o82863j003245p46906o81456n00348j087297o14028o94746
16667B3920307k44366o78585p28182o11067k4678q77896m91748k59775n06727
16658A9497283q80843J21601m50706n26808l36737p15623k17523o17310R1881
16649A5965215o23726P7733n34768l43462p2072n47573j0617l83662n04468J11693
16639A3134293l38719j47311r8236n28251J76688o07858l26701r3206j97987m71704
16629A0501008k29352o6901j7214k93075n0526l38024L17277n26771l62133L84404
16619I318693l87626p662k99092j63194j82746J31707m06549p3924k17403j61843
16609G550361L0521L19397m32247k60943J56861m99714N7639J63660k70694l23964
$$ y = [30564396, 29931196, 29248333, 28245088, 27498182, 26816726, 26316378, 25229081, 24615053, 23920307, 23675941, 22997356, 22269174, 21658107, 21633429, 20755533, 20263785, 20004010, 19497283, 18616440, 18738041, 18287335, 17760527, 17423790, 16708167, 16490644, 15873334, 15965215, 15341489, 15419222, 14884454, 14540992, 14468920, 13921347, 13910730, 13527068, 13022600, 13134293, 12795574, 12648263, 12550027, 12021776, 12198464, 11590606, 11263905, 11170699, 10972712, 10501008, 10271656, 10204755, 10187541, 9894466, 9843940, 9505916, 9823193, 9296422, 8934289, 9318693, 8931067, 8923405, 8624313, 8461119, 8278373, 8410080, 8003531, 7929607, 7712204, 7550361, 7580882, 7900279, 7468032, 7207089, 7363950, 6864236, 6921875, 7085535, 6814841, 6490877]
16599F490877L7888M878k78523J55698k43566m5535J03931j39158n07350J19543
16589E698683L5666k72276j3081P7732r1879j65673O4821M1964J08060k59094
16579E224923J53893k22081j96458J13695j11587l82868m1141j56447L49438k30925
16569D500442J25328m34645K00780k63165J29754j27560Q173L4886q439j31168
16559D034386j34526K2514j72657P859j46192L31837k24661n0483K36653m11769
16549C492961J34025k4514l160j56667j14291K49047J11807m76798R8925P5588
16539C386923l62090L45523m91025J31645L804l00667K48227N5560K29795j63479
16529C084216M38687r99315N37538l26173K90570k08927k11494N13808m25392
$$ y = [6490877, 6528765, 6533643, 6255120, 6410818, 6167252, 6121717, 6225648, 6086490, 5579140, 5698683, 5734349, 5462073, 5448992, 5526724, 5434845, 5269172, 5333993, 5375957, 5484017, 5224923, 5378816, 5156735, 4960277, 5073972, 4962385, 4579517, 4538376, 4381929, 4731367, 4500442, 4625770, 4191125, 4391905, 4128740, 4258494, 4130934, 4139107, 4173993, 4165554, 4034386, 3899860, 3922374, 3749717, 3757576, 3611384, 3943221, 3718560, 3668077, 3904730, 3492961, 3626986, 3602472, 3599312, 3442645, 3328354, 3577401, 3689208, 3212410, 3311335, 3386923, 3024833, 3370356, 2879331, 3010976, 3014780, 2714113, 2962340, 3017900, 3247695, 3084216, 3522903, 2523588, 3061126, 2734953, 3025523, 2816596, 2605102, 3118910, 2693518]
16520B693518k72827M70588l94847M47297m71159L72767j89868K05583m40339
16511B420713L12540l30442R1908K0164P2209N0516n68278J98425J83439l3127
16501B418067j81004J99712j22607m2328P9753l5497j40991o809Q903j5536P0764
16490B232427O5324j38674k33141J28984n3437K33965k59913L69253m1549j84866
16480B118373r2094K66559j53313k9087k08792Q7543q4180j39612L11478j99052
16470A877823O2365J01205r8882j05682K60679o36040N26570k12926j02403K83937
16460A956646l73393K46112j83702q5199L2570K70665m01136L65784k58194K03984
16450A774137l5248l06300K25441l62455l410N06041m37501K34506j40681O5008
$$ y = [2693518, 2420691, 2891279, 2496432, 2943729, 2472570, 2845337, 2655469, 2861052, 2420713, 2733253, 2402811, 2494719, 2514883, 2587092, 2637608, 2069330, 2267755, 2451194, 2418067, 2237063, 2436775, 2314168, 2271840, 2351593, 2316096, 2175105, 2168296, 2177199, 2161663, 2232427, 2297751, 2159077, 1925936, 2054920, 2001483, 2235448, 1975535, 2344788, 2303239, 2118373, 2026279, 2292838, 2139525, 2110438, 1901646, 1989189, 1905009, 1765397, 2076875, 1877823, 1940188, 2041393, 1942511, 1836829, 2097508, 1461468, 1988038, 1775112, 1672709, 1956646, 1583253, 1829365, 1645663, 1560464, 1593034, 1863699, 1462563, 1828347, 1570153, 1774137, 1738889, 1432589, 1658030, 1295575, 1292165, 1798206, 1360705, 1595211, 1454530, 1519538]
16440A519538J80891j53513p703k45705N43617l34867O1890J48975m39799L7485
16430A310809K39980q6988j15936J82839k39314L74763k2055l88051q850R1092
16420A338289K61872J06827m69205Q400R4545r9580J57005L4616l23657K84864
16410A393976j89957o8041J61751j20932r6008J53161J11010j71137k2818K1863
16400A172868l6090K81214r2848j69755q4797j8860K37153m44650M20060k69358
16390I94937Q8189l4323p2521M1837l8894o6977o5883K35300L58434o095l41990
16379A092014l39426L88847k8888K4280j42126j44093L07953j08004J90828q7468
16369A153917l50708M54383j65053j30385P9661J90699K2174l46151L20547j84605
$$ y = [1519538, 1700429, 1546916, 1539213, 1293508, 1837125, 1502258, 1564148, 1713123, 1273324, 1310809, 1550789, 1463801, 1347865, 1530704, 1291390, 1666153, 1644098, 1256047, 1247197, 1338289, 1600161, 1706988, 1237783, 1246183, 1340728, 1241148, 1398153, 1432769, 1109112, 1393976, 1204019, 1135978, 1297729, 1176797, 1080789, 1233950, 1344960, 1173823, 1151005, 1172868, 1136778, 1417992, 1325144, 1155389, 1070592, 1051732, 1288885, 844235, 1264295, 994937, 1083126, 1048803, 976282, 1018119, 979225, 912248, 846365, 1081665, 1440099, 1434004, 1092014, 752588, 1141435, 1112547, 1136827, 994701, 850608, 1158561, 1050557, 1241385, 1153917, 803209, 1257592, 1092539, 962154, 1041815, 1232514, 1254688, 908537, 1229084, 1044479]
16359A044479j40963n3463n009N2797M14968m22260N443K13496K34202n95808
16349G47882L22177m08655L28331o9361q016k5448j06049J63429J07054K334l53268
16338G00410M98772k35011K05677l05507o8135J93269l7568J80804l28845j87663
16328F16203K94439j83859O3105o4711j21721R7622J47148J11059p7397J80712
16318A062600l88644J13719J31402K17400n0510l99215L41419l46675M17311j86431
16308I12376k39358J93295l01332K73006L7520P1337C54306M15757K54867M4498
16298A069428l80683O5768n2116J15856k11885j40389L11738q013l6932j07124
16288F25648N3203C04555M28813j25519B98552L85471n7009j19797J48100j4346
$$ y = [1044479, 903516, 850053, 845044, 897841, 1312809, 890549, 895992, 1109488, 1343690, 747882, 1070059, 661404, 989735, 920374, 912358, 886910, 780861, 944290, 1051344, 1053678, 700410, 1199182, 964171, 1169848, 864341, 796206, 989475, 951907, 1132711, 803866, 616203, 910642, 726783, 789888, 725177, 603456, 701078, 848226, 959285, 881888, 1062600, 673956, 787675, 919077, 1136477, 1085967, 686752, 1028171, 681496, 1098807, 912376, 673018, 866313, 564981, 837987, 875507, 946844, 354306, 770063, 1024930, 1069428, 688745, 754513, 702397, 818253, 606368, 465979, 777717, 769704, 732772, 625648, 678851, 304555, 733368, 607849, 298552, 684023, 627014, 507217, 655317, 640971]
16278F40971J11760C10696J88772J95812B69696L90864J0675q4165K43252k81852
16268E48470j1401k26900M98389R0590B86130L81991j53408K42986n078k18144
16258E34477L1982k48252M23664k74657L06031J1864j32569J53069j11403J16026
16248H10232k09542J65641A82570L28944j96368K45875k62376L00610J32129j18006
16238F13378n6048K09741l49047J88244k9106k56924L47437j83899j69215L32818
16228F47379K26470C58689J62074k31388J20902J37881k10358A33963L73774A92306
16217A84177K49432J72493k32034r8082m5308K48421N4543M2536K6617A85027
16206G23250B26249M35718m3911k40672J73923j86625J8520K44485l02607K062
$$ y = [640971, 752731, 310696, 499468, 695280, 269696, 660560, 671235, 587070, 830322, 548470, 537069, 310169, 808558, 899148, 286130, 668121, 514713, 757699, 752621, 534477, 566459, 318207, 741871, 467214, 773245, 785109, 652540, 805609, 694206, 810232, 600690, 766331, 182570, 511514, 315146, 561021, 298645, 599255, 731384, 613378, 557330, 767071, 418024, 606268, 577162, 320238, 667675, 483776, 314561, 647379, 873849, 358689, 520763, 289375, 410277, 548158, 337800, 133963, 507737, 192306, 184177, 433609, 606102, 374068, 275986, 230678, 479099, 533642, 576178, 602795, 185027, 723250, 226249, 661967, 618056, 377384, 551307, 364682, 383202, 627687, 325080, 327142]
16196C27142K62045k85193q0719K09181N0576k07775e5980B45627K40668n3877
16186D32418q098r0449j23590K50292P4045r0187J35054j62950J02063A63117
16175C88304K52354A32506M57406m7879j75133j5880p6535M19867k27432k22283
16165B44637J0056K07972A29693L47164A29547K94478B10981I2175J89777K18147
16155E00099k24369P0367E5361L36204Q6310j65171p7995J34833j3392K71819
16145F27969j53064j69070K94975B47947K31394j35906J20219j11063j58296M75817
16135F70112C02393C3477L45715j15791o7358K08806N7196j21218n103p1633e0535
16123A40973J54780J79229A6793J54867N727L08027I1218L86923O734A99143F0832
$$ y = [327142, 589187, 303994, 223275, 432456, 483032, 275257, -55980, 245627, 486295, 432418, 424320, 333871, 210281, 460573, 534618, 444431, 579485, 416535, 518598, 163117, 388304, 640658, 132506, 589912, 542033, 366900, 351020, 274485, 694352, 466920, 244637, 254693, 462665, 129693, 476857, 129547, 424025, 210981, 92175, 281952, 500099, 275730, 346097, 55361, 391565, 477875, 312704, 234709, 369542, 356150, 627969, 474905, 305835, 600810, 247947, 479341, 343435, 463654, 352591, 194295, 670112, 302393, 33477, 379192, 263401, 196043, 404849, 462045, 340827, 335724, 264091, -50535, 140973, 295753, 474982, 16793, 171660, 177387, 485414, 91218, 478141, 484875, 199143, 60832]
16111A47708d4535B89918D0220M67281B30607N5353D5377R0651K7911o135K15942
16100C73746M9776M1739j9160H4774K80628Q8235k11286B2681C628J88343O1393
16089B53364i2211E77308A79642Q7615j12118n9880e7834F00945b0094D21738
16078a1187j26702B09646R8148e5814A53952P4401j649r0526a95599a0025A43680
16066D6937J5836J20125J29441K46340p2835C637M7289b44624B22795B3275N5753
16055G9028a0970B3785K36147H9315k4493d0030C27582j40820H9882J0407K45921
16044C46210D6536J76760a21275c7079B11071P2956B0963J41495N8864a20686
16033A5823K24007J94264q4950A69207J5337C0193h5202a132k27839A07607J26501
$$ y = [147708, -44535, 289918, 40220, 507501, 230607, 285960, 45377, 136028, 163939, 157804, 373746, 423522, 465261, 446101, 84774, 365402, 453637, 242351, 22681, 3628, 191971, 253364, -92211, 577308, 179642, 267257, 155139, 95259, -57834, 600945, -20094, 421738, -11187, -137889, 209646, 307794, -55814, 153952, 228353, 226704, 136178, -195599, -10025, 143680, 46937, 62773, 182898, 312339, 558679, 485844, 3637, 50926, -244624, 222795, 23275, 79028, -10970, 23785, 259932, 89315, 64822, -40030, 327582, 186762, 89882, 100289, 346210, 46536, 223296, -121275, -37079, 211071, 284027, 20963, 162458, 221322, -120686, 15823, 239830, 434094, 349144, 169207, 184544, 30193, -85202, -1132, -228971, 107607, 234108]
16022B34108q3521c00541f736l42481A76598a24905A83171J48446g0130D3552
16011H2016M89278A76315J44005n3401A03784J84881j04064H3799a88241I3977
16000C46998a36092H8355d5454K0666m1331B14401b77005D56882j35973A48994
15989E52497J88720L47182O9391n4931L16425p9616m98501B87185q278G0264K26724
15978B96988J03111j67527a31586H7763K6681c7564A08254e2458K3497j24781
15968a53742d7385a8711j13866D3755K42468b73120c7181G9451a01723I2778A9317
15956I9196J4230a54474O2557C1222d5593B20453O7480j15540c21435A68849F3340
15944H1432B7645A3535J3702J61549A9563f3280K6201j86851I2374J93687a38831
$$ y = [234108, 150587, -300541, -6736, -349217, 176598, -124905, 183171, 331617, -70130, 43552, 82016, 571294, 176315, 320320, 266919, 103784, 288665, 184601, 83799, -188241, 93977, 346998, -136092, 88355, -45454, -24788, -66119, 214401, -277005, 456882, 320909, 148994, 552497, 741217, 1088399, 1157790, 1102859, 1419284, 1339668, 841167, 287185, 278907, 70264, 296988, 400099, 232572, -131586, 87763, 114444, -37564, 108254, -52458, -28961, -153742, -47385, -18711, -132577, 43755, 286223, -273120, -37181, 79451, -101723, 92778, 19317, 99196, 113426, -154474, -91917, 31222, -45593, 220453, 287933, 172393, -321435, 168849, 63340, 81432, 27645, 13535, 27237, 188786, 19563, -63280, -37079, -223930, 92374, 286061, -138831]
15932A16271N9790o3871K91650j99494j3813q2451K64871a44337A00460A975R2436
15921I4411L9767O9946g8359c4631C05054a41442D1972K36391o350C055J45575
15910A48630a02749A72707E0544h0386A55440c5309A15213m97B6511A2524c3928
15898d2079C75692a93394r5876a23218B54854o4967a43301j1641A29576a50278
15887c8974n4935c1394A58827E6300J23594m0435a09281i053A31826D23a9742
15875b75146a15427J517C62960d7826I4116J20794A5882J52274K2536i8390G827
15863E5852c8555C00239a18188A85206H1079J7533a60002G7375f6336B38252A2755
15851A24891E4973L74529c5020a4084j64227A59670D866G04J89764f5394j86049
$$ y = [116271, 176061, 112190, 403840, 204346, 190533, 108082, 372953, -144337, 100460, 1975, 94411, 134178, 204124, -78359, -34631, 305054, -141442, 41972, 278363, 272013, 3055, 148630, -102749, 172707, 50544, -80386, 155440, -35309, 115213, 114716, 26511, 12524, -33928, -42079, 375692, -193394, -289270, -123218, 254854, 189887, -143301, -154942, 129576, -150278, -38974, -93909, -31394, 158827, 56300, 179894, 139459, -109281, -9053, 131826, 423, -19742, -275146, -115427, -113910, 362960, -47826, 94116, 214910, 15882, 168156, 190692, -98390, 7827, 55852, -38555, 300239, -118188, 185206, 81079, 98612, -160002, 77375, -66336, 238252, 12755, 124891, 54973, 429502, -35020, -14084, -178311, 159670, 4866, 704, 190468, -65394, -251443]
15840b51443d3185A52621c54968G6453a78748g5314B33685G5861c44381O824d0910
15828A77899d6718o2648F0948a57151q8496K1136L8A15838K44727A64458c02889
15816b49841A39217a92543B96268A45306P9501G2510c64810A54508A1826a69690
15805b1815B34174b5412h431E18885A04621B0717J2704J07640M93258B35464b57990
15793h0749A32202a73414a7041B97064A7566D474R4837a97011b4721m3417j57508
15782b25646a9257B55829a13331j49217C6778e7029D9599b2883A28972R0843r9952
15771A19863D3530K5785f3286B21650c3507F7933l3277a94254D6217Q4375a72293
15759A74327G4224Q0620K35864A4048J57862A6291f3473C4985a25661d1494j991
$$ y = [-251443, -43185, 152621, -354968, 76453, -178748, -75314, 233685, 75861, -344381, -337557, -40910, 177899, -46718, -109366, 60948, -157151, -245647, -224511, -224473, 115838, 360565, 164458, -302889, -249841, 139217, -192543, 296268, 145306, 224807, 72510, -364810, 154508, 11826, -169690, -21815, 234174, -25412, -8431, 518885, 104621, 20717, 33421, 141061, 634319, 235464, -257990, -80749, 132202, -173414, -17041, 297064, 17566, 4474, 99311, -197011, -24721, -68138, -225646, -19257, 255829, -113331, -262548, 36778, -57029, 49599, -22883, 128972, 219815, 119863, 43530, 69315, -63286, 221650, -33507, 67933, 34656, -194254, 46217, 130592, -172293, 174327, 74224, 154844, 390708, 14048, 171910, 16291, -63473, 34985, -125661, -41494, -43485]
15748d3485j26096L4343B43787J9802A10907f5558a4342A96962c50922g0691B69351
15736a9232A39635e7846k08918j51075A57114d2648A56470b20200A24300a00280
15725d1263d527A33352m5436B4102a36083A55123Q7480E1386M4394a85987a7347
15713a71805I2166b52693C84669b0522B99925E9327J827i9166A28814a05239B5529
15701a06371E3068a71590C3863a22422M1732L9110B06544l8678p2546A6046e4968
15689A36506m6091J5450J65336H0725b73102g4217B9137A4147h73G1566a45078
15677h9369K9344A45219P7116b03437j3673A83110p0152b6p5897a6240j14437
15666a30677A76109R1183n7447g436j06416L8528A6061J13517d14727g2271a5424
$$ y = [-43485, -169581, -135238, 243787, 263589, 110907, -65558, -14342, 196962, -350922, -70691, 269351, -19232, 139635, -57846, -266764, -417839, 157114, -42648, 156470, -220200, 124300, -100280, -41263, -4527, 133352, 87916, 24102, -136083, 155123, 242603, 51386, 95780, -185987, -17347, -171805, 92166, -252693, 384669, -20522, 299925, 59327, 61154, -99166, 128814, -105239, 25529, -106371, 53068, -171590, 33863, -122422, -80690, -41580, 206544, 167866, 95320, 16046, -54968, 136506, 90415, 105865, 271201, 80725, -273102, -74217, 29137, 14147, -873, 71566, -145078, -89369, -60025, 145219, 222335, -203437, -217110, 183110, 112958, -26, -75923, -16240, -130677, 176109, 267292, 209845, -7436, -113852, -75324, 16061, 129578, -414727, -72271, -15424]
15654a39135K879k3854k00548K226d0014B63019a43023n9207D19207B697i4687
15642b3148k9357A6201b27917p3746c0308H0129h7569J567J0867B22912a18558
15630A26413C6889a10089A23454K2384B7803A0655c0802A6023J46440E5693a55244
15618B11263F0591K60398j20953d2002I6710c3208j00691l9091a0855k98188J33058
15607a75985h5201c5611G4450A539J23033N5538J36056F7214h8353k07872e8246
15595I3893b23410I7873K8560a57325a3489C52069P339h6856L8412e486A95435
15583A62265J48606A3350J58825a40579A98733C1470a45735B29435J4411f667
15572F4905J60112J74549a38980c1041j31533A36247K6250B3K05156d4429r8024
$$ y = [-139135, -136256, -160110, -360658, -358432, -40014, 263019, -143023, -202230, 419207, 2697, -94687, -23148, -52505, 16201, -227917, -301663, -30308, 80129, -87569, -86002, -75135, 222912, -118558, 126413, 36889, -110089, 123454, 145838, 27803, 10655, -30802, 16023, 162463, 55693, -155244, 211263, 60591, 320989, 200036, -42002, 96710, -33208, -133899, -172990, -10855, -309043, -175985, -85201, -35611, 74450, 1539, 124572, 180110, 316166, 67214, -88353, -296225, -58246, 93893, -223410, 97873, 126433, -157325, -13489, 352069, 359408, -86856, -48444, -5486, 195435, 162265, 310871, 13350, 172175, -140579, 198733, 31470, -145735, 229435, 243846, -6667, 64905, 225017, 399566, -138980, -31041, -162574, 136247, 162497, 23, 205179, -44429, -142453]
15561a42453A54291E2579d0728j7371A4692L8920a25462A8279a71510O0123A3786
15549c34889D6428J14249f6456p3499o7625K3721b1501A03953K57056c01306F2126
15537B33568A4119b145k41910K5431C4282K42086d39418F4855a52645E6872J20365
15526A77237F8074a1111r6152G2048J68355h7862B06016h0731B31745M7924a67260
15514A1986K32563b98868B76638H1368a20710B83279K28405A58165L4357C3270
15503B03497l8822D3412a90013E4868e3710I4323I85K74394A36166K9324L99802
15492E65292E301K0010f9965m35890a69347B03689j5577J90978A72753D6587K69430
15481C16017A47893K4168J19981l8144K4692Q6999O7865j42524j03237J11900
$$ y = [-142453, 154291, 52579, -40728, -58099, 14692, 53612, -125462, 18279, -171510, -111387, 13786, -334889, 46428, 160677, -66456, -139955, -207580, -183859, -21501, 103953, 361009, -301306, 62126, 233568, 14119, -2145, -244055, -218624, 34282, 276368, -439418, 64855, -152645, 56872, 177237, 68074, -11111, -107263, 72048, 240403, -87862, 206016, -80731, 231745, 279669, -167260, 11986, 244549, -298868, 276638, 81368, -120710, 283279, 511684, 158165, 192522, 33270, 203497, 164675, 43412, -190013, 54868, -53710, 94323, 985, 275379, 136166, 165490, 565292, 5301, 25311, -69965, -505855, -169347, 203689, 188112, 379090, 172753, 46587, 316017, 147893, 172061, 292042, 253898, 278590, 365589, 433454, 290930, 187693, 299593]
15471B99593j01386p0459o1770l1269a13391A17754a78833A7704J35211a02818
15460a03648F8156L6651b4810j73199A50289e5912A11538C0946A2250L30562c71467
15448F9647N2877K01678p6454A7072O39697K09345J1642k63581j19479g0331C11309
15436E9473R2021i0676C65371g8756m1887A25349l9284A7055f4212A59441a04912
15424b71815F0648b33273B30117a76700A28297h3071A66243a4813j10783o3936
15414a89532g616j6405B35129a65425E00292I2503a91888j89837I9292J94883
15404B94175r0556a7872A63981a88536Q2676j24074Q1147A10953k4911L05190
15394C91232n4146f4684I7757a25997A99794k7137b08452A85099k0360P8383b23859
$$ y = [299593, 198207, 127748, 65978, 34709, -113391, 117754, -178833, 17704, 152915, -102818, -103648, 68156, 104807, -24810, -198009, 150289, -55912, 111538, 30946, 12250, 342812, -371467, 69647, 122524, 324202, 247748, 17072, 656769, 866114, 877756, 614175, 494696, -70331, 311309, 59473, 151494, -90676, 365371, -78756, -120643, 125349, 86065, 17055, -64212, 159441, -104912, -271815, 60648, -233273, 230117, -176700, 128297, -83071, 166243, -14813, -125596, -189532, -7616, -24021, 235129, -165425, 500292, 92503, -191888, -381725, 99292, 294175, 203619, -17872, 163981, -188536, -105860, -229934, -148787, 110953, 86042, 391232, 337086, -64684, 97757, -125997, 199794, 172657, -208452, 185099, 164739, 243122, -223859]
15382h0543f742j03719L7562D57668b41953J11053G20J16558k8002J56297K401
15371B47974a8813C28404j20421b70775G8979O3362J31865j11038e6514C74387
15360D44616a80619B98451N758e74D4615L56285c1668C18374j09597G3765K1475
15349I5240h4678B29945j08819P9597a85666A13946b38206H00927H9967N4556
15339A44523J84725A20709m6087d6798A94975G0156a12796B35114I3856C6784
15328D57861E1488J22532l6591P5634h7636K0544E4340J65014o8532b14198R7793
15317a16405A58336E5211a59872n3809A36691J56294a62411B94842r2131P0955
15307B73666F7559J32724E6018d8203g093I2850J7138f4269e57A22983k7418J91272
$$ y = [-80543, -6742, -110461, -72899, 457668, -241953, -130900, 720, 117278, 89276, 245573, 247974, -18813, 328404, 207983, -270775, 78979, 142341, 274206, 163168, -56514, 374387, 444616, -180619, 298451, 304209, -574, 44615, 400900, -31668, 318374, 208777, 73765, 95240, -84678, 229945, 121126, 200723, -185666, 113946, -238206, 800927, 89967, 144523, 329248, 120709, 74622, -46798, 194975, 70156, -112796, 235114, 93856, 36784, 457861, 51488, 174020, 137429, 213063, -87636, -67092, 54340, 219354, 150822, -214198, -116405, 158336, 55211, -159872, -213681, 136691, 292985, -162411, 294842, 202711, 273666, 67559, 200283, 56018, -48203, -7093, 92850, 109988, -64269, -557, 122983, 95565, 286837]
15295B86837b27111a4420c066B48442a86102B49564m1765e3247k1211C576R795
15284A3371L20957B6085J76512A00044b34941a3619p2465d886C9040A3862L971
15273A7833K35880p013c8384B64377g4189B68984a51230I3273k0745R0074j2192
15262A50410g436A65259J16481a01931D3862a6431A64626p9108c9716j34442A89233
15250h3238N186A23521L8442J37703N27975L07065J49802m30698O55436n27770
15240I81476C61892A07560C0391J70522f6848A7115K03782K905g7139L3054n6582
15229a00667A07561e4050H415J2794J55885E7935J93319c7302D1050c7163C24231
15217g0920B85416e6836B02460p5449K53382j0611a07261A85837P2292b68503
$$ y = [286837, -227111, -14420, -3066, 248442, -186102, 249564, 207799, -53247, -74458, 3576, 13371, 334328, 26085, 202597, 100044, -234941, -13619, -86084, -4886, 39040, 13862, 17833, 253713, 246700, -38384, 264377, -74189, 268984, -151230, 93273, 72528, 162602, 150410, -7436, 165259, 281740, -101931, 43862, -16431, 164626, 85518, -39716, -174158, 189233, -83238, -78052, 123521, 161963, 299666, 827641, 1134706, 1284508, 853810, 1509246, 981476, 361892, 107560, 30391, 200913, -66848, 17115, 220897, 223802, -77139, -44085, -100667, 107561, -54050, 8415, 21209, 177094, 57935, 251254, -37302, 41050, -37163, 324231, -70920, 285416, -56836, 202460, 127011, 380393, 369782, -107261, 185837, 258129, -268503]
15206A40371C991J84046b3974C2211c2216G5725J42233l7708a95893A10494b3368
15194a49478A21837D9314h3899A44283B3173c4755A28040b46515A3065K02034
15184B15099q6685L3965L9016p9433n0375J18764r1355a6394k793A51584i9671
15172B92410H5179K0820J32953A498a5768k49475A34653k8590K28531A27949K06694
15161C34643j61928q3909e8955K4945C3726i5073E0744b01846I2431J35363N638
15150B33432K50416j50348e2808B15311a38353A61453C8951h0909E0659e1849
15139a17807r3209b4061G7476h4078A78321P3482b01885C16160j42926C4488L29867
15128C64355H4043M4206k2678J90312J3382m5175A28481J79531N7815J15394k11686
$$ y = [140371, 3991, 188037, -23974, 32211, -32216, 75725, 217958, 180250, -195893, 110494, -23368, -149478, 121837, 49314, -83899, 144283, 23173, -34755, 128040, -246515, 13065, 215099, 128414, 162379, 201395, 121962, 71587, 190351, 98996, -16394, -19187, 151584, -99671, 292410, 85179, 105999, 238952, 1498, -15768, -265243, 134653, 106063, 334594, 127949, 334643, 172715, 88806, -58955, -34010, 33726, -95073, 50744, -201846, 92431, 227794, 233432, 483848, 333500, -52808, 215311, -138353, 161453, 38951, -80909, 50659, -51849, -117807, -211016, -24061, 77476, -84078, 178321, 251803, -201885, 316160, 173234, 34488, 364355, 84043, 128249, 105571, 295883, 309265, 264090, 128481, 308012, 365827, 481221, 269535]
15117B69535A32698m6123j7288b8548l126j189G4749J03309L63514j80668A73179
15105G5859O0019F06J26125a8602A50672L3564J00154l4185K72144h4932E4804
15093B63021A21962Q0882D2102f6294B76583o4292k7745G0140J49051N5770a85005
15081A31438J54925A35216J75581r0485G8997M5775J53082e346E2853J52771K15301
15070D20925j12682a5137E13529B8316L52462A55748l2644J83934A45399R8384
15060B43783G5213J5047K70711O110A40800J71106O6918E5781j360K30493M9079
15049C33993A55734R822K51438D4464J59542b17494A54353L56449G3380K63195
15039C36575A18618L84686A36496K55574C9031L55582A24472L13081R0167J09358
$$ y = [269535, 132698, 86575, 69287, -28548, -31674, -32863, 74749, 178058, 541572, 360904, 173179, 75859, 135878, 606, 126731, -18602, 150672, 184236, 284390, 250205, 522349, -84932, 54804, 263021, 121962, 202844, 42102, -66294, 276583, 212291, 184546, 70140, 219191, 274961, -185005, 131438, 286363, 135216, 310797, 220312, 78997, 124772, 277854, -5346, 52853, 205624, 420925, 308243, -15137, 513529, 28316, 380778, 155748, 123104, 307038, 145399, 243783, 75213, 90260, 360971, 367081, 140800, 311906, 378824, 55781, 54421, 284914, 333993, 155734, 165556, 416994, 44464, 204006, -217494, 154353, 510802, 73380, 336575, 118618, 503304, 136496, 392070, 39031, 394613, 124472, 437553, 527720, 637078]
15029F37078k20174K18412j02670N9576A71591K46577j57856M9953K57286j79410
15019C88141Q8646K7356O0526j75600J48765k05499n8354J35904j7763a84153
15008B34895K48765L55320C70216q3277K96621B37522J20394j56849k5723J0054
14998A85398K28081B9958N23257k36644k494M5821R9880A60179O2825M30151l5445
14987F17710k46262M36760l32414A35640L21540j13121O4211Q9538K59677J38455
14977H95940k72801k26753C7217J04442L01060K07033k8190J04040B72019L33230
14967F05249k00909J23756k59259J45949R794J11192j49652m1891L04072B35881
14956A64117K25562a14489B49095D9443L37811j31661q8988J48204M6746A41102
$$ y = [637078, 416904, 635316, 532646, 592222, 171591, 418168, 260312, 310265, 567551, 388141, 476787, 504143, 564669, 389069, 537834, 332335, 273981, 409885, 392122, -184153, 234895, 483660, 838980, 370216, 286939, 583560, 237522, 357916, 201067, 175344, 185398, 413479, 29958, 553215, 316571, 314077, 359898, 459778, 160179, 223004, 653155, 617710, 371448, 808208, 475794, 135640, 457180, 344059, 408270, 497808, 757485, 895940, 623139, 396386, 37217, 141659, 442719, 649752, 621562, 725602, 272019, 605249, 404340, 528096, 268837, 414786, 424580, 535772, 386120, 344229, 648301, 235881, 164117, 389679, -114489, 249095, 49443, 387254, 255593, 166605, 314809, 361555, 141102]
14945E95802P5118k93402K91778k51818l1567r4828o5862J33436m4131N5042J31766
14934E01334k44134L04193k9039M00609O1074j96141K17307P5327r7291J47964
14924A141203J7292j11306j1896J84212O09894m11173M03514l04690l68566Q0068
14914A228552Q9708F52887R2142l12047K8883n8322J5411j76793K69239k02244
14904C09156J84232k0927k09386J97345L2329A76671j0260M21484D6606L21729
14894C68335J16242q1973q5986L36831o8401j44645p7742L6377K75842C28829
14883D97530J09535K65421m03484J53224q2450n9355N6587o2251R3900A57496
14872C91401D3166B1430K89300J73377k3002A14706N53470j05944j61886J02869
$$ y = [595802, 670920, 377518, 669296, 417478, 385911, 291083, 225221, 358657, 314526, 369568, 501334, 257200, 561393, 532354, 932963, 994037, 797896, 1015203, 1090530, 993239, 1141203, 1158495, 1047189, 1035293, 1219505, 1829399, 1418226, 1821740, 1517050, 1148484, 1228552, 1318260, 652887, 745029, 432982, 461865, 403543, 418954, 242161, 511400, 309156, 493388, 472461, 263075, 460420, 492749, 176671, 166411, 587895, 46606, 368335, 484577, 402604, 316618, 653449, 585048, 440403, 362661, 399038, 674880, 328829, 497530, 607065, 872486, 469002, 622226, 539776, 480421, 537008, 474757, 568657, 157496, 391401, 43166, 21430, 310730, 484107, 461105, 114706, 668176, 562232, 400346, 503215]
14862E03215M2487B25904L50448j31113A94782L07648K3681l2750l9191J1832
14852D66002J22981j25588J22756k25629N6345K87167p8950p4096J31972K00869
14842H83829J7670k7880R6900O8436l05798k23665K44643k11855j11965n2806
14832C77509L12631j43604N3462j41794m5232J93389B67110L52246P9233J7578
14822G16167j86880J49560k51429k6380J14688J47160J82263j61993N2423p9393
14812F56186j21480l7094L13641j51683k22421j3995J5490K37570J12112k67955
14802E20371O0818J77885n7046j64807J0330o5923L4915l9090k33116J88164j20744
14791C11757K12319r1765M9942K48077j89707K25907l52366n0871J14986P5443
$$ y = [503215, 545702, 225904, 576352, 445239, 194782, 502430, 526111, 493361, 454170, 466002, 588983, 463395, 586151, 360522, 416867, 704034, 625084, 550988, 682960, 883829, 901499, 873619, 970519, 1038955, 733157, 509492, 754135, 542280, 430315, 377509, 690140, 546536, 599998, 458204, 412972, 606361, 267110, 619356, 698589, 716167, 529287, 678847, 427418, 401038, 515726, 662886, 845149, 683156, 735579, 656186, 534706, 497612, 811253, 659570, 437149, 423154, 438644, 676214, 788326, 520371, 581189, 759074, 702028, 537221, 547551, 481628, 516543, 477453, 244337, 432501, 311757, 524076, 432311, 482253, 730330, 540623, 766530, 414164, 363293, 478279, 553722]
14781E53722K56721k25340p5757L23142J36481l31170J9552k5520K45099k26540
14771F50390R157k93019A50490Q62478l54527L7513q7229J8664k27508J3275J53803
14760E66959j27619n9901J46661q0279J88453J68425n9760l66033M4309K77201
14750F98416N4574k04573n6204K00091L4839C16968K26471j47675J71650L4173
14740F01587K16214L8657j33511J58416p2535j22803J29450r645J01816k18181
14730F89465K7780N52816n93062O33513Q6606l5188j85862J70342m01533m7959
14720H96918K95860E76653O29331m21764J75355k29511J85214l1550n4189l1793
14710G97746J57122k21094j50072K50111J60903p5638J36159K9757M15008J65912
$$ y = [553722, 810443, 585103, 509346, 832488, 968969, 637799, 657351, 631831, 876930, 650390, 659547, 366528, 150490, 1012968, 658441, 695954, 608725, 627389, 399881, 413156, 566959, 439340, 379439, 526100, 445821, 634274, 802699, 742939, 376906, 421215, 698416, 752990, 548417, 492213, 692304, 727143, 316968, 543439, 395764, 567414, 601587, 817801, 856458, 722947, 881363, 808828, 686025, 815475, 805830, 907646, 689465, 717245, 1270061, 676999, 1310512, 1397118, 1361930, 1176068, 1346410, 944877, 896918, 1192778, 576653, 1205984, 784220, 959575, 730064, 915278, 883728, 829539, 797746, 954868, 733774, 583702, 833813, 994716, 919078, 1055237, 1084994, 1500002, 1665914]
14700A665914n30991K86398k02123O5720l25687K33241k73581K12473l49714K02646
14690I84296j2001q7668k92181R0698L65257l34927j54119L70112j25798Q936
14680H12605M08347E91514J95496M6735j60497L0609K40052Q107J4964j00028
14670H66952l66989O51029l4134L933k72747l3319J61649k76742K4343M38508
14660A162483k68965l2516O8043M7277l68132M16106K50955l76549K01904K72854
14650A373460n01883k9306J57097R7559m63128O02967j83149l14087K40257L54478
14640A334265l63391M5369N23370n72814M43061N2148m16508r5128J56441j75978
14630I30835j55149L89220O5458k14684o1404L33296j66245K02212P1057j6712
$$ y = [1665914, 1134923, 1421321, 1219198, 1284918, 959231, 1192472, 918891, 1131364, 781650, 984296, 972295, 884627, 592446, 683144, 1048401, 713474, 559355, 929467, 803669, 812605, 1220952, 591514, 787010, 833745, 673248, 703857, 943909, 952016, 966980, 866952, 499963, 1150992, 1116858, 1120791, 848044, 814725, 976374, 699632, 723975, 1162483, 893518, 861002, 929045, 976322, 608190, 1024296, 1275251, 898702, 1100606, 1373460, 871577, 842271, 999368, 1096927, 633799, 1236766, 1053617, 739530, 979787, 1334265, 970874, 1016243, 1539613, 966799, 1409860, 1462008, 1045500, 950372, 1106813, 930835, 775686, 1164906, 1230364, 1015680, 954276, 1287572, 1121327, 1323539, 1394596, 1377884]
14620A377884M566j34883Q2960R7J79055m46192K94964r9889L1952M30289m09993
14609A310810j01353R7940K66333j1137k71220j04904K12853N5988K4760M592
14599A484662J32780K8607r6978k69895J4421M69887j88761n461J12825k79071
14589A403016L48737k81158M49740m23985o4513Q0237J79517k07089M87529l65677
14579A606354K00460o9512K32156J11961J70293k60444j21132J76453j82313K73198
14569B137474k07880M17642k83456Q6266j12633O3286J07648L46095k96313K93299
14559B551428J29588L60991m14482J61050R1678O50907N6010N98152J110174J668179
14549F963675L204778M942119Q858851J3398367p275491A2895415F073036j878679
$$ y = [1377884, 1382450, 1247567, 1330527, 1330624, 1509679, 1063487, 1358451, 1258562, 1290514, 1720803, 1310810, 1209457, 1307397, 1573730, 1562593, 1291373, 1186469, 1399322, 1455310, 1480070, 1484662, 1617442, 1646049, 1549071, 1279176, 1293597, 1763484, 1574723, 1569262, 1682087, 1403016, 1751753, 1470595, 1920335, 1496350, 1431837, 1512074, 1691591, 1484502, 1972031, 1606354, 1806814, 1737302, 1969458, 2081419, 2251712, 1991268, 1870136, 2046589, 1864276, 2137474, 1929594, 2347236, 2063780, 2150046, 2037413, 2100699, 2208347, 2554442, 2258129, 2551428, 2681016, 3042007, 2627525, 2788575, 2880253, 3531160, 3587170, 4185322, 5295496, 6963675, 10168453, 15110572, 23969423, 37367790, 30092299, 12895415, 6073036, 4194357]
14541D194357J84808L68987j940043q24759k46208J9919J65283k96104O06999
14532B233239l80868j38942M40117m48388J10147J137J09733L5898J60584K6077
14522B148734J31199k19819J51358k82228L41793q7503r1430L45246o20L4191
14512B470921J20952o0349K316K59126j37410k70760J25267k441L16036k51208
14502B572450L798O5414K19891R9052J98303m70987K10103K6196m0484J46444
14492C030180J40031j32522R0205q089M6681J27836q6529J6485J38386J06826
14482C469490j19553J02793j63858P8342L86838k81676L55153m31957K70573K19792
14472C885937M9387q7756J67671p9897J34151k44324L60226o6145k9342P7934
$$ y = [4194357, 4379165, 4748152, 2808109, 1983350, 1737142, 1757061, 1922344, 1626240, 2233239, 1852371, 1713429, 2153546, 1705158, 1815305, 1816442, 1926175, 1962073, 2122657, 2148734, 2279933, 2060114, 2211472, 1929244, 2271037, 2183534, 2092104, 2437350, 2436730, 2470921, 2591873, 2531524, 2533840, 2792966, 2655556, 2384796, 2510063, 2507622, 2823658, 2572450, 2576248, 2641662, 2861553, 2960605, 3158908, 2687921, 2898024, 2924220, 2883736, 3030180, 3170211, 3037689, 3127894, 3119805, 3166486, 3294322, 3207793, 3224278, 3362664, 3469490, 3349937, 3452730, 3288872, 3367214, 3754052, 3472376, 3827529, 3395572, 3666145, 3885937, 3935324, 3847568, 4015239, 3935342, 4069493, 3825169, 4185395, 4119250, 4089908, 4167842]
14462D167842l8326J80533j81854L29663l98515P14710l34143J77002L43060J80361
14452E140333O5073m29964j39163P86516m43334j842J89151J08138q6843K26150
14442E414215M0402Q8693m2612K58855j96861J57022j1789J81038L09781k48131
14432E950613m6990N27256l41986M36008j20553J09126K46418K8945k1105J89584
14422F957316K19166L30751r884m9412j88972J59038K12507K03946J62753r7519
14412G899690N26339k87290M38065l33878J11793M39775K85906K97889k56709
14403I121580M50715K2072L8152K50858k38986L98246O3245K68583J21763K14666
14393A0710894J78694K56254J74770r1457L32381J85436k32693M23061O01940
$$ y = [4167842, 4129516, 4310049, 4128195, 4457858, 4059343, 4774053, 4439910, 4616912, 4959972, 5140333, 5205406, 4775442, 4636279, 5422795, 4979461, 4977619, 5166770, 5274908, 5188065, 5414215, 5454617, 5543310, 5500698, 5759553, 5562692, 5719714, 5707925, 5888963, 6198744, 5950613, 5903623, 6430879, 6088893, 6524901, 6404348, 6513474, 6759892, 6788837, 6767732, 6957316, 7176482, 7507233, 7497349, 7447937, 7258965, 7418003, 7630510, 7834456, 7997209, 7899690, 8426029, 8138739, 8576804, 8242926, 8354719, 8794494, 9080400, 9378289, 9121580, 9572295, 9594367, 9632519, 9883377, 9644391, 10042637, 10105882, 10374465, 10496228, 10710894, 10889588, 11145842, 11320612, 11229155, 11561536, 11746972, 11514279, 11937340, 12539280]
14384A2539280M17579L89450l353n9636M85533j33587P91302k2911R4594N05870
14374A5004121l351L58160K44906O98204K00391M04348J54645O53591J24712O65704
14364A8505431M13852J29426L55205K79126J91983O70044P65326J46040O52410
14355B2108843N02021M35746J065420K04395K38084Q63211P61611N52437O24447
14346B7356215Q54621N03471J090293P76736Q47886J008665O98007R97475P26046
14337C4859415J094179R77009J091207J340336J383603Q50716J689906J659082
14329D4945453R07583J482546J514552J638264J752450K007703J723929K102552
14321E8075032K070045K040387K068784K301445K581631K427576K502687K969753
$$ y = [12539280, 12956859, 13346309, 13342956, 13283320, 13768853, 13635266, 14426568, 14403657, 14498251, 15004121, 15000770, 15358930, 15603836, 16302040, 16502431, 16906779, 17061424, 17715015, 17839727, 18505431, 18919283, 19048709, 19403914, 19683040, 19875023, 20545067, 21310393, 21456433, 22108843, 22610864, 23046610, 24112030, 24316425, 24554509, 25417720, 26179331, 26731768, 27356215, 28210836, 28714307, 29804600, 30581336, 31429222, 32437887, 33135894, 34133369, 34859415, 35953594, 36930603, 38021810, 39362146, 40745749, 41596465, 43286371, 44945453, 45853036, 47335582, 48850134, 50488398, 52240848, 54248551, 55972480, 58075032, 60145077, 62185464, 64254248, 66555693, 69137324, 71564900, 74067587, 77037340]
14313G7037340L369386L276277L633792L626382L422192M310373M325407M478750
14305A07479899M691178N223642N243201N962306N899968O549941P074249P005256
14297A55129640P964140Q250802Q819812R190171R724426J0369765J0811404J1538446
14289B31798606J2199253J2528698J3307491J3643612J4250386J4737593J5013835
14282C27479474J5288087J5289177J5091486J4769449J4353994J2967545J1436771
14275D26675983Q461658L154477m12872P13081K210172P75511j631217m175980
14267D35770813n488719o777776r305614j2064411j3825951j4912392j6000579
14260C57395371j6190931j6258327j5546997j5670206j4876906j4529611j3727844
$$ y = [77037340, 80406726, 83683003, 87316795, 90943177, 94365369, 98675742, 103001149, 107479899, 112171077, 117394719, 122637920, 128600226, 134500194, 141050135, 148124384, 155129640, 163093780, 171344582, 180164394, 189354565, 199078991, 209448756, 220260160, 231798606, 243997859, 256526557, 269834048, 283477660, 297728046, 312465639, 327479474, 342767561, 358056738, 373148224, 387917673, 402271667, 415239212, 426675983, 435137641, 438292118, 437879246, 438592327, 440802499, 441578010, 439946793, 435770813, 430282094, 423504318, 414198704, 402134293, 388308342, 373395950, 357395371, 341204440, 324946113, 309399116, 293728910, 278852004, 264322393, 250594549]
14253B50594549j3095544j2715967j1096197j0579335j0667525r880841r376521
14246A73182619q665546q100773p333536p421015o681765o349005o292138n367705
14238A16971136n131566m955798m750774m854483l880162l862867l734682l440801
14230H2360003l084261l439968k908663k738989l036780k557545j860904k588103
14222F0144790j739918k243617j662535j872151k013483j443509k001199j280742
14214D5887636r81313j457971j499892j240542j532321r91078r32472p37072j212810
14205C5302165j025533q05838j283039n36818p19272j085911m81941j071376n99310
14196B7693127q81887m59995p29514o58973m76578p51974n08045o28133l35558
$$ y = [250594549, 237499005, 224783038, 213686841, 203107506, 192439981, 182559140, 173182619, 164517073, 156416300, 149082764, 141661749, 134979984, 128630979, 122338841, 116971136, 111839570, 106883772, 102132998, 97278515, 93398353, 89535486, 85800804, 82360003, 79275742, 75835774, 72927111, 70188122, 67151342, 64593797, 62732893, 60144790, 58404872, 56161255, 54498720, 52626569, 50613086, 49169577, 47168378, 45887636, 44906323, 43448352, 41948460, 40707918, 39175597, 38184519, 37252047, 36514975, 35302165, 34276632, 33470794, 32187755, 31650937, 30931665, 29845754, 29363813, 28292437, 27693127, 26811240, 26351245, 25621731, 24962758, 24486180, 23734206, 23226161, 22598028, 22262470]
14187B2262470o22979m18526l06372p88638m44290j62778n26123o45770m0390
14178A8306604l19728l60924p85092j52123n7749n27277j99900k93385l52105
14169A5258321l83615N9987p30424j71750k73789k27951l78458O9977k04732m14298
14159A2603268j37952k52939j79692j76547Q9704o88425j05821k23816m49782
14150A0477998J00751j54342J55777m22706j58524l36485J30466l20563q4908
14141I387464l22311r1208n9334r9201k09508j72688J54460k41877J37329k11818
14131H271308m67174k78422L95202k27693j19636Q0587q8442l12091p0274O8656
14121G252021n15742K35919j73087j25250k1514j94258O0882k63317L40747k19228
$$ y = [22262470, 21639491, 21220965, 20914593, 20125955, 19681665, 19518887, 18992764, 18346994, 18306604, 17986876, 17625952, 16840860, 16688737, 16630988, 16103711, 15903811, 15610426, 15258321, 14874706, 14934693, 14204269, 14032519, 13758730, 13530779, 13152321, 13222298, 13017566, 12603268, 12465316, 12212377, 12032685, 11856138, 11945842, 11257417, 11151596, 10927780, 10477998, 10578749, 10424407, 10580184, 10157478, 9998954, 9662469, 9792935, 9472372, 9387464, 9065153, 8973945, 8914611, 8815410, 8605902, 8433214, 8587674, 8345797, 8483126, 8271308, 7804134, 7525712, 7920914, 7693221, 7573585, 7654172, 7565730, 7253639, 7183365, 7252021, 6736279, 6972198, 6799111, 6673861, 6652347, 6458089, 6518971, 6255654, 6596401, 6377173]
14111F377173l0707J0131p76443n432L069N479M9847J94665l99361k21448K22907
14100E429880l16808Q9202L31219l02830j68245J85444k21466j53989J56840l51207
14090D678040K46315k42022j10372k19004J50865k33096Q7606l2418K5964j85929
14080D165949J73145N0663l37725L45367l52236J99318k80235l23581M13661j48522
14070C905804j4181j71620M58049n99903K68534q5436k1909q7362j64937K84380
14060C771419j69278j53708j20921l4627j20942R636q9431K39328m2111j29055
14050C160310j39371R6333j75815L39149k94811k9715K46860J1904l35815m6611
14040B832418p6023K98383m16800J36545k29925k14748N58918L9909n0131l9663
$$ y = [6377173, 6346466, 6356597, 5580154, 5574722, 5577791, 5583270, 5633117, 5827782, 5428421, 5206973, 5429880, 5113072, 5202274, 5533493, 5230663, 5062418, 5247862, 5026396, 4872407, 5029247, 4678040, 4924355, 4682333, 4571961, 4352957, 4503822, 4270726, 4358332, 4325914, 4351878, 4165949, 4339094, 4389757, 4052032, 4397399, 4045163, 4244481, 3964246, 3640665, 4054326, 3905804, 3891623, 3720003, 4178052, 3578149, 3846683, 3761247, 3739338, 3651976, 3487039, 3771419, 3602141, 3448433, 3327512, 3292885, 3171943, 3181579, 3092148, 3331476, 3289365, 3160310, 3020939, 3117272, 2941457, 3280606, 2985795, 2956080, 3202940, 3214844, 2879029, 2832418, 2756395, 3054778, 2637978, 2774523, 2544598, 2329850, 2888768, 2928677, 2878546, 2838883]
14030B838883J05436p3793j81028K46183k08402l13342j6325J33576j73291J61046
14020B518943j2736J16048j17312l39701J18004m7208k41448M60033l03099j15939
14010B035585J21958J00457k90795N3918K26267J6920l16098l26632L93115k28096
14000A786599L96381l83722L808J03672K99449k64759K17124m68468K71470N72166
13990B533720R22504K784048L222253P710550J4964495M332993j7220114q688367
13982A0562082l949153j861072q90305j98545o22162j70929p040r7816n98932
13973B166128M61089m14722l01426M60846l72961N5288k18642N14650n8511m42392
13963A849347K63985k39329J29332j93080m8790L6666j14827K9284N6965J50092
$$ y = [2838883, 2944319, 2870526, 2689498, 2935681, 2727279, 2413937, 2397612, 2531188, 2357897, 2518943, 2506207, 2622255, 2504943, 2165242, 2283246, 2236038, 1994590, 2454623, 2151524, 2035585, 2157543, 2258000, 1967205, 2021123, 2247390, 2264310, 1948212, 1621580, 2014695, 1786599, 2182980, 1799258, 1803066, 1906738, 2206187, 1941428, 2158552, 1690084, 1961554, 2533720, 3456224, 6240272, 9462525, 17173075, 32137570, 36470563, 19250449, 10562082, 6612929, 4751857, 3861552, 3663007, 3040845, 2869916, 2862876, 2765060, 2166128, 2627217, 2212495, 1911069, 2371915, 1998954, 2054242, 1835600, 2350250, 2291739, 1849347, 2113332, 1874003, 2003335, 1810255, 1761465, 1798131, 1683304, 1712588, 1769553, 1919645]
13953A919645j49001K9811k42640M32554l01740q9850j76787J36051J90592o0103
13943A688532j77941l0795L7936J34398j85620M2668j74444k9128L73624k73844
13933A405386L7448J35987p2565N5720J34386j42665j39508Q5058L5898l21119
13923A214026J20630j3990J42057j63425M8360M0809j86356J37269J49358r7102
13913A391636Q4332k66868L4961r1669L82129l12493m4516K7612J76971q2028
13903A300067l42083L08559j47746K58717j21905j5700J9764K23520l43069q509
13893A131615L1201J98031L6593k38138l51924L22192P577Q5224j86526L3579
13883A069424J23731j91005J38212L7940K82926n08935Q5952j11662J19406j57101
$$ y = [1919645, 1770644, 1800455, 1557815, 1990369, 1688629, 1598779, 1421992, 1558043, 1748635, 1688532, 1510591, 1479796, 1517732, 1652130, 1466510, 1509178, 1334734, 1305606, 1679230, 1405386, 1442834, 1578821, 1506256, 1561976, 1696362, 1553697, 1414189, 1499247, 1535145, 1214026, 1334656, 1320666, 1462723, 1299298, 1347658, 1388467, 1202111, 1339380, 1488738, 1391636, 1475968, 1209100, 1244061, 1152392, 1534521, 1222028, 1177512, 1205124, 1382095, 1300067, 957984, 1266543, 1118797, 1377514, 1255609, 1239909, 1259673, 1483193, 1140124, 1131615, 1162816, 1360847, 1397440, 1159302, 807378, 1129570, 1137147, 1222371, 1035845, 1069424, 1193155, 1002150, 1140362, 1178302, 1461228, 952293, 1038245, 926583, 1045989, 888888]
13873H88888L12883l79879K66364n3770j67591K4146m1839L77994k41638k08343
13863G77215K07749L01808l98642K19734k05936l2545K17143k28999K54345p3513
13853A038359N5494m29047K60581l6598J79671m6038J06989j57864j28913l9120
13843H03514J9836K75502l86176J20379M50316k19065m4649p2441m3086p7014
13833H27116m6085K17273n0350j70014J7243n5284Q6954k03756K70571K06501
13823A100169k47333K3495n9483C18107N64230J02099D77528M32087J7246O7320
13813I94181m80745j6061J09896j49467K27941q0491j18356j03296K38562O8065
13803F90229j86099J32560r198P475j00220J18164j34357P7734K24369J80155
$$ y = [888888, 1201771, 821892, 1088256, 1034486, 866895, 891041, 849202, 1227196, 985558, 777215, 984964, 1286772, 888130, 1107864, 901928, 869383, 1086526, 857527, 1111872, 1038359, 1093853, 664806, 925387, 888789, 1068460, 1022422, 1129411, 971547, 842634, 803514, 823350, 1098852, 712676, 833055, 1283371, 1064306, 1019657, 947216, 904130, 827116, 781031, 998304, 947954, 777940, 795183, 739899, 826853, 623097, 893668, 1100169, 852836, 876331, 816848, 318107, 882337, 984436, 477528, 909615, 926861, 994181, 513436, 497375, 607271, 457804, 685745, 605254, 486898, 383602, 622164, 690229, 504130, 636690, 627492, 634967, 534747, 652911, 518554, 596288, 820657, 1000812]
13793A000812o6891j41725B73375L39093K42881l02819j38061O17634k85353K56260
13783A003010k56153O9161o5744k97717J42128J48416K53785m35587m9585q5555
13773D26159J69629j42780N8229J82741Q8912q1009k3480Q4365k52513j90541
13763C19712N79952C03806H1700M38734K30485m7044r5363J54482m784j12573
13753F45637J78646k09901B79385K5796K11817j26941J27946l6432K15139J446
13743F98156M4289j22398l0626M07288m24822J22681j68534J9458J17521o3383
13733E99630j35998K66144l7971k60940j43419J90871j6719q1937R2272K49041
13723G20974C01930p8273J83643q7610J003L84261j14743r9015p2296M57750B25984
$$ y = [1000812, 933921, 792196, 273375, 612468, 855349, 552530, 414469, 1032103, 746750, 1003010, 746857, 816018, 750274, 452557, 594685, 743101, 996886, 561299, 511714, 426159, 595788, 453008, 511237, 693978, 782890, 701881, 678401, 762766, 510253, 319712, 899664, 303806, 81700, 520434, 750919, 703875, 608512, 762994, 758210, 645637, 824283, 614382, 279385, 305181, 516998, 390057, 518003, 481571, 696710, 698156, 742445, 620047, 589421, 996709, 571887, 694568, 526034, 545492, 663013, 599630, 463632, 729776, 691805, 430865, 287446, 478317, 461598, 379661, 471933, 720974, 301930, 223657, 407300, 319690, 320693, 704954, 590211, 491196, 418900, 876650, 225984]
13711E66606j44745J15969M7782A26619N45506k72577J9399K61584B88132K83652
13701E71784q9685j20350A13625K40308K41035j66284M5476J37325B37504K75608
13691E13112m7448j08782R9132A71381K4055K68315j0460B00203L44605j36190
13681D08618J13393Q0157P3576B91078L22566m7951H155M13356L6149j46381K53405
13670E64684k02949R775r3327K32469A98956K61249j58769Q2491K46966G3532
13659E38539k41671O952j49433O79170l24996D5942M97398j65638B665L48864
13649C51529J98043j04902L6391R8681A65545K39692j69203J44574A50663L38881
13639D89544o5467F2596J41670K32269n8270J24760A74977J38946L6429O2248
$$ y = [566606, 421861, 537830, 585612, 126619, 672125, 399548, 418947, 680531, 288132, 571784, 482099, 361749, 113625, 353933, 594968, 428684, 474160, 611485, 237504, 513112, 465664, 356882, 456014, 171381, 195436, 463751, 453291, 200203, 544808, 408618, 522011, 602168, 675744, 291078, 613644, 565693, 8155, 421511, 457660, 311279, 564684, 361735, 371510, 278183, 510652, 198956, 460205, 301436, 383927, 630893, 73532, 538539, 296868, 303820, 154387, 833557, 508561, 45942, 543340, 377702, 2665, 351529, 549572, 444670, 481061, 579742, 165545, 405237, 236034, 380608, 150663, 489544, 424077, 62596, 204266, 436535, 378265, 503025, 174977, 313923, 350352, 412600]
13629D12600J58199j31853Q1242k03025P0226A65116J53938J66928B07433N8749
13619B66182K0445j30999L62508B31682K53678j72335L01229r8973M5012o1342
13609D98951j40104j34084O8124K84316I6467J14482J41492J04449j44803A03807
13598D61729B06762J25074j40285J07404J08951A86830N3416a2088C27286o4987
13588B62299j06997J10183J27291H1932N2576J60632K0245J00164A63241k5522
13578A37719N73784C46264j9665j23344L50148o1119q3657P0765J44249a73F00173
13566A02627Q9454J88278N4017I9443K21162m0467I6138J55797K41371j21002
13556C72304J00884O1214K6702k61347I8052K26785b8551A95328b0542C37091
$$ y = [412600, 570799, 438946, 520188, 317163, 387389, 165116, 319054, 485982, 207433, 266182, 286627, 155628, 518136, 231682, 485360, 313025, 614254, 515281, 560293, 498951, 358847, 224763, 292887, 577203, 96467, 210949, 352441, 456890, 312087, 103807, 461729, 206762, 331836, 191551, 298955, 407906, 186830, 240246, -12088, 327286, 262299, 155302, 265485, 392776, 81932, 134508, 295140, 315385, 415549, 163241, 137719, 711503, 346264, 326599, 203255, 553403, 492284, 408627, 479392, 623641, -173, 600173, 102627, 192081, 380359, 434376, 99443, 320605, 280138, 96138, 251935, 493306, 372304, 473188, 534402, 561104, 299757, 98052, 324837, -28551, 195328, -20542, 337091]
13545B85672o3025J93843A97473J77740j20359K54442B21853b5162E29640B12854
13534A32476K77238N0250A22545J82814q5023j3794q3474b6522C68307A19266
13523C05080M45759E0348b46052B2425K42435J02994A12375k6451K47280j10806
13513B22398e5460C04441r1010J26813L21752g5184C08323k1373H332M59879B33588
13501E51601E7099Q6138J93814N2217h5017J7213F05170B19554q8420D1653J26427
13490A68080a40697E37709H5979M35906R1662B31595L5583h1047q0926D34379
13479A4243F810O93229A6738L78184L984j95798B3143K9338M9789O0611A2802
13467C04903m4689a9434B85744p0565C7510K63854r6593G9975K83150p9025A30205
$$ y = [285672, 222647, 416490, 197473, 375213, 254854, 509296, 221853, -25162, 529640, 212854, 132476, 409714, 459964, 122545, 305359, 220336, 206542, 123068, -26522, 368307, 119266, 305080, 750839, 50348, -246052, 22425, 264860, 367854, 112375, 85924, 333204, 222398, -55460, 304441, 213431, 340244, 661996, -75184, 308323, 286950, 8332, 468211, 233588, 551601, 57099, 143237, 337051, 389268, -85017, -67804, 605170, 219554, 131134, 41653, 168080, -140697, 537709, 85979, 521885, 613547, 231595, 267178, -81047, -161973, 434379, 14243, 6810, 700039, 16738, 394922, 398906, 203108, 23143, 52481, 102270, 162881, 12802, 304903, 260214, -19434, 285744, 215179, 37510, 301364, 204771, 79975, 363125, 284100, 130205]
13455E01601A61896j2671R1599b9409G9924c44453B48555L8248A38027L5562B5912
13443a805A28130L9288J0541J16795g0029B41671M7021D7824J32298J04322R0509
13432C74953j60240f0080B34207j0211l1220m3945n9363b17054A36496i552A30881
13420B09727R3189A12791J6276E7742q541d9525C4733O081b9290A97001M3284
13409B40285G0626K15295F9483K50321G5605b40237B68179L8462j12454a01792
13398A98698r0584B9567O0699J09302I2409a41549C82636J09056A17168J84072
13388C01240L6375J72285B36570R3753l5687N9220j02177b3194C68738n2825D2341
13376H0967K84075m640n8312P5546A30384b1051A15226K42069A48887J14157j26123
$$ y = [501601, 161896, 149225, 240824, -29409, 79924, -344453, 248555, 286803, 138027, 173589, 25912, -1805, 128130, 167418, 177959, 294754, -70029, 241671, 288692, 47824, 180122, 284444, 374953, 214713, -60080, 234207, 223996, 192776, 148831, 89468, -217054, 136496, -9552, 130881, 209727, 302916, 112791, 129067, 57742, 49201, -49525, 34733, 40814, -29290, 197001, 240285, 70626, 285921, 69483, 319804, 75605, -240237, 268179, 306641, 194187, -101792, 198698, 108114, 29567, 90266, 199568, 92409, -141549, 382636, 491692, 117168, 301240, 337615, 509900, 236570, 330323, 294636, 353856, 251679, -23194, 368738, 315913, 42341, 80967, 365042, 360402, 302090, 377636, 130384, -21051, 115226, 357295, 148887, 263044, 136921]
13365A36921N6054c1052B10033K40567A57194f6987B60189J72324a8116j16978
13355a35094C77756A29868a33753C38805j12687J44825F2249J50628d0381A51396
13344B98687F3972L76268r4334j08570Q9080D4570L56229A58508K21330p8611
13334C01227A31697l4679L46452J44008j87975A80807J67964j25621g3452B68719
13323D04096j00933A36139J60150a88921D0094a15039B85550C5464Q2761J09647
13313B27872Q9251O9468J3818C2973K23630J41458A23494N3786K3670B6485J43612
13302A70097o6883k459Q2461j5337k4511m6956G667M10868A47909b00335B09929
13290C85600H8747a46554j70131B46963I7690f6626a1636C66244I8990R5580o906
$$ y = [136921, 192975, -31052, 210033, 450600, 157194, -66987, 260189, 432513, -18116, -135094, 377756, 129868, -133753, 338805, 226118, 370943, 62249, 212877, -40381, 151396, 298687, 63972, 440240, 345906, 237336, 326416, 44570, 400799, 158508, 379838, 301227, 131697, 97018, 443470, 587478, 399503, 180807, 348771, 223150, -73452, 268719, 404096, 303163, 136139, 296289, -188921, 40094, -115039, 285550, 35464, 118225, 227872, 317123, 386591, 400409, 32973, 256603, 398061, 123494, 177280, 200950, 26485, 170097, 103214, 100755, 183216, 167879, 143368, 96412, 7667, 418535, 147909, -200335, 209929, 385600, 88747, -146554, -316685, 246963, 97690, -66626, -11636, 366244, 98990, 194570, 187664]
13279A87664J78620C8105K50820b09686A02675L1420g4812A6127d3289A763Q7118
13268H8881a5467A54339J72080j34959c7045B21625J7113r9125C7353a24772B49369
13256a00899B77068E3221J91788f3435B63110f3903D6400J9165N1083J775d8928
13244C07661b10088L8570B11974a7328k71190A06604l5241J89805j23388J62432
13234C00212A37790F3052c54322A38723e3014l3945B32102q0342C1258O3978C1259
13222a85948P4642e305C73970G4296J87115a21319A93815J3724a0464B9515M35898
13211D65413j48219l0567K3486d12132G8440M3833M0201l5522Q7786a0919H2826
13199B32589N1851J4928g4078l31933H2870Q3463J89781c3962m097A36804J1430
$$ y = [187664, 366284, 38105, 288925, -209686, 102675, 134095, -74812, 16127, -43289, 1763, 88881, -15467, 154339, 326419, 191460, -37045, 221625, 238738, 139613, 37353, -124772, 249369, -100899, 277068, 53221, 245009, -63435, 263110, -63903, 46400, 65565, 116648, 118423, -48928, 307661, -210088, -171518, 211974, -17328, -288518, 106604, 71363, 261168, 137780, 300212, 137790, 63052, -354322, 138723, -53014, -86959, 232102, 151760, 31258, 95236, 31259, -185948, -111306, -5305, 373970, 74296, 261411, -121319, 193815, 207539, -10464, 29515, 465413, 317194, 286627, 310113, -412132, 78440, 122273, 162474, 126952, 214738, -10919, 82826, 232589, 284440, 299368, -74078, -406011, 82870, 166333, 356114, -33962, -38059, 136804, 148234]
13188A48234C4980d2881j73853C515c71585A81277l0174L4413J16023B1969g80
13176h6977C9005a5018F4716a45935A37465L49348H0459K76167A06844m6552P2324
13165A32616h3563n8382m9963g5799C30825a34660G6674d1662B43805K39293A05668
13153A52866d8754A467a39906f3295A16450d5542J3455A31502E6956J05273D4232
13141a24240F7120J21177D2733i0821C3983a34570h272A23285e3448E4620K20007
13130B74627r0934b8759D1385r002j2214P5972J4623K22925j49778d38482A85327
13118i0440A06769d84921A45220B9609J65172e9596C86614a77179B48022j19827
13108A28195e5264K7101l34887C24319b5743A05106c2836A0646J71689N276E4356
$$ y = [148234, 34980, -42881, -216734, 3515, -371585, 181277, 151103, 185516, 301539, 21969, -780, -86977, 39005, -15018, 64716, -145935, 137465, 486813, 80459, 356626, 106844, 60292, 132616, -83563, -141945, -191908, -75799, 330825, -134660, 76674, -41662, 243805, 483098, 105668, 152866, -48754, 1467, -139906, -63295, 116450, -45542, -32087, 131502, 56956, 162229, 44232, -124240, 67120, 188297, 42733, -90821, 33983, -134570, -8272, 123285, -53448, 54620, 274627, 183693, -28759, 41385, 32383, 20169, 96141, 110764, 333689, 183911, -438482, 185327, -90440, 106769, -484921, 145220, 29609, 194781, -59596, 386614, -177179, 248022, 128195, -55264, -28163, -363050, 324319, -25743, 105106, -32836, 10646, 182335, 187611, 54356]
13096g1265q7823m6054C35560L987M0863j07724g9767F6279J19162a0223l6587
13085d6810a9731q6850a9822j68597C8158O3078f0849B6834d5203B12105q0264
13074A31841a47844p5328g4515B08957I8410n400J57265A07687O7225J87675b56795
13062A29741c6527E1225K3617K5481e430j3899k80988B4288M4024J2943M41130
13051E22385A04186m1147L3393a56398M2532C67367B2862h8682C51723c6010j28445
13040a64455B85589I181J40487a11042G7161A5258J04339k2185K08017a48321
13029i7795k7048M9405A58263o852Q2457i8883A12757J35294a25232G6673e770
13017a36A47606n7305H917K12200n1288p8061J83085F5458J58043c22696A91962
$$ y = [-71265, -159088, -205142, 335560, 339547, 380410, 272686, -79767, 66279, 185441, -10223, -46810, -19731, -106581, -19822, -188419, 38158, 101236, -60849, 26834, -45203, 212105, 131841, -147844, -223172, -74515, 208957, 98410, 93010, 250275, 107687, 174912, 362587, -256795, 129741, -36527, 51225, 74842, 100323, -5430, -19329, -300317, 24288, 68312, 81255, 522385, 104186, 63039, 96432, -156398, -113866, 367367, 22862, -88682, 351723, -36010, -164455, 285589, 9181, 149668, -111042, 77161, 15258, 119597, 97412, 305429, -148321, -97795, -124843, -75438, 158263, 151411, 233868, -98883, 112757, 248051, -125232, 76673, -5770, -136, 147606, 90301, 8917, 221117, 169829, 91768, 274853, 65458, 223501, -322696, 191962]
13005A19455c6107o0006B99879a8011j17406L4868B33209n6499i5481k93108B34761
12993A1340h3354L7136r4463p544A39492l9554a73694A90259l2884k1204J41557
12982B77728j20768b31001J02313a5226l5775p0385C50640a88874A1478J56889
12972A68367m3193a14163A31695b92481B53647f1572j71655g8375l3535D12410
12961d81476A49651d0329A77291h7393B49691C440K09144b01384r1584M733g3694
12949C5144L2162e3263K0684F9346C031h5040F7071A40a18584l9789B93415A397
12936C4110b09789G5740p765A5100a9665F0366h7240A97458d512E9921g3825B31589
12923a00267j35575k349B9787a40399C3309K76047A15386K01545p3734q9463a20098
$$ y = [119455, -36107, -96113, 299879, -18011, -135417, -100549, 233209, 176710, -95481, -388589, 234761, 11340, -83354, -46218, -140681, -148225, 139492, 99938, -173694, 190259, 157375, 136171, 277728, 156960, -231001, -128688, -15226, -51001, -121386, 350640, -188874, 11478, 168367, 125174, -114163, 131695, -292481, 253647, -61572, -233227, -78375, -111910, 412410, -481476, 149651, -40329, 177291, -87393, 249691, 3440, 212584, -201384, -292968, -288235, -73694, 35144, 67306, -53263, -32579, 69346, 3031, -85040, 67071, 140, -118584, -158373, 293415, 1397, 34110, -209789, 75740, 67975, 15100, -19665, 60366, -87240, 197458, -4512, 59921, -73825, 231589, -100267, -235842, -238191, 29787, -140399, 33309, 309356, 115386, 316931, 243197, 153734, -120098]
12911a48523E7026e9963K5315C8905a2172A62813a67695A01932C2897j5191J92594
12900B10300E067a47552q4289j38033B01460a43594j3804H2759h0390j72622A05269
12888a18016M5765q4480g27l4605B77461g5971a4427j70201h5444A37989K0830
12877A58819a38247A4998e0514o5059N7140J0995a8147m7210B0518J53760b97763
12865a75292i175q8984A19971Q276C9884a76730B13541k6853m4131a4279A92244
12853b18616H3068Q6557o0151J45150n2160b29117a0191A16717a05711q4527N538
12842a84700G9065C3606g8165D79417E6676P0126f9662o8411a3819B8141a93531
12830B9196R9765K70767E3358j6838b57314A39436K68662a73740A71150Q2878
$$ y = [-148523, 57026, -59963, -34648, 38905, -12172, 162813, -167695, 101932, 32897, 17706, 210300, 5067, -147552, -231841, -369874, 201460, -143594, -157398, 82759, -80390, -253012, 105269, -118016, -72251, -156731, -727, -35332, 277461, -75971, -14427, -184628, -85444, 137989, 158819, -138247, 14998, -50514, -115573, -58433, -47438, -18147, -65357, 20518, 174278, -297763, -175292, -9175, -98159, 119971, 128247, 39884, -176730, 213541, 186688, 142557, -14279, 192244, -218616, 83068, 169625, 109474, 254624, 202464, -229117, -10191, 116717, -105711, -190238, -184700, 79065, 33606, -78165, 479417, 56676, 126802, -69662, -138073, -13819, 28141, -193531, 29196, 128961, 399728, 53358, 36520, -257314, 139436, 408098, -173740, 171150, 254028]
12820B54028M5216I2481L5686a13315A01751j7669g3964a2577B85437J50438A43931
12808b23229O5954G9057k3433J36827b30681D486a42j63000c808I7542Q375a84528
12795C47154b75598A3523c971j15407A61348E0650c45519N1042f9736l85793A92274
12783B15186B9536J58547J9696q8413a11373A48668A2822P4861c12197E6970B4920
12771B9817R8808f7731n5345B99673B8194a22424L1099o5558r8120J20544k6534
12760a60993q190c083E5393K28760b60917j52003E2803a2449r0414j73824e2433
12748h0322k54102I3790B0988L4840J91897a00607k66062D79369d4805A24966
12737E998a49861B42559n3667M647E9495a22445A39037h5498m4385A22345d0034
$$ y = [254028, 299244, 92481, 128167, -113315, 101751, 84082, -73964, -12577, 285437, 435875, 143931, -223229, -157275, 79057, 55624, 192451, -230681, 4486, -142, -163142, -3808, 97542, 105917, -184528, 347154, -275598, 13523, -3971, -119378, 161348, 50650, -345519, -294477, -69736, -455529, 192274, 215186, 29536, 188083, 207779, 119366, -111373, 148668, 12822, 87683, -312197, 56970, 24920, 29817, 128625, -67731, -123076, 299673, 28194, -122424, -91325, -156883, -255003, -134459, -160993, -169183, -3083, 55393, 284153, -260917, -412920, 52803, -12449, -102863, -276687, -52433, -80322, -334424, 93790, 20988, 55828, 247725, -100607, -366669, 479369, -44805, 124966, 5998, -149861, 242559, 188892, 193539, 59495, -122445, 139037, -85498, -129883, 122345, -40034]
12725G1140j9179i1841J4604A92422F309i0143B09447a70068j04696c863n29966
12714e33829A05009a2003k6797j51202B42529n6041a04383L8598l3248A5153M2717
12703E7870k13K05099p3772B1346a41163l2100A8273d5845o0336n3099C68963
12691A59229a56412G93R8975A8955L05316j18660k4910L8393m5801O2766J07058
12680C43117C7774b79438B68771a5279j8092F589K41164E3034b8711B39901a25384
12668a08312A5508a181l21650A4863a13607B05910L6903b27289A75896a51966
12657g5294H2880b42934A2424h7872A00692f6626n1051j95211B38778A80a95102
12645g0766B0926L48382a78691b6937k9612D41365A68781i2491A58406b73786
$$ y = [71140, 51961, -91841, -77237, 192422, 6309, -90143, 209447, -170068, -274764, -3863, -533829, 105009, -12003, -38800, -190002, 242529, 186488, -104383, -65785, -99033, 15153, 57870, 57657, 262756, 188984, 21346, -141163, -173263, 18273, -45845, -106181, -159280, 368963, 159229, -156412, 793, 99768, 18955, 324271, 205611, 180701, 219094, 173293, 236059, 343117, 37774, -279438, 268771, -15279, -33371, 6589, 247753, 53034, -28711, 239901, -125384, -108312, 15508, -1181, -322831, 14863, -113607, 205910, 242813, -227289, 175896, -151966, -75294, 82880, -242934, 12424, -87872, 100692, -66626, -117677, -312888, 238778, 180, -195102, -70766, 20926, 369308, -178691, -26937, -56549, 441365, 168781, -92491, 158406, -273786]
12634a55185E2997L7367k3459R32K4745a29765C39622h1377k7935a8611k46408
12623b65019g8873j58599A91567a39694i939n8592k4458A20669J2989a09492J7277
12612i2215D8528b21868B3006b39584J03688c0011A79030j105C908K83554J53217
12601D40679E4904b5327l92569F6537K28595A6541d4383a9899F1784i2527L2789
12590e9738j71106A69763K8871c520j12445A59522a40888M4125p8611N78e2653
12578c00022a23910b0505j6421A09526M4222L46867a25242C18050c91084J58374
12568b32710d3025j24446P7193D08057r3383E2364d4033q989G9737J22406b96110
12556A57307h2279j67034g9063j6990j49090a2642k50244F5766J31769q4300a5744
$$ y = [-155185, 52997, 90364, 66905, 67837, 92582, -129765, 339622, -81377, -109312, -18611, -265019, -78873, -237472, 191567, -139694, -9939, -68531, -92989, 120669, 133658, -109492, -92215, 48528, -221868, 23006, -239584, -135896, -30011, 179030, 177925, 3908, 287462, 440679, 54904, -25327, -417896, 66537, 295132, 16541, -44383, -19899, 61784, -92527, -59738, -230844, 169763, 198634, -3520, -115965, 159522, -140888, -96763, -175374, -174796, -52653, -300022, -123910, -20505, -36926, 109526, 153748, 500615, -125242, 318050, -391084, -232710, -43025, -167471, -90278, 408057, 314674, 52364, -44033, -53022, 79737, 202143, -296110, 157307, -82279, -249313, -79063, -96053, -245143, -12642, -262886, 65766, 197535, 113235, -15744]
12544b36551e5246j77872f3189A07030A2901h1221l10103H7989C7565b94546H7359
12532b99702F7221i368j01446d4443A44062J27157A34182h1063A08965f3736B1844
12520a78043B03137a08925a4936G119a2548E4144K5681b20912D3962O9049n5247
12509E7764K13130b8558B3959L20628a10258A87460J9403q413k706a39333A60181
12497h7365A39487K9730J346q3725N9672a33010H7837b01011g4302A54943i9382
12485a04375j4014d1596B4619J07076a081A4748P8010m1691J01854J5424C6315
12473c00832A30242K7227A7040g387o5862F3366G389c3326B37385n0640b2757
12461i8424M6703k09283e0978A94449q6132b40149c2544j3591j11745B65416a62893
$$ y = [-236551, -55246, -233118, -63189, 107030, 12901, -81221, -391324, 87989, 37565, -294546, 87359, -299702, 67221, -9368, -110814, -44443, 144062, 271219, 134182, -81063, 108965, -63736, 21844, -178043, 203137, -108925, -14936, 7119, -12548, 54144, 79825, -220912, 43962, 113011, 57764, 270894, -28558, 23959, 344587, -110258, 187460, 206863, 198450, 195744, -139333, 160181, -87365, 139487, 169217, 170563, 86838, 146510, -133010, 87837, -201011, -74302, 154943, -99382, -104375, -118389, -41596, 24619, 131695, -1081, 14748, 92758, 51067, 152921, 168345, 36315, -300832, 130242, 157469, 17040, -7387, -73249, 63366, 7389, -33326, 237385, 186745, -22757, -98424, -51721, -261004, -50978, 194449, 108317, -240149, -32544, -46135, -157880, 265416, -162893]
12449a10820D0778c059m4226L522B2023J05988b03025j7108b8222A30485o3478
12438F7007a9959k8780j12778B44799E9492M40681a2701F5849b6767m1115G7305
12426B39706o7690c22949a40819b2094I910b48824j7420C96068b39108e7192j83517
12415b40709A19162e838j75080a6475j33524A0813O275J22690c489B3878i4597
12403a57483B3168J39517o5011a83408G0818K06782a23347L2717I7934b62004
12392a41673L4919A44281e9761r2978f7739o5386G8260h3703L3647B03700b3399
12380i4222n0335A4810K60987a25748N3824o7669A86227B6607b57288A08937J59295
12369B68232B0610b69566a05384D22659b31353k6063i7212j51536D6363b57698
$$ y = [-110820, 40778, -3059, -47285, -43763, 22023, 128011, -203025, -220133, -28222, 130485, 67007, -19959, -48739, -161517, 244799, 59492, 500173, -12701, 65849, -26767, -67882, 77305, 239706, 172016, -322949, -140819, -22094, 9910, -248824, -266244, 396068, -239108, -57192, -240709, 119162, -5838, -180918, -16475, -149999, 10813, 17088, 139778, -3489, 23878, -94597, -157483, 23168, 162685, 97674, -183408, 70818, 277600, -123347, -90630, 97934, -262004, -141673, -106754, 144281, -59761, -152739, -67739, -133125, 78260, -83703, -50056, 203700, -23399, -94222, -144557, 14810, 275797, -125748, -71924, -139593, 186227, 26607, -257288, 108937, 268232, 20610, -269566, -105384, 422659, -231353, -257416, -97212, -248748, 46363, -257698]
12358b9561j71917C7811L11324A72670b21940e5819B22360j09359l1370b55212
12347A99856P9653n2695c934l77272D9401a17578q6311O5102D305K0834a20788
12335F3326b82849B81947B4257a34814B52670K7201K2205C3177j5249J05564k8074
12324I5418a31876b2806B55283A8293c970j34305H6270J28598c89n5039B12632
12312C08680g9448A768b26713d4325B77053A02820J39595k5138c13751J44357
12302a69394A32632K29096I3946G696J6129L79391G5329j266A5031a12782B30377
12290B0202a6490j54761b7374C5905a68589B67924o8834o4671P4765F6535a52633
12278A59797i2310D247J04094a9948D7130Q5533p328a0484A16468L06831h528
$$ y = [-29561, -201478, 37811, 349135, 172670, -221940, -55819, 222360, 113001, 81631, -255212, 199856, 279509, 226814, -3934, -381206, 49401, -117578, -203889, -138787, 4305, 25139, -120788, 63326, -282849, 281947, 24257, -134814, 252670, 279871, 302076, 33177, 17928, 123492, 95418, -131876, -22806, 255283, 18293, -3970, -138275, 86270, 214868, -389, -55428, 212632, 308680, -79448, 1768, -226713, -44325, 277053, 102820, 242415, 217277, -313751, -169394, 132632, 361728, 93946, 7696, 23825, 403216, 75329, 74063, 15031, -112782, 230377, 20202, -16490, -171251, -27374, 35905, -168589, 267924, 199090, 134419, 209184, 66535, -152633, 159797, -92310, 4247, 108341, -19948, 47130, 132663, 125335, -10484, 116468, 423299, -8528]
12266D09356D5099P9734J00423r9321C2179J90791a29393B6035j2301i2412E2546
12254A35757k0119N8642k2864J50978B3396K21419q8928J61948A38502J9778K59299
12243D17579A5877P2219m1706L08332a4067C3770i4817B28628A13774J94361a30240
12231b2377C20661B5581b39635F2340L08949g897A73651j7676b9648l908A00789
12219b04103A83658C0210K21405J96561j88016L924a07966B11371f8047C35820
12208A6682J76650I4570j4263M675P4021E0331J08956J15956M9222n8743H4709
12196G5984L64531n3094a18034E88393k46468H1820Q5757E8835k3439J10852A1374
12184C28756I758J28324k7038a9146A98560L1342e9168f286j129C76682A25286
$$ y = [409356, 45099, 124833, 225256, 125935, 32179, 222970, -129393, 26035, 13734, -92412, 52546, 135757, 115638, 174280, 151416, 302394, 23396, 244815, 155887, 317835, 138502, 158280, 417579, 15877, 88096, 46390, 354722, -14067, 33770, -94817, 228628, 113774, 308135, -130240, -22377, 320661, 25581, -239635, 62340, 371289, -7897, 173651, 155975, -29648, -33556, 100789, -204103, 183658, 30210, 251615, 448176, 260160, 264084, -107966, 211371, -68047, 335820, 16682, 193332, 94570, 80307, 84982, 159003, 50331, 159287, 275243, 324465, 265722, 84709, 75984, 440515, 387421, -118034, 588393, 341925, 81820, 167577, 58835, 35396, 146248, 11374, 328756, 9758, 138082, 111044, -19146, 198560, 229902, -59168, -6286, -7415, 376682, 125286]
12172A39242b05358a3941J785D08189L1607A69219A3521J53222J98331A02800
12161H3660D719K324J27395C7267e1784j9010B71073b01041A32330M9040b03634
12149C01019j15253c7972k18679G7502b2254G8626a52034B14001r8241h7697c7635
12137A02960J33633n6693e5139G1966N4457J19914B7946J75042m4421a9976A37679
12125A31484a27360K6905B37846a07003B26072J3689o6113b37287D17198E0369
12114B49408J08618a2455A52383k9124C4176G635J27443m318O4273b5398m5019
12103g0417A75965A9270J07943d44500A59745c629j10276j3363A71648D607J72964
12092A77571l2711j2703K30129g269A9419e1383q4861f2393A61382J3118p2842
$$ y = [139242, -205358, -13941, -12156, 408189, 439796, 169219, 13521, 166743, 365074, 102800, 83660, 4719, 7043, 134438, 37267, -51784, -70794, 271073, -201041, 132330, 181370, -203634, 301019, 185766, -37972, -256651, 77502, -22254, 78626, -152034, 214001, 115760, -87697, -37635, 102960, 236593, 179900, -55139, 71966, 126423, 246337, 27946, 202988, 158567, -19976, 137679, 131484, -127360, -100455, 237846, -107003, 226072, 239761, 173648, -237287, 417198, 50369, 249408, 358026, -12455, 152383, 123259, 34176, 7635, 135078, 130760, 195033, -25398, -70417, 175965, 19270, 127213, -444500, 159745, -3629, -113905, -127268, 171648, 4607, 177571, 144860, 132157, 362286, -7269, 19419, -51383, -136244, -62393, 161382, 174500, 101658]
12081A01658J32034H5128K68671m8701A22876f9689G0549J42488Q527n3439C8580
12069F0623f1889A58816n6199j6911l7033a09615e712q4389K7095A10520c9394
12057H6959K3871L05142H5179L5386l3077B8473J20638bo1189A06931j6545h1334
12044a12925o1232B3537a26610A87970a72771l2892A30579k6317f0339J0252B36940
12032e9208k2716n4094a822B93085I155M21699E558K8274P9861A4367c0137j966
12020c2103D5108b26214m9707C20982H0826K28288j03554L0908J70044A68477
12009G7999b55481G499G04a88719A47316b01253B84679a99133B23587a63115P947
11998a55168A15597a87072A20458g8721j34751c9605q6031A9038b75047A24651
$$ y = [101658, 233692, 85128, 353799, 305098, 122876, -69689, 70549, 213037, 221564, 168125, 38580, 60623, -61889, 158816, 102617, 85706, 48673, -109615, -5712, -90101, -63006, 110520, -39394, 86959, 110830, 415972, 85179, 120565, 87488, 28473, 149111, -2, -61191, 106931, 90386, -81334, -112925, -174157, 23537, -126610, 187970, -172771, -205663, 130579, 104262, -60339, -50087, 236940, -59208, -81924, -136018, -1822, 293085, 9155, 430854, 5558, 33832, 113693, 14367, -30137, -32103, 45108, -226214, -275921, 320982, 80826, 309114, 205560, 236468, 406512, 168477, 77999, -255481, 7499, 704, -188719, 147316, -201253, 284679, -199133, 223587, -163115, -155168, 115597, -187072, 120458, -78721, -213472, -39605, -125636, 19038, -275047, 124651]
11987D8973c9324D9825J17150c92110a65350C2225f134G8144C0580J43427L29430
11976E03437b11881A19227J01639J08109d30312a90023B66451H0104c10987f3579
11965d11832e6492B84410A527f3090B54041b53097G4285h5321G6908J05829j454
11954A81283c1911l04902g6815k6229F1786P5672a12961C25213c23353j09488
11944d32841R7559d6616k7102k48525B04855L22940B10108D8275a13317q5147
11934a98464j46856a31753j0842j24933g5486k0940G2173c0761j66484o6416E5412
11922E5562K4356K75643c2625o4785j67799j54473a86221G7638B4263b31318B0422
11910A8456b52745D1838d4272F0210a18181c9324I7918b27087a7565k88626A94861
$$ y = [48973, -39324, 49825, 166975, -392110, -165350, 32225, -6134, 78144, 30580, 174007, 503437, -211881, 119227, 220866, 328975, -430312, -190023, 266451, 80104, -310987, -63579, -411832, -56492, 284410, 1527, -63090, 254041, -253097, 74285, -85321, 76908, 182737, 181283, -31911, -336813, -76815, -103044, 61786, 137458, -112961, 325213, -323353, -432841, -335282, -46616, -73718, -322243, 204855, 527795, 210108, 48275, -113317, -198464, -345320, -131753, -142595, -267528, -75486, -96426, 72173, -30761, -197245, -263661, 55412, 55562, 79918, 355561, -32625, -97410, -265209, -419682, -186221, 77638, 24263, -231318, 20422, 18456, -252745, 41838, -44272, 60210, -118181, -39324, 97918, -227087, -17565, -306191, 194861]
11898A9622a1898j19558A12834b03442H3863c3556E9332b73j09692j9408j05221
11887b34594a6316I8622b030q5489E9416J0321l1394b38555L6239a00998l03318
11876d04316a80443f0970J9460D9675a4079j2483F3500M8241Q2756d317A19781
11864C41564c06350A47573b25239D9299g6200j09715N8996b9773H1885h9778j9046
11853a08824A75256e6166A42996a00982F7016a03580I3662a08328e2321j66793
11843b19114e3320B69221a20705k96453B04569f541j13212j1378D9074d5934j7730
11832f3664n0279j40511A7951d1114B96485e7584o442J7420q2942H1665d71601
11820f22k03452a9975o4985p1580d3492K1406j58766B89216a70330C3730a46346
$$ y = [19622, -11898, -131456, 112834, -203442, 83863, -33556, 59332, -273, -109965, -129373, -234594, -16316, 98622, -2030, -87519, 59416, 69737, 38343, -238555, -202316, -100998, -404316, -180443, -60970, -41510, 49675, -14079, -26562, 63500, 111741, 194497, -4317, 119781, 341564, -306350, 147573, -225239, 49299, -76200, -185915, -126919, -29773, 81885, -89778, -108824, 175256, -56166, 142996, -100982, 67016, -103580, 93662, -108328, -52321, -219114, -53320, 269221, -120705, -417158, 204569, -6541, -119753, -131131, 49074, -45934, -63664, -113943, -254454, 17951, -41114, 296485, -57584, -64026, -46606, -129548, 81665, -471601, -622, -204074, -19975, -84960, -156540, -43492, -22086, -180852, 289216, -170330, 33730, -146346]
11808A35366n0686m1129a94280b3139A14995J29251a08393k32427H6517K7070
11798A13587c34081D7270K1874a20851j5201j05550A05546a33928r6266A8186
11787a18913A51763A7879J25746e6263G6707L63293A3927J04992a1436N112r6858
11776a03182E6092J13175a41697C74506b92109b7960B37390C6425c68346G726
11765D2325J22550J72366d45410D9667k0477P023J15565m7032j9139b01946A37232
11753i0933j84178J31688L0694c7259A31147b09897A81435F5997a99746A31346
11742b93600a37651r4897A98200d7892A06347n600O4886l5874c3672j83424P3991
11731a43105D3145j3285K1045B1903d0237l07286j4195c8224j18615B82240r9172
$$ y = [135366, 84680, 43551, -194280, -23139, 114995, 244246, -108393, -340820, 86517, 113587, -334081, 47270, 69144, -120851, -136052, -241602, 105546, -133928, -230194, 18186, -118913, 151763, 17879, 143625, -56263, 76707, 440000, 13927, 118919, -11436, -6324, -103182, 56092, 169267, -141697, 374506, -292109, -27960, 237390, 36425, -368346, 7726, 42325, 164875, 337241, -445410, 49667, 29190, 36213, 151778, 104746, 85607, -201946, 137232, -90933, -275111, -143423, -112729, -37259, 131147, -209897, 181435, 65997, -199746, 131346, -293600, -137651, -232548, 198200, -47892, 106347, 100747, 165633, 129759, -33672, -217096, -143105, 43145, 29860, 50905, 21903, -40237, -347523, -361718, -38224, -156839, 282240, 183068]
11720A83068b4767j11617C04436E660K1307L3827a3681k94385J15216G4733b46891
11708h0172k25366g4984A04517N9193f4301r0928n8171C4206R5575i2646G2193
11696C63974C8714K0267b33533A96226f8577j02582p257B08406b8211G6183N1301
11685A27484a64148A4383N9103Q9705l434N7392c49723A41301J15464Q6789j42987
11674B00567a35685G3780d9041B16040m5308Q1A3747a64972K5748c851p338H1218
11661c52891a60329J4680M1983D5999b02514D6694J29275a93357A47562a0428
11650a16110a9209C1433R8305f2549F3150M3753K564J63570a82419G392R2368
11639I9760d6036l2175C71536A47156b45009F8356Q1234k5192j1662b0983n7379
$$ y = [183068, -24767, -136384, 304436, 5660, 26967, 60794, -13681, -308066, -192850, 74733, -246891, -80172, -305538, -74984, 104517, 163710, -64301, -155229, -213400, 34206, 129781, -92646, 72193, 363974, 38714, 58981, -233533, 196226, -68577, -171159, -178416, 208406, -28211, 76183, 127484, -164148, 14383, 73486, 163191, 159757, 217149, -349723, 141301, 256765, 343554, 200567, -135685, 73780, -49041, 216040, 170732, 170813, 13747, -164972, -139224, -3851, -11189, 81218, -352891, -160329, -145649, -103666, 45999, -202514, 46694, 175969, -193357, 147562, -10428, -116110, -19209, 31433, 129738, -62549, 63150, 106903, 109467, 273037, -182419, 7392, 99760, -46036, -78211, 371536, 147156, -245009, 68356, 149590, 124398, 112736, -20983, -78362]
11628g8362A78463J21949c2131C8147J36506a18122D675K21317c19754B4653b21211
11616a93595B18403F5719a45646j9615d7978o6902D7330O1648O6596M6420g9588
11604a85229f2989a9167C69447A62148a76765j0850A98214a2539B26383k3986
11594B02397A2663M0783b6488C0048h5955j08114k5082B4838a11294C8990b67977
11582F4966B3779R2473K17809j06370F5208J8686K2068J92238b42518a9956D7701
11570a55006F1558f5339G8961e8926j04874B5003A226f7088b2395A20767c7615
11558A89299F1956J60151a60033E57a50059O6110j40625a4420B88880d4926k4968
11547f9894q9476A0582R1419B4263M15815c26726C7697O6886d48558B3673a21238
$$ y = [-78362, 178463, 300412, -32131, 38147, 174653, -118122, 4675, 225992, -319754, 24653, -221211, -193595, 218403, 65719, -145646, -165261, -47978, -114880, 47330, 108978, 175574, 221994, -79588, -185229, -62989, -19167, 369447, 162148, -176765, -187615, 198214, -12539, 226383, 202397, 12663, 53446, -26488, 30048, -85955, -194069, -219151, 24838, -111294, 38990, -267977, 64966, 23779, 116252, 334061, 227691, 65208, 83894, 105962, 298200, -242518, -19956, 47701, -155006, 61558, -65339, 78961, -58926, -163800, 25003, 1226, -67088, -22395, 120767, -37615, 189299, 61956, 222107, -160033, 557, -150059, -83949, -224574, -14420, 288880, -44926, -69894, -159370, 10582, 102001, 24263, 440078, -326726, 37697, 104583, -448558, 23673, -121238]
11535b88110a29809C47675a59300i735j45366d4059C7520b5498A40273c4770H3578
11523d0206E4727b38702J04321M148A70950f0571B18401b53864c4173p2259B75256
11511F00a00840A65917C3086L55854Q381c8494A25779c13574B92494e2252H8791
11499C31986i8919A44959J33890G5136K68330a49696B94667F7693b88562A78797
11488a41619I4756b1235d77D4291B0279K26544A09433n3459b2485J689B71259
11476C0560a70467g3695A25557J21273G3225j8458e5505B46762j02219J87795
11466C32338A13193a27606A07922J57293a1308l28060a08189A55746N6994G6173
11455B03133N0480p9918m3630d3806A6657i8441C61001b94845P1014I7540h9383
$$ y = [-288110, -129809, 347675, -159300, -9735, -155101, -44059, 37520, -25498, 140273, -34770, 83578, -40206, 54727, -238702, -134381, -130233, 170950, -60571, 218401, -253864, -34173, -106432, 275256, 600, -100840, 165917, 33086, 388940, 397321, -38494, 125779, -313574, 292494, -52252, 88791, 331986, -98919, 144959, 278849, 75136, 343466, -149696, 294667, 67693, -288562, 178797, -141619, 94756, -21235, -477, 44291, 20279, 246823, 109433, 55974, -22485, -20796, 271259, 30560, -170467, -73695, 125557, 246830, 73225, 54767, -55505, 246762, 144543, 332338, 113193, -127606, 107922, 265215, -11308, -339368, -108189, 155746, 212740, 76173, 203133, 253613, 173695, 130065, -43806, 16657, -98441, 361001, -294845, -223831, 97540, -89383]
11443H5736j4044F457f7207K7442A7433L8973b77773A739a84962A34944h5461
11431A7758K53497A06985b05377d6020E2579K86579A60062p4063d486k24120B17783
11419c13877F1693b14882B6403a97477Q948c3095k548J7442H3560J24229k9162
11408A78627E225f2271k4231j73420F7891b6231l3718A15048f7496C19989B4234
11396c90276a45118d625q8046G3324b30490e7805k70602D7748B3383d5789n9086
11385a04875k1110N538o2514R1146D7147a09690j50785O9263a0377k53088G1930
11373C87613c42671N7223a32013B3817J60840a23566H3904a8334j30011q7703
11363b36048k50390F0687c1437j6391l343A96348G5624J9506G793P4419J01051
$$ y = [85736, 71692, 6457, -67207, -39765, 17433, 56406, -277773, 1739, -184962, 134944, -85461, 17758, 271255, 106985, -205377, -46020, 52579, 339158, 160062, 85999, -4486, -228606, 217783, -313877, 61693, -214882, 26403, -197477, -188529, -33095, -35643, -18201, 83560, 207789, 178627, 5225, -62271, -86502, -259922, 67891, -26231, -59949, 115048, -67496, 319989, 24234, -390276, -145118, -4625, -92671, 73324, -230490, -57805, -328407, 47748, 23383, -45789, -104875, -125985, -120447, -182961, -91815, 47147, -109690, -260475, -191212, -10377, -263465, 71930, 387613, -342671, -285448, -132013, 23817, 184657, -123566, 83904, -18334, -148345, -236048, -486438, 60687, -31437, -47828, -51171, 196348, 75624, 95130, 7793, 82212, 183263]
11352A83263K5614I1275J25928a26452A17718M447K65635E759a92743B39957D0258
11340C3263h6801F4743J90317h7649B03746C3498J63961a55994j2537a9518A26862
11328D2335a72946A95539r3313J01008e2588j70284B5905a13391K2059B81874
11317a08193D0884a70008O3629A6153b21998j06465A75631A9286a49476c2601
11306C2200P4557b12135e5876B07038f8549B14930b11240l3226a13413D68a76362
11294A06320j988D8686R2196C081K7112a46889E1661i3032l16730B33697b23131
11282a68168n7599c6533a4613n7228B39261A10336b84645c6307k27427J31042
11272a32692C5539c11256C23039a3712A94217e6750F8295o856a4779B3512O6806
$$ y = [183263, 208877, 91275, 217203, -126452, 117718, 122165, 387800, 5759, -192743, 239957, 40258, 33263, -86801, 64743, 255060, -87649, 203746, 33498, 197459, -155994, -168531, -19518, 126862, 42335, -172946, 195539, 102226, 203234, -52588, -222872, 25905, -113391, -91332, 281874, -108193, 40884, -170008, -106379, 16153, -221998, -328463, 175631, 19286, -149476, -32601, 32200, 106757, -212135, -55876, 207038, -68549, 214930, -211240, -244466, -113413, 468, -176362, 106320, 104332, 48686, 140882, 3081, 30193, -146889, 51661, -93032, -409762, 233697, -223131, -168168, -225767, -36533, -14613, -71841, 239261, 110336, -284645, -36307, -263734, -132692, 35539, -311256, 323039, -13712, 194217, -56750, 68295, 61439, -14779, 23512, 90318]
11261I0318b57528A82189b31164G2498a73645g80j28401m9541j09620j92919K12200
11250b69061a5268H8587a36867A36221r364J30200b26230f6444m3399J1343k2531
11239a21031j49661a3800j8908j9041j50127P0472M6828A27155b15296j94283
11229d09579g3146A0706f7720k36837B58831b1719k21481B07172H9808a30000
11218c20209i9864j3048B01359F6173b00416a4301H3318a36254k06104H5294a19854
11206b44624a8510r729I4436g9702m0308e8432j36121a5446c516G3761a17863
11194B81225j39270a58240L1864e0425B94959j15477D1532K39670C518J42090
11184A45608d1606b878B4583i1017G4387a51212A0936g8485j77220j9129P2477
$$ y = [90318, -257528, 182189, -231164, 72498, -173645, -780, -129181, -178722, -288342, -481261, -269061, -15268, 88587, -136867, 136221, 126857, 257057, -226230, -66444, -109843, -98500, -121031, -270692, -13800, -32708, -51749, -201876, -131404, -84576, 127155, -215296, -409579, -73146, 10706, -67720, -304557, 258831, -21719, -243200, 207172, 89808, -130000, -320209, -99864, -112912, 201359, 66173, -200416, -14301, 83318, -136254, -342358, 85294, -119854, -244624, -18510, -28239, 94436, -79702, -120010, -58432, -194553, -15446, -3516, 73761, -117863, 281225, 141955, -158240, -126376, -50425, 294959, 179482, 41532, 281202, 3518, 145608, -41606, -2878, 24583, -91017, 74387, -151212, 10936, -78485, -255705, -274834, -202357]
11173b02357A79992K21684A32229A243K5306J34722h2352A21763E1789a07501
11162b32328K9779P7863j19072C88832D0835f9753n13C3503A4414a63607b8347
11150A94609G668b78207a11961l33034g9751j37844H7793d20057B30095E6873
11139b49974J15331A1275b79085J09170A37947e856r7679n8135c2480B3663N514
11128B9177N8450d40387i2757J1359C62694a30929A41386a6014B63733c76799
11117A9060M8119h5063B45153c42467L2810H7220c50012j6665b8509j02711A04524
11105B37301g1381B6837b110C22487B425J21431a58265B19081D8593M7199f4575
11093B73223c4175F1996m281J09243K33412b10210L1032C3937J9546J37534B7293
$$ y = [-202357, 179992, 401676, 132229, 1243, 26549, 161271, -82352, 121763, 51789, -107501, -232328, -202549, -124686, -243758, 388832, 40835, -69753, -70266, 33503, 14414, -163607, -28347, 194609, 7668, -278207, -111961, -444995, -79751, -217595, 87793, -420057, 230095, 56873, -249974, -134643, 11275, -279085, -169915, 137947, -5856, -103535, -161670, -32480, 23663, 29177, 87627, -440387, -92757, -81398, 362694, -130929, 141386, -16014, 263733, -376799, 19060, 67179, -85063, 245153, -342467, -309657, 87220, -350012, -366677, -28509, -131220, 104524, 237301, -71381, 26837, -2110, 322487, 2425, 123856, -158265, 219081, 48593, 95792, -64575, 273223, -34175, 61996, 57715, 166958, 400370, -210210, -179178, 33937, 53483, 191017, 27293]
11081H4987b45115B63560A07285J00952L182a28426H4405L24362p5559C9778J01027
11070A40805L5438M0369j6809J73403m9851k4390P4421j1783J72645A50008K77757
11059D27765j51063K88309B79981A38948J69449K94088j54671O1372J50406k31832
11049D27760K96796C17941M03584K954k99531K89206k27878J05070L0848N5776
11039F77970n3440j98946L24649N1481k10525J06850J586m4629j19471O1615m6256
11028E50884j36501j41591M41949l9912j41973O7013P5287C12845M54914A96210
11017D89935P5889k82716K26787j78034j37859K73214j64808Q6403K46387j50547
11007D84651q0796K11661j99184K37593j2698B42247J81323j04528J91949R7385
$$ y = [84987, -245115, 263560, 107285, 208237, 211419, -128426, 84405, 408767, 333208, 39778, 140805, 176243, 216612, 199803, 373206, 323355, 298965, 373386, 361603, 534248, 150008, 427765, 276702, 565011, 279981, 138948, 308397, 602485, 447814, 509186, 659592, 427760, 724556, 317941, 721525, 724479, 424948, 714154, 486276, 591346, 622194, 677970, 624530, 425584, 750233, 801714, 591189, 698039, 699625, 654996, 535525, 597140, 550884, 414383, 272792, 714741, 674829, 532856, 599869, 675156, 312845, 767759, 196210, 489935, 565824, 283108, 509895, 331861, 194002, 467216, 302408, 388811, 635198, 484651, 403855, 615516, 416332, 653925, 641227, 242247, 423570, 319042, 510991, 608376]
10997F08376j32308K23464B16005P50512k87620k16367J04612K7790J8572k56191
10987C57313M15529l70367j96264O39670C16406K08583P5265k07015L42411J04986
10977H40636R6477J20232m4322J74866j57509K90116K19307J66217L8134k05364
10967A538790L12205O7649j08524J46489q893j40607l96024Q7243j22147k02936
10957A173245K10197l87531J16724j46398N07901k40266m4950K69675M9557n14756
10947I93398k47320j05923P9674P1949j09279j92407j36051j12513e3226F04P0611
10936G1215a3570o2133C9369J81115l0114m296n6814K04719A09059c7710q3722
10925a21432N3387i722j18972A24633a04998b7591B17394a7014A35242c8259n2782
$$ y = [608376, 476068, 699532, 216005, 966517, 678897, 462530, 567142, 594932, 613504, 357313, 772842, 402475, 206211, 845881, 316406, 524989, 600254, 393239, 735650, 840636, 937113, 1057345, 1013023, 1187889, 1030380, 1320496, 1539803, 1706020, 1744154, 1538790, 1850995, 1918644, 1810120, 1956609, 1947716, 1807109, 1411085, 1498328, 1376181, 1173245, 1383442, 995911, 1112635, 966237, 1474138, 1233872, 1188922, 1458597, 1508154, 993398, 746078, 640155, 719829, 791778, 682499, 490092, 354041, 241528, -53226, 604, 71215, -13570, -75703, 39369, 220484, 190370, 186074, 129260, 333979, 109059, -37710, -121432, -68045, -9722, -128694, 124633, -104998, -27591, 217394, -17014, 135242, -38259, -91041]
10914i1041M4869B06955a69691G5332f0913l65589J92072A81278a73621J9684
10904a53937o8629P3354I5618J30326a18816N446k8953A12723g0544A22167J29674
10893B51841a29591A64230M6575p8034f9700G2953J25626r4296c6012F4441e6705
10881B26554a50013F7948J77698O9690D1675a33733a8634j34914E1294J05030
10871A56324a17901B32439a02633A68024g5111B14578A02138h0889j7953A21351
10860b92771f5440j78307B91381c6094A30091J08374P1716e4247j07411k07296
10850c68954c443j48539F4530L9121e3404A40991a36004a1233H1969g7331p6539
10839a53870j44598J1721h5268E1120a59323O2293d3027b0677B86920H7927b14154
$$ y = [-91041, -46172, 206955, -169691, 75332, -60913, -426502, -234430, 181278, -173621, -153937, -222566, -149212, 95618, 225944, -118816, -113370, -142323, 112723, -70544, 122167, 251841, -129591, 164230, 210805, 132771, -69700, 72953, 198579, 104283, -36012, 64441, -56705, 226554, -150013, 67948, 245646, 315336, 41675, -133733, -18634, -153548, 51294, 156324, -117901, 232439, -102633, 168024, -75111, 214578, 102138, -80889, -98842, 121351, -292771, -65440, -243747, 291381, -36094, 130091, 238465, 310181, -54247, -161658, -368954, -3443, -151982, 64530, 103651, -53404, 140991, -136004, -11233, 81969, -77331, -153870, -298468, -286747, -85268, 51120, -159323, -97030, -43027, -20677, 286920, 87927, -214154]
10827a51977I0669J34620l8761i7392j3911r6614A76114k5051F238a07747B65250
10815G1074J70610g2848o973j48822B8339K42608A34262e345n4355B1945b90849
10803D44a27606B45467a7054q9133B72837J52234g5809p1793m9587K8657F3002
10791a50992j914n3010J00630M4380j49206O2387B5941m18K24105A11821b6107
10779A36267B004J32130b1788A5923J6271i8183B7268d57231g4367k95089B510
10767B11452a4770D02504a85626n980E752K12497a17502D433a33544I5999b4501
10755H0358L5322d95447A2348a85555N2523N9370N420A15059e095A36791a23130
10743A26094b99122A48061a50750O7309J5004p3342f9657l6483A40009b49615
$$ y = [-151977, 90669, 225289, 186528, -97392, -111303, -207917, 176114, 151063, 6238, -107747, 265250, 71074, 241684, -72848, -79821, -228643, 28339, 270947, 134262, -5345, -59700, 21945, -290849, 444, -127606, 245467, -17054, -106187, 272837, 425071, -75809, -147602, -197189, -168532, 63002, -150992, -152906, -205916, -105286, -60906, -210112, -147725, 25941, 25523, 249628, 111821, -26107, 136267, 2004, 134134, -21788, 15923, 32194, -98183, 27268, -457231, -74367, -369456, 2510, 211452, -14770, 402504, -185626, -191606, 5752, 218249, -117502, 4433, -133544, 95999, -24501, 80358, 115680, -495447, 12348, -185555, -133032, -73662, -68242, 115059, -5095, 136791, -123130, 126094, -299122, 148061, -150750, -83441, -68437, -141779, -69657, -106140, 140009, -249615]
10732A3860a22061A34214g8735B9747a57413A5294k055O0530d106j58542A08846
10720e2931H4882a30706N1536q076o6968D3245b8708k6525f031k46033h9090K6789
10708f2301p4901m8728G5834M9767a37128A70672a38839F6461h6676C05688r3684
10697B12004d37931k4295A62609m4875g6607A6692a05369m2878c2696k68511I2341
10685A53508b25335M4999j29549a2772B14535b4954p0858A54092C362a71572m2474
10674b14046n4503e4906B38783p3512g1169k47884a0040j29320a4998l36688M7542
10663c04144h1144j11992r9733J40636n3744h1351D5080J83403j05103c52833
10652C841b02154A1984f2253J7436B91082b11380c3263a4170k0665B27867m4227
$$ y = [13860, -122061, 134214, -78735, 29747, -157413, 15294, 13239, 73769, -4106, -162648, 108846, -52931, 84882, -130706, -79170, -87246, -154214, 43245, -28708, -55233, -6031, -252064, -89090, -62301, -137202, -185930, 75834, 125601, -137128, 170672, -138839, 66461, -86676, 305688, 212004, -437931, -462226, 162609, 117734, -76607, 16692, -105369, -148247, -32696, -301207, 92341, 153508, -225335, -180336, -309885, -12772, 214535, -24954, -95812, 154092, 3362, -171572, -214046, -268549, -54906, 238783, 165271, -71169, -319053, -10040, -139360, -14998, -351686, -304144, -81144, -193136, -292869, -152233, -205977, -81351, 45080, 228483, 123380, -352833, 3841, -202154, 11984, -62253, -44817, 291082, -211380, -33263, -14170, -34835, 227867, 183640]
10641A83640a84468c8781j94568a9344D0286L0769b02594K6435g1305k30850J34247
10630a67908O4204E4303d60990a80000b3237j90889B96490m0474M2322G1895b32179
10618E8594O7027i9229j08559C6645K2739e8650o9706B12904o0997i9580A21988
10606a9190n48523G4629c20200c283C19718a10655a7555B5990a51190p795B4984
10594D8346n602c316A17093d03676i8085o0013p8322L0088f0116k70185R5644
10583b34657a16567A26835J37018j28995f1136A16886e2026B48137e8577q060
10573f6637B9351a80415A38974a30357e9362o1423N4274m94496B40713a31472
10562c38534A8888M0184J32324R9822b98026J45935A20619e1322j67848Q8346
$$ y = [183640, -184468, -38781, -233349, -19344, 40286, 71055, -202594, -176159, -71305, -302155, -167908, -103704, 54303, -460990, -180000, -23237, -214126, 296490, 256016, 298338, 71895, -232179, 58594, 125621, -99229, -207788, 36645, 59384, -58650, -128356, 212904, 151907, -99580, 121988, -19190, -567713, 74629, -320200, -3283, 319718, -110655, -17555, 25990, -151190, -158985, 24984, 48346, 42744, -3316, 117093, -403676, -98085, -158098, -236420, -206332, -60116, -330301, -234657, -116567, 126835, 263853, 134858, -61136, 116886, -52026, 248137, -58577, -66637, 29351, -180415, 138974, -130357, -59362, -120785, -66511, -561007, 240713, -131472, -338534, 18888, 59072, 191396, 291218, -298026, -152091, 120619, -51322, -219170, -130824]
10552a30824j56747C64942H4599f5200k8034o8748O5795L6376C25348c2208I570
10540A09211n1137a13972k08246A96820K8916a01597d3180l57995B270J19406
10530A21676k9320j3475J83470a28382j65434l1473E5728b91779a36854m0908
10520a77762L9162p0959j03438a09668B4013a08211k08746A63884b36834m835
10510b41669E1227A991g8554l3962N0785m3097A4280i4120B38619b10803A70454
10498a65747j1065n2281J09067K092j29789K8278D0778a71858e3688p6914j68569
10487b99171J23344j3807e1744j74640f9438A87483b58722c779A46199M2773J98447
10476C87419Q2383l7073A37476J56542K93398A21641O8603P447a69987C1253J11580
$$ y = [-130824, -287571, 364942, 84599, -65200, -93234, -161982, -96187, -59811, 325348, -32208, 9570, 109211, 58074, -113972, -322218, 196820, 225736, -101597, -43180, -401175, 2270, 121676, 92356, 78881, 262351, -128382, -293816, -325289, 55728, -291779, -136854, -177762, -138600, -209559, -312997, -109668, 24013, -108211, -316957, 163884, -236834, -241669, 51227, 1991, -78554, -112516, -61731, -104828, 14280, -94120, 238619, -210803, 170454, -165747, -176812, -229093, -120026, -117934, -247723, -219445, 40778, -171858, -53688, -130602, -299171, -175827, -189634, -51744, -226384, -69438, 187483, -258722, -3779, 146199, 188972, 387419, 469802, 432729, 137476, 294018, 587416, 121641, 190244, 197691, -169987, 31253, 142833]
10465A42833p1414c9457A17756a37116C58040j66615E2985Q5992B6061a04889
10454A8573b18342k72809A63857J6852a78863d3247C3537e337k46731A50053c33323
10442B09959c3997B69319F4731i0505E9338a79687C13412j08215p5234m5874b46451
10430B67496c3069k14841P5146j33228A61503O7506J17123b78987J37362j95794
10420c37419f6172B29940A3403b57375A36251c18340A71708M1660a77605h6813
10409b87729c3000n2221a9161o0202B5866e4567K2083j2070G6671a95486A05220
10397G5748J74907b28070K8148C0319L6850N15181H1238h9907j94681A91865A893
10385g379C34306c15259c4218C14715a80718B05716I2920a55494D950a48492C11185
$$ y = [142833, 71419, -39457, 117756, -137116, 358040, 191425, 52985, 138977, 26061, -104889, 18573, -218342, -491151, 163857, 180709, -178863, -43247, 33537, -5337, -252068, 150053, -333323, 209959, -33997, 269319, 64731, -90505, 59338, -179687, 313412, 205197, 129963, 84089, -246451, 267496, -33069, -247910, -172764, -305992, 161503, 229009, 346132, -278987, -141625, -337419, -66172, 229940, 13403, -257375, 136251, -318340, 171708, 213368, -177605, -86813, -287729, -33000, -85221, -19161, -79363, 25866, -54567, -32484, -44554, 76671, -195486, 105220, 75748, 250655, -228070, -199922, 30319, 67169, 582350, 81238, -89907, -284588, 191865, 1893, -7379, 334306, -315259, -34218, 314715, -180718, 205716, 92920, -155494, 4950, -148492, 311185]
10373G8383A0887L53637a71173A2369K21022o4947n80k6795J23216J45273B9201
10361B18123k2052k344J15193J74104j41496a66834B29939m3287K27513a70800
10350A43277K37486F8379L38811m6778J29791r5040A4926K80266q1618q1363J78786
10339C10997R5282j71258n7881e2654C94111F9670K63226d9677n7941A47598a58556
10327D94232I8658J11250b52817j18610A03936h9336C10325A02498i8439l81000
10317d79439d0492M226B91930a3847A23758C5108h2568D2873c0913A72815A2688
10305a12275j63594A47880c12176A42893c66634D82442a23173k67144J15194C859
10294B05616C1725O7846r934K85924b37697f7431A57137B3749i3451L5660b3143
$$ y = [78383, 10887, 364524, -171173, 12369, 233391, 168444, 167864, 141069, 264285, 409558, 29201, 218123, 196071, 193727, 308920, 483024, 341528, -166834, 229939, 186652, 414165, -170800, 143277, 380763, 68379, 407190, 360412, 490203, 395163, 14926, 295192, 213574, 132211, 310997, 406279, 235021, 177140, -52654, 394111, 69670, 332896, -49677, -107618, 147598, -158556, 494232, 98658, 209908, -252817, -371427, 103936, -89336, 310325, 102498, -98439, -479439, -40492, -36266, 291930, -13847, 123758, 35108, -82568, 42873, -30913, 172815, 12688, -112275, -275869, 147880, -312176, 142893, -366634, 482442, -123173, -390317, -275123, 3859, 205616, 31725, 99571, 89637, 375561, -237697, -67431, 157137, 23749, -93451, -57791, -23143]
10282B2551J39582b90538E0231L52012b68149L7990A23748A8683q381b82203G7501
10270C4085j1492O8212j7930k6678L0376K9265a27993j13885A91736M6176E6717
10258g4449c5976G9369K013J13231L36095B36113J31058e3410a029j3646H2519
10246a34208C9299i6640o8421C84955h1130A73998b27627A0272a26075k90077
10236d16152F556i8299l07144k6105J96524k8977A34119J75662d0143l66655J07200
10225b99598J47471L0419k76472J16544O8479C12896n1996I8836k8049J97665
10215B68452N4028a60248j30325J31746O0755j98F6947J95356I362c06362b6171
10203a57105F6764f5983j4361c0945j02589C82642f3519A55666b41684N3169A01786
$$ y = [22551, 162133, -290538, 50231, 402243, -268149, -230159, 123748, 18683, 10302, -282203, 77501, 34085, 22593, 90805, 72875, 46197, 76573, 105838, -127993, -241878, 191736, 237912, 56717, -74449, -35976, 79369, 81382, 194613, 530708, 236113, 367171, -53410, -1029, -14675, 82519, -134208, 39299, -96640, -165061, 384955, -81130, 173998, -227627, 10272, -126075, -416152, 6556, -98299, -405443, -431548, -235024, -264001, 134119, 309781, -40143, -406798, -299598, -152127, -121708, -398180, -281636, -213157, 312896, 260900, 98836, 70787, 268452, 322480, -160248, -290573, -158827, -98072, -98270, 66947, 262303, 9362, -306362, -26171, -157105, 66764, -65983, -80344, -30945, -133534, 382642, -63519, 155666, -241684, -188515, 101786]
10191A06719b97696e3585j98550Q2411C9296a29697j77460c6825j36251d9344
10180a08301B82411b19985a708l00832f4302G0708i2045L1518h248k26929A33681
10168C61902d85585g0893J4957j61044q1886c7166B42663c93875Q7325A31026
10157h206j40349c5768j28821M2448A64582a92521R3092a3924l5803m6768C02133
10145a61125m7736M8118B3497G553J44043N8622H7021d3962l5416A59599H686
10133a26817D6269K2652a53052K8694j99700c9707r5888N8749k4986n2272b8582
10121B9351a20160J1524e0933k88282a00628d7880F5763d5690F4519a58533m4467
10110b03000A92981d62775A89914f7897k7718n3218o3274b6073l612R430H6027
$$ y = [106719, -297696, -53585, -252135, -169724, 39296, -129697, -307157, -36825, -173076, -49344, -108301, 282411, -219985, -1708, -302540, -64302, 70708, -92045, -60527, -8248, -235177, 133681, 361902, -485585, -70893, -55936, -216980, -298866, -37166, 242663, -393875, -306550, 131026, -8206, -148555, -35768, -164589, -122141, 164582, -192521, -99429, -13924, -49727, -96495, 302133, -161125, -208861, -160743, 23497, 7553, 151596, 210218, 87021, -43962, -79378, 159599, 8686, -126817, 46269, 68921, -153052, -124358, -324058, -39707, -135595, -76846, -101832, -154104, -28582, 29351, -120160, -108636, -50933, -339215, -100628, -47880, 65763, -45690, 64519, -158533, -203000, 192981, -462775, 189914, -67897, -95615, -148833, -212107, -26073, -29685, -20255, 86027]
10098f2439k25997G6568a13561e1600j65833H8492a4366k52325a24651n8967H5350
10086G3570a20282E7083a52438c3669l53449d1414E8071f9667A82281a42192j31068
10075b73260h3950q7167g8255p6197B72990F950A718K2412c1048A42726a69704
10063g3873K7360p809G8568a02512M7238B17126c5722e090k0005k49997r4545
10052c69637R8704e1015l3042L0593K4650k70579K6013b0244G4674B0861a72208
10040I8661B6808a8459C2756a51136A41922b22991p3691H1783a58865A39419N8113
10029A97532j8862C3822M81a67492N2826r6529O0221B86478g9862M4F8167c21573
10016H6094b5186j53615b9528j37248J8813K7041l5366P6074d983p0825I4770
$$ y = [-62439, -288436, 76568, -113561, -51600, -217433, 88492, -14366, -266691, -124651, -183618, 85350, 73570, -120282, 57083, -152438, -33669, -387118, -41414, 58071, -69667, 182281, -142192, -273260, -83950, -171117, -78255, -154452, 272990, 6950, 1718, 24130, -31048, 142726, -169704, -73873, -46513, -54322, 78568, -102512, -55274, 217126, -35722, -5090, -25095, -275092, -369637, -270933, -51015, -84057, -53464, -28814, -299393, -273380, -20244, 74674, 20861, -172208, 98661, 26808, -18459, 32756, -151136, 141922, -222991, -296682, 81783, -158865, 139419, 197532, 178670, 33822, 34303, -167492, -114666, -211195, -150974, 286478, -79862, -79818, 68167, -321573, 86094, -25186, -178801, -29528, -166776, -147963, -120922, -156288, -80214, -4983, -75808, 94770]
10004f5386F8407a6342j63213J5338A29533m4477l2437b03675b9802j90180D7043
9992A94030f089A10353a75501g1419p0691l2420M9175d9783j46532k2131i1791
9980b07808Q2003A94727c55225a54306j09247B0964i5578A72308a36262A05494
9969b01998M2309B52112e2602p7004M5672I5154d24180B66616a56561r9923B51939
9957a60653A12064a62988P1414K6436G6657K20205H9247c01805f0516j44297n8376
9946b63189j1981a23412l1218E9679R7476a37927A63524a0997D2946a52736P0734
9935h2002J2260n7750c662D57138a95349j50751a21787A7636K33752I5261a14628
9923B36679e4371A59307a44147a9161p5809C3910a09112L187B24799a9878b900
$$ y = [-65386, 68407, -16342, -179555, -164217, 129533, 85056, 52619, -203675, -29802, -219982, 47043, 194030, -6089, 110353, -175501, -71419, -142110, -174530, -125355, -49783, -196315, -218446, -91791, -207808, -125805, 194727, -355225, -154306, -263553, 20964, -95578, 172308, -136262, 105494, -201998, -159689, 252112, -52602, -129606, -83934, 95154, -424180, 266616, -156561, -256484, 251939, -160653, 112064, -162988, -91574, -65138, 76657, 296862, 89247, -301805, -60516, -204813, -263189, -275170, -123412, -154630, 59679, 157155, -137927, 163524, -10997, 42946, -152736, -82002, -69742, -127492, -3662, 457138, -195349, -346100, -121787, 17636, 251388, 95261, -114628, 236679, -54371, 159307, -144147, -19161, -94970, 33910, -109112, -105925, 224799, -19878, -2900]
9911D9940a09619B0274a69915r497E4506J58564H9994a28577K9915k52003f5948
9899h6411k46681B27776I0995b32457e4932k9950L0526A4760J46102a00561B33741
9887b13732R1926c865D08361c6998A02242J55175A10214m5299f7232B49091n0809
9876A98282a47846i290D0070a19218B492K0211i0844J4224D1105b57863g5729
9864a04825A75747P3814i1607j66575b6034j23475d8930m6087J4B59045c24209
9852a65601b7329j67267A13789j8341b42034a5387C92629A04850K7979F3991b16224
9840c1211j60558B42884a87176f410m1912l2252k04374j12893C34686b00805h6130
9828a8135A04490a50134j06218H0222I929i7730A23845a18194r0821k93288B1368
$$ y = [49940, -109619, 20274, -169915, -179412, 54506, 213070, 89994, -128577, -98662, -350665, -65948, -86411, -333092, 227776, 90995, -232457, -54932, -84882, -54356, 14760, 160862, -100561, 233741, -213732, -121806, -3865, 408361, -36998, 102242, 257417, 110214, 64915, -67232, 249091, 198282, -147846, -9290, 40070, -119218, 2492, 22703, -90844, -76620, 41105, -257863, -75729, -104825, 175747, 249561, -91607, -258182, -26034, -149509, -48930, -95017, -95003, 259045, -324209, -165601, -27329, -194596, 113789, 95448, -242034, -15387, 392629, 104850, 132829, 63991, -216224, -31211, -191769, 242884, -187176, -6410, -48322, -80574, -284948, -397841, 334686, -200805, -86130, -18135, 104490, -150134, -256352, 80222, 9929, -97730, 123845, -118194, -209015, -502303, 21368]
9816c75289a63784C3464a97370e6927A58916c85177I0471b29070B0084b42696
9805C2898B466a39746j77806A65131D0716b16028l5728a22271o3685k42110a57506
9793d8502A2893M9623b2535D5999J35396H604a26028n077l5258k3706n8608a14651
9780A93411D9872b85194a32842A65296Q6675D4206a64677j6724g4908k40599I0442
9768i7139k74616b7197A11337a10329A38197m0766e0960b2603g489l84272b1193
9756A19565b65141a08677a876j9259j6546B94107c27002a17773j48351h241m4700
9745e2941k13098J15767j5426b2643k6056p8542r2833h7998j50417K2643B9884
9733b44685C19266a59936B66574b03127e389j87980A17180e5267k9611q7213B3015
$$ y = [-375289, -163784, 33464, -197370, -56927, 158916, -385177, 90471, -229070, 20084, -242696, 32898, 2466, -139746, -317552, 165131, 40716, -216028, -251756, -122271, -185956, -428066, -157506, -48502, 12893, 62516, -22535, 45999, 181395, 8604, -126028, -131105, -166363, -190069, -248677, -114651, 193411, 49872, -285194, -132842, 165296, 251971, 44206, -164677, -181401, -74908, -315507, 90442, -97139, -371755, -27197, 111337, -110329, 138197, 97431, -50960, -22603, -7489, -391761, -21193, 119565, -265141, -108677, -1876, -21135, -37681, 294107, -327002, -117773, -266124, -8241, -52941, -266039, -150272, -165698, -22643, -48699, -127241, -220074, -87998, -238415, -215772, 29884, -244685, 319266, -159936, 266574, -203127, -5389, -193369, 117180, -55267, -84878, -172091, 23015]
9721G7744L5492a47528C39881e4390m420b7071j22457j40453o5615J69078g5955
9709a15841A62426b8056q3375q5298F1738a94926a1300j7664C7620P235a37887
9697F1231h1809A61527A528c97122B75554a42154C3380a09994m3124I132c60405
9685I4534a51371j33084P1512N8708g2409p1075E3259N5372n2815N8043B5212
9673b7128l88232c9373B7651e4456k31788a25585m4181k19113D8008k372a38042
9661B4838Q0081g0841j33976Q603k7692h1156k4199a1778B2508O8613a53318b2390
9648b77537H6064a2300B190L81352b2636n8630j49768e005E6973J86973A21094
9636B308b02436E4550b4898C29268b91501d3250j13267A77632N9585c0905j09834
$$ y = [77744, 113236, -147528, 339881, -54390, -58810, -27071, -149528, -289981, -355596, -186518, -75955, -115841, 162426, -28056, -111431, -196729, 61738, -194926, -11300, -28964, 37620, 44855, -137887, 61231, -81809, 161527, 1528, -397122, 275554, -142154, 33380, -109994, -153118, 9132, -360405, 94534, -151371, -284455, -212943, -154235, -72409, -143484, 53259, 108631, 55816, 113859, 25212, -27128, -415360, -39373, 27651, -54456, -286244, -125585, -169766, -388879, 48008, 45636, -138042, 24838, 104919, -70841, -204817, -196214, -223906, -81156, -105355, -11778, 22508, 91121, -153318, -22390, -277537, 86064, -12300, 2190, 383542, -22636, -81266, -231034, -5005, 56973, 243946, 121094, 2308, -202436, 54550, -24898, 329268, -291501, -43250, -156517, 177632, 237217, -30905, -140739]
9625a40739f7731j0545l1745j78522a23551G8035J31686b66336b0934q8587N1967
9614e7554l78911a77233k58814F1477c6960D4723b08309d6739j81452H0018A2639
9602A07094e9629m21676a16853G5750K4948d2539D5762a99671j87852H2774N4151
9591A36925e8850k9363A88577m0574a19208K9182j25014a2595j16451c6567H6541
9579h9099A8286a21903B04966D309f2259J6358q6804O2864C0871a88476J0324
9568a78152B79308d9978C24682g8298k4218I092d00154a83288M7044B03621O6537
9557B70158a55343M3688C15752a02841L9486j48586O8595A78628a7025j88016
9547b05041N2499M0973J540k9983c6293B895J9394d153B54944a85903j13524j248
$$ y = [-140739, -67731, -78276, -110021, -288543, -123551, 78035, 209721, -266336, -20934, -109521, -57554, -436465, -177233, -436047, 61477, -36960, 44723, -208309, -46739, -228191, 80018, 12639, 107094, -59629, -481305, -116853, 75750, 100698, -42539, 45762, -199671, -387523, 82774, 136925, -58850, -88213, 188577, 148003, -119208, -90026, -215040, -12595, -129046, -36567, 86541, -89099, 18286, -121903, 204966, 4309, -62259, -45901, -132705, -69841, 30871, -188476, -178152, 279308, -49978, 324682, -78298, -102516, 9092, -400154, -183288, -136244, 203621, 270158, -155343, -111655, 315752, -102841, -63355, -211941, -143346, 178628, -17025, -205041, -152542, -111569, -110029, -140012, -36293, 2895, 22289, -4153, 254944, -185903, -299427, -300675]
9535c00675a3063j44106c2697j95318B60950n8802H2603F7Q699g8122m6200j50088
9523b74410R4114k58374C8323J48469D4850J7154i0624p0258B54641A5445b7862
9511F4119a33894j17395f5860c1935H5101J21331d4597j26639j35602F3848g4025
9499h246k55116a0167B28832k3311p500b97149C70627I9927J00195h350j13358
9488a21708A85995c31704a16940j6258d0370p1848B9369c99460a73062h287j64811
9477a73098J9305k34628B7201R4783B8581Q9362B5421a66905p092G1495J21029
9466A92524d3826D6863M9388D5063J19134b54040a07001A43671c97675J15252
9456b82423I0660d28615J72761d8762H7986l8740i9295j3846b0436k19130J9526
$$ y = [-300675, -13063, -157169, -32697, -228015, 260950, 202148, 82603, 67, 8766, -78122, -124322, -274410, -180296, -438670, 38323, 186792, 44850, 62004, -90624, -160882, 254641, 15445, -27862, 64119, -133894, -251289, -65860, -31935, 85101, 206432, -44597, -171236, -306838, 63848, -74025, -8246, -263362, -10167, 228832, 205521, 198021, -297149, 370627, 99927, 200122, -8350, -121708, 185995, -331704, -116940, -133198, -40370, -112218, 29369, -399460, -173062, -8287, -173098, -153793, -388421, 27201, 121984, 28581, 117943, 25421, -166905, -173997, 71495, 192524, -43826, 46863, 96251, 45063, 164197, -254040, -107001, 143671, -397675, -282423, 90660, -428615, -255854, -48762, 87986, 49246, -99295, -113141, -20436, -239566, -220040]
9445b20040E4211a15610j25117B18165k0672a11212I5909a36673F3303c99468
9434B6989b57626E7791c2270j37181M3600j72999a9772n9269A10265a75429j55118
9423c30547a43317j10817d7685A304Q3197b40278e7396k41j07928m2992J3303
9412a95254A50651b36118G800b07332A57941n945c14486h5386a4592A26937a02240
9400b65854A56884b90819A6608L71910A13745a2957m7015A35953P9052E9797N2226
9389A12023a44144N3440L9217m4432j42706J05318j79427G5295b65413g2024G416
9377G3349a97024B32988a13020C2744a90989G1172l2066a71927f0711j3270n7448
9366a31429A88538a30327Q224r0031r1558F9128f7558A23640a76306A95294a0995
$$ y = [-220040, 54211, -115610, -240727, 218165, 197493, -111212, 95909, -136673, 63303, -399468, 26989, -257626, 57791, -32270, -169451, -125851, -298850, -19772, -79041, 110265, -175429, -330547, -143317, -254134, -47685, 1304, 84501, -240278, -57396, -57637, -165565, -208557, -195254, 150651, -236118, 7800, -207332, 157941, 151996, -314486, -85386, -14592, 126937, -102240, -265854, 156884, -290819, 16608, 388518, 113745, -12957, -59972, 135953, 215005, 59797, 112023, -144144, -90704, -51487, -95919, -238625, -133307, -312734, 75295, -265413, -72024, 7416, 73349, -197024, 232988, -113020, 32744, -190989, 71172, 39106, -171927, -60711, -73981, -131429, 188538, -130327, -122103, -212134, -303692, 69128, -67558, 123640, -176306, 195294, -10995]
9354F8010d91538a23113j5582A05675b06490A17123E8120b10219A54785a24128
9343b8900p4992o1197d9038j79704c8517K902l47435B14620b56105G8267e65407
9331a27792F3617f9199j52817A48913b93997a09009L8766j07134m3092l4186a24844
9319e6904C0759e981r856j83334A06531a20424e7653B5489J80712a58365f2762
9307b47o2266q4504B34437b26266P6022Q591p5317A40537b94188a17281C7192
9295i4339A27978F0191b96712B2910a9928A2974b76783p3836a07681H5749h2500
9283c97034d3829A36807K8158L1154K03987d23120b5142i974A25469B5665M36472
9272D62137i9758A84896a96415M9230P2978J677j23147C6649P61a97411J0010
$$ y = [68010, -491538, -123113, -138695, 105675, -206490, 117123, 58120, -210219, 154785, -124128, -28900, -103892, -165089, -49038, -228742, -38517, -35615, -383050, 214620, -256105, 78267, -565407, -127792, 63617, -69199, -222016, 148913, -293997, -109009, -70243, -177377, -220469, -254655, -124844, -56904, 30759, -5981, -15837, -199171, 106531, -120424, -57653, 25489, 206201, -158365, -62762, -247, -62513, -147017, 234437, -226266, -150244, -141653, -216970, 140537, -294188, -117281, 37192, -94339, 127978, 60191, -296712, 22910, -19928, 12974, -276783, -350619, -107681, 85749, -82500, -397034, -43829, 136807, 164965, 196119, 400106, -423120, -25142, -9974, 125469, 25665, 462137, -99758, 184896, -196415, -147185, -74207, -72530, -195677, 36649, 37410, -197411, -187401]
9261a87401A34363l5002a12903B09713b62826B2447J17777a15278o0005o0215
9251b35498A5981J72129A0893d7323B21212b77337K8358a07360R843B7766a54354
9239A20735i6945l9928J241D0628a2366l1673m5732A23138e8315p1487a5102j25248
9227a40350L7570C3429d12853d3789A69609l2255B6030K6753b59290J14706A03484
9215a32483E0982J34824q5077b03887A47510c1274A93932c36202B4927e726r2863
9204i8589k46439a42450C3717h0973L2996j6035l42351A71160c73464J04488J06376
9193a62600N6909d6873D0159j5347b29130K0451C12958o3360f2663r3679A72411
9181e7047J6868E3675R2732b13847o0978j20893a9739B93613a4409j40288I1834
$$ y = [-187401, 134363, 99361, -112903, 209713, -262826, 22447, 140224, -115278, -175283, -235498, 15981, 188110, 10893, -47323, 221212, -277337, -248979, -107360, -97517, 27766, -154354, 120735, -96945, -136873, -135632, 40628, -12366, -44039, -89771, 123138, -58315, -129802, -15102, -140350, -102780, 33429, -412853, -43789, 169609, 137354, 26030, 52783, -259290, -144584, 103484, -132483, 50982, 185806, 100729, -203887, 147510, -31274, 193932, -336202, 24927, -5726, -98589, -345028, -142450, 33717, -80973, -47977, -64012, -406363, 171160, -373464, -268976, -162600, -105691, -46873, 40159, 24812, -229130, -208679, 312958, 249598, -62663, -156342, 172411, -57047, -40179, 53675, 146407, -213847, -274825, -395718, -19739, 293613, -14409, -154697, 91834]
9169a22367b927j31241k0086K8743l03059A02324b52664O3434g3722q7444A97338
9157B1463a55756A15376m6169i0051B00393E5784h4532c4426F0277A9441P5434
9146I4875g5844F0804K66939a73384d8524j06177r3379B26533a68320a3129j44331
9135a57460A96154a5131A43826j2126b486j80002H1241h0554k38020J52941N2354
9124a13279e3682a617j46336I3602b72925J01056k49508F707K39613c89779A00284
9112B69905C0585a3266l44515A20611D070J2434R7142A9982b86105F9738B1784
9100g5027I7749a40762B13204g2440j00073j37015a51775B52582e09027E1302
9089A35304b22553g0572l11588a82321h1713H2469j7509c0308m3994f433j61840
$$ y = [-122367, -2927, -134168, -154254, -125511, -428570, 102324, -252664, -189230, -73722, -161166, 197338, 21463, -155756, 115376, 69207, -90051, 200393, 55784, -84532, -34426, 60277, 19441, 94875, -75844, 60804, 327743, -173384, -48524, -154701, -248080, 226533, -168320, -13129, -157460, 196154, -15131, 143826, 131700, -2486, -182488, 81241, -80554, -318574, -165633, -113279, -53682, -1617, -147953, 93602, -272925, -171869, -421377, 6707, 246320, -389779, 100284, 269905, 30585, -13266, -357781, 120611, 4070, 16504, 113646, 19982, -286105, 69738, 21784, -75027, 97749, -140762, 213204, -72440, -172513, -309528, -151775, 252582, -509027, 51302, 135304, -222553, -70572, -382160, -182321, -81713, 82469, 64960, -30308, -74302, -6433, -168273]
9078a68273D2691O0894d431B9345a73517P7058J0053O960g544n6423k01040P2688
9066a92319C7766N2453a33569j86304A06151i6654j16040A00036l9690a49411
9055A55810F7991a06334q9765g1711A6173f3455j11864j61578A8821a42270E5451
9043d9976j81193a12053A2677J25449a13232j31509M0024e9526A06549b54596
9032D1710c6267j05921H4311c65373a53553E5206a61348A77152g4412A43239b4512
9020a51452E32226b24784a6109k41936M4627f8498k11685J04426r673e2484B29573
9008e37770R8514a41770b1849B39374a44610B13660E2308J64808a49981A63507
8997G5542a64801q3714A43727a26976f1642B30240f8505C72756g0425A22097D7009
$$ y = [-168273, 42691, 103585, -4431, 29345, -173517, -96459, -86406, -79446, -7544, -63967, -265007, -192319, 37766, 90219, -133569, -319873, 106151, -96654, -212694, 100036, 60346, -149411, 155810, 67991, -106334, -196099, -71711, 16173, -63455, -175319, -336897, 18821, -142270, 55451, -49976, -231169, -112053, 12677, 138126, -113232, -244741, -204717, -59526, 106549, -254596, 41710, -36267, -142188, 84311, -365373, -153553, 55206, -161348, 177152, -74412, 143239, -24512, -151452, 532226, -224784, -16109, -258045, -213418, -68498, -280183, -175757, -185430, -52484, 229573, -537770, -439256, -141770, -21849, 239374, -144610, 213660, 52308, 217116, -149981, 163507, 75542, -164801, -248515, 143727, -126976, -61642, 230240, -68505, 372756, -70425, 122097, 47009]
8985g69F3139d5505j21514F2506J32567a82091c591G990K49383i1949L9584D62859
8972d23735b00761Q2570A9202N7589a24123q4433Q196A2149K27080H0671a23831
8960i8037B8479a10454C33754E9754a90516M5106l45555i6759B5847H136O9591
8949G7727a7106B5162b60357C3621b02150J116C388a50964E169a83240a4550p1541
8937h6091G3536J00244b56325O6399B02926k9798m1564c56738A19958n1429g6498
8925a74847F2580A9416b18560L5534H2567K48656O81335K78585a52134C34884
8914a25043a3723k18201e3311j3218B44191j20238K78505A01803C4884i4144m1624
8903a35768n2361P0531B6105L9042c23294a25142D2247p787e05924e8792G3501
$$ y = [-769, 63139, -45505, -167019, 62506, 195073, -182091, -3591, 7990, 257373, -91949, -52365, 462859, -423735, -200761, -118191, 19202, 76791, -124123, -208556, -200360, 12149, 239229, 80671, -123831, -98037, 28479, -110454, 333754, 59754, -190516, -145410, -490965, -96759, 25847, 8136, 77727, -17106, 25162, -260357, 33621, -202150, -201034, 3388, -150964, 5169, -183240, -14550, -86091, 73536, 173780, -256325, -189926, 202926, 173128, 131564, -356738, 119958, 68529, -76498, -174847, 62580, 19416, -218560, -183026, 82567, 331223, 1012558, 1291143, -152134, 334884, -125043, -13723, -231924, -53311, -66529, 244191, 123953, 402458, 101803, 34884, -94144, -135768, -188129, -117598, 26105, 65147, -323294, -125142, 42247, 34460, -505924, -58792, 73501]
8891E9556d2907p3281A5679J43444a96793k9998m3649A46970a82806a5704I7238
8879a1187r4094k20687d3213C50410E4614O6985a12647k61094R448K040Q1604
8868b80649i1501D5076K64224o2128a82470O7000D9108D605K15029a37446C413
8856a788A62243b74734I4729g1303G5105a52682O3601A21555b70068J00299P2099
8845i7670B31019f4660j00374J9389B06682e27042E4538a72530b8719p6994j57781
8834b63494a17680p4749D4149g9214o59j10098P3472k00963A21848h3850k53832
$$ y = [59556, -42907, -116188, 15679, 159123, -196793, -226791, -270440, 146970, -182806, -15704, 97238, -11187, -105281, -325968, -43213, 350410, 54614, 121599, -112647, -373741, -364293, -362253, -280649, -91501, 45076, 309300, 247172, -182470, -115470, 49108, 4605, 219634, -137446, 3413, -1788, 162243, -274734, 94729, -71303, 75105, -152682, -89081, 121555, -270068, -169769, -97670, 231019, -64660, -165034, -145645, 206682, -527042, 54538, -172530, -28719, -105713, -263494, -117680, -192429, 44149, -79214, -79873, -189971, -116499, -317462, 121848, -83850, -337682]
$$ [...]
##END NTUPLES=NMR SPECTRUM
##END=
