##TITLE=NES1083_IC_9885136_LPl463uOHN
##JCAMPDX= 6.0         $$ Bruker NMR JCAMP-DX V2.0
##DATA TYPE= NMR SPECTRUM
##DATA CLASS= NTUPLES
##ORIGIN= BRUKER
##OWNER= Administrator
$$ 1.72 TOPSPIN		Version 2.1
$$ 2016-08-27 22:57:43.789 -0500  Administrator@X
$$ Compression mode = diff/dup
##.OBSERVE FREQUENCY= 400.02188249412
##.OBSERVE NUCLEUS= ^1H
##.ACQUISITION MODE= SIMULTANEOUS (DQD)
##.ACQUISITION SCHEME= undefined
##.AVERAGES= 64
##.DIGITISER RES= 22
##SPECTROMETER/DATA SYSTEM= spect
##.PULSE SEQUENCE= noesygpps1d.comp
##.SOLVENT NAME= COFFEE_meoh
##.SHIFT REFERENCE= INTERNAL, COFFEE_meoh, 1, 14.96272
##AUDIT TRAIL= $$ (NUMBER, WHEN, WHO, WHERE, PROCESS, VERSION, WHAT)
$$ ##TITLE= Audit trail, TOPSPIN		Version 2.1
$$ ##JCAMPDX= 5.01
$$ ##ORIGIN= Bruker BioSpin GmbH
$$ ##OWNER= Administrator
$$ $$ E:\/data/COFFEE/nmr/NES1083_IC_9885136_LPl463uOHN/12/pdata/1/auditp.txt
$$ ##AUDIT TRAIL=  $$ (NUMBER, WHEN, WHO, WHERE, PROCESS, VERSION, WHAT)
(   1,<2016-08-27 22:57:38.492 -0500>,<Administrator>,<X>,<go>,<TOPSPIN 2.1>,
      <created by zg
	started at 2016-08-27 22:46:09.070 -0500,
	POWCHK enabled, PULCHK disabled,
       configuration hash MD5:
       21 0F 79 D6 B3 7B B4 F6 88 20 88 DB 03 48 BD 9F
       data hash MD5: 64K
       E5 0B 5B 71 13 37 72 C0 9F BE 97 2B B9 30 8A 02>)
(   2,<2016-08-27 22:57:41.695 -0500>,<Administrator>,<X>,<proc1d>,<TOPSPIN 2.1>,
      <Start of raw data processing
       efp LB = 0.3 FT_mod = 6 PKNL = 1 PHC0 = 0 PHC1 = 0 SI = 128K 
       data hash MD5: 128K
       2A B3 F2 6F C3 52 96 2D CB 4E D8 CD 1B DA 56 21>)
(   3,<2016-08-27 22:57:42.570 -0500>,<Administrator>,<X>,<proc1d>,<TOPSPIN 2.1>,
      <pk PHC0 = -84.51233 PHC1 = 0 
       data hash MD5: 128K
       67 D0 50 A4 5B 6F 80 3F 5B BA B0 A2 12 55 FF 00>)
(   4,<2016-08-27 22:57:42.961 -0500>,<Administrator>,<X>,<proc1d>,<TOPSPIN 2.1>,
      <abs ABSG = 1 
       data hash MD5: 128K
       EC D7 6D 00 F1 C2 9E 6C C5 89 29 02 FD BE BF 6D>)
(   5,<2016-08-27 22:57:43.070 -0500>,<Administrator>,<X>,<proc1d>,<TOPSPIN 2.1>,
      <abs ABSG = 2 
       data hash MD5: 128K
       2B 8C 57 2C 0F 16 B8 A9 B0 6C FC CA 5C 1D CE 11>)
(   6,<2016-08-27 22:57:43.148 -0500>,<Administrator>,<X>,<proc1d>,<TOPSPIN 2.1>,
      <abs ABSG = 3 
       data hash MD5: 128K
       0F 1E B0 7A 05 25 7F 20 4C CC 8D 9B E0 66 AE 0C>)
(   7,<2016-08-27 22:57:43.242 -0500>,<Administrator>,<X>,<proc1d>,<TOPSPIN 2.1>,
      <abs ABSG = 4 
       data hash MD5: 128K
       0B DE 23 A4 B4 B1 E0 22 35 D2 0F 04 1B 05 77 0C>)
(   8,<2016-08-27 22:57:43.367 -0500>,<Administrator>,<X>,<proc1d>,<TOPSPIN 2.1>,
      <abs ABSG = 5 
       data hash MD5: 128K
       BA 97 B7 34 4C C0 B4 A0 26 4E B0 3A 7C F2 CE FD>)
$$ ##END=
$$ 
$$ $$ hash MD5
$$ $$ 82 90 8B EA 1F 54 EB A7 D6 06 16 DB B0 D9 A7 16
##$RELAX= 
##$RELAX= 
##$RELAX= 
##$RELAX= 
##$RELAX= 
##$RELAX= 
##$RELAX= 
##$RELAX= 
$$ Bruker specific parameters
$$ --------------------------
##$DU= <E:\>
##$EXPNO= 12
$$ [...]
##$TP07= 0
##$TPNAME0= <>
##$TPNAME1= <>
##$TPNAME2= <>
##$TPNAME3= <>
##$TPNAME4= <>
##$TPNAME5= <>
##$TPNAME6= <>
##$TPNAME7= <>
##$TPOAL= (0..7)
0.5 0.5 0.5 0.5 0.5 0.5 0.5 0.5
##$TPOFFS= (0..7)
0 0 0 0 0 0 0 0
##$TUNHIN= 0
##$TUNHOUT= 0
##$TUNXOUT= 0
##$USERA1= <user>
##$USERA2= <user>
##$USERA3= <user>
##$USERA4= <user>
##$USERA5= <user>
##$V9= 5
##$VALIST= <valist>
##$VCLIST= <CCCCCCCCCCCCCCC>
##$VD= 0
##$VDLIST= <DDDDDDDDDDDDDDD>
##$VPLIST= <PPPPPPPPPPPPPPP>
##$VTLIST= <TTTTTTTTTTTTTTT>
##$WBST= 1024
##$WBSW= 4
##$XGAIN= (0..3)
0 0 0 0
##$XL= 0
##$YL= 0
##$YMAX_a= 6959634
##$YMIN_a= -14832005
##$ZGOPTNS= <>
##$ZL1= 120
##$ZL2= 120
##$ZL3= 120
##$ZL4= 120
##$ABSF1= 14.96272
##$ABSF2= -5.595462
##$ABSG= 5
##$ABSL= 3
##$ALPHA= 0
##$AQORDER= 0
##$ASSFAC= 0
##$ASSFACI= 0
##$ASSFACX= 0
##$ASSWID= 0
##$AUNMP= <proc_prof1d_extract.lims>
##$AXLEFT= 0
##$AXNAME= <>
##$AXNUC= <1H>
##$AXRIGHT= 0
##$AXTYPE= 0
##$AXUNIT= <>
##$AZFE= 0.1
##$AZFW= 0.1
##$BCFW= 0
##$BC_mod= 0
##$BYTORDP= 0
##$COROFFS= 0
##$CY= 15
##$DATMOD= 1
##$DC= 0
##$DFILT= <>
##$DTYPP= 0
##$F1P= 0
##$F2P= 0
##$FCOR= 0.5
##$FTSIZE= 131072
##$FT_mod= 6
##$GAMMA= 0
##$GB= 0
##$INTBC= 1
##$INTSCL= 1
##$ISEN= 128
##$LB= 0.3
##$LEV0= 0
##$LPBIN= 0
##$MAXI= 10000
##$MC2= 0
##$MEAN= 0
##$ME_mod= 0
##$MI= 0
##$NCOEF= 0
##$NC_proc= -2
##$NLEV= 6
##$NOISF1= 0
##$NOISF2= 0
##$NSP= 0
##$NTH_PI= 0
##$NZP= 0
##$OFFSET= 14.96272
##$PC= 1
##$PHC0= -84.51233
##$PHC1= 0
##$PH_mod= 1
##$PKNL= yes
##$PPARMOD= 0
##$PPDIAG= 0
##$PPIPTYP= 0
##$PPMPNUM= 2147483647
##$PPRESOL= 1
##$PSCAL= 4
##$PSIGN= 0
##$PYNMP= <proc.py>
##$REVERSE= no
##$SF= 400.020008949026
##$SI= 131072
##$SIGF1= 0
##$SIGF2= 0
##$SINO= 400
##$SIOLD= 131072
##$SPECTYP= <>
##$SREGLST= <1H.CDCl3>
##$SSB= 0
##$STSI= 131072
##$STSR= 0
##$SW_p= 8223.68421052631
##$SYMM= 0
##$S_DEV= 0
##$TDeff= 65536
##$TDoff= 0
##$TI= <>
##$TILT= no
##$TM1= 0
##$TM2= 0
##$TOPLEV= 0
##$USERP1= <user>
##$USERP2= <user>
##$USERP3= <user>
##$USERP4= <user>
##$USERP5= <user>
##$WDW= 1
##$XDIM= 131072
##$YMAX_p= 378629136
##$YMIN_p= -12308
##$CURPLOT= <Network HP LaserJet P1505>
##$CURPRIN= <$Network HP LaserJet P1505>
##$DFORMAT= <normdp>
##$LAYOUT= <+/1D_H.xwp>
##$LFORMAT= <normlp>
##$PFORMAT= <normpl>
##$SURQMSG= 1
$$ End of Bruker specific parameters
$$ ---------------------------------
##NTUPLES= NMR SPECTRUM
##VAR_NAME=  FREQUENCY,     SPECTRUM/REAL,   SPECTRUM/IMAG
##SYMBOL=    X,             R,               I
##VAR_TYPE=  INDEPENDENT,   DEPENDENT,       DEPENDENT
##VAR_FORM=  AFFN,          ASDF,            ASDF
##VAR_DIM=   131072,        131072,          131072
##UNITS=     HZ,            ARBITRARY UNITS, ARBITRARY UNITS
##FACTOR=    0.0627417313425164, 1,          1
##FIRST=     8223.62146879497, -1431,        -45988
##LAST=      0,             597,             -46758
##MIN=       0,             -12308,          0
##MAX=       8223.62146879497, 378629136,    0
$$ Real data points
##PAGE= N=1
##DATA TABLE= (X++(R..R)), XYDATA
$$ [...]
61022I01577K2960K4273K4992K5758K7621L0915L4694L7971M1094M5020M9613
$$ 901577 924537 948810 973802 999560 1027181 1058096 1092790 1130761 1171855 1216875 1266488
61011A266488N3781N7074O0056O3241O6912P1993P9818R0862J04687J21108J40289
$$ 1266488 1320269 1377343 1437399 1500640 1567552 1639545 1719363 1810225 1914912 2036020 2176309
61000B176309J61888J85600K12590K44908K83192L26326L73398M24531M79919
$$ 2176309 2338197 2523797 2736387 2981295 3264487 3590813 3964211 4388742 4868661
60991D868661N40190O08211O88724P86318R06307J056953J245412J467945J705770
$$ 4868661 5408851 6017062 6705786 7492104 8398411 9455364 10700776 12168721 13874491
60982A3874491J929177K096020K140557J979671J562734R38002K64887k61610
$$ 13874491 15803668 17899688 20040245 22019916 23582650 24520652 24785539 24523929
60974B4523929n18882n06133l09134l9808J87269K52790N9537m04341j028556
$$ 24523929 24005047 23498914 23189780 23149972 23337241 23590031 23649568 23245227 22216671
60965B2216671j626658k038124k202461k155306j973922j729792j472882j233455
$$ 22216671 20590013 18551889 16349428 14194122 12220200 10490408 9017526 7784071
60957G784071j025222q49487p02500n80964m81968m01495l35672k82497k40842
$$ 7784071 6758849 5909362 5206862 4625898 4143930 3742435 3406763 3124266 2883424
60948B883424k08640j83219j62733j46213j32758j21480j11811j03150r4631q5846
$$ 2883424 2674784 2491565 2328832 2182619 2049861 1928381 1816570 1713420 1618789 1532943
60938A532943p7349o9904o3598n8218n4024n1449n0204m9297m7842m5595m2778
$$ 1532943 1455594 1385690 1322092 1263874 1209850 1158401 1108197 1058900 1011058 965463 922685
60927I22685l9727l6641l3509l0348k7479k5188k3139k0587j7385j4342j2304
$$ 922685 882958 846317 812808 782460 754981 729793 706654 686067 668682 654340 642036
60916F42036j1284j0722j0166r421q425p407o796o558o015m792l596l385l954
$$ 642036 630752 620030 609864 600443 592018 584611 577815 571257 565242 560450 556854 553469 549515
60903E49515m085l141j846j206j251j235p47n0N85J400K780M600O138O714O387
$$ 549515 545430 542289 540443 539237 537986 536751 536004 535954 536539 537939 540719 545319 551457 558171 564558
60888E64558N950O190P060P704P461O704O406O800O966O007M230K629J405j59
$$ 564558 570508 576698 583758 591462 598923 605627 612033 618833 625799 631806 636036 638665 640070 639911
60874F39911k345m324n259n476n878o633p124p040o739o544o296n813n232m672
$$ 639911 637566 633242 627983 622507 616629 609996 602872 595832 589093 582549 576253 570440 565208 560536
60860E60536l903k672j135K82J347K190L125M378N903P418Q684R723J0622J1259
$$ 560536 556633 553961 552826 553108 554455 556645 559770 564148 570051 577469 586153 595876 606498 617757
60846F17757J1487J1470J1563J1782J1809J1545J1344J1573J2207J2982J3599
$$ 617757 629244 640714 652277 664059 675868 687413 698757 710330 722537 735519 749118
60835G49118J3670J2833J1242R633Q571P861O995N968N179M671M047L217K720
$$ 749118 762788 775621 786863 796496 805067 812928 819923 825891 831070 835741 839788 843005 845725
60822H45725K940L396L159J909K25j098j774k056k452l493n480q128j0545j1876
$$ 845725 848665 852061 855220 857129 857354 856256 854482 852426 849974 846481 841001 832873 822328 810452
60808H10452j2002j1534j1121j0887j0544r867q960q058p200o086m397k314n58
$$ 810452 798450 786916 775795 764908 754364 744497 735537 727479 720279 714193 709796 707482 706924
60795G06924L13N55R25J772K730L371L791M281M707M602L821K818K120J792J552
$$ 706924 707237 707792 708717 710489 713219 716590 720381 724662 729369 733971 737792 740610 742730 744522 746074
60780G46074J274J166J327J384Q93J21k6R30K312L140L394L968N385P145Q470
$$ 746074 747348 748514 749841 751225 752118 752239 752213 753143 755455 758595 761989 765957 771342 778487 786957
60765G86957R124R269R084Q862R016R514R700R112Q189P701P696P629P307P082
$$ 786957 796081 805350 814434 823296 832312 841826 851526 860638 868827 876528 884224 891853 899160 906242
60751I06242P100O961O378N597M970M353L356J981P71K43K97K57m65j692k686
$$ 906242 913342 920303 926681 932278 937248 941601 944957 946938 947709 947952 948249 948506 948041 946349 943663
60736I43663l041l221m021n643p544r094j0102j0808j1615j2825j4333j5584j6083
$$ 943663 940622 937401 933380 927737 920193 911099 900997 890189 878574 865749 851416 835832 819749
60723H19749j5922j5647j5598j5599j5286j4450j3171j1806j0845j0475j0268
$$ 819749 803827 788180 772582 756983 741697 727247 714076 702270 691425 680950 670682
60712F70682r608q351o867n470m190l079k243j382J79K655N284P028P630P683
$$ 670682 661074 652723 645856 640386 636196 633117 630874 629492 629671 632326 637610 644638 652268 659951
60698F59951P787P971P885P198N797L862J777j88k139m261o342p906q954j0121
$$ 659951 667738 675709 683594 690792 696589 700451 702228 702040 699901 695640 689298 681392 672438 662317
60684F62317j1785j3366j3990j3670j3249j3159j2841j1612r599p462n649m342
$$ 662317 650532 637166 623176 609506 596257 583098 570257 558645 549046 541584 535935 531593
60672E31593l657l363k724j301L13J237J545K039K815L130K753K482K893L522
$$ 531593 527936 524573 521849 520548 520861 522098 523643 525682 528497 531627 534380 536862 539755 543277
60658E43277L779L884M156M165L480K708K794L631M273M354M378M708N126N468
$$ 543277 547056 550940 555096 559261 562741 565449 568243 571874 576147 580501 584879 589587 594713 600181
60644F00181N908O489P046P741Q983J0620J1859J2257J2234J2359J2604J2640
$$ 600181 606089 612578 619624 627365 636348 646968 658827 671084 683318 695677 708281 720921
60632G20921J2448J2278J2301J2516J2801J2881J2523J1818J1052J0250R219Q020
$$ 720921 733369 745647 757948 770464 783265 796146 808669 820487 831539 841789 851008 859028
60620H59028O976O091M913L185J245l78j455k058k435k961l787m411m149l227
$$ 859028 866004 872095 877008 880193 881438 881060 879605 877547 875112 872151 868364 863953 859804 856577
60606H56577k881l921n716p090p791q504r695j1046j2028j2437j2272j1528j0334
$$ 856577 853696 849775 844059 836969 829178 820674 810979 799933 787905 775468 763196 751668 741334
60593G41334q992p667o199m397k366m74J011K062K735L039L099L201L445L423
$$ 741334 732342 724675 718476 714079 711713 711239 712250 714312 717047 720086 723185 726386 729831 733254
60579G33254K681J488P45Q34J102P52j29j040j991l274m554n144n181n608o762
$$ 733254 735935 737423 738168 739002 740104 740856 740727 739687 737696 734422 729868 724724 719543 713935 707173
60564G07173p790p868p284o793o506n919m683k876q55Q60J949K853M494P057R607
$$ 707173 699383 691515 684231 677438 670932 665013 660330 657454 656599 657459 659408 662261 666755 673812 683419
60549F83419J1325J2586J4179J6103J7930J9951K2927K6822L0738L4085L6924
$$ 683419 694744 707330 721509 737612 755542 775493 798420 825242 855980 890065 926989
60538I26989L8976L9250L7021L2477K5969J7333O658m772j4984k2719k7778l0282
$$ 926989 965965 1005215 1042236 1074713 1100682 1118015 1124673 1119901 1104917 1082198 1054420 1024138
60526A024138l0197k7731k3601j8620j3232p672k264K641O850J0188J2374J3321
$$ 1024138 993941 966210 942609 923989 910757 903085 900821 903462 910312 920500 932874 946195
60514I46195J3471J3418J3278J2831J2371J2872J5005J8465K2688K7869L4702
$$ 946195 959666 973084 986362 999193 1011564 1024436 1039441 1057906 1080594 1108463 1143165
60503A143165M3289N2984O3248P4116Q5754R8166J11407J25450J39590J52605
$$ 1143165 1186454 1239438 1302686 1376802 1462556 1560722 1672129 1797579 1937169 2089774
60493B089774J63965J74493J85607J98323K13169K30325K49027K66863K79846
$$ 2089774 2253739 2428232 2613839 2812162 3025331 3255656 3504683 3771546 4051392
60484D051392K82908K70388K37392J82221J07880K0834p1488j61637k41664l03784
$$ 4051392 4334300 4604688 4842080 5024301 5132181 5153015 5081527 4919890 4678226 4374442
60474D374442l42889l58495l54160l35339l07645k75990k44052k13972j86500
$$ 4374442 4031553 3673058 3318898 2983559 2675914 2399924 2155872 1941900 1755400
60465A755400j61606j39229j19668j03294q9840p8371o8209n9534n2597m6759
$$ 1755400 1593794 1454565 1334897 1231603 1141763 1063392 995183 935649 883052 836293
60455H36293m1080l5668l1480k8596k5760k2134j8611j6573j5952j5419j4169
$$ 836293 795213 759545 728065 699469 673709 651575 632964 616391 600439 585020 570851
60444E70851j2599j1312j0300r352q480p715o934o134n408m552l260k027k078
$$ 570851 558252 546940 536640 527288 518808 511093 504159 498025 492617 488065 484805 482778 480700
60431D80700l824n873o448n452m287l682k788p59J728L317L680L541L317K671
$$ 480700 476876 471003 464555 459103 454816 451134 448346 447587 449315 452632 456312 459853 463170 465841
60417D65841J519O44Q72K083L328L815L524L076L058L398L420K735J899J839K675
$$ 465841 467360 468004 468876 470959 474287 478102 481626 484702 487760 491158 494578 497313 499212 501051 503726
60402E03726L639M152M380M557M455L956L590L881M461M451L618K635K172K183
$$ 503726 507365 511517 515897 520454 524909 528865 532455 536336 540797 545248 548866 551501 553673 555856
60388E55856K153J771J245J062J327J428N88j071k477k882k756k936l362l342
$$ 555856 558009 559780 561025 562087 563414 564842 565430 564359 561882 559000 556244 553308 549946 546604
60374E46604k767k176j750j150m61m02j143j676j008N00J610J731J388J302J622
$$ 546604 543837 541661 539911 538761 538300 537898 536755 535079 534071 534571 536181 537912 539300 540602 542224
60359E42224K113K612L102L530L790L805L613L359L254L395L638L694L346K576
$$ 542224 544337 546949 550051 553581 557371 561176 564789 568148 571402 574797 578435 582129 585475 588051
60345E88051J575O11j84q98j651k315k550k205j547r92o95m39Q5R19J741K112
$$ 588051 589626 590237 590053 589155 587504 585189 582639 580434 578887 577895 577200 576761 576846 577765 579506 581618
60329E81618J863J304R80J194J781K328K510K294J873J485J252J157J038N86m60
$$ 581618 583481 584785 585765 586959 588740 591068 593578 595872 597745 599230 600482 601639 602677 603263 602803
60314F02803j858k745k387j158l47p35j795k554k815k938k869k198j119m93p56
$$ 602803 600945 598200 595813 594655 594308 593573 591778 589224 586409 583471 580602 578404 577285 576792 576036
60299E76036j424j980k593l481m104l712k428j175n92m21j17M75J191J929K677
$$ 576036 574612 572632 570039 566558 562454 558742 556314 555139 554547 554126 554009 554484 555675 557604 560281
60284E60281L306L631L673L704L890M050L937L710L851M552N411N969O371P114
$$ 560281 563587 567218 570891 574595 578485 582535 586472 590182 594033 598585 603996 609965 616336 623450
60270F23450Q259R198R307Q661Q045Q315R691J1553J2999J3746J4331J5326J6706
$$ 623450 631709 640907 650214 658875 666920 675235 684926 696479 709478 723224 737555 752881 769587
60257G69587J8270K0211K2670K5059K6689K7976L0077L3316L6843M0099M3580
$$ 769587 787857 808068 830738 855797 882486 910462 940539 973855 1010698 1050797 1094377
60246A094377M7662N1707N5170N8768O3522O9145P4390P8706Q2453Q5660Q7705
$$ 1094377 1142039 1193746 1248916 1307684 1371206 1440351 1514741 1593447 1675900 1761560 1849265
60235A849265Q8266Q7701Q6121Q2992P7910P1215O3507N5114M6260L7128K7517
$$ 1849265 1937531 2025232 2111353 2194345 2272255 2343470 2406977 2462091 2508351 2545479 2572996
60224B572996J7042O014m398j3272k0685k6976l1821l4557l5051l3662l0631k6035
$$ 2572996 2590038 2596052 2591654 2578382 2557697 2530721 2498900 2464343 2429292 2395630 2364999 2338964
60212B338964k0186j3521o206J768J0192J8741K7423L6453M5772N4956O3618P1625
$$ 2338964 2318778 2305257 2299051 2300819 2311011 2329752 2357175 2393628 2439400 2494356 2557974 2629599
60200B629599P8887Q5157R0005R2832R3024R0277Q4680P6468O5927N3679M0661
$$ 2629599 2708486 2793643 2883648 2976480 3069504 3159781 3244461 3320929 3386856 3440535 3481196
60189C481196K7408J3694p32j5327k9138m1672n2806o2079o8830p2979p4974p4873
$$ 3481196 3508604 3522298 3521566 3506239 3477101 3435429 3382623 3320544 3251714 3178735 3103761 3028888
60177C028888p2197o6842n9424n0495m0062k8199j5544k806R697K1590L2104M0756
$$ 3028888 2956691 2889849 2830425 2779930 2739868 2711669 2696125 2693319 2703016 2724606 2756710 2797466
60165B797466M7915N4052N8678O0676N9481N5404M8981M0659L1083K1063J1073
$$ 2797466 2845381 2899433 2958111 3018787 3078268 3133672 3182653 3223312 3254395 3275458 3286531
60154C286531J204q304j6922k4231l0117l4329l6318l5683l2534k7161j9636r955
$$ 3286531 3287735 3279431 3262509 3238278 3208161 3173832 3137514 3101831 3069297 3042136 3022500 3012545
60142C012545J562J4269K7655M1674N6514P2119Q8040J03951J20192J37353J55249
$$ 3012545 3014107 3028376 3056031 3097705 3154219 3226338 3314378 3418329 3538521 3675874 3831123
60131C831123J72760J89034K04366K19345K33483K45406K54305K60376K63777
$$ 3831123 4003883 4192917 4397283 4616628 4850111 5095517 5349822 5610198 5873975
60122E873975K63963K60360K52906K41443K25171K03480J77082J47696J16608
$$ 5873975 6137938 6398298 6651204 6892647 7117818 7321298 7498380 7646076 7762684
60113G762684Q3953M9328J2813k4613o1399r6201j28504j58320j85146k07556
$$ 7762684 7846637 7895965 7908778 7884165 7822766 7726565 7598061 7439741 7254595 7047039
60103G047039k24148k34607k39406k38711k32180k19822k02501j81493j57986
$$ 7047039 6822891 6588284 6348878 6110167 5877987 5658165 5455664 5274171 5116185
60094E116185j33091j07785q2571n7612l3360j0707R835K8677M6391O2622P6178
$$ 5116185 4983094 4875309 4792738 4735126 4701766 4691059 4700894 4729571 4775962 4838584 4914762
60083D914762Q6091R1997R3684R0924Q3954P3490N9889M2839K2520O22k0517l9850
$$ 4914762 5000853 5092850 5186534 5277458 5361412 5434902 5494791 5537630 5560150 5560772 5540255 5500405
60071E500405n7962p5471r1848j06214j18537j29249j38010j43733j45858j44923
$$ 5500405 5442443 5366972 5275124 5168910 5050373 4921124 4783114 4639381 4493523 4348600
60061D348600j41661j36087j27843j17042j04350r0484p5977o1302m6804l2399
$$ 4348600 4206939 4070852 3943009 3825967 3721617 3631133 3555156 3493854 3447050 3414651
60051C414651j7660k415J2848K7392M0932N3733O5844P6578Q5030R0974R4703
$$ 3414651 3396991 3394576 3407424 3434816 3475748 3529481 3595325 3671903 3756933 3847907 3942610
60040C942610R5974R3733Q7334P7437O5197N0936L4419J6175k485k0765l8852
$$ 3942610 4038584 4132317 4219651 4297088 4362285 4413221 4447640 4463815 4461330 4440565 4401713
60029D401713n6624p2797q5980r6054j03757j09260j11838j10838j06340r8979
$$ 4401713 4345089 4272292 4186312 4090258 3986501 3877241 3765403 3654565 3548225 3449246
60019C449246q9597p9127o8297n7266m5829l3987k1967r721L139J6711L0447M3688
$$ 3449246 3359649 3280522 3212225 3154959 3109130 3075143 3053176 3043455 3046594 3063305 3093752 3137440
60007C137440N6410O9189Q2470R5956J08646J19413J27597J33223J36515J37060
$$ 3137440 3193850 3263039 3345509 3441465 3550111 3669524 3797121 3930344 4066859 4203919
59997D203919J33564J24708J10436R2260P2098N0923K8759N758j7311l9702o1186
$$ 4203919 4337483 4462191 4572627 4664887 4736985 4787908 4816667 4822425 4805114 4765412 4704226
59986D704226q1419r9248j13280j22927j28323j29464j26094j18514j07776r4897
$$ 4704226 4622807 4523559 4410279 4287352 4159029 4029565 3903471 3784957 3677181 3582284
59976C582284q0475o5124m9648l4481j9534m852R147K2340L5100M7431N8492O7556
$$ 3582284 3501809 3436685 3387037 3352556 3333022 3328170 3337317 3359657 3394757 3442188 3500680 3568236
59964C568236P4842Q0855Q5345Q7576Q7281Q4674P9907P3159O5043N6182M6544
$$ 3568236 3643078 3723933 3809278 3896854 3984135 4068809 4148716 4221875 4286918 4343100 4389644
59953D389644L5924K4917J4739O076j223p218j1307j2655j0747n413L215J4724
$$ 4389644 4425568 4450485 4465224 4471300 4470077 4462859 4451552 4438897 4428150 4422737 4425952 4440676
59941D440676K8804M5640O5433Q7557J10785J34412J58602J83434K08149K31701
$$ 4440676 4469480 4515120 4580553 4668110 4778895 4913307 5071909 5255343 5463492 5695193
59931E695193K53591K73728K91580L05752L14378L15784L08745K92200K64885
$$ 5695193 5948784 6222512 6514092 6819844 7134222 7450006 7758751 8050951 8315836
59922H315836K25749J75065J15049M9102j9381q7253j51154k07599k53716k87750
$$ 8315836 8541585 8716650 8831699 8880801 8861420 8774167 8623013 8415414 8161698 7873948
59912G873948l09044l18093l16548l06572k90012k68311k43027k15793j87722
$$ 7873948 7564904 7246811 6930263 6623691 6333679 6065368 5822341 5606548 5418826
59903E418826j59307j30892j02806p5070m7594k0823M294K7207M8212O7898Q6479
$$ 5418826 5259519 5128627 5025821 4950751 4903157 4882334 4886628 4913835 4962047 5029945 5116424
59892E116424J03670J18777J30739J38497J41444J39310J31635J17683R6908O9251
$$ 5116424 5220094 5338871 5469610 5608107 5749551 5888861 6020496 6138179 6235087 6304338
59882F304338L5217l716m4881q5251j22492j54864j80532j98080k07803k11488
$$ 6304338 6339555 6335839 6290958 6205707 6083215 5928351 5747819 5549739 5341936 5130448
59872E130448k10594k05407j96253j84460j71570j58392j45427j33572j23642
$$ 5130448 4919854 4714447 4518194 4333734 4162164 4003772 3858345 3724773 3601131
59863C601131j15721j09418j04273r9355r3220q5123p5898o6876n8281m9398l9953
$$ 3601131 3485410 3375992 3271719 3172364 3079144 2994021 2918123 2851247 2792966 2743568 2703615
59852B703615l0475k1527j3426o719k185k68j051m621j0771j8357k5694l1817
$$ 2703615 2673140 2651613 2638187 2631468 2629283 2629015 2627964 2623343 2612572 2594215 2568521 2536704
59840B536704l6832m0834m3148m3030m0662l7007l2900k8584k4003j9187j4371
$$ 2536704 2499872 2459038 2415890 2372860 2332198 2295191 2262291 2233707 2209704 2190517 2176146
59829B176146r939o284l528j230J537N649J1319J8090K5301L2334L8294M2033
$$ 2176146 2166207 2159923 2156395 2155165 2156702 2162351 2173670 2191760 2217061 2249395 2287689 2329722
59817B329722M3019M2043M0411L8454L5447L1081K6152K1442J6661J1204N544
$$ 2329722 2372741 2414784 2455195 2493649 2529096 2560177 2586329 2607771 2624432 2635636 2641180
59806B641180J103j123j274k2K261N754J1017J8542K8221L9367N1473O4684P9147
$$ 2641180 2642283 2641160 2639886 2639864 2642125 2647879 2658896 2677438 2705659 2745026 2796499 2861183 2940330
59793B940330R4178J08727J22811J37890J55550J75969J97834K19524K40045K58570
$$ 2940330 3034508 3143235 3266046 3403936 3559486 3735455 3933289 4152813 4392858 4651428
59783D651428K72993K79161K71947K47348K03742J42013O5788j7905r9234j68466
$$ 4651428 4924421 5203582 5475529 5722877 5926619 6068632 6134420 6116515 6017281 5848815
59773E848815k19278k49902k61925k58654k44100k22255j96524j69592j43523
$$ 5848815 5629537 5379635 5117710 4859056 4614956 4392701 4196177 4026585 3883062
59764C883062j19574r8046p8678o1265m5648l1330j7547l876R494K2150L3965
$$ 3883062 3763488 3665442 3586764 3525499 3479851 3448521 3430974 3427098 3436592 3458742 3492707
59753C492707M5192N6295O7703P9639R2166J05295J18949J32925J47225J62417
$$ 3492707 3537899 3594194 3661897 3741536 3833702 3938997 4057946 4190871 4338096 4500513
59743D500513J79196J97520K16659K36238K56656K78209L00525L23304L46914
$$ 4500513 4679709 4877229 5093888 5330126 5586782 5864991 6165516 6488820 6835734
59734F835734L71509L96067M19096M39744M57317M70049M75559M72645M61714
$$ 6835734 7207243 7603310 8022406 8462150 8919467 9389516 9865075 10337720 10799434
59725A0799434M43427M18115L87088L53718L22419K96732K78689K69415K69602
$$ 10799434 11242861 11660976 12048064 12401782 12724201 13020933 13299622 13569037 13838639
59716A3838639K79261K97312L21466L48571L75344L98954M16945M26774M25800
$$ 13838639 14117900 14415212 14736678 15085249 15460593 15859547 16276492 16703266 17129066
59707A7129066M11869L83943L42389K89002K26737J59042Q9400K1548m0277r1957
$$ 17129066 17540935 17924878 18267267 18556269 18783006 18942048 19031448 19052996 19012719 18920762
59697A8920762j30565j54589j63395j56982j36228j02839n8768o032N3164J16668
$$ 18920762 18790197 18635608 18472213 18315231 18179003 18076164 18017396 18011364 18064528 18181196
59687A8181196J82984K51202L20305L88927M55823N19978N79891O33126O76583
$$ 18181196 18364180 18615382 18935687 19324614 19780437 20300415 20880306 21513432 22190015
59678B2190015P06730P19204P08796O70433O00433M97120L61243J96803J1719
$$ 22190015 22896745 23615949 24324745 24995178 25595611 26092731 26453974 26650777 26662496
59669B6662496j82743l73774n49004o98015q13270q90706r29966r34272r09789
$$ 26662496 26479753 26105979 25556975 24858960 24045690 23154984 22225018 21290746 20380957
59660B0380957q64535q07366p47411o93591o53717o33138o33406o51417o79592
$$ 20380957 19516422 18709056 17961645 17268054 16614337 15981199 15347793 14696376 14016784
59651A4016784p07913p27424p33038p23761p01055o67483o26340n81178n34883
$$ 14016784 13308871 12581447 11848409 11124648 10423593 9756110 9129770 8548592 8013709
59642H013709m89252m45379m04050l65671l30304k97944k68520k41683k17034
$$ 8013709 7524457 7079078 6675028 6309357 5979053 5681109 5412589 5170906 4953872
59633D953872j94619j74662j56761j39935j23686j08495r4954q2859p1549o0842
$$ 4953872 4759253 4584591 4427830 4287895 4164209 4055714 3960760 3877901 3806352 3745510
59623C745510n1214m3278l7316l3189l0506k9046k9045l0857l4407l9242m5024
$$ 3745510 3694296 3651018 3613702 3580513 3550007 3520961 3491916 3461059 3426652 3387410 3342386
59612C342386n1416n7615o2737o6791p0436p3476p4483p2532o8611o4485o0714
$$ 3342386 3290970 3233355 3170618 3103827 3033391 2959915 2885432 2812900 2744289 2679804 2619090
59601B619090n6559n1442m5561l9290l2855k6676k1193j6194j1027n579m80L828
$$ 2619090 2562531 2511089 2465528 2426238 2393383 2366707 2345514 2329320 2318293 2312714 2312234 2316062
59589B316062P545J0832J3422J5295J7140J9424K1440K2001K1019J9753J9390
$$ 2316062 2323607 2334439 2347861 2363156 2380296 2399720 2421160 2443161 2464180 2483933 2503323
59578B503323K0006K1097K2634K5061K8579L2936L7940M3714N0320N7457O4784
$$ 2503323 2523329 2544426 2567060 2592121 2620700 2653636 2691576 2735290 2785610 2843067 2907851
59567B907851P2318Q0303Q8816R7787J07284J17493J28427J39891J51687J63570
$$ 2907851 2980169 3060472 3149288 3247075 3354359 3471852 3600279 3740170 3891857 4055427
59557D055427J75019J85459J94796K03365K11106K17099K20264K20312K17547
$$ 4055427 4230446 4415905 4610701 4814066 5025172 5242271 5462535 5682847 5900394
59548E900394K11942K02943J90454J75534J59574J42822J24165J02577P8583N4209
$$ 5900394 6112336 6315279 6505733 6681267 6840841 6983663 7107828 7210405 7288988 7343197
59538G343197L1714J2585k485j3229j9611k1837k0201j4884n869O934K3323M2463
$$ 7343197 7374911 7387496 7385011 7371782 7352171 7330334 7310133 7295249 7289380 7296314 7319637 7362100
59526G362100O2966Q3459J02751J19124J29818J31960J24218J06936Q0754M5909
$$ 7362100 7425066 7508525 7611276 7730400 7860218 7992178 8116396 8223332 8304086 8349995
59516H349995L311m4659r5104j45825j94860k39525k77080l06186l26774l38554
$$ 8349995 8353306 8308647 8213543 8067718 7872858 7633333 7356253 7050067 6723293 6384739
59506F384739l40706l33344l18480k99033k77279k54326k30448k05646j80299
$$ 6384739 6044033 5710689 5392209 5093176 4815897 4561571 4331123 4125477 3945178
59497C945178j55605j33012j13041r5007p7962o1508m5581l0062j4880j58J4104
$$ 3945178 3789573 3656561 3543520 3448513 3370551 3309043 3263462 3233400 3218520 3218362 3232466
59486C232466K8172M2269N6383P0556Q4926R9345J13272J26286J38468J50043
$$ 3232466 3260638 3302907 3359290 3429846 3514772 3614117 3727389 3853675 3992143 4142186
59476D142186J60916J70588J78316J83144J84135J80612J72111J58155J38439
$$ 4142186 4303102 4473690 4652006 4835150 5019285 5199897 5372008 5530163 5668602
59467E668602J13125Q2661M7530Q742l1630p1199j08509j42817j72697j96084
$$ 5668602 5781727 5864388 5911918 5920660 5889030 5817831 5709322 5566505 5393808 5197724
59457E197724k12068k21728k26621k27231k23445k15756k05224j92821j79482
$$ 5197724 4985656 4763928 4537307 4310076 4086631 3870875 3665651 3472830 3293348
59448C293348j66241j53509j40752j27628j15030j04113r4639q5243p5212o5215
$$ 3293348 3127107 2973598 2832846 2705218 2590188 2486075 2391436 2306193 2230981 2165766
59438B165766n6300m8937m3028l8047l3075k7343k1044j5112j0171o080k565L43
$$ 2165766 2109466 2060529 2017501 1979454 1946379 1919036 1897992 1882880 1872709 1866629 1864064 1864407
59426A864407K670M802P178R885J2703J5333J7489J8995J9783J9655J8255J5678
$$ 1864407 1867077 1871879 1879057 1888942 1901645 1916978 1934467 1953462 1973245 1992900 2011155 2026833
59414B026833J2911J1335J1744J4167J8383K4081L0683L7651M4951N2551N9376
$$ 2026833 2039744 2051079 2062823 2076990 2095373 2119454 2150137 2187788 2232739 2285290 2344666
59403B344666O3640O4740O4361O5200O8972P5908Q5687R7973J12264J27942J44759
$$ 2344666 2408306 2473046 2537407 2602607 2671579 2747487 2833174 2931147 3043411 3171353 3316112
59392C316112J62879J82295K02634K23743K46053K70009K95420L21702L48478
$$ 3316112 3478991 3661286 3863920 4087663 4333716 4603725 4899145 5220847 5569325
59383E569325L75387M01319M24433M43090M56233M62588M60175M47451M24853
$$ 5569325 5944712 6346031 6770464 7213554 7669787 8132375 8592550 9040001 9464854
59374I464854L94714L59742L22004K83185K44924K08523J74758J44241J17292
$$ 9464854 9859568 10219310 10541314 10824499 11069423 11277946 11452704 11596945 11714237
59365A1714237R3115O9522M4151J5861j5349m9464q6832j27324j69627k11545
$$ 11714237 11807352 11876874 11921025 11936886 11921537 11872073 11785241 11657917 11488290 11276745
59355A1276745k50939k86222l16230l40101l57618l69592l77483l82337l84258
$$ 11276745 11025806 10739584 10423354 10083253 9725635 9356043 8978560 8596223 8211965
59346H211965l82977l78565l71241l60880l47330l31002l12548k92150k69854
$$ 8211965 7828988 7450423 7079182 6718302 6370972 6039970 5727422 5435272 5165418
59337E165418k46598k23928k02598j82244j62601j44064j26714j09873r3316p7989
$$ 5165418 4918820 4694892 4492294 4310050 4147449 4003385 3876671 3766798 3673482 3595493
59327C595493o4623n2412m0145k8096j7560q827p70P485J5557K2663K8600L3557
$$ 3595493 3530870 3478458 3438313 3410217 3392657 3383830 3383060 3390545 3406102 3428765 3457365 3490922
59315C490922L7651M0956M3457M4742M4155M1514L7243L1663K4743J6730Q483
$$ 3490922 3528573 3569529 3612986 3657728 3701883 3743397 3780640 3812303 3837046 3853776 3862259
59304C862259P30o531j3433j9377k3392k5263k5645k4963k2645j7922j1024l036
$$ 3862259 3862989 3856458 3843025 3823648 3800256 3774993 3749348 3724385 3701740 3683818 3672794 3669758
59292C669758N401J4616K5001L6234M7824N9854P2419Q4719R5634J05089J13705
$$ 3669758 3675159 3689775 3714776 3751010 3798834 3858688 3931107 4015826 4111460 4216549 4330254
59281D330254J20895J24297J21779J13291J00366Q4548O7040M9079L1651J4939
$$ 4330254 4451149 4575446 4697225 4810516 4910882 4995430 5062470 5111549 5143200 5158139
59271E158139j182j6325k9704m0780m9308n5120n8488o0340o1462o1751o0895
$$ 5158139 5156957 5140632 5110928 5070148 5020840 4965720 4907232 4846892 4785430 4723679 4662784
59260D662784n9471n8566n8574n9171o0220o1815o3524o4584o4944o5281o5738
$$ 4662784 4603313 4544747 4486173 4427002 4366782 4304967 4241443 4176859 4111915 4046634 3980896
59249C980896o5433o3524o0070n5409m9282m1088l0723j8787o019P320K1610L7454
$$ 3980896 3915463 3851939 3791869 3736460 3687178 3646090 3615367 3596580 3590561 3597881 3619491 3656945
59237C656945N4968P3624R3019J13477J35465J58596J81807K04441K26525K47953
$$ 3656945 3711913 3785537 3878556 3992033 4127498 4286094 4467901 4672342 4898867 5146820
59227E146820K67831K84723K96919L02423K99215K85849K61610K26157J79692
$$ 5146820 5414651 5699374 5996293 6298716 6597931 6883780 7145390 7371547 7551239
59218G551239J23624O0619o364p4786j42157k05395k61014l06022l38627l58365
$$ 7551239 7674863 7735482 7729118 7654332 7512175 7306780 7045766 6739744 6401117 6042752
59208F042752l65868l62613l50721l32624l10480k85739k59453k32929k07598
$$ 6042752 5676884 5314271 4963550 4630926 4320446 4034707 3775254 3542325 3334727
59199C334727j84147j62476j42735j25693j11606r9418q7970p7417o8639o1643
$$ 3334727 3150580 2988104 2845369 2719676 2608070 2508652 2420682 2343265 2274626 2212983
59189B212983n5501m9584m3814l7919l1547k5156j9699j5269j1001o507k421Q13
$$ 2212983 2157482 2107898 2064084 2026165 1994618 1969462 1949763 1934494 1923493 1916986 1914565 1915378
59177A915378L784P237J1087J4783J8042K0865K3345K5895K9135L3138L7199M0628
$$ 1915378 1919162 1926399 1937486 1952269 1970311 1991176 2014521 2040416 2069551 2102689 2139888 2180516
59165B180516M3413M5926M8511N1458N4862N8205O0604O1704O1809O1010N8882
$$ 2180516 2223929 2269855 2318366 2369824 2424686 2482891 2543495 2605199 2667008 2728018 2786900
59154B786900N5258N0638M5381L9190L1779K3509J4888O012k988j1478j8850k5118
$$ 2786900 2842158 2892796 2938177 2977367 3009146 3032655 3047543 3053555 3050567 3039089 3020239 2995121
59142B995121l0458l4571l6982l7687l6937l4706l0891k5838k0154j4114p652
$$ 2995121 2964663 2930092 2893110 2855423 2818486 2783780 2752889 2727051 2706897 2692783 2685131
59131B685131p25O697J4794K3652L2992M2438N1920O1527P1207Q0953R1036J01556
$$ 2685131 2684406 2691103 2705897 2729549 2762541 2804979 2856899 2918426 2989633 3070586 3161622 3263178
59119C263178J11899J21193J29261J36738J44110J51005J56617J60597J63305
$$ 3263178 3375077 3496270 3625531 3762269 3906379 4057384 4214001 4374598 4537903
59110D537903J65282J66711J67414J67114J65451J61756J55130J44846J30393
$$ 4537903 4703185 4869896 5037310 5204424 5369875 5531631 5686761 5831607 5962000
59101E962000J11009Q5645N3799J6315k4928o7838j10310j50022j84792k13248
$$ 5962000 6073009 6158654 6212453 6228768 6203840 6136002 6025692 5875670 5690878 5477630
59091E477630k34853k49413k57013k58326k54447k46438k35347k22387k08521
$$ 5477630 5242777 4993364 4736351 4478025 4223578 3977140 3741793 3519406 3310885
59082C310885j94062j79269j65035j52254j40700j29439j18333j08179r9358r1332
$$ 3310885 3116823 2937554 2772519 2620265 2479565 2350126 2231793 2123614 2024256 1932924
59072A932924q3655p6563p0209o4245n8515n3414m9094m5065m1011l7269l4077
$$ 1932924 1849269 1772706 1702497 1638252 1579737 1526323 1477229 1432164 1391153 1353884 1319807
59061A319807l1005k7604k4053k0745j7861j5692j4609j4181j3114j0803q329
$$ 1319807 1288802 1261198 1237145 1216400 1198539 1182847 1168238 1154057 1140943 1130140 1121811
59050A121811p184p395p626o833n242l851l390l610l311j397J855N052P286Q969
$$ 1121811 1114627 1107232 1099606 1092773 1087531 1083680 1080290 1076680 1073369 1071972 1073827 1078879 1086165 1095134
59036A095134J0911J3227J5561J7595J8953J9250J8705J8037J7306J5674J2851
$$ 1095134 1106045 1119272 1134833 1152428 1171381 1190631 1209336 1227373 1244679 1260353 1273204
59025A273204R945Q080O943N601M101L242L248L636M086M563M794M483L936L721
$$ 1273204 1283149 1291229 1298172 1303773 1307874 1311116 1314364 1318000 1322086 1326649 1331443 1335926 1339862 1343583
59011A343583L858L981L961L759K955J191j171l489n591p428q491q502q279q785
$$ 1343583 1347441 1351422 1355383 1359142 1362097 1363288 1362117 1358628 1353037 1345609 1337118 1328616 1320337 1311552
58997A311552r527r106p346n608m745l971k336l00J006J425J794K637L591M186
$$ 1311552 1302025 1292919 1285573 1279965 1275220 1271249 1268913 1268613 1269619 1271044 1272838 1275475 1279066 1283252
58983A283252M545N091N864O467O657O744P256Q359R775J1188J2466J3540J4485
$$ 1283252 1287797 1292888 1298752 1305219 1311876 1318620 1325876 1334235 1344010 1355198 1367664 1381204 1395689
58970A395689J5712J7646K0145K2599K4682K6574K8378K9925L1203L2354L3059
$$ 1395689 1411401 1429047 1449192 1471791 1496473 1523047 1551425 1581350 1612553 1644907 1677966
58959A677966L2624L1088K9471K8589K8224K7883K7631K7721K8140K9123L1329
$$ 1677966 1710590 1741678 1771149 1799738 1827962 1855845 1883476 1911197 1939337 1968460 1999789
58948A999789L4864L8845M2681M6946N2265N8027O3254O8011P2911P7901Q2762
$$ 1999789 2034653 2073498 2116179 2163125 2215390 2273417 2336671 2404682 2477593 2555494 2638256
58937B638256Q8291R5586J04496J13968J23732J34441J46322J59060J72939J88737
$$ 2638256 2726547 2822133 2926629 3040597 3164329 3298770 3445092 3604152 3777091 3965828
58927C965828K06272K24384K42674K62180K83796L07030L30809L54749L79183
$$ 3965828 4172100 4396484 4639158 4901338 5185134 5492164 5822973 6177722 6556905
58918F556905M04418M30297M56000M80096N01316N19186N33304N42093N43072
$$ 6556905 6961323 7391620 7847620 8327716 8829032 9348218 9881522 10423615 10966687
58909A0966687N34231N14228M81293M33320L69553K91344K01076J01482l463j08191
$$ 10966687 11500918 12015146 12496439 12929759 13299312 13590656 13791732 13893214 13889751 13781560
58899A3781560k07250k96876l74416m37070m82445n10233n22502n22297n12466
$$ 13781560 13574310 13277434 12903018 12465948 11983503 11473270 10950768 10428471 9916005
58890I916005m95765m75466m55255m38091m24737m13264m00421l83811l62995
$$ 9916005 9420240 8944774 8489519 8051428 7626691 7213427 6813006 6429195 6066200
58881F066200l38907l12991k86887k62171k39703k19356k00582j83104j66941
$$ 6066200 5727293 5414302 5127415 4865244 4625541 4406185 4205603 4022499 3855558
58872C855558j52102j38539j26236j15168j05176r5959q7158p8576p0407o3073
$$ 3855558 3703456 3564917 3438681 3323513 3218337 3122378 3035220 2956644 2886237 2823164
58862B823164n6651n0733m5037l9742l4898k9989k4668j9482j5070j0947n969
$$ 2823164 2766513 2715780 2670743 2631001 2596103 2566114 2541446 2521964 2506894 2495947 2489978
58851B489978K8O028J1215J5797K0291K4851K9608L4861M0560M6181N1470N6814
$$ 2489978 2490006 2496034 2507249 2523046 2543337 2568188 2597796 2632657 2673217 2719398 2770868 2827682
58839B827682O2634O8878P5387Q2274Q9628R7336J05482J14500J24684J35938
$$ 2827682 2890316 2959194 3034581 3116855 3206483 3303819 3409301 3523801 3648485 3784423
58829C784423J48172J61522J75968J91244K07412K25094K44732K65964K88098
$$ 3784423 3932595 4094117 4270085 4461329 4668741 4893835 5138567 5404531 5692629
58820E692629L10958L34897L60049L85899M11559M36226M59309M80110M97472
$$ 5692629 6003587 6338484 6698533 7084432 7495991 7932217 8391526 8871636 9369108
58811I369108N09766N15135N11506M96532M68214M25870L70043L01233K19507
$$ 9369108 9878874 10394009 10905515 11402047 11870261 12296131 12666174 12967407 13186914
58802A3186914J26062K4652p9304j80636k74846l57501m24845m75315n09520n28646
$$ 13186914 13312976 13337628 13258324 13077688 12802842 12445341 12020496 11545181 11035661 10507015
58792A0507015n33674n26201n08842m84280m54445m20884l85137l48290l10550
$$ 10507015 9973341 9447140 8938298 8454018 7999573 7578689 7193552 6845262 6534712
58783F534712k71532k30910j89114j48095j11496q3573o8079o8352q7183j24252
$$ 6534712 6263180 6032270 5843156 5695061 5583565 5499992 5431913 5363561 5276378 5152126
58773E152126j73091k22011k59600k79801k82693k72097k53059k30149k06269
$$ 5152126 4979035 4757024 4497424 4217623 3934930 3662833 3409774 3179625 2973356
58764B973356j82609j59811j38812j20429j04727r1184p9163o8137n7980m9217
$$ 2973356 2790747 2630936 2492124 2371695 2266968 2175784 2096621 2028484 1970504 1921287
58754A921287m2422l7291l2879k8812k5501k3066k0946j8908j7577j7556j8701
$$ 1921287 1878865 1841574 1808695 1779883 1754382 1731316 1710370 1691462 1673885 1656329 1637628
58743A637628k0586k2952k5339k7113k8320k9756l1723l3401l3940l3480l2500
$$ 1637628 1617042 1594090 1568751 1541638 1513318 1483562 1451839 1418438 1384498 1351018 1318518
58732A318518l0926k8581k5978k3900k2532k1571k0796k0134j9483j8935j8782
$$ 1318518 1287592 1259011 1233033 1209133 1186601 1165030 1144234 1124100 1104617 1085682 1066900
58721A066900j8888j8507j7194j5432j3951j2836j1800j0838j0075r358q548p890
$$ 1066900 1048012 1029505 1012311 996879 982928 970092 958292 947454 937379 928021 919473 911583
58709I11583p630p517p245p025p228p605p429o426n196m604m907n507n556m814
$$ 911583 903953 896436 889191 882166 874938 867333 859904 853478 848282 843678 838771 833264 827708 822894
58695H22894l836l137k486j305M80K498M588O820R060J1196J3531J6336J9173
$$ 822894 819058 815921 813435 812130 812610 815108 819696 826516 835576 846772 860303 876639 895812
58682H95812K1576K4178K8166L3564L9140M4034M8566N3352N8738O5307P3836
$$ 895812 917388 941566 969732 1003296 1042436 1086470 1135036 1188388 1247126 1312433 1386269
58671A386269Q4469R6849J11050J26975J42436J53008J54022J41628J12352O4633
$$ 1386269 1470738 1567587 1678637 1805612 1948048 2101056 2255078 2396706 2509058 2573691
58661B573691K748o2227j17443j54666j72148j72643j61355j44319j26030j08036
$$ 2573691 2576439 2514212 2396769 2242103 2069955 1897312 1735957 1591638 1465608 1357572
58651A357572r0460p4211o0564m9400l9488l0407k2806j6868j1765o756j911K425
$$ 1357572 1267112 1192901 1132337 1082937 1043449 1013042 990236 973368 961603 954847 952936 955361
58639I55361O103R179J2028J5368J9558K4018K7938L1374L5101L9597M4790N0558
$$ 955361 961464 970643 982671 998039 1017597 1041615 1069553 1100927 1136028 1175625 1220415 1270973
58627A270973N6845O3463P0259P7380Q4982R2970J01299J10081J19070J27542
$$ 1270973 1327818 1391281 1461540 1538920 1623902 1716872 1818171 1928252 2047322 2174864
58617B174864J35148J42255J48933J54168J56634J55576J50313J39573J22270
$$ 2174864 2310012 2452267 2601200 2755368 2912002 3067578 3217891 3357464 3479734
58608C479734R8580O9699L7053K390l1915o3611r1316j14044j30633j40535j44748
$$ 3479734 3578314 3648013 3685066 3687456 3655541 3591930 3500614 3386570 3255937 3115402 2970654
58597B970654j45084j42741j38124j31592j23687j14989j06318r8662r2286q6387
$$ 2970654 2825570 2682829 2544705 2413113 2289426 2174437 2068119 1969457 1877171 1790784
58587A790784q0122p3508o6837o0052n3263m7122m1883l6822l1381k6108k1691
$$ 1790784 1710662 1637154 1570317 1510265 1457002 1409880 1367997 1331175 1299794 1273686 1251995
58576A251995j7880j4241j1081q693o512m094k005o56P37K685M004L528K434K933
$$ 1251995 1234115 1219874 1208793 1200100 1193588 1189494 1187489 1186833 1187570 1190255 1194259 1197787 1200221 1203154
58562A203154N111P017P795Q833J1698J6565K2863K9844L5977L9039L7318L0069
$$ 1203154 1208265 1215282 1223077 1231910 1243608 1260173 1283036 1312880 1348857 1387896 1425214 1455283
58550A455283J7039j046k1273l9320n2064n8934o0792n8687n3908m7968m1835
$$ 1455283 1472322 1471276 1450003 1410683 1358619 1299685 1238893 1180206 1126298 1078330 1036495
58539A036495l5759l0010k5096k1189j8113j5948j4846j4343j3708j3058j3125
$$ 1036495 1000736 970726 945630 924441 906328 890380 875534 861191 847483 834425 821300
58528H21300j3959j4781j5236j5724j6339j6490j5885j4962j4028j2795j1102
$$ 821300 807341 792560 777324 761600 745261 728771 712886 697924 683896 671101 659999
58517F59999r318p689n995m239l074l057l872m598m553l773k893k570k797k932
$$ 659999 650681 642992 636997 632758 629684 626627 622755 618157 613604 609831 606938 604368 601571 598639
58503E98639k534j843j205n21L58J226K017L051M222M661L961L002K725K738K212
$$ 598639 596105 594262 593057 592536 592894 594120 596137 599188 603410 608071 612032 615034 617759 620497 622709
58488F22709J388J043J022O53K25O49J889K952L361L562L971M601N394O045N827
$$ 622709 624097 625140 626162 626815 627040 627689 629578 632530 635891 639453 643424 648025 653419 659464 665291
58473F65291M580L342K891K320M58k009l519m224n650p899r203q644p439p005
$$ 665291 669871 673213 676104 678424 678882 676873 673354 669130 663480 655581 646378 637734 630295 623290
58459F23290p247p338p009o338n328m219l427k925k420k078k184k224j379R8J181
$$ 623290 616043 608705 601696 595358 590030 585811 582384 579459 577039 574961 572777 570553 569174 569272 570453
58444E70453J669K248L074L564L627L788L976L506K364J319O65K3n75o39k08K86
$$ 570453 572122 574370 577444 581008 584635 588423 592399 595905 598269 599588 600253 600276 599701 599062 598854 599140
58428E99140J073K613M271M914M771N121O170O868O896P138P995Q918R757J0930
$$ 599140 600213 602826 607097 612011 616782 621903 628073 634941 641837 648975 656970 665888 675645 686575
58414F86575J2004J1925J0944J0470J0623R774P106L777R46j583m007n605o136
$$ 686575 698579 710504 721448 731918 742541 752315 759421 763198 764144 762561 758554 752949 746813
58401G46813o509p155p206o222n170m732m117k638j117n90p07n53q2L03P32J500
$$ 746813 740304 733149 725943 719721 714551 709819 705702 703064 701947 701357 700650 700097 700015 700318 701050 702550
58385G02550K438L290M048M468M098L174K519K317K042J814K497M053N165N060
$$ 702550 704988 708278 712326 716794 720892 724066 726585 728902 730944 732758 735255 739308 744473 749533
58371G49533M491M458N079O160P559Q622Q484P367O377N901N426N069N587O699
$$ 749533 754024 758482 763561 769721 777280 785902 794386 801753 808130 814031 819457 824526 830113 836812
58357H36812P167O831O800P269P063N787M494L679K597J258R14J821K555K539
$$ 836812 843979 850810 857610 864879 871942 877729 882223 885902 888499 889757 890671 892492 895047 897586
58343H97586L113M988O693O814O033N654N838O493Q199J0929J3282J4214J4139
$$ 897586 900699 905687 912380 919194 925227 930881 936719 943212 951411 962340 975622 989836 1003975
58330A003975J3541J2216J0758J0752J2320J3412J2840J2190J3257J5395J6821
$$ 1003975 1017516 1029732 1040490 1051242 1063562 1076974 1089814 1102004 1115261 1130656 1147477
58319A147477J6942J5995J4044J1790J0818J1560J2394J2007J1172J1012J1222
$$ 1147477 1164419 1180414 1194458 1206248 1217066 1228626 1241020 1253027 1264199 1275211 1286433
58308A286433J1262J1656J2770J3845J4506J5623J7516J9029J9563K0177K1518
$$ 1286433 1297695 1309351 1322121 1335966 1350472 1366095 1383611 1402640 1422203 1442380 1463898
58297A463898K2550K2655K2987K4355K5687K6056K6296K7205K8089K8529K9555
$$ 1463898 1486448 1509103 1532090 1556445 1582132 1608188 1634484 1661689 1689778 1718307 1747862
58286A747862L1618L3330L3821L4316L6002L8244M0211M2191M3994M4367M3297
$$ 1747862 1779480 1812810 1846631 1880947 1916949 1955193 1995404 2037595 2081589 2125956 2169253
58275B169253M2572M2772M2390M1150M1196M3355M5333M5514M5542M7059M8940
$$ 2169253 2211825 2254597 2296987 2338137 2379333 2422688 2468021 2513535 2559077 2606136 2655076
58264B655076M9970N1216N3544N5727N7230N9854O4303O8346P0723P3521P8230
$$ 2655076 2705046 2756262 2809806 2865533 2922763 2982617 3046920 3115266 3185989 3259510 3337740
58253C337740Q3011Q6439R0316R5893J01109J04612J08706J15063J21392J25777
$$ 3337740 3420751 3507190 3597506 3693399 3794508 3899120 4007826 4122889 4244281 4370058
58243D370058J30396J37339J44753J50950J58210J68478J79378J88635J98344
$$ 4370058 4500454 4637793 4782546 4933496 5091706 5260184 5439562 5628197 5826541
58234E826541K10702K23809K36109K50269K68151K86731L03841L23000L47371
$$ 5826541 6037243 6261052 6497161 6747430 7015581 7302312 7606153 7929153 8276524
58225H276524L74355M01515M32122M68898N08387N48167N93491O49607P13916
$$ 8276524 8650879 9052394 9484516 9953414 10461801 11009968 11603459 12253066 12966982
58216A2966982P83274Q62511R57586J067367J191196J337779J517504J733679
$$ 12966982 13750256 14612767 15570353 16637720 17828916 19166695 20684199 22417878
58208B2417878J991066K304345K687422L143890L679531M311581N048833N871943
$$ 22417878 24408944 26713289 29400711 32544601 36224132 40535713 45584546 51456489
58200E1456489O749792P667005Q624403R633784J0737454J2018589J3570558J5478134
$$ 51456489 58206281 65873286 74497689 84131473 94868927 106887516 120458074 135936208
58192A35936208J7848170K0794429K4286362K7976574L1188908L3018879L2377263
$$ 135936208 153784378 174578807 198865169 226841743 258030651 291049530 323426793
58185C23426793K8097754J9448479O945913p298507k0317936k9701103l4560965
$$ 323426793 351524547 370973026 377918939 370620432 350302496 320601393 286040428
58178B86040428l5441732l3562383l0145202k6128818k2118867j8424432j5155410
$$ 286040428 250598696 217036313 186891111 160762293 138643426 120218994 105063584
58171A05063584j2330322r918542p842603o018040m409667l028032j892879j054851
$$ 105063584 92733262 82814720 74972117 68954077 64544410 61516378 59623499 58568648
58163E8568648o46649q29022j617425k768582l877444m606846m841754m667518
$$ 58568648 57921999 57092977 55475552 52706970 48829526 44222680 39380926 34713408
58155C4713408m248016l726519l195169k704922k279397j922895j628319j386177
$$ 34713408 30465392 26738873 23543704 20838782 18559385 16636490 15008171 13621994
58147A3621994j188612j027399q92911p77813o79381n96389n26182m66894m19252
$$ 13621994 12433382 11405983 10513072 9735259 9055878 8459489 7933307 7466413 7047161
58138G047161l83041l54301l28995l06964k89160k73524k57113k40102k24074
$$ 7047161 6664120 6309819 5980824 5673860 5384700 5111176 4854063 4613961 4389887
58129D389887k08275j91043j73316j57194j42603j28515j15954j06581r9901r4849
$$ 4389887 4181612 3990569 3817253 3660059 3517456 3388941 3272987 3166406 3066505 2971656
58119B971656r2508r3938r6805r7446r5151r1490q6899q1088p5373p1281o7848
$$ 2971656 2879148 2785210 2688405 2590959 2495808 2404318 2317419 2236331 2160958 2089677 2021829
58108B021829o3319n8438n5076n2702m9322m5022m1538l9079l6476l3873l2454
$$ 2021829 1958510 1900072 1844996 1792294 1742972 1697950 1656412 1617333 1580857 1546984 1514530
58097A514530l2005l1257l0156k9483k9021k8282k8094k9089k9663k7963k4851
$$ 1514530 1482525 1451268 1421112 1391629 1362608 1334326 1306232 1277143 1247480 1219517 1194666
58086A194666k2463k0938j9275j8179j8983k0525k0338j8509j7341j7470j7312
$$ 1194666 1172203 1151265 1131990 1113811 1094828 1074303 1053965 1035456 1018115 1000645 983333
58075I83333j6240j5388j5092j4255j2574j1065j0122r124q182q083q431p886
$$ 983333 967093 951705 936613 922358 909784 898719 888597 879473 871291 863208 854777 846891
58063H46891o406n307m987m532l707l390l865m421m821n470o195o413o480p148
$$ 846891 840485 835178 830191 825659 821952 818562 814697 810276 805455 799985 793790 787377 780897 773749
58049G73749p818p051m814k533j015O5P65P15L93P49J605J965J846K123K721K713
$$ 773749 765931 758880 754066 751533 750518 750583 751348 752063 752456 753205 754810 756775 758621 760744 763465 766178
58033G66178K113J818J745R17o54j986l080m896p164q288p880p525q334r456r736
$$ 766178 768291 770109 771854 772771 772117 770131 767051 762155 754991 746703 738823 731298 722964 713508 703772
58018G03772r276q658p915p092o638o503n884m485l105k424k066j371k99Q38J823
$$ 703772 694496 685838 677923 670831 664193 657690 651806 647321 644216 641792 639726 638355 638056 638894 640717
58003F40717K434K520K333K232K003J170j40j343k223k896l166k822k266j957
$$ 640717 643151 645671 648004 650236 652239 653409 653269 651926 649703 646807 643641 640819 638553 636596
57989F36596j562n98M75R12R51J233J365M82j060k025k162k318k775l007k943
$$ 636596 635034 634436 634911 635823 636774 638007 639372 639854 638794 636769 634607 632289 629514 626507 623564
57974F23564l097l367l166k693k606k493j310O23J754J646J437J639J314Oj247
$$ 623564 620467 617100 613934 611241 608635 606142 604832 605455 607209 608855 610292 611931 613245 613251 612004
57959F12004j692k071l140m274m561m148l575k705j242M25J685K443K798K660
$$ 612004 610312 608241 605101 600827 596266 592118 588543 585838 584596 585021 586706 589149 591947 594607
57945E94607K082J337L92r65k312k876k911l666n538p355q056q004q078q385q600
$$ 594607 596689 598026 598418 597453 595141 592265 589354 585688 580150 572795 564739 556735 548657 540272 531672
57930E31672q718q733q289p277o179n313m357l090j867r51J5J319K643L620M307
$$ 531672 522954 514221 505932 498655 492476 487163 482806 479716 477849 476898 476913 478232 480875 484495 488802
57915D88802M777M903M863N125N664N944N944O302P079P317O312M499K663J051
$$ 488802 493579 498482 503345 508470 514134 520078 526022 532324 539403 546720 553032 557531 560194 561245
57901E61245l32j466k761m747o914p919p512p103p637q139p362n857n093n296
$$ 561245 560913 559447 556686 551939 545025 537106 529594 522491 514854 506715 499353 493496 488403 483107
57887D83107n445m955m128l180j953m97R05K256L668M863N503N836O382P139P785
$$ 483107 477662 472707 468579 465399 463446 462949 463854 466110 469778 474641 480144 485980 492362 499501 507286
57872E07286Q315Q856Q980Q099O439M994M305L854K781Q49j453l427m689n359
$$ 507286 515601 524457 533437 541536 547975 552969 557274 561128 563909 564758 563305 559878 555189 549830
57858E49830n812o258o683p111p655q169q209p573o608n874n647n799n870n305
$$ 549830 544018 537760 531077 523966 516311 508142 499933 492360 485752 479878 474231 468432 462562 457257
57844D57257m031k772k334k666l083l343l745m241m316l952l838m242m594m622
$$ 457257 453226 450454 448120 445454 442371 439028 435283 431042 426726 422774 418936 414694 410100 405478
57830D05478m979o166p587q382q532q433q040p187o278n772n364m467l209k220
$$ 405478 400499 394333 386746 378364 369832 361399 353359 346172 339894 334122 328758 324291 321082 318862
57816C18862j654j105l82L13Q57J354J904K561L347M011M140L904M205N566P265
$$ 318862 317208 316103 315721 316034 316891 318245 320149 322710 326057 330068 334208 338112 342317 347883 355148
57801C55148Q144P943P260O557N970N814O426P521Q348Q495Q129P473O602N583
$$ 355148 363292 371235 378495 385052 391022 396836 403262 410783 419131 427626 435755 443228 449830 455413
57787D55413M385K720M55j929l829n349p128r340j1352j2355j2010j0581q802
$$ 455413 459798 462518 462973 461044 457215 451866 444738 435398 424046 411691 399681 389100 380298
57774C80298p439o631n787m538l348k750k338j354J7Q49R53J122J791K349K178
$$ 380298 372859 366228 360441 355903 352555 349805 347467 346113 346130 346979 347932 349054 350845 353194 355372
57759C55372J713J825K777M147N397O065N811M836L982L924M414M694M439L946
$$ 355372 357085 358910 361687 365834 371231 377296 383107 387943 391925 395849 400263 404957 409396 413342
57745D13342L519L244L225L584M037M028L472L053L372M111M409M043L777M417
$$ 413342 416861 420105 423330 426914 430951 434979 438451 441504 444876 448987 453396 457439 461216 465633
57731D65633N837P225Q044Q505R087R959J0868J1511J1846J2127J2652J3472J4413
$$ 465633 471470 478695 486739 495244 504331 514290 525158 536669 548515 560642 573294 586766 601179
57718F01179J5339J6261J7166J7985J8834K0013K1543K3066K4555K6760L0343
$$ 601179 616518 632779 649945 667930 686764 706777 728320 751386 775941 802701 833044
57707H33044L4822L8983M2444M6124N1030N7135O3666P0029P6138Q2303Q9118
$$ 833044 867866 906849 949293 995417 1046447 1103582 1167248 1237277 1313415 1395718 1484836
57696A484836R7074J06004J15210J24356J33841J43847J53419J60965J65321J65945
$$ 1484836 1581910 1687914 1803124 1927480 2061321 2205168 2358587 2519552 2684873 2850818
57686B850818J62245J53414J38893J18654R3088O3248L1315M18k6458m7364o1301
$$ 2850818 3013063 3166477 3305370 3424024 3517112 3580360 3611675 3612093 3585635 3538271 3476970
57675C476970o7542o5422n4896l7213j4974Q451K9215M2526M2387K3217j6510
$$ 3476970 3409428 3344006 3289110 3251897 3236923 3245374 3274589 3317115 3359502 3382719 3366209
57664C366209p1260j29233j77276k06649k15650k08052j89691j66058j41462j18620
$$ 3366209 3294949 3165716 2988440 2781791 2566141 2358089 2168398 2002340 1860878 1742258
57654A742258r8359q0211o3793m9400l7264k6950j7878r836k498M978J3048K1049
$$ 1742258 1643899 1563688 1499895 1450495 1413231 1386281 1368403 1358567 1356069 1361047 1374095 1395144
57642A395144K8198L4955M2399N0570N8541O6040P3841Q2347R0941R9091J07002
$$ 1395144 1423342 1458297 1500696 1551266 1609807 1675847 1749688 1832035 1922976 2022067 2129069
57631B129069J14790J21862J27587J31603J32971J30018J21634J08010Q9493O5736
$$ 2129069 2243859 2365721 2493308 2624911 2757882 2887900 3009534 3117544 3207037 3272773
57621C272773L6855M644k8294o0058q9218j13858j32148j43781j49912j51644
$$ 3272773 3309628 3314272 3285978 3225920 3136702 3022844 2890696 2746915 2597003 2445359
57611B445359j49400j43674j35515j26026j15953j05820r6080q7048p8960p1987
$$ 2445359 2295959 2152285 2016770 1890744 1774791 1668971 1572891 1485843 1406883 1334896
57601A334896o5955o0316n4716m9302m4263l9493l5090l1628k9317k7410k5048
$$ 1334896 1268941 1208625 1153909 1104607 1060344 1020851 985761 954133 924816 897406 872358
57590H72358k2331j9874j7756j5656j3703j2329j1480j0759j0133r748r244q100
$$ 872358 850027 830153 812397 796741 783038 770709 759229 748470 738337 728589 719345 711245
57578G11245o554n313m415l230j697o09m58p29n58M47K151M014N211N330N146
$$ 711245 704691 699378 694963 691733 690036 689427 688969 688240 687682 688129 690280 694294 699505 704835 709981
57563G09981O008Q209J0550J1850J2283J2920J4437J6665J9015K1011K2652K4460
$$ 709981 715989 724198 734748 746598 758881 771801 786238 802903 821918 842929 865581 890041
57551H90041K6981L0203L3692L7249M1038M5128M9400N3960N9092O4727P0464
$$ 890041 917022 947225 980917 1018166 1059204 1104332 1153732 1207692 1266784 1331511 1401975
57540A401975P6202Q2171Q8223R3715R8296J02251J05648J07721J07366J03882
$$ 1401975 1478177 1560348 1648571 1742286 1840582 1942833 2048481 2156202 2263568 2367450
57530B367450R6827Q5682P0079N0247K6919J231k5119n0047p1883q9838j03398
$$ 2367450 2464277 2549959 2620038 2670285 2697204 2698435 2673316 2623269 2551386 2461548 2358150
57519B358150j11779j14557j12627j07957j02197r5831q8644q0634p2334o4436
$$ 2358150 2246371 2131814 2019187 1911230 1809033 1713202 1624558 1543924 1471590 1407154
57509A407154n7304n0828m4706l8802l3213k8108k3594j9695j6245j2860r224
$$ 1407154 1349850 1299022 1254316 1215514 1182301 1154193 1130599 1110904 1094659 1081799 1072575
57498A072575n418j824J366M355P436J0687J4008J7271K0423K3518K6716L0125
$$ 1072575 1067157 1065333 1066699 1071054 1078490 1089177 1103185 1120456 1140879 1164397 1191113 1221238
57486A221238L3777L7794M2425M7692N3202N8619O4131P0052P6123Q1701Q6657
$$ 1221238 1255015 1292809 1335234 1382926 1436128 1494747 1558878 1628930 1705053 1786754 1873411
57475A873411R1517R6530J00919J03276J02414R7690Q8786P5517N7951L6577J2352
$$ 1873411 1964928 2061458 2162377 2265653 2368067 2465757 2554543 2630060 2688011 2724588 2736940
57464B736940j3474l9530o4179q5419j01523j12085j17996j20127j18522j13327
$$ 2736940 2723466 2683936 2619757 2534338 2432815 2320730 2202734 2082607 1964085 1850758
57454A850758j05894r8045r0559q3096p5487o8103o1048n4009m7129m1203l6589
$$ 1850758 1744864 1646819 1556260 1473164 1397677 1329574 1268526 1214517 1167388 1126185 1089596
57443A089596l2676k8771k4913k1473j8489j5862j3676j1938j0446r153q307p883
$$ 1089596 1056920 1028149 1003236 981763 963274 947412 933736 921798 911352 902199 893892 886009
57431H86009p368o372n064l734k447j369q35p66n46N8M55J93j56K34J255K098
$$ 886009 878641 872269 867205 863471 861024 859655 858820 858054 857508 857566 858021 858214 858058 858292 859547 861645
57415H61645K455K766L421M322N212N931O325O333O165O120O238O405O625O892
$$ 861645 864100 866866 870287 874609 879821 885752 892077 898410 904575 910695 916933 923338 929963 936855
57401I36855O952O618O206O341P285Q640R693R881R142Q053P474P808Q669R453
$$ 936855 943807 950425 956631 962972 970257 978897 988590 998471 1007613 1015666 1023140 1030948 1039617 1049070
57387A049070R989J0387J0606J0516J0199R868R540R102Q699Q705R400J0668J2013
$$ 1049070 1059059 1069446 1080052 1090568 1100767 1110635 1120175 1129277 1137976 1146681 1156081 1166749 1178762
57374A178762J2780J2685J2233J2258J2899J3435J3333J2950J2857J2959J2834
$$ 1178762 1191542 1204227 1216460 1228718 1241617 1255052 1268385 1281335 1294192 1307151 1319985
57363A319985J2537J2410J2341J2018J1686J1992J2939J3755J3894J3710J3910
$$ 1319985 1332522 1344932 1357273 1369291 1380977 1392969 1405908 1419663 1433557 1447267 1461177
57352A461177J4767J6089J7528J8648J8971J8301J7008J5924J5891J7196J9224
$$ 1461177 1475944 1492033 1509561 1528209 1547180 1565481 1582489 1598413 1614304 1631500 1650724
57341A650724K0801K1250K1005K0956K1298K1471K1176K0884K1160K1963K2870
$$ 1650724 1671525 1692775 1713780 1734736 1756034 1777505 1798681 1819565 1840725 1862688 1885558
57330A885558K3649K4239K4436K4010K3155K2530K2771K3923K5452K6720K7474
$$ 1885558 1909207 1933446 1957882 1981892 2005047 2027577 2050348 2074271 2099723 2126443 2153917
57319B153917K7874K8136K8342K8583K9063K9940L1120L2403L3656L4706L5317
$$ 2153917 2181791 2209927 2238269 2266852 2295915 2325855 2356975 2389378 2423034 2457740 2493057
57308B493057L5548L6009L7313L9275M0969M1756M1964M2448M3601M5075M6290
$$ 2493057 2528605 2564614 2601927 2641202 2682171 2723927 2765891 2808339 2851940 2897015 2943305
57297B943305M6987M7294M7405M7459M7585M7885M8207M8164M7491M6334M4928
$$ 2943305 2990292 3037586 3084991 3132450 3180035 3227920 3276127 3324291 3371782 3418116 3463044
57286C463044M3139M0586L7164L3159K8867K4547K0716J8008J6537J5828J5507
$$ 3463044 3506183 3546769 3583933 3617092 3645959 3670506 3691222 3709230 3725767 3741595 3757102
57275C757102J5663J6407J7593J9226K1578K4508K7146K8799K9764L0742L1842
$$ 3757102 3772765 3789172 3806765 3825991 3847569 3872077 3899223 3928022 3957786 3988528 4020370
57264D020370L2782L3600L4481L5085L4945L4386L4276L4869L5604L6115L6682
$$ 4020370 4053152 4086752 4121233 4156318 4191263 4225649 4259925 4294794 4330398 4366513 4403195
57253D403195L7479L8134L8381L8577L9183M0204M1476M3073M5002M6809M7886
$$ 4403195 4440674 4478808 4517189 4555766 4594949 4635153 4676629 4719702 4764704 4811513 4859399
57242D859399M8043M7510M6654M5874M5509M5456M5092M3872M1951L9975L8403
$$ 4859399 4907442 4954952 5001606 5047480 5092989 5138445 5183537 5227409 5269360 5309335 5347738
57231E347738L7281L6558L6242L6185L5992L5408L4711L4472L4855L5336L5357
$$ 5347738 5385019 5421577 5457819 5494004 5529996 5565404 5600115 5634587 5669442 5704778 5740135
57220E740135L5138L5474L6652L7974L8622L8641L8643L8868L8989L8755L8272
$$ 5740135 5775273 5810747 5847399 5885373 5923995 5962636 6001279 6040147 6079136 6117891 6156163
57209F156163L7656L6882L6097L5676L5754L5967L5784L4989L3803L2674L1854
$$ 6156163 6193819 6230701 6266798 6302474 6338228 6374195 6409979 6444968 6478771 6511445 6543299
57198F543299L1034K9559K7271K4913K3304K2359K1434K0389J9648J9326J9071
$$ 6543299 6574333 6603892 6631163 6656076 6679380 6701739 6723173 6743562 6763210 6782536 6801607
57187F801607J8869J9148J9899K0411K0311K0125K0389K0792K0729K0168J9401
$$ 6801607 6820476 6839624 6859523 6879934 6900245 6920370 6940759 6961551 6982280 7002448 7021849
57176G021849J8431J7252J6273J5748J5040J3239J0388P359M514J256k951p764
$$ 7021849 7040280 7057532 7073805 7089553 7104593 7117832 7128220 7135579 7140093 7141349 7138398 7130634
57164G130634j2478j6855k1079k5209k9033l2366l5223l7719l9853m1372m1847
$$ 7130634 7118156 7101301 7080222 7055013 7025980 6993614 6958391 6920672 6880819 6839447 6797600
57153F797600m1020l9060l6325l2922k8665k3516j7841j2173o914k270J654M780
$$ 6797600 6756580 6717520 6681195 6648273 6619608 6596092 6578251 6566078 6559164 6556894 6558548 6563328
57141F563328O927P732O895M597J458k080o181j1104j6323k0448k2182k1276j8390
$$ 6563328 6570255 6577987 6584882 6589479 6590937 6588857 6582676 6571572 6555249 6534801 6512619 6491343 6472953
57128F472953j4263r221l487K422P746J1841J4327J5186J4970J4888J6358K0419
$$ 6472953 6458690 6449469 6445982 6448404 6456150 6467991 6482318 6497504 6512474 6527362 6543720 6564139
57116F564139K7589L8144N2203O9468Q9186J10597J33400J57924J85289K17787
$$ 6564139 6591728 6629872 6682075 6751543 6840729 6951326 7084726 7242650 7427939 7645726
57106G645726K59032L13308L84368M74648N85564P18424Q75008J057300J266817
$$ 7645726 7904758 8218066 8602434 9077082 9662646 10381070 11256078 12313378 13580195
57097A3580195J504139J768744K059235K374324K714116L079696L469402L873544
$$ 13580195 15084334 16853078 18912313 21286637 24000753 27080449 30549851 34423395
57089C4423395M270714M626277M891776N008163M919225M594263M045103L321105
$$ 34423395 38694109 43320386 48212162 53220325 58139550 62733813 66778916 70100021
57081G0100021K484125J584471O56113k71582j163207j979447k688177l273040
$$ 70100021 72584146 74168617 74824730 74553148 73389941 71410494 68722317 65449277
57073F5449277l732700m073146m300236m417785m430586m347519m181475l947520
$$ 65449277 61716577 57643431 53343195 48925410 44494824 40147305 35965830 32018310
57065C2018310l662088l343152l009178k676585k357842k061565j793400j556168
$$ 32018310 28356222 25013070 22003892 19327307 16969465 14907900 13114500 11558332
57057A1558332j349519j170409j014826q79592p62821o62939n77690n04459m41264
$$ 11558332 10208813 9038404 8023578 7143986 6381165 5718226 5140536 4636077 4194813
57048D194813l86876l39996k99050k62985k31594k04679j81446j61195j43948
$$ 4194813 3807937 3467941 3168891 2905906 2674312 2469633 2288187 2126992 1983044
57039A983044j29758j17760j06713r6235q6810p8743p1778o5631o0140n4962m9764
$$ 1983044 1853286 1735526 1628813 1532578 1445768 1367025 1295247 1229616 1169476 1114514 1064750
57028A064750m4748m0338l6335l2104k7598k3349j9288j4556q911l379J264N918
$$ 1064750 1020002 979664 943329 911225 883627 860278 840990 826434 817523 814144 815408 821326
57016H21326J2075J9902K8583L8409N0986O6886Q4259J00561J14147J22126J17304
$$ 821326 833401 853303 881886 920295 971281 1038167 1122426 1222987 1337134 1459260 1576564
57005A576564R0606L9495k6213q8627j32841j54280j57030j47790j32131j14131
$$ 1576564 1667170 1706665 1680452 1591825 1458984 1304704 1147674 999884 867753 753622
56995G53622r6617q0908o7153n5202m4923l5968k7938k0729j4330q418k725K325
$$ 753622 657005 576097 508944 453742 408819 372851 344913 324184 309854 301436 298711 301036
56983C01036N828P180O194K818k529q442j3088j5575j6242j5669j3954j1141p744
$$ 301036 306864 314044 320238 323056 320527 312085 298997 283422 267180 251511 237557 226416 218672
56970B18672m492j856R7J636L222N112P138R122J1302J3922J6658J8995K0963
$$ 218672 214180 212324 212421 214057 217279 222391 229529 238651 249953 263875 280533 299528 320491
56957C20491K2607K2869J9957J3181L777o265j5437k2593k6643k7170k4975k1460
$$ 320491 343098 365967 385924 399105 402882 396617 381180 358587 331944 304774 279799 258339
56945B58339j7638j3947j0439o792k633J696N192P436R333J2044J5639J9400K2981
$$ 258339 240701 226754 216315 209523 206890 208586 213778 221214 230547 242591 258230 277630 300611
56932C00611K6508K9554L0684K8209K1205J0045l514j6790k7228l3500l5722l4957
$$ 300611 327119 356673 387357 415566 436771 446816 443302 426512 399284 365784 330062 295105
56920B95105l2490k9252k5585k1643j8005j5403j3738j1975r452o816n142m508
$$ 295105 262615 233363 207778 186135 168130 152727 138989 127014 117562 110746 105604 101096
56908A01096m117l470k699j887q25M55J530K195K755L544M523N524O610P882R225
$$ 101096 96979 93509 90810 88923 88098 88553 90083 92278 95033 98577 103100 108624 115234 123116 132341
56893A32341J0388J1298J2136J3161J4490J5990J7331J8093J7710J5523J1218
$$ 132341 142729 154027 166163 179324 193814 209804 227135 245228 262938 278461 289679
56882B89679N388o55n817r688j2073j2652j1530r639p884o140l653l87K786N267
$$ 289679 295067 294412 288595 278907 266834 254182 242652 233013 225129 218989 215336 214949 217735 223002
56868B23002P465J0133J3499J7369K1666K6458L1596L6653M0940M3260M1763L4714
$$ 223002 230467 240600 254099 271468 293134 319592 351188 387841 428781 472041 513804 548518
56856E48518K1925N557j0663k3351l0914l3614l2638k9274k4598j9339j3732p729
$$ 548518 570443 576000 565337 541986 511072 477458 444820 415546 390948 371609 357877 350148
56844C50148j460M677J0411J5874K1427K7459L4415M2576N1556O0212O7157P0891
$$ 350148 348688 353365 363776 379650 401077 428536 462951 505527 557083 617295 684452 755343
56832G55343O9251N9520M0219J3214j6264m2035n9775o8332o9193o4984n7979
$$ 755343 824594 884114 924333 937547 921283 879248 819473 751141 681948 616964 558985
56821E58985m9524m0366l1164k2495j4634p533r69N396J1904J8654K5540L2534
$$ 558985 509461 469095 437931 415436 400802 393269 392300 397696 409600 428254 453794 486328
56809D86328L9618M6184N0656N0841M4708L1265J1551j0992l1726m7093n5746
$$ 486328 525946 572130 622786 673627 718335 749600 761151 750159 718433 671340 615594
56798F15594n7916n4713m8159m0733l3866k7332k0702j4607r796n789j544L035
$$ 615594 557678 502965 454806 414073 380207 352875 332173 317566 307770 301981 300437 303472
56786C03472P358J1447J5763J9987K3160K4857K4970K2445J5732M917p630j9101
$$ 303472 310830 322277 338040 358027 381187 406044 431014 453459 469191 474108 466478 447377
56774D47377k7874l3323l5338l4621l2473k9636k6051k2005j8511j6051j3940
$$ 447377 419503 386180 350842 316221 283748 254112 228061 206056 187545 171494 157554
56763A57554j1543r266p641o379n037l917l393l073k439j821j805k132k077j596
$$ 157554 146011 136745 129104 122725 117688 113771 110378 107305 104866 103045 101240 99108 97031 95435
56749I5435j260j259j264j095q71o31l92m44j023j815k229k066j551r49m92l67
$$ 95435 94175 92916 91652 90557 89686 89055 88663 88219 87196 85381 83152 81086 79535 78586 78094 77727
56733G7727m20k77m7l65j299j891j492p65o31q07m77J86L61O6N0L47K72j73j94
$$ 77727 77307 77030 76983 76618 75319 73428 71936 71171 70540 69733 69256 69442 69803 69869 69919 70266 70538 70365 70171
56714G0171L71P42O11N85Q60O78k37r12n72J33J78l07n34l95k99j80L80J267J953
$$ 70171 70542 71284 71895 72480 73340 74018 73781 72869 72297 72430 72608 72301 71767 71372 71073 70893 71273 72540 74493
56695G4493K236K188J679P74K96J034K425L013K295J236P73P01M00j07l44j96
$$ 74493 76729 78917 80596 81370 81666 82700 85125 88138 90433 91669 92442 93143 93543 93436 93092 92896
56679I2896M4J08j25o73j312j587j297p92n59p06j046j419j682j704j602j740
$$ 92896 92940 93048 92923 92250 90938 89351 88054 87262 86703 85997 84951 83532 81850 80146 78544 76804
56663G6804k115k070j109K27Q84O11J65J69L54J98k31n24n93o66p73o89l07K30
$$ 76804 74689 72619 71510 71737 72621 73232 73397 73566 73920 74118 73887 73363 72770 72104 71331 70642 70335 70565
56645G0565P86J240J343Q69J8n48l43L57P45K87o85j260q77P9O59M12j96m31j59
$$ 70565 71351 72591 73934 74803 74821 74273 73930 74287 75032 75319 74634 73374 72497 72576 73235 73647 73451 73020 72861
56626G2861J24J5l69o21m67K2N31P10N78N76J140K070K606K192J068pn09n02l23
$$ 72861 72985 73000 72631 72010 71543 71565 72096 72806 73384 73960 75100 77170 79776 81968 83036 83029 82520 82018 81695
56607H1695j00K18N17M90R0k64k10j8j53m54k72M66J020R21O15O21O57K58k13
$$ 81695 81595 81813 82330 82820 82910 82646 82436 82418 82265 81811 81539 82005 83025 83946 84561 85182 85839 86097 85884
56588H5884m9N96R50R19J252K213L025K937K208J594J388J427J578J843K189K688
$$ 85884 85835 86431 87381 88300 89552 91765 94790 97727 99935 101529 102917 104344 105922 107765 109954 112642
56572A12642L556M752N740N940N306M263L254K570K388K819L787M967N743N575
$$ 112642 116198 120950 126690 132630 137936 142199 145453 148023 150411 153230 157017 161984 167727 173302
56558A73302M564L539L125L015K543J748J188Q63J76r31j709j786j801k371l102
$$ 173302 177866 181405 184530 187545 190088 191836 193024 193887 194063 193132 191423 189637 187836 185465 182363
56543A82363l252k846k563k868l748m930n889n979n073l859l029k553k110j792
$$ 182363 179111 176265 173702 170834 167086 162156 156267 150288 145215 141356 138327 135774 133664 131872
56529A31872j784j707r86J83Q42K94j223k802l485k860j445l74l34r08j186q85
$$ 131872 130088 128381 127395 127578 128420 128714 127491 124689 121204 118344 116899 116525 116191 115283 114097 113212
56513A13212m61l63n58p76q59q35q26q63p35k89J98K47r6k25J65O87Q91P75M22
$$ 113212 112751 112388 111830 111054 110195 109360 108534 107671 106936 106647 106845 107092 106996 106771 106936 107623 108514 109289 109711
56494A09711k12p82n40O29J791K223K414L118L994M158L634L232L212L096K705
$$ 109711 109499 108717 108177 108806 110597 112820 115234 118352 122346 126504 130138 133370 136582 139678 142383
56479A42383K439K396K156J642J379J628J888J661J181J119J763K774L560L813
$$ 142383 144822 147218 149374 151016 152395 154023 155911 157572 158753 159872 161635 164409 167969 171782
56465A71782L768L859M120M133L722L219K764K000Q37j7l0J62m19j685k693l012
$$ 171782 175550 179409 183529 187662 191384 194603 197367 199367 200204 200187 200157 200319 199900 198215 195522 192510
56449A92510k950k635j881r48n06o91r45q92p32p11q88j345j973k178j601r25
$$ 192510 189560 186925 185044 184096 183590 182899 181954 181062 180330 179619 178731 177386 175413 173235 171634 170709
56433A70709j122j963k394k275k494l199l276k178j019j027j857k255j765q87
$$ 170709 169587 167624 165230 162955 160461 157262 153986 151808 150789 149762 147905 145650 143885 142998
56419A42998r2M37M43j83r87j310j017m52J36O79R70P60J51l64l46J93Q00R25
$$ 142998 142906 143343 143786 143603 142616 141306 140289 139837 139973 140652 141622 142382 142533 142169 141823 142016 142816 143741
56401A43741M55j62m27k85O1N69J176J451J029K98L4L74P92J049J423J962K228
$$ 143741 144196 144034 143607 143322 143383 143952 145128 146579 147608 147906 147940 148314 149106 150155 151578 153540 155768
56384A55768K002J551J039L36l30l23N22J511J951J849J506J067P39Q93J501K024
$$ 155768 157770 159321 160360 160696 160366 160043 160565 162076 164027 165876 167382 168449 169188 170081 171582 173606
56368A73606K158K180K284K155J644J228J302J554J516J281J218J332J392J383
$$ 173606 175764 177944 180228 182383 184027 185255 186557 188111 189627 190908 192126 193458 194850 196233
56354A96233J401J399J389J528J736J624J119Q00J214K180L114L690L916L881
$$ 196233 197634 199033 200422 201950 203686 205310 206429 207229 208443 210623 213737 217427 221343 225224
56340B25224L788L943M371M713M734M655M794N190N745O343O692O435N670M962
$$ 225224 229012 232955 237326 242039 246773 251428 256222 261412 267157 273500 280192 286627 292297 297259
56326B97259M678M718M990N545O008N580M020K167J061Q31R42J048J230J483J530
$$ 297259 301937 306655 311645 317190 323198 328778 332798 334965 336026 336857 337799 338847 340077 341560 343090
56311C43090J104L57o6N25K038L415L726L253K955L082L116L030L544M978O640
$$ 343090 344194 344551 344485 345010 347048 350463 354189 357442 360397 363479 366595 369625 373169 378147 384787
56296C84787P733Q132Q096P921Q152R284J0991J2395J3293J4362J5892J7408J8754
$$ 384787 392520 400652 408748 416669 424821 434105 445096 457491 470784 485146 501038 518446 537200
56283E37200K0516K2886K5273K7537L0423L4033L7124L9029M1123M5081N0566
$$ 537200 557716 580602 605875 633412 663835 697868 734992 774021 815144 860225 910791
56272I10791N6086O1456O7841P5651Q3960R2130J00671J10082J19906J29367J38286
$$ 910791 966877 1028333 1096174 1171825 1255785 1347915 1448586 1558668 1678574 1807941 1946227
56261A946227J46835J54887J61971J67575J71261J72621J71285J66931J59236
$$ 1946227 2093062 2247949 2409920 2577495 2748756 2921377 3092662 3259593 3418829
56252C418829J47884J32655J13613R1429O7325M2476J7602o561k8739m7737o3425
$$ 3418829 3566713 3699368 3812981 3904410 3971735 4014211 4031813 4025252 3996513 3948776 3885351
56241C885351p6412q6882r4573r9823j03598j06338j07861j08606j09819j12105
$$ 3885351 3808939 3722057 3627484 3527661 3424063 3317725 3209864 3101258 2991439 2879334
56231B879334j14679j16621j17865j18557j18378j17216j15619j13904j11537
$$ 2879334 2764655 2648034 2530169 2411612 2293234 2176018 2060399 1946495 1834958
56222A834958j08000j03603r8830r3650q7977q2098p6121o9785o3264n7337n2285
$$ 1834958 1726958 1623355 1524525 1430875 1342898 1260800 1184679 1114894 1051630 994293 942008
56211I42008m7493m2580l7948l3771k9547k5304k2028k0153j8762j7069j5556
$$ 942008 894515 851935 813987 780216 750669 725365 703337 683184 664422 647353 631797
56200F31797j4742j3910j2193r906p806n976m382l537l560l418k285p65J93P75
$$ 631797 617055 603145 590952 581046 573240 567264 562882 559345 555785 552367 550082 549317 549510 550285
56186E50285J625K623L385M127M983N383N122N073N788O453O347O177O711P157
$$ 550285 551910 554533 557918 562045 567028 572411 577533 582606 588394 594847 601194 607371 614082 621239
56172F21239O458N165M546M696M945N225N617N440M442L934N179P448R282J0731
$$ 621239 627697 632862 637408 642104 647049 652274 657891 663331 667773 671707 676886 684334 693616 704347
56158G04347J2697J4959J6757J8561K1450K5267K9204L3494L8755M4317M9197
$$ 704347 717044 732003 748760 767321 788771 814038 843242 876736 915491 959808 1009005
56147A009005N4186O1001O9846P9707R0566J03238J17273J30906J42783J51881
$$ 1009005 1063191 1124192 1194038 1273745 1364311 1467549 1584822 1715728 1858511 2010392
56137B010392J56051J52931J42452J26964J09084R1033P5408O4301N7334N2081
$$ 2010392 2166443 2319374 2461826 2588790 2697874 2788907 2864315 2928616 2985950 3038031
56127C038031M6245L8099K5776Q661j0581k7506l9738m7943n3702n8596o5083
$$ 3038031 3084276 3122375 3148151 3156812 3146231 3118725 3078987 3031044 2977342 2918746 2853663
56116B853663p5633r0255j06366j21155j32580j38657j37981j31314j20970j08628
$$ 2853663 2778030 2687775 2581409 2460254 2327674 2189017 2051036 1919722 1798752 1690124
56106A690124r5203q2240p1377o2542n4654m7740m2497l8290l3809k9350k6109
$$ 1690124 1594921 1512681 1441304 1378762 1324108 1276368 1233871 1195581 1161772 1132422 1106313
56095A106313k3626k0400j6674j4021j2348j0088p238n386m577l053n21J227J531
$$ 1106313 1082687 1062287 1045613 1031592 1019244 1009156 1001918 996532 991955 988902 988381 989608 991139
56082I91139K029L806N790O821P122P117O817O811P902R428J0002R953J0795J2405
$$ 991139 993168 996974 1002764 1009585 1016707 1023824 1030641 1037452 1045354 1054782 1064784 1074737 1085532 1097937
56068A097937J3249J3334J4166J5713J6311J5832J6003J7197J7899J7753J8124
$$ 1097937 1111186 1124520 1138686 1154399 1170710 1186542 1202545 1219742 1237641 1255394 1273518
56057A273518J9094J9034J7904J7879J9784K1860K2941K4005K5666K6955K7545
$$ 1273518 1292612 1311646 1329550 1347429 1367213 1389073 1412014 1436019 1461685 1488640 1516185
56046A516185K8417K9535K9602K8828K9137L0992L2858L4277L6348L8692L9360
$$ 1516185 1544602 1574137 1603739 1632567 1661704 1692696 1725554 1759831 1796179 1834871 1874231
56035A874231L8456L8481M0309M2227M3594M5907M9286N1749N2818N4225N6206
$$ 1874231 1912687 1951168 1991477 2033704 2077298 2123205 2172491 2224240 2277058 2331283 2387489
56024B387489N6928N6458N7234N9612O1119O1162O2203O5098O7778O9759P3377
$$ 2387489 2444417 2500875 2558109 2617721 2678840 2740002 2802205 2867303 2935081 3004840 3078217
56013C078217P9010Q3824Q6851R0584R5985J00760J04308J09289J16413J22849
$$ 3078217 3157227 3241051 3327902 3418486 3514471 3615231 3719539 3828828 3945241 4068090
56003D068090J27695J33691J41555J48273J53179J59854J69610J79014J86484
$$ 4068090 4195785 4329476 4471031 4619304 4772483 4932337 5101947 5280961 5467445
55994E467445J95167K06636K18086K28753K42365K60136K78106K94901L14955
$$ 5467445 5662612 5869248 6087334 6316087 6558452 6818588 7096694 7391595 7706550
55985G706550L40492L67571L94056M23969M59903M99033N40778N90221O49439
$$ 7706550 8047042 8414613 8808669 9232638 9692541 10191574 10732352 11322573 11972012
55976A1972012P14248P84242Q66759R66067J078915J206456J359853J548254J773020
$$ 11972012 12686260 13470502 14337261 15303328 16382243 17588699 18948552 20496806 22269826
55967B2269826K040531K367734K767414L241756L798078M453692N212733O052739
$$ 22269826 24310357 26678091 29445505 32687261 36485339 40939031 46151764 52204503
55959E2204503O946123P881527Q859137R892173J1030571J2361296J3973222J5953438
$$ 52204503 59150626 67032153 75891290 85783463 96814034 109175330 123148552 139101990
55951A39101990J8424266K1501712K5118875K8866460L1999103L3518761L2225278
$$ 139101990 157526256 179027968 204146843 233013303 265012406 298531167 330756445
55944C30756445K6937855J7146961L787875j0679397k3262419l1833085l5858224
$$ 330756445 357694300 374841261 378629136 367949739 344687320 312854235 276996011
55937B76996011l6101193l3837079l0254719k6230544k2309646j8762344j5682841
$$ 276996011 240894818 207057739 176803020 150572476 128262830 109500486 93817645
55930I3817645j3081549j0925163r149208p683899o477114n487569m671143l989170
$$ 93817645 80736096 69810933 60661725 52977826 46500712 41013143 36342000 32352830
55922C2352830l419723k947684k552265k214635j927904j688483j485529j308291
$$ 32352830 28933107 25985423 23433158 21218523 19290619 17602136 16116607 14808316
55914A4808316j155547j028283r20157q23805p39451o68941o07623n50223m98640
$$ 14808316 13652769 12624486 11704329 10880524 10141073 9472132 8864509 8314286 7815646
55905G815646m56178m19543l83888l50692l23450l00246k77316k55754k38296
$$ 7815646 7359468 6939925 6556037 6205345 5881895 5581649 5304333 5048579 4810283
55896D810283k23352k08103j93729j82108j71130j58597j47041j39377j33335
$$ 4810283 4586931 4378828 4185099 4002991 3831861 3673264 3526223 3386846 3253511
55887C253511j25367j16584j09731j03668r5928q7851q2042p7483p1823o6112
$$ 3253511 3128144 3011560 2901829 2798161 2702233 2614382 2532340 2454857 2383034 2316922
55877B316922o2688o0780n8394n6333n6142n6310n4519n1464m8755m5286l9619
$$ 2316922 2254234 2193454 2135060 2078727 2022585 1966275 1911756 1860292 1811537 1766251 1726632
55866A726632l3665l0146k8481k6983k6982l0738l6977m2248m5235m6354m5017
$$ 1726632 1692967 1662821 1634340 1607357 1580375 1549637 1512660 1470412 1425177 1378823 1333806
55855A333806m0902l6308l3572l1554k8051k4162k2635k3213k3321k2349k1732
$$ 1333806 1292904 1256596 1223024 1191470 1163419 1139257 1116622 1093409 1070088 1047739 1026007
55844A026007k1582k0608j8907j7815j7465j7072j6951j7676j8106j6878j5031
$$ 1026007 1004425 983817 964910 947095 929630 912558 895607 877931 859825 842947 827916
55833H27916j4555j5093j4694j3055j1459j0148q467o978o886p640p549o592o354
$$ 827916 813361 798268 783574 770519 759060 748912 740445 733467 726581 718941 711392 704800 698446
55820F98446p311q208q024o860n029k882j226n15j32L76J51j524l657m929n625
$$ 698446 691135 682927 674903 668043 663014 660132 658906 658391 658259 658635 658786 657262 653605 648676 643051
55805F43051o626p568p693p508p800p977p196o152n977o287o142n941o382o564
$$ 643051 636425 628857 621164 613656 605856 597879 590683 584531 578554 572267 566125 560184 553802 547238
55791E47238n216l046j748j294l08J347K276J482j161n769j1889j7486k0334k0364
$$ 547238 542022 538976 537228 535934 535626 536973 539249 540731 539570 533801 521912 504426 484092 463728
55777D63728j9136j7489j5256j2724j0608q856p079n825o048p555r414j1306j3156
$$ 463728 444592 427103 411847 399123 388515 379659 372580 366755 360707 353152 343738 332432 319276
55764C19276j4059j3177j1221r543q248o676n142m530m571m163l175k462k347
$$ 319276 305217 292040 280819 271276 263028 256352 251210 246680 242109 237946 234771 232309 229962
55751B29962k469k796l470l996l844l418l310l175k578k174k652l290l027k298
$$ 229962 227493 224697 221227 217231 213387 209969 206659 203484 200906 198732 196080 192790 189763 187465
55737A87465k215k564k308j530j144j173r62p23j084j584j325p43j014j941k302
$$ 187465 185250 182686 180378 178848 177704 176531 175569 174846 173762 172178 170853 170110 169096 167155 164853
55722A64853k015k113k618k390j233m73r08j743j921j327l22Q72J956K567K627
$$ 164853 162838 160725 158107 155717 154484 154011 153103 151360 149439 148112 147790 148662 150618 153185 155812
55707A55812K196J298M33O06J883K716J876K79m14k61n36j436k037k096k143k116
$$ 155812 158008 159306 159739 160345 162228 164944 166820 167099 166685 166424 165888 164452 162415 160319 158176 156060
55691A56060j511p16n79q82p45k71j33R3J327K921L236K231J656K388L461L991
$$ 156060 154549 153833 153254 152372 151627 151356 151223 151316 152643 155564 158800 161031 162687 165075 168536 172527
55675A72527M265M444L888K492J285J118J779K773L860M566M380L652L233L148
$$ 172527 176792 181236 185124 187616 188901 190019 191798 194571 198431 202997 207377 211029 214262 217410
55661B17410K776K265K328K643J982J95j461k239k704l209l158k314j601j846
$$ 217410 220186 222451 224779 227422 229404 229599 228138 225899 223195 219986 216828 214514 212913 211067
55647B11067k780l799m687n265n342n334n949o917p151o401n633n492n536n365
$$ 211067 208287 204488 199801 194536 189194 183860 177911 170994 163843 157442 151809 146317 140781 135416
55633A35416n267n339n070m339l723l464l158k768k874l456l576k803j960j924
$$ 135416 130149 124810 119740 115401 111678 108214 105056 102288 99414 95958 92382 89579 87619 85695
55619H5695k528l137l409l087j986o12M0k62o78n94l48l86n49o03o28o21l96j39
$$ 85695 83167 80030 76621 73534 71548 70936 70976 70714 70036 69442 69094 68708 68159 67556 66928 66307 65911 65772
55601F5772k62n88n17o6J21j03k63l09o58j123j015m71m59j137j515j094n89n49
$$ 65772 65510 64922 64405 64339 64460 64357 64094 63785 63127 62004 60989 60518 60059 58922 57407 56313 55724 55175
55583E5175n26j95n1l58n33k14J09J92P02K009L313L695L251K543J746R89O61
$$ 55175 54649 54454 54403 54045 53512 53298 53407 53599 54301 56310 59623 63318 66569 69112 70858 71847 72508
55566G2508P52O38J43q9J62L6j074k408k893k581k251k224k313k424k463k102
$$ 72508 73260 73898 74041 73952 74114 74150 73076 70668 67775 65194 62943 60719 58406 55982 53519 51417
55550E1417j277m59%L39Q41J317J562J667J660J432J294J756K541K753K351K356
$$ 51417 50140 49681 49681 50020 50861 52178 53740 55407 57067 58499 59793 61549 64090 66843 69194 71550
55534G1550L122L592K946J903J505J584J462J271J462J636J039j56j080j448j690
$$ 71550 74672 78264 81210 83113 84618 86202 87664 88935 90397 92033 93072 92916 91836 90388 88698
55519H8698k017k162k034k015k509l528m595n012m519l740l469l568l236k472
$$ 88698 86681 84519 82485 80470 77961 74433 69838 64826 60307 56567 53098 49530 46294 43822
55505D3822k236k875l443l110k285j686j207n18N1O4j76k70n40j349k094j814
$$ 43822 41586 38711 35268 32158 29873 28187 26980 26462 26513 26577 26401 26131 25591 24242 22148 20334
55489B0334n51P09J187Q38k0r37j434j402j278j468j821j957j719j027J18J265
$$ 20334 19783 20492 21679 22517 22497 21560 20126 18724 17446 15978 14157 12200 10481 9454 9572 10837
55473A0837J659J196N73K24k43j099j780j704j136o21j78L12N39K92K2J72M41
$$ 10837 12496 13692 14265 14489 14246 13147 11367 9663 8527 7906 7728 8040 8579 8871 8893 9065 9506
55456I506K92j83n01m90k20K76P58P32J28m89p58r47j176j011l30K25K68L30Q33
$$ 9506 9798 9615 9114 8624 8404 8680 9438 10170 10298 9809 9051 8104 6928 5917 5587 5812 6080 6410 7243
55437G243J186Q16K37K53O95J010J348K069K688K421J399L99l05q44r72l77M28
$$ 7243 8429 9245 9482 9735 10430 11440 12788 14857 17545 19966 21365 21764 21459 20615 19643 19266 19694
55420A9694N55m4n86n64j17M47Q26P05K73L56J284K073J614K86n26k93K19K34
$$ 19694 20249 20205 19619 19055 18938 19385 20211 20916 21189 21545 22829 24902 26516 26802 26276 25983 26202 26436
55402B6436k34p78j027p66j92J08o9j39L24P89O69L53M43N39p5j006j315j160
$$ 26436 26202 25424 24397 23631 23439 23547 23478 23339 23663 24452 25121 25474 25917 26456 26381 25375 24060 22900
55384B2900j521k433k922k628k174j684m88J336K380J723K75m12m6M45K86m69
$$ 22900 21379 18946 16024 13396 11222 9538 9050 10386 12766 14489 14764 14352 14306 14751 15037 14568
55368A4568j287j681j545j147p35j83O11J165Q66m3o19m27K2J61m0m97j260k006
$$ 14568 13281 11600 10055 8908 8173 7990 8601 9766 10632 10589 9970 9543 9565 9726 9686 9189 7929 5923
55350E923j943p36Q64J713J374K54r22j539j353o64j26j34n41r67G7g44lA87J293
$$ 5923 3980 3244 4108 5821 7195 7449 6527 4988 3635 2971 2845 2711 2170 1203 77 -744 -747 187 1480
55331A480Q10R8K4P19J400J272L60n64q75o31k28J43M02L32r2l75o1M58M52P9
$$ 1480 2290 2388 2412 3131 4531 5803 6163 5599 4724 4093 3865 4008 4410 4742 4650 4275 4214 4672 5124 5203
55311E203J72P61Q29j4q11p75m64n61m99M96J753J947J091M23N04O91M84J88O9
$$ 5203 5375 6136 6965 6951 6140 5365 4901 4340 3841 4337 6090 8037 9128 9551 10055 10746 11230 11418 11487
55292A1487j10m32n74m70m92p62r58r25q77q76p13m13k45k20q0J46J98J50L46
$$ 11487 11377 10945 10371 9901 9409 8647 7689 6764 5887 5011 4298 3885 3640 3420 3340 3486 3684 3834 4180
55273D180P77J114J309J527J493P15o60j846k374k362j916r54K36J060J391J615
$$ 4180 4957 6071 7380 8907 10400 11115 10455 8609 6235 3873 1957 1003 1239 2299 3690 5305
55257E305J772J394M00n03o90k92J88M39L24j88q14j140j144j099r10k13P29R77
$$ 5305 7077 8471 8871 8368 7678 7386 7574 8013 8337 8149 7335 6195 5051 3952 3042 2829 3558 4535
55239D535J55q33q36J35J010R85L77J22O72J423J412M88n13q38o01k18L39J127
$$ 4535 4690 3857 3021 3156 4166 5151 5528 5650 6322 7745 9157 9645 9132 8294 7693 7475 7814 8941
55221H941J611J294O11L42L82M0o13p31q9N62P12P18Q48O86n3p99q28k17L82N12
$$ 8941 10552 11846 12457 12799 13181 13221 12608 11877 11788 12350 13062 13780 14628 15314 15261 14462 13634 13417 13799 14311
55201A4311J80l15n40k76J69L24K19K30L18mq00j394j194l80M48Q81Q94P33O70
$$ 14311 14491 14176 13636 13360 13529 13853 14072 14302 14620 14616 13816 12422 11228 10848 11296 12177 13071 13804 14474
55182A4474O36K48m74q73o33n19j239j987j375L72J476J059K22K53R36J310J125
$$ 14474 15110 15358 14884 14011 13378 12859 11620 9633 8258 8630 10106 11165 11387 11640 12576 13886 15011
55165A5011P31K78k26n70o76q63j287j583j409q60q0R50J863J855P22o08j120
$$ 15011 15742 16020 15794 15224 14548 13685 12398 10815 9406 8546 8466 9416 11279 13134 13856 13248 12128
55148A2128q17l61q0J29K97L44L00K36J28Km8o4j36j00J69L10n8n02k36N50Q23
$$ 12128 11311 10950 10870 10999 11296 11640 11940 12176 12304 12306 12258 12194 12058 11958 12127 12437 12379 11877 11641 12191 13014
55127A3014L54J17O13R32K26q55j054k07Q53J502J651J269M30m24q43q37n70k1
$$ 13014 13368 13485 14098 15030 15256 14401 13347 13140 13993 15495 17146 18415 18845 18421 17578 16741 16171 16150
55109A6150O89J067Q49L76k0n33j263j654j108J68J449K296K630K450J942J487
$$ 16150 16839 17906 18755 19131 19111 18578 17315 15661 14553 14721 16170 18466 21096 23546 25488 26975
55093B6975J223Q94M79K95K88q3q01j002k75N64P33P14J258J909J602L82o32p62
$$ 26975 28198 29092 29571 29866 30154 30071 29270 28268 27993 28557 29290 30004 31262 33171 34773 35155 34523 33761
55075C3761l44M1J22k06p30q61l23K43P2n54o98r0O70J084J121P21j99j208j540
$$ 33761 33417 33458 33580 33374 32644 31783 31460 31703 31775 31221 30523 30433 31103 32187 33308 34029 33830 32622 31082
55056C1082j016k94p4m47r64j064m82L50N95No99q03n32m70o10o07n50o86o96
$$ 31082 30066 29772 29698 29251 28287 27223 26741 27091 27686 27691 26992 26189 25657 25187 24577 23970 23420 22734 22038
55037B2038j66N49P81O61Q81J430J556J010M17K82M15N03N76P05Q43J009J123
$$ 22038 21872 22421 23202 23863 24744 26174 27730 28740 29157 29439 29854 30357 30933 31638 32481 33490 34613
55020C4613P55l27j420j554q92o53j425k390k485j634m94L39N57Q3p18j215j141
$$ 34613 35368 35041 33621 32067 31175 30522 29097 26707 24222 22588 22094 22433 22990 23073 22355 21140 19999
55003A9999q76q53j020j034o72M5Q52J337J373J387J813K392K567K404K516L006
$$ 19999 19123 18270 17250 16216 15544 15589 16441 17778 19151 20538 22351 24743 27310 29714 32230 35236
54987C5236L202K629J627P54J92jM13J396K350K689K529K457K795L308L560L436
$$ 35236 38438 41067 42694 43448 43640 43639 44052 45448 47798 50487 53016 55473 58268 61576 65136 68572
54971F8572L366L986N389O891P782Q156Q648R545J0677J2047J3834J5727J6914
$$ 68572 71938 75924 81313 88204 95986 104142 112790 122335 133012 145059 158893 174620 191534
54958A91534J6966J6169J4774J2477Q905M270q47n915j0430j3839j5860j6707
$$ 191534 208500 224669 239443 251920 260825 265095 264248 258333 247903 234064 218204 201497
54946B01497j6723j6030j4664j2857j0977r266p808o574n523m675m154l890l518
$$ 201497 184774 168744 154080 141223 130246 120980 113172 106598 101075 96400 92246 88356 84838
54933H4838k791j915j188m42O45J890K825L520M504N862P019P664Q270R410J1018
$$ 84838 82047 80132 78944 78502 79147 81037 83862 87382 91886 97748 104767 112431 120701 130111 141129
54918A41129J2573J3668J4174J4194J4009J3690J2660J0111N978J075l848q567
$$ 141129 153702 167370 181544 195738 209747 223437 236097 246208 252186 253261 249413 240846
54906B40846j2750j5643j6853j6936j6661j6082j4853j3100j1398j0013q718p288
$$ 240846 228096 212453 195600 178664 162003 145921 131068 117968 106570 96557 87839 80551
54894H0551n801m459l367k520j861j400j305j630j985j859j353j137j459j738
$$ 80551 74750 70291 66924 64404 62543 61143 59838 58208 56223 54364 53011 51874 50415 48677
54880D8677j503j160j259j520j322q75r87j675j910j024K55P27J57p03j288j729
$$ 48677 47174 46014 44755 43235 41913 41038 40051 38376 36466 35442 35697 36424 36581 35878 34590 32861
54864C2861k232k453j928q48RJ41j09rO99J572J989J686Q51j41j007j668k174
$$ 32861 30629 28176 26248 25400 25409 25550 25441 25432 26131 27703 29692 31378 32229 32088 31081 29413 27239
54847B7239k500k463j960j163l56L48J053J740K151K023J435Q66Q40J386J885
$$ 27239 24739 22276 20316 19153 18797 19145 20198 21938 24089 26112 27547 28413 29253 30639 32524
54832C2524J673Q61K24K43O18R54J389K060K452J992J125R53J846L089M006M719
$$ 32524 34197 35058 35282 35525 36143 37097 38486 40546 42998 44990 46115 47068 48914 52003 56009 60728
54816F0728N497O094O201O109O396P263Q532J0011J1484J2538J2894J2849J3039
$$ 60728 66225 72319 78520 84629 91025 98288 106820 116831 128315 140853 153747 166596 179635
54803A79635J3716J4418J4266J2537R109M600l9m228p983j1407j4161j5683j5787
$$ 179635 193351 207769 222035 234572 243681 248281 248242 244014 236031 224624 210463 194780 178993
54790A78993j4852j3503j2195j1010r711q083o286m759l729k980k202j370o38
$$ 178993 164141 150638 138443 127433 117722 109639 103353 98594 94865 91885 89683 88313 87675
54777H7675j5O41J337J908K276K593L137M074N324O578P556Q295R131J0320J1697
$$ 87675 87660 88301 89638 91546 93822 96415 99552 103626 108950 115528 123084 131379 140510 150830 162527
54762A62527J2786J3292J3411J3486J3368J2282R575N483R33l353p202j0560j3159
$$ 162527 175313 188605 202016 215502 228870 241152 250727 256210 257143 253790 246588 236028 222869
54749B22869j4790j5402j4849j3033j0581q771q254q326q019p370o963o676n908
$$ 222869 208079 192677 177828 164795 154214 145443 137189 128863 120844 113474 106511 99835 93927
54736I3927m830m369m790n213m829l832k859k185j810j780j916j744j147o97r25
$$ 93927 89097 84728 79938 74725 69896 66064 63205 61020 59210 57430 55514 53770 52623 51926 51001
54721E1001j518j624q20M34J189Q27l39j216j013j28L91J88j17L2M70Q31J090
$$ 51001 49483 47859 47039 47473 48662 49489 49150 47934 46921 46793 47184 47372 47255 47287 47757 48588 49678
54704D9678J214R01J05o17o89j81L77N99M40J17m2K2j51r00j655j412k19P81R57
$$ 49678 50892 51793 51898 51281 50592 50411 50788 51387 51827 51944 51902 51924 51773 50873 49218 47806 47587 48368 49325
54685D9325R32J271J442R17L66O59J339J288N94M91J492K736L375L545L675L711
$$ 49325 50257 51528 52970 53887 54253 54912 56251 57539 58133 58624 60116 62852 66227 69772 73447 77158
54669G7158L503L290L299L304K993K437J899J456J047P14M92L14J57Q8N8j18m15
$$ 77158 80661 83951 87250 90554 93547 95984 97883 99339 100386 101100 101592 101906 102063 102151 102209 102091 101676
54652A01676n27l05nM5j37l58n72p31n01M68J901K967L145K804K686K977L223
$$ 101676 101149 100844 100839 100884 100747 100389 99817 99086 98585 99053 100954 103921 107066 109870 112556 115533 118756
54635A18756L100K764K366J660M00j184k683l965m984n393m938m075l580l523
$$ 118756 121856 124620 126986 128646 129046 127862 125179 121214 116230 110837 105899 101824 98244 94721
54621I4721l226k289j114k13L70P67R29R31J097J509J764J568J099N72j16r32
$$ 94721 91495 89206 88092 87879 88249 89016 89945 90876 91973 93482 95246 96814 97913 98485 98369 97437
54605I7437j408j264r21r11j149j293j396j695k062k248k382k675k828k406j613
$$ 97437 96029 94765 93844 92933 91784 90491 89095 87400 85338 83090 80708 78033 75205 72799 71186
54590G1186j122j180j433j577j651j668j543j423j617k069k264j824r91m33o84
$$ 71186 70064 68884 67451 65874 64223 62555 61012 59589 57972 55903 53639 51815 50824 50391 49707
54575D9707j647k523k434j371k69J32J33L98Q42Q28K18m96r63j245j324j042n93
$$ 49707 48060 45537 43103 41732 41463 41595 41728 42126 42968 43796 44014 43518 42555 41310 39986 38944 38351
54558C8351m21n71o43m91l47j48N03J472J868J163K4m73j67K26K19P5K38P28J256
$$ 38351 37930 37359 36716 36225 35878 35730 36233 37705 39573 40736 40760 40287 40120 40346 40565 40640 40878 41606 42862
54539D2862J642J876J897J596J096P89Q78J056J005J055J818L088L788L354K447
$$ 42862 44504 46380 48277 49873 50969 51758 52636 53692 54697 55752 57570 60658 64446 67800 70247
54524G0247J812J097k67j668j948j271j061j858k504j954q56n79j388k413k905
$$ 70247 72059 73156 72889 71221 69273 68002 66941 65083 62579 60625 59769 59190 57802 55389 52484
54509E2484k721j949q46k4M0l57m95j38L32O56R47J254J407J386J424J517J306
$$ 52484 49763 47814 46968 46944 46984 46627 46132 45994 46326 46982 47929 49183 50590 51976 53400 54917 56223
54492E6223O27j42n23m86l14j26J54M74O06M53J94L8j9j28l17l94j70L18P56Q55
$$ 56223 56850 56708 56185 55699 55385 55259 55413 55887 56493 56946 57140 57178 57159 57031 56714 56320 56150 56468 57224 58079
54472E8079O57N00O45R92J276J409J470J378Q84lq10j092r77r03r45p83l84k65
$$ 58079 58736 59236 59881 60873 62149 63558 65028 66406 67290 67287 66477 65385 64408 63505 62560 61777 61393 61128
54454F1128q42j742k087j442k72N46O54N24P83J324J348M69o52j088q38o27p58
$$ 61128 60286 58544 56457 55015 54743 55289 55943 56467 57250 58574 59922 60391 59739 58651 57813 57186 56428
54437E6428q00m90j55l9J39N73Q68O59K00p1j87l41l69k3M85P87Q64Q69P50N53
$$ 56428 55628 55138 54983 54944 55083 55656 56524 57183 57383 57312 57125 56784 56415 56392 56877 57664 58528 59397 60147 60700
54417F0700P66J653K513K355J182N4j67M27J225J685J580J184J205K035L121L574
$$ 60700 61466 63119 65632 67987 69169 69223 69056 69483 70708 72393 73973 75157 76362 78397 81518 85092
54401H5092L362L253L681M287M669M842M780M121K739J143K0m45o04r95j941l167
$$ 85092 88454 91707 95388 99675 104344 109186 113966 118087 120826 121969 121989 121544 120940 119945 118004 114837
54385A14837l841l413k361j734j924k388k585k589k614k574k319j982j804j900
$$ 114837 110996 107583 105222 103488 101564 99176 96591 94002 91388 88814 86495 84513 82709 80809
54371H0809k238k579k467j693p62l98n89p04m99l96o13o80j87N75R79P97L01K3
$$ 80809 78571 75992 73525 71832 71070 70672 70083 69379 68880 68484 67871 67191 67004 67579 68558 69355 69656 69679
54353F9679M26J484K467K629K147J843K049K320K341K403K784L293L649L674L141
$$ 69679 70105 71589 74056 76685 78832 80675 82724 85044 87385 89788 92572 95865 99514 103188 106329
54338A06329K051J110J054J398R04n26j624j826k214l653n127n147l911k875k736
$$ 106329 108380 109490 110544 111942 112846 112320 110696 108870 106656 103003 97876 92729 88818 85943 83207
54323H3207l027l233l219k877k341k283l017l697l418k669k582l031k803j583
$$ 83207 80180 76947 73728 70851 68510 66227 63210 59513 56095 53426 50844 47813 45010 43427
54309D3427m11pJ36N33P75L75l03o02n07m80p63j203j446j128k11P38J146J244
$$ 43427 43016 43009 43145 43678 44453 44828 44525 43923 43416 42936 42173 40970 39524 38396 38185 38923 40069 41313
54291D1313J647K176J937P73k47l13J8j97q90j299j200j029j000q40m17kJ89K83
$$ 41313 42960 45136 47073 47846 47599 47286 47304 47107 46217 44918 43718 42689 41689 40849 40432 40430 40619 40902
54273D0902N11Q34R65O92J93m0K12M89K15l69l90L86J069R08L80M09Q95Q76Lr28
$$ 40902 41413 42247 43212 43904 44097 44057 44269 44758 44973 44604 44214 44600 45669 46577 46957 47366 48261 49137 49140 48212
54253D8212j110o90k46J47Q23J748K254J764N19n58p25r5N63O71L76J80K60L71
$$ 48212 47102 46412 46166 46313 47136 48884 51138 52902 53421 52863 52138 52043 52606 53277 53653 53833 54093 54464
54235E4464L50L87O57Q91O57L5l16N9P67J032O62K09J07J27j28n58q63j129j550
$$ 54464 54814 55201 55858 56749 57406 57441 57125 57184 57951 58983 59645 59854 59961 60088 59960 59402 58539 57410 55860
54216E5860j704q83O68J617J041l62j160q96l96m21p54p24k01K99L21k4k45k2
$$ 55860 54156 53273 53941 55558 56599 56237 55077 54181 53785 53364 52610 51886 51685 51984 52305 52281 52036 52014
54198E2014M16M99q6r73j438j129m19N4P0o9o8p5m40j072j283n11R33K049K192
$$ 52014 52430 52929 52843 51870 50432 49303 48884 48938 49008 48939 48871 48796 48356 47284 46001 45490 46423 48472 50664
54179E0664J662J142Q42M69j30o46p47n57m63n91o83m82q9J69J27o3j59j90l76
$$ 50664 52326 53468 54310 54779 54649 54003 53256 52699 52236 51645 50962 50480 50391 50560 50687 50624 50465 50275 49899
54160D9899p97j241j492j553j468j106l82L29M48r9p13q88q05q97j099r72m32
$$ 49899 49102 47861 46369 44816 43348 42242 41860 42189 42637 42538 41825 40937 40132 39235 38136 37164 36732
54143C6732R8K89K03j07p35j429j474n40O71J115O17m8k08N4K60J22l37q36r61
$$ 36732 36830 37119 37322 37215 36480 35051 33577 33037 33708 34823 35440 35392 35184 35238 35498 35620 35283 34447 33486
54124C3486n00K09O08O29P33J107J261P06l10j060j138p13j72K14L79M74P13J024
$$ 33486 32986 33195 33803 34432 35165 36272 37533 38239 37929 36869 35731 35018 34846 35060 35439 35913 36626 37650
54106C7650J079P99N41N56N66K38k13l07j14j49n31p46m58m6o3m90p82n62N3P01
$$ 37650 38729 39528 40069 40625 41191 41429 41216 40909 40795 40646 40115 39369 38911 38865 38802 38312 37530 36968 37021 37722
54086C7722J156J403J441J133M07m11p54m87j38j60j74M93J628K162J561N10r6
$$ 37722 38878 40281 41722 42855 43262 42851 42097 41610 41472 41312 41138 41631 43259 45421 46982 47492 47396
54069D7396k77n48q15m83M97J373J554J292J122J118J024Q26Q65J329J972K264
$$ 47396 47119 46571 45756 45273 45770 47143 48697 49989 51111 52229 53253 54079 54944 56273 58245 60509
54053F0509J883J058N15P99J632K134J844J273J240J866K580K946L087L334L840
$$ 60509 62392 63450 63965 64764 66396 68530 70374 71647 72887 74753 77333 80279 83366 86700 90540
54038I0540M579N357N781N596N161N224N944O516O131N043M274M417N094N554
$$ 90540 95119 100476 106257 111853 117014 122238 128182 134698 140829 145872 150146 154563 159657 165211
54024A65211N445M989M651M606M473L647K180R57P05J028J044N99J74l24j665
$$ 165211 170656 175645 180296 184902 189375 193022 195202 196159 196864 197892 198936 199535 199709 199385 197720
54009A97720l883n694n947n097m462m561m842m777m479m225m080m057m116l952
$$ 197720 193837 188143 182196 177099 172637 168076 163234 158457 153978 149753 145673 141616 137500 133548
53995A33548l277k329j723j671j800j806j816j989k172k185k012j576p22L47R68
$$ 133548 130271 127942 126219 124548 122748 120942 119126 117137 114965 112780 110768 109192 108470 108817 109785
53980A09785P36M2m01l55o3K83O13O95K47n93j245j229o01J60N51L62j27l42J1
$$ 109785 110521 110563 110162 109807 109744 110027 110640 111335 111582 110989 109744 108515 107914 108074 108625 108987 108860 108518 108529
53961A08529N94Q93R12J037J250J066L32l78m83j27K35N75J080J504J431J087
$$ 108529 109123 110016 110928 111965 113215 114281 114613 114235 113752 113625 113860 114435 115515 117019 118450 119537
53945A19537J197J918K615K890L223M168N454O406O817O879O636O139N809N976
$$ 119537 120734 122652 125267 128157 131380 135548 141002 147408 154225 161104 167740 173879 179688 185664
53931A85664O117N393L911K644J994J249j22j430j662r11j43K06O29J550K605
$$ 185664 191781 197174 201085 203729 205723 206972 206850 205420 203758 202847 202704 202910 203539 205089 207694
53916B07694L164L223L366M036N000N616N509M992M714M899N048M497L135J514
$$ 207694 210858 214081 217447 221483 226483 232099 237608 242600 247314 252213 257261 261758 264893 266407
53902B66407L18k01l38o53j458k489l139l087k666k541l087m126n186n935o371
$$ 266407 266725 266524 266186 265533 264075 261586 258447 255360 252694 250153 247066 242940 237754 231819 225448
53887B25448o722p120p441p433o969o116n148m506m536n066n419n137m478l886
$$ 225448 218726 211606 204165 196732 189763 183647 178499 173993 169457 164391 158972 153835 149357 145471
53873A45471l273k334j433j374k233l073l139k721k557k907l578m348m905m829
$$ 145471 142198 139864 138431 137057 134824 131751 128612 125891 123334 120427 116849 112501 107596 102767
53859A02767m098l306k918k648k033j247p69n73k52J69K51r7m56n76o88j031j395
$$ 102767 98669 95363 92445 89797 87764 86517 85748 85175 84923 85092 85343 85246 84790 84214 83526 82495 81100
53842H1100j313n37O83J660J692P73k94o95m54k13l64p23r28p94m00p4j89o61
$$ 81100 79787 79250 79933 81593 83285 84058 83764 83069 82615 82402 82038 81315 80387 79593 79193 79119 78930 78269
53824G8269q39k33Q65J753K074J854J169K86k31q3L02N01R19K088L399L608K553
$$ 78269 77430 77197 78062 79815 81889 83743 84912 85198 84967 84884 85186 85687 86606 88694 92093 95701 98254
53807I8254J457J306J861K551L351M222M616M256L837M144M937N360N165M743
$$ 98254 99711 101017 102878 105429 108780 113002 117618 121874 125711 129855 134792 140152 145317 150060
53793A50060M275L636L044K948L213L072K173J095N00K53j75p65r71o06k00l27
$$ 150060 154335 157971 161015 163963 167176 170248 172421 173516 174016 174269 174094 173329 172358 171752 171552 171225
53777A71225r07j454j710j828j966k126k344k811l654m716n554n642m703l122
$$ 171225 170318 168864 167154 165326 163360 161234 158890 156079 152425 147709 142155 136513 131810 128688
53763A28688j866j626k064k299k007j593j289q92m53m32q18r16m70k16o33r32
$$ 128688 126822 125196 123132 120833 118826 117233 115944 115052 114599 114167 113349 112433 111963 111747 111114 110182
53747A10182k60P94R98L26j67n8O9q8j70j70n81j269j353o63j91n81j137j080
$$ 110182 109922 110716 111714 112040 111873 111815 111884 111796 111626 111456 110875 109606 108253 107590 107399 106818 105681 104601
53729A04601q31j142j715j679j047o73r11j181r18k86K29M72P03J221J949K425
$$ 104601 103770 102628 100913 99234 98187 97514 96603 95422 94504 94218 94447 94919 95622 96843 98792 101217
53713A01217K216J457O88J52m59j381k285k618k177j115L39J954L456M626N382
$$ 101217 103433 104890 105578 105730 105271 103890 101605 98987 96810 95695 96034 97988 101444 106070 111452
53698A11452N659N407M685L617K318J117N74Q59J341J359J192J540K219K378J957
$$ 111452 117111 122518 127203 130820 133138 134255 134829 135688 137029 138388 139580 141120 143339 145717 147674
53683A47674J832K272K389J669R30J020J512J571J316J351J517J215N86L02M15
$$ 147674 149506 151778 154167 155836 156766 157786 159298 160869 162185 163536 165053 166268 166854 167156 167571
53668A67571L16k20q07j183j444j595j464j126q47o97o59q75j323j441p90J04
$$ 167571 167887 167667 166860 165677 164233 162638 161174 160048 159201 158504 157845 156970 155647 154206 153416 153520
53652A53520K90l38r97j152r84p34l48Q0K19Q4J06L89M76J02l22l25q6r4l99o03
$$ 153520 153810 153472 152475 151323 150339 149605 149257 149337 149556 149640 149746 150135 150611 150713 150391 150066 149980 149886 149487 148884
53632A48884m31l8K95N14P72J118J387J418J362J531J956K305K348K191K028J867
$$ 148884 148453 148415 148710 149224 149996 151114 152501 153919 155281 156812 158768 161073 163421 165612 167640 169507
53616A69507J709J631J579J407J260J482J977K097J540Q88Q83J560K513L499M341
$$ 169507 171216 172847 174426 175833 177093 178575 180552 182649 184189 185077 185960 187520 190033 193532 197873
53601A97873M625M185L472L021K904L123L928N062N383M249K761K525L455M092
$$ 197873 202498 206683 210155 213176 216080 219203 223131 228193 233576 237825 240586 243111 246566 250658
53587B50658L887L790M345M689L970K687J857J674J692J765J989K224K246K117
$$ 250658 254545 258335 262680 267369 271339 274026 275883 277557 279249 281014 283003 285227 287473 289590
53573B89590J919J468P49K83N38J223J636J537J266J123J022Q01N41N21Q60J255
$$ 289590 291509 292977 293726 294009 294547 295770 297406 298943 300209 301332 302354 303155 303696 304217 305077 306332
53557C06332J187O14K72Q32J832K072J184J62lM14N43L53O25J582K365K107R95
$$ 306332 307519 308133 308405 309237 311069 313141 314325 314487 314484 314898 315441 315794 316419 318001 320366 322473 323468
53540C23468m9m39k98K7L95P61J015J096J139J239J282J269J564K420L328L455
$$ 323468 323419 322980 322682 322709 323104 323865 324880 325976 327115 328354 329636 330905 332469 334889 338217 341672
53524C41672K831K470L005L891M340M535N184O263P034P172P165P550Q378R459
$$ 341672 344503 346973 349978 353869 358209 362744 367928 374191 381225 388397 395562 403112 411490 420949
53510D20949J0629J1626J2176J2298J2239J2186J2340J3079J4482J5868J6455
$$ 420949 431578 443204 455380 467678 479917 492103 504443 517522 532004 547872 564327
53499E64327J6432J6723J7677J8721J9384J9993K1010K2290K3343K3907K4013
$$ 564327 580759 597482 615159 633880 653264 673257 694267 716557 739900 763807 787820
53488G87820K3831K3647K3667K3719K3474K3048K2915K3188K3437K3369K3170
$$ 787820 811651 835298 858965 882684 906158 929206 952121 975309 998746 1022115 1045285
53477A045285K3054K2952K2858K2956K3170K3097K2615K2099K1821K1545K0969
$$ 1045285 1068339 1091291 1114149 1137105 1160275 1183372 1205987 1228086 1249907 1271452 1292421
53466A292421K0162J9269J8222J7015J5863J4828J3654J2264J0967R870Q500O459
$$ 1292421 1312583 1331852 1350074 1367089 1382952 1397780 1411434 1423698 1434665 1444535 1453035 1459494
53454A459494M108K145P35n82k195m044n950p993j0339j2753j4486j4983j4728
$$ 1459494 1463602 1465747 1466482 1465900 1463705 1459661 1453711 1445718 1435379 1422626 1408140 1393157 1378429
53441A378429j4990j6454j8477k0030k0906k1479k1767k1547k1117k0978k0956
$$ 1378429 1363439 1346985 1328508 1308478 1287572 1266093 1244326 1222779 1201662 1180684 1159728
53430A159728k0587k0231k0670k1562k1563k0239j8641j7599j6608j5022j3212
$$ 1159728 1139141 1118910 1098240 1076678 1055115 1034876 1016235 998636 982028 967006 953794
53419I53794j1704j0153q143o141m774l818k817k022j706j193L60K540M153M826
$$ 953794 942090 931937 923794 917653 912879 909061 906244 904222 902516 901323 901683 904223 908376 913202
53405I13202N222N898O943Q557J0978J3764J6025J7517J8740J9975K0974K1668
$$ 913202 918424 924322 931265 939822 950800 964564 980589 998106 1016846 1036821 1057795 1079463
53393A079463K2507K3815K5335K6703K7894K9108L0479L2048L3756L5439L7000
$$ 1079463 1101970 1125785 1151120 1177823 1205717 1234825 1265304 1297352 1331108 1366547 1403547
53382A403547L8465L9717M0492M0880M1463M2556M3675M4255M4538M5113M5848
$$ 1403547 1442012 1481729 1522221 1563101 1604564 1647120 1690795 1735050 1779588 1824701 1870549
53371A870549M5996M5217M3940M2745M1842M1051L9796L7369L3701K9770K6604
$$ 1870549 1916545 1961762 2005702 2048447 2090289 2131340 2171136 2208505 2242206 2271976 2298580
53360B298580K4090K1279J7744J3948J0375O961L402m53m528q439j1666j4266
$$ 2298580 2322670 2343949 2361693 2375641 2386016 2392977 2396379 2395926 2391398 2382959 2371293 2357027
53348B357027j7125k0886k4906k8017l0080l1997l4351l6948l9626m2516m5254
$$ 2357027 2339902 2319016 2294110 2266093 2236013 2204016 2169665 2132717 2093091 2050575 2005321
53337B005321m6971m7306m6789m5870m4341m2083l9717l8035l7184l6782l6411
$$ 2005321 1958350 1911044 1864255 1818385 1774044 1731961 1692244 1654209 1617025 1580243 1543832
53326A543832l5797l4807l3522l2027l0172k7973k6104k5239k4919k3879k1716
$$ 1543832 1508035 1473228 1439706 1407679 1377507 1349534 1323430 1298191 1273272 1249393 1227677
53315A227677j9371j7626j6030j3937j1814j0695j0765j1189j1187j0634r757
$$ 1227677 1208306 1190680 1174650 1160713 1148899 1138204 1127439 1116250 1105063 1094429 1084672
53304A084672q775p785o701n386m008l032k599k217j359j11J050J888K475K865
$$ 1084672 1075897 1068112 1061411 1056025 1052017 1048985 1046386 1044169 1042810 1042699 1043749 1045637 1048112 1050977
53290A050977L128L563M510N908P307Q277Q764R122R905J1435J3452J5345J6792
$$ 1050977 1054105 1057668 1062178 1068086 1075393 1083670 1092434 1101556 1111461 1122896 1136348 1151693 1168485
53277A168485J8009J9279K0479K1213K1199K0493J9490J8762J8578J8564J8054
$$ 1168485 1186494 1205773 1226252 1247465 1268664 1289157 1308647 1327409 1345987 1364551 1382605
53266A382605J6825J5155J3226J0944Q448O236M586L264K003P86n28k341m666
$$ 1382605 1399430 1414585 1427811 1438755 1447203 1453439 1458025 1461289 1463292 1464078 1463550 1461209 1456543
53253A456543o825q258r249j0413j1844j3230j4531j5910j7262j8302j9101k0047
$$ 1456543 1449718 1441460 1432211 1421798 1409954 1396724 1382193 1366283 1349021 1330719 1311618 1291571
53241A291571k1347k2819k4102k4727k4303k3059k1966k1782k2086k1822k0718
$$ 1291571 1270224 1247405 1223303 1198576 1174273 1151214 1129248 1107466 1085380 1063558 1042840
53230A042840j9560j8992j8698j8036j6932j5743j4628j3467j2317j1506j1249
$$ 1042840 1023280 1004288 985590 967554 950622 934879 920251 906784 894467 882961 871712
53219H71712j1373j1493j1317j0787r997q942p470n525l523k208j962k357k644
$$ 871712 860339 848846 837529 826742 816745 807803 800333 794808 791285 789077 787115 784758 782114
53206G82114k611k712l297m119m793n370o065o627o631o310o477p347q111q061
$$ 782114 779503 776791 773494 769375 764582 759212 753147 746520 739889 733579 727102 719755 711644 703583
53192G03583p618p627q086q341q250q353q871r363r565r877j0685j1741j2527
$$ 703583 695965 688338 680252 671911 663661 655308 646437 637074 627509 617632 606947 595206 582679
53179E82679j2831j2749j2471j2263j2257j2133j1446j0396r716r587r365q745
$$ 582679 569848 557099 544628 532365 520108 507975 496529 486133 476417 466830 457465 448720
53167D48720q435r103j0207j0623j0053r111q282p572o995o637o250n556m947
$$ 448720 440285 431182 420975 410352 400299 391188 382906 375334 368339 361702 355452 349896 344949
53154C44949n195o312p347p522o982o187n244m226l623l862m586n001m792m304
$$ 344949 339754 333442 326095 318573 311591 305404 300160 295934 292311 288449 283863 278862 274070 269766
53140B69766l839l328k714k288k392k962l593l905l770l239k507j882j539j373
$$ 269766 265927 262599 259885 257597 255205 252243 248650 244745 240975 237736 235229 233347 231808 230435
53126B30435j223j169j290j170k03J368K297J764O19N09J820L242L533K912K349
$$ 230435 229212 228043 226753 225583 225380 226748 229045 230809 231428 231937 233757 236999 240532 243444 245793
53111B45793K093J605O34m00j092j575k149k807l328l685m116m745n312n392m899
$$ 245793 247886 249491 250125 249725 248633 247058 244909 242102 238774 235089 230973 226228 220916 215524 210625
53096B10625m276m024m108m041l555l020k991l535m082l977l150k229j914k185
$$ 210625 206349 202325 198217 194176 190621 187601 184610 181075 176993 173016 169866 167637 165723 163538
53082A63538k369k081j799k086k605k568j959j579j808k075j841j352r83n28K57
$$ 163538 161169 159088 157289 155203 152598 150030 148071 146492 144684 142609 140768 139416 138433 137905 138162
53067A38162Q50N00o52j572j491o41J18J69k92m80O0P34M91p54j887j987j363
$$ 138162 139012 139512 138860 137288 135797 135156 135274 135443 135151 134671 134731 135465 135956 135202 133315 131328 129965
53050A29965p78l63R6L86J94j82k26k8ro9J21K43l00j238j591j085n66p22j213
$$ 129965 129187 128824 128920 129306 129500 129318 129092 129064 129055 128986 129107 129350 129050 127812 126221 125136 124570 123848 122635
53031A22635j417j312j207j113q04k57L25O83O03J09m09o13o71r21j148q10rM76
$$ 122635 121218 119906 118699 117586 116782 116525 116850 117533 118136 118245 117836 117223 116552 115631 114483 113673 113664 114140
53013A14140K63j63k30oK15M00N43M25jl55k96R7N60R08Q69K47n73p85k26K93
$$ 114140 114403 114240 114010 114004 114219 114619 115162 115587 115586 115231 114935 115032 115592 116500 117369 117616 117043 116258 116032 116325
52993A16325R8m61o60l99o7J49K83K55O6M5M29R75J399J799K329K791L076L555
$$ 116325 116423 115962 115302 114903 114836 114985 115268 115523 115589 115634 116063 117038 118437 120236 122565 125356 128432 131987
52975A31987M468N276N331M818M416M241L908L355K949K796K643K372K073J700
$$ 131987 136455 141731 147062 151880 156296 160537 164445 167800 170749 173545 176188 178560 180633 182333
52961A82333J313J349J906K000N43j995l863m168l709l485l438l172k922k998
$$ 182333 183646 184995 186901 188901 189444 187449 183586 179418 175709 172224 168786 165614 162692 159694
52947A59694k969k281j294r49j568k536l014k600j537o09n72j279j705j171k36
$$ 159694 156725 154444 153150 152201 150633 148097 145083 142483 140946 140337 139765 138486 136781 135610 135374
52932A35374R4l74r86j188q57m4R62J471J028J73o4N08J026P67pn99o78l02L95
$$ 135374 135468 135094 134108 132920 132063 132019 132981 134452 135480 135653 135589 136097 137123 137890 137883 137284 136606 136304 136699
52913A36699J131J439J056K74l27l85O5P02J085Q29q3j174j758j424l85O09Q78
$$ 136699 137830 139269 140325 140599 140272 139887 139952 140654 141739 142568 142485 141311 139553 138129 137744 138353 139231
52896A39231M88J82M63R54J041Q02Q16J139J152O08J56M73J259J626J214N60L48
$$ 139231 139719 139901 140364 141318 142359 143161 143977 145116 146268 146876 147032 147505 148764 150390 151604 152164 152512
52879A52512O47R59Q39L01l13q01j178j361j059k53N36Q55R40J219J475J199O49
$$ 152512 153159 154118 154957 155258 154945 154144 152966 151605 150546 150293 150829 151684 152624 153843 155318 156517 157166
52862A57166O86J436J958J631J030R85J383J576J424J287J371J703K353L126L408
$$ 157166 157852 159288 161246 162877 163907 164892 166275 167851 169275 170562 171933 173636 175989 179115 182523
52847A82523K971K594L102M109M513M010L250K610J716K97j271k528l317l568
$$ 182523 185494 188088 191190 195299 199812 203822 207072 209682 211398 211695 210424 207896 204579 201011
52833B01011l214k541k023j740j434j231j531k191k540k513k839l730m205l395
$$ 201011 197797 195256 193233 191493 190059 188828 187297 185106 182566 180053 177214 173484 169279 165884
52819A65884j880r79j091j534j755j924k332k828l072k980k698k344j858j127
$$ 165884 164004 163025 161934 160400 158645 156721 154389 151561 148489 145509 142811 140467 138609 137482
52805A37482k55L37K66l71j142j777k224k312j808q84p6L60N49M72q6r03j356
$$ 137482 137227 137564 137830 137459 136317 134540 132316 130004 128196 127312 127236 127596 128145 128617 128531 127628 126272
52788A26272j353j490j930j896r48K8o8r25j320q60l23l67p78j055j014p34m55
$$ 126272 124919 123429 121499 119603 118655 118683 118615 117690 116370 115510 115187 114820 114042 112987 111973 111239 110784
52771A10784n91j292j971j884j112m06j63j63k69n90q97p10j93j82r93j887k192
$$ 110784 110193 108901 106930 105046 103934 103528 103365 103202 102933 102343 101446 100736 100543 100361 99368 97481 95289
52754I5289k206k460k690k275j381q73j136j625j671j275r34r31j036q44k61L46
$$ 95289 93083 90623 87933 85658 84277 83404 82268 80643 78972 77697 76763 75832 74796 73952 73691 74037
52738G4037N93N29N31P70R98R12M83j60r07j580j911j774j329q31m40k58k92l25
$$ 74037 74630 75159 75690 76460 77458 78370 78853 78693 77786 76206 74295 72521 71192 70361 69921 69663 69371 69046
52720F9046q1L17M40K00P9L95P56O81M36O67J315J593J171P27J011J780K187J969
$$ 69046 68965 69282 69722 69922 70001 70396 71152 71833 72269 72936 74251 75844 77015 77742 78753 80533 82720 84689
52702H4689J701J869K238K327K193K350K975L552L395K369R75j79q80j286j488
$$ 84689 86390 88259 90497 92824 95017 97367 100342 103894 107289 109658 110633 110454 109574 108288 106800
52687A06800j363r09n88r18j746k293k203k143k911m177m688l830k362j484j547
$$ 106800 105437 104528 103940 103022 101276 98983 96780 94637 91726 87549 82861 79031 76669 75185 73638
52672G3638k006k207j930j377q81o07l40K11Q79J119P56K50L6m1l51q56j231j301
$$ 73638 71632 69425 67495 66118 65237 64630 64290 64501 65380 66499 67255 67505 67541 67500 67149 66293 65062 63761
52654F3761j093p15m81p52j358j528q35J78P12P05N92M75J99r5j31j34n67j387
$$ 63761 62668 61953 61472 60720 59362 57834 56999 57177 57889 58594 59186 59661 59860 59765 59634 59500 58933 57546
52636E7546k079k332k105j236K51J628K051J619J186J078Q29K10l89p60j175j572
$$ 57546 55467 53135 51030 49794 50045 51673 53724 55343 56529 57607 58436 58646 58257 57497 56322 54750
52620E4750j378m93K75K85p4j06K14N14P31R72J096R68Q06P90O91L46J63O04J409
$$ 54750 53372 52879 53154 53439 53365 53259 53473 53987 54718 55690 56786 57754 58560 59350 60041 60387 60550 61154 62563
52601F2563J805J327J74j070j741j422l43P40J232J071L93o82j655j710o18P88
$$ 62563 64368 65695 65869 64799 63058 61636 61293 62033 63265 64336 64729 64047 62392 60682 60064 60852
52585F0852J543J543J264R53N94L44L45M44N14P47J180J385J110P87Q27Q81N63
$$ 60852 62395 63938 65202 66155 66749 67093 67438 67882 68396 69143 70323 71708 72818 73605 74432 75313 75876
52568G5876L72R66J877K005J266O98Q67J169R64N13L21L42K41n3m77r77j295j012
$$ 75876 76248 77214 79091 81096 82362 83060 83927 85096 86060 86573 86894 87236 87477 87424 86947 85970 84675 83663
52550H3663j62O40R35R23R47R55Q27Q58J403K283K877K738J908Q14N2M3O16J051
$$ 83663 83501 84141 85076 85999 86946 87901 88728 89586 90989 93272 96149 98887 100795 101609 101661 101704 102320 103371
52532A03371Q02N8n49o07k05K59L95J07k63j97M15J120J389J139O95M20M52O02
$$ 103371 104173 104231 103682 103075 102870 103129 103524 103631 103368 103171 103586 104706 106095 107234 107929 108349 108801 109403
52514A09403M36k03p69n06M01P61j11j265j248j29N44j46j287j528r09n16p41
$$ 109403 109839 109636 108867 108361 108762 109523 109412 108147 106899 106770 107314 107168 105881 104353 103444 102928 102187
52497A02187q57l50K52J95m24q61o50J45J174J892J728P19k26l01K09M99N41R25
$$ 102187 101330 100980 101232 101427 101003 100142 99492 99637 100811 102703 104431 105150 104924 104623 104832 105331 105872 106797
52479A06797J506J375M12j83M01J323J414R30R03J309J170L38j09M52J255J323
$$ 106797 108303 109678 110090 109907 110308 111631 113045 113975 114878 116187 117357 117695 117586 118038 119293 120616
52463A20616P81L86L50K78l0l31l16N1N46Q31P27L98J40m3l19m92p6Q62J451J019
$$ 120616 121397 121783 122133 122411 122381 122050 121734 121785 122331 123162 123889 124287 124427 124384 124065 123573 123497 124359 125810 126829
52443A26829J7n24k22M39R04J049Q93M29n6kP20J469J533J037O87P32O75J12o32
$$ 126829 126846 126322 126100 126539 127443 128492 129385 129814 129758 129756 130476 131945 133478 134515 135202 135934 136609 136721 136089
52424A36089j002r20o25j78L58N17L1m05K37J737K620K121J202J056J453J436
$$ 136089 135087 134167 133542 133364 133722 134239 134270 133865 134102 135839 138459 140580 141782 142838 144291 145727
52408A45727R98R35J342J452R59M03J00l10r36j237j001r18j488k062j728p58
$$ 145727 146725 147660 149002 150454 151413 151816 151916 151606 150670 149433 148432 147514 146026 143964 142236 141478
52392A41478l20q33j424j115q1O28L84l44o46l52j58n84j145r49J06J243J818
$$ 141478 141158 140325 138901 137786 137705 138333 138717 138373 137727 137375 137217 136633 135488 134539 134645 135888 137706
52375A37706J863J644J238Q03O92R63J175R68O38P53J427K207K591K486K177K025
$$ 137706 139569 141213 142451 143254 143946 144909 146084 147052 147690 148443 149870 152077 154668 157154 159331 161356
52359A61356K042J923J573J413J786K310K315J865J671K050K559K837L002L094
$$ 161356 163398 165321 166894 168307 170093 172403 174718 176583 178254 180304 182863 185700 188702 191796
52345A91796K871K411K246K493K565K218K062K528K985K640J708R55N76L17K48
$$ 191796 194667 197078 199324 201817 204382 206600 208662 211190 214175 216815 218523 219478 220054 220371 220619
52330B20619N23P72O20N29J214K401L114L075K891K866K656K204K069K519L133
$$ 220619 221142 221914 222534 223063 224277 226678 229792 232867 235758 238624 241280 243484 245553 248072 251205
52315B51205L594M130M877N506N808O026O303O390O246O261O509O474O006N841
$$ 251205 254799 258929 263806 269312 275120 281146 287449 293839 300085 306346 312855 319329 325335 331176
52301C31176O644Q031R154R751J0052J0164J0258J0875J2196J3323J3272J2500
$$ 331176 337820 345851 355005 364756 374808 384972 395230 406105 418301 431624 444896 457396
52289D57396J2510J3776J5029J4957J3845J3023J3236J4134J5025J5502J5451
$$ 457396 469906 483682 498711 513668 527513 540536 553772 567906 582931 598433 613884
52278F13884J4990J4439J4102J3892J3441J2602J1650J0930J0400R683Q528P142
$$ 613884 628874 643313 657415 671307 684748 697350 709000 719930 730330 740013 748541 755683
52266G55683N985N274M791M272L747L346K891K077J061M55M94N48r5j170j722
$$ 755683 761668 766942 771733 776005 779752 783098 785989 788066 789127 789582 790076 790624 790529 789359 787637
52251G87637j348o19j24K61Q04J217J169J116J789K986L673L551L609M690O186
$$ 787637 786289 785670 785546 785807 786611 787828 788997 790113 791902 794888 798561 802112 805721 810411 816597
52236H16597O898O728O640P153P723P836P840Q298R043R362Q872P803O600N630
$$ 816597 823495 830223 836863 844016 851739 859575 867415 875713 884756 894118 902990 910793 917393 923023
52222I23023N080M893M733M265L409K235P55r43k560l804m757n732o828p857q703
$$ 923023 928103 932996 937729 941994 945403 947638 948393 947450 944890 941086 936329 930597 923769 915912 907209
52207I07209r469j0208j0782j1140j1535j2227j2990j3162j2312j0824r672r533
$$ 907209 897740 887532 876750 865610 854075 841848 828858 815696 803384 792560 782888 773355
52195G73355j0152j0715j0715j0244r416q091o410n196n136n783n995n454m960
$$ 773355 763203 752488 741773 731529 722113 714022 707612 702416 697280 691497 685502 680048 675088
52182F75088n048n126m528l699l490l694l371k442j903k162k303j600q26j210
$$ 675088 670040 664914 660386 656687 653197 649503 646132 643690 641787 639625 637322 635722 634896 633686
52168F33686k583l576l492l020l026l403l454k823j739o57M2K75L33N71Q71P72
$$ 633686 631103 627527 624035 621015 617989 614586 611132 608309 606570 605913 605955 606230 606563 607134 608005 608777
52152F08777J30o61j253j755k275k498k137j523j294j602k021k215k259k309k258
$$ 608777 608907 608246 606993 605238 602963 600465 598328 596805 595511 593909 591888 589673 587414 585105 582847
52137E82847j902j269o52l94p18j530k392k785k609k287k329k787l272l429l255
$$ 582847 580945 579676 579024 578630 577912 576382 573990 571205 568596 566309 563980 561193 557921 554492 551237
52122E51237k930k527k113j899j992k003j338k8J103J415J219J225J518J631J467
$$ 551237 548307 545780 543667 541768 539776 537773 536435 536407 537510 538925 540144 541369 542887 544518 545985
52107E45985J507K196L553N419P499R165R922J0161J0742J1733J2354J2411J2786
$$ 545985 547492 549688 553241 558660 566159 575324 585246 595407 606149 617882 630236 642647 655433
52094F55433J4012J5304J5879J6307J7505J8951J9286J8386J7563J7618J7910
$$ 655433 669445 684749 700628 716935 734440 753391 772677 791063 808626 826244 844154
52083H44154J7652J7024J6482J5884J4890J3663J2519J1403J0147Q850P583O127
$$ 844154 861806 878830 895312 911196 926086 939749 952268 963671 973818 982668 990251 996378
52071I96378M415K837J661M88j170l054m446n141n643o481p715r054j0103j0498
$$ 996378 1000793 1003630 1005291 1005779 1004609 1001555 997109 991968 986325 979844 972129 963075 952972 942474
52057I42474j0169r469q842q339p692o806n974n567n669n942n824m990l672k414
$$ 942474 932305 922836 913994 905655 897963 891157 885183 879616 873947 868005 862181 857191 853519 851105
52043H51105j404l23J088K561L677M368M807N012M939M818N017N584O197O564
$$ 851105 849701 849378 850466 853027 856704 861072 865879 870891 875830 880648 885665 891249 897446 904010
52029I04010O665O607O448O168N712N046M252L487K785K105J487R64K29j176l104
$$ 904010 910675 917282 923730 929898 935610 940656 944908 948395 951180 953285 954772 955736 955965 954789 951685
52014I51685m759n728o632q239j0275j1813j2547j3067j3859j4744j5408j5868
$$ 951685 946926 941198 934566 926327 916052 904239 891692 878625 864766 850022 834614 818746
52002H18746j6234j6512j6827j7397j8119j8611j8807j9055j9423j9405j8687
$$ 818746 802512 786000 769173 751776 733657 715046 696239 677184 657761 638356 619669
51991F19669j7750j7305j7428j7613j7468j6982j6298j5567j4973j4625j4450
$$ 619669 601919 584614 567186 549573 532105 515123 498825 483258 468285 453660 439210
51980D39210j4314j4082j3481j2209j0440q858p959p546p252p188p628q277q451
$$ 439210 424896 410814 397333 385124 374684 365826 357867 350321 343069 335881 328253 319976 311525
51967C11525p920p153o658o477o335n988n361m670m376m631m869m343l135k150
$$ 311525 303605 296452 289794 283317 276982 270994 265633 260963 256587 251956 247087 242744 239609 237459
51953B37459j999k343k523k358k100k004k243k921l761m079l448k288j457j315
$$ 237459 235460 233117 230594 228236 226136 224132 221889 218968 215207 211128 207680 205392 203935 202620
51939B02620j497j492j150o73m02o13j249j836j847j300p08n39p70j029r90o11
$$ 202620 201123 199631 198481 197808 197406 196793 195544 193708 191861 190561 189853 189314 188544 187515 186525 185914
51923A85914j83j32o01j253j632j641j536j455j298j049r18r98j070r37q37j108
$$ 185914 185731 185599 184998 183745 182113 180472 178936 177481 176183 175134 174216 173218 172148 171211 170374 169266
51907A69266j602j699j125m58n80j608k586k490j392l83l12q91j205q42j94K27
$$ 169266 167664 165965 164840 164382 163802 162194 159608 157118 155726 155343 155031 154140 152935 152093 151899 152126
51891A52126L67M22M36L29R7j81m60o63o26k96J6p7n31q09m66L50J080J382J359
$$ 152126 152493 152915 153351 153680 153777 153596 153136 152473 151847 151551 151567 151490 150959 150150 149684 150034 151114 152496 153855
51872A53855J243J074Q00N51N59Q42J148J235J037N66j04o61o66o5O02P44L83
$$ 153855 155098 156172 156972 157523 158082 158924 160072 161307 162344 162910 162806 162145 161479 161414 162016 162760 163143
51855A63143M1N5K94N46Q46J291J760J925J582Q92L51L94R20J333J226R21J058
$$ 163143 163184 163239 163533 164079 164925 166216 167976 169901 171483 172375 172726 173120 174040 175373 176599 177520 178578
51838A78578J744K374K339J572M03q40j901k543k598k086j255n50l88p11r48o87
$$ 178578 180322 182696 185035 186607 187010 186170 184269 181726 179128 177042 175787 175237 174849 174138 173190 172503
51822A72503k20j18m22p25q76r58p00L12J668K289J860J332J528J942J662Q42
$$ 172503 172283 172165 171743 171018 170142 169184 168484 168796 170464 172753 174613 175945 177473 179415 181077 181919
51806A81919L98O45J106J394J493J334Q73N00N93P49K77n45o81J37R88J120Q04
$$ 181919 182317 182962 184068 185462 186955 188289 189162 189662 190255 191004 191281 190736 190055 190192 191180 192300 193104
51789A93104M82j0p31r95k70P66J024N24K78P78J437J637J565J676J932J922J477
$$ 193104 193586 193576 192845 191850 191580 192346 193370 193894 194172 194950 196387 198024 199589 201265 203197 205119 206596
51772B06596Q23K78Q5L61R62J486J627J517J552J827J933J490P39L58P01J454
$$ 206596 207419 207697 207782 208143 209105 210591 212218 213735 215287 217114 219047 220537 221276 221634 222335 223789
51756B23789K186K891L679M209L944K983K105J885K190K695L398M200M516L838
$$ 223789 225975 228866 232545 236754 240698 243681 245786 247671 249861 252556 255954 260154 264670 268508
51742B68508K531J490J047O93j4p64r26l63M26Q39O90K78J17M59J045J366J216
$$ 268508 271039 272529 273576 274269 274255 273491 272565 272202 272628 273467 274157 274435 274552 275011 276056 277422 278638
51725B78638Q66O21M07pn06o26j14P29J461J989K400K467J732K15j317k147k351
$$ 278638 279504 280125 280532 280525 280019 279393 279279 280008 281469 283458 285858 288325 290057 290272 288955 286808 284457
51708B84457k459k617k530k167j921j956j935j586j092o76k23L25N89K18n28j136
$$ 284457 281998 279381 276851 274684 272763 270807 268872 267286 266194 265518 265295 265620 266209 266427 265899 264763
51692B64763j508j746j549n41Q26J509J233R31J491K576L134K689J546J24j340
$$ 264763 263255 261509 259960 259419 260245 261754 262987 263918 265409 267985 271119 273808 275354 275478 274138
51677B74138k537l168l360l505l618l290k374j317n66j8O84J596K546L443M135
$$ 274138 271601 268433 265073 261568 257950 254660 252286 250969 250403 250385 251069 252665 255211 258654 262789
51662B62789M193L342K139J622K121K800K610J461J13q41j446j968k413k636k710
$$ 262789 266982 270324 272463 274085 276206 279006 281616 283077 283190 282349 280903 278935 276522 273886 271176
51647B71176k979l767n039o289o832o352n259m379m236m617m909m704m102l534
$$ 271176 268197 264430 259391 253102 246270 239918 234659 230280 226044 221427 216518 211814 207712 204178
51633B04178l359l562l772l531k672j489n59l41q21j552k014k011j643j029k41
$$ 204178 200819 197257 193485 189954 187282 185793 185234 184893 184072 182520 180506 178495 176852 175823 175582
51618A75582M85P41L57l29q30j002j021j004q92o55l64n4K48M04L17J85K89N03
$$ 175582 176067 176808 177165 176836 176006 175004 173983 172979 172087 171432 171068 171014 171262 171666 171983 172168 172457 172960
51600A72960L85j71o61n91m9N51J065J635K243K642K701K532K218J709J081O96
$$ 172960 173345 173174 172513 171922 171873 172424 173489 175124 177367 180009 182710 185242 187460 189169 190250 190946
51584A90946Q65J475K150K700L238L782M088M002L788L824M068M138L884L528
$$ 190946 191811 193286 195436 198136 201374 205156 209244 213246 217034 220858 224926 229064 232948 236476
51570B36476L206K812K412K339K464J878m9k549m054l912k942k210j937j787j593
$$ 236476 239682 242494 244906 247245 249709 251587 251538 248989 244935 241023 238081 235871 233934 232147 230554
51555B30554j341r00j67O90J504K275K902L075K809K773L502M559N046M877M941
$$ 230554 229213 228313 228146 228836 230340 232615 235517 238592 241401 244174 247676 252235 257281 262158 267099
51540B67099N837O969P211O213M669L461K804K226J243j11j360k155k573k832
$$ 267099 272936 279905 287116 293329 297998 301459 304263 306489 307732 307621 306261 304106 301533 298701
51526B98701k816k180r14M40J226J308J043P34L09l35q97r50o46p54j781l281
$$ 298701 295885 293705 292791 293231 294457 295765 296808 297542 297851 297516 296619 295669 295023 294269 292488 289207
51510B89207m316m452l934l142k326j821j963k602l157l296l213l034k490j500
$$ 289207 284891 280439 276505 273363 271037 269216 267253 264651 261494 258198 254985 251951 249461 247961
51496B47961o12l66m54j48N88R95O29N5J04Q12J417J309O87K50M46J199K176L035
$$ 247961 247349 246983 246529 246381 246969 247964 248593 248648 248752 249564 250981 252290 252977 253227 253673 254872 257048 260083
51478B60083L409L041K182J564J612J880J720J272J333K198L309M147M770N270
$$ 260083 263492 266533 268715 270279 271891 273771 275491 276763 278096 280294 283603 287750 292520 297790
51464B97790N304M691L965L758L952L959L594L191L084L369M021M783N077M523
$$ 297790 303094 307785 311750 315508 319460 323419 327013 330204 333288 336657 340678 345461 350538 355061
51450C55061L431K438J774J273Q65N62R0q27j863k268j795j012n92o48q94j091
$$ 355061 358492 360930 362704 363977 364842 365404 365494 364667 362804 360536 358741 357729 357137 356489 355595 354504
51434C54504j237j492j952k398k420k001j816k465l663m582m964n343o160p162
$$ 354504 353267 351775 349823 347425 345005 343004 341188 338723 335060 330478 325514 320171 314011 306849
51420C06849p782p684o851n562m431m095m572n158n078m130k690j372o05l68k69
$$ 306849 299067 291383 284532 278970 274539 270444 265872 260714 255636 251506 248816 247444 246839 246471 246202
51405B46202o7M9n0J6O14J370J633J556J953L001L849L752K929J966J045K15k07
$$ 246202 246135 246184 246134 246150 246764 248134 249767 251323 253276 256277 260126 263878 266807 268773 269818 270033 269826
51388B69826j70m20j772l997n976o932p048o918o866o947p189p509p579p042n944
$$ 269826 269656 269236 267464 263467 257491 250559 243511 236593 229727 222780 215591 208082 200503 193461 187517
51373A87517m801m055l601l022k281j849j974k284k397k527k977l355l016k127
$$ 187517 182716 178661 175060 172038 169757 167908 165934 163650 161253 158726 155749 152394 149378 147251
51359A47251j559j675j929j804j476j317j363j535j825k019j725j041o30p94r78
$$ 147251 145692 144017 142088 140284 138808 137491 136128 134593 132768 130749 129024 127983 127353 126559 125581
51344A25581o27lK65O6k06k48J5N49J082J196Q44M64K85Om70n90J3P75R96J011
$$ 125581 124954 124951 125216 125282 125076 124828 124843 125392 126474 127670 128514 128978 129263 129269 128799 128209 128222 128997 129993 131004
51324A31004J676K977L902L734K811J949J718K240L148L773L799L653L822L998
$$ 131004 132680 135657 139559 143293 146104 148053 149771 152011 155159 158932 162731 166384 170206 174204
51310A74204L540K601J967J806J440N79j62l37n20j425k742l572l679l655l961
$$ 174204 177744 180345 182312 184118 185558 186137 185975 185638 185118 183693 180951 177379 173700 170045 166084
51295A66084m383m553m475m361m229l934l455k967k608k312j958j610j453j497
$$ 166084 161701 157148 152673 148312 144083 140149 136694 133727 131119 128807 126849 125239 123786 122289
51281A22289j475j163o50j64K17N46P94P82L69m36j405k140k279j838j192p17
$$ 122289 120814 119651 119001 118837 119054 119600 120394 121176 121545 121109 119704 117564 115285 113447 112255 111538
51265A11538n20o13r88j371j221l23Q31J595J826J750J440R18N26O56J190J673
$$ 111538 111018 110405 109417 108046 106825 106502 107333 108928 110754 112504 113944 114862 115388 116044 117234 118907
51249A18907J934K029J739P29o21j340r74j65J96m4m04m90l28j60k10n02q15r54
$$ 118907 120841 122870 124609 125338 124717 123377 122403 122238 122434 122390 121986 121496 121168 121008 120798 120296 119481 118527
51231A18527j030j186j176p03j08n7m04j06J234K474K241P73m03l87K15M32R5
$$ 118527 117497 116311 115135 114432 114324 114267 113863 113757 114991 117465 119706 120479 120076 119689 119904 120336 120431
51214A20431k99l72n0O16J373J663J043k12j274j518j023k44M57Q84Q65L82j62
$$ 120431 120132 119760 119710 120326 121699 123362 124405 124193 122919 121401 120378 120134 120591 121475 122340 122722 122560
51197A22560k37K25P14P42L15k78r06j537j990k052j768j382j114j155j621k207
$$ 122560 122323 122548 123262 124004 124319 124041 123135 121598 119608 117556 115788 114406 113292 112137 110516 108309
51181A08309k251j503o68o25j215j520j177o83k85M74J705K498K080J053O56J069
$$ 108309 106058 104555 103887 103262 102047 100527 99350 98667 98382 98856 100561 103059 105139 106192 106848 107917
51165A07917J321P62j02m67k25J69K99L4n81j275j650j520j120p67n49m41n17
$$ 107917 109238 110000 109898 109431 109206 109375 109674 109708 109127 107852 106202 104682 103562 102795 102246 101805 101288
51148A01288p94j014q77m88l02m99o79l29N07J215J277P48R0k55q1N40J219J448
$$ 101288 100494 99480 98603 98115 97813 97314 96635 96306 96813 98028 99305 100053 100143 99888 99807 100347 101566 103014
51130A03014J097O73Q20J565K328K623K556K498K523K286J413Pj199j350m16N15
$$ 103014 104111 104784 105604 107169 109497 112120 114676 117174 119697 121983 123396 123403 122204 120854 120438 120953
51114A20953L26q00j640j512r75p54o81k29M33P21P11J038J718J877J034Mm9Q91
$$ 120953 121279 120479 118839 117327 116352 115598 114917 114688 115121 115842 116553 117591 119309 121186 122220 122224 122175 123066
51096A23066J642J304K62l97k38J15r4p43j047o83k22k74o27o48k55P3J40K71
$$ 123066 124708 126012 126274 125877 125639 125754 125660 124917 123870 123187 122965 122691 122064 121416 121161 121234 121374 121645
51078A21645O09P91N56J97Oj60m50n20j31J94k45j189j671j347q59o53l46L59
$$ 121645 122254 123045 123601 123798 123804 123644 123194 122674 122543 122737 122492 121303 119632 118285 117426 116773 116427 116786
51060A16786Q95O09m9pR89K119K593K371J802J214R54J198J492J146K72j50L96
$$ 116786 117681 118290 118241 118234 119223 121342 123935 126306 128108 129322 130276 131474 132966 134112 134384 134234 134630
51043A34630J220J542J662K262L028K948J880Q84P91J257J429J035L50l06o80
$$ 134630 135850 137392 139054 141316 144344 147292 149172 150056 150847 152104 153533 154568 154918 154612 153932
51028A53932n76q7L68N05M80M82M06J58L3L42R25J363J531J634J848K245K933
$$ 153932 153356 153269 153637 154142 154622 155104 155510 155668 155701 156043 156968 158331 159862 161496 163344 165589 168522
51011A68522L814M361M105L402L221M034N195N692N231M450M137M499N152N702
$$ 168522 172336 176697 180802 184204 187425 191459 196654 202346 207577 212027 216164 220663 225815 231517
50997B31517O172O834P736Q630R414J0315J1422J2411J3095J4039J5949J8595
$$ 231517 237689 244523 252259 260889 270303 280618 292040 304451 317546 331585 347534 366129
50985C66129K0949K2523K3958K6024K8621L1247L3884L6811L9823M2420M4648
$$ 366129 387078 409601 433559 459583 488204 519451 553335 590146 629969 672389 717037
50974G17037M7091M9916N2525N4347N5405N5897N5671N4485N2436M9706M6131
$$ 717037 764128 814044 866569 920916 976321 1032218 1087889 1142374 1194810 1244516 1290647
50963A290647M1378L5424K8587K1275J3985P286J466l764q841j3720j7976k1353
$$ 1290647 1332025 1367449 1396036 1417311 1431296 1438582 1440048 1436284 1427443 1413723 1395747 1374394
50951A374394k3779k4988k4656k3080k1237j9892j9010j8160j7322j7018j7808
$$ 1374394 1350615 1325627 1300971 1277891 1256654 1236762 1217752 1199592 1182270 1165252 1147444
50940A147444j9750k2262k4456k5890k6997k8551l0724l3006l5002l6738l8092
$$ 1147444 1127694 1105432 1080976 1055086 1028089 999538 968814 935808 900806 864068 825976
50929H25976l8476l7570l5930l4386l3090l1556k9442k6903k4251k1711j9401
$$ 825976 787500 749930 714000 679614 646524 614968 585526 558623 534372 512661 493260
50918D93260j7253j5040j2732j0681r207q121o967n580m119k708j361j66P65J401
$$ 493260 476007 460967 448235 437554 428347 420226 413259 407679 403560 400852 399491 399325 400090 401491
50904D01491J651J352O88L17O55J304J640J673J814K054K036J865K088K854L649
$$ 401491 403142 404494 405182 405499 406154 407458 409098 410771 412585 414639 416675 418540 420628 423482 427131
50889D27131M035M121M234M597N419O776Q321R540J0357J1044J1655J2138J2941
$$ 427131 431166 435287 439521 444118 449537 456313 464634 474174 484531 495575 507230 519368 532309
50876E32309J4725J7369J9962K2031K4076K6634K9623L2900L6752M1320M6200
$$ 532309 547034 564403 584365 606396 630472 657106 686729 719629 756381 797701 843901
50865H43901N1167N6656O3003O9754P6363Q3033R0233R7734J04832J11230J17030
$$ 843901 895068 951724 1014727 1084481 1160844 1243877 1334110 1431844 1536676 1647906 1764936
50854A764936J22080J25900J28185J28747J27196J23071J16239J06747R4509P9599
$$ 1764936 1887016 2012916 2141101 2269848 2397044 2520115 2636354 2743101 2837610 2917209
50844B917209O2594M4254K5101N761j2583k8692m2049n2626o0198o4522o5965
$$ 2917209 2979803 3024057 3049158 3054919 3042336 3013644 2971595 2918969 2858771 2794249 2728284
50833B728284o5247o2621n7939n1498m4299l7522l2238k9412k9469l1818l5434
$$ 2728284 2663037 2600416 2542477 2490979 2446680 2409158 2376920 2347508 2318039 2286221 2250787
50822B250787l9959m5693n2569n9891o7099p4029q0242q4851q7337q7960q7122
$$ 2250787 2210828 2165135 2112566 2052675 1985576 1911547 1831305 1746454 1659117 1571157 1484035
50811A484035q4899q1451p7286p2735o7577o1637n5286m9065m3136l7447l2145
$$ 1484035 1399136 1317685 1240399 1167664 1100087 1038450 983164 934099 890963 853516 821371
50800H21371k7406k3149j9154j5324j1620q057m884k403m86J303K930L749L511
$$ 821371 793965 770816 751662 736338 724718 716661 711777 709374 708888 710191 713121 716870 720381
50787G20381K951K878L060K662J477P0j186k512m033n342o042o432p173q416r534
$$ 720381 723332 726210 729270 731932 733409 733479 732293 729781 725748 720406 714364 707932 700759 692343 682809
50772F82809r801r209q410p908p490o676n415m029k579q24J203L160N072P461
$$ 682809 673008 663799 655389 647481 639991 633315 627900 623871 621292 620468 621671 624831 629903 637364
50758F37364J0443J3281J5307J6888J8856K1416K4282K7588L1784L6650M1260
$$ 637364 647807 661088 676395 693283 712139 733555 757837 785425 817209 853859 895119
50747H95119M5186M9009N3365N8088O2801O7713P3198P8835Q3556Q6740Q8637
$$ 895119 940305 989314 1042679 1100767 1163568 1231281 1304479 1383314 1466870 1553610 1642247
50736A642247Q9726Q9922Q8544Q4750P8085O8838N7887M5926L2882J8400K836
$$ 1642247 1731973 1821895 1910439 1995189 2073274 2142112 2199999 2245925 2278807 2297207 2300043
50725B300043j2678k7202m0405n1852o0504o5545o7295o6690o4074n9209n2468
$$ 2300043 2287365 2260163 2219758 2167906 2107402 2041857 1974562 1907872 1843798 1784589 1732121
50714A732121m5216l8756l3425k8969k5333k2745k1434k1692k3855k7750l2440
$$ 1732121 1686905 1648149 1614724 1585755 1560422 1537677 1516243 1494551 1470696 1442946 1410506
50703A410506l6964m1171m5332m9161n1854n3021n3025n2237n0484m7482m3450
$$ 1410506 1373542 1332371 1287039 1237878 1186024 1133003 1079978 1027741 977257 929775 886325
50692H86325l8969l4488l0113k5854k1749j7870j4290j1018p980n153k632l94
$$ 886325 847356 812868 782755 756901 735152 717282 702992 691974 683994 678841 676209 675815
50680F75815J930M792Q139J1366J3925J5787J7211J8268J8708J8273J7088J5760
$$ 675815 677745 682537 690676 702042 715967 731754 748965 767233 785941 804214 821302 837062
50668H37062J4990J4851J4580J3369J1342R427Q214P317O120M784M112M551N697
$$ 837062 852052 866903 881483 894852 906194 915621 923835 931152 937272 942056 946168 950719 956416
50655I56416O914Q080R578J1594J3781J5727J7595K0001K3223K6772K9912L2366
$$ 956416 963330 971410 980988 992582 1006363 1022090 1039685 1059686 1082909 1109681 1139593 1171959
50643A171959L4370L6152L7606L8367L8052L6618L4556L2493L0444K7826K4516
$$ 1171959 1206329 1242481 1280087 1318454 1356506 1393124 1427680 1460173 1490617 1518443 1542959
50632A542959K1368J9153J7384J5033J2223J0267R976J0847J2206J4245J7273
$$ 1542959 1564327 1583480 1600864 1615897 1628120 1638387 1648363 1659210 1671416 1685661 1702934
50621A702934K0606K2980K3798K3226K1313J7718J2425O160j01n836j1016j5680
$$ 1702934 1723540 1746520 1770318 1793544 1814857 1832575 1845000 1851160 1851059 1845223 1834207 1818527
50609A818527j9674k2820k5326k7862l1091l5085l9355m3418m7127n0519n3505
$$ 1818527 1798853 1776033 1750707 1722845 1691754 1656669 1617314 1573896 1526769 1476250 1422745
50598A422745n5822n7083n6926n5484n3646n2399n1753n0677m8217m4390l9869
$$ 1422745 1366923 1309840 1252914 1197430 1143784 1091385 1039632 988955 940738 896348 856479
50587H56479l5282l1042k7438k4401k1464j8285j5017j1981r208o657m508k874
$$ 856479 821197 790155 762717 738316 716852 698567 683550 671569 662361 655704 651196 648322
50575F48322j437K96K479M913P356R559J1276J2544J3781J5267J6765J7985J9156
$$ 648322 646885 647181 649660 654573 661929 671488 682764 695308 709089 724356 741121 759106 778262
50562G78262K0670K2361K3715K4726K5962K7625K9063K9490K8931K8125K7674
$$ 778262 798932 821293 845008 869734 895696 923321 952384 981874 1010805 1038930 1066604
50551A066604K7511K7200K6503K5576K4754K4385K4802K6160K8105K9878L1082
$$ 1066604 1094115 1121315 1147818 1173394 1198148 1222533 1247335 1273495 1301600 1331478 1362560
50540A362560L2185L3929L6392L9128M1999M5253M8783N1971N4599N7187O0170
$$ 1362560 1394745 1428674 1465066 1504194 1546193 1591446 1640229 1692200 1746799 1803986 1864156
50529A864156O3193O5533O6679O6285O4134O0571N6282N1233M4411L5272K4719
$$ 1864156 1927349 1992882 2059561 2125846 2189980 2250551 2306833 2358066 2402477 2437749 2462468
50518B462468J4079L622p055j7723k7585l6319m4093n0680n5415n8066n8965n8263
$$ 2462468 2476547 2480169 2473114 2455391 2427806 2391487 2347394 2296714 2241299 2183233 2124268 2066005
50506B066005n5734n1274m5030l7201k8372j9881j2998p697l014J458N192P783
$$ 2066005 2010271 1958997 1913967 1876766 1848394 1828513 1815515 1807818 1804804 1806262 1811454 1819237
50494A819237R547J0813J1515J1546J0879R026N159j053r272j9155l0432m2158
$$ 1819237 1828784 1839597 1851112 1862658 1873537 1882563 1887722 1886669 1877397 1858242 1827810 1785652
50482A785652n2804o1415o7964p2494p4724p4855p3763p1879o8713o3981n8386
$$ 1785652 1732848 1671433 1603469 1530975 1456251 1381396 1307633 1235754 1167041 1103060 1044674
50471A044674n2767m7233m1708l6591l2124k7854k3470j9528j6500j3741j0409
$$ 1044674 991907 944674 902966 866375 834251 806397 782927 763399 746899 733158 722749
50460G22749o864m124k169M0K986N975Q280J0044J1884J4161J6788J9308K1133
$$ 722749 715885 711761 709592 709632 712618 718593 726873 736917 748801 762962 779750 799058 820191
50447H20191K2138K2947K4156K5462K6110K6064K6057K6542K7286K7952K8380
$$ 820191 842329 865276 889432 914894 941004 967068 993125 1019667 1046953 1074905 1103285
50436A103285K8245K7178K5465K3996K3247K2846K2357K1981K2050K2344K2359
$$ 1103285 1131530 1158708 1184173 1208169 1231416 1254262 1276619 1298600 1320650 1342994 1365353
50425A365353K1964K1464K1096K0812K0484K0190K0297K1237K3035K5111K6672
$$ 1365353 1387317 1408781 1429877 1450689 1471173 1491363 1511660 1532897 1555932 1581043 1607715
50414A607715K7271K6736K4884K1760J8068J4672J1526P669K530l341r117j4781
$$ 1607715 1634986 1661722 1686606 1708366 1726434 1741106 1752632 1760301 1762831 1759490 1750373 1735592
50402A735592k0830k7255l3421l8902m3925m8879n3673n7709o0361o1357o0773
$$ 1735592 1714762 1687507 1654086 1615184 1571259 1522380 1468707 1410998 1350637 1289280 1228507
50391A228507n8770n5483n1224m6602m2028l7185l1421k4810j8398j3142q873
$$ 1228507 1169737 1114254 1063030 1016428 974400 937215 905794 880984 862586 849444 840571
50380H40571m712k01M329Q406J1888J4707J6564J7174J6591J5055J2546Q788L841
$$ 840571 835859 835658 839987 848393 860281 874988 891552 908726 925317 940372 952918 961706 965547
50367I65547j584o601j0960j5055j9050k2319k4103k4475k4236k3897k3240k1946
$$ 965547 963963 957362 946402 931347 912297 889978 865875 841400 817164 793267 770027 748081
50355G48081k0267j8694j7282j5733j4005j2486j1476j0789j0017q992p888o848
$$ 748081 727814 709120 691838 676105 662100 649614 638138 627349 617332 608340 600452 593604
50343E93604n768m543l348k424j554j52J982M271O056P428Q853J0288J1239J1695
$$ 593604 587836 583293 579945 577521 575967 575815 577797 582068 588124 595552 604405 614693 625932 637627
50329F37627J2320J3502J4800J5709J6358J7059J7688J8041J8422J9153J9798
$$ 637627 649947 663449 678249 693958 710316 727375 745063 763104 781526 800679 820477
50318H20477J9635J8751J8016J7888J7945J7710J7280J6804J5996J4522J2579
$$ 820477 840112 858863 876879 894767 912712 930422 947702 964506 980502 995024 1007603
50307A007603J0680R129P958P076O120M469J861j147l677n422o728q033r577j1547
$$ 1007603 1018283 1027412 1035370 1042446 1048566 1053035 1054896 1053749 1050072 1044650 1037922 1029889 1020312 1008765
50293A008765j4049j6860j9523k1789k3706k5322k6557k7348k7625k7154k5838
$$ 1008765 994716 977856 958333 936544 912838 887516 860959 833611 805986 778832 752994
50282G52994k4132k2715k1710k0663j9428j8477j8054j7541j6243j4347j2551
$$ 752994 728862 706147 684437 663774 644346 625869 607815 590274 574031 559684 547133
50271E47133j1052r582q246p489p274o922o012m790l594k487j666j499j754j453
$$ 547133 536081 526499 518253 510764 503490 496568 490556 485766 482172 479685 478019 476520 474766 473313
50257D73313j55J287J856J806K097K782K986K465K071K404K943K958K617K557
$$ 473313 473158 474445 476301 478107 480204 482986 485972 488437 490508 492912 495855 498813 501430 503987
50243E03987K868L040K637J576O5j341j940j609j096j157j727k341k984l896m775
$$ 503987 506855 509895 512532 514108 514173 512832 510892 509283 508187 507030 505303 502962 499978 496082 491307
50228D91307m975m453l779l213k498j610j017q88p53k86J53J80P1L36J009J792
$$ 491307 486332 481879 478100 474887 472389 470779 469762 468874 468121 467835 467988 468168 468239 468575 469584 471376
50212D71376K502K940K800K225K032K755L778M132L923M064M729N008M324L265
$$ 471376 473878 476818 479618 481843 483875 486630 490408 494540 498463 502527 507256 512264 516588 519853
50198E19853K635K323J744Q71K07p8m04j207k478l874n035n769o161o427o628
$$ 519853 522488 524811 526555 527426 527633 527555 527151 525944 523466 519592 514557 508788 502627 496200 489572
50183D89572o615o328n940n593n160m505l808l328l015k573j952j523j781k889
$$ 489572 482957 476629 470689 465096 459936 455431 451623 448295 445280 442707 440755 439232 437451 434562
50169D34562m447n674n961n429m813m674m859m858m549m277m252m174l591k562
$$ 434562 430115 424441 418480 413051 408238 403564 398705 393847 389298 385021 380769 376595 373004 370442
50155C70442j785j938k865l582l261k127j129q46j048j274j339j129m65M89J076
$$ 370442 368657 366719 363854 360272 357011 354884 353755 352909 351861 350587 349248 348119 347654 348143 349219
50140C49219Q29J09k58K21J450L054M542N447N615N282M749M228M052M472N024
$$ 349219 350048 350157 349899 350120 351570 354624 359166 364613 370228 375510 380259 384487 388539 393011 398035
50125C98035M815L949L890N596P901Q840Q114P071O544O065N303M798M781M527
$$ 398035 402850 406799 410689 416285 424186 433026 441140 448211 454755 460820 466123 470921 475702 480229
50111D80229L571K595K234J974J050k33j060j441j948k517k514j891j301j009
$$ 480229 483800 486395 488629 490603 491653 491420 490360 488919 486971 484454 481940 480049 478748 477739
50097D77739n30M28J435J941J968J885J949K275K971M055N334O533P468Q112Q587
$$ 477739 477209 477637 479072 481013 482981 484866 486815 489090 492061 496116 501450 507983 515451 523563 532150
50082E32150R042R471R800J0153J0796J1619J2040J1675J0827J0005R284Q518
$$ 532150 541192 550663 560463 570616 581412 593031 605071 616746 627573 637578 646862 655380
50070F55380P905P757P939Q000P789P468P094O712O694P313Q058Q025P059N859
$$ 655380 663285 671042 678981 686981 694770 702238 709332 716044 722738 730051 738109 746134 753193 759052
50056G59052M917M088L390L374M159M750M095K488J263J194J797K199K109J811
$$ 759052 763969 768057 771447 774821 778980 783730 787825 790313 791576 792770 794567 796766 798875 800686
50042H00686J584J447J321J291J662K799M737O971Q786R953J0984J2626J5078
$$ 800686 802270 803717 805038 806329 807991 810790 815527 822498 831284 841237 852221 864847 879925
50029H79925J7843K0381K2714K5227K7877K9902L0369K8966K6199K2921J9811
$$ 879925 897768 918149 940863 966090 993967 1023869 1054238 1083204 1109403 1132324 1152135
50018A152135J7101J4640J2291J0295R161R085R675J0339J0763J0766R836P160
$$ 1152135 1169236 1183876 1196167 1206462 1215623 1224708 1234383 1244722 1255485 1266251 1276087 1283247
50006A283247K158n077j3753k2686l0818l7673m3228m7327m9547m9780m8614m6733
$$ 1283247 1285405 1280328 1266575 1243889 1213071 1175398 1132170 1084843 1035296 985516 936902 890169
49994H90169m4222m0890l7031l3282k9935k6896k4250k2274k0888j9650j8392
$$ 890169 845947 805057 768026 734744 704809 677913 653663 631389 610501 590851 572459
49983E72459j7363j6557j5468j3745j1739j0083r069q565q223p552o201m435l096
$$ 572459 555096 538539 523071 509326 497587 487504 478435 469870 461647 454095 447894 443459 440363
49970D40363k810l332l900l977l562k900k233j730j539j784k431l032k943k029
$$ 440363 437553 434221 430321 426344 422782 419882 417649 415919 414380 412596 410165 407133 404190 402161
49956D02161r55l83j13L71P67K13j248k308j885l57J097J797J824J622J786K743
$$ 402161 401206 400823 400710 401081 401848 402061 400813 398505 396620 396263 397360 399157 400981 402603 404389 407132
49940D07132M094M780M373L792M120N278O445P358Q273R047R231R035R274J0233
$$ 407132 411226 416006 420379 424171 428291 433569 440014 447372 455645 464692 473923 482958 492232 502465
49926E02465J1317J2033J2587J3292J4072J4900J6183J8258K0862K3540K6255
$$ 502465 513782 525815 538402 551694 565766 580666 596849 615107 635969 659509 685764
49915F85764K9301L2822L6756M0992M5311M9275N2455N4731N6125N6478N5488
$$ 685764 715065 747887 784643 825635 870946 920221 972676 1027407 1083532 1140010 1195498
49904A195498N3054M9412M5006M0375L6169L3040L1309L0743L0722L0639L0087
$$ 1195498 1248552 1297964 1342970 1383345 1419514 1452554 1483863 1514606 1545328 1575967 1606054
49893A606054K8612K5498K0079J2255K496q621k0524l2250m2447n0184n5558n9178
$$ 1606054 1634666 1660164 1680243 1692498 1694994 1686373 1665849 1633599 1591152 1540968 1485410 1426232
49881A426232o1330o2110o2061o1942o1783o0806n8540n5501n2427m9305m5639
$$ 1426232 1364902 1302792 1240731 1178789 1117006 1056200 997660 942159 889732 840427 794788
49870G94788m1501l7668l4633l1968k8903k5342k1866j8921j6350j3916j1860
$$ 794788 753287 715619 680986 649018 620115 594773 572907 553986 537636 523720 511860
49859E11860j0575r973r576r153q843q634q257p727p452p522p459o979o514o493
$$ 511860 501285 491312 481736 472583 463740 455106 446849 439122 431670 424148 416689 409710 403196 396703
49845C96703o624o485o375o772p206o623m951l330k621k382j818j026p30j131
$$ 396703 390079 383594 377219 370447 363241 356618 351667 348337 345716 343334 341516 340490 339760 338629
49831C38629j607j483p68q3K6k75k43N25J505J892J689J624K016K432K571K795
$$ 338629 337022 335539 334771 334688 334714 334439 334196 334721 336226 338118 339807 341431 343447 345879 348450 351245
49815C51245L367L833L632K951K387K122J978J994K340K884L388M100N537P646
$$ 351245 354612 358445 362077 365028 367415 369537 371515 373509 375849 378733 382121 386221 391758 399404
49801C99404R600J0667J0937J1096J1745J3042J4854J7020J9454K2006K4395K6539
$$ 399404 409004 419671 430608 441704 453449 466491 481345 498365 517819 539825 564220 590759
49789E90759K8934L2208L6151L9557M1330M1425M0305L7946L4056K9002K3783
$$ 590759 619693 651901 688052 727609 768939 810364 850669 888615 922671 951673 975456
49778I75456J9081J5009J1841J0204J0239J1177J2091J2698J2904J2037R010L231
$$ 975456 994537 1009546 1021387 1031591 1041830 1053007 1065098 1077796 1090700 1102737 1111747 1114978
49766A114978n020j4880k5259l4942m2922m8752n2511n4351n4236n2101m8101
$$ 1114978 1109958 1095078 1069819 1034877 991955 943203 890692 836341 782105 730004 681903
49755F81903m2755l6907l1557k7435k4559k2265j9745j6703j3548j0971r279q111
$$ 681903 639148 602241 570684 543249 518690 496425 476680 459977 446429 435458 426179 418068
49743D18068o906n546m374l648l202k755k284j884j503j091q67j108j663k010
$$ 418068 411162 405616 401242 397594 394392 391637 389353 387469 385966 384875 384008 382900 381237 379227
49729C79227j851j397r76o33l47l80j078k262l137k987j914p30r7P3K60N13L38
$$ 379227 377376 375979 375003 374370 374023 373643 372565 370303 367166 364179 362265 361535 361438 361511 361771 362284 362622
49712C62622n23j470j595p71J71M45J86J07M93R21Q60K97l02m55q4M62P60Q03
$$ 362622 362099 360629 359034 358263 358434 358879 359065 359172 359665 360586 361446 361743 361441 360986 360902 361364 362124 362927
49694C62927J039J805K744L036K265Q53l61q45o53l11l79r82j559j361l97M13
$$ 362927 363966 365771 368515 371551 373816 374669 374308 373463 372810 372499 372120 371138 369579 368218 367821 368234
49678C68234K61n55j003n75K28P36R23J217J722K041J842J334J001R99R69N54
$$ 368234 368495 367940 366937 366362 366590 367326 368249 369466 371188 373229 375071 376405 377406 378405 379374 379928
49662C79928k2p3P11J768K156J601P77N36R71J445J390R02M59K41r8r21k008k659
$$ 379928 379906 379833 380544 382312 384468 386069 386846 387382 388353 389798 391188 392090 392549 392790 392692 391771 389763 387104
49644C87104k382j368k79L58M70L43L40O33J115J536J748J795J719J456J028P16
$$ 387104 384722 383354 383075 383433 383903 384246 384586 385219 386334 387870 389618 391413 393132 394588 395616 396332
49628C96332Q35J365J872J889J352P05N95J294K388L171L297K989K577K188J934
$$ 396332 397167 398532 400404 402293 403645 404350 404945 406239 408627 411798 415095 418084 420661 422849 424783
49613D24783K030K498L107L795M849O251P311P411O940O832P400Q160Q742R272
$$ 424783 426813 429311 432418 436213 441062 447313 454624 462035 468975 475807 483207 491367 500109 509381
49599E09381R827J0176J0243J0311J0556J0873J1287J2006J2845J3254J3198J3441
$$ 509381 519208 529384 539627 549938 560494 571367 582654 594660 607505 620759 633957 647398
49587F47398J4497J5888J6895J7588J8544J9908K1304K2429K3220K3693K4145
$$ 647398 661895 677783 694678 712266 730810 750718 772022 794451 817671 841364 865509
49576H65509K5205K7113K9140L0355L0816L1387L2427L3440L4011L4481L5374
$$ 865509 890714 917827 946967 977322 1008138 1039525 1071952 1105392 1139403 1173884 1209258
49565A209258L6719L8175L9458M0343M0638M0364L9813L9236L8617L7773L6508
$$ 1209258 1245977 1284152 1323610 1363953 1404591 1444955 1484768 1524004 1562621 1600394 1636902
49554A636902L4619L2013K8835K5249K1226J6803J2383Q358M518L33m157q311
$$ 1636902 1671521 1703534 1732369 1757618 1778844 1795647 1808030 1816388 1820906 1821239 1817082 1808771
$$ [...]
##END NTUPLES=NMR SPECTRUM
##END=
