##TITLE=NES1084_ptc140_9884872_SXvDNknLow
##JCAMPDX= 6.0         $$ Bruker NMR JCAMP-DX V2.0
##DATA TYPE= NMR SPECTRUM
##DATA CLASS= NTUPLES
##ORIGIN= BRUKER
##OWNER= Administrator
$$ 1.72 TOPSPIN		Version 2.1
$$ 2016-08-27 15:55:00.711 -0500  Administrator@X
$$ Compression mode = diff/dup
##.OBSERVE FREQUENCY= 400.02188249412
##.OBSERVE NUCLEUS= ^1H
##.ACQUISITION MODE= SIMULTANEOUS (DQD)
##.ACQUISITION SCHEME= undefined
##.AVERAGES= 8
##.DIGITISER RES= 22
##SPECTROMETER/DATA SYSTEM= spect
##.PULSE SEQUENCE= zg30
##.SOLVENT NAME= COFFEE_meoh
##.SHIFT REFERENCE= INTERNAL, COFFEE_meoh, 1, 14.98509
##AUDIT TRAIL= $$ (NUMBER, WHEN, WHO, WHERE, PROCESS, VERSION, WHAT)
$$ ##TITLE= Audit trail, TOPSPIN		Version 2.1
$$ ##JCAMPDX= 5.01
$$ ##ORIGIN= Bruker BioSpin GmbH
$$ ##OWNER= Administrator
$$ $$ E:\/data/COFFEE/nmr/NES1084_ptc140_9884872_SXvDNknLow/10/pdata/1/auditp.txt
$$ ##AUDIT TRAIL=  $$ (NUMBER, WHEN, WHO, WHERE, PROCESS, VERSION, WHAT)
(   1,<2016-08-27 15:54:53.601 -0500>,<Administrator>,<X>,<go>,<TOPSPIN 2.1>,
      <created by zg
	started at 2016-08-27 15:53:47.898 -0500,
	POWCHK enabled, PULCHK disabled,
       configuration hash MD5:
       21 0F 79 D6 B3 7B B4 F6 88 20 88 DB 03 48 BD 9F
       data hash MD5: 64K
       7D 9E 25 62 51 99 29 F1 8E 1D 56 59 DC 09 7D 18>)
(   2,<2016-08-27 15:54:56.648 -0500>,<Administrator>,<X>,<proc1d>,<TOPSPIN 2.1>,
      <Start of raw data processing
       efp LB = 0 FT_mod = 6 PKNL = 1 PHC0 = 0 PHC1 = 0 SI = 32K 
       data hash MD5: 32K
       A5 E1 67 5D F5 10 DA 60 90 83 58 A8 FB 69 18 F9>)
(   3,<2016-08-27 15:54:56.945 -0500>,<Administrator>,<X>,<proc1d>,<TOPSPIN 2.1>,
      <pk PHC0 = 94.9823 PHC1 = 0 
       data hash MD5: 32K
       51 B4 F9 AD 75 21 8B 00 69 C3 39 F8 E9 71 88 E2>)
(   4,<2016-08-27 15:54:57.054 -0500>,<Administrator>,<X>,<proc1d>,<TOPSPIN 2.1>,
      <abs ABSG = 1 
       data hash MD5: 32K
       00 A4 50 78 8A 38 D9 80 CE 7A 76 A7 BC 7D 00 2F>)
(   5,<2016-08-27 15:54:57.117 -0500>,<Administrator>,<X>,<proc1d>,<TOPSPIN 2.1>,
      <abs ABSG = 2 
       data hash MD5: 32K
       56 3B 8A CC 0F 3A 8F 76 98 E6 77 AE 92 67 67 11>)
(   6,<2016-08-27 15:54:57.179 -0500>,<Administrator>,<X>,<proc1d>,<TOPSPIN 2.1>,
      <abs ABSG = 3 
       data hash MD5: 32K
       6F 16 0D 83 AE B0 C3 93 25 A5 15 2F 2D 81 6F 18>)
(   7,<2016-08-27 15:54:57.242 -0500>,<Administrator>,<X>,<proc1d>,<TOPSPIN 2.1>,
      <abs ABSG = 4 
       data hash MD5: 32K
       8D C8 56 F5 31 E1 74 97 08 49 EF A0 95 A7 E5 C2>)
(   8,<2016-08-27 15:54:57.289 -0500>,<Administrator>,<X>,<proc1d>,<TOPSPIN 2.1>,
      <abs ABSG = 5 
       data hash MD5: 32K
       84 26 CA CC D4 EC 52 8F A7 FF 14 26 26 AF 9E A5>)
$$ ##END=
$$ 
$$ $$ hash MD5
$$ $$ 69 32 C5 BC 7B 0E 46 3E B2 D0 66 6A 3D 08 A5 55
##$RELAX= 
##$RELAX= 
##$RELAX= 
##$RELAX= 
##$RELAX= 
##$RELAX= 
##$RELAX= 
$$ Bruker specific parameters
$$ --------------------------
##$DU= <E:\>
##$EXPNO= 10
##$NAME= <NES1084_ptc140_9884872_SXvDNknLow>
##$PROCNO= 1
$$ [...]
150 150 150 150 150 150 150 150
##$TP07= 0
##$TPNAME0= <>
##$TPNAME1= <>
##$TPNAME2= <>
##$TPNAME3= <>
##$TPNAME4= <>
##$TPNAME5= <>
##$TPNAME6= <>
##$TPNAME7= <>
##$TPOAL= (0..7)
0.5 0.5 0.5 0.5 0.5 0.5 0.5 0.5
##$TPOFFS= (0..7)
0 0 0 0 0 0 0 0
##$TUNHIN= 0
##$TUNHOUT= 0
##$TUNXOUT= 0
##$USERA1= <user>
##$USERA2= <user>
##$USERA3= <user>
##$USERA4= <user>
##$USERA5= <user>
##$V9= 5
##$VALIST= <valist>
##$VCLIST= <CCCCCCCCCCCCCCC>
##$VD= 0
##$VDLIST= <DDDDDDDDDDDDDDD>
##$VPLIST= <PPPPPPPPPPPPPPP>
##$VTLIST= <TTTTTTTTTTTTTTT>
##$WBST= 2048
##$WBSW= 25
##$XGAIN= (0..3)
0 0 0 0
##$XL= 0
##$YL= 0
##$YMAX_a= 621225
##$YMIN_a= -529006
##$ZGOPTNS= <>
##$ZL1= 120
##$ZL2= 120
##$ZL3= 120
##$ZL4= 120
##$ABSF1= 14.98509
##$ABSF2= -5.573092
##$ABSG= 5
##$ABSL= 3
##$ALPHA= 0
##$AQORDER= 0
##$ASSFAC= 0
##$ASSFACI= 0
##$ASSFACX= 0
##$ASSWID= 0
##$AUNMP= <proc_prof1d_extract_pilot.lims>
##$AXLEFT= 0
##$AXNAME= <>
##$AXNUC= <1H>
##$AXRIGHT= 0
##$AXTYPE= 0
##$AXUNIT= <>
##$AZFE= 0.1
##$AZFW= 0.1
##$BCFW= 0
##$BC_mod= 0
##$BYTORDP= 0
##$COROFFS= 0
##$CY= 15
##$DATMOD= 1
##$DC= 0
##$DFILT= <>
##$DTYPP= 0
##$F1P= 0
##$F2P= 0
##$FCOR= 0.5
##$FTSIZE= 32768
##$FT_mod= 6
##$GAMMA= 0
##$GB= 0
##$INTBC= 1
##$INTSCL= 1
##$ISEN= 128
##$LB= 0
##$LEV0= 0
##$LPBIN= 0
##$MAXI= 10000
##$MC2= 0
##$MEAN= 0
##$ME_mod= 0
##$MI= 0
##$NCOEF= 0
##$NC_proc= -8
##$NLEV= 6
##$NOISF1= 0
##$NOISF2= 0
##$NSP= 0
##$NTH_PI= 0
##$NZP= 0
##$OFFSET= 14.98509
##$PC= 1
##$PHC0= 94.9823
##$PHC1= 0
##$PH_mod= 1
##$PKNL= yes
##$PPARMOD= 0
##$PPDIAG= 0
##$PPIPTYP= 0
##$PPMPNUM= 2147483647
##$PPRESOL= 1
##$PSCAL= 4
##$PSIGN= 0
##$PYNMP= <proc.py>
##$REVERSE= no
##$SF= 400.02
##$SI= 32768
##$SIGF1= 0
##$SIGF2= 0
##$SINO= 400
##$SIOLD= 32768
##$SPECTYP= <>
##$SREGLST= <1H.CDCl3>
##$SSB= 0
##$STSI= 32768
##$STSR= 0
##$SW_p= 8223.68421052631
##$SYMM= 0
##$S_DEV= 0
##$TDeff= 65536
##$TDoff= 0
##$TI= <>
##$TILT= no
##$TM1= 0
##$TM2= 0
##$TOPLEV= 0
##$USERP1= <user>
##$USERP2= <user>
##$USERP3= <user>
##$USERP4= <user>
##$USERP5= <user>
##$WDW= 1
##$XDIM= 32768
##$YMAX_p= 440563220
##$YMIN_p= -723343
##$CURPLOT= <Network HP LaserJet P1505>
##$CURPRIN= <$Network HP LaserJet P1505>
##$DFORMAT= <normdp>
##$LAYOUT= <+/1D_H.xwp>
##$LFORMAT= <normlp>
##$PFORMAT= <normpl>
##$SURQMSG= 1
$$ End of Bruker specific parameters
$$ ---------------------------------
##NTUPLES= NMR SPECTRUM
##VAR_NAME=  FREQUENCY,     SPECTRUM/REAL,   SPECTRUM/IMAG
##SYMBOL=    X,             R,               I
##VAR_TYPE=  INDEPENDENT,   DEPENDENT,       DEPENDENT
##VAR_FORM=  AFFN,          ASDF,            ASDF
##VAR_DIM=   32768,         32768,           32768
##UNITS=     HZ,            ARBITRARY UNITS, ARBITRARY UNITS
##FACTOR=    0.250966925370066, 1,           1
##FIRST=     8223.43324360094, 125860,       -184196
##LAST=      0,             -89241,          -122515
##MIN=       0,             -723343,         0
##MAX=       8223.43324360094, 440563220,    0
$$ Real data points
##PAGE= N=1
##DATA TABLE= (X++(R..R)), XYDATA
$$ [...]
19556A75250D4190J54742A1080K35618j12633a54460b6179j73989I031M3522d0805
$$ 175250 44190 198932 11080 246698 134065 -154460 -26179 -200168 9031 52553 -40805
19544c02754c755G5673A2888H01J1686a32765j01186Q845P7339p8742H732N1289
$$ -302754 -3755 75673 12888 801 12487 -132765 -233951 -225106 -147767 -226509 8732 60021
19532F0021a72917j95023d9367j43835D065a39230D2482G419c1218k8038A57442
$$ 60021 -172917 -367940 -49367 -193202 4065 -139230 42482 7419 -31218 -59256 157442
19520a85730j96499a33805c8116m0937K6182D2474h3567B06178o8403a5129k71840
$$ -185730 -382229 -133805 -38116 -79053 -52871 42474 -83567 206178 137775 -15129 -286969
19509b86969d7657p1770k77790J80204B28943c3601j50566J2392b9780C52219
$$ -286969 -47657 -119427 -397217 -217013 228943 -33601 -184167 -171775 -29780 352219
19498G2792i7393M7724A30465h7156j00404o0427g9877j97607A77599c92063A16142
$$ 72792 -97393 -49669 130465 -87156 -187560 -247987 -79877 -277484 177599 -392063 116142
19486c0965l5306l53417a26708A66659C984K86764k5821b7498p4407j94944f3764
$$ -30965 -66271 -419688 -126708 166659 3984 290748 264927 -27498 -101905 -296849 -63764
19474h1046L7520k02099A45856E7612e7038m8870I3993L2185C141b73460g3843
$$ -81046 -43526 -245625 145856 57612 -57038 -105908 93993 126178 3141 -273460 -73843
19462a7442A40732a41500A87647a34200B88269a02672B1396M0833a3221G2853
$$ -17442 140732 -141500 187647 -134200 288269 -102672 21396 62229 -13221 72853
19451a20414A2016i6162c8956l69385F9598J229a62907j64671a36785N2699j21435
$$ -120414 12016 -96162 -38956 -408341 69598 70827 -162907 -327578 -136785 -84086 -205521
19440b05521A74143B2758a83425J4425o8035e0616r6135l14722i8843j54262j63342
$$ -205521 174143 22758 -183425 -169000 -237035 -50616 -146751 -461473 -98843 -253105 -416447
19429d16447a8450B9763h2725j82308A63524d2216j19880A93498i983o6109B2542
$$ -416447 -18450 29763 -82725 -265033 163524 -42216 -162096 193498 -9983 -76092 22542
19417A02909b33336c0348j86965f1639A08934i930m18225D6323b17530j03996
$$ 102909 -233336 -30348 -217313 -61639 108934 -9930 -428155 46323 -217530 -321526
19407c21526a20827n8863M1344j18444N5832k8503A35390c8608M067I3159c2158
$$ -321526 -120827 -179690 -138346 -256790 -200958 -229461 135390 -38608 -34541 93159 -32158
19395b18256I5547f9510G883J84582i2131B10868e57139c5420B23602a33828c5828
$$ -218256 95547 -69510 7883 192465 -92131 210868 -557139 -35420 223602 -133828 -35828
19383A45496o7428A060Q7505E638N9756a74338g9412A4883o782O8135M7904b50464
$$ 145496 78068 1060 88565 5638 65394 -174338 -79412 14883 8101 76236 124140 -250464
19370i7299A48947b5285A90964d2878H1012K0267b89551P3846A14549a43676d6591
$$ -97299 148947 -25285 190964 -42878 81012 101279 -289551 -215705 114549 -143676 -46591
19358a01937I3338c6861q1424j48431f5498A22059e3109l60130g0250B08168h4483
$$ -101937 93338 -36861 -118285 -266716 -65498 122059 -53109 -413239 -70250 208168 -84483
19346A42615o6645b20770j08624a39915b2856j25729l08541b12027I7579M8791
$$ 142615 75970 -220770 -329394 -139915 -22856 -148585 -457126 -212027 97579 146370
19336A46370g2265j55144F9775b4939l70534A5014a82163A00537d6792B08385
$$ 146370 -72265 -227409 69775 -24939 -395473 15014 -182163 100537 -46792 208385
19325a44950e9726A31718b63460f0215A3326g9692j19388b8328j31955H0648K7158
$$ -144950 -59726 131718 -263460 -60215 13326 -79692 -199080 -28328 -160283 80648 107806
19314A07806c08610A47451o6210J32460L264B907Q4757b45635j29396a80749e9236
$$ 107806 -308610 147451 81241 213701 216965 2907 87664 -245635 -375031 -180749 -59236
19302E7162a83104E4580L0914a4696A77371b99746d4968A12950J2067E2252a51121
$$ 57162 -183104 54580 85494 -14696 177371 -299746 -44968 112950 125017 52252 -151121
19290h8664L4379A64484b39548C3627a36973A49079a44072d7526k50254G0003
$$ -88664 -54285 164484 -239548 33627 -136973 149079 -144072 -47526 -297780 70003
19279A6191a34880j90751a54863A03562O503A2445J32501a47436j02499a07936
$$ 16191 -134880 -325631 -154863 103562 110065 12445 144946 -147436 -249935 -107936
19268b55119e660o9617A49033a15703M5032j62831B2950e1369G945c59331B35546
$$ -255119 -5660 -75277 149033 -115703 -70671 -233502 22950 -51369 7945 -359331 235546
19256E2162J65119m0993b4730J784F0763c4903A22333a86484N0644M5571m4808
$$ 52162 217281 176288 -24730 -22946 60763 -34903 122333 -186484 -135840 -90269 -135077
19245a35077B26278b06476E5939d6555D2917g4748p0478n3079j3739B8775b14179
$$ -135077 226278 -206476 55939 -46555 42917 -74748 -145226 -198305 -212044 28775 -214179
19233i6592b7020A9887R2863f7240D8094a0280a179l05454D9413a63155P1051
$$ -96592 -27020 19887 112750 -67240 48094 -10280 -1179 -306633 49413 -163155 -92104
19222i2104A61619q0535b8475l7902I3674C0939c51907J59955C9648K6321a58158
$$ -92104 161619 81084 -28475 -66377 93674 30939 -351907 -191952 39648 65969 -158158
19210i8175B0041a35541J8924A353J92301a74796B00296D9647a05748A53428b02190
$$ -98175 20041 -135541 -116617 1353 193654 -174796 200296 49647 -105748 153428 -202190
19198A12078i1588q7558M973A64727c9394E6078b73332j04378J43576j40635H9863
$$ 112078 -91588 -179146 -174173 164727 -39394 56078 -273332 -377710 -234134 -374769 89863
19186A18391G468R939f24674f2055k36338N9832G8661B8798d04526b5711l7889
$$ 118391 7468 17407 -624674 -62055 -298393 -238561 78661 28798 -404526 -25711 -63600
19175f3600l1894K9811k41308J48149m2866j58673b4810L496D8422P4277a37781
$$ -63600 -95494 -65683 -306991 -158842 -201708 -360381 -24810 -21314 48422 122699 -137781
19163c2995p4719C303c05337I4972e054m0333A85852a47166j60261a01186l11098
$$ -32995 -107714 3303 -305337 94972 -5054 -45387 185852 -147166 -307427 -101186 -412284
19152d12284a26554B47052n1506b23649r0489A48289D5824R2791d02762H4222
$$ -412284 -126554 247052 195546 -223649 -314138 148289 45824 138615 -402762 84222
19141h4934A02446R896e3601j79690F3692c09706O5334n0848a01783G8432c56248
$$ -84934 102446 112342 -53601 -233291 63692 -309706 -244372 -295220 -101783 78432 -356248
19129a38332B61277c38892F5704k0906h9334A19047a5469A09079a74089a4558
$$ -138332 261277 -338892 65704 44798 -89334 119047 -15469 109079 -174089 -14558
19118a03192A54410F8939J49453I8308i2565j71771A3900M9650b21266c5895q9012
$$ -103192 154410 68939 218392 98308 -92565 -264336 13900 63550 -221266 -35895 -124907
19107a24907E9553c01j80584d441A54099b99518a38502j33484A03374a65507j4203
$$ -124907 59553 -301 -180885 -4441 154099 -299518 -138502 -271986 103374 -165507 -179710
19096a79710j73356e1077m4195B3765J37078h4744E7511j7470a96121j03372E6710
$$ -179710 -353066 -51077 -95272 23765 160843 -84744 57511 40041 -196121 -299493 56710
19084C7596c08091c6756j64814k83557a78974o1068C9839a77346q4408A22941
$$ 37596 -308091 -36756 -201570 -485127 -178974 -240042 39839 -177346 -261754 122941
19073B75991f1720o0722F5910a35742j57145F3119j9322c49953a46487b6056F363
$$ 275991 -61720 -122442 65910 -135742 -292887 63119 43797 -349953 -146487 -26056 6363
19061c03095C48861F226e0988I545a30308g785j89200A55581P3499c7731j54956
$$ -303095 348861 6226 -50988 9545 -130308 -7785 -196985 155581 229080 -37731 -192687
19050a92687N7130g316l01717f798J741B49002a26311B00910c56044D30939H8603
$$ -192687 -135557 -7316 -309033 -6798 -5057 249002 -126311 200910 -356044 430939 88603
19038i259o8569I4428q366K48449a58256A05873J31138J36785A05718L5910J38058
$$ -9259 -77828 94428 86062 334511 -158256 105873 237011 373796 105718 141628 279686
19027B79686a76285M4802b7832B53904O2193A05434Q948n3716N3670B630b73508
$$ 279686 -176285 -131483 -27832 253904 316097 105434 114382 60666 114336 2630 -273508
19015A16592i5878j43481H9153c3190k00804B21653l8613k8740a00900p1892h3767
$$ 116592 -95878 -239359 89153 -33190 -233994 221653 183040 154300 -100900 -172792 -83767
19003i798q6361A36566b9631I9304Q4155B5573O2262c10616a17578b3100p7144
$$ -9798 -96159 136566 -29631 99304 183459 25573 87835 -310616 -117578 -23100 -100244
18992a00244c5649m2268j66088O4243J6449l8949a8183B8999a05183c7398j13782
$$ -100244 -35649 -77917 -244005 -179762 -163313 -202262 -18183 28999 -105183 -37398 -151180
18981a51180l6883M4434k15429J33565j24601N0278A36898d3081J8176m2082A30883
$$ -151180 -188063 -143629 -359058 -225493 -350094 -299816 136898 -43081 -24905 -66987 130883
18969C11140A12985b1302j143j83078G5521J5986c06051h7176B0821a95580A61548
$$ 311140 112985 -21302 -22445 -205523 75521 91507 -306051 -87176 20821 -195580 161548
18957f8953j02274A77003d7065k24453M8449n2622I4781O7773b5262G6401R8560
$$ -68953 -171227 177003 -47065 -271518 -223069 -275691 94781 162554 -25262 76401 174961
18946A74961i0817J9280l03189J44458a02848A27986J2417a09361B99511r1248
$$ 174961 -90817 -71537 -374726 -230268 -102848 127986 140403 -109361 299511 208263
18936B08263D2098M09147H4433c33529A13114h5824A77717b06462N6541I1937
$$ 208263 42098 451245 84433 -333529 113114 -85824 177717 -206462 -149921 91937
18925F4753P1415a27734k4380m04514g7438c7474k32819H6275a40801j1026a7845
$$ 64753 136168 -127734 -152114 -556628 -77438 -37474 -270293 86275 -140801 -151827 -17845
18913B07517g3759E722K25J04644K30010c6686A59954a75308f0711A46582b84630
$$ 207517 -73759 5722 5947 110591 340601 -36686 159954 -175308 -60711 146582 -284630
18901a32851j88461i6035C9458h2201o9987A26254D7209L14760a98186d8694E8807
$$ -132851 -321312 -96035 39458 -82201 -152188 126254 47209 361969 -198186 -48694 58807
18889D7380O5064R8571b46474p4562R8439C6408c0646r4333B5770a57554D9976
$$ 47380 112444 211015 -246474 -321036 -222597 36408 -30646 -124979 25770 -157554 49976
18877a96336A21998c5567F9214a59390k2476A90463a91171r893r0764i824k53698
$$ -196336 121998 -35567 69214 -159390 -181866 190463 -191171 -201064 -291828 -9824 -263522
18866b63522O8557Q2649m4290j24516A52113b30724M5156j15272F0660b37409
$$ -263522 -194965 -112316 -156606 -281122 152113 -230724 -185568 -300840 60660 -237409
18855A47856J46769a14513C1441J45698H4650J4763J31379L0404d2787A43581
$$ 147856 294625 -114513 31441 177139 84650 99413 230792 261196 -42787 143581
18844a167A27401f0628j07922e1705A60346K7018b84211H3916j0420a76952B663
$$ -1167 127401 -60628 -168550 -51705 160346 187364 -284211 83916 73496 -176952 2663
18832B30128b37540A69804c25051A25954L69137d9883A6808a84995k24881B37367
$$ 230128 -237540 169804 -325051 125954 495091 -49883 16808 -184995 -409876 237367
18821g9588A36540a89579H6681J41694e444A34079E3774a81711e9686B95419o9237
$$ -79588 136540 -189579 86681 228375 -5444 134079 53774 -181711 -59686 295419 226182
18810B26182J01901c42618e9779j27164M5974b2863j71946n1476P4569l4758l0139
$$ 226182 328083 -342618 -59779 -186943 -140969 -22863 -194809 -246285 -171716 -206474 -236613
18799b36613A18994e4229k58630a46514e9933A48235g1773d080j1182j53576A89660
$$ -236613 118994 -54229 -312859 -146514 -59933 148235 -71773 -4080 -15262 -168838 189660
18787a1339r9101a9186j27793k18001A14046B1592c0684F6854J0335O1536F2870
$$ -11339 -110440 -19186 -146979 -364980 114046 21592 -30684 66854 77189 138725 62870
18775b11362e3287o2848D6299J54795a10075B26877a12094A56165i7645a7821
$$ -211362 -53287 -116135 46299 201094 -110075 226877 -112094 156165 -97645 -17821
18764a54551A40474o2248a74801n5717R5921L1020j30647K5560A6268M0921a76110
$$ -154551 140474 78226 -174801 -230518 -134597 -103577 -234224 -208664 16268 57189 -176110
18752D4308c71262a75811f3542j2504j26263I3534g6449e648j86449A33377R3707
$$ 44308 -371262 -175811 -63542 -76046 -202309 93534 -76449 -5648 -192097 133377 227084
18741B27084b12207e7293p1905E77g4398r139B4047K4907L2756J63487n1199q1434
$$ 227084 -212207 -57293 -129198 577 -74398 -83537 24047 48954 81710 245197 193998 112564
18729A12564A8962c1385k15857j61325B2539c13835A52453a71174C4715a16977
$$ 112564 18962 -31385 -247242 -408567 22539 -313835 152453 -171174 34715 -116977
18718B47381a41119N5999B00177A2728a91979c7900I9597c0993m4873k3355j60504
$$ 247381 -141119 -85120 200177 12728 -191979 -37900 99597 -30993 -75866 -99221 -259725
18707b59725d0324j22394p0855D02418b14728B69648d2497l8392A44816E6056
$$ -259725 -40324 -162718 -233573 402418 -214728 269648 -42497 -80889 144816 56056
18696C4574J32410c07777C29357h7497o9314A50850o8290b29021A40138a33407
$$ 34574 166984 -307777 329357 -87497 -156811 150850 82560 -229021 140138 -133407
18685H6578M317F587d0006A24552h3500C5676a78494c6661C5773a82547m3725
$$ 86578 90895 6587 -40006 124552 -83500 35676 -178494 -36661 35773 -182547 -226272
18674b26272A45311c3382A1295a12521J5671A36742e0558N634A3068J72494d2061
$$ -226272 145311 -33382 11295 -112521 -96850 136742 -50558 -44924 13068 185562 -42061
18662a28680m8466k25028J76492N7461G853d1840A99517a58902C41043b88639
$$ -128680 -177146 -402174 -225682 -168221 7853 -41840 199517 -158902 341043 -288639
18651d057l61254C045a59307C821c07280H6424L3323L0500a87593A4394b87941
$$ -4057 -365311 3045 -159307 3821 -307280 86424 119747 150247 -187593 14394 -287941
18639A97183E7165a0457p5543m38794A94100H9563h9600M0694n9908l1510E8265
$$ 197183 57165 -10457 -86000 -524794 194100 89563 -89600 -48906 -108814 -140324 58265
18627a05789A36362P724a68812N5388q3178d6956B55750p6713N64b4155n99419
$$ -105789 136362 144086 -168812 -113424 -196602 -46956 255750 179037 179601 -24155 -623574
18616f23574c05425J9036N584A33024E0362P7315i5443o5782I7341C8590c78443
$$ -623574 -305425 -286389 -280805 133024 50362 127677 -95443 -161225 97341 38590 -378443
18604b2377B6734c404m1396C4399d77126e7997l1227G0680a48284E5077Q6522
$$ -22377 26734 -3404 -44800 34399 -477126 -57997 -89224 70680 -148284 55077 141599
18593A41599o0146n688c90038A91029a55975j34343J03234h4765m6934r7H603
$$ 141599 81453 75765 -390038 191029 -155975 -290318 -187084 -84765 -131699 -131796 8603
18581A06382l5050b41993P3252C6029J21537L2836l5238a31262L2298j24296h1065
$$ 106382 71332 -241993 -168741 36029 157566 190402 155164 -131262 -98964 -223260 -81065
18569a11075M1062J2780l26379g9752A5181J69128g5655l6375b6696o5663A52124
$$ -111075 -70013 -57233 -383612 -79752 15181 184309 -75655 -112030 -26696 -92359 152124
18557b69488C8131b40564c4957B45458a32598c1930E9165a69257B15956b4676
$$ -269488 38131 -240564 -34957 245458 -132598 -31930 59165 -169257 215956 -24676
18546A92031e1555n3067d7803j05105B3388J608J13685c10918c7609n6301D0984
$$ 192031 -51555 -104622 -47803 -152908 23388 24996 138681 -310918 -37609 -93910 40984
18534b23906G506i1512j70666h2165c1621o473a4697k43306L8752J3071f8579
$$ -223906 7506 -91512 -262178 -82165 -31621 -38094 -14697 -258003 -219251 -206180 -68579
18522b30207B1696J35026b5152G2352J45834a20650j36447O6234p1224l3315P9208
$$ -230207 21696 156722 -25152 72352 218186 -120650 -257097 -190863 -262087 -295402 -216194
18511b16194H1987a3042n3510A11510a55478j1925K7590k9056p1451e44n2703
$$ -216194 81987 -13042 -66552 111510 -155478 -167403 -139813 -168869 -240320 -544 -53247
18500e3247n4994I2706A2750b94267i3567k34143C10835a71026E3034L4821a41172
$$ -53247 -108241 92706 12750 -294267 -93567 -327710 310835 -171026 53034 87855 -141172
18488I1171Q5232b81178R1221j0324A60956B2232K42900m3963a6288j39359N0140
$$ 91171 176403 -281178 -189957 -200281 160956 22232 265132 221169 -16288 -155647 -105507
18477a05507B40847a07840j66324J7722i4554A31311K3308G6424k6524J89815
$$ -105507 240847 -107840 -274164 -256442 -94554 131311 154619 76424 49900 239715
18467B39715b47747B26696h9091k2699m0537Q94A2678a32840j49129d1177p3735
$$ 239715 -247747 226696 -89091 -111790 -152327 -151433 12678 -132840 -281969 -41177 -114912
18456a14912Q682m0833D13817a32019f517j77213a5477j2205A4899J35703a30820
$$ -114912 -106230 -147063 413817 -132019 -6517 -183730 -15477 -27682 14899 150602 -130820
18444C42830j43631K94508A80013b52382P1419n5578d983G4821J09825e5657l03765
$$ 342830 199199 493707 180013 -252382 -180963 -236541 -4983 74821 184646 -55657 -359422
18433c59422a50875A18227E5982a26894j57382B9483K8756b9440L756k85350B23592
$$ -359422 -150875 118227 55982 -126894 -284276 29483 58239 -29440 -25684 -311034 223592
18421A30896g7702B18344d24797c567A44833c9676E5266J31771a23286G2466a50530
$$ 130896 -77702 218344 -424797 -3567 144833 -39676 55266 187037 -123286 72466 -150530
18409a06260E9076a16685E478a05172B6678d22039D8836h7745c9422l10263f115
$$ -106260 59076 -116685 5478 -105172 26678 -422039 48836 -87745 -39422 -349685 -6115
18397g7452l7184k53641A85085a22394N8727b5055j01912A48116J39356g037B2869
$$ -77452 -114636 -368277 185085 -122394 -63667 -25055 -126967 148116 287472 -7037 22869
18385A6034e1438J9066B7822a42643L0717q3929E87b95923e9504F0301A5286a22466
$$ 16034 -51438 -32372 27822 -142643 -111926 -195855 587 -295923 -59504 60301 15286 -122466
18372B56254K99096b9769m347A14971a61388j5832A32364a57638A4355c0132A36560
$$ 256254 555350 -29769 -34116 114971 -161388 -177220 132364 -157638 14355 -30132 136560
18360B42775j2734D0959b30548E6675R051a30012b4691E8007K63702j46366b30746
$$ 242775 230041 40959 -230548 56675 65726 -130012 -24691 58007 321709 175343 -230746
18348B8519b33305K9941E8068a41427j51258B9350O4873b02122A5703K17579p4533
$$ 28519 -233305 -203364 58068 -141427 -292685 29350 94223 -202122 15703 233282 158749
18337A58749c30617e2289j61742h1755C743K294g2725J7480A51049g2023k30478
$$ 158749 -330617 -52289 -214031 -81755 3743 6037 -72725 -55245 151049 -72023 -302501
18326c02501J8627B68830a37827L7152l22880J27820A42831O5592h5314B30421
$$ -302501 -283874 268830 -137827 -100675 -423555 -295735 142831 208423 -85314 230421
18315d36967G1602b62666A84438c5621A0051b58060c3929C8848d2529B38871H0128
$$ -436967 71602 -262666 184438 -35621 10051 -258060 -33929 38848 -42529 238871 80128
18303F4931i1220B8869b4177j17523j1312e5596E9404p951L9349a6669F8366a76135
$$ 64931 -91220 28869 -24177 -141700 -153012 -55596 59404 51453 90802 -16669 68366 -176135
18290a29753j2613C2586c81119O7051C8099b3598p0697q7242Q4111j9292K8849
$$ -129753 -142366 32586 -381119 -314068 38099 -23598 -94295 -181537 -97426 -116718 -87869
18279h7869C1113A068d9438j19829E0666b42802J20985l734o5127k6712L3409
$$ -87869 31113 1068 -49438 -169267 50666 -242802 -121817 -125551 -190678 -217390 -183981
18268a83981B01408p2699B974Q4719A3268g592j84137j47041A25906g4462A22019
$$ -183981 201408 128709 2974 87693 13268 -7592 -191729 -338770 125906 -74462 122019
18256d533k87671A23031K4540c31382B8839a74580c252H3725k5912J63151n3682
$$ -4533 -292204 123031 147571 -331382 28839 -174580 -3252 83725 57813 220964 167282
18245A67282E2916c45838a1850k132k00138a9011l04315J23241l2383d0779B0772
$$ 167282 52916 -345838 -11850 -13982 -214120 -19011 -323326 -200085 -232468 -40779 20772
18233B6478m15L4515K84540a69025e326D5332F936N6533a7716A22725F025b2284
$$ 26478 26063 60578 345118 -169025 -5326 45332 6936 63469 -17716 122725 6025 -22284
18220A65955b22573K4776F0133a71456P9733G0833b11314I4444g8644B56548b89948
$$ 165955 -222573 -197797 60133 -171456 -91723 70833 -211314 94444 -78644 256548 -289948
18208a55962d9831b4032j66990d7034j62485j2573Q4178I7076C7978j3769J25956
$$ -155962 -49831 -24032 -191022 -47034 -209519 -222092 -137914 97076 37978 24209 150165
18197A50165a29268M7768C359K69997i8093j39692j09549a6084l16548R6527J03732
$$ 150165 -129268 -81500 3359 273356 -98093 -237785 -347334 -16084 -332632 -236105 -132373
18186a32373N8073k50657i5645e546A13816a04775E6128R180h817B39855a42564
$$ -132373 -74300 -324957 -95645 -5546 113816 -104775 56128 65308 -8817 239855 -142564
18174a46198b3451D1362M8712a58849D2655a48654H2932h0354E0424J86257c7748
$$ -146198 -23451 41362 90074 -158849 42655 -148654 82932 -80354 50424 236681 -37748
18162B33783J10630b34408i3950H6841a23248C8060g4211G9611J23438h9940L6328
$$ 233783 344413 -234408 -93950 86841 -123248 38060 -74211 79611 203049 -89940 -53612
18151e3612A32614l6638J06783K84d8947B02734c2041C7856J9443a76526A07534
$$ -53612 132614 95976 202759 203043 -48947 202734 -32041 37856 57299 -176526 107534
18139a64455n477j53778K6615d2435A9905a8923A5729K16390a12140J5983j59989
$$ -164455 -169932 -323710 -297095 -42435 19905 -18923 15729 232119 -112140 -96157 -256146
18128b56146c3837B08026a50434B02066c97177a41694L5739E0720a91713e3642
$$ -256146 -33837 208026 -150434 202066 -397177 -141694 -105955 50720 -191713 -53642
18117C60583d3725l28534d4342o6665m7496l8964A02342B2453K63728c54498A15837
$$ 360583 -43725 -372259 -44342 -111007 -158503 -197467 102342 22453 286181 -354498 115837
18105C85953D2480b08483B7400b15976o4462H5743B2558O8729b62947A40057b0630
$$ 385953 42480 -208483 27400 -215976 -280438 85743 22558 91287 -262947 140057 -20630
18093A45232E7372g8359E6896b72372E7488a52434G6745a39853A09989d6496j46726
$$ 145232 57372 -78359 56896 -272372 57488 -152434 76745 -139853 109989 -46496 -193222
18082a93222H0049a20501A41636J23994a66442O1585A53130d715H8270i0072A37677
$$ -193222 80049 -120501 141636 265630 -166442 -104857 153130 -4715 88270 -90072 137677
18070h0015k4292J0981j02979i4501A05771c2464D8092j158f2318B180J39522
$$ -80015 -104307 -93326 -196305 -94501 105771 -32464 48092 46934 -62318 2180 141702
18059A41702j1602F1164B1129J79509b82190a09875d6415J9312A28904a5934E0916
$$ 141702 130100 61164 21129 200638 -282190 -109875 -46415 -27103 128904 -15934 50916
18047c60167I9455b67928A95296b73128K3376c2626B5024M8442C3499J10321J4084
$$ -360167 99455 -267928 195296 -273128 -249752 -32626 25024 73466 33499 143820 157904
18036A57904a38759A13441C126h4345r4679O4439j04r3169j05496Q8416I8971
$$ 157904 -138759 113441 3126 -84345 -179024 -114585 -114689 -207858 -313354 -224938 98971
18024A91256a07258N1296j83275D2040d1172B76882c1242k13381i1992B51475
$$ 191256 -107258 -55962 -239237 42040 -41172 276882 -31242 -244623 -91992 251475
18013A09914N4566o8504Q6800q6065K0059b07378M572H5934c6348A09081f3732
$$ 109914 164480 95976 182776 96711 116770 -207378 -202806 85934 -36348 109081 -63732
18001c05618A33862b38434h2765k00620L5878c3280k31601A3725a72652L1964
$$ -305618 133862 -238434 -82765 -283385 -247507 -33280 -264881 13725 -172652 -140688
17991a40688A48890f6106j05239P1646a9001H0679k5449f8347m9446B78142H3856
$$ -140688 148890 -66106 -171345 -99699 -19001 80679 55230 -68347 -117793 278142 83856
17979B38796d1131k18915f4627A13533a60301l5148l6377M9958N3618B81942G7427
$$ 238796 -41131 -260046 -64627 113533 -160301 -195449 -231826 -181868 -128250 281942 77427
17967G4735a35873J5051N0155k573j61226e765o0196k96842C8683J62833a84770
$$ 74735 -135873 -120822 -70667 -73240 -234466 -5765 -65961 -362803 38683 201516 -184770
17955f835o5104j43037A41651n2853j5400P7228a53277M0083k35795A64190p2615
$$ -6835 -71939 -214976 141651 88798 73398 150626 -153277 -113194 -348989 164190 91575
17944I1575a57520A23014c30203A41389a50011e449C3405b57049A4637f8430A53162
$$ 91575 -157520 123014 -330203 141389 -150011 -5449 33405 -257049 14637 -68430 153162
17932b5273a2198A96944o1297f8686C6864a71737m9568I2413J8859J1716b8943
$$ -25273 -12198 196944 135647 -68686 36864 -171737 -221305 92413 111272 122988 -28943
17920A02468b04200B13670j05245D5924b3685k02919H0786d7682B87425p7403
$$ 102468 -204200 213670 108425 45924 -23685 -226604 80786 -47682 287425 210022
17910B10022j3012a20740b5335I8665c97964A09003n3669c1961l28897B22758
$$ 210022 197010 -120740 -25335 98665 -397964 109003 55334 -31961 -360858 222758
17899A45691a6471k44168B61751f0088A54941M6319b77400C3272a27480A92929
$$ 145691 -16471 -260639 261751 -60088 154941 201260 -277400 33272 -127480 192929
17888A84614a25090K7894l6471m5708g1202D3465R0336O4671p475d28550a04109
$$ 184614 -125090 -97196 -133667 -179375 -71202 43465 133801 198472 190997 -428550 -104109
17876a07997c1441l45725d908p2422P903k53703B88794A41128C9542h4074k54298
$$ -107997 -31441 -377166 -4908 -77330 -69427 -323130 288794 141128 39542 -84074 -338372
17865c38372c4527A89828a154E1943a8944k12819A01441a38881r8998A11233a24790
$$ -338372 -34527 189828 -1154 51943 -18944 -231763 101441 -138881 -237879 111233 -124790
17853e34j77262E6584M8063d5072j44002H4900k1833b46681J20238I6182a99897
$$ -534 -177796 56584 104647 -45072 -189074 84900 63067 -246681 -126443 96182 -199897
17841h9938B18181b28733A4383e05237K49390N8162A00244K2655a67732i446A90535
$$ -89938 218181 -228733 14383 -505237 -255847 -197685 100244 122899 -167732 -9446 190535
17829e4578j96112C412K60546D4519f4888k16861A05095M9453j2512g2808E6922
$$ -54578 -250690 3412 263958 44519 -64888 -281749 105095 154548 142036 -72808 56922
17817a88642F3886J20027a27700k45522j7311d7979j7708A51901b0553c615A07280
$$ -188642 63886 183913 -127700 -373222 -390533 -47979 -65687 151901 -20553 -3615 107280
17805A07526b96820A65218K1344M6689a18605j55524B6074d08977C2802K79847
$$ 107526 -296820 165218 186562 233251 -118605 -274129 26074 -408977 32802 312649
17795C12649h3547o9964A548O9098K16692p1011J41970D7544K73372d3081o7441
$$ 312649 -83547 -153511 1548 70646 287338 216327 358297 47544 320916 -43081 -110522
17784a10522I6802G762d031A18986D4957h0749C8148A4761M1006J7739l0219M8039
$$ -110522 96802 7762 -4031 118986 44957 -80749 38148 14761 55767 73506 43287 91326
17772I1326a52641C7187K44667a4695F1014K38182j27759L1152c02670F5835j0690
$$ 91326 -152641 37187 281854 -14695 61014 299196 171437 202589 -302670 65835 55145
17761E5145d3101j44787A06197a18358A06889K23792a92863B5223J08405b71204
$$ 55145 -43101 -187888 106197 -118358 106889 330681 -192863 25223 133628 -271204
17750a28265J4874C43882B9472a0810m8431A40995c0111q7641A18059J27628a95504
$$ -128265 -113391 343882 29472 -10810 -59241 140995 -30111 -117752 118059 245687 -195504
17738A1350a03136H3248L4761n0996b20035A42024D4707a2480A66497q1977a42377
$$ 11350 -103136 83248 118009 67013 -220035 142024 44707 -12480 166497 84520 -142377
17726E1145f1055k01279B939c49887C1094Q4898M9342j0253i8760j6314k00051
$$ 51145 -61055 -262334 2939 -349887 31094 115992 165334 155081 -98760 -115074 -315125
17715c15125A2223J50155D3511J48108p4806a12800C64023j23828b0250l14433
$$ -315125 12223 162378 43511 191619 116813 -112800 364023 240195 -20250 -334683
17705c34683F8846a91013I3581H725K40535b8270B98488A47336f4049F0126M7820
$$ -334683 68846 -191013 93581 8725 249260 -28270 298488 147336 -64049 60126 107946
17694A07946J68529c7608l4098A67009g0794K103I4667J01171j4615C0463a67798
$$ 107946 276475 -37608 -71706 167009 -70794 -68691 94667 195838 181223 30463 -167798
17682F0029J53501a44888r059A21774N6572a72963B60225F6660j0780h0593A18181
$$ 60029 213530 -144888 -153947 121774 178346 -172963 260225 66660 55880 -80593 118181
17670a40299C02663D2202K25416A7451h8319j31471C7058J4985J83249B1270J67617
$$ -140299 302663 42202 267618 17451 -88319 -219790 37058 52043 235292 21270 188887
17659A88887g0944A59534a60685M5300E8119B7278b70832d243A75661c24342C11203
$$ 188887 -70944 159534 -160685 -115385 58119 27278 -270832 -4243 175661 -324342 311203
17647C61796i3774A65870C9177A2842a31444N5290H6645c6100j85259b7079r1852
$$ 361796 -93774 165870 39177 12842 -131444 -76154 86645 -36100 -221359 -27079 -118931
17636a18931D4242K8865J12931f8929b4241A16832a34794A9519g8424r7477L053
$$ -118931 44242 73107 186038 -68929 -24241 116832 -134794 19519 -78424 -175901 -172848
17625a72848l06444C05209B3453J52166B7531K1882M1610a7184N664E05147c9552
$$ -172848 -479292 305209 23453 175619 27531 49413 91023 -17184 -11520 505147 -39552
17613D2635J13814a20007F6216E58f3046F9233J02003q3071R4503b68367B43706
$$ 42635 156449 -120007 66216 558 -63046 69233 171236 88165 182668 -268367 243706
17601b0219D1035a57768a2875n8178J3137k21346A97640n8100i2202j6095C53425
$$ -20219 41035 -157768 -12875 -71053 -57916 -279262 197640 139540 -92202 -108297 353425
17589b6191n8272A85373d0875q5832A45000C6442J51725a38163j919C07246b026
$$ -26191 -84463 185373 -40875 -126707 145000 36442 188167 -138163 -140082 307246 -2026
17577f7098B60975A4042i4536C19569D3214K48410C5088K30139q0410d35471A9004
$$ -67098 260975 14042 -94536 319569 43214 291624 35088 265227 184817 -435471 19004
17565I0840N1309b8100E3177c8574q5056A47990a49577B15606g1889k6233l1428
$$ 90840 142149 -28100 53177 -38574 -123630 147990 -149577 215606 -71889 -98122 -129550
17554a29550A7691b6106j65612j76761G9056a4087C03848a99225A95433O7742
$$ -129550 17691 -26106 -191718 -368479 79056 -14087 303848 -199225 195433 263175
17544B63175A14273i1990m8368m1601C6485J35643a84356H8407b40145B54698
$$ 263175 114273 -91990 -140358 -181959 36485 172128 -184356 88407 -240145 254698
17533b5155o5428B8035h7960j63042C01926j48102a4295j7574A99738A5725O7349
$$ -25155 -90583 28035 -87960 -251002 301926 153824 -14295 -31869 199738 15725 83074
17522H3074J2344K65512a09894A41499a29838r9210B68113a92606A65705D454
$$ 83074 95418 360930 -109894 141499 -129838 -229048 268113 -192606 165705 4454
17511I826b6371k8416k2433F7723K19148a0517B78101A11037a19336n541L0749
$$ 9826 -26371 -54787 -77220 67723 286871 -10517 278101 111037 -119336 -124877 -94128
17500i4128A69439J31675h0960c677B25568K5646E5334J9101L3447k7078o288
$$ -94128 169439 301114 -80960 -3677 225568 251214 55334 74435 107882 80804 74516
17489G4516b00428c9935H1315A7706O2653c22167Q8339g3333A25486a18001K9045
$$ 74516 -200428 -39935 81315 17706 80359 -322167 -233828 -73333 125486 -118001 -88956
17478h8956B9602b0204C72145H8196K19104J8053A14257a68504E10043a1980k82592
$$ -88956 29602 -20204 372145 88196 307300 325353 114257 -168504 510043 -11980 -294572
17467b94572H9288J23141E6072K6966J0837R1890c5913C5585a73517G2979h0444
$$ -294572 89288 212429 56072 83038 93875 185765 -35913 35585 -173517 72979 -80444
17455F5910O7839a54634B99323K9912j31013r0621J11461L03047J37560C15014
$$ 65910 133749 -154634 299323 329235 198222 107601 219062 522109 659669 315014
17444B95063g1139C18245k9106M795E1159a69120H9734K84553r8561j34062m0130
$$ 295063 -71139 318245 289139 293934 51159 -169120 89734 374287 275726 141664 101534
17433A01534O3279m6125k6179L76682A25309b125k6297B35044C7588Q1846l3737
$$ 101534 164813 118688 92509 469191 125309 -2125 -28422 235044 37588 119434 85697
17422H5697b922B77216j22705K59966I7826L24254j52592J34759k6234j10853
$$ 85697 -2922 277216 154511 414477 97826 422080 269488 404247 378013 267160
17412B67160j19606E2329J94952A09722N7105o9955K10997c9059j06499G0074
$$ 267160 147554 52329 247281 109722 166827 96872 307869 -39059 -145558 70074
17401D48504A45977R406e3770D02954a98461A94834a17946D28867A31801M01751
$$ 448504 145977 155383 -53770 402954 -198461 194834 -117946 428867 131801 533552
17391E33552B28630K47777j90171j09991P0958G5914K17725a40546C8108J20946
$$ 533552 228630 476407 286236 176245 247203 75914 293639 -140546 38108 159054
17381A59054J6468Q8499H498J57375n2000Q7404O5699a20426I1479L29754A99828
$$ 159054 175522 264021 8498 165873 113873 201277 266976 -120426 91479 421233 199828
17369g9786D9016K30374A00819M0345l1894Q585d8394A56936c4249B87600Q9875
$$ -79786 49016 279390 100819 141164 109270 117855 -48394 156936 -34249 287600 377475
17358C77475J00789j99909G3130J36853J66969B3168L51155A02580K09260Q0040
$$ 377475 478264 278355 73130 209983 376952 23168 374323 102580 311840 391880
17348C91880j18750B5706K98225E3971k5414c3455j9545i449B38644I8060N9405
$$ 391880 273130 25706 323931 53971 28557 -33455 -53000 -9449 238644 98060 157465
17337A57465a8285C36431j62179c048A97510M3815a40340B48122F6924f3760I0722
$$ 157465 -18285 336431 174252 -3048 197510 241325 -140340 248122 66924 -63760 90722
17325b8703m1225A96708a02786r7490i7010A54605e8466A32709p481a9451j48528
$$ -28703 -69928 196708 -102786 -200276 -97010 154605 -58466 132709 125228 -19451 -167979
17314a67979A69556a11749o7028A73838P6295o7769k6939l6940k1299Q5198j1546
$$ -167979 169556 -111749 -178777 173838 250133 182364 155425 118485 97186 182384 170838
17303A70838MJ33395P4873A78584j9011J14056a84905B63567h49B59261o2787
$$ 170838 170842 304237 379110 178584 159573 273629 -184905 263567 -849 259261 196474
17292A96474e3116A79523r285K1441h8495k6186A716L25408J37052j60976j4228
$$ 196474 -53116 179523 170238 191679 -88495 -114681 1716 327124 464176 303200 288972
17281B88972j5843f5409A96035i7383C98135a18855D667J14056L450a75735k9906
$$ 288972 273129 -65409 196035 -97383 398135 -118855 4667 118723 122173 -175735 -205641
17270b05641O7235D1130K75097E6372K76580j63452m3289O3499m7045o6649J39854
$$ -205641 -138406 41130 316227 56372 332952 169500 126211 189710 142665 76016 215870
17259B15870R8102R3612a29957A29800J21231j05772D7451J98188a67842d6542
$$ 215870 313972 407584 -129957 129800 251031 145259 47451 245639 -167842 -46542
17248I2068O0437G6108K93173A73448F7924O1242J1523J76114F4833L9450J44355
$$ 92068 152505 76108 369281 173448 67924 129166 140689 316803 64833 104283 248638
17237B48638L41203E3246e2988A02939D5134c24810G2072J80964n7986J91767
$$ 248638 589841 53246 -52988 102939 45134 -324810 72072 253036 195050 386817
17227C86817j54442c3422B93079F9145J50233O9278I0710B0609K07934O1244j35580
$$ 386817 232375 -33422 293079 69145 219378 288656 90710 20609 228543 289787 154207
17216A54207i1A67159Q4916d9952D24540A00278O8004K21026q4168A21982g7613
$$ 154207 -91 167159 252075 -49952 424540 100278 168282 389308 305140 121982 -77613
17204D3364P7976J64399n5765J20964j31716P6453J1002J1997K58338D7203J00153
$$ 43364 121340 285739 229974 350938 219222 295675 306677 318674 577012 47203 147356
17193A47356K77042a58320B42160n105O4902j42331N09150b4767B63912d0333
$$ 147356 424398 -158320 242160 237055 301957 159626 668776 -24767 263912 -40333
17182A65081K06940b9787m9400A36946P4236f033C75649N565J50904A01390O2343
$$ 165081 372021 -29787 -79187 136946 211182 -6033 375649 381214 532118 101390 163733
17171A63733m8136a20104A94433b9245B85249J40221A08273J95279q0880K30195
$$ 163733 115597 -120104 194433 -29245 285249 425470 108273 303552 222672 452867
17161D52867A97687P0210K40498B32986k1554J53733p1249j25584o8496J46316
$$ 452867 197687 267897 508395 232986 211432 365165 293916 168332 99836 246152
17151B46152q6320f0975A41647B0150L12625j14712J17333j39127N8990J39593
$$ 246152 159832 -60975 141647 20150 332775 218063 335396 196269 255259 394852
17141C94852r21I3784k9891k19K35408K9854J6697A534L23850r1161O885M6107
$$ 394852 393931 93784 63893 63674 299082 328936 345633 1534 325384 234223 241108 287215
17129B87215f0237B56688j10671L63347k02287j1897N701I8939K53395J68546
$$ 287215 -60237 256688 146017 509364 307077 295180 300881 98939 352334 520880
17119E20880k1279A79944J16758p8032Q5932j31963M2782k2443K87470j71121
$$ 520880 499601 179944 296702 218670 304602 172639 215421 192978 480448 309327
17109C09327m5018I1735K18863K22901A72218L14860k24333n0702J3616D4077
$$ 309327 264309 91735 310598 533499 172218 487078 262745 212043 225659 44077
17098D04001j66314b2564C50027R5194A42454D4453K04028K28091O3408L7596
$$ 404001 237687 -22564 350027 445221 142454 44453 248481 476572 539980 577576
17088E77576k44014J89522k49464J86354k04995L49722B06713O3749J03230k2028
$$ 577576 333562 523084 273620 459974 254979 604701 206713 270462 373692 351664
17078C51664l3973M14808k48784J60032H5415J75839K49021R5660F1316L59021
$$ 351664 317691 732499 483715 643747 85415 261254 510275 605935 61316 420337
17068D20337a42128D78193J34208j96747n8003J17532j37246L05661l14623K82994
$$ 420337 -142128 478193 612401 415654 357651 475183 337937 643598 328975 611969
17058F11969A53783L09525J69276k51142A34430J39848J65633m7098j5269j26308
$$ 611969 153783 463308 632584 381442 134430 274278 439911 392813 377544 251236
17048B51236K31979R720J51109l09984j16026N65268l52089K90129k7054j32023
$$ 251236 483215 492935 644044 334060 218034 783302 431213 721342 694288 562265
17038E62265O8721k24304L71283B63283J11325Q0473l0018j45796N08612k14506
$$ 562265 630986 406682 777965 263283 374608 455081 425063 279267 787879 573373
17028E73373N818L11615K1092j17556j02031o0345p8737Q4350l14872K64265J21123
$$ 573373 579191 890806 911898 794342 692311 631966 553229 637579 322707 586972 708095
17017G08095J85932k09114K9844C25454K37897o4562R8642N2931J56674j20108
$$ 708095 894027 684913 714757 325454 563351 498789 597431 650362 807036 686928
17007F86928r6056M13066l74976O7985K08146l46126J82786J3492n086n4529r5123
$$ 686928 590872 1003938 628962 696947 905093 558967 741753 755245 750159 695630 600507
16996F00507J53761k75099J67898J60628k29552Q0123K65183C87728K99445K0712
$$ 600507 754268 479169 647067 807695 578143 658266 923449 387728 687173 707885
16986G07885k96693L02690j62540N51625l27251m7068p743L19992m78767J44353
$$ 707885 411192 713882 551342 1102967 775716 728648 720905 1040897 562130 706483
16976G06483L28363n4768k28084P7160Q960k76067K89476j25387Q5026K00944
$$ 706483 1034846 980078 751994 829154 838114 562047 851523 726136 811162 1012106
16966A012106k91273r1811j42737K72144r8254K67335k31067j9262n117J70781
$$ 1012106 720833 629022 486285 758429 660175 927510 696443 677181 672064 842845
16956H42845j8434m9993K43081j52218k22080J75089J31114K79833j22967n04880
$$ 842845 824411 774418 1017499 865281 643201 818290 949404 1229237 1106270 601390
16946F01390L72181K21127J3556l32135O0538n7841N26323k52607j98696n7976
$$ 601390 973571 1194698 1208254 876119 936657 878816 1405139 1152532 953836 895860
16936H95860N9751j16676J88396p4852j47337M94999m43674N55001l54805L04042
$$ 895860 955611 838935 1027331 952479 805142 1300141 856467 1411468 1056663 1360705
16926A360705P021k14915k18975O58666J35397n36044N7407m9360p2374j6920
$$ 1360705 1367726 1152811 933836 1592502 1727899 1191855 1249262 1199902 1127528 1110608
16916A110608L36671k13003R4509J94910K76175m18153J09628N8876r0075j46205
$$ 1110608 1447279 1234276 1328785 1523695 1799870 1381717 1491345 1550221 1460146 1313941
16906A313941K82901N6026L2950o4616J68418k17998K34107l65895K74741k26823
$$ 1313941 1596842 1652868 1685818 1621202 1789620 1571622 1805729 1439834 1714575 1487752
16896A487752K05840j48294J07878L65904k71622j18453J44538R2191k06450J77088
$$ 1487752 1693592 1545298 1653176 2019080 1747458 1629005 1773543 1865734 1659284 1836372
16886A836372j96926L73721k71735k53925L13327O9987k64567K97004J97681k39282
$$ 1836372 1639446 2013167 1741432 1487507 1800834 1870821 1606254 1903258 2100939 1861657
16876A861657N27743l14439j7331Q7676L23555j74122j32349j30070J35935L30579
$$ 1861657 2389400 2074961 2057630 2145306 2468861 2294739 2162390 2032320 2168255 2498834
16866B498834J4140m7604k00647L55979k25610J47671K69849k04906K49520j76292
$$ 2498834 2512974 2465370 2264723 2620702 2395092 2542763 2812612 2607706 2857226 2680934
16856B680934M8143J92207K19844k38862K83883j18319j98569K3394J49868L06924
$$ 2680934 2729077 2921284 3141128 2902266 3186149 3067830 2869261 2892655 3042523 3349447
16846C349447n26090L09802M45556k50294l0156M34574l17362J29765J42200M2387
$$ 3349447 2823357 3133159 3578715 3328421 3298265 3732839 3415477 3545242 3687442 3729829
16836C729829J65203K11966m4090J90555Q3972m19978K98385R7240J67762m6706
$$ 3729829 3895032 4106998 4062908 4253463 4337435 3917457 4215842 4313082 4480844 4434138
16826D434138o5878K27779l1472k5831Q8467K22209L15422r7448J14148J05429
$$ 4434138 4368260 4596039 4564567 4538736 4627203 4849412 5164834 5067386 5181534 5286963
16816E286963J92404M5619M69800J75021j01671j29655K44427Q3430J57550L05037
$$ 5286963 5479367 5524986 5994786 6169807 6068136 5938481 6182908 6266338 6423888 6728925
16806F728925j22512L73847L77386L23620j53469J60937r2531O29177r3956K81809
$$ 6728925 6606413 6980260 7357646 7681266 7527797 7688734 7596203 8225380 8131424 8413233
16796H413233J00094M07115J27691L5684N16309K78146K39365J50037K67197Q30626
$$ 8413233 8513327 8920442 9048133 9083817 9600126 9878272 10117637 10267674 10534871 11365497
16786A1365497O6230J99236K76746J0694P55307M09495K60206P90906K59790K40031
$$ 11365497 11431727 11630963 11907709 11918403 12673710 13083205 13343411 14134317 14394107 14634138
16776A4634138R18599L31825M67347K36825R29653N76826N87746Q31826O20732
$$ 14634138 15552737 15884562 16351909 16588734 17518387 18095213 18682959 19514785 20135517
16767B0135517Q65968O73626J245604M68040J040253Q48665J399956P68194J458087
$$ 20135517 21001485 21675111 22920715 23388755 24429008 25277673 26677629 27445823 28903910
16758B8903910J369741J113541J615588J634600J503468J600643K037961K132736
$$ 28903910 30273651 31387192 33002780 34637380 36140848 37741491 39779452 41912188
16750D1912188J934867K555555K249367K366242L438459K398045L448415L831723
$$ 41912188 43847055 46402610 48651977 51018219 54456678 56854723 60303138 64134861
16742F4134861L482010M242943M190332M803716M977613N312255O070428N823699
$$ 64134861 67616871 71859814 76050146 80853862 85831475 91143730 97214158 103037857
16734A03037857O475120P115198P219841P577965P787807Q380029P818406Q189223
$$ 103037857 109512977 116628175 123848016 131425981 139213788 147593817 155412223 163601446
16726A63601446P459811P121638O565596N446119M577153K648067J804302l0799
$$ 163601446 171061257 178182895 184748491 190194610 194771763 197419830 199224132 199193333
16718A99193333j465695l256114m013375o180353o609580p211123p582113q710533
$$ 199193333 197727638 194471524 190458149 184277796 177668216 170457093 162874980 154164447
16710A54164447q545796q185344q319003p923774p645145p096007o807086o238246
$$ 154164447 145618651 137433307 129114304 121190530 113545385 106449378 99642292 93404046
16702I3404046n788521n574047n094192m682309m716390l883563l522480l751599
$$ 93404046 87615525 82041478 76947286 72264977 67548587 63665024 60142544 56390945
16694E6390945l252555k949523k857416k476482k577476j919141k054069j962429
$$ 56390945 53138390 50188867 47331451 44854969 42277493 40358352 38304283 36341854
16686C6341854j738701j731076j699637j575349j127320j065710j328143j145395
$$ 36341854 34603153 32872077 31172440 29597091 28469771 27404061 26075918 24930523
16678B4930523j408627o12482o83014j321798q22851o59638n81997p66607p24361
$$ 24930523 23521896 22909414 22226400 20904602 20081751 19422113 18840116 18073509 17349148
16669A7349148r25073l23174l24200j012750m31158k02178m90614o00114k24425
$$ 17349148 16424075 16100901 15776701 14763951 14332793 14130615 13640001 13039887 12815462
16660A2815462o47827l84623o22907j74299m4963n47264l75152m18876j68427
$$ 12815462 12167635 11783012 11160105 10985806 10940843 10393579 10018427 9599551 9431124
16651I431124k97491j23973m81051j88711k05373j20227k78678k73255J71015
$$ 9431124 9133633 9009660 8528609 8339898 8134525 8014298 7735620 7462365 7633380
16642G633380l35728J42576m24644k55317l92545K7044j11675J2690o24588K33459
$$ 7633380 7297652 7440228 7015584 6760267 6367722 6394766 6283091 6295781 5671193 5904652
16632E904652j69095k26569l69535J85852j00870m8739l94492L13932l60454k0481
$$ 5904652 5735557 5508988 5139453 5325305 5224435 5175696 4781204 5095136 4734682 4714201
16622D714201l91546N17191j00016o80384J85693k69666K7659N6551j06705o3840
$$ 4714201 4322655 4839846 4739830 4059446 4245139 3975473 4003132 4059683 3952978 3889138
16612C889138l73910L48107m5149l11801l7956p2916k36728q1521J4341j19274
$$ 3889138 3515228 3863335 3818186 3506385 3468429 3395513 3158785 3077264 3091605 2972331
16602B972331j26499o0356L20083k80161J77190j18616j25455J53375n12963j66505
$$ 2972331 2845832 2785476 3105559 2825398 3002588 2883972 2758517 2911892 2398929 2232424
16592B232424K88401L1833k2712j25508j05946k46117N1161M07892n7745r4131
$$ 2232424 2520825 2552658 2529946 2404438 2298492 2052375 2103536 2511428 2453683 2359552
16582B359552j5433k97266J89517l44459J55926k04729Q0803k73327L35819l52344
$$ 2359552 2344119 2046853 2236370 1891911 2047837 1843108 1923911 1650584 1986403 1634059
16572A634059J70101J72403O6415j21176m02747j25J73703J27741j85162N7788
$$ 1634059 1804160 1976563 2042978 1921802 1519055 1518930 1692633 1820374 1635212 1693000
16562A693000j93629K9502Q7010M2413J83981l55111j15299J7240L38516j22067
$$ 1693000 1499371 1528873 1615883 1658296 1842277 1487166 1371867 1389107 1727623 1605556
16552A605556j90521P97M7275j32217K87019k62496k3397K41248m30258Q2380
$$ 1605556 1415035 1415832 1463107 1330890 1617909 1355413 1332016 1573264 1143006 1225386
16542A225386J19788j41513Q4542m39600L37938r7397L02923j06813K1811k27752
$$ 1225386 1345174 1203661 1288203 848603 1186541 1089144 1392067 1285254 1307065 1079313
16532A079313M8775K3152j61850N7793l4728J03964j22288J44819k6949k92781
$$ 1079313 1128088 1151240 989390 1047183 1012455 1116419 994131 1138950 1112001 819220
16522H19220R0370N4142J06725k88518K2364k07012K40492K21886k00120J66411
$$ 819220 909590 963732 1070457 781939 804303 597291 837783 1059669 859549 1025960
16512A025960r5049j96322j40585M2543M83144j34584m12359K35300l0152m089
$$ 1025960 930911 734589 594004 636547 1119691 985107 572748 808048 777896 773807
16502G73807l0243k31323M37292k49038j59137K03065K84085k10225k56249L84416
$$ 773807 743564 512241 949533 700495 541358 744423 1028508 818283 562034 946450
16492I46450L41078o08353K27872m3228k53901K17661m8833l3303j27867J67975
$$ 946450 1287528 679175 907047 863819 609918 827579 778746 745443 617576 785551
16482G85551K65397k96377j85575Q5281k35626M7933J58403j69526L56931j60107
$$ 785551 1050948 754571 568996 654277 418651 466584 624987 455461 812392 652285
16472F52285j89994M7988K3113J0000K55255m8140j01783L3385J77570l29770
$$ 652285 462291 510279 533392 543392 798647 750507 648724 682109 859679 529909
16462E29909L09698l70946J96642k20918J60434j4670j03162J99859B44663K13175
$$ 529909 839607 468661 665303 444385 604819 590149 486987 686846 244663 457838
16452D57838O5707K06571E1614P38196k61747n6023K62512C48059J31273k15712
$$ 457838 523545 730116 51614 789810 528063 472040 734552 348059 479332 263620
16442B63620J88357J14817j0545P5456Q062K8168B78950K99670j99929J2661B4819
$$ 263620 451977 566794 556249 631705 639767 667935 278950 578620 378691 391352 24819
16430B11482Q2162J05320j55369N0595n6504J36479K20287j01422B40604L68919
$$ 211482 293644 398964 243595 294190 237686 374165 594452 493030 240604 609523
16420F09523B72667K35287B48654K75576p2125r6986L45085j98064k06421j17831
$$ 609523 272667 507954 248654 524230 452105 355119 700204 502140 295719 177888
16410A77888k2184N2093j4397J68113O1049M2293A31531K09484r0504M04771g8582
$$ 177888 155704 207797 193400 361513 422562 464855 131531 341015 250511 655282 -78582
16398C39122n1666e926B24720K62580J9878j95393L9095J39259k4320l8997j35936
$$ 339122 287456 -5926 224720 487300 507178 311785 350880 490139 465819 426822 290886
16387B90886K32872m683A50168p3219L11097j40299J68578J03665r0035A34662
$$ 290886 523758 519075 150168 76949 388046 247747 416325 519990 429955 134662
16376C67050m7898l4893K50250k17467K6330A66940L02811A24618L66898m1157
$$ 367050 319152 284259 534509 317042 343372 166940 469751 124618 491516 450359
16366D50359B19623J18334K12179B54842F4523K80271J42150j97075l366Q9181
$$ 450359 219623 337957 550136 254842 64523 344794 486944 289869 286503 375684
16356C75684j6376F1476n94k3734K70504j47906J84m992J11999r590A05479R1204
$$ 375684 359308 61476 60882 37148 307652 159746 159930 154938 266937 257347 105479 196683
16344A96683K71453k25663k488H7901L74544B3298N3672a55753D28453K210j30193
$$ 196683 468136 242473 239985 87901 462445 23298 76970 -155753 428453 430663 300470
16333C00470q5405n2911N762G190L67019K2096m2426k0652B845a15479C13413
$$ 300470 215065 162154 167916 7190 374209 396305 353879 333227 2845 -115479 313413
16321I9539K6949J15444e115B48443J77304l8284A75205J34680J66289l7021j22998
$$ 99539 126488 241932 -5115 248443 425747 387463 175205 309885 476174 439153 316155
16310C16155j39518m3430L4525p9514K45195Q7576o1013C4019g9493B89666R4070
$$ 316155 176637 133207 167732 88218 333413 420989 359976 34019 -79493 289666 383736
16299C83736n806j7366j16067J31179j20703N3135A24720K26321M4796M7421k07135
$$ 383736 377930 360564 244497 375676 254973 308108 124720 351041 395837 443258 236123
16288B36123F0245b86878A50761a06338A45925L08822A44206a91822C88849A46934
$$ 236123 60245 -286878 150761 -106338 145925 454747 144206 -191822 388849 146934
16277A19970R2948l4654p857L13330M1655A67142b4704L642A1262J00117J63101
$$ 119970 212918 178264 170407 483737 525392 167142 -24704 -21062 11262 111379 274480
16266B74480k6475a92715A27809k7347J44131E9690b8058j3729F6044J46672a92261
$$ 274480 248005 -192715 127809 100462 244593 59690 -28058 -41787 66044 212716 -192261
16254B43792N5526F1263J27025n5182J88043a90608R0492A35520h7289p2885d5893
$$ 243792 299318 61263 188288 133106 321149 -190608 -100116 135520 -87289 -160174 -45893
16242C3904L81358a64198B12160B5089J64340c3928A83034O5846p3976n1687D8846
$$ 33904 415262 -164198 212160 25089 189429 -33928 183034 248880 174904 123217 48846
16230e1808B95248A27370E8952a11321A21274n8054J76995a08843C8043K21102
$$ -51808 295248 127370 58952 -111321 121274 63220 240215 -108843 38043 259145
16220B59145j775N2437B7269b2526r636l3321b2356A64098J69736R9433a95651
$$ 259145 257370 309807 27269 -22526 -32162 -65483 -22356 164098 333834 433267 -195651
16208i9070p3005K7240J6599G9869A3342a75184c0182A16465i2609A28814g855
$$ -99070 -172075 -144835 -128236 79869 13342 -175184 -30182 116465 -92609 128814 -7855
16196A58106j4719C0779P3509K4945a41825m8420A27446D5652J58070g3979A50753
$$ 158106 143387 30779 104288 129233 -141825 -190245 127446 45652 203722 -73979 150753
16184B94691C0309J56188b36828A2583O3788a02498e0922A41276a3805A65804
$$ 294691 30309 186497 -236828 12583 76371 -102498 -50922 141276 -13805 165804
16173e2689A41482l0719f0602A54769E1581J27356c41855a13786A16737J59988
$$ -52689 141482 110763 -60602 154769 51581 178937 -341855 -113786 116737 276725
16163B76725e5482j54778P4313B47627H5540f3503B11170J32275e7991a89B26136
$$ 276725 -55482 -210260 -135947 247627 85540 -63503 211170 343445 -57991 -189 226136
16151H9488a70468q6116f2663I3111O8598a22074D7509e3067D9670f704G6856
$$ 89488 -170468 -256584 -62663 93111 161709 -122074 47509 -53067 49670 -6704 76856
16139a19168G6572O5083k1666a06664N0121m6342E8695N0112l3285l7633q399
$$ -119168 76572 141655 119989 -106664 -56543 -102885 58695 108807 75522 37889 29490
16128B9490e1114k37083D5403M9008J43604i6164C09213C5002J47936h251j27327
$$ 29490 -51114 -288197 45403 94411 238015 -96164 309213 35002 182938 -8251 -135578
16117a35578K5481r3950E26461d66039i4526a9618A01299a43693E20526e8999
$$ -135578 -110097 -204047 526461 -466039 -94526 -19618 101299 -143693 520526 -58999
16106C22608j35746C2480a8652o9353j07640D33337H4775J69013h8433F5443a6390
$$ 322608 186862 32480 -18652 -88005 -195645 433337 84775 253788 -88433 65443 -16390
16094A04714B8360a51019A9894c26187R0968f1817k82423a04968B33075B8936
$$ 104714 28360 -151019 19894 -326187 -235219 -61817 -344240 -104968 233075 28936
16083G1066d89528b32022h9298B64690C4229A4051J00800J07925C2523a62042
$$ 71066 -489528 -232022 -89298 264690 34229 14051 114851 222776 32523 -162042
16072d4744A13743A8407m770O7503a26727D7838a77952j67125A7316J26708b03280
$$ -44744 113743 18407 13637 81140 -126727 47838 -177952 -345077 17316 144024 -203280
16060d39015a49523l3968A97706a54018H2853J64511h6503k97656a89383A46905
$$ -439015 -149523 -183491 197706 -154018 82853 247364 -86503 -384159 -189383 146905
16049e5452A38251A0431f79k89674h3127n6003A19767B7615d8228m9560l623A05236
$$ -55452 138251 10431 -679 -290353 -83127 -139130 119767 27615 -48228 -97788 -101411 105236
16036a17516A861a159n8829B41210c2544n5802A96997r8097L4066a36895B9752
$$ -117516 1861 -1159 -59988 241210 -32544 -88346 196997 98900 132966 -136895 29752
16024c937k9553H1414b4545I0536J51308C6692c1863n3308j29741O2755j2003
$$ -3937 -33490 81414 -24545 90536 241844 36692 -31863 -85171 -214912 -152157 -164160
16013a64160o5436C6811Q9083P5667b75108G4198e0700j35290A79664b79488f0459
$$ -164160 -229596 36811 125894 201561 -275108 74198 -50700 -185990 179664 -279488 -60459
16001d15596h5299k22423D999Q289a80775O4436k54966B8232P572f1783m6558
$$ -415596 -85299 -307722 4999 13288 -180775 -116339 -371305 28232 35804 -61783 -108341
15990a08341A25314E6544M6413M4289K05886q3595a83891A36871M79857A15542
$$ -108341 125314 56544 102957 147246 353132 269537 -183891 136871 616728 115542
15979B01936E5175Q0401J2147M7886h7608j74675g6078B72834a03576c2866j9092
$$ 201936 55175 135576 147723 195609 -87608 -262283 -76078 272834 -103576 -32866 -51958
15968e1958F9006b89963A20267a56797j0355A19020J99876A23680d2363l6030
$$ -51958 69006 -289963 120267 -156797 -167152 119020 318896 123680 -42363 -78393
15958g8393H9510K52847i2895M2102p5737l5745k8407d0772k78879I7317c7215
$$ -78393 89510 342357 -92895 -50793 -126530 -162275 -190682 -40772 -319651 97317 -37215
15946E2216O2983a93768q4199A09449j8842L2259c56136a9970A97990b5475G6173
$$ 52216 115199 -193768 -277967 109449 90607 122866 -356136 -19970 197990 -25475 76173
15934a56396M638D1517J4383c70419a33501j69271J3751C78888A03891a13393
$$ -156396 -151758 41517 55900 -370419 -133501 -302772 -289021 378888 103891 -113393
15923G6647d695l59718c1166k2809a0554A69591j9006R6359G3235b94715j10088
$$ 76647 -4695 -364413 -31166 -53975 -10554 169591 150585 246944 73235 -294715 -404803
15912d04803A27923a49445J8163C36987g1282j78504b4782F0918a97208e6550
$$ -404803 127923 -149445 -131282 336987 -71282 -249786 -24782 60918 -197208 -56550
15901b19919K2560i1275A39483c4367j8171B01655f8804A06323i554j01107B29078
$$ -219919 -197359 -91275 139483 -34367 -52538 201655 -68804 106323 -9554 -110661 229078
15889a35867k21025g4604C278e5109a4910k15632b1202p1964j63397B51528b26846
$$ -135867 -356892 -74604 3278 -55109 -14910 -230542 -21202 -93166 -256563 251528 -226846
15877A48060b2956j29398F870f0239A36185Q4281g7078G7883a35423C6619K4090
$$ 148060 -22956 -152354 6870 -60239 136185 220466 -77078 77883 -135423 36619 60709
15866F0709c026k7428r6091r3132m7329c6557a0282G9860a56996G3576B0629b1215
$$ 60709 -3026 -30454 -126545 -219677 -267006 -36557 -10282 79860 -156996 73576 20629 -21215
15853c14849A8953J34091k9002a97703e6346A75819G5788B8202a84510N0571I4276
$$ -314849 18953 153044 124042 -197703 -56346 175819 75788 28202 -184510 -133939 94276
15841d9118a8980A67491H243b92436K2350A2821R7650b49066C4403a19724B8891
$$ -49118 -18980 167491 8243 -292436 -270086 12821 110471 -249066 34403 -119724 28891
15829a37665j01292A49906B7492K32569b28314M6146A35834a89090k78297I7052
$$ -137665 -238957 149906 27492 260061 -228314 -182168 135834 -189090 -467387 97052
15818d48187C4950a89513N2417k08568B71821b22024Q1134A73276A2929a06287
$$ -448187 34950 -189513 -137096 -345664 271821 -222024 -140890 173276 12929 -106287
15807D776a2356l1947A66817b16668A5767M61416G1294a73067j90660A03654g7175
$$ 4776 -12356 -44303 166817 -216668 15767 477183 71294 -173067 -363727 103654 -77175
15795a68695h0627r2478j1504A47825b22558f0067p4239k37645a85663r2249h5714
$$ -168695 -80627 -173105 -184609 147825 -222558 -60067 -134306 -371951 -185663 -277912 -85714
15783b28940d5225n1528n4605E7770K4506K91086B1399a9298j72326a347j6204
$$ -228940 -45225 -96753 -151358 57770 82276 373362 21399 -19298 -191624 -1347 -17551
15772a7551A24167a02473F7628b25588f7083k29567E869a14860M3508I5888b89114
$$ -17551 124167 -102473 67628 -225588 -67083 -296650 5869 -114860 -71352 95888 -289114
15760A37374a70672E3441L58063A18771A4202J01879i779G823P3709g3829j14131
$$ 137374 -170672 53441 411504 118771 14202 116081 -9779 7823 81532 -73829 -187960
15749a87960j73116J25208C84657C6070J56626R0680I7360a97724f0991K5819
$$ -187960 -361076 -235868 384657 36070 192696 283376 97360 -197724 -60991 -35172
15739c5172j82179g4929I8452D3747a87856C71651g4006j02242Q2052j8292F7846
$$ -35172 -217351 -74929 98452 43747 -187856 371651 -74006 -176248 -94196 -112488 67846
15727D4910b00138Q7234m5555G5191h1732k1525L5002N080k11065L5873c7602
$$ 44910 -200138 -112904 -158459 75191 -81732 -103257 -68255 -63175 -274240 -238367 -37602
15715A86459H1540M4497b14189i9112M4431H2182K05406a55130G202N4498a87466
$$ 186459 81540 126037 -214189 -99112 -54681 82182 287588 -155130 7202 61700 -187466
15703a77314H0855a36331k35305J70027Q7412D9639c1577B46212A2543a34754
$$ -177314 80855 -136331 -371636 -201609 -114197 49639 -31577 246212 12543 -134754
15692d7202F3413J91469E7005M40991b08303E8282a48704A28414k2557E1587b48215
$$ -47202 63413 254882 57005 497996 -208303 58282 -148704 128414 105857 51587 -248215
15680a07575c0950j02949F9527a27667N2779F2794a21144A99219p2943J9450R5814
$$ -107575 -30950 -133899 69527 -127667 -74888 62794 -121144 199219 126276 145726 241540
15669B41540J17937a32734A8943R0867d5477m38012a26145l0138K8528A3745a79525
$$ 241540 359477 -132734 18943 109810 -45477 -483489 -126145 -156283 -127755 13745 -179525
15657h0069l648j142b4268B6376N9993K1624b83783Q7892N0305C21929j26885
$$ -80069 -83717 -84859 -24268 26376 86369 107993 -283783 -195891 -145586 321929 195044
15646A95044D144h7860B27168c51463A46790D6793p835a18791A79684a78110L9236
$$ 195044 4144 -87860 227168 -351463 146790 46793 38958 -118791 179684 -178110 -138874
15635a38874k20890A62423i1891A20993B1489K0262i667r9815L6991E6784a41546
$$ -138874 -359764 162423 -91891 120993 21489 41751 -9667 -109482 -72491 56784 -141546
15623e3866r7012N0944A36855b6030C5843J29066g8990H1587b9672k3847k12029
$$ -53866 -150878 -99934 136855 -26030 35843 164909 -78990 81587 -29672 -53519 -265548
15612b65548i6690E317J36047d30024d1948A4354N1563a90688D790M4667Q4338
$$ -265548 -96690 5317 141364 -430024 -41948 14354 65917 -190688 4790 49457 133795
15601A33795k1469K68306a41024n7038A31140b6815A11571i4456l2435c5058A06460
$$ 133795 112326 380632 -141024 -198062 131140 -26815 111571 -94456 -126891 -35058 106460
15589F3384q682J13571E5123c9779B75276F0526M4797a54566d8726k08394I8180
$$ 63384 54702 168273 55123 -39779 275276 60526 105323 -154566 -48726 -257120 98180
15577C30745p7074b53859O6072g0302p6636a0624H8311e19B72924a64151G4398
$$ 330745 253671 -253859 -187787 -70302 -146938 -10624 88311 -519 272924 -164151 74398
15565c7365G2597J8411a53979d2892j48652C67435H3658M4539c9187p182k56377
$$ -37365 72597 91008 -153979 -42892 -191544 367435 83658 128197 -39187 -46369 -302746
15554c02746J2095a35817C46722B9362K48696q1638b01820j02314K1299L2511
$$ -302746 -290651 -135817 346722 29362 278058 196420 -201820 -304134 -282835 -250324
15544b50324A7094b37515j19317C94382A36938Q5918i4969A948e130j65852a571
$$ -250324 17094 -237515 -356832 394382 136938 222856 -94969 1948 -5130 -170982 -1571
15532F4401l1259f2426A48662a02945A41814O6879G4974J57575h9755b9190A23866
$$ 64401 33142 -62426 148662 -102945 141814 208693 74974 232549 -89755 -29190 123866
15520b4878B11834a80859A1054e8125A09489a7425q2758J2605B17618I7842a14160
$$ -24878 211834 -180859 11054 -58125 109489 -17425 -100183 -87578 217618 97842 -114160
15508A31153a1803D6681Q425J24649a77624q2875J11243R64B1677J35131c35084
$$ 131153 -11803 46681 55106 179755 -177624 -260499 -149256 -148292 21677 156808 -335084
15496F5672a8630B13263a31963F1755g3243p4575L0812A36359J68698I5624Q8609
$$ 65672 -18630 213263 -131963 61755 -73243 -147818 -117006 136359 305057 95624 184233
15485A84233a64863H5107P133B0361e2079C5660d7919j77617J01589B6545K21465
$$ 184233 -164863 85107 92240 20361 -52079 35660 -47919 -225536 -123947 26545 248010
15474B48010H3133a26995n0806A02806D3267i437C23882a38415A46895E4494i4840
$$ 248010 83133 -126995 -177801 102806 43267 -9437 323882 -138415 146895 54494 -94840
15462A32063c0115E9534a06638m064A10837J1860i2408J1937J4806b6549I4973
$$ 132063 -30115 59534 -106638 -110702 110837 122697 -92408 -80471 -65665 -26549 94973
15450a83571d8550G2170J9042B7143b37210G6024c0584j35118I6868A5340J04048
$$ -183571 -48550 72170 91212 27143 -237210 76024 -30584 -165702 96868 15340 119388
15439A19388M1097g9993A66352F1783K56655F5604f8890K4299j14668g0544A76417
$$ 119388 160485 -79993 166352 61783 318438 65604 -68890 -44591 -159259 -70544 176417
15427a72750K3506p2036b1805p548H9334O1956f9170j6068F3053K593a66604j11272
$$ -172750 -149244 -221280 -21805 -29353 89334 151290 -69170 -85238 63053 65646 -166604 -277876
15415b77876i2392k25369e3636C19180E3972K106J0619a59785Q830a5958B08502
$$ -277876 -92392 -317761 -53636 319180 53972 56078 66697 -159785 -150955 -15958 208502
15403A50279e6274A5107R588c15420A6847R209J09266c13039B20343a55941F7817
$$ 150279 -56274 15107 24695 -315420 16847 26056 135322 -313039 220343 -155941 67817
15391B66652e7158m5407E5288a15413A91135a50985q5826A15420f685A81531F3300
$$ 266652 -57158 -102565 55288 -115413 191135 -150985 -236811 115420 -6685 181531 63300
15379c06851C454d22510A32533R9591a95067C03590a1600l7327l01383D03130
$$ -306851 3454 -422510 132533 232124 -195067 303590 -11600 -48927 -350310 403130
15368c032A38074n1847J72520a93373r0340B93374b29951A42300K0496b93137
$$ -3032 138074 86227 258747 -193373 -283713 293374 -229951 142300 162796 -293137
15357d09157A12728a49580A94889L4934c44273c6244j98823d022D22607H7235
$$ -409157 112728 -149580 194889 229823 -344273 -36244 -235067 -4022 422607 87235
15346a45748E513J13733d9692A5873B260a66395E9043J70664a96848E9839N7733
$$ -145748 5513 119246 -49692 15873 2260 -166395 59043 229707 -196848 59839 117572
15335A17572L0216g1270B49829q7017a90911c9955j30890D9353a10576D94401
$$ 117572 147788 -71270 249829 162812 -190911 -39955 -170845 49353 -110576 494401
15324A03213I24b04081f7179A48822J58718j39417L5219J450j6879j7147L071
$$ 103213 924 -204081 -67179 148822 307540 168123 203342 204792 187913 170766 173837
15313A73837J4591q0466q703k8711o90a06404F9893k7602J65816a20189N8464
$$ 173837 188428 107962 99259 70548 69858 -106404 69893 42291 208107 -120189 -61725
15302f1725J1904B95133d3082r8510K1265c4298j67776A24410d0596l07474B57031
$$ -61725 -49821 295133 -43082 -141592 -120327 -34298 -202074 124410 -40596 -348070 257031
15290A03365b19294D4555J4204m93c0018A00392J06111o4341b82183A23009j6341
$$ 103365 -219294 44555 58759 58266 -30018 100392 206503 142162 -282183 123009 106668
15279A06668O2279e3075l53815C06257p5910r3458n6119b81086c238A36128A822
$$ 106668 168947 -53075 -406890 306257 230347 136889 80770 -281086 -3238 136128 1822
15267A19016J8084b76H1508P4480J3172J07474d29684E8751a8313B87877j16298
$$ 119016 137100 -276 81508 155988 169160 276634 -429684 58751 -18313 287877 171579
15256A71579K72968g7530A64752L3338L6910K7978M58424P6037J19899M32380
$$ 171579 444547 -77530 164752 198090 235000 262978 721402 797439 917338 1349718
15246A349718o64375B49821j1665a01425F7266g4711A71937b0209k5439A46941
$$ 1349718 685343 249821 238156 -101425 67266 -74711 171937 -20209 -45648 146941
15235E0265J68459F2523J1581L13071a83168A03874b13496A91071I4483M3244
$$ 50265 218724 62523 74104 387175 -183168 103874 -213496 191071 94483 137727
15225A37727N5115b25082E040a80456k05163b0927C50678c66293a08974B54997
$$ 137727 192842 -225082 5040 -180456 -385619 -20927 350678 -366293 -108974 254997
15214g2849k396o5593e0371j12986b1075A26522K955N4672J2008r4539i4919a2150
$$ -72849 -75245 -140838 -50371 -163357 -21075 126522 129477 184149 196157 101618 -94919 -12150
15201a2392B91829d2233A45826j0190a60790k3948E7573J01883L1231m8996P845
$$ -12392 291829 -42233 145826 135636 -160790 -184738 57573 159456 190687 141691 149536
15190A49536a14671F8004h776o4993j06523k5649e0201D0361d2476K802q4768
$$ 149536 -114671 68004 -8776 -73769 -180292 -205941 -50201 40361 -42476 -39674 -124442
15179a24442c4103H0589a10053C2671K55233j06337q4221a57488a3944B71294
$$ -124442 -34103 80589 -110053 32671 287904 181567 97346 -157488 -13944 271294
15168B02045e4357G9703O6862E3715J2452c9929B65797R4973A2004K32953K8817
$$ 202045 -54357 79703 146565 53715 66167 -39929 265797 360770 12004 244957 273774
15157B73774A23141a69727c689F1972l524J06141i2794E1970K44750b45610C32305
$$ 273774 123141 -169727 -3689 61972 58448 164589 -92794 51970 296720 -245610 332305
15145F7295B34M36820A77318J10381o4537J81199B2818b42472J20108A33008E1490
$$ 67295 234 437054 177318 287699 223162 404361 22818 -242472 -122364 133008 51490
15133c8324H475O8986K87765j73258K44858A58246J51978H4052J53742e6672l3678
$$ -38324 8475 77461 365226 191968 436826 158246 310224 84052 237794 -56672 -90350
15122i0350j644a7262A31323b6547J1058A97924K22366A74473a04804H7688J73819
$$ -90350 -91994 -17262 131323 -26547 -15489 197924 420290 174473 -104804 87688 261507
15111B61507r1266A2726a29557A91172E1551g5845E407J84993H2477J53384A00271
$$ 261507 170241 12726 -129557 191172 51551 -75845 5407 190400 82477 235861 100271
15099b70226I5902R6282a35749A64511B4040N3050K5148J7775J91043A50283o0158
$$ -270226 95902 192184 -135749 164511 24040 77090 102238 120013 311056 150283 90125
15088I0125D991a07174A44792j6575J14840q0324A4502J3219Q0158K05134A04121
$$ 90125 4991 -107174 144792 128217 243057 162733 14502 27721 107879 313013 104121
15076B27110N5000G6520J75928F3902K75749A4953M3320K76020r7427k2310j05460
$$ 227110 282110 76520 252448 63902 339651 14953 58273 334293 236866 214556 109096
15065A09096C862R6859K1473J1983J44295F4928L27211A87153e7910B78694I227
$$ 109096 3862 100721 122194 134177 278472 64928 392139 187153 -57910 278694 9227
15053C12405D8873K52180q4786J43968b6957a0542A57493K00073j14750D1687
$$ 312405 48873 301053 216267 360235 -26957 -10542 157493 357566 242816 41687
15042B46553k5768L7185a01018A80577H0199f7341E05373E5019a3684B51647m832
$$ 246553 220785 257970 -101018 180577 80199 -67341 505373 55019 -13684 251647 246815
15031B46815K17100b60660a992A71065O6887a84650F8944J99862J64066o7531
$$ 246815 463915 -260660 -1992 171065 237952 -184650 68944 268806 432872 365341
15021C65341j48753e5107D19665l7793J12417G9623j2827O2457C330J93517Q1359
$$ 365341 216588 -55107 419665 381872 494289 79623 66796 129253 3330 196847 278206
15010B78206b0858G8947B0774b663l0540J1805B64118a74749I5835J86317P4757
$$ 278206 -20858 78947 20774 -2663 -33203 -21398 264118 -174749 95835 282152 356909
14999C56909A34418J04060O194H188K87362o3507n4653K160M97539C17242m1361
$$ 356909 134418 238478 244672 8188 295550 232043 177390 179550 677089 317242 275881
14988B75881A00525L0025f400C48766A57173K08476A22621K13945o4100j00026
$$ 275881 100525 130550 -6400 348766 157173 365649 122621 336566 272466 172440
14978A72440Q2207i8188B39546a07615C43157f9815B78789g6884A88909M9626
$$ 172440 254647 -98188 239546 -107615 343157 -69815 278789 -76884 188909 238535
14968B38535b8113B63218n500J86707A32946l3588K22512k6812H2283J73117J1000
$$ 238535 -28113 263218 257718 444425 132946 99358 321870 295058 82283 255400 266400
14957B66400J45880n3245A64984E0632L10157E7806J90229O8172j20241O106K05886
$$ 266400 412280 359035 164984 50632 360789 57806 248035 316207 195966 202072 407958
14946D07958k02724J50462A26522L98760A99916A9684K3781Q1976L1767N8954
$$ 407958 205234 355696 126522 525282 199916 19684 43465 125441 157208 216162
14936B16162N0988M8132J70327A46354n9538M20290J17002j16645j27924F2643
$$ 216162 267150 315282 485609 146354 86816 507106 624108 507463 379539 62643
14925A28124D9023N85876A86530K21940j99204l4673O9114J6943A00736J98886
$$ 128124 49023 634899 186530 408470 209266 174593 243707 260650 100736 299622
14915B99622j14165N9894K99946I443J70403K53848A52014K95492B6397i876B02183
$$ 299622 185457 245351 545297 9443 179846 433694 152014 447506 26397 -9876 202183
14903A47782P9537M1716j11274Q3397L21196A20924J69743J94113q5019E8893
$$ 147782 227319 269035 157761 241158 562354 120924 290667 484780 399761 58893
14892D36544A01278M3547J6607K26339L4488j6326H6649J76531D7767J44062E0924
$$ 436544 101278 144825 161432 387771 422259 405933 86649 263180 47767 191829 50924
14880D41634A15243K64418j10055L5421G8099j099M14821m0194n4385F1491L16912
$$ 441634 115243 379661 269606 305027 78099 77000 491821 451627 397242 61491 378403
14869C78403q9608K95739j97683N5517A58853P2506p5476K54562j39795j12425
$$ 378403 288795 584534 386851 442368 158853 231359 155883 410445 270650 158225
14859A58225L68347j23851j00243O5160N1863j2950K03573B68722l7769K00468
$$ 158225 526572 402721 302478 367638 419501 406551 610124 268722 230953 431421
14849D31421k04166L75518k20245L91112l54537j94762J65776J5514J00743r7792
$$ 431421 227255 602773 382528 773640 419103 224341 390117 405631 506374 408582
14839D08582J9383k11831K76423R2692k47502L6947k5483J67657l5441j37408
$$ 408582 427965 216134 492557 585249 337747 374694 349211 516868 481427 344019
14829C44019K31720l5880j30848K1067k6123K42563H7212L20583M10068B1500
$$ 344019 575739 539859 409011 430078 403955 646518 87212 407795 817863 21500
14818C90467j37486N17213C55366L01250C15813L20477A14435J43825J60260J64996
$$ 390467 252981 770194 355366 656616 315813 636290 114435 258260 418520 583516
14808E83516J8077k13413J64509J75430k41828A42898J16354L3372L07766k33420
$$ 583516 601593 388180 552689 728119 486291 142898 259252 292624 600390 366970
14798C66970K08451j04588M5928K12512p4281k39139K06690m4862j19451M2180
$$ 366970 575421 470833 516761 729273 654992 415853 622543 577681 458230 500410
14788E00410M9352B5666N55325O8634k77370k1214K4541L30058p1461P6574j61787
$$ 500410 549762 25666 580991 649625 372255 351041 375582 705640 634179 710753 548966
14777E48966L49637k71185k46573o4394K53653j80237L59888O41k83595l8697
$$ 548966 898603 627418 380845 316451 570104 389867 749755 750396 466801 428104
14767D28104n5139L93859l58116m349L63100j54822j81923K48441Q4782k80550
$$ 428104 372965 766824 408708 404359 767459 612637 430714 679155 763937 483387
14757D83387N2982K00749k56701K26222j99153N3170K28674k94624K21678l08001
$$ 483387 536369 737118 480417 706639 507486 560656 789330 494706 716384 408383
14747D08383M02771k96725k19755M49976C29774J36654K93148k77345P3548J36448
$$ 408383 811154 514429 294674 744650 329774 466428 759576 482231 555779 692227
14737F92227l5608J13643j69061L1607j32339K78298j45351L53J84460J55273
$$ 692227 656619 770262 601201 632808 500469 778767 633416 633769 818229 973502
14727I73502j27668l26744P8416K20295k02528q9052o1183K84070k404K40862
$$ 973502 845834 519090 597506 817801 615273 526221 465038 749108 746704 987566
14717I87566k48089m6346l3809O2895j53626N32312p8536l77976J93388j89718
$$ 987566 739477 693131 659322 722217 568591 1100903 1022367 644391 837779 648061
14707F48061K51577K0079j55761K28585D64304M83962j22241r5626j6863j85829
$$ 648061 899638 919717 763956 992541 464304 948266 826025 730399 713536 527707
14697E27707L06997j17740J12392j78063K45307m62J70234j8962k16536K67925
$$ 527707 834704 716964 829356 651293 896600 896138 1066372 1047410 830874 1098799
14687A098799m1722j69157N1235J83442E37106K68160K49249j27725J34797j79015
$$ 1098799 1057077 887920 939155 1122597 537106 805266 1054515 926790 1061587 882572
14677H82572J33140k28227P8414q6902L22753j20392Q8357k65982N77021l90761
$$ 882572 1015712 787485 865899 778997 1101750 981358 1069715 803733 1380754 989993
14667I89993j57150K73443k68913J6839J28506L47546l10845j15866R8478L23714
$$ 989993 832843 1106286 837373 854212 982718 1330264 1019419 903553 1002031 1325745
14657A325745j00254l46377L879O43677m25960K2205K56679J50023k51202k60960
$$ 1325745 1225491 879114 882993 1526670 1100710 1122915 1379594 1529617 1278415 1017455
14647A017455l19964L26279L00519j12285K33177l45514J69542k6950l80751M00161
$$ 1017455 697491 1023770 1324289 1212004 1445181 1099667 1269209 1242259 861508 1261669
14637A261669k77584K8299L57039n7161m1843j58587Q3470M89031n43924K34332
$$ 1261669 984085 1012384 1369423 1312262 1270419 1111832 1195302 1684333 1140409 1374741
14627A374741k08401l9649K55592l19620K38382o9314M77069j9692m41816P6394
$$ 1374741 1166340 1126691 1382283 1062663 1301045 1231731 1708800 1689108 1247292 1323686
14617A323686N5413j13258J93840Q0377R3366J48438m15043Q7077l5097J15195
$$ 1323686 1379099 1265841 1459681 1540058 1633424 1781862 1366819 1453896 1418799 1533994
14607A533994j96306k8777J11138J33435J70499j60137l4787K11169j83408J3619
$$ 1533994 1337688 1308911 1420049 1553484 1723983 1563846 1529059 1740228 1556820 1570439
14597A570439M08994m51890L732J03905p694N3375L6983l2800K36895j23833l0263
$$ 1570439 1979433 1527543 1531275 1635180 1627486 1680861 1717844 1685044 1921939 1798106 1767843
14586A767843K24900M2412l96726R9315N3460L80709p432n7797k92465J66768
$$ 1767843 1992743 2035155 1638429 1737744 1791204 2171913 2164481 2106684 1814219 1980987
14576A980987J55640l02839k0198n8313L16192l57238N30229K81125l0886P4947
$$ 1980987 2136627 1833788 1813590 1755277 2071469 1714231 2244460 2525585 2494699 2569646
14566B569646n19125K81014L19239j66101J17819L55234k20809O9194m2520L43708
$$ 2569646 2050521 2331535 2650774 2484673 2602492 2957726 2736917 2806111 2763591 3107299
14556C107299J96034K66041M6907N41844M81829N41041J300877L146926N234977
$$ 3107299 3303333 3569374 3616281 4158125 4639954 5180995 6481872 9628798 14863775
14547A4863775J0196308J4483399q110412A5347851G408566l150872j388958j78737
$$ 14863775 25060083 39543482 31433070 15347851 7408566 4257694 2868736 2689999
14539B689999o04909J16164k31615k5632K26121l76789K61713J45938K36973K55570
$$ 2689999 2085090 2201254 1969639 1944007 2170128 1793339 2055052 2200990 2437963 2693533
14529B693533n04652J05015k50075R9703l18693L11715L59809R5990J34318j01809
$$ 2693533 2188881 2293896 2043821 2143524 1824831 2136546 2496355 2592345 2726663 2624854
14519B624854l76820M58098l37692P1180L92275k00325K36621j5495q2646K38679
$$ 2624854 2248034 2706132 2368440 2439620 2831895 2631570 2868191 2852696 2770050 3008729
14509C008729q7080j49345Q6328K44762j02091k61971K44457K91020n1315l323
$$ 3008729 2921649 2772304 2858632 3103394 3001303 2739332 2983789 3274809 3223494 3220171
14499C220171L10399k65576M1327K39124m30448J13830J07974j70790K33538M5512
$$ 3220171 3530570 3264994 3306321 3545445 3114997 3228827 3336801 3166011 3399549 3445061
14489C445061K80628N551m04505O28527n979k20778j3290o2713l1626K17535K25452
$$ 3445061 3725689 3731240 3326735 3955262 3949283 3728505 3715215 3652502 3620876 3838411 4063863
14478D063863j17064J20581J76970k05676j2225M18497j99936K46684r263k19975
$$ 4063863 3946799 4067380 4244350 4038674 4026449 4444946 4245010 4491694 4482431 4262456
14468D262456l35274P50533J23873j07121K82758j63898j64713J90571m899L8503
$$ 4262456 3927182 4677715 4801588 4694467 4977225 4813327 4648614 4839185 4834286 4872789
14458D872789l26778Q21079n55684L54990L18772o0081j3088j08069N4000Q0644
$$ 4872789 4546011 5367090 4811406 5166396 5485168 5425087 5411999 5303930 5357930 5438574
14448E438574N7310L23970j33301N9849J03037o3595L71820k26671L86216m13800
$$ 5438574 5495884 5819854 5686553 5746402 5849439 5785844 6157664 5930993 6317209 5903409
14438E903409M01848K2858M51084N2774j20453k54412N86224j59330N5570K4044
$$ 5903409 6305257 6328115 6779199 6831973 6711520 6457108 7043332 6884002 6939572 6963616
14428F963616L84409O0965o8191k72510O00795J63193Q3078k02940M39257J8612
$$ 6963616 7348025 7408990 7340799 7068289 7669084 7832277 7915355 7712415 8151672 8170284
14418H170284J54158R4804M2907j12850K12410P50229m8046j40807K66050M8141
$$ 8170284 8324442 8419246 8462153 8349303 8561713 9311942 9263896 9123089 9389139 9437280
14408I437280K01499n0756M56454K72019m33150K95133K73900p3068N23037Q9803
$$ 9437280 9638779 9588023 10044477 10316496 9883346 10178479 10452379 10379311 10902348 10992151
14398A0992151L05438L43568k15095K47972M23206N8945K28074n9779M32125M14631
$$ 10992151 11297589 11641157 11426062 11674034 12097240 12156185 12384259 12324480 12756605 13171236
14388A3171236Q4867K83245k61151P25925J52516J28051L97624J38542M28273
$$ 13171236 13256103 13539348 13278197 14004122 14156638 14284689 14682313 14820855 15249128
14379A5249128K01074m8946O15645M57493k8384L99394K01358P14441L81070j9793
$$ 15249128 15450202 15401256 16016901 16474394 16446010 16845404 17046762 17761203 18142273 18122480
14369A8122480N26743K09963M45529O27872K33040O41628L48276N30114L15234
$$ 18122480 18649223 18859186 19304715 19932587 20165627 20807255 21155531 21685645 22000879
14360B2000879L49861J050196J51289O01291N10043N63004L27301J041665O20890
$$ 22000879 22350740 23400936 23552225 24153516 24663559 25226563 25553864 26595529 27216419
14351B7216419O63287N53485R18488N29060N41535Q30022P37981J123014P15366
$$ 27216419 27879706 28433191 29351679 29880739 30422274 31252296 31990277 33113291 33828657
14342C3828657J163185R00469P28238J113414J115053R92866J270293R85516J200821
$$ 33828657 34991842 35892311 36620549 37733963 38849016 39841882 41112175 42097691 43298512
14333D3298512J096563J605023J502212J171939J760724J356727J940658J834945
$$ 43298512 44395075 46000098 47502310 48674249 50434973 51791700 53732358 55567303
14325E5567303J567656J922969J992445J744223K340440K379521K227089K291731
$$ 55567303 57134959 59057928 61050373 62794596 65135036 67514557 69741646 72033377
14317G2033377L331552K562659K476363L322437L371294L147547L810451L869533
$$ 72033377 75364929 77927588 80403951 83726388 87097682 90245229 94055680 97925213
14309I7925213M011194M264942M298254M668211M856888N349290N380523N937124
$$ 97925213 101936407 106201349 110499603 115167814 120024702 125373992 130754515 136691639
14301A36691639O016260O898145O666799P098970P823201Q188011Q781789R013858
$$ 136691639 142707899 149606044 156272843 163371813 171195014 179383025 188164814 197178672
14293A97178672R598520R838218J0574989J1110361J1714510J1846541J2632564
$$ 197178672 206777192 216615410 227190399 238300760 250015270 261861811 274494375
14286B74494375J2686746J3469433J3739056J3802467J3820246J3940700J3938849
$$ 274494375 287181121 300650554 314389610 328192077 342012323 355953023 369891872
14279C69891872J3294436J2779921J2147340J0882980R256960P500642L212045
$$ 369891872 383186308 395966229 408113569 418996549 428253509 435754151 438966196
14272D38966196N63800Q60425J72799j357104j785558l979806o780951r346763
$$ 438966196 439529996 440390421 440563220 439206116 437420558 433440752 426659801 417313038
14264D17313038j1658329j2939348j4151154j4611077j4906760j5251983j5004063
$$ 417313038 405654709 392715361 378564207 363953130 349046370 333794387 318790324
14257C18790324j4703591j3808608j4124677j3680820j2694060j2387634j1666620
$$ 318790324 304086733 290278125 276153448 262472628 249778568 237390934 225724314
14250B25724314j0957496j0934781j0089799r557168q558933q454501p855425
$$ 225724314 214766818 203832037 193742238 184185070 175626137 167171636 159316211
14243A59316211p318085p102074p031666n746737n983500n295395n153189m952151
$$ 159316211 151998126 144896052 137864386 132117649 126134149 120838754 115685565 110733414
14235A10733414m951308m230424m247838l729179l543016l818913k970907l228348
$$ 110733414 105782106 101551682 97303844 93574665 90031649 86212736 83241829 80013481
14227H0013481l261093k498303k974886k338642k631840k469162k312600j541353
$$ 80013481 76752388 74254085 71279199 68940557 66308717 63839555 61526955 59985602
14219E9985602k224743k077258j819195j449252j799792j101319j500008j741026
$$ 59985602 57760859 55683601 53864406 52415154 50615362 49514043 48014035 46273009
14211D6273009j472533j519010r98787r62129r78261j283875j043316j175807
$$ 46273009 44800476 43281466 42282679 41320550 40342289 39058414 38015098 36839291
14203C6839291j055441r80772q42595r78512o54478j276275q61394n74585n85979
$$ 36839291 35783850 34803078 33960483 32981971 32327493 31051218 30189824 29615239 29029260
14194B9029260p30948o03529p89658l27853o31381r65449l72280m63055q12843
$$ 29029260 28298312 27694783 26905125 26577272 25945891 24980442 24608162 24145107 23332264
14185B3332264l81882l48690m36302m68789n93389n77004n28323r6151p32399
$$ 23332264 22950382 22601692 22165390 21696601 21103212 20526208 19997885 19901734 19169335
14176A9169335l43036l70393k47344m86551j31198k38576o58320l93193j45893
$$ 19169335 18826299 18455906 18208562 17722011 17590813 17352237 16693917 16300724 16154831
14167A6154831j51610o64114j7136n61981L01069l95670m71324j1423m94941k06724
$$ 16154831 16003221 15339107 15321971 14759990 15061059 14665389 14194065 14182642 13687701 13480977
14157A3480977k21446m19474J8075j09076m42750l10152k65098J99873l06183
$$ 13480977 13259531 12840057 12858132 12749056 12306306 11996154 11731056 11930929 11624746
14148A1624746l07620l77128K21888l12076m21927R2671m67390L05m22978M61991
$$ 11624746 11317126 10939998 11161886 10849810 10427883 10520554 10053164 10053469 9630491 10092482
14138A0092482l82436k15269l78452L6529m15319O28545j42828m47046L4653l20008
$$ 10092482 9710046 9494777 9116325 9152854 8737535 9366080 9223252 8776206 8810859 8490851
14128H490851l07106Q6472j48869K22449p19502J81014j46332J96492k03381k66283
$$ 8490851 8183745 8270217 8121348 8343797 7624295 7805309 7658977 7855469 7652088 7385805
14118G385805O6261k70520J55704r3988k69562J21989j71607l10622M13947m05120
$$ 7385805 7452066 7181546 7337250 7243262 6973700 7095689 6924082 6613460 7027407 6622287
14108F622287l41237R3095k05913M9927p2355l2805r7715Q3242j20885j7066k44051
$$ 6622287 6281050 6374145 6168232 6218159 6145804 6112999 6015284 6098526 5977641 5960575 5716524
14097E716524P5429l31328J41808k3814n8667n16010K32085P381p1656k13273
$$ 5716524 5791953 5460625 5602433 5578619 5519952 5003942 5236027 5243408 5171752 4958479
14087D958479J13254J26866k47074m45191L99825j93919j25091R1923N3246m1928
$$ 4958479 5071733 5198599 4951525 4506334 4906159 4712240 4587149 4679072 4732318 4690390
14077D690390K17989p38035M28784l53151k0234j5694J49366q9612M8872m78001
$$ 4690390 4908379 4170344 4599128 4245977 4225743 4210049 4359415 4269803 4318675 3840674
14067C840674L83480k94146L40055l26412k09281L20314m9276k46099j271K82459
$$ 3840674 4224154 3930008 4270063 3943651 3734370 4054684 4005408 3759309 3758038 4040497
14057D040497P3183k77561M4920l53810p1102L47523m21743J9984N8236l68124
$$ 4040497 4113680 3836119 3881039 3527229 3456127 3803650 3381907 3401891 3460127 3092003
14047C092003K06497p7773K35646l59494J11992j03994L51856k07030k68333L9918
$$ 3092003 3298500 3220727 3456373 3096879 3208871 3104877 3456733 3249703 2981370 3021288
14037C021288k64028M83983r8036k28056J70021J65897l66855L7961j26552L78056
$$ 3021288 2757260 3241243 3143207 2915151 3085172 3251069 2884214 2922175 2795623 3173679
14027C173679n06996J56355n1497L14709m83211L85800m29590L49524k65680j19893
$$ 3173679 2666683 2823038 2771541 3086250 2603039 2988839 2559249 2908773 2643093 2523200
14017B523200j61260J40582k3567K06533k11137k4191o7827J51649n1519l6677
$$ 2523200 2361940 2502522 2478955 2685488 2474351 2450160 2382333 2533982 2482463 2445786
14007B445786j47905j7123l4645J24387o6505j90519L63260k67170K31509k48443
$$ 2445786 2297881 2280758 2246113 2370500 2303995 2113476 2476736 2209566 2441075 2192632
13997B192632L77493n9921j76201P1436n6345M4993L89207J116228J553150M422431
$$ 2192632 2570125 2510204 2334003 2405439 2349094 2394087 2783294 3899522 5452672 9875103
13987I875103Q615538J6181800j342305j3185929q813091l660461k174199p63119
$$ 9875103 18490641 34672441 33330136 20144207 11331116 7670655 5496456 4733337
13979D733337q70052m09785j17038l51571l92768K80826l17624K0826K09530m23088
$$ 4733337 3863285 3453500 3336462 2984891 2592123 2872949 2555325 2576151 2785681 2362593
13969B362593q329o3543j4524j60228K27088j25466J82547j52074n728o5724k3190
$$ 2362593 2354264 2290721 2276197 2115969 2343057 2217591 2400138 2248064 2242336 2176612 2153422
13958B153422k00410J92498l6531m88911N41073q5663k38955l0329L36813l92341
$$ 2153422 1953012 2145510 2108979 1620068 2161141 2075478 1836523 1806194 2143007 1750666
13948A750666P4124n1785j17340L3526P0946k845J47763j39112J78557J1118k70753
$$ 1750666 1824790 1773005 1655665 1689191 1760137 1757292 1905055 1765943 1944500 1955618 1684865
13937A684865J6198L8285P2155k5081k20467k17613M41319k24664O2649K08748
$$ 1684865 1701063 1739348 1811503 1786422 1565955 1348342 1789661 1564997 1627646 1836394
13927A836394m44442P1984J44405K8145j04182K8381K5975l5044l2363j50719
$$ 1836394 1391952 1463936 1608341 1636486 1532304 1560685 1586660 1551616 1519253 1368534
13917A368534J14560J19536l7118r9801J9770r8453J65324m28068M98615j62170
$$ 1368534 1483094 1602630 1565512 1465711 1485481 1387028 1552352 1124284 1622899 1460729
13907A460729n2744M2916L01003m16722R0673J67763l90102K99553m12909M23543
$$ 1460729 1407985 1450901 1751904 1335182 1425855 1593618 1203516 1503069 1090160 1513703
13897A513703j57094L7635p2395j17660j8372N5377J73106p9310j17051J9024
$$ 1513703 1356609 1394244 1321849 1204189 1185817 1241194 1414300 1334990 1217939 1236963
13887A236963k67769R2462J81952j5241o3033J16199l82229L69598O3019o3008
$$ 1236963 969194 1061656 1243608 1228367 1165334 1281533 899304 1268902 1331921 1268913
13877A268913O6450k62171L17083k88238n823k76162K35605k0770R9850N7928
$$ 1268913 1335363 1073192 1390275 1102037 1096214 820052 1055657 1034887 1134737 1192665
13867A192665L769j93298J39803N0256k24m8073K7025j44427n6745M0953Q8775
$$ 1192665 1196434 1003136 1142939 1193195 1192971 1144898 1171923 1027496 970751 1011704 1100479
13856A100479j05987r4805O4797m2956l6703J66986n5396l30567L14466J47239
$$ 1100479 994492 899687 964484 921528 884825 1051811 996415 665848 980314 1127553
13846A127553k6825J3368n09526L81984J24754N0947o5228l68716K41144j28995
$$ 1127553 1100728 1114096 604570 986554 1111308 1162255 1097027 728311 969455 840460
13836H40460J23566P6965Q6658l28338O9623J64020J32199n10574M80560m80308
$$ 840460 964026 1040991 1127649 799311 868934 1032954 1165153 654579 1135139 654831
13826F54831M51128l8080J7221k04214J98052C73223P67441m07056J73720j26971
$$ 654831 1105959 1067879 1085100 880886 1078938 373223 1140664 733608 907328 780357
13816G80357P5445K68981D75774N53823J09m28332J25884K54088J10932m82192
$$ 780357 855802 1124783 475774 1029597 1029706 601374 727258 981346 1092278 610086
13806F10086K35183Q3412J2732J44503k71229P6664J9194p6319k63110J40014
$$ 610086 845269 928681 941413 1085916 814687 891351 910545 834226 571116 711130
13796G11130R1846N8674k02491J59349R7547m4327L8039j34642O843C76349M04159
$$ 711130 802976 861650 659159 818508 916055 871728 909767 775125 781968 376349 780508
13785G80508M9019J19709m21395J85995K37139k60872j22689J69239r5801M3649
$$ 780508 829527 949236 527841 713836 950975 690103 567414 736653 640852 684501
13775F84501j07185r1754j4342N5496L26082l83914L12734J48222l84335J93816
$$ 684501 577316 485562 471220 526716 852798 468884 781618 929840 545505 739321
13765G39321k73972L16116j18890M5087C39449K14067Q9610R4144j68227J3949
$$ 739321 465349 781465 662575 707662 339449 553516 643126 737270 569043 582992
13755E82992K91986k26212J84220l91543L40341l08021K13946j58400J45411k09659
$$ 582992 874978 648766 832986 441443 781784 473763 687709 529309 674720 465061
13745D65061J16748J30980j60834O6266j00105K15017p3150k37989j95381M55284
$$ 465061 581809 712789 551955 618221 518116 733133 659983 421994 226613 681897
13735F81897J8325L4287k94081M0511k19059M00680n7055B43419M3727M10431
$$ 681897 700222 734509 440428 480939 261880 662560 605505 243419 287146 697577
13725F97577J4014j70845j28966r8106N33211k76959L31917k97197r3781j34836
$$ 697577 711591 540746 411780 313674 846885 569926 901843 604646 510865 376029
13715C76029L48826l51651L25734j45K857j38201J94192C77068n1165N30459l77882
$$ 376029 724855 373204 698938 698793 701650 563449 757641 377068 325903 856362 478480
13704D78480Q0982j58089M2357j48693K95616j91125K79188j58916M3974j26596
$$ 478480 559462 401373 443730 295037 590653 399528 678716 519800 563774 437178
13694D37178K32204B52597P4481R5701P0397J09751M6824A77676E9669N44779
$$ 437178 669382 252597 327078 422779 493176 602927 649751 177676 59669 604448
13684F04448p162j85346L00525j10503r2231B31552J92953K33885L6213A55536
$$ 604448 597286 411940 712465 601962 509731 231552 424505 658390 694603 155536
13673F30407P0052k85093l2106k2269K25343m5031j15764K3090K10133j21122
$$ 630407 700459 415366 383260 360991 586334 541303 425539 448629 658762 537640
13663E37640k61073A02972O87721k30869n9895k11431K72163k0460B47349J12647
$$ 537640 276567 102972 790693 559824 499929 288498 560661 540201 247349 359996
13653C59996M5924o3071M1924R6287M5349k11008L08122k03950j68088J88643
$$ 359996 405920 342849 384773 481060 526409 315401 623523 419573 251485 440128
13643D40128l2050q0130J28325K8422B07414j6940K76584j10697K28499B45872
$$ 440128 408078 327948 456273 484695 207414 190474 467058 356361 584860 245872
13632I0812M45534k28050Q7271j87139L43079j34059A62093J78387L6595J85955
$$ 90812 536346 308296 395567 208428 551507 417448 162093 340480 377075 563030
13622E63030k52061J22587Q8496k45612J16232l0067K31045k03412J25112J65775
$$ 563030 310969 433556 522052 276440 392672 362605 593650 390238 515350 681125
13612F81125d5019A17280K38889l9800J42458r4605j23577J41184L5615m3880
$$ 681125 -45019 117280 356169 316369 458827 364222 240645 381829 417444 373564
13602C73564j04342j6635M5987J23470j66401n9458q4239J91296k4944n4078K73383
$$ 373564 269222 252587 298574 422044 255643 196185 111946 303242 278298 224220 497603
13591D97603p6983j11966m5570J40995k9806A81333K89878l3213B12716R7031
$$ 497603 420620 308654 263084 404079 374273 181333 471211 437998 212716 309747
13581C09747L7668l0378I0534J54236K23794E8624K74325K21428a57602B84992
$$ 309747 347415 317037 90534 244770 468564 58624 332949 554377 -157602 284992
13570D33395J04683k31812J61795H8289L10193p3887J32119R4220A44144B6433
$$ 433395 538078 306266 468061 88289 398482 324595 456714 550934 144144 26433
13559C44225J1645n8852n3892G2778L67338j22100J11768j09411P4826e6523E38663
$$ 344225 355870 297018 243126 72778 440116 318016 429784 320373 395199 -56523 538663
13547C82074K46695l02565j59449J10323j20684B8401K85313r6737K68993k11920
$$ 382074 628769 326204 166755 277078 156394 28401 313714 216977 485970 274050
13537B74050P237j01237J97507M5947A76731J29211L35594j19112P694k56759
$$ 274050 281287 180050 377557 423504 176731 305942 641536 522424 530118 273359
13527B73359F3573M10119l1548a1008D04836l8524O7653r1684L72086l37516j18813
$$ 273359 63573 473692 442144 -11008 404836 366312 433965 342281 714367 376851 258038
13516B58038J56437A61687J00336n0449r1448c2662B86502m9665p9958L55836
$$ 258038 414475 161687 262023 211574 120126 -32662 286502 236837 156879 512715
13506E12715B09930p7622L60455A88333K12895q3197J35652i3138C30393p0776
$$ 512715 209930 132308 492763 188333 401228 318031 453683 -93138 330393 259617
13496B59617D7945L3625J58323p1149L87550F9122Q7649N31462B83324j08803
$$ 259617 47945 81570 239893 168744 556294 69122 156771 688233 283324 174521
13486A74521H3802a46613C34631F8436J97395j23676l7847g0769H7635O2099L6062
$$ 174521 83802 -146613 334631 68436 265831 142155 104308 -70769 87635 149734 185796
13475A85796N3191n7584J74885J4146I8016r597e6570B08345K85391k13083H9554
$$ 185796 238987 181403 356288 370434 98016 88419 -56570 208345 493736 280653 89554
13463E14314j50360L3416j62671n8603K0200b8947F14384k91907b82760D05756
$$ 514314 363954 397370 234699 176096 196296 -28947 614384 322477 -282760 405756
13452A26015L18258a00407B56416J22258A60386O746L0459G5713K45238j48708
$$ 126015 444273 -100407 256416 378674 160386 167132 197591 75713 320951 172243
13442A72243J69816P1302j72582N3407A27288a12996A65193C3473O4497r570J08678
$$ 172243 342059 413361 240779 294186 127288 -112996 165193 33473 97970 88400 197078
13431A97078K62787B07248J43468o584A69615g4323B40681J61742q9416p741J03617
$$ 197078 459865 207248 350716 344132 169615 -74323 240681 402423 313007 305266 408883
13420D08883q2487D6711J00283J7042p3737L36814E5113K08151K5984j20560J61233
$$ 408883 326396 46711 146994 164036 90299 427113 55113 263264 289248 168688 329921
13409C29921e4776B25379m7262e4452B55875k6224j862n2246G5393K15942p6608
$$ 329921 -54776 225379 178117 -54452 255875 229651 227789 175543 75393 291335 214727
13398B14727Q0084K6036K44609A13776a4546B01407H6897d6765A05483a03789
$$ 214727 294811 320847 565456 113776 -14546 201407 86897 -46765 105483 -103789
13387E7845d1858A40661J88885q6987K4177m5614f7171A01462D5285L0531A5657
$$ 57845 -41858 140661 329546 242559 266736 221122 -67171 101462 45285 75816 15657
13375E64412K2167B63290N8038F1762J31216D7845L144Q8811j0759M86022A91780
$$ 564412 586579 263290 321328 61762 192978 47845 50989 139800 129041 615063 191780
13363h8213A94289g2511C42056G4445k4870c0706B7705K34208K37025C9164J87847
$$ -88213 194289 -72511 342056 74445 49575 -30706 27705 261913 498938 39164 227011
13352B27011n4075b2099C7824j7881K95273k827R1653A50910J40221p9060J00837
$$ 227011 172936 -22099 37824 19943 315216 312389 404042 150910 291131 212071 312908
13341C12908k8841K47391l5249m3081o2777j69855j09538C0314J65517a5079B80534
$$ 312908 284067 531458 496209 453128 390351 220496 110958 30314 195831 -15079 280534
13329C23736N9293N9653m5685p8374n4464K97434B59083J65047F6219M60344A99216
$$ 323736 383029 442682 396997 318623 264159 561593 259083 424130 66219 526563 199216
13317A63003M6198L03744B16781I2746O5609L13740A39680a35996D6125M98308
$$ 163003 209201 512945 216781 92746 158355 472095 139680 -135996 46125 544433
13307E44433I0499C5198L8496M5862J70057O1904R0896A46000h8357A31246n9423
$$ 544433 90499 35198 73694 119556 289613 351517 442413 146000 -88357 131246 71823
13296G1823R8890K97167H6953K73127A41187A7144K07665o4580m5130P3678K41377
$$ 71823 170713 467880 86953 360080 141187 17144 224809 160229 115099 188777 430154
13285D30154C1974J12074K08521F0197K20781d3627A77533l2413l8828K02690
$$ 430154 31974 144048 352569 60197 280978 -43627 177533 145120 106292 308982
13275C08982a61940B04879n757J54953K5269A46405N2638C7684J50718c49247
$$ 308982 -161940 204879 199122 354075 379344 146405 199043 37684 188402 -349247
13264A92913J1055q2585K15347H8909J35069q4021a35787E6447Q987b24638B44331
$$ 192913 203968 121383 336730 88909 223978 139957 -135787 56447 65434 -224638 244331
13252b33211E6592k6512K54767g0440A19924L787J01177C5523N28119A54120E1771
$$ -233211 56592 30080 284847 -70440 119924 123711 224888 35523 563642 154120 51771
13240G8167D628Q4975K19695j25090a35523d8421H6191n166P8916f8614E0776
$$ 78167 4628 89603 309298 184208 -135523 -48421 86191 81025 159941 -68614 50776
13228i5318G4947a12777A10836J44048A09852A7140M23414A1573c3757B8496K4016
$$ -95318 74947 -112777 110836 254884 109852 17140 440554 11573 -33757 28496 52512
13217E2512N0865A5907K68117A7047L3448P961J92869Q240q8800m0773P6064a13775
$$ 52512 103377 15907 284024 17047 50495 58456 251325 259565 170765 129992 206056 -113775
13204B31579o6193K80239A76245P5100A18916n0162L4518g2594B94939A4897P6625
$$ 231579 165386 445625 176245 251345 118916 68754 103272 -72594 294939 14897 91522
13193I1522a01787A62188R576F6581k0179A0526f0897C11811F1419L964R5114
$$ 91522 -101787 162188 171764 66581 46402 10526 -60897 311811 61419 65383 160497
13182A60497c306A43093b5192o8017B38729F8426B0426J01827O5722J21930j01607
$$ 160497 -3306 143093 -25192 -93209 238729 68426 20426 122253 187975 309905 208298
13171B08298o8287e9038A49938k5592E9734a5393j21782p9233i1693A93148a70426
$$ 208298 140011 -59038 149938 124346 59734 -15393 -137175 -216408 -91693 193148 -170426
13159b0667B4288M8195c22537D2332R2123J24740K04538H5426a52614D57788A98735
$$ -20667 24288 72483 -322537 42332 134455 259195 463733 85426 -152614 457788 198735
13147a56748r9018F1969b4112n1976C18723j27058O5919g8865K3981p6221A46129
$$ -156748 -255766 61969 -24112 -76088 318723 191665 257584 -78865 -54884 -131105 146129
13135B4946j1776e3296q2162G6849a2501q4700A69207e2932E04467p2231f0717
$$ 24946 13170 -53296 -135458 76849 -12501 -97201 169207 -52932 504467 432236 -60717
13123B06772K84334d8531k9295j31474d4877j5245C15772K5317q1146G6783b14055
$$ 206772 491106 -48531 -77826 -209300 -44877 -60122 315772 341089 259943 76783 -214055
13111a13424B26641J1161o4853L0136a31893B15182h504B47264G612O8296J0039
$$ -113424 226641 237802 172949 203085 -131893 215182 -8504 247264 7612 75908 85947
13100H5947P497f6848I983f4243C5219K40066b39711g3735j49840g3710E9539
$$ 85947 93444 -66848 9983 -64243 35219 275285 -239711 -73735 -223575 -73710 59539
13088b70729Q7185L3743A96377K66819b11222c5432g450E17116k17592G6476M3420
$$ -270729 -183544 -149801 196377 463196 -211222 -35432 -7450 517116 299524 76476 119896
13077A19896P52k5616C4644J06746L2889h6146D2720N1698P9940a02534H8990
$$ 119896 120648 95032 34644 141390 174279 -86146 42720 94418 174358 -102534 88990
13065B08806M944F8593K95851A08781L63247A2696O2281e5690H7609J77339D1298
$$ 208806 213750 68593 364444 108781 472028 12696 74977 -55690 87609 264948 41298
13053B04736G0480J20339E6648k3794L4024P1435E500d8687A08001J91428A16453
$$ 204736 70480 190819 56648 32854 66878 138313 5500 -48687 108001 299429 116453
13041F4409g7932F7123b27258A65530K67077h8718o071I7911g7360A49102J68233
$$ 64409 -77932 67123 -227258 165530 432607 -88718 -94789 97911 -77360 149102 317335
13030C17335A4923K09593J8151c24193B63775k6975o0702L15624I9984F262R6755
$$ 317335 14923 224516 242667 -324193 263775 236800 176098 491722 99984 6262 103017
13019A03017O5988o0374Q8721b1649C16698A58164J86341M52696a74026A46593
$$ 103017 169005 108631 197352 -21649 316698 158164 344505 797201 -174026 146593
13008B94051I5675K6599d2715A78036C7736a38205A04231l4836i3450H0819a50624
$$ 294051 95675 122274 -42715 178036 37736 -138205 104231 69395 -93450 80819 -150624
12996a65006N9686b6438A39654J3095k5349k0177J03970Q5103R831b07100D3571
$$ -165006 -105320 -26438 139654 152749 127400 107223 211193 296296 306127 -207100 43571
12984E3592a21608E5606J14491H0258g885B53575c55436g0776k616A52046K24087
$$ 53592 -121608 55606 170097 80258 -7885 253575 -355436 -70776 -73392 152046 376133
12973C76133d2648j08202F1040a20060K4717C5593j5628L0763b36798M3537B44519
$$ 376133 -42648 -150850 61040 -120060 -95343 35593 19965 50728 -236798 -193261 244519
12961C53441a80489l8530h7594B73863j27198a39131K1475q1337N8028D8820L18002
$$ 353441 -180489 -219019 -87594 273863 146665 -139131 -117656 -198993 -140965 48820 366822
12950C66822F9124b17030B75670a38341G9000L8664O3838J75616c8139j34355
$$ 366822 69124 -217030 275670 -138341 79000 117664 181502 357118 -38139 -172494
12940a72494m69H9932a02675A32757b75900d4514j17899G6288J2154j1145J49045
$$ -172494 -172963 89932 -102675 132757 -275900 -44514 -162413 76288 88442 77297 226342
12929B26342K1799b7697C96398A55210b71540f7629k8367B764b43692a5484j54846
$$ 226342 248141 -27697 396398 155210 -271540 -67629 -95996 2764 -243692 -15484 -170330
12918a70330K3502a7056C4411J33216b11837A32133a52466a7003j23668B320J51512
$$ -170330 -146828 -17056 34411 167627 -211837 132133 -152466 -17003 -140671 2320 153832
12907A53832a31119j87632a45998p8381A3063J31929D5444N781J2012d2882A7216
$$ 153832 -131119 -318751 -145998 -224379 13063 144992 45444 51225 63237 -42882 17216
12895A03742a12007C50112O9961D9327J27363G5975a21716o637A19071e688H8910
$$ 103742 -112007 350112 420073 49327 176690 75975 -121716 -128353 119071 -5688 88910
12883I8693b46380b5519A3026h4582B68101j33836i5325c4400j40185C1075b15947
$$ 98693 -246380 -25519 13026 -84582 268101 134265 -95325 -34400 -174585 31075 -215947
12871B59194b72363a01868A32174a34650m4806j2046c9283A50410o1108e2189
$$ 259194 -272363 -101868 132174 -134650 -179456 -191502 -39283 150410 89302 -52189
12860a17876L9426r4225A54932P2443B7865K15158o6972A953L9285J72570n6083
$$ -117876 -78450 -172675 154932 227375 27865 243023 176051 1953 41238 213808 157725
12849A57725b20364A61489I113a11327A32195J44899A30156o2212P6449R799a38051
$$ 157725 -220364 161489 9113 -111327 132195 277094 130156 67944 144393 154192 -138051
12837a5936A08400a9212A03615E0197L4981a15806E9273J12235Q9786a769A18944
$$ -15936 108400 -19212 103615 50197 85178 -115806 59273 171508 261294 -1769 118944
12825B5508b08115i679j34488B83277a49745H6572b65807A59191m3499D1569i7928
$$ 25508 -208115 -9679 -144167 283277 -149745 86572 -265807 159191 115692 41569 -97928
12813B19550a78499B47834A04848K26660a79745k25825F7515j0490J33393k9014
$$ 219550 -178499 247834 104848 331508 -179745 -405570 67515 57025 190418 161404
12803A61404a07792L421A91106L3938A4611a60333O907A79738I644N8979A8942
$$ 161404 -107792 -104371 191106 225044 14611 -160333 -153426 179738 9644 68623 18942
12791h8395m0694j86475a2004F4942L59426j66799g0730B13899C407J61618b4446
$$ -88395 -129089 -315564 -12004 64942 424368 257569 -70730 213899 3407 165025 -24446
12779B4120b29319C16116b1418B55958b70276a20324h171E7761j5536a17086B72084
$$ 24120 -229319 316116 -21418 255958 -270276 -120324 -8171 57761 42225 -117086 272084
12767G0938b26163A42382F992L21277h2827j88814B27181b34191B68069j24963
$$ 70938 -226163 142382 6992 328269 -82827 -271641 227181 -234191 268069 143106
12757A43106o6918N9966J66720F7057a6158j08402A64618j5468i1650B70230b31490
$$ 143106 76188 136154 302874 67057 -16158 -124560 164618 149150 -91650 270230 -231490
12745F3686L6924P391a22991A7775K16148b51983a20879C35817c12360e982A25839
$$ 63686 100610 108001 -122991 17775 233923 -251983 -120879 335817 -312360 -5982 125839
12733h9864b7127A25342N040D2481a47093H848h4172B5866b77837G0656d760k21085
$$ -89864 -27127 125342 130382 42481 -147093 8848 -84172 25866 -277837 70656 -4760 -225845
12721b25845A5419J39304p2878L6748j880B4857a05543A1279K32054b48145B97646
$$ -225845 15419 154723 81845 118593 116713 24857 -105543 11279 243333 -248145 297646
12709A73705m0611L5748O4951a27085G3233l5006K48199m5082P222L2711j08079
$$ 173705 133094 168842 233793 -127085 73233 38227 286426 241344 248566 281277 173198
12698A73198O1905h7337K7935A95972k9760E2222I677d7135F5134e9682K5522
$$ 173198 235103 -87337 -59402 195972 166212 52222 9677 -47135 65134 -59682 -34160
12687c4160B05205a36316B19456j06298J80354E658i4463C16256j12215G8550
$$ -34160 205205 -136316 219456 113158 293512 5658 -94463 316256 204041 78550
12676B32463G6109J29063k1842P7459k4333j06832R1750c1768k8763k614n5130
$$ 232463 76109 205172 183330 260789 236456 129624 221374 -31768 -60531 -63145 -118275
12665a18275C0487J11988a6664q6815A61414L31453B7416N0388c6934B05812K44455
$$ -118275 30487 142475 -16664 -103479 161414 492867 27416 77804 -36934 205812 450267
12654D50267i7416C42464J76000k07650C2888J4405K84907a18927C60944C6728
$$ 450267 -97416 342464 518464 310814 32888 47293 332200 -118927 360944 36728
12643c03100B03761n7994O3439a00403L3492A41442F8716q957M8143J45516l3094
$$ -303100 203761 145767 209206 -100403 -66911 141442 68716 59759 107902 253418 220324
12632B20324C0453M33451e1644p0593G7427R0432i011B25938n6279n1922P1271
$$ 220324 30453 463904 -51644 -122237 77427 167859 -9011 225938 169659 117737 189008
12621A89008o791J29822D3796L16654a36678G4775O743d4503C4628L05742A06588
$$ 189008 182217 312039 43796 360450 -136678 74775 81518 -44503 34628 340370 106588
12609A723a24147B7314J23550i7918J0484F680J92257n9075d09207A47025M7336
$$ 1723 -124147 27314 150864 -97918 -87434 6680 198937 139862 -409207 147025 194361
12598A94361Q7029d5867A75619B8488g0662A02003a4362A20493b2761q8093B14207
$$ 194361 281390 -45867 175619 28488 -70662 102003 -14362 120493 -22761 -110854 214207
12586d6688J5859G9211K44702H085k6N4843b28472D2638e6761A08907c38734B33346
$$ -46688 -30829 79211 323913 8085 8059 62902 -228472 42638 -56761 108907 -338734 233346
12573a8326B8212e9996E8973J60863n5481k8876O8924C3828J87243c80977A56780
$$ -18326 28212 -59996 58973 219836 164355 135479 204403 33828 221071 -380977 156780
12561A19785i7743r2023B29785g6510p857L5618H646N8051K36519p1603G232b71076
$$ 119785 -97743 -189766 229785 -76510 -84367 -48749 8646 66697 303216 231613 7232 -271076
12548A44388i6465A83756o0445B1468c16238i7249M6490j7335j9055A93120a23441
$$ 144388 -96465 183756 123311 21468 -316238 -97249 -50759 -68094 -87149 193120 -123441
12536e9586B39891A4905b96845B45995D6731L2239i2579B13239b29027h6117B42149
$$ -59586 239891 14905 -296845 245995 46731 78970 -92579 213239 -229027 -86117 242149
12524C88332a47476A95095F2385J68160n2028B0740K12506q4288A1573J78755
$$ 388332 -147476 195095 62385 230545 178517 20740 233246 148958 11573 190328
12514A90328l5274Q5845A5734a68530A67852D63M8700A5894N8684L5967a55359
$$ 190328 155054 240899 15734 -168530 167852 463 49163 15894 74578 110545 -155359
12502i1307j58912q330g4301G2292b99698a38681E670K18934a21981A40070k2928
$$ -91307 -250219 -258549 -74301 72292 -299698 -138681 5670 224604 -121981 140070 117142
12491A17142k005i8740M6625j0241l3651D1808b47714A01555a25940m8316A60042
$$ 117142 115137 -98740 -52115 -62356 -96007 41808 -247714 101555 -125940 -174256 160042
12479a3787E4730a11775d7085A20698J95505N5682a24347A57384b15096A13204
$$ -13787 54730 -111775 -47085 120698 316203 371885 -124347 157384 -215096 113204
12468D1613K81307b47262P3256A97388b68950M8757J07673A84058a08753G1159
$$ 41613 322920 -247262 -174006 197388 -268950 -220193 -112520 184058 -108753 71159
12457a59084C0021f5205E2146Q4729c8869A43158k2776e7526j31636R3595j44915
$$ -159084 30021 -65205 52146 136875 -38869 143158 120382 -57526 -189162 -95567 -240482
12446b40482d1588l62869a22549A4207b8978J0257l7205j3524E8593J52432g9430
$$ -240482 -41588 -404457 -122549 14207 -28978 -18721 -55926 -69450 58593 211025 -79430
12434A10538C4922J55755b15851F1839h7322f862A49984m1185l5668d75222A30655
$$ 110538 34922 190677 -215851 61839 -87322 -6862 149984 108799 73131 -475222 130655
12422I8541d9678J1221D7609N5098a90149I631N432d1488F7835a16420a2525j14551
$$ 98541 -49678 -38457 47609 102707 -190149 9631 15063 -41488 67835 -116420 -12525 -127076
12410a27076B1502b28383A05386R2533a17806k7584G4437h5391k5795r4088l6971
$$ -127076 21502 -228383 105386 197919 -117806 -145390 74437 -85391 -111186 -205274 -242245
12399b42245A9173M1675k2757I502f2490n988I934e4172j27071B50244a29575
$$ -242245 19173 60848 38091 9502 -62490 -68478 9934 -54172 -181243 250244 -129575
12387C77038c8114j03489i874A06229a41235A05880J43722N9320j12090q0804
$$ 377038 -38114 -141603 -9874 106229 -141235 105880 249602 308922 196832 116028
12377A16028a0020k22059R8052I9527k1004l6600A0922a37743A51101a23645o3897
$$ 116028 -10020 -232079 -134027 99527 78523 41923 10922 -137743 151101 -123645 -187542
12366a87542A4708J29760b01285A27077g9351A33714f2905k74230C18918a43733
$$ -187542 14708 144468 -201285 127077 -79351 133714 -62905 -337135 318918 -143733
12355B59421c2694j55574I9864d7002A56770G286d96570a62212I0209Q6211b13010
$$ 259421 -32694 -188268 99864 -47002 156770 7286 -496570 -162212 90209 176420 -213010
12343B32668h5776j8897j03923B57106A0427a90357A965J92120q4092a85219h1373
$$ 232668 -85776 -104673 -208596 257106 10427 -190357 1965 194085 109993 -185219 -81373
12331a49504a6311n5568K5053A63525A4221K78555D2257L11976O0240j94515a7558
$$ -149504 -16311 -71879 -46826 163525 14221 292776 42257 354233 414473 219958 -17558
12319B02948d2213n0674H1948J56991M8734A16100l6950C9386K04646g1071F9631
$$ 202948 -42213 -92887 81948 238939 287673 116100 79150 39386 244032 -71071 69631
12307h8481A74033a18291B07561e6836A83439K535g242H1538A4201J024d9622
$$ -88481 174033 -118291 207561 -56836 183439 185974 -7242 81538 14201 15225 -49622
12295b97082C45974j16372N8705A30254b43353h8464c7578n2321A58705j3321
$$ -297082 345974 229602 288307 130254 -243353 -88464 -37578 -89899 158705 145384
12285A45384l063a26557N0043A25086E4093J64410C5332J15480J07085j22017
$$ 145384 142321 -126557 -76514 125086 54093 218503 35332 150812 257897 135880
12275A35880a9472D51310a79334F3790A6948L45333a05064d2753A27405a24312
$$ 135880 -19472 451310 -179334 63790 16948 362281 -105064 -42753 127405 -124312
12264a16479D9792O1528J65663l6677f1619B8555a67712a1504B52992Q9446h2621
$$ -116479 49792 111320 276983 240306 -61619 28555 -167712 -11504 252992 342438 -82621
12252h0623B5023h4346b9144j32767B62560h3402B4497r271P454J80004O3433
$$ -80623 25023 -84346 -29144 -161911 262560 -83402 24497 15226 22680 202684 266117
12241B66117r1835j6054K0692b8294j65306H7690J05745j665L19244b96291C01340
$$ 266117 174282 158228 178920 -28294 -193600 87690 193435 191770 511014 -296291 301340
12229A51561a10529e3689B17750f2144F75366B18441E7103K99331A75405O4238
$$ 151561 -110529 -53689 217750 -62144 675366 218441 57103 356434 175405 239643
12219B39643M9570C2140M59332B23565D8482R1641m920K7302F0068i1854A17882
$$ 239643 289213 32140 491472 223565 48482 140123 135203 162505 60068 -91854 117882
12207H5978a81796h0455C95749E4973M4566c1402A36261k7711J47076J93707j36518
$$ 85978 -181796 -80455 395749 54973 99539 -31402 136261 108550 255626 449333 312815
12196C12815a01234A51954K25780A24147g244D67274B25563b70602A01809K68855
$$ 312815 -101234 151954 377734 124147 -7244 467274 225563 -270602 101809 370664
12186C70664G2565d4942k00223M7576i7552B92190F7257a61472A11395g2692C24381
$$ 370664 72565 -44942 -245165 -197589 -97552 292190 67257 -161472 111395 -72692 324381
12174C82322C3402L32625b2344C838Q451J97231h2490A36209j3681J53029D5884
$$ 382322 33402 366027 -22344 3838 12289 209520 -82490 136209 122528 275557 45884
12162B01605d0194j37218F992Q0099d2088j22294D7008M15537H6922a1620j03950
$$ 201605 -40194 -177412 6992 87091 -42088 -164382 47008 462545 86922 -11620 -115570
12151a15570A28819N0407F0992B7294K1689b18826A61954a15874Q604A99016h6438
$$ -115570 128819 179226 60992 27294 48983 -218826 161954 -115874 -107270 199016 -86438
12139B02647l892k3437J37548G1154i3821C23309a10763d7896F4525b11784d3904
$$ 202647 198755 175318 312866 71154 -93821 323309 -110763 -47896 64525 -211784 -43904
12127C03162N431A08650J1889Q015g7422c8500B0249f3057k09780n2742B8993
$$ 303162 308593 108650 120539 128554 -77422 -38500 20249 -63057 -272837 -325579 28993
12115a63156l8464P8199A14107P513j1600a21409j60036A09008L29452G0011J6499
$$ -163156 -201620 -123421 114107 121620 110020 -121409 -281445 109008 438460 70011 86510
12104H6510J54270a15819B04041P0309b98118e4424A69001d3171k82964B43831
$$ 86510 240780 -115819 204041 274350 -298118 -54424 169001 -43171 -326135 243831
12093d0990D4853K787d9094o707e744r1223A7076a5113I157R1244a11842A5479
$$ -40990 44853 47640 -49094 -55801 -5744 -96967 17076 -15113 9157 100401 -111842 15479
12080A1180K3224K08467A3903a38386F3057K85026b29272B03816b4556B90394
$$ 11180 34404 242871 13903 -138386 63057 348083 -229272 203816 -24556 290394
12069e3568h968k79501a12777m7045A30315O35607P87730F50398B4829c60868
$$ -53568 -8968 -288469 -112777 -159822 130315 765922 1553652 650398 24829 -360868
12058B28453h1446l11730C40582d3849o6806B49615E9485R8392h9919a1272j18463
$$ 228453 -81446 -393176 340582 -43849 -110655 249615 59485 157877 -89919 -11272 -129735
12047a29735j30495J15524d7474m8025j71952J5366A07157a14528G0713a95130
$$ -129735 -260230 -144706 -47474 -95499 -267451 -252085 107157 -114528 70713 -195130
12036a1672A02386a31280a2371l3961A72157b98036j0979a33376n4323j01380
$$ -11672 102386 -131280 -12371 -46332 172157 -298036 -309015 -133376 -187699 -289079
12026b89079O5595Q9187A4194K8557e8971A34158P5529A5936K28078A09332d870
$$ -289079 -223484 -134297 14194 42751 -58971 134158 209687 15936 244014 109332 -4870
12014c4632B19749e0401A56456c53968C5512L02710E4322B0427b37508P8088A07460
$$ -34632 219749 -50401 156456 -353968 35512 338222 54322 20427 -237508 -159420 107460
12002b4686o6628d1031l49667A2680a0199A00348D5094Q3750d3435l6489E7653
$$ -24686 -91314 -41031 -390698 12680 -10199 100348 45094 128844 -43435 -79924 57653
11990D5633J12894B8908c3095A59414a03245D24023a90539G6602b03674K0756
$$ 45633 158527 28908 -33095 159414 -103245 424023 -190539 76602 -203674 -182918
11980a82918e130H3973j0502f932l16515J36878B75411a62106B65222G0650h0925
$$ -182918 -5130 83973 73471 -6932 -323447 -186569 275411 -162106 265222 70650 -80925
11968A60211R7287r2453l1019B8250a7478o5353m46431a45705G5145g4227E1584
$$ 160211 257498 165045 134026 28250 -17478 -82831 -529262 -145705 75145 -74227 51584
11956H2909b32640A75660a5969j1847o9193H3486J49096E9247k4130O5097C6711
$$ 82909 -232640 175660 -15969 -27816 -97009 83486 232582 59247 35117 100214 36711
11944F1576K412a17868a7419q3823l42235a277D0144b07955G9018n070b63691
$$ 61576 63988 -117868 -17419 -101242 -443477 -1277 40144 -207955 79018 73948 -263691
11932B8597K19425b7658F4723p550L31300A6421b2444G6546A2081d0642l9276
$$ 28597 248022 -27658 64723 57173 388473 16421 -22444 76546 12081 -40642 -79918
11921g9918k81366B7314a8312G6528a89676P9786A40152a4904k00292f5383l4570
$$ -79918 -361284 27314 -18312 76528 -189676 -109890 140152 -14904 -215196 -65383 -99953
11910i9953c7027k36032O0070D8595g1307l56322A86873p2557a20956l7365B36314
$$ -99953 -37027 -273059 -212989 48595 -71307 -427629 186873 114316 -120956 -158321 236314
11898C35587j53882c9154j72418A3074g2158L0554N752r2263B34023d08716c804
$$ 335587 181705 -39154 -211572 13074 -72158 -41604 -35852 -128115 234023 -408716 -3804
11886b38113F9054g3912k13242B5277a42472k20558F5332i9782C772a87163i1284
$$ -238113 69054 -73912 -287154 25277 -142472 -363030 65332 -99782 3772 -187163 -91284
11874A62244I399b92084A08779k5864R2522a00212G8091o10b12341A10069h729
$$ 162244 9399 -292084 108779 82915 175437 -100212 78091 77481 -212341 110069 -8729
11862c83576a05148A15175l121b04106A12049K35930a1400B65577e917B48927
$$ -383576 -105148 115175 112054 -204106 112049 347979 -11400 265577 -5917 248927
11851D9661K11556o8669g8856m4492r205N9516C795c03679a18898q7207G540a69762
$$ 49661 261217 192548 -78856 -123348 -132553 -73037 3795 -303679 -118898 -206105 7540 -169762
11838c10919J24546o6088p5375a38283A31928c9878C28699j45642g4046j0970
$$ -310919 -186373 -252461 -327836 -138283 131928 -39878 328699 183057 -74046 -85016
11828h5016c2843j17483d0537k37846h6626A04705e72553a67099j56384d9518
$$ -85016 -32843 -150326 -40537 -278383 -86626 104705 -572553 -167099 -323483 -49518
11817a26428A29639L8891J3055a75074O0453E9963b25137h5116A95236g5446A42245
$$ -126428 129639 168530 181585 -175074 -114621 59963 -225137 -85116 195236 -75446 142245
11805A37117Q3181q8670d9719l245I8617c81069C07303d5893j19541B7450L15462
$$ 137117 220298 131628 -49719 -52964 98617 -381069 307303 -45893 -165434 27450 342912
11794C42912G6733b55426P5718O0145B09574P4370a16905A46270a01451c9919
$$ 342912 76733 -255426 -179708 -119563 209574 283944 -116905 146270 -101451 -39919
11783d3921j35236D90175B20982k7326D8398a04018b0504A21094j7481a38375
$$ -43921 -179157 490175 220982 193656 48398 -104018 -20504 121094 103613 -138375
11772d2986j54955J3308A72953o4925b76700A11995b4429C23709c01088B34370
$$ -42986 -197941 -184633 172953 108028 -276700 111995 -24429 323709 -301088 234370
11761a21104b9841q8827d0064A17875K70548c8935o7194d2935F1098a98794B47164
$$ -121104 -29841 -118668 -40064 117875 388423 -38935 -106129 -42935 61098 -198794 247164
11749a73220A75002a45642A16578c12707a2523D4677J22224J34298A25721b25629
$$ -173220 175002 -145642 116578 -312707 -12523 44677 166901 301199 125721 -225629
11738e167p4029A87382o8050L672L7445h9019I644J12204N7488q5041e6796J7089
$$ -5167 -79196 187382 119332 123004 160449 -89019 9644 121848 179336 94295 -56796 -39707
11726c9707a682r0623D4796P1884d4674D16619A36141A5533K8706L8547E1R1451
$$ -39707 -1682 -92305 44796 116680 -44674 416619 136141 15533 44239 82786 51 91502
11714I1502R0665m6496Q2435a57629L899A47793N8337d1709j00813A62635O9258
$$ 91502 182167 135671 218106 -157629 -153730 147793 206130 -41709 -142522 162635 231893
11703B31893K00698A56940d19725g947j1618j27471A51832L357M2699l0137g6681
$$ 231893 432591 156940 -419725 -7947 -19565 -147036 151832 155189 197888 167751 -76681
11691d2648l83542A65321B5135J04060E902K05947F8564a03546A63310f8845A06380
$$ -42648 -426190 165321 25135 129195 5902 211849 68564 -103546 163310 -68845 106380
11679B1841b52970J24738A67963K62227A14966a50585C26953C2377g7448B9168
$$ 21841 -252970 -128232 167963 430190 114966 -150585 326953 32377 -77448 29168
11668b19381F148J94020C475L4718K15430b15840A56b29993B9639a03756E2618
$$ -219381 6148 200168 3475 38193 253623 -215840 156 -229993 29639 -103756 52618
11656b7950A94368D1675c8213A17126a8609o0278A754J01755J91986k658a05958
$$ -27950 194368 41675 -38213 117126 -18609 -78887 1754 103509 295495 292837 -105958
11644D9906Q7930c7615j45485A35884M7931a82464E9810a86824A11761J12939
$$ 49906 137836 -37615 -183100 135884 183815 -182464 59810 -186824 111761 224700
11634B24700a62912J5036B40744b02706b7862G2105P4821a03283F1910a29974
$$ 224700 -162912 -147876 240744 -202706 -27862 72105 146926 -103283 61910 -129974
11623E7430B8408a30041A04847J1842a02085B39249r5958E2341K03715A9386A594
$$ 57430 28408 -130041 104847 116689 -102085 239249 143291 52341 256056 19386 1594
11611A00517D8262Q2653m0946f4555A72896K15914g7973r8282f0190b451D0402
$$ 100517 48262 130915 89969 -64555 172896 388810 -77973 -176255 -60190 -2451 40402
11599B4285a80777B77994A21359A0467J46267Q7344G5932K5423H910c7657A80693
$$ 24285 -180777 277994 121359 10467 156734 244078 75932 101355 8910 -37657 180693
11587H0354a20108A69577A9817J6070O5882l0715j4655d657C7653c17244B22017
$$ 80354 -120108 169577 19817 35887 101769 71054 56399 -4657 37653 -317244 222017
11575B55783a55711g7100C78800A1334f253D6817K20125P6393I1855N7934a03983
$$ 255783 -155711 -77100 378800 11334 -6253 46817 266942 343335 91855 149789 -103983
11563b48931P0519G9010b05991a8649A96591J9667a6626L315A67860M6452h5362
$$ -248931 -178412 79010 -205991 -18649 196591 216258 -16626 -13311 167860 214312 -85362
11551a06517B83417i5210d6230G1592c71312o5995d5210C53625l7890a73915A08597
$$ -106517 283417 -95210 -46230 71592 -371312 -437307 -45210 353625 315735 -173915 108597
11539B02195C3693Q5287M8773N814a04279A98712o4179D5759L9665h148o5498
$$ 202195 33693 118980 167753 173567 -104279 198712 134533 45759 85424 -8148 -73646
11528g3646C25762m5032O6730A8663J71399G41Q7995a10158M5012B54890E9939
$$ -73646 325762 280730 347460 18663 190062 741 88736 -110158 -65146 254890 59939
11516C86296j31698N0215A16513L5651o2444J47947J25065g8587A75972J92510
$$ 386296 254598 304813 116513 152164 89720 237667 362732 -78587 175972 368482
11506C68482B9376J33145N7126r5473a16959A98172Q0050K44969b89675A56410
$$ 368482 29376 162521 219647 124174 -116959 198172 278222 523191 -289675 156410
11495B96868J22668b8313A95759m9198f0874B18678b0727j60229F5557i7631C25446
$$ 296868 419536 -28313 195759 146561 -60874 218678 -20727 -180956 65557 -97631 325446
11483e4030A13542A7938K38131j18415J92284q7006o6945J0385O9251B8436J56571
$$ -54030 113542 17938 256069 137654 329938 242932 175987 186372 255623 28436 185007
11472A85007k0901Q6156B4950L79118D6288L66277p5577A04702L4485a4346A25441
$$ 185007 164106 250262 24950 404068 46288 412565 336988 104702 139187 -14346 125441
11460B7954c62719b788A51274a07199c2671k9658A36900J37085o3014C8466r195
$$ 27954 -362719 -2788 151274 -107199 -32671 -62329 136900 273985 210971 38466 29271
11449B9271J44416h4593D7835b45142C51035b4344A69093m7042i9387A28117i3076
$$ 29271 173687 -84593 47835 -245142 351035 -24344 169093 122051 -99387 128117 -93076
11437A6279J8333N9701g4693A1289b63863B77194J534e3678b1044j420n442F6071
$$ 16279 34612 94313 -74693 11289 -263863 277194 278728 -53678 -21044 -22464 -27906 66071
11424a31799p0880A0643i7458F3694L5141b9915A31803a00343B39159d5839g291
$$ -131799 -202679 10643 -97458 63694 98835 -29915 131803 -100343 239159 -45839 -7291
11412F7481c27l5133E0538d3967A92579j3462b35679C76627A11605i5907K0603
$$ 67481 -327 -35460 50538 -43967 192579 179117 -235679 376627 111605 -95907 -75304
11401g5304A05917B3981i7308J0509J2715A88215d02435F3757B5168i261B38139
$$ -75304 105917 23981 -97308 -86799 -74084 188215 -402435 63757 25168 -9261 238139
11389I6901l7248B4343b09951f6388m4027q8961G2448r328f5415C38637a9452
$$ 96901 59653 24343 -209951 -66388 -110415 -199376 72448 63120 -65415 338637 -19452
11377a44529A29061a18353A27730b88448h0272A67260A3087L11163a42783a57
$$ -144529 129061 -118353 127730 -288448 -80272 167260 13087 324250 -142783 -157
11366i8782j87396L1000J972Q2585A56690p3162e2299n3346K2461L4488A37863
$$ -98782 -286178 -255178 -253206 -170621 156690 83528 -52299 -105645 -83184 -48696 137863
11354e6631j86870j06768B04326a2744l09467P6832d9835k6589m8308J0876n0663
$$ -56631 -243501 -350269 204326 -12744 -322211 -245379 -49835 -76424 -124732 -113856 -164519
11343a64519a8565E9117J9138j1407o854h8564F9875g6253M976C0427a7086B2660
$$ -164519 -18565 59117 78255 66848 59994 -88564 69875 -76253 -71277 30427 -17086 22660
11330H2351J21156a3785j13698H4274I839a25967k3790A54084c3456j30798l3409
$$ 82351 203507 -13785 -127483 84274 9839 -125967 -149757 154084 -33456 -164254 -197663
11319a97663k1642g5096A3653h1084j16213M6033F5336b20930N01A26777J52686
$$ -197663 -219305 -75096 13653 -81084 -197297 -151264 65336 -220930 -220429 126777 279463
11308B79463I054d8641B34379D3543b70812B07026L5786A02350J77507G6619b52399
$$ 279463 9054 -48641 234379 43543 -270812 207026 242812 102350 279857 76619 -252399
11296A63925o2895D9822K09407b9263j31061k74969K05499J417A72084a97571
$$ 163925 101030 49822 259229 -29263 -160324 -435293 -229794 -228377 172084 -197571
11285b14627P3912r3441C24072a4429k44102d4725m4868k7282k95933a05726j53506
$$ -214627 -140715 -234156 324072 -14429 -258531 -44725 -89593 -116875 -412808 -105726 -259232
11274b59232a8704r4723j66111C60152b00817h8991n1939m2812B24769c31539
$$ -259232 -18704 -113427 -279538 360152 -200817 -88991 -140930 -183742 224769 -331539
11263E7430d6688B19530j09593a11486E6595a81184Q6058k31069e3464k4858b018
$$ 57430 -46688 219530 109937 -111486 56595 -181184 -95126 -326195 -53464 -78322 -2018
11251c65158a11822q1670k51097a56742o1045H3519O1732j6478k4526a92285A4543
$$ -365158 -111822 -193492 -444589 -156742 -217787 83519 145251 128773 104247 -192285 14543
11239b02847d5269A24024L1045D0988a6030q6106B1575J04302q685m3305d4842
$$ -202847 -45269 124024 155069 40988 -16030 -102136 21575 125877 117192 73887 -44842
11227i061A07415b6963B79667b7381R89E2570J13001o6921L2353K6471e8610A12912
$$ -9061 107415 -26963 279667 -27381 -26392 52570 165571 98650 131003 157474 -58610 112912
11214b9955q2380j6473A14568h4410B42994l7186j6550m8005J67962b52901K1100
$$ -29955 -112335 -128808 114568 -84410 242994 205808 189258 141253 309215 -252901 -231801
11203b31801i2067n6439k36329a5928o5662j0665A47776b19802n2265h7392B7068
$$ -231801 -92067 -148506 -384835 -15928 -81590 -92255 147776 -219802 -272067 -87392 27068
11191c52622a32218j51362a36231M1029A00158L0605b77633b5323j36003j01600
$$ -352622 -132218 -283580 -136231 -95202 100158 130763 -277633 -25323 -161326 -262926
11181b62926P4194C32067a00405d90A36289i3158j6088j15021B2156P2846i7075
$$ -262926 -188732 332067 -100405 -490 136289 -93158 -109246 -224267 22156 95002 -97075
11169g526j22343K1212B0659h6534A27775h5900c1938q9517A88955Q121I1907
$$ -7526 -129869 -108657 20659 -86534 127775 -85900 -31938 -121455 188955 197076 91907
11157a68250k79101C7692K4247k1992J4630L06327j59144d7776j58508A90503
$$ -168250 -447351 37692 61939 39947 54577 360904 201760 -47776 -206284 190503
11146b23224a452l05777A46857j4852B6628d11843c6929l2632j45631p0576H9628
$$ -223224 -1452 -307229 146857 132005 26628 -411843 -36929 -69561 -215192 -285768 89628
11134B04772G4372O5112j0576A3492K37544a2254F2749M16043A3180e5052H6820
$$ 204772 74372 139484 128908 13492 251036 -12254 62749 478792 13180 -55052 86820
11122g470d02F0295K01188j06372m7790J45866J19458a82078H0758E130a25977
$$ -7470 -402 60295 261483 155111 107321 253187 372645 -182078 80758 5130 -125977
11110B07775H4379J47553c3364G373N9188c49159C50825A51646K18360K89358
$$ 207775 84379 231932 -33364 7373 66561 -349159 350825 151646 370006 659364
11100F59364A21393a87300B45167N724J43282A07072p607j7464K58082b17014
$$ 659364 121393 -187300 245167 250891 394173 107072 99465 82001 340083 -217014
11089B60077C1388D694P35513C4655J43441K22470j72906A03026l7632L74614
$$ 260077 31388 4694 740207 34655 178096 400566 227660 103026 65394 440008
11079D40008j86079j8863l9295E4131M4369L93525J17233B63744R123Q477B211
$$ 440008 253929 235066 195771 54131 98500 492025 609258 263744 272867 281344 2211
11067D21543r8211J13959m3670O4383B28729J40269k6969R0575K70336k38113
$$ 421543 323332 437291 393621 458004 228729 368998 342029 432604 702940 464827
11057D64827N4104J75443J03953k52363J88615O52Q7126k16863r4862K70732k15637
$$ 464827 518931 694374 798327 545964 734579 735231 822357 605494 510632 781364 565727
11046E65727J72066M1238j32117J80853j54267m4292j38948K26103R1200l20767
$$ 565727 737793 779031 646914 827767 673500 629208 490260 716363 807563 486796
11036D86796L63570k55116J87418C55399K20599J38585J7989r9793j07793K41959
$$ 486796 850366 595250 782668 355399 575998 714583 732572 632779 524986 766945
11026G66945j80405J06870J29632C38778N6378M31174k19527o388J06424l04707
$$ 766945 586540 693410 823042 338778 395156 826330 606803 600415 706839 402132
11016D02132J53957L51147k29240J49976k5100k07560P7728r1825l5297q2653
$$ 402132 556089 907236 677996 827972 802872 595312 673040 581215 545918 463265
11006D63265L54846j36510J3982C45362M10708k55199J25124L85078l60423k7532
$$ 463265 818111 681601 695583 345362 756070 500871 625995 1011073 650650 623118
10996F23118J7257J60766R5940k36847K78268J81306j06592k20350M0863R7584
$$ 623118 640375 801141 897081 660234 938502 1119808 1013216 792866 833729 931313
10986I31313k78396J02858K01711J17230j21955m5850L16663J47702k1974M32604
$$ 931313 652917 755775 957486 1074716 952761 906911 1223574 1371276 1349302 1781906
10976A781906j59315R92760j38646M48428l6862O0952j27672j95148k42687m85516
$$ 1781906 1622591 2615351 2476705 2925133 2888271 2949223 2821551 2626403 2383716 1898200
10966A898200k89965k33355J50510o0677K11075j36646j41719L11449m78089K92263
$$ 1898200 1608235 1374880 1525390 1464713 1675788 1539142 1397423 1708872 1230783 1523046
10956A523046J25149n24459J02466j74205k99108j93789J9929K3469J13487B23933
$$ 1523046 1648195 1123736 1226202 1051997 752889 559100 579029 602498 715985 223933
10945B94316F9671K84447a0361A33559J69417A17884O1061J47514A63219p7918
$$ 294316 69671 354118 -10361 133559 302976 117884 178945 326459 163219 85301
10935H5301a26691B087K31985e8015f70B39494C2715K9050J72929a99323G9005
$$ 85301 -126691 2087 234072 -58015 -670 239494 32715 61765 234694 -199323 79005
10923B99437d2747A37274F5208M5422o910l4931b35210E1841i9650A36146M5512
$$ 299437 -42747 137274 65208 110630 103720 68789 -235210 51841 -99650 136146 181658
10912A81658b58317H7560a76756Q0538F9621P3743a7056D2898P6110c49523D0018
$$ 181658 -258317 87560 -176756 -96218 69621 143364 -17056 42898 119008 -349523 40018
10900b25790A74806h5346j02298C799a38917f908j53615B56867a0379j47931B51379
$$ -225790 174806 -85346 -187644 3799 -138917 -6908 -160523 256867 -10379 -158310 251379
10888A51037j3144b85297h701k43821h0067p5270L3143G8563c4352m6051c602
$$ 151037 137893 -285297 -8701 -252522 -80067 -155337 -122194 78563 -34352 -80403 -3602
10876b82265C0736L59928A8863d4935i131j59239K5796N6153r2362A41369c7164
$$ -282265 30736 390664 18863 -44935 -9131 -168370 -142574 -86421 -178783 141369 -37164
10864c8100B52763a57719p2181D12462A34526k5650i947C0091b81316J09472D1575
$$ -38100 252763 -157719 -229900 412462 134526 108876 -9947 30091 -281316 -171844 41575
10852A60964I839L9094b12787E7955a12673B2189Q2268a27634K7405B1260f3420
$$ 160964 9839 48933 -212787 57955 -112673 22189 104457 -127634 -100229 21260 -63420
10840D7049a08873l4869c287D1788a04839J6368C69345f4666j31598b7758j09071
$$ 47049 -108873 -143742 -3287 41788 -104839 -88471 369345 -64666 -196264 -27758 -136829
10829a36829A85596K00552c88857a00607A69880F3976b15120C1221J21768b60163
$$ -136829 185596 386148 -388857 -100607 169880 63976 -215120 31221 152989 -260163
10818a60320B53480a69608o8125B1545e9501B39758A2519K8695a14483k7837I0992
$$ -160320 253480 -169608 -237733 21545 -59501 239758 12519 41214 -114483 -142320 90992
10806b16508N0626A0251J25450P6408L25263A67293d0661k3518j39276l8558R7681
$$ -216508 -165882 10251 135701 212109 537372 167293 -40661 -64179 -203455 -242013 -144332
10795a44332A80242a23736C0547P795i0542G3601h8885l54113K18780A31484J1528
$$ -144332 180242 -123736 30547 38342 -90542 73601 -88885 -442998 -224218 131484 143012
10784A43012m3132m3858K50095A51160N9263a00056G6400b21511F2134c32174
$$ 143012 99880 56022 306117 151160 210423 -100056 76400 -221511 62134 -332174
10773c3248m2616B1334a60558l4477N6061F0751N0018k5352d2929j21926n5504
$$ -33248 -75864 21334 -160558 -195035 -138974 60751 110769 85417 -42929 -164855 -220359
10762b20359a2696j63354b6052F8173b43752g8701r9643G6794a62244D6260L12012
$$ -220359 -12696 -176050 -26052 68173 -243752 -78701 -178344 76794 -162244 46260 358272
10751C58272h5627A11069N1580g5890A62340G4987d05880A16817L8861a868E0304
$$ 358272 -85627 111069 162649 -75890 162340 74987 -405880 116817 155678 -1868 50304
10739i5699L8799J97M034a9434k01856B19887a02425P958A52170c38843c7782
$$ -95699 -56900 -56703 -52669 -19434 -221290 219887 -102425 -94467 152170 -338843 -37782
10727C07486B1045e0975B4036a33389A92703c42472B43041D0010f5282r620k24857
$$ 307486 21045 -50975 24036 -133389 192703 -342472 243041 40010 -65282 -74902 -299759
10716b99759J46196d2301E890a10425q3593L7316F6031d024j90256A08785b2596
$$ -299759 -153563 -42301 5890 -110425 -194018 -156702 66031 -4024 -194280 108785 -22596
10704F9992P771a35904J8744K5762f343A57647A9608a01365j60092E1114c17223
$$ 69992 77763 -135904 -117160 -91398 -6343 157647 19608 -101365 -261457 51114 -317223
10692G4521Q2691B4118b30121b290k32771A5138a98143B60154O8658a93808j70220
$$ 74521 157212 24118 -230121 -2290 -235061 15138 -198143 260154 328812 -193808 -364028
10681c64028i9435A326b39342a5673m37385A92191a41315l6343f9390K1523k10729
$$ -364028 -99435 1326 -239342 -15673 -453058 192191 -141315 -177658 -69390 -47867 -258596
10670b58596A49311F6790j6659c1345l8617m8577m1394n889O6533j53846I1270
$$ -258596 149311 66790 50131 -31345 -69962 -118539 -159933 -165822 -99289 -253135 91270
10658A87638m0756p0520a14100A14177b18877F7906a49302L2160C1094c030l29917
$$ 187638 146882 76362 -114100 114177 -218877 67906 -149302 -117142 31094 -3030 -332947
10647c32947b2810j26113j08474R4019M4907A04947N2878a83264O5111C7274b78362
$$ -332947 -22810 -148923 -257397 -163378 -118471 104947 157825 -183264 -118153 37274 -278362
10635e4223A96331a48765k28306B15499e08877A09885g6359j12571E5588a74328
$$ -54223 196331 -148765 -377071 215499 -508877 109885 -76359 -188930 55588 -174328
10624B08720D2807c3343k44052C1780b1443F4566N6257B7519d0423j65765j30647
$$ 208720 42807 -33343 -277395 31780 -21443 64566 120823 27519 -40423 -206188 -336835
10613c36835H0597J80451a3752j12399k13732E2870c8143j65255B15492m1812
$$ -336835 80597 261048 -13752 -126151 -339883 52870 -38143 -203398 215492 173680
10603A73680C9739J2331d15389i4732D9373N1016B8691N1917J1172A0381a30417
$$ 173680 39739 52070 -415389 -94732 49373 100389 28691 80608 91780 10381 -130417
10591g6249k01314E1215J6344J44709a29913A79110c3097j99983A17722a68006
$$ -76249 -277563 51215 67559 212268 -129913 179110 -33097 -233080 117722 -168006
10580A1539e75092A05781a58610D5491a66892b1726j24073n0958O701l2669N1930
$$ 11539 -575092 105781 -158610 45491 -166892 -21726 -145799 -196757 -190056 -222725 -170795
10569a70795K6086O9557K5700j09562J7509J9506D4296a02188K6553k9369e1368
$$ -170795 -144709 -75152 -49452 -159014 -141505 -121999 44296 -102188 -75635 -105004 -51368
10557b38396D2388a02271N110r0678D0211a01745d5455F0641c2964l4680m3774
$$ -238396 42388 -102271 -97161 -187839 40211 -101745 -45455 60641 -32964 -67644 -111418
10546a11418A33345a47390A60298J24840C9563b484A13557E0298j1597j8713b29691
$$ -111418 133345 -147390 160298 285138 39563 -2484 113557 50298 38701 19988 -229691
10534g2795m94609b14356f2454r1270j3835I2873a59217l5340e8698A78000b48361
$$ -72795 -567404 -214356 -62454 -153724 -167559 92873 -159217 -194557 -58698 178000 -248361
10522b36907p8859B81998j30951F9877A8274q562a35602D4762K1786J15441h4901
$$ -236907 -315766 281998 151047 69877 18274 9712 -135602 44762 66548 181989 -84901
10510A58043a21000e1030j1123A04355c152A22984R6536a45213j10110Q368e4683
$$ 158043 -121000 -51030 -62153 104355 -3152 122984 219520 -145213 -255323 -246955 -54683
10498C46955H3775J30825c53585h5967B17785a72398B35083a26795A45400D159
$$ 346955 83775 214600 -353585 -85967 217785 -172398 235083 -126795 145400 4159
10487F2231a3879B7635M0950R7784p6283D1203O9250J08482q3002K12320a62301
$$ 62231 -13879 27635 68585 166369 90086 41203 110453 218935 135933 348253 -162301
10475b57449A10518c25689a26469e3193m0334n0891A15214a02217B07225a3040
$$ -257449 110518 -325689 -126469 -53193 -93527 -144418 115214 -102217 207225 -13040
10464a34378I8445e1305J3775k38020K2918f7499j44446d4728k66932K7790A41761
$$ -134378 98445 -51305 -37530 -275550 -252632 -67499 -211945 -44728 -311660 -283870 141761
10452a8666l33044a70217D4927a70611A67569b88396F4050a19197H9091a15533
$$ -18666 -351710 -170217 44927 -170611 167569 -288396 64050 -119197 89091 -115533
10441A05511a9952j86532i3661B01411m803b35926A65330E8748l538M1117a07687
$$ 105511 -19952 -206484 -93661 201411 196608 -235926 165330 58748 55210 96327 -107687
10429B70631f5614A29589P278K12027j61561a05417B50272e00B8234a51937F6615
$$ 270631 -65614 129589 136867 348894 187333 -105417 250272 -500 28234 -151937 66615
10417b53900A41973M1603k1387a62372P1890F7914c21764B30684b28754b2006
$$ -253900 141973 183576 162189 -162372 -90482 67914 -321764 230684 -228754 -22006
10406a3185A37418b44302d9169g59C14561D2502b25175A28850c63813g5406A21869
$$ -13185 137418 -244302 -49169 -759 314561 42502 -225175 128850 -363813 -75406 121869
10394a47763A52311J5971l6057L92313A72625L09437A56583C9525c5824D27111
$$ -147763 152311 168282 132225 524538 172625 482062 156583 39525 -35824 427111
10383A22373E1789Q452L6002d5465B82220Q3563A57563a6613H1192Q17L26246
$$ 122373 51789 60241 96243 -45465 282220 365783 157563 -16613 81192 82009 408255
10372D08255A98341J46458L5081Q3287H7303M061L79948m2526K44884b3953A90846
$$ 408255 198341 344799 379880 463167 87303 91364 471312 428786 673670 -23953 190846
10360B43375F2016J66597Q7568I67M4082K68877A16433K55532K373m3068J04630
$$ 243375 62016 228613 316181 967 45049 313926 116433 371965 374338 331270 435900
10349D35900k00922O85219C25558N4819J55349j46691M2841h3212A42340J18022
$$ 435900 234978 920197 325558 380377 535726 389035 431876 -83212 142340 260362
10339B60362n0870P7269J60447d5045D07769a26394A35673C8558a17527A16480
$$ 260362 209492 286761 447208 -45045 407769 -126394 135673 38558 -117527 116480
10328E334L60852j28965J96618j07914B1744K9309K09392b18401i9373B13407
$$ 5334 366186 237221 433839 325925 21744 51053 260445 -218401 -99373 213407
10317a10068I5498K50102a99010B58093A14226K48455f4424A32652M8287a54347
$$ -110068 95498 345600 -199010 258093 114226 362681 -64424 132652 180939 -154347
10306B39360A5213a83930K049A01999a95693g7152E0405M9413b5379A37681a42473
$$ 239360 15213 -183930 -181881 101999 -195693 -77152 50405 99818 -25379 137681 -142473
10294a66206b4430D8430K02168b43573A73497a46564H9316b82759f3686B827K56438
$$ -166206 -24430 48430 250598 -243573 173497 -146564 89316 -282759 -63686 2827 259265
10283B59265a35730M3386A20003b37277d7942E0503a19091j09131I1096C6893
$$ 259265 -135730 -92344 120003 -237277 -47942 50503 -119091 -228222 91096 36893
10272B47556q8339f9451k06907a2922l9518m0190E2400J49670L2988l3055K89738
$$ 247556 159217 -69451 -276358 -12922 -52440 -92630 52400 202070 235058 202003 491741
10261D91741B39428o7599n6042J56405I2796D2904K3562K27480b00263A69988
$$ 491741 239428 171829 115787 272192 92796 42904 66466 293946 -200263 169988
10250b34978A71356b7472j60821B79530D5798a31303A74653k5006D1455K7392
$$ -234978 171356 -27472 -188293 279530 45798 -131303 174653 149647 41455 68847
10240F8847J26436a7986C2293c13409J00436Q0603n8573K2278m501f6497A27027
$$ 68847 195283 -17986 32293 -313409 -212973 -132370 -190943 -168665 -173166 -66497 127027
10228g5010m1644m1294a5540E248a6115j89908f5777k70732J12696Q7219B18838
$$ -75010 -116654 -157948 -15540 5248 -16115 -206023 -65777 -336509 -223813 -136594 218838
10216a73921E0914A6816c0464J024j17974L0212D7971b19242j37909J74542h0028
$$ -173921 50914 16816 -30464 -29440 -147414 -117202 47971 -219242 -357151 -182609 -80028
10204e09698C806d80099J83936D2359A7400O389b88047B37821A7360b30999G0611
$$ -509698 3806 -480099 -296163 42359 17400 23789 -288047 237821 17360 -230999 70611
10192d07697J67802a16973A0792J52305b8676n52509C230J7292c85711B17531
$$ -407697 -239895 -116973 10792 163097 -28676 -581185 3230 20522 -385711 217531
10181H4373c29154a20951N8503A80172i5833A31199J14725c79415i5678r5344
$$ 84373 -329154 -120951 -62448 180172 -95833 131199 245924 -379415 -95678 -191022
10171a91022M0511N4458d675j425l15432C2764K22344p171b89549p0977A40381
$$ -191022 -150511 -96053 -4675 -6100 -321532 32764 255108 247937 -289549 -360526 140381
10159f5192j0961A04942L5707a62925B4247a46604l82685a10094F3179a83844
$$ -65192 -76153 104942 140649 -162925 24247 -146604 -529289 -110094 63179 -183844
10148f8424I9297b4416l84976E0179m90a39742j34433b9540j01720F8717a28510
$$ -68424 99297 -24416 -409392 50179 49689 -139742 -274175 -29540 -131260 68717 -128510
10136h4866k22099D6939a41129c5790m0165L824k29628a32210J4988H3507a27492
$$ -84866 -306965 46939 -141129 -35790 -75955 -72131 -301759 -132210 -117222 83507 -127492
10124d7763A0314N0884A6903b97088L3933B96653A17551A9318K80944h3858j55153
$$ -47763 10314 61198 16903 -297088 -263155 296653 117551 19318 300262 -83858 -239011
10113b39011B44849c21948D8749e8165k2637j48989f0080B48316c5613A68375
$$ -239011 244849 -321948 48749 -58165 -80802 -229791 -60080 248316 -35613 168375
10102b4044E2749L50935a64794c4715B01807b25000Q1016B22120p5233c07318
$$ -24044 52749 403684 -164794 -34715 201807 -225000 -143984 222120 146887 -307318
10091i1475h385j48695m902j5313a8006n5141k60936D0129K4438b60622E6226
$$ -91475 -8385 -157080 -161982 -177295 -18006 -73147 -334083 40129 64567 -260622 56226
10079b26256p9472i9279Q393k402J9523j9819D01615F3747b67995B1211c81153
$$ -226256 -305728 -99279 -90886 -93288 -73765 -93584 401615 63747 -267995 21211 -381153
10067b17418F9676L54812a8762C43266D6117i9409A01309b34858e5457A72869
$$ -217418 69676 424488 -18762 343266 46117 -99409 101309 -234858 -55457 172869
10056a53902j37603f3303B5619R6340L3102B0541a06107j13091B80698b19196
$$ -153902 -291505 -63303 25619 121959 155061 20541 -106107 -219198 280698 -219196
10045c00439J24583O2347M5615A31129k4702a24980N9244O678l24508B08324q4064
$$ -300439 -175856 -113509 -67894 131129 106427 -124980 -65736 -59058 -383566 208324 124260
10034A24260J44984c047B5873b46933a8900j5393j40162P324g0240k93433M4639
$$ 124260 269244 -3047 25873 -246933 -18900 -34293 -174455 -167131 -70240 -363673 -319034
10023c19034P7620j67344d0255A85052B699R5156C0d91154a8726q6907A34823
$$ -319034 -241414 -408758 -40255 185052 2699 97855 30 -491154 -18726 -105633 134823
10011C7324J07533e4377k41524a31196F0631J32148H4215b54941M4066i1395J9806
$$ 37324 144857 -54377 -295901 -131196 60631 192779 84215 -254941 -210875 -91395 -71589
10000g1589A99687o5987D6350R1935o0582B4643N2127k6748R9185n6012a43196
$$ -71589 199687 133700 46350 138285 77703 24643 76770 50022 149207 93195 -143196
9988A27038F3238a74357F6788g8972l5813h772n8712j07210N6739b4886q7636
$$ 127038 63238 -174357 66788 -78972 -114785 -8772 -67484 -174694 -117955 -24886 -112522
9977a12522E5188I864g4371r8149G885b37419J02568o2471p8181e3374K199j19551
$$ -112522 55188 9864 -74371 -172520 7885 -237419 -134851 -197322 -275503 -53374 -51175 -170726
9965a70726g323B73757c09427B36898B6728k828i2188a1155A2209h8153b8438
$$ -170726 -7323 273757 -309427 236898 26728 23900 -92188 -11155 12209 -88153 -28438
9953c89186e3455k6853j6719q8712I6377N9534b85039h31k59270B6224N1820g1356
$$ -389186 -53455 -80308 -97027 -185739 96377 155911 -285039 -831 -260101 26224 78044 -71356
9940h2113j12045H5175a90144A42336a78655A19787J2992a38503R433j11508f1951
$$ -82113 -194158 85175 -190144 142336 -178655 119787 132779 -138503 -129070 -240578 -61951
9928A40799i5915j75683d4235j27737Q4178j68166B056b28499R6303a3321j67660
$$ 140799 -95915 -271598 -44235 -171972 -87794 -255960 2056 -228499 -132196 -13321 -180981
9917a80981d1486m043C7735c04832r1970E3891d7395o238o3356d3820r7066A98327
$$ -180981 -41486 -45529 37735 -304832 -396802 53891 -47395 -53633 -116989 -43820 -140886 198327
9904a32876I7648f2550j10448I3474c00965f0325q4530n4238A61914b75113d8817
$$ -132876 97648 -62550 -172998 93474 -300965 -60325 -144855 -199093 161914 -275113 -48817
9892a23253B8065b52156r5147G6465J09955c13980f4849A60155e2075p3849B0275
$$ -123253 28065 -252156 -347303 76465 186420 -313980 -64849 160155 -52075 -125924 20275
9880b16754P2599c1344j30901l028k8240j85768H6728k5183K0805J68141C6288
$$ -216754 -144155 -31344 -162245 -165273 -193513 -379281 86728 61545 82350 250491 36288
9868c51070a68293j40242a32230K4763K1848k6699k82241q76B4886i56j47561
$$ -351070 -168293 -308535 -132230 -107467 -85619 -112318 -394559 -395435 24886 -956 -148517
9857a48517f2160J6663q9008j17466J7194G0738a82393G0890L3632c80616D3963
$$ -148517 -62160 -45497 -134505 -251971 -234777 70738 -182393 70890 104522 -380616 43963
9845c21324d8967A91398b7962j7144J1732A09443J32105a65124j72559A74177
$$ -321324 -48967 191398 -27962 -45106 -33374 109443 241548 -165124 -337683 174177
9834e7914k00103c2453A85298c7755D4585b1643G3699j1694i7411m2998q908L8548
$$ -57914 -258017 -32453 185298 -37755 44585 -21643 73699 62005 -97411 -140409 -149317 -110769
9822a10769H5725a6679D2575a89557B31881j02723h8782A61599F4858b22808i4924
$$ -110769 85725 -16679 42575 -189557 231881 129158 -88782 161599 64858 -222808 -94924
9810a10075A92558j9577F7112a01258L8891A98395e9594B39229g7371d924k04882
$$ -110075 192558 172981 67112 -101258 -62367 198395 -59594 239229 -77371 -4924 -209806
9799b09806o7244n1342J57668A45863a95570A18830h2291D1669b66769A78080
$$ -209806 -277050 -328392 -170724 145863 -195570 118830 -82291 41669 -266769 178080
9788c83741O3317B5027b83844A41471o7523f6034J6361k09750g0091J2850I5165
$$ -383741 -320424 25027 -283844 141471 73948 -66034 -49673 -259423 -70091 -57241 95165
9776F9586B5620e9681a9058j93582d6733j1655A91754c43780N1563r7298B9631
$$ 69586 25620 -59681 -19058 -212640 -46733 -58388 191754 -343780 -292217 -389515 29631
9764b86287F2244F805J88409c9768k4704l4917n5521O2238j95284C6079g0146
$$ -286287 62244 6805 195214 -39768 -64472 -99389 -154910 -92672 -287956 36079 -70146
9752C2991J50659a49002N6433D487a03378C3322d6204l01506B95344p6004D7917
$$ 32991 183650 -149002 -92569 4487 -103378 33322 -46204 -347710 295344 219340 47917
9740F534J06350a28901P122n6432r057r7554E041R4182h8926H2402c5334l4510
$$ 6534 112884 -128901 -121779 -178211 -187268 -284822 5041 99223 -88926 82402 -35334 -69844
9728f9844k39421J13116M3263F3687h0033I7672f7822b0635B7964G719L10407
$$ -69844 -309265 -196149 -152886 63687 -80033 97672 -67822 -20635 27964 7719 318126
9717C18126d87297E3314K01289b68548D4963a11540j42844e7519C33043f6556
$$ 318126 -487297 53314 254603 -268548 44963 -111540 -254384 -57519 333043 -66556
9706a67595B41304b6778A20688a119A20024f717B73759d13389f3230F6019K4058
$$ -167595 241304 -26778 120688 -1119 120024 -6717 273759 -413389 -63230 66019 90077
9695I0077a76702B28621b55258j90287K06100n6821F4195P0692c6896m7937p315
$$ 90077 -176702 228621 -255258 -445545 -239445 -296266 64195 134887 -36896 -84833 -92148
9684i2148j14078l44360A26201a45615H3527P0024b32774a07195C27352j37335
$$ -92148 -206226 -550586 126201 -145615 83527 153551 -232774 -107195 327352 190017
9674A90017j9440F6082d34587c0181I4809B372i5746r2590G4612a92237a7869
$$ 190017 170577 66082 -434587 -30181 94809 2372 -95746 -188336 74612 -192237 -17869
9662A4368O3736g4704B34104A11312O5395b41512K5602O5938j59261J35466c356
$$ 14368 78104 -74704 234104 111312 176707 -241512 -215910 -149972 -309233 -173767 -3356
9650c8567E6456a66280J3338B9372J78247a07642k4816M7730B45723b56838E9073
$$ -38567 56456 -166280 -152942 29372 207619 -107642 -132458 -84728 245723 -256838 59073
9638c33756e9692B43744h6101C17511i1866j74928a1604l4514A9925a30113B2503
$$ -333756 -59692 243744 -86101 317511 -91866 -266794 -11604 -46118 19925 -130113 22503
9626b69798N3078J7264M0262l02047f4719E7634b48301A77036n8296a68955K7749
$$ -269798 -216720 -199456 -159194 -461241 -64719 57634 -248301 177036 118740 -168955 -141206
9615a41206j61418F4228J8290a23762k00755a20311j03144A1440b96778N2119
$$ -141206 -302624 64228 82518 -123762 -324517 -120311 -223455 11440 -296778 -244659
9605b44659a055k27555E591b26925o382A59978m2696O8831c3393k26054h2568
$$ -244659 -1055 -228610 5591 -226925 -233307 159978 117282 186113 -33393 -259447 -82568
9593a16134K3473m8153C4335M8566a6979C3377g231j91952O7786f9C27226f0644
$$ -116134 -92661 -140814 34335 82901 -16979 33377 -7231 -199183 -131397 -69 327226 -60644
9580A65529a42910B27280G9043j212a59373m2915i6275l58028A86518e6144b6037
$$ 165529 -142910 227280 79043 77831 -159373 -202288 -96275 -454303 186518 -56144 -26037
9568c5940B68323D6342A8074a710k87108c238j59040B2473K8374q217e9369a7190
$$ -35940 268323 46342 18074 -1710 -288818 -3238 -162278 22473 50847 42630 -59369 -17190
9555C08236c4637J3644A23377n2323b39400Q6619P2903k30676a10973k2556p3916
$$ 308236 -34637 -20993 123377 71054 -239400 -152781 -79878 -310554 -110973 -133529 -207445
9544b07445J2388e4894j05226B5741a59555M3150j37546B31749o3885B11a21278
$$ -207445 -195057 -54894 -160120 25741 -159555 -116405 -253951 231749 167864 211 -121278
9532d53835A2726b03154Q6913G3768a73083j85592H5449c23900A36368J9871f3549
$$ -453835 12726 -203154 -116241 73768 -173083 -358675 85449 -323900 136368 156239 -63549
9520b60698Q7544e8656A99396c85035J34589P3510C79974A10677i1736j37561
$$ -260698 -173154 -58656 199396 -385035 -250446 -176936 379974 110677 -91736 -229297
9510b29297M8383b3354A94908c8731A17888d9064I180J96620a85893A0721b32238
$$ -229297 -180914 -23354 194908 -38731 117888 -49064 9180 205800 -185893 10721 -232238
9498c39281l2935a06975I2584A721J61961D051d2504J8116A66854b62753f0615
$$ -339281 -372216 -106975 92584 1721 163682 4051 -42504 -24388 166854 -262753 -60615
9486h3807l90270b08128h5599o2597L7955c6868B29219G6325O4176D0476b02786
$$ -83807 -474077 -208128 -85599 -148196 -110241 -36868 229219 76325 140501 40476 -202786
9474a17398l7210M3484j31218L0960r643B51654h5192A91705a00773J6093k13780
$$ -117398 -154608 -111124 -242342 -211382 -221025 251654 -85192 191705 -100773 -84680 -298460
9463b98460J04211m4285E0583c20095g1750a7206n6714j5190b4220l03139A15678
$$ -298460 -194249 -238534 50583 -320095 -71750 -17206 -73920 -89110 -24220 -327359 115678
9451i3789A14832C3358c2059m91339J41502k96447h3690B30664I2342a46389j27068
$$ -93789 114832 33358 -32059 -523398 -381896 -678343 -83690 230664 92342 -146389 -273457
9440b73457B4419M71994b49145Q3327H3134e6335E3480f1672J2473j85510a04672
$$ -273457 24419 496413 -249145 -165818 83134 -56335 53480 -61672 -49199 -234709 -104672
9428G7391b4715G4808c2106A08227A5460c03687B29682a81539C5408d94174c3403
$$ 77391 -24715 74808 -32106 108227 15460 -303687 229682 -181539 35408 -494174 -33403
9416e1241k83714A19674b2197j39461B26520b04892i7223q6136O4491A65050b16114
$$ -51241 -334955 119674 -22197 -161658 226520 -204892 -97223 -183359 -118868 165050 -216114
9404c33980q9636a35429f0134j79972R1712e0226A43035l2805c1928A80664M5200
$$ -333980 -423616 -135429 -60134 -240106 -148394 -50226 143035 110230 -31928 180664 225864
9393B25864n4123a09250D3618J00697b46482D2096J1534R4634b9535p1327A1063
$$ 225864 171741 -109250 43618 144315 -246482 42096 53630 148264 -29535 -100862 11063
9381D867c52726a68264A68863F28L95347a00164A9052h7112F3692a80896r0219
$$ 4867 -352726 -168264 168863 628 395975 -100164 19052 -87112 63692 -180896 -271115
9370b71115e7581P669C3335K24658a26199l1168C24261b3493B25788d3842B45712
$$ -271115 -57581 -49912 33335 257993 -126199 -157367 324261 -23493 225788 -43842 245712
9358b09090H5180a17324n3882Q4027k29352D6308J11995c85577A0901c16941D5657
$$ -209090 85180 -117324 -171206 -87179 -316531 46308 158303 -385577 10901 -316941 45657
9346C9866c70176A93089a17896l2206b64q4100A97880b48670l1363n9677a16885
$$ 39866 -370176 193089 -117896 -150102 -264 -84364 197880 -248670 -280033 -339710 -116885
9334a79858C27640c43844g1499A67415k5924J9689G5198c4925g238j67704g5400
$$ -179858 327640 -343844 -71499 167415 141491 161180 75198 -34925 -7238 -174942 -75400
9322C437a30645k24943g1340j17806j04971g9880A24596b03778I4540m6413K22288
$$ 3437 -130645 -355588 -71340 -189146 -294117 -79880 124596 -203778 94540 48127 270415
9311B70415a4535A41867b51047A89475c17478h4021j98120a12964c5667B86295
$$ 270415 -14535 141867 -251047 189475 -317478 -84021 -282141 -112964 -35667 286295
9300a02745n7861l3237A0048b06409P7631O2874q2040l29040b06836B63950b41673
$$ -102745 -160606 -193843 10048 -206409 -128778 -65904 -147944 -476984 -206836 263950 -241673
9288a83260I5481b02172K3022A10066e1091F3952a46096G2342J89522a09181L9580
$$ -183260 95481 -202172 -179150 110066 -51091 63952 -146096 72342 261864 -109181 -69601
9277f9601k086H0445a96999C545b01196B26177a30520J5742a8682k60018a16486
$$ -69601 -71687 80445 -196999 3545 -201196 226177 -130520 -114778 -18682 -278700 -116486
9265H9458a81955B8342a7509j48499O3416E484J35651K8407c64886C5794c07725
$$ 89458 -181955 28342 -17509 -166008 -102592 5484 141135 169542 -364886 35794 -307725
9253F3301K55839a35048j21819A17801m4225b96852h6255k20736a0338E6573a16624
$$ 63301 319140 -135048 -256867 117801 73576 -296852 -86255 -306991 -10338 56573 -116624
9241b61562q046b4628G5161a2321m1938A59759b9440j81780A89026H2887M7748
$$ -261562 -269608 -24628 75161 -12321 -54259 159759 -29440 -211220 189026 82887 130635
9230A30635a68761e7668a046o8181G1958c36998O0655j1966a23317B50345K7943
$$ 130635 -168761 -57668 -1046 -69227 71958 -336998 -276343 -288309 -123317 250345 278288
9219B78288B4872b40295I3669f1482C3877b95416N2003A93243a05134j61798E026
$$ 278288 24872 -240295 93669 -61482 33877 -295416 -243413 193243 -105134 -266932 5026
9207B25929a33306l0838A26994F0083N4650a62845c9957k85439a4646j67069G0677
$$ 225929 -133306 -164144 126994 60083 114733 -162845 -39957 -325396 -14646 -181715 70677
9195a12213j1618j29788j03473i6462A54578d3550C11627f540A84727f2847p366
$$ -112213 -123831 -253619 -357092 -96462 154578 -43550 311627 -6540 184727 -62847 -70213
9184g0213j27344g2518k34127a41207B2162g2168I4726d37895A29479a00559A90584
$$ -70213 -197557 -72518 -306645 -141207 22162 -72168 94726 -437895 129479 -100559 190584
9172b04228A45256a82909F3773c07140Q8951B41425I5226b3989l81029f723j73444
$$ -204228 145256 -182909 63773 -307140 -218189 241425 95226 -23989 -405018 -6723 -180167
9161a80167j32197C03117A07916f0295K7205l0921k1239C54170j58707a22572
$$ -180167 -312364 303117 107916 -60295 -33090 -64011 -85250 354170 195463 -122572
9150a80190c7429p806A36667a47526E2574k4881k578c3753q8392E5106a02755
$$ -180190 -37429 -45235 136667 -147526 52574 27693 25115 -33753 -122145 55106 -102755
9138a52543l90979B0672R2563b82422B5644P5158c1722r2309j69231h103A19107
$$ -152543 -543522 20672 113235 -282422 25644 100802 -31722 -124031 -293262 -8103 119107
9126b96990D0475K0936J44776m3406D2830b7927B3486J46337C7369g8985j1709
$$ -296990 40475 61411 206187 162781 42830 -27927 23486 169823 37369 -78985 -90694
9115i0694A9329f8513C94922d41623I6897a3639I5779J06515a32128k07107d5518
$$ -90694 19329 -68513 394922 -441623 96897 -13639 95779 202294 -132128 -339235 -45518
9103g6734r5492d4178j88699A6530h7059k92499A1893J7863a72497D01177b02432
$$ -76734 -172226 -44178 -232877 16530 -87059 -379558 11893 29756 -172497 401177 -202432
9091b05510g5584k41621H5960c65082J58271k997J4240q459c7154G5264k1982
$$ -205510 -75584 -317205 85960 -365082 -206811 -209808 -195568 -204027 -37154 75264 53282
9080E3282Q585d29859A64721Q1472F6141a80806q3091c2043q2041I2822A281d2698
$$ 53282 61867 -429859 164721 246193 66141 -180806 -263897 -32043 -114084 92822 1281 -42698
9067b45470A41794b31433f7643b366D573e4542j81636A31427a56213E0811c03569
$$ -245470 141794 -231433 -67643 -2366 4573 -54542 -236178 131427 -156213 50811 -303569
9055A20337b06796A38853d5968a0730j34150A30001a43097J7819b8852r3615A73937
$$ 120337 -206796 138853 -45968 -10730 -144880 130001 -143097 -125278 -28852 -122467 173937
9043c64545g6565H1369L8357a2754A06572h9197J6500L1327A776h9956l12618
$$ -364545 -76565 81369 119726 -12754 106572 -89197 -72697 -41370 1776 -89956 -402574
9032d02574A6790b04918j55412J48823D3303J69722b3342H9966a08959A8643J54227
$$ -402574 16790 -204918 -360330 -211507 43303 213025 -23342 89966 -108959 18643 172870
9021A72870p8264c4189A1585J52930n7423e5468j68178D0760b85738H6715H376
$$ 172870 94606 -34189 11585 164515 107092 -55468 -223646 40760 -285738 86715 8376
9009b23701K5860A01969A636K82635H5580a14549I2621h4901B3741c33711J57743
$$ -223701 -197841 101969 1636 284271 85580 -114549 92621 -84901 23741 -333711 -175968
8998a75968M3351k3312B7050a74745O4723A94742G8044a68665F5162b6584E5507
$$ -175968 -132617 -155929 27050 -174745 -110022 194742 78044 -168665 65162 -26584 55507
8986A44091b70435g0218j48878P8653j4646A9579e2819m7853A2388i7548b9624
$$ 144091 -270435 -70218 -219096 -140443 -155089 19579 -52819 -100672 12388 -97548 -29624
8974f2948F1869a58709o9832K3308D1294N46b24592A5560a28257C96916c2202
$$ -62948 61869 -158709 -228541 -205233 41294 41840 -224592 15560 -128257 396916 -32202
8962b30637A75871f3604j72625P4015A97777a44405M5452o1449B3040K43536a75573
$$ -230637 175871 -63604 -236229 -162214 197777 -144405 -98953 -160402 23040 266576 -175573
8950b04482Q9127m9789A68496a8706A57934o1319D1365d06950A24703j8580k6792
$$ -204482 -115355 -165144 168496 -18706 157934 96615 41365 -406950 124703 106123 79331
8939G9331l0678P2052g992j67993A30438l6823P7563C0500a55001N1173A763c7770
$$ 79331 48653 120705 -7992 -175985 130438 93615 171178 30500 -155001 -103828 1763 -37770
8926B6709g513k1748C21956K39723J074260o12632C03905G3236i6169j22909j07631
$$ 26709 -7513 -29261 321956 561679 1635939 1023307 303905 73236 -96169 -219078 -326709
8915c26709a1584k91823F1105b13038P3575j29131j4681B3303O9551b74541h0588
$$ -326709 -11584 -303407 61105 -213038 -139463 -268594 -283275 23303 92854 -274541 -80588
8903h7593j38104b4039n9212A39703a09821A04292a147m151l595o0112k12856
$$ -87593 -225697 -24039 -83251 139703 -109821 104292 -1147 -5298 -8893 -69005 -281861
8892b81861G9971d5352a9798k23181c5054A21434J08072a54168r996b6050A16388
$$ -281861 79971 -45352 -19798 -242979 -35054 121434 229506 -154168 -164164 -26050 116388
8880A52708b96548C36204b06037M3960j00731j00224J02668r132A34369b31342
$$ 152708 -296548 336204 -206037 -162077 -262808 -363032 -260364 -269496 134369 -231342
8869c04912R0702J5408B38016R3542D8771e6622B6730J33366a8787A07029k1515
$$ -304912 -214210 -198802 238016 331558 48771 -56622 26730 160096 -18787 107029 85514
8858H5514a31238r2741D3452c49192I5648r320g9337j78283h5223b8699H7689
$$ 85514 -131238 -223979 43452 -349192 95648 86328 -79337 -257620 -85223 -28699 87689
8846B04901B4524K70723A12614g1068K8682A48279M0258a12134B72434q3168a5363
$$ 204901 24524 295247 112614 -71068 -42386 148279 188537 -112134 272434 189266 -15363
8834b1507B17697A00955D1401a25286M4612k0033J702C6546b88784F4343b76714
$$ -21507 217697 100955 41401 -125286 -80674 -100707 -99005 36546 -288784 64343 -276714
$$ [...]
##END NTUPLES=NMR SPECTRUM
##END=
