##TITLE=NES1084_ptc140_9884872_SXvDNknLow
##JCAMPDX= 6.0         $$ Bruker NMR JCAMP-DX V2.0
##DATA TYPE= NMR SPECTRUM
##DATA CLASS= NTUPLES
##ORIGIN= BRUKER
##OWNER= Administrator
$$ 1.72 TOPSPIN		Version 2.1
$$ 2016-08-27 16:08:03.492 -0500  Administrator@X
$$ Compression mode = diff/dup
##.OBSERVE FREQUENCY= 400.02188249412
##.OBSERVE NUCLEUS= ^1H
##.ACQUISITION MODE= SIMULTANEOUS (DQD)
##.ACQUISITION SCHEME= undefined
##.AVERAGES= 64
##.DIGITISER RES= 22
##SPECTROMETER/DATA SYSTEM= spect
##.PULSE SEQUENCE= noesygpps1d.comp
##.SOLVENT NAME= COFFEE_meoh
##.SHIFT REFERENCE= INTERNAL, COFFEE_meoh, 1, 14.96056
##AUDIT TRAIL= $$ (NUMBER, WHEN, WHO, WHERE, PROCESS, VERSION, WHAT)
$$ ##TITLE= Audit trail, TOPSPIN		Version 2.1
$$ ##JCAMPDX= 5.01
$$ ##ORIGIN= Bruker BioSpin GmbH
$$ ##OWNER= Administrator
$$ $$ E:\/data/COFFEE/nmr/NES1084_ptc140_9884872_SXvDNknLow/12/pdata/1/auditp.txt
$$ ##AUDIT TRAIL=  $$ (NUMBER, WHEN, WHO, WHERE, PROCESS, VERSION, WHAT)
(   1,<2016-08-27 16:07:58.351 -0500>,<Administrator>,<X>,<go>,<TOPSPIN 2.1>,
      <created by zg
	started at 2016-08-27 15:56:28.429 -0500,
	POWCHK enabled, PULCHK disabled,
       configuration hash MD5:
       21 0F 79 D6 B3 7B B4 F6 88 20 88 DB 03 48 BD 9F
       data hash MD5: 64K
       5E 14 20 58 CE AB 55 01 8F 2A 69 33 2E E1 09 14>)
(   2,<2016-08-27 16:08:01.461 -0500>,<Administrator>,<X>,<proc1d>,<TOPSPIN 2.1>,
      <Start of raw data processing
       efp LB = 0.3 FT_mod = 6 PKNL = 1 PHC0 = 0 PHC1 = 0 SI = 128K 
       data hash MD5: 128K
       5C 62 0B EE BD 14 B1 00 7B 7A F7 8B 39 C9 25 FE>)
(   3,<2016-08-27 16:08:02.336 -0500>,<Administrator>,<X>,<proc1d>,<TOPSPIN 2.1>,
      <pk PHC0 = -81.57898 PHC1 = 0 
       data hash MD5: 128K
       6A B1 5C 60 9C 6B 9D 9D 18 6C C2 E3 07 E9 83 4A>)
(   4,<2016-08-27 16:08:02.711 -0500>,<Administrator>,<X>,<proc1d>,<TOPSPIN 2.1>,
      <abs ABSG = 1 
       data hash MD5: 128K
       68 74 F4 29 8B EB 73 88 59 90 91 F4 91 BF A0 18>)
(   5,<2016-08-27 16:08:02.804 -0500>,<Administrator>,<X>,<proc1d>,<TOPSPIN 2.1>,
      <abs ABSG = 2 
       data hash MD5: 128K
       EC DC EB D0 AF 65 F6 A8 75 76 3F 4F 4C 52 8C FC>)
(   6,<2016-08-27 16:08:02.883 -0500>,<Administrator>,<X>,<proc1d>,<TOPSPIN 2.1>,
      <abs ABSG = 3 
       data hash MD5: 128K
       BB 96 4A 8E B3 E6 9A 0F BE 0D 9C 2B 7E D6 7C 4A>)
(   7,<2016-08-27 16:08:02.976 -0500>,<Administrator>,<X>,<proc1d>,<TOPSPIN 2.1>,
      <abs ABSG = 4 
       data hash MD5: 128K
       A8 2D F2 D4 30 C6 07 CC 0A 45 CB 04 B5 55 FB D3>)
(   8,<2016-08-27 16:08:03.117 -0500>,<Administrator>,<X>,<proc1d>,<TOPSPIN 2.1>,
      <abs ABSG = 5 
       data hash MD5: 128K
       45 1F 73 CA B2 05 BD 21 1A EE 2E 69 1B 92 55 4C>)
$$ ##END=
$$ 
$$ $$ hash MD5
$$ $$ 41 F0 5B 84 C0 99 3D DF 1F 1E 93 B4 72 9C 2A 58
##$RELAX= 
##$RELAX= 
##$RELAX= 
##$RELAX= 
##$RELAX= 
##$RELAX= 
##$RELAX= 
##$RELAX= 
$$ Bruker specific parameters
$$ --------------------------
##$DU= <E:\>
##$EXPNO= 12
$$ [...]
##$TP07= 0
##$TPNAME0= <>
##$TPNAME1= <>
##$TPNAME2= <>
##$TPNAME3= <>
##$TPNAME4= <>
##$TPNAME5= <>
##$TPNAME6= <>
##$TPNAME7= <>
##$TPOAL= (0..7)
0.5 0.5 0.5 0.5 0.5 0.5 0.5 0.5
##$TPOFFS= (0..7)
0 0 0 0 0 0 0 0
##$TUNHIN= 0
##$TUNHOUT= 0
##$TUNXOUT= 0
##$USERA1= <user>
##$USERA2= <user>
##$USERA3= <user>
##$USERA4= <user>
##$USERA5= <user>
##$V9= 5
##$VALIST= <valist>
##$VCLIST= <CCCCCCCCCCCCCCC>
##$VD= 0
##$VDLIST= <DDDDDDDDDDDDDDD>
##$VPLIST= <PPPPPPPPPPPPPPP>
##$VTLIST= <TTTTTTTTTTTTTTT>
##$WBST= 2048
##$WBSW= 25
##$XGAIN= (0..3)
0 0 0 0
##$XL= 0
##$YL= 0
##$YMAX_a= 6444715
##$YMIN_a= -12123866
##$ZGOPTNS= <>
##$ZL1= 120
##$ZL2= 120
##$ZL3= 120
##$ZL4= 120
##$ABSF1= 14.96056
##$ABSF2= -5.597622
##$ABSG= 5
##$ABSL= 3
##$ALPHA= 0
##$AQORDER= 0
##$ASSFAC= 0
##$ASSFACI= 0
##$ASSFACX= 0
##$ASSWID= 0
##$AUNMP= <proc_prof1d_extract.lims>
##$AXLEFT= 0
##$AXNAME= <>
##$AXNUC= <1H>
##$AXRIGHT= 0
##$AXTYPE= 0
##$AXUNIT= <>
##$AZFE= 0.1
##$AZFW= 0.1
##$BCFW= 0
##$BC_mod= 0
##$BYTORDP= 0
##$COROFFS= 0
##$CY= 15
##$DATMOD= 1
##$DC= 0
##$DFILT= <>
##$DTYPP= 0
##$F1P= 0
##$F2P= 0
##$FCOR= 0.5
##$FTSIZE= 131072
##$FT_mod= 6
##$GAMMA= 0
##$GB= 0
##$INTBC= 1
##$INTSCL= 1
##$ISEN= 128
##$LB= 0.3
##$LEV0= 0
##$LPBIN= 0
##$MAXI= 10000
##$MC2= 0
##$MEAN= 0
##$ME_mod= 0
##$MI= 0
##$NCOEF= 0
##$NC_proc= -2
##$NLEV= 6
##$NOISF1= 0
##$NOISF2= 0
##$NSP= 0
##$NTH_PI= 0
##$NZP= 0
##$OFFSET= 14.96056
##$PC= 1
##$PHC0= -81.57898
##$PHC1= 0
##$PH_mod= 1
##$PKNL= yes
##$PPARMOD= 0
##$PPDIAG= 0
##$PPIPTYP= 0
##$PPMPNUM= 2147483647
##$PPRESOL= 1
##$PSCAL= 4
##$PSIGN= 0
##$PYNMP= <proc.py>
##$REVERSE= no
##$SF= 400.020009813685
##$SI= 131072
##$SIGF1= 0
##$SIGF2= 0
##$SINO= 400
##$SIOLD= 131072
##$SPECTYP= <>
##$SREGLST= <1H.CDCl3>
##$SSB= 0
##$STSI= 131072
##$STSR= 0
##$SW_p= 8223.68421052631
##$SYMM= 0
##$S_DEV= 0
##$TDeff= 65536
##$TDoff= 0
##$TI= <>
##$TILT= no
##$TM1= 0
##$TM2= 0
##$TOPLEV= 0
##$USERP1= <user>
##$USERP2= <user>
##$USERP3= <user>
##$USERP4= <user>
##$USERP5= <user>
##$WDW= 1
##$XDIM= 131072
##$YMAX_p= 365492750
##$YMIN_p= -10493
##$CURPLOT= <Network HP LaserJet P1505>
##$CURPRIN= <$Network HP LaserJet P1505>
##$DFORMAT= <normdp>
##$LAYOUT= <+/1D_H.xwp>
##$LFORMAT= <normlp>
##$PFORMAT= <normpl>
##$SURQMSG= 1
$$ End of Bruker specific parameters
$$ ---------------------------------
##NTUPLES= NMR SPECTRUM
##VAR_NAME=  FREQUENCY,     SPECTRUM/REAL,   SPECTRUM/IMAG
##SYMBOL=    X,             R,               I
##VAR_TYPE=  INDEPENDENT,   DEPENDENT,       DEPENDENT
##VAR_FORM=  AFFN,          ASDF,            ASDF
##VAR_DIM=   131072,        131072,          131072
##UNITS=     HZ,            ARBITRARY UNITS, ARBITRARY UNITS
##FACTOR=    0.0627417313425164, 1,          1
##FIRST=     8223.62146879497, -657,         -53355
##LAST=      0,             293,             -54225
##MIN=       0,             -10493,          0
##MAX=       8223.62146879497, 365492750,    0
$$ Real data points
##PAGE= N=1
##DATA TABLE= (X++(R..R)), XYDATA
$$ [...]
63966C69642Q546Q652R635J0978J2016J2949J4544J7054J9941K2614K5034K7608
$$ 369642 378188 386840 396475 407453 419469 432418 446962 464016 483957 506571 531605 559213
63954E59213L0820L4956L9948M5508N1636N8888O7795P8080Q8739R8865J08182
$$ 559213 590033 624989 664937 710445 762081 820969 888764 966844 1055583 1154448 1262630
63943A262630J16816J24872J32227J38475J43070J45701J46459J45275J41359
$$ 1262630 1379446 1504318 1636545 1775020 1918090 2063791 2210250 2355525 2496884
63934B496884J33646J21926J07104R0233P1723N1699L0620R091j2579l4241n5450
$$ 2496884 2630530 2752456 2859560 2949793 3021516 3073215 3103835 3112926 3100347 3066106 3010656
63923C010656p5520r3888j10032j23239j32934j39208j42602j43420j41678j37713
$$ 3010656 2935136 2841248 2731216 2607977 2475043 2335835 2193233 2049813 1908135 1770422
63913A770422j32231j25605j17631j08318r8475q9156q0711p2760o4877n6971
$$ 1770422 1638191 1512586 1394955 1286637 1188162 1099006 1018295 945535 880658 823687
63903H23687m9184m1861l5449l0192k5921k2367j9502j7300j5405j3430j1459
$$ 823687 774503 732642 697193 667001 641080 618713 599211 581911 566506 553076 541617
63892E41617r833q571p447o486n837n245m203k767j539p15K77J936M029O108Q095
$$ 541617 531784 523213 515766 509280 503443 498198 493995 491228 489689 488974 489251 491187 495216 501324 509419
63877E09419J0004J1599J2843J4193J5899J7413J8099J8134J8076J7913J7310
$$ 509419 519423 531022 543865 558058 573957 591370 609469 627603 645679 663592 680902
63866F80902J6516J6031J5495J3933J1292Q717O993N597L777J753J06j321l077
$$ 680902 697418 713449 728944 742877 754169 762886 769879 775476 779253 781006 781112 779791 776714
63853G76714n104o944q760j1269j4572j7797k0052k1246k1862k2405k3209k4304
$$ 776714 771610 764666 755906 744637 730065 712268 692216 670970 649108 626703 603494 579190
63841E79190k5198k5154k3957k2155k0433j9024j7860j6896j6026j4988j3743
$$ 579190 553992 528838 504881 482726 462293 443269 425409 408513 392487 377499 363756
63830C63756j2703j2262j2190j1893j1147j0206r254q197p129o495o490o590o081
$$ 363756 351053 338791 326601 314708 303561 293355 284101 275904 268775 262280 255790 249200 243119
63817B43119m922l824l424l707m231m587m556l984k828j314Q6Q58P59p4j180k071
$$ 243119 238197 234373 230949 227242 223011 218424 213868 209884 207056 205742 205828 206686 207445 207371 206191 204120
63801B04120k485k399j909j239p98r52j547j874j353k19O71O91jp51j053r05o66
$$ 204120 201635 199236 197327 196088 195290 194338 192791 190917 189564 189345 190016 190707 190706 189955 188902 187997 187331
63784A87331o64r18j224j440j506j298p45k19l98j326j995j408P0J062Q70J43
$$ 187331 186667 185749 184525 183085 181579 180281 179536 179317 178919 177593 175598 174190 174260 175322 176192 176335
63768A76335k83m29o21o16k2Q28J174Q55L59m9n66j087r90JJ237J786J384N12
$$ 176335 176052 175623 175002 174386 174364 175192 176366 177221 177580 177531 176965 175878 174888 174889 176126 177912 179296 179808
63750A79808j89l43N2O79J155J341J293R64L19k71k47M01J083J458J798K203K160
$$ 179808 179619 179276 179328 180007 181162 182503 183796 184760 185079 184808 184561 184962 186045 187503 189301 191504 193664
63733A93664J429P51R69J846K545K932L509M162M100L182K409K654L663M651N263
$$ 193664 195093 195844 196813 198659 201204 204136 207645 211807 215907 219089 221498 224152 227815 232466 237729
63718B37729N433M953L771K372J348Q44P52R94J331J246N30m15j196j986k959
$$ 237729 243162 248115 251886 254258 255606 256450 257202 258196 259527 260773 261303 260888 259692 257706 254747
63703B54747l718l807l430l005k474j695j106j098j062j37J282J880J323P31R60
$$ 254747 251029 247222 243792 240787 238313 236618 235512 234414 233352 233215 234497 236377 237700 238431 239391
63688B39391J511J636J514J681K037K177K177K373K704K864K754K385J704R83
$$ 239391 240902 242538 244052 245733 247770 249947 252124 254497 257201 260065 262819 265204 266908 267891
63674B67891P92J137J167L95l82j85P16J378J769K597L704L916K761J244M59L08
$$ 267891 268683 269820 270987 271382 271000 270815 271531 272909 274678 277275 280979 284895 287656 288900 289359 289667
63658B89667J25k38o00j158k260l685m779n138m847m137l256k512k073j747j223
$$ 289667 289792 289554 288954 287796 285536 281851 277072 271934 267087 262950 259694 257182 255109 253362 252139
63643B52139n08J36N73Q93J217J640K314L268M124M303L683K943K979M018N419
$$ 252139 251631 251767 252340 253233 254450 256090 258404 261672 265796 270099 273782 276725 279704 283722 289141
63628B89141O347O541O295N967N755N888O591P674Q524Q776Q830R372J0595J2145
$$ 289141 295488 302029 308324 314291 320046 325934 332525 340199 348723 357499 366329 375701 386296 398441
63614C98441J3746J5428J7205J8843K0083K0964K1927K3641K6419K9583L1707
$$ 398441 412187 427615 444820 463663 483746 504710 526637 550278 576697 606280 637987
63603F37987L1951L0899K9598K8009K5168K0706J5441J0276N419R97k393m433
$$ 637987 669938 700837 730435 758444 783612 804318 819759 830035 835454 836451 834058 829625
63591H29625n793p329q904r802j0113j1008j3400j6890k0299k2882k4712k6038
$$ 829625 823832 816503 807599 797797 787684 776676 763276 746386 726087 703205 678493 652455
63579F52455k6660k6120k4419k2204k0111j8168j6105j4020j2245j0670q827o643
$$ 652455 625795 599675 575256 553052 532941 514773 498668 484648 472403 461733 452906 446263
63567D46263m561k753r12R43K209K740L453N190P459R182J0221J1332J2806J4178
$$ 446263 441702 438949 438037 438980 441189 443929 447382 452572 460031 469213 479434 490766 503572 517750
63553E17750J5267J6517J8138J9781K1450K3847K7332L1185L4510L7258L9620
$$ 517750 533017 549534 567672 587453 608903 632750 660082 691267 725777 763035 802655
63542H02655M0811L9478L5292K9345K2800J5867Q518J536l910p495r867j1526
$$ 802655 843466 882944 918236 947581 970381 986248 994766 996302 992392 984897 975030 963504
63530I63504j2246j1910j1236j1153j1771j2672j4019j6595k0574k4958k8613
$$ 963504 951258 939348 928112 916959 905188 892516 878497 861902 841328 816370 787757
63519G87757l1289l3221l4217l3891l2537l1023k9783k8376k6253k3501k0694
$$ 787757 756468 723247 689030 655139 622602 591579 561796 533420 507167 483666 462972
63508D62972j8292j6409j4902j3511j2064j0647r556q930q513p831o611n116m026
$$ 462972 444680 428271 413369 399858 387794 377147 367591 358661 350148 342317 335706 330590 326564
63495C26564l824m203m314l689k748k212k282k576k680k316j310K14J603K120
$$ 326564 322740 318537 314223 310534 307786 305574 303292 300716 298036 295720 294410 294624 296227 298347
63481B98347J725J115J044J762L092M597N709N985N478M626L809L122K495J769
$$ 298347 300072 301187 302231 303993 307085 311682 317391 323376 328854 333480 337289 340411 342906 344675
63467C44675P20o71j909k386k049j495j360j832k685l444l635l134k355j749j307
$$ 344675 345395 344724 342815 340429 338380 336885 335525 333693 331008 327564 323929 320795 318440 316691 315384
63452C15384p48j12L90R02J790K945L801M119M314M888O026P748R880J1861J3214
$$ 315384 314636 314524 314914 315816 317606 320551 324352 328471 332785 337673 343699 351447 361327 373188 386402
63437C86402J4309J6075J8790K1887K5043K8443L1532L2554L0291K5626K0495
$$ 386402 400711 416786 435576 457463 482506 510949 542481 575035 605326 630952 651447
63426F51447J5761J1070O495L170K090L080N275Q109J1642J6120K1453K6884L1332
$$ 651447 667208 678278 684773 687943 690033 693113 698388 706497 718139 734259 755712 782596 813928
63413H13928L4222L5812L6506L6054L3910L0050K5002J9174J2699N931l90n543
$$ 813928 848150 883962 920468 956522 990432 1020482 1045484 1064658 1077357 1083288 1082898 1077355
63401A077355r114j1021j1643j1862j2607j4309j6964k0378k4103k7488l0315
$$ 1077355 1068241 1057220 1045577 1033715 1021108 1006799 989835 969457 945354 917866 887551
63390H87551l2967l5481l6891l6351l4499l2706l1162k8953k5959k3310k1490
$$ 887551 854584 819103 782212 745861 711362 678656 647494 618541 592582 569272 547782
63379E47782j9419j6209j2753j0435r122p557n295k961q61J454M105O500Q257
$$ 547782 528363 512154 499401 488966 479844 472287 466992 464031 463170 464624 468729 475229 483486
63366D83486R747J1295J2700J3945J5739J8613K1934K4562K6427K8628L1819L5121
$$ 483486 493233 504528 517228 531173 546912 565525 587459 612021 638448 667076 698895 734016
63354G34016L7132L7628L7660L7955L7887L6308L2933K8349K2986J6780R942L413
$$ 734016 771148 808776 846436 884391 922278 958586 991519 1019868 1042854 1059634 1069576 1072989
63342A072989j871n787q768j1064j2645j3674j4617j5834j7368j9192k1448k4330
$$ 1072989 1071118 1065331 1056563 1045499 1032854 1019180 1004563 988729 971361 952169 930721 906391
63330I06391k7696l0900l3070l3770l3333l2354l0903k8533k5046k0854j6518
$$ 906391 878695 847795 814725 780955 747622 715268 684365 655832 630786 609932 593414
63319E93414j2449r286p941q731j0761j2794j4534j6485j8730k0508k1039k0220
$$ 593414 580965 571679 563738 555007 544246 531452 516918 500433 481703 461195 440156 419936
63307D19936j8432j6162j3984j2395j1418j0599r544q245o839n412m175l423l144
$$ 419936 401504 385342 371358 358963 347545 336946 327402 319157 312318 306906 302731 299308 296164
63294B96164k969k662k368k226k102j899j808j941k031j831j564j628k047k499
$$ 296164 293195 290533 288165 285939 283837 281938 280130 278189 276158 274327 272763 271135 269088 266589
63280B66589k746k693k155j035K78J027Q26J22k64L6O13Q29O22O22J276K060J994
$$ 266589 263843 261150 258995 257960 258238 259265 260091 260213 259949 259985 260598 261427 262049 262671 263947 266007 268001
63263B68001R77J14M21J624K653L007L038L162L413L783M370M994N187M847M529
$$ 268001 268978 269092 269513 271137 273790 276797 279835 282997 286410 290193 294563 299557 304744 309591 314120
63248C14120M791N527O217O647P103P951R212J0556J1619J2423J3398J4784J6106
$$ 314120 318911 324438 330655 337302 344405 352356 361568 372124 383743 396166 409564 424348 440454
63235D40454J6675J6623J6916J8080J9447K0100K0102K0160K0412K0269J9518
$$ 440454 457129 473752 490668 508748 528195 548295 568397 588557 608969 629238 648756
63224F48756J8744J8537J8823J9280J9811K0228K0048J9112J7980J7123J6025
$$ 648756 667500 686037 704860 724140 743951 764179 784227 803339 821319 838442 854467
63213H54467J3810J0636P564M958J888k485p636j2419j6445j9958k2752k4262
$$ 854467 868277 878913 886477 891435 893323 890838 883202 870783 854338 834380 811628 787366
63201G87366k4688k5016k5508k5035k2483j8340j4217j1112q787o602m237j573
$$ 787366 762678 737662 712154 687119 664636 646296 632079 620967 612180 605578 601341 599768
63189E99768J459M725P932J0949J3753J6064J7535J8370J9229K0323K1136K1316
$$ 599768 601227 605952 613884 624833 638586 654650 672185 690555 709784 730107 751243 772559
63177G72559K1334K1744K2210K1931K0836J9676J8955J8251J6855J4589J1771
$$ 772559 793893 815637 837847 859778 880614 900290 919245 937496 954351 968940 980711
63166I80711Q604M906M04m825j0240j5211j9524k3411k7037l0182l2574l4296
$$ 980711 989315 994221 994625 989800 979560 964349 944825 921414 894377 864195 831621 797325
63154G97325l5527l6102l5727l4597l3218l1631k9316k6157k2928k0451j8577
$$ 797325 761798 725696 689969 655372 622154 590523 561207 535050 512122 491671 473094
63143D73094j6506j4015j1802j0515r850q916p351n703m693m322l947l109j986
$$ 473094 456588 442573 430771 420256 410406 401490 394139 388436 383743 379421 375474 372365 370379
63130C70379j012k91L46R54J403J637J743J822J981K313K653K574J929J269J298
$$ 370379 369367 369076 369422 370376 371779 373416 375159 376981 378962 381275 383928 386502 388431 389700 390998
63115C90998J986K749L345M024M746M996M629M176L973L634K851K104J895J836
$$ 390998 392984 395733 399078 403102 407848 412844 417473 421649 425622 429256 432107 434211 436106 437942
63101D37942J306O40P62J727K570K699K567K737K987K836K388K093J991J641P19
$$ 437942 439248 439888 440650 442377 444947 447646 450213 452950 455937 458773 461161 463254 465245 466886 467605
63086D67605n96j811k465k403j813r93p9Q66J637K049K285K791L762M995O298
$$ 467605 467009 465198 462733 460330 458517 457524 457445 458311 459948 461997 464282 467073 470835 475830 482128
63071D82128P668R042J0178J0955J1452J1693J1680J1776J2607J4348J6517J8682
$$ 482128 489796 498838 509016 519971 531423 543116 554796 566572 579179 593527 610044 628726
63059F28726K0950K3432K5739K7546K9267L1620L4701L7962M0932M3431M5258
$$ 628726 649676 673108 698847 726393 755660 787280 821981 859943 900875 944306 989564
63048I89564M6291M6896M7631M8468M8843M8594M8268M8290M8364M8117M7848
$$ 989564 1035855 1082751 1130382 1178850 1227693 1276287 1324555 1372845 1421209 1469326 1517174
63037A517174M8164M9018M9574M9033M7224M4417M0824L6313L0513K3142J4407
$$ 1517174 1565338 1614356 1663930 1712963 1760187 1804604 1845428 1881741 1912254 1935396 1949803
63026A949803N021m272j3260k2175l1110l9586m6812n2260n5933n8090n8766n7658
$$ 1949803 1954824 1950552 1937292 1915117 1884007 1844421 1797609 1745349 1689416 1631326 1572560 1514902
63014A514902n4506m9621m3854l7998l2191k6040j9271j2117n045J682P980J3673
$$ 1514902 1460396 1410775 1366921 1328923 1296732 1270692 1251421 1239304 1234259 1235941 1243921 1257594
63002A257594J8558K2818K6986L1230L4904L7149L7865L7760L7516L7253L6799
$$ 1257594 1276152 1298970 1325956 1357186 1392090 1429239 1467104 1504864 1542380 1579633 1616432
62991A616432L6059L4933L3342L1496K9734K7885K5128K0850J5246Q663Q54q522
$$ 1616432 1652491 1687424 1720766 1752262 1781996 1809881 1835009 1855859 1871105 1879768 1880622 1872100
62979A872100j8828k8687l7307m4998n2251n8875o4260o7996p0004p0396o9480
$$ 1872100 1853272 1824585 1787278 1742280 1690029 1631154 1566894 1498898 1428894 1358498 1289018
62968A289018o7551o4564o0283n4962m9495m4694m0725l7369l4468l1872k9353
$$ 1289018 1221467 1156903 1096620 1041658 992163 947469 906744 869375 834907 803035 773682
62957G73682k6850k4538k2432k0329j8314j6853j6026j5220j4055j3132j3166
$$ 773682 746832 722294 699862 679533 661219 644366 628340 613120 599065 585933 572767
62946E72767j3784j3969j3463j2903j2596j2085j1088j0100r679r631r327q423
$$ 572767 558983 545014 531551 518648 506052 493967 482879 472779 463100 453469 444142 435719
62934D35719p061n668m794m720n037m951m257l598l505l639l327k559j947j877
$$ 435719 428658 422990 418196 413476 408439 403488 399231 395633 392128 388489 385162 382603 380656 378779
62920C78779k104k154j786j152o68o67r86j070o27oL41M35N34N29L0j032k225
$$ 378779 376675 374521 372735 371583 370915 370248 369262 368192 367565 367559 367900 368335 368869 369398 369428 368396 366171
62903C66171l087l458l447l265l108k899k306j223j20M54O05R09J479J723J161
$$ 366171 363084 359626 356179 352914 349806 346907 344601 343378 343258 343712 344317 345226 346705 348428 349589
62888C49589J49n04l58L36J006J249J104R34R68J037Q61N66N05O90P53O11O06
$$ 349589 349738 349234 348876 349212 350218 351467 352571 353505 354473 355510 356371 356937 357442 358132 358885 359496 360102
62871C60102Q41Q33K26n51q69p81p78q69o41j44J0l34m54K35J239J596J085K63
$$ 360102 360943 361776 362002 361451 360582 359801 359023 358154 357513 357369 357379 357045 356591 356826 358065 359661 360746 361009
62853C61009l90p27m88N81J946K433J560K66k49J07N84Q44J110J303R60J90j72
$$ 361009 360619 359892 359404 359985 361931 364364 365924 366190 365941 366048 366632 367476 368586 369889 370849 371039 370867
62836C70867K73Q47Q28M84N18R60J306J373J336J137O52L04O70J531K050K000
$$ 370867 371140 371987 372815 373299 373817 374777 376083 377456 378792 379929 380581 380885 381555 383086 385136 387136
62820C87136K058K641L256L295K845K328J981K022K745L886M559M365M063M499
$$ 387136 389194 391835 395091 398386 401231 403559 405540 407562 410307 414193 418752 423117 427180 431679
62806D31679N399N953O064O175O276O128O248P489R601J1304J2049J2594J3554
$$ 431679 437078 443031 449095 455270 461546 467674 473922 481411 491012 502316 514365 526959 540513
62793E40513J4460J4911J5598J7345J9843K2325K4939K8410L2640L6752M0450
$$ 540513 554973 569884 585482 602827 622670 644995 669934 698344 730984 767736 808186
62782H08186M4378M8992N3915N8671O3272O7762P1768P4871P6967P7962P7499
$$ 808186 852564 901556 955471 1014142 1077414 1145176 1216944 1291815 1368782 1446744 1524243
62771A524243P5225P0985O4550N5671M4659L2428J9656O370p313k0612l2809m3978
$$ 1524243 1599468 1670453 1735003 1790674 1835333 1867761 1887417 1893787 1886474 1865862 1833053 1789075
62759A789075n4285o2979o8984p2287p3850p4188p3039p0581o7929o5862o3816
$$ 1789075 1734790 1671811 1602827 1530540 1456690 1382502 1309463 1238882 1170953 1105091 1041275
62748A041275o0776n6643n2139m7784m3630l9682l5922l2120k8203k4641k1880
$$ 1041275 980499 923856 871717 823933 780303 740621 704699 672579 644376 619735 597855
62737E97855j9603j7143j4528j2384j0855r414p910o905o586o061m416k089m29
$$ 597855 578252 561109 546581 534197 523342 513928 506018 499113 492527 486466 482050 479961 479532
62724D79532J0P4Q89K541M131M876M917N093O023P577R288J1095J3298J5898J8410
$$ 479532 479542 479616 480505 483046 487177 492053 496970 502063 508086 515663 524951 536046 549344 565242 583652
62709E83652K0557K2740K5535K8948L2496L5860L9147M2652M6639N1270N6396
$$ 583652 604209 626949 652484 681432 713928 749788 788935 831587 878226 929496 985892
62698I85892O1489O5972O9683P2791P5399P7364P8357P7871P5320P0391O3211
$$ 985892 1047381 1113353 1183036 1255827 1331226 1408590 1486947 1564818 1640138 1710529 1773740
62687A773740N4023M2873K9946J5969J807j2222k6153l9472n1028o0085o7046
$$ 1773740 1827763 1870636 1900582 1916551 1918358 1906136 1879983 1840511 1789483 1729398 1662352
62676A662352p2774p7421q0255q0642p8847p5854p2539o9133o5422o1256n6719
$$ 1662352 1589578 1512157 1431902 1351260 1272413 1196559 1124020 1054887 989465 928209 871490
62665H71490n1972m7221m2853l9168l5855l2143k7860k3895k1183j9461j7655
$$ 871490 819518 772297 729444 690276 654421 622278 594418 570523 549340 529879 512224
62654E12224j5296j2879j0967r636q892q863r260r290q483p243o232n668n475
$$ 512224 496928 484049 473082 463446 454554 445691 436431 427141 418658 411415 405183 399515 394040
62641C94040n651o039o088n387m143k853j682n82K81O63N87K71j54n31o15m19
$$ 394040 388389 382350 376262 370875 366732 363879 362197 361615 361896 362559 363146 363417 363263 362732 362117 361698
62625C61698l23m24k24N59J263J066L11J30R01J833K260K535L284M431N451O176
$$ 361698 361375 360951 360727 361286 362549 363615 363926 364056 364957 366790 369050 371585 374869 379300 384751 390927
62609C90927O908P887Q989R890J0359J0584J1139J2380J3954J5308J6661J8837
$$ 390927 397835 405722 414711 424601 434960 445544 456683 469063 483017 498325 514986 533823
62597E33823K1984K5185K7701K9938L2591L5343L7226L7963L8049L7528L5622
$$ 533823 555807 580992 608693 638631 671222 706565 743791 781754 819803 857331 892953
62586H92953L1929K7306K2883J8505J2829N103l622j1359j7112k1566k5897l0255
$$ 892953 924882 952188 975071 993576 1006405 1011508 1007886 996527 979415 957849 931952 901697
62574I01697l3781l5772l6403l6262l5678l4682l3217l1225k8787k6378k4560
$$ 901697 867916 832144 795741 759479 723801 689119 655902 624677 595890 569512 544952
62563E44952k3199k1415j8711j5730j3459j2018j0823r610q565p638o504n243
$$ 544952 521753 500338 481627 465897 452438 440420 429597 419987 411422 403784 397280 392037
62551C92037m313l761l161k487k244k503k549j939j196q42m52O06J939K576K372
$$ 392037 387724 383963 380802 378315 376071 373568 371019 369080 367884 367042 366590 367196 369135 371711 374083
62536C74083K129K350K648K554K260K311K972M112N338O233O763P428Q759J0687
$$ 374083 376212 378562 381210 383764 386024 388335 391307 395419 400757 406990 413753 421181 429940 440627
62522D40627J2855J5292J8207K1226K3652K5528K7673L0451L3300L5818L8398
$$ 440627 453482 468774 486981 508207 531859 557387 585060 615511 648811 684629 723027
62511G23027M1281M3716M4825M4668M3696M1645L7945L2883K7338K1515J4874
$$ 723027 764308 808024 852849 897517 941213 982858 1020803 1053686 1081024 1102539 1117413
62500A117413P336l59p630j4473k0662k5393k8252k9830l0870l1290l0567k8629
$$ 1117413 1124749 1124390 1116760 1102287 1081625 1056232 1027980 998150 967280 935990 905423 876794
62488H76794k5841k2437j8588j4745j1359q272m932j167K615N996Q941J1525J3644
$$ 876794 850953 828516 809928 795183 783824 775552 770620 769453 772068 778064 787005 798530 812174
62475H12174J5113J5895J6014J5384J3854J1381Q109M225j46m905r831j4637j9190
$$ 812174 827287 843182 859196 874580 888434 899815 907924 912149 912003 907098 897267 882630 863440
62462H63440k3467k7184k9836l1370l2483l3711l4382l3295l0504k7592k5823
$$ 863440 839973 812789 782953 751583 719100 685389 651007 617712 587208 559616 533793
62451E33793k4673k2798j9867j6794j4417j2761j1421j0030q325o291m338k928
$$ 533793 509120 486322 466455 449661 435244 422483 411062 401032 392707 386416 382078 379150
62439C79150j988j041J01J234K176K832K927K286J386R97J092P45n92k292l402
$$ 379150 377162 376121 376222 377456 379632 382464 385391 387677 389063 390060 391152 391897 391305 389013 385611
62424C85611l801l981m166m258m372m746n161n017m167l149k494k168j955j977
$$ 385611 381810 377829 373663 369405 365033 360287 355126 350109 345942 342793 340299 338131 336176 334199
62410C34199k465l186l507l108k341j697j217o53j29j46q06j378j070q7N57L60
$$ 334199 331734 328548 325041 321933 319592 317895 316678 316025 315896 315750 314944 313566 312496 312409 312966 313326
62394C13326p1N1N85P88M97L89J035K209L284L851L740K871J618R70J731L512
$$ 313326 313255 313306 313891 314679 315176 315565 316600 318809 322093 325944 329684 332555 334173 335143 336874 340386
62378C40386N074N764O131O941Q139R141R714J0003J0060R967J0283J1553J3423
$$ 340386 345460 351224 357355 364296 372435 381576 391290 401293 411353 421320 431603 443156 456579
62365D56579J4939J5890J7156J9413K2279K5155K8224L1887L5771L9215M2423
$$ 456579 471518 487408 504564 523977 546256 571411 599635 631522 667293 706508 748931
62354G48931M6165N0396N4001N6095N6794N6415N4651N0897M4974L7215K8223
$$ 748931 795096 845492 899493 955588 1012382 1068797 1123448 1174345 1219319 1256534 1284757
62343A284757J8831R896J746n904j3307k0317k6736l2573l7677m1684m4653m7165
$$ 1284757 1303588 1313484 1315230 1309326 1296019 1275702 1248966 1216393 1178716 1137032 1092379 1045214
62331A045214m9272m9961m8354m5055m1419l7840l3736k9150k5211k2670k0872
$$ 1045214 995942 945981 897627 852572 811153 773313 739577 710427 685216 662546 641674
62320F41674j8846j6672j5150j4605j4733j5260j6000j6393j5835j4534j3403
$$ 641674 622828 606156 591006 576401 561668 546408 530408 514015 498180 483646 470243
62309D70243j2894j2502j1656j0539r659r005q199p201o370n807n206m348l445
$$ 470243 457349 444847 433191 422652 412993 403988 395789 388588 382218 376411 371205 366857 363412
62296C63412k770k267j707j015l74m4j36m21l91K65J241J949K262K602L195L712
$$ 363412 360642 358375 356668 355653 355279 355235 355099 354678 354287 354552 355793 357742 360004 362606 365801 369513
62280C69513L877M013M594N500O160O299O139N967N899O035O459P068P696Q424
$$ 369513 373390 377403 381997 387497 393657 399956 406095 412062 417961 423996 430455 437523 445219 453643
62266D53643R476J0881J2474J4266J6462J9137K2174K5507K9140L2965L6885M1047
$$ 453643 463119 474000 486474 500740 517202 536339 558513 584020 613160 646125 683010 724057
62254G24057M5604N0277N4539N8086O0684O1633O0111N6099N0396M3522L5259
$$ 724057 769661 819938 874477 932563 993247 1054880 1114991 1171090 1221486 1265008 1300267
62243A300267K5602J5428N766l100j1324j8891k5835l2594l9337m5315m9582n2205
$$ 1300267 1325869 1341297 1347063 1343963 1332639 1313748 1287913 1255319 1215982 1170667 1121085 1068880
62231A068880n3968n5063n4883n3203n0693m7984m4875m0970l6560l2431k8953
$$ 1068880 1014912 959849 904966 851763 801070 753086 708211 667241 630681 598250 569297
62220E69297k5802k2457j8778j5171j2409j1091j1062j1440j1366j0648r586q359
$$ 569297 543495 521038 502260 487089 474680 463589 452527 441087 429721 419073 409487 401128
62208D01128o880n273m108l893m380m659m034k704j362l95K79P51R58J092J615
$$ 401128 394248 388975 384867 380974 376594 371935 367901 365197 363835 363440 363719 364470 365428 366520 368135
62193C68135K634L672M386N166O485Q016Q959R156R288R913J0843J1573J1867
$$ 368135 370769 374441 378827 383993 390478 398494 407453 416609 425897 435810 446653 458226 470093
62180D70093J1715J1133J0226R295Q590Q138P851P702P787Q417J0031J2643J5506
$$ 470093 481808 492941 503167 512462 521052 529190 537041 544743 552530 560947 570978 583621 599127
62167E99127J7843J9926K2903K7308L2295L6702M0276M3376M5882M7126M6702
$$ 599127 616970 636896 659799 687107 719402 756104 796380 839756 885638 932764 979466
62156I79466M4759M1448L6705L0680K3920J6992J0168L611k516q268j3902j9423
$$ 979466 1024225 1065673 1102378 1133058 1156978 1173970 1184138 1187749 1185233 1176965 1163063 1143640
62144A143640k4456k8725l2372l5507l7797l8827l8673l7656l5753l2792k9187
$$ 1143640 1119184 1090459 1058087 1022580 984783 945956 907283 869627 833874 801082 771895
62133G71895k5807k2937j9957j6399j2779r844p440m780j674J217L236M193L997
$$ 771895 746088 723151 703194 686795 674016 664172 656732 651952 650278 651495 654731 658924 662921
62120F62921K634P54n07p25o24r37j347j173n81l84r69k086l565n416p304q636
$$ 662921 665555 666309 665802 665077 664453 663516 662169 660996 660415 660031 659062 656976 653411 647995 640691 632055
62104F32055r280r531r357q314o400m325k632j144M10J827K842L663M520N123
$$ 632055 622775 613244 603887 595573 589173 584848 582216 581072 581482 583309 586151 589814 594334 599457
62090E99457N169N070N558O656P642Q087Q382R127J0400J1841J3104J4030J4633
$$ 599457 604626 609696 615254 621910 629552 637639 646021 655148 665548 677389 690493 704523 719156
62077G19156J5180J6120J7587J9092K0048K0512K1096K2010K2629K2359K1622
$$ 719156 734336 750456 768043 787135 807183 827695 848791 870801 893430 915789 937411
62066I37411K1430K2052K2767K3094K3576K4930K6915K8633K9602K9797K8938
$$ 937411 958841 980893 1003660 1026754 1050330 1075260 1102175 1130808 1160410 1190207 1219145
62055A219145K6555K2810J8496J4038R146L597k262q067j3858j9667k5235l0453
$$ 1219145 1245700 1268510 1287006 1301044 1310190 1313787 1311525 1303458 1289600 1269933 1244698 1214245
62043A214245l5493m0191m3842m6123m7533m8453m8325m6515m3453m0147l6939
$$ 1214245 1178752 1138561 1094719 1048596 1001063 952610 904285 857770 814317 774170 737231
62032G37231l3636l0473k7977k5902k3352k0087j6890j4429j2527j0803r304q139
$$ 737231 703595 673122 645145 619243 595891 575804 558914 544485 531958 521155 511851 503712
62020E03712p166o373o045o159o200n970n976o543p096o915o161n476m887l853
$$ 503712 496546 490173 484128 477969 471769 465799 459823 453280 446184 439269 433108 427632 422745 418892
62006D18892k240m82J135K768M455N861O743P177P264O991O514O091N566M401
$$ 418892 416652 416170 417305 420073 424528 430389 437132 444309 451573 458564 465078 471169 476735 481136
61992D81136K494N83n55j056j681k804m059m985n613o370p556q996j0127j0416
$$ 481136 483630 484213 483658 482602 480921 478117 474058 469073 463460 457090 449534 440538 430411 419995
61978D19995r870r025q346p703o694n381m357m022m094l983l478k816k318k115
$$ 419995 410125 401100 392754 385051 378357 372976 368619 364597 360503 356520 353042 350226 347908 345793
61964C45793k144k127j706q59j26j21p44j192q38J41J129J773K100K226K376L006
$$ 345793 343649 341522 339816 338957 338831 338710 337966 336774 335936 336077 337206 338979 341079 343305 345681 348687
61948C48687M426O270P727Q482R054J0033J1318J2452J3446J4844J6954J9402
$$ 348687 353113 359383 367110 375592 384646 394679 405997 418449 431895 446739 463693 483095
61936D83095K1480K2714K3091K3020K3071K3439K3562K2587K0409J7944J6190
$$ 483095 504575 527289 550380 573400 596471 619910 643472 666059 686468 704412 720602
61925G20602J5188J4106J2175R286N942K855M46j507l627o064q107q906q347o877
$$ 720602 735790 749896 762071 771357 777299 780154 780600 779093 775466 769402 761295 752389 744042 737165
61911G37165m779k092R37L980P088J0375J3310J5117J5893J6529J7260J7155J5468
$$ 737165 732386 730294 731231 735211 742299 752674 765984 781101 796994 813523 830783 847938 863406
61898H63406J2560Q986M571p46n988j0125j3500j7087k0668k2988k3671k3731
$$ 863406 875966 884952 889523 888777 882789 872664 859164 842077 821409 798421 774750 751019
61886G51019k3999k4204k3891k3240k2392k0930j8677j6374j4856j4045j3283
$$ 751019 727020 702816 678925 655685 633293 612363 593686 577312 562456 548411 535128
61875E35128j2258j1134j0129r385q842p956o081l500j476p34m79M50K085L686
$$ 535128 522870 511736 501607 492222 483380 475424 469343 465843 464367 463633 463154 463604 465689 469375
61861D69375N082O705Q583J0319J1944J3923J6258J8499K0638K3250K6400K9245
$$ 469375 474457 481162 489745 500064 512008 525931 542189 560688 581326 604576 630976 660221
61849F60221L1020L1893L2563L3442L4499L5443L5779L5048L3256L0760K7592
$$ 660221 691241 723134 755697 789139 823638 859081 894860 929908 963164 993924 1021516
61838A021516K3266J7478J0648L628k828q174j2104j4733j6399j7071j6263j3746
$$ 1021516 1044782 1062260 1072908 1076536 1073708 1065534 1053430 1038697 1022298 1005227 988964 975218
61826I75218j0029n870j679K417O242R618J2393J4158J4269J2517R419N552Q28
$$ 975218 965189 959319 957640 960057 966299 975917 988310 1002468 1016737 1029254 1038673 1044225 1045053
61813A045053n099j1961j8891k5176l0521l4746l7684l9445m0285m0190l8975
$$ 1045053 1039954 1027993 1009102 983926 953405 918659 880975 841530 801245 761055 722080
61802G22080l6860l4493l2256k9911k7140k4108k1218j8605j6200j4062j2340
$$ 722080 685220 650727 618471 588560 561420 537312 516094 497489 481289 467227 454887
61791D54887j0974r819q961q614q580q245p288o156n455n092m374l018j622r53
$$ 454887 443913 434094 425133 416519 407939 399694 392406 386250 380795 375703 371329 368311 366689 365736
61777C65736j048j278j125n64J56P98J180J292J402J760K148J970J017j55q45
$$ 365736 364688 363410 362285 361721 361877 362675 363855 365147 366549 368309 370457 372427 373444 373289 372444
61762C72444r55q47o66k30M06P56N08L5qM93J049J211R95O33J89l42p92r94j056
$$ 372444 371489 370642 369976 369746 370152 370908 371416 371451 371443 371936 372985 374196 375191 375824 376013 375671 374879 373885 372829
61743C72829j204j370j223o80p8K74M95Q92J445J780J605J077P10R02J465J724
$$ 372829 371625 370255 369032 368352 368274 368548 369043 369935 371380 373160 374765 375842 376552 377454 378919 380643
61727C80643J263N60N26J417K590L403L932M492M954N022M794M565M231L546K783
$$ 380643 381906 382466 382992 384409 386999 390402 394334 398826 403780 408802 413596 418161 422392 425938 428721
61712D28721K508K755K917K635K139J592O59r79l021m808n925o395o499o558o669
$$ 428721 431229 433984 436901 439536 441675 443267 443926 442947 439926 435118 429193 422798 416299 409741 403072
61697D03072o585o057n323m874m711m302l464k796k899l515l832l440k669k103
$$ 403072 396487 390430 385107 380233 375522 371220 367756 364960 362061 358546 354714 351274 348605 346502
61683C46502k007k132j921j154l77l96j278k247k749k967l048k528j127L31P16
$$ 346502 344495 342363 340442 339288 338911 338515 337237 334990 332241 329274 326226 323698 322571 322902 323618
61668C23618J1p22p71l88j1K85M23J15n36q24l37M08O86N99Q30J497J899J528
$$ 323618 323629 322907 322136 321748 321737 322022 322445 322560 322024 321200 320863 321271 321957 322556 323386 324883 326782 328310
61650C28310Q35O93J343K225K779L077L528M218M782M917M698M350L910L335K752
$$ 328310 329145 329838 331181 333406 336185 339262 342790 347008 351790 356707 361405 365755 369665 373000 375752
61635C75752K361K089J561N47p40j863k600l040l323l447l448l533l867m266m303
$$ 375752 378113 380202 381763 382310 381570 379707 377107 374067 370744 367297 363849 360316 356449 352183 347880
61620C47880l783k873j727l24J136K069K143J863J919K140J664K42j301k106k264
$$ 347880 344097 341224 339497 339173 340309 342378 344521 346384 348303 350443 352107 352349 351048 348942 346678
61605C46678k452l020l839m682n355n674n593n213m572l732l196l639m851n593
$$ 346678 344226 341206 337367 332685 327330 321656 316063 310850 306278 302546 299350 295711 290860 285267
61591B85267n024l871l505m179m878m727l844k868k304k292k509k335j666j330
$$ 285267 280243 276372 272867 268688 263810 259083 255239 252371 250067 247775 245266 242931 241265 239935
61577B39935k062l210l372k337j465j773k606k706j899j049p56q30q34n77j65
$$ 239935 237873 234663 231291 228954 227489 225716 223110 220404 218505 217456 216700 215870 215036 214459 214294
61562B14294J18M0k27k58o6k32j009j688j395k90O41Q85R36J472K462L259L315
$$ 214294 214412 214452 214225 213967 213901 213669 212660 210972 209577 209287 209928 210813 211749 213221 215683 218942 222257
61545B22257K610J603Q34M55R9o32j584k109j755o81N22J346J604J450J222J172
$$ 222257 224867 226470 227304 227759 227858 227226 225642 223533 221778 221097 221619 222965 224569 226019 227241 228413
61529B28413J272J297J088O70J32m46r75j369j642j894k114k116j800j403j295
$$ 228413 229685 230982 232070 232740 232872 232426 231451 230082 228440 226546 224432 222316 220516 219113 217818
61514B17818j483j521j121o63p73j408j802j507j071j238j779j720p65J64N0r22
$$ 217818 216335 214814 213693 213030 212257 210849 209047 207540 206469 205231 203452 201732 200967 201131 201181 200259
61498B00259j604j262l43J99M8k37j28M3m32j375j607m63J078J473N43m59o12
$$ 200259 198655 197393 197050 197249 197297 197060 196932 196975 196543 195168 193561 193098 194176 195649 196192 195733 195121
61481A95121j94L37J140K246K851K239R18M3K6L68O89J044J377J388J027N75J87
$$ 195121 194927 195264 196404 198650 201501 203740 204658 204701 204727 205095 205784 206828 208205 209593 210620 211195 211382
61464B11382j28j33L66Q77O17k73o73L5J054J270O59M7o1K33P94J494J860J408
$$ 211382 211254 211121 211487 212364 212981 212708 212035 212070 213124 214394 215053 215100 215039 215272 216066 217560 219420 220828
61446B20828M73L7N45J326J548J206Q52P26O57O16Q21J323J929K540L185L681
$$ 220828 221301 221338 221883 223209 224757 225963 226815 227541 228198 228814 229635 230958 232887 235427 238612 242293
61430B42293L724L466L459L738L474K102M33j10O94J605J622J155J157J688K007
$$ 242293 246017 249483 252942 256680 260154 262256 262689 262579 263273 264878 266500 267655 268812 270500 272507
61415B72507J692J051N67M73P99J326J544J056N7r57j851k734l343l190k507k239
$$ 272507 274199 275250 275817 276290 277089 278415 279959 281015 281072 280115 278264 275530 272187 268997 266490 264251
61399B64251k770l271k869j917j410j501j433r04n89r95j578j492q00l24m30o37
$$ 264251 261481 258210 255341 253424 252014 250513 249080 248176 247587 246592 245014 243522 242722 242398 241968 241331
61383B41331m43n4L4j69j47M19J156J360P86J0o8Q75K211K973K796K100J439R48
$$ 241331 240888 240834 240868 240699 240552 240971 242127 243487 244273 244283 244215 245090 247301 250274 253070 255170 256609 257557
61365B57557N89N28R62J707K351K823L424M260M969N186N013M838M884N125N502
$$ 257557 258146 258674 259636 261343 263694 266517 269941 274201 279170 284356 289369 294207 299091 304216 309718
61350C09718N959O321O412O244N987N743N479N150M765M389M144M151M455M983
$$ 309718 315677 321998 328410 334654 340641 346384 351863 357013 361778 366167 370311 374462 378917 383900
61336C83900N656O336O670O215M938L425K316J630R38R0o64j248k041l241m294
$$ 383900 389556 395892 402562 408777 413715 417140 419456 421086 422024 422114 421450 420202 418161 414920 410626
61321D10626m398l535k590k321k515k412j748r53l76J64Q97J601K044K535L520
$$ 410626 406228 402693 400103 397782 395267 392855 391107 390154 389778 389942 390839 392440 394484 397019 400539
61306D00539M733N374N188M773M680M760M645M314L731K518N56j433k498k534
$$ 400539 405272 410646 415834 420607 425287 430047 434692 439006 442737 445255 445811 444378 441880 439346
61292D39346k187j940j781j677j707j745j604j487j775k368k753k799k840k907
$$ 439346 437159 435219 433438 431761 430054 428309 426705 425218 423443 421075 418322 415523 412683 409776
61278D09776k499j418k10N57R50J309J746K334L262M323M729M080L146L053L890
$$ 409776 407277 405859 405649 406206 407156 408465 410211 412545 415807 420130 424859 428939 432085 435138 439028
61263D39028M797N261N586O047O357O262O066O169O392O245N627M919M382L892
$$ 439028 443825 449086 454672 460719 467076 473338 479404 485573 491965 498210 503837 508756 513138 517030
61249E17030L339L033L437M506N506N564M366K331J97j426k334k777l291m223
$$ 517030 520369 523402 526839 531345 536851 542415 546781 549112 549309 547883 545549 542772 539481 535258
61235E35258n386o273o614o515o128n507m793m205l738l198k625k301k186j815
$$ 535258 529872 523599 516985 510470 504342 498835 494042 489837 486099 482901 480276 477975 475789 473974
61221D73974r65k8O26J201J961K608K835L044L832M894N241M547L532K885K567
$$ 473974 473009 472981 473607 474808 476769 479377 482212 485256 489088 493982 499223 503770 507302 510187 512754
61206E12754K357K432K917L458L662L663L835M300N078O349Q083R744J0859J1656
$$ 512754 515111 517543 520460 523918 527580 531243 535078 539378 544456 550805 558888 568632 579491 591147
61192E91147J2546J3206J2816J1288R614Q713Q425P967P012N966N331N178N227
$$ 591147 603693 616899 629715 641003 650617 659330 667755 675722 682734 688700 694031 699209 704436
61179G04436N173M863M303L608K909K289J831J608J511J185L61p35j459j496j433
$$ 704436 709609 714472 718775 722383 725292 727581 729412 731020 732531 733716 734077 733342 731883 730387 728954
61164G28954k267m236o387p592p865q276r520j0967j1466j0779r758r121q579
$$ 728954 726687 722451 716064 708472 700607 692331 682811 671844 660378 649599 639841 630720 622141
61151F22141p454n856m802n109o484p885q666r126r901j1020j1795j1657j0849
$$ 622141 614687 608831 604029 598920 592436 584551 575885 566759 556858 545838 534043 522386 511537
61138E11537j0123r752r193p804n711l720k411j645r79k62L92R88J761K877M300
$$ 511537 501414 491662 482469 474665 468954 465234 462823 461178 460199 459937 460329 461317 463078 465955 470255
61123D70255N895P496Q850R812J0610J1687J3243J5146J7281J9634K1874K3340
$$ 470255 476150 483646 492496 502308 512918 524605 537848 552994 570275 589909 611783 635123
61111F35123K3801K3980K4793K6190K7155K6856K5430K3643K2115K0951J9774
$$ 635123 658924 682904 707697 733887 761042 787898 813328 836971 859086 880037 899811
61100H99811J7996J5312J2079Q986O323L779J065j639m030o171q320j0505j2505
$$ 899811 917807 933119 945198 954184 960507 964286 965351 963712 959682 953511 945191 934686 922181
61087I22181j4105j5193j5728j5930j6328j7333j8711j9687j9670j8790j7714
$$ 922181 908076 892883 877155 861225 844897 827564 808853 789166 769496 750706 732992
61076G32992j7016j6684j6137j4826j2838j0876r593r015q682q150p219n886m283
$$ 732992 715976 699292 683155 668329 655491 644615 635022 626007 617325 609175 601956 596070 591787
61063E91787k625j058M06J710K697L311L786M437N377O538P809R054J0138J1152
$$ 591787 589162 588104 588510 590220 592917 596228 600014 604451 609828 616366 624175 633229 643367 654519
61049F54519J2369J3798J5011J5776J6609J8286K0868K3632K5959K7863K9704
$$ 654519 666888 680686 695697 711473 728082 746368 767236 790868 816827 844690 874394
61038H74394L1748L4186L7093M0272M3361M6207M8854N1183N2976N4422N6144
$$ 874394 906142 940328 977421 1017693 1061054 1107261 1156115 1207298 1260274 1314696 1370840
61027A370840N8572O1700O5652P0920P7694Q5383R3353J01888J12043J24864J41312
$$ 1370840 1429412 1491112 1556764 1627684 1705378 1790761 1884114 1986002 2098045 2222909 2364221
61016B364221J62733J90796K26802K71368L24722L86959M58098N38681O31474
$$ 2364221 2526954 2717750 2944552 3215920 3540642 3927601 4385699 4924380 5555854
61007E555854P43534Q85907J066661J276213J474138J594338J575839J401124
$$ 5555854 6299388 7185295 8251956 9528169 11002307 12596645 14172484 15573608
60999A5573608J109939P75458M65474K22577O9960J8311N4255J25003J49792O2465
$$ 15573608 16683547 17459005 17924479 18147056 18217016 18235327 18289582 18414585 18564377 18626842
60989A8626842j48486m38453p42518j013006j228887j381086j459523j456803
$$ 18626842 18478356 18039903 17297385 16284379 15055492 13674406 12214883 10758080
60981A0758080j379673j251366j101093r51290q12995o89282n80216m85282m03793
$$ 10758080 9378407 8127041 7025948 6074658 5261663 4572381 3992165 3506883 3103090
60972C103090l35038k78274k32419j95854j66754j43486j24740j09565r7372q7625
$$ 3103090 2768052 2489778 2257359 2061505 1894751 1751265 1626525 1516960 1419588 1331963
60962A331963p9388p1473o3326n5462m8738m3342l8878l5166l2405l0535k8995
$$ 1331963 1252575 1181102 1117776 1062314 1013576 970234 931356 896190 863785 833250 804255
60951H04255k7362k5797k4604k3582k2149k0035j7560j5311j3657j2476j1301
$$ 804255 776893 751096 726492 702910 680761 660726 643166 627855 614198 601722 590421
60940E90421r882q662q394r087r683r159p795o830o977p723q236q389q540q697
$$ 590421 580539 571877 563483 554396 544713 535554 527759 520929 513952 506229 497993 489604 481064 472367
60926D72367q437p683o993o863o995o627n528m308l582l253k873k470k419k603
$$ 472367 463930 456247 449254 442391 435396 428769 423241 418933 415351 412098 409225 406755 404336 401733
60912D01733k322j314k79M1j75k99k77m75p22m08M62J092J029P09N57K87m08j094
$$ 401733 399411 398097 397818 397859 397684 397385 397108 396633 395911 395503 395965 397057 398086 398795 399352 399639 399231 398137
60894C98137j197r24r02j200j417j492j732k113k303k392k832l592m095m129m145
$$ 398137 396940 396016 395114 393914 392497 391005 389273 387160 384857 382465 379633 376041 371946 367817 363672
60879C63672m337m206l476k687k301j795m33J403K583K712K470K435K464K415
$$ 363672 359335 355129 351653 348966 346665 344870 344437 345840 348423 351135 353605 356040 358504 360919
60865C60919K712L647M680N023M668M304M313M339L928L287L101L765M891N631
$$ 360919 363631 367278 371958 376981 381649 385953 390266 394605 398533 401820 404921 408686 413577 419208
60851D19208N412M328K880J522N51J67L63P18P25K92k13n44p99j090j284j395
$$ 419208 424620 428948 431828 433350 433901 434068 434431 435149 435874 436166 435953 435409 434610 433520 432236 430841
60835D30841j804k757l819m251l909l418l370l678l756l185k117j146p66q88q93
$$ 430841 429037 426280 422461 418210 414301 410883 407513 403835 400079 396894 394777 393631 392865 391977 391084
60820C91084l07O56J391J639J705J955K395K849L340M149N491P192Q711R542R657
$$ 391084 390777 391433 392824 394463 396168 398123 400518 403367 406707 410856 416347 423539 432250 441792 451449
60805D51449R542R686J0176J0849J1644J2630J3816J5150J6572J7882J8691J8890
$$ 451449 460991 470677 480853 491702 503346 515976 529792 544942 561514 579396 598087 616977
60793F16977J8908J9171J9403J9055J8309J7948J8061J7618J5747J2886J0065
$$ 616977 635885 655056 674459 693514 711823 729771 747832 765450 781197 794083 804148
60782H04148P543M795J614j578m470p191r703j1494j2299j2750j3781j5481j6938
$$ 804148 811691 816486 818100 816522 812052 804861 795158 783664 771365 758615 744834 729353 712415
60769G12415j7291j6613j5658j5016j4771j4818j5036j5081j4469j3193j2021
$$ 712415 695124 678511 662853 647837 633066 618248 603212 588131 573662 560469 548448
60758E48448j1703j2049j2231j1953j1710j1806j1779j1134j0117r272q610p786
$$ 548448 536745 524696 512465 500512 488802 476996 465217 454083 443966 434694 426084 418298
60746D18298o844o247o162o276o290o273o382o558o586o274n632m966m728n006
$$ 418298 411454 405207 399045 392769 386479 380206 373824 367266 360680 354406 348774 343808 339080 334074
60732C34074n245m762l555k325j758j906k289k404k135j738j363p45L96J612J970
$$ 334074 328829 324067 320512 318187 316429 314523 312234 309830 307695 305957 304594 303849 304245 305857 307827
60717C07827J352Q29J289K085J890N53p07r37n09l85j003k122l238l898l968l758
$$ 307827 309179 310008 311297 313382 315272 315825 315118 314181 313672 313287 312284 310162 306924 303026 299058 295300
60701B95300l575l272k584j838j677k131k621k908l239l528l240k411j916k191
$$ 295300 291725 288453 285869 284031 282354 280223 277602 274694 271455 267927 264687 262276 260360 258169
60687B58169k513k082j105k16N10J199J495J070M20K88N48N90M42P02J373J764
$$ 258169 255656 253574 252469 252253 252763 253962 255457 256527 256947 257235 257783 258373 258815 259517 260890 262654
60671B62654J598J392J476J427Q36L6l51k35m2n6r8K10J008J975K594K669K507
$$ 262654 264252 265644 267120 268547 269383 269419 269068 268833 268791 268735 268637 268847 269855 271830 274424 277093 279600
60654B79600K438K429K363K469L008L767M277M461M579M625M270L455K607K117
$$ 279600 282038 284467 286830 289299 292307 296074 300351 304812 309391 314016 318286 321741 324348 326465
60640C26465J956J873J608R33j57j238j844k066k465l309m270m866m813l990k637
$$ 326465 328421 330294 331902 332835 332678 331440 329596 327530 325065 321756 317486 312620 307807 303817 301180
60625C01180j572j600k448k841k041p58k03n98j177j304j037p19n53o19r07j185
$$ 301180 299608 298008 295560 292719 290678 289920 289717 289119 287942 286638 285601 284882 284329 283710 282803 281618
60609B81618j155q52p50j254k159k720k351j276l22p3k94l80j80l5j37k33j38
$$ 281618 280463 279611 278861 277607 275448 272728 270377 269101 268779 268706 268412 268032 267852 267817 267680 267447 267309
60592B67309q4l40p91j093j119q93l75L77R48Q75K88o4L83J385K209K514K622
$$ 267309 267225 266885 266094 265001 263882 262989 262614 262991 263939 264814 265102 265038 265421 266806 269015 271529 274151
60575B74151K974L591M238M880N656O491P138P593Q109Q697Q989Q767Q163P118
$$ 274151 277125 280716 284954 289834 295490 301981 309119 316712 324821 333518 342507 351274 359437 366555
60561C66555N156K236o25k243k625k856l657m719n386n399m814l718k282p01J015
$$ 366555 371711 373947 373322 371079 368454 365598 361941 357222 351836 346437 341623 337905 335623 334922 335937
60546C35937K837M349N075N173N300N724O069O089N986N831N243M016K571J357
$$ 335937 338774 343123 348198 353371 358671 364395 370464 376553 382539 388370 393613 397629 400200 401557
60532D01557K91q52j900k501k571k194j416n01Mj93p79j322j768k194k492k582
$$ 401557 401848 400996 399096 396595 394024 391830 390414 389913 389917 389724 388945 387623 385855 383661 381169 378587
60516C78587k559k337j554k13J061J821K377L151L940M446N027O249Q000R798
$$ 378587 376028 373691 372137 371924 372985 374806 377183 380334 384274 388720 393747 399996 407996 417794
60502D17794J1668J3978J6648J9288K1993K5126K8271L0317L0727K9997K8600
$$ 417794 429462 443440 460088 479376 501369 526495 554766 585083 615810 645807 674407
60491F74407K6155K2028J6242R398K052n535j3224k0701k7248l1796l3707l3488
$$ 674407 700562 722590 738832 748230 750282 744747 731523 710822 683574 651778 618071 584583
60479E84583l2311l0746k8486k5438k2403k0240j8773j7107j4853j2540j0830
$$ 584583 552272 521526 493040 467602 445199 424959 406186 389079 374226 361686 350856
60468C50856r699q592p184n798m970m714m482l894l206k842k736k518k162j971
$$ 350856 341157 332565 325381 319583 314613 309899 305417 301523 298317 295475 292739 290221 288059 286088
60454B86088k074k347k793l413l754l233k077j284j326j440p05O16J434J244O23
$$ 286088 284014 281667 278874 275461 271707 268474 266397 265113 263787 262347 261642 262258 263692 264936 265559
60439B65559L17L71L27m1m77o87q67j588l038m495m854l751j966n42K74J033K176
$$ 265559 265876 266247 266574 266533 266056 265369 264502 262914 259876 255381 250527 246776 244810 244268 244542 245575 247751
60422B47751L398L941L436K304J380J091J160J064O58J79j48k89l24m14p25j055
$$ 247751 251149 255090 258526 260830 262210 263301 264461 265525 266183 266362 266214 265925 265601 265187 264462 263407
60406B63407p89L60J686K128J641J263J703K428K544K025J557J515J724J961K184
$$ 263407 262618 262978 264664 266792 268433 269696 271399 273827 276371 278396 279953 281468 283192 285153 287337
60391B87337K256J983J505J254J405J674J741J669J693J751J496Q10J24k8L32
$$ 287337 289593 291576 293081 294335 295740 297414 299155 300824 302517 304268 305764 306574 306698 306670 307002
60376C07002O01M36K48O51J498K018J865J506J439J529J424J241J328J650J834
$$ 307002 307603 308039 308287 308938 310436 312454 314319 315825 317264 318793 320217 321458 322786 324436 326270
60361C26270J759J663J679J656J459J237J235J573K186K925L721M695O007P466
$$ 326270 328029 329692 331371 333027 334486 335723 336958 338531 340717 343642 347363 352058 358065 365531
60347C65531Q487Q625Q037P183O181M696K437m31l323n490o393o133n527n433
$$ 365531 374018 382643 390680 397863 404044 408740 411177 410746 407423 401933 395540 389407 383880 378447
60333C78447n931o382o203n338m052k699j790j804k612l352l295k661k266k409
$$ 378447 372516 366134 359931 354593 350541 347842 346052 344248 341636 338284 334989 332328 330062 327653
60319C27653k556k109j125q7P03J276J675J887K039K359K886L506M345N780P797
$$ 327653 325097 322988 321863 321776 322479 323755 325430 327317 329356 331715 334601 338107 342452 348232 356029
60304C56029R628J0479J0522J0713J1507J2195J1743R966P514M924K144r75m106
$$ 356029 365657 376136 386658 397371 408878 421073 432816 442782 450296 455220 457364 456389 452283
60291D52283o635q292r323j0043j0383j0077r238q501q329q379p835o452m875
$$ 452283 445648 437356 428033 417990 407607 397530 388292 379791 371462 363083 355248 348796 343921
60278C43921l790l151k532j962j855k155k229j766j308j483k036k156j635j134
$$ 343921 340131 336980 334448 332486 330631 328476 326247 324481 323173 321690 319654 317498 315863 314729
60264C14729j247j775k216k509k926l419l541k980j878o57K47N30K52p5L2M54
$$ 314729 313482 311707 309491 306982 304056 300637 297096 294116 292238 291581 291828 292358 292610 292535 292567 293021
60248B93021P15P61R92J427J468Q19J27K10J017J874K423K699K580J885J002O91
$$ 293021 293736 294497 295489 296916 298384 299203 299330 299540 300557 302431 304854 307553 310133 312018 313020 313711
60232C13711J136J712J814J433Q06J09l23n2Q77J802K215K230K086J662R46M89
$$ 313711 314847 316559 318373 319806 320612 320721 320398 320346 321223 323025 325240 327470 329556 331218 332164 332653
60216C32653Q25J668K259K349K345K519K652K546K428K627L153L794M453N097
$$ 332653 333478 335146 337405 339754 342099 344618 347270 349816 352244 354871 358024 361818 366271 371368
60202C71368N517N414M800M169M035M362M610M400L931L561L281K853K270J736
$$ 371368 376885 382299 387099 391268 395303 399665 404275 408675 412606 416167 419448 422301 424571 426307
60188D26307J276Q02N14O91J022P10n24j995k922l288l546l808l809l481l150
$$ 426307 427583 428385 428899 429590 430612 431322 430798 428803 425881 422593 419047 415239 411430 407949 404799
60173D04799l183l636m154m125l221j897j062j098j538j841k005k104j803q77
$$ 404799 401616 397980 393826 389701 386480 384583 383521 382423 380885 379044 377039 374935 373132 372255
60159C72255J42N81N83Q16J320J420Q61L22N64J506K445K856K705K282J906J731
$$ 372255 372397 372978 373561 374377 375697 377117 377978 378300 378864 380370 382815 385671 388376 390658 392564 394295
60143C94295J661J503J239J090J362K274L695M963N266M516L568L219L294L147
$$ 394295 395956 397459 398698 399788 401150 403424 407119 412082 417348 421864 425432 428651 431945 435092
60129D35092K765K591K509J860O49j67m3K87j37j061j359n58O34J351J432J200
$$ 435092 437857 440448 442957 444817 445466 445299 445256 445543 445406 444345 442986 442428 443062 444413 445845 447045
60113D47045Q55M46J40J71N29R15J018P64K69l37r39j387j558j562j711k118k463
$$ 447045 447900 448346 448486 448657 449186 450101 451119 451883 452152 451815 450876 449489 447931 446369 444658 442540 440077
60096D40077k332j753j281j399j997k478k322j529n45J70M97O33Q07J092J464
$$ 440077 437745 435992 434711 433312 431315 428837 426515 424986 424441 424611 425108 425741 426548 427640 429104
60081D29104J913K410K822K895K405J417M54J98P21J180O15r25k474l336l756
$$ 429104 431017 433427 436249 439144 441549 442966 443420 443618 444339 445519 446134 445209 442735 439399 435643
60066D35643m222m682m802m601m395m285m181m107m117m082l933l905m138m215
$$ 435643 431421 426739 421937 417336 412941 408656 404475 400368 396251 392169 388236 384331 380193 375978
60052C75978l575k308j045j50M89R69J155J064J007J165J408J689K226L157M228
$$ 375978 372403 370095 369050 368900 369389 370358 371513 372577 373584 374749 376157 377846 380072 383229 387457
60037C87457N027N319N127M620M090L755L518L027K037O28q92k188l055l560l952
$$ 387457 392484 397803 402930 407550 411640 415395 418913 421940 423977 424605 423713 421525 418470 414910 410958
60022D10958m331m625m945n686o900p885p862o883n679m748m091l671l557l616
$$ 410958 406627 402002 397057 391371 384471 376586 368724 361841 356162 351414 347323 343652 340095 336479
60008C36479l569l317k827j861m07P99R62M25L22Q66R43j80j564j789q19J02K06
$$ 336479 332910 329593 326766 324905 324498 325297 326259 326684 327006 327872 328815 328635 327071 325282 324463 324565 324771
59991C24771k2K09R23J578J914K172K519K606K076J303J186J985K840K880K346
$$ 324771 324749 324958 325881 327459 329373 331545 334064 336670 338746 340049 341235 343220 346060 348940 351286
59976C51286K053K104J958J562J395J379P64n42j536j463q03l38o0L31N19R2m93
$$ 351286 353339 355443 357401 358963 360358 361737 362501 361959 360423 358960 358157 357819 357759 358090 358609 358701 358208
59959C58208m01L13P36L23n43j215j375j047n16k73n67j013j074q48r20j442j902
$$ 358208 357807 358120 358856 359179 358636 357421 356046 354999 354483 354210 353643 352630 351556 350708 349788 348346 346444
59942C46444j866j513j226j077r58r17j060j247j227j064j197j868k584k509j454
$$ 346444 344578 343065 341839 340762 339804 338887 337827 336580 335353 334289 333092 331224 328640 326131 324677
59927C24677k33K51O6o3J58L49K86L25Q25J655K496L111L180K534J790K037L411
$$ 324677 324444 324695 324761 324698 324856 325205 325491 325816 326641 328296 330792 333903 337083 339617 341407 343444 346855
59910C46855M630M527L512K844K933L237L445L791M238M237L497K395J398N42
$$ 346855 351485 356012 359524 362368 365301 368538 371983 375774 380012 384249 387746 390141 391539 392081
59896C92081l21j139j623j492p51J07M29J96K35J174K473L034K632K098K151K702
$$ 392081 391760 390621 388998 387506 386755 386862 387291 387487 387722 388896 391369 394403 397035 399133 401284 403986
59880D03986L408M232N114N597N253M293L404K928K446J315m14j851k259k014
$$ 403986 407394 411626 416740 422337 427590 431883 435287 438215 440661 441976 441562 439711 437452 435438
59866D35438k129k874l453l305k933k958l009k278p84P34J914L033M304N602O780
$$ 435438 433309 430435 426982 423677 420744 417786 414777 412499 411715 412449 414363 417396 421700 427302 434082
59851D34082P573P345N737L502J898J243Q14J31m62p11j016j775k816l877m973
$$ 434082 441655 449000 454737 458239 460137 461380 462194 462325 461863 461152 460136 458361 455545 451668 446695
59836D46695n993o510o388o061n847n455m512l156j798p55l26o93j394j523q86
$$ 446695 440702 434192 427804 421743 415896 410441 405929 402773 400975 400220 399894 399201 397807 396284 395398
59821C95398m04q72j829k318k287k488l220l942m094l701l071k435j939j558r94
$$ 395398 394994 394122 392293 389975 387688 385200 381980 378038 373944 370243 367172 364737 362798 361240 360246
59806C60246m4R12J183O18k03p49j112j546j834j600j063j000j760k775l330l516
$$ 360246 360202 361114 362297 362915 362712 361963 360851 359305 357471 355871 354808 353808 352048 349273 345943 342427
59790C42427l918m524m608l816k771k234k134j904j405r01m55K3K54j32q15r80
$$ 342427 338509 333985 329377 325561 322790 320556 318422 316518 315113 314212 313757 313780 314034 313902 313087 312107
59774C12107l87L29O20O88J030J734K461K747K312J379P36R28J538J794J742J961
$$ 312107 311720 312049 312669 313357 314387 316121 318582 321329 323641 325020 325756 326684 328222 330016 331758 333719
59758C33719K316K039J250J108J971K650K228J543J788K693L279L652M539N525
$$ 333719 336035 338074 339324 340432 342403 345053 347281 348824 350612 353305 356584 360236 364775 370300
59744C70300N358L991K831K729K961K660K053J727J602J330J081J151J290J059
$$ 370300 375658 379649 382480 385209 388170 390830 392883 394610 396212 397542 398623 399774 401064 402123
59730D02123N22P0j92l83m39k28O1Pn06j100j212n70N22J335J373R06O06O54P17
$$ 402123 402645 402715 402523 402140 401701 401473 401534 401541 401035 399935 398723 398153 398675 400010 401383 402289 402895 403549 404266
59711D04266O93Q87J246J145L57l74l52K1p3n70p57m81k13o2K75O06L20l70m31
$$ 404266 404959 405846 407092 408237 408594 408220 407868 407889 407816 407246 406489 406008 405795 405733 406008 406614 406934 406564 406133
59692D06133L20O43k51j244r03K81O09k01o40J98J297J252L0j463k638l304l203
$$ 406133 406453 407096 406845 405601 404698 404979 405588 405387 404747 404945 406242 407494 407524 406061 403423 400119 396916
59675C96916k402j675j686k139k403k582l131l717l456k288j237j160j863k638
$$ 396916 394514 392839 391153 389014 386611 384029 380898 377181 373725 371437 370200 369040 367177 364539
59661C64539k996k767k061j371j252j604j721j196l14O08J708L051M141M358L654
$$ 364539 361543 358776 356715 355344 354092 352488 350767 349571 349257 349865 351573 354624 358765 363123 366777
59646C66777K484J347N93L80N37O06K85l52j089j775k155j927j139k85J78K29
$$ 366777 369261 370608 371201 371581 372118 372724 373009 372657 371568 369793 367638 365711 364572 364287 364465 364694
59630C64694J17R7L50P41O87k68j637k305j893j175r75j213j361j256r79o06m72
$$ 364694 364811 364908 365258 365999 366686 366418 364781 362476 360583 359408 358433 357220 355859 354603 353624 353018 352546
59613C52546j100k248k701j690l6R43J198J670K594L215L085K607K091J258M5
$$ 352546 351446 349198 346497 344807 344771 345714 346912 348582 351176 354391 357476 360083 362174 363432 363477
59598C63477q96j012o20m75q90j564j955j598m77P27J131O14o6l19l99q01j415
$$ 363477 362581 361569 360949 360474 359584 358020 356065 354467 353990 354717 355848 356462 356396 356077 355678 354877 353462
59581C53462j774j838j977k323k560k422k052j794j842k067k088j579o40J30K55
$$ 353462 351688 349850 347873 345550 342990 340568 338516 336722 334880 332813 330725 329146 328506 328636 328891
59566C28891J0J81J048J927K017J482J297J903K486J922J92j497k002j264j4J124
$$ 328891 328901 329082 330130 332057 334074 335556 336853 338756 341242 343164 343356 341859 339857 338593 338579 339703
59550C39703J984K580K874K850K658K571K832L482M375N356O390P569R040J1037
$$ 339703 341687 344267 347141 349991 352649 355220 358052 361534 365909 371265 377655 385224 394264 405301
59536D05301J3604J6071J7084J5649J2137P857L744j25l768o718q355q383o946
$$ 405301 418905 434976 452060 467709 479846 487703 491447 491322 487554 480836 472481 464098 457152
59523D57152m658k530j249m30Q03K426L405L129K149J174J83r84j986k585l214
$$ 457152 452494 449964 448715 448285 449088 451514 454919 458048 460197 461371 461554 460570 458584 455999 452785
59508D52785m262n425o309p038p635p617o926o502o886p090o076m619m281m936
$$ 452785 448523 443098 436789 429751 422116 414499 407573 401071 394185 387095 381019 376400 372119 367183
59494C67183m943l693k313j734j483r70n50o85j006q99k87N86J491K016J806J334
$$ 367183 362240 358547 356234 354500 353017 352047 351497 350812 349806 348907 348620 349206 350697 352713 354519 355853
59478C55853J564K617L546L753L704L859L899L592L430L757M056L823L407L192
$$ 355853 357417 360034 363580 367333 371037 374896 378795 382387 385817 389574 393630 397453 400860 404052
59464D04052K751J662N25K68Q70J676K488L503M489N019N274N801O558P080P419
$$ 404052 406803 408465 408990 409258 410128 411804 414292 417795 422284 427303 432577 438378 444936 452016 459435
59449D59435Q110R085R483Q790P547O591N980M951K816k34l244n348o575p568
$$ 459435 467545 476630 486113 494903 502450 509041 515021 519972 522788 522554 519310 513962 507387 499819
59435D99819q608r267r143q438p608o822o151n722n366m515k928j093M71J918
$$ 499819 491211 481944 472801 464363 456755 449933 443782 438060 432694 428179 425251 424158 424629 426547
59421D26547L576N304O845Q389J0064J1303J1590J1590J2632J5054J7736J9224
$$ 426547 430123 435427 442272 450661 460725 472028 483618 495208 507840 522894 540630 559854
59409E59854J8745J6174J1832O462J003l815p501r669j0296r827q580o410l547
$$ 559854 578599 594773 606605 613067 614070 610255 602754 593085 582789 572962 564382 557972 554425
59396E54425j414j634m308q029j1466j4173j5985j6687j6531j6099j5419j3939
$$ 554425 553011 551377 547069 539040 527574 513401 497416 480729 464198 448099 432680 418741
59384D18741j1699r592q137o764m896k959j695j070n27O9M49N30M01k4p28j190
$$ 418741 407042 397450 389313 382549 377653 374694 372999 371929 371402 371471 371920 372450 372851 372827 372099 370909
59368C70909q25K18J222J797K190K754L507M263M873N218N270N203N275N560N931
$$ 370909 370084 370302 371524 373321 375511 378265 381772 386035 390908 396126 401396 406599 411874 417434 423365
59353D23365O345O965P898Q918R614R888J0218J1232J2859J4226J4614J4336J4250
$$ 423365 429710 436675 444573 453491 463105 472993 483211 494443 507302 521528 536142 550478 564728
59340E64728J4559J4605J3876J2630J1273R669P473M835K332L12j362l027m907
$$ 564728 579287 593892 607768 620398 631671 641340 648813 653648 655980 656292 654930 651903 646996
59327F46996o984r045j0832j2195j2920j2602j1161r515r063j0065j1034j0314
$$ 646996 640012 630967 620135 607940 595020 582418 571257 561742 552679 542614 531580 521266
59315E21266p982n545m013k950j500L63K032L231M327N736P311Q343Q136O545
$$ 521266 513284 507739 503726 500776 499276 499639 501671 504902 509229 514965 522276 530619 538755 545300
59301E45300L988J002k178n456q522j0847j2059j2132j1241r607p532n451l823
$$ 545300 549288 550290 548112 542656 534134 523287 511228 499096 487855 478248 470716 465265 461442
59288D61442k916k671k714k519j756n16P79J716K195K472K896L545M101M238M085
$$ 461442 458526 455855 453141 450622 448866 448350 449129 450845 453040 455512 458408 461953 466054 470292 474377
59273D74377M195M902O002P118Q173R268J0227J0588J0106R051P914O923N896
$$ 474377 478572 483474 489476 496594 504767 514035 524262 534850 544956 554007 561921 568844 574740
59260E74740M511K689O55j401l588o037q415r978j0307r739q945q266p696p289
$$ 574740 579251 581940 582595 581194 577606 571569 563154 553176 542869 533130 524185 515919 508223 500934
59246E00934p166p174o849n870m373k792j528p79m69k65K24J155K348L350L647
$$ 500934 493768 486594 479745 473875 469502 466710 465182 464403 463934 463669 463893 465048 467396 470746 474393
59231D74393L052K085J729K454L534L695K433M05j487k965m201n230n900o187
$$ 474393 477445 479530 481259 483713 487247 490942 493375 493780 492293 489328 485127 479897 473997 467810
59217D67810o240o161n993n819n712n604n394n103m809m500m138l763l361k730
$$ 467810 461570 455409 449416 443597 437885 432281 426887 421784 416975 412475 408337 404574 401213 398483
59203C98483j702n13K69K41l99r06n31Q21K362L084K836K471K753L349L369K686
$$ 398483 396781 396268 396537 396778 396379 395473 394942 395763 398125 401209 404045 406516 409269 412618 415987 418673
59187D18673K096K133K348K042J306Q54J095J732K225K301K142K232K941M016
$$ 418673 420769 422902 425250 427292 428598 429452 430547 432279 434504 436805 438947 441179 444120 448136
59173D48136M690M513L983L987M749N644O072O099O179O504O832O842O449N865
$$ 448136 452826 457339 461322 465309 470058 475702 481774 487873 494052 500556 507388 514230 520679 526544
59159E26544N341M875M255L450K732K217J545L19j285k749l955n211o617p800
$$ 526544 531885 536760 541015 544465 547197 549414 550959 551278 549993 547244 543289 538078 531461 523661
59145E23661q437q529q138p302o403n983n958n537m379l316l368m339n046m710
$$ 523661 515224 506695 498557 491255 484852 478869 472911 467374 462995 459679 456311 451972 446926 442216
59131D42216l559k158q16K63Q53J035J281J973K994L934M486M599M486M562N138
$$ 442216 438657 436499 435683 435946 436799 437834 439115 441088 444082 448016 452502 457101 461587 466149 471287
59116D71287O012O618O624O323O310O877P769Q407Q303P452O347N558N231N056
$$ 471287 477299 483917 490541 496864 503174 510051 517820 526227 534530 541982 548329 553887 559118 564174
59102E64174M659L919L003K261J975K003J758Q35m13j192j147o43k32j76n56j374
$$ 564174 568833 572752 575755 578016 579991 581994 583752 584587 584174 582982 581835 581192 580960 580784 580228 578854
59086E78854k374l053l145k953l005l557m500n572o472o955p061p119p362p623
$$ 578854 576480 573427 570282 567329 564324 560767 556267 550695 544223 537268 530207 523088 515726 508103
59072E08103p632p428p311p322p020n964m327k931k525k992l413l036k035j198
$$ 508103 500471 493043 485732 478410 471390 465426 461099 458168 455643 452651 449238 446202 444167 442969
59058D42969r85j168j369j576j974k491k736k325j234J28J182J619J606J461J255
$$ 442969 441984 440816 439447 437871 435897 433406 430670 428345 427111 427239 428421 430040 431646 433107 434362
59043D34362R16N30L01K60K81L44M61M26J26o9L41J199J904K424L310M505N039
$$ 434362 435278 435808 436109 436369 436650 436994 437455 437881 438007 437938 438279 439478 441382 443806 447116 451621 456660
59026D56660M495M000M806O430P246O796O366P158Q822J0181J0644J0395R690
$$ 456660 461155 465155 469961 476391 483637 490433 496799 503957 512779 522960 533604 543999 553689
59013E53689Q549O938M913K714Q51j96n70r64j656j994j197O02K491L776M438
$$ 553689 562238 569176 574089 576803 577654 577458 576888 575924 574268 572274 571077 571679 574170 577946 582384
58998E82384M751M929N119N334N318M840M109L634L546L437K862J794M26j028
$$ 582384 587135 592064 597183 602517 607835 612675 616784 620418 623964 627401 630263 632057 632483 631455
58984F31455k225k803k929l409m759o308o768n712m001k707j990j300k56J035
$$ 631455 629230 626427 623498 620089 615330 609022 602254 596542 592541 589834 587844 586544 586288 587323
58970E87323K301L364M111M556M997N894P385Q997R930R738Q753P756P155O504
$$ 587323 589624 592988 597099 601655 606652 612546 619931 628928 638858 648596 657349 665105 672260 678764
58956F78764N102K981R91k56j142k519m693p258r618j1325j2103j2089j1892j1993
$$ 678764 683866 686847 687838 687582 686440 683921 679228 671970 662352 651027 638924 626835 614943 602950
58942F02950j2065j1502j0466r717r355q570p016n644n495o171o353n522m377
$$ 602950 590885 579383 568917 559200 549845 541275 534259 528615 523120 516949 510596 505074 500697
58929E00697l611l072k304j309m10K34O52P92N48r7j006j850k150j628o28J44
$$ 500697 497086 494014 491710 490401 489991 490225 490877 491669 492217 492120 491114 489264 487114 485486 484858 485002
58913D85002L80M61Q52J519K165K784L580M484N136N442N822O744Q149R520J0435
$$ 485002 485382 485843 486695 488214 490379 493163 496743 501227 506363 511805 517627 524371 532520 542040 552475
58898E52475J0930J1324J1745J1960J1666J0964J0501J1022J2722J4946J6668
$$ 552475 563405 574729 586474 598434 610100 621064 631565 642587 655309 670255 686923
58887F86923J7345J7316J7358J7860J8508J8676J7964J6340J4051J1552R287P180
$$ 686923 704268 721584 738942 756802 775310 793986 811950 828290 842341 853893 863180 870360
58875H70360M487N23m394r028j2413j4673j6502j8108j9101j9244j8872j8384
$$ 870360 874847 875370 870976 861948 849535 834862 818360 800252 781151 761907 743035 724651
58863G24651j7699j6510j4927j3471j2413j1414j0070q625p825q023q718r147
$$ 724651 706952 690442 675515 662044 649631 638217 628147 619522 611697 603674 594956 585809
58851E85809r125r023r027q791p992o862n929n415n185n163n386n642n475m741
$$ 585809 576684 567661 558634 549843 541851 534989 529060 523645 518460 513297 507911 502269 496794 492053
58837D92053l889l381l141k803k380k229k525l043l461l504k842j389J51O06l93
$$ 492053 488164 484783 481642 478839 476459 474230 471705 468662 465201 461697 458855 457466 457617 458223 457830
58822D57830j794k202j327PJ017J629K116K646L343M211M890M890M285L793L879
$$ 457830 456036 453834 452507 452514 453531 455160 457276 459922 463265 467476 472366 477256 481541 485334 489213
58807D89213M127L873L124K480K211J948J228M0j223k097k308j944j515j598k300
$$ 489213 493340 497213 500337 502817 505028 506976 508204 508244 507021 504924 502616 500672 499157 497559 495259
58792D95259l177l705l727l313k476j220K39J513K361K835L136L474M018M816
$$ 495259 492082 488377 484650 481337 478861 477641 477880 479393 481754 484589 487725 491199 495217 500033
58778E00033N615N969N725N216M784M176K803O03j756l682n306o976q438q993
$$ 500033 505648 511617 517342 522558 527342 531518 534321 534924 533168 529486 524180 517204 508766 499773
58764D99773q444p335o216n169m170l476l279l303l135k730k196j363KJ571K581
$$ 499773 491329 483994 477778 472609 468439 464963 461684 458381 455246 452516 450320 448957 448959 450530 453111
58749D53111K768K721L054L624L867L723L679L969M194L992L688L935M822N761
$$ 453111 455879 458600 461654 465278 469145 472868 476547 480516 484710 488702 492390 496325 501147 506908
58735E06908O225O322O419O506O211N327M136L189K892L265L899M222L922L220
$$ 506908 513133 519455 525874 532380 538591 543918 548054 551243 554135 557400 561299 565521 569443 572663
58721E72663K630K403K312K012J496J132J241J755K318K751L297M236N370O061
$$ 572663 575293 577696 580008 582020 583516 584648 585889 587644 589962 592713 596010 600246 605616 611677
58707F11677N882M992L826K605J316r3j660l408n210o774p902q678r322j0009
$$ 611677 617559 622551 626377 628982 630298 630205 628545 625137 619927 613153 605251 596573 587251 577242
58693E77242j0845j1664j1831j0804r126q209q597r058q158o248m908m692m649
$$ 577242 566397 554733 542902 532098 522972 514763 506166 497108 488950 482702 477794 473102 468453
58680D68453m047l378l173k963k189j312j140j534j553o63Q68K617M395O098P605
$$ 468453 464406 461028 457855 454892 452703 451391 450251 448717 447164 446501 447369 449986 454381 460479 468084
58665D68084Q848R661R737R045Q076P304O553N292L401J297o20k183l179l406
$$ 468084 476932 486593 496330 505375 513451 520755 527308 532600 536001 537298 536678 534495 531316 527910
58651E27910l044k725l005l849m714m999m578l891l453l247k854k183j690j640
$$ 527910 524866 522141 519136 515287 510573 505574 500996 497105 493652 490405 487551 485368 483678 482038
58637D82038j609j098l18J31J99N68J801L625N046N116L751J965J062J373J974
$$ 482038 480429 479331 479013 479144 479343 479911 481712 485337 490383 495499 499250 501215 502277 503650 505624
58622E05624J884J186O66P60J310K118L086L902M212M161M345N040N835O139N771
$$ 505624 507508 508694 509360 510120 511430 513548 516634 520536 524748 528909 533254 538294 544129 550268 556039
58607E56039M941L826K415P20r32j926j913j299r24j189j815k407k872l096k804
$$ 556039 560980 564806 567221 567941 567009 565083 563170 561871 560947 559758 557943 555536 552664 549568 546764
58592E46764k061j422j181q92j49O72J023J173J871L189M484N370O123P017P817
$$ 546764 544703 543281 542100 541208 541059 541731 542754 543927 545798 548987 553471 558841 564964 571981 579798
58577E79798Q061P506O345N245M909N297N627N569N932P488R509J0487J0099R543
$$ 579798 587859 595365 601710 606955 611864 617161 622788 628357 634289 641777 651286 661773 671872 681415
58563F81415R951J1357J3310J5475J7388J8472J8661J8384J7692J6137J3753J1357
$$ 681415 691366 702723 716033 731508 748896 767368 786029 804413 822105 838242 851995 863352
58551H63352R422P401M709J764n89k254l758n257o345o850p271q209r642j0949
$$ 863352 872774 880175 884884 886648 886059 883805 880047 874790 868445 861595 854324 846115 836473 825524
58537H25524j1669j2007j2484j3098j3251j2690j1998j1751j1536j0526q724o928
$$ 825524 813855 801848 789364 776266 763015 750325 738327 726576 715040 704514 695790 688862
58525F88862n598m503l446k563j843j095m51j64J07R34J930J962Q74l8K38J087
$$ 688862 683264 678761 675315 672752 670909 669814 669363 669199 669306 670240 672170 674132 675006 674968 675206 676293
58509F76293J316P21l3m87o35n48m19o16j145j443j142o13l33k03KQ7j04j98J21
$$ 676293 677609 678330 678297 677810 677175 676627 676208 675592 674447 673004 671862 671249 670916 670713 670715 670802 670698 670500 670621
58490F70621M91M71L27N17Q62R22R50J624L004M440N405N921O290O957Q369J0377
$$ 670621 671112 671583 671910 672427 673289 674211 675161 676785 679789 684229 689634 695555 701845 708802 717171 727548
58474G27548J1978J2242J1334J0052Q649O811M624K643R87p91k748m162m450l945
$$ 727548 739526 751768 763102 773154 781803 788614 793238 795881 796868 796077 793329 789167 784717 780772
58460G80772l392l025k480j376K65K054L581M724N668O513O971O640N476L877
$$ 780772 777380 774355 771875 770499 770764 772818 776399 781123 786791 793304 800275 806915 812391 816268
58446H16268K361J258N71p3j115k494l581l829l299k389j390n20j3K17O82J746
$$ 816268 818629 819887 820458 820385 819270 816776 813195 809366 806067 803678 802288 801768 801755 801972 802654 804400
58430H04400L136M372N327O090O595O927P564Q719R743R903R493R446R846R704
$$ 804400 807536 811908 817235 823325 829920 836847 844411 853130 862873 872776 882269 891715 901561 911265
58416I11265Q347O328M603L401K359J314M54k23j030k106l062l331k884k398k548
$$ 911265 919612 925940 930543 933944 936303 937617 938071 937848 936818 934712 931650 928319 925435 923037 920489
58401I20489l207l519k831j350K00J326K051K649L330M079M737N277N887O543
$$ 920489 917282 913763 910932 909582 909782 911108 913159 915808 919138 923217 927954 933231 939118 945661
58387I45661O618N475L484J928J637K178K639K705K613K529K516K771L383M055
$$ 945661 952279 957754 961238 963166 964803 966981 969620 972325 974938 977467 979983 982754 986137 990192
58373I90192M504M882N518O387P199P844Q401Q903R364R877J0491J1193J2122
$$ 990192 994696 999578 1005096 1011483 1018682 1026526 1034927 1043830 1053194 1063071 1073562 1084755 1096877
58360A096877J3427J4810J5650J5835J5918J6151J5902J4528J2390J0500R487
$$ 1096877 1110304 1125114 1140764 1156599 1172517 1188668 1204570 1219098 1231488 1241988 1251475
58349A251475R278R442R476R080Q509Q404Q928R586J0044J0586J1447J2397J3400
$$ 1251475 1260753 1270195 1279671 1288751 1297260 1305664 1314592 1324178 1334222 1344808 1356255 1368652 1382052
58336A382052J4891J6786J8010J7813J7003J6964J7902J8833J8940J8231J7175
$$ 1382052 1396943 1413729 1431739 1449552 1466555 1483519 1501421 1520254 1539194 1557425 1574600
58325A574600J6435J6567J7270J7349J6118J4457J3653J3678J3458J2588J1740
$$ 1574600 1591035 1607602 1624872 1642221 1658339 1672796 1686449 1700127 1713585 1726173 1737913
58314A737913J1573J2111J3182J4706J6485J8173J9532K0432K0915K1467K2694
$$ 1737913 1749486 1761597 1774779 1789485 1805970 1824143 1843675 1864107 1885022 1906489 1929183
58303A929183K4436K5824K6537K7228K8224K8814K8600K8487K9340L0529L0841
$$ 1929183 1953619 1979443 2005980 2033208 2061432 2090246 2118846 2147333 2176673 2207202 2238043
58292B238043L0116K8992K7879K7171K7571K9011L0202L0474L1034L3063L5594
$$ 2238043 2268159 2297151 2325030 2352201 2379772 2408783 2438985 2469459 2500493 2533556 2569150
58281B569150L6987L7534L8778M0995M3353M5883M9257N3156N6803O0674O5564
$$ 2569150 2606137 2643671 2682449 2723444 2766797 2812680 2861937 2915093 2971896 3032570 3098134
58270C098134P0438P3515P5200P7547Q0910Q3591Q4984Q6531Q9075R1637R3505
$$ 3098134 3168572 3242087 3317287 3394834 3475744 3559335 3644319 3730850 3819925 3911562 4005067
58259D005067R5499R8305J01343J04017J06546J09089J11569J14615J18969J23853
$$ 4005067 4100566 4198871 4300214 4404231 4510777 4619866 4731435 4846050 4965019 5088872
58249E088872J27774J31044J35454J41391J47508J53535J60863J69894J79295
$$ 5088872 5216646 5347690 5483144 5624535 5772043 5925578 6086441 6256335 6435630
58240F435630J88613J99162K11393K23900K36027K49115K64052K79830K95789
$$ 6435630 6624243 6823405 7034798 7258698 7494725 7743840 8007892 8287722 8583511
58231H583511L13095L32705L53860L75843L99486M25888M55317M88079N24639
$$ 8583511 8896606 9229311 9583171 9959014 10358500 10784388 11239705 11727784 12252423
58222A2252423N64498O07099O54120P08273P69664Q36432R09442R92922J089790
$$ 12252423 12816921 13424020 14078140 14786413 15556077 16392509 17301951 18294873 19384663
58213A9384663J200006J324433J466296J627807J810040K018188K263104K556271
$$ 19384663 20584669 21909102 23375398 25003205 26813245 28831433 31094537 33650808
58205C3650808K908261L334261L855881M494602N268044O193877P289716Q565153
$$ 33650808 36559069 39893330 43749211 48243813 53511857 59705734 66995450 75560603
58197G5560603J0021488J1665332J3518279J5614347J8001715K0740173K3832436
$$ 75560603 85582091 97247423 110765702 126380049 144381764 165121937 188954373
58190A88954373K7058571K9817834L1167507L0141139K6198214J9520747J0959518
$$ 188954373 216012944 245830778 276998285 307139424 333337638 352858385 363817903
58183C63817903J674847p277736j5161404k1518370k6047066k8587328k9214690
$$ 363817903 365492750 358215014 343053610 321535240 295488174 266900846 237686156
58176B37686156k8282768k6311483k3800176k1110509j8461966j5976441j3714084
$$ 237686156 209403388 183091905 159291729 138181220 119719254 103742813 90028729
58169I0028729j1697386r931652q413711p128409o048794n145640m393820l769771
$$ 90028729 78331343 68399691 59985980 52857571 46808777 41663137 37269317 33499546
58161C3499546l250005k815227k451861k147849j890782j671306j484173j324379
$$ 33499546 30249541 27434314 24982453 22834604 20943822 19272516 17788343 16463964
58153A6463964j185663j063704r57168q64252p81474p06906o41421n85375n36846
$$ 16463964 15278301 14214597 13257429 12393177 11611703 10904797 10263376 9678001 9141155
58144I141155m94093m56966m24733l95297l67744l43165l21788l01712k81700
$$ 9141155 8647062 8190096 7765363 7370066 7002322 6659157 6337369 6035657 5753957
58135E753957k62850k46217k30876k15751k01378j88542j76794j65581j55329
$$ 5753957 5491107 5244890 5014014 4798263 4596885 4408343 4231549 4065968 3910639
58126C910639j46300j37760j29324j21732j15377j09442j03392r7931r3542q9399
$$ 3910639 3764339 3626579 3497255 3375523 3260146 3150704 3047312 2949381 2855839 2766440
58116B766440q4712p9955p5902p2486o9458o6998o4864o2054n8270n4646n2141
$$ 2766440 2681728 2601773 2525871 2453385 2383927 2316929 2252065 2190011 2131741 2077095 2024954
58105B024954n0059m7189m3630m0493l8328l6660l4730l2144k9106k6430k4957
$$ 2024954 1974895 1927706 1884076 1843583 1805255 1768595 1733865 1701721 1672615 1646185 1621228
58094A621228k4706k4953k5189k5478k5895k6347k6974k7926k8717k8679k8038
$$ 1621228 1596522 1571569 1546380 1520902 1495007 1468660 1441686 1413760 1385043 1356364 1328326
58083A328326k7721k7943k7914k7029k5572k4107k2962k2278k1798k0784j9025
$$ 1328326 1300605 1272662 1244748 1217719 1192147 1168040 1145078 1122800 1101002 1080218 1061193
58072A061193j7638j7695j8383j7968j6404j5338j5429j5427j4409j3179j2748
$$ 1061193 1043555 1025860 1007477 989509 973105 957767 942338 926911 912502 899323 886575
58061H86575j2824j2716j2467j2276j1831j1039j0482j0435j0370r986r736r756
$$ 886575 873751 861035 848568 836292 824461 813422 802940 792505 782135 772149 762413 752657
58049G52657r408q503p886q043q239p830p298p112o671n524m622n057o300o923
$$ 752657 743249 734746 726860 718817 710578 702748 695450 688338 681667 676143 671521 666464 660164 653241
58035F53241o584o130o129o452p014p867q649q822q467q153q095p955p397o464
$$ 653241 646657 640527 634398 627946 620932 613065 604416 595594 587127 578974 570879 562924 555527 549063
58021E49063n543n212n755o589o677n798m872m642m688m247l342k556k170k143
$$ 549063 543520 538308 532553 525964 519287 513489 508617 503975 499287 495040 491698 489142 486972 484829
58007D84829k387k557k097j084n02j025k016k342j755q41o2M91P27O07L44Q3l13
$$ 484829 482442 479885 477788 476704 476202 475177 473161 470819 469064 468223 468161 468652 469379 469986 470330 470413 470100
57990D70100q38j129j034r78j291j678j774j751j859j944j855j876k246k720l004
$$ 470100 469262 468133 467099 466121 464830 463152 461378 459627 457768 455824 453969 452093 449847 447127 444123
57975D44123l111k924k097p89J60L80M94R92J387J166P45O48O22M03N58J535K585
$$ 444123 441012 438088 435991 435202 435362 435742 436236 437228 438615 439781 440526 441174 441796 442199 442757 444292 446877
57958D46877K769K400K344K440J888P77j3k16k62k31J57O70Q39R38J574K488K845
$$ 446877 449646 452046 454390 456830 458718 459495 459482 459266 459004 458773 458930 459600 460439 461377 462951 465439 468284
57941D68284K595K397K319J890J455K055L750N252N597N139M528L807K940K235
$$ 468284 470879 473276 475595 477485 478940 480995 484745 489997 495594 500733 505261 509068 512008 514243
57927E14243J679O35j158l029m253m923n482n998o267o237n991n703n676n990
$$ 514243 515922 516557 515399 512370 508117 503194 497712 491714 485447 479210 473219 467516 461840 455850
57913D55850o070n268l874k859k539k308j846j586j739j688r64k3M61N34P36J400
$$ 455850 449780 444512 440638 437779 435240 432932 431086 429500 427761 426073 425109 425086 425547 426081 426817 428217
57897D28217K516L747M326L574J939P87P64J005M87n52j175j129q90p71o86o44
$$ 428217 430733 434480 438806 442380 444319 445106 445870 446875 447362 446810 445635 444506 443616 442845 442159 441515
57881D41515p72j036j345j811k470k993l069k845k653k551k454k423k388j938
$$ 441515 440743 439707 438362 436551 434081 431088 428019 425174 422521 419970 417516 415093 412705 410767
57867D10767q77K67P68N60J70j2Q0N25J352K242K729K743K639K704K976L439M018
$$ 410767 409890 410157 410925 411485 411655 411643 411723 412248 413600 415842 418571 421314 423953 426657 429633 433072 437090
57850D37090M388M152L326K428J901J641J173K62p18j085o34M6K21j24l85k64
$$ 437090 441478 445630 448956 451384 453285 454926 456099 456361 455643 454558 453924 453970 454191 454067 453682 453418
57834D53418j26l13n66m08K92J387K701L906M505M360M035M229N063O133P045
$$ 453418 453292 452979 452413 452005 452297 453684 456385 460291 464796 469156 473191 477420 482483 488616 495661
57819D95661P560P420O488M955L124J115j028l118m989o602p772q058p334o173
$$ 495661 503221 510641 517129 522084 525208 526323 525295 522177 517188 510586 502814 494756 487422 481249
57805D81249n218m429l419k368j910k129k291j765p77K0L87N98R23J313J566J698
$$ 481249 476031 471602 468183 465815 463905 461776 459485 457720 456943 456963 457350 457948 458871 460184 461750 463448
57789D63448J963K479K954L075L095L671M907O014O283O003N939O141N997N338
$$ 463448 465411 467890 470844 473919 477014 480685 485592 491606 497889 503892 509831 515972 521969 527307
57775E27307M807M887N129M751L612K328J515J250J151P27k45j562k758l488l745
$$ 527307 532114 537001 542130 546881 550493 552821 554336 555586 556737 557464 557219 555657 552899 549411 545666
57760E45666l769l818l964m063l925l550l102k614j909r88j85K71N67Q65Q54K42
$$ 545666 541897 538079 534115 530052 526127 522577 519475 516861 514952 513964 513779 514050 514617 515482 516336 516578
57744E16578n05n54K22J121J651K057K642L134L127K676K127J659J346J327J546
$$ 516578 516073 515519 515741 516862 518513 520570 523212 526346 529473 532149 534276 535935 537281 538608 540154
57729E40154J627J413J290J585J923J695R91N11O33J134J774K554L274L472L076
$$ 540154 541781 543194 544484 546069 547992 549687 550678 551189 551822 552956 554730 557284 560558 564030 567106
57714E67106K734L025L645L708K808J482O73Q42J608K107J848J210R87J442K065
$$ 567106 569840 572865 576510 580218 583026 584508 585181 586023 587631 589738 591586 592796 593783 595225 597290
57699E97290K376K572L123L985M636M762M531M175L628K745J634O74K64N19J156
$$ 597290 599666 602238 605361 609346 613982 618744 623275 627450 631078 633823 635457 636131 636395 636914 638070
57684F38070J746K136K611L432M391N135N787O835Q421J0133J1685J3447J6051
$$ 638070 639816 641952 644563 647995 652386 657521 663308 670143 678564 688697 700382 713829 729880
57671G29880J9672K4050K8935L4142L9061M2322M2219L7641K8784J7044M261p928
$$ 729880 749552 773602 802537 836679 875740 918062 960281 997922 1026706 1043750 1048011 1040083
57659A040083j8177k5436k9343l0515k9948k8107k4945k0798j6696j3536j1347
$$ 1040083 1021906 996470 967127 936612 906664 878557 853612 832814 816118 802582 791235
57648G91235r675q251p003n696m028j944L66K546L991M124L171K311K556L675
$$ 791235 781560 773309 766306 760610 756582 754638 755004 757550 761541 765665 768836 771147 773703 777378
57634G77378M671N000M878M626M349M195M306M510M502M326M192L968L369K610
$$ 777378 782049 787049 791927 796553 800902 805097 809403 813913 818415 822741 826933 830901 834270 836880
57620H36880K239K277K213J993K253L260M261M387L780L318L473L897M027L805
$$ 836880 839119 841396 843609 845602 847855 851115 855376 859763 863543 866861 870334 874231 878258 882063
57606H82063L675M061M832N354N172M515L931L659L641L876M233M222L599L070
$$ 882063 885738 889799 894631 899985 905157 909672 913603 917262 920903 924779 929012 933234 936833 939903
57592I39903L513M618N145M692M129M065M022L681L748M713N676N557M765M523
$$ 939903 943416 948034 953179 957871 962000 966065 970087 973768 977516 982229 987905 993462 998227 1002750
57578A002750N007N380N363N492N925O202O313O783P470P406O276N126M925N278
$$ 1002750 1007757 1013137 1018500 1023992 1029917 1036119 1042432 1049215 1056685 1064091 1070367 1075493 1080418 1085696
57564A085696N268M899M884N415O037O570P352Q434R234R259Q798Q500Q527Q485
$$ 1085696 1090964 1095863 1100747 1106162 1112199 1118769 1126121 1134555 1143789 1153048 1161846 1170346 1178873 1187358
57550A187358Q198Q085Q503R012Q760P639O582O472P167P910Q320Q551Q738Q851
$$ 1187358 1195556 1203641 1212144 1221156 1229916 1237555 1244137 1250609 1257776 1265686 1274006 1282557 1291295 1300146
57536A300146Q970R157R126Q612P985P889Q273Q448Q236Q290Q957R582R491R076
$$ 1300146 1309116 1318273 1327399 1336011 1343996 1351885 1360158 1368606 1376842 1385132 1394089 1403671 1413162 1422238
57522A422238R217R950J0489J0440J0294J0609J1291J1863J2040J1792J1183J0422
$$ 1422238 1431455 1441405 1451894 1462334 1472628 1483237 1494528 1506391 1518431 1530223 1541406 1551828
57510A551828R886R770R865R858R811J0045J0605J1133J1348J1359J1315J1070
$$ 1551828 1561714 1571484 1581349 1591207 1601018 1611063 1621668 1632801 1644149 1655508 1666823 1677893
57498A677893J0491R935R929J0427J0822J0800J0701J0889J1231J1530J2013J2860
$$ 1677893 1688384 1698319 1708248 1718675 1729497 1740297 1750998 1761887 1773118 1784648 1796661 1809521
57486A809521J3605J3677J3341J3429J4114J4621J4344J3687J3426J3679J3896
$$ 1809521 1823126 1836803 1850144 1863573 1877687 1892308 1906652 1920339 1933765 1947444 1961340
57475A961340J3661J3101J2558J2244J2190J2357J2647J2929J3156J3455J4004
$$ 1961340 1975001 1988102 2000660 2012904 2025094 2037451 2050098 2063027 2076183 2089638 2103642
57464B103642J4752J5298J5277J4806J4402J4419J4781J5267J5662J5664J5151
$$ 2103642 2118394 2133692 2148969 2163775 2178177 2192596 2207377 2222644 2238306 2253970 2269121
57453B269121J4701J5185J6476J7290J6912J6376J6938J8052J8136J7110J6669
$$ 2269121 2283822 2299007 2315483 2332773 2349685 2366061 2382999 2401051 2419187 2436297 2452966
57442B452966J7741J9127J9334J8644J8371J8873J9338J9185J8770J8699J9108
$$ 2452966 2470707 2489834 2509168 2527812 2546183 2565056 2584394 2603579 2622349 2641048 2660156
57431B660156J9662J9913J9732J9514J9760K0352K0610K0257J9780J9625J9694
$$ 2660156 2679818 2699731 2719463 2738977 2758737 2779089 2799699 2819956 2839736 2859361 2879055
57420B879055J9955K0774K2055K2802K2386K1615K1595K2023K1750K0766K0333
$$ 2879055 2899010 2919784 2941839 2964641 2987027 3008642 3030237 3052260 3074010 3094776 3115109
57409C115109K1062K2085K2402K2110K1814K1738K1974K2856K4270K5194K4700
$$ 3115109 3136171 3158256 3180658 3202768 3224582 3246320 3268294 3291150 3315420 3340614 3365314
57398C365314K3270K2402K2923K4194K5080K5239K5185K5389K5686K5691K5559
$$ 3365314 3388584 3410986 3433909 3458103 3483183 3508422 3533607 3558996 3584682 3610373 3635932
57387C635932K5871K6769K7550K7509K6846K6311K6141K5947K5601K5539K6022
$$ 3635932 3661803 3688572 3716122 3743631 3770477 3796788 3822929 3848876 3874477 3900016 3926038
57376C926038K6614K6847K6894K7206K7721K7952K7716K7324K7123K7105K7047
$$ 3926038 3952652 3979499 4006393 4033599 4061320 4089272 4116988 4144312 4171435 4198540 4225587
57365D225587K6757K6226K5727K5719K6429K7526K8367K8629K8541K8500K8695
$$ 4225587 4252344 4278570 4304297 4330016 4356445 4383971 4412338 4440967 4469508 4498008 4526703
57354D526703K9138K9853L0796L1618L1866L1465L0887L0641L0787L1099L1503
$$ 4526703 4555841 4585694 4616490 4648108 4679974 4711439 4742326 4772967 4803754 4834853 4866356
57343D866356L2002L2318L2078L1486L1241L1616L1998L1747L1129L0869L1143
$$ 4866356 4898358 4930676 4962754 4994240 5025481 5057097 5089095 5120842 5151971 5182840 5213983
57332E213983L1526L1765L1984L2183L2138L1934L1949L2202L2173L1569L0811
$$ 5213983 5245509 5277274 5309258 5341441 5373579 5405513 5437462 5469664 5501837 5533406 5564217
57321E564217L0482L0607L0817L0932L1062L1312L1612L1769L1598L1136L0755
$$ 5564217 5594699 5625306 5656123 5687055 5718117 5749429 5781041 5812810 5844408 5875544 5906299
57310E906299L0767L0911L0587K9765K9151K9248K9631K9554K8927K8238K7780
$$ 5906299 5937066 5967977 5998564 6028329 6057480 6086728 6116359 6145913 6174840 6203078 6230858
57299F230858K7426K7088K6882K6811K6681K6407K6091K5770K5340K4764K4169
$$ 6230858 6258284 6285372 6312254 6339065 6365746 6392153 6418244 6444014 6469354 6494118 6518287
57288F518287K3674K3336K3251K3507K3990K4446K4641K4369K3397K1745K0029
$$ 6518287 6541961 6565297 6588548 6612055 6636045 6660491 6685132 6709501 6732898 6754643 6774672
57277F774672J9172J9561K0637K1428K1383K0629J9623J8683J7873J7175J6711
$$ 6774672 6793844 6813405 6834042 6855470 6876853 6897482 6917105 6935788 6953661 6970836 6987547
57266F987547J6682J6996J7147J6625J5548J4644J4536J5118J5691J5595J4735
$$ 6987547 7004229 7021225 7038372 7054997 7070545 7085189 7099725 7114843 7130534 7146129 7160864
57255G160864J3597J2909J3052J3735J4253J4172J3714J3409J3425J3391J2800
$$ 7160864 7174461 7187370 7200422 7214157 7228410 7242582 7256296 7269705 7283130 7296521 7309321
57244G309321J1527R976Q768Q217P973P297N847M147L036K570J873K31j952l701
$$ 7309321 7320848 7330824 7339592 7347809 7355782 7363079 7368926 7373073 7376109 7378679 7380552 7380783 7378831 7375130
57230G375130m674n327n913o076n703n541o360p784q641q358p461o654o083n632
$$ 7375130 7370456 7365129 7359216 7353140 7347437 7341896 7335536 7327752 7319111 7310753 7303292 7296638 7290555 7284923
57216G284923n398n421n257m380k922j708j431j979k614k725k355k013j972j974
$$ 7284923 7279525 7274104 7268847 7264467 7261545 7259837 7258406 7256427 7253813 7251088 7248733 7246720 7244748 7242774
57202G242774j728j481j776k819m309n865p124p607p104o339o671q668j1467j3855
$$ 7242774 7241046 7239565 7237789 7234970 7230661 7224796 7217672 7210065 7202961 7196622 7189951 7181283 7169816 7155961
57188G155961j5473j6617j7424j7951j8730k0379k2687k4771k6169k7224k8319
$$ 7155961 7140488 7123871 7106447 7088496 7069766 7049387 7026700 7001929 6975760 6948536 6920217
57177F920217k9380l0287l1227l2334l3323l3846l3911l3713l3266l2434l1213
$$ 6920217 6890837 6860550 6829323 6796989 6763666 6729820 6695909 6662196 6628930 6596496 6565283
57166F565283k9731k8094k6329k4403k2293k0094j7998j5997j3764j1092q468
$$ 6565283 6535552 6507458 6481129 6456726 6434433 6414339 6396341 6380344 6366580 6355488 6347020
57155F347020o792o442o965p758q727j0129j2139j4798j8130k2022k6181l0319
$$ 6347020 6340228 6333786 6326821 6319063 6310336 6300207 6288068 6273270 6255140 6233118 6206937 6176618
57143F176618l4255l7700m0240m1724m2313m1974m0320l7240l3415k9789k6658
$$ 6176618 6142363 6104663 6064423 6022699 5980386 5938412 5898092 5860852 5827437 5797648 5770990
57132E770990k3698k0735j8113j6385j5978j7048j9289k1891k4050k5531k6354
$$ 5770990 5747292 5726557 5708444 5692059 5676081 5659033 5639744 5617853 5593803 5568272 5541918
57121E541918k6072k3864j9508j3736p386n91O835J4526K1686K8049L4443M2305
$$ 5541918 5515846 5491982 5472474 5458738 5451352 5450761 5457596 5472122 5493808 5521857 5556300 5598605
57109E598605N2885O6948Q4838J06613J32234J61992J96852K38413K88570L49223
$$ 5598605 5651490 5718438 5803276 5909889 6042123 6204115 6400967 6639380 6927950 7277173
57099G277173M22077N08167O07368P18391Q39246R67351J099171J230390J356986
$$ 7277173 7699250 8207417 8814785 9533176 10372422 11339773 12438944 13669334 15026320
57090A5026320J475458J580235J659844J696166J669441J566775J388976J151846
$$ 15026320 16501778 18082013 19741857 21438023 23107464 24674239 26063215 27215061
57082B7215061Q81046O02726L34815Q4001j50505l70927n77691p69733r45393
$$ 27215061 28096107 28698833 29033648 29117649 28967144 28596217 28018526 27248793 26303400
57073B6303400j102412j238139j350501j438490j501447j538441j548741j532428
$$ 26303400 25200988 23962849 22612348 21173858 19672411 18133970 16585229 15052801
57065A5052801j490306j423860j336002j231688j117281r99234q83265p73961
$$ 15052801 13562495 12138635 10802633 9570945 8453664 7454430 6571165 5797204
57057E797204o74224n84965n05782m36085l75455l23372k79056k41584k09809
$$ 5797204 5122980 4538015 4032233 3596148 3220693 2897321 2618265 2376681 2166872
57048B166872j82337j58109j36973j19242j04660r2184q0782p0081o0118n0891
$$ 2166872 1984535 1826426 1689453 1570211 1465551 1373367 1292585 1222504 1162386 1111495
57038A111495m2258l3858k4905j4393k014J0872K1159K5020J9890O417j1292k7989
$$ 1111495 1069237 1035379 1010474 996081 994067 1004939 1026098 1051118 1071008 1077425 1066133 1038144
57026A038144m0505m8898n4713n8720o0470n9364n5591n0159m4385l9209l4727
$$ 1038144 997639 948741 894028 835308 774838 715474 659883 609724 565339 526130 491403
57015D91403l0441k6104k2112j8888j6249j3768j1427r568q319p503o928o380
$$ 491403 460962 434858 412746 393858 377609 363841 352414 342846 334527 327024 320096 313716
57003C13716n529m302l259l041l436l558k994k319k189k447k451j991j492j409
$$ 313716 308187 303885 300626 297585 294149 290591 287597 285278 283089 280642 278191 276200 274708 273299
56989B73299j663j646o67J380L683N017M752L229J146j091l259m951n823o070
$$ 273299 271636 269990 269323 270703 274386 279403 284155 287384 288530 287439 284180 279229 273406 267336
56975B67336o247o561o681o290n476m473l277j755J4J707L067M155N324O932R016
$$ 267336 261089 254528 247847 241557 236081 231608 228331 226576 226590 228297 231364 235519 240843 247775 256791
56960B56791J1121J2498J2613J1497R562P059L892j2m233p964j0608j2103j2644
$$ 256791 267912 280410 293023 304520 314082 321141 325033 325021 320788 312824 302216 290113 277469
56947B77469j2326j1243r708q056o290m219j996j15J275K753M996P896J0600J2373
$$ 277469 265143 253900 244192 236136 229846 225627 223631 223516 224791 227544 232540 240436 251036 263409
56933B63409J3180J3370J3103J2168J0276P264L180j666o649j0989j4155j6083
$$ 263409 276589 289959 303062 315230 325506 332770 335950 334284 327635 316646 302491 286408
56921B86408j6976j6924j5935j4321j2716j1527j0539r374q179p447p217o902
$$ 286408 269432 252508 236573 222252 209536 198009 187470 178096 169917 162470 155253 148351
56909A48351o058m939m033l368k665j863j144n13K39J120J889K404K819L267L658
$$ 148351 142293 137354 133321 129953 127288 125425 124281 123768 124007 125127 127016 129420 132239 135506 139164
56894A39164L870L969M168M636N455O533P482P768P141N853M357K876J311m57
$$ 139164 143034 147003 151171 155807 161262 167795 175277 183045 190186 196039 200396 203272 204583 204126
56880B04126k374m204n650o430o347n338l567j446M92J929L000M145N736P871
$$ 204126 201752 197548 191898 185468 179121 173783 170216 168770 169262 171191 174191 178336 184072 191943
56866A91943J0451J3226J5786J7746J9104K0137K0777K0264J7814J3536Q334K919
$$ 191943 202394 215620 231406 249152 268256 288393 309170 329434 347248 360784 369118 372037
56854C72037k555p787j1836j3894j4268j3897j3017j0941p352l100P41M096P588
$$ 372037 369482 361695 349859 335965 321697 307800 294783 283842 276490 273390 274131 278227 285815
56841B85815J1384J5104J8679K2508K6675L0564L3461L4856L3991K9826K2108
$$ 285815 297199 312303 330982 353490 380165 410729 444190 479046 513037 542863 564971
56830E64971J2047J417q707j7864k5305l0025l1679l0895k8537k5150k1098j6748
$$ 564971 577018 578435 569728 551864 526559 496534 464855 433960 405423 380273 359175 342427
56818C42427j2323p890l612L29M108Q099J2299J6265J9719K2640K4558K4350K1152
$$ 342427 330104 322214 318602 318931 323039 331138 343437 359702 379421 402061 426619 450969 472121
56805D72121J5177P362j364r988j7194k2002k4670k6274k7295k7162k5284k2001
$$ 472121 487298 494660 493296 483308 466114 444112 419442 393168 365873 338711 313427 291426
56793B91426j8238j4659j1492q815o471l862l72L808P610J0054J1161J1562J1395
$$ 291426 273188 258529 247037 238222 231751 227889 227517 231325 238935 248989 260150 271712 283107
56780B83107R975O822K560j588n130q566j2201j5312j6914j6992j6348j5445j4113
$$ 283107 293082 299904 302464 300876 295746 287180 274979 259667 242753 225761 209413 193968 179855
56767A79855j2419j1054j0420r882q552o538m901m338m489m538m072l213k325
$$ 179855 167436 156382 145962 136080 127528 120990 116089 111751 107262 102724 98652 95439 93114
56754I3114j802j866k294k543k335j939j670j362p44p0O6l90p23k98P07J548J650
$$ 93114 91312 89446 87152 84609 82274 80335 78665 77303 76559 76489 76555 76165 75442 75144 75851 77399 79049
56737G9049R26l58j645k246j845q70q5K15L19M79N55M38M00P28J162J125N32k6
$$ 79049 79975 79617 77972 75726 73881 73011 72926 73141 73460 73939 74494 74932 75332 76060 77222 78347 78879 78853
56719G8853N1O65J194J207P93L51J87L39O02O76M20j5l55m89m13n3O23J204J012
$$ 78853 78904 79569 80763 81970 82763 83114 83301 83640 84242 84918 85338 85323 84968 84479 84066 84013 84636 85840 86852
56700H6852n5j121j195l16O09J051J379J998K506K188J067K1k04K69P40O68K6
$$ 86852 86797 85676 84481 84165 84774 85825 87204 89202 91708 93896 94963 94984 94780 95049 95789 96457 96483
56683I6483q42j491j587j036j03P14J043R14O43M10K20K31P91J803K351J573j57
$$ 96483 95641 94150 92563 91527 91424 92138 93181 94095 94738 95148 95368 95599 96390 98193 100544 102117 101960
56666A01960j402j243j96O09P07M37K37K14L08M20M67M78N49O24N11L43N37J149
$$ 101960 100558 99315 99119 99728 100435 100872 101109 101323 101631 102051 102518 102996 103545 104169 104680 105023 105560 106709
56648A06709J579J370R44J067J777K344K189J426N84K11N44J251J569J145M66
$$ 106709 108288 109658 110602 111669 113446 115790 117979 119405 119989 120200 120744 121995 123564 124709 125175
56633A25175J22n2n46j168j243o32J30O56R47R12M72J06L91R05N45p67j729j455
$$ 125175 125297 125245 124699 123531 122288 121656 121786 122442 123389 124301 124773 124879 125270 126175 126720 125953 124224 122769
56615A22769p24p52j470j853j435o94j91n2j83l91l96j42N8j4r4J25M67N51L70
$$ 122769 122045 121293 119823 117970 116535 115841 115650 115598 115415 115024 114628 114486 114544 114530 114436 114561 115028 115579 115949
56596A15949J64p2n14j150j762k121j956j074K68J388J849J801J446P15j94n72
$$ 115949 116113 116041 115527 114377 112615 110494 108538 107464 107732 109120 110969 112770 114216 114931 114737 114165
56580A14165m6Q01J195J115R37O86L53M40J353K541L066K777K223J723J335J397
$$ 114165 114119 114920 116115 117230 118167 118853 119206 119646 120999 123540 126606 129383 131606 133329 134664 136061
56564A36061K122K910L081L132M119N851O900O564N653N053M586L788K768J687
$$ 136061 138183 141093 144174 147306 151425 157276 164176 170740 176393 181446 186032 189820 192588 194275
56550A94275K89j378k562k754k466k417k585k609k566k706k862k765k542k388
$$ 194275 194564 193186 190624 187870 185404 182987 180402 177793 175227 172521 169659 166894 164352 161964
56536A61964k161j794j634j789j649p27M24R16P86Q26J294J578J129J06r32j556
$$ 161964 159803 158009 156375 154586 152937 152210 152634 153550 154336 155162 156456 158034 159163 159269 158337 156781
56520A56781j627j371j218j339j403j145q34q13q82o04m4L60M54L45j9o33r26
$$ 156781 155154 153783 152565 151226 149823 148678 147844 147031 146149 145545 145501 145861 146315 146660 146641 146008 145082
56503A45082k91Q64J307M83p97j328p45M25J441J823J499P78M5n56j024j158q11
$$ 145082 144791 145655 146962 147445 146648 145320 144575 145000 146441 148264 149763 150541 150586 150030 149006 147848 147037
56486A47037l59m06q82r76k09Q28J158N25m22q48m07N57J308J385J005O57L48
$$ 147037 146678 146272 145390 144414 144205 145033 146191 146716 146294 145446 145039 145596 146904 148289 149294 149951 150299
56469A50299k61r69r04L01J734K172J517P83P96J412K022K261K098J618R94N05
$$ 150299 150038 149069 148165 148466 150200 152372 153889 154672 155468 156880 158902 161163 163261 164879 165873 166378
56453A66378L38L89L24j08q07j301j137l58M36O78L63q6l96o33q58q75m80J60
$$ 166378 166716 167105 167429 167321 166514 165213 164076 163718 164154 164832 165195 165109 164713 164080 163222 162347 161867 162027
56435A62027N99N52J59j78j85P7L39L94K85K54M62P26O12n9q81j170o83J71Q62
$$ 162027 162626 163178 163337 163159 162974 163051 163390 163784 164069 164323 164785 165511 166123 166064 165183 164013 163330 163501 164363
56416A64363J251J440J427J220J081J292J683J801J475Q93K17m01n47J27J158
$$ 164363 165614 167054 168481 169701 170782 172074 173757 175558 177033 177926 178143 177742 177195 177322 178480
56401A78480J516R47M13P97J659J972J607J291J362J375R98N51M41P33J320K003
$$ 178480 179996 180943 181356 182153 183812 185784 187391 188682 190044 191419 192417 192968 193409 194142 195462 197465
56385A97465K216J469K28k95L37J151J082L11l23n33m72R5J397K714K888J872
$$ 197465 199681 201150 201378 201083 201420 202571 203653 203964 203641 203108 202636 202731 204128 206842 209730 211602
56369B11602Q84P44J002R47O69N46M20l5n38n36p5L22M88P07J039J131Q02L63
$$ 211602 212486 213230 214232 215179 215848 216394 216814 216779 216241 215705 215630 215952 216440 217147 218186 219317 220119 220482
56351B20482J87K93M98P54J123J550J790J608J021L55LN1K53M13O61J267K295
$$ 220482 220669 220962 221460 222214 223337 224887 226677 228285 229306 229661 229664 229715 229968 230381 231042 232309 234604
56334B34604L477M276M108K840J275O96J636L261M292M274L650K973K507K345
$$ 234604 238081 242357 246465 249305 250580 251276 252912 256173 260465 264739 268389 271362 273869 276214
56320B76214K372K166J491P87O73J017J095O78K86K43J35l45o74j37J116K220
$$ 276214 278586 280752 282243 283030 283703 284720 285815 286493 286779 287022 287157 286812 286138 286001 287117 289337
56304B89337K682K774K938L216L381L324L116K875K701K682K787K831K638K369
$$ 289337 292019 294793 297731 300947 304328 307652 310768 313643 316344 319026 321813 324644 327282 329651
56290C29651K407K822L039K520J722J834L317N108N823N324M620M483M892N610
$$ 329651 332058 334880 337919 340439 342161 343995 347312 352420 358243 363567 368187 372670 377562 383172
56276C83172O519P296P545P436P601Q180Q616Q680R000J0064J1387J2208J2663
$$ 383172 389691 396987 404532 411968 419569 427749 436365 445045 454045 464109 475496 487704 500367
56263E00367J3539J5142J7082J9026K1048K3158K5104K6866K8982L2076L6172
$$ 500367 513906 529048 546130 565156 586204 609362 634466 661332 690314 722390 758562
56252G58562M0689M5111M9484N4180N9226O4152O8630P2930P7330Q1311Q3755
$$ 758562 799251 844362 893846 948026 1007252 1071404 1140034 1212964 1290294 1371605 1455360
56241A455360Q4042Q2449P9506P5380O9957O2929N3766M2215K9043J5712K998
$$ 1455360 1539402 1621851 1701357 1776737 1846694 1909623 1963389 2005604 2034647 2050359 2053357
56230B053357r475k2015l3879m4049n2397n9406o5168o9397p2093p3521p3653
$$ 2053357 2043882 2021867 1987988 1943939 1891542 1832136 1766968 1697571 1625478 1551957 1478304
56219A478304p2363o9988o7132o3935o0136n5819n1482m7345m3230l9238l5922
$$ 1478304 1405941 1335953 1268821 1204886 1144750 1088931 1037449 990104 946874 907636 871714
56208H71714l3480l1241k8359k4859k1654j9559j8437j7390j5702j3534j1542
$$ 871714 838234 806993 778634 753775 732121 712562 694125 676735 661033 647499 635957
56197F35957r950q365o569n062m476m682m879m496l643k788k243k015j910j736
$$ 635957 626007 617642 611073 606011 601535 596853 591974 587478 583835 581047 578804 576789 574879 573143
56183E73143j447j060n23J88R12J557K332L357M161M214L942M408N784O960P028
$$ 573143 571696 570636 570113 570301 571213 572770 575102 578459 582620 586834 590776 595184 600968 607928 614956
56168F14956O341N659N129M809N288O819Q446R066Q949R225J0214J1263J2056
$$ 614956 621297 626956 632085 636894 642182 649001 657447 666513 675462 684687 694901 706164 718220
56155G18220J3021J4474J6322J8584K1413K4540K7527L0560L4301L9057M4759
$$ 718220 731241 745715 762037 780621 802034 826574 854101 884661 918962 958019 1002778
56144A002778N1561N9548O8016P5826Q2322Q7024Q8730Q6219P9941P1840O3456
$$ 1002778 1054339 1113887 1181903 1257729 1340051 1427075 1515805 1602024 1681965 1753805 1817261
56133A817261N5275M7958M2595L9210L6272L2444K7780K2666J6832J0286M136
$$ 1817261 1872536 1920494 1963089 2002299 2038571 2071015 2098795 2121461 2138293 2148579 2152715
56122B152715o17m545r100j5098k2681l2048m3020n4209o3744p0730p5253p7201
$$ 2152715 2152098 2147553 2138453 2123355 2100674 2068626 2025606 1971397 1907653 1836923 1761670 1684469
56110A684469p6043p1870o5818n9175n2504m5767l8858l1859k5019j8673j3165
$$ 1684469 1608426 1536556 1470738 1411563 1359059 1313292 1274434 1242575 1217556 1198883 1185718
56099A185718q787n686l580j637Q60L658N778O807P391Q256R317J0147J0733J1250
$$ 1185718 1176931 1171245 1167665 1166028 1166888 1170546 1176324 1183131 1190522 1198778 1208095 1218242 1228975 1240225
56085A240225J1500J1269J0880J0822J1045J1228J1504J2305J3527J4432J4544
$$ 1240225 1251725 1262994 1273874 1284696 1295741 1306969 1318473 1330778 1344305 1358737 1373281
56074A373281J4216J4158J4670J5453J5980J6074J6175J6991J8756K0915K2626
$$ 1373281 1387497 1401655 1416325 1431778 1447758 1463832 1480007 1496998 1515754 1536669 1559295
56063A559295K3537K3915K4213K4654K5189K5725K6286K6995K7864K8728K9427
$$ 1559295 1582832 1606747 1630960 1655614 1680803 1706528 1732814 1759809 1787673 1816401 1845828
56052A845828K9934L0207L0138K9748K9231K8636K7946K7666K8733L1248L3845
$$ 1845828 1875762 1905969 1936107 1965855 1995086 2023722 2051668 2079334 2108067 2139315 2173160
56041B173160L5050L5016L5160L6418L8635M1448M4707M8080N1241N4531N8519
$$ 2173160 2208210 2243226 2278386 2314804 2353439 2394887 2439594 2487674 2538915 2593446 2651965
56030B651965O2820O6217O8176O9435P0970P3100P5642P8132P9873Q0649Q1438
$$ 2651965 2714785 2781002 2849178 2918613 2989583 3062683 3138325 3216457 3296330 3376979 3458417
56019C458417Q3462Q6583Q9639R2298R5291R8862J02462J06197J11000J16902
$$ 3458417 3541879 3628462 3718101 3810399 3905690 4004552 4107014 4213211 4324211 4441113
56009D441113J22575J27277J31853J37155J42861J48589J54879J62154J69937
$$ 4441113 4563688 4690965 4822818 4959973 5102834 5251423 5406302 5568456 5738393
56000E738393J78014J87142J97705K08800K19681K31008K43725K57692K72436
$$ 5738393 5916407 6103549 6301254 6510054 6729735 6960743 7204468 7462160 7734596
55991G734596K88239L05612L24575L45252L68186L93477M20647M49994M82695
$$ 7734596 8022835 8328447 8653022 8998274 9366460 9759937 10180584 10630578 11113273
55982A1113273N19097N58452O01006O48615P02482P62275Q28379R03025R88049
$$ 11113273 11632370 12190822 12791828 13440443 14142925 14905200 15733579 16636604 17624653
55973A7624653J083936J192431J317756J463644J631937J826215K054551K326700
$$ 17624653 18708589 19901020 21218776 22682420 24314357 26140572 28195123 30521823
55965C0521823K651609L040665L510888M081896M771625N596840O573654P713378
$$ 30521823 33173432 36214097 39724985 43806881 48578506 54175346 60749000 68462378
55957F8462378R021104J0503143J2174489J4059086J6191141J8612918K1327136
$$ 68462378 77483482 87986625 100161114 114220200 130411341 149024259 170351395
55950A70351395K4174350K6698893K8145814K7676873K4726127J9285655J1940669
$$ 170351395 194525745 221224638 249370452 277047325 301773452 321059107 332999776
55943C32999776L639369m643411j2141615j8340902k2911876k5680085k6675349
$$ 332999776 336639145 331995734 319854119 301513217 278601341 252921256 226245907
55936B26245907k6167794k4597531k2425757k0014399j7594596j5295701j3183111
$$ 226245907 200078113 175480582 153054825 133040426 115445830 100150129 86967018
55929H6967018j1285566r613533q167096o934775n894150n019333m287149l676287
$$ 86967018 75681452 66067919 57900823 50966048 45071898 40052565 35765416 32089129
55921C2089129l165713k737361k377958k076277j821103j603580j418656j262064
$$ 32089129 28923416 26186055 23808097 21731820 19910717 18307137 16888481 15626417
55913A5626417j127930j011100r09413q21625p44940o76485o15516n62100n15042
$$ 15626417 14498487 13487387 12577974 11756349 11011409 10334924 9719408 9157308 8642266
55904H642266m72767m35018m01938l72526l45516l20866k98948k79127k60404
$$ 8642266 8169499 7734481 7332543 6960017 6614501 6293635 5994687 5715560 5455156
55895E455156k42696k26302k10866j95971j82000j69445j58106j47935j39727
$$ 5455156 5212460 4986158 4775292 4579321 4397321 4227876 4069770 3921835 3782108
55886C782108j34015j29926j26189j22544j19196j15632j11083j05703j00174
$$ 3782108 3648093 3518167 3391978 3269434 3150238 3034606 2923523 2817820 2717646
55877B717646r4568q8502q2170p6398p1836o8639o6588o5000o2992o0344n7680
$$ 2717646 2623078 2534576 2452406 2376008 2304172 2235533 2168945 2103945 2040953 1980609 1922929
55866A922929n5337n2661m8977m4641m0439l6526l2746k9586k7805k7326k7195
$$ 1922929 1867592 1814931 1765954 1721313 1680874 1644348 1611602 1582016 1554211 1526885 1499690
55855A499690k6677k5857k5279k5443k6585k8541l0747l2555l3564l3765l3558
$$ 1499690 1473013 1447156 1421877 1396434 1369849 1341308 1310561 1278006 1244442 1210677 1177119
55844A177119l3495l3566l2891l0753k7769k5311k3777k2386k0786j9620j9194
$$ 1177119 1143624 1110058 1077167 1046414 1018645 993334 969557 947171 926385 906765 887571
55833H87571j8686j7424j5904j4775j3752j2462j1509j1532j1885j1475j0545
$$ 887571 868885 851461 835557 820782 807030 794568 783059 771527 759642 748167 737622
55822G37622j0393j1437j2770j3570j3903j3956j3520j2664j2062j2113j2179
$$ 737622 727229 715792 703022 689452 675549 661593 648073 635409 623347 611234 599055
55811E99055j1328r544p748o699o236n677m758l864l370l056k475j704j269j347
$$ 599055 587727 578183 570435 563736 557500 551823 547065 543201 539831 536775 534300 532596 531327 529980
55797E29980j550j600j678j870j799j193m35k8J95R09K486M626O574P410O417
$$ 529980 528430 526830 525152 523282 521483 520290 519855 519827 520022 520931 523417 528043 534617 542027 548444
55782E48444L543n10m891r075j2706j5363j6833j7312j7069j6123j4486j2387
$$ 548444 551987 551477 546586 537511 524805 509442 492609 475297 458228 442105 427619 415232
55770D15232r978p276m707l264l479m575n243n117m897n112n381n071m131l038
$$ 415232 405254 397978 393271 390007 386528 381953 376710 371593 366696 361584 356203 351132 347001 343963
55756C43963k248j880j789j782j792j956k435l180m019m866n782o742p443p445
$$ 343963 341715 339835 338046 336264 334472 332516 330081 326901 322882 318016 312234 305492 298049 290604
55742B90604o647n584n023n152n367n098m506m039l658l110k663k780l146k908
$$ 290604 283957 278373 273350 268198 262831 257733 253227 249188 245530 242420 239757 236977 233831 230923
55728B30923k040j543j952k510k342j744j586k077k763l315l562l184k153j155
$$ 230923 228883 227340 225388 222878 220536 218792 217206 215129 212366 209051 205489 202305 200152 198997
55714A98997q81j039q47k66j4l40o44l90K11O70Q11O40J14o84j416j835k053k351
$$ 198997 198116 197077 196230 195964 195950 195610 194966 194576 194787 195457 196268 196908 197022 196338 194922 193087 191034 188683
55696A88683k755k973k706k094j763k253l228l612k751j219j63j1k57l35j60J92
$$ 188683 185928 182955 180249 178155 176392 174139 170911 167299 164548 163329 163166 163155 162898 162563 162403 162595
55680A62595Q01J565J937J427K92o01o59j55K42K97L11M17K63l53r88j099q15
$$ 162595 163396 164961 166898 168325 168617 168016 167357 167202 167444 167741 168052 168469 168732 168379 167391 166292 165477
55663A65477n77k93M12J258J472J061R82J698K399K120J018n5n91m94K46J241
$$ 165477 164900 164607 165019 166277 167749 168810 169792 171490 173889 176009 177027 176972 176381 175887 176133 177374
55647A77374J548N78j072k349k867k829k311j423p81r40j541j810j709j790k120
$$ 177374 178922 179500 178428 176079 173212 170383 168072 166649 165868 164928 163387 161577 159868 158078 155958
55632A55958k226k055k070k401k647k674k817l182l422l359l135k706j856q31
$$ 155958 153732 151677 149607 147206 144559 141885 139068 135886 132464 129105 125970 123264 121408 120577
55618A20577k40k37m66q40j542k115j621j60P31p4j773k723k461j864j648j632
$$ 120577 120337 120100 119634 118794 117252 115137 113516 113356 114087 114013 112240 109517 107056 105192 103544 101912
55602A01912j404r53n07k09j02j91m10o74q85q70n33j88l96j227j941j724o21
$$ 101912 100508 99555 99048 98839 98737 98546 98136 97462 96577 95707 95174 94986 94590 93363 91422 89698 89077
55585H9077O06J279J288R69Q64J384K374L101L065K676K815L742M816N350N287
$$ 89077 89683 90962 92250 93219 94083 95467 97841 100942 104007 106683 109498 113240 118056 123406 128693
55570A28693M998M748M561M375M000L088J436n97k196k786k625k579l278m508
$$ 128693 133691 138439 143000 147375 151375 154463 155899 155302 153106 150320 147695 145116 141838 137330
55556A37330n464n573n017m434m200m058l535k628j928j896k207k092j324m99
$$ 137330 131866 126293 121276 116842 112642 108584 105049 102421 100493 98597 96390 94298 92974 92475
55542I2475k24l96n14m03k80l35n59q54j016p88k19J64rl70l36n0j70p86j182
$$ 92475 92251 91855 91341 90938 90658 90323 89764 88910 87894 87106 86887 87051 87042 86672 86336 86286 86116 85330 84148
55523H4148q57j69K85M19M11K27k37q35j357j803k149k161j790j408j317j281
$$ 84148 83291 83122 83407 83826 84237 84464 84227 83392 82035 80232 78083 75922 74132 72724 71407 70126
55507G0126j044r63j492k242k299j522p82o75o69k0J014J557J408J202J333J345
$$ 70126 69082 68119 66627 64385 62086 60564 59782 59107 58438 58418 59432 60989 62397 63599 64932 66277
55491F6277O56n78j612j839j143J61J410J867J287K19m84m11K08P98P35k92j793
$$ 66277 66933 66355 64743 62904 61761 61922 63332 65199 66486 66705 66221 65810 66018 66816 67551 67259 65466
55474F5466k549j780j21J029J069N58J24k30n36n04j24K3l58o59k94K55M4r28
$$ 65466 62917 61137 61016 62045 63114 63672 63796 63566 63030 62526 62402 62425 62067 61408 61114 61369 61413 60485
55456F0485j654j412n25K51N45N10M21L59J61k40n07k86N1k90j213j462k77J314
$$ 60485 58831 57419 56894 57145 57690 58200 58621 58980 59141 58901 58394 58108 58159 57869 56656 55194 54917 56231
55438E6231J701P05n52j321j693j578o11P48J255N42k48m6P35R58L48m17p41n91
$$ 56231 57932 58637 58085 56764 55071 53493 52882 53630 54885 55427 55179 55133 55868 56826 57174 56757 56016 55425
55420E5425k13J23K33J94K94O55J113J513J717J369K19j162j706j230p82j159
$$ 55425 55212 55335 55568 55762 56056 56711 57824 59337 61054 62423 62642 61480 59774 58544 57762 56603
55404E6603j695j219K86J733K326K179J658Q46j97j141j575j329n98J37M37L00
$$ 56603 54908 53689 53975 55708 58034 60213 61871 62717 62520 61379 59804 58475 57877 58014 58451 58751
55388E8751Q7n6l46p44o57K86J478J913J347L95l85r23j168q80j06N81P10N19
$$ 58751 58838 58782 58436 57692 57035 57321 58799 60712 62059 62454 62069 61146 59978 59098 58992 59573 60283 60802
55370F0802N90R76J057L09r62j890j932j309n57J7L42L70K01J27K13k5r33j877
$$ 60802 61392 62368 63425 63734 62772 60882 58950 57641 57084 57101 57443 57813 58014 58141 58354 58329 57396 55519
55352E5519j785n76O42J014R17J078J403J282O59N6k94p19j382j870j678q85j10
$$ 55519 53734 53158 53800 54814 55731 56809 58212 59494 60153 60209 59915 59196 57814 55944 54266 53381 53271
55335E3271J32q0k35k8L67O65Q70J043R57M84O5K33P38Q08L28k1P8J25k02m53
$$ 53271 53403 53323 53088 53060 53427 54092 54962 56005 56962 57446 57511 57744 58482 59290 59618 59597 59675 59800 59598 59145
55315E9145l08l06r64j863k249k138k032j933j424m80N08J289J768J667Q79n5
$$ 59145 58837 58531 57567 55704 53455 51317 49285 47352 45928 45448 45956 47245 49013 50680 51559 51504
55299E1504l44J91J096J840J985J212j59j036o50M06R59P84N60N86M81J20q3M0
$$ 51504 51160 51351 52447 54287 56272 57484 57325 56289 55639 56045 57004 57788 58348 58934 59415 59535 59452 59492
55281E9492K02L64Q34J412J324L71n55o31j61o3o48j354j453o80N82J515J516
$$ 59492 59694 60058 60892 62304 63628 63999 63444 62813 62652 62589 61941 60587 59134 58454 59036 60551 62067
55264F2067P49j03o42r64j171j146r39q39q93p65k69L08O24O24M05J07L9M39R78
$$ 62067 62816 62713 62071 61107 59936 58790 57851 57012 56119 55354 55085 55393 56017 56641 57046 57153 57192 57631 58609
55245E8609R89L49k90l80j40n8k41m93o61o17j95N40J257J720J856J490M69p44
$$ 58609 59598 59947 59657 59277 59137 59079 58838 58345 57684 57067 56872 57412 58669 60389 62245 63735 64204 63460
55227F3460j320j153j073j528j745q73N53J240R50P39J294J911J550L11p24r55
$$ 63460 62140 60987 59914 58386 56641 55768 56321 57561 58511 59250 60544 62455 64005 64316 63592 62637
55211F2637r01j253j748j528m75M06K76l86n44j05J01k00k70L54R54O24l71r39
$$ 62637 61736 60483 58735 57207 56732 57138 57414 57028 56484 56379 56480 56280 56010 56364 57318 57942 57571 56632
55193E6632n81J54N36M58K91L26M76M37J84J26N66J073R15J85k19Q5L48n1n11
$$ 56632 56051 56205 56741 57199 57490 57816 58292 58729 58913 59039 59605 60678 61593 61778 61559 61644 61992 61941 61430
55174F1430j61O68Q75K50k95j41L11N39O40Q12P06j42j525k613k654j493L42J913
$$ 61430 61269 61937 62812 63062 62767 62626 62937 63476 64116 64928 65634 65492 63967 61354 58700 57207 57549 59462
55156E9462K503K217J806J731J694J193K76n22q63r20j030j169r54j64P73J148
$$ 59462 61965 64182 65988 67719 69413 70606 70882 70360 69497 68577 67547 66378 65424 65260 66033 67181
55140F7181Q03L87M85P83O12O5o5M64Q29K76p81j314j022n74n27o07k52M91R40
$$ 67181 67984 68371 68856 69639 70251 70316 70251 70715 71544 71820 71039 69725 68703 68129 67602 66995 66743 67234 68174
55121F8174N76l49j077j115o44j85k0n2p6M3L64P87Q94K64q70j612j302l12M34
$$ 68174 68750 68401 67324 66209 65565 65380 65360 65308 65232 65275 65639 66426 67320 67584 66714 65102 63800 63488 63922
55102F3922N33L60L31M02M08M08M92N14L82L29O07J023J183J025Q23O64L30k14
$$ 63922 64455 64815 65146 65548 65956 66364 66856 67370 67752 68081 68688 69711 70894 71919 72742 73406 73736 73522
55084G3522o21n97k76M3K35K71N9m30r57j214j069n51K31R80J293J136R50J059
$$ 73522 72901 72304 72028 72071 72306 72577 72636 72206 71249 70035 68966 68415 68646 69626 70919 72055 73005 74064
55066G4064J122O10l48j034r87m23J49M05K63r1k87j84j90p67j642j997j514p14
$$ 74064 75186 75796 75448 74414 73427 73004 73153 73558 73821 73730 73443 73259 73069 72302 70660 68663 67149 66435
55048F6435j95k0o5l93r05j145q01j75K83N35O99O14J40l65m05n3K01K11L18P08
$$ 66435 66240 66220 66155 65762 64857 63712 62911 62736 63019 63554 64253 64867 65007 64642 64237 64184 64385 64596 64914 65622
55028F5622J066R96M39l50j012j238r39l47K20O28Q55Q01M73J81K02L29J61k09
$$ 65622 66688 67684 68123 67773 66761 65523 64584 64237 64457 65085 65940 66741 67214 67395 67597 67926 68087 67878
55010F7878k32K92R62J393J660J828J548O05m74q50l92J90K69k7k03j24j2J8J00
$$ 67878 67646 67938 68900 70293 71953 73781 75329 75934 75460 74610 74218 74408 74677 74650 74447 74323 74311 74329 74429
54991G4429K89M06L69L84O26R02Q30L64j57m37n19n69n92m64j56J95L65K57Q1
$$ 74429 74718 75124 75493 75877 76503 77405 78235 78599 78442 78005 77486 76917 76325 75861 75705 75900 76265 76522 76603
54972G6603K46Q60J472J496R39L40K4j73l71l36O0M77N72M67M14K95p9m75n36
$$ 76603 76849 77709 79181 80677 81616 81956 81980 81807 81436 81100 81160 81637 82209 82676 83090 83385 83306 82831 82295
54953H2295m21n44p83o01jL33N4k66k9L97J78o94j255p88K38P80N24K04N94J506
$$ 82295 81874 81330 80547 79946 79945 80278 80332 80066 80037 80434 80612 79918 78663 77875 78113 78893 79417 79621 80215 81721
54933H1721K006J536N37j15m8L12K96k97j003j134n18K37M54K89N98J724K884
$$ 81721 83727 85263 85800 85685 85637 85949 86245 85948 84945 83811 83293 83530 83984 84273 84871 86595 89479
54916H9479L181K825K775L379L985M011L706L593L606L194K126Q21j37o28j119
$$ 89479 92660 95485 98260 101639 105624 109635 113341 116934 120540 123734 125860 126681 126544 125916 124797
54901A24797k114l461m328m121l319k971l359l565k685j134k42o64j606j823j092
$$ 124797 122683 119222 114894 110773 107454 104483 101124 97559 94874 93740 93498 92834 91228 89405 88313
54886H8313l69n34j296j638j108l15k2j65r4M98J295J931K367K639K706K677K884
$$ 88313 87944 87410 86114 84476 83368 83053 83031 82866 82772 83270 84565 86496 88863 91502 94208 96885 99769
54869I9769L466M082M255L851L074K192J434R73P00J41j041k480l284k973k034
$$ 99769 103235 107317 111572 115423 118497 120689 122123 123096 123796 123937 122896 120416 117132 114159 112125
54854A12125j477j845k835l717l988l633k940k216j680j403j367j535j834j987
$$ 112125 110648 108803 105968 102251 98263 94630 91690 89474 87794 86391 85024 83489 81655 79668
54840G9668j627p67m1j41r22j499j288o00l6K81N35O85N95N03P58J171J166O45
$$ 79668 78041 77274 77233 77092 76170 74671 73383 72783 72747 73028 73563 74248 74843 75346 76104 77275 78441 79086
54822G9086J66J67M43O14O59P05O13J76m65q83q88o69n40n84o44m81L8Q00J456
$$ 79086 79252 79419 79862 80476 81135 81840 82453 82629 82164 81281 80393 79724 79184 78600 77956 77475 77513 78313 79769
54803G9769J607J074N8r48j524j621j438j045l07P41J715K211K143J587O40l65
$$ 79769 81376 82450 82508 81560 80036 78415 76977 75932 75625 76366 78081 80292 82435 84022 84662 84297
54787H4297q57o25j53k4j95k69j64K3M40J135J507R65pk74M29J204J358J128Q97
$$ 84297 83440 82815 82662 82638 82443 82174 82010 82033 82473 83608 85115 86080 86073 85799 86228 87432 88790 89918 90815
54768I0815O53N94J282K581L335K897K166K294L055L441L296L276L512L514L220
$$ 90815 91468 92062 93344 95925 99260 102157 104323 106617 109672 113113 116409 119685 123197 126711 129931
54753A29931K984K569J246q83k700l528l824m090m023l370k769k922l407l173
$$ 129931 132915 135484 136730 135847 133147 129619 125795 121705 117682 114312 111543 108621 105214 102041
54739A02041k052r84p14r20q09k14K54Jq44j578j676j272p98m45j66l%J20P45
$$ 102041 99989 99005 98291 97371 96562 96348 96602 96603 95759 94181 92505 91233 90435 89990 89824 89821 89821 89941 90686
54720I0686J749K543K875L109L493L658L264K722K694L073L077K326J302N89R9
$$ 90686 92435 94978 97853 100962 104455 108113 111377 114099 116793 119866 122943 125269 126571 127160 127259
54705A27259o49j751k736l117k936k726k955l565m024l878l180k326j569q59j24
$$ 127259 126610 124859 122123 119006 116070 113344 110389 106824 102800 98922 95742 93416 91847 90988 90864
54690I0864M58O25L42j44n89q97j015q10k64K89L27k73j014j289r95m95j11O1
$$ 90864 91322 91947 92289 92145 91556 90659 89644 88834 88570 88859 89186 88913 87899 86610 85615 85120 85009 85070
54672H5070q7o49j305j407p11K04O33O22P73J231J410Q67J7l35K5N25M99j22q61
$$ 85070 84983 84334 83029 81622 80911 81115 81748 82370 83143 84374 85784 86651 86668 86333 86358 86883 87382 87260 86399
54653H6399j159q43k31J29l6m80p61p37n79l66N9P38J367J553J224O30J10m9K90
$$ 86399 85240 84397 84166 84295 84259 83779 83018 82281 81702 81336 81395 82133 83500 85053 86277 86907 87017 86968 87258
54634H7258Q77J134O97j49q38j139j165r08l24K25K14j63o7P24J272P48k62n41
$$ 87258 88135 89269 89966 89817 88979 87840 86675 85767 85443 85668 85882 85719 85652 86376 87648 88396 88134 87593
54616H7593mK73k45q07o16j9J83k2l1L03N08L66K83O26J139J319J044N66O5m80
$$ 87593 87589 87862 87617 86810 86194 86175 86358 86336 86305 86608 87116 87482 87765 88391 89530 90849 91893 92459 92524 92044
54596I2044j045j359j139m61J78L01p5m54m23p9J72Q0l63j097j941k383j861m48
$$ 92044 90999 89640 88501 88040 88218 88519 88444 87990 87567 87488 87660 87740 87377 86280 84339 81956 80095 79647
54578G9647J029J768J716J332R07M68J65K51O09P75N50K29O1j56n59p32k46N23
$$ 79647 80676 82444 84160 85492 86399 86867 87032 87283 87892 88667 89217 89446 89507 89351 88792 88060 87814 88337
54560H8337P01R2n66n98k01M2j3j45k61l65k18M06J185J402Q28O6j79J51N95Q67
$$ 88337 89038 89130 88564 87966 87765 87807 87794 87649 87388 87023 86805 87211 88396 89798 90626 90692 90513 90664 91259 92126
54540I2126J092J377J475J064K58l45k69K87P14P51P47J004J204Q07j39r04q74
$$ 92126 93218 94595 96070 97134 97392 97047 96778 97065 97779 98530 99277 100281 101485 102292 102153 101249 100375
54523A00375j63O08R18P20L27R8R8P7j50m05l82j56j71o37j220j394r88l07J96
$$ 100375 100212 100820 101738 102458 102785 102883 102981 103058 102908 102503 102121 101965 101794 101157 99937 98543 97555 97248 97444
54504I7444K90J09n5j66n23j213j725j459n84J29L33M11O12N52Nl80J56J263J819
$$ 97444 97734 97843 97788 97622 97099 95886 94161 92702 92118 92247 92580 92991 93603 94155 94160 93780 93936 95199 97018
54485I7018J381O42L24L09J28k20l90l10j97p8K61Q46J339J438J235J052R86Q05
$$ 97018 98399 99041 99365 99674 99802 99582 99192 98882 98685 98607 98868 99714 101053 102491 103726 104778 105764 106569
54467A06569L15k40k96L98J359J703J001k74j188j203n98p5j3j61p6K19K30l40
$$ 106569 106884 106644 106348 106746 108105 109808 110809 110535 109347 108144 107546 107471 107458 107297 107221 107440 107670 107330
54449A07330j107j405j096o80o33q43q33l57L52Q75R80P78N48M69M47K94j1k87
$$ 107330 106223 104818 103722 103042 102409 101566 100733 100376 100728 101603 102583 103361 103909 104378 104825 105119 105108 104821
54431A04821l43j37K46O74R91J105J082J026Q47K95o27j433j536r17k41j35m34
$$ 104821 104478 104341 104587 105261 106252 107357 108439 109465 110312 110607 109980 108547 107011 106094 105853 105718 105284
54414A05284l59M38J260J114nr68q06K40J207J573J493J166O10K4j93L4L34M34
$$ 105284 104925 105363 106623 107737 107732 106764 105958 106198 107405 108978 110471 111637 112247 112271 112078 112112 112446 112880
54396A12880M64N58N71M32L79N98R05J046J017Q27L26l71o70j95N72P65J67o99
$$ 112880 113344 113902 114473 114905 115284 115882 116787 117833 118850 119677 120003 119632 118962 118767 119339 120104 120271 119572
54378A19572j313j467j055j56O81P94K53j57P8O00P25K86l02n43k76K14M63L25
$$ 119572 118259 116792 115737 115581 116262 117056 117309 117152 117230 117830 118555 118841 118539 117996 117720 117934 118397 118722
54360A18722J25P4j67r28j705j648p49J01L93N56R52J184Q20K00j18j95l84n91
$$ 118722 118847 118921 118754 117826 116121 114473 113724 113825 114218 114774 115726 116910 117730 117930 117812 117617 117233 116642
54342A16642n15l07l34m80l40J19N83R13J126J037O26M69J186K421L156K954K219
$$ 116642 116127 115820 115486 115006 114666 114785 115368 116281 117407 118444 119070 119539 120725 123146 126302 129256 131475
54325A31475J281O2j155j586r79j43N0l65q55j226j521j567j281j097j474k125
$$ 131475 132756 132818 131663 130077 129098 128955 129005 128640 127785 126559 125038 123471 122190 121093 119619 117494
54309A17494k324j885j313r75o69j07N45Q51O30Q4l74l89J27R40J592J644R24
$$ 117494 115170 113285 111972 110997 110328 110221 110766 111617 112247 112331 111957 111568 111695 112635 114227 115871 116795
54292A16795k69j208j242m35M79Q71P40L71j80q62j263r91l16J09J77L97R37J217
$$ 116795 116526 115318 114076 113641 114120 114991 115731 116102 115922 115060 113797 112806 112490 112599 112776 113173 114110 115327
54274A15327Q02J95J46M99L71n81j682k101j659o71M50J196J111M23L9M06P73
$$ 115327 116129 116324 116470 116969 117340 116759 115077 112976 111317 110646 111096 112292 113403 113826 113865 114271 115044
54257A15044K55p11q35J84J266J539J320J165Q59J29m88l63J01Qo60j143j162
$$ 115044 115299 114588 113753 113937 115203 116742 118062 119227 120086 120215 119727 119364 119465 119473 118813 117670 116508
54240A16508j126j180r58m68k73n55p99o57m27l23n6M75P29L00m19q47j008j158
$$ 116508 115382 114202 113244 112776 112503 111948 111149 110492 110065 109742 109686 110161 110890 111190 110771 109924 108916 107758
54222A07758j136o81q9J33J2J8L25O68P86O42K94m3n2K70M42J70o9L82J329J828
$$ 107758 106622 105941 105852 105985 105997 106015 106340 107008 107794 108436 108730 108687 108635 108905 109347 109517 109448 109830 111159 112987
54202A12987J376N14J37M93J071J260J026Q52J023J098M35q05j700j754j505j646
$$ 112987 114363 114877 115014 115507 116578 117838 118864 119716 120739 121837 122272 121467 119767 118013 116508 114862
54186A14862k020j957j256l38L10M24j2n60n05K89J022R16K36k45l09j67L23J323
$$ 114862 112842 110885 109629 109291 109601 110025 110013 109453 108948 109237 110259 111175 111411 111166 110857 110690 111013 112336
54168A12336K136J675j8j624k138j872j651j723j769j443n86O26J498J281R2j030
$$ 112336 114472 116147 116129 114505 112367 110495 108844 107121 105352 103909 103323 103949 105447 106728 106820 105790
54152A05790j216n26M31J152J297P29j39n09j9Q32J305J154N58j96p69q35m43
$$ 105790 104574 104048 104479 105631 106928 107657 107518 107009 106990 107822 109127 110281 110839 110643 109874 109039 108596
54135A08596n4M0kQ7L40P40J318J896K101J820J303P08L1m51k29O38J303J094
$$ 108596 108542 108582 108580 108667 109007 109747 111065 112961 115062 116882 118185 118893 118924 118473 118244 118882 120185 121279
54117A21279K73n18j093j568j820j628j103n43l9M40P49O94K80l39r22j040m02
$$ 121279 121552 121034 119941 118373 116553 114925 113822 113279 113240 113680 114429 115123 115403 115064 114142 113102 112700
54100A12700N38Q31K48l40j93K64K83O2L01Q78R24K09m87m72K2L69L68K34K21
$$ 112700 113238 114069 114317 113977 113784 114048 114331 114393 114694 115572 116496 116705 116218 115746 115768 116137 116505 116739 116960
54081A16960M54R38J531K019K247K082J404L80n21r80j165j298j262r59p33q38
$$ 116960 117414 118352 119883 121902 124149 126231 127635 128015 127494 126514 125349 124051 122789 121830 121097 120259
54065A20259q22j25R11J358J009N51M19K94k4j10L58R70J202J139J147J249J279
$$ 120259 119437 119312 120223 121581 122590 123141 123560 123854 123830 123720 124078 125048 126250 127389 128536 129785 131064
54048A31064J314J491J650J649J729K154K665K818K720K938L680M463M705M323
$$ 131064 132378 133869 135519 137168 138897 141051 143716 146534 149254 152192 155872 160335 165040 169363
54034A69363L708L310L276L303K899J986J169J161J951K751K831K148J233O58
$$ 169363 173071 176381 179657 182960 185859 187845 189014 190175 192126 194877 197708 199856 201089 201747
54020B01747O92J165J593J585J185P25M04K60M86J353K694L819M159L748K818
$$ 201747 202439 203604 205197 206782 207967 208692 209096 209356 209842 211195 213889 217708 221867 225615 228433
54005B28433J286q99l252n036o051o674p136p275p012o558o038n294m362l639
$$ 228433 229719 228820 225568 220532 214481 207807 200671 193396 186384 179826 173788 168494 164132 160493
53991A60493l327l065k467j669j023o12m05n29r41j174r27o38q50j252j119m90
$$ 160493 157166 154101 151634 149965 148942 148330 147925 147396 146455 145281 144354 143716 142866 141614 140495 140005
53975A40005j68m67p55m80M5J57k97r66j373j097k8J256J795J220J70m44k12P06
$$ 140005 139837 139370 138615 138135 138180 138337 138040 137074 135701 134604 134576 135832 137627 138847 139017 138573 138361 139067
53957A39067J810K391K046J286J077J518J676J051M06O09J326J685J604J635J851
$$ 139067 140877 143268 145314 146600 147677 149195 150871 151922 152328 152937 154263 155948 157552 159187 161038
53942A61038J791J471J527K318L403M068L952L193K378K205K826L595L753L290
$$ 161038 162829 164300 165827 168145 171548 175616 179568 182761 185139 187344 190170 193765 197518 200808
53928B00808K707K297K065K093K419K703K564K107J738J580J634K113L081M002
$$ 200808 203515 205812 207877 209970 212389 215092 217656 219763 221501 223081 224715 226828 229909 233911
53914B33911M314M203M162M061L518K864K728K769J968L56p72p43n02j108k170
$$ 233911 238225 242428 246590 250651 254169 257033 259761 262530 264498 264854 264082 263339 262837 261729 259559
53899B59559k644k413k203k339k514k590k876l536m313m917n304n522n527n211
$$ 259559 256915 254502 252299 249960 247446 244856 241980 238444 234131 229214 223910 218388 212861 207650
53885B07650m477l378k241j560j572k038k518k732k641k386k226k315k398k002
$$ 207650 203173 199795 197554 195994 194422 192384 189866 187134 184493 182107 179881 177566 175168 173166
53871A73166j051k1N64O56N44M26K87L0l03m61j69N05J158J644K378L728N352
$$ 173166 172115 172094 172658 173314 173858 174284 174571 174601 174298 173837 173668 174173 175331 176975 179353 183081 188433
53854A88433O658P649Q617R154Q380O221L640J344r67l602n958p183p268o852
$$ 188433 195091 202740 211357 220511 228891 235112 238752 240096 239129 235527 229569 222386 215118 208266
53840B08266o317n608m659l490k064n03P19J183J008O60M35L51K75j0o63j501
$$ 208266 201949 196341 191682 188192 186128 185625 186344 187527 188535 189195 189630 189981 190256 190246 189583 188082
53824A88082k140k499k821l068k866k202j667j563j385o14M22J005R46N52N0l48
$$ 188082 185942 183443 180622 177554 174688 172486 170819 169256 167871 167257 167679 168684 169630 170182 170232 169884
53808A69884k60M37J266J805K344L254M100M158L627L433L811L970L299K253J667
$$ 169884 169624 170061 171327 173132 175476 178730 182830 186988 190615 194048 197859 201829 205128 207381 209048
53793B09048J715J863J540O93j93m96j34K36k4o65q95n02j90o32j602k281k187
$$ 209048 210763 212626 214166 214859 214666 214170 214036 214272 214248 213583 212688 212186 211996 211364 209762 207481 205294
53776B05294j625j381j959l043l777l685l194k973l030k875k381j926j739j617
$$ 205294 203669 202288 200329 197286 193509 189824 186630 183657 180627 177752 175371 173445 171706 170089
53762A70089j452j477j767j911j531q35l52k91m56o50q69j103j121o42L15J315
$$ 170089 168637 167160 165393 163482 161951 161116 160764 160473 160017 159367 158498 157395 156274 155632 155947 157262
53746A57262J812J575Q43Q0l26k48Q8K07j52o10n08K26R10J003P43O55Q31J071
$$ 157262 159074 160649 161492 161572 161246 160998 161086 161293 161141 160531 160023 160249 161159 162162 162905 163560 164391 165462
53728A65462J378J768J936J641J292J476K062K358K178K087K443K805K595J921
$$ 165462 166840 168608 170544 172185 173477 174953 177015 179373 181551 183638 186081 188886 191481 193402
53714A93402J384J259J241R10K14m78p34m28K39J053J938K788L384L673L915M283
$$ 193402 194786 196045 197286 198196 198410 197932 197198 196770 197009 198062 200000 202788 206172 209845 213760 218043
53698B18043M515M232L472K607J912J386R32M95J69K78R73J643J313j9j079r03
$$ 218043 222558 226790 230262 232869 234781 236167 237099 237594 237763 238041 239014 240657 241970 241951 240872 239969
53682B39969j44ll95k69N92J190Q52Rp43j386j932j986j301k34P36J394J576J165
$$ 239969 239825 239822 239427 239158 239750 240940 241792 241801 241058 239672 237740 235754 234453 234219 234955 236349 237925 239090
53664B39090N31K37J46m13j380j845j531j322j717j852r59J52K43l75l56N73J344
$$ 239090 239621 239858 240004 239591 238211 236366 234835 233513 231796 229944 228985 229137 229380 229005 228649 229222 230566
53647B30566J325J068J114J168R29Q39J384K261K738K449J552N09n6L13J306J977
$$ 230566 231891 232959 234073 235241 236170 237009 238393 240654 243392 245841 247393 247902 247846 248159 249465 251442
53631B51442J778J185R57J171J393J502J750K158K380K291K239K558L148L718
$$ 251442 253220 254405 255362 256533 257926 259428 261178 263336 265716 268007 270246 272804 275952 279670
53617B79670M191M582M722M483M143M100M209L870K980K388K942M278N051M417
$$ 279670 283861 288443 293165 297648 301791 305891 310100 313970 316950 319338 322280 326558 331609 336026
53603C36026K890J643J298J561J758J481Q82M74N91R56R67M05l25p86r80j122
$$ 336026 338916 340559 341857 343418 345176 346657 347539 348013 348604 349560 350527 350932 350607 349821 348841 347719
53587C47719j170r54o11n92j147k030k677k667k000j054k62J97L50K52M9R8O96
$$ 347719 346549 345595 344984 344392 343245 341215 338538 335871 333871 332817 332555 332752 333102 333354 333403 333501 334197
53570C34197J574K093K070K023K371K674K225J110J44k11l47p69j388j833k076
$$ 334197 335771 337864 339934 341957 344328 347002 349227 350337 350481 350270 349923 349154 347766 345933 343857
53555C43857k262k068r13J048K589K582J335K85L27R73J322J351J738K745L933
$$ 343857 341595 339527 338614 339662 342251 344833 346168 346453 346780 347753 349075 350426 352164 354909 358842
53540C58842M920N748O425O657O374O116O468P361Q265Q926R536J0249J0932J1446
$$ 358842 363762 369510 375935 382592 388966 395082 401550 408911 417176 426102 435638 445887 456819 468265
53526D68265J1981J2794J3747J4322J4328J4363J5224J6838J8174J8501J8365
$$ 468265 480246 493040 506787 521109 535437 549800 565024 581862 600036 618537 636902
53515F36902J8892K0466K2529K4433K5864K6581K6547K6294K6468K6870K6632
$$ 636902 655794 676260 698789 723222 749086 775667 802214 828508 854976 881846 908478
53504I08478K5588K4650K4517K4738K4589K4206K4192K4502K4479K3775K2660
$$ 908478 934066 958716 983233 1007971 1032560 1056766 1080958 1105460 1129939 1153714 1176374
53493A176374K1607K0944K0760K0738K0307J9337J8445J8234J8503J8621J8337
$$ 1176374 1197981 1218925 1239685 1260423 1280730 1300067 1318512 1336746 1355249 1373870 1392207
53482A392207J7813J7178J6505J5946J5357J4095J1819R166P030N402L580J250
$$ 1392207 1410020 1427198 1443703 1459649 1475006 1489101 1500920 1510086 1517116 1522518 1526098 1527348
53470A527348j375m230p321j0110j1958j3182j4693j6463j7410j7155j6839j7577
$$ 1527348 1525973 1521743 1514422 1504312 1492354 1479172 1464479 1448016 1430606 1413451 1396612 1379035
53458A379035j9004k0122k0862k1822k2959k3541k3321k2851k2597k2406k1980
$$ 1379035 1360031 1339909 1319047 1297225 1274266 1250725 1227404 1204553 1181956 1159550 1137570
53447A137570k1332k0534j9474j8085j6513j4869j3044j0990q993p471o534n870
$$ 1137570 1116238 1095704 1076230 1058145 1041632 1026763 1013719 1002729 993736 986265 979731 973861
53435I73861m988l531j497P07K529L771M797O128P811R376J0458J1287J2389J3991
$$ 973861 968873 965342 963845 964552 967081 970852 975649 981777 989588 998964 1009422 1020709 1033098 1047089
53421A047089J5866J7718J9389K0810K2063K3462K5226K7065K8505K9653L1101
$$ 1047089 1062955 1080673 1100062 1120872 1142935 1166397 1191623 1218688 1247193 1276846 1307947
53410A307947L2933L4520L5663L7252L9989M3121M5302M6530M8094N0602N3128
$$ 1307947 1340880 1375400 1411063 1448315 1488304 1531425 1576727 1623257 1671351 1721953 1775081
53399A775081N4669N5518N6551N7831N8678N8815N8695N8789N9072N9256N9109
$$ 1775081 1829750 1885268 1941819 1999650 2058328 2117143 2175838 2234627 2293699 2352955 2412064
53388B412064N8431N7014N4786N1949M8869M5750M2440L8681L4593L0705K7272
$$ 2412064 2470495 2527509 2582295 2634244 2683113 2728863 2771303 2809984 2844577 2875282 2902554
53377B902554K3820J9764J5274J0975O820J967m094j0913j7812k4615l1289l7457
$$ 2902554 2926374 2946138 2961412 2972387 2979207 2981174 2977080 2966167 2948355 2923740 2892451 2854994
53365B854994m2820m7641n2219n6135n8667n9784o0195o0470o0551o0100n8880
$$ 2854994 2812174 2764533 2712314 2656179 2597512 2537728 2477533 2417063 2356512 2296412 2237532
53354B237532n6866n4416n2248n0855m9945m8927m7866m7393m7571m7514m6452
$$ 2237532 2180666 2126250 2074002 2023147 1973202 1924275 1876409 1829016 1781445 1733931 1687479
53343A687479m4648m2829m1058l8786l5895l3096l1087k9640k7900k5460k2772
$$ 1687479 1642831 1600002 1558944 1520158 1484263 1451167 1420080 1390440 1362540 1337080 1314308
53332A314308k0523j8834j7418j6227j5553j5422j5388j5123j4825j4661j4116
$$ 1314308 1293785 1274951 1257533 1241306 1225753 1210331 1194943 1179820 1164995 1150334 1136218
53321A136218j2553j0315q581p931p621o591m776k935j504k16J216K615L768M888
$$ 1136218 1123665 1113350 1104769 1096838 1089217 1082626 1077850 1074915 1073411 1073195 1074411 1077026 1080794 1085682
53307A085682O361Q185R947J1338J2477J3786J5596J7907K0352K2396K3706K4388
$$ 1085682 1092043 1100228 1110175 1121513 1133990 1147776 1163372 1181279 1201631 1224027 1247733 1272121
53295A272121K4918K5739K6941K8230K9151K9375K8798K7522K5820K4095K2727
$$ 1272121 1297039 1322778 1349719 1377949 1407100 1436475 1465273 1492795 1518615 1542710 1565437
53284A565437K1729K0656J8995J6656J3870J0668O887K796p68l322n429p965j0954
$$ 1565437 1587166 1607822 1626817 1643473 1657343 1668011 1674898 1677694 1676926 1673604 1668175 1660210 1649256
53271A649256j3792j6367j9137k2012k4160k5330k6458k8279l0072l0710l0471
$$ 1649256 1635464 1619097 1599960 1577948 1553788 1528458 1502000 1473721 1443649 1412939 1382468
53260A382468l0720l1914l3005l2978l2087l1202l0642l0137k9488k8785k8200
$$ 1382468 1351748 1319834 1286829 1253851 1221764 1190562 1159920 1129783 1100295 1071510 1043310
53249A043310k7843k7720k7670k7515k7273k6998k6511k5682k4888k4583k4379
$$ 1043310 1015467 987747 960077 932562 905289 878291 851780 826098 801210 776627 752248
53238G52248k3274k1054j8780j7451j6770j5779j4203j2479j0955r737r121r364
$$ 752248 728974 707920 689140 671689 654919 639140 624937 612458 601503 591766 582645 573281
53226E73281j0065j0408j0153r849r995j0497j1034j1507j1899j2022j1745j1232
$$ 573281 563216 552808 542655 532806 522811 512314 501280 489773 477874 465852 454107 442875
53214D42875j0809j0667j0701j0529r729q290o766n857n758o118o487o633o535
$$ 442875 432066 421399 410698 400169 390440 382150 375384 369527 363769 357651 351164 344531 337996
53201C37996o388o513o955p192o700n719n051n019n148m948m565m331m159l818
$$ 337996 331608 325095 318140 310948 304248 298529 293478 288459 283311 278363 273798 269467 265308 261490
53187B61490l496l497l624l324k519j831j790k171k357k142j899j941k025j633
$$ 261490 257994 254497 250873 247549 245030 243199 241409 239238 236881 234739 232840 230899 228874 227241
53173B27241p29Qj26r93j655j335k30P27P98N8p72r35j88R84J689J370L12o39
$$ 227241 226512 226520 226394 225401 223746 222411 222181 222908 223706 223764 222992 222057 221869 222853 224542 225912 226224 225585
53155B25585r18o65l73l70p03j286j846j942j344m03K49M25M37M74K92k69q04
$$ 225585 224667 224002 223629 223259 222556 221270 219424 217482 216138 215735 215984 216409 216846 217320 217612 217343 216539
53138B16539p73k46J97K13J2p8n8j29l88p20q78o76k27N2o0k18O5N69N14l96j421
$$ 216539 215766 215520 215717 215930 215942 215864 215806 215677 215289 214569 213691 213015 212788 212840 212780 212562 212627 213196 213710 213314 211893
53117B11893j632r64j67J37r4n57r55j072q49m38q1P0k1l61q81j398j735j788
$$ 211893 210261 209297 209130 209267 209173 208616 207661 206589 205740 205302 205221 205291 205270 204909 204028 202630 200895 199107
53099A99107j451p34k1R1m92j082r98l99L2P5J25L67L94p4n91m86J93O87N09N8
$$ 199107 197656 196922 196901 196992 196500 195418 194420 194021 194053 194128 194253 194620 195014 194940 194349 193863 194056 194743 195252 195310
53079A95310N8N38P58K02o40q46k32M47N21J67n4PJ42L09O02Q32O20n3p55j141
$$ 195310 195368 195906 196664 196866 196226 195380 195148 195595 196116 196283 196229 196236 196378 196687 197289 198121 198741 198688 197933 196792
53059A96792j213j052o26j4M33M58K41K33O12J081J151P19K48K48O01O33j3r34
$$ 196792 195579 194527 193901 193887 194320 194778 195019 195252 195864 196945 198096 198815 199063 199311 199912 200545 200532 199598
53041A99598j544j787j923j964j755j419j201r57l61M12P22K66n52j146j207p07
$$ 199598 198054 196267 194344 192380 190625 189206 188005 187048 186687 187099 187821 188087 187535 186389 185182 184475
53025A84475Q1N77M18P7L45J115J395O92k49n45k43J40N15R72J169P70J27j95
$$ 184475 184556 185133 185551 185628 185973 187088 188483 189175 188926 188381 188138 188278 188793 189765 190934 191704 191831 191636
53007A91636l39q10j384j271l48N34P39N75N66O30L97r3m57m91k70QP0k46o36
$$ 191636 191297 190487 189103 187832 187484 188018 188757 189332 189898 190528 190925 190832 190375 189884 189614 189622 189692 189446 188810
52988A88810m62M24J283J347Q22N48P93R56N52n4k27KQ0k09m93m44k23l1L22J010
$$ 188810 188348 188772 190055 191402 192224 192772 193565 194521 195073 195019 194792 194794 194874 194665 194172 193728 193505 193474 193796 194806
52968A94806J605J465P31L40Q30J648K017K023K249K699K746K132J263M56m49
$$ 194806 196411 197876 198607 198947 199777 201425 203442 205465 207714 210413 213159 215291 216554 217010 216561
52953B16561j425j937j753j561k089k939l039k168j266j111j351j188n11J32L66
$$ 216561 215136 213199 211446 209885 207796 204857 201818 199650 198384 197273 195922 194734 194223 194355 194721
52938A94721K98J37p9l39n79q48j241j673j880j805j646j483j124m62K19O30R20
$$ 194721 195019 195156 195077 194738 194159 193311 192070 190397 188517 186712 185066 183583 182459 181997 182216 182846 183766
52921A83766J363J704J348L02n52n13QL5o30j195r96l02K70N88Q55R48N49j51
$$ 183766 185129 186833 188181 188483 187931 187418 187426 187461 186831 185636 184640 184338 184608 185196 186051 186999 187548 187397
52903A87397m32j3M79K87m67r93r18o72p15q47n94KM03L21N1n5k6K0K55P88J142
$$ 187397 186965 186952 187431 187718 187251 186258 185340 184668 183953 183106 182512 182514 182917 183238 183289 183234 183208 183228 183483 184271 185413
52882A85413O41n71j425j129j33M85L42L2J93P65J203J108N05j82l73J56Q98J104
$$ 185413 186054 185483 184058 182929 182796 183281 183623 183655 183848 184613 185816 186924 187429 187247 186874 187030 187928 189032
52864A89032P50O14J182J853J638L91j061j801j510m77N44O97k30j330j432n01
$$ 189032 189782 190396 191578 193431 195069 195460 194399 192598 191088 190611 191155 191852 191622 190292 188860 188359
52848A88359K67o4j092j764j699j411j445j736j783j242l32K33n6q84j402j271
$$ 188359 188626 188562 187470 185706 184007 182596 181151 179415 177632 176390 176058 176291 176235 175351 173949 172678
52832A72678j029j225j608j540r14j63M13P43O32q1r23j016j46Q52J098O34R0
$$ 172678 171649 170424 168816 167276 166362 166199 166612 167355 167987 167906 166983 165967 165821 166673 167771 168405 168495
52815A68495k18m13m93k14M18J054J465J753J943J730R60J24j04K55M79R0n44
$$ 168495 168277 167864 167371 167157 167575 168629 170094 171847 173790 175520 176480 176604 176500 176755 177234 177324 176780
52798A76780q06o75n90p18q38r06j214j849k372k329j753r86k13N66J241J545
$$ 176780 175974 175299 174709 173991 173153 172247 171033 169184 166812 164483 162730 161744 161531 162097 163338 164883
52782A64883J328P16J19L8O19J310J350O80N2N7L86M31J29j89m85r06j204r13
$$ 164883 166211 166927 167046 167084 167703 169013 170363 171043 171095 171152 171538 171969 172098 171909 171424 170518 169314 168401
52764A68401j32M07J67o53j383j433o58M06Q27K55m64k45Q13J550J347P54M48
$$ 168401 168269 168676 168843 168190 166807 165374 164716 165122 165949 166204 165740 165495 166308 167858 169205 169959 170407
52747A70407L27N5k02j22J69L64M93O94P86N87L80N68J073J453J508J430J420
$$ 170407 170734 170789 170587 170465 170634 170998 171491 172185 172971 173558 173938 174506 175579 177032 178540 179970 181390
52730A81390J586J964K425K611K337J845J450J115O40K7o13j254j763j875j643
$$ 181390 182976 184940 187365 189976 192313 194158 195608 196723 197363 197390 196777 195523 193760 191885 190242
52715A90242j584j921k157j838j310j053p78o2N24R9q96j060j47M70j3m87K96
$$ 190242 188658 186737 184580 182742 181432 180379 179601 179539 180063 180162 179266 178206 178059 178529 178516 178029 178325
52698A78325J631J807N44p58r87m18K22O67Q77P62O09J015J960K513K015J044
$$ 178325 179956 181763 182307 181549 180562 180144 180366 181033 181910 182672 183281 184296 186256 188769 190784 191828
52682A91828O46Q93R50L46m52q20p49o41o95p98q02o78n05m44n70p70q83r77j171
$$ 191828 192474 193367 194317 194663 194211 193391 192642 192001 191306 190508 189706 189028 188523 188079 187509 186739 185856 184879 183708
52663A83708j226p09K94J010Q51J06n35q02o91J8J399K704K940K185J541J531
$$ 183708 182482 181773 182067 183077 183928 184034 183499 182697 182006 182024 183423 186127 189067 191252 192793 194324
52647A94324J440O27l89q55j013j476j900j440l29K53k4q5Q30J922K031J322R32
$$ 194324 195764 196391 196002 195147 194134 192658 190758 189318 188989 189242 189218 189133 189963 191885 193916 195238 196170
52630A96170J294J717J492P24pl16k14j8j49p15j253j210o00L7L16L02J86M2k4
$$ 196170 197464 199181 200673 201397 201390 201074 200860 200842 200693 199978 198725 197515 196915 196952 197268 197570 197756 197798 197774
52611A97774Q2J88J4l12l26L3K30l5k97mO21R81J020J111J228R47L43P8L67N11
$$ 197774 197856 198044 198058 197746 197420 197453 197683 197648 197351 197347 197968 198949 199969 201080 202308 203255 203598 203676 204043 204554
52591B04554j00r90j191m93M30R45R62N63k02j055j483j232o03M4O93J425J935
$$ 204554 204454 203464 202273 201780 202210 203155 204117 204680 204478 203423 201940 200708 200105 200149 200842 202267 204202
52574B04202J764R79L26M27J016J224O24k59p12p49q77j160j092n64k56o32j120
$$ 204202 205966 206945 207271 207698 208714 209938 210562 210303 209591 208842 207965 206805 205713 205149 204893 204261 203141
52557B03141q78m7N18N03L83M41L84J38J61O65J122J030N64O4o20j621k357k090
$$ 203141 202263 202216 202734 203237 203620 204061 204445 204583 204744 205409 206531 207561 208125 208189 207569 205948 203591 201501
52539B01501j061l02k92l93J82J301K109K024J233L25l52q61j281j380q76j6N05
$$ 201501 200440 200138 199846 199453 199635 200936 203045 205069 206302 206627 206275 205414 204133 202753 201877 201861 202366
52522B02366K72m17j031j334j311r15k37L24N17O42J112J803K213K211K138K218
$$ 202366 202638 202221 201190 199856 198545 197630 197393 197717 198234 198876 199988 201791 204004 206215 208353 210571
52506B10571K323K343K355K322K014J357N98j3m42p29r01j101j526k088k354k013
$$ 210571 212894 215237 217592 219914 221928 223285 223883 223870 223428 222699 221798 220697 219171 217083 214729 212716
52490B12716j290p34o65r20j069q66m86k89l56m15k51PJ69L08N41P25O76N51O20
$$ 212716 211426 210692 210027 209107 208038 207172 206686 206397 206041 205626 205375 205382 205551 205859 206400 207125 207801 208352 208972
52471B08972Q11Q67Q62J132J678K049J877J195K58n41o36K82J655K407K078J289
$$ 208972 209783 210650 211512 212644 214322 216371 218248 219443 219701 219160 218524 218806 220461 222868 224946 226235
52455B26235Q64Q84Q36L77l91j157j641j751j704j798j948j741j096n50n84r64
$$ 226235 227099 227983 228819 229196 228805 227648 226007 224256 222552 220754 218806 217065 215969 215419 214835 213871
52439B13871j084q10n99q31j322j532j104j47Q24J269J018L49k67m63j29N33J094
$$ 213871 212787 211977 211378 210547 209225 207693 206589 206442 207266 208535 209553 209902 209635 209172 209043 209576 210670
52422B10670J277J249J379J700J873J712J433J308J422J832K600L537M218M484
$$ 210670 211947 213196 214575 216275 218148 219860 221293 222601 224023 225855 228455 231992 236210 240694
52408B40694M675N147N789O237O266N818M853L465J923L49j362l156m584n313
$$ 240694 245369 250516 256305 262542 268808 274626 279479 282944 284867 285216 283854 280698 276114 270801
52394B70801n538n535n057l723j952q06p95j227j057q1R93J472J364J108R46Q09
$$ 270801 265263 259728 254671 250948 248996 248190 247395 246168 245111 245030 246023 247495 248859 249967 250913 251722
52378B51722P20R78J795K897L679L736L150K434K290L150M591N458N016L826K977
$$ 251722 252442 253420 255215 258112 261791 265527 268677 271111 273401 276551 281142 286600 291616 295442 298419
52363B98419K663K200J438J153J713K251J832P97J60J62K63K60N10J136J786K297
$$ 298419 301082 303282 304720 305873 307586 309837 311669 312466 312626 312788 313051 313311 313821 314957 316743 319040
52347C19040K950L867M766N362N604N468N060M944N753P257Q413Q669Q691R461
$$ 319040 321990 325857 330623 335985 341589 347057 352117 357061 362814 370071 378484 387153 395844 405305
52333D05305J1009J2518J3422J3967J4727J5964J7397J8497J9011J9258J9775
$$ 405305 416314 428832 442254 456221 470948 486912 504309 522806 541817 561075 580850
52322E80850K0600K1124K0900K0227J9689J9335J8770J7911J7124J6541J5732
$$ 580850 601450 622574 643474 663701 683390 702725 721495 739406 756530 773071 788803
52311G88803J4352J2683J1218R930Q424O702N313M658M543M498M167L205J321
$$ 788803 803155 815838 827056 836986 845410 852112 857425 862083 866626 871124 875291 878496 879817
52298H79817j156l087l506k787k324l064m669o143o833o754o358o139o149n812
$$ 879817 878661 875574 872068 869281 866957 863893 859224 853081 846248 839494 833136 826997 820848 815036
52284H15036m546k573o76Q75K573M756P003Q748R980J1003J1971J2978J4149J5274
$$ 815036 810490 807917 807241 808116 810689 815445 822448 831196 841176 852179 864150 877128 891277 906551
52270I06551J5789J5530J5012J4623J4059J2999J1792J0817R755Q240O688N708
$$ 906551 922340 937870 952882 967505 981564 994563 1006355 1017172 1026927 1035167 1041855 1047563
52258A047563N015L906K437J257N11j46o66p68q85j785l313m562n411o603q131
$$ 1047563 1052578 1056484 1058921 1060178 1060689 1060543 1059877 1059109 1058224 1056439 1053126 1048564 1043153 1036550 1028419
52243A028419q867q405p939q500r387r338q403p583p156o488n282m043l330l181
$$ 1028419 1019552 1011147 1003208 994708 985321 975983 967580 959997 952841 946353 941071 937028 933698 930517
52229I30517l192k795j661k68L62n7n57k20O28J268J939L273M787N340M966M983
$$ 930517 927325 924530 922869 922601 922963 922906 922349 922129 922757 924025 925964 929237 934024 939364 944330 949313
52213I49313O001P053P160O714O616O873O849O396N881N408M730L854L141K737
$$ 949313 955314 962367 969527 976241 982857 989730 996579 1002975 1008856 1014264 1018994 1022848 1025989 1028726
52199A028726K426K044J792J992K660L384L589L066K269J865J913J747Q74l83
$$ 1028726 1031152 1033196 1034988 1036980 1039640 1043024 1046613 1049679 1051948 1053813 1055726 1057473 1058347 1057964
52185A057964j400k072k696l263l434l164k920l096l694m578n618o364o143m942
$$ 1057964 1056564 1054492 1051796 1048533 1045099 1041935 1039015 1035919 1032225 1027647 1022029 1015665 1009522 1004580
52171A004580l796l719m445m738l985k817k063j670j056n4J010J906K682L326
$$ 1004580 1000784 997065 992620 987882 983897 981080 979017 977347 976291 976237 977247 979153 981835 985161
52157I85161L740L970M081L865L064J908J016P09P81J018J454J945K037J564J022
$$ 985161 988901 992871 996952 1000817 1003881 1005789 1006805 1007514 1008295 1009313 1010767 1012712 1014749 1016313 1017335
52142A017335R87J459K134K937L844M426M227L561L480M742P132R846J2192J3904
$$ 1017335 1018322 1019781 1021915 1024852 1028696 1033122 1037349 1040910 1044390 1049132 1056264 1066110 1078302 1092206
52128A092206J5124J6287J7795J9644K1452K2972K4319K5614K6608K6911K6470
$$ 1092206 1107330 1123617 1141412 1161056 1182508 1205480 1229799 1255413 1282021 1308932 1335402
52117A335402K5592K4571K3460K2268K1082J9897J8373J6004J2598Q522M420P72
$$ 1335402 1360994 1385565 1409025 1431293 1452375 1472272 1490645 1506649 1519247 1527769 1532189 1532961
52105A532961k262m708o652q221r499j0480j1144j1534j1636j1317j0565r668
$$ 1532961 1530699 1525991 1519339 1511118 1501619 1491139 1479995 1468461 1456825 1445508 1434943 1425275
52093A425275q918q248p495o829o508o205n262l738k562k320k408j891o84P09
$$ 1425275 1416357 1408109 1400614 1393785 1387277 1381072 1375810 1372072 1369510 1367190 1364782 1362891 1362207 1362916
52079A362916K267M429P127R569J1173J2150J2956J3629J3965J4056J4283J4798
$$ 1362916 1365183 1369612 1376739 1386308 1397481 1409631 1422587 1436216 1450181 1464237 1478520 1493318
52067A493318J5173J4661J2920J0537Q611P605O853N393L069M68j957m242o503
$$ 1493318 1508491 1523152 1536072 1546609 1555220 1562825 1569678 1575071 1578140 1578608 1576651 1572409 1565906
$$ [...]
##END NTUPLES=NMR SPECTRUM
##END=
