##TITLE=NES1084_ptc140_9884872_SXvDNknLow
##JCAMPDX= 6.0         $$ Bruker NMR JCAMP-DX V2.0
##DATA TYPE= NMR SPECTRUM
##DATA CLASS= NTUPLES
##ORIGIN= BRUKER
##OWNER= Administrator
$$ 1.72 TOPSPIN		Version 2.1
$$ 2016-08-27 21:08:05.211 -0500  Administrator@X
$$ Compression mode = diff/dup
##.OBSERVE FREQUENCY= 400.02188249412
##.OBSERVE NUCLEUS= ^1H
##.ACQUISITION MODE= SIMULTANEOUS (DQD)
##.ACQUISITION SCHEME= undefined
##.AVERAGES= 8
##.DIGITISER RES= 22
##SPECTROMETER/DATA SYSTEM= spect
##.PULSE SEQUENCE= zg30
##.SOLVENT NAME= COFFEE_meoh
##.SHIFT REFERENCE= INTERNAL, COFFEE_meoh, 1, 14.98509
##AUDIT TRAIL= $$ (NUMBER, WHEN, WHO, WHERE, PROCESS, VERSION, WHAT)
$$ ##TITLE= Audit trail, TOPSPIN		Version 2.1
$$ ##JCAMPDX= 5.01
$$ ##ORIGIN= Bruker BioSpin GmbH
$$ ##OWNER= Administrator
$$ $$ E:\/data/COFFEE/nmr/NES1084_ptc140_9884872_SXvDNknLow/20/pdata/1/auditp.txt
$$ ##AUDIT TRAIL=  $$ (NUMBER, WHEN, WHO, WHERE, PROCESS, VERSION, WHAT)
(   1,<2016-08-27 21:07:58.039 -0500>,<Administrator>,<X>,<go>,<TOPSPIN 2.1>,
      <created by zg
	started at 2016-08-27 21:06:51.914 -0500,
	POWCHK enabled, PULCHK disabled,
       configuration hash MD5:
       21 0F 79 D6 B3 7B B4 F6 88 20 88 DB 03 48 BD 9F
       data hash MD5: 64K
       FC C6 46 2C 67 A8 B8 A0 7C CF 28 3F 52 20 68 52>)
(   2,<2016-08-27 21:08:01.179 -0500>,<Administrator>,<X>,<proc1d>,<TOPSPIN 2.1>,
      <Start of raw data processing
       efp LB = 0 FT_mod = 6 PKNL = 1 PHC0 = 0 PHC1 = 0 SI = 32K 
       data hash MD5: 32K
       E0 75 45 8D 8B DF E4 43 57 09 AF FC 76 B9 08 B6>)
(   3,<2016-08-27 21:08:01.461 -0500>,<Administrator>,<X>,<proc1d>,<TOPSPIN 2.1>,
      <pk PHC0 = 93.03223 PHC1 = 0 
       data hash MD5: 32K
       5E FB 41 B0 41 32 3D C2 0C C5 46 6B D3 92 4B CA>)
(   4,<2016-08-27 21:08:01.570 -0500>,<Administrator>,<X>,<proc1d>,<TOPSPIN 2.1>,
      <abs ABSG = 1 
       data hash MD5: 32K
       E3 09 17 7E 89 A5 2D 5A C7 51 A0 1F BD 56 3F 28>)
(   5,<2016-08-27 21:08:01.633 -0500>,<Administrator>,<X>,<proc1d>,<TOPSPIN 2.1>,
      <abs ABSG = 2 
       data hash MD5: 32K
       96 16 01 93 1E 4F 13 35 D7 D8 EE 28 17 1E E4 6F>)
(   6,<2016-08-27 21:08:01.695 -0500>,<Administrator>,<X>,<proc1d>,<TOPSPIN 2.1>,
      <abs ABSG = 3 
       data hash MD5: 32K
       DB A8 CA 80 C8 12 2D 1F E8 A4 8D E3 FE B2 CF F6>)
(   7,<2016-08-27 21:08:01.742 -0500>,<Administrator>,<X>,<proc1d>,<TOPSPIN 2.1>,
      <abs ABSG = 4 
       data hash MD5: 32K
       C0 78 FD 6D F2 29 EC 9C 16 D4 ED 38 0E DE EB 00>)
(   8,<2016-08-27 21:08:01.804 -0500>,<Administrator>,<X>,<proc1d>,<TOPSPIN 2.1>,
      <abs ABSG = 5 
       data hash MD5: 32K
       F5 BE C6 E5 63 BC C7 42 48 1C B4 B3 37 19 49 B2>)
$$ ##END=
$$ 
$$ $$ hash MD5
$$ $$ DA 40 63 26 17 E5 C1 6D E4 92 E7 B4 26 BA 80 F3
##$RELAX= 
##$RELAX= 
##$RELAX= 
##$RELAX= 
##$RELAX= 
##$RELAX= 
##$RELAX= 
$$ Bruker specific parameters
$$ --------------------------
##$DU= <E:\>
##$EXPNO= 20
##$NAME= <NES1084_ptc140_9884872_SXvDNknLow>
##$PROCNO= 1
$$ [...]
150 150 150 150 150 150 150 150
##$TP07= 0
##$TPNAME0= <>
##$TPNAME1= <>
##$TPNAME2= <>
##$TPNAME3= <>
##$TPNAME4= <>
##$TPNAME5= <>
##$TPNAME6= <>
##$TPNAME7= <>
##$TPOAL= (0..7)
0.5 0.5 0.5 0.5 0.5 0.5 0.5 0.5
##$TPOFFS= (0..7)
0 0 0 0 0 0 0 0
##$TUNHIN= 0
##$TUNHOUT= 0
##$TUNXOUT= 0
##$USERA1= <user>
##$USERA2= <user>
##$USERA3= <user>
##$USERA4= <user>
##$USERA5= <user>
##$V9= 5
##$VALIST= <valist>
##$VCLIST= <CCCCCCCCCCCCCCC>
##$VD= 0
##$VDLIST= <DDDDDDDDDDDDDDD>
##$VPLIST= <PPPPPPPPPPPPPPP>
##$VTLIST= <TTTTTTTTTTTTTTT>
##$WBST= 1024
##$WBSW= 4
##$XGAIN= (0..3)
0 0 0 0
##$XL= 0
##$YL= 0
##$YMAX_a= 604587
##$YMIN_a= -513476
##$ZGOPTNS= <>
##$ZL1= 120
##$ZL2= 120
##$ZL3= 120
##$ZL4= 120
##$ABSF1= 14.98509
##$ABSF2= -5.573092
##$ABSG= 5
##$ABSL= 3
##$ALPHA= 0
##$AQORDER= 0
##$ASSFAC= 0
##$ASSFACI= 0
##$ASSFACX= 0
##$ASSWID= 0
##$AUNMP= <proc_prof1d_extract_pilot.lims>
##$AXLEFT= 0
##$AXNAME= <>
##$AXNUC= <1H>
##$AXRIGHT= 0
##$AXTYPE= 0
##$AXUNIT= <>
##$AZFE= 0.1
##$AZFW= 0.1
##$BCFW= 0
##$BC_mod= 0
##$BYTORDP= 0
##$COROFFS= 0
##$CY= 15
##$DATMOD= 1
##$DC= 0
##$DFILT= <>
##$DTYPP= 0
##$F1P= 0
##$F2P= 0
##$FCOR= 0.5
##$FTSIZE= 32768
##$FT_mod= 6
##$GAMMA= 0
##$GB= 0
##$INTBC= 1
##$INTSCL= 1
##$ISEN= 128
##$LB= 0
##$LEV0= 0
##$LPBIN= 0
##$MAXI= 10000
##$MC2= 0
##$MEAN= 0
##$ME_mod= 0
##$MI= 0
##$NCOEF= 0
##$NC_proc= -8
##$NLEV= 6
##$NOISF1= 0
##$NOISF2= 0
##$NSP= 0
##$NTH_PI= 0
##$NZP= 0
##$OFFSET= 14.98509
##$PC= 1
##$PHC0= 93.03223
##$PHC1= 0
##$PH_mod= 1
##$PKNL= yes
##$PPARMOD= 0
##$PPDIAG= 0
##$PPIPTYP= 0
##$PPMPNUM= 2147483647
##$PPRESOL= 1
##$PSCAL= 4
##$PSIGN= 0
##$PYNMP= <proc.py>
##$REVERSE= no
##$SF= 400.02
##$SI= 32768
##$SIGF1= 0
##$SIGF2= 0
##$SINO= 400
##$SIOLD= 32768
##$SPECTYP= <>
##$SREGLST= <1H.CDCl3>
##$SSB= 0
##$STSI= 32768
##$STSR= 0
##$SW_p= 8223.68421052631
##$SYMM= 0
##$S_DEV= 0
##$TDeff= 65536
##$TDoff= 0
##$TI= <>
##$TILT= no
##$TM1= 0
##$TM2= 0
##$TOPLEV= 0
##$USERP1= <user>
##$USERP2= <user>
##$USERP3= <user>
##$USERP4= <user>
##$USERP5= <user>
##$WDW= 1
##$XDIM= 32768
##$YMAX_p= 443222479
##$YMIN_p= -670433
##$CURPLOT= <Network HP LaserJet P1505>
##$CURPRIN= <$Network HP LaserJet P1505>
##$DFORMAT= <normdp>
##$LAYOUT= <+/1D_H.xwp>
##$LFORMAT= <normlp>
##$PFORMAT= <normpl>
##$SURQMSG= 1
$$ End of Bruker specific parameters
$$ ---------------------------------
##NTUPLES= NMR SPECTRUM
##VAR_NAME=  FREQUENCY,     SPECTRUM/REAL,   SPECTRUM/IMAG
##SYMBOL=    X,             R,               I
##VAR_TYPE=  INDEPENDENT,   DEPENDENT,       DEPENDENT
##VAR_FORM=  AFFN,          ASDF,            ASDF
##VAR_DIM=   32768,         32768,           32768
##UNITS=     HZ,            ARBITRARY UNITS, ARBITRARY UNITS
##FACTOR=    0.250966925370066, 1,           1
##FIRST=     8223.43324360094, -136222,      -175847
##LAST=      0,             -175941,         -39880
##MIN=       0,             -670433,         0
##MAX=       8223.43324360094, 443222479,    0
$$ Real data points
##PAGE= N=1
##DATA TABLE= (X++(R..R)), XYDATA
$$ [...]
$$ plain form
19546 201866 225033 44514 -74206 160492 -83703 86624 -182360 -337691 15989 -277578 -47336
19534 -113285 -186795 -5017 -434847 353138 127106 -8949 -464012 -39623 61450 -97637 264931
19522 -100173 39936 31754 -140438 -2553 -45806 -23481 17610 123350 263744 -209388 -290751
19511 -290751 -95290 -30652 -298821 -324868 111884 -121865 20963 203731 316074 203845
19501 203845 -112313 -241083 112444 -99604 282298 282958 -188039 -30508 123366 -327737
19490 -143121 -25452 134720 16912 42764 -291170 29323 -92171 -154356 104993 -53122 -39224
19479 -39224 -165973 195046 -105313 13889 150094 -160614 -44201 -38814 -224091 24720 94793
19468 94793 14083 182123 242941 42306 20617 -196731 -14839 -228161 53417 -690 -22883
$$ packed form
19546B01866K3167D4514g4206A60492h3703H6624a82360j55331A5989b77578d7336
19534a13285p3510e017m29830C53138A27106h949m55063c9623F1450i7637B64931
19522a00173C9936q182a40438b553m3253K2325A7610J05740J40394b09388q1363
19511b90751i5290c0652k68169k6047A11884a21865B0963J82768J12343j12229
19501B03845a12313j28770A12444i9604B82298O60a88039c0508A23366c27737
19490a43121b5452A34720A6912K5852b91170B9323i2171o2185A04993e3122J3898
19479c9224j26749A95046a05313A3889J36205a60614d4201N387j85277B4720P0073
19468I4793A4083J68040O0818D2306B0617a96731a4839k13322E3417f90k2193
$$ plain form
19457 -22883 313319 -167181 108060 43608 -27583 -52567 -41076 339110 -404507 -250680
19447 -250680 -121094 -96077 -187496 259487 -63327 -227468 185843 -228788 -271780 -101259
19436 -274100 -128584 66425 116557 218513 -34243 150109 184954 103991 8163 -188428 206800
19424 -190427 -33296 -11497 -350841 -284814 100317 105761 52166 177175 96998 -244686 -173515
19413 -173515 65799 229415 89476 -136820 -266209 32077 -50903 -115512 -46265 -252664 73789
19401 -322431 -72306 119228 -308594 -396591 -161047 58361 63864 4101 -159643 27082 -232457
19389 -230617 279522 33439 -55423 301336 52609 -142347 -99224 35025 -43172 14590 169523
19378 169523 -338518 -299955 -388302 172357 173044 -349468 -198909 -12599 -148188 -131650 236862
$$ packed form
19457b2883C13319a67181A08060D3608b7583k4984J1491C39110d04507J53827
19447b50680a21094K5017r1419B59487f3327j64141A85843b28788m2992a01259
19436b74100a28584F6425N0132J01956c4243A50109L4845q0963H163a88428B06800
19424a90427c3296a1497l39344O6027A00317N444E2166J25009q0177b44686P1171
19413a73515F5799J63616H9476a36820j29389C2077e0903o4609d6265k06399G3789
19401c22431g2306A19228c08594q7997a61047E8361N503D101a59643B7082b32457
19389b30617B79522C3439e5423C01336E2609a42347M3123C5025d3172A4590J54933
19378A69523c38518L8563q8347A72357O87c49468J50559a2599j35589J6538B36862
$$ plain form
19366 -288237 -57937 -3628 130427 28655 75402 185822 -192980 -147831 -247604 -100948 90087
19354 -320571 181467 -362976 -150415 114753 75425 22629 -446571 122628 3428 -107995
19343 -87639 125280 -95242 -97309 -46966 5817 -16601 -259558 -160733 -210587 -13640 39590 51492
19331 51492 -297467 -290677 -94301 -165007 -4150 -123293 -129030 -48794 -88067 -85986 72788 -83673
19318 192398 -4925 70842 147082 100154 -199291 -163308 79227 8617 -80815 -120895 -135446 -84937
19306 -84937 -270327 -158824 -162059 -107677 -387440 -21750 350213 -48178 -255751 -427366 -73146
19294 -21284 -215340 -21344 -208211 -184212 129017 -194193 245924 -205368 -26917 143379
19283 -114661 -227915 100188 201427 48163 9595 -174827 124403 -95976 -265582 156922
$$ packed form
19366b88237e7937c628A30427B8655M6747J10420a92980M5149r9773a00948I0087
19354c20571A81467c62976a50415A14753l9328B2629d46571A22628C428a07995
19343h7639A25280i5242k067d6966E817a6601k42957R8825m9854a3640C9590J1902
19331E1492b97467O790i4301p0706d150j19143n737d8794l9273K081G2788h3673
19318A92398d925G0842P6240m6928a99291L5983G9227H617h0815m0080j4551N0509
19306h4937j85390J11503l235N4382k79763b1750C50213d8178k07573j71615g3146
19294b1284j94056b1344j86867K3999A29017a94193B45924b05368b6917A43379
19283a14661j13254A00188J01239D8163I595a74827A24403i5976j69606A56922
$$ plain form
19272 44949 -171964 -118503 219432 -5444 97498 126749 -87763 -190625 -264180 70299 -238198
19260 121074 92107 53542 -28165 -35601 -31091 -117535 -508457 151760 -18449 22848 430664
19249 430664 337303 -113588 13384 -182803 -42354 152189 235181 -394180 -271491 -14219
19238 60572 -37337 -350410 33094 32393 -356377 -4927 -297156 -91553 266391 -69425 -9095 232174
19225 -35918 96166 -165101 23073 12720 -440778 -13028 -119142 34485 357116 -103026 -271902
19214 -271902 15225 -168309 329207 -46227 241793 -144094 66609 -48153 122353 -49640
19203 -358957 -25200 -237412 -233900 -155573 196918 198466 -135283 -155517 90214 -148429 24958
19191 33265 -189603 -514756 -304449 153042 -119765 50723 -147955 -299275 -55358 -145554
$$ packed form
19272D4949a71964N3461B19432e444I7498K9251h7763j02862p3555G0299b38198
19260A21074k8967l8565b8165p436M510q6444l90922A51760a8449B2848M07816
19249D30664r3361a13588A3384a82803d2354A52189Q2992c94180J22689a4219
19238F0572c7337l13073C3094p01c56377d927k92229i1553B66391f9425i095B32174
19225c5918I6166a65101B3073j0353d40778a3028j06114C4485L22631a03026j68876
19214b71902A5225a68309C29207d6227B41793a44094F6609d8153A22353d9640
19203c58957b5200k12212L512P8327A96918J548a35283k0234I0214a48429B4958
19191C3265a89603l25153K10307A53042a19765E0723a47955j51320e5358r0196
$$ plain form
19181 -145554 -147099 -247605 233609 -116383 61287 -424283 42515 -72041 6271 62114 -71195
19169 -81026 52776 -15599 -42796 -41734 144482 -224175 96245 425570 -5882 407755 -151290
19157 36363 181860 -145963 238612 -378980 -40151 -53213 9244 -74959 -86380 154539 145050
19146 145050 1176 -75327 -180598 -16905 81124 -269555 -132560 68285 -75796 196189 107647
19135 107647 37629 -97663 38423 -334331 11515 -22260 -392771 -352928 -258530 -144401 -29045
19123 -82819 -37860 -211558 203522 39683 -40821 -189790 200909 219621 255867 -171972 15822
19111 -576163 -144863 -216871 -59487 253331 85568 -12336 -45256 -141988 18404 -6680 -245959
19100 -245959 -48763 -135592 -9945 -171779 56858 -86762 -207934 -24344 53186 60470 88313
$$ packed form
19181a45554j545j00506B33609a16383F1287d24283D2515g2041F271N5843g1195
19169h1026E2776a5599k7197J062A44482b24175I6245L29325e882D07755a51290
19157C6363J45497a45963B38612c78980d0151j3062I244g4959j1421A54539r489
19146A45050A176g5327j05271a6905H1124b69555a32560F8285g5796A96189q8542
19135A07647C7629i7663C8423c34331A1515b2260l70511L9843R4398J14129b9045
19123h2819c7860j73698B03522C9683d0821j48969B00909J8712L6246a71972A5822
19111e76163a44863p2008e9487B53331H5568a2336l2920r6732A8404f680k39279
19100b45959d8763q6829i945j61834E6858h6762j21172b4344E3186P284K7843
$$ plain form
19089 88313 94129 -307165 -182342 200258 128768 135144 120431 151930 55127 -177886 43278
19077 -43276 -102822 -126016 87694 -115964 258280 -236279 -71532 32376 -63639 223847 -330771
19065 107063 -334692 -384083 29274 -160768 -276047 -911 -15176 32669 -222576 5881 252523
19054 252523 -251530 27725 -214015 -18228 132320 -88183 163256 75210 143674 3715 79869
19043 79869 29534 -376714 -185284 -47192 43975 128094 2962 -130294 -78976 86949 20860
19031 -185734 195416 171943 179351 121343 159721 516547 -109074 57404 -70243 127303 -142659
19019 25654 24721 -198851 222323 173775 242601 -225688 87569 72742 36186 -330601 -340506
19008 -340506 -258467 166992 -177263 251708 -37788 -16671 -119207 -24243 -205131 -202578 -88276
$$ packed form
19089H8313N816c07165J24823B00258p1490O376j4713L1499E5127a77886D3278
19077d3276n9546k3194H7694a15964B58280b36279g1532C2376f3639B23847c30771
19065A07063c34692m9391B9274a60768j15279i11j4265C2669b22576E881K46642
19054B52523b51530B7725b14015a8228A32320h8183A63256G5210O8464C715P6154
19043G9869B9534c76714a85284d7192D3975Q4119B962a30294N1318H6949B0860
19031a85734A95416k3473P408n8008L8378L56826a09074E7404g0243A27303a42659
19019B5654r33a98851B22323m8548O8826b25688H7569j4827C6186c30601r905
19008c40506Q2039A66992a77263B51708c7788a6671j02536b4243j80888K553h8276
$$ plain form
18996 -41486 -240124 165220 -107726 -172173 -229911 387856 -15128 -224503 143231 327029
18986 327029 -98964 -274489 -21984 -179275 -251927 96405 -317149 -176055 -354325 -27875
18975 117674 -137294 -86645 -319778 -125479 67309 -187197 -141679 73923 68752 -234597 -105562
18963 105768 230066 3249 -246370 204703 -31165 -190016 -228867 207710 -210461 -374262
18953 -374262 -154024 -47002 -41167 54052 -217855 -166675 43760 -223655 -36192 244348 158240
18942 158240 78324 82893 233545 66630 -78358 76525 -29279 -288569 69834 -145462 164796
18930 -6397 -251526 -109763 -172237 91581 -43842 227186 205152 -89009 -232878 -208140 -175372
18919 -175372 -34698 -23886 -117327 -10958 102874 -140783 -427452 194746 -67297 -46882 -297717
$$ packed form
18996d1486j98638A65220a07726o4447n7738C87856a5128k09375A43231J83798
18986C27029i8964j75525b1984j57291p2652I6405c17149J41094j78270b7875
18975A17674a37294N0649k33133a25479F7309a87197M5518G3923n171b34597a05562
18963A05768J24298C249b46370B04703c1165j58851l8851B07710b10461j63801
18953c74262a54024d7002N835E4052b17855N1180D3760b23655c6192B44348q6108
18942A58240G8324M569J50652F6630g8358G6525b9279k59290F9834a45462A64796
18930f397k45129a09763o2474I1581d3842B27186k2034h9009j43869K4738L2768
18919a75372c4698J0812r3441a0958A02874a40783k86669A94746f7297K0415k50835
$$ plain form
18908 -297717 206795 44961 -88521 -198775 52848 22771 94397 231049 275458 68716 178391
18897 178391 141748 39776 -256245 -143770 50217 48594 -145928 46925 -96134 -126616 128007
18885 -152689 -263336 -14969 -132259 62597 -61800 102513 231935 67962 -164495 -452731
18875 -452731 334570 -183755 220631 -53941 -80785 73999 107283 5896 -55429 83115 41400
18863 -69819 -218473 111414 -13330 231254 89970 66417 -239436 78768 -213997 8167 52672
18852 52672 -190158 -227750 57205 28625 -20859 -3268 -23385 282191 165462 218723 216791
18841 216791 -91948 113371 188940 -222255 221986 59146 -382683 -17587 -162565 -122617
18831 -122617 -214734 273207 110112 -186120 -360027 93022 -186846 104836 -11020 -67669
$$ packed form
18908b97717B06795D4961h8521j10254E2848B2771P1626J36652M4409F8716J09675
18897A78391l6643C9776b56245J12475E0217j623a45928D6925i6134l0482A28007
18885a52689j10647a4969j17290F2597f1800A02513J29422F7962a64495k88236
18875d52731C34570a83755B20631e3941k6844G3999L3284E896e5429H3115D1400
18863f9819j48654A11414a3330B31254H9970k3553b39436G8768b13997H167M4505
18852E2672a90158l7592E7205k8580b0859c268k0117B82191j16729N3261j932
18841B16791i1948A13371P5569b22255B21986E9146c82683a7587j44978L9948
18831a22617r2117B73207A10112a86120j73907I3022a86846A04836a1020n6649
$$ plain form
18821 -67669 100266 -113406 187948 -202498 -90582 -508773 183424 -209583 93066 27279
18810 -319668 125315 4435 -18560 -83005 -148691 2294 -86933 -12007 139736 66242 -270957
18798 17888 -133811 -192746 -135443 53842 -541 -2848 122182 -136617 -298434 -334659 -243828
18787 -243828 223676 -210712 -133753 -161048 -501315 258525 -14407 -162600 90204 -250443
18776 -174873 -165107 -379181 270601 -190761 399276 -64718 284536 190049 319841 -291432
18765 -41903 35327 -85270 -106951 9603 -185980 253750 44553 100482 24659 -99801 282522
18753 28673 313214 250687 -103650 -302380 -440458 79884 -270620 -155441 -171186 -235912
18743 -235912 251753 -247923 -52042 -113428 120999 85108 88003 -204915 -147389 54443 -336801
$$ packed form
18821f7669A00266a13406A87948b02498i0582m18191A83424b09583I3066B7279
18810c19668A25315D435a8560o4445o5686B294h6933a2007A39736F6242b70957
18798A7888a33811n8935N7303E3842e41k307A22182a36617j61817l6225R0831
18787b43828B23676b10712P6959k7295l40267B58525a4407j48193I0204b50443
18776a74873R766k14074B70601a90761C99276f4718B84536r4487J29792b91432
18765d1903C5327h5270k1681I603a85980B53750D4553N5929B4659i9801B82522
18753B8673K84541o2527a03650j98730j38078G9884b70620J15179j5745o4726
18743b35912B51753b47923e2042o1386A20999l5891K895b04915N7526E4443c36801
$$ plain form
18731 -87050 -304091 105170 -166362 -82530 181547 -288071 86491 20145 -251508 -160227
18721 -160227 -277941 176066 -9349 -111700 336034 -17428 -328695 -184086 -138115 -396950
18711 -396950 45579 12489 97908 -19306 -199878 -19914 149153 87444 5522 -233433 193132
18699 -189303 6570 -178161 310637 252742 -304563 426482 -231336 -61041 -198347 142168
18688 -95163 73690 -94058 -184670 -248381 -230111 232894 28591 120178 -319882 -202625 -112798
18677 -112798 -138853 -56513 165799 -78085 -269222 -485259 187508 -110073 -304452 -305595
18667 -305595 -25765 47396 87732 -110105 59477 39633 -39367 149503 2791 201400 48776
18655 -285342 -94374 -204393 -112936 245 -372890 -345603 -144441 15070 -63635 -259297 -174513
$$ packed form
18731h7050k17041A05170a66362h2530A81547b88071H6491B0145b51508R1281
18721a60227j17714A76066i349j02351C36034a7428l11267J44609M5971k58835
18711c96950D5579A2489Q5419a9306j80572a9914A49153o1709E522b33433A93132
18699a89303F570a78161C10637n7895c04563D26482b31336f1041j37306A42168
18688i5163G3690i4058r0612o3711J8270B32894B8591R1587c19882J17257Q9827
18677a12798k6055e6513A65799g8085j91137k16037A87508a10073j94379j143
18667c05595b5765D7396M0336a10105E9477j9844c9367A49503B791J98609D8776
18655b85342i4374j10019R1457B45c72890K7287a44441A5070f3635j95662Q4784
$$ plain form
18644 -174513 -175882 135615 28415 -63489 56127 76259 -87232 104407 26495 59096 -170426
18632 -179169 -253386 -21622 -19055 98889 -183080 145261 110646 73977 -232051 -172350 -286582
18621 -286582 16840 48561 -97913 116224 -23934 -194096 57713 -173818 50005 195392 118713
18610 118713 22694 141412 -211932 127493 -56964 30977 -424249 124093 -347008 -5285
18599 11724 -127715 -47757 127462 56516 -281086 149811 -13936 -156725 8334 19260 -106649
18587 -257128 -186445 -295828 -202251 -135867 -777 78150 -163878 148351 -3638 -295727 -14676
18575 109183 -92019 149948 148468 -99617 185846 -92689 -223054 -305776 175827 -280170 -98911
18563 89277 107334 189060 89552 -200824 54588 301784 -296255 -190448 238738 60109 -145933
$$ packed form
18644a74513j369A35615B8415f3489E6127K0132h7232A04407B6495L2601a70426
18632a79169p4217b1622K567I8889a83080A45261l4615l6669b32051N9701j14232
18621b86582A6840L1721i7913A16224b3934j70162E7713a73818E0005J45387p6679
18610A18713B2694J18718b11932A27493e6964C0977d24249A24093c47008e285
18599A1724a27715d7757A27462E6516b81086A49811a3936j42789H334J0926a06649
18587b57128P0683j09383R3577O6384g77G8150a63878A48351c638k92089a4676
18575A09183i2019A49948j480i9617A85846i2689j30365q2722A75827b80170i8911
18563H9277J8057Q1726H9552b00824E4588K47196b96255J05807B38738F0109a45933
$$ plain form
18551 -319947 -181015 147479 -180961 -240581 -55351 -394388 -84139 3298 -996 237241 -18827
18539 125915 -71392 84137 -58087 198920 -95463 -26784 -86817 -122387 -29100 207945 -82183
18527 183907 -171977 119984 -30012 78715 119045 10361 -160275 -211890 -131612 -234276 113885
18515 16099 83002 -30741 119262 145599 222502 219471 168657 -235704 378281 -150014 -92349
18504 -92349 -154983 -30486 32796 -174337 -247993 -104735 -97122 117074 101687 150705 -77138
18492 -107036 91251 94300 -83604 -42259 -139605 12753 25003 115549 60618 -67696 61702 -140843
18479 294619 194049 -3220 -34073 -52314 -208066 73969 130360 73505 -374190 249231 -114077
18467 75769 244511 -150411 3584 -94552 -301977 44062 -349592 104702 -319804 -126807
$$ packed form
18551c19947J38932A47479a80961n9620e5351l39037h4139C298i96B37241a8827
18539A25915g1392H4137e8087A98920i5463b6784o0033l5570b9100B07945h2183
18527A83907a71977A19984c0012G8715M0330A0361a60275n1615Q0278j02664A13885
18515A6099O6903c0741A19262K6337P6903l031n0814b35704C78281a50014N7665
18504i2349o2634c0486C2796a74337p3656a04735P613A17074j5387M9018g7138
18492a07036I1251L049h3604M1345r7346A2753J2250R0546n4931f7696F1702a40843
18479B94619j00570c220l0853j8241j55752G3969N6391n6855c74190B49231a14077
18467G5769J68742a50411C584i4552k07425D4062c49592A04702c19804a26807
$$ plain form
18456 -32001 -141149 -167021 -63861 -104036 99006 103116 -116995 -108262 -35221 29874 124374 119759
18444 119759 -190490 26740 48151 -122097 -132916 -168311 -198896 -237842 -2688 -85214 -66072
18433 -66072 -243 42857 418365 154645 -605876 -332013 -128547 -216481 304544 -326762 104918
18421 -266528 -88645 -80807 -515341 -629133 33787 -237595 -154651 -43970 -26570 -84292 176051
18409 3993 -170830 108465 -52109 189516 -52302 107282 -123147 237281 -280315 -6326 69842
18397 -64917 -95255 -28896 -52739 15661 -233819 5901 34196 57420 144945 87779 275765
18386 275765 -250980 -57811 -166338 -39131 -255336 -157252 -58113 85957 31987 -81015 -66086
18375 -66086 294934 -174909 175504 57633 -49134 -7759 -104936 106522 178067 24284 145114
$$ packed form
18456c2001j09148k5872f3861m0175I9006M110a16995Q733c5221B9874R4500m615
18444A19759a90490B6740K1411a22097j0819l5395l0585l8946b688q2526J9142
18433f6072b43D2857L75508A54645f05876K73863a28547q7934C04544c26762A04918
18421b66528h8645P838m34534j13792C3787b37595Q2944d3970J7400n7722A76051
18409C993a70830A08465e2109A89516e2302A07282a23147B37281b80315f326F9842
18397f4917l0338b8896k3843A5661b33819E901K8295K3224Q7525n7166J87986
18386B75765b50980e7811j08527c9131k16205R8084e8113H5957C1987h1015J4929
18375f6086B94934a74909A75504E7633d9134g759r7177A06522P1545B4284J20830
$$ plain form
18364 145114 -92158 -141142 73012 -246607 -110813 -56125 92703 -194478 -257796 27141 -4028
18352 132386 -282801 -367877 -19832 69015 -109474 243413 257688 -18800 -10687 -20647 386761
18340 -10567 42701 -43755 -259972 -98277 39624 -171382 -240036 -771 -114651 -80625 -95905
18329 -95905 -2911 209626 -73103 160310 -376477 7340 21477 -227594 -77203 119867 197380
18318 197380 117282 -220340 83644 -23499 -122576 -251961 91911 78671 -67090 -218226 -154219
18307 -154219 -160180 107514 28971 -600 -177079 -314206 85404 7401 -211486 66055 175680
18296 175680 -65746 -145609 80948 -123319 180938 18397 1745 -102771 -35338 -152878 183800
18284 -341860 230180 42023 6130 -89009 23258 -155243 -255941 78570 32142 -4026 -270034
$$ packed form
18364A45114i2158m8984G3012b46607a10813N4688I2703a94478o3318B7141d028
18352A32386b82801q5076a9832F9015a09474B43413J4275a8800Q113r960C86761
18340a0567D2701d3755k16217i8277C9624a71382o8654g71j13880L4026j5280
18329i5905b911B09626g3103A60310c76477G340J4137b27594g7203A19867P7513
18318A97380q0098b20340H3644b3499r9077j29385I1911j3240f7090j51136O4007
18307a54219n961A07514B8971f00j76479j37127H5404G401b11486F6055J09625
18296A75680f5746p9863H0948a23319A80938A8397A745a02771c5338j17540A83800
18284c41860B30180D2023F130h9009B3258a55243j00698G8570C2142d026k66008
$$ plain form
18273 -270034 -326237 -139486 21363 -44563 -12104 -56080 105037 -99514 6842 -312308 -221057
18262 -221057 262180 -39893 30009 155737 149382 -96191 -98224 -491063 166885 -275998 -39414
18250 39850 -292328 -172988 60429 -112744 38332 -226043 51732 8394 151190 -175173 142713
18238 -378925 -20365 108244 -341175 -94056 -127471 -152991 37248 -77788 -212013 -41339 386119
18226 -43027 -144621 371762 84511 99006 -186584 117136 141465 -262992 -208515 -140946 -274426
18215 -274426 34522 -123171 122161 40065 -226049 -149060 84457 -73366 377507 106802
18204 -251699 20286 -174283 -252775 -28987 -21920 -371136 37610 109402 -158883 -146262 -258291
18193 -258291 -212024 -30313 -61645 -299388 -105559 -168261 77766 293682 -12473 150544 -208560
$$ packed form
18273b70034n6203a39486B1363d4563a2104m3976A05037i9514F842c12308R1251
18262b21057B62180c9893C0009J25728o355i6191k033l92839A66885b75998c9414
18250C9850b92328J19340F0429a12744C8332b26043E1732H394J42796a75173A42713
18238c78925b0365A08244c41175i4056l3415k5520C7248g7788j34225d1339C86119
18226d3027j01594C71762H4511J4495a86584A17136K4329b62992N4477O7569j33480
18215b74426C4522a23171A22161D0065b26049P6989H4457g3366C77507A06802
18204b51699B0286a74283p8492b8987P067l49216C7610P1792a58883J2621j12029
18193b58291M6267c0313l1332k37743a05559o2702G7766K15916a2473A50544b08560
$$ plain form
18181 48040 -322101 -90326 -36083 64700 26323 159245 -151818 -65783 -202083 -226710 83787
18169 15321 186049 -99555 -85265 204631 -78615 -95561 208916 22831 -37294 -337733 -187786
18158 -187786 -153121 -296120 12331 181354 -191884 -43514 -87804 -267009 -365974 9554 102151
18147 102151 -197451 235327 -11887 -65104 -111577 -14249 60049 -138590 16428 -387783 227547
18135 -115712 -274481 34252 -22223 -170521 63540 20719 -85167 -143129 48058 -106051 -101509
18124 -101509 125052 274799 151273 25423 -85054 218103 -348167 31688 -60442 -97359
18114 -97359 -140440 -31562 189414 -195401 -470000 -96596 43045 -59036 234298 8229 3265
18102 -52428 87104 65833 46208 -23492 22908 -70657 -362223 -91812 -40997 -220367 251601
$$ packed form
18181D8040c22101i0326c6083F4700B6323J32922a51818f5783j36300k4627H3787
18169A5321J70728i9555J4290B04631g8615j6946B08916B2831c7294l00439J49947
18158a87786L4665j42999A2331J69023a91884d3514m4290j79205r8965I554R2597
18147A02151a97451B35327a1887n3217m6473a4249F0049a38590A6428c87783B27547
18135a15712j58769C4252b2223j48298F3540B0719h5167n7962D8058a06051M542
18124a01509A25052J49747j23526B5423h5054B18103c48167C1688f0442l6917
18114i7359m3081c1562A89414a95401k74599i6596D3045e9036B34298H229C265
18102e2428H7104k1271j9625b3492B2908g0657k91566i1812d0997j79370B51601
$$ plain form
18090 236728 -5039 -61289 -155345 -32647 -6253 -5022 93948 83731 56924 62710 -114227 -174103
18078 -174103 -172216 175923 -31005 235217 -173457 -109771 106855 121545 -242701 -110368
18067 22631 87806 47183 -12831 68556 69752 -14843 4554 -229450 -305428 -79268 -306542 -82131
18054 67348 -24661 107710 -10434 -114161 -136044 -250353 -142080 -88021 -70502 -302364 29144
18042 -416907 -220043 301298 -230018 439635 -47831 101569 -57296 -146677 198063 -108594
18031 236078 -59155 -68598 -250340 -62861 -176344 101423 -105667 -38207 9022 -144179 -179110
18020 -179110 252982 123011 -177477 -2430 -224116 -208404 -55276 108554 -64060 -50559 153041
18008 287809 -195276 -249777 -250776 299807 -258084 359721 243788 128122 -138152 209459
$$ packed form
18090B36728e039n6250r4056c2647f253J231I3948j0217k6807N786a14227n9876
18078a74103J887A75923c1005B35217a73457O3686A06855J4690b42701a10368
18067B2631O5175m0623a2831F8556J196a4843D554b29450p5978g9268k27274h2131
18054F7348b4661A07710a0434j03727k1883j14309J08273N4059J7519k31862B9144
18042d16907J96864C01298b30018D39635d7831A01569e7296q9381A98063a08594
18031B36078e9155r443j81742f2861j13483A01423a05667c8207I022a44179l4931
18020a79110B52982A23011a77477b430k21686J5712e5276A08554f4060J3501A53041
18008B87809a95276n4501r99B99807b58084C59721j15933j15666a38152B09459
$$ plain form
17997 320827 283963 -268022 36396 224342 -31797 -87869 -267316 -309978 -45438 -30580 -20675
17986 -20675 31854 -17087 43088 44695 66651 -226894 15909 115074 -155502 35023 -127255
17974 -119731 257423 15435 184678 223129 -282338 312691 7795 176517 -8969 -21720 257399
17962 -89183 -126704 -213594 74143 37649 -132268 -259508 -34437 -278361 -33615 92611 -277669
17950 64867 -236986 -47085 -330591 -99104 -270137 31911 -34242 -196333 4475 198955 -288983
17938 -79565 -137885 18249 127669 325741 -139752 242415 17646 -56951 -141282 -159075 20815
17926 96975 115667 48405 50501 -33977 17792 294523 -187975 -28259 -159680 334145 65332
17914 121290 -178072 52407 -53930 -136389 111301 79201 20792 38541 -201533 -398403 244966
$$ packed form
17997C20827l6864b68022C6396J87946c1797n6072j79447m2662d5438J4858R905
17986b0675C1854a7087D3088J607K1956b26894A5909R9165a55502C5023a27255
17974a19731B57423A5435J69243L8451b82338C12691G795J68722h969j2751B57399
17962h9183l7521q6890G4143l6494a32268j27240c4437k43924c3615I2611b77669
17950F4867b36986d7085k83506i9104j71033C1911c4242j62091D475J94480b88983
17938g9565n8320A8249J09420J98072a39752B42415A7646e6951q4331j7793B0815
17926I6975J8692D8405K096c3977A7792K76731a87975b8259j31421C34145F5332
17914A21290a78072E2407e3930q2459A11301l2100B0792J7749b01533j96870B44966
$$ plain form
17902 53389 -125608 -315461 -213945 -257527 -62653 -171124 -140721 2192 -92823 -180185 -330496
17891 -330496 -122873 -49316 -232429 -191130 -328854 224898 -53427 -19534 -190060 -80481
17880 -215714 9935 98763 -199663 52058 161077 351726 71300 -118535 318791 -66790 -218575
17869 -218575 -28909 17837 -43124 -355036 20901 50272 -139608 -105422 261464 -15776 -5933
17857 -140157 160443 -20080 115582 104923 -117765 -40747 377499 -1307 315205 119301
17846 -333469 -20004 148361 -138773 -197211 114111 -31757 141405 40729 -144643 159350
17835 -43087 -163137 -160307 -5565 283375 40861 -91042 131988 135677 173400 174550 -150570 -173083
17823 -173083 -44587 17072 -102066 106722 272003 -98278 -81669 44882 225472 239531 186674
$$ packed form
17902E3389a25608j89853J01516m3582f2653j08471L0403B192i2823q7362j50311
17891c30496a22873d9316j83113M1299j37724B24898e3427a9534j70526h0481
17880b15714I935Q8828a99663E2058J09019J90649G1300a18535C18791f6790j51785
17869b18575b8909A7837d3124l11912B0901K9371a39608L4186B61464a5776e933
17857a40157A60443b0080A15582j0659a17765d0747C77499a307C15205A19301
17846c33469b0004A48361a38773n8438A14111c1757A41405D0729a44643A59350
17835d3087j20050K830e565B83375D0861i1042A31988L689L7723J150a50570k2513
17823a73083d4587A7072a02066A06722J65281i8278J6609D4882J80590J4059n2857
$$ plain form
17812 186674 -218929 167435 -310761 128806 34028 -185897 175400 -231068 51734 165859
17802 165859 -163767 258091 -49284 254124 6798 257391 -29640 519157 30059 176144
17792 176144 109928 231012 -314795 -134125 57560 -46304 91344 -153609 -331893 19577
17781 -87156 -110436 -47825 396355 -304955 83665 -69052 220988 -142347 -88015 64563 -248477
17769 9661 -94070 160016 -38349 104730 -235359 -23629 18444 93126 -25345 94917 33405
17757 -87885 -131661 -105045 151156 59884 -59215 90854 -121956 51141 -72501 -12844 18705
17745 -113687 -45585 -91030 -106462 59858 54373 101331 37698 128580 -234237 -62513 250883
17733 145103 241932 25836 -126503 285602 -67008 50142 89512 289721 296505 43368 -484
$$ packed form
17812A86674b18929A67435c10761A28806C4028a85897A75400b31068E1734J14125
17802A65859a63767B58091d9284B54124F798K50593b9640E19157C0059J46085
17792A76144o6216J21084c14795a34125E7560d6304I1344a53609j78284A9577
17781h7156k3280d7825C96355c04955H3665f9052B20988a42347N4332F4563b48477
17769I661i4070A60016c8349A04730b35359b3629A8444P4682b5345I4917C3405
17757h7885m3776K6616A51156E9884e9215I0854a21956E1141g2501a2844A8705
17745a13687d5585m5445j5432E9858n485M6958C7698R0882b34237f2513B50883
17733A45103R6829B5836a26503B85602f7008E0142L9370K00209O784D3368d84
$$ plain form
17721 355255 -172239 13534 52951 -93652 221559 -183989 -191383 -50244 -5594 -137437 -44982
17709 260487 -132616 59304 -49819 12552 -113225 -79348 -87603 -53257 -291789 341733 -23477
17697 -328006 -124556 107935 -29006 353676 7644 -160464 -426735 50237 -292187 186767
17686 166711 -127952 23210 -132521 19905 -187948 146642 -24974 126616 197957 131387
17676 131387 -205351 383571 -16477 108317 285348 -48903 116021 166841 174664 -392009
17665 188317 155580 -101360 197579 -316272 -271414 -325809 -83770 56361 -120927 236841
17654 207884 113473 78747 89895 190018 -160979 -185753 21289 150019 131627 243200 101640
17642 -145311 108102 115550 80705 152128 39921 -75295 -115945 449890 120595 13612 -83142
$$ packed form
17721C55255a72239A3534L9417i3652B21559a83989p394e0244e594j31843d4982
17709B60487a32616E9304d9819A2552a13225L3877q255L4346k38532C41733b3477
17697c28006a24556A07935b9006C53676G644a60464k66271E0237b92187A86767
17686A66711a27952B3210a32521A9905a87948A46642b4974A26616P1341o6570
17676A31387b05351C83571a6477A08317J77031d8903A16021N0820P823c92009
17665A88317l2737a01360A97579c16272M4858n4395h3770E6361a20927B36841
17654B07884r4411l4726J1148J00123a60979k4774B1289J28730j8392J11573A01640
17642a45311A08102P448l4845P1423C9921g5295m0650D49890A20595A3612h3142
$$ plain form
17630 27995 -224830 -50737 -1290 9025 292700 -52059 -46149 4889 69722 107034 15142 117005
17618 117005 240698 145813 180386 391362 -409549 22596 53228 -133474 94511 -100049
17607 58032 217469 -167348 -179180 65313 -32220 -981 -18021 -118716 142486 -103010 -121211
17596 -121211 322964 -282437 -22340 -78570 164874 -79242 408568 -295976 -177502 113405
17585 -32876 30896 -67530 -116605 -147568 63765 271652 196701 17228 110727 -73222 66334
17573 -194224 209228 47488 77733 47983 -428804 48296 11223 -23814 -106021 77266 95069
17562 95069 -21223 35609 -89604 -2055 -182767 -9729 150783 82356 128859 89255 -105641
17550 -3042 137502 37555 525717 134026 -49597 -174240 314507 54988 -98744 -61455 217967
$$ packed form
17630B7995b24830e0737a290I025K83675e2059N910D889O4833L7312A5142J01863
17618A17005J23693r4885L4573K10976d09549B2596L0632a33474I4511a00049
17607E8032J59437a67348j1832F5313c2220i81j7040j00695A42486a03010j8201
17596a21211C22964b82437b2340n6230A64874g9242D08568b95976J18474A13405
17585c2876C0896f7530m9075l0963F3765K07887p4951A7228R3499g3222F6334
17573a94224B09228D7488L0245k9750d28804D8296A1223b3814q2207G7266J7803
17562I5069b1223C5609h9604b055j80712i729A50783o8427M6503l9604a05641
17550c042A37502C7555M88162A34026d9597j24643C14507E4988i8744L7289B17967
$$ plain form
17538 -162902 -215470 -80925 372935 209132 5364 93788 136398 101890 -33262 71349 -141196
17526 218804 185625 199449 66944 858 203121 -215050 194676 281447 141282 -261673 -96999
17514 63034 -184631 61170 104788 112227 11002 175324 201159 85490 139250 87976 -70606
17502 -114156 -164721 82876 -82102 28244 -47541 -95930 119712 -318257 117629 161540 25407
17490 -112048 52764 305697 162982 -213069 -67704 231134 20112 91038 -86846 55383 324738
17479 324738 111702 256027 -14030 313034 6696 353579 -52525 -4767 -49620 29560 179995
17468 179995 -4475 -61867 59614 259679 239525 312551 -197077 143984 -262364 156664 31054
17456 73363 119060 559350 166969 124856 404194 264044 427415 475211 206590 550534
$$ packed form
17538a62902n2568h0925C72935j63803E364Q8424M2610l4508c3262G1349a41196
17526B18804l3179J3824F6944H58K02263b15050A94676Q6771j40165b61673i6999
17514F3034a84631F1170M3618P439A1002J64322K5835H5490N3760n1274g0606
17502a14156n0565H2876h2102B8244d7541m8389A19712c18257A17629M3911B5407
17490a12048E2764K52933j42715b13069f7704B31134B0112P0926h6846E5383K69355
17479C24738A11702J44325a4030C13034F696L46883e2525d767m4853B9560J50435
17468A79995d475n7392E9614K00065k0154P3026a97077A43984b62364A56664C1054
17456G3363M5697M40290A66969m2113K79338j40150J63371M7796B06590L43944
$$ plain form
17446 550534 -53822 323418 213520 425383 163689 438986 22497 474278 156102 59817
17435 68837 329031 89227 22243 346254 -162900 -185772 384192 58723 424250 349336 -90312
17423 305104 7601 257337 43626 81596 197518 232991 454047 401668 130996 372275 327785
17412 327785 1026 394439 77059 268102 327515 -93082 -92659 171136 338298 -75725 348624
17400 233137 158069 60006 135839 281961 103869 -92583 -57911 -266045 62103 63761 336876
17389 336876 170024 392795 162401 43005 206081 -55205 188223 -53472 34094 90943
17379 90943 -54572 248894 178455 110435 14595 233689 144829 368521 -18095 154435 498770
17368 498770 -14253 313959 291610 193473 79868 349885 25115 -195756 -71289 376649 332306
$$ packed form
17446E50534e3822C23418j09898K11863A63689K75297B2497M51781A56102E9817
17435F8837K60194H9227B2243L24011a62900k2872C84192E8723L65527p4914i0312
17423C05104G601K49736D3626L7970J15922L5473K21056n2379A30996K41279m4490
17412C27785A026L93413G7059J91043N9413i3082M23A71136J67162g5725C48624
17400B33137p5068F0006P5833J46122A03869i2583L4672k08134F2103J658K73115
17389C36876j66852K22771A62401D3005J63076e5205A88223e3472C4094N6849
17379I0943e4572B48894p0439o8020A4595K19094q8860K23692a8095A54435L44335
17368D98770a4253C13959k2349r8137G9868K70017B5115a95756g1289C76649m4343
$$ plain form
17357 332306 772 185369 -96073 -305829 77213 -85478 -61025 -490469 210715 114509 81049
17346 81049 123998 373474 -2910 211400 33714 -290276 440682 227326 -100313 224066
17335 162736 141956 197141 29264 367323 116696 177931 322105 -6139 -201710 257788 571704
17324 571704 284217 72873 373266 -32240 -3801 319752 346968 43677 -7810 598413 145785
17312 169698 132002 234330 192507 -6370 -25386 12131 -188708 -275363 423611 305077 58136
17300 58276 -48985 -45498 154640 -43839 340442 202619 18011 145659 140862 -197401 69438
17288 13553 121971 70589 -105284 221921 142670 229348 204474 16676 -93768 213079 200956
17277 200956 297612 128267 126409 -100941 70694 170727 172884 390964 121148 219274 -162983
$$ packed form
17357C32306G72J84597i6073k09756G7213h5478K4453m29444B10715r6206l3460
17346H1049M2949K49476b910B11400C3714b90276D40682k13356a00313B24066
17335A62736k0780N5185B9264L38059A16696O1235J44174f139j95571B57788L13916
17324E71704B84217G2873L00393c2240c801C19752K7216D3677g810E98413A45785
17312A69698l7696J02328m1823f370j9016A2131a88708q6655D23611j18534E8136
17300E8276d8985L487A54640d3839C40442j37823A8011J27648m797a97401F9438
17288A3553J08418n1382a05284B21921p9251Q6678k4874A6676i3768B13079j2123
17277B00956R6656A28267j858a00941G0694J00033K157K18080A21148R8126a62983
$$ plain form
17265 341763 107685 -242181 -57783 395732 66539 40735 136625 67677 227971 219261 340211
17254 340211 134622 275083 237899 165008 119519 174061 223376 18141 145920 10205 197293
17243 197293 361410 436319 109136 163228 -122582 -32479 397762 39716 139539 359629
17233 359629 -46954 6379 -92625 484992 179835 325741 253580 225574 -154917 668907 468474
17222 468474 318724 250559 432870 225853 150146 274195 395796 136747 93385 282778
17212 282778 403330 188057 149498 546597 -252061 152274 38945 316836 289935 199442
17202 199442 93643 64048 -71877 318586 285244 168997 111844 61829 426693 -86502 15314
17190 205792 -3959 466524 321784 121595 636225 154028 187556 395427 238598 326366
$$ packed form
17265C41763A07685b42181e7783C95732F6539k5804R5890F7677J60294q710J20950
17254C40211A34622J40461l7184p2891m5489N4542M9315A8141J27779A0205J87088
17243A97293J64117P4909A09136N4092a22582c2479C97762C9716R9823K20090
17233C59629d6954F379i2625D84992A79835J45906p2161k8006a54917F68907k00433
17222D68474j49750o8165J82311k07017p5707J24049J21601A36747m3362J89393
17212B82778J20552A88057l8559L97099b52061A52274C8945K77891k6901r0493
17202A99442I3643k9595g1877C18586l3342j16247n7153n0015L64864h6502A5314
17190B05792c959D66524j44740A21595N14630A54028L3528K07871j56829Q7768
$$ plain form
17180 326366 298207 44399 582911 351615 260527 339535 488704 199395 -225440 247587
17169 215337 338520 457976 16036 160775 353434 61252 83326 -21588 243755 205780
17159 205780 259366 469399 419007 -42472 388837 514464 70315 54937 276512 373272 397484
17148 397484 182827 -13725 301054 217340 655381 139790 295614 1186 196199 -32458
17137 244753 418491 519061 154819 158840 451889 -21815 337340 297880 201826 182241 218043
17126 218043 307155 149194 297957 186435 228024 309490 230081 370976 156797 113151
17116 113151 260406 912336 167760 371242 180372 -418473 273149 379259 -49425 387006
17105 157326 579196 -58872 468070 349304 249251 514818 94219 20935 -44057 365673
$$ packed form
17180C26366k8159D4399N38512k31296r1088P9008J49169A99395b25440B47587
17169B15337J23183J19456A6036J44739J92659F1252K2074b1588B43755l7975
17159B05780N3586K10033n0392d2472C88837J25627G0315j5378K21575R6760K4212
17148C97484A82827a3725C01054q3714M38041A39790J55824A186J95013c2458
17137B44753J73738J00570A54819M021K93049b1815C37340l9460r6054j9585L5802
17126B18043Q9112A49194J48763j11522M1589Q1466p9409J40895A56797m3646
17116A13151J47255O51930A67760K03482A80372d18473B73149J06110d9425C87006
17105A57326M21870e8872D68070j18766j00053K65567I4219B0935d4057C65673
$$ plain form
17094 396699 344945 203480 393094 498781 35182 204735 283402 279014 424850 288295
17084 288295 288382 204277 265378 248081 422078 366731 180075 448217 417092 515832 438180
17073 438180 178476 122800 334587 483724 423747 319884 239234 411441 154672 119681
17063 119681 387104 364122 518819 273917 400166 533247 881284 276938 478106 354371
17053 354371 422753 528782 359229 513354 433450 634884 -53975 709772 255659 331636
17043 331636 314874 130677 514101 537891 520284 382053 484327 295225 468539 669287
17033 669287 632964 377199 465292 482777 566872 836424 539593 560260 535356 469239 475657
17022 475657 463684 458980 845794 710496 482539 646462 747532 360583 347147 500990
$$ packed form
17094C96699n1754j41465J89614J05687C5182J69553P8667m388J45836j36555
17084B88295Q7q4105O1101j7297J73997n5347A80075K68142l1125R8740p7652
17073D38180A78476n5676K11787J49137n9977j03863q0650J72207A54672l4991
17063A19681K67423k2982J54697k44902J26249J33081L48037B76938K01168j23735
17053C54371O8382J06029j69553J54125p9904K01434e3975G09772B55659P5977
17043C31636j6762A30677L83424K3790j7607j38231J02274j89102J73314K00748
17033F69287l6323k55765Q8093J7485Q4095K69552k96831K0667k4904o6117O418
17022D75657j1973m704L86814j35298k27957J63923J01070C60583j3436J53843
$$ plain form
17012 500990 847683 499527 341052 502997 617884 790628 813224 575644 405703 580586
17002 580586 169202 776983 648574 613399 879260 463584 384846 705752 862669 928906
16992 928906 730715 633497 820287 663281 1124747 683983 912407 209398 826105 697055
16982 697055 820758 863247 622294 858806 850620 787304 944461 1272119 751293 734603
16972 734603 735674 563579 857520 593545 904774 836659 775792 868693 870377 841090 975927
16961 975927 682632 921111 912933 844410 469218 852050 714791 959256 980597 705321
16951 705321 1148532 1077880 903078 1017261 967381 1112784 1122920 1107161 929060 930853 1044286
16940 1044286 1380434 1068606 1150335 1060440 1110075 1578381 1059197 1149292 943988 851417
$$ packed form
17012E00990L46693l48156j58475J61945J14887J72744K2596k37580j69941J74883
17002E80586A69202O07781j28409l5175K65861m15676p8738L20906J56917O6237
16992I28906j98191r7218J86790j57006M61466m40764K28424B09398O16707j29050
16982F97055J23703M2489k40953K36512q186o3316J57157L27658n20826j6690
16972G34603J071j72095K93941k63975L11229o8115o0867R2901J684k9287J34837
16961I75927k93295K38479q178o8523l75192L82832j37259K44465K1341k75276
16951G05321M43211p0652j74802J14183m9880J45403J0136j5759j78101J793J13433
16940A044286L36148l11828Q1729q9895M9635M68306n19184R0095k05304r2571
$$ plain form
16930 851417 850322 1253410 1255547 1275804 1058251 1177366 1057815 1414791 1023778 1105352 1243228
16919 1243228 1300335 1463211 1336340 1240603 1313575 1198622 1186539 1319951 1413452 1378533
16909 1378533 1301075 1458559 1575896 1715809 1595414 1329093 1267919 1723055 1411331 1662976
16899 1662976 1842715 1574499 1094504 1936713 1783717 1524722 1715127 1876235 1369910
16890 1369910 1631830 1403158 1779073 2187702 1867123 1832707 1720133 1855754 2042445 2048373
16880 2048373 2166898 2125070 2046522 2250926 2296155 2334181 2252557 1762812 2236420 2555198
16870 2555198 2261547 2328306 2326108 2409523 2252189 2420535 3045008 2497027 2693235 2598996
16860 2598996 2665094 2773491 2815946 2887399 2855920 2756923 2769807 2653799 2731696 2878536 3171402
$$ packed form
16930H51417j095M03088K137K0257k17553J19115j19551L56976l91013Q1574J37876
16919A243228N7107J62876j26871r5737P2972j14953j2083J33412R3501l4919
16909A378533p7458J57484J17337J39913j20395k66321o1174M55136l11724K51645
16899A662976J79739k68216m79995Q42209j52996k58995J90405J61108n06325
16890A369910K61920k28672L75915M08629l20579l4416j12574J35621J86691N928
16880B048373J18525m1828p8548K04404M5229L8026q1624m89745M73608L18778
16870B555198k93651O6759k198Q3415j57334J68346O24473n47981J96208r4239
16860B598996O6098J08397M2455P1453l1479r8997J2884j16008P7897J46840K92866
$$ plain form
16849 3171402 3056998 2934076 3745894 3320346 2864837 3459159 3265481 3232631 3866108 3362145
16839 3362145 3918235 3719069 3646521 4006460 4281638 3947971 4286258 4244090 4423320 4550603
16829 4550603 4463275 4795869 4442891 4454217 4989693 4784937 4731258 4960721 5332866 5075115
16819 5075115 5010824 5472349 5553368 5549579 5600780 6021346 5922194 5855442 5974186 6180075 6465199
16808 6465199 6771716 6555766 6797102 7113376 7218482 7182409 7764821 7471698 8137685 8018311
16798 8018311 8065530 8480000 8432344 8783709 9176463 9351541 9408862 9895376 9806129 10295440
16788 10295440 10685225 10673517 10950408 11381246 11759425 12038238 12662315 13064587 13038932 13431416
16778 13431416 14061810 14533944 15116123 15379032 15727250 16253443 16886703 18131404 18013761
$$ packed form
16849C171402j14404j22922Q11818m25548m55509N94322j93678l2850O33477n03963
16839C362145N56090j99166p2548L59939K75178l33667L38287m2168J79230J27283
16829D550603q7328L32594l52978J1326N35476k04756n3679K29463L72145k57751
16819E075115o4291M61525Q1019l789N1201M20566r9152o6752J18744K05889K85124
16808F465199L06517k15950K41336L16274J05106l6073N82412k93123O65987j19374
16798H018311M7219M14470m7656L51365L92754J75078N7321M86514q9247M89311
16788A0295440L89785j1708K76891M30838L78179K78813O24077M02272k5655L92484
16778A3431416O30394M72134N82179K62909L48218N26193O33260J244701j17643
$$ plain form
16769 18013761 18910690 19404956 19967502 20961943 21451919 22312576 23236496 24495273 25319940
16760 25319940 26090520 27076242 28463877 29643643 30707518 32102977 33761388 35133494
16752 35133494 36510044 38518334 40248399 42231608 44212440 46288193 48906183 51224556
16744 51224556 53995671 57156402 60279662 63839459 67356246 71218983 74976013 79947451
16736 79947451 84367155 89700143 95178910 100747305 106674019 113262411 119780880 126742584
16728 126742584 133801604 140948509 147873626 155206011 161963745 168038171 173897760 178441646
16720 178441646 182105938 184818060 185856150 186445915 184883292 182363420 178790375 173633505
16712 173633505 167936848 161259117 154231274 146503986 139211309 131723434 124445861 117261308
$$ packed form
16769A8013761Q96929M94266N62546R94441M89976Q60657R23920J258777Q24667
16760B5319940P70580R85722J387635J179766J063875J395459J658411J372106
16752C5133494J376550K008290J730065J983209J980832K075753K617990K318373
16744E1224556K771115L160731L123260L559797L516787L862737L757030M971438
16736G9947451M419704N332988N478767N568395N926714O588392O518469O961704
16728A26742584P059020P146905O925117P332385O757734O074426N859589M543886
16720A78441646L664292K712122J038090N89765j562623k519872l573045n156870
16712A73633505n696657o677731p027843p727288p292677p487875p277573p184553
$$ plain form
16704 117261308 110381905 103608552 97351620 91575157 86020094 81053271 75548323 70979785
16696 70979785 67094568 63605122 59695687 56536741 52980627 49883723 47371024 44909928
16688 44909928 42984193 40360956 38431522 36559962 34615472 33086115 31303449 30174812
16680 30174812 28423827 27252876 26593008 25318087 24059335 23312418 22055164 21169445
16672 21169445 20261424 19700579 18911252 18193045 17865418 17133179 15959138 15467954 15319050
16663 15319050 14778404 14298969 13773770 13440335 12719437 12605664 11847512 11704961 11507884
16654 11507884 10882544 10514060 10403981 9996153 9634209 9314624 8895944 8703428 8488468
16645 8488468 8689038 8041999 7835004 7907738 7468955 7502798 7275162 7081470 6741736 6728885
$$ packed form
16704A17261308o879403o773353o256932n776463n555063m966823n504948m568538
16696G0979785l885217l489446l909435l158946l556114l096904k512699k461096
16688D4909928j925735k623237j929434j871560j944490j529357j782666j128637
16680C0174812j750985j170951o59868j274921j258752p46917j257254q85719
16672B1169445r08021n60845p89327p18207l27627p32239j174041m91184j48904
16663A5319050n40646m79435n25199l33435p20898j13773p58152j42551j97077
16654A1507884o25340l68484j10079m07828l61944l19585m18680j92516k14960
16645H488468K00570o47039k06995P2734m38783L3843k27636j93692l39734j2851
$$ plain form
16635 6728885 6241836 6213963 6383930 6077834 6245868 6062789 5676132 5515926 5171059 5258133
16625 5258133 5151462 5218965 4785260 4786485 4625618 4530247 4668250 4579533 4360395 3916495
16615 3916495 4045815 4109122 4030406 4155419 4089333 3866857 3796194 3544351 3884650 3705524
16605 3705524 3386255 3357568 3437404 3328002 3243173 2961620 3150338 3238789 2962436 2812624
16595 2812624 2822903 2705887 2701735 2810149 2812647 2333165 2685146 2585125 2737874 2489437
16585 2489437 2713421 2500159 2512574 2131473 2194016 2250590 2480633 2057423 1770727 1802125
16575 1802125 2185539 2107526 2291703 1986172 2011277 2075258 1945076 1758118 2154553 1741637
16565 1741637 1870309 1737940 1906254 1449096 1796943 1995568 2025440 1618627 1425584 1515256
$$ packed form
16635F728885m87049k7873J69967l06096J68034j83079l86657j60206l44867Q7074
16625E258133j06671O7503m33705J225j60867r5371J38003q8717k19138m43900
16615C916495J29320O3307p8716J25013o6086k22476p0663k51843L40299j79126
16605C705524l19269k8687P9836j09402q4829k81553J88718Q8451k76353j49812
16595B812624J0279j17016m152J08414K498m79482L51981j00021J52749k48437
16585B489437K23984k13262J2415l81101O2543N6574K30043m23210k86696L1398
16575A802125L83414p8013J84177l05531K5105O3981j30182j86958L96435m12916
16565A741637J28672j32369J68314m57158L47847J98625K9872m06813j93043Q9672
$$ plain form
16555 1515256 1639679 1367122 1702146 1518125 1524783 1634776 1386000 1602250 1461140 1653806
16545 1653806 1340051 1424859 1678618 1154129 1415771 1448785 1561552 1364452 1160269 1281964
16535 1281964 1393799 1098287 1088138 1173163 1163464 1586144 1275156 1064658 1101106 1159424
16525 1159424 1148101 1044001 986460 1237305 1106516 950709 1143581 1497841 1252228 1283361
16515 1283361 975314 1065620 702026 681435 998798 713801 1070804 985947 1205282 953083
16505 953083 991829 576118 1048858 603157 909843 885627 785482 856545 916018 878885
16495 878885 1051259 744169 408361 1021032 963894 933637 587198 1375139 673549 759575
16485 759575 552496 722271 767160 964317 745409 808716 581681 1177038 632390 779310
$$ packed form
16555A515256J24423k72557L35024j84021O658J09993k48776K16250j41110J92666
16545A653806l13755Q4808K53759n24489K61642L3014J12767j97100k04183J21695
16535A281964J11835k95512j0149Q5025r699M22680l10988k10498L6448N8318
16525A159424j1323j04100n7541K50845j30789j55807J92872L54260k45613L1133
16515A283361l08047R0306l63594k0591L17363k84997L57003q4857K19335k52199
16505I53083L8746m15711M72740m45701L06686k4216j00145P1063N9473l7133
16495H78885J72374l07090l35808O12671n7138l0257l46439P87941F73549Q6026
16485G59575k07079J69775M4889J97157k18908O3307k27035N95357n44648J46920
$$ plain form
16475 779310 731373 1171151 639953 703176 1025496 929224 681738 537204 612569 642918
16465 642918 661115 947187 796841 712781 1064223 522044 782787 534529 543631 972517
16455 972517 920436 683766 432102 573477 581685 544550 398944 547719 221301 512969
16445 512969 390451 593205 409715 818491 496014 356501 561397 592610 639998 493414
16435 493414 337972 335673 211178 753801 582084 710663 369724 925685 434885 383045
16425 383045 503909 415669 544293 372547 334129 544376 229649 580390 544149 387250
16415 387250 399335 505453 190071 136275 537070 548394 311535 568494 374227 218690
16405 218690 430327 473776 278532 205542 242566 331461 236084 292195 244389 193288 490710
$$ packed form
16475G79310m7937M39778n31198O3223L22320r6272k47486j44534P5365L0349
16465F42918J8197K86072j50346q4060L51442E22044K60743k48258R102M28886
16455I72517n2081k36670k51664J41375Q208l7135j45606J48775B21301K91668
16445E12969j22518K02754j83490M08776l22477j39513K04896L1213M7388j46584
16435D93414j55442k299j24495N42623j71717J28579l40939N55961D34885n1840
16425C83045J20864q8240J28624j71746l8418K10247B29649L50741l6241j56899
16415C87250J2085J06118A90071n3796M00795J1324k36859K56959j94267j55537
16405B18690K11637M3449j95244p2990L7024Q8895r5377N6111m7806n1101K97422
$$ plain form
16394 490710 297756 516948 215348 293394 543253 342703 393385 386164 209595 211172 325588
16383 325588 315192 555416 191760 391575 181050 371692 399648 319047 485488 205671
16372 591924 467111 423698 421945 517198 -125482 -17102 399746 130823 157364 413930 266233
16361 266233 385264 133296 287403 671188 164788 197131 236894 326574 218306 111997
16351 111997 384930 176436 157225 185534 459231 281217 428199 305481 151830 460013
16341 460013 364573 198914 21794 355387 450909 141936 289259 182336 514450 230768
16330 336863 109695 229025 286910 327526 529162 295179 50215 432454 210059 248381
16320 248381 129623 -3412 207972 515263 342468 629050 77175 57118 194944 -76754
$$ packed form
16394D90710j92954K19192B15348P8046K49859k00550N0682p221j76569J577J14416
16383C25588j0396K40224A91760J99815A81050J90642K7956q0601J66441B05671
16372E91924j24813m3413j753R5253a25482a7102C99746A30823K6541K56566j47697
16361B66233J19031A33296J54107L83785A64788L2343L9763Q9680j08268j06309
16351A11997K72933A76436j9211K8309K73697j78014J46982j22718A51830L08183
16341D60013r5440j65659B1794L33593R5522A41936J47323j06923L32114B30768
16330C36863A09695J19330N7885M0616K01636k33983E0215L82239B10059L8322
16320B48381j18758c412B07972L07291j72795K86582G7175k0057J37826g6754
$$ plain form
16309 108822 202926 489481 20399 63972 246785 225666 145567 112552 531099 301239 311683
16298 311683 140267 -118784 470030 120366 499150 364333 278831 370732 256133 201008
16288 201008 324654 103951 265431 617058 222614 1955 164042 289217 462516 126187
16277 250386 417027 13562 -167696 254056 314506 164549 126708 84323 -111657 305455
16266 201289 13364 325517 103792 198394 17170 283813 664864 337893 8124 19802 188081
16255 188081 -93577 171535 -24969 144011 194496 560764 159449 422767 268402 -232544
16244 508320 52788 -57655 65334 470541 284695 -184556 134498 -19376 1442 -287705 -41210
16232 -92595 -83110 -137778 115538 224354 187305 465176 183745 53434 143310 177103 -66874
$$ packed form
16309A08822R4104K86555B0399M3573J82813k1119q0099l3015M18547k29860J0444
16298C11683A40267a18784D70030A20366L78784j34817q5502R1901j14599n5125
16288B01008J23646A03951J61480L51627B22614A955J62087J25175J73299A26187
16277B50386J66641A3562a67696B54056O0450j49957l7841m2385a11657C05455
16266B01289A3364L12153A03792R4602A7170K66643L81051l26971H124J1678J68279
16255A88081i3577A71535b4969A44011N0485L66268A59449K63318j54365b32544
16244E08320E2788e7655F5334M05207j85846a84556A34498a9376A442b87705d1210
16232i2595R485n4668A15538J08816l7049K77871A83745E3434Q9876L3793f6874
$$ plain form
16220 12772 204417 -56606 40847 451900 -235738 133799 -3962 304823 -25553 -166148 158408
16208 77705 71845 72038 -311846 99642 -42263 216593 -108918 123545 193703 17150 96921
16197 96921 220150 122145 418806 -240957 96139 31419 -11769 151285 -368 222924 258898
16186 258898 491723 163426 -146228 -151317 174865 123621 -39951 147792 -157709 -994 73070
16174 123871 -279505 291372 416361 -26659 -17560 363021 280108 -2180 -44868 70622 90867
16163 90867 234814 -268402 -196070 138472 125143 390018 -120028 145960 39166 112508
16153 112508 195412 -410473 339161 180347 -39395 220955 90750 149830 205449 222434 4618
16141 8197 -182393 290100 -139481 -13655 28453 -161415 283383 -8432 -157875 275542 180877
$$ packed form
16220A2772J91645e6606D0847M11053b35738A33799c962C04823b5553j40595A58408
16208G7705n860J93c11846I9642d2263B16593a08918A23545P0158A7150P9771
16197I6921J23229r8005K96661b40957I6139C1419a1769A51285c68B22924L5974
16186B58898K32825A63426a46228n089A74865n1244c9951A47792a57709i94G3070
16174A23871b79505B91372J24989b6659R099C63021q2913b180m2688G0622K0245
16163I0867J43947b68402P2332A38472j3329K64875a20028A45960C9166P3342
16153A12508Q2904d10473C39161j58814c9395B20955I0750N9080N5619J6985D618
16141H197a82393B90100a39481a3655B8453a61415B83383h432j49443B75542r4665
$$ plain form
16130 180877 118818 453739 -132888 99122 -276674 189571 155042 -34821 274517 148436
16120 148436 334203 -204668 169059 78492 -143035 -51884 163591 106031 -63709 253350
16109 216471 -288281 -131471 200198 23003 373735 107644 -97899 -113410 -60057 20316
16098 83603 320331 -3262 27920 -84765 -127773 50353 316791 -9554 17311 -108836 -281579
16087 -281579 -158619 -115972 -181553 21655 -121226 -170732 379296 -172255 -29005 176377
16076 -149620 -71576 -275778 292187 -74751 -66690 -193221 -58060 -55593 147100 63678 -541769
16064 -85664 81574 -238658 69496 -271621 202705 -213101 -212736 14908 -187738 -42090 7416
16052 -138066 114619 11633 127202 -180806 32762 185712 -127109 298573 -6688 -84042
$$ packed form
16130A80877o2059L34921a32888I9122b76674A89571l4529c4821B74517j26081
16120A48436J85767b04668A69059G8492a43035e1884A63591n7560f3709B53350
16109B16471b88281a31471B00198B3003L50732A07644i7899j5511N3353B0316
16098H3603K36728c262B7920h4765m3008E0353K66438i554A7311a08836j72743
16087b81579J22960M2647o5581B1655a21226m9506C79296a72255b9005A76377
16076a49620g1576k04202B92187g4751Q061j26531e8060K467A47100F3678e41769
16064h5664H1574b38658F9496b71621B02705b13101L65A4908a87738d2090G416
16052a38066A14619A1633J15569a80806C2762J52950a27109B98573f688p7354
$$ plain form
16042 -84042 -8228 87247 39908 185571 -219509 142197 -21681 245942 -32684 -65307 -178178
16031 -178178 -88464 -66847 28861 -230984 -77770 243875 250613 16851 157377 142397 -49602
16019 228008 -178220 124734 27234 -81801 272763 69051 18509 36707 -198318 -227832 -84811
16007 156262 206702 7031 215238 335410 -49702 -191597 -364698 -216576 200158 -226977
15996 222800 174780 214542 -19503 38696 73741 -216037 -13099 -367342 35670 109978 -179549
15984 -126270 73611 338968 278663 282049 31188 356937 167760 -335446 -30656 -120062 -3633
15972 44569 349868 27282 -329671 329864 86163 7759 -5217 123624 -93861 56904 -59046
15960 -169038 -96335 70127 25194 -44642 -98866 140226 -278882 44963 264140 -266409 -150501
$$ packed form
16042h4042h228H7247C9908J45663b19509A42197b1681B45942c2684l2623j12871
16031a78178h8464K1617B8861b30984g7770B43875O738A6851J40526j4980d9602
16019B28008a78220A24734B7234h1801B72763F9051A8509J8198a98318k9514h4811
16007A56262N0440G031K08207J20172d9702j41895j73101J48122B00158b26977
15996B22800m8020L9762a9503C8696L5045b16037a3099l54243C5670P4308a79549
15984a26270G3611K65357o0305L386C1188L25749A67760c35446c0656q9406c633
15972D4569L05299B7282c29671C29864H6163G759e217A23624i3861E6904e9046
15960a69038P2703G0127B5194d4642n4224A40226b78882D4963K19177b66409J15908
$$ plain form
15949 -150501 -164958 -344750 -226623 138220 -464781 101688 10385 -218338 -26446 -256834
15939 -256834 -259072 12636 -98447 -213109 -41046 -95039 -69931 41514 -209813 -378695 -255531
15928 -255531 -37956 -99336 59814 41437 -355652 146693 -200442 -4839 -227609 344141 -136299
15916 -76306 -104595 161438 297613 67291 -40797 -74454 125645 58848 -340792 -198494 -156326
15905 -156326 -116403 -117785 -131091 286845 108055 110334 -41641 -35693 167783 -180586 -340762
15894 -340762 97451 -68427 284905 3065 17413 -19177 185527 -368613 -5300 167633 7106
15882 224818 67530 -8481 -115249 -190297 265208 -105490 -359181 -222142 -203215 -223711 68343
15870 -218279 -206844 7587 -105473 92064 -12316 -273040 -218623 -131819 -62241 93136 25782
$$ packed form
15949a50501j4457j79792J18127A38220d64781A01688A0385b18338b6446k30388
15939b56834k238A2636i8447j14662d1046n3993K5108D1514b09813j68882J23164
15928b55531c7956o1380E9814j8377c55652A46693b00442d839k22770C44141a36299
15916g6306k8289A61438J36175F7291d0797l3657A25645E8848c40792J42298M2168
15905a56326L9923j382j3306B86845A08055K279d1641N948A67783a80586j60176
15894c40762I7451f8427B84905C065J4348a9177A85527c68613e300A67633G106
15882B24818F7530h481j06768p5048B65208a05490k53691J37039J8927k0496F8343
15870b18279J1435G587a05473I2064a2316k60724N4417Q6804f2241I3136B5782
$$ plain form
15858 -21917 -378297 -59163 -230590 240027 -232217 -143207 -344123 163216 -233461 215785
15847 -4876 142291 -131322 -23342 -162936 -261642 81126 126402 267296 111415 41042 61682
15836 61682 97585 -125574 -177152 111142 -24192 170388 -232249 -343216 -116424 9190 -184779
15824 24108 -355834 99605 -33763 -144309 -169253 5587 -9998 -253892 187959 -70385 -112192
15813 -112192 -73807 98625 -260707 -204101 22059 21445 -24815 47461 -242519 -61514 -44435
15802 -44435 91033 -30941 -135637 -73995 129483 -165249 217992 -291978 -34258 -249593
15792 -249593 -60850 120658 -224681 -27919 -5964 165206 -246273 60865 170172 170482 53178
15780 -55901 -408339 72624 42200 -230711 -104851 -231281 54309 -202388 -378592 83466
$$ packed form
15858b1917l56380e9163j71427B40027b32217Q9010k00916A63216b33461B15785
15847d876A42291a31322b3342j39594r8706H1126M5276J40894A11415D1042K0640
15836F1682L5903a25574n1578A11142b4192A70388b32249j10967a16424I190a84779
15824B4108c55834I9605c3763j10546k4944E587i998k43894A87959g0385m1807
15813a12192L8385I8625b60707N6606B2059o14b4815D7461b42519f1514J7079
15802d4435I1033c0941j04696O1642A29483a65249B17992b91978c4258k15335
15792b49593f0850A20658b24681b7919e964A65206b46273F0865J09307L10E3178
15780e5901l52438G2624l0424b30711a04851j26430E4309b02388j76204H3466
$$ plain form
15769 45757 -245087 -20909 53357 162171 -220051 158503 38976 -288249 -37741 94516 -175200
15757 208587 59119 -49347 -6813 223773 -174634 304636 -34088 -181781 -90537 -28591 -45142
15746 -45142 -94976 167192 -158906 -15188 -84842 18180 28603 -131896 28979 -290070 -150699
15735 -150699 13994 94679 -132344 299059 165100 50897 -275196 -55874 145796 188319
15725 188319 -1318 -173568 5397 -120212 181347 -60852 -296655 -329540 -186038 -86095 -368850
15714 -368850 -35965 -9867 -217696 -116827 -59641 -317258 -26123 -26605 -317304 -327244 -376998
15703 -376998 -174 -175150 -32226 -130209 -344905 -164966 -123144 -362287 12877 383463 173985
15691 295465 116122 68818 11766 -22503 174075 183949 260024 -231311 -85967 -41395 -46614
$$ packed form
15769D5757b45087b0909E3357J08814b20051A58503C8976b88249c7741I4516a75200
15757B08587E9119d9347f813B23773a74634C04636c4088j47693i0537b8591j6551
15746d5142m9834A67192a58906a5188o9654A8180J0423a31896B8979b90070J39371
15735a50699A3994Q0685a32344B99059j33959E0897b75196e5874A45796M2523
15725A88319a318j72250E397a20212A81347f0852k35803l2885J43502h6095k82755
15714c68850c5965i867k07829J00869N7186k57617b6123m82k90699r940m9754
15703c76998a74j74976c2226r7983k14696a64966M1822k39143A2877L70586A73985
15691B95465A16122m7304A1766b2503A74075R874P6075b31311h5967d1395n219
$$ plain form
15680 -46614 189462 -282011 -208558 -129410 49820 325370 -72758 87284 513691 -26298 -83505
15669 -83505 -1746 66609 204208 -407457 -15941 43754 -44605 -205084 -175383 -130395 291144
15657 12416 -165235 -6861 -160050 -46836 9921 76664 -183342 167745 -330504 160144 -52866
15645 16743 91744 113761 151958 165653 -196012 -31661 -396533 -301949 237979 185009 -169822
15633 -183947 319315 -342631 -39094 -204425 170087 83872 339802 -44135 41320 -169497
15622 93715 -76639 270016 -429913 -315392 -169954 -450213 249130 24077 -124244 -247061
15612 -247061 -83633 -199421 98874 54505 -309496 -134059 98753 106019 -7643 35989 -166117
15600 141272 -11787 -167622 125097 67558 -305619 157186 -113709 -319693 186105 -203632
$$ packed form
15680d6614A89462b82011P3453P9148D9820K75550g2758H7284M26407b6298n7207
15669h3505a746F6609J37599d07457a5941D3754d4605j60479K9701M4988B91144
15657A2416a65235f861j53189d6836I921O6743a83342A67745c30504A60144e2866
15645A6743P5001K2017L8197J3695a96012c1661l64872R4584B37979n2970a69822
15633a83947C19315c42631c9094j65331A70087H3872K55930d4135D1320a69497
15622I3715g6639B70016d29913J14521J45438k80259B49130B4077a24244j22817
15612b47061h3633j15788I8874m4369c09496a34059I8753P266g643C5989a66117
15600A41272a1787j55835A25097n7539c05619A57186a13709k05984A86105b03632
$$ plain form
15589 -44317 167867 50310 379443 -37497 179808 74660 -226024 -200433 77603 -27789 -311848
15578 -311848 -190160 467494 -121944 687 -63836 199561 -63325 -224422 -3072 -18543 -9470
15567 -9470 -412621 154258 -268038 229354 78972 -234126 -169119 -157007 -234698 73697 -277781
15555 38354 -41646 -87972 -30730 115731 -23684 77667 -24447 -34938 -115586 -187564 150267
15543 -72124 253989 312209 59073 339792 -75330 49360 58766 -62756 116605 -61808 -302155
15532 -302155 -42461 62470 162530 58084 -269308 27752 -180577 46336 -87079 -19447 156620
15520 -146233 195064 119335 349004 -173274 -49306 127142 144045 82896 -374808 141074
15509 -64055 74276 -103143 -61290 -335139 -151525 -58563 -67267 50586 16015 49594 373552
$$ packed form
15589d4317A67867E0310L29133c7497A79808G4660b26024K5591G7603b7789k84059
15578c11848J21688D67494a21944F87f3836A99561f3325j61097c072j5471R073
15567i470m03151A54258b68038B29354G8972b34126O5007J2112p7691G3697b77781
15555C8354d1646m6326c0730A15731b3684G7667b4447j0491q0648p1978A50267
15543g2124B53989N8220E9073K80719g5330D9360R406f2756A16605f1808k40347
15532c02155d2461F2470J00060E8084b69308B7752a80577D6336h7079a9447A56620
15520a46233A95064p5729K29669a73274d9306A27142J6903o1149c74808A41074
15509f4055G4276a03143M1853k73849a51525e8563q704E0586A6015L3579L23958
$$ plain form
15498 373552 -94852 71116 -36989 25747 -234110 155795 -3694 27285 9994 -173387 -3553
15486 -354706 41534 124567 -285947 -163605 -197268 -114885 -149533 68635 169988 -10866 -1622
15474 -117852 256506 -16248 30780 355301 -475894 -329394 67743 -296071 -86271 161925
15463 -228505 -228693 -331118 -8776 6198 -2116 20488 195600 -65393 -126766 77534 -179082 149661
15450 197770 -201153 -15143 -181206 -349072 -425756 111136 -101007 -64511 5262 -307586
15439 -245110 85107 77293 -169591 -513 14597 66852 -32031 43539 6009 -23110 175158 268996
15427 268996 -115171 232459 -129666 79635 -138729 -143117 292421 -109603 -214243 -207815
15417 -207815 184770 -175303 -152006 99497 204798 180115 22080 38293 112227 -136931 35940
$$ packed form
15498C73552i4852G1116c6989B5747b34110A55795c694B7285I994a73387c553
15486c54706D1534Q3033b85947J22342l3663Q2383l4648F8635J01353a0866a622
15474a17852B56506a6248C0780L24521d75894J46500F7743b96071h6271A61925
15463b28505j88j02425h776F198b116B0488J75112f5393o1373G7534a79082A49661
15450A97770b01153a5143j66063j67866p6684A11136a01007L6496E262c07586
15439b45110H5107p814a69591e13A4597N2255c2031D3539F009b3110A75158R3838
15427B68996a15171B32459a29666G9635a38729m388B92421a09603j04640O428
15417b07815A84770a75303K3297I9497J05301k4683B2080J6213P3934a36931C5940
$$ plain form
15405 -49322 -135031 -182104 -218812 175920 73563 291300 -30133 297620 -169785 -12131 -78330
15394 -78330 -94567 -207375 102489 -310056 -209998 4539 18684 264420 74166 -9271 88839
15382 418616 -47291 48899 -23992 -14872 -25437 -135299 226710 -97601 -80729 -279998 99758
15370 196048 -116977 -17543 -137160 269982 -131329 52261 334574 36245 135185 -63630
15359 99723 120899 74083 -126315 -306227 -138057 40097 276834 57162 125382 -80607 134270
15347 -104494 11240 193568 127180 200190 141477 -173790 -198677 59424 466322 -166043 -365288
15336 -365288 -88509 -12802 85820 26747 227936 175164 -87872 -1022 -417518 71795 139792
15325 139792 155217 -257830 -58112 100368 -186242 -49398 65696 47215 48309 4907 148612
$$ packed form
15405d9322q5709m7073l6708A75920G3563K17737c0133B97620a69785a2131o6199
15394g8330j6237j12808A02489c10056J00058D539J4145K45736G4166i271H8839
15382D18616d7291D8899b3992R120j0565j09862B26710i7601J6872j99269I9758
15370A96048a16977a7543j19617B69982a31329E2261K82313C6245R8940f3630
15359I9723K1176m6816a26315j79912a38057D0097K36737E7162O8220h0607A34270
15347a04494A1240J82328o6388P3010n8713a73790k4887E9424M06898a66043j99245
15336c65288h8509a2802H5820B6747K01189n2772h7872a022m16496G1795O7997
15325A39792J5425b57830e8112A00368a86242d9398F5696j8481J094D907J43705
$$ plain form
15314 148612 93622 -59862 -33960 229281 -36287 -283978 -131660 67427 200912 -138069
15303 127436 39905 203219 -70285 -101709 -81986 160420 117844 -117400 194108 49858 30522
15292 30522 -54397 553366 -31933 50342 127164 24384 195788 245957 -134022 51012 -65489
15280 310975 -190910 -136045 125852 372119 -50468 131879 173021 236962 253549 -10321 137264
15268 113265 120330 -36712 292941 88974 7535 146847 -273611 -55886 138655 137059 394199
15257 394199 -276254 256943 -16140 116023 134224 501143 866015 1228916 729545 1351551
15247 1351551 835295 354983 157437 153836 -131134 -452866 -155066 -9313 -25994 -19235 163436
15235 23066 147768 261672 -54580 -17111 127420 138602 7227 76192 -54593 269995 -251328
$$ packed form
15314A48612n4990e9862K5902B29281c6287k47691a31660F7427J33485a38069
15303A27436C9905J63314g0285l1424J9723A60420m2576a17400A94108D9858j9336
15292C0522e4397E53366c1933E0342P6822B4384J71404N0169a34022E1012f5489
15280C10975a90910N4865A25852K46267e0468A31879M1142O3941J6587a0321A37264
15268A13265P065c6712B92941H8974G535J39312b73611e5886A38655j596K57140
15257C94199b76254B56943a6140A16023J8201L66919L64872L62901m99371O22006
15247A351551n16256C54983A57437l601a31134l21732a55066i313j6681O759A63436
15235B3066J24702J13904e4580a7111A27420J1182G227O8965e4593B69995b51328
$$ plain form
15223 182761 -91566 75933 -71809 -180130 199481 101643 121420 134299 -63112 319925 110911
15211 75999 -179396 419224 63687 -140491 218269 -124724 241308 31750 2368 120730
15201 120730 -59845 -38434 -93503 345997 -186728 114907 272302 33688 -51988 -82234 343298
15189 116109 -56663 126902 -79174 70711 59228 -38332 -189610 -2 -1589 51600 159525 198838
15177 198838 -23015 -422 -65972 -380206 -206411 38886 362423 92931 119372 -56088 57072
15165 145887 24826 103981 173170 -13118 211493 215699 -54926 371641 -169141 113202 -17225
15153 220801 159455 -78604 60447 110513 -279185 -198284 -158092 215201 282199 403008 274140
15142 274140 96435 35772 118032 201773 280924 259853 355095 -220932 -114671 47297 216946
$$ packed form
15223A82761i1566G5933g1809j08321A99481r7838J9777J2879f3112C19925A10911
15211G5999a79396D19224F3687a40491B18269a24724B41308C1750B368J18362
15201A20730e9845K1411n5069C45997a86728A14907J57395C3688e1988l0246C43298
15189A16109e6663A26902g9174G0711j1483c8332j51278bj587E1600J07925L9313
15177A98838b3015d22o5550l14234J73795C8886L23537I2931K6441e6088E7072
15165A45887B4826P9155O9189a3118B11493M206e4926C71641a69141A13202a7225
15153B20801o1346g8604F0447N0066b79185Q0901M0192B15201O6998J20809j28868
15142B74140I6435C5772Q2260Q3741P9151k1071R5242b20932J06261D7297J69649
$$ plain form
15131 216946 350045 -283403 330100 112549 264702 -68224 239698 180306 145674 330098
15121 330098 -339027 180707 119075 200142 83774 145097 258 157673 69416 -151673 324417
15109 85159 -127135 -289066 615410 -18094 -144731 -166316 -34396 248030 181986 13687 109742
15098 109742 -259542 -40874 262299 149394 76242 -34869 130834 165005 131589 2102 216611
15087 216611 139495 393565 -52587 7461 123375 -667 270927 -22867 8656 -120096 -122933 -299755
15075 -299755 56214 -83925 144281 292531 49601 62180 86308 2105 104804 -85839 377016
15063 -38724 29416 -39714 240772 121248 92812 208558 148384 139218 -97173 114364 -220290
15051 151497 437586 412716 270729 462591 -28564 248474 688517 204555 -81278 343517
$$ packed form
15131B16946J33099b83403C30100A12549J52153f8224B39698n9392l4632J84424
15121C30098c39027A80707o1632Q1067H3774O1323B58J57415F9416a51673C24417
15109H5159a27135j61931F15410a8094j26637k1585c4396B48030o6044A3687R6055
15098A09742b59542d0874B62299j12905p3152c4869A30834L4171l3416B102K14509
15087B16611p7116K54070e2587G461J15914f67B70927b2867H656a20096k837j76822
15075b99755E6214h3925A44281J48250D9601J2579K4128B105J02699h5839C77016
15063c8724B9416c9714B40772j19524k8436J15746o0174r166i7173A14364b20290
15051A51497K86089k4870j41987J91862b8564B48474M40043B04555h1278C43517
$$ plain form
15040 49446 166606 446801 -42757 315679 256146 352480 143716 258554 266366 200208 74643
15028 255615 157948 317458 180649 333643 501964 146971 27827 354606 159816 223055
15018 223055 -74647 123339 297228 3495 7467 104773 171027 178694 177324 300058 145024
15006 -142116 25115 264456 300926 250501 100070 317153 239071 -80918 432208 97357 41392
14994 -468 34686 -80363 183084 -21039 123782 14301 332966 268148 -35446 235268 -195301
14982 315106 163559 -58268 -5923 260198 24229 167580 78471 206984 511185 361795
14972 361795 -77271 69720 174937 60911 294927 267950 291705 385461 51636 -11683 -14107
14961 -14107 411223 -60336 242292 318734 400339 19099 132131 244825 273304 313621 13489
$$ packed form
15040D9446J17160K80195d2757C15679n9533R6334A43716J14838P812o6158G4643
15028B55615r7667J59510j36809J52994J68321A46971B7827L26779A59816O3239
15018B23055g4647A23339J73889C495L972R7306O6254P667j370J22734A45024
15006a42116B5115K39341L6470n0425A00070K17083p8082h0918D32208I7357D1392
14994d68C4686h0363A83084b1039A23782A4301L18665o4818c5446B35268a95301
14982C15106j51547e8268e923B60198B4229J43351G8471J28513L04201j49390
14972C61795g7271F9720J05217F0911K34016k6977K3755R3756E1636a1683k424
14961a4107D11223f0336B42292P6442Q1605A9099J13032J12694K8479M0317A3489
$$ plain form
14949 276575 262694 389379 308977 -167523 10210 419893 586767 71125 244838 190802
14939 190802 1338 322936 189898 158544 249498 284123 87085 107437 286793 38044 266841
14928 266841 53337 402300 194392 278701 339016 127728 464152 205667 641696 266709
14917 31669 357968 324633 78319 72260 -30309 101119 99329 243292 272457 421604 654475
14906 654475 479795 -156774 311453 862599 398594 392957 122818 166397 292436 374617
14896 374617 362154 111882 312267 739792 144299 46073 370362 395854 292120 173396
14886 173396 213694 361220 183692 209163 498223 296239 418195 271949 153558 661336
14876 661336 234303 88219 293651 296022 254976 694129 317568 -127049 465335 256491
$$ packed form
14949B76575j3881J26685q0402a67523A0210M09683J66874G1125J73713n4036
14939A90802A338L21598j33038l1354R0954L4625H7085K0352J79356C8044K28797
14928B66841E3337L48963A94392Q4309O0315A27728L36424B05667M36029B66709
14917C1669L26299l3335G8319o059c0309A01119j790J43963K9165J49147K32871
14906F54475j74680a56774C11453N51146C98594n637A22818M3579J26039Q2181
14896C74617j2463A11882K00385M27525A44299D6073L24289K5492j03734j18724
14886A73396M0298J47526j77528K5471K89060k01984J21956j46246j18391N07778
14876F61336B34303H8219K05432K371m1046M39153C17568a27049D65335k08844
$$ plain form
14866 256491 366368 504562 385702 399409 334255 234984 381459 160727 183695 602884
14856 602884 405392 519669 332095 450576 664646 486035 444368 507751 632511 496799
14846 496799 435213 251718 67313 235310 8346 544484 194181 380274 328082 504106
14836 504106 490108 137567 777554 619085 277720 464407 810113 564508 433231 368255
14826 368255 599403 166779 280740 520860 212709 652722 423222 667221 529767 348729
14816 348729 248677 507901 49610 737303 204846 889105 442567 460043 509978 356797
14806 356797 413472 595927 493112 593701 487598 744055 445241 463762 875603 456332
14796 456332 586116 315400 794412 489912 577339 540046 483628 466358 514525 599055 454626
$$ packed form
14866B56491J09877J38194j18860J3707o5154r9271J46475A60727K2968M19189
14856F02884j97492J14277j87574J18481K14070j78611m1667O3383J24760j35712
14846D96799o1586j83495F7313J67997H346N36138A94181J86093n2192J76024
14836E04106j3998A37567O39987j58469B77720J86687L45706k45605j31277o4976
14826C68255K31148A66779J13961K40120B12709M40013k29500K43999j37454j81038
14816C48729j00052K59224D9610O87693B04846O84259D42567J7476M9935j53181
14806C56797N6675J82455j02815J00589j06103K56457k98814J8521M11841m19271
14796D56332J29784k70716M79012l04500Q7427l7293n6418j7270M8167Q4530j44429
$$ plain form
14785 454626 556883 312938 146277 729245 469798 382920 407193 697984 819714 389573
14774 245628 768438 632608 898970 632909 629102 412874 641442 490949 939303 638388
14764 638388 274303 721100 1015253 874113 479571 705387 27674 248879 507745 650534
14754 650534 383252 427659 725091 696690 490305 446016 417005 609828 525916 735061
14744 735061 652348 861028 512097 537494 957748 829812 509826 675436 636039 755720
14734 755720 758426 605629 689288 616008 569052 562343 607388 689014 712342 872731 693486
14723 693486 646319 709914 956710 723322 737833 1027268 427898 872285 352036 622435
14713 622435 504692 912315 837782 776476 1063342 960147 697584 754261 920139 988146
$$ packed form
14785D54626J02257k43945A46277N82968k59447q6878K4273K90791J21730C89573
14774B45628N22810j35830K66362k66061l807k16228K28568j50493M48354l00915
14764F38388B74303M46797K94153j41140l94542K25816B7674K21205K58866J42789
14754F50534k67282M4407K97432k8401k06385m4289k9011J92823q3912K09145
14744G35061q2713K08680l48931K5397M20254j27936l19986J65610l9397J19681
14734G55720K706j52797Q3659p3280m6956o709M5045Q1626K3328J60389j79245
14723F93486m7167O3595K46796k33388J4511K89435D27898M44387C52036K70399
14713F22435j17743M07623p4533o1306K86866j03195k62563N6677J65878O8007
$$ plain form
14703 988146 1056962 645971 856406 721297 869302 832970 874963 1079548 254675 877338
14693 877338 1150343 813297 1069136 855594 556859 1048187 742439 975487 791499 955379
14683 955379 824402 873783 1021891 907903 695630 941048 782521 635514 1029607 1109959
14673 1109959 854613 1069117 758839 1228576 711978 812866 1145544 771766 1015347
14664 1015347 951374 753951 1193313 1002371 1197434 1204979 1108776 1064141 939020 838419
14654 838419 1152902 1155855 1086880 1215397 1232042 1107177 1268967 1401562 1091667 1206706
14644 1206706 1236258 948092 990096 1173639 1271875 1322915 948971 1395208 1423156 740152
14634 740152 788630 1113478 1077208 1283852 1702705 1323261 1364788 1116640 1063768 1190811
$$ packed form
14703I88146O8816m10991K10435j35109J48005l6332M1993K04585B54675O22663
14693H77338K73005l37046K55839k13542k98735M91328l05748K33048j83988J63880
14683I55379j30977M9381J48108j13988k12273K45418j58527j47007L94093Q0352
14673A109959k55346K14504l10278M69737n16598J00888L32678l73778K43581
14664A015347o3973j97423M39362j90942J95063P545r6203m4635j25121j00601
14654H38419L14483K953o8975J28517J6645j24865J61790J32595l09895J15039
14644A206706K9552k88166M2004J83543R8236N1040l73944M46237K7948o83004
14634G40152M8478L24848l6270K06644M18853l79444M1527k48148n2872J27043
$$ plain form
14624 1190811 1275839 1409727 1372378 1110759 1324598 1649706 1323957 1318766 1447475 1667036
14614 1667036 1784431 1461028 1574587 1626134 1673395 1220830 1350902 1705941 1501946 1657157
14604 1657157 1339954 1543514 1731269 1945994 1866504 1883312 1541269 1820684 1531083 1545296
14594 1545296 1642763 1551881 1704417 1529702 1708668 1509755 1975053 1730119 1959309 1706071
14584 1706071 1977127 2082135 1700730 1814485 1943294 2014169 1976514 1858435 2251584 2080297
14574 2080297 2415312 1916336 2017831 1962477 2221585 2340214 2599132 2103742 2567221 2604893
14564 2604893 2418133 2728304 3060734 2715151 2620500 2803435 3349549 2981148 3372967 3455379
14554 3455379 3604178 4383924 4832077 5618124 7085541 9413225 14706049 25774048 38062265
$$ packed form
14624A190811Q5028J33888l7349k61619K13839L25108l25749n191J28709K19561
14614A667036J17395l23403J13559N1547M7261m52565J30072L55039k03995J55211
14604A657157l17203K03560J87755K14725p9490J6808l42043K79415k89601J4213
14594A545296R7467r0882J52536j74715J78966j98913M65298k44934K29190k53238
14584A706071K71056J05008l81405J13755J28809P0875l7655j18079L93149j71287
14574B080297L35015m98976J01495n5354K59108J18629K58918m95390M63479L7672
14564B604893j86760L10171L32430l45583r4651J82935N46114l68401L91819Q2412
14554C455379J48799P79746M48153P86047J467417K327684N292824J1067999J2288217
$$ plain form
14545 38062265 29356587 13931167 6606005 3869465 2907303 2118293 2165824 2023028 1746615
14536 1746615 1704740 1845325 2304442 2039375 2048289 1883342 2396080 2436164 2426587 2468548 2090465
14525 2090465 2667283 2552518 2424608 2399147 2265068 2548125 2572944 2248230 2705203 2802349
14515 2802349 2725682 2415686 2689301 2761418 2664652 3054708 2949204 2878483 2603289 3177846
14505 3177846 3180423 3193719 3112619 3003218 3240224 3165760 3297857 3269358 2938734 3319096
14495 3319096 3571383 3312729 3178929 3553283 3595850 3657625 3450621 3526793 3662658 3747158
14485 3747158 3742959 3758278 4157743 3860673 4047929 3910597 3863371 3914232 4163710 3733375
14475 3733375 4091258 4173397 3931934 4323601 4420393 4445163 4459108 4417588 4809394 4505596
$$ packed form
14545C8062265q705678A3931167F606005k736540r62162p89010M7531j42796k76413
14536A746615m1875J40585M59117k65067Q914j64947N12738M0084r577M1961l78083
14525B090465N76818j14765j27910k5461j34079K83057K4819l24714M56973R7146
14515B802349p6667l09996K73615P2117r6766L90056j05504p0721k75194N74557
14505C177846K577J3296q1100j09401K37006p4464J32097k8499l30624L80362
14495C319096K52287k58654j33800L74354M2567O1775k07004P6172J35865Q4500
14485C747158m199J5319L99465k97070J87256j37332m7226N0861K49478m30335
14475C733375L57883Q2139k41463L91667R6792K4770J3945m1520L91806l03798
$$ plain form
14465 4505596 4641670 4558564 4273598 4618505 4695530 4714029 4784515 4838126 4944545 5094132
14455 5094132 5235366 5317391 5085548 5464349 5435284 5450278 5612217 5711010 5726120 5963008
14445 5963008 5786005 6087925 6064877 6115608 6123861 6309813 6214084 6293768 6191189 6581922
14435 6581922 6781288 6832972 6686665 6871488 6867299 6794223 6966093 7146221 7205909 7446298
14425 7446298 7292348 7707888 7846455 8204492 8155755 8219786 8377649 8035786 8501290 8799795
14415 8799795 8680402 8817028 9164247 9208494 9264389 9427770 9460784 9349792 9570769 10198957
14405 10198957 9573662 10133999 10296237 10662756 10503579 11057232 10949125 11327844 11480293
14396 11480293 11646797 11622108 11823999 12141431 12596390 12547512 12952400 12661052 13208551 13680850
$$ packed form
14465D505596J36074q3106k84966L44907P7025J8499P0486N3611J06419J49587
14455E094132J41234Q2025k31843L78801k9065J4994J61939R8793J5110K36888
14445E963008j77003L01920k3048N0731Q253J85952r5729P9684j02579L90733
14435F581922J99366N1684j46307J84823m189p3076J71870J80128N9688K40389
14425G446298j53950M15540J38567L58037m8737O4031J57863l41863M65504K98505
14415H799795j19393J36626L47219M4247N5895J63381L3014j10992K20977O28188
14405A0198957o25295N60337J62238L66519j59177N53653j08107L78719J52449
14396A1480293J66504k4689K01891L17432M54959m8878M04888k91348N47499M72299
$$ plain form
14386 13680850 13578118 13845296 14468628 14314298 15020167 15095015 15309492 15776942 15864957 16472101
14376 16472101 16441854 16915839 17112456 17096188 18195660 17802770 18708860 18979826 19118824
14367 19118824 19484035 20034185 20389350 20841913 21188170 21774798 21997393 22796071 23307344
14358 23307344 23662134 24121593 24763877 25518950 25862458 26387611 27429797 27826319 28640350
14349 28640350 29367850 30199835 30693233 31425956 31985269 32919583 33803295 34798139 35519255
14340 35519255 36713278 37715217 38829793 39820082 40896856 41932552 43111805 44365224
14332 44365224 45749957 47222886 48594382 49702971 51548770 53126673 54915232 56655884
14324 56655884 58453091 60068574 62391676 64579505 66678684 69243008 71260548 73838769
$$ packed form
14386A3680850j02732K67178O23332j54330P05869P4848K14477M67450Q8015O07144
14376A6472101l0247M73985J96617j6268J099472l92890R06090K70966J38998
14367A9118824L65211N50150L55165M52563L46257N86628K22595P98678N11273
14358B3307344L54790M59459O42284P55073L43508N25153J042186L96522Q14031
14349B8640350P27500Q31985M93398P32723N59313R34314Q83712R94844P21116
14340C5519255J194023J001939J114576R90289J076774J035696J179253J253419
14332D4365224J384733J472929J371496J108589J845799J577903J788559J740652
14324E6655884J797207J615483K323102K187829K099179K564324K017540K578221
$$ plain form
14316 73838769 76649506 79583114 82422523 85800548 88700086 92237571 95929657 99933913
14308 99933913 104044879 108305416 112850473 117704808 122892653 128213334 133566721 139920848
14300 139920848 146286612 152816484 159911426 167722202 175672711 184279553 192963066 202419901
14292 202419901 212688361 223087707 234088732 245868154 257789789 270630104 283314795
14285 283314795 296867445 310703520 325001795 339062488 353356204 367369080 381003161
14278 381003161 394381944 406695247 417970527 427648991 435527839 440548762 443222479
14271 443222479 442876739 442257680 440560179 437026621 432309326 424419160 413759901 401044929
14263 401044929 387197513 372385305 356770929 341167262 325519175 310023529 295364395
$$ packed form
14316G3838769K810737K933608K839409L378025K899538L537485L692086M004256
14308I9933913M110966M260537M545057M854335N187845N320681N353387O354127
14300A39920848O365764O529872P094942P810776P950509Q606842Q683513R456835
14292B02419901J0268460J0399346J1001025J1779422J1921635J2840315J2684691
14285B83314795J3552650J3836075J4298275J4060693J4293716J4012876J3634081
14278C81003161J3378783J2313303J1275280R678464P878848N020923K673717
14271D43222479l45740o19059j697501l533558m717295p890166j0659259j2714972
14263D01044929j3847416j4812208j5614376j5603667j5648087j5495646j4659134
$$ plain form
14256 295364395 281266190 267008303 253340584 240407453 228424727 216712212 205687335
14249 205687335 195105751 185213229 176062414 167287931 159488721 152041458 144840398 137736536
14241 137736536 131084666 125325489 119558028 114598488 109573942 104591935 100322774 96187930
14233 96187930 91962365 88480255 84840459 81432775 78501264 75198140 72465515 69693729
14225 69693729 67225822 64870051 62286825 60228462 58251593 56428408 54321999 52634663
14217 52634663 50483392 48902647 47660716 46447048 44986589 43258421 42127288 40999985
14209 40999985 39662188 38836958 37712484 36265834 35662939 34340938 33302196 32652276
14201 32652276 32155733 31365348 30450566 29575938 28737476 27992931 27262245 26375722 26258386
$$ packed form
14256B95364395j4098205j4257887j3667719j2933131j1982726j1712515j1024877
14249B05687335j0581584r892522r150815q774483p799210p447263p201060p103862
14241A37736536o651870n759177n767461m959540n024546m982007m269161m134844
14233I6187930m225565l482110l639796l407684k931511l303124k732625k771786
14225F9693729k467907k355771k583226k058363j976869j823185k106409j687336
14217E2634663k151271j580745j241931j213668j460459j728168j131133j127303
14209D0999985j337797q25230j124474j446650o02895j322001j038742o49920
14201C2652276m96543p90385r14782q74628q38462p44545p30686q86523j17336
$$ plain form
14192 26258386 25264620 24595288 24283783 23673078 23189652 22542267 22070966 21567871 20889088
14183 20889088 20385593 19769097 19580267 19402427 18998265 18524706 18367721 17881239 17342336
14174 17342336 16951878 16620244 16542149 16070723 15949659 15185244 15026216 14597080 14536284 14522526
14164 14522526 14173502 13821605 13566780 13284867 13256964 13111621 12698148 12394531 12242107
14155 12242107 11956033 11528127 11669081 11628934 11019050 11053729 10842167 10715219 10383756 10195973
14145 10195973 10400658 10072854 9978729 9491253 9526658 9187707 9329835 9211369 9117270 9098888
14135 9098888 8959770 8406219 8441692 8568072 8252992 8082842 8257058 7885733 7754116 7809201
14125 7809201 7499732 7462624 7332725 7238598 7062598 6972140 7001023 7032267 6968340 7062926 6776610
$$ packed form
14192B6258386r93766o69332l11505o10705m83426o47385m71301n03095o78783
14183B0889088n03495o16496j88830j77840m04162m73559j56985m86482n38903
14174A7342336l90458l31634p8095m71426j21064p64415j59028m29136o0796j3758
14164A4522526l49024l51897k54825k81913k7903j45343m13473l03617j52424
14155A2242107k86074m27906J40954m0147o09884L4679k11562j26948l31463j87783
14145A0195973K04685l27804r4125m87476L5405l38951J42128j18466r4099j8382
14135I098888j39118n53551L5473J26380l15080j70150J74216l71325j31617N5085
14125G809201l09469l7108j29899r4127j76000r0458K8883L1244o3927R4586k86316
$$ plain form
14114 6776610 6420899 6524414 6278394 6534570 6367982 6030775 6384322 5958363 6152547
14105 6152547 5921908 6136021 5715398 5365736 5452709 5682132 5720144 5376493 5660413 5619442
14095 5619442 5200118 5282071 5174472 5113923 4760126 5033757 5001649 4652893 5070582 4805895
14085 4805895 4601610 4710670 4713268 4475925 4232181 4331350 4324320 4505386 3717166 4497692
14075 4497692 3960028 4157133 4218256 4213227 4006328 3879085 3969983 4047957 4022771 3989167 3713029
14064 3713029 3621764 3828367 3655189 3828858 3952857 3798362 3552358 3422079 3617336 3420180
14054 3420180 3419144 3248265 3215155 3358758 3150745 3244994 3437068 3260352 3456618 2925670
14044 2925670 2902087 3292272 3351572 2832189 3113239 3298538 2822962 2841018 2781796 2989568
$$ packed form
14114F776610l55711J03515k46020K56176j66588l37207L53547m25959J94184
14105F152547k30639K14113m20623l49662Q6973K29423L8012l43651K83920m0971
14095E619442m19324Q1953j07599o0549l53797K73631l2108l48756M17689k64687
14085D805895k04285J09060K598k37343k43744R9169p030J81066p88220P80526
14075D497692n37664J97105O1123n029k06899j27243R0898P7974k5186l3604k76138
14064C713029r1265K06603j73178J73669J23999j54495k46004j30279J95257j97156
14054C420180j036j70879l3110J43603k08013R4249J92074j76716J96266n30948
14044B925670k3583L90185N9300n19383K81050J85299m75576J8056n9222K07772
$$ plain form
14034 2989568 3384538 2934218 2938577 2727517 2647907 3049608 2718578 2666610 2678057 2492782
14024 2492782 2587045 2494924 2270724 2661112 2308228 2540765 2299522 2648231 2201222 2434589
14014 2434589 2559821 2346433 2157794 2278976 2197133 2354925 2332581 2359589 2228122 2278436
14004 2278436 2420334 2242774 2072487 2353534 2365476 2261845 2301504 2343061 2073016 2126606
13994 2126606 2423539 2526876 2766597 3139032 3972977 5132428 9358910 18194699 33414867
13985 33414867 32746087 18414875 10470058 6820046 5154919 3936284 3820966 3264652
13977 3264652 3089477 2814497 2888954 2338544 2386553 2525855 2124241 2109559 2302814 2000647
13967 2000647 1902039 2052973 2291586 2127287 2251625 1672398 2304270 1869398 2028720 2079683
$$ packed form
14034B989568L94970m50320M359k11060p9610M01701l31030n1968J1447j85275
14024B492782R4263r2121k24200L90388l52884K32537k41243L48709m47009K33367
14014B434589J25232k13388j88639J21182q1843J57792k2344K7008j31467N0314
14004B278436J41898j77560j70287K81047J1942j03631L9659M1557k70045N3590
13994B126606K96933J03337K39721L72435Q33945J159451M226482Q835789J5220168
13985C3414867o68780j4331212p944817l650012j665127j218635j15318n56314
13977C264652j75175k74980P4457n50410M8009J39302m01614j4682J93255l02167
13967B000647r8608J50934K38613j64299J24338n79227O31872m34872J59322N0963
$$ plain form
13957 2079683 1971757 1868799 1918588 1963266 1875891 1419492 2038069 1579268 1607377 1735470
13947 1735470 1965310 1837419 1904713 1851856 1640288 1509562 2144017 1699140 1569858 1771787
13937 1771787 1570770 1404015 1406519 1513023 1647233 1282299 1704923 1624386 1552403 1655494
13927 1655494 1893926 1298939 1588495 1506646 1414155 1492476 1192196 1665363 1420371 1299717
13917 1299717 1371303 1416707 1606909 1799866 1402659 1517577 1430319 1301004 1203453 1287524
13907 1287524 1453001 1090066 1479771 1279568 1001969 1344392 1462519 1438975 1407738 1589222
13897 1589222 1353593 1126927 848007 1078743 1071705 1409372 1090779 1095198 1229937 1234456
13887 1234456 1072509 1474579 747318 1171760 1256865 894378 1171638 813935 966442 1118615
$$ packed form
13957B079683j07926j02958M9789M4678q7375m56399O18577m58801K8109J28093
13947A735470K29840j27891O7294n2857k11568j30726O34455m44877j29282K01929
13937A771787k01017j66755K504J06504J34210l64934M22624q0537p1983J03091
13927A655494K38432n94987K89556q1849r2491P8321l00280M73167k44992j20654
13917A299717P1586M5404J90202J92957l97207J14918q7258j29315r7551Q4071
13907A287524J65477l62935L89705k00203k77599L42423J18127k3544l1237J81484
13897A589222k35629k26666k78920K30736p038L37667l18593M419J34739M519
13887A234456j61947M02070p27261M24442Q5105l62487K77260l57703J52507J52173
$$ plain form
13877 1118615 1250372 801510 1057661 1160982 957492 949868 1059537 1218434 905796 1120224
13867 1120224 1276559 976564 849744 1051908 1122864 1070504 991543 1103749 874434 789724
13857 789724 854875 641353 750627 870820 1070525 1266957 798287 934377 1142059 774014
13847 774014 658800 758868 971173 1010882 863476 990325 734626 653177 1088612 799730
13837 799730 1032040 843789 850484 732194 972882 868254 1262764 709217 733076 1033439
13827 1033439 753002 814994 780522 1006458 622081 1025927 668579 880880 764734 761549
13817 761549 777281 862907 963000 684774 514871 790730 779188 742309 993561 632119
13807 632119 499295 812403 750539 854107 750507 842505 1053486 638382 787265 646172
$$ packed form
13877A118615J31757m48862K56151J03321k03490p624J09669J58897l12638K14428
13867A120224J56335k99995j26820K02164P0956n2360p8961J12206k29315q4710
13857G89724O5151k13522J09274J20193J99705J96432m68670J36090K07682l68045
13847G74014j15214J00068K12305L9709j47406J26849k55699q1449M35435k88882
13837G99730K32310j88251O695j18290K40688j04628L94510n53547K3859L00363
13827A033439k80437O1992l4472K25936l84377M03846l57348K12301j16146l185
13817G61549J5732Q5626J00093k78226j69903K75859j1542l6879K51252l61442
13807F32119j32824L13108o1864J03568j03600R1998K10981m15104J48883j41093
$$ plain form
13797 646172 618151 759699 1054948 692657 386935 506132 977350 593132 887234 570445
13787 570445 473841 829934 849973 766778 661245 502272 607669 714971 914868 862619
13777 862619 508549 272933 802732 692378 777438 712920 850360 501349 685573 1029776
13767 1029776 802988 590154 420775 1111797 631399 485887 583387 504716 649860 593920
13757 593920 1134687 697069 742931 414778 681160 758366 550472 437102 607729 709433
13747 709433 372261 589461 667737 450961 498365 557175 921500 339118 418753 626182
13737 626182 382124 545126 639912 631614 903311 543625 618974 584282 572368 309748 626672
13726 626672 559269 386346 592427 521304 449588 841361 852189 535208 609431 419341
$$ packed form
13797F46172k8021J41548K95249l62291l05722J19197M71218l84218K94102l16789
13787E70445r6604L56093K0039q3195j05533j58973J05397J07302J99897n2249
13777H62619l54070k35616N29799j10354Q5060o4518J37440l49011J84224L44203
13767A029776k26788k12834j69379O91022m80398j45512R7500p8671J45144n5940
13757E93920N40767m37618M5862l28153K66382P7206k07894j13370J70627J01704
13747G09433l37172K17200P8276k16776M7404N8810L64325C39118P9635K07429
13737F26182k44058J63002R4786q298K71697l59686P5349l4692j1914k62620L16924
13726F26672o7403j72923K06081p1123p1716L91773J0828l16981P4223j90090
$$ plain form
13716 419341 361558 388058 409881 377149 62541 623433 546110 623252 364750 423761 458448
13705 458448 854471 902478 613974 402540 725688 257493 303584 343898 295242 823758
13695 823758 727434 655861 543571 559988 168572 678184 371240 311612 432832 367210
13685 367210 337545 302294 323915 48406 331091 462929 625516 416926 280859 572154
13675 572154 677040 84567 648219 300331 592193 372177 379510 630811 262551 749223
13665 749223 313812 488165 292513 552293 288633 593939 314392 563793 660562 376720
13655 376720 275144 545737 623825 578723 289668 487931 270504 538653 214296 876699
13645 876699 334049 158855 308856 522533 148636 499997 199524 416273 277162 448254
$$ packed form
13716D19341n7783K6500K1823l2732F2541N60892p7323P7142k58502N9011L4687
13705D58448L96023M8007k88504k11434L23148B57493M6091M0314m8656N28516
13695H23758r6324p1573j12290J6417A68572N09612l06944n9628J21220o5622
13685C67210k9665l5251K1621D8406K82685J31838J62587k08590j36067K91295
13675E72154J04886H4567N63652C00331K91862k20016P333K51301B62551M86672
13665G49223C13812J74353j95652K59780k63660L05306k79547K49401R6769k83842
13655C76720j01576K70593P8088m5102k89055J98263k17427K68149B14296O62403
13645H76699C34049A58855J50001K13677A48636L51361A99524K16749j39111J71092
$$ plain form
13635 448254 410027 386472 48557 417887 452351 346372 473105 417201 371756 610991 198835
13623 609197 264852 253209 371932 236274 287409 290356 787151 340604 309873 156014
13613 156014 147247 454200 238995 291669 248892 352171 242263 128087 608074 256770
13602 454507 291367 327672 370419 404149 568306 279174 298296 10699 308323 466700
13592 466700 338056 259496 280587 310198 493526 259399 282814 391758 394097 198759 28230
13580 184437 421173 509540 138030 67426 125222 394955 229630 585449 264862 151700
13570 151700 378570 142045 274191 367680 263768 313181 65591 468091 -32807 90998
13559 424370 410416 99663 405080 275544 154905 42585 210421 567814 397642 386362
$$ packed form
13635D48254l8227k3555D8557L69330L4464j05979J26733n5904m5445K39235A98835
13623F09197B64852j1643J18723j35658N1135K947M96795C40604l0731j53859
13613A56014q767L06953k15205N2674m2777J03279j09908j14176M79987B56770
13602D54507j63140L6305M2747L3730J64157B79174J9122A0699K97624J58377
13592D66700j28644p8560K1091K9611J83328k34127K3415J08944K339j95338B8230
13580A84437K36736Q8367A38030F7426N7796K69733j65325L55819B64862j13162
13570A51700K26870A42045J32146R3489j03912M9413F5591M02500c2807I0998
13559D24370j3954I9663L05417j29536j20639D2585J67836L57393j70172j1280
$$ plain form
13549 386362 186390 244659 407337 -21357 522617 460675 -264177 211120 284449 389260
13539 389260 662801 191208 443898 650864 343203 262471 387371 109515 80457 448014
13529 448014 -7756 322576 508982 -3445 267916 335547 193414 350402 29556 230239 23571
13517 324803 404933 497656 268757 234099 136752 131517 212205 299713 67539 264445 185340
13506 185340 631497 457642 202878 273804 104130 304307 24077 7612 290501 195689
13496 195689 153435 33292 436247 229172 164728 453814 -218533 387977 533464 155105
13485 135828 282659 -158985 353206 241151 166227 142682 12708 347925 369895 417934
13475 417934 -46717 201307 188831 214761 76398 140707 288537 -100931 554735 135912
$$ packed form
13549C86362A86390N8269J62678b1357E22617o1942b64177B11120P3329J04811
13539C89260K73541A91208K52690K06966l07661q0732J24900A09515k9058L67557
13529D48014g756C22576J86406c445B67916O7631j42133J56988B9556K00683B3571
13517C24803Q0130R2723k28899l4658r7347n235Q0688Q7508F7539J96906p9105
13506A85340M46157j73855B02878P0926A04130K00177B4077G612K82889r4812
13496A95689m2254C3292M02955k07075o4444K89086b18533C87977J45487A55105
13485A35828J46831a58985C53206j12055p4924k3545A2708L35217K1970M8039
13475D17934d6717B01307j2476K5930G6398O4309J47830a00931E54735A35912
$$ plain form
13464 -2210 346925 128773 -8208 160518 236025 313940 267916 424261 435412 192920 288851
13453 288851 139751 337617 52428 -44201 114858 170362 167948 60429 33477 262274 58714
13441 131292 435779 379393 322719 343860 638334 -1681 12775 25535 240813 222431 373924
13430 373924 275244 190316 62048 204059 293668 292705 60215 455614 -88571 490558 108383
13418 382044 45110 241340 104551 292086 205191 281304 400201 167229 340835 430605
13408 430605 190876 85475 -77014 -2598 150087 292125 139526 39517 -13390 -129241 372966
13396 120210 185883 338874 35564 -55782 115627 166259 -138689 92323 258803 131753
13386 131753 169735 236675 332336 330369 450157 152025 267364 -32545 310362 389055 248458
$$ packed form
13464b210C46925A28773h208A60518P5507P7915m6024J56345J1151A92920R5931
13453B88851A39751J97866E2428d4201A14858N5504k414F0429k6952K28797E8714
13441A31292L04487n6386n6674K1141K94474a681A2775J2760K15278j8382J51493
13430C73924r8680q4928F2048J42011Q9609r63F0215L95399h8571D90558A08383
13418C82044D5110J96230A04551J87535q6895P6113J18897A67229J73606Q9770
13408D30605A90876H5475g7014b598A50087J42038A39526C9517a3390j15851C72966
13396A20210O5673J52991C5564e5782A15627N0632a38689I2323J66480j27050
13386A31753L7982O6940R5661j967J19788A52025J15339c2545C10362P8693j40597
$$ plain form
13375 248458 322755 93751 321119 387795 207914 287231 317095 30486 298857 183200 329839
13364 329839 326886 308267 168462 -89023 159274 228460 225666 186088 299808 307252 205520
13353 205520 -103767 149883 74551 239788 279392 -20543 126861 421691 57369 69355
13343 69355 20067 69607 -8356 -293603 331444 126051 309223 264717 387880 243571 -86724
13331 450539 462012 229502 330182 165215 5219 113448 443546 462003 551338 135417
13320 354136 -40126 351743 143969 526574 124915 41793 -45460 47458 -196119 -73806
13309 78090 184744 105289 89718 -58327 411172 -72547 -53211 402347 183427 269775 49095
13297 -123803 118363 197572 58841 144086 -30889 175091 373320 125870 -88056 23357 333998
$$ packed form
13375B48458P4297I3751K27368O6676j79881P9317K9864C0486K68371j15657J46639
13364C29839k953j8619j39805h9023A59274O9186k794l9578J13720P444j01732
13353B05520a03767A49883G4551J65237L9604b0543A26861K94830E7369J1986
13343F9355B0067M9540h356k85247C31444A26051J83172m4506J23163j44309h6724
13331D50539J1473B29502J00680j64967E219J08229L30098J8457Q9335A35417
13320C54136d0126C51743A43969L82605A24915D1793d5460D7458a96119g3806
13309G8090J06654p9455j5571e8327D11172g2547J9336D02347A83427Q6348D9095
13297a23803A18363P9209E8841Q5245c0889A75091J98229A25870h8056B3357L10641
$$ plain form
13286 333998 247174 50090 20508 84402 -91404 40483 -91005 103779 221178 115169 200001
13275 200001 -140895 338533 214161 158373 -216445 299557 346980 233472 224578 16727
13264 -202317 307361 84006 138212 137483 486059 161158 303463 117906 40678 -105097 142869
13252 -128456 263686 -249942 -230233 255607 27527 44492 1243 -117640 -165397 138298 132306
13241 132306 387420 69220 24326 573544 14430 437460 235355 104760 -15324 34745
13230 103933 392220 170577 -11689 -5203 268946 375480 258120 118291 199722 185129
13220 185129 253804 147262 156232 121804 181290 80466 -5380 -13031 -13103 262981 -350200 181726
13207 119573 -77717 35592 66734 -6966 -34632 -54129 23196 -54169 38867 262327 -63081
$$ packed form
13286C33998q6824E0090B0508O3894i1404D0483i1005A03779J17399j06009Q4832
13275B00001a40895C38533j24372n5788b16445B99557M7423j13508q894A6727
13264b02317C07361H4006N4206p29L48576A61158J42305A17906D0678a05097A42869
13252a28456B63686b49942J9709B55607B7527J6965A243a17640m7757A38298n992
13241A32306K55114F9220B4326N49218A4430M23030k02105A04760a5324C4745
13230A03933K88287A70577a1689e203B68946J06534j17360A18291Q1431j4593
13220A85129O8675j06542Q970l4428N9486H0466e380p651p2B62981c50200A81726
13207A19573g7717C5592L1142f966k7666j9497B3196e4169C8867K23460f3081
$$ plain form
13195 95563 51087 256845 162149 -78629 172231 255987 83812 58798 134054 51489 154401
13184 154401 -86096 -45781 19779 -67519 41561 149653 95813 279369 -72019 266940 -73453
13172 4633 -127761 -123043 -210108 15637 -241901 -81123 -92801 190348 36898 311947 -23417
13160 86256 275805 -227903 15115 8880 118879 342832 174556 10930 358500 335606 453425
13149 453425 450959 46643 -33022 246724 -35901 33054 23696 89626 33739 13298 227804
13138 227804 105610 -169212 -54801 256032 -68811 209792 179228 18087 175609 287794
13128 287794 246800 -124948 164998 193136 98228 506718 163771 31323 -180954 372516
13117 120637 123522 273078 149043 111339 230721 165961 245823 224134 430602 -200719 122995
$$ packed form
13195I5563m4476K05758r4696g8629A72231Q3756H3812k5014P5256E1489J02912
13184A54401h6096M0315A9779f7519D1561J08092n3840J83556g2019B66940g3453
13172D633a27761M718q7065A5637b41901h1123j1678A90348C6898K75049b3417
13160H6256J89549b27903A5115o235J09999K23953j68276A0930L47570k2894J17819
13149D53425k466D6643c3022B46724c5901C3054r358O5930C3739A3298K14506
13138B27804A05610a69212e4801B56032f8811B09792l0564A8087J57522J12185
13128B87794m0994a24948A64998K8138r4908M08490A63771C1323a80954C72516
13117A20637K885J49556j24035l7704J19382o4760P9862k1689K06468b00719A22995
$$ plain form
13105 29040 183730 12723 1486 -147146 -51581 280354 -145698 -179893 -116932 -42583 373336
13093 -92717 278108 122127 29101 49403 228202 430002 60013 293456 49605 154097
13083 154097 274395 109802 188823 144990 321989 102388 119927 179865 -51874 185976
13072 -65185 -67694 266809 -30356 -99749 268546 -167476 218000 96859 -63852 29426 -113922
13060 216947 -175316 -169813 300370 -10408 -30484 -32509 150027 33096 148541 -209670 212135
13048 -88432 78439 304515 140463 526952 287250 160038 261950 397661 112876 44766
13037 67631 -50346 242060 -214936 192249 -45634 25607 -239601 207203 244913 306782 65155
13025 -167113 210836 40473 -137506 103410 205750 541942 137672 -104191 160441 26012
$$ packed form
13105B9040J54690A2723A486a47146e1581B80354a45698l4195O2961d2583C73336
13093i2717B78108A22127B9101K0302J78799K01800F0013K33443D9605J04492
13083A54097J20298A09802P9021m3833J76999A02388J7539N9938e1874A85976
13072f5185k509B66809c0356o9393B68546a67476B18000I6859f3852B9426a13922
13060B16947a75316N503C00370a0408k0076k025A50027C3096J15445b09670B12135
13048h8432G8439K26076A40463L86489k39702j27212J01912J35711A12876D4766
13037F7631e0346B42060b14936A92249d5634B5607b39601B07203L7710O1869F5155
13025a67113B10836D0473a37506A03410J02340L36192A37672a04191A60441B6012
$$ plain form
13014 305000 184268 349006 109146 89208 86226 130560 387584 64598 -130125 99708 -53501
13002 165110 35433 390219 42822 107245 -137126 132715 -4710 3120 291580 96729 -67982
12990 264201 133248 239133 5307 43195 43212 6434 -64676 146111 24565 -71448 122923 374206
12978 374206 11977 158017 65848 172068 -5959 -491485 -506634 231540 -23139 -286954 -296317
12967 -296317 -126282 191814 12407 -107612 124323 148807 134591 143603 334817 58231 21144
12955 30860 -20000 136231 99011 -370074 -24070 -54962 171422 -81554 -121661 58131 64747
12944 64747 -247616 -8292 -43179 -208334 237388 -8616 46242 -97656 -184663 -140695 -158588
12933 -158588 -13081 -178363 -97857 114904 39806 -126895 -35926 -331622 -269859 42323 24334
$$ packed form
13014C05000j20732J64738A09146j9938k982M4334K57024F4598a30125I9708e3501
13002A65110C5433L54786D2822O4423a37126A32715d710C120K88460I6729f7982
12990B64201j30953J05885E307L7888J7F434f4676A46111B4565g1448A22923K51283
12978C74206A1977J46040F5848J06220e959m85526j5149B31540b3139k63815r363
12967b96317a26282A91814A2407a07612A24323K4484j4216R012J91214E8231B1144
12955C0860b0000A36231l7220c70074b4070l0892A71422h1554m0107E8131O616
12944F4747b47616h292l4887j65155B37388h616D6242i7656q7007M3968j7893
12933a58588a3081j65282Q0506A14904C9806a26895c5926k95696O1763D2323j7989
$$ plain form
12922 24334 278819 11441 58046 -97074 204782 -82074 216880 143043 -47779 188652 -98717
12910 45048 -63044 -61676 -69215 88102 -9019 18293 255325 -428263 30902 166368 -60620 12929
12897 -52144 -62661 -47379 181593 83696 379194 209004 66484 62079 36282 102485 137974
12886 137974 74214 -51909 -58265 -114808 67603 61731 -76594 -3866 -136138 -500082 179509
12874 198767 -50482 422167 260097 60643 -180310 214590 -35231 21781 44978 44285 60896
12863 60896 -401244 -13938 195526 -255054 184599 -37563 -69104 -165172 102674 -66476 -55034
12852 -55034 -77376 176770 71181 -135277 219145 83205 -145421 223403 -186433 269055
12841 92471 146968 -41203 80301 136719 368537 -95258 219566 197032 189283 -134467 -46748
$$ packed form
12922B4334K54485A1441M6605i7074B04782h2074B16880p3837d7779A88652i8717
12910D5048f3044J368p539H8102i019A8293K37032d28263C0902J35466f0620A2929
12897e2144j0517J5282A81593H3696K95498j70190F6484m405k5797O6203L5489
12886A37974o3760e1909o356n6543F7603n872g6594c866j32272l63944A79509
12874A98767e0482D22167j62070F0643a80310B14590c5231B1781K3197o93J6611
12863F0896d01244a3938A95526b55054A84599c7563l1541r6068A02674f6476J1442
12852e5034k2342A76770G1181a35277B19145H3205a45421B23403a86433B69055
12841I2471N4497d1203H0301N6418K31818i5258B19566k2534p749a34467d6748
$$ plain form
12829 175287 -324473 69247 129810 -85713 112465 232396 48890 -270681 -76608 348780
12818 175036 236472 -100527 107811 116827 -42029 -151639 214093 -51675 99412 298611 -138519
12806 125285 -41551 -204022 284493 28808 -336693 -194699 200062 -61214 333643 176285
12796 176285 233381 -228525 146615 -68086 -346067 -87927 95334 62046 -63430 -212899 128854
12784 34244 92631 278613 -155970 232103 129996 68203 -203914 6743 142456 -38305 -92116
12773 -92116 82244 25421 -201361 117402 -206009 189447 68611 157126 104195 265424 112028
12761 -155709 26040 78864 72309 29183 -310738 -288357 13350 184875 -45725 75621 88428
12750 88428 149965 -15103 -196410 -262324 -112659 200366 205299 73817 -86062 217537 -48659
$$ packed form
12829A75287c24473F9247O0563h5713A12465J19931D8890b70681g6608C48780
12818A75036O1436a00527A07811R016d2029j09610B14093e1675I9412J99199a38519
12806A25285d1551j62471B84493B8808c36693J41994B00062f1214C33643j57358
12796A76285N7096b28525A46615f8086k77981h7927I5334l3288f3430j49469A28854
12784C4244N8387J85982a55970B32103j02107o1793b03914F743J35713c8305n3811
12773i2116H2244B5421b01361A17402b06009A89447F8611Q8515n2931J61229A12028
12761a55709B6040N2824o555B9183c10738K2381A3350J71525d5725G5621J2807
12750H8428O1537a5103j81307o5914a12659B00366M933G3817h6062B17537d8659
$$ plain form
12738 147058 -152523 -28504 189642 -56758 -68371 278163 129814 -94804 -27496 245213
12727 196994 -194120 252349 -175722 77940 323527 -162713 -11589 222518 15822 17659
12717 17659 6586 262341 -58108 -7576 -55437 237826 -109322 73015 212032 147610 173303
12706 173303 218414 64947 161469 128677 163184 521444 4951 204346 -66796 121743 -15682
12694 -135793 -77148 268002 -169111 -86390 164632 -304206 13482 -55240 343618 167644
12683 -159234 463231 -16942 -256758 171279 138787 85616 11496 73148 83116 -110610 -219055
12672 -219055 -62431 -52615 -125023 268351 185962 222561 -42014 -355659 -87783 100175 104512
12661 104512 -163423 -180294 -150739 5568 647722 -76185 125518 139527 -119747 92154 -111515
$$ packed form
12738A47058a52523b8504A89642e6758j1613B78163A29814i4804b7496B45213
12727A96994a94120B52349a75722G7940K45587a62713a1589B22518A5822J837
12717A7659F586K55755e8108g576m7861B37826a09322G3015J39017o4422K5693
12706A73303M5111F4947R6522l2792L4507L58260D951J99395f6796A21743a5682
12694a35793N8645B68002a69111Q2721A64632c04206A3482e5240C43618A67644
12683a59234D63231a6942k39816A71279l2492n3171A1496O1652R968a10610j08445
12672b19055f2431R816p2408B68351q2389L6599d2014l13645h7783A00175M337
12661A04512a63423j6871K9555E568O42154g6185A25518J4009a19747I2154a11515
$$ plain form
12649 162484 -51984 24734 72994 333053 -234865 -54965 252798 -37788 18554 -325547 -290025
12638 -290025 -23034 -38417 200699 106319 -50661 365091 210822 226474 115915 270548
12628 270548 383975 88301 288101 132417 182447 233961 -47901 400794 116450 72020
12618 72020 -414835 63786 119426 8816 -151035 88253 -79443 12282 386708 266133 -103207
12606 -160575 57751 -184324 345734 1840 295101 92777 -86741 5735 38581 276216 133474
12594 -45029 34651 -99583 -178108 -46855 54084 31744 -110259 -245026 -127438 186581 -19724
12582 -15248 125005 28820 96798 33111 -313391 233581 61753 -330696 11853 11658 -140584
12570 -252900 274355 -280552 58295 9197 290228 58260 52702 211667 -79302 73611 33889
$$ packed form
12649A62484e1984B4734M8260K60059b34865e4965B52798c7788A8554c25547L5522
12638b90025b3034j5383B00699r4380e0661C65091j54269J5652j10559J54633
12628B70548J13427H8301J99800A32417N0030N1514d7901D00794A16450m4430
12618G2020d14835F3786N5640H816a51035H8253g9443A2282L74426j20575a03207
12606a60575E7751a84324C45734A840K93261I2777h6741E735L2846K37635A33474
12594d5029C4651i9583p8525d6855E4084k2340a10259j34767J17588A86581a9724
12582a5248A25005B8820O7978C3111c13391B33581F1753c30696A1853j95a40584
12570b52900B74355b80552E8295I197K81031E8260n558J58965g9302G3611C3889
$$ plain form
12558 -98907 -75152 133546 -286804 -112992 129242 124225 -47562 93422 185093 59154 -145459
12546 124148 4859 37220 -72801 408974 -170914 -83123 2324 209817 -149765 58004 228880
12535 228880 88032 -23787 310328 189392 2454 -60249 83161 -245134 94332 -86935 127264
12523 -175725 -81543 -102359 71255 67490 171736 43880 -93389 -85366 75477 -124243 191237
12511 186793 -149681 -205656 -245313 -112900 146775 43441 110433 -49168 18428 -248296 -196929
12500 -196929 136388 143475 347622 106588 167558 -2907 -52583 214915 -72492 -67923 71304
12488 22736 178889 35066 -10061 115036 -170859 -286489 -211999 -149126 149187 23737 -114102
12476 20771 288195 255564 235487 -74044 -89302 -159110 107310 -33226 101277 236952 -95088
$$ packed form
12558i8907K3755A33546b86804a12992A29242n017d7562I3422R1671E9154a45459
12546A24148D859L2361g2801D08974a70914h3123B324K07493a49765E8004J70876
12535B28880H8032b3787C10328j20936B454f0249H3161b45134I4332h6935A27264
12523a75725h1543k0816G1255l765J04246D3880i3389Q023G5477a24243A91237
12511A86793a49681n5975l9657a12900A46775D3441O6992d9168A8428b48296N1367
12500a96929A36388P087K04147A06588O0970b907m9676B14915g2492M569G1304
12488B2736J56153C5066a0061A15036a70859j15630P4490O2873A49187B3737a14102
12476B0771K67424l2631k0077g4044j5258o9808A07310c3226A01277J35675i5088
$$ plain form
12464 -176277 19935 175205 42116 181836 -114988 50508 -13734 -223883 106718 42818
12453 113662 462613 7611 173592 174772 74097 -41228 -194088 -189180 37825 36115 57226 133553
12441 133553 380260 -122635 -34653 89237 -163237 -24421 232331 323415 -121489 -103611
12431 -103611 452818 215864 -126091 145382 85298 349152 -478199 -83084 -284324 -240849
12421 -240849 274615 -235672 294539 -462812 83319 61245 -138222 57506 42065 38215 -286314
12409 -171883 37757 39366 -254172 242450 -153868 -381726 -155649 -212008 49785 -252639
12398 -29143 -95418 -346757 167592 170683 18786 153494 113526 -82796 194326 -83615 145131
12386 -176981 -131689 -23520 -26382 -123586 10910 132653 -81581 -155457 219944 226459 31272
$$ packed form
12464a76277A9935J55270D2116J39720a14988E0508a3734k10149A06718D2818
12453A13662L48951G611J65981J180G4097d1228j52860M908C7825j710K1111P6327
12441A33553K46707a22635c4653H9237a63237b4421B32331R1084a21489J7878
12431a03611D52818B15864a26091A45382o0084K63854d78199h3084k01240M3475
12421b40849B74615b35672B94539d62812H3319k2074a38222E7506j5441l850b86314
12409a71883C7757J609b54172B42450a53868k27858a55649n6359D9785b52639
12398b9143o6275k51339A67592L091A8786J34708l9968h2796A94326h3615A45131
12386a76981M5292b3520k862r7204A0910J21743h1581p3876B19944O515C1272
$$ plain form
12374 -62981 -54285 -100551 -930 -264157 -27121 -255319 103780 227430 42675 54348 370533
12363 370533 25011 179970 -234585 212871 -53540 152441 172175 74355 -269359 117713
12352 246931 156307 -187274 224687 -168161 134269 123186 38691 -6782 283703 5569 -181432
12340 24800 99973 182095 -48568 70721 -396860 157851 -2072 17411 -39663 164506 116807
12329 116807 -291164 64576 -26118 -5293 -229357 -182367 -154661 48382 286086 136370 79305
12318 79305 -58665 235392 -238628 327389 -47536 92651 260365 250215 -23755 -195426 -245486
12307 -245486 -295603 -39721 145908 139246 15157 -108829 -33204 290819 23496 -135374 120718
12295 -33166 150172 -6526 85574 82727 1086 214771 -517209 116760 -90868 122708 128930
$$ packed form
12374f2981Q696m6266i30k63227b7121k28198A03780J23650D2675J1673L16185
12363C70533B5011J54959b34585B12871e3540A52441J9734G4355b69359A17713
12352B46931r0624a87274B24687a68161A34269j1083C8691f782B83703E569a81432
12340B4800P5173Q2122d8568G0721c96860A57851b072A7411c9663A64506m7699
12329A16807b91164F4576b6118e293k24064M6990K7706D8382K37704A36370n7065
12318G9305e8665B35392b38628C27389d7536I2651J67714j0150b3755j71671n0060
12307b45486n0117c9721A45908o662A5157a08829c3204B90819B3496a35374A20718
12295c3166A50172f526H5574k847A086K13685e17209A16760i0868A22708O222
$$ plain form
12284 128930 273630 75153 187116 146306 179351 -330517 137346 138350 4004 341124 90368
12272 216517 106976 8111 201769 124533 -71748 -215074 50463 247200 24304 -61881 -74716
12261 -74716 -96167 345032 20709 103267 50397 253135 -23618 47425 178721 67839 361796
12250 361796 172468 11255 -62756 202753 109545 86678 63062 65148 139051 171833 -4491
12238 273270 -142704 82401 110949 231692 73105 108494 -57111 487310 -62199 32177 400532
12227 400532 695027 364319 280123 -42979 -19265 163090 -28280 30105 84176 103562 -79734
12215 51940 -161950 405439 228897 220622 155988 403770 39511 54877 330264 298541 181981
12204 181981 -62373 153644 51298 15286 266751 288757 477931 315780 243499 205987 90828
$$ packed form
12284A28930J44700G5153J11963m0810L3045c30517A37346J004D004L37120I0368
12272B16517A06976H111J93658p7236g1748j43326E0463J96737B4304f1881j2835
12261g4716k1451C45032B0709Q2558E0397K02738b3618D7425J31296F7839K93957
12250C61796A72468A1255f2756B02753r3208k2867k3616K086P3903L2782d491
12238B73270a42704H2401K8548J20743G3105L5389e7111D87310f2199C2177L68355
12227D00532K94495l30708q4196d2979a9265A63090b8280C0105N4071J9386g9734
12215E1940a61950D05439j76542q275o4634K47782C9511J5366K75387l1723j16560
12204A81981f2373A53644E1298A5286K51465K2006J89174j62151p2281l7512I0828
$$ plain form
12192 177927 30926 -1379 -303080 101729 238218 105088 366050 32181 186569 199008
12182 199008 111235 219239 131398 150195 422719 124315 73867 232451 149852 197862 126467
12171 126467 -146791 256744 -81890 64124 104386 67395 -237896 -132767 -8639 -136212 -14975
12159 375375 -4281 183963 56611 109169 103372 32630 154534 218276 317310 148098 -68231
12147 36547 -99405 176197 114140 39855 -274445 -2098 145727 178912 -221581 180905 -36142
12135 -87333 80253 -138069 204924 -224467 -111405 -343741 -70740 98469 -84784 27484 105029
12124 105029 30780 -192668 -305064 32816 -184021 125349 21866 -102113 519534 -158399
12113 -35968 95727 -42326 205629 70590 -280054 83285 -31221 -368941 -20420 9923 -27255
$$ packed form
12192A77927C0926a379l01701A01729J36489A05088K60962C2181J54388J2439
12182A99008q7773J08004q7841J8797K72524A24315n0448J58584q2599M8010p1395
12171A26467a46791B56744h1890F4124M0262l6991b37896J05129h639j27573a4975
12159C75375d281A83963E6611N2558n797C2630J21904O3742R9034A48098f8231
12147C6547i9405A76197o2057C9855b74445b098A45727L3185b21581A80905c6142
12135h7333H0253a38069B04924b24467a11405k32336g0740I8469h4784B7484P7545
12124A05029C0780a92668j12396C2816a84021A25349B1866a02113E19534a58399
12113c5968I5727d2326B05629G0590b80054H3285c1221l37720b0420I923b7255
$$ plain form
12101 6471 49769 209127 -235865 -26383 -181320 -43132 -200807 -234028 -117461 -370107 -54493
12089 -290988 6896 -339066 -130034 -33858 -25943 -125712 -591890 22637 -254797 -45905 -159889
12078 -159889 219120 190149 -102883 -128083 49564 313400 -148560 -22714 -223141 337821
12067 11753 -43108 293071 731056 1358143 430968 484096 410215 61185 134903 -177698 46584
12055 6571 -118915 -314882 -344712 -72697 -30116 -58622 -176897 -261685 150503 61565 42109
12044 42109 240424 107504 174633 298278 -188909 131159 -132617 51201 107661 -51996
12033 192955 23157 -29551 -109497 -249150 4566 -10273 -133509 123416 -163883 -115871 -128541
12022 -128541 146367 141453 92601 -342101 -39828 133019 125373 224081 -148601 64447 -64401
$$ packed form
12101F471M3298J59358b35865b6383j54937d3132j57675l3221J16567k52646e4493
12089b90988F896c39066a30034c3858P915r9769m66178B2637b54797d5905j13984
12078a59889B19120k8971a02883k5200D9564K63836a48560b2714k00427C37821
12067A1753d3108B93071M37985O27087D30968N3128p3881F1185P3718a77698D6584
12055F571a18915j95967k9830g2697c0116k8506j18275q4788A50503F1565j9456
12044D2109J98315A07504O7129J23645a88909A31159a32617E1201N6460e1996
12033A92955B3157b9551p9946j39653D566a0273j23236A23416a63883M8012j2670
12022a28541A46367m914m8852c42101c9828A33019p646R8708a48601F4447f4401
$$ plain form
12010 -65741 -155438 -339456 -65503 -42208 253650 -91498 -175191 40907 -72350 75425 -34925
11998 34140 -474419 -29106 -11716 310073 -189639 -205035 -12548 -53565 -91927 -57099 -175278
11987 -175278 222958 183473 139821 -44052 48019 -19337 -327365 -164700 36128 183893 20470
11975 -304029 183717 -23508 -87485 -422304 -187580 28705 -197861 72728 -85900 311623
11964 39399 -29159 -147204 121420 -113944 12384 108469 -163202 -166329 120230 147518 53117
11952 55225 50786 -37783 274380 -42855 -358014 57973 174515 -20667 -291 -113037 -189935
11941 -189935 91454 145686 111634 -227311 24950 315000 -176979 -65687 -5327 -113975 -73912
11930 -73912 -25578 287471 370227 150500 -130268 -150387 102338 42259 -54310 -225657 217267
$$ packed form
12010f5741q9697j84018f5503K3295B53650i1498q3693D0907g2350G5425c4925
11998C4140d74419b9106a1716C10073a89639j5396a2548m1017l8362L4828j18179
11987a75278B22958l9485m3652d4052D8019a9337l08028J62665C6128J47765B0470
11975c04029A83717b3508o3977l34819a87580B8705a97861G2728h5900C11623
11964C9399b9159j18045A21420a13944A2384R6085a63202l127A20230K7288E3117
11952E5225m439c7783B74380d2855l15159E7973J16542b0667b91j12746p6898
11941a89935I1454N4232l4052b27311B4950K90050a76979f5687e327j08648M0063
11930g3912b5578B87471Q2756A50500a30268k0119A02338D2259e4310j71347B17267
$$ plain form
11918 -135499 264045 209340 -207487 -53221 -351723 141285 65016 309761 -236216 -58140
11907 114307 -135987 7094 -196846 -223768 216892 100988 -205190 -38010 139920 133741 201345
11896 201345 307020 -61233 49605 -58150 219533 -26165 -22625 -153331 -248466 149185 221957
11885 221957 186640 371956 90767 94010 -250123 16150 -267756 -186389 -123418 191479 198279
11874 198279 -205314 414496 -49396 -186596 -125148 -90823 -468836 -183913 -120666 -70606
11864 -70606 -180824 33803 91225 61167 -90916 -148493 -269171 291600 -24138 -42036 -27778
11853 -27778 -90422 131022 -263730 356626 92146 -116269 67352 36728 101943 171662 -124247
11841 -93154 260715 -176594 -69921 -195700 -17001 215900 -180017 65165 -43646 -111343 -485271
$$ packed form
11918a35499B64045n4705b07487e3221k98502A41285F5016K44745b36216e8140
11907A14307a35987G094a96846k6922B16892A00988b05190c8010A39920o179O7604
11896B01345J05675f1233D9605e8150B19533b6165L540j30706r5135A49185P2772
11885B21957l5317J85316I0767L243b50123A6150b67756Q1367O2971A91479O800
11874A98279b05314D14496d9396j37200O1448L4325l78013a83913O3247N0060
11864g0606j10218C3803N7422l0058i0916n7577j20678B91600b4138j7898J4258
11853b7778o2644A31022b63730C56626I2146a16269F7352l0624O5215O9719a24247
11841i3154B60715a76594f9921j25779a7001B15900a80017F5165d3646o7697l73928
$$ plain form
11830 -485271 -73264 -48954 -103448 -6755 58145 93182 100499 -342741 -70747 -237281 -104789
11818 -16773 -201807 167775 168149 -169996 -281387 -397886 125267 23932 -206918 266852
11807 -130433 -111937 -132521 186092 -132420 132972 -229572 359057 -166695 -252238 -35425
11796 -124373 179512 -229608 -191508 -133340 1067 -250346 -112873 84358 -90649 26076 49864
11785 49864 363928 165851 -127492 250975 -61150 -87427 -88801 -71290 58786 158441 94797
11774 94797 125099 -208327 123981 51420 -125666 -92509 -43503 -275276 213393 223602 -255290
11762 -226312 -206711 -128242 15611 -20215 -15011 -48913 -5353 -152018 266786 -272758 49360
11750 201217 130842 -175006 128644 -196963 235850 -166804 -151033 -33549 181681 -291522
$$ packed form
11830d85271g3264K4310n4494f755E8145L5037P317c42741g0747j66534a04789
11818a6773j85034A67775L74a69996j11391j16499A25267B3932b06918B66852
11807a30433J8496k0584A86092a32420A32972b29572C59057a66695q5543c5425
11796a24373A79512b29608L8100N8168A067b50346a12873H4358i0649B6076K3788
11785D9864L14064A65851a27492B50975f1150k6277j374J7511E8786R9655o3644
11774I4797L0302b08327A23981E1420a25666L3157d3503k31773B13393J0209b55290
11762b26312J9601P8469A5611b0215N204l3902e353j46665B66786b72758D9360
11750B01217p0375a75006A28644a96963B35850a66804J5771c3549A81681b91522
$$ plain form
11739 64261 203969 145931 281574 -76558 167858 40569 -137669 -177818 19517 -5928 -59403
11728 -59403 136277 36255 79607 62588 156062 -271826 -92802 -134050 -152136 48400 68073
11717 68073 -57235 302767 48690 -113694 137212 300738 288068 170553 -105210 -37683
11706 -172349 134472 -33131 31824 133910 -193835 -10994 234479 135420 243060 -190279
11695 -261115 -68729 -14111 277458 -106394 469385 8038 162848 -66741 22831 180320 171105
11684 171105 -27747 207929 50687 -382693 52564 41646 318449 101277 -51155 -133351 150539
11672 -64098 -13341 277637 55756 58590 38158 -63219 -126680 -153974 -45669 56826 -107770
11660 42401 -289309 259237 -135627 17444 5156 238792 18176 -238710 -229089 -23809 -73976
$$ packed form
11739F4261J39708n8038J35643g6558A67858D0569a37669m0149A9517e928n3475
11728e9403A36277C6255M3352j7019R3474b71826i2802m1248j8086D8400J9673
11717F8073e7235C02767D8690a13694A37212J63526j2670j17515a05210c7683
11706a72349A34472c3131C1824J02086a93835a0994B34479r9059J07640a90279
11695b61115f8729a4111B77458a06394D69385H038J54810f6741B2831J57489r215
11684A71105b7747B07929E0687c82693E2564j0918K76803A01277e1155q2196A50539
11672f4098a3341B77637E5756K834k0432f3219o3461k7294d5669E6826a07770
11660D2401b89309B59237a35627A7444E156K33636A8176b38710R621b3809n0167
$$ plain form
11649 -73976 -290122 -2321 -194185 66445 28753 66900 -245618 138227 -505388 123758 368927
11638 368927 92332 -58192 4068 55399 -105487 -223735 165660 -61314 -108317 416126 -157367
11626 -168325 165635 125930 -23386 170426 -171216 -116002 4433 -33269 -8703 -55909 -119837
11615 -119837 2910 60397 -33630 -351764 -34381 45600 -182611 118219 108463 75720 83096
11604 83096 6363 76606 -110165 75595 62219 232147 111857 -13451 -78360 -14423 -121542
11593 -121542 146919 57151 -51292 -39607 137654 181484 193279 -190813 155666 -167772
11582 126697 -27423 -20600 -107254 306452 308683 -322979 223839 99703 206847 -187587 20155
11570 57184 -134674 190238 69279 95883 16426 100672 130506 471814 101196 235902 -107933
$$ packed form
11649g3976k16146b321j91864F6445B8753L8147b45618A38227e05388A23758K45169
11638C68927I2332e8192D068N1331a05487j18248A65660f1314m7003D16126a57367
11626a68325A65635l9705b3386A70426a71216N5214D433c3269h703m7206o3928
11615a19837B910N7487c3630l18134c4381D5600a82611A18219r756l2743P376
11604H3096F363P0243a10165G5595j3376J69928A11857a3451o4909a4423j07119
11593a21542A46919E7151e1292J1685A37654M3830J1795a90813A55666a67772
11582A26697b7423O823q6654C06452K231c22979B23839I9703J07144a87587B0155
11570E7184a34674A90238F9279K6604A6426Q4246K9834L41308A01196J34706a07933
$$ plain form
11558 -170056 -92596 -44222 -18464 -21726 114694 157268 227273 -74745 150660 -169879 51872
11546 95848 -50772 103765 279689 -221778 205219 -255319 4866 254618 104022 337354
11536 337354 138497 451197 49846 -213902 13700 18355 157686 23009 79112 207823 -74382
11524 86932 91991 383541 -202944 37561 -114996 26871 121226 -168256 -51529 -31990 224967
11512 -122116 15706 124424 340050 224792 33834 251302 183340 -9637 140304 99685 -122813
11500 223498 317671 30516 216888 -91240 85290 -4189 131766 224939 137504 -98599 164051
11488 343882 -54076 45571 75673 100416 33243 242095 -32044 227958 141112 321351 38016
11476 95198 171463 -207946 -209099 -44347 302001 -14937 192269 285279 124016 239296 163142
$$ packed form
11558a70056P7460d4222a8464l262A14694M2574P0005g4745A50660a69879E1872
11546I5848e0772A03765J75924b21778B05219b55319D866K49752A04022K33332
11536C37354A38497L12700D9846b13902A3700M655J39331B3009N6103J28711g4382
11524H6932N059K91550b02944C7561a14996B6871R4355a68256e1529J9539B24967
11512a22116A5706J08718K15626j15258C3834K17468o7962i637A40304m0619a22813
11500B23498R4173C0516J86372i1240H5290d189A31766R3173q7435i8599A64051
11488C43882e4076D5571L0102K4743C3243K08852c2044B27958q6846J80239C8016
11476I5198P6265b07946j153d4347C02001a4937A92269R3010A24016J15280p6154
$$ plain form
11465 163142 295467 228215 218361 -163837 108052 -66137 200230 -37491 68466 18133 161839
11454 161839 -200367 145537 199487 410774 122585 -4488 139880 27299 280106 147315
11444 147315 102022 40747 -120222 -84460 96378 86412 -69207 113305 83153 118145 -191485
11432 110 37703 -5481 53703 -132545 81493 99160 -152316 49610 292494 -348802 -178626
11421 -178626 -63730 -160959 21548 81547 -167866 -107447 19229 -19989 195409 170560 86908
11410 86908 -107877 -250198 79487 -29903 -162861 -123898 -54283 40702 241583 248138 169180
11399 169180 -156798 45563 54190 -178554 -173088 -43276 -120428 -86704 198940 225137 -104811
11387 184158 42588 -167369 -73499 65612 -120070 -165905 41922 89111 92857 -320545 -7272
$$ packed form
11465A63142J32325o7252r854a63837A08052f6137B00230c7491F8466A8133J43706
11454A61839b00367A45537N3950K11287A22585d488A39880B7299K52807j32791
11444A47315m5293D0747a20222L5762I6378r966f9207A13305l0152L4992a91485
11432A10L7593e481E3703a32545H1493J7667a52316D9610K42884c48802J70176
11421a78626f3730r7229B1548N9999a67866O0419A9229a9989A95409k4849q3652
11410H6908a07877j42321G9487b9903j32958L8963e4283D0702K00881O555p8958
11399A69180a56798D5563Q627a78554N466d3276p7152L3724A98940K6197a04811
11387A84158D2588a67369g3499F5612a20070m5835D1922M7189L746c20545g272
$$ plain form
11375 250466 -8433 -102515 38098 -42372 -255712 313183 134519 -109330 -194581 -33176 107557
11363 -218474 -63658 -33849 -234344 -10518 70724 194550 -125100 -169940 195127 192463 79693
11351 217240 -44742 -185147 -127206 -57576 -67022 94076 171521 -52413 28427 150613 285906
11340 285906 -105220 -73778 55566 115427 33235 -167702 -89943 73291 122381 -141710 -63707
11328 -247684 207732 -12018 -58842 171374 -111341 -157816 56145 -238231 72687 117131 85680
11317 85680 308640 -218583 60875 45024 -62325 -107004 -14746 95822 -95676 118116 35984
11305 -320044 102417 -333475 -233805 100502 -28563 23045 -54872 100636 400396 20629
11294 -235998 25658 -191869 162086 -11788 73829 -94241 345306 109360 -62661 339190
$$ packed form
11375B50466h433r4082C8098d2372k13340C13183A34519a09330q5251c3176A07557
11363b18474f3658K9809k00495a0518G0724J23826a25100m4840A95127k664G9693
11351B17240d4742j40405N7941e7576r446I4076P7445e2413B8427J22186J35293
11340B85906a05220L1442E5566N9861C3235a67702P7759G3291M9090a41710f3707
11328b47684B07732a2018m6824A71374a11341m6475E6145b38231G2687M4444l1451
11317H5680K22960b18583F0875j5851f2325m4679a4746I5822i5676A18116C5984
11305c20044A02417c33475R9670A00502b8563B3045e4872A00636K99760B0629
11294b35998B5658a91869A62086a1788G3829i4241C45306A09360f2661C39190
$$ plain form
11283 -225249 35684 46366 -251893 39773 14290 -401238 -72800 191439 -250487 -92015 -42273
11271 -52875 462855 65200 95111 308497 -4147 32843 -37495 -73901 55116 -9806 -265463
11260 -265463 -129961 13786 14323 -25012 -50999 -134595 25547 -199944 -342422 82967 62353
11249 62353 -144008 -7298 -62396 37266 -216100 -276959 74017 -236200 -1133 -274393 -107858
11237 -64439 -38314 60037 -141921 -52883 -338142 155875 -24398 -40690 -38212 -4627 -63797
11226 -63797 -90423 -90179 134885 -16445 -68992 228405 -12597 -461302 184448 -162879 226636
11214 69107 92646 192605 -13221 9597 -210221 110119 -216381 -278892 221163 -151925 166565
11202 -298842 -53924 -156576 97065 -142017 -21521 -119318 -30624 187339 -45177 -72608 145297
$$ packed form
11283b25249C5684J0682b51893C9773A4290d01238g2800A91439b50487i2015d2273
11271e2875D62855F5200K9911K13386d147C2843c7495l6406E5116i806k55657
11260b65463a29961A3786N37b5012k5987q3596B5547a99944j42478H2967k0614
11249F2353a44008g298n5098C7266b16100o0859G4017b36200a133k73260a07858
11237f4439K6125F0037a41921e2883k85259A55875b4398j6292K478d627n9170
11226f3797k6626K44A34885a6445n2547B28405a2597m48705A84448a62879B26636
11214F9107K3539R9959a3221I597b10221A10119b16381o2511B21163a51925A66565
11202b98842e3924j02652I7065a42017b1521r7797c0624A87339d5177k7431A45297
$$ plain form
11190 -155122 268881 75708 -40951 32745 58660 -175355 -362768 -162362 -273010 -310513
11180 -310513 36398 199053 132809 127732 -133813 -6604 -187167 41404 238098 236289 -37311
11168 -313613 -373854 3944 51527 -112997 -373833 -166582 -170813 94751 173277 -87192 77349
11156 -257523 198630 -58132 200236 -124481 -110854 -77640 -231525 -338672 -331876 -199845
11146 -199845 41066 -39997 -236366 44704 45843 10845 -83151 133105 -10245 111856 156721
11135 156721 -276071 74722 41022 58656 -9037 123748 -185673 17371 -107265 218543 -38018
11123 -148584 29950 34270 344502 -55866 -82026 212231 -180074 34438 196599 219832 158931
11112 158931 67323 103227 58162 -132710 104024 46459 195935 -289763 311422 305066 362901
$$ packed form
11190a55122B68881G5708d0951C2745K5915a75355j87413a62362j10648l7503
11180c10513C6398J62655o6244n077a33813f604j80563D1404J96694j809c7311
11168c13613o0241C944M7583a12997k60836a66582m231I4751P8526h7192G7349
11156b57523A98630e8132B00236a24481J3627L3214j53885j07147O796J32031
11146a99845D1066c9997j96369D4704J139A0845h3151A33105a0245A11856M4865
11135A56721b76071G4722l3700J7634i037A23748a85673A7371a07265B18543c8018
11123a48584B9950M320L10232e5866k6160B12231a80074C4438J62161K3233o0901
11112A58931F7323L5904m5065a32710A04024D6459J49476b89763C11422o356N7835
$$ plain form
11101 362901 -255694 180191 222336 138960 258026 359177 131105 -111693 -114433 107222
11090 110418 119800 354874 395528 265518 -303421 257437 339542 185268 173987 423248
11080 423248 295761 372646 148975 168910 279986 386989 564301 337756 182738 128712
11070 128712 208757 177879 -67038 389462 199514 213974 512409 477933 478094 630161 577535
11059 577535 696607 501999 686960 671819 645051 517120 505998 651654 727306 665600
11049 665600 727881 950454 505339 1113098 526554 818751 387167 537083 739742 800624
11039 800624 1039059 764375 802425 691650 837630 546061 376843 713463 734690 553915
11029 553915 765236 458699 999165 312869 744733 575184 549204 615808 525807 857558
$$ packed form
11101C62901b55694A80191M2145q3376J19066J01151A31105a11693k740A07222
11090A10418R382K35074M0654j30010c03421B57437Q2105j54274j1281K49261
11080D23248j27487P6885A48975J9935J11076J07003J77312k26545j55018n4026
11070A28712Q0045l0878f7038C89462j89948J4460K98435l4476J61J52067n2626
11059E77535J19072j94608J84961j5141k6768j27931j1122J45656P5652o1706
11049F65600O2281K22573m45115O07759E26554K92197C87167J49916K02659O0882
11039H00624K38435k74684L8050j10775J45980k91569j69218L36620K1227j80775
11029E53915K11321l06537N40466C12869M31864j69549k5980O6604r0001L31751
$$ plain form
11019 857558 837110 844954 581264 816682 442925 709159 636751 702074 642366 463709 732099
11008 732099 392527 612837 515968 801280 495278 715709 899983 907745 640748 766676
10998 766676 794455 1100895 660970 588966 521189 616991 730971 657469 843039 630096
10988 630096 799334 1216513 948373 842264 1129113 719571 919674 1547993 1334984 1378108
10978 1378108 1681957 1980342 2235811 2146049 2456047 2605193 2743405 2650756 2602762 2262705
10968 2262705 2305525 2127806 1618174 1396494 1666105 1425474 1610143 1567161 1322790 1100686
10958 1100686 1623158 1382668 1337798 1329129 782656 1102547 1035415 439794 916002 582011
10948 582011 374137 280189 104793 178689 310701 235223 26178 361817 275441 32118 185820
$$ packed form
11019H57558k0448P844k63690K35418l73757K66234p2408O5323n9708j78657K68390
11008G32099l39572K20310r6869K85312l06002K20431J84274P762k66997J25928
10998G66676K7779L06440m39925p2004o7777R5802J13980p3502J85570k12943
10988F30096J69238M17179k68140j06109K86849m09542K00103O28319k13009M3124
10978A378108L03849K98385K55469q9762L09998J49146J38212r2649m7994l40057
10968B262705M2820j77719n09632k21680K69611k40631J84669m2982k44371k22104
10958A100686N22472k40490m4870q669n46473L19891o7132D39794M76208l33991
10948E82011k07874r3948A04793P3896J32012p5478B6178L35639q6376C2118J53702
$$ plain form
10937 185820 49456 124552 93002 74036 -173031 -98385 -81021 11376 -115044 268806 126362
10925 155878 -299177 216142 99006 304654 77850 257763 138593 -88066 80802 -186125
10914 -79305 531517 -288828 323388 226099 169223 25514 17650 8296 97111 -122102 -82472
10903 -82472 152611 -128025 297936 54965 -111246 192610 15738 110634 -174577 80353
10892 -294441 -122506 200487 155111 197043 192605 79478 166056 -4689 -210153 -240550 -25691
10880 191281 12965 148726 390164 -359970 -34180 74864 139528 -17064 -209300 -41102 -509412
10869 -509412 -196316 16140 165673 60436 25480 19279 -272013 -367490 519876 -123153 202818
10857 -38148 228734 120540 34801 58651 171079 -273658 -59830 -49253 102736 72507 67869
$$ packed form
10937A85820D9456P5096l1550j8966a73031P4646J7364A1376a15044B68806A26362
10925A55878b99177B16142I9006K05648G7850J79913j19170h8066H0802a86125
10914g9305E31517b88828C23388r7289n6876B5514p864H296Q8815a22102L9630
10903h2472A52611a28025B97936E4965a11246A92610A5738R4896a74577H0353
10892b94441a22506B00487m5376M1932m438G9478Q6578d689k05464l0397b5691
10880A91281A2965J35761K41438c59970c4180G4864O4664a7064j92236d1102m68310
10869e09412a96316A6140J49533F0436B5480o201b72013r5477E19876a23153B02818
10857c8148B28734j08194C4801K3850J12428b73658e9830J0577A02736l0229m638
$$ plain form
10846 67869 68276 123188 -11884 -118114 -98968 -188007 -62003 212967 -393946 -92136 -240269
10835 -240269 -168474 69998 100644 55169 111621 -129846 -500411 -294418 -391604 159071 58286
10823 -56077 -110347 -227149 -85703 -121619 17649 419934 -227291 -214610 -4477 480188 -256051
10811 -14960 -3881 93125 -25735 -154120 -103847 -85878 15041 16441 -73877 33779 -267451 -109641
10798 -56017 -186503 172196 115751 12888 -233049 43397 -146445 -49485 15451 5741 70856
10787 70856 -134928 -204138 -187120 -195332 -356847 -193938 -60942 -148035 161075 -117313 -245049
10776 -245049 176067 147927 -164372 -50307 -304210 104886 276911 86088 -304943 12686
10765 28524 -84623 105194 -18997 -146179 -43436 81533 42529 -63663 2849 173239 -161696
$$ packed form
10846F7869M07N4912a1884j06230J9146q9039f2003B12967c93946i2136j48133
10835b40269P1795F9998L0646m5475N6452a29846l70565K05993r7186A59071E8286
10823e6077n4270j16802h5703l5916A7649M02285b27291J2681d477D80188b56051
10811a4960c881I3125b5735j28385N0273J7969A5041J400g3877C3779b67451a09641
10798e6017j30486A72196n6445A2888b33049D3397a46445d9485A5451E741O5115
10787G0856a34928o9210J7018q212j61515J62909f0942q7093A61075a17313j27736
10776b45049A76067k8140a64372e0307k53903A04886J72025H6088c04943A2686
10765B8524h4623A05194a8997j27182d3436H1533l9004f3663B849J70390a61696
$$ plain form
10753 -25904 91625 -112146 -5617 74895 88247 -245097 -46892 -159020 171418 -36266 79916
10741 33284 63088 -222355 349360 246232 -10227 57119 -98445 40848 -75100 -285047 62291
10729 -50649 -335727 -43230 34492 -227589 184695 86288 -133189 13961 -205468 222522
10718 -179012 -230717 121417 -6430 -16231 -355510 346070 25640 -81575 46336 61406 -113553
10706 -300956 -129111 -48794 -185812 -99114 -216074 16014 132309 8577 -131615 -143633 -289800
10695 -289800 -129192 -182271 -124157 -75723 -332409 -51739 137491 249643 -73836 -8083 -163057
10684 -163057 45507 -319507 38576 -41323 -35866 -98566 213042 14218 -62549 42042 154055
10673 154055 -40047 -95339 159953 -128661 163189 111132 -95876 -167485 121528 41682 442893
$$ packed form
10753b5904I1625a12146e617G4895J3352b45097d6892j12128A71418c6266G9916
10741C3284K9804b22355C49360j03128a0227E7119i8445D0848g5100k09947F2291
10729e0649k85078d3230C4492b27589A84695H6288a33189A3961b05468B22522
10718a79012n1705A21417f430r801l39279C46070B5640h1575D6336J5070a13553
10706c00956a29111d8794j37018Q6698j16960A6014J16295H577a31615j2018j46167
10695b89800a29192n3079N8114M8434k56686e1739A37491J12152g3836h083j54974
10684a63057D5507c19507C8576d1323N457o2700B13042A4218f2549D2042J12013
10673A54055d0047n5292A59953a28661A63189n2057i5876p1609A21528D1682M01211
$$ plain form
10662 442893 -66307 82334 63263 -241486 52549 -115749 -322829 79655 -2276 -111996 93062
10650 186117 109156 -257949 42339 123529 -33608 -158900 264942 163035 -93958 52264 -17220
10638 -240478 20515 -113657 -61108 24186 -143755 331081 -302632 -132498 68460 -230684
10627 -248087 -379090 -247498 -233464 -309931 -138740 -232610 -257854 259022 -102775 -424936
10617 -424936 -127604 -31057 147602 -232801 51727 -249031 -90813 225897 127640 189217
10607 189217 -358989 -268991 192349 341708 -112999 84135 -452107 118304 -134257 -114869
10597 -114869 156721 -57275 3641 -112296 113894 44809 -256948 -233806 225557 -4967 -29855
10586 -29855 159825 47771 -248465 -170645 -202459 -139555 75805 -142213 -66884 22335 135817
$$ packed form
10662D42893f6307H2334j9071b41486E2549a15749k07080G9655b276j09720I3062
10650A86117p6961b57949D2339Q1190c3608j25292B64942j01907i3958E2264a7220
10638b40478B0515a13657N2549B4186a43755C31081c02632a32498F8460b30684
10627b48087j31003J31592J4034p6467a38740r3870k5244B59022a02775l22161
10617d24936a27604c1057A47602b32801E1727b49031i0813B25897r8257O1577
10607A89217c58989Q9998A92349J49359a12999H4135d52107A18304a34257J9388
10597a14869A56721e7275C641a12296A13894D4809b56948K3142B25557d967k4888
10586b9855A59825D7771b48465P7820l1814O2904G5805a42213f6884B2335J13482
$$ plain form
10575 135817 -208522 19508 205196 -44290 -246328 57688 -68601 153921 485219 27982
10564 -244911 94525 166840 -42946 152572 138245 -101683 -18675 185154 -346318 -40693 115828
10552 71373 -18361 74821 -96342 -233093 -150772 93889 20646 45661 -23245 182678 -104166
10540 30912 54674 -3676 -226122 -73446 -332531 -286240 104300 -62818 -405941 -51750 160759
10528 -252037 -56527 -324841 -102532 -116826 -88710 -332202 110348 -160229 3607 -150952
10517 182901 -17952 166537 78616 44313 131682 -139614 -51506 162979 -304988 174230
10506 31182 -68652 20734 110172 -169725 359440 -503432 418119 -177377 30059 27209 -44877
10494 48843 61917 117218 -190153 -10700 -47932 62730 19162 -73838 232358 305889 196609
$$ packed form
10575A35817b08522A9508J85688d4290k02038E7688f8601A53921L31298B7982
10564b44911I4525P2315d2946A52572j4327a01683a8675A85154c46318d0693A15828
10552G1373a8361G4821i6342j36751Q2321I3889B0646K5015b3245A82678a04166
10540C0912K3762c676k22446g3446k59085M6291A04300f2818l43123e1750A60759
10528b52037e6527k68314a02532j4294K8116k43492A10348a60229C607a50952
10517A82901a7952A66537G8616l4303Q7369a39614e1506A62979c04988A74230
10506C1182f8652B0734Q9438a69725C59440e03432D18119a77377C0059k850d4877
10494D8843J3074N5301a90153a0700l7232F2730A9162g3838B32358P3531j09280
$$ plain form
10483 196609 135903 350411 318335 393346 -105385 -25202 -66643 -86255 32012 59693 127656
10472 127656 33271 82599 -163620 -80272 101538 5470 190056 136054 191183 114730 69067
10461 69067 -183454 63113 -310703 -24480 20990 137670 176953 -21325 146704 -164541 120250
10449 176184 -5096 -279046 -91463 -233698 -141132 114316 -131361 -426065 164711 -381569
10438 -141446 -145106 -227503 129078 -6007 -151741 -63563 -61433 15804 105165 63555 182528
10427 182528 18097 29944 -99617 173853 68394 -25477 189920 -313119 13556 375 -2971
10415 -128037 -270534 -537854 -135330 -140214 -4773 10565 -13841 -100719 183162 166309 -71565
10403 -52721 454591 1946 40572 -159232 130660 -138412 -278830 211768 -64416 354010
$$ packed form
10483A96609o0706K14508l2076P5011a05385b5202m1441j9612C2012K7681O7963
10472A27656C3271M9328a63620h0272A01538E470J84586n4002N5129p6453m5663
10461F9067a83454F3113c10703b4480B0990J16680L9283b1325A46704a64541A20250
10449A76184e096k73950i1463j42235R2566A14316a31361k94704A64711c81569
10438a41446l660q2397A29078f007j45734f3563K130A5804Q9361m1610J18973
10427A82528A8097J1847i9617A73853F8394b5477A89920c13119A3556C75b971
10415a28037j42497k67320a35330m884d773A0565a3841q6878A83162j6853g1565
10403e2721D54591A946L8626a59232A30660a38412j40418B11768f4416C54010
$$ plain form
10392 127165 141710 48712 385653 82653 -32429 -105559 -53038 196632 -37212 391443 208809
10381 208809 194704 234220 411602 389054 9152 463726 263847 48660 49545 233936 296334
10370 296334 123251 194787 408037 228988 264850 401853 212258 358357 559893 139016
10359 206635 53536 442773 368810 272850 168167 432525 505657 395040 387555 649619 312610
10347 49838 -10717 248549 517904 328413 258866 433338 -84130 206088 181503 301292
10337 301292 -10436 275302 24944 132615 227012 128591 183413 72700 -112514 122455 102718
10326 102718 204721 59734 162001 332655 -362799 68748 159841 36900 26390 -252997
10315 -13936 190634 52932 109102 213971 -287770 -55966 -362099 169212 -396628 -38077
$$ packed form
10392A27165J4545D8712L36941H2653c2429p3130N2521A96632c7212C91443j82634
10381B08809j4105L9516J77382k2548I152M54574j99879D8660Q85J84391O2398
10370B96334A23251P1536K13250j79049L5862J37003j89595J46099K01536A39016
10359B06635E3536L89237p3963r5960j04683K64358P3132j10617p485K62064C12610
10347D9838a0717B48549K69355j89491o9547J74472h4130B06088k4585J19789
10337C01292a0436B75302B4944J07671R4397r8421N4822G2700a12514A22455j9737
10326A02718J02003E9734J02267J70654c62799F8748R1093C6900j0510b52997
10315a3936A90634E2932N6170J04869b87770e5966l06133A69212c96628c8077
$$ plain form
10304 55380 -103795 -156107 -7817 180843 -22613 83952 97172 100455 -12853 61529 -217486
10292 -202448 5923 29137 94845 -271930 -361876 62421 200649 47153 -33382 -9123 -169960
10281 -169960 -310486 -38104 -44687 83647 -230153 -52928 -180859 -101106 -244677 -304579 116093
10269 176882 244579 25678 238166 161353 177338 68563 187910 489122 160000 262328
10259 262328 312960 229361 241637 149780 156509 88573 296590 304663 21257 -175360 -348798
10248 -348798 331269 -262118 -19815 340910 139331 75148 229914 -3874 173490 19865
10237 133463 27731 63226 92270 -106817 -11090 -138167 -133171 106276 -242117 39413 290594
10226 290594 -205841 53506 371833 30268 70621 -277785 -372595 18923 44119 -107661 195492
$$ packed form
10304E5380a03795n2312g817A80843b2613H3952J3220L283a2853F1529b17486
10292b02448E923K3214O5708b71930q9946F2421J38228D7153c3382i123j60837
10281a69960j40526c8104o583H3647b30153e2928j27931P9753j43571n9902A16093
10269A76882O7697B5678K12488p6813J5985F8563J19347L01212A60000J02328
10259B62328N0632q3599J2276r1857O729o7936K08017Q073B1257a75360j73438
10248c48798C31269b62118a9815C40910A39331o4183J54766c874A73490A9865
10237A33463B7731L5495K9044a06817a1090j27077M996A06276b42117C9413K51181
10226B90594b05841E3506L18327C0268M0353b77785r4810A8923K5196a07661A95492
$$ plain form
10214 -75963 -193683 14651 -118158 -42472 -66315 -11206 -109232 104565 158655 -273738 -37664
10202 273351 48149 -78177 -402806 11004 -186140 -257584 285 -138773 -86066 -33549 -240642
10191 -240642 -105969 165810 -25049 -205757 -27753 -16601 -38271 -145669 -17226 526 64216
10180 64216 102840 -138461 64074 26309 -155233 -61829 75398 -49543 -39352 150696 3993
10168 285489 -54399 -109866 -73909 -386472 -291733 -104151 9279 141284 227864 -151187 -129922
10157 -129922 -38558 -81589 120417 9803 13488 -160974 54498 17015 172896 -94152 312235
10145 -190906 -184891 -48893 49956 356843 -224325 18353 -15000 -123617 115402 -7681 -52129
10134 -52129 -86772 -58487 114194 -250155 -298217 -117261 -242652 -87364 -161291 -469503 73058
$$ packed form
10214g5963j17720A4651a18158d2472k3843a1206r8026A04565N4090b73738c7664
10202B73351D8149g8177l24629A1004a86140p1444B85a38773N2707c3549k07093
10191b40642a05969A65810b5049j80708b7753J1152k1670j07398a7226E26O3690
10180F4216L8624a38461F4074B6309a55233f1829G5398d9543J0191A50696C993
10168B85489e4399n5467L5957l12563R4739a04151I279J32005Q6580a51187K1265
10157a29922c8558m3031A20417I803L685a60974E4498A7015J55881i4152C12235
10145a90906O015d8893D9956L06887b24325A8353a5000j08617A15402g681m4448
10134e2129l4643K8285A14194b50155m8062a17261j25391h7364p3927l08212G3058
$$ plain form
10122 -328904 -134470 -161568 -289257 -105921 -98532 -88598 81305 -268750 -205653 -123465 -399563
10111 -399563 110687 -246178 132712 30924 93684 -83513 -50414 -163468 38040 144840
10101 144840 -126923 -169238 -49258 165183 -55228 -106990 56545 53359 -156652 -158416 -147178
10090 -147178 167943 -168659 190318 -126930 -67960 -344111 -106240 -17593 -21444 66046
10079 -140809 -243608 -312982 177283 -119308 103021 -129071 -48861 254400 -37635 42628
10068 -167981 -68394 -48343 77521 134392 -75148 -27366 -309605 -105487 -108855 43508 117638
10057 117638 -67552 -248789 -411273 -96662 -68718 182636 -231466 -167282 88843 91398 -74218
10045 -11236 -186390 -431720 -193005 -181997 51977 131362 -62021 -318143 -109670 6611 -149964
$$ packed form
10122c28904a34470k7098j27689a05921P389R934H1305b68750O3097Q2188k76098
10111c99563A10687b46178A32712C0924O2760h3513L3099j13054C8040J06800
10101A44840a26923m2315d9258A65183e5228n1762E6545l186a56652j764J1238
10090a47178A67943a68659A90318a26930N8970k76151a06240a7593l851F6046
10079a40809j02799o9374A77283a19308A03021a29071d8861B54400c7635D2628
10068a67981f8394K0051G7521N6871g5148b7366k82239a05487l368D3508P4130
10057A17638f7552j81237j62484i6662K7944A82636b31466O4184H8843K555g4218
10045a1236j75154k45330a93005J1008E1977P9385f2021k56122a09670F611a49964
$$ plain form
10033 263215 -91960 -44461 -44754 78554 -56718 -111278 59948 76612 -121525 181933 -80578
10021 -204404 207296 82438 -99805 -227513 -237790 -95793 -137210 -141570 -149128 -5722 -56645 196556
10008 42528 -55962 -171773 -126973 73950 235785 -343575 -10146 -278803 60833 -105382 -105071
9997 -105071 171114 -280220 -95849 -10185 -177508 80762 86712 -149146 88221 -143823 -145483
9986 -145483 -144734 -72682 -48937 -185052 253744 -275828 -228312 -257306 104827 132707 -328006
9974 -38675 -174274 290835 262124 -103256 -39137 112521 -66760 141071 271286 -116122
9963 -197820 -126358 -130739 -281409 -207204 49781 -77153 84460 -44600 -202455 -349694 -4879
9951 -102429 -164416 290664 46915 43967 279685 -24098 28096 -29764 -72406 151988 138963
$$ packed form
10033B63215i1960d4461k93G8554e6718n4560E9948J6664a21525A81933h0578
10021b04404B07296H2438i9805j27708j0277i5793m1417m360p558e722n0923A96556
10008D2528e5962j15811M4800G3950J61835c43575a0146k68657F0833a05382L11
9997a05071A71114b80220i5849a0185j67323H0762N950a49146H8221a43823j660
9986a45483P49P2052K3745j36115B53744b75828M7516k8994A04827K7880c28006
9974c8675j35599B90835k8711a03256c9137A12521f6760A41071J30215a16122
9963a97820P1462m381j50670P4205D9781g7153H4460d4600j57855j47239d879
9951a02429o1987B90664D6915k948K35718b4098B8096b9764m2642A51988j3025
$$ plain form
9940 138963 -205737 125569 -199002 -92972 85069 45746 32213 -166221 -155100 -96625 -110795
9929 -110795 -161959 81731 -39022 154445 11500 -75275 -62244 759 169856 -131280 -139555 -55235
9916 -135626 174387 69166 -380041 -321874 -259019 -78148 -334218 15010 61736 3584 -253443
9904 20631 289579 -97526 182472 292287 68788 -241044 -236824 235060 55504 -267849 -305429
9893 -305429 -180647 -42770 11688 -72246 -134387 143690 -122175 -82477 76312 -379077 57457
9881 49193 -61910 101915 -67753 -315897 -125826 -8590 31899 -123894 200987 -141480 -5823
9869 -256735 -198592 -214799 -1481 125477 59905 -100285 -143362 225050 -163689 -109311 74424
9857 -257219 -52957 -132457 -296364 -99004 -14020 119782 -203928 86937 24620 -22185 192692
$$ packed form
9940A38963b05737A25569a99002i2972H5069l9323j3533a66221J1121N8475j4170
9929a10795n1164H1731c9022A54445A1500g5275J3031G59J69097a31280q275e5235
9916a35626A74387F9166c80041N8167O2855g8148k56070A5010M6726C584b53443
9904B0631K68948i7526A82472J09815F8788b41044M220B35060E5504b67849l7580
9893c05429J24782d2770A1688g2246o2141A43690a22175L9698G6312c79077E7457
9881D9193f1910A01915f7753k48144a25826h590C1899a23894B00987a41480e823
9869b56735N8143j6207a481A25477E9905a00285m3077B25050a63689N4378G4424
9857b57219e2957p9500j63907i9004a4020A19782b03928H6937B4620b2185A92692
$$ plain form
9845 324308 -18450 27096 -106258 36718 -47376 83003 -197823 -142643 -388955 38400 -273562
9833 -17800 -244030 -133778 8445 -247035 -155563 -89661 -161626 355039 18549 246718 111490
9821 -262123 341732 115616 -20305 131418 -69107 -216631 23375 -67368 30534 -7241 -51795
9810 -51795 68213 -153365 -62741 -91538 -117014 28560 -134810 -74857 259195 -68925 -160478
9799 -160478 -130772 164973 -111061 83960 212099 -29886 183112 -203584 -135687 -25536 -21945
9788 -21945 67431 -205998 -247376 -70658 -235620 228506 -284803 -43007 -72256 -45716 -98703
9777 -98703 -48410 146102 -113883 -167890 66086 -40921 -152340 -235441 -31701 -375025 61268
9765 -84268 -355298 201492 -172327 614 -186746 35751 -136483 169090 128275 -66290 -43823
$$ packed form
9845C24308a8450B7096a06258C6718d7376H3003a97823N5180k46312C8400b73562
9833a7800k26230J10252H445b47035R1472O5902p1965C55039A8549K28169A11490
9821b62123C41732A15616b0305A31418f9107j47524B3375f7368C0534g241m4554
9810e1795F8213a53365f2741k8797k5476B8560a34810N9953B59195f8925r1553
9799a60478K9706A64973a11061H3960J28139b9886A83112b03584O7897b5536L591
9788b1945F7431b05998m1378g0658j64962B28506b84803d3007k9249K6540n2987
9777i8703d8410A46102a13883n4007F6086d0921j11419q3101c1701l43324F1268
9765h4268k71030B01492a72327F14a86746C5751a36483A69090m0815f6290K2467
$$ plain form
9754 -43823 28041 -127185 -88168 65521 41029 -73488 -117762 -170939 280342 -29223 -184216
9743 -184216 215249 -219386 32375 -102609 -17937 -96168 186606 32942 -93437 151912 -99002
9731 -64055 19299 255228 172854 -226305 82609 -256702 -68283 -133715 203780 2628 -207253
9719 35761 -212876 32285 49343 -231179 -491857 -102765 -334502 -73203 -42854 -108847 -156230
9708 -156230 -237363 -251312 102194 108798 223373 -345015 -72783 -168300 -120501 -77504 -255101
9697 -255101 137667 -98002 -112366 -33687 22817 210603 -94688 19557 -170461 -283101 69287
9685 -315259 -60884 73748 -458044 46996 3070 -18096 -102801 -7414 266957 -104259 -284235
9674 -284235 -416619 -160927 -3125 168398 6564 -166768 78427 -50627 -329770 -287228 -181178
$$ packed form
9754d3823B8041a27185L9017F5521k4492g3488m4274n3177B80342b9223j54993
9743a84216B15249b19386C2375a02609a7937p8231A86606C2942i3437A51912i9002
9731f4055A9299K35929q2374b26305H2609b56702f8283o5432B03780B628b07253
9719C5761b12876C2285J7058b31179k60678a02765k31737g3203L0349o5993m7383
9708a56230q1133j3949A02194O604J14575c45015g2783r5517M7799M2997j77597
9697b55101A37667i8002j4364c3687B2817J87786i4688A9557a70461j12640F9287
9685c15259f0884G3748d58044D6996C070a8096q4705g414B66957a04259j79976
9674b84235j32384a60927c125A68398F564a66768G8427e0627k79143M2542J06050
$$ plain form
9663 -181178 -237242 -265061 -105264 -58570 -99742 -231849 -307879 -365519 -77920 -80778 -47404
9652 -47404 7190 -83061 -60465 -54888 5100 159259 -72262 -120201 -9067 70145 128222 -172554
9639 -8459 -234855 -101738 -122990 -237127 -483071 -147152 -156033 84385 -47858 32603 -53351
9627 -148974 198402 -38342 237974 -65292 -70513 -226164 -503939 115192 -138742 -216473 -177060
9616 -177060 145952 296182 -385648 27810 -176129 -226278 -93721 97999 -96601 187378 -178550
9604 -108995 205678 186339 -404156 -25755 81867 -37591 -91147 101711 45889 -108351 -1019
9592 357433 44905 282145 -183314 -46377 -151556 -254095 196022 -81372 219596 138032
9582 138032 159273 212756 90336 -96850 -82707 98514 -324417 137369 -109424 -28440 161600
$$ packed form
9663a81178n6064k7819a05264M6694m1172j32107p6030n7640g7920k858L3374
9652d7404G190h3061K2596N577E100J54159g2262m7939i067G0145N8077a72554
9639h459k26396a01738k1252j14137k45944a47152q881H4385d7858C2603e3351
9627a48974A98402c8342B37974f5292n221j55651k77775A15192a38742p7731L9413
9616a77060A45952J50230c85648B7810a76129n0149i3721I7999i6601A87378a78550
9604a08995B05678j9339d04156b5755H1867c7591n3556A01711D5889a08351a019
9592C57433D4905K37240a83314d6377j05179j02539A96022h1372B19596q1564
9582A38032K1241N3483I0336i6850J4143I8514c24417A37369a09424b8440A61600
$$ plain form
9570 -125767 97115 -306300 5741 -66606 -190764 -222280 -144880 -87325 -46945 -134932 -287671
9559 -287671 15906 356191 -175391 134363 -33099 125130 237402 -40677 -165428 83443
9548 9960 201814 144311 -169350 -294150 41864 -202324 -174671 -146300 -48038 30921 12248
9536 -623444 -257530 253711 196150 157696 145211 -3072 20361 -422139 -200266 -115082 -223382
9525 -223382 -278845 -42285 -16341 -301272 -74076 133670 -323490 -27426 -209380 -323529 182416
9513 -49624 -7464 -110558 -13663 -151428 -25458 -138802 40341 -243455 -230096 -55798 -134882
9502 -134882 -113718 -38946 31575 -198425 -547313 -285009 44546 -110349 -120595 -37728 -143577
9491 -143577 -257444 -182795 49854 -1200 17370 71395 -97177 -129098 -59792 -23368 88781 -268027
$$ packed form
9570a25767I7115c06300E741f6606j24158l1516P7400N7555M0380q7987j52739
9559b87671A5906L40285a75391A34363c3099A25130J12272d0677j24751H3443
9548I960J91854n7503a69350j24800D1864b02324K7653K8371d8038C0921A2248
9536f23444b57530B53711n7561l8454j2485c072B0361d22139b00266Q5184j08300
9525b23382n5463d2285a6341k84931g4076A33670c23490b7426j81954j14149A82416
9513d9624g464j03094a3663j37765b5458j13344D0341b43455J3359e5798p9084
9502a34882K1164c8946C1575a98425l48888K62304D4546a10349j0246c7728j05849
9491a43577j13867P4649D9854a200A7370N4025i7177l1921e9792b3368H8781b68027
$$ plain form
9478 -271299 51177 -250985 74536 -279741 53955 249675 -40388 188115 -33412 -16542 -40993
9467 -40993 -365616 -290068 -72862 123255 -199133 -315181 190829 -206877 163267 -14193
9456 -162036 74547 7992 -94364 41481 -140249 118647 107047 -161502 -118641 13201 21570
9445 21570 -13816 -37088 -112607 -197340 131221 97632 -174623 -247972 149946 120369 -338584
9433 -11832 -301485 -22727 -144050 -40867 83508 -185321 -73055 166280 -54988 -250847 -41073
9421 -267129 -64150 -99316 206872 4078 -299705 -164384 -272992 308398 -72798 -87095 -229874
9410 -229874 -14980 56810 36829 -160953 -265788 39313 -26710 -55399 -70003 -291684 -160661
9399 -160661 -149684 25073 106133 -71277 -75539 32253 -179679 -100755 -228682 140693 -95769
$$ packed form
9478b71299E1177b50985G4536b79741E3955J95720d0388A88115c3412a6542k4451
9467d0993l24623P5548g2862A23255a99133j16048A90829b06877A63267a4193
9456a62036G4547G992i4364D1481a40249A18647j1600a61502M2861A3201Q369
9445B1570a3816k3272p5519q4733A31221l3589a74623p3349A49946k9577c38584
9433a1832k89653b2727j21323d0867H3508a85321g3055A66280e4988j95859d1073
9421b67129f4150l5166B06872D078b99705J35321j08608C08398g2798j4297j42779
9410b29874a4980E6810j9981a60953j04835C9313b6710k8689j4604k21681J31023
9399a60661J0977B5073Q1060g1277m262C2253a79679P8924j27927A40693i5769
$$ plain form
9387 31534 -189210 -209527 37539 -196807 252796 63720 -80225 -66736 -253327 114289 -244059
9375 -69490 77921 -331922 -151689 74475 -171582 -14812 79789 -183011 -105260 -236276 107391
9363 86170 -118576 -71715 -53176 155048 -190221 -106500 -666051 122262 -126340 130704
9352 -222161 56575 -81891 36058 -166580 44254 92604 -75659 7815 -48457 -184411 -54212
9340 103704 -128492 88748 65662 215341 74855 -425903 -31904 50478 95946 6453 -164055
9328 -321287 -205717 -273081 -123679 28740 -167871 49662 14498 -30799 150829 -112110 34196
9316 -28897 123857 53626 11672 92810 74258 -74099 125940 165062 69445 205420 -176913
9304 -449788 108589 -6703 -311537 -265167 145189 149977 -124165 -121817 136422 -91137 -163229
$$ packed form
9387C1534a89210k0317C7539a96807B52796F3720h0225J3489j86591A14289b44059
9375f9490G7921c31922a51689G4475a71582a4812G9789a83011P7751j31016A07391
9363H6170a18576M6861J8539A55048a90221Q3721n59551A22262a26340A30704
9352b22161E6575h1891C6058a66580D4254M8350g5659G815d8457j35954e4212
9340A03704a28492H8748k3086J49679G4855d25903c1904E0478M5468F453a64055
9328c21287J15570o7364a23679B8740a67871D9662A4498c0799A50829a12110C4196
9316b8897A23857E3626A1672Q1138j8552g4099A25940L9122F9445J35975a76913
9304d49788A08589f703l04834M6370A45189M788a24165K348A36422i1137p2092
$$ plain form
9293 -163229 -72410 -57633 -7131 196494 -119320 357289 175102 -152825 -38642 -72169 -1911
9281 -438775 -55866 -239892 -336757 -60572 8745 -236199 118460 -28067 302227 49062 -73671
9269 186636 -94769 -111887 58126 397873 -69375 -107304 -64704 -326349 -72627 -8892 -286769
9258 -286769 -10781 -49665 -88456 10972 -100370 -169885 -85126 -414603 -33361 -342505 -147810
9246 -21848 -33109 182326 54609 -149212 -79075 -227596 182277 -167562 -443128 28239 49034
9235 49034 166487 -18149 -64086 193786 193003 74722 308398 186146 -99432 44770 72046
9224 72046 124015 -14877 -208116 17234 -154494 -216348 62573 -91795 81955 -434783 -210986
9212 44932 106096 168241 -403029 330736 -61312 -168513 -233447 -15494 -263084 204094 -193965
$$ packed form
9293a63229g2410J4777g131A96494a19320C57289A75102a52825c8642l3527a911
9281d38775e5866j84026r6865f0572H745b36199A18460b8067C02227D9062g3671
9269A86636i4769j7118E8126L39747f9375l7929M2600k61645g2627h892k77877
9258b86769a0781l8884l8791A0972a00370o9515Q4759l29477c3361l09144a47810
9246b1848j1261A82326E4609a49212P0137j48521A82277a67562k75566B8239K0795
9235D9034J17453a8149m5937A93786p83G4722K33676j22252i9432D4770K7276
9224G2046N1969a4877j93239A7234a54494o1854F2573i1795H1955d34783b10986
9212D4932O1164O2145d03029C30736f1312j07201o4934a5494k47590B04094a93965
$$ plain form
9200 194407 261497 -13110 -160247 32357 -427570 -148760 -57220 100268 -303575 -87050 97687
9188 -137856 -211091 17779 3547 7432 -336609 -54586 -358319 -234917 -37246 -102766 199690
9176 85912 56081 202532 -103842 -35866 81386 88381 35072 306518 -21759 -66129 404552
9164 29976 169428 -189608 -10528 -9517 -64811 -114555 -92390 -73546 298732 -245613 -60717
9152 -148050 1024 -54580 -161524 22126 148301 237384 -43453 -173471 -269017 -94796 -192683
9141 -192683 262879 -228214 -10095 -280335 -20258 -218729 -248737 -95811 -5515 89452 -188733
9129 59661 -165076 -213210 -6516 -30500 -193183 -64193 -71632 -24527 -330159 65162 7438 -161720
9116 -122436 -165019 -130047 -180564 110858 -98032 2184 -154171 221024 -322197 18072 -94423
$$ packed form
9200A94407O7090a3110j47137C2357d27570a48760e7220A00268c03575h7050I7687
9188a37856p3235A7779C547L885c36609e4586l03733J23402c7246o5520A99690
9176H5912k9831J46451a03842c5866H1386O995C5072K71446b1759m4370D04552
9164B9976J39452a89608a0528J011n5294m9744K2165J8844B98732b45613f0717
9152a48050A024e4580j06944B2126J26175Q9083d3453j30018r5546i4796r7887
9141a92683B62879b28214a0095k70240b0258j98471l0008i5811e515H9452a88733
9129E9661a65076m8134f516k3984j62683f4193p439b4527l05632F5162G438a61720
9116a22436m2583L4972n0517A10858i8032B184a54171B21024c22197A8072i4423
$$ plain form
9104 15112 -253971 24582 -221895 -169260 -293195 146383 -91137 191104 134890 -17016 -329541
9093 -329541 -257999 -75547 -221383 132028 -69148 -41329 -31227 -16377 97008 60341 67973
9082 67973 -180232 51127 -376114 43705 -22467 -447283 117945 72526 26807 -37407 -120357
9071 -120357 -7572 77974 -163832 173374 -175531 58338 -206852 386667 168952 -133436
9060 -56378 10644 13324 -178414 -103959 61959 142264 -257520 -347228 249326 -19265 157558
9048 -119860 213166 -153679 -45281 -299531 -25760 -181038 -64155 -286164 -90560 -80403 100018
9036 165569 -164006 -424582 -251082 -60166 -30465 20432 109716 -1511 226022 74165 -336667
9024 -237040 156608 -68572 102589 57365 -314405 158993 -71203 -24801 79870 69549 -397298
$$ packed form
9104A5112b53971B4582b21895N2635j23935A46383i1137A91104n6214a7016l12525
9093c29541P1542g5547j45836A32028f9148K7819J0102J4850I7008l6667P632
9082F7973a80232E1127c76114D3705b2467m24816A17945m5419B6807c7407q2950
9071a20357g572G7974a63832A73374a75531E8338b06852C86667A68952a33436
9060e6378A0644K680a78414P4455F1959Q0305b57520q9708B49326a9265A57558
9048a19860B13166a53679d5281k54250b5760j55278f4155k22009i0560J0157A00018
9036A65569a64006k60576J73500f0166K9701B0432Q9284a511B26022G4165c36667
9024b37040A56608f8572A02589m5224c14405A58993g1203b4801G9870j0321c97298
$$ plain form
9012 -121467 -125236 -332035 928 131208 -143220 -93978 160579 -318969 -177632 -73026 -104434
9001 -104434 -346556 92319 -352291 -101628 110496 108561 -320592 -102776 74386 243289
8991 243289 -53610 162767 173517 -114035 -35011 421726 -174685 -89994 -18042 -64338 -129989
8980 -129989 -108166 -141364 86032 125130 6622 -70776 46093 84608 -180919 -155598 -289691
8969 -289691 -282942 -218321 203712 59242 77964 -387961 -88620 -14338 -135687 -127669 120863
8957 176058 -305796 -100871 83511 169898 -274861 -204329 -162441 -18360 -75646 59736 -159914
8945 17567 -39045 -118719 119479 128519 191312 -122172 -14557 -274919 -429 235851 -297486
8933 -54696 -120497 -66965 -82784 -264142 30594 -146703 -6081 61391 175762 390415 1168093
$$ packed form
9012a21467l769k06799I28J30280a43220M9242A60579c18969J41337g3026l1408
9001a04434k42122I2319c52291a01628A10496j935c20592a02776G4386J68903
8991B43289e3610A62767J0750a14035c5011D21726a74685Q4691a8042m6296o5651
8980a29989K1823l3198H6032L9098F622g0776D6093L8515a80919K5321j34093
8969b89691O749O4621B03712E9242J8722c87961h8620a4338j21349Q018A20863
8957A76058c05796a00871H3511Q6387b74861P0532M1888a8360n7286E9736a59914
8945A7567c9045p9674A19479R040O2793a22172a4557k60362d29B35851b97486
8933e4696o5801N3532j5819j81358C0594a46703f081F1391J14371K14653P77678
$$ plain form
8922 1168093 1220399 375328 43089 -257302 177643 81648 79815 484872 -217510 3457 -16112
8910 262008 -328008 -191078 54966 -261931 -234893 -89036 -37515 262081 -297495 -2198 279147
8898 215116 53944 -206249 -168188 -161793 -258341 -261871 20079 75002 -93846 -54630 -226308 334375
8885 8084 280059 10863 -194817 41701 -110982 -273154 -184040 -100389 282830 -261099 110526
8873 -176717 -218765 -149744 -267822 97125 3028 183833 50331 -38222 49566 -91211 -172583
$$ packed form
8922A168093N2306C75328D3089b57302A77643H1648j833M05057b17510C457a6112
8910B62008c28008J36930E4966b61931K7038h9036c7515B62081b97495b198B79147
8898B15116E3944b06249L8061O395r6548l530B0079N4923i3846L9216j71678C34375
8885H084K71975A0863a94817D1701a10982j62172Q9114Q3651B82830b61099A10526
8873a76717m2048O9021j18078I7125C028J80805E0331c8222D9566i1211q1372
$$ [...]
##END NTUPLES=NMR SPECTRUM
##END=
