##TITLE=NES1084_ptc140_9884872_SXvDNknLow
##JCAMPDX= 6.0         $$ Bruker NMR JCAMP-DX V2.0
##DATA TYPE= NMR SPECTRUM
##DATA CLASS= NTUPLES
##ORIGIN= BRUKER
##OWNER= Administrator
$$ 1.72 TOPSPIN		Version 2.1
$$ 2016-08-27 21:21:09.336 -0500  Administrator@X
$$ Compression mode = diff/dup
##.OBSERVE FREQUENCY= 400.02188249412
##.OBSERVE NUCLEUS= ^1H
##.ACQUISITION MODE= SIMULTANEOUS (DQD)
##.ACQUISITION SCHEME= undefined
##.AVERAGES= 64
##.DIGITISER RES= 22
##SPECTROMETER/DATA SYSTEM= spect
##.PULSE SEQUENCE= noesygpps1d.comp
##.SOLVENT NAME= COFFEE_meoh
##.SHIFT REFERENCE= INTERNAL, COFFEE_meoh, 1, 14.96027
##AUDIT TRAIL= $$ (NUMBER, WHEN, WHO, WHERE, PROCESS, VERSION, WHAT)
$$ ##TITLE= Audit trail, TOPSPIN		Version 2.1
$$ ##JCAMPDX= 5.01
$$ ##ORIGIN= Bruker BioSpin GmbH
$$ ##OWNER= Administrator
$$ $$ E:\/data/COFFEE/nmr/NES1084_ptc140_9884872_SXvDNknLow/22/pdata/1/auditp.txt
$$ ##AUDIT TRAIL=  $$ (NUMBER, WHEN, WHO, WHERE, PROCESS, VERSION, WHAT)
(   1,<2016-08-27 21:21:04.117 -0500>,<Administrator>,<X>,<go>,<TOPSPIN 2.1>,
      <created by zg
	started at 2016-08-27 21:09:34.289 -0500,
	POWCHK enabled, PULCHK disabled,
       configuration hash MD5:
       21 0F 79 D6 B3 7B B4 F6 88 20 88 DB 03 48 BD 9F
       data hash MD5: 64K
       1B E5 5F 17 38 BA 58 F2 A1 BB 7B CB 7B B0 CC 40>)
(   2,<2016-08-27 21:21:07.258 -0500>,<Administrator>,<X>,<proc1d>,<TOPSPIN 2.1>,
      <Start of raw data processing
       efp LB = 0.3 FT_mod = 6 PKNL = 1 PHC0 = 0 PHC1 = 0 SI = 128K 
       data hash MD5: 128K
       41 EA 70 9E 1E E0 8F FE 94 00 BE 48 FF 05 EC 96>)
(   3,<2016-08-27 21:21:08.148 -0500>,<Administrator>,<X>,<proc1d>,<TOPSPIN 2.1>,
      <pk PHC0 = -82.99622 PHC1 = 0 
       data hash MD5: 128K
       E3 66 B8 8A 7C 32 7B 94 CD 99 40 F1 85 5D BF 45>)
(   4,<2016-08-27 21:21:08.523 -0500>,<Administrator>,<X>,<proc1d>,<TOPSPIN 2.1>,
      <abs ABSG = 1 
       data hash MD5: 128K
       5B 63 17 4B 86 FA C8 1E 12 52 89 0B 62 3B 39 A6>)
(   5,<2016-08-27 21:21:08.617 -0500>,<Administrator>,<X>,<proc1d>,<TOPSPIN 2.1>,
      <abs ABSG = 2 
       data hash MD5: 128K
       4D EA BB E7 F1 A5 0F F2 28 5C F2 6F AB 9A A3 43>)
(   6,<2016-08-27 21:21:08.695 -0500>,<Administrator>,<X>,<proc1d>,<TOPSPIN 2.1>,
      <abs ABSG = 3 
       data hash MD5: 128K
       49 E0 14 A1 BA 1A B0 68 ED BD 61 9F 63 C1 8B 18>)
(   7,<2016-08-27 21:21:08.789 -0500>,<Administrator>,<X>,<proc1d>,<TOPSPIN 2.1>,
      <abs ABSG = 4 
       data hash MD5: 128K
       C2 51 BE C5 91 F1 FD 9C 8B 8D 9D AA F7 1E 66 2A>)
(   8,<2016-08-27 21:21:08.898 -0500>,<Administrator>,<X>,<proc1d>,<TOPSPIN 2.1>,
      <abs ABSG = 5 
       data hash MD5: 128K
       DF F5 83 C5 D9 4D D0 9E 5F 83 68 62 B0 7E A4 4E>)
$$ ##END=
$$ 
$$ $$ hash MD5
$$ $$ A4 F5 E6 6A C9 27 36 6E C8 A7 42 CE FA 14 BE BD
##$RELAX= 
##$RELAX= 
##$RELAX= 
##$RELAX= 
##$RELAX= 
##$RELAX= 
##$RELAX= 
##$RELAX= 
$$ Bruker specific parameters
$$ --------------------------
##$DU= <E:\>
##$EXPNO= 22
$$ [...]
##$TP07= 0
##$TPNAME0= <>
##$TPNAME1= <>
##$TPNAME2= <>
##$TPNAME3= <>
##$TPNAME4= <>
##$TPNAME5= <>
##$TPNAME6= <>
##$TPNAME7= <>
##$TPOAL= (0..7)
0.5 0.5 0.5 0.5 0.5 0.5 0.5 0.5
##$TPOFFS= (0..7)
0 0 0 0 0 0 0 0
##$TUNHIN= 0
##$TUNHOUT= 0
##$TUNXOUT= 0
##$USERA1= <user>
##$USERA2= <user>
##$USERA3= <user>
##$USERA4= <user>
##$USERA5= <user>
##$V9= 5
##$VALIST= <valist>
##$VCLIST= <CCCCCCCCCCCCCCC>
##$VD= 0
##$VDLIST= <DDDDDDDDDDDDDDD>
##$VPLIST= <PPPPPPPPPPPPPPP>
##$VTLIST= <TTTTTTTTTTTTTTT>
##$WBST= 1024
##$WBSW= 4
##$XGAIN= (0..3)
0 0 0 0
##$XL= 0
##$YL= 0
##$YMAX_a= 6810918
##$YMIN_a= -12172715
##$ZGOPTNS= <>
##$ZL1= 120
##$ZL2= 120
##$ZL3= 120
##$ZL4= 120
##$ABSF1= 14.96027
##$ABSF2= -5.597912
##$ABSG= 5
##$ABSL= 3
##$ALPHA= 0
##$AQORDER= 0
##$ASSFAC= 0
##$ASSFACI= 0
##$ASSFACX= 0
##$ASSWID= 0
##$AUNMP= <proc_prof1d_extract.lims>
##$AXLEFT= 0
##$AXNAME= <>
##$AXNUC= <1H>
##$AXRIGHT= 0
##$AXTYPE= 0
##$AXUNIT= <>
##$AZFE= 0.1
##$AZFW= 0.1
##$BCFW= 0
##$BC_mod= 0
##$BYTORDP= 0
##$COROFFS= 0
##$CY= 15
##$DATMOD= 1
##$DC= 0
##$DFILT= <>
##$DTYPP= 0
##$F1P= 0
##$F2P= 0
##$FCOR= 0.5
##$FTSIZE= 131072
##$FT_mod= 6
##$GAMMA= 0
##$GB= 0
##$INTBC= 1
##$INTSCL= 1
##$ISEN= 128
##$LB= 0.3
##$LEV0= 0
##$LPBIN= 0
##$MAXI= 10000
##$MC2= 0
##$MEAN= 0
##$ME_mod= 0
##$MI= 0
##$NCOEF= 0
##$NC_proc= -2
##$NLEV= 6
##$NOISF1= 0
##$NOISF2= 0
##$NSP= 0
##$NTH_PI= 0
##$NZP= 0
##$OFFSET= 14.96027
##$PC= 1
##$PHC0= -82.99622
##$PHC1= 0
##$PH_mod= 1
##$PKNL= yes
##$PPARMOD= 0
##$PPDIAG= 0
##$PPIPTYP= 0
##$PPMPNUM= 2147483647
##$PPRESOL= 1
##$PSCAL= 4
##$PSIGN= 0
##$PYNMP= <proc.py>
##$REVERSE= no
##$SF= 400.020009929856
##$SI= 131072
##$SIGF1= 0
##$SIGF2= 0
##$SINO= 400
##$SIOLD= 131072
##$SPECTYP= <>
##$SREGLST= <1H.CDCl3>
##$SSB= 0
##$STSI= 131072
##$STSR= 0
##$SW_p= 8223.68421052631
##$SYMM= 0
##$S_DEV= 0
##$TDeff= 65536
##$TDoff= 0
##$TI= <>
##$TILT= no
##$TM1= 0
##$TM2= 0
##$TOPLEV= 0
##$USERP1= <user>
##$USERP2= <user>
##$USERP3= <user>
##$USERP4= <user>
##$USERP5= <user>
##$WDW= 1
##$XDIM= 131072
##$YMAX_p= 351619648
##$YMIN_p= -12041
##$CURPLOT= <Network HP LaserJet P1505>
##$CURPRIN= <$Network HP LaserJet P1505>
##$DFORMAT= <normdp>
##$LAYOUT= <+/1D_H.xwp>
##$LFORMAT= <normlp>
##$PFORMAT= <normpl>
##$SURQMSG= 1
$$ End of Bruker specific parameters
$$ ---------------------------------
##NTUPLES= NMR SPECTRUM
##VAR_NAME=  FREQUENCY,     SPECTRUM/REAL,   SPECTRUM/IMAG
##SYMBOL=    X,             R,               I
##VAR_TYPE=  INDEPENDENT,   DEPENDENT,       DEPENDENT
##VAR_FORM=  AFFN,          ASDF,            ASDF
##VAR_DIM=   131072,        131072,          131072
##UNITS=     HZ,            ARBITRARY UNITS, ARBITRARY UNITS
##FACTOR=    0.0627417313425164, 1,          1
##FIRST=     8223.62146879497, 657,          -53005
##LAST=      0,             2193,            -53363
##MIN=       0,             -12041,          0
##MAX=       8223.62146879497, 351619648,    0
$$ Real data points
##PAGE= N=1
##DATA TABLE= (X++(R..R)), XYDATA
$$ [...]
63980B70142N115N864O237O556P043P538P861Q090Q385Q672Q778Q744Q832R191
63966C77048R752J0417J1181J2087J3253J4935J7355K0326K3377K6325K9571L3679
63954E99306L8861M4985N1927N9685O8287P7664Q7529R7279J06227J14009J20645
63943A466404J26141J30316J33066J34342J33653J29966J22501J11439R7578Q1644
63933B667050O4201M5882K7056P548j2751l3156n2648p0935q8225j03899j16343
63922B333780j24478j28890j30884j30980j28941j24908j19633j13594j06507
63913A224965r8018q8562p9192p0639o2782n5060m7362m0324l4662l0318k6513
63902E91533k2653j8859j5538j2785j0519q865p929p356o630n825n522n841o068
$$ plain form
63980 270142 275257 281121 287358 293914 300957 308495 316356 324446 332831 341503 350281 359025 367857 377048
63966 377048 386800 397217 408398 420485 433738 448673 466028 486354 509731 536056 565627 599306
63954 599306 638167 683152 735079 794764 863051 940715 1028244 1125523 1231750 1345759 1466404
63943 1466404 1592545 1722861 1855927 1990269 2123922 2253888 2376389 2487828 2585406 2667050
63933 2667050 2731251 2777133 2804189 2811737 2798986 2765830 2713182 2642247 2554022 2450123 2333780
63922 2333780 2209302 2080412 1949528 1818548 1689607 1564699 1445066 1331472 1224965
63913 1224965 1126947 1038385 959193 888554 825772 770712 723350 683026 648364 618046 591533
63902 591533 568880 550021 534483 521698 511179 502314 494385 487029 480399 474574 469052 463211 457143
63889D57143n591m671l831k802q79J777L979M969N379O310P936R671J1326J3287
63875E04003J5519J7173J7590J7155J6801J6887J7008J6578J5315J3281J0819
63864F78129Q413O323M408K465N86j047k586m400o519q477r825j0616j1357j2559
63850F32938j4317j6283j8068j9631k1096k2209k2398k1526k0270j9369j8836
63839D18935j8282j7630j6991j6096j4575j2810j1717j1545j1502j0886r917r174
63827B57810q722q294p830p265o216m495k732j838j887k112k026j931k198k556
63813A97708k442j750r13l82l00n77j029j453j670j581j227q19o70r33j460j988
63797A78514k432k781k836k379j616j093j020r70n23J30N38O81Q73J098J020O40
$$ plain form
63889 457143 451552 446881 443050 440248 439369 441146 445125 450094 455473 461783 469719 479390 490716 504003
63875 504003 519522 536695 554285 571440 588241 605128 622136 638714 654029 667310 678129
63864 678129 686542 692865 697273 699738 700324 699277 696691 692291 685772 677295 667470 656854 645497 632938
63850 632938 618621 602338 584270 564639 543543 521334 498936 477410 457140 437771 418935
63839 418935 400653 383023 366032 349936 335361 322551 310834 299289 287787 276901 266984 257810
63827 257810 249088 240794 232964 225699 219483 214988 212256 210418 208531 206419 204393 202462 200264 197708
63813 197708 195266 193516 192603 192221 191921 191344 190315 188862 187192 185611 184384 183565 182895 181962 180502 178514
63797 178514 176082 173301 170465 168086 166470 165377 164357 163387 162864 162994 163532 164213 165086 166184 167204 167844
63781A67844M19M99L28n69j734k188j521k46Q53J356J228O61Ql73l61n9M09Q61
63763A67415R32L47n68j040o82P7N37M38Lm30n97l90%K42L55P15J433K000J946
63744A72733J520J330J527J827K089K330K352J981J613J817K359K333J509Q36
63730A98156J137J958K334K209K367L143L961M275M217M133L995L664L420L627
63716B42596L989L625K087j0j589k208k303k442k673k743k595k434k444k636k892
63701B25328k948k496j539n06K53R30J873K856L192K660J826J341J363J803K651
63686B38587L696M372M264L616K965K497K053J573J133P36L67J38O6j05m45m86
63670B65027K15J320K084K395K758L243L152K037M37q26j567k063k396k554k867
$$ plain form
63781 167844 168263 168762 169090 168521 166787 164599 163078 162832 163685 165041 166269 166930 166938 166565 166204 166145 166554 167415
63763 167415 168347 168694 168126 167086 166404 166481 167018 167456 167459 167029 166432 166042 166042 166284 166639 167354 168787 170787 172733
63744 172733 174253 175583 177110 178937 181026 183356 185708 187689 189302 191119 193478 195811 197320 198156
63730 198156 199293 201251 203585 205794 208161 211304 215265 219540 223757 227890 231885 235549 238969 242596
63716 242596 246585 250210 252297 252287 250698 248490 246187 243745 241072 238329 235734 233300 230856 228220 225328
63701 225328 222380 219884 218345 217839 218092 219022 220895 223751 226943 229603 231429 232770 234133 235936 238587
63686 238587 242283 246655 250919 254535 257500 259997 262050 263623 264756 265492 265859 265997 266063 265958 265513 265027
63670 265027 265242 266562 268646 271041 273799 277042 280194 282231 282668 281842 280275 278212 275816 273262 270395
63655B70395l663m574m825m231l418k916k514j753o76J93M83L45L29Q95J969K842
63639B48881K848K220K009K919M455N551N846N971O606P655Q471Q647Q387Q222
63625C28688Q436Q834R027R024R351J0430J1947J3180J3899J4654J6082J8263
63613D71815K0845K3490K5965K8117K9974L1684L3100L3684L2973L0932K7555
63602G90134K2569J6009Q898K688j933n291p812r480j0275j0505j0499j0461j0886
63589G63156j2606j5848j9633k2654k4560k5884k6887k7098k6128k4291k2243
63578E15324k0238j8085j5587j2804r995p488n500l912k326n19J223K469L316
63565D25878M426O214Q206R495R847J0068J1084J2944J4960J6682J8294K0104
$$ plain form
63655 270395 266732 262158 257333 253102 249684 246768 244254 242501 241825 242018 242501 242846 243175 244070 246039 248881
63639 248881 251729 253949 255958 258877 263332 268883 274729 280700 287306 294961 303432 312079 320466 328688
63625 328688 337124 345958 354985 364009 373360 383790 395737 408917 422816 437470 453552 471815
63613 471815 492660 516150 542115 570232 600206 631890 664990 698674 731647 762579 790134
63602 790134 812703 828712 837610 840298 838365 833074 825262 815782 805507 795002 784503 774042 763156
63589 763156 750550 734702 715069 692415 667855 641971 615084 587986 561858 537567 515324
63578 515324 495086 477001 461414 448610 438615 431127 425627 421715 419389 418870 420093 422562 425878
63565 425878 430304 436518 444724 454219 464066 474134 485218 498162 513122 529804 548098 568202
63553E68202K2050K4042K6349K9314L2836L6452L9786M2468M3634M2039L6930
63542I44102K8721J8705Q361r76q243j2925j5261j5874j5227j3585j1471r765
63530H96562r190r942j1929j5170j9603k4601k9088l2251l4017l4785l4895l4467
63518F06624l3550l2148l0151k7515k4510k1659j9320j7472j5869j4290j2574
63507C57566j0608q457o442m973m300m382m921n473n602n118m164l116k339k026
63493B85645k073k085j605n58N24Q69K42o70p49N25K561M183M756M628M558M878
63477C05629N374N712N722N321M454L218J838M63q30j858k387k516k722l292l896
63462C20230l920l229k332j783j599j369q64l43k17m05k54P86K433L813M391M533
$$ plain form
63553 568202 590252 614294 640643 669957 702793 739245 779031 821499 865133 907172 944102
63542 944102 972823 991528 999889 998913 990670 977745 962484 946610 931383 917798 906327 896562
63530 896562 887372 877430 865501 850331 830728 806127 777039 744788 710771 675986 641091 606624
63518 606624 573074 540926 510775 483260 458750 437091 417771 400299 384430 370140 357566
63507 357566 346958 338501 332059 327086 322786 318404 313483 308010 302408 297290 293126 290010 287671 285645
63493 285645 283572 281487 279882 279324 279848 280717 280959 280289 279540 280065 282626 286809 291565 296193 300751 305629
63477 305629 311003 316715 322437 327758 332212 335430 337268 337731 336901 335043 332656 330140 327418 324126 320230
63462 320230 316310 313081 310749 308966 307367 305998 305134 304791 304574 304169 303915 304701 307134 310947 315338 319871
63446C19871N020O249Q019R971J1927J3846J5700J7526J9545K2092K5270K8567
63434E03603L0899L1174K8953K4606J9008J3186Q172M807L517M315O939J0832
63422F90011J5131J9093K2677K6388L0466L4459L7709L9845M0572L9299L5463
63411A031113K9134K1066J2281L805l484r059j2758j4493j4269j2824j1770j2546
63399A006196j5210j8746k2416k6280l0443l4420l7414l8908l8802l7365l5188
63388F71004l2806l0293k7481k4508k1750j9163j6295j3124j0235p933n707l110
63376D58599o05J091K173L515N411P301Q799J0336J2469J5115J7805K0351K2837
63363E85197K5156K7096K8790L0752L3241L5833L7812L8866L9238L9153L8325
$$ plain form
63446 319871 324891 331140 339159 349130 361057 374903 390603 408129 427674 449766 475036 503603
63434 503603 534502 565676 594629 619235 638243 651429 659601 664408 667925 672240 679179 690011
63422 690011 705142 724235 746912 773300 803766 838225 875934 915779 956351 995650 1031113
63411 1031113 1060247 1081313 1093594 1097399 1093915 1084856 1072098 1057605 1043336 1030512 1018742 1006196
63399 1006196 990986 972240 949824 923544 893101 858681 821267 782359 743557 706192 671004
63388 671004 638198 607905 580424 555916 534166 515003 498708 485584 475349 467416 461709 458599
63376 458599 457994 459085 461258 464773 470184 477485 486284 496620 509089 524204 542009 562360 585197
63363 585197 610353 637449 666239 696991 730232 766065 803877 842743 881981 921134 959459
63352I59459L6083L1896K5714J7955R447J310n404j0183j3084j4366j4291j3433
63340A011103j2804j3341j5257j8145k1626k5664l0104l4214l6928l7659l6823
63329G28538l5409l3948l1962k8658k4056j9140j4804j1104p883n713n594p751
63317E02516j1198j4617j7260j8896j9432j8918j7668j6023j4149j2194j0461
63306C31700r131p974o636n173m055l667l944m417m534m003l049k230j882j799
63292B69206j622j365j282j399j461j382j355j509j735j923k134k363k351j790
63278B45535o50P03J652J717J023L03K11O09Q73P66O44P53R08J040J534K619L793
63261B64033M306M039L506L157L084L255L678M287M896N287N223M655M006M028
$$ plain form
63352 959459 995542 1027438 1053152 1071107 1080554 1081864 1076460 1066277 1053193 1038827 1024536 1011103
63340 1011103 998299 984958 969701 951556 929930 904266 874162 839948 803020 765361 728538
63329 728538 693129 659181 627219 598561 574505 555365 540561 529457 521574 515861 510267 502516
63317 502516 491318 476701 459441 440545 421113 402195 384527 368504 354355 342161 331700
63306 331700 322569 314595 307959 302786 298731 295064 291120 286703 282169 278166 275117 272887 271005 269206
63292 269206 267584 266219 264937 263538 262077 260695 259340 257831 256096 254173 252039 249676 247325 245535
63278 245535 244885 245588 247240 248957 249980 250283 250494 251103 251976 252742 253386 254139 255047 256087 257621 260240 264033
63261 264033 268339 272378 275884 279041 282125 285380 289058 293345 298241 303528 308751 313406 317412 321440
63247C21440N075O718Q327R714J0895J1670J2006J2507J3827J5680J7114J7689
63235D62662J7773J7750J7658J7671J8154J8925J9202J8590J7646J7091J7037
63224F60159J7277J7800J8484J8825J8459J7728J7180J6786J5965J4190J1219
63213H44072P054K042l150q003j2397j6245j9297k1567k3533k5456k6838k6974
63201F69708k5754k3523k0583j7250j4016j1014p773m016l58K489M876P732J1112
63188E71630J4063J5905J6902J7641J8467J9554K0821K1692K1614K0938K0560
63177G79787K0618K0249J8917J7190J5891J4989J3777J1673Q550M699P51k799
63165I24292o257j0484j5732k1135k5677k9205l2091l4356l5564l5441l4191l2354
$$ plain form
63247 321440 326515 333233 341560 351274 362169 373839 385845 398352 412179 427859 444973 462662
63235 462662 480435 498185 515843 533514 551668 570593 589795 608385 626031 643122 660159
63224 660159 677436 695236 713720 732545 751004 768732 785912 802698 818663 832853 844072
63213 844072 851126 853168 850018 842015 829618 813373 794076 772509 748976 723520 696682 669708
63201 669708 643954 620431 599848 582598 568582 557568 549795 545779 545421 547910 552786 560518 571630
63188 571630 585693 601598 618500 636141 654608 674162 694983 716675 738289 759227 779787
63177 779787 800405 820654 839571 856761 872652 887641 901418 913091 921641 926340 927091 924292
63165 924292 918035 907551 891819 870684 845007 815802 783711 749355 713791 678350 644159 611805
63153F11805l0490k8825k7064k4757k1959j9196j6804j4702j2858j1434j0278
63142C93438q840o886m913l590l112l236l490l287k323j079l63k18L8O20J022
63127C53781J135J615K583L075K553J967K311K989K871K222K189K842L218L119
63113C88470L342M008M094L101J959J699K130K449K398K288K370K664L002K979
63099D26953K320J452J229J865K707L189L314L099K349J226L59j04p44j812k569
63084D44833k266j173o4P90J576K340L015L677M298M645M881N756P675J0025J1895
63069E01903J2962J3212J2519J1342J1166J3113J6410J9244K0985K2575K4868
63058F80299K7656L0440L3107L5551L7544L9297M1375M3729M5510M6223M6389
$$ plain form
63153 611805 581315 552490 525426 500669 478710 459514 442710 428008 415150 403716 393438
63142 393438 384598 377712 372799 369209 366097 362861 359371 356084 353761 352682 352319 352101 352139 352759 353781
63127 353781 354916 356531 359114 362189 364742 366709 369020 372009 374880 377102 379291 382133 385351 388470
63113 388470 391812 395820 399914 403015 404974 406673 408803 411252 413650 415938 418308 420972 423974 426953
63099 426953 429273 430725 431954 433819 436526 439715 443029 446128 448477 449703 450062 449958 449214 447402 444833
63084 444833 442567 441394 441330 442120 443696 446036 449051 452728 457026 461671 466552 472308 479983 490008 501903
63069 501903 514865 528077 540596 551938 563104 576217 592627 611871 632856 655431 680299
63058 680299 707955 738395 771502 807053 844597 883894 925269 968998 1014508 1060731 1107120
63047A107120M6656M6874M6547M5640M4469M3350M2752M3228M4638M5881M6000
63036A603155M5142M3798M1618L7789L2285K5857J8728J0239J8j1081k1589l0652
63024A795307l8427m5505n2062n7381o0183n9777n6875n2979m8908m4295l8623
63013A240292l2116k5402j8732j1963n113J505P628J3159J8082K2442K6379K9866
63001A266027L2537L4044L4545L4604L4593L4521L4410L4490L4793L4796L3780
62990A643140L1465K8175K4344K0096J5258R567K762n332j4566k4324l3802m2536
62978A654247n0479n7497o3019o6434o7745o7537o6364o4403o1699n8351n4407
62967I76312m9918m5255m0950l7050l3028k8743k5014k2691k1402j9953j7864
$$ plain form
63047 1107120 1153776 1200650 1247197 1292837 1337306 1380656 1423408 1466636 1511274 1557155 1603155
63036 1603155 1648297 1692095 1733713 1771502 1803787 1829644 1848372 1858611 1858629 1847548 1825959 1795307
63024 1795307 1756880 1711375 1659313 1601932 1541749 1481972 1425097 1372118 1323210 1278915 1240292
63013 1240292 1208176 1182774 1164042 1152079 1146966 1148471 1156099 1169258 1187340 1209782 1236161 1266027
63001 1266027 1298564 1332608 1367153 1401757 1436350 1470871 1505281 1539771 1574564 1609360 1643140
62990 1643140 1674605 1702780 1727124 1747220 1762478 1772045 1774807 1769475 1754909 1730585 1696783 1654247
62978 1654247 1603768 1546271 1483252 1416818 1349073 1281536 1215172 1150769 1089070 1030719 976312
62967 976312 926394 881139 840189 803139 770111 741368 716354 693663 672261 652308 634444
62956F34444j5799j4422j3602j2998j2680j2722j2684j2156j1394j0886j0558
62945D94543j0095r720r949j0525j0447r220p539o412o055n965n733n339m890
62932C92654m431m018l677l315k797k135j518j139j033j137j379j738k123k221
62918C59993j713q35l68p73j470j465o15K36M41J86j86q09j833k850l376l462
62902C41101l381k983k120j293j102j183n45R11K105K253J796J471J135L39n67
62887C37937o91J15R73J109O38J62O1L55R12J400J391Q28K95M61J274J890J525
62870C50635L21p99j059n56NJ10k02o78j165j504j398p20K11R39J278J239P41
62853C47398j61q07l12J350L019L456K539J201L87L54P96J219J263R23N11K53
$$ plain form
62956 634444 618645 604223 590621 577623 564943 552221 539537 527381 515987 505101 494543
62945 494543 484448 474728 464779 454254 443807 434587 427048 420636 414581 408616 402883 397544 392654
62932 392654 388223 384205 380528 377213 374416 372281 370763 369624 368591 367454 366075 364337 362214 359993
62918 359993 358280 357445 357077 356304 354834 353369 352754 352990 353431 353617 353431 352622 350789 347939 344563 341101
62902 341101 337720 334737 332617 331324 330222 329039 328494 329405 331510 333763 335559 337030 338165 338504 337937
62887 337937 337246 337361 338334 339443 340081 340243 340304 340659 341571 342971 344362 345190 345485 345946 347220 349110 350635
62870 350635 350956 350157 349098 348542 348547 348657 348455 347777 346612 345108 343710 342990 343201 344140 345418 346657 347398
62853 347398 347237 346430 346118 347468 350487 353943 356482 357683 358070 358424 359220 360439 361702 362625 363136 363389
62837C63389J6l59n81j74P71J485J369O90K32M09R82J550K044K664L450M057L991
62820C85985L162K117J611J835K243K311K277K823M035N069N088M302L732M085
62806D30675N110O123O731O952P006P286Q283J0114J2161J3600J4265J4690J5330
62793E58326J6191J7350J9310K2399K6166K9828L3250L7007M1517M6521N1495
62782H99360N6222O0764O5099O9052P2426P4989P6323P5816P2998O7871O0933
62771A651853N2651M2955L1465J8272M226r691k2998l5424m6391n5285o2102o7235
62759A502296p0692p2156p1860p0727o9240o6823o2893n8081n3754n0436m7353
62748H08281m3626l9317l5152l1558k8473k5803k3604k1721j9616j6888j3884
$$ plain form
62837 363389 363405 363046 362465 362291 363062 364547 365916 366606 366838 367247 368229 369779 371823 374487 377937 381994 385985
62820 385985 389147 391264 392875 394710 396953 399264 401541 404364 408399 413468 418556 422858 426590 430675
62806 430675 435785 441908 448639 455591 462597 469883 478166 488280 500441 514041 528306 542996 558326
62793 558326 574517 591867 611177 633576 659742 689570 722820 759827 801344 847865 899360
62782 899360 955582 1016346 1081445 1150497 1222923 1297912 1374235 1450051 1523049 1590920 1651853
62771 1651853 1704504 1747459 1778924 1797196 1801422 1791731 1768733 1733309 1686918 1631633 1569531 1502296
62759 1502296 1431604 1359448 1287588 1216861 1147621 1080798 1017905 959824 906070 855634 808281
62748 808281 764655 725338 690186 658628 630155 604352 580748 559027 539411 522523 508639
62737E08639j1409r796q609p393o258n421m609l455k238j488j002J4J722L357
62723D52054M367N063N866O623P249Q216R789J1407J2596J3901J6037J8602K0704
62710E92474K2608K5465K9502L3647L7234M0928M5425N0244N4541N8382O2406
62699A052856O6616P0318P3030P4758P5458P4724P2105O7376O0553N1843M1501
62688A781138K9613J6168J578j3098k6776l9074n0209o0298o8929p5347p8948
62677A415818p9730p8443p6114p3248o9659o5186o0239n5455n1033m6777m2581
62666G17353l8562l4841l1494k8627k6200k3842k1181j8358j5904j4129j2768
62655D51447j1337r680q099p025o572o489o524o661o851o692n797m421l286k719
$$ plain form
62737 508639 497230 487434 478825 471432 465174 459753 455144 451689 449451 447963 446961 446975 448697 452054
62723 452054 456421 461484 467350 473973 481222 489438 499227 510634 523230 537131 553168 571770 592474
62710 592474 615082 640547 670049 703696 740930 781858 827283 877527 932068 990450 1052856
62699 1052856 1119472 1189790 1262820 1337578 1413036 1487760 1559865 1627241 1687794 1739637 1781138
62688 1781138 1810751 1826919 1828497 1815399 1788623 1749549 1699340 1639042 1570113 1494766 1415818
62677 1415818 1336088 1257645 1181531 1108283 1038624 973438 913199 857744 806711 759934 717353
62666 717353 678791 643950 612456 583829 557629 533787 512606 494248 478344 464215 451447
62655 451447 440110 430430 422331 415306 408734 402245 395721 389060 382209 375517 369720 365299 362013 359294
62641C59294k450k275k337k545k385j725j194j218j255o34L03P50P02Q23J220
62626C45074J301Q46L71L07N29Q65J332J749J912K222L350N054O173O225O102
62611C83412O639P385P572P629Q592J0506J2386J3719J4977J6635J8500K0295
62599E28247K2221K4629K7531L0654L3607L5863L7000L7112L6585L5349L2754
62588H81552K8439K2947J7114J1127M590k639j0045j6845k2569k7161l0711l3288
62576H22511l4962l5836l5959l5262l3752l1781k9871k8151k6196k3638k0732
62565D86371j7999j5605j3443j1692j0684j0186r398p904o167m883m217m010m189
62552C65994m570m504l363j370M32J156P83Ml74K5R26J691J973K011K143K282
$$ plain form
62641 359294 356844 354569 352232 349687 347302 345577 344383 343165 341910 341276 341579 342329 343031 343854 345074
62626 345074 346375 347221 347592 347899 348428 349293 350625 352374 354286 356508 359858 364912 371085 377310 383412
62611 383412 390051 397436 405008 412637 421229 431735 444121 457840 472817 489452 507952 528247
62599 528247 550468 575097 602628 633282 666889 702752 739752 776864 813449 848798 881552
62588 881552 909991 932938 950052 961179 965769 963130 953085 936240 913671 886510 855799 822511
62576 822511 787549 751713 715754 680492 646740 614959 585088 556937 530741 507103 486371
62565 486371 468372 452767 439324 427632 416948 406762 397364 389460 383293 378410 374193 370183 365994
62552 365994 361424 356920 353557 352187 352619 353775 354558 354562 354188 354213 355139 356830 358803 360814 362957 365239
62536C65239K165J933J970K311K722L336M614O536Q398R713J0815J2284J4192
62523D46228J6314J8647K1251K3879K6346K8992L2117L5198L7398L8793M0274
62512G65437M2007M2848M1785L9216L6150L2636K7759K1042J3081M834l085j0245
62500A053465j6301k1301k5661k9491l2278l3522l3373l2320l0553k7981k4702
62489G45982k1046j7307j3663j0221o832l148Q34M471P240R543J2137J4864J6694
62476G39548J7167J6965J6664J5650J2973Q815M390N10l065o924j1231j5690j9846
62463G75926k3257k5740k7504k8808k9508k9321k8432k7387k6336k4867k2742
62452D82024k0293j7891j5518j3113j0941r188p552n714l954k846k396j969j053
$$ plain form
62536 365239 367404 369337 371307 373618 376340 379676 384290 390826 399224 408937 419752 432036 446228
62523 446228 462542 481189 502440 526319 552665 581657 613774 648972 686370 725163 765437
62512 765437 807444 850292 892077 931293 967443 1000079 1027838 1048880 1061961 1066795 1063710 1053465
62500 1053465 1037164 1015863 990202 960711 928433 894911 861538 829218 798665 770684 745982
62489 745982 724936 707629 693966 683745 676913 673765 674599 679070 686310 695853 707990 722854 739548
62476 739548 756715 773680 790344 805994 818967 827782 832172 832682 829617 822693 811462 795772 775926
62463 775926 752669 726929 699425 670617 641109 611788 583356 555969 529633 504766 482024
62452 482024 461731 443840 428322 415209 404268 395080 387528 381814 377860 375014 372618 370649 369596
62439C69596K18J380K143K472K441K162J779J451J195Q31P7j105k323l112l549
62424C75656m168n189o151o518o330n954n499m853m104l491l008k448j798j261
62410C14884r34p16n17k53J61N84N66o5p74q77m25P1O32J648K792K974J858N80
62392C22189L66R91J369J187J048J249J358J197J369K376L770M739N157N531O069
62377C59965O469O696P322Q735J0370J1327J1610J2155J3562J5405J7126J8986
62365D99728K1549K4575K7217K9272L1616L5164L9934M5269N0496N5074N8543
62354I18437O0668O1461O0821N8363N3721M6829L7837K7151J5709M798m773j3033
62342A327989k0303k6662l2287l7747m3359m8490n1990n3278n2648n0655m7729
$$ plain form
62439 369596 369814 371194 373337 375809 378250 380412 382191 383642 384837 385668 385745 384640 382317 379205 375656
62424 375656 371488 366299 360148 353630 347300 341346 335847 330994 326890 323399 320391 317943 316145 314884
62410 314884 313950 313234 312717 312464 312625 313209 313775 313710 312936 312059 311634 311705 312337 313985 316777 319751 321609 322189
62392 322189 322555 323546 324915 326102 327150 328399 329757 330954 332323 334699 338469 343208 348365 353896 359965
62377 359965 366434 373130 380452 389187 399557 410884 422494 434649 448211 463616 480742 499728
62365 499728 521277 545852 573069 602341 633957 669121 709055 754324 804820 859894 918437
62354 918437 979105 1040566 1101387 1159750 1213471 1260300 1298137 1325288 1340997 1345795 1341022 1327989
62342 1327989 1307686 1281024 1248737 1210990 1167631 1119141 1067151 1013873 961225 910570 862841
62331H62841m4247m0511l6596l2530k8608k5172k2158j9287j6679j4898j4247
62320E67908j4410j4822j5137j5173j4811j4103j3347j2808j2428j1861j0788
62309D18220r248p738o891o872p192p235o849o245n463m346k925j551n74j03m4
62294C44944j54j10K43P42J174J555J973K347K658L104L700M000L806L810M766
62279C78558O152O606N826N154N823P415Q615Q892Q763Q862R460J0651J2394J4456
62265D97627J6773J9693K3367K7222L0609L3876L8010M3245M8648N3314N7332
62254H89716O1128O4319O5675O4179N9758N3005M4492L4501K3371J1912J225q041
62242A365240j6097k3565l0744l7624m4274n0709n6270n9771o0596n9337n7105
$$ plain form
62331 862841 818594 778083 741487 708957 680349 655177 633019 613732 597053 582155 567908
62320 567908 553498 538676 523539 508366 493555 479452 466105 453297 440869 429008 418220
62309 418220 408972 401234 394343 387471 380279 373044 366195 359950 354487 350141 347216 345665 345091 344988 344944
62294 344944 344790 344680 344923 345665 346839 348394 350367 352714 355372 358476 362176 366176 369982 373792 378558
62279 378558 384710 391316 397142 402296 408119 415534 424149 433041 441804 450666 460126 470777 483171 497627
62265 497627 514400 534093 557460 584682 615291 649167 687177 730422 779070 832384 889716
62254 889716 950844 1015163 1080838 1145017 1204775 1257780 1302272 1336773 1360144 1372056 1373281 1365240
62242 1365240 1349143 1325578 1294834 1257210 1212936 1162227 1105957 1046186 985590 926253 869148
62231H69148n4446n1240m7373m2999l8358l3709k9480k6030k3245k0686j8206
62220D83376j6089j4471j3051j1575j0226r207q290p197o167n668n626n449m834
62207C65526m071l457k918k385k068j982j616n18J024K352L261M002M626M906
62193C66682M986N511O813Q366R401R782R991J0420J1016J1574J2020J2331J2354
62180D91247J1861J0779R372Q200P780Q198R112J0186J1468J3245J5651J8634
62168F25733K2303K6979L2763L9078M4909M9384N2049N2691N1151M7404M1653
62157A086097L4277K5910J7568J0277M334r06o159j1463j6578k1745k7318l2772
62145A061522l6855l8931l9527l9342l8359l6399l3835l1206k8486k5342k1838
$$ plain form
62231 869148 814702 763462 716089 673090 634732 601023 571543 545513 522268 501582 483376
62220 483376 467287 452816 439765 428190 417964 408757 400467 393270 387103 381435 375809 370360 365526
62207 365526 361455 357998 355080 352695 350627 348645 347029 346511 347535 349887 353148 357150 361776 366682
62193 366682 371668 377179 383992 392358 401759 411541 421532 431952 442968 454542 466562 478893 491247
62180 491247 503108 513887 523259 531459 539239 547437 556549 566735 578203 591448 607099 625733
62168 625733 648036 675015 707778 746856 791765 841149 893198 945889 997040 1044444 1086097
62157 1086097 1120374 1146284 1163852 1174129 1178463 1177557 1171398 1159935 1143357 1121612 1094294 1061522
62145 1061522 1024667 985736 946209 906867 868508 832109 798274 767068 738582 713240 691402
62134F91402j8376j5176j2286r827p711n494l015q15O56J781L001L710K945R45
62120F31740r85k081k515k234q25J160J980N87k183m881p033q825j0107j0654
62106E83144j0662j0212q848o557m485l542k941j303J175L022L811M663O215P523
62092E61003P604P030P097Q108R299R984J0172J0232J0568J1488J2942J4462J5629
62079F95618J6495J7410J8584K0015K1601K3069K4117K4807K5579K6603K7384
62068I41282K7404K6901K6680K7220K8334K9625L0817L1569L1376K9809K6711
62057A257728K2087J6052R041J882m580r966j4429j8362k2234k6469l1225l6157
62045A143368m0576m3937m6060m6874m6247m4364m1999l9985l8373l6498l3931
$$ plain form
62134 691402 673026 657850 645564 635737 628026 622532 619517 618702 619358 621139 624140 627850 630795 631740
62120 631740 630755 628674 626159 623925 623100 624260 626240 626827 624644 619763 612730 603905 593798 583144
62106 583144 572482 562270 553422 546865 542380 538838 535897 534594 535769 538791 542602 547265 553480 561003
62092 561003 568607 575637 582734 590842 600141 610125 620297 630529 641097 652585 665527 679989 695618
62079 695618 712113 729523 748107 768122 789723 812792 836909 861716 887295 913898 941282
62068 941282 968686 995587 1022267 1049487 1077821 1107446 1138263 1169832 1201208 1231017 1257728
62057 1257728 1279815 1295867 1304908 1306790 1302210 1292244 1277815 1259453 1237219 1210750 1179525 1143368
62045 1143368 1102792 1058855 1012795 965921 919674 875310 833311 793326 754953 718455 684524
62034F84524l0998k8186k5420k2354j9105j6237j4057j2286j0555q924p773p301
62022D81328p242p107o665o205o181o648p163p314p094o634n885m824l688k652
62008C96026j451K69K273L886M812N396O073O896P717Q373Q560P856O202M134
61994D67022K292Q02o58k338m122n670o701p189p379p555p803q056q276q483q550
61979C87336q289p747p187o687n987m930l858l310l372l521l089j908m96L77M03
61964C27735ok11o0J08M3q7k3K74P45J396K125K674L034L680N057O884Q313Q858
61946C70539Q938R397J0633J2362J4142J5909J7898K0078K1921K2850K2845K2402
61934E69914K1891K1227K0206J8984J7970J7293J6470J4726J1688P848M257J576
$$ plain form
62034 684524 653526 625340 599920 577566 558461 542224 528167 515881 505326 496402 488629 481328
62022 481328 474086 466979 460314 454109 447928 441280 434117 426803 419709 413075 407190 402366 398678 396026
62008 396026 394575 394844 397117 401003 405815 411211 417284 424180 431897 440270 448830 456686 462888 467022
61994 467022 469314 470116 469458 467120 462998 457328 450627 443438 436059 428504 420701 412645 404369 395886 387336
61979 387336 379047 371300 364113 357426 351439 346509 342651 339341 335969 332448 329359 327451 326955 327332 327735
61964 327735 327729 327518 327458 327566 327609 327522 327499 327773 328518 329914 332039 334713 337747 341427 346484 353368 361681 370539
61946 370539 379477 388874 399507 411869 426011 441920 459818 479896 501817 524667 547512 569914
61934 569914 591805 613032 633238 652222 670192 687485 703955 718681 730369 738217 742474 744050
61922G44050n07k756n360p737r338j0196j0467r808p700m248k47L581P112J0512
61908F96891J3689J6192J7678J8239J8249J7810J6481J3729R650N011M39m141
61896H39917q985j3748j7618k0194k1818k2961k3669k3770k3348k2696k1965k1021
61884E98124j9644j7742j5482j3360j1975j1546j1646j1533j0724r237p451n888
61872D51896m929m485l934k717r81O03J734K842M402O229P751Q818R872J1361
61858D88462J3356J5717J8318K1043K3796K6594K9439L1981L3711L4551L5019
61847G71987L5549L5901L5444L3849L1209K7648K3116J7605J1333M756j558p104
61835A019735j1708j5414j8050j9069j8091j5391j1625p216k414K310O432R967
$$ plain form
61922 744050 743543 740787 735427 727690 718352 708156 697689 687881 680181 675933 675686 679267 686379 696891
61908 696891 710580 726772 744450 762689 780938 798748 815229 828958 838608 843619 844058 839917
61896 839917 830932 817184 799566 779372 757554 734593 710924 687154 663806 641110 619145 598124
61884 598124 578480 560738 545256 531896 519921 508375 496729 485196 474472 465235 457784 451896
61872 451896 446967 442482 438548 435831 434850 435453 437187 440029 444431 450660 458411 467229 477101 488462
61858 488462 501818 517535 535853 556896 580692 607286 636725 668706 702417 736968 771987
61847 771987 807536 843437 878881 912730 943939 971587 994703 1012308 1023641 1028397 1026839 1019735
61835 1019735 1008027 992613 974563 955494 937403 922012 910387 903171 900757 903067 909499 919466
61823I19466J3281J6147J7475J6276J2615P376J355n115j1883j8683k5062l0483
61811I12765l4567l7355l9200m0272m0318l9075l6659l3471k9932k6577k4072
61800E31267k2640k1609j9961j7439j4772j2728j1302r987q525p086n871m914
61788C74433m233l882l757l594l282k979k751k331j563r05r77j572j681q04K10
61773C40332K34n66q87l7J186J624J178O81P22J110J427J535J532J475J363J255
61757C54164J201J098O71k45j375k051j783q30L4L24K29J56K16K75L10M14N95
61740C53403P96R80J065Q67L22l14o34m12L21J363K356K868K741K278J931J904
61724C71835K173K724L495M223M643M758M721M577M368M273M279L927K834J389
$$ plain form
61823 919466 932747 948894 966369 982645 995260 1002636 1003991 998876 986993 968310 943248 912765
61811 912765 878198 840843 801643 761371 721053 681978 645319 611848 581916 555339 531267
61800 531267 508627 487018 467057 449618 434846 422118 410816 400829 392304 385218 379347 374433
61788 374433 370200 366318 362561 358967 355685 352706 349955 347624 346061 345156 344179 342607 340926 340122 340332
61773 340332 340566 340000 339113 339076 340262 341886 343064 343745 344467 345577 347004 348539 350071 351546 352909 354164
61757 354164 355365 356463 357134 356889 355514 353463 351680 350850 350884 351208 351437 351593 351809 352084 352394 352808 353403
61740 353403 354199 355179 356244 357111 357433 357119 356485 356073 356394 357757 360113 362981 365722 368000 369931 371835
61724 371835 374008 376732 380227 384450 389093 393851 398572 403149 407517 411790 416069 419996 422830 424219
61710D24219L72j30q42k161l587m544n148n686n888n423m746m653n073n138m537
61695C67035l972l986m092l638k979k979l667m130l784l065k623k435k072j494
61681C22119j104j131j298j182o57jL58J56n18j326j966k276k157j587p80j32
61665C06518J84L72O97J100J282J082O17K23L23J049J860J918J068K15K50R86
61649C19744J596J865K251K888L305L343L556M319N165N449N153M570L618K106
61635C68928L54j084k158l173m072m436m255m051m136m194l826l106k316j577
61621C26898r32n51m30j25Q07K147L089L039K132R72K5o61j286k047k974l936
61605C26167m729n258n627o019o400o453n923n030m322m067l957l556k919k531
$$ plain form
61710 424219 424591 424461 423619 421458 417871 413327 408179 402493 396605 391182 386436 381783 376710 371572 367035
61695 367035 363063 359077 354985 351347 348368 345389 341722 337592 333808 330743 328120 325685 323613 322119
61681 322119 321015 319884 318586 317404 316747 316746 317104 317260 316742 315416 313450 311174 309017 307430 306650 306518
61665 306518 306702 307074 307771 308871 310153 311235 311852 312075 312398 313447 315307 317225 318293 318508 318758 319744
61649 319744 321340 323205 325456 328344 331649 334992 338548 342867 348032 353481 358634 363204 366822 368928
61635 368928 369282 368198 366040 362867 358795 354359 350104 346053 341917 337723 333897 330791 328475 326898
61621 326898 325966 325415 324985 324860 325667 327814 330903 333942 336074 337046 337071 336410 335124 333077 330103 326167
61605 326167 321438 316180 310553 304534 298134 291681 285758 280728 276406 272339 268382 264826 261907 259376
61591B59376k670l079l307l180k853k543k386k412k466k253j645r59o71q81j249
61576B26822j486j673j935k104j985j776j790j871j508o33J50K59k41q85j333
61561B08011j410j029m17o6j62k61N7N87R30J202J695K097J842J095O32O82O15
61544B16100K1o68q76o11j33M67J013J151R81J173J948K472J922O82j74l47m25
61527B24696p75j085j119j137j397j732j854j756j608j532j560j643j645j511
61513B04342j383j408j466j290p73K4R78J707J567L03j396k428k373j707j015
61498A93682m90j77j44k91l37k33k24l78l69M5O13Q21M64j59n32l64J46N97R57
61479A93627J611K589L123K514J186K55O0j09o91j075n62M93J106R02L62O0J65
$$ plain form
61591 259376 256706 253627 250320 247140 244287 241744 239358 236946 234480 232227 230582 229623 228952 228071 226822
61576 226822 225336 223663 221728 219624 217639 215863 214073 212202 210694 210061 210211 210470 210229 209344 208011
61561 208011 206601 205572 205155 205089 204927 204666 204723 205310 206240 207442 209137 211234 213076 214171 214803 215485 216100
61544 216100 216121 215453 214577 213966 213833 214300 215313 216464 217445 218618 220566 223038 224960 225642 225468 225121 224696
61527 224696 223921 222836 221717 220580 219183 217451 215597 213841 212233 210701 209141 207498 205853 204342
61513 204342 202959 201551 200085 198795 198022 198046 199024 200731 202298 202601 201205 198777 196404 194697 193682
61498 193682 193192 193015 192871 192580 192243 192010 191786 191408 191039 191084 191697 192518 192982 192823 192291 191927 192073 192670 193627
61479 193627 195238 197827 200950 203464 204650 204905 204965 204856 204165 203090 202528 203021 204127 205029 205391 205451 205616
61462B05616N65J050J263R35K45k69k41K41Q33J259J360J094O00J85J07L30N64
61445B15737N32K56K5J07N34J148J768K222K383K295K243K490K990L483L750L723
61429B45686L370K740K028J384P46J1o03p46l66K19P51J240J691J959J938J738
61413B63786J537J413J361J302J027L36o89j752k677l445l913l814l221k673k587
61398B45991k693k379j527p53p57j507k206k106j226k25L57N40N54M95M67P23
61382B33748J231J392P43k09m21L52J244J465J285J440K019K394K125J468R62
61367B51238Q50J056J476K082K700L014K928K852L254L969M334M174M172M950
61353B93049O200P185P671P803P400O158M447L155K628K474K376K547L151L972
$$ plain form
61462 205616 206181 207231 208494 209429 209674 209405 209164 209405 210238 211497 212857 213951 214551 214736 214843 215173 215737
61445 215737 216269 216525 216550 216657 217191 218339 220107 222329 224712 227007 229250 231740 234730 238213 241963 245686
61429 245686 249056 251796 253824 255208 255954 255965 255362 254616 254250 254469 255220 256460 258151 260110 262048 263786
61413 263786 265323 266736 268097 269399 270426 270762 270073 268321 265644 262199 258286 254472 251251 248578 245991
61398 245991 243298 240919 239392 238639 237882 236375 234169 232063 230837 230612 230969 231509 232063 232558 233025 233748
61382 233748 234979 236371 237114 236905 236484 236836 238080 239545 240830 242270 244289 246683 248808 250276 251238
61367 251238 252088 253144 254620 256702 259402 262416 265344 268196 271450 275419 279753 283927 288099 293049
61353 293049 299249 306434 314105 321908 329308 335466 339913 343068 345696 348170 350546 353093 356244 360216
61339C60216M797N568O022N839N310N110N145M405K426J54j247j755k072k400
61325C97518k487k500k972l938m771m894m219k946j387P8J206K080K837L369L547
61310C80521L546L666M041M735N774O832P231O659N588M575L527K088M37r27j854
61295D36439k445k616k375k309k994m042m481m040l374k984k741k557k667k981
61281C93833k874k082j171o72k51O59J832K541K720L150M304N516N678M607L368
61266D21158L131L904M671M697M379M684N961P574Q529Q293P080N662M729M337
61252D98789M053L703L625M012M391M234L722L331K891J768q3j889l003l583m092
61237E21869m698n340n964o471o648o426n936n260m368l396k598j911r86K05J128
$$ plain form
61339 360216 365013 370581 376603 382442 387752 392862 398007 402412 404838 404992 403745 401990 399918 397518
61325 397518 395031 392531 389559 385621 380850 375956 371737 368791 367404 367482 368688 370768 373605 376974 380521
61310 380521 384067 387733 391774 396509 402283 409115 416346 423005 428593 433168 436695 438783 439220 438293 436439
61295 436439 433994 431378 429003 426694 423700 419658 415177 411137 407763 404779 402038 399481 396814 393833
61281 393833 390959 388877 387706 387034 386783 387442 389274 391815 394535 397685 401989 407505 413183 417790 421158
61266 421158 424289 428193 432864 437561 441940 446624 452585 460159 468688 476981 484061 489723 494452 498789
61252 498789 502842 506545 510170 514182 518573 522807 526529 529860 532751 534519 534436 532547 529544 525961 521869
61237 521869 517171 511831 505867 499396 492748 486322 480386 475126 470758 467362 464764 462853 461867 462072 463200
61222D63200J348J069Q38R57J442K286L443M622N378N409M672L377J988J074R19
61207E02022J300J725J900K000K501L689N194O185O276O132O872Q851J1292J3098
61193E79037J3690J3126J1827J0367R193Q319P487O668O103N853N630N239M798
61180F87337M450M137L852L700L566L040J947O54l48r05j088j061j241k102l511
61165G02427m697n285n929p324q984r767r416q844q814r117r244r222r271r096
61151E87417q097o207m181l046l391n060p324r322j0502j0748j0161q928p436
61138D93014o234n624n369m953m116k989j771n00Q44K154L254M023M494M907N684
61123D86818P207R410J1669J3262J4017J4427J5123J6300J7775J9418K1302K3288
$$ plain form
61222 463200 464548 465617 466455 467412 468854 471140 474583 479205 484583 489992 494664 498041 500029 501103 502022
61207 502022 503322 505047 506947 508947 511448 515137 520331 526516 532792 538924 545796 554647 565939 579037
61193 579037 592727 605853 617680 628047 637240 645559 653046 659714 665817 671670 677300 682539 687337
61180 687337 691787 695924 699776 703476 707042 710082 712029 712683 712335 711430 710342 709281 708040 705938 702427
61165 702427 697730 692445 686516 679192 670208 660441 651025 642181 633367 624250 615006 605784 596513 587417
61151 587417 579320 573113 568932 565886 562495 557435 550111 540789 530287 519539 509378 500450 493014
61138 493014 486780 481156 475787 470834 466718 463729 461958 461458 462302 464456 467710 471733 476227 481134 486818
61123 486818 494025 503435 515104 528366 542383 556810 571933 588233 606008 625426 646728 670016
61111F70016K4781K5225K4880K4681K5109K5441K4560K2348J9790J7680J5736
61100I20247J3262J0165O919L836R04j855m349o622q700j0370j1492j2453j3812
61087H85680j5585j7294j8609j9442j9546j8730j7533j6840j6705j6273j5121
61076F94002j3856j3021j2195j0805r150p904p071o123m910l729k725j781q29
61063E99903J92J479L079M676O020P190Q188Q728Q858R224J0225J1438J2461J3668
61049G05329J5485J7473J9028K0397K2171K4344K6751K9760L3486L6907L9125
61038I90256M0952M3792M7310M9838N0882N1549N2554N3643N5286N8978O5146
61027A560186P2354P9335Q6422R4211J02394J11005J21708J36912J58555J88295
$$ plain form
61111 670016 694797 720022 744902 769583 794692 820133 844693 867041 886831 904511 920247
61100 920247 933509 943674 950593 954429 955333 953478 949129 942507 933807 923437 911945 899492 885680
61087 885680 870095 852801 834192 814750 795204 776474 758941 742101 725396 709123 694002
61076 694002 680146 667125 654930 644125 634975 627071 620000 613877 608967 605238 602513 600732 599903
61063 599903 600095 601574 604653 609329 615349 622539 630727 639455 648313 657537 667762 679200 691661 705329
61049 705329 720814 738287 757315 777712 799883 824227 850978 880738 914224 951131 990256
61038 990256 1031208 1075000 1122310 1172148 1223030 1274579 1327133 1380776 1436062 1495040 1560186
61027 1560186 1632540 1711875 1798297 1892508 1994902 2105907 2227615 2364527 2523082 2711377
61017B711377K27522K76305L33567L99010M73674N58550O55752P72837R22316
61008G330910J110884J325456J527261J656380J644463J439334J041437N29996
61000A7606121M5582k74693l66005k57378l9883J78761K98983K41453k8394m69054
60990A6935493r63331j370993j600758j644771j555433j397262j216605j039034
60982F147306q77032p34660o10836n03817m13352l38899k78301k29292j90644
60973A970473j60933j37791j19379j05205r4601q5733p7183o9282o2726n6887
60963A000753n0675m4255l8672l4318l0866k8311k6942k6483k6155k5477k4389
60952F44210k2758k0509j8065j6029j4454j2871j0977q957p289o404o341o473
$$ plain form
61017 2711377 2938899 3215204 3548771 3947781 4421455 4980005 5635757 6408594 7330910
61008 7330910 8441794 9767250 11294511 12950891 14595354 16034688 17076125 17606121
61000 17606121 17651703 17377010 17011005 16753627 16713744 16892505 17191488 17432941 17404547 16935493
60990 16935493 15972162 14601169 13000411 11355640 9800207 8402945 7186340 6147306
60982 6147306 5270274 4535614 3924778 3420961 3007609 2668710 2390409 2161117 1970473
60973 1970473 1809540 1671749 1552370 1447165 1352564 1266831 1189648 1120366 1057640 1000753
60963 1000753 950078 905823 867151 832833 801967 773656 746714 720231 694076 668599 644210
60952 644210 621452 600943 582878 566849 552395 539524 528547 519590 512301 505897 499556 493083
60940D93083n972m818l942m107n005n857o351o553o413n995n829o339p065p138
60926D11699o404n611n456n876o285o149n366m321l527l046k467j561o61j85q2
60911C54702j1K12O63J428K292K656K239J543J211J159Q47J83m01o51p03o41l66
60894C66362L1J56k64j062j776k060k007k187l053m202m592l842k919l003l981
60879C31601m620m096k766j484p22m27k22L47J442K680L544L992M330M612M595
60864C42806M319M165M255M246L928L632L782M355M944N223N089M527L590K466
60850D01327J464Q76P80R00Q05L73p2k07j32r0j6K00J99o24k192l579l970l499
60832C92543k913k674k677k659k572k512k498k393k081j599j110p43n61n45m78
$$ plain form
60940 493083 487111 482293 478351 474244 469239 463382 457031 450478 444065 438070 432241 425902 418837 411699
60926 411699 405295 399684 394228 388352 382067 375918 370552 366231 362704 359658 357191 355630 354969 354784 354702
60911 354702 354691 354903 355566 356994 359286 361942 364181 365724 366935 368094 368941 369124 368723 368072 367369 366728 366362
60894 366362 366393 366549 366285 365223 363447 361387 359380 357193 354140 349938 345346 341504 338585 335582 331601
60879 331601 326981 322885 320119 318635 317913 317486 317264 317611 319053 321733 325277 329269 333599 338211 342806
60864 342806 347125 351290 355545 359791 363719 367351 371133 375488 380432 385655 390744 395271 398861 401327
60850 401327 402791 403667 404447 405347 406152 406525 406453 406246 406114 406024 406008 406208 406407 405783 403591 400012 396042 392543
60832 392543 389630 386956 384279 381620 379048 376536 374038 371645 369564 367965 366855 366112 365551 365006 364528
60817C64528N5J208K410K888K741K968M099N401N976O085O593P434P736P375P424
60802D34921Q694J0720J2614J4199J5722J6987J7563J7599J7786J8514J9470K0127
60790F24916K0309K0235K0158J9999J9354J7916J5860J3602J1251Q592N628K680
60778H00500j18l034o200r272j1856j3900j5418j6198j6232j6058j6244j6690
60766F59280j6916j6870j6935j7176j7093j6277j5041j4163j4070j4340j4113
60755D86286j3083j1990j1753j2231j2287j1190r421p826o621n682n152n122n176
60742C68752m992n018n734o582o590n882n478n637n504m661l891l862m023l471
60728B97427k258j133n45m72q00j230j226n80K64Q75J368J793J678Q15l1n4M44
$$ plain form
60817 364528 364583 365791 368201 371089 373830 376798 380897 386298 392274 398359 404952 412386 420122 427497 434921
60802 434921 443615 454335 466949 481148 496870 513857 531420 549019 566805 585319 604789 624916
60790 624916 645225 665460 685618 705617 724971 742887 758747 772349 783600 792192 797820 800500
60778 800500 800382 797348 791148 781876 770020 756120 740702 724504 708272 692214 675970 659280
60766 659280 642364 625494 608559 591383 574290 558013 542972 528809 514739 500399 486286
60755 486286 473203 461213 449460 437229 424942 413752 404331 396505 389884 384202 379050 373928 368752
60742 368752 363760 358742 353008 346426 339836 333954 328476 322839 317335 312674 308783 304921 300898 297427
60728 297427 295169 294036 293491 293019 292219 290989 289763 289183 289447 290322 291690 293483 295161 295976 295945 295891 296335
60711B96335O17L59J38q5o60j274j351j288k064l520m391m271m203m768m989l980
60695B60605k510j892k064k018j469r84q31p28n86n90o35m85k84k16P7Q68J493
60678B47751J115J67q5O04J206J141J005J198J032n8j331j658r80r0M90P58P36
60661B53001N40N64R79J321J216J175J918L154L849L642L194L100L274L539M092
60646B88558M918N354M807L596K630K331K241J645L61j103k024k100j718j575
60632C07921j991k696l205l309l105k726k260j874j800k030k220k059j724j668
60618B75254j925j918j249l77n9l31n56m46l94o66r63j059j204j436j185k47M07
60601B61646k50j704k342j523k30M30M19K00j44o29q63n26N1L13K61K52L37L19
$$ plain form
60711 296335 296952 297311 297449 297364 296704 295430 294079 292791 290727 287207 282816 278545 274342 269574 264585 260605
60695 260605 258095 256203 254139 252121 250652 249668 248837 248109 247523 246933 246298 245813 245529 245313 245390 246258 247751
60678 247751 248866 249033 248948 249552 250758 251899 252904 254102 255134 255076 253745 252087 251107 251017 251507 252265 253001
60661 253001 253541 254105 255084 256405 257621 258796 260714 263868 267717 271359 274553 277653 280927 284466 288558
60646 288558 293476 298830 303637 307233 309863 312194 314435 316080 316441 315338 313314 311214 309496 307921
60632 307921 305930 303234 300029 296720 293615 290889 288629 286755 284955 282925 280705 278646 276922 275254
60618 275254 273329 271411 270162 269785 269726 269395 268839 268393 267999 267333 266370 265311 264107 262671 261486 261239 261646
60601 261646 261396 259692 257350 255827 255597 256027 256446 256646 256502 255873 255010 254484 254535 254848 255109 255361 255698 256017
60583B56017L07O24J215J704K006K437L121L803M327M909N726O585P264P874Q622
60568C16541R338R546Q938P605N807L726J454r49l379n588p130p564o882n550
60554C25913m132k891j832r31j12Q72K199L607M610N155N762O775P781Q127P738
60539C68641P013O061M605K626O32q99j909k454k455k037j693j736j883j748j501
60524C71263j525j669j412p94n40j069j778j717p22M35R66Q70Q77J675L222M820
60508C72902N951O965Q681J1311J4096J6275J8042K0206K2995K5789K7982K9567
60496E80762L0617L0601K8720K4716J8911J1578K821o847j6270k4270l0233l3948
60484F17158l5347l4775l3121l1118k8620k5110k0906j7296j5218j4276j3337
$$ plain form
60583 256017 256324 256948 258163 259867 261873 264310 267431 271234 275561 280470 286196 292781 300045 307919 316541
60568 316541 325879 335425 344363 351968 357775 361501 362955 362006 358627 353039 345909 338345 331463 325913
60554 325913 321781 318890 317058 316127 316015 316887 319086 322693 327303 332458 338220 344995 352776 360903 368641
60539 368641 375654 381715 386320 388946 389578 388679 386770 384316 381861 379824 378131 376395 374512 372764 371263
60524 371263 369738 368069 366657 365863 365323 364254 362476 360759 360037 360472 361438 362308 363185 364860 368082 372902
60508 372902 378853 385818 394499 405810 419906 436181 454223 474429 497424 523213 551195 580762
60496 580762 611379 641980 670700 695416 714327 725905 728726 721879 705609 681339 651106 617158
60484 617158 581811 547036 513915 482797 454177 429067 408161 390865 375647 361371 348034
60473C48034j1756r758p867o384n343m708m390m201l820k935j611m67k06q63j763
60458B81962k293k419k349k113j778j728k235k957l224k762j852r46m57o84j491
60443B52674k141j950j025mQ13J488J803J345L36m45q20j500k782l739l398k142
60427B38513j104n41K44J532K695L198L263L227K911K073J025K58j80n44p57m87
60411B55326K30Q32Q32L58l7K3M62R63J358J729K154K469K391J840J078N19M73
60394B73000R95J810K397K401K015J772J894K026J727J031L69J27M00J045J715
60379B94724K001J816J579J756K191K247J698J081R50J102R85O06N33R52J318
60364C15539J151O99M45M03L99P04J660K825L318L123L306M523O078O945P101
$$ plain form
60473 348034 336278 326520 318653 312269 306926 302218 297828 293627 289807 286872 285261 284794 284588 283725 281962
60458 281962 279669 277250 274901 272788 271010 269282 267047 264090 260866 258104 256252 255306 254849 254165 252674
60443 252674 250533 248583 247558 247554 248367 249855 251658 253003 253339 252894 252074 250574 247792 244053 240655 238513
60427 238513 237409 236868 237112 238644 241339 244537 247800 251027 253938 256011 257036 257294 257114 256570 255813 255326
60411 255326 255556 256388 257220 257578 257541 257564 258026 258989 260347 262076 264230 266699 269090 270930 272008 272527 273000
60394 273000 273995 275805 278202 280603 282618 284390 286284 288310 290037 291068 291437 291564 291964 293009 294724
60379 294724 296725 298541 300120 301876 304067 306314 308012 309093 310043 311145 312130 312736 313269 314221 315539
60364 315539 316690 317389 317834 318237 318636 319340 321000 323825 327143 330266 333572 338095 344173 351118 358219
60349C58219P117O984O245N089M245L722K581L24k295m249n461o459p330p643
60335C61089p147o107m950m043l604l562l478k961k157j630j791k535l311l418
60321C10395k545j129j5M55P55J393K210K747K964L181L584M167N025O180P403
60306C46770Q565R983J1839J3473J3899J2933J1178Q924N868K042j727m672o813
60293D32262q473r629j0183j0413j0612j0635j0194r362q348p069n464l960l012
60280C24908k413j664r56j002j834k522k441k133k374k857k588j384j97R1m32
60265C00202j218j993k627k776k291j638j352j252p69M5N64O56Q36J217J160M28
60249B89192j14K92J005Q62n7n09J64J374K325K810K757J964P45K1K23O55N12
$$ plain form
60349 358219 365336 372320 378565 383654 387899 391621 394202 394526 392231 387982 382521 376062 368732 361089
60335 361089 353942 347835 342885 338842 335238 331676 328198 325237 323080 321450 319659 317124 313813 310395
60321 310395 307850 306721 306706 307161 307916 309309 311519 314266 317230 320411 323995 328162 333187 339367 346770
60306 346770 355335 365318 377157 390630 404529 417462 428640 437564 443432 445474 443747 439075 432262
60293 432262 423789 414160 403977 393564 382952 372317 362123 352761 344413 337344 331880 327920 324908
60280 324908 322495 320831 319875 318873 317039 314517 312076 309943 307569 304712 302124 300740 300543 300634 300202
60265 300202 298984 296991 294364 291588 289297 287659 286307 285055 284286 284331 284895 285551 286387 287604 288764 289192
60249 289192 289078 289370 290375 291237 291180 290671 290835 292209 294534 297344 300101 302065 302810 302831 303054 303709 304221
60232C04221N2J40R32J675J756J352J069J247J727K092K110J870J545J092M91
60217C23371J20M14J141J615J715K074K943L641L631L472L959M793N005M424L830
60202C66148L716L737L529L295L293L383L377L393L508L444K884J915R76M49M48
60187D07495P60R21O04p4p86j514k457l407l691l042k104j789k305l111l586l473
60171C78441k846j966j222r60j237j832k454k847k830k431j895j382p08L95J694
60156C55920K456K287J725J676K277K794K626K031J511J044M48J69R27K502L646
60141C84039L562K900K840L610M400M513M058L508L078K642K065J419Q89M77n4
60126D23946p42j079n02P05J533J393P77M87O89J024J178R68L08n01q00l96J45
$$ plain form
60232 304221 304273 304413 305345 307020 308776 310128 311197 312444 314171 316263 318373 320243 321788 322880 323371
60217 323371 323491 323905 325046 326661 328376 330450 333393 337034 340665 344137 348096 352889 357894 362318 366148
60202 366148 369864 373601 377130 380425 383718 387101 390478 393871 397379 400823 403707 405622 406598 407047 407495
60187 407495 408255 409176 409780 409706 408920 407406 404949 401542 397851 394809 392705 390916 388611 385500 381914 378441
60171 378441 375595 373629 372407 371447 370210 368378 365924 363077 360247 357816 355921 354539 353831 354226 355920
60156 355920 358376 360663 362388 364064 366341 369135 371761 373792 375303 376347 376795 376964 377891 380393 384039
60141 384039 387601 390501 393341 396951 401351 405864 409922 413430 416508 419150 421215 422634 423523 424000 423946
60126 423946 423204 422125 421623 422328 423861 425254 426031 426518 427207 428231 429409 430377 430685 430184 429384 428988 429133
60109D29133L42M71Q14Q33Mj100j536j463j785k493k622j928j371j608k039j908
60093D11744j410j120j046q92o68m53m6O75J439K024K582L130L240K678J917J515
60077D25309J419J270R80N50j43r46j287j082j212k445m249n449n683n474n132
60062C96426m528l885l824m372m696m183l243k672k609k515j963j118m58j71K3
60047C56212M84J133J575J763K138K910L589L584L033K632K761L228L643L675
60033C92360L097K030J036M76k6j045k354l152l258l430m266n394o062o089n852
60018C58071n674n582n527n464n303m942m374l659k885k181j643j222p52j33N70
60003C09300J161J353R48J74l37j57M55R01R77Q66O53L00K3J95P46J175J251J243
$$ plain form
60109 429133 429475 429946 430760 431593 431597 430497 428961 427498 425713 423220 420598 418670 417299 415691 413652 411744
60093 411744 410334 409214 408168 407276 406608 406155 406109 406784 408223 410247 412829 415959 419199 421877 423794 425309
60077 425309 426728 427998 428978 429528 429385 428439 427152 426070 424858 422413 418164 412715 407032 401558 396426
60062 396426 391898 388013 384189 379817 375121 370938 367695 365023 362414 359899 357936 356818 356360 356189 356212
60047 356212 356696 357829 359404 361167 363305 366215 369804 373388 376421 379053 381814 385042 388685 392360
60033 392360 395457 397487 398523 398999 398973 397928 395574 392422 389164 385734 381468 376074 370012 363923 358071
60018 358071 352397 346815 341288 335824 330521 325579 321205 317546 314661 312480 310837 309615 308863 308730 309300
60003 309300 310461 311814 312762 312936 312599 312442 312897 313798 314775 315641 316294 316594 316617 316812 317558 318733 319984 321227
59985C21227J398J624J855K204K532K376J679J073J070J330J229P73M31L07Q3
59970C41191l21n85n08j42M54J172J543J069Jp14n09J84O47P62Q31Q60M86l92
59952C46029j377j983k012j571r08k88J97O03Q40N45m18j475j792j364j137j815
59936C32074k877l166k288j012l38n40j179j713j917j828j531j028l12M89J130
59921C13964J472J622J721J780J768J759J809J848J880K139K782L563M087M251
59907C46445M092L461K341J407J601K973M434M926M403L425K345J223J62p39j564
59892C80935k337k760k545j766p02M85J658K616L362M185N091N567N260M585M196
59877D07830M164M186M185M073L313J575l41j290j415j997l409m400l889k503
$$ plain form
59985 321227 322625 324249 326104 328308 330840 333216 334895 335968 337038 338368 339597 340370 340801 341108 341191
59970 341191 340870 340285 339777 339635 340089 341261 342804 343873 343874 343160 342651 342835 343482 344244 345075 345935 346421 346029
59952 346029 344652 342669 340657 339086 338178 337890 338087 338690 339530 340075 339657 338182 336390 335026 333889 332074
59936 332074 329197 326031 323743 322731 322393 321853 320674 318961 317044 315216 313685 312657 312345 312834 313964
59921 313964 315436 317058 318779 320559 322327 324086 325895 327743 329623 331762 334544 338107 342194 346445
59907 346445 350537 353998 356339 357746 359347 362320 366754 371680 376083 379508 381853 383076 383238 382499 380935
59892 380935 378598 375838 373293 371527 370825 371310 372968 375584 378946 383131 388222 393789 399049 403634 407830
59877 407830 411994 416180 420365 424438 427751 429326 428985 427695 426280 424283 420874 416474 412585 410082
59863D10082j506r81j15J253K481L391M563O097P053O568M946L138J564j1j693
59848D46830l055l487k661q22J032J463l13l571o679q655r720j0252r900q252
59834C81958n864l819k440j123M74J765K007J194rq54q42k7Q01P25k46j222j725
59817C70753k222k956l158k250j141j145k014k252j341m08m05q38q00l48j17k86
59801C49072n62q49j169j334j226j216j739k624l227l210k809k430k318k471k710
59786C19178k858k955l129l154k586j491n60k29j42J09K14k49q23n88N23J599
59770C02859K025K130K376K526K068J141M99O90J485K126K052J428R84J289K216
59755C27894L201L888M240M154L452K372J668J899K785L467L349K597J879J736
$$ plain form
59863 410082 408576 407595 407480 408733 411214 414605 419168 425265 432318 438886 443832 446970 448534 448523 446830
59848 446830 443775 440288 437627 436805 437837 439300 438987 435416 428737 420082 410362 400110 390210 381958
59834 381958 376094 372275 369835 368712 369186 370951 372958 374152 374143 373289 372447 372420 373221 373946 373700 372478 370753
59817 370753 368531 365575 362417 360167 359026 357881 355867 353615 352274 351866 351461 350623 349823 349475 349358 349072
59801 349072 348510 347661 346492 345158 343932 342716 340977 338353 335126 331916 329107 326677 324359 321888 319178
59786 319178 316320 313365 310236 307082 304496 303005 302445 302216 302074 302183 302397 302148 301325 300737 301260 302859
59770 302859 304884 307014 309390 311916 313984 315125 315624 316314 317799 319925 321977 323405 324389 325678 327894
59755 327894 331095 334983 339223 343377 346829 349201 350869 352768 355553 359020 362369 364966 366845 368581
59741C68581K149K625K714K391J905J383Q13L48K84O92J275J680J693J195K25
59726C89953p55j062m97M14J039J222J036M17n18j180j100o53n65q36q00j96N30
59709C86449J090J726K386K385J420K80j12J42L64M35O38P46L24k88k10O22J299
59692C99696J287R84P32J71q60j724j844j541j353j158o40j18j21n26q22r35j159
59675C90069j553k028k645l209l069k111j489k318l946m676m050l179k824k489
59661C50483j735j029o66l3J204K106J659L42m12pR74J813K256K156J408L41l76
59644C60484l64J74P33Q46L61l90q11p14m79m03k31K68O98N79J90K51P82R72K57
59625C63203r23j671j656j370j494k116k660k610k153j885j988k175k312k530
$$ plain form
59741 368581 370730 373355 376069 378460 380365 381748 382561 382909 383193 383885 385160 386840 388533 389728 389953
59726 389953 389198 388136 387639 388053 389092 390314 391350 391767 391249 390069 388969 388316 387751 386915 386115 385919 386449
59709 386449 387539 389265 391651 394036 395456 395736 395624 395766 396130 396565 397203 397949 398273 397985 397775 398397 399696
59692 399696 400983 401967 402699 402870 402010 400286 398442 396901 395548 394390 393750 393632 393511 392985 392163 391228 390069
59675 390069 388516 386488 383843 380634 377565 375454 373965 371647 367701 363025 358975 355796 352972 350483
59661 350483 348748 347719 347053 347020 348224 350330 351989 352331 351919 351912 352886 354699 356955 359111 360519 360860 360484
59644 360484 360120 360294 361027 361873 362234 361844 361033 360319 359840 359437 359206 359474 360172 360751 360941 361192 361974 362946 363203
59625 363203 362280 360609 358953 357583 356089 353973 351313 348703 346550 344665 342677 340502 338190 335660
59611C35660k544j648J39J660J978J675K010L126L897L449K057O14j80j12M68
59596C52249P70K89n77j033q79n19j55L27P38N57l04j296j933k209k180j802j344
59579C40699j363j972k523k410j752j059n57k11m8j29l54n16n11l01J25O68J172
59562C28958J538J690J477Q92K97Q8J67J97K70P89J648K147J946J590J806K700
59546C48200L879M962N709O106O607P925J0231J2883J5159J6775J7229J5258R899
59533D80822K117n287r744j0728r538p701n851l948k034l85R44K202L372L976
59519D38217L770L284L143L154K695J736P34l15j802l505m717n435o440p850q705
59504D17964q476p868p455o711n310m298m599n234m529k657j389j465j795j358
$$ plain form
59611 335660 333116 331468 331607 333267 335245 336920 338930 342056 345953 349402 351459 352073 351893 351781 352249
59596 352249 353019 353308 352731 351698 350819 350300 350145 350472 351210 351767 351463 350167 348234 346025 343845 342043 340699
59579 340699 339336 337364 334841 332431 330679 329620 329063 328852 328804 328675 328321 327805 327294 326993 327118 327786 328958
59562 328958 330496 332186 333663 334555 334852 334940 335107 335304 335574 336363 338011 340158 342104 343694 345500 348200
59546 348200 352079 357041 362750 368856 375463 383388 393619 406502 421661 438436 455665 470923 480822
59533 480822 482939 477652 467908 457180 447642 439941 434090 430142 428108 427723 428667 430869 434241 438217
59519 438217 441987 445271 448414 451568 454263 455999 456733 456418 454616 451111 446394 440959 434519 426669 417964
59504 417964 409488 401620 394165 387454 382144 377846 373247 368013 363484 360827 359438 357973 356178 354820
59490C54820m74K57R19J645J997J745J490J887K775L581M102M482M893N517O363
59475C95999O867O315M925L820L502L147J899K34p08n97NO57J344K041K628L206
59459D35284L927M588M943N284O213P820R478J0531J0920J1121J1673J2615J3218
59446E47615J2485J0103O695L043o11m236p507j0054j1818j2755j2544j1188r499
59433D99729q448q189q270q423q568q295p178n421l542j570P50L111M932O350
59419D46968Q085J0249J2267J4049J6280J9122K1592K2615K1846J9006J3441N286
59407F30806l528j0373j3912j4493j2977r958n959j695J965L990L304o01p023
59394E59546j4227k0181k3346k3248k0741j7377j4231j1500r212p657o792n908
$$ plain form
59490 354820 354346 354603 355522 357167 359164 360909 362399 364286 367061 370642 374744 379226 384119 389636 395999
59475 395999 402866 409181 414106 417926 421428 424575 426474 426708 426000 425403 425408 426065 427409 429450 432078 435284
59459 435284 439211 443799 448742 454026 460239 468059 477537 488068 498988 510109 521782 534397 547615
59446 547615 560100 570203 576898 579941 579330 575094 567587 557533 545715 532960 520416 509228 499729
59433 499729 491281 483092 474822 466399 457831 449536 442358 436937 433395 431825 432575 435686 440618 446968
59419 446968 455053 465302 477569 491618 507898 527020 548612 571227 593073 612079 625520 630806
59407 630806 627278 616905 602993 588500 575523 565565 559606 557911 559876 563866 567170 566569 559546
59394 559546 545319 525138 501792 478544 457803 440426 426195 414695 405483 397826 391034 385126
59382C85126m519l026j982j197l26K45rn93m69M41J207J352J361J628J813J651
59366C82703J508J751K126K259K282K518K943L328L647L993M396M923N721O734
59352D30832P654Q389R272J0545J1896J2786J3114J3290J3746J4483J5063J4993
59340E76063J4184J2978J1623R937P738N368L311J470o31k970m987o460p814r333
59326F10477j0647j1301j1364j1236j1117j0991j0704r933q435o499m720l206
59314E00324j546K99J723K444L137M575O557Q097Q209O192J815m045r369j2456
59300E15956j3321j3167j2762j1888j0209p919n494l386k005j470j335r45j30
59287D31925P41J425K087K859L433L322K403J225O92J313K641L735M316N016O306
$$ plain form
59382 385126 380607 377581 375599 374402 374076 374321 374312 373719 373250 373691 374898 376250 377611 379239 381052 382703
59366 382703 384211 385962 388088 390347 392629 395147 398090 401418 405065 409058 413454 418377 424098 430832
59352 430832 438486 446875 456147 466692 478588 491374 504488 517778 531524 546007 561070 576063
59340 576063 590247 603225 614848 624785 632523 637891 641202 642672 642041 639071 634084 627624 619810 610477
59326 610477 599830 588529 577165 565929 554812 543821 533117 523184 514749 508250 503530 500324
59314 500324 498778 499077 500800 503244 506381 510956 517513 525610 533819 540011 541826 537781 528412 515956
59300 515956 502635 489468 476706 464818 454609 446690 441196 437810 435805 434335 433000 432055 431925
59287 431925 432666 434091 436178 439037 442470 445792 448195 449420 450112 451425 454066 457801 462117 467133 473439
59272D73439P625Q108P794P523P789Q354Q839R072Q802P701N834L747J859J13
59258E66599j700l566n336o924q253r157r463r176q583q123p973p711o730n143
59244D68761l826l339l185k530j297m6Q85J609K200K631L020L513L960M142M078
59229D80576L805L101J964R75M97q5j537l451m698n059n421o301p179p567p661
59214D41959p639p185o240n408n065m683l664k253j084l10K38M98M33M11P29J053
59198D01790R48P04J012J955K864L157K835K199J524J030Q54R01R29Q00N97O21
59182D24720J231K460L703M169L763L161K908K940L176L921N205O194O062N137
59168D78750M563M911N754O509P036P302P111O413N562M929M447L713K481R97
$$ plain form
59272 473439 481064 489172 496966 504489 512278 520632 529471 538543 547345 555046 560880 564627 566486 566599
59258 566599 564899 561333 555997 549073 540820 531663 522200 513024 504441 496318 488345 480634 473904 468761
59244 468761 464935 461596 458411 455881 454584 454538 455423 457032 459232 461863 464883 468396 472356 476498 480576
59229 480576 484381 487482 489446 490421 490918 490833 489296 485845 481147 476088 470667 464366 457187 449620 441959
59214 441959 434320 427135 420895 415487 410422 405739 402075 399822 398738 398428 398666 399164 399597 400008 400737 401790
59198 401790 402738 403442 404454 406409 409273 412430 415265 417464 418988 420018 420872 421773 422702 423502 424099 424720
59182 424720 425951 428411 432114 436283 440046 443207 446115 449055 452231 456152 461357 467551 473613 478750
59168 478750 483313 488224 493978 500487 507523 514825 521936 528349 533911 538840 543287 547000 549481 550478
59154E50478j55p03j161k390m422o135o498n821n218n180n330n481n929o541o459
59139D83055n329m121m020m854n370m911m083l649l490k954j795l75Q24J582J981
59124D42491K294K837L707M657N376N816O172O648P310Q031Q507Q425P902P469
59110E27642P481P634P421O874O378N942N227M322L818L864L781L015J916J122
59096E96437N71k35j326k235k660k608k062j131m23n97j468k121k067j789k018
59081E74268k878l959m922n755o588p408p957p994p694p486p400o994o194n629
59067D85410n621n424m316k939k516k989l085k228j251j001j346j840k328k432
59053D46094j503L05J772K082J734J520J380J048Q62J151J468J372J310J784K230
$$ plain form
59154 550478 550323 549620 548459 546069 541647 535512 529014 523193 517975 512795 507465 501984 496055 489514 483055
59139 483055 477726 473605 469585 464731 459361 454450 450367 446718 443228 440274 438479 438104 438928 440510 442491
59124 442491 444785 447622 451329 455986 461362 467178 473350 479998 487308 495339 503846 512271 520173 527642
59110 527642 535123 542757 550178 557052 563430 569372 574599 578921 582739 586603 590384 593399 595315 596437
59096 596437 597008 596773 595447 593212 590552 587944 585882 584751 584328 583731 582263 580142 578075 576286 574268
59081 574268 571390 567431 562509 556754 550166 542758 534801 526807 519113 511627 504227 497233 491039 485410
59067 485410 479789 474365 470049 467110 464594 461605 458520 456292 455041 454040 452694 450854 448526 446094
59053 446094 444591 444896 446668 448750 450484 452004 453384 454432 455294 456445 457913 459285 460595 462379 464609
59038D64609J804Q35M37R41J746K500L338M076M322M378N034O245O958O578N696
59023E19497N140N057N290N897O809P590P929P948P682O838N388L939L030K470
59009F00504J810J086O00K89j37n32l61N93J918L047L733M053M233M590N347O253
58993F37026O550N656L916K399J804J734J278Q8j485l069m586n812o318o113n790
58978F27278n630n026l396j235L68J102J637K502L470M200M811N591O497P282
58964F49451P726P679P138O501O346O674O700N656L687J647J25j071k542m624
58950G01093p095r412j1085j1896j1858j1157j0137r189q430p596o495n442m991
58937E86310n200n509n483n364n638o173o201n202l541k053j129n27M3M93O44
$$ plain form
59038 464609 466413 467248 467685 468626 470372 472872 476210 480286 484608 488986 494020 500265 507223 513801 519497
59023 519497 524637 529694 534984 540881 547690 555280 563209 571157 578839 585677 591065 595004 598034 600504
59009 600504 602314 603400 604000 604289 604152 603620 603259 603852 605770 608817 612550 616603 620836 625426 630773 637026
58993 637026 643576 649232 653148 655547 657351 659085 660363 660451 658966 655897 651311 645499 639181 633068 627278
58978 627278 621648 616622 613226 611991 612359 613461 615098 617600 621070 625270 630081 635672 642169 649451
58964 649451 657177 664856 671994 678495 684841 691515 698215 703871 707558 709205 709330 708259 705717 701093
58950 701093 693998 684586 673501 661605 649747 638590 628453 619264 610834 603238 596743 591301 586310
58937 586310 581110 575601 570118 564754 559116 552943 546742 541540 537999 535946 534817 534290 534333 534826 535470
58922E35470O46P72J047J354J732K246K674K806K952L663M853N754N910N758N961
58907E83598O567P153P493P701P918Q136Q234Q058P595P121O893O708O144N298
58893F84617M798N023N848P289R713J2955J5919J7603J8142J8267J8152J7370
58881H35696J5728J3534J1156Q746O280L521K18l415o671r187j1387j3796j6290
58868H34133j8405j9838k0286j9371j7366j5404j4243j3412j2272j1307j1276
58857F60953j1664j1268j0084r312r464r723r399q801q370p961p493p366p648
58844E42400p631o736n329m085l103k153j390j215j679k428l115l582l758l571
58830D92625k926j822o80k12n52p61J29J680K472K006J383J787L079M225M558
$$ plain form
58922 535470 536116 536888 537935 539289 541021 543267 545941 548747 551699 555362 560215 565969 571879 577637 583598
58907 583598 590165 597318 604811 612512 620430 628566 636800 644858 652453 659574 666467 673175 679319 684617
58893 684617 689415 694438 700286 707575 717288 730243 746162 763765 781907 800174 818326 835696
58881 835696 851424 864958 876114 884860 891140 894661 894879 891464 884793 875606 864219 850423 834133
58868 834133 815728 795890 775604 756233 738867 723463 709220 695808 683536 672229 660953
58857 660953 649289 638021 627937 618625 609161 599438 590039 581238 572868 564907 557414 550048 542400
58844 542400 534769 528033 522704 518619 515516 513363 511973 510758 509079 506651 503536 499954 496196 492625
58830 492625 489699 487877 487197 486985 486433 485672 485801 487481 489953 491959 493342 495129 498208 502433 506991
58815E06991M125L276K435J978J943K006J959J966K140K184J637L46j382k912
58801E28692l603l279k412j596j031p32q89j492j946j800j529j772k011j142O65
58786E04123J952K032J829K250K978L539M368N820P061P126O425O025N911N106
58772E66545L257R80j287l598n634o621o499o235o522o836o419n581n203n283
58758E05064m883l610k344k013k205j757m67O36Q67Q81J566K694L369L455L658
58743E04911M340N055N413N618N979O415O664O573O112N422M939M946N114M911
58729E82412M451M324M627M841M675M294L724K780J706J117J060R69P52J033K002
58714F24767K908L179L179L300L139K379J742K126L182L618K695P92j341l214
$$ plain form
58815 506991 511116 514392 516827 518805 520748 522754 524713 526679 528819 531003 532640 532986 531604 528692
58801 528692 525089 521810 519398 517802 516771 516039 515150 513658 511712 509912 508383 506611 504600 503458 504123
58786 504123 506075 508107 509936 512186 515164 518703 523071 528891 535952 543078 549503 555528 561439 566545
58772 566545 569802 570782 569495 565897 560263 553642 547143 540908 534386 527550 521131 515550 510347 505064
58758 505064 500181 496571 494227 492214 490009 488252 487785 488421 489288 490169 491735 494429 497798 501253 504911
58743 504911 509251 514306 519719 525337 531316 537731 544395 550968 557080 562502 567441 572387 577501 582412
58729 582412 586863 591187 595814 600655 605330 609624 613348 616128 617834 618951 620011 620980 621732 622765 624767
58714 624767 627675 630854 634033 637333 640472 642851 644593 646719 649901 653519 656214 657006 655665 652451
58700F52451m624n691o819q270r780j0893j1469j1662j1519j0950r914q530p097
58687E35233o011n393m898m249l794l921m105l432k070j257j519j977j762j146
58673D89699o25P3J283K587L563M659O363Q145R179R614J0138J0657J0365Q930
58659E74630O728M134J347j250l258m678n563n650m927m132l886l729k955j989
58645E44822j876k546k781k010j047p73r75r09l54L64R22J251J499J945K702L432
58629E43666L713L639L698L966L857K860J248q5m34J55J030J733K532L941N790
58614E81309P195P624P441P136O581N421L764K031N33m70o90l06p7n09j306j974
58598F23703k482k824k673k054j807k520l478l497k379p41J069K957M385M825
$$ plain form
58700 652451 647827 642136 635317 627047 617267 606374 594905 583243 571724 560774 550860 542330 535233
58687 535233 529222 523829 518931 514682 510888 506967 502862 499430 497360 496103 494584 492607 490845 489699
58673 489699 489074 489147 490430 493017 496580 501239 507602 515747 524926 534540 544678 555335 565700 574630
58659 574630 581358 585492 586839 585589 582331 577653 572090 566440 561513 557381 553495 549766 546811 544822
58645 544822 542946 540400 537619 535609 534562 533789 532814 531905 531551 531915 532837 534088 535587 537532 540234 543666
58629 543666 547379 551018 554716 558682 562539 565399 566647 566562 566128 566283 567313 569046 571578 575519 581309
58614 581309 588504 596128 603569 610705 617286 622707 626471 628502 629035 628565 627875 627569 627492 626983 625677 623703
58598 623703 621221 618397 615724 613670 611863 609343 605865 602368 599989 599248 600317 603274 607659 612484
58584F12484M765N223O342P325P709P716P424O619N572N028N162N424N536N859
58570F98188O537P177P681Q563J0015J1375J2030J2270J2793J3772J4937J6110
58558H31448J7210J7940J7976J7278J5920J3704J0428O535L101R10l60j728l637
58545I46725n389o141o100o261p094q211r290j0523j1859j2680j2727j2631j2871
58532H24948j2825j1677r759q158p258o483n337l948k609j398k87P42J687K291
58518G59929K142J275M49L71R20J472J676J549J247J103J481K213K583K263J661
58503G82334J125M36m21q59o29l80n90p98n72l54m47j37J076K288K420J949K050
58486G88491K715L138L396M190N279N697N387N199N492O015O956Q670J0443J1020
$$ plain form
58584 612484 617249 622472 628814 636139 643848 651564 658988 665607 671179 676207 681369 686793 692329 698188
58570 698188 704725 711902 719583 728146 738161 749536 761566 773836 786629 800401 815338 831448
58558 831448 848658 866598 884574 901852 917772 931476 941904 948439 951540 952450 952090 950362 946725
58545 946725 941336 935195 929095 922834 915740 907529 898239 887716 875857 863177 850450 837819 824948
58532 824948 812123 800446 790687 782529 775271 768788 763451 759503 756894 755496 755209 755951 757638 759929
58518 759929 762071 763346 763795 764166 765086 766558 768234 769783 771030 772133 773614 775827 778410 780673 782334
58503 782334 783459 783895 783474 782615 781986 781606 781016 780218 779646 779292 778845 778708 779784 782072 784492 786441 788491
58486 788491 791206 794344 797740 801930 807209 812906 818293 823492 828984 834999 841955 850625 861068 872088
58472H72088J0349R432Q495O719L955J289l65j107j349j343j451j737j425O1J680
58457I05291J906J196J655L997O488P354O732N677M627L575K558J333n00k550
58443I49339l760l844l546l274k606j496o86l74K63J665L134M107M981O041O647
58428I56591O401O138O833Q228R359R979J0635J1626J2465J2307J0773Q522O823
58415A076680O151N541L971J898M90j66r10j865k398k491k734k897k123o18L75
58400A078904N48R11J952K976L648M605O022P065P375P633Q142Q232P705P353
58386A153071P437P125O122N441N681N998N606N033M994N260N439N755O158N924
58372A235044M943M315M816N879O792P750Q940R818J0160J0687J1859J3033J3636
$$ plain form
58472 872088 882437 891869 900364 907083 911038 912327 911962 910855 909506 908163 906712 904975 903550 903611 905291
58457 905291 907197 908393 910048 914045 920533 927887 934619 940296 944923 948498 951056 952389 951889 949339
58443 949339 945579 941735 938189 934915 932309 930813 930127 929753 930016 931681 934815 938922 943903 949944 956591
58428 956591 962992 969130 975963 984191 993550 1003529 1014164 1025790 1038255 1050562 1061335 1069857 1076680
58415 1076680 1082831 1088372 1092343 1094241 1094731 1094565 1093655 1091790 1089392 1086901 1084167 1081270 1079147 1078529 1078904
58400 1078904 1079452 1080363 1082315 1085291 1088939 1093544 1099566 1106631 1114006 1121639 1129781 1138013 1145718 1153071
58386 1153071 1160508 1167633 1173755 1179196 1184877 1190875 1196481 1201514 1206508 1211768 1217207 1222962 1229120 1235044
58372 1235044 1239987 1244302 1249118 1254997 1261789 1269539 1278479 1288297 1298457 1309144 1321003 1334036 1347672
58359A347672J4065J4747J5355J5584J5647J5442J4509J3237J2750J3014J2590
58348A504612J0912R259Q714Q787Q905R585J1022J2171J2451J2957J4740J7139
58336A641254J8890J9718J9862J9359J8749J9098K0366K1121K0667J9933J9507
58325A858524J8659J7268J6588J6896J6519J4715J3324J3857J4972J4946J4676
58314B030944J5778J7423J7740J7220J8049K0673K3405K5045K5868K6324K6567
58303B265036K7014K7936K8809K9243K9892L1317L2687L2869L2088L1397L1302
58292B599590L1859L3156L4735L5606L5766L6530L8503M0635M2095M3533M5463
58281C017471M7212M8534N0441N3283N5837N7517N9419O1994O3871O4405O4982
$$ plain form
58359 1347672 1361737 1376484 1391839 1407423 1423070 1438512 1453021 1466258 1479008 1492022 1504612
58348 1504612 1515524 1524783 1533497 1542284 1551189 1560774 1571796 1583967 1596418 1609375 1624115 1641254
58336 1641254 1660144 1679862 1699724 1719083 1737832 1756930 1777296 1798417 1819084 1839017 1858524
58325 1858524 1877183 1894451 1911039 1927935 1944454 1959169 1972493 1986350 2001322 2016268 2030944
58314 2030944 2046722 2064145 2081885 2099105 2117154 2137827 2161232 2186277 2212145 2238469 2265036
58303 2265036 2292050 2319986 2348795 2378038 2407930 2439247 2471934 2504803 2536891 2568288 2599590
58292 2599590 2631449 2664605 2699340 2734946 2770712 2807242 2845745 2886380 2928475 2972008 3017471
58281 3017471 3064683 3113217 3163658 3216941 3272778 3330295 3389714 3451708 3515579 3579984 3644966
58270C644966O6383O7344O7426O8492P1400P4059P5057P6345P9766Q3706Q6126
58259D461070Q8196R1882R6257R9559J02525J06561J10673J13543J16527J21286
58249E508079J26595J30758J35108J41741J49850J57673J65836J75453J85226
58240F876319J93982K03605K15846K28816K40385K52366K67203K83433K98819
58231I060774L15080L34858L56748L78337M01345M28655M59027M90128N23885
58222A2748837N63383O07401O53797P05219P65389Q33089R06042R87129J079988
58213A9850274J182596J292815J416383J561584J730772J926236K159644K445684
58205C3565988K791658L204885L705484M319443N064306N954866P015479Q269273
$$ plain form
58270 3644966 3711349 3778693 3846119 3914611 3986011 4060070 4135127 4211472 4291238 4374944 4461070
58259 4461070 4549266 4641148 4737405 4836964 4939489 5046050 5156723 5270266 5386793 5508079
58249 5508079 5634674 5765432 5900540 6042281 6192131 6349804 6515640 6691093 6876319
58240 6876319 7070301 7273906 7489752 7718568 7958953 8211319 8478522 8761955 9060774
58231 9060774 9375854 9710712 10067460 10445797 10847142 11275797 11734824 12224952 12748837
58222 12748837 13312220 13919621 14573418 15278637 16044026 16877115 17783157 18770286 19850274
58213 19850274 21032870 22325685 23742068 25303652 27034424 28960660 31120304 33565988
58205 33565988 36357646 39562531 43268015 47587458 52651764 58606630 65622109 73891382
58197G3891382R722120J1378863J3270297J5437862J7888101K0572702K3379972
58190A85541299K6072506K8202181K9130288K8186881K4850431J8874059J0435724
58183C51293369L26279j0049103j9069752k5530305k9044994k9967405k9007997
58176B08950092k6891194k4196798k1325601j8517148j5899469j3542478j1480169
58169G7097235r711119q210248o949209n900731n031527m306500l700361l196405
58161C0091135k776606k422053k120765j866295j650044j462431j299416j160377
58153A5333148j041003r34802q39944p58068o87874o25831n71703n27268m90578
58144H856077m57003m24972l95805l68983l42533l17058k94765k75242k56409
$$ plain form
58197 73891382 83613502 94992365 108262662 123700524 141588625 162161327 185541299
58190 185541299 211613805 239815986 268946274 297133155 321983586 340857645 351293369
58183 351293369 351619648 341570545 322500793 296970488 267925494 237958089 208950092
58176 208950092 182058898 157862100 136536499 118019351 102119882 88577404 77097235
58169 77097235 67386116 59175868 52226659 46325928 41294401 36987901 33287540 30091135
58161 30091135 27314529 24892476 22771711 20905416 19255372 17792941 16493525 15333148
58153 15333148 14292145 13357343 12517399 11759331 11071457 10445626 9873923 9346655 8856077
58144 8856077 8399074 7974102 7578297 7209314 6866781 6549723 6254958 5979716 5723307
58135E723307k38543k23231k09473j95064j80779j69158j59987j50986j42010
58126D054076j34599j28180j20737j12676j06273j01723r7210r2448q8658q5477
58116B986095q1334p6595p3093p0740o7776o4102o1295n9479n7235n4545n2809
58105B267092n1880m9904m6348m2676l9815l7321l5026l3247l1317k8181k4502
58094A846875k2094k1309k1000k0820k1391k2336k2414k1634k1195k1329k1200
58083A610153k0863k1229k2130k2393k1940k1825k2145k1872k0912k0339k0407
58072A374098k0127j9143j8232j7623j6531j4747j3194j2427j1921j1207j0475
58061A208471r829r074q386q211q378q390q445r050r791r763r067q653q704q490
$$ plain form
58135 5723307 5484764 5261533 5052060 4856996 4676217 4507059 4347072 4196086 4054076
58126 4054076 3919477 3791297 3670560 3557884 3451611 3349888 3252678 3160230 3071572 2986095
58116 2986095 2904761 2828166 2755073 2684333 2616557 2552455 2491160 2431681 2374446 2319901 2267092
58105 2267092 2215212 2165308 2118960 2076284 2036469 1999148 1964122 1930875 1899558 1871377 1846875
58094 1846875 1824781 1803472 1782472 1761652 1740261 1717925 1695511 1673877 1652682 1631353 1610153
58083 1610153 1589290 1568061 1545931 1523538 1501598 1479773 1457628 1435756 1414844 1394505 1374098
58072 1374098 1353971 1334828 1316596 1298973 1282442 1267695 1254501 1242074 1230153 1218946 1208471
58061 1208471 1198642 1189568 1181182 1172971 1164593 1156203 1147758 1138708 1128917 1119154 1110087 1101434 1092730 1084240
58047A084240p730o892o161n363m846n186n977o098n333m652m751n292n622n448
58033A004889m853m398m899o329p342o885n753n443n992o219n766n406n448n283
58019I24873m567l653k789j903j220j128j406j493j412j509j603j201l82M27J147
58004I02181J675J425K85n06J59J384J307k79j830k362k390k500k482k157j866
57989H92044j769j591j191o64Q0R78J333O49l27l93M97J420J956K317K358J723
57973H99420Q36N12O84O24L23M15J022J714K467L431L963L307K077J669K297K922
57957I27683L070L288L780L967L583K906J994Q89M76J581L311L896L188K718L201
57942I69531L740L855M344N580O635O906P021P389P363O689O327O752O787N309
$$ plain form
58047 1084240 1076510 1069618 1063457 1058094 1053248 1048062 1042085 1035987 1030654 1026002 1021251 1015959 1010337 1004889
58033 1004889 1000036 995638 990739 984410 977068 970183 964430 958987 952995 946776 941010 935604 930156 924873
58019 924873 920306 916653 913864 911961 910741 909613 908207 906714 905302 903793 902190 900989 900607 901034 902181
58004 902181 903856 905281 905566 905060 905219 906603 907910 907631 905801 903439 901049 898549 896067 893910 892044
57989 892044 890275 888684 887493 886829 886909 887887 889220 889869 889542 889149 889646 891066 893022 895339 897697 899420
57973 899420 900256 900768 901452 902076 902399 902814 903836 905550 908017 911448 915411 918718 920795 922464 924761 927683
57957 927683 930753 934041 937821 941788 945371 948277 950271 951160 951636 953217 956528 960424 963612 966330 969531
57942 969531 973271 977126 981470 987050 993685 1000591 1007612 1015001 1022364 1029053 1035380 1042132 1048919 1054228
57928A054228L040J418N13o55k384m002n033n702o371p082p501p012n284k949
57914A005224j293r02j108r55j79R53K145L126L708L981M039L620K618J785K030
57899A028792K994L398K806K102K052K378K524K325J700O66j13J56J045J186J81
57884A054192p99p80k00Q8p8o06j578k609k807j986j014l57N79K015K942K652
57868A049654K051K333L206L633L535L662M231M854N501O397P237P482P295P350
57854A118421P798Q173Q201Q039P705O965N867M838M259M106M048L645K684J466
57840A196215N99L21L53M87Q88J618K363K914L542M491N531O296O826P449Q334
57825A248227R363J0179J0368R861R116Q506P671O043L873J977N26r94k572l441
$$ plain form
57928 1054228 1057268 1058686 1059199 1058544 1056160 1052158 1047125 1041423 1035052 1027970 1020469 1013457 1008173 1005224
57914 1005224 1003931 1003029 1001921 1000966 1000787 1001740 1003885 1007011 1010719 1014700 1018739 1022359 1024977 1026762 1028792
57899 1028792 1031786 1035184 1037990 1040092 1042144 1044522 1047046 1049371 1051071 1051737 1051624 1051780 1052825 1054011 1054192
57884 1054192 1053393 1052613 1052413 1052501 1052423 1051817 1050239 1047630 1044823 1042837 1041823 1041466 1042045 1044060 1047002 1049654
57868 1049654 1051705 1054038 1057244 1060877 1064412 1068074 1072305 1077159 1082660 1089057 1096294 1103776 1111071 1118421
57854 1118421 1126219 1134392 1142593 1150632 1158337 1165302 1171169 1176007 1180266 1184372 1188420 1192065 1194749 1196215
57840 1196215 1196814 1197135 1197488 1197975 1198863 1200481 1202844 1205758 1209300 1213791 1219322 1225618 1232444 1239893 1248227
57825 1248227 1257590 1267769 1278137 1287998 1297114 1305620 1313291 1319334 1323207 1325184 1325710 1324716 1322144 1318703
57811A318703l348k977k744k106o92P91J511J712K238L364M710N890O713P080
57797A340845P147P205P092O271M757L409K939L211L841M783N869O533O554O500
57783A416956O943P731Q550R509J0636J1344J1078J0045Q768P390N962M896M532
57770A524340M540M304L632K732J812R91L15l31r90j253o92L53J102J491K127
57755A544473L018L403L200L406M567N881O474O609O887P193P172O971O806O571
57741A622631O454P002P968Q103O903N468M868M811M770N148O093O469N542M640
57727A706870N396P203Q158P923P753Q069Q013P338O910P101P225O971O969P594
57713A809493Q291Q518Q346P899P091O155N604N570N874O670Q141R674J0361J0255
$$ plain form
57811 1318703 1315355 1312378 1309634 1307528 1306836 1307627 1309138 1310850 1313088 1316452 1321162 1327052 1333765 1340845
57797 1340845 1347992 1355197 1362289 1368560 1373317 1376726 1379665 1382876 1386717 1391500 1397369 1403902 1410456 1416956
57783 1416956 1423899 1431630 1440180 1449689 1460325 1471669 1482747 1492792 1501560 1508950 1514912 1519808 1524340
57770 1524340 1528880 1533184 1536816 1539548 1541360 1542351 1542666 1542335 1541345 1540092 1539400 1539753 1540855 1542346 1544473
57755 1544473 1547491 1550894 1554094 1557500 1562067 1567948 1574422 1581031 1587918 1595111 1602283 1609254 1616060 1622631
57741 1622631 1629085 1636087 1644055 1652158 1659061 1664529 1669397 1674208 1678978 1684126 1690219 1696688 1702230 1706870
57727 1706870 1712266 1719469 1727627 1735550 1743303 1751372 1759385 1766723 1773633 1780734 1787959 1794930 1801899 1809493
57713 1809493 1817784 1826302 1834648 1842547 1849638 1855793 1861397 1866967 1872841 1879511 1887652 1897326 1907687 1917942
57699A917942J0212J0504J0682J0687J0876J0928J0033Q316O933O358N832M875
57687B024178M236M766O215P747Q984J0043J1153J2539J4194J5692J6785J8129
57675B154661K0593K3898K6958K9598L2757L6861M1114M4660M6954M6479M0679
57664B545212K8500J2277l816j6631k4920k8530k8056k4879k0487j5756j1260
57653B411654p648n024k602K14K858M547N625O947Q305Q730Q268Q249R486J1177
57639B470786J2082J2036J1777J1793J2039J2429J2967J3350J3057J2019J0927
57628B605262J0589J1084J1790J2132J2069J1858J1655J1530J1545J1629J1588
57617B732731J1421J1444J1849J2386J2789J3177J3711J4069J3789J3061J2581
$$ plain form
57699 1917942 1928154 1938658 1949340 1960027 1970903 1981831 1991864 2000180 2007113 2013471 2019303 2024178
57687 2024178 2028414 2033180 2039395 2047142 2056126 2066169 2077322 2089861 2104055 2119747 2136532 2154661
57675 2154661 2175254 2199152 2226110 2255708 2288465 2325326 2366440 2411100 2458054 2504533 2545212
57664 2545212 2573712 2585989 2582173 2565542 2540622 2512092 2484036 2459157 2438670 2422914 2411654
57653 2411654 2404006 2398982 2396380 2396594 2399452 2403999 2409624 2416571 2424876 2433606 2441874 2450123 2459609 2470786
57639 2470786 2482868 2494904 2506681 2518474 2530513 2542942 2555909 2569259 2582316 2594335 2605262
57628 2605262 2615851 2626935 2638725 2650857 2662926 2674784 2686439 2697969 2709514 2721143 2732731
57617 2732731 2744152 2755596 2767445 2779831 2792620 2805797 2819508 2833577 2847366 2860427 2873008
57606B873008J2706J3152J3560J3843J3964J3847J3607J3497J3508J3386J3077
57595C021155J2792J2574J2206J1678J1334J1451J1979J2719J3507J4184J4631
57584C160210J4959J5330J5695J5913J6035J6190J6356J6507J6722J6803J6230
57573C336950J5023J4278J4948J6471J7439J7470J7331J7336J6921J6048J5741
57562C515956J6614J7860J8410J8272J8049J7893J7723J7837J8492J9254J9537
57551C715897J9440J9424J9508J9431J9324J9455J9625J9468J9170J9228J9633
57540C929603J9926K0011K0200K0521K0560K0203J9889J9930K0034J9804J9366
57529D150047J9213J9562K0148K0571K0653K0440K0013J9515J9316J9899K1352
$$ plain form
57606 2873008 2885714 2898866 2912426 2926269 2940233 2954080 2967687 2981184 2994692 3008078 3021155
57595 3021155 3033947 3046521 3058727 3070405 3081739 3093190 3105169 3117888 3131395 3145579 3160210
57584 3160210 3175169 3190499 3206194 3222107 3238142 3254332 3270688 3287195 3303917 3320720 3336950
57573 3336950 3351973 3366251 3381199 3397670 3415109 3432579 3449910 3467246 3484167 3500215 3515956
57562 3515956 3532570 3550430 3568840 3587112 3605161 3623054 3640777 3658614 3677106 3696360 3715897
57551 3715897 3735337 3754761 3774269 3793700 3813024 3832479 3852104 3871572 3890742 3909970 3929603
57540 3929603 3949529 3969540 3989740 4010261 4030821 4051024 4070913 4090843 4110877 4130681 4150047
57529 4150047 4169260 4188822 4208970 4229541 4250194 4270634 4290647 4310162 4329478 4349377 4370729
57518D370729K3023K3980K3837K2977K2028K1401K1271K1609K2127K2500K2742
57507D618224K3092K3485K3493K2947K2188K1624K1325K1248K1435K1818K2092
57496D862971K2097K2021K2052K2159K2314K2557K2683K2347K1738K1664K2555
57485E107158K3799K4498K4475K4135K3749K3434K3457K3935K4384K4283K3907
57474E371214K3946K4383K4481K4003K3696K4222K5234K5939K6173K6324K6485
57463E646100K6287K5622K5020K5074K5801K6735K7510K8025K8199K7945K7449
57452E939767K7208K7532K8122K8331K7789K6773K5980K6043K7011K8226K8871
57441F241653K8748K8312K7942K7580K7267K7422K8139K8702K8450K7799K7626
$$ plain form
57518 4370729 4393752 4417732 4441569 4464546 4486574 4507975 4529246 4550855 4572982 4595482 4618224
57507 4618224 4641316 4664801 4688294 4711241 4733429 4755053 4776378 4797626 4819061 4840879 4862971
57496 4862971 4885068 4907089 4929141 4951300 4973614 4996171 5018854 5041201 5062939 5084603 5107158
57485 5107158 5130957 5155455 5179930 5204065 5227814 5251248 5274705 5298640 5323024 5347307 5371214
57474 5371214 5395160 5419543 5444024 5468027 5491723 5515945 5541179 5567118 5593291 5619615 5646100
57463 5646100 5672387 5698009 5723029 5748103 5773904 5800639 5828149 5856174 5884373 5912318 5939767
57452 5939767 5966975 5994507 6022629 6050960 6078749 6105522 6131502 6157545 6184556 6212782 6241653
57441 6241653 6270401 6298713 6326655 6354235 6381502 6408924 6437063 6465765 6494215 6522014 6549640
57430F549640K7889K7841K7446K7572K8526K9422K9481K9069K8873K8780K8368
57419F862907K7924K8093K8751K9100K8819K8483K8648K9133K9408K9302K9106
57408G179674K9086K9189K9155K8896K8624K8573K8577K8204K7369K6633K6724
57397G490704K7753K8990K9472K8880K7828K7179K7139K7259K7346K7802K8767
57386G799119K9516K9354K8660K8288K8229K7779K6914K6477K6852K7435K7629
57375H106252K7496K7135K6362K5441K5246K6043K6902K6860K6107K5370K4843
57364H394057K4361K4082K4254K4732K5328K6158K7098K7452K6852K6018K5808
57353H676200K6017K5863K5287K4887K4852K4885K4979K5348K5618K5022K3509
$$ plain form
57430 6549640 6577529 6605370 6632816 6660388 6688914 6718336 6747817 6776886 6805759 6834539 6862907
57419 6862907 6890831 6918924 6947675 6976775 7005594 7034077 7062725 7091858 7121266 7150568 7179674
57408 7179674 7208760 7237949 7267104 7296000 7324624 7353197 7381774 7409978 7437347 7463980 7490704
57397 7490704 7518457 7547447 7576919 7605799 7633627 7660806 7687945 7715204 7742550 7770352 7799119
57386 7799119 7828635 7857989 7886649 7914937 7943166 7970945 7997859 8024336 8051188 8078623 8106252
57375 8106252 8133748 8160883 8187245 8212686 8237932 8263975 8290877 8317737 8343844 8369214 8394057
57364 8394057 8418418 8442500 8466754 8491486 8516814 8542972 8570070 8597522 8624374 8650392 8676200
57353 8676200 8702217 8728080 8753367 8778254 8803106 8827991 8852970 8878318 8903936 8928958 8952467
57342H952467K2022K1452K1833K2500K2660K1829K0286J8987J8547J8482J7927
57331I178992J6877J6102J5969J6114J6115J5839J5205J4342J3977J4790J6288
57320I350610J7021J6243J4692J3465J2732J1977J1070J0513J0747J1552J2180
57309I492802J2044J1213J0269R662R401R348R419R373Q908Q188P840Q022Q093
57296I614582P634P140O991O516N029L193K197J875J015o17j937k338k458k792
57282I646030k809k133j525j880k973l933m361m372m084l726l808m593n666o494
57268I593673o992p242p111o643o337o574p133p694q410r446j0349j0506r978
57255I489258r405r229r486j0160j1279j2722j4315j6034j7837j9439k0585k1379
$$ plain form
57342 8952467 8974489 8995941 9017774 9040274 9062934 9084763 9105049 9124036 9142583 9161065 9178992
57331 9178992 9195869 9211971 9227940 9244054 9260169 9276008 9291213 9305555 9319532 9334322 9350610
57320 9350610 9367631 9383874 9398566 9412031 9424763 9436740 9447810 9458323 9469070 9480622 9492802
57309 9492802 9504846 9516059 9526328 9535990 9545391 9554739 9564158 9573531 9582439 9590627 9598467 9606489 9614582
57296 9614582 9622216 9629356 9636347 9642863 9647892 9651085 9653282 9655157 9656172 9655555 9653618 9651280 9648822 9646030
57282 9646030 9643221 9641088 9639563 9637683 9634710 9630777 9626416 9622044 9617960 9614234 9610426 9605833 9600167 9593673
57268 9593673 9586681 9579439 9572328 9565685 9559348 9552774 9545641 9537947 9529537 9520091 9509742 9499236 9489258
57255 9489258 9479853 9470624 9461138 9450978 9439699 9426977 9412662 9396628 9378791 9359352 9338767 9317388
57243I317388k2165k3165k4484k6167k8036k9711l1049l2348l3805l5125l5922
57232H995411l6297l6607l6898l6972l6792l6522l6222l5872l5572l5427l5322
57221H596908l5114l4939l5082l5542l5972l5940l5220l3968l2765l2193l2217
57210H217956l2212l1803l1373l1442l1943l2471l2975l3635l4262l4431l4286
57199G857123l4634l5967l7785l9200m0025m0857m2113m3273m3429m2488m1406
57188G415946m1100m1430m1622m1406m1116m0813m0075l8808l7628l6972l6349
57177F978627l4999l2923l0784k8993k7408k5839k4326k3003k1976k1368k1191
57166F685817k1286k1551k2163k3315k4884k6626k8549l0830l3409l5917l8033
$$ plain form
57243 9317388 9295223 9272058 9247574 9221407 9193371 9163660 9132611 9100263 9066458 9031333 8995411
57232 8995411 8959114 8922507 8885609 8848637 8811845 8775323 8739101 8703229 8667657 8632230 8596908
57221 8596908 8561794 8526855 8491773 8456231 8420259 8384319 8349099 8315131 8282366 8250173 8217956
57210 8217956 8185744 8153941 8122568 8091126 8059183 8026712 7993737 7960102 7925840 7891409 7857123
57199 7857123 7822489 7786522 7748737 7709537 7669512 7628655 7586542 7543269 7499840 7457352 7415946
57188 7415946 7374846 7333416 7291794 7250388 7209272 7168459 7128384 7089576 7051948 7014976 6978627
57177 6978627 6943628 6910705 6879921 6850928 6823520 6797681 6773355 6750352 6728376 6707008 6685817
57166 6685817 6664531 6642980 6620817 6597502 6572618 6545992 6517443 6486613 6453204 6417287 6379254
57155F379254l9830m1703m4112m7197n0598n3732n6263n8114n9122n9057n8042
57144E811484n6439n4228n0943m6471m1441l6486l1638k6807k2347j8690j5830
57133E410164j3728j2768j3218j4610j6286j8164k0275k1912k2092k0603j7725
57122E218783j3173o407K024J0576J8444K6218L4531M2995N1124N9447O8989Q0393
57110E593944R4251J11747J33975J60910J91889K27112K68017L16415L73990M42836
57100G915086N25797O25845P45315Q85691J047617J230738J433517J653162J885539
57091A7948307K125149K365245K597585K811416K992383L122665L182010L148171
57083D0292931K997112K706305K263466J677491R83915K39163m94385j164485
$$ plain form
57155 6379254 6339424 6297721 6253609 6206412 6155814 6102082 6045819 5987705 5928583 5869526 5811484
57144 5811484 5755045 5700817 5649874 5603403 5561962 5525476 5493838 5467031 5444684 5425994 5410164
57133 5410164 5396436 5383668 5370450 5355840 5339554 5321390 5301115 5279203 5257111 5236508 5218783
57122 5218783 5205610 5199203 5201227 5211803 5230247 5256465 5290996 5333991 5385115 5444562 5513551 5593944
57110 5593944 5688195 5799942 5933917 6094827 6286716 6513828 6781845 7098260 7472250 7915086
57100 7915086 8440883 9066728 9812043 10697734 11745351 12976089 14409606 16062768 17948307
57091 17948307 20073456 22438701 25036286 27847702 30840085 33962750 37144760 40292931
57083 40292931 43290043 45996348 48259814 49937305 50921220 51160383 50665998 49501513
57075D9501513j738441k203472k561101k820076k990751l081817l099480l048862
57067B7957513k936585k772622k570044k343036k104824j866674j637615j424147
57059A0301966j230003j056593r04011p71836o59168n64433m85387m19408l63826
57050C847301l16373k75604k40851k11600j86903j65463j46145j28315j11873
57041B064174r6934q3311p0018n5598l9257k1925o384L331K935j0134l4127o2162
57029A590590q5389r8224j00857r6996q9964q1305p1935o3017n5359m8829m2971
57018G55744l7786l3557l0215k7337k4691k2415k0687j9446j8502j7721j7053
57007D86334j6501j6082j5710j5165j4295j3216j2144j1100r916q533p079n662
$$ plain form
57075 49501513 47763072 45559600 42998499 40178423 37187672 34105855 31006375 27957513
57067 27957513 25020928 22248306 19678262 17335226 15230402 13363728 11726113 10301966
57059 10301966 9071963 8015370 7111359 6339523 5680355 5115922 4630535 4211127 3847301
57050 3847301 3530928 3255324 3014473 2802873 2615970 2450507 2304362 2176047 2064174
57041 2064174 1967240 1883929 1813911 1758313 1719056 1697131 1690747 1694078 1697013 1686879 1652752 1590590
57029 1590590 1505201 1406977 1306120 1209124 1119160 1037855 965920 902903 847544 798715 755744
57018 755744 717958 684401 654186 626849 602158 579743 559056 539610 521108 503387 486334
57007 486334 469833 453751 438041 422876 408581 395365 383221 372121 362205 353672 346593 340931
56995C40931m288k950j544K25K482M703O116O780P635R076J0057R323P145M909
56981D00600L117P83k916p315j1034j3446j4698j4874j3879j1985r827p787n880
56968B90859m171k842j781m70J459L751N787P257Q488R998J1697J2576J1480Q171
56954C62259L459j660o576j0767j3561j4622j4298j3146j1403r285p354o017m920
56941B52109l428j469O30K910N692Q828J1797J4467J7029J9003J9208J6984J2808
56928C76568P362Q12o431j2910j6975j8324j8117j7680j7534j7509j7161j6060
56916B26041j4109j1816r956q825q009o938n487m060l133k812k728k387j673r06
56902A43202l31K02R11J571J695J154L67j18L3R50K568M449N939O757P290Q153
$$ plain form
56995 340931 336643 333693 332149 332374 334856 339559 345675 352455 360090 369166 379223 388546 395691 400600
56981 400600 403717 404500 401584 394269 383235 369789 355091 340217 326338 314353 304526 296739 290859
56968 290859 286688 283846 282065 281595 283054 286805 292592 299849 308337 318335 330032 342608 354088 362259
56954 362259 365718 364058 357482 346715 333154 318532 304234 291088 279685 270400 263046 257029 252109
56941 252109 248681 247212 247842 250752 256444 265272 277069 291536 308565 327568 346776 363760 376568
56928 376568 383930 384742 378311 365401 348426 330102 311985 294305 276771 259262 242101 226041
56916 226041 211932 200116 190160 181335 173326 166388 160901 156841 153708 150896 148168 145781 144108 143202
56902 143202 142871 143073 143984 145555 147250 148404 148771 148653 148686 149636 152204 156653 162592 169349 176639 184792
56886A84792R436J0524J0561Q987N882J997j559m021n418o196o406n620l740j451
56872A97768N27K307M434O792Q606R653J0818J3054J6236J9527K2463K5063K6980
56859C64228K7132K4453J8700J0648J745o456j2902j7308j9713k0059j8496j5819
56847C36153j2934r902o109j517L053P100J1238J6185K1592K6628L1300L6232
56835D59019M1044M3869M2790L7250K7802J5234O23j4126k6685l5495m0247m1320
56823E09758l9260l4997k9881k4888j9970j4649r068l944M78M749R298J3820J7949
56810C79395K1966K6135K9591L0523K7605K0865J1282Q6j1400k1734k9600l4222
56798D50492l5628l4674l2471k9466k5281j9847j4323j0128p226m276o68K656
$$ plain form
56886 184792 194228 204752 215313 224300 230182 232179 230620 226599 221181 214985 208579 202959 199219 197768
56872 197768 198295 200602 205036 211828 220434 230087 240905 253959 270195 289722 312185 337248 364228
56859 364228 391360 415813 434513 445161 446906 440450 427548 410240 390527 370468 351972 336153
56847 336153 323219 313317 307208 305691 308744 315844 327082 343267 364859 391487 422787 459019
56835 459019 500063 543932 586722 623972 651774 667008 667631 653505 626820 591325 551078 509758
56823 509758 470498 435501 405620 380732 360762 346113 337045 333101 333579 338328 347626 361446 379395
56810 379395 401361 427496 457087 487610 515215 536080 547362 547448 536048 514314 484714 450492
56798 450492 414864 380190 347719 318253 292972 273125 258802 248674 241448 237172 236504 239160
56786B39160M862O647R213J2432J5050J6201J5779J3445Q616J682n624j1656j6106
56773C09701j9415k1548k1983k0698j8537j6447j4699j3050j1385r932q855p943
56761A25209o937o003n503n227m426k860j416j118j746k141j769j349j682k509
56747H0523k959k668j951j157l50L73P57P14M88L82M18L62J3n50r93j027p14l65
56729G1296j23J93O99J143J234J104J106J258J253R79O90N66N44N94Q25J068Q35
56712H5264M1n83l20N66J200J282J180R78K65q06j105R6J808K254R81o93j390
56695I1018j112p42p37q41p84o88p75r81j035p20o7O92J222J276Q41K02j90o1
56677H6518L66M62j49j028j278n48M59P37J28n15l63M16R61Q47N39O04Q27N35
$$ plain form
56786 239160 244022 250669 259882 272314 287364 303565 319344 332789 341405 343087 337463 325807 309701
56773 309701 290286 268738 246755 226057 207520 191073 176374 163324 151939 142007 133152 125209
56761 125209 118272 112269 106766 101539 97113 94253 92837 91719 89973 87832 86063 84714 83032 80523
56747 80523 77564 74896 72945 71788 71438 71811 72568 73282 73770 74152 74570 74932 74945 74395 73402 72375 71661 71296
56729 71296 71173 71366 72065 73208 74442 75546 76652 77910 79163 80142 80832 81398 81942 82536 83361 84429 85264
56712 85264 85305 84722 84402 84968 86168 87450 88630 89608 89873 89067 87962 88058 89866 92120 93101 92408 91018
56695 91018 89906 89164 88427 87586 86802 86114 85339 84358 83323 82603 82536 83228 84450 85726 86567 86769 86579 86518
56677 86518 86884 87346 87197 86169 84891 84343 84802 85539 85667 85152 84789 85205 86166 87013 87552 88156 88983 89518
56659H9518k83p10RJ501K663K826K226J541J213J210J196R45O67P55J153J277
56643A07707Q22K97L67R67J503J716J761J597R48q2r22j199j055p31k78K49P35
56626A14402J168J496J418Q23K97M80R67O62n95j694j853j614j772k103j924j266
56610A08892p62p21j011j430j673j300l39M60N35K19l5m63j246j569n92R81J535
56593A01481O97k88m54k19k60l64NP27J283J475J389R75J92o85j206j114m22N85
56575A03797J420J829K121K676L179K929K007J381J610K105K167K169L029M826
56561A37245O580P325O983O146N268M228K642O54q40j118o69p19j709k835l245
56546A65936l004k558k001j386j227j845k657k734j926q47N8P46J063P61Q8l16
$$ plain form
56659 89518 89235 88525 88534 90035 92698 95524 97750 99291 100504 101714 102910 103855 104522 105277 106430 107707
56643 107707 108529 108826 109193 110160 111663 113379 115140 116737 117685 117603 116681 115482 114427 113696 113418 113667 114402
56626 114402 115570 117066 118484 119307 119604 120084 121051 121713 121118 119424 117571 115957 114185 112082 110158 108892
56610 108892 108130 107409 106398 104968 103295 101995 101656 102116 102651 102870 102835 102372 101126 99557 98965 99946 101481
56593 101481 102178 101890 101436 101217 100957 100593 100598 101325 102608 104083 105472 106447 106639 105954 104748 103634 103212 103797
56575 103797 105217 107046 109167 111843 115022 117951 119958 121339 122949 125054 127221 129390 132419 137245
56561 137245 143825 151150 158133 164279 169547 173775 176417 177071 176231 175113 174444 173725 172016 169181 165936
56546 165936 162932 160374 158373 156987 155760 153915 151258 148524 146598 145751 145809 146555 147618 148379 148467 148151
56530A48151l20n19j290k079k072j290n68n27q95r53m14L13P03O97N68M23J13
56513A40041l21n21k82J14K73J92J83M59R64J520J866J697R33q4q31r85n46K63
56495A44935R83J073M08m84r26p90m50j70J32M99P25O66N45P05J112J295Q84J56
56477A51298j55K71Q07O06k24o59j11P52R86O49M94O61M66l59j031p56J22N69
56459A54386K63k8M50J453K063J790R71J97k95n03k84M64J383J803J455P30Q9
56442A66387m38r58j227q85k2Q16J202J138Q53N56M14N11P30Q83R44J058J283
56425A73245J477J444J077M04l62q35p14j20M76O91N82N10P36J158J457J507J528
56408A84261J705J751J185Q7q13j003p94p00n88KR44J565J644J653J865J841J182
$$ plain form
56530 148151 147831 147312 146022 143943 141871 140581 140013 139486 138591 137638 137224 137537 138240 138937 139505 139928 140041
56513 140041 139720 139199 138917 139031 139304 139496 139679 140138 141102 142622 144488 146185 147118 147034 146203 145218 144672 144935
56495 144935 145918 146991 147399 146915 145989 145199 144749 144579 144711 145210 145935 146601 147146 147851 148963 150258 151142 151298
56477 151298 151143 151414 152221 152827 152603 151944 151833 152585 153571 154220 154714 155375 155841 155482 154451 153695 153817 154386
56459 154386 154649 154621 155071 156524 158587 160377 161348 161545 161250 160747 160463 160927 162310 164113 165568 166298 166387
56442 166387 165949 164991 163764 162879 162857 163673 164875 166013 166866 167422 167836 168347 169077 169960 170904 171962 173245
56425 173245 174722 176166 177243 177647 177285 176450 175736 175616 176092 176783 177365 177875 178611 179769 181226 182733 184261
56408 184261 185966 187717 188902 188989 188176 187173 186379 185679 185091 185093 186037 187602 189246 190899 192764 194605 195787
56391A95787K99j08pJ26K02O49J542K165J813P33n3J64J095J769J522O07m2K13
56373B08476J012J439J177R20J397K280K570J973J296J301J692J684J140O46O17
56358B29620Q88J233J670K133K228J726R72N22N12O03N37M07L54K66m5m08l16
56341B42902M31J338J707J479J253J437J836K165K499K872K972K723K716L394
56327B71724M200M287L843L728L946L547K240J071R55J446J545J035M09j3j99
56312C03764l2M60Q62Q91R22J462K435L387M124M629M678M146L404K925K669K400
56296C43126K255K465K791K843K755K900L166L204L189L637M472N050N058M863
56282C91774M824M967N365O199P277P975P950P523P316P757Q933J0478J1674J2075
$$ plain form
56391 195787 196086 195978 195971 196097 196299 196948 198490 200655 202468 203201 203148 203312 204407 206176 207698 208305 208263 208476
56373 208476 209488 210927 212104 213024 214421 216701 219271 221244 222540 223841 225533 227217 228357 229003 229620
56358 229620 230508 231741 233411 235544 237772 239498 240470 240992 241504 242107 242644 243051 243405 243671 243626 243218 242902
56341 242902 243333 244671 246378 247857 249110 250547 252383 254548 257047 259919 262891 265614 268330 271724
56327 271724 275924 280211 284054 287782 291728 295275 297515 298586 299541 300987 302532 303567 303976 303963 303764
56312 303764 303732 304192 305054 305945 306867 308329 310764 314151 318275 322904 327582 331728 335132 338057 340726 343126
56296 343126 345381 347846 350637 353480 356235 359135 362301 365505 368694 372331 376803 381853 386911 391774
56282 391774 396598 401565 406930 413129 420406 428381 436331 443854 451170 458927 467860 478338 490012 502087
56268E02087J2076J2412J3250J4179J5081J6406J8485K1086K3763K6284K8712
56257G03821L1452L5094L9727M4567M8791N2680N7243O2759O8381P3215P7091
56246A294821Q0141Q2344Q3660Q3924Q2373P8045P0996O2392N3003M2214K9165
56235B043078J4390l55j3649k5320l5926m5798n4682o2046o7632p1577p3961p4532
56223A531990p3250p0876o8430o6060o3089n9143n4632n0034m5422m0937l7020
56212I03097l3758l0612k7254k4200k2171k1069k0022j8271j5749j3028j0856
56201F66107r492q409o914n066l619l039l094l346l450k986j788n20j12l58MJ450
56185F15368K800K808J824J143J300J858K457L214M211N249O064O423O251N899
$$ plain form
56268 502087 514163 526575 539825 554004 569085 585491 603976 625062 648825 675109 703821
56257 703821 735273 770367 810094 854661 903452 956132 1013375 1076134 1144515 1217730 1294821
56246 1294821 1374962 1457306 1540966 1624890 1707263 1785308 1856304 1918696 1971699 2013913 2043078
56235 2043078 2057468 2057113 2043464 2018144 1982218 1936420 1881738 1819692 1752060 1680483 1606522 1531990
56223 1531990 1458740 1387864 1319434 1253374 1190285 1131142 1076510 1026476 981054 940117 903097
56212 903097 869339 838727 811473 787273 765102 744033 724011 705740 689991 676963 666107
56201 666107 656615 648206 641292 636226 632607 629568 626474 623128 619678 616692 614904 614384 614272 613914 613918 615368
56185 615368 618168 620976 622800 623943 625243 627101 629558 632772 636983 642232 648296 654719 660970 666869
56171F66869O016O754P536P871P907P904P764P581P993R286J0712J1431J1716
56158G77340J2445J3797J5300J6876J8952K1604K4482K7616L1554L6566M2339
56147A038871M8659N5828O4102P3030Q1465Q7983R1262R0382Q5107P6052O4703
56136A857444N3140M3326L6309L2112L0197K9497K8243K4686J8567J1317M511
56125B169349j292n931r013j0995j4183k1339l3071m7277o0967p1975p9136q1885
56113A732285q0264p5001o7236n8218m9022m0307l2352k5407j9758j5249j1176
56102A258295p065l244l21J632L085M518O124P732Q823R157R463J0790J2927J4309
56088A336225J3977J2745J1820J1255J0640J0410J1262J2790J3904J4328J4632
$$ plain form
56171 666869 672885 679639 687175 695046 702953 710857 718621 726202 734195 743481 754193 765624 777340
56158 777340 789785 803582 818882 835758 854710 876314 900796 928412 959966 996532 1038871
56147 1038871 1087530 1143358 1207460 1280490 1361955 1449938 1541200 1631582 1716689 1792741 1857444
56136 1857444 1910584 1953910 1990219 2022331 2052528 2082025 2110268 2134954 2153521 2164838 2169349
56125 2169349 2168057 2162126 2153113 2142118 2127935 2106596 2073525 2026248 1965281 1893306 1814170 1732285
56113 1732285 1652021 1577020 1509784 1451566 1402544 1362237 1329885 1304478 1284720 1269471 1258295
56102 1258295 1251230 1247986 1247665 1249297 1252382 1256900 1263024 1270756 1279579 1288736 1298199 1308989 1321916 1336225
56088 1336225 1350202 1362947 1374767 1386022 1396662 1407072 1418334 1431124 1445028 1459356 1473988
56077A473988J5059J5344J5545J6119J7236J8724K0442K2040K2738K2271K1637
56066A681143K2030K3246K4166K4505K4995K5991K7034K7836K8649K9532L0122
56055A969249L0358L0728L1591L2756L3777L4250L4015L3568L3852L5110L6368
56044B335622L6712L6551L6854L7740L8809M0328M2905M6326M9817N3220N6797
56033B811681O0141O2409O3580O4491O5763O7470O9506P1420P2392P2414P2866
56022C554133P4853P7538P9466Q0903Q3320Q7032R1035R4832R8802J02917J06820
56011D531651J11040J16544J23019J29145J34479J39659J44911J50007J55540
56002E735995J62632J71344J80853J90944K01866K13062K23880K35169K48288
$$ plain form
56077 1473988 1489047 1504391 1519936 1536055 1553291 1572015 1592457 1614497 1637235 1659506 1681143
56066 1681143 1703173 1726419 1750585 1775090 1800085 1826076 1853110 1880946 1909595 1939127 1969249
56055 1969249 1999607 2030335 2061926 2094682 2128459 2162709 2196724 2230292 2264144 2299254 2335622
56044 2335622 2372334 2408885 2445739 2483479 2522288 2562616 2605521 2651847 2701664 2754884 2811681
56033 2811681 2871822 2934231 2997811 3062302 3128065 3195535 3265041 3336461 3408853 3481267 3554133
56022 3554133 3628986 3706524 3785990 3866893 3950213 4037245 4128280 4223112 4321914 4424831 4531651
56011 4531651 4642691 4759235 4882254 5011399 5145878 5285537 5430448 5580455 5735995
56002 5735995 5898627 6069971 6250824 6441768 6643634 6856696 7080576 7315745 7564033
55993G564033K62898K77674K92865L09931L28989L48953L70015L93570M19867
55984A0568795M48210M79361N14996N54796N96934O41711O91937P49435Q13917
55975A6060092Q85645R66481J058104J161981J281224J419678J579453J762590
55967B6175248J974964K225443K522199K874257L296437L808542M430585N183074
55959E2490749O088971P166861Q421714R849815J1453842J3248562J5257324J7511521
55951A41489359K0032445K2754856K5408112K7443169K8079960K6477696K2002471
55944C13688068J4557325M845388n668771j5221973k2424412k6708453k8302957
55937B34764215k7873110k6150417k3736956k1058085j8379487j5849655j3548546
$$ plain form
55993 7564033 7826931 8104605 8397470 8707401 9036390 9385343 9755358 10148928 10568795
55984 10568795 11017005 11496366 12011362 12566158 13163092 13804803 14496740 15246175 16060092
55975 16060092 16945737 17912218 18970322 20132303 21413527 22833205 24412658 26175248
55967 26175248 28150212 30375655 32897854 35772111 39068548 42877090 47307675 52490749
55959 52490749 58579720 65746581 74168295 84018110 95471952 108720514 123977838 141489359
55951 141489359 161521804 184276660 209684772 237127941 265207901 291685597 313688068
55944 313688068 328245393 333090781 327422010 312200037 289775625 263067172 234764215
55937 234764215 206891105 180740688 157003732 135945647 117566160 101716505 88167959
55930H8167959j1517064r763631q270434p009317n952642n071987m337210l722385
55922C2523289l208518k778900k416781k109415j849435j630155j443241j282193
55914A5804651j143930j025253r21335q29048p48339o78783o17749n63171n15179
55905H761864m73648m36840m03548l74003l47671l22730k98821k77683k59899
55896E567021k43362k26212k09131j93509j79498j67200j57796j51988j48575
55887C889750j45694j42231j37428j30724j22893j15722j09703j03465r6277q9441
55877B696172q4252q0219p6482p3553p2209p1723p0608o8481o6083o3893o1599
55866A907070n8627n4645m9898m5315m1848l9551l7863l6671l6185l5848l4572
$$ plain form
55930 88167959 76650895 66887264 58616830 51607513 45654871 40582884 36245674 32523289
55922 32523289 29314771 26535871 24119090 22009675 20160240 18530085 17086844 15804651
55914 15804651 14660721 13635468 12714133 11885085 11136746 10457963 9840214 9277043 8761864
55905 8761864 8288216 7851376 7447828 7073825 6726154 6403424 6104603 5826920 5567021
55896 5567021 5323659 5097447 4888316 4694807 4515309 4348109 4190313 4038325 3889750
55887 3889750 3744056 3601825 3464397 3333673 3210780 3095058 2985355 2881890 2785613 2696172
55877 2696172 2611920 2531701 2455219 2381666 2309457 2237734 2167126 2098645 2032562 1968669 1907070
55866 1907070 1848443 1793798 1743900 1698585 1656737 1617186 1579323 1542652 1506467 1470619 1436047
55855A436047l2242k9897k8219k6882k5615k4798k4662k4983k5762k7106k8268
55844A137613k8081k6670k5402k4832k4006k2325k0615j9672j9078j8257j7474
55833H91201j6910j5902j4133j2554j2052j2085j1618j0739j0298j0563j1146
55822G53201j1752j2223j2275j1880j1563j1692j1974j2044j1881j1291r864q033
55810F16729p109p481p812o995n929o014o709o179m004j702n53l35m12p75j399
55795E53321j644j006P8P93J078J646L088N195P214Q438Q437O747K760l501j0541
55780E82103j5923j8185j7873j6435j4483j1649p741l317P21L518M256K435j539
55767D85888o407j0861j4139j5879j5874j4238j1618q873o553m725l332k510k451
$$ plain form
55855 1436047 1403805 1373908 1345689 1318807 1293192 1268394 1243732 1218749 1192987 1165881 1137613
55844 1137613 1109532 1082862 1057460 1032628 1008622 986297 965682 946010 926932 908675 891201
55833 891201 874291 858389 844256 831702 819650 807565 795947 785208 774910 764347 753201
55822 753201 741449 729226 716951 705071 693508 681816 669842 657798 645917 634626 624762 616729
55810 616729 609620 602139 594327 587332 581403 575389 568680 562501 558497 556795 556242 555907 555495 554720 553321
55795 553321 551677 550671 550749 551542 552620 554266 557354 562549 569763 578201 586638 593385 596145 592644 582103
55780 582103 566180 547995 530122 513687 499204 487555 479814 476497 477218 480736 484992 487427 485888
55767 485888 479481 468620 454481 438602 422728 408490 396872 387999 381446 376721 373389 370879 368428
55754C68428l025l775m422n112o063p082p721p815p557p160o683o143n479m529
55740B85862l388k642k827l594l933l295k124j225r55j209j758k365k811k979
55726B50757k849k493k216k528l533m509m561l677k658k065j754j411r50l16N34
55711B15771J299J557J398J336J448J183J94j161k276k766k499j829j776l114
55697B08765m981n435l802j664r06j560k250k119j412o71j82k3oK58P99J048O21
55680A86480k0k48j83l36o65o95l60k9J51L26M27K44o4q4J82L11J61P3K66N14
55660A86451N81N41N16L83l5o71j274j726k124k551k832k659k051j489j306j185
55644A68569o69j6N4n16j011j067j124j433j476r85p30j486k743l425l441l528
$$ plain form
55754 368428 365403 361628 357206 352094 346031 338949 331228 323413 315856 308696 302013 295870 290391 285862
55740 285862 282474 279832 277005 273411 269478 266183 264059 262834 261879 260670 258912 256547 253736 250757
55726 250757 247908 245415 243199 240671 237138 232629 228068 224391 221733 219668 217914 216503 215553 215237 215771
55711 215771 217070 218627 220025 221361 222809 223992 224186 223025 220749 217983 215484 213655 211879 208765
55697 208765 203784 198349 194547 192883 191977 190417 188167 186048 184636 183965 183783 183760 183754 184012 184811 185859 186480
55680 186480 186460 186212 186029 185693 185028 184333 183973 183944 184095 184421 184848 185092 185028 184944 185126 185437 185598 185671 185937 186451
55660 186451 187032 187573 188089 188472 188437 187766 186492 184766 182642 180091 177259 174600 172549 171060 169754 168569
55644 168569 167900 167884 167938 167422 166411 165344 164220 162787 161311 160326 159596 158110 155367 151942 148501 144973
55628A44973l814l629k770j922j564j302o57J41N69N56L37j9n45j051j256j188
55612A26859j192j516j982k136j812j444j625k223k295j296K9M39k13q74p93m72
55596A07454q00j783k581k580j907r92l3R25J692J995J841J559J403J273J051
55581A08517J039J718L014M197M694M710M851N334N860O107O016N706N234M455
55567A71452L081J037j144k636l155l266l643m336m987n439n776n976n923n636
55553A23653n184m538l717k989k586k390k137j779j437j186j098j261j427j067
55539I0857j00O85N12l16p78m29K31N96O00M52K53O2J2J77N38J033J465J444P59
55520I8053k19q66j031j059j212j425j617j837j949j712j261j146j593k044j776
$$ plain form
55628 144973 141159 137530 134760 132838 131274 129972 129315 129456 130025 130581 130918 130899 130354 129303 128047 126859
55612 126859 125667 124151 122169 120033 118221 116777 115152 112929 110634 109338 109367 109806 109593 108719 107926 107454
55596 107454 106654 104871 102290 99710 97803 96811 96778 97703 99395 101390 103231 104790 106193 107466 108517
55581 108517 109556 111274 114288 118485 123179 127889 132740 138074 143934 150041 156057 161763 166997 171452
55567 171452 174533 175570 174426 171790 168635 165369 161726 157390 152403 146964 141188 135212 129289 123653
55553 123653 118469 113931 110214 107225 104639 102249 100112 98333 96896 95710 94612 93351 91924 90857
55539 90857 90757 91442 91954 91638 90860 90431 90662 91258 91858 92310 92563 92625 92637 92814 93352 94385 95850 97294 98053
55520 98053 97834 96968 95937 94878 93666 92241 90624 88787 86838 85126 83865 82719 81126 79082 77306
55505G7306q17N4J67l82j004j307j338j152o03K90R62Q34J32k89q2K31J24k55
55487G2871n57q17j135j334j375j609k062k056j136O9P08R14J292J639J236K33
55471F6881l88k80m9m4Q0M22M27p8m51k46J46L15M54O61N39M3r8M43Q28L42l19
55450F9628j33N28M72m11j080j060r38j015p36O8N59J46m87l65L38O96M30Q2L3
55431F6755J31K28L66L93M5m30l73L12Q43N71j48n48n14n12p16p70m65n5J61J56
55411F5430k0l23m61j7R15J601J455O82j24p32j262j691j831j637j192m80N17
55394F0830J466J829J413O24O5M7L57N04K13k05j31N40J087P32m00j366j438p73
55376F5394j05M6j78k68j5J65k45j061j493j051p8P52J059P95Q5o77j020r61r55
$$ plain form
55505 77306 76489 76543 76710 76328 75324 74017 72679 71527 70924 71214 72176 73010 73142 72853 72771 73002 73126 72871
55487 72871 72314 71497 70362 69028 67653 66044 63982 61926 60790 60859 61567 62481 63773 65412 66648 66881
55471 66881 66493 66213 66164 66120 66200 66622 67049 66971 66520 66274 66420 66735 67189 67850 68389 68432 68334 68777 69605 69947 69628
55450 69628 69495 70023 70495 70084 69004 67944 67006 65991 65255 65323 65882 66028 65541 65176 65514 66210 66640 66722 66755
55431 66755 66886 67114 67480 67873 67918 67488 67115 67427 68270 68841 68693 68145 67631 67119 66403 65633 65168 65113 65274 65430
55411 65430 65410 65087 64626 64609 65524 67125 68580 69262 69138 68406 67144 65453 63622 61985 60793 60313 60830
55394 60830 62296 64125 65538 66162 66227 66274 66631 67135 67348 67143 67012 67552 68639 69371 68971 67605 66167 65394
55376 65394 65289 65335 65157 64889 64874 65039 64794 63733 62240 61189 61111 61863 62922 63717 63802 63125 62105 61144 60189
55357F0189j039o17M86J388J201K53m82p32q90j026p91k46J78M54R50J586J791
55340F2653J391Q52N09J99k12n80p89q20m70L08Q94N70l62q45n25j01q0j22L8
55321F2508pn10r16o73p7K30J45l8j85k86j79J58M29M00J80r1m25o74n55k24j94
55300E9016n02n53q0M38O51Q54J175J139O12L36P96J228P45k73q31q26q66r94
55282F2065p47k56j66n05n92j74K78N03Q14J314J532J129M00j48k66Q3P07J061
55264F7032P03n2m31k32M0O8Q4K13J81p8j83k4l6m50q00o73l95m29n77l84o0k35
55242F3282r54j491j258m45L44O87M88j18q49j375j505j165l36P82J612J612R67
55225F0278N47R25J688J971J446M44o92j784k404j925m24J015J374Q16K92K77
$$ plain form
55357 60189 59150 58533 59019 60407 61608 61861 61379 60647 59757 58731 57940 57694 57872 58326 59276 60862 62653
55340 62653 64044 64896 65405 65604 65392 64812 64023 63203 62733 63041 63935 64505 64143 63298 62773 62672 62592 62470 62508
55321 62508 62501 61991 61075 60402 60325 60555 60700 60662 60477 60191 60012 60170 60599 60999 61179 61088 60663 59989 59434 59210 59016
55300 59016 58514 57961 57881 58319 58970 59824 60999 62138 62750 63086 63882 65110 65855 65582 64751 63925 63059 62065
55282 62065 61318 61062 60896 60391 59799 59625 59903 60406 61220 62534 64066 65195 65595 65447 65181 65264 65971 67032
55264 67032 67735 67683 67252 67020 67060 67128 67212 67425 67606 67528 67345 67321 67285 66835 66035 65362 64967 64538 63961 63577 63517 63282
55242 63282 62328 60837 59579 59134 59478 60165 60653 60535 59686 58311 56806 55641 55305 56087 57699 59311 60278
55225 60278 60825 61750 63438 65409 66855 67299 66607 64823 62419 60494 60070 61085 62459 63275 63567 63844
55209F3844M58N30N87O34L76k59p84o98l5P56J250J206O44n3m45n62p22q06k52
55190F5669Q87J575J005k14p65k37N83Q35M58p3l19j23K92M08o0p08q42l72K6
55171F8025k43r54j388j152m63K54Q35J284J370P05o16j740j837j014j02L49L73
55154F3686O2n32r18l76R31J813J502O06J36J67Q9k47m25k11K41O98R11O56K07
55135F8996L25J171J711R34o50j632j520r86n41j7N97Q24N13J19r0l19n42l18
55117F8575L12N03l11j522k064j598n69N06J311J602J333Q31N25N08N16K66k89
55100G0435q69j008m50N75J567K184K317J925J170M66M9l11p60q74k69N07N85
55083G7239O2j93pj48q48j227o39L16Q38J089J484J561O66o38j020k08N85L51
$$ plain form
55209 63844 64302 64832 65419 66053 66429 66170 65386 64688 64653 65409 66659 67865 68509 68456 68011 67449 66727 65921 65669
55190 65669 66556 68131 69136 68922 68157 67920 68503 69338 69796 69723 69404 69281 69573 69981 69921 69213 68371 67999 68025
55171 68025 67782 66828 65440 64288 63825 64079 64914 66198 67568 68273 67657 65917 64080 63066 62964 63313 63686
55154 63686 63748 63216 62298 61922 62853 64666 66168 66774 66910 67077 67166 66919 66494 66283 66524 67222 68133 68789 68996
55135 68996 69321 70492 72203 73137 72487 70855 69335 68349 67808 67791 68388 69212 69725 69844 69754 69435 68893 68575
55117 68575 68887 69390 69079 67557 65493 63895 63326 63832 65143 66745 68078 68909 69434 69942 70458 70724 70435
55100 70435 69566 68558 68108 68683 70250 72434 74751 76676 77846 78312 78361 78050 77290 76416 76147 76654 77239
55083 77239 77301 77108 77101 76953 76105 74878 74239 74555 75393 76482 77966 79527 80193 79555 78535 78327 78912 79263
55065G9263m53p14j69M13L06l67r17q95m78j66k44n52p02m32J41N82N41J41j29
55046G5169p3l8l19o47o47m64m19k79L85J170J096O5p40l43P29J193O28k65p59
55027G5442q54r12r86p32J0P60P40r7q01n52K39N28J10k39n3L39P02J301K060
55008G7005K259J594P57M53N19O10R13J442J419K89j193j883j747j459j066j94
54992G9718P22P96K29J98R65J376P14j22j4O90P99L3p44q48m97k90n01r77j309
54973H0938j068k38N93P43J82m30n14j60J14j8m31p79p63k46O47J463J637J040
54955H2710K96K49J051J922J943J012j01n47j34O02R35N42l15j106j443j201n12
54938H5903J78K41n14j498j884j491p25J32J036J670J547P90J12j50k71j91P46
$$ plain form
55065 79263 78810 78096 77927 78340 78646 78279 77362 76467 75989 75823 75579 75027 74325 73893 74034 74616 75157 75298 75169
55046 75169 75096 75058 74739 74092 73445 72981 72562 72283 72668 73838 74934 74999 74259 73916 74645 75838 76466 76201 75442
55027 75442 74588 73676 72690 71958 71968 72728 73468 73371 72570 72018 72257 72785 72895 72656 72603 72942 73644 74945 77005
55008 77005 79264 80858 81615 82068 82587 83197 84110 85552 86971 87260 86067 84184 82437 80978 79912 79718
54992 79718 80440 81236 81465 81663 82628 84004 84718 84596 84582 85272 86071 86104 85360 84512 84015 83725 83224 82247 80938
54973 80938 79870 79632 80225 80968 81150 80720 80206 80046 80160 80142 79711 78932 78169 77923 78570 80033 81670 82710
54955 82710 83006 83255 84306 86228 88171 89183 89082 88535 88401 89003 89938 90480 90165 89059 87616 86415 85903
54938 85903 86081 86322 85808 84310 82426 80935 80210 80342 81378 83048 84595 85385 85497 85347 85076 84885 85631
54921H5631K555L998M033L238K888L200L459L475L674L911L453K245J113M24m12
54906A26885j721k808l048k863k982l311l327l089l068l202k932k110j266q53
54892I0305o83l56Q4J58m64j419j832j199m3N85L49pL05J135J831K226K673L192
54874I6840L304K893K634L206M351N092M798L672K281R22m00j678k765l462l584
54859A18104l090k305j894k293l173l782l817l663l672l569k918j861j032p84
54845H0251q55q49o98n97o27n83j68O32J340J336N45k94l14N31J328J140j8j137
54827H0963j219l30M40J76q60j673j790j620j562j419q72n7P35J440J970K027
54811G6349J646J444J751J969J455O15K98L90N4p69j127n35K41L17k26p54r51
$$ plain form
54921 85631 88186 92184 96217 99455 102343 105543 109002 112477 116151 120062 123515 125760 126873 127297 126885
54906 126885 125164 122356 119308 116445 113463 110152 106825 103736 100668 97466 94534 92424 91158 90305
54892 90305 89622 89266 89350 89508 89044 87625 85793 84594 84551 85136 85485 85478 85783 86918 88749 90975 93648 96840
54874 96840 100144 103037 105671 108877 113228 118320 123118 126790 129071 129993 129593 127915 125150 121688 118104
54859 118104 115014 112709 110815 108522 105349 101567 97750 94087 90415 86846 83928 82067 81035 80251
54845 80251 79396 78547 77849 77252 76625 76042 75874 76506 77846 79182 79727 79433 79119 79650 80978 82118 82100 80963
54827 80963 79744 79414 79854 80030 79170 77497 75707 74087 72525 71106 70234 70177 70912 72352 74322 76349
54811 76349 77995 79439 81190 83159 84614 85229 85527 85917 85971 85202 84075 83540 83781 84098 83872 83118 82167
54794H2167p91k51M99J013J075R49Q57O17J78o1J41M02K84j9p0J24K84L83N18
54775H8299N50M19M92J078J817K126K015J878J751J435J280J955L370M528M737
54760A17730M321L891L503K898K143J473P86k73j765l333m528n074m906m243l570
54745A09053l294l318l130k369j295n86o28j061j195q93p20j021j170l50J100
54730H9123J811J133K5j95N14J245J640K170K965L327K825K134K196K940L501
54715A17354L409K967K556K115J408L92p94j891k522k541k428k885l859m442m019
54700A04820l094k581k580k370j526n08j28o90j688k190j601k70P46P90L27K51
54684H7708O72Q73L43o15j424j798j677j060k22K88K05j61m27o15q69j008p35
$$ plain form
54794 82167 81376 81125 81624 82637 83712 84661 85518 86135 86313 86252 86393 86795 87079 87060 86990 87114 87398 87781 88299
54775 88299 88849 89268 89760 90838 92655 94781 96796 98674 100425 101860 103140 105095 108465 112993 117730
54760 117730 122051 125942 129445 132343 134486 135959 136745 136472 134707 131374 126846 121772 116866 112623 109053
54745 109053 105759 102441 99311 96942 95647 95061 94433 93372 92177 91284 90564 89543 88373 88023 89123
54730 89123 90934 92067 92092 91897 92411 93656 95296 97466 100431 103758 106583 108717 110913 113853 117354
54715 117354 120763 123730 126286 128401 129809 130201 129407 127516 124994 122453 120025 117140 113281 108839 104820
54700 104820 101726 99145 96565 94195 92669 92161 92033 91343 89655 87465 85864 85594 86340 87130 87457 87708
54684 87708 88380 89253 89596 88981 87557 85759 84082 83022 82800 83088 83293 83132 82705 82090 81221 80213 79478
54667G9478j58L22N88Q39J181J446J505J367R86L01m63q65q12p31r17r88m31M85
54649H3133Q70M13r3K23J118J601J304Q61P96P25R4p46q82j56N53M93p5m64o13
54630H9155r85j568j611o33O64J044K08q17r48l40M3j76m27k49N6Q6L1K07L10
54611H4050j12p40p25J17R43Q67j12j285j913j643o06N96J314J331R47N44L26
54594H3899L38M79N08L38K05K84L83L49M98J060J470J007pn87o02r19j735j990
54576H4978j001K85N71k6l88p6L63M35K01j40l79j64N69J190J041M16J25K66J91
54557H8457l14o68m58l2J73K81N91J006J192J071Q76Q82J181J505J382O63j87
54540I7601o43p79r09q68k85N76J036J034J145J426J265O05L42Q53J103J06j402
$$ plain form
54667 79478 79320 79642 80230 81069 82250 83696 85201 86568 87554 87855 87392 86527 85715 84984 84067 83079 82648 83133
54649 83133 84003 84416 84323 84546 85664 87265 88569 89430 90226 90951 91045 90299 89417 89261 89814 90307 90232 89768 89155
54630 89155 88170 86602 84991 84358 85022 86066 86274 85457 84509 84169 84212 84036 83609 83360 83416 83502 83533 83740 84050
54611 84050 83938 83198 82473 82590 83533 84400 84288 83003 81090 79447 78841 79437 80751 82082 83029 83573 83899
54594 83899 84237 84716 85224 85562 85767 86051 86434 86783 87281 88341 89811 90818 90811 90224 89622 88703 86968 84978
54576 84978 83977 84262 84833 84807 84419 84343 84706 85141 85342 85202 84823 84659 85228 86418 87459 87875 88000 88266 88457
54557 88457 88143 87475 87017 86985 87158 87439 88030 89036 90228 91299 92175 93057 94238 95743 97125 97788 97601
54540 97601 96958 96179 95270 94402 94117 94693 95729 96763 97908 99334 100599 101204 101546 102399 103502 103608 102206
54523A02206j854j006r9J0k11n4L57N47M70L16Jn78j115j198q97o36n52l81K8
54504I5354M32N01J45m89j113j339r25j59K58K3k86J02J038J496R05k8j76N77
54486I6316J253J079L73QL45R29J080N56k71q01p39l11R9M18Q21J290J524J389
54468A05358J146J076J116J065R28P75M44k91j196j622j205l39K38J87k04m71
54452A07005m29j70J77N11O56M31q4m81m59k08j89m97o93l73K24M87K20p9J00
54433A06149N16M52k96r88q37m1M66K52j02P2N81P53M80L00M85N95J55o03j002
54414A07387p30j12L52N01N02M62K48j93n53m59p4K1k80l00M66J429J614J054
54396A11335P24J099J516J272N81N8j75l29l75k20n1m9K4L50N57K93n7O1L41J9
$$ plain form
54523 102206 100352 99346 99247 99257 99046 98992 99349 99896 100366 100682 100683 100105 98990 97792 96895 96259 95707 95326 95354
54504 95354 95786 96287 96432 95943 94830 93491 92566 92407 92665 92688 92402 92504 93542 95038 95943 95915 95739 96316
54486 96316 97569 98648 99021 99029 99374 100303 101383 101939 101668 100867 100128 99817 99916 100334 101155 102445 103969 105358
54468 105358 106504 107580 108696 109761 110689 111464 111908 111617 110421 108799 107594 107255 107493 107680 107476 107005
54452 107005 106576 106406 106583 107094 107750 108181 108097 107616 107157 106949 106760 106263 105570 105197 105421 105908 106128 106049 106149
54433 106149 106665 107117 106821 105833 104996 104955 105421 105673 105571 105643 106224 106977 107457 107757 108242 108837 108992 108389 107387
54414 107387 106657 106545 106897 107398 107900 108362 108610 108417 107864 107405 107331 107352 107072 106772 107238 108667 110281 111335
54396 111335 112059 113158 114674 115946 116527 116585 116410 116081 115706 115486 115435 115386 115410 115760 116317 116610 116553 116614 116955 116974
54376A16974p36q54Q1J195J626J553J391Q46m32j734j918r87j45j95o62o96k31
54359A15076J87K33O0r1j23p8j13m43j069j617j637j057k12N81J227J645J574
54342A14143Q61r4m69K00J457K355K424K000J646J543J594J738J868J638Q27j72
54326A33559o66n46m53q94j579j926j882j872k035j975j355m32J87J77k26n39
54310A17543n02k69k16n99j309j870j734p10P32J712J628O54m80j109j014m25
54294A12032J35J79k61n71l02J58J07m47q05o71m98o10o63l83j10j11k2L77M59
54275A07993k64j025o54O41J552J548J380J525J449P73J19R2L61M23N16R82J322
54258A18733Q95L7k98J55Q57J378J696J713J261N54k2n39j293k024k079j436r23
$$ plain form
54376 116974 116238 115384 115465 116660 118286 119839 121230 122076 121644 119910 117992 117005 116860 116665 116003 115307 115076
54359 115076 115263 115496 115556 115465 115342 115264 115151 114708 113639 112022 110385 109328 109116 109697 110924 112569 114143
54342 114143 115004 114910 114441 114641 116098 118453 120877 122877 124523 126066 127660 129398 131266 132904 133731 133559
54326 133559 132893 132347 131894 131000 129421 127495 125613 123741 121706 119731 118376 117944 118131 118308 118082 117543
54310 117543 117041 116772 116556 115957 114648 112778 111044 110334 111066 112778 114406 115060 114580 113471 112457 112032
54294 112032 112167 112346 112085 111514 111212 111370 111477 111030 110225 109554 109056 108446 107783 107400 107290 107179 107157 107534 107993
54275 107993 107729 106704 106050 106691 108243 109791 111171 112696 114145 114918 115037 115129 115490 115913 116429 117411 118733
54258 118733 119628 119665 119367 119522 120379 121757 123453 125166 126427 126981 126959 126420 125127 123103 121024 119588 118665
54241A18665j166j835k163j774q83m4K01k34p84p75k16L36N23M30R5n42j211j428
54223A07195j172q95o99j92O30J121R81Q60J302J741J218j56j246j226l20P26
54207A09868J308J186N25j42l95k88o6L20R71J546J571J151Q35O89J94p93j577
54190A16903j544j027p90r78j132r57o06k78o1j62p15j309j162j21R57J155N50
54173A08723o1k40j88j19M8K50J31l49n54qP59P14k99j253j143j61P02R19R03
54154A08774J203J606J441O30k1J26N75L27o43j281r49k81j08k27k8K26k09j077
54136A10084j151M2J447J857J347Q33Q26J109J240Q68j39j349j941j562p52j77
54120A12582J26L57L58J3j77K79R39R44L45M5M28Q65P60K83j82o51j148j287p50
$$ plain form
54241 118665 117499 115664 113501 111727 110844 110800 111001 110767 109983 109208 108992 109328 109851 110281 110376 109834 108623 107195
54223 107195 106023 105128 104429 104237 104867 105988 106969 107829 109131 110872 112090 111934 110688 109462 109142 109868
54207 109868 111176 112362 112887 112745 112350 112062 111996 112316 113287 114833 116404 117555 118390 119079 119273 118480 116903
54190 116903 115359 114332 113542 112564 111432 110475 109869 109591 109530 109368 108653 107344 106182 106061 107018 108173 108723
54173 108723 108662 108422 108234 108115 108163 108413 108544 108195 107641 107633 108392 109106 108807 107554 106411 106250 106952 107871 108774
54154 108774 109977 111583 113024 113654 113633 113759 114334 114661 114018 112737 111788 111507 111399 111172 111144 111370 111161 110084
54136 110084 108933 108975 110422 112279 113626 114459 115285 116394 117634 118502 118363 117014 115073 113511 112759 112582
54120 112582 112708 113065 113423 113436 113259 113538 114477 115421 115766 115811 116239 117104 117864 118147 117965 117314 116166 114879 114129
54101A14129J96J001J453J574J284N70k31p10q24p71o10l18p2r5k96l22l4L81
54083A16305P43J064J339J394J063M56p9k92k73l20m93m90j07L18L16M2J24N99
54065A21709N77n15j809j865m70J112J713J435J029Q17O59N73P63J216J702K124
54049A30770K564K967L151L119L072L053K797K189J614J726K732M070M819M587
54035A73230L915L661L953M040L292K055J172R22R04Q59J035J525J888J716J293
54020B05460J202J525J802J668J195O69L52N05J299K560L669L828K441m62m016
54005B23697o868q136q056p520p112o790o387n953n528m973m180l199k065p58
53991A46172M61J025O16m01j317j731j691j382r32m89k47l25o57j015j127q45
$$ plain form
54101 114129 114325 115326 116779 118353 119637 120207 119976 119266 118442 117671 117061 116743 116671 116576 116280 115958 115924 116305
54083 116305 117048 118112 119451 120845 121908 122364 122285 121993 121720 121400 120907 120417 120310 120628 120944 120986 121110 121709
54065 121709 122286 121771 119962 118097 117627 118739 120452 121887 122916 123733 124392 124965 125728 126944 128646 130770
54049 130770 133334 136301 139452 142571 145643 148696 151493 153682 155296 157022 159754 163824 168643 173230
54035 173230 177145 180806 184759 188799 192091 194146 195318 196240 197144 198003 199038 200563 202451 204167 205460
54020 205460 206662 208187 209989 211657 212852 213521 213873 214378 215677 218237 221906 225734 228175 227713 223697
54005 223697 216829 208693 200637 193117 186005 179215 172828 166875 161347 156374 152194 148995 146930 146172
53991 146172 146633 147658 148274 147873 146556 144825 143134 141752 140820 140331 140084 139759 139102 138087 136960 136115
53975A36115k60L79Q48J091J176J239J361J374R46Q8n62l67M48R27N67j26m25
53958A44819k93j51j39m4K15N04Q08J220J684K044K353K720K998K911K527K227
53942A66403K192K260K312K437K606K596K370K185K183K209K227K530L175L572
53928B01257L106K062J368J452J855K078K305K908L676M037L906L789L996M157
53914B41952L813L093K522K317K155J594M59j071k509l214k870j868r88o83q87
53899B43815j442k318l294l898l943l828l997m281m232l823l476l370l221k833
53885A95859k458k415k572k527k179j830j708j636j378j099j154j435j318m99
53871A71651M44P13K63l33q15j346j707j148N85K679M174N026N851O912P987Q889
$$ plain form
53975 136115 135855 136234 137082 138173 139349 140588 141949 143323 144269 144357 143795 143428 143876 144803 145370 145244 144819
53958 144819 144526 144375 144236 144192 144407 144911 145719 146939 148623 150667 153020 155740 158738 161649 164176 166403
53942 166403 168595 170855 173167 175604 178210 180806 183176 185361 187544 189753 191980 194510 197685 201257
53928 201257 204363 206425 207793 209245 211100 213178 215483 218391 222067 226104 230010 233799 237795 241952
53914 241952 245765 248858 251380 253697 255852 257446 257905 256834 254325 251111 248241 246373 245385 244702 243815
53899 243815 242373 240055 236761 232863 228920 225092 221095 216814 212582 208759 205283 201913 198692 195859
53885 195859 193401 190986 188414 185887 183708 181878 180170 178534 177156 176057 174903 173468 172150 171651
53871 171651 172095 172808 173071 172738 171923 170577 168870 167722 168307 170986 175160 180186 186037 192949 200936 209825
53855B09825R464R166P326L942j17l760o345p805q537q991r087q207o108l588
53841A77178j802j009o02j04M45R41J395J625J421J058R64Q93J84j066j938k062
53825A77521k130k623k948k499j805j713j996j756q64o0L06P11J497K248K440
53810A66329K172J952K126K713L537M213M269L512K282J255R03J135J434J407
53796A99239J159J002R04O79N75J079J955K177J301J87k51l42r02j719j934j625
53780B03484j749k521l035k871k793l318l631k895j708j253j567j713j360j109
53766A71961j291j461j247r34q76j028j262j663k149k301j887j189n55K6N55O88
53750A55387J67n98r18o47k50l7K02P21J300J463J090N89M27O32Q42Q29P92J001
$$ plain form
53855 209825 219289 228455 235781 239723 239606 235846 229501 221696 213159 204168 195081 186874 180766 177178
53841 177178 175376 174367 173765 173661 174106 175047 176442 178067 179488 180546 181510 182403 182587 181521 179583 177521
53825 177521 175391 172768 169820 167321 165516 163803 161807 160051 159187 159127 159433 160144 161641 163889 166329
53810 166329 168501 170453 172579 175292 178829 183042 187311 190823 193105 194360 195263 196398 197832 199239
53796 199239 200398 201400 202304 202983 203558 204637 206592 208769 210070 210257 210006 209664 208762 207043 205109 203484
53780 203484 201735 199214 196179 193308 190515 187197 183566 180671 178963 177710 176143 174430 173070 171961
53766 171961 170670 169209 167962 167028 166152 165124 163862 162199 160050 157749 155862 154673 154118 154144 154699 155387
53750 155387 155554 154956 154038 153391 153141 153104 153306 154027 155327 156790 157880 158469 158896 159528 160370 161199 161991 162992
53732A62992J351J504J448J502J722J682J139N60N71J110J606J872K255K829L096
53717A87239K727K189K173K653K895K283R50m09j078q21n8O16J147K065L580N007
53701B13158N506N084M421L855L164K298J647J418J341J215J215J280Q30m03j666
53686B44363j918j108j39L27N16Q98J439J606R18n24j927k376j811j213j405j907
53670B35739j617m76M08M00J51L97P16L25n78j109j038r07r27o99j27K85K95L27
53652B31565O25P10K97N7P50J922K341J669Q50P04Q97O88J30o7L97J066J486J783
53634B47870K248K652K391J372M38N57J727K957L412L274L188L289L176K738K436
53619B83725K628L084L395L579L856M119M007L507L173L529M417N042M710L524
$$ plain form
53732 162992 164343 165847 167295 168797 170519 172201 173340 173900 174471 175581 177187 179059 181314 184143 187239
53717 187239 189966 192155 194328 196981 199876 202159 203109 202700 201622 200801 200743 201359 202506 204571 208151 213158
53701 213158 218664 223748 228169 232024 235188 237486 239133 240551 241892 243107 244322 245602 246432 246029 244363
53686 244363 242445 241337 241198 241525 242041 242939 244378 245984 246902 246378 244451 242075 240264 239051 237646 235739
53670 235739 234122 233646 234054 234454 234605 235002 235718 236043 235465 234356 233318 232411 231484 230785 230658 230943 231238 231565
53652 231565 232190 232900 233197 233254 234004 235926 238267 239936 240786 241490 242387 243075 243205 243138 243535 244601 246087 247870
53634 247870 250118 252770 255161 256533 256971 257528 259255 262212 265624 268898 272086 275375 278551 281289 283725
53619 283725 286353 289437 292832 296411 300267 304386 308393 311900 315073 318602 323019 328061 332771 336295
53605C36295K316J817J899J814J169L90J07L69O82P22O03N03L31r2o82j126j207
53588C45910j034q96r75j259j634j954j925j173K69J668K163J605O13k24p26p32
53572C39696O5J496K653K709J825Q01J07l16o01q47j287j970k352j826o42K41
53556C39752K72k00o20p85o03O7J047J824K237K777L865N152N862N617M723L891
53540C74878L850M839O273P289P749Q361R561J0874J1638J1820J1713J1417J1214
53527D91476J1761J3225J4576J4757J4272J4671J6495J8658K0080K1000K2226
53516F73197K3814K5107K5671K5668K5523K5604K6031K6508K6536K6006K5399
53505I55064K5142K5048K4684K4053K3525K3222K2833K2138K1393K1050K1211
$$ plain form
53605 336295 338611 340428 342327 344141 345310 345700 345807 346176 346858 347580 348183 348686 349017 348925 348243 347117 345910
53588 345910 344876 343980 343005 341746 340112 338158 336233 335060 335329 336997 339160 340765 341378 341154 340428 339696
53572 339696 339761 341257 343910 346619 348444 349245 349352 349036 348435 347588 346301 344331 341979 340153 339511 339752
53556 339752 340024 339824 339204 338419 337816 337883 338930 340754 342991 345768 349633 354785 360647 366264 370987 374878
53540 374878 378728 383567 389840 397129 404878 413239 422800 433674 445312 457132 468845 480262 491476
53527 491476 503237 516462 531038 545795 560067 574738 591233 609891 629971 650971 673197
53516 673197 697011 722118 747789 773457 798980 824584 850615 877123 903659 929665 955064
53505 955064 980206 1005254 1029938 1053991 1077516 1100738 1123571 1145709 1167102 1188152 1209363
53494A209363K1473K1316K0627J9815J9368J9271J9004J8176J7110J6602J7096
53483A419221J8058J8319J7076J4597J1861R503P357N046K651M95j544l968o941
53470A511731j0027j2720j4804j6158j6670j6617j6673j7227j7983j8612j9468
53459A334772k1091k3190k4709k4978k4351k3607k3082k2615k1972k1008j9663
53448A084506j8089j6694j5735j4887j3507j1382r047p250o195n422m312k628
53436I59358n93J356K883L934M726N602O780Q245R768J1113J2246J3421J4979
53423A053818J6951J8895K0288K1130K2020K3545K5667K7846K9681L1241L2778
53412A323860L4383L5963L7463L8909M0389M2120M4454M7553N0995N3905N5680
$$ plain form
53494 1209363 1230836 1252152 1272779 1292594 1311962 1331233 1350237 1368413 1385523 1402125 1419221
53483 1419221 1437279 1455598 1472674 1487271 1499132 1508635 1515992 1521038 1523689 1524184 1522640 1518672 1511731
53470 1511731 1501704 1488984 1474180 1458022 1441352 1424735 1408062 1390835 1372852 1354240 1334772
53459 1334772 1313681 1290491 1265782 1240804 1216453 1192846 1169764 1147149 1125177 1104169 1084506
53448 1084506 1066417 1049723 1033988 1019101 1005594 994212 985165 977915 971720 966298 961986 959358
53436 959358 958765 960121 963004 966938 971664 977266 984046 992291 1002059 1013172 1025418 1038839 1053818
53423 1053818 1070769 1089664 1109952 1131082 1153102 1176647 1202314 1230160 1259841 1291082 1323860
53412 1323860 1358243 1394206 1431669 1470578 1510967 1553087 1597541 1645094 1696089 1749994 1805674
53401A805674N6477N6844N7047N7092N7218N7886N9042N9912N9870N9205N8492
53390B444759N7532N5588N2564M9257M6255M3287L9935L6291L2466K8045K2776
53379B908755J7421J3081R812O525K335k667p998j3632j9980k7360l5581m3724
53367B806987n0482n5175n8421o1302o3852o5040o4388o2827o1533o0541n9091
53356B144335n6869n4283n1786m9559m7779m6637m6098m5986m6237m6643m6510
53345A605948m5066m2308l9066l6186l3924l2035l0091k7684k4799k2020k0013
53334A252756j8690j7278j5396j3652j2898j3157j3631j3589j2968j2131j1375
53323A097991j0691r914q953p853o623n100l203j233L45J479K606M036N528O733
$$ plain form
53401 1805674 1862151 1918995 1976042 2033134 2090352 2148238 2207280 2267192 2327062 2386267 2444759
53390 2444759 2502291 2557879 2610443 2659700 2705955 2749242 2789177 2825468 2857934 2885979 2908755
53379 2908755 2926176 2939257 2949069 2955594 2957929 2955262 2947264 2933632 2913652 2886292 2850711 2806987
53367 2806987 2756505 2701330 2642909 2581607 2517755 2452715 2388327 2325500 2263967 2203426 2144335
53356 2144335 2087466 2033183 1981397 1931838 1884059 1837422 1791324 1745338 1699101 1652458 1605948
53345 1605948 1560882 1518574 1479508 1443322 1409398 1377363 1347272 1319588 1294789 1272769 1252756
53334 1252756 1234066 1216788 1201392 1187740 1174842 1161685 1148054 1134465 1121497 1109366 1097991
53323 1097991 1087300 1077386 1068433 1060580 1053957 1048857 1045654 1044421 1044766 1046245 1048851 1052887 1058415 1065148
53309A065148P764R007J0504J1971J3375J5113J7441K0040K2351K4166K5674K7066
53297A269620K8256K9036K9318K9234K9041K8898K8656K7917K6367K4104K1592
53286A572039J9257J7225J5306J3149J0428P032L215n56l950o970r773j2389j4722
53273A609291j6735j8524k0243k2021k3945k5994k8012k9839l1416l2637l3190
53262A326735l2869l2063l1671l2225l3263l3779l3222l1896l0434k9248k8383
53251I77682k7702k7026k6310k5777k5684k5926k6028k5661k4899k3879k2412
53240F96378k0330j7999j6136j5053j4331j3330j1811j0048q504p549p246p336
53228E46705p548p972q893j0181j1208j1595j1739j2184j2704j2587j1756j0985
$$ plain form
53309 1065148 1072912 1081919 1092423 1104394 1117769 1132882 1150323 1170363 1192714 1216880 1242554 1269620
53297 1269620 1297876 1326912 1356230 1385464 1414505 1443403 1472059 1499976 1526343 1550447 1572039
53286 1572039 1591296 1608521 1623827 1636976 1647404 1654436 1657651 1657095 1653145 1646175 1636402 1624013 1609291
53273 1609291 1592556 1574032 1553789 1531768 1507823 1481829 1453817 1423978 1392562 1359925 1326735
53262 1326735 1293866 1261803 1230132 1197907 1164644 1130865 1097643 1065747 1035313 1006065 977682
53251 977682 949980 922954 896644 870867 845183 819257 793229 767568 742669 718790 696378
53240 696378 676048 658049 641913 626860 612529 599199 587388 577340 568836 561287 554041 546705
53228 546705 539157 531185 522292 512111 500903 489308 477569 465385 452681 440094 428338 417353
53216D17353j0811j0750j0013q623p331o626o369o327o488o746o704o195n634
53203C18736n547n882o155o204o353o736o860o159m789l524k869k602k292j894
53189B50870j664j691j877k208k699l069k877k110j338j049j099j064r19r63j218
53174B25025j279q24r1L72K17m16j048j281j108q02m45J59R76J381P93m73j478
53157B19678j767j726j719j553j100q04r76j064m10M95M38p67j870j809r84l55
53141B03707L1P38J605J700P11m71q77n63j93n7p7l85j181k083k202j174L11J174
53123B00714R66P4p53r55m81K15N70M83L38L81K99l35j387k222k407k079j581
53106A91840j064n36j31j08n29j036j052l62N25Q33M33L1K17N96K77q58j878j914
$$ plain form
53216 417353 406542 395792 385779 377156 369825 363199 356830 350503 344015 337269 330565 324370 318736
53203 318736 313189 307307 301152 294948 288595 281859 274999 268840 264051 260527 257658 255056 252764 250870
53189 250870 249206 247515 245638 243430 240731 237662 234785 232675 231337 230288 229189 228125 227206 226243 225025
53174 225025 223746 222922 222831 223203 223420 223004 221956 220675 219567 218765 218320 218479 219455 220836 221629 221156 219678
53157 219678 217911 216185 214466 212913 211813 211009 210033 208969 208559 209054 209492 208725 206855 205046 204062 203707
53141 203707 203738 204476 206081 207781 208492 208021 207144 206581 206388 206331 206254 205869 204688 202605 200403 199229 199540 200714
53123 200714 201680 201754 201001 200046 199565 199780 200350 200833 201171 201552 201851 201516 200129 197907 195500 193421 191840
53106 191840 190776 190240 190109 190001 189472 188436 187384 187022 187547 188380 188813 188844 189061 189657 189934 189076 187198 185284
53088A85284j122k96J32L30N04N39K44k51n42l23L09Q96R90N65L5j77o3M0j47
53069A86947n01n92j05P57J334J103K58m82o90o40p29q38n79l7K76K68N00J250
53051A87500J798J293Q3n48j21L20k84j418j728j032n65j128j912j751q09k34
53035A79464n15j007j066q25o39m22L7N41P05N06L10L86O67R45J103J103R24N26
53017A82743p2p02j066j001o98n01n05n17m10l19l62m60m68l31j7M73R14R32M74
52998A78107jj3L70P36Q67Q14N71L7o21r17n45K22P42N69j77q68q55n7Q99J317
52978A81197J216J232J631J819J186K34K34J589L056L082J705M94O03J494J896
52963B02668J515J151J319J480Q56m75j703k278k392k549k878l013k575j695r70
$$ plain form
53088 185284 184162 183866 183998 184328 184832 185371 185615 185364 184822 184499 184808 185704 186694 187259 187294 187117 187054 187094 186947
53069 186947 186446 185854 185749 186506 187840 188943 189201 188719 188029 187389 186660 185822 185243 185206 185482 185750 186250 187500
53051 187500 189298 190591 190674 190126 190005 190325 190041 188623 186895 185863 185298 184170 182258 180507 179698 179464
53035 179464 178949 177942 176876 176051 175412 174990 175027 175568 176273 176779 177089 177475 178142 179087 180190 181293 182217 182743
53017 182743 182671 181969 180903 179902 179204 178703 178198 177681 177271 176952 176590 176130 175662 175331 175314 175787 176701 177633 178107
52998 178107 178106 178093 178463 179199 180066 180880 181451 181488 180867 179950 179405 179627 180369 180938 180761 179893 179038 178981 179880 181197
52978 181197 182413 183645 185276 187095 188281 188515 188749 190338 193394 196476 198181 198675 199278 200772 202668
52963 202668 204183 205334 206653 208133 208989 208514 206811 204533 202141 199592 196714 193701 191126 189431 188461
52948A88461q27j066j148r19p54r27j133q37J4Q63J124P71K60m5k21n27r09j014
52930A81166p73n64o34o41j34P04J251J250R42M83k04q90j021m89J10K87K83M93
52912A81619P43O62L32M5l73j244k176k222j112K30O93J95m40n19j36J41p2o94
52894A75672j312j456q38L51J368J474Q21M60J035J801J535L07n83n40m76j210
52878A78409k002j635k92Q01J180J397J618J255L15j27N78J557J571O63j68m19
52862A84701m46n75o94p17q14r78q75l89J4k62j239k223k372j472j97M76K53j82
52844A72009o5M21L92n20j613j957j456p97n41n83m99j19L09M49K46P1L18Q21
52826A66886Q60J0j151j641j339j119j528j889j215L48J642J886J319N69O0J46
$$ plain form
52948 188461 187634 186568 185420 184501 183747 182820 181687 180850 180864 181727 182851 183622 183882 183837 183616 183089 182180 181166
52930 181166 180393 179829 179195 178554 178420 179124 180375 181625 182567 183050 182846 181956 180935 180446 180556 180843 181126 181619
52912 181619 182362 183024 183356 183401 183028 181784 179608 177386 176274 176504 177197 177392 176952 176433 176297 176438 176366 175672
52894 175672 174360 172904 172066 172417 173785 175259 176080 176540 177575 179376 180911 181218 180635 180095 179619 178409
52878 178409 176407 174772 174480 175281 176461 177858 179476 180731 181046 180919 181497 183054 184625 185288 185120 184701
52862 184701 184255 183680 182986 182269 181455 180477 179602 179213 179227 178965 177726 175503 173131 171659 171462 171938 172191 172009
52844 172009 171944 172365 172757 172237 170624 168667 167211 166414 165873 165290 164791 164672 164981 165430 165676 165747 166065 166886
52826 166886 167746 167756 166605 164964 163625 162506 160978 159089 157874 158222 159864 161750 163069 163638 163698 163844
52810A63844J115K638L696L524K340R23k72j173j705j775j510j156q49p31j053
52795A67856j817k460k317j369k72L24K66j50m20k39K22N41O93J063J644J730
52779A65295Q90k07n99l38k65o73j035j046j039j154r26j40N49M10l26p62m88
52762A58146O2L29K76K39L34L38J55J43O47J280J192K89l77M4J003J263N81j27
52744A65817r9N34J318J963K164J697R35O23R54J403J616J750J833J564J107J158
52728A86337J790J996J039l41q47k98L75M49Jo42j274j721j907k011k153k058
52712A78735j407m63J39J45j10j83R1N69Q61N55l43j290j779j837j733j449q38
52695A69663l2O83J215J600J723J479R92M27j86o82o21J61J150J743J846J556
$$ plain form
52810 163844 164959 167597 171293 174817 177157 178080 177808 176635 174930 173155 171645 170489 169640 168909 167856
52795 167856 166039 163579 161262 159893 159621 159945 160211 160061 159641 159402 159624 160165 160858 161921 163565 165295
52779 165295 166185 165978 165379 165041 164776 164103 163068 162022 160983 159829 158903 158763 159312 159722 159396 158634 158146
52762 158146 158208 158537 158813 159052 159386 159724 159879 160022 160669 161949 163141 163430 163053 163097 164100 165363 165944 165817
52744 165817 165718 166252 167570 169533 171697 173394 174329 174952 175906 177309 178925 180675 182508 184072 185179 186337
52728 186337 188127 190123 191162 190821 189974 189676 190051 190500 190501 189859 188585 186864 184957 182946 180793 178735
52712 178735 177328 176865 177004 177149 177039 176856 176947 177516 178377 178932 178589 177299 175520 173683 171950 170501 169663
52695 169663 169631 170314 171529 173129 174852 176331 177323 177750 177564 176882 176261 176422 177572 179315 181161 182717
52679A82717O78p59j951k062j370q98r78j045p67n26n76n43j33L00L30O1j19n7
52661A72302K15O66J139J398J517J834K287K196J117m05j362j434j184j187j296
52646A77803r73j46N11L45l39m99L19J286J350O73L78R63J738J969J798J663J430
52629A90269P12k63p26l08N09R42O85P8l53l93k68k41l07l50m23o05p24n38j52
52610A87544J27K86N47Q81J027J005J085J205J002N36L64O41P95M55K5p4j21m90
52592A96840q64p16j92K61P34J494K068J655M20n53p16n94o36m38L96J329J514
52575B02002Q91O1n87j036j194r13m49l27o32q73o40p0M81Q85J106R44K09q92
52557A98966j827k169j903j319p83n47n89n91k28M21Q95Q52M25K0j26rL91J087
$$ plain form
52679 182717 183395 182636 180685 178623 177253 176355 175377 174332 173565 173039 172463 171920 171787 172087 172417 172478 172359 172302
52661 172302 172517 173183 174322 175720 177237 179071 181358 183554 184671 184266 182904 181470 180286 179099 177803
52646 177803 176830 176684 177195 177540 177201 176702 177021 178307 179657 180330 180708 181671 183409 185378 187176 188839 190269
52629 190269 190981 190718 189992 189684 190193 191135 191820 191898 191545 191152 190884 190643 190336 189986 189563 188958 188234 187696 187544
52610 187544 187671 187957 188504 189385 190412 191417 192502 193707 194709 195245 195609 196250 197045 197500 197525 197451 197330 196840
52592 196840 195976 195260 195068 195329 196063 197557 199625 201280 201700 201147 200431 199837 199201 198763 199159 200488 202002
52575 202002 202893 202954 202367 201331 200137 199224 198775 198448 197816 196943 196303 196233 196714 197599 198705 199649 199858 198966
52557 198966 197139 194970 193067 191748 190965 190418 189829 189238 189010 189431 190326 191178 191603 191623 191497 191488 191879 192966
52539A92966J798K020J559P91K21m4j90k59j51N4J14Lo2n5k52p46j188j245j059
52520A94275r29p24j31O95J148R67N74M45N25N23N18Q54J619K503L121L262K904
52503B12149K228J549J002L61n44j425j829j758j583j393r51l23o7n28j306j800
52487B03782j821j490q24P8P63Q43N57M40N50N00K54L02Q35J281R75P4n94n01
52469B06004R9O12Q31J006J373J789J948J824J718J879K231K482K356J671M64
52454B28287q61j693j754j349j001r76j230j556j663j399j070j167j591j604r31
52439B08442l55o43j300j236m11J41p2l30P1P44Q94M50Om1K74P50J127J183J048
52420B10742J178J712K178K215K194K661L447L942M093M531N679P225Q533R120
$$ plain form
52539 192966 194764 196784 198343 199134 199355 199311 199121 198862 198711 198765 198879 198882 198820 198765 198513 197767 196579 195334 194275
52520 194275 193346 192622 192491 193186 194334 195301 195875 196320 196845 197368 197886 198740 200359 202862 205983 209245 212149
52503 212149 214377 215926 216928 217289 216745 215320 213491 211733 210150 208757 207806 207483 207416 206888 205582 203782
52487 203782 201961 200471 199647 199725 200488 201331 201888 202328 202878 203378 203632 203934 204769 206050 207025 207099 206505 206004
52469 206004 206103 206715 207546 208552 209925 211714 213662 215486 217204 219083 221314 223796 226152 227823 228287
52454 228287 227426 225733 223979 222630 221629 220653 219423 217867 216204 214805 213735 212568 210977 209373 208442
52439 208442 208087 207444 206144 204908 204497 204638 204566 204236 204307 205051 205945 206395 206401 206360 206634 207384 208511 209694 210742
52420 210742 211920 213632 215810 218025 220219 222880 226327 230269 234362 238893 244572 251797 260330 269450
52406B69450Q635O859M018Q68j878m053n814p055p342o444m792l205k244j905
52392B45098j886j930j809j263k75O95J078Q53N39N23O92Q75J192J759K383K815
52376B51339L143L545L854L755L306K957L050L473L868L935L667L313L087K805
52362B99097K047Q34j24j33O18J267J240P88N85J052J989K709K652K085J996K980
52346C21682M437N281N303N342O063P223Q178Q697Q934R150R730J1080J3047J4773
52332D38920J5589J5912J6664J7975J9028J9273J9198J9591K0482K1228K1343
52321F45203K0817J9804J8511J7300J6398J5440J3842J1772J0164R474Q986P893
52309H15604O490N519M776L323J122o25j043o58m55o79j120j924l271m644n244
$$ plain form
52406 269450 278085 284944 288962 289830 287952 283899 278085 271030 263688 257244 252452 249247 247003 245098
52392 245098 243212 241282 239473 238210 237935 238630 239708 240561 241100 241623 242315 243190 244382 246141 248524 251339
52376 251339 254482 258027 261881 265636 268942 271899 274949 278422 282290 286225 289892 293205 296292 299097
52362 299097 301144 301978 301854 301721 302339 303606 304846 305634 306219 307271 309260 311969 314621 316706 318702 321682
52346 321682 326119 331400 336703 342045 348108 355331 363509 372206 381140 390290 400020 411100 424147 438920
52332 438920 454509 470421 487085 505060 524088 543361 562559 582150 602632 623860 645203
52321 645203 666020 685824 704335 721635 738033 753473 767315 779087 789251 798725 807711 815604
52309 815604 822094 827613 832389 835712 836834 836209 835166 834508 834053 833374 832254 830330 827059 822415 817171
52294H17171n006m591m473m627m945n295n260m503l342k331j282N58L265N930
52280G81269P861R398J1144J2994J4405J5132J5198J4597J3569J2863J3135J4151
52268I35716J4974J4810J3370J0765P545M680K879J925J115K81j15R8L27j34j363
52253A006873k892m121m607m308l787l857m797o173p497q733r890j0582j0480
52240I25149r851r159q290o766m722l034k319k271k201j872j418q25O4J136J985
52225H75606K358K348K239K314K788L596M330M600M579M850N654O610P252P584
52211I36708P853Q012P720O836N672M683M019L444K655J660R04Q92J626K462K696
52196I97842K206J528J273J564J930J711O70o75j431j219o57p17j706l015l928
$$ plain form
52294 817171 812165 807574 803101 798474 793529 788234 782974 778471 775129 772798 771516 772074 775339 781269
52280 781269 789130 798528 809672 822666 837071 852203 867401 881998 895567 908430 921565 935716
52268 935716 950690 965500 978870 989635 997180 1001860 1004739 1006664 1007779 1008060 1007945 1008043 1008370 1008236 1006873
52253 1006873 1003981 999860 995253 990945 987158 983301 978504 972331 964834 956101 946211 935629 925149
52240 925149 915298 906139 897849 891083 886361 883327 881008 878737 876536 874664 873246 872421 872485 873621 875606
52225 875606 877964 880312 882551 884865 887653 891249 895579 900179 904758 909608 915262 921872 929124 936708
52211 936708 944561 952573 960293 967129 972801 977484 981503 984947 987602 989262 990166 991058 992684 995146 997842
52196 997842 1000048 1001576 1002849 1004413 1006343 1008054 1008724 1008049 1006618 1005399 1004742 1004025 1002319 999304 995376
52181I95376m369m726n244n769o060o043n753n268m722m253l825l224k394j587
52167I32139j037n97L2P71J201J245J408K159L285M160M509M560M561M431L911
52152I66738K818J234k77q62j77J000J463R74N13R60K036K879L318L963N200O603
52136I98383P503P872Q436R883J2066J4118J5473J6540J8121K0233K2030K2870
52124A173528K3082K3391K4064K4834K5350K5306K4422K2639K0201J7419J4549
$$ plain form
52181 995376 991007 986281 981037 975268 969208 963165 957412 952144 947422 943169 939344 936120 933726 932139
52167 932139 931102 930505 930537 931308 932509 933754 935162 937321 940606 944766 949275 953835 958396 962827 966738
52152 966738 969556 970790 970513 969651 969474 970474 971937 972911 973424 974384 976420 979299 982617 986580 991780 998383
52136 998383 1005886 1013758 1022194 1032077 1044143 1058261 1073734 1090274 1108395 1128628 1150658 1173528
52124 1173528 1196610 1220001 1244065 1268899 1294249 1319555 1343977 1366616 1386817 1404236 1418785
$$ [...]
##END NTUPLES=NMR SPECTRUM
##END=
