##TITLE=NES1086_santa_lucia_9885092_Txwg26jtW8
##JCAMPDX= 6.0         $$ Bruker NMR JCAMP-DX V2.0
##DATA TYPE= NMR SPECTRUM
##DATA CLASS= NTUPLES
##ORIGIN= BRUKER
##OWNER= Administrator
$$ 1.72 TOPSPIN		Version 2.1
$$ 2016-08-27 17:32:26.133 -0500  Administrator@X
$$ Compression mode = diff/dup
##.OBSERVE FREQUENCY= 400.02188249412
##.OBSERVE NUCLEUS= ^1H
##.ACQUISITION MODE= SIMULTANEOUS (DQD)
##.ACQUISITION SCHEME= undefined
##.AVERAGES= 8
##.DIGITISER RES= 22
##SPECTROMETER/DATA SYSTEM= spect
##.PULSE SEQUENCE= zg30
##.SOLVENT NAME= COFFEE_meoh
##.SHIFT REFERENCE= INTERNAL, COFFEE_meoh, 1, 14.98509
##AUDIT TRAIL= $$ (NUMBER, WHEN, WHO, WHERE, PROCESS, VERSION, WHAT)
$$ ##TITLE= Audit trail, TOPSPIN		Version 2.1
$$ ##JCAMPDX= 5.01
$$ ##ORIGIN= Bruker BioSpin GmbH
$$ ##OWNER= Administrator
$$ $$ E:\/data/COFFEE/nmr/NES1086_santa_lucia_9885092_Txwg26jtW8/20/pdata/1/auditp.txt
$$ ##AUDIT TRAIL=  $$ (NUMBER, WHEN, WHO, WHERE, PROCESS, VERSION, WHAT)
(   1,<2016-08-27 17:32:19.101 -0500>,<Administrator>,<X>,<go>,<TOPSPIN 2.1>,
      <created by zg
	started at 2016-08-27 17:31:13.054 -0500,
	POWCHK enabled, PULCHK disabled,
       configuration hash MD5:
       21 0F 79 D6 B3 7B B4 F6 88 20 88 DB 03 48 BD 9F
       data hash MD5: 64K
       33 C2 F5 31 BC 5C 44 95 DB 71 2D 8A 4F 7B 01 52>)
(   2,<2016-08-27 17:32:22.101 -0500>,<Administrator>,<X>,<proc1d>,<TOPSPIN 2.1>,
      <Start of raw data processing
       efp LB = 0 FT_mod = 6 PKNL = 1 PHC0 = 0 PHC1 = 0 SI = 32K 
       data hash MD5: 32K
       06 5A 3C BF C9 30 7A FC FF 5E D7 7D B1 AE 48 AC>)
(   3,<2016-08-27 17:32:22.398 -0500>,<Administrator>,<X>,<proc1d>,<TOPSPIN 2.1>,
      <pk PHC0 = 93.33984 PHC1 = 0 
       data hash MD5: 32K
       6B AA 4D 50 A1 85 D5 B1 54 C8 AA 3E E5 68 FB 07>)
(   4,<2016-08-27 17:32:22.508 -0500>,<Administrator>,<X>,<proc1d>,<TOPSPIN 2.1>,
      <abs ABSG = 1 
       data hash MD5: 32K
       7E 67 F7 51 35 92 3E 8B CF 1E 54 26 6C D5 7D 06>)
(   5,<2016-08-27 17:32:22.570 -0500>,<Administrator>,<X>,<proc1d>,<TOPSPIN 2.1>,
      <abs ABSG = 2 
       data hash MD5: 32K
       6C AA 40 6E 9C A9 2B 8A 71 F7 1E F8 81 2B 75 D6>)
(   6,<2016-08-27 17:32:22.648 -0500>,<Administrator>,<X>,<proc1d>,<TOPSPIN 2.1>,
      <abs ABSG = 3 
       data hash MD5: 32K
       A0 53 56 D0 C3 EC 3A 36 65 DF B1 18 2E 32 6B D8>)
(   7,<2016-08-27 17:32:22.695 -0500>,<Administrator>,<X>,<proc1d>,<TOPSPIN 2.1>,
      <abs ABSG = 4 
       data hash MD5: 32K
       14 A4 5E 18 B3 DF C2 5D 71 35 AB E2 30 78 17 D4>)
(   8,<2016-08-27 17:32:22.758 -0500>,<Administrator>,<X>,<proc1d>,<TOPSPIN 2.1>,
      <abs ABSG = 5 
       data hash MD5: 32K
       11 CC 59 27 B3 6C DE 67 4B E0 9C B7 24 F1 40 EF>)
$$ ##END=
$$ 
$$ $$ hash MD5
$$ $$ 18 5D 2B BB 2B DD 70 31 A6 DC 6C DF 60 5A E6 5A
##$RELAX= 
##$RELAX= 
##$RELAX= 
##$RELAX= 
##$RELAX= 
##$RELAX= 
##$RELAX= 
$$ Bruker specific parameters
$$ --------------------------
##$DU= <E:\>
##$EXPNO= 20
$$ [...]
##$TP= (0..7)
150 150 150 150 150 150 150 150
##$TP07= 0
##$TPNAME0= <>
##$TPNAME1= <>
##$TPNAME2= <>
##$TPNAME3= <>
##$TPNAME4= <>
##$TPNAME5= <>
##$TPNAME6= <>
##$TPNAME7= <>
##$TPOAL= (0..7)
0.5 0.5 0.5 0.5 0.5 0.5 0.5 0.5
##$TPOFFS= (0..7)
0 0 0 0 0 0 0 0
##$TUNHIN= 0
##$TUNHOUT= 0
##$TUNXOUT= 0
##$USERA1= <user>
##$USERA2= <user>
##$USERA3= <user>
##$USERA4= <user>
##$USERA5= <user>
##$V9= 5
##$VALIST= <valist>
##$VCLIST= <CCCCCCCCCCCCCCC>
##$VD= 0
##$VDLIST= <DDDDDDDDDDDDDDD>
##$VPLIST= <PPPPPPPPPPPPPPP>
##$VTLIST= <TTTTTTTTTTTTTTT>
##$WBST= 2048
##$WBSW= 25
##$XGAIN= (0..3)
0 0 0 0
##$XL= 0
##$YL= 0
##$YMAX_a= 605412
##$YMIN_a= -511078
##$ZGOPTNS= <>
##$ZL1= 120
##$ZL2= 120
##$ZL3= 120
##$ZL4= 120
##$ABSF1= 14.98509
##$ABSF2= -5.573092
##$ABSG= 5
##$ABSL= 3
##$ALPHA= 0
##$AQORDER= 0
##$ASSFAC= 0
##$ASSFACI= 0
##$ASSFACX= 0
##$ASSWID= 0
##$AUNMP= <proc_prof1d_extract_pilot.lims>
##$AXLEFT= 0
##$AXNAME= <>
##$AXNUC= <1H>
##$AXRIGHT= 0
##$AXTYPE= 0
##$AXUNIT= <>
##$AZFE= 0.1
##$AZFW= 0.1
##$BCFW= 0
##$BC_mod= 0
##$BYTORDP= 0
##$COROFFS= 0
##$CY= 15
##$DATMOD= 1
##$DC= 0
##$DFILT= <>
##$DTYPP= 0
##$F1P= 0
##$F2P= 0
##$FCOR= 0.5
##$FTSIZE= 32768
##$FT_mod= 6
##$GAMMA= 0
##$GB= 0
##$INTBC= 1
##$INTSCL= 1
##$ISEN= 128
##$LB= 0
##$LEV0= 0
##$LPBIN= 0
##$MAXI= 10000
##$MC2= 0
##$MEAN= 0
##$ME_mod= 0
##$MI= 0
##$NCOEF= 0
##$NC_proc= -8
##$NLEV= 6
##$NOISF1= 0
##$NOISF2= 0
##$NSP= 0
##$NTH_PI= 0
##$NZP= 0
##$OFFSET= 14.98509
##$PC= 1
##$PHC0= 93.33984
##$PHC1= 0
##$PH_mod= 1
##$PKNL= yes
##$PPARMOD= 0
##$PPDIAG= 0
##$PPIPTYP= 0
##$PPMPNUM= 2147483647
##$PPRESOL= 1
##$PSCAL= 4
##$PSIGN= 0
##$PYNMP= <proc.py>
##$REVERSE= no
##$SF= 400.02
##$SI= 32768
##$SIGF1= 0
##$SIGF2= 0
##$SINO= 400
##$SIOLD= 32768
##$SPECTYP= <>
##$SREGLST= <1H.CDCl3>
##$SSB= 0
##$STSI= 32768
##$STSR= 0
##$SW_p= 8223.68421052631
##$SYMM= 0
##$S_DEV= 0
##$TDeff= 65536
##$TDoff= 0
##$TI= <>
##$TILT= no
##$TM1= 0
##$TM2= 0
##$TOPLEV= 0
##$USERP1= <user>
##$USERP2= <user>
##$USERP3= <user>
##$USERP4= <user>
##$USERP5= <user>
##$WDW= 1
##$XDIM= 32768
##$YMAX_p= 444303508
##$YMIN_p= -696137
##$CURPLOT= <Network HP LaserJet P1505>
##$CURPRIN= <$Network HP LaserJet P1505>
##$DFORMAT= <normdp>
##$LAYOUT= <+/1D_H.xwp>
##$LFORMAT= <normlp>
##$PFORMAT= <normpl>
##$SURQMSG= 1
$$ End of Bruker specific parameters
$$ ---------------------------------
##NTUPLES= NMR SPECTRUM
##VAR_NAME=  FREQUENCY,     SPECTRUM/REAL,   SPECTRUM/IMAG
##SYMBOL=    X,             R,               I
##VAR_TYPE=  INDEPENDENT,   DEPENDENT,       DEPENDENT
##VAR_FORM=  AFFN,          ASDF,            ASDF
##VAR_DIM=   32768,         32768,           32768
##UNITS=     HZ,            ARBITRARY UNITS, ARBITRARY UNITS
##FACTOR=    0.250966925370066, 1,           1
##FIRST=     8223.43324360094, 60942,        12666
##LAST=      0,             -27031,          36608
##MIN=       0,             -696137,         0
##MAX=       8223.43324360094, 444303508,    0
$$ Real data points
##PAGE= N=1
##DATA TABLE= (X++(R..R)), XYDATA
$$ [...]
19516a44033B9818f5887C0183c34510h9327m4711K4137F6876b04589j4760G3095
19504a41286j05856h9563j42254G0955i6705K6923J5542k53252d4177B22344g6271
19492b62864h3693fE0595J01464B19d31561A43545b86539A1399J43046i1353m9660
19480a41013j42768B12385c04743i0275j08565A38414D4337f1602j12947A16706
19469b74931i911H0446f9286c160I4216J9220b12841b0479p8775j10345E706J24402
19457A30108b6522B56069k8424I3462c972l4931m9645l67822C94094a46834M9190
19446i7644j43156b8952k57863O6704J8661n6349D2585g2952j43901p0325j624
19435b88802J08001A3701J60352a86766A45359o6299d5057D473b25336C1178a11285
$$ plain form
19516 -144033 29818 -65887 30183 -334510 -89327 -134038 -109901 66876 -204589 -219349 73095
19504 -141286 -247142 -89563 -231817 70955 -96705 -69782 -54240 -307492 -44177 222344 -76271
19492 -262864 -83693 -6 50595 152059 219 -431561 143545 -286539 11399 154445 -91353 -141013
19480 -141013 -283781 212385 -304743 -90275 -198840 138414 44337 -61602 -174549 116706
19469 -274931 -9911 80446 -69286 -3160 94216 113436 -212841 -20479 -99254 -209599 5706 130108
19457 130108 -26522 256069 227645 93462 -3972 -38903 -88548 -456370 394094 -146834 -97644
19446 -97644 -240800 -28952 -286815 -220111 -201450 -257799 42585 -72952 -216853 -287178 -288802
19435 -288802 -180801 13701 174053 -186766 145359 79060 -45057 4473 -225336 31178 -111285
19423c09195K6261C11498a76682B06372H473a84609B05379c45457h9233j38574
19413b27807f4905r0536B06654h3389A08387L4894B7295n912a85856G4945c21108
19401e2341n0656j85254D6029a30278M2852q3913g74D5312N7851J0121a5961l38462
19389c54423a19665e3664k43237a8522j58197g454j58202o9738A98605D612b71342
19377d2294j86149i6439M911A37731c18162a54562k7683j03409J19535b5923C09380
19365h2837q9405K0986I9808e8137A89433C2823g0557k01155m2615B69867c70794
19353H989a57105g5364m3155nk8342L8635G0245a71508A40428a01250j4944N7151
19341e9043k29007J16260G320b13820o4528K6976B20684a00357c6107A10920h3323
$$ plain form
19423 -309195 -282934 311498 -176682 206372 8473 -184609 205379 -345457 -89233 -227807
19413 -227807 -64905 -155441 206654 -83389 108387 143281 27295 21383 -185856 74945 -321108
19401 -52341 -102997 -288251 46029 -130278 -87426 -171339 -774 45312 103163 113284 -15961 -354423
19389 -354423 -119665 -53664 -296901 -18522 -176719 -7454 -165656 -235394 198605 4612 -271342
19377 -42294 -228443 -96439 -91528 137731 -318162 -154562 -182245 -285654 -166119 -25923 309380
19365 -82837 -172242 -151256 99808 -58137 189433 32823 -70557 -271712 -314327 269867 -370794
19353 8989 -157105 -75364 -118519 -118524 -146866 -108231 70245 -171508 140428 -101250 -116194 -59043
19341 -59043 -288050 -171790 7320 -213820 -278348 -251372 220684 -100357 -36107 110920 -83323
19329a87157b858A32384a5817A96758l3122E3160a14195A32048a4630j10345f2007
19317F0360B8147J08577D7478g9831c9165j80737n2795J19252e3610J0258j80271
19306b23623G7323e8871A4993N9114a49945A44037a74571j15982Q508E151b78634
19294B20059a02000A73583c70470C24667c19238A04759r960o542h9924j04548
19284a94472g1828k83240g0570l0906G7152R8139a49410K6842A56234b39231N6517
19273a82714f7932o7008A07479a38276m9833B50273a43169k0324f6877M964j16769
19262a78682N0486e1915j33520H5240Q827C7393K9961a30672r5471d4820k98764
19251c43584Q9596j44564d0759l0018o5077A6411c52517f5456k77961c1214k62921
$$ plain form
19329 -187157 -2858 132384 -15817 196758 163636 53160 -114195 132048 -14630 -124975 -62007
19317 60360 28147 136724 47478 -79831 -39165 -219902 -272697 -153445 -53610 -43352 -223623
19306 -223623 77323 -58871 14993 74107 -149945 144037 -174571 -290553 -282045 5151 -278634
19294 220059 -102000 173583 -370470 324667 -319238 104759 94799 88257 -89924 -194472
19284 -194472 -71828 -355068 -70570 -101476 77152 175291 -149410 -122568 156234 -239231 -182714
19273 -182714 -67932 -134940 107479 -138276 -188109 250273 -143169 -163493 -66877 -61913 -178682
19262 -178682 -128196 -51915 -185435 85240 94067 37393 67354 -130672 -226143 -44820 -343584
19251 -343584 -253988 -398552 -40759 -70777 -135854 16411 -352517 -65456 -343417 -31214 -294135
19240b94135D9109b42298r938F850b74677H7600h3898F3906L4490A1884b65902
19228D2081b98789A0991a2218A12621R727g4154J0567k72040a33490k555a1922
19216b30398f8869A41092K0248B9468a96228o0156d6645A8652J94430G3415b80596
19204c96l3972l1289k090r7093k06328A2493a29492A37923b92978J41914K6220
19193a24844M3940D1939a15724k0392E7271b56278J16484j62408H9023l8602e54536
19181c92670i6931A41588d8440A19096J17612a21272j12167B521c56524A27555
19170b37188m7420D0790b750D0703a29167k39697j9111B11495K2089H2163B6734
19158d74932J31775L0038A95384a25502G1965b44710A86824b23170m3209A34209
$$ plain form
19240 -294135 49109 -242298 -252236 6850 -274677 87600 -83898 63906 98396 11884 -265902
19228 42081 -298789 10991 -12218 112621 122348 -74154 -63587 -335627 -133490 -136045 -11922
19216 -230398 -68869 141092 161340 29468 -196228 -256384 -46645 18652 213082 73415 -280596
19204 -396 -34368 -65657 -67747 -164840 -371168 12493 -129492 137923 -292978 -151064 -124844
19193 -124844 -80904 41939 -115724 -136116 57271 -256278 -139794 -302202 89023 50421 -554536
19181 -392670 -96931 141588 -48440 119096 236708 -121272 -233439 2521 -356524 127555
19170 -237188 -284608 40790 -2750 40703 -129167 -368864 -387975 211495 233584 82163 26734
19158 -474932 -343157 -313119 195384 -125502 71965 -244710 186824 -223170 -266379 134209
19147A80628J11640a93622A97611a51616A85672F5508b5106k23540a16327j28990
19137b45317J04726f0328A35540k7536b2721k51461M9094B52501I1778a45326
19126A7685a08785B20627a24991A41753B7406b46587o2703h4862A91463h8374
19115a01097A16833b40659d6998n12485B27644b22798N3631B1181C011J32836
19105A35847a05729K8864G3041n527k9715h7453G8900Q2975H931g5338I6276k4241
19093G2035K9641a09109B50964a17521H144a04793I2815J17516a26174C24745
19082I6665a24395D2634c63926C76653b45700A43188b5717j98233g3149o3057
19072a36206p7513j1286k02472B7736a04779K684o4544o1703G3227a86571q1538
$$ plain form
19147 180628 292268 -193622 197611 -151616 185672 65508 -25106 -248646 -116327 -245317
19137 -245317 -140591 -60328 135540 108004 -22721 -274182 -225088 252501 91778 -145326
19126 17685 -108785 220627 -124991 141753 27406 -246587 -309290 -84862 191463 -88374
19115 -101097 116833 -240659 -46998 -559483 227644 -222798 -169167 21181 3011 135847
19105 135847 -105729 -76865 73041 67514 37799 -87453 78900 161875 8931 -75338 96276 72035
19093 72035 101676 -109109 250964 -117521 8144 -104793 92815 210331 -126174 324745
19082 96665 -124395 42634 -363926 376653 -245700 143188 -25717 -223950 -73149 -136206
19072 -136206 -213719 -225005 -427477 27736 -104779 -102095 -166639 -228342 73227 -186571 -268109
19061b68109a15963j14106e3678I6777M599k1740P4987e0026F2624i2468A22157
19049B26598d09611B04525h6809B71778b31145I5955b3869k72013A13643c44122
19038c29173a41959M2709C4446K28933a13510c9447A08285b17198A43366o0369
19028H2997h5801b197C8058h2566m5406H2256J83054j07673a4137j17814A22874
19016E3153c1618C0843J6955b21377K5857k0005j40081A64242I882b00530g7729
19004d26535B6256b07279A29921h7344B7739J83684a58160g8376a0843k72465
18994b83308C2929D400a19653B38758j15904f7471E7525a38634l8270p0189E5203
18982D51524b05684A03667d5698J6623j4574n3722A76226B0779f4590j81580E28599
$$ plain form
19061 -268109 -115963 -230069 -53678 96777 101376 79636 154623 -50026 62624 -92468 122157
19049 226598 -409611 204525 -86809 271778 -231145 95955 -23869 -295882 113643 -344122
19038 -329173 -141959 -99250 34446 263379 -113510 -39447 108285 -217198 143366 82997
19028 82997 -85801 -2197 38058 -82566 -127972 82256 265310 157637 -14137 -131951 122874
19016 53153 -31618 30843 47798 -221377 -195520 -215525 -355606 164242 9882 -200530 -77729
19004 -426535 26256 -207279 129921 -87344 27739 211423 -158160 -78376 -10843 -283308
18994 -283308 32929 4400 -119653 238758 122854 -67471 57525 -138634 -176904 -247093 55203
18982 451524 -205684 103667 -45698 -29075 -43649 -97371 176226 20779 -64590 -246170 528599
18970a01463H2542c33486c5332A35620b9431j06849B37489g3371A490b10066N2210
18959a57856m1077B09292j1176o7224J18087f8665k5466j14167I3551J21068c4183
18947a40264e0019k62533I6483c64489D5114d4015i536B55837m5903e046A14256
18935a02199c9776B1365a67934B26811c55174J49018O702O9116n9507C7139b101
18923i6571B75989a76076B10696C6437b00087O2280I4130a30229E379a33936j58907
18912b92843d9833D5834a41384q3776b2350j70391A08630h3290o8034c0554A53424
18900B09284C7669a22705d7794B24861b45136A0773h0285J6943o7533D8921J00247
18889A49168f6456k14082o8304J71639j6119p1350E1261P5888b90168G5976c0715
$$ plain form
18970 -101463 82542 -333486 -35332 135620 -29431 -136280 237489 -73371 1490 -210066 -157856
18959 -157856 -198933 209292 198116 130892 248979 -68665 -94131 -208298 93551 214619 -34183
18947 -140264 -50019 -312552 96483 -364489 45114 -44015 -9536 255837 209934 -5046 114256
18935 -102199 -39776 21365 -167934 226811 -355174 -206156 -199454 -130338 -189845 37139 -2101
18923 -96571 275989 -176076 210696 36437 -200087 -137807 94130 -130229 5379 -133936 -292843
18912 -292843 -49833 45834 -141384 -225160 -22350 -192741 108630 -83290 -151324 -30554 153424
18900 209284 37669 -122705 -47794 224861 -245136 10773 -80285 -63342 -130875 48921 149168
18889 149168 -66456 -280538 -348842 -177203 -193322 -264672 51261 127149 -290168 75976 -30715
18877b17477j3660d6684A16025a18024j58352J18464A06199A0407b38361F6454
18866E9271c35242P6811h6311B82414A12505B6260I598a70896B59719A15758a11525
18854A61712b7680A10047m6887L6639d0796A42327J13912j13278a02432I8690
18843c40876A48613a34443k09041k1688a7773j13052f231j2412k37344A37199
18832A21722K09562C2044J13876E7887g6235m53733b20072A76776B0697J21685
18822A42382o4731c90641a20901A38926Q3961b72728a2323n3167A69831b97456
18811A97807Q1696n4582b22559M7390C7942p050Q2929C7796a50894A34900a17921
18799c356F3332c75943R2869d1305A349O1468a0097l2356j18333K71j33662I173
$$ plain form
18877 -217477 -231137 -46684 116025 -118024 -276376 -157912 106199 10407 -238361 66454
18866 59271 -335242 -258431 -86311 282414 112505 26260 9598 -170896 259719 115758 -111525
18854 161712 -27680 110047 63160 99799 -40796 142327 256239 142961 -102432 98690
18843 -340876 148613 -134443 -343484 -365172 -17773 -130825 -6231 -18643 -255987 137199
18832 121722 331284 32044 145920 57887 -76235 -529968 -220072 176776 20697 142382
18822 142382 77651 -390641 -120901 138926 222887 -272728 -12323 -65490 169831 -297456
18811 197807 279503 224921 -222559 -175169 37942 30892 113821 37796 -150894 134900 -117921
18799 -3356 63332 -375943 -283074 -41305 1349 62817 -10097 -42453 -160786 -160515 -294177 9173
18786a41281C1482a29928c8327B0932i0050l8633J6102B20639b87457k2384H7766
18774A3287J02267c06851B18453f2482j43994o602E7088b25171G333f0348n2209
18763a12557p4886m3595A69021H0316A4472a26699m1693A52610J63214B4091P397
18752C1488i9530k6261A45714a26474a655j5698l00019A40529b87548a00335C91779
18740b98554a03422d283A37722a49121B7322c51691a04221A49931b30858j50759
18730c81617M8558B06305A3266e2114A2962b26905i1122n8604f8924A50280M7587
18719A97867a74632j3457j92914A4478c8127B03492a6970D3297g182F1877a53587
18707a14074E850J41752p0738g9741h272j12332A08476b05937f6197j26172g8977
$$ plain form
18786 -141281 31482 -129928 -38327 20932 -90050 -128683 -112581 220639 -287457 -309841 87766
18774 13287 115554 -306851 218453 -62482 -206476 -213078 57088 -225171 7333 -60348 -112557
18763 -112557 -187443 -231038 169021 80316 14472 -126699 -168392 152610 315824 24091 31488
18752 31488 -99530 -125791 145714 -126474 -1655 -17353 -317372 140529 -287548 -100335 391779
18740 -298554 -103422 -4283 137722 -149121 27322 -351691 -104221 149931 -230858 -381617
18730 -381617 -333059 206305 13266 -52114 12962 -226905 -91122 -149726 -68924 150280 197867
18719 197867 -174632 -188089 -381003 14478 -38127 203492 -16970 43297 -7182 61877 -153587
18707 -114074 5850 147602 76864 -79741 -8272 -120604 108476 -205937 -66197 -192369 -78977
18695a00719k0392A78976a7086k73226a23215Q005N6571A16923a07917H4059a88402
18683c0907G1315M4862b985k12936M7499A10783c33588a495D6532c39224M9952
18672b89272J4283a08915F5041f653j88778B85455a9980l79702J91057M5564L5118
18661a27943a8340q4957r6822B11339H5346a78147J4354h0337A38475j2461j285
18650A24729b1407k31221a22184B20885F0026a97521F5703g8490L472E1453j8522
18639C2931d18575J91992A61066b59297A39551B014e7655A60209a15235A23145
18628f1263j44464A19408B0739b00949m4126H764Q5503m5618L31376a10809d8361
18616D8452O7704c09400P2712I5138b29629B58878f9432k82624c3314l0831B38375
$$ plain form
18695 -100719 -121111 178976 -17086 -290312 -123215 -115210 -58639 116923 -107917 84059 -188402
18683 -30907 71315 116177 -2985 -215921 -168422 110783 -333588 -1495 46532 -339224 -289272
18672 -289272 -274989 -108915 65041 -6653 -195431 285455 -19980 -399682 -208625 -163061 -127943
18661 -127943 -18340 -103297 -200119 211339 85346 -178147 -163793 -80337 138475 126014 124729
18650 124729 -21407 -252628 -122184 220885 60026 -197521 65703 -78490 -75018 51453 32931
18639 32931 -418575 -226583 161066 -259297 139551 2014 -57655 160209 -115235 123145
18628 -61263 -205727 119408 20739 -200949 -245075 8764 94267 48649 380025 -110809 -48361
18616 48452 116156 -309400 -236688 95138 -229629 258878 -69432 -352056 -33314 -64145 238375
18604a04746j99386a24826A60065i842k1447j47845c185A52167L6159b87310a19078
18592I288J37662L8431b5129C6800e3704c898B91898p2517b66739o939A09844
18580a89918C44871a03874j48156c1373k55011B6271c9606H45M7757c8869j40018
18569a78887q7957h7667A34122a98883c5378C83597q4932a55933k11479c5268
18558b31652J02681j98592e9584A73544B1621a27889h229k08659i3531l7118a1324
18546d3674B1970b62230C5669b43913B1402a32630I2096a72342m0991A00753d8428
18534D1517c27483N3876a3349j44015c7898J1874B22354C1467J1141b91584E2554
18522i7968A01462D5145b79641i9195b5727j65191q8656J0978A86992N7586a95145
$$ plain form
18604 -104746 -304132 -124826 160065 -9842 -31289 -179134 -3185 152167 188326 -287310 -119078
18592 9288 146950 185381 -25129 36800 -53704 -3898 291898 219381 -266739 -273678 109844
18580 -189918 344871 -103874 -252030 -31373 -286384 26271 -39606 845 48602 -38869 -178887
18569 -178887 -266844 -87667 134122 -198883 -35378 383597 298665 -155933 -367412 -35268
18558 -231652 -128971 -327563 -59584 173544 21621 -127889 -8229 -216888 -93531 -130649 -11324
18546 -43674 21970 -262230 35669 -243913 21402 -132630 92096 -172342 -213333 100753 -48428
18534 41517 -327483 -273607 -13349 -157364 -37898 -26024 222354 31467 42608 -291584 52554
18522 -97968 101462 45145 -279641 -99195 -25727 -190918 -279574 -268596 186992 244578 -195145
18510a6662j01139n6113k6310m5899A58149a678j27238l856C0567J04545M7382
18499A82494j3722P143b24180k6807L3794e8969b823m4808l7558c9463A34861
18487B4242l452b69697E4248b24296A90890c67496B94391G852M4015g4166m791
18476g8957K1080j09279J8104D19603c84960E2067d52960d7893C8806H059g1095
18464C03930d1153j36177B8179L9536D166b8528j18998d0702A95460b9824A2450
18452b24327J08224l42557I210a64059l58202B23593b22285p9856a0728B69492
18441a68369N010P2701b0681A18518a47472c5792j73114H3044a43320B09814c76124
18429f5884J9833A84208g3610j73599d0678j2067A61345a41231B7153a48895P1392
$$ plain form
18510 -16662 -117801 -173914 -200224 -246123 158149 -1678 -128916 -132772 30567 135112 182494
18499 182494 168772 175915 -224180 -250987 -217193 -58969 -2823 -47631 -85189 -39463 134861
18487 24242 20790 -269697 54248 -224296 190890 -367496 294391 7852 51867 -74166 -78957
18476 -78957 -57877 -167156 -149052 419603 -384960 52067 -452960 -47893 38806 8059 -71095
18464 303930 -41153 -177330 28179 67715 4166 -28528 -147526 -40702 195460 -29824 12450
18452 -224327 -116103 -458660 9210 -164059 -522261 223593 -222285 -302141 -10728 269492
18441 -168369 -163359 -90658 -20681 118518 -147472 -35792 -208906 83044 -143320 209814 -376124
18429 -65884 -46051 184208 -73610 -247209 -40678 -52745 161345 -141231 27153 -148895 -77503
18418g7503B00285K1300A07376D7531c034j08840E8116a27164j44472d5205A79761
18406b20555A66422j0464N9498H9182k5592B5613M3117e6928A0973c90295A98174
18394a65112l0238D9896j6262e4176k46664a44860p514f2078l1661H8179a82864
18382B03520h7651A11206J75334c3094D8747i0138A91146b32709H1237b31282
18371A74452a59665D72981c27353A05539b24318a1010l05617A11140a84953c2179
18360H7288b96221f4843A34582e6860p1820j27866j9494e1269p9304B937L03317
18349C06254d1886B01691b12022K0105M3120A0183J10890c39633H2667J06678
18339A89345a86375D5296d9174o7240A8926c18876F3491b5834H8573a41797a9553
$$ plain form
18418 -77503 200285 221585 107376 47531 -3034 -111874 58116 -127164 -271636 -45205 179761
18406 -220555 166422 155958 215456 89182 63590 25613 68730 -56928 10973 -390295 198174
18394 -165112 -195350 49896 33634 -54176 -300840 -144860 -152374 -62078 -93739 88179 -182864
18382 203520 -87651 111206 286540 -33094 48747 -90138 191146 -232709 81237 -231282
18371 174452 -159665 472981 -327353 105539 -224318 -11010 -316627 111140 -184953 -32179
18360 87288 -296221 -64843 134582 -56860 -128680 -256546 -276040 -51269 -130573 2937 306254
18349 306254 -41886 201691 -212022 -191917 -148797 10183 121073 -339633 82667 189345
18339 189345 -186375 45296 -49174 -116414 18926 -318876 63491 -25834 88573 -141797 -19553
18327f9603j83116f6243J1578j38444b2966j8970C52853b86077c33l7019J1144
18316b6208m3034C44308A525N8587J31305O0890c2763c99I6491a35782j9044o2121
18304b16947l160C4606c4318B72261a7197n5689B51067M3700A1106J69126g0503
18292f7136R780J1807J6214B76699f53470A46125P5123F7828J98746j27614N3066
18281A92026f315k45010J244C8557f8737b84A44023B9594J17852f4175l6388c3827
18268i1541B5580a28236j37095a20433J9849L3665p5288G623c63856f1986a3566
18256d798r1503A11348e7737B29875a57629A52880j7010E1097a60382D5464c4489
18244b09588B81706d9736j69671E4886c77538d8227j12117F2482Q309A2067K07271
$$ plain form
18327 -69603 -252719 -66243 -54665 -193109 -22966 -41936 352853 -286077 -333 -37352 -26208
18316 -26208 -69242 344308 1525 60112 191417 252307 -32763 -399 96491 -135782 -154826 -216947
18304 -216947 -220107 34606 -34318 272261 -17197 -72886 251067 294767 11106 180232 -70503
18292 -67136 -57356 -45549 -29335 276699 -653470 146125 221248 67828 266574 138960 192026
18281 192026 -6315 -251325 -250081 38557 -68737 -284 144023 29594 147446 -64175 -100563 -33827
18268 -91541 25580 -128236 -265331 -120433 -100584 -66919 -142207 7623 -363856 -61986 -13566
18256 -4798 -96301 111348 -57737 229875 -157629 152880 135870 51097 -160382 45464 -34489
18244 -209588 281706 -49736 -219407 54886 -377538 -48227 -160344 62482 70791 12067 219338
18233B19338C5727a5418k8199p1978q827B4860c9442a7808k10816B06296F906
18221F000c6556A45203b4837A7102i3199h869j65460e6795G1257c34112B1718
18209h0613A99977C5874b74713B5907J03049J21210f6877j77130A54466K29629
18199C84095b45674G2726J83288c77877f1266B68306c3138o2204q7151C86221
18188a30912J6680p2304A47414p0979c30453g7671o4081j10717a14472j56956
18178b71428A8434e4631j48058A01596a36654j38499A13424k7692K0678i8135
18167D1407L86528a14853M7595l45088A59965a05863j09440E1953O2769a74318
18156f8247j08507c8257j31369j97550a12103I6259C0395h908j06872j80592A79361
$$ plain form
18233 219338 35727 -15418 -43617 -115595 -124422 24860 -39442 -17808 -228624 206296 6906
18221 6000 -36556 145203 -24837 17102 -93199 -8869 -174329 -56795 71257 -334112 21718
18209 -80613 199977 35874 -274713 25907 128956 250166 -66877 -244007 154466 384095
18199 384095 -245674 72726 256014 -377877 -61266 268306 -33138 -95342 -182493 386221
18188 -130912 -114232 -186536 147414 76435 -330453 -77671 -141752 -252469 -114472 -271428
18178 -271428 18434 -54631 -202689 101596 -136654 -275153 113424 85732 106410 -98135
18167 41407 427935 -114853 -67258 -412346 159965 -105863 -215303 51953 114722 -174318
18156 -68247 -176754 -38257 -169626 -367176 -112103 96259 30395 -8908 -115780 -296372 179361
18144a58559K6094e7074B03727e5538l8680G9953J80163r3660K9292b9889A92220
18132a4971k81165J27665k2680O084B60238B592Q5029a00511B65339b99509k59215
18121e58724a6206j36228L4243B59230a067E4695K8639b99008d1501j4399C0848
18109B1691e4882j58568A1308J08583B6265a15851j51140J09106j17121h3359
18098a78722H5270J63426f3309A16564A9474J33379b63522C985d1745l9350L2706
18087d8389q6393A03578A1898a34665H929J56414a03760H3212B9656e7066F3350
18075a11639a2401A07203c39237A72167a34959m9996E9510b45858b3543B64405
18064c619A44679K64197D9791b78485d2036A20039a08347l9564A19927j7068A1303
$$ plain form
18144 -158559 -132465 -57074 203727 -55538 -94218 79953 260116 166456 195748 -29889 192220
18132 -14971 -296136 -168471 -191151 -185067 260238 2592 87621 -100511 265339 -299509 -558724
18121 -558724 -16206 -152434 -118191 259230 -1067 54695 83334 -299008 -41501 -55900 30848
18109 21691 -54882 -213450 11308 119891 26265 -115851 -266991 -157885 -275006 -83359
18098 -178722 85270 248696 -63309 116564 19474 152853 -263522 3985 -41745 -81095 -48389
18087 -48389 -134782 103578 11898 -134665 8929 165343 -103760 83212 29656 -57066 63350
18075 -111639 -12401 107203 -339237 172167 -134959 -184955 59510 -245858 -23543 264405
18064 -3619 144679 408876 49791 -278485 -42036 120039 -108347 -147911 119927 102859 11303
18052f017A31881a8596B7730c5492C00662a30335J1370B3168R4294R9100c11101
18040A48688q886c8447F5223g0447L4088E7131R1278d92006A42841F6917k4110
18029D2807R1250c26115m4581a70346B42894a69251A3200Q6007a70397C71727
18018B11164k5367b76839A43798A9072c3394l49695J36345B15774I3845B8290
18007c12579A69072A2569h6848A13111b06601j45758A79450a39693A71892j7955
17997A53937f9958A75511E2300b41290j12525a69560A80798a00893C5653a19850
17986A18236b90596D8518g3607J4171D4650M770h9197H9975c8182C08773D1687
17974b52226R0891G1676H967b09836g7698j91440A40671a6356k02361A5684J66149
$$ plain form
18052 -6017 131881 -18596 27730 -35492 300662 -130335 -118965 23168 117462 216562 -311101
18040 148688 139802 -38447 65223 -70447 -36359 57131 148409 -492006 142841 66917 42807
18029 42807 134057 -326115 -370696 -170346 242894 -169251 13200 99207 -170397 371727
18018 211164 185797 -276839 143798 19072 -33394 -383089 -246744 215774 93845 28290
18007 -312579 169072 12569 -86848 113111 -206601 -352359 179450 -139693 171892 153937
17997 153937 -69958 175511 52300 -241290 -353815 -169560 180798 -100893 35653 -119850
17986 118236 -290596 48518 -73607 -59436 44650 49420 -89197 89975 -38182 308773 41687
17974 -252226 -161335 71676 8967 -209836 -77698 -269138 140671 -16356 -218717 15684 181833
17963A81833a92072D8356K00670a77593P7602B04173i9017j68419O0827a00981
17952D4558J68869I2163b26376B65370E5125c8339D57341A83840a82873E297J376
17941F673b52685A50102K48767b91514J05798G9837c27482A79224J036f9584B57518
17929a94257c2592l11989D1235e8664D2518K1154J0156R631d9443j38766A19599
17917f1954j92521a11702q288o6752M4822j12654C9918A37N8664A8294K42479
17906B60773e0401A67005n2035a54232f3855p8292O0026j71163D8126N1627g1250
17894H5184e0607I7090K75A3091O260P6906k1998J61897f3549b4078j2014j61660
17882a97752L3060b9864A66240a2761k15573N332F769K79036j19870g4641D010
$$ plain form
17963 181833 -192072 48356 249026 -177593 -99991 204173 -99017 -267436 -206609 -100981
17952 44558 213427 92163 -226376 265370 55125 -38339 457341 183840 -182873 5297 6673
17941 6673 -252685 150102 398869 -291514 -185716 79837 -327482 179224 180260 -69584 257518
17929 -194257 -32592 -344581 41235 -58664 42518 63672 73828 83459 -49443 -188209 119599
17917 -61954 -254475 -111702 -119990 -186742 -141920 -254574 39918 137 58801 18294 260773
17906 260773 -50401 167005 114970 -154232 -63855 -142147 -82121 -253284 48126 99753 -71250
17894 85184 -50607 97090 97365 13091 19351 96257 74259 236156 -63549 -24078 -36092 -197752
17882 -197752 -164692 -29864 166240 -12761 -228334 -223002 6769 285805 165935 -74641 4010
17870b20962j31552F205c5224B2667a37804m9408p8609L0369H2820K721N4428
17859A39969B3027J09755A1550j686c01146A37916o3199D865J82188p8809k2765
17848H5479c94483A14049M6796a68921B8026i2400J077A23956c26147a3997m2686
17837e6683j51235A34461a67049C3346L22809d9110Q533B22424J6707K0025d0048
17825C52296a19358r643e5715D8019k442O8404m8963b4455p2084c471B36852i2547
17812A57878o1567J70189j13078d93751f4802K0295C4717J30285l1818J35054
17802B68238A22257M8791j3094J8509a45919B36039E7168a94164e4448J5851j2703
17791e1300j1168D1240b59701A31102E0640K6657b12962I4315P4268e1386A1124
$$ plain form
17870 -220962 -352514 6205 -35224 22667 -137804 -187212 -265821 -235452 82820 85541 139969
17859 139969 23027 132782 11550 9864 -301146 137916 74717 4865 187053 108244 85479
17848 85479 -394483 114049 160845 -168921 28026 -92400 -91323 123956 -326147 -13997 -56683
17837 -56683 -207918 134461 -167049 33346 356155 -49110 -40577 222424 239131 259156 -40048
17825 352296 -119358 -129001 -55715 48019 45577 113981 65018 -24455 -96539 -3471 236852 -92547
17812 157878 96311 266500 153422 -493751 -64802 -44507 34717 165002 133184 268238
17802 268238 122257 171048 157954 176463 -145919 236039 57168 -194164 -54448 -38597 -51300
17791 -51300 -62468 41240 -259701 131102 50640 77297 -212962 94315 168583 -51386 11124
17779A17063c795q1396D6663h1843k401b5597m3423B09198A4853a16758K72k0135
17767a36621f634q0428h467o2153A83872F4894d3049B1598e120k07667R8310d9113
17754E374b81905C79591D5354a17792b9757j31622A42880b47216A21604c0410
17743A52472d590j8962j2817A97070e5826n7754B75123A33934l6324j1998A5270
17731B7665Q4304J07884d1565k31118R5612L942K0668j19230B51261H2937L04528
17720C87465a93455B99677b4263F4848f5340J5828A84183a49544n0877B6691M95307
17709E21998A01628K30847H4979f3855A8879O9171a99540A77629b53923E0329
17698B29794d1432k41367A59477K92895A71426J17088j10385c42633P288C9186
$$ plain form
17779 117063 -3795 -85191 46663 -81843 -84244 -25597 -69020 209198 14853 -116758 -116486 -136621
17767 -136621 -6634 -87062 -8467 -70620 183872 64894 -43049 21598 -5120 -212787 -114477 -49113
17754 5374 -281905 379591 45354 -117792 -29757 -161379 142880 -247216 121604 -30410
17743 152472 -4590 -23552 -36369 197070 -55826 -113580 275123 133934 97610 85612 15270
17731 27665 111969 219853 -41565 -272683 -177071 -173129 -152461 -271691 251261 82937 387465
17720 387465 -193455 299677 -24263 64848 -65340 -49512 184183 -149544 -200421 26691 521998
17709 521998 101628 332475 84979 -63855 18879 88050 -199540 177629 -253923 50329
17698 229794 -41432 -282799 159477 452372 171426 288514 178129 -342633 -335345 39186
17687C57621j20289J13629D5157j9409J601L13147Q6315a84230B24620b19380
17676b25309C31280a82515P4939A37379L4177q5495j0258R65c682J023C4274L8554
17664G2828a60595r0500a5156B45968a52058R48M1236c3990j67948R3438A01808
17652f3698C58398a72601e8866A83195c5731A73860M4085B1743b75858b887o6920
17641f9807g157k21687B22334P0839e1027B61643b02823g2826o6124I3439a83804
17629H0311L281j9285M6237K08023F5926L06814j69758J36906D9073a17946C2575
17617B38938p3190J92023a2503l54676a0363k79263a43861A31758a64854D20356
17606a79775A84112e1907l5953B87554J88721A00738A2500L02503d14057E7275
$$ plain form
17687 357621 237332 350961 45157 25748 27349 340496 426811 -184230 224620 -219380
17676 -225309 331280 -182515 -107576 137379 171556 86061 75803 76768 -3682 -2659 34274 72828
17664 72828 -160595 -251095 -15156 245968 -152058 -151110 -109874 -33990 -201938 -108500 101808
17652 -63698 358398 -172601 -58866 183195 -35731 173860 217945 21743 -275858 -2887 -69807
17641 -69807 -7157 -228844 222334 293173 -51027 261643 -202823 -72826 -138950 93439 -183804
17629 80311 83592 64307 110544 318567 65926 372740 202982 339888 49073 -117946 32575
17617 238938 165748 357771 -12503 -367179 -10363 -289626 -143861 131758 -164854 420356
17606 -179775 184112 -51907 -87860 287554 476275 100738 12500 315003 -414057 57275
17595a39547N4105A58075n1278p807L52483k13931a89110A24539i8014j90486
17585b88500A21036l0003e0358D39537A56105a0370C5692M08605F7742J07120
17575A74862f105A6347J40952i7868m193D5801M4548l5098C615J43268B135c1274
17562B1687R2378M664J13146J33436a6409C50073a11196E4196a88904H1178f3288
17550H3360A214a13297A67321e6064C73014p8761a4449j7935l3948B28440q5269
17539A43171a06595I7626N1098m1761J16402I0861a2221m0675n0253A29189B0996
17527A87047C0580J72185J56780a18198D48422A04718K17532K06142B07359k3978
17517A83381J2724L79509B48625P922o6357K49948B19276P1857J84364A84398
$$ plain form
17595 -139547 -85442 158075 106797 98990 451473 237542 -189110 124539 -98014 -288500
17585 -288500 121036 91033 -50358 439537 156105 -10370 35692 444297 67742 174862
17575 174862 -6105 16347 157299 -97868 -102061 45801 90349 55251 3615 146883 2135 -31274
17562 21687 114065 118729 231875 365311 -16409 350073 -111196 54196 -188904 81178 -63288
17550 83360 1214 -113297 167321 -56064 373014 294253 -14449 -32384 -66332 228440 143171
17539 143171 -106595 97626 148724 106963 223365 90861 -12221 -52896 -103149 129189 20996
17527 187047 30580 202765 359545 -118198 448422 104718 322250 528392 207359 183381
17517 183381 196105 575614 248625 256547 190190 440138 219276 291133 475497 184398
17506A29098M97072k56486J69109B64264A04772J81498j20493J32663I0892J23345
17496B14237a4178A92527C1196i6441B01618m6691J00320R5737A58158k6089K49696
17485C81765C31K17953A00874b000A99868f1262j3544A10879F073f060A64400
17473B29246h2506G0932d1563B25673O20c4412C76533j13383a08440f334A74840
17461C41557E1906J08327O7837r8978J14929n7969f3061Q348B46531H8025N4378
17450A42403M5887M2680A1785K16145R0400K42787B12460l828M7074N4669j5830
17439B94545C1114N3491P9188L40792j68994r9559M25959I8596k2351J12917J64330
17428C53492g7671L2386A73705N6445Q5668j40455L42286J9648A34244N1542n0841
$$ plain form
17506 129098 626170 369684 538793 264264 104772 286270 165777 298440 90892 214237
17496 214237 -14178 192527 31196 -96441 201618 154927 255247 350984 158158 132069 381765
17485 381765 331 218284 100874 -2000 199868 -61262 -74806 110879 6073 -6060 164400
17473 229246 -82506 70932 -41563 225673 226293 -34412 376533 263150 -108440 -6334 174840
17461 341557 51906 160233 228070 129092 244021 186052 -63061 -54713 246531 88025 142403
17450 142403 188290 230970 11785 227930 318330 561117 212460 208632 255706 310375 294545
17439 294545 31114 84605 163793 504585 335591 236032 661991 98596 76245 189162 353492
17428 353492 -77671 -45285 173705 230150 315818 175363 517649 537297 134244 185786 134945
17417A34945o3435K31107o8502r6094P8409I2439N9782J0580K16594f9875B08223
17405I8799R4489a98082O1774A4495K58144A19419l1822P5810K8053a28331L6450
17394i1881C42843j55237c1390F7850h8300A73313J36768a1342B70579m4I4901
17382I957J40417D6118d8027D8853g508B18935j8049g6049i066A15600R4756M0656
17370B51012j01957a20668H1349k457r972J21491d2915I9607j9692J72693C2133
17358E37072A88780b21008C90100j82703B9216f7658I2457k3187J16874p9G8316
17346d01150C52940p6674J55806n9419j82062g8792B32515b6260C07519b08046
17335A01448m0863j3613K19741a7435I5736Q7532H0585J61894I3302L55914B15023
$$ plain form
17417 134945 71510 302617 234115 138021 216430 92439 152221 162801 379395 -69875 208223
17405 98799 193288 -198082 -136308 14495 272639 119419 87597 163407 191460 -128331 -91881
17394 -91881 342843 187606 -31390 67850 -88300 173313 310081 -11342 270579 270535 94901
17382 9957 150374 46118 -48027 48853 -7508 218935 200886 -76049 -9066 115600 210356 251012
17370 251012 149055 -120668 81349 78892 68920 190411 -42915 99607 79915 252608 32133
17358 537072 188780 -221008 390100 207397 29216 -67658 92457 69270 186144 186065 78316
17346 -401150 352940 276266 432072 372653 190591 -78792 232515 -26260 307519 -208046
17335 101448 60585 46972 266713 -17435 95736 183268 80585 242479 93302 449216 215023
17323D67229A02641M2018M2010o4769J90765A11339k4458l0890K29184Q6410k8831
17312C42754c1918G6785B2086b054j57000B42721q6567J94575j64490L70970d6498
17300D47932A50300P805K65589A15019L17150e084A8445J00434a98493A47519
17289B72846K1956j28940L06780j45382A36262K5000a30171B93522E3163L1011
17279H4174L81076A45901a9296D1329K43283N8747k093f8779A78642M80903B14419
17267f4296k17910g0553p5338E3206M0286J22907p7847o4302J80183a34360D07797
17255I6975M29092e9347C35849j08017K16309j10837A13890Q6039K28167A95768
17244B47193f150D16166A59770m6768J7681J20426a2665B08480J02416O4156l6624
$$ plain form
17323 467229 102641 144659 186669 121900 312665 111339 86881 55991 285175 371585 342754
17312 342754 -31918 76785 22086 -2054 -159054 242721 156154 350729 186239 557209 -46498
17300 447932 150300 158105 423694 115019 432169 -5084 18445 118879 -198493 147519
17289 272846 294802 165862 472642 327260 136262 161262 -130171 293522 53163 84174
17279 84174 465250 145901 -19296 41329 284612 343359 341266 -68779 178642 659545 214419
17267 -64296 -282206 -70553 -145891 53206 93492 216399 138552 74250 254433 -134360 407797
17255 96975 526067 -59347 335849 227832 444141 333304 113890 199929 428096 195768
17244 247193 -6150 416166 159770 113002 130683 251109 -12665 208480 310896 375052 338428
17233C38428j10078D0709R1831a21821A38153N8737J39098j57482n0222K83349
17223D11633j84698j5187p562J07957A34394J59630j09337M10609B15484P9551
17213B95035q4624a51970A70643L2720L8357q6893M0203M04311B26200k7257p6073
17202A22870J2577R1902J60831J02829j63768J03712h5261E59154A30994a52927
17191C85300a80691H0032J64360K16411A45720J98726R8868C2835K75955G6349
17180D49959D0052L19816A21306L17733p9012J35357j57821F7600D630J6070L57860
17169C78560K64949C06049j15244K01020A53352n3151a6592A65041J41305E1374
17158C33042j50234p4788J49220A13461K46450l4499J41599j70231K6227K86952
$$ plain form
17233 338428 228350 40709 132540 -121821 138153 196890 335988 178506 128284 411633
17223 411633 226935 211748 204186 312143 134394 294024 184687 595296 215484 295035
17213 295035 210411 -151970 170643 203363 241720 154827 195030 599341 226200 198943 122870
17202 122870 135447 227349 388180 491009 327241 430953 -85261 559154 130994 -152927
17191 385300 -180691 80032 244392 460803 145720 344446 443314 32835 308790 76349
17180 449959 40052 359868 121306 439039 360027 495384 337563 67600 4630 20700 378560
17169 378560 643509 306049 190805 391825 153352 100201 -16592 165041 306346 51374
17158 333042 182808 108020 257240 113461 359911 325412 467011 296780 323007 609959
17148F09959J8883j32015q5712l300A93101J86856j56393J26159j04781h49C30352
17136g639A5776M92030k02129j6167A16895M5073e2781C05759q498j22885K47132
17125D21508j86233K22104j20058m3233R7394j71083K07081A97459N9F9688M62696
17114E32384j71102j00602m6398J52526J27150n6340A98252L4393J11421J32228
17104D76294j26028A14490L9430K58102J32599j50724m5363L240R2902N7629Q5490
17093E87795k51410J1255k4675j54237N13468k48385N0689J14939J75671k07648
17083E67462J6070B54919N73845L6220m09939J92323k21179J12143N1799r9577
17073D90554O1347O7125q7661k7385A66914K88731j60212K58583j3728N1809p8471
$$ plain form
17148 609959 628842 496827 411115 407815 193101 379957 223564 349723 244942 -849 330352
17136 -7639 15776 507806 305677 289510 116895 161968 -52781 305759 297261 174376 421508
17125 421508 235275 457379 337321 294088 391482 220399 427480 197459 197518 69688 532384
17114 532384 361282 260680 214282 366808 493958 437618 198252 232645 344066 476294
17104 476294 350266 114490 153920 412022 544621 393897 348534 351774 444676 502305 587795
17093 587795 336385 347640 322965 168728 682196 433811 484500 599439 775110 567462
17083 567462 583532 254919 828764 864984 455045 647368 426189 538332 590131 490554
17073 490554 551901 619026 531365 503980 166914 455645 295433 554016 540288 592097 513626
17062E13626J19392j94506J05203o8564Q1618k4878l1049J27357j85087J37728
17052E80840o8867l2628K98304C60229K29534j93123j08044J30928Q1859J06991
17042F08374r5239M2382J6169j27878K60809j57471J81817q7588M5560k08789
17032D78146J43095Q3664n7683K37317l73715O3679L1935q5373q2785L42851q5945
17021F95186L0764J02090j66612K17527k16253l23703O04448l29553j99742J80865
17011E95017j02757L39115L8859L5495l95744K16260J86892l58001L08559L3006
17001H96701l36744K94491r6361Q3235J34419k84852K90954r636l07600R1639
16991G56246Q4432m975J94042o8776L0662j60844J90856j08961J35459m00483
$$ plain form
17062 513626 633018 438512 543715 475151 556769 531891 500842 628199 443112 580840
17052 580840 511973 479345 777649 360229 589763 396640 288596 419524 501383 608374
17042 608374 513135 555517 571686 443808 704617 547146 728963 641375 686935 478146
17032 478146 621241 704905 647222 884539 510824 574503 606438 521065 438280 781131 695186
17021 695186 725950 828040 661428 878955 662702 338999 943447 613894 414152 595017
17011 595017 492260 831375 870234 905729 509985 726245 913137 555136 863695 896701
17001 896701 559957 854448 758087 841322 975741 690889 981843 972207 664607 756246
16991 756246 840678 835703 1029745 960969 991631 830787 1021643 912682 1048141 647658
16981F47658M62507l17080k02744K58143J91268j21653o0084J4380O9636j72702
16971G69329J64027J71656j10403M8933j83052J53957J41834j01676K32012m73515
16961H13102o5960N23758j09845L2320k66150L9233J79271o5247M66378l95824
16951A151036K29203l77740K39471J36845k77195J14348K10989k79622l5945k3740
16941A087650J79592K84527j19121Q6967k12428j97772N22582m42902L99036l63771
16931A224360J10134J9620N29612n40284J99839r299k580K47029R511n8814J06838
16920A835966k32948q348K39198m15423J65011J55380r2197j5723L40718n9751
16910A911883k33842q9490L00167k94687r885K67620K7149l2673Q0361J34871
$$ plain form
16981 647658 1110165 793085 590341 848484 1039752 918099 858015 872395 942031 769329
16971 769329 933356 1105012 994609 1043542 860490 1014447 1156281 1054605 1286617 813102
16961 813102 747142 1270900 1161055 1193375 927225 966458 1145729 1080482 1546860 1151036
16951 1151036 1380239 1002499 1241970 1378815 1101620 1215968 1426957 1147335 1111390 1087650
16941 1087650 1267242 1551769 1432648 1519615 1307187 1109415 1631997 1189095 1588131 1224360
16931 1224360 1334494 1354114 1883726 1343442 1543281 1533982 1531402 1778431 1787942 1729128 1835966
16920 1835966 1603018 1594670 1833868 1418445 1583456 1738836 1646639 1630916 1971634 1911883
16910 1911883 1678041 1588551 1888718 1594031 1584146 1851766 1878915 1846242 1926603 2061474
16900B061474j3140J36324k94934K38370j56591J11716J54757j61100J64819j67925
16890B073770N3680N8244L59841k55477q6821K32010O39o4002k22701K90329k47708
16879B191804N57326M4979K9598l02476K11307m4832L048K10911k04605L60008
16869C057068m7538J55250p5790J30094k62650R5752M49008p9259p1678J4843
16859C365100j05624L70013R2001k08808r6377K85642n9290J68980Q1602k7037
16849C866202K15139p7532J53056Q1992K66510j63069J70289p2883J71649J08918
16839D720271j24841L39451q0268J77706j61612L03028L26312J90171m07404R1274
16829E374088M07174j05422J12862L82930j20420K69868M06017j82217k8046J85323
$$ plain form
16900 2061474 2048334 2184658 1889724 2128094 1971503 2083219 2237976 2076876 2241695 2073770
16890 2073770 2127450 2185694 2545535 2290058 2203237 2435247 2435886 2371884 2149183 2439512 2191804
16879 2191804 2749130 2794109 2823707 2521231 2732538 2687706 2690754 2901665 2697060 3057068
16869 3057068 3009530 3164780 3088990 3219084 2956434 3052186 3501194 3421935 3350257 3365100
16859 3365100 3259476 3629489 3721490 3512682 3416305 3701947 3642657 3811637 3893239 3866202
16849 3866202 4081341 4003809 4156865 4238857 4505367 4342298 4512587 4439704 4611353 4720271
16839 4720271 4595430 4934881 4854613 5032319 4870707 5173735 5500047 5690218 5282814 5374088
16829 5374088 5781262 5675840 5788702 6171632 6051212 6321080 6727097 6544880 6516834 6702157
16819F702157L15008j17516L15936L79795l4703L20711j48252M90127K15054J07588
16809H545905K74275M26385k80625L33129K11953L00806K76577K68090J16272
16800A0472767M59611J60521O32735J05499K00654R6010O51388L13881K22642
16791A3315708L76263N72120K90938K88070O79817K28595P74693K61420P38993
16782A7526617K65875M65910Q07938L11369N96605N95669J002522P80877Q28958
16773B3182340O76080J142586O52555O91952J273465R86754J210193J097775J125431
16764C2039131J245169J624819R01697J614733J611607J582287J851110J447985
16756D3918538K124104J877101K032244K371017K489351K327814K957408K451351
$$ plain form
16819 6702157 7017165 6899649 7215585 7595380 7560677 7881388 7733136 8223263 8438317 8545905
16809 8545905 8820180 9246565 8965940 9299069 9511022 9811828 10088405 10356495 10472767
16800 10472767 10932378 11092899 11725634 11831133 12031787 12127797 12779185 13093066 13315708
16791 13315708 13691971 14264091 14555029 14843099 15522916 15751511 16526204 16787624 17526617
16782 17526617 17792492 18258402 19066340 19377709 19974314 20569983 21572505 22353382 23182340
16773 23182340 23858420 25001006 25653561 26345513 27618978 28605732 29815925 30913700 32039131
16764 32039131 33284300 34909119 35810816 37425549 39037156 40619443 42470553 43918538
16756 43918538 46042642 47919743 49951987 52323004 54812355 57140169 60097577 62548928
16748F2548928K659462L448869L120879K958453L937481L526791L515888M281059
16740H9997810L938565L810230M101748M690391L775948M274789M093624M003026
16732A22686131L691237L720245L006331K830584K348077J692649J257268J078051
16724A42310573q7646k89060q99886j629391k034214k570396l138203k895328
16716A28766449m040900l660698l932726m438208m237765m390991l922809m299746
16708I5842606l897190l869955m273446l608915l346635l453242l322140l220733
16700F6850350l149276k675104l009674k312066k685782k369071j716659k716366
16692D6216352j812496j656667j808394j780530j302818j460677j518736j296471
$$ plain form
16748 62548928 65208390 68657259 71778138 74736591 78674072 82200863 85716751 89997810
16740 89997810 93936375 97746605 101848353 106538744 110314692 114589481 118683105 122686131
16732 122686131 126377368 130097613 133103944 135934528 138282605 139975254 141232522 142310573
16724 142310573 142222927 141933867 141033981 139404590 137370376 134799980 131661777 128766449
16716 128766449 124725549 121064851 117132125 112693917 108456152 104065161 100142352 95842606
16708 95842606 91945416 88075461 83802015 80193100 76846465 73393223 70071083 66850350
16700 66850350 63701074 61025970 58016296 55704230 53018448 50649377 48932718 46216352
16692 46216352 44403856 42747189 40938795 39158265 37855447 36394770 34876034 33579563
16684C3579563j024938j200614j461253j078925r39787j002628r97132o12431
16676B5261855r80238r21118r00824o79787o56648o34140l21426r70642p42112
16667A8454920k08718o48635n60276l89282p56355J2396q75035m39495j45236
16658A4444284p17927j12772n11000j55501o47812K5069j64839m68921l64321
16649A1326260l79303l91280k59584j69804j65282l89308J0539k43780j59237
16640I179221k36199J769l79231l60616q899j38824j09023j41154l33138r4822
16630G379084k421k10424j14341m43351J44187l25059J76939J46712p43996j6729
16620E990601N0862j48503J90320n83850N5507n3357j75390p6510k4754j36456
$$ plain form
16684 33579563 32554625 31354011 29892758 28813833 27874046 26871418 25874286 25261855
16676 25261855 24281617 23360499 22459675 21779888 21123240 20489100 20167674 19197032 18454920
16667 18454920 18246202 17597567 17037291 16648009 15891654 15904050 15029015 14589520 14444284
16658 14444284 13726357 13613585 13102585 12947084 12299272 12324341 12159502 11690581 11326260
16649 11326260 10946957 10555677 10296093 10126289 9961007 9571699 9582238 9338458 9179221
16640 9179221 8943022 8944791 8565560 8204944 8196045 8057221 7948198 7807044 7473906 7379084
16630 7379084 7376663 7166239 7051898 6608547 6752734 6427675 6604614 6751326 6007330 5990601
16620 5990601 6041463 5892960 6083280 5499430 5554937 5501580 5326190 5249680 5224926 5088470
16610E088470L11463j43266n62091K74649m3871n24383J79876k39308K18744j3712
16600D546571q3111m32326L15648r6278k88165J12367j01895j367r7461p7815
16590C796168k59447L33474l7887l05546k80113J53213Q899j0724R26k50202K6708
16579C175469J81523l65902J57305j85134K10355O4811l11038N8679k94830K68867
16569B960105q2918K80323l32603q5843j13241J92014j76398J57735l11310O3559
16559B551423k0317k76118P0415J36979J18429K33144l56597k10594k86904L96493
16549B356353j67797k16703K55570N8287j72730J79867l52829K68266J76795j74806
16539B210273m97099M50267k24073K0268L43006m02447K4744K06049k36808o841
$$ plain form
16610 5088470 5399933 5256667 4694576 4969225 4925354 4400971 4580847 4341539 4560283 4546571
16600 4546571 4463460 4031134 4346782 4250504 3962339 4074706 3972811 3971444 3873983 3796168
16590 3796168 3536721 3870195 3832308 3526762 3246649 3399862 3408761 3398037 3398963 3148761 3175469
16579 3175469 3356992 2991090 3148395 2963261 3173616 3238427 2927389 2986068 2691238 2960105
16569 2960105 2877187 3157510 2824907 2739064 2625823 2817837 2641439 2799174 2487864 2551423
16559 2551423 2531106 2254988 2325403 2462382 2580811 2813955 2457358 2246764 1959860 2356353
16549 2356353 2188556 1971853 2227423 2285710 2112980 2292847 1940018 2208284 2385079 2210273
16539 2210273 1713174 2163441 1939368 1959636 2302642 1900195 1924939 2130988 1894180 1887339
16529A887339k79618K85443K6415j25094M4712l27054M11904J11081o31832K60441
16519A663737N3579J65308k94817K83436k92403L0399l76841M53671N8089k68223
16509A475935j28729J40200J17611k05778K01485k8721J60334j36405M31700l73498
16499A654134l81771K58741o7695q5516J79695R6525r7887m49450J61672j83122
16489A085326L79747l24904L5720p0701M05992j81015p6799J95997k82823j3446
16479A153094K75052J04630k45620J97282l14328J03534R6401n7211k37085J60812
16469A236561L25645l99185L85441k33607k42166L9120L65897k77442J3058M0984
16459A254306j69307j492J38127M0307k46631L04083l60964J28771Q9744J72257
$$ plain form
16529 1887339 1607721 1893164 1919579 1794485 1839197 1512143 1924047 2035128 1403296 1663737
16519 1663737 1717316 1882624 1587807 1871243 1578840 1609239 1232398 1686069 1744158 1475935
16509 1475935 1347206 1487406 1605017 1399239 1600724 1572003 1732337 1595932 2027632 1654134
16499 1654134 1272363 1531104 1463409 1377893 1557588 1654113 1556226 1106776 1268448 1085326
16489 1085326 1465073 1140169 1175889 1105188 1511180 1330165 1253366 1449363 1166540 1153094
16479 1153094 1428146 1532776 1287156 1484438 1170110 1273644 1370045 1312834 1075749 1236561
16469 1236561 1562206 1163021 1548462 1314855 1072689 1111809 1477706 1200264 1213322 1254306
16459 1254306 1084999 1083507 1221634 1261941 1015310 1319393 958429 1087200 1176944 1349201
16449A349201F49452P21956l40143j71252M08270q0336j98418l8471o7166L08724
16439A192616k02751n8465K56625n3248j10515k5777k2406Q5375k55134J14212
16429I20532K26022l16553K97395k71564J95021K00376k52577K00916k43853j6782
16419I38933L19440m53364J70988j1242j34718J39467N7711k88037L68860j02052
16409A005986m48677M51902j46084L37138l97685k07507M42928q8220k23138K67397
16399I94040M58N391k3627J95957Q0446j90102J25522l31516J08545k03287M16947
16388A178774E72959L12183j26587K20676k31602K92228m32608K70101m3235l1714
16378H02401P7039J55185l52900J53462j90546K54005J94758k52307Q325r3714
$$ plain form
16449 1349201 649452 1371408 1031265 860013 1268283 1187947 989529 951058 883892 1192616
16439 1192616 989865 931400 1188025 1134777 1024262 998485 976079 1061454 806320 920532
16429 920532 1146554 830001 1127396 855832 1050853 1251229 998652 1199568 955715 938933
16419 938933 1258373 805009 975997 964755 830037 969504 1027215 739178 1108038 1005986
16409 1005986 557309 1009211 863127 1200265 802580 595073 1038001 949781 726643 994040
16399 994040 994498 999889 976262 1172219 1252665 1062563 1188085 856569 965114 761827 1178774
16388 1178774 572959 885142 758555 979231 747629 1039857 607249 877350 834115 802401
16378 802401 879440 1034625 681725 835187 644641 898646 1093404 841097 849422 755708
16368G55708P819K2415m4826j4969L25654k47668J84853p9689k26038K89471j87399
16357G85331j7798J85824m33313K48708j82630O2092K48929n397l77475L09588
16347H23859r3204M13329m03524M38195m64683J20264l41382J29926J06172K72744
16337A001696j17634D12231L49327m2813J9412J90980l61421O6559K03786K4216
16327H62277m1807o9380Q2433m1435P2408r0465j96014L52536j53655J45178k35791
16316F86285K44320j50240J68046l08372r0390r8493J29676M10996m47323J61764
16306G06269J95218m47687L12189k5775Q155J86868k49552Q4446k32670j95750
16296C41711N24245r5100l67005K94634M4633J29494C94530J91976r9571O7353
$$ plain form
16368 755708 763527 785942 741116 726147 1051801 804133 988986 909297 683259 972730 785331
16357 785331 767533 953357 520044 768752 586122 648214 897143 891746 514271 823859
16347 823859 730655 1143984 740460 1178655 713972 834236 492854 622780 728952 1001696
16337 1001696 884062 412231 761558 718745 738157 929137 567716 634275 838061 862277
16327 862277 820470 751090 833523 792088 864496 774031 578017 930553 776898 922076 686285
16316 686285 930605 780365 948411 640039 549649 451156 580832 991828 544505 706269
16306 706269 901487 453800 765989 740214 748369 935237 685685 770131 537461 341711
16296 341711 865956 770856 403851 698485 743118 872612 394530 586506 486935 554288
16286E54288K2276J51891j10143J69373k46909N50013l61677J60996k64202K7227
16276F53133P8049j66737K55731l23466B21314N44670k25893j86075L64446C46221
16265F24526K12479m18463J45944K57699k93248J18618k5244j55957J57426R8263
16255G22043k00498j041j5547N6879J21026j57513r5125N0060k214k22613J75272
16244D30729J52985P0419B96010L55076K82114m25062B02469J73389j60353J34527
16234C50032N98475l11792k41038Q3424J57086A22409J69758K33825R1948Q4145
16224G02085j39878K01813l21167m9716k7735P5602k3947L71026l35159J68979
16214F21903k38920K56817J9455B95732K30150k2792m1143j761K1772p6668j43556
$$ plain form
16286 554288 576564 728455 618312 787685 540776 1090789 729112 890108 625906 653133
16276 653133 731182 564445 820176 496710 221314 765984 540091 354016 718462 346221
16265 624526 837005 418542 564486 822185 528937 647555 622311 466354 623780 722043
16255 722043 521545 520504 504957 561836 682862 525349 430224 480284 478070 255457 430729
16244 430729 583714 654133 296010 651086 933200 508138 202469 375858 215505 350032
16234 350032 948507 636715 395677 479101 636187 122409 292167 525992 617940 702085
16224 702085 562207 764020 442853 393137 365402 441004 417057 788083 452924 621903
16214 621903 382983 639800 659255 295732 525882 503090 461947 460186 481958 405290 261734
16203B61734K39783p2045A87088K09903j7658K83151K0010l08716J71432j86459
16193C58751M63838l87135B15680K55192Q4621k34957J4950j06077J40996K68261
16183F38666J06786l12909r1735l5607H0643K40242J43177k02358J06891L92174
16173G60769B16434L16879O5963k51179m1374J23784P4520j28798A38673M3043
16163A81716K43431A04859L04219J69425j38227k14495A897L50006n9360k8058
16153B64485J71838j5516j42748A31718L20194j95121j03738l7172J84583J03257
16143D03721F7463J72558J18756N4975J15211B24563L12530j16520j21395H4762
16132D91175k6683j46437c000A10128L47883A38601J1031p130m6215K59985A01727
$$ plain form
16203 261734 501517 429472 187088 396991 379333 662484 682494 373778 545210 358751
16193 358751 822589 435454 215680 470872 555493 320536 335486 229409 370405 638666
16183 638666 745452 432543 340808 305201 80643 320885 464062 261704 368595 760769
16173 760769 216434 533313 599276 348097 306723 430507 505027 376229 138673 181716
16163 181716 425147 104859 409078 578503 440276 225781 1897 351903 292543 264485
16153 264485 436323 420807 278059 131718 451912 256791 153053 115881 300464 403721
16143 403721 67463 240021 358777 413752 528963 224563 537093 420573 299178 84762
16132 491175 464492 318055 -3000 110128 458011 138601 149632 142502 96287 356272 101727
16120C55526O5893j246G1625J44139J01909M2026c37017D29523a41896E84030
16109A70141K10044k9622j44118l6160n1527L83035c15505A96343D0068Q638O608
16098E5314j516L78805e2279A76496J37415M7937j54120K24308A58946L7105J36009
16087C32060M9578H2508C0549K74268L05465B14068K4337F9594R5121J9158D1585
16075B84713j26177M7799O5430n0393K14926e6205A57439n8068a88194f7678A14476
16063E131i9486B7523J31046m0811a20432B77378b54779A07384m4907j7203C566
16051B2815K04687L4267C3256b86901F9761b20199C92552a25608A43360P6236
16041B19596b80660h523q849c206A99498b4608k06098c6692G8648a09117B27013
$$ plain form
16120 355526 421419 420173 71625 215764 317673 359699 -337017 429523 -141896 584030
16109 170141 380185 350563 206445 170285 118758 501793 -315505 196343 40068 48706 55314
16098 55314 53798 432603 -52279 176496 313911 361848 207728 432036 158946 196051 332060
16087 332060 381638 82508 30549 304817 610282 214068 238405 69594 164715 183873 41585
16075 284713 158536 206335 271765 221372 436298 -56205 157439 99371 -188194 -67678 114476
16063 5131 -99486 27523 158569 117758 -120432 277378 -254779 107384 62477 45274 3566
16051 22815 227502 261769 33256 -286901 69761 -220199 392552 -125608 143360 219596
16041 219596 -280660 -8523 -17372 -3206 199498 -24608 -230706 -36692 78648 -109117 227013
16029F845d05886A12490l8693b07176E1037c11586B57402j19747a67262a0310
16018g8339P440G961K06204a1912B34384K48398k23718B4153c9597j20411E44366
16006a68793E2747i0676F601K46609N3290r1990a6815E911d6635B95141a2276
15994c14204A71471H4736h369D4146F655M97759A44088K13793J87431K89242k22673
15983F11881p0366J2743B15274q4644E3367K3410k2534J71274P070a94652I3078
15971a37032g07E11718b20248A80837o1027a8407G3153l234c0881A39066b54065
15959b58058C5650C784i9496j56816c9639j13888g4210A28020C2636a63680N9644
15948a04036c5968B34647I7262i9494A62591C7511e6239I4830K66344b89476A5688
$$ plain form
16029 6845 -405886 112490 73797 -207176 51037 -311586 257402 137655 -167262 -10310
16018 -78339 -70899 7961 214165 -11912 234384 482782 259064 24153 -39597 -160008 544366
16006 -168793 52747 -90676 6601 253210 306500 214510 -16815 5911 -46635 295141 -12276
15994 -314204 171471 84736 -8369 44146 6655 504414 144088 357881 545312 834554 611881
15983 611881 541515 554258 215274 130630 53367 76777 54243 225517 232587 -194652 93078
15971 -137032 -707 511718 -220248 180837 119810 -18407 73153 69919 -30881 139066 -254065
15959 -258058 35650 3784 -99496 -256312 -39639 -153527 -74210 128020 32636 -163680 -104036
15948 -104036 -35968 234647 97262 -99494 162591 37511 -56239 94830 361174 -289476 15688
15936a95578e71j71372q2239d3615H5542D1067c4130B3511a51390B20298E7867
15924H8034A108K294J85187p5112k6641B0766a93486A26281i2634e769p284p7383
15912i0436B95329a08250m8019b621q1731l50210E4109h1995D3369P7961j8103
15901A03227h3903A66411B0312f6123i555k05791A97625d8274C59050A21543P6423
15890A97966h5825a7133l6547B71200j06065D3111n735b7412l44659C3335b53686
15878A82715k1715n5935c7486j79562d9997A32975b51541a12298A78007b43958
15867i8341H4075B030b068k45314r3004B82517i8622k01805c6826j17988A08372
15855a25466A67042m2997c9418B25726j09232b8553p6757a7517n714A78685c50340
$$ plain form
15936 -195578 -571 -171943 -254182 -43615 85542 41067 -34130 23511 -151390 220298 57867
15924 88034 1108 3402 188589 113477 86836 20766 -193486 126281 -92634 -5769 -13053 -90436
15912 -90436 295329 -108250 -156269 -2621 -84352 -434562 54109 -81995 43369 121330 103227
15901 103227 -83903 166411 20312 -66123 -9555 -215346 197625 -48274 359050 121543 197966
15890 197966 -85825 -17133 -53680 271200 165135 43111 37376 -27412 -372071 33335 -253686
15878 182715 161000 105065 -37486 -217048 -49997 132975 -251541 -112298 178007 -243958
15867 -98341 84075 2030 -2068 -247382 -340386 282517 -98622 -300427 -36826 -154814 108372
15855 -125466 167042 124045 -39418 225726 116494 -28553 -105310 -17517 -23231 178685 -350340
15843g871C00255l7035a5387q070k28246H2292g6151A31434l4656c97179b6740
15831a30588j24446F973J03429F698a80659Q9135k83214A93915a96573j83718
15821c80291i3547A68434k4077h2496j571j0549A70992a73424P425F5867C776
15809c90807A78512i7006L1257F5600Q9373e7385j94617I7382Q5537F9639b01872
15797I4602b61411A61907E6126b42471A20009k3476a99727A63247N1666b34097
15786a96840c2162c41A68634f1314A93286A160a70770p7740A54189i7344A01666
15774a7978l32115a27957l7962H3586a93800A80458a98987C9268L2410N4390J53476
15763B79544l3937a4847k0585B75307G8185a79909E6814a54985o5159J5870M1207
$$ plain form
15843 -7871 300255 263220 -15387 -23457 -251703 82292 -76151 131434 96778 -397179 -26740
15831 -130588 -255034 6973 110402 6698 -180659 -91524 -374738 193915 -196573 -380291
15821 -380291 -93547 168434 144357 -82496 -84067 -94616 170992 -173424 -165999 65867 3776
15809 -390807 178512 -97006 -65749 65600 154973 -57385 -252002 97382 182919 69639 -201872
15797 94602 -261411 161907 56126 -242471 120009 96533 -199727 163247 214913 -234097
15786 -196840 -32162 -341 168634 -61314 193286 1160 -170770 -248510 154189 -97344 101666
15774 -17978 -350093 -127957 -165919 83586 -193800 180458 -198987 39268 71678 126068 279544
15763 279544 245607 -14847 -35432 275307 78185 -179909 56814 -154985 -220144 -204274 -163067
15752a63067j28526I5822k0211e4441j15805K8400A15271n7287j0956a20888A62077
15740D7959b7854k9760B83932A33375e0917D0587J14308c57118C1659i4763A64977
15728a39807A14498A2831b2908E0017h8825d2294k8641j0189C65093N3818a02416
15716C9737a3233l10107n8937c590A72573o1102M7905a19033F254L33831d96945
15704B80438l7F1900i2946m5162f5022Q855A95088c5926m37657A92520b20507
15692H6000f3772B64699b65342B75785a12561A84944J9328a08397A0241J11016
15682A21257g2709A48436a35510B5063a70202I6269g0255B28614d11048a05139
15671D994a66268d3499q6068m7936D3380d2059j03650A6731e68837F0510a22173
$$ plain form
15752 -163067 -291593 95822 75611 -54441 -170246 -141846 115271 57984 47028 -120888 162077
15740 47959 -27854 -57614 283932 133375 -50917 40587 154895 -357118 31659 -94763 164977
15728 -139807 114498 12831 -22908 50017 -88825 -42294 -70935 -81124 365093 418911 -102416
15716 39737 -13233 -323340 -382277 -3590 172573 111471 159376 -119033 6254 340085 -496945
15704 280438 280401 61900 -92946 -138108 -65022 -56167 195088 -35926 -473583 192520 -220507
15692 86000 -63772 264699 -265342 275785 -112561 184944 204272 -108397 10241 121257
15682 121257 -72709 148436 -135510 25063 -170202 96269 -70255 228614 -411048 -105139
15671 4994 -166268 -43499 -129567 -177503 43380 -42059 -145709 16731 -568837 60510 -122173
15659a03544q9485c9944k01151A2803a04121j07777P491C24678d59514J70589
15649b88925a2583B52627b35702A21245a75020k02414m4054a48214A23608n9792
15639F3816A2239i1435j12331d6560A40585c13525H7412B9147f5527i405A34297
15627E7258J6762d29274A90019a14879A56480C1741a08334q501n9484H3120b5843
15615A08864L09639g2999B23086m9279b23421A02942f2017A79604c0960B70712
15604a30948R102e6633G3386a01232B0978d9522k8328b6977G6937a2922o1990
15593g4912j85555C66111f2405R247F1960b7527m5828Q789j51531k89100c9510
15581A27308a48731g3439o7990E7065h891p0821l80590J08570D78b82837i0577
$$ plain form
15659 -103544 -193029 -39944 -241095 12803 -104121 -211898 -204407 324678 -459514 -288925
15649 -288925 -12583 252627 -235702 121245 -175020 -377434 -421488 -148214 123608 63816
15639 63816 12239 -91435 -203766 -46560 140585 -313525 87412 29147 -65527 -9405 134297
15627 57258 74020 -429274 190019 -114879 156480 31741 -108334 -116835 -176319 83120 -25843
15615 108864 418503 -72999 223086 173807 -223421 102942 -62017 179604 -30960 270712
15604 -130948 -121846 -56633 73386 -101232 20978 -49522 -77850 -26977 76937 -12922 -74912
15593 -74912 -260467 366111 -62405 -53158 61960 -27527 -73355 -64566 -216097 -505197 -39510
15581 127308 -148731 -73439 -141429 57065 -8891 -79712 -460302 -351732 478 -282837 -90577
15569b66173b4564k42957c1938C4357M58586b16799f4957B7446K04675i3695d5671
15557b00168Q4666l6640A92794p2737a90678A18040b49648F9007A8455M8190J13080
15546A79725a53644o184N2171k6966J3591p3282g7703H0665a0995k01672B69002
15534G1216J25223a68523j11615A08023b54872J04064p2504B37975f8071b8085
15523B79960f7072j5800I3497g1791E8302j9795K46532C1507a03247G5445J35032
15512B10477O8410b14830O7349D61326k13260C2483J39291J02690b41008c0376
15501c08781G5816b9803l33077J78473a2042C32526D5398J97649m0469D6965a14656
15489A7278P9849B6191J15572a65275A59082b62B27781a65889n1961A82808b95904
$$ plain form
15569 -266173 -24564 -267521 -31938 34357 492943 -216799 -64957 27446 232121 -93695 -45671
15557 -200168 -115502 -152142 192794 120057 -190678 118040 -249648 69007 18455 66645 179725
15546 179725 -153644 -159828 -107657 -134623 -121032 -194314 -77703 80665 -10995 -212667 269002
15534 71216 196439 -168523 -280138 108023 -254872 -150808 -223312 237975 -68071 -28085
15523 279960 -67072 -82872 93497 -71791 58302 38507 285039 31507 -103247 75445 210477
15512 210477 278887 -214830 -147481 461326 248066 32483 171774 274464 -241008 -30376
15501 -308781 75816 -29803 -362880 -184407 -12042 332526 45398 243047 202578 46965 -114656
15489 17278 97127 26191 141763 -165275 159082 -262 227781 -165889 -217850 182808 -295904
15477f0144H3119b73497i4128q5716D53735R8080B03967q6618g1321D6465K77954
15466C24419a97599d770a761p5545L0688E879J90106d0071A64425c44697C88829
15454G841L75070d5548j16077B4754J14776B552J84411a17889A84924i4141B35270
15442D0622J14950K35616A73319a11159C80511j13565a28621G8923K986E569O6968
15431G2537P1020i7640j28272j086O7756G7610b60748a21362k1687C42700c99104
15419b06775A5116O161J62745c49708j4240a17945k81604A6403K54844A20780
15408D7258i4570D2630J5842b6142l1591C07887a08729B09370K5651B2653a18643
15396A07322C5992e3670k0710G0333J24490o8307k7798O9580B5657g9708m6145
$$ plain form
15477 -60144 83119 -273497 -94128 -179844 453735 551815 203967 117349 -71321 46465 324419
15466 324419 -197599 -4770 -1761 -77306 -46618 5879 195985 -40071 164425 -344697 388829
15454 7841 382911 -45548 -161625 24754 139530 2552 186963 -117889 184924 -94141 235270
15442 40622 155572 391188 173319 -111159 380511 266946 -128621 78923 81909 5569 72537
15431 72537 143557 -97640 -225912 -226998 -159242 77610 -260748 -121362 -143049 342700 -399104
15419 -206775 15116 21277 184022 -349708 -363948 -117945 -399549 16403 271247 120780
15408 47258 -94570 42630 58472 -26142 -57733 307887 -108729 209370 235021 22653 -118643
15396 107322 35992 -53670 -74380 70333 194823 126516 98718 168298 25657 -79708 -125853
15385a25853l76170K36049A95419G1158G265b37607k23458A37358B7747c4856
15374a53140J728A04188a44475A43433f1650A72957g9786A27363m1767a28026
15363a94784H9193K09525a38434F0182K45573j49476m4472P6554f3420G5289h888
15351c46680A06396P6239J5487J5629a08280C2705J39468b01806K5067H6366a13555
15339D2188J70514b82551C02826M2590d7051J5896A42100J88607c53170a01857
15328e5668r8521P427G1376K94697a09130C01381A40680f8751j48710i7405k3145
15317a20550C309f9445b0548C02532b09286B08014o6715E8767B714R8051J34777
15306B35542q3275p3042d8834j95929j6043g8640K4676p7977a4914E5402J37919
$$ plain form
15385 -125853 -502023 -265974 195419 71158 7265 -237607 -461065 137358 27747 -34856
15374 -153140 -151412 104188 -144475 143433 -61650 172957 -79786 127363 85596 -128026
15363 -194784 89193 298718 -138434 60182 305755 156279 111807 188361 -63420 75289 -8888
15351 -346680 106396 182635 198122 213751 -108280 32705 172173 -201806 -176739 86366 -113555
15339 42188 212702 -282551 302826 345416 -47051 -31155 142100 330707 -353170 -101857
15328 -55668 -154189 -146762 71376 366073 -109130 301381 140680 -68751 -217461 -97405 -120550
15317 -120550 3309 -69445 -20548 302532 -209286 208014 141299 58767 2714 100765 235542
15306 235542 152267 79225 -48834 -244763 -260806 -78640 -53964 -131941 -14914 55402 193321
15295A93321K5855a13813p4074L2679A68162J8650q3543J15702a32647A09699
15284a19226A02507a06765B85831j33449e7268j53017f6541o827A1935K67390
15274B79325I3054e3053m7121L9531G4512c23347D4885J06012M1568o1025O1960
15263A93400a22823j7903B53276d02238A5111J12219D6939M7344J44839K03178
15253D42300j50416K6284M11374j19930L32344j86240O0701r3634C58742A59888
15242H0549R4414f6357l1899a5998B7523I245L5068h0412M075H5240K19546a7221
15229A23501K71020A47873a17563I5072a96848L4886A23785i1625A61942b7703
15218A88852A3901b6141A03441M20161c9752H7617p205f6420A75991O1679o0592
$$ plain form
15295 193321 219176 -113813 -187887 -155208 168162 186812 103269 218971 -132647 109699
15284 -119226 102507 -106765 285831 152382 -57268 -210285 -66541 -73368 11935 279325
15274 279325 93054 -53053 -100174 -60643 74512 -323347 44885 150897 192465 131440 193400
15263 193400 -122823 -140726 253276 -402238 15111 127330 46939 94283 239122 442300
15253 442300 291884 318168 729542 609612 941956 755716 816417 722783 358742 159888
15242 80549 174963 -66357 -98256 -15998 27523 9245 44313 -80412 -76337 85240 304786 -17221
15229 123501 394521 147873 -117563 95072 -196848 -161962 123785 -91625 161942 -27703
15218 188852 13901 -26141 103441 523602 -39752 87617 80412 -66420 175991 237670 177078
15207A77078J19395c319k8068k59216d0532E0971a98544J0453G6859J0387A791
15195A77318H2790b2676A44135d1715I2065O5528l2708E8283e0045j75648P637
15184b18056e7156B66152A7308Q0843K9490P8138a9973F3104L27397A87474h6753
15172d4914a6051D48484A32463n6669h7023p492B01768a67581B91095J3177a66230
15160a43669d6963M136B25091B3048M5409g8699E8553L8357J95300E5638a21912
15148b8460k87824B38351a27437e9715B52645L92916A44321b53443A35738K496
15138A38234l7201a51428A04393R0767K1332o3845J75024b0685D0771J9966b04767
15126A26856b25428a08947I4882N7555J36434L3049o5896g4836A92857N0339f4548
$$ plain form
15207 177078 296473 -3319 -31387 -290603 -40532 50971 -198544 -188091 76859 87246 1791
15195 177318 82790 -22676 144135 -41715 92065 157593 124885 58283 -50045 -225693 -218056
15184 -218056 -57156 266152 17308 98151 127641 205779 -19973 63104 390501 187474 -86753
15172 -44914 -16051 448484 132463 75794 -87023 -94515 201768 -167581 291095 304272 -166230
15160 -143669 -46963 -42827 225091 23048 68457 -78699 58553 96910 292210 55638 -121912
15148 -28460 -316284 238351 -127437 -59715 252645 645561 144321 -253443 135738 138234
15138 138234 101033 -151428 104393 195160 216492 152647 327671 -20685 40771 60737 -204767
15126 126856 -225428 -108947 94882 152437 288871 321920 256024 -74836 192857 243196 -64548
15114B69474a61697G12K06328A6441J34500l6217a27041e0800B5111J31872c7224
15102A29554a17595A04132J18732a9698l2190A26668P9153A01513K01074d0894
15091i0695p229A25375A3345N9114J01010A1906b46934B24032c1330C20677j37359
15080A83318J60227P2384F3714J21269Q6950E4103K83761h2642B34141B2574K80697
15069C03271A41770f571B59062C9704I825K88203J1915p2756C1774Q4128h8172
15057A34710L05669A44648J94599J62912D1787L41504A10298J26507R3612j33566
15047A96851Q7893d8074B10123Q7254A29318a8511C24796O1716A31414K30071
15037C61485C063Q3611J96416C3188L50916J47250A26647J61034L9997J49414
$$ plain form
15114 269474 -161697 712 207040 16441 150941 114724 -127041 -50800 25111 156983 -37224
15102 129554 -117595 104132 222864 -19698 -51888 126668 205821 101513 302587 -40894
15091 -90695 -97924 125375 13345 72459 173469 11906 -246934 224032 -31330 320677 183318
15080 183318 343545 415929 63714 184983 271933 54103 337864 -82642 234141 22574 303271
15069 303271 141770 -6571 259062 39704 9825 298028 309943 237187 31774 115902 -88172
15057 134710 440379 144648 339247 502159 41787 383291 110298 236805 330417 196851
15047 196851 284744 -48074 210123 297377 129318 -18511 324796 386512 131414 361485
15037 361485 3063 86674 283090 33188 384104 531354 126647 287681 327678 477092
15027D77092l2078k5377K3321A68903m2260J56321m8674J94943d2317A95831J84372
15016C80203J8563H2601K30826q7001e7246D36064n8468A32479l135K28231L3158
15005C90733A15600K15071M9940J3380j87282b16077B25432J44402j66234c510
14994B23633K36285q0395e4734A99672k9235O792g8630A67386N25623k75897A91222
14982B68370p9819G9651Q9399J8939L39634P9370r1773A62581P7179a77125D42212
14970C56299H0045J27812l307F9175J2852J60044R1863J37732A82689G2791J84261
14959B57052L956K08759k0606B14986F1346J01689P8150G8386L42740N3421B30663
14947B0823M81742A15900a437B87941J45437q6397N4739A96062M3945K37913A7760
$$ plain form
15027 477092 445014 419637 442958 168903 126643 282964 234290 429233 -42317 195831 380203
15016 380203 398766 82601 313427 226426 -57246 436064 377596 132479 129344 357575 390733
15005 390733 115600 330671 380611 393991 206709 -216077 225432 369834 203600 -3510
14994 223633 459918 379523 -54734 199672 170437 177229 -78630 167386 693009 417112 191222
14982 268370 188551 79651 169050 187989 527623 606993 515220 162581 239760 -177125 442212
14970 356299 80045 207857 204550 69175 82027 242071 333934 471666 182689 72791 257052
14959 257052 261008 469767 449161 214986 61346 163035 241185 78386 421126 474547 230663
14947 20823 502565 115900 -1437 287941 433378 346981 401720 196062 240007 477920 17760
14935A57094E8233B4403K48309J04960J32790j65426Q3587o3520L22214M6258
14925G33575B52816O54655C73962K64324q4144J44115J95381l49855p6315J93864
14915F61332N5541j33154j2129K3369M15279m29421J7157o7326k0847r6800J13168
14904E26169A03626M7678J77478j10417L6208j21226J93066q2236K17779o5911
14894C96045k3786j14398j14610b3912C0214L20913q0722K60392E2871K31796
14884B84667A41593M27285k69613k8818K47530k02003j41293J34377J493I0677
14873C77122J03345j1691J3207k05057r3289G6115L93771o9677J3233l8959L14313
14862F88796J75666C51225j70741J72849K30728j56396q3965j31999J75043J88977
$$ plain form
14935 157094 58233 24403 272712 377672 510462 345036 428623 365103 687317 733575
14925 733575 252816 907471 373962 638286 554142 698257 893638 543783 467468 661332
14915 661332 716873 583719 571590 594959 1010238 580817 597974 530648 509801 413001 526169
14904 526169 103626 151304 328782 218365 254573 133347 326413 244177 461956 396045
14894 396045 372259 257861 143251 -23912 30214 351127 270405 530797 52871 284667
14884 284667 141593 568878 299265 270447 517977 315974 174681 309058 310551 90677
14873 377122 480467 468776 481983 276926 183637 76115 469886 400209 413442 374483 688796
14862 688796 864462 351225 180484 353333 584061 427665 343700 211701 386744 575721
14852E75721B55542q5902L68513J65859B68044K48632k32479K27488j63351K78742
14842F27076j46443j57685l3552K13228N8712m3927P7109M04200k77114A92657
14831G68941B21684M16093p6470k36219L76858j58207B59424J08142j39142N27626
14821G56050B57440j3562K04206K22327C20380M45412r8614k30161k5560q0447
14811C31010K43602J2587B77636K36759M46212B99026K58192l1358Q5277k17340
14801C93797n4068L08844J31963C56986J14767P6917J87631B86728L37911j86048
14791D38591J67318o2224A68678L43750L4123j6254k15359K7153N10731l13128
14781E39694K01960j01231j79896K06243A96619O43432C38218K48962j85733j0076
$$ plain form
14852 575721 255542 169640 538153 704012 268044 516676 284197 511685 348334 627076
14842 627076 480633 322948 289396 502624 561336 517409 594518 998718 721604 192657
14831 768941 221684 637777 561307 325088 701946 543739 259424 367566 228424 756050
14821 756050 257440 243878 448084 670411 320380 765792 667178 437017 411457 331010
14811 331010 574612 587199 277636 514395 960607 299026 557218 525860 611137 393797
14801 393797 339729 648573 780536 356986 471753 548670 736301 286728 624639 438591
14791 438591 605909 543685 168678 512428 546551 530297 314938 342091 852822 539694
14781 539694 741654 640423 460527 666770 196619 840051 338218 587180 401447 391371
14771C91371J51979j65564M08175r2275j62669j4996B16275K24031M19978C97877
14760E15329M9478k08770O3303L36402l10085o6560Q1733Q3953j81108K13511
14750E77186K72103k06745J78190k39444m2045k9856k30834M65760l04997O2034
14740E01352L09710k19584B47799L12249J83469j88934R4603j07433O2034Q7397
14730F91184J04109q8475k26880O2727J88599M9337q2109O0481J12636R6726K52592
14719A220927j25102K8614n6053C36874N37241O0492l59634K97106m1893j44263
14709F85923Q9404j09460J04381K11895l10231M03612j21957k58911K56729m7786
14699I03599k01685J22176j00534K59189L0671k81338K08129j35086M1221K11987
$$ plain form
14771 391371 543350 377786 785961 693686 531017 516021 216275 440306 860284 397877
14760 515329 564807 356037 419340 755742 445657 379097 460830 544783 363675 577186
14750 577186 849289 642544 820734 581290 539245 509389 278555 744315 439318 501352
14740 501352 811062 591478 247799 560048 743517 554583 649186 541753 603787 691184
14730 691184 795293 706818 479938 542665 731264 780601 698492 758973 871609 968335 1220927
14719 1220927 1095825 1124439 1068386 336874 874115 934607 574973 872079 830186 685923
14709 685923 775327 665867 770248 982143 671912 1075524 953567 694656 951385 903599
14699 903599 701914 824090 723556 982745 1013416 732078 940207 805121 846342 1058329
14689A058329m25243K29345k42531K37736l36505K49965R5982l82499O76784k21449
14679I39914j51267N3436p9382P2732l2445J20348k01483L77981l44231O0767
14669H16370M3815R5732j05378R2414k26189O2310K29039P5754k59353M12312
14659A236826l78249J85936p0459J20842j06841k82101J13302p990o6958M06786
14649A151094o6725j5875O4369k52984M15570k92730R9763K3747j77825L93937
14639A342341l06247M38278j08972O039j07209j91275q8969m1967K58985M4409
14629A245413j74826R2334K0539l05747J05014K21472j32402j18329q8744J37456
14619A002180L05681j410l84105O75189k45525M960J81258j85976j68061J75496
$$ plain form
14689 1058329 633086 862431 619900 857636 521131 771096 867078 484579 1161363 939914
14679 939914 788647 842083 762701 835433 802988 923336 721853 1099834 755603 816370
14669 816370 860185 955917 850539 942953 716764 779074 1008113 1083867 824514 1236826
14659 1236826 858577 1044513 974054 1094896 988055 705954 819256 811266 744308 1151094
14649 1151094 1084369 1068494 1132863 879879 1295449 1002719 1102482 1126229 948404 1342341
14639 1342341 1036094 1474372 1365400 1371439 1264230 1072955 983986 942019 1201004 1245413
14629 1245413 1070587 1162921 1183460 877713 982727 1204199 1071797 953468 864724 1002180
14619 1002180 1307861 1306451 922346 1597535 1352010 1356970 1538228 1352252 1184191 1359687
14609A359687k02190K59026k63910o2227L08533j39628L69457k00550k60463K89768
14599A457503L70218p51920M67109j61159J05665j92578M23597j31497r2329K68738
14589A763347r3355Q1803J9518M5917R1541k45020K79904k79611L7721J90995
14579A892760j55874L38477n29725j7672O5421N55877m68245K37694L93253k42136
14569B069830j8678O0372L04056p2605j99467K3693K46900J6602L90625l57945
14559B463383j73424M45716P0790O54567k31225J61894J57572Q50583O80070R77799
14549F057725L096046M426630Q047283J1283647j260188j4219591H441391l768438
14541D672953j271325o79043p28012J61746k6847j48670L77600o12793L54186
$$ plain form
14609 1359687 1157497 1416523 1152613 1090386 1398919 1259291 1628748 1428198 1167735 1457503
14599 1457503 1827721 1075801 1542910 1381751 1487416 1294838 1718435 1586938 1494609 1763347
14589 1763347 1669992 1751795 1771313 1817230 1908771 1663751 1943655 1664044 1701765 1892760
14579 1892760 1736886 2075363 1545638 1527966 1593387 2149264 1681019 1918713 2311966 2069830
14569 2069830 2051152 2111524 2415580 2342975 2143508 2167201 2414101 2430703 2821328 2463383
14559 2463383 2289959 2735675 2806465 3461032 3229807 3391701 3549273 4399856 5079926 6057725
14549 6057725 9153771 13580401 21627684 32911331 31651143 17431552 8441391 4672953
14541 4672953 3401628 2722585 1994573 2156319 2129472 1980802 2358402 1745609 2099795
14532B099795L078n00119L3609J53945L13822k13581L98922J67794l49980J7201
14522B124486J39972j55083K66252J85722M0980p2954j27512K41968j42038j28816
14512B372977K08125j61737K64032K48026m75760K22854L0535J10591r8861l702
14502B717080m6074K08927n9626j14581K98449l07766M94579K5934k17765k570
14492B996587K71740p1012j38943K98423j69579K62500m2042k12937L63185J30549
14482C688471k70387R6696J64654N424p9551r278K31669k74787J85937K94563
14472D033411l70922M27002P4428l01190m6098L75940l7884P2084K22143k4102
14462D424812O3589k51691j48083M06689J52392Q9099J58617R4124k40723K27950
$$ plain form
14532 2099795 2102873 1602754 1636363 1790308 2104130 1890549 2289471 2457265 2107285 2124486
14522 2124486 2264458 2109375 2375627 2561349 2602329 2529375 2401863 2643831 2501793 2372977
14512 2372977 2581102 2419365 2683397 2931423 2455663 2678517 2709052 2819643 2720782 2717080
14502 2717080 2671006 2879933 2820307 2705726 3004175 2696409 3190988 3216922 2999157 2996587
14492 2996587 3268327 3197315 3058372 3356795 3187216 3449716 3407674 3194737 3557922 3688471
14482 3688471 3418084 3514780 3679434 3684858 3605307 3596029 3827698 3552911 3738848 4033411
14472 4033411 3662489 4089491 4163919 3862729 3816631 4192571 4154687 4226771 4448914 4424812
14462 4424812 4488401 4236710 4088627 4495316 4647708 4736807 4895424 4989548 4748825 4976775
14452D976775j42827K30091j20532L32016j39040r5725J68447K64393j33466J15539
14442E455671r3255L20366j85263J24882K4196L84647R104j02461J83848L25633
14432F447368J23130j38281m09615O16952K34528n0429l47034K04222P9192J90677
14422F950710M07191p5837K35752M5099j61504M28211k22343O20792q7365J30331
14412H271037K07914M37057n05757J40337K64405J08672L89159j44700L41621
14403I509745j53196L19570p004M14937k2710J72354L35091J8871K56367R7745
14393A0941770j37697N10885K38387L1081K84843L75478q6735M97195L3382M84380
14383A3172969n2763J62562P11977k7345J45612P50412n9316J30361M22543M58340
$$ plain form
14452 4976775 4833948 5064039 4943507 5275523 5136483 5040758 5209205 5473598 5340132 5455671
14442 5455671 5362416 5682782 5497519 5622401 5646597 6031244 6040348 5937887 6121735 6447368
14432 6447368 6570498 6432217 6022602 6639554 6874082 6823653 6476619 6680841 6760033 6950710
14422 6950710 7357901 7282064 7517816 7562915 7401411 7829622 7607279 8228071 8140706 8271037
14412 8271037 8478951 8916008 8410251 8550588 8814993 8923665 9312824 9168124 9509745
14403 9509745 9356549 9676119 9669115 10084052 10061342 10233696 10568787 10587658 10844025 10941770
14393 10941770 10804073 11314958 11553345 11584426 11869269 12244747 12158012 12655207 12688589 13172969
14383 13172969 13120206 13282768 13994745 13967400 14113012 14863424 14804108 14934469 15357012 15815352
14373A5815352K04140K78173p8414O13539K77868O94544K23150N74722J26342
14364A8729416O36591L27250M57306N30288K01220R26584K83770M49570M27935
14355B2969930N36999Q47122J29880O63388R90901L64407M03442R95113N41293
14346B8442475Q66257P18664Q98121P61518R74495P44822O32712J555294M03090
14337C5997448J379446N07028J450702J346160Q98895J407820J340784P82518
14329D5110801K106016J556469R03437K228314J672083J763870J716640K307841
14321E9365471J796860K171759K135710K752087K253018K755249K685381K980341
14313G8895876L044973L050355L750372L782828L782157L921783M178583M675000
$$ plain form
14373 15815352 16019492 16297665 16219251 16832790 17110658 17805202 18028352 18603074 18729416
14364 18729416 19366007 19693257 20150563 20680851 20882071 21808655 22092425 22541995 22969930
14355 22969930 23506929 24354051 24483931 25147319 26138220 26502627 26906069 27901182 28442475
14346 28442475 29308732 30027396 30925517 31687035 32661530 33406352 34039064 35594358 35997448
14337 35997448 37376894 37883922 39334624 40680784 41579679 42987499 44328283 45110801
14329 45110801 47216817 48773286 49676723 51905037 53577120 55340990 57057630 59365471
14321 59365471 61162331 63334090 65469800 68221887 70474905 73230154 75915535 78895876
14313 78895876 81940849 84991204 88741576 92524404 96306561 100228344 104406927 109081927
14305A09081927M769267M793756N612880N485032O196853O212676O992909O988109
14297A56133409P623452Q339482Q482975R024635R419226J0366668J0282641J1588633
14289B31261121J1736165J2100572J2824757J3666627J3823356J4659257J4746104
14282C24817959J4847304J4936347J5069093J4389843J3939322J2801829J1910629
14275D22712326J0129209P249744L135460N82232M94537m6209k309227l209171
14267D38738901n011886p657373r338933j0978448j2857516j4675656j5064961
14260C63154128j6186292j5409761j5946247j5348208j4576509j4361350j3904874
14253B57420887j3273254j2308952j2227595j1129905j0459023j0205527r356316
$$ plain form
14305 109081927 113851194 118644950 124257830 129742862 135939715 142152391 149145300 156133409
14297 156133409 163756861 172096343 180579318 189603953 199023179 209389847 219672488 231261121
14289 231261121 242997286 255097858 267922615 281589242 295412598 310071855 324817959
14282 324817959 339665263 354601610 369670703 384060546 397999868 410801697 422712326
14275 422712326 432841535 440091279 443226739 443808971 444303508 444257299 441948072 438738901
14267 438738901 433727015 426069642 416730709 405752261 392894745 378219089 363154128
14260 363154128 346967836 331558075 315611828 300263620 285687111 271325761 257420887
14253 257420887 244147633 231838681 219611086 208481181 198022158 187816631 178460315
14246A78460315q945638q274075p436036p697164o922791o596019o089820n590904
14238A20907868n353837n018294n053049m378792m207366m267485l548186l192483
14230H5888376l154666l759750k810271l138044k716373k597340k604273k267949
14222F2839710k332795j863869j673182k260297j679565j931386j802405j143388
14214D8152823j368554j520277j176986j430187j382727j263814r91516r63931
14206C8054831j014597r98206j326441q02206p84544o68093r47889r38560q72438
14197B9701857q29021p72260q11755l51648n86858p77033m72977r47881o18234
14188B3534190k39582r34471p6415n42404n52250m91210l80483m75716k45271
$$ plain form
14246 178460315 169514677 161240602 153804566 146107402 139184611 132588592 126498772 120907868
14238 120907868 115554031 110535737 105482688 101103896 96896530 92629045 89080859 85888376
14230 85888376 82733710 78973960 76163689 73025645 70309272 67711932 65107659 62839710
14222 62839710 60506915 58643046 56969864 54709567 53030002 51098616 49296211 48152823
14214 48152823 46784269 45263992 44087006 42656819 41274092 40010278 39018762 38054831
14206 38054831 37040234 36042028 34715587 33913381 33128837 32460744 31512855 30574295 29701857
14197 29701857 28872836 28100576 27288821 26937173 26350315 25573282 25100305 24152424 23534190
14188 23534190 23294608 22360137 22283722 21741318 21189068 20697858 20317375 19841659 19596388
14179A9596388n46993k93160n00709n48789j02905o11762m00695J93043n27577
14170A6256841l87706l46685j77555k50617j91744l27005k08377j87433n71312
14161A3608407j43376j3038k25312m31124k12744j52651k68219k65383k97225
14152A1599335Q7983m98083m6370j43982j6375k75208k17969k31252j48747l35383
14142I773949j34955K08698j66390L143l76149l05596j51836l185j05372k22682
14132H519625o5679j75131k17436n2674K6717j27716p3631l46857m5647K70734
14122G712305j96025j60921o7798j49484k47820J26343N3127n30043J85652k46059
14112F479277j55877j58553J42805K77555o64490L99004k26419q6252l01878l4141
$$ plain form
14179 19596388 19049395 18756235 18255526 17706737 17603832 16992070 16591375 16784418 16256841
14170 16256841 15869135 15522450 15344895 15094278 14902534 14575529 14367152 14179719 13608407
14161 13608407 13465031 13451993 13226681 12795557 12582813 12430162 12161943 11896560 11599335
14152 11599335 11687318 11189235 11142865 10998883 10982508 10707300 10489331 10258079 10109332 9773949
14142 9773949 9638994 9847692 9681302 9684445 9308296 9002700 8850864 8847679 8742307 8519625
14132 8519625 8453946 8278815 8061379 8008705 8035422 7907706 7834075 7487218 7441571 7712305
14122 7712305 7516280 7355359 7287561 7138077 6890257 7016600 7069727 6539684 6725336 6479277
14112 6479277 6323400 6164847 6307652 6585207 5920717 6319721 6093302 6007050 5705172 5671031
14102E671031n85119O31817L76654m53121j37667l03188K10176l98893J646k2321
14092D991015K19431l24240m11261N01477n1804k60896J2134J96646l89403J06462
14082D589561O6085M430m81313J55213K24818L6114l56405l1775P5286q5937j57589
14071D038488K5369k04999k08547M2657J47991j33659M61297k61653l19311K73281
14061C860914J23062k29734j06775J32886j59676k71276l8900J19394p5070J11639
14051C466464K63863p09845L71909k47797J6914N3326m38638M05244l33099M84119
14041C332460m00303J18721J02774J54463n11530R5734J32614J05047k89486N3558
14031B894052n6816j1745L6239K43072m74613n2582N1024o3827L83520m63910
$$ plain form
14102 5671031 5085912 5717729 6094383 5641262 5503595 5200407 5410583 5011690 5013336 4991015
14092 4991015 5210446 4886206 4474945 4976422 4924618 4663722 4675856 4872502 4483099 4589561
14082 4589561 4655646 4660076 4178763 4333976 4558794 4594908 4238503 4206728 4282014 4196077 4038488
14071 4038488 4063857 3858858 3650311 3692968 3840959 3707300 4168597 3906944 3587633 3860914
14061 3860914 3983976 3754242 3647467 3780353 3620677 3349401 3310501 3429895 3354825 3466464
14051 3466464 3730327 3020482 3392391 3144594 3161508 3214834 2776196 3181440 2848341 3332460
14041 3332460 2932157 3050878 3153652 3308115 2796585 2892319 3024933 3129980 2840494 2894052
14031 2894052 2837236 2825491 2861730 3104802 2630189 2577607 2628631 2564804 2948324 2484414
14021B484414R5597l14055K21566j89387K02714l35156L79316j05429l3904l4300
14011B371376n2693N8769j93944Q389M02011n12178J86440j34186K76969l13696
14001B097257K62481Q1095n06782K31032j92740P9467N8279j11577N33194J51719
13991B683425q1142J035958J627739L662759O624143J2089359M904278j0499868
13983B2046651r320486m630274j823866j678764o18561k49688p72728j45004n7514
13974B749766J8802j30258j81047m8929J12677n34364N38235n98364L57904k84578
13964A999844J19790O4216r7986o9510k05626L77493k97998k50057M43163j18811
13954A964518J058j82671j75387K14090k35761R0707J98385p7270p0475O6850
$$ plain form
14021 2484414 2580011 2265956 2487522 2298135 2500849 2165693 2545009 2439580 2405676 2371376
14011 2371376 2318683 2377452 2183508 2191897 2593908 2081730 2268170 2133984 2410953 2097257
14001 2097257 2359738 2440833 1934051 2165083 1972343 2051810 2110089 1998512 2531706 2683425
13991 2683425 2602283 3638241 5265980 8928739 15552882 27642241 32546519 22046651
13983 22046651 12726165 8095891 6272025 4593261 3974700 3725012 2952284 2807280 2749766
13974 2749766 2768568 2638310 2457263 2408334 2521011 1986647 2524882 1926518 2284422 1999844
13964 1999844 2119634 2183850 2085864 2016354 1810728 2188221 1890223 1640166 2083329 1964518
13954 1964518 1965576 1782905 1607518 1821608 1585847 1676554 1874939 1797669 1727194 1794044
13944A794044L3174j85929j53611J23593J49000l76880K02009R7691o9949Q6788
13934A699930m29421K36401m6346m58206Q75961k37217j17513J00920J81499m35532
13924A370476J78587j21756J01109j62538J06168K4504m3861j35761k25487J55712
13914A247153M14055k29239N778j17554K30231p2857K80991o69080n4973M84701
13904A519206l05401K35435k00193p5858O4684J95280m92488L76058P2385k38124
13894A150984J17911l72389J20941J15482k67605M18322l4074k6105J17146J39740
13884A480353m5020j65988j66269k606l63133J87844J20216J41437O9121o2908
13874A193047j94159Q6062j35979n5018Q0780J11637J00292R9723j82752L2895
$$ plain form
13944 1794044 1827218 1641289 1487678 1611271 1760271 1383391 1585400 1683091 1613142 1699930
13934 1699930 1270509 1506910 1460564 1002358 1878319 1641102 1523589 1624509 1806008 1370476
13924 1370476 1549063 1427307 1528416 1365878 1472046 1496550 1452689 1316928 1091441 1247153
13914 1247153 1661208 1431969 1437747 1320193 1550424 1477567 1758558 1089478 1034505 1519206
13904 1519206 1213805 1449240 1249047 1173189 1237873 1433153 940665 1316723 1389108 1150984
13894 1150984 1268895 896506 1017447 1132929 865324 1283646 1249572 1223467 1340613 1480353
13884 1480353 1435333 1269345 1103076 1100470 737337 925181 1045397 1186834 1255955 1193047
13874 1193047 998888 1084950 948971 893953 974733 1086370 1186662 1286385 1103633 1136528
13864A136528m7850p2533M3586J40775l79470l05649O26479j28295q9032P5017
13854I99556K9180j47943P6352P9428j69463k42244N67453J055k11081k2142J57777
13843A117928n03081J10566P7360K0949q6510Q1924m739K33889m37909L35585
13833I45962j80602n1998L2409J18285m7683J34007J55286l13079J6445k04158
13823F04874L10496M1490K38660l25492j53446j7661J38240N4916o7336p3898
13813G50843N2035P0041L4882C41280J81115L62277l6865k51882K09801j28220
13803F77506n2448J8506j85919K75084j585m4312J57567k73576L35342k79332
13793F26833J49783J07962J87980k00200r4180K9125k54104Q6235j45845J3821
$$ plain form
13864 1136528 1088678 1016145 1059731 1200506 821036 515387 1141866 1013571 924539 999556
13854 999556 1028736 880793 957145 1036573 867110 624866 1192319 1193374 982293 960151 1117928
13843 1117928 614847 725413 802773 823722 737212 819136 814397 1048286 610377 945962
13833 945962 765360 713362 745771 864056 816373 950380 1105666 792587 809032 604874
13823 604874 915370 956860 1195520 870028 716582 698921 837161 892077 824741 750843
13813 750843 802878 872919 907801 341280 522395 884672 847807 595925 805726 677506
13803 677506 625058 643564 457645 732729 731144 686832 844399 570823 906165 626833
13793 626833 776616 884578 1072558 872358 778178 807303 553199 639434 493589 507410
13783E07410L14457l8788p3147L8733J26996r6412R9876C64037L67759l45234
13773C86562L26576k27132K26851N2041J1454m7764K12961k67883B88578L84667
13763F73245j71347L22041k40197R8469k63504L94694k2798j02965Q9416j92489
13753E84565k30300L59952l0702J14424j42655J24504k78834K57283q8853l3547
13743F35837J21727j89175M646K32079k87697j33146P1099j58015J61960K05786
13733F65101J39641j19699K197C16359L4533L77781C13916J42413J32969j58268
13723D31030n071K4886L96934k28661r7207k44081K01216p796k547M3410L21311
13712H33424p9240p8565r3801k36160K55241N6620j73550K5891K16878j15859
$$ plain form
13783 507410 821867 783079 709932 748665 875661 779249 879125 364037 731796 386562
13773 386562 713138 486006 712857 764898 776352 728588 941549 673666 288578 673245
13763 673245 501898 823939 583742 682211 418707 813401 790603 687638 777054 584565
13753 584565 354265 714217 683515 797939 655284 779788 500954 758237 669384 635837
13743 635837 757564 568389 573035 805114 517417 384271 455370 297355 459315 665101
13733 665101 804742 685043 687240 316359 350892 728673 313916 456329 589298 431030
13723 431030 425959 450845 847779 619118 521911 277830 479046 471250 468703 512113 833424
13712 833424 754184 675619 581818 345658 600899 657519 483969 509860 726738 610879
13702F10879k16749O3853n8458m4319J02132J92345k40394m8894Q0811j29357
13692C11849J58433P4789A92397J42904L5918J76832k06106o3119K42826J20045
13682F41697l06426K73790L5626m6697O4783B23041Q6539J63106J34050k93074
13672C13662J22452K75605H3943J77648L41639K74287j25056C22105J29454J09470
13662E61029r2952j58428J66679K08654j9740l06058O5237M9751l4096o1859K36256
13651F14473B93759L5801L03171J06567j65372A96756K37540k05956N8183L22326
13641F08849J10495l41301j42319K98450k023j40915n6411M5744M0132J18918
13631E39619B29301p699J56173J22245J9833k55717L3826j37195K9075J23144
$$ plain form
13702 610879 394130 457983 399525 355206 457338 649683 409289 360395 441206 311849
13692 311849 470282 545071 192397 335301 371219 548051 341945 278826 521652 641697
13682 641697 335271 609061 644687 597990 662773 223041 309580 472686 606736 313662
13672 313662 436114 711719 83943 261591 603230 877517 752461 322105 451559 561029
13662 561029 468077 309649 476328 684982 665242 359184 424421 474172 440076 378217 614473
13651 614473 293759 329560 632731 739298 573926 196756 434296 228340 286523 608849
13641 608849 719344 378043 235724 534174 532151 391236 334825 380569 420701 539619
13631 539619 229301 221602 377775 500020 519853 264136 297962 160767 189842 312986
13621C12986L2422K2353j15488K26282I3116M41255m4749J2312k35801M19268
13611F85401B67123A31804J85725M79870B4620L96171m0548I9022J57487K7733
13601B84242l9242K44563k02709K350R7155p8975J27701j04712r9870N8986J52177
13590D41666q5486A76918L07702F3665J66198L69951j72330H8090Q873J90471
13580B87434I3861J40054K98513j03711j5997H5805J92487A38769K29329M59693
13570H27791A35829J32716A23436J6594M56988B28976J88901A52370K28427H7623
13559C66447B0208N06901A70886K31087M7304m2466q8466M2360J20221j53069
13549C27857j07052O0521I8124L25847n5669g9608B53900K12229r9654P7129j99489
$$ plain form
13621 312986 345408 367761 252273 478555 93116 534371 489622 501934 266133 685401
13611 685401 267123 131804 317529 797399 24620 420791 380243 99022 256509 284242
13601 284242 245000 489563 286854 289204 386359 307384 435085 330373 230503 289489 441666
13590 441666 356180 176918 484620 63665 229863 599814 427484 88090 96963 287434
13580 287434 93861 233915 532428 428717 412720 85805 278292 138769 368098 827791
13570 827791 135829 268545 123436 140030 597018 228976 417877 152370 380797 87623
13559 366447 20208 527109 170886 401973 449277 406811 318345 360705 480926 327857
13549 327857 220805 281326 98124 423971 368302 -79608 253900 466129 366475 443604 244115
13538B44115j0297o1944l3730Q5198q1868J47041a21957F26959k31570j08558
13528B86831I0757L1514G973J27420N1707a27633C51070J66009G6271J41332L55289
13517E72892A83227k0210E9726K54922J20115a33781A38145Q5724a14878a0858
13506B06519N5906r849r782r1503K78804h2240B99124K88474k75113n1720k4792
13495B35973o4688j656P2641n3972I3669R5533O5316C6289J81727A4825K05526
13484B20351J52720J11319F4234L25073n017e3790C6284P21115k82261O210j71864
13473C09484J03576P4476j12946j66334K3333J52955n0082J45401K5176k01381
13463C03658Q0054K01298p0050j46601a22796C0200M11269k8960A82849J21498
$$ plain form
13538 244115 233818 171874 138144 223342 141474 288515 -121957 626959 395389 286831
13528 286831 90757 122271 7973 135393 187100 -127633 351070 517079 76271 217603 572892
13517 572892 183227 163017 59726 314648 434763 -133781 138145 223869 -114878 -10858
13506 206519 262425 252576 242794 151291 430095 -82240 299124 587598 312485 260765 235973
13495 235973 171285 169629 242270 188298 93669 189202 254518 36289 218016 14825 220351
13484 220351 373071 484390 64234 389307 384290 -53790 36284 757399 475138 481348 309484
13473 309484 413060 487536 374590 208256 231589 384544 334462 479863 505039 303658
13463 303658 383712 585010 514960 368359 -122796 30200 441469 412509 182849 304347
13453C04347J46555n1040A74865n0175J47520K0213k993G3568K14585H477N6014
13442F4491k8J80878K16813A63052R7526r7514K38724K8249q3149o9732J463p3263
13430B05356K19371b13708B82483m5806H7135K21781n2656J12405A03663a5537
13419D62310A72633K66256A53891N4802p3563J59930g1665A08250h6948A29723
13408D67279j89163M2685c25591c508D71504I599J04608K05995Kj06212a72060
13396A08578b4516o2982B29366o209f1457A32933n5061K37991o315A76J10343
13385A10519M03805k53800K46496k05326E6974M37355c9092B95789l3979q2876
13375A78934K28937a325F33132K0859A70374J10479I5879L5202j1929D8579P1711
$$ plain form
13453 304347 450902 399862 174865 124690 272210 292423 289430 73568 288153 8477 64491
13442 64491 64463 245341 462154 163052 260578 163064 401788 430037 346888 277156 278619 205356
13430 205356 424727 -213708 282483 236677 87135 308916 256260 368665 103663 -15537
13419 462310 172633 438889 153891 208693 135130 295060 -71665 108250 -86948 129723
13408 467279 278116 320801 -325591 -3508 471504 9599 114207 320202 320204 213992 -172060
13396 108578 -24516 -87498 229366 223157 -61457 132933 77872 315863 309548 176 110519
13385 110519 514324 260524 507020 301694 56974 494329 -39092 295789 261810 178934
13375 178934 407871 -1325 633132 653991 170374 280853 95879 131081 119152 48579 120290
13364A20290J6302J96450j36374A3222J08075J59355G5192K79882n2747O1156
13354C63483r9825d6788A22223P3928M2950j09590J18934P216B5366g8500A18182
13342B31117J90991r0146H5452q712J23503R7817B8719M24625A85524H0207J56587
13331B36794K92899A59144L12326F5108L23783A56277L25920j79798I3453J5307
13321A08760a84028A94240C4505K55833P2609p5363j35225J08558m3140l3308
13311A84469A0082J16380K55435d4605B24034R4088b2561j04216B24089l5370
13301A88719C3266a99416A09986i5701r1578G8698a4181E41541A87992n4258F6143
13289A58380M984K59335E094K33391m1261K49730A77155k9975B8476K39972f2269
$$ plain form
13364 120290 136592 333042 196668 13222 121297 280652 75192 355074 302327 363483
13354 363483 263658 -46788 122223 196151 239101 129511 248445 255661 25366 -78500 118182
13342 231117 422108 331962 85452 76740 200243 298060 28719 453344 185524 80207 236794
13331 236794 529693 159144 471470 65108 388891 156277 482197 302399 93453 108760
13321 108760 -184028 194240 34505 290338 362947 287584 152359 260917 217777 184469
13311 184469 10082 126462 381897 -44605 224034 318122 -22561 -126777 224089 188719
13301 188719 33266 -199416 109986 -95701 -187279 78698 -14181 541541 187992 133734 66143
13289 158380 163364 422699 5094 238485 197224 446954 177155 147180 28476 268448 -62269
13277D07940j86421I0244b1762B56358M6968G9572J55895a22936C37274F8632
13266A3333b7623p408j03337B00165l122q527L0442L4512f6436a3835B16625M030
13254B20655a02184A68315D5030Q4225e4853B53851J28274b82396B03578E9971
13243B27618a93407C00157h1153B51595L1012b5139h127A52726L5224i5513I878
13231E1558J32918r592e2391A96159B1440L4946J84933J58664c5961B59273A06201
13219B75961J2411B190a44148I8986N7953P2544r0723J77004a13481L5564j27139
13208b05056A05487O4824G2319J83939d968B83819I9945e9596C7286J42803E6119
13196G1139J61231F0236J46259r7247E4112J92668a61190M2362B11537C5710e7312
$$ plain form
13277 407940 221519 90244 -21762 256358 303326 79572 235467 -122936 337274 68632
13266 13333 -27623 -35031 -138368 200165 197043 188516 218958 253470 -66436 -13835 216625 220655
13254 220655 -102184 168315 45030 129255 -54853 253851 382125 -282396 203578 59971
13243 227618 -193407 300157 -81153 251595 282607 -25139 -8127 152726 187950 -95513 9878
13231 51558 184476 174884 -52391 196159 21440 56386 241319 399983 -35961 259273 106201
13219 275961 288372 2190 -144148 98986 156939 229483 138760 315764 -113481 -77917 -205056
13208 -205056 105487 170311 72319 256258 -4968 283819 99945 -59596 37286 180089 56119
13196 71139 232370 60236 206495 109248 54112 246780 -161190 -118828 211537 35710 -57312
13184C00751A12500J34721J94032A88883M01016B7183a31322B90688g7989B25637
13173E3880e8452B39216k749J08870A23817d1714C76038E5796d6029A85214j155
13162A84059J40155I1689M4876l438l7199a3515A40780n8194J02110e8976E5236
13150g5892B77281a1857k0291l0100p738G5175J22787H8828L2076m1861M5839
13139A24882N2146B266M3719k372L1813b1923q760A19268J04117b07764A74235
13127I3601a85581o9400C28702h8356D6751L2991a33884a8623j3952A32657b41266
13115a11641B47848a7946E2402J20342B487K18307A8741p591i0950E04604a19560
13103C47248e2018a0545A47470m8234E164M2282K78489A24241O5806K156K02619
$$ plain form
13184 300751 112500 247221 441253 188883 589899 27183 -131322 290688 -77989 225637
13173 53880 -58452 239216 236467 345337 123817 -41714 376038 55796 -46029 185214 184059
13162 184059 324214 91689 136565 133127 95928 -13515 140780 82586 184696 -58976 55236
13150 -75892 277281 -11857 -32148 -62248 -69986 75175 197962 88828 120904 79043 124882
13139 124882 177028 2266 45985 43613 75426 -21923 -30683 119268 223385 -207764 174235
13127 93601 -185581 -254981 328702 -88356 46751 79742 -133884 -18623 -32575 132657 -241266
13115 -111641 247848 -17946 52402 172744 2487 220794 18741 11150 -90950 504604 -119560
13103 347248 -52018 -10545 147470 99236 5164 47446 325935 124241 190047 192203 394822
13092C94822d7868m6691p4341d6267A72452b73066C1244a00761l437b7633A6374
13080B41684a08470I3821J87354j01423b00547C51886a4631l16107E87370k80465
13070C06905A39292R7116b4240D433L0169f5519r7488f4294B86879A22501J8534
13059A41035E9434n294K3667J8481a01936A38470R6157J45473F8218j5982b59581
13047A72462K52672a17289q8604C0803L16124D6378N2254J52948b62461e850k01248
13036b07098O3130c3197k21812A12676K0404a88847B33025o8417k7899a26021
13025A81114F1760N9492j8421N6433M5717r6544a46993A12700h117o6326J6513
13014e7930J750r158A17465i4640f834C20632d48944I3821b8405B57698r3410
$$ plain form
13092 394822 -47868 -94559 -168900 -46267 172452 -273066 31244 -100761 -104198 -27633 16374
13080 241684 -108470 93821 281175 179752 -200547 351886 -14631 -330738 587370 306905
13070 306905 139292 236408 -24240 4433 34602 -65519 -163007 -64294 286879 122501 141035
13059 141035 59434 54140 77807 96288 -101936 138470 234627 380100 68218 52236 -259581
13047 172462 425134 -117289 -205893 30803 346927 46378 98632 251580 -262461 -5850 -207098
13036 -207098 -143968 -33197 -255009 112676 133080 -188847 233025 164608 136709 -126021
13025 181114 61760 121252 102831 159264 204981 108437 -146993 112700 -8117 -74443 -57930
13014 -57930 -56180 -65338 117465 -94640 -6834 320632 -448944 93821 -28405 257698 164288
13003A64288a2331B922a95017D18945j01577H3223K46372b01155R7208H890K57105
12992B65995a29122e7054A75538D1060h744j78722K0221N5678B53950A15773L73822
12981D89595b11834C51995j67510G4688f3138A9279J29853m8997K78841a08311
12970D0066K71449j44350c50949D35232a5658r2148B55817E2302H169c06625J51720
12959a54905H413f1083k80006A82906a47190A97773g3403B18746a6314P378l7397
12948d6333F3578O8130C8759R8229N6621e8098B09203a18874C71977e468C3496
12936B72991F1625k8246M24970I2040a0007k69631A092J52485F8762e3004B05388
12924a39326A21609C0444M5983k2441N1950a43349d1597D167K06517Q4527b47968
$$ plain form
13003 164288 -12331 2922 -195017 418945 317368 83223 329595 -201155 -103947 8890 265995
12992 265995 -129122 -57054 175538 41060 -8744 -187466 -167245 -111567 253950 115773 489595
12981 489595 -211834 351995 184485 74688 -63138 19279 149132 100135 378976 -108311
12970 40066 311515 167165 -350949 435232 -15658 -107806 255817 52302 8169 -306625 -154905
12959 -154905 8413 -61083 -341089 182906 -147190 197773 -73403 218746 -16314 -8936 -46333
12948 -46333 63578 131708 38759 136988 193609 -58098 209203 -118874 371977 -5468 33496
12936 272991 61625 33379 458349 92040 -10007 -279638 1092 153577 68762 -53004 205388
12924 -139326 121609 30444 76427 53986 105936 -143349 -41597 4167 210684 295211 -247968
12912A82585o6320E7353P2825K5n910K57085a07443K4123a1776A80179A7201N9028
12900G6229j0792d3607j67132g2254B52723r6471M263g4671l97815B93013i2444
12888F267K8090K57725b3612q6313B72351E0920J21616N06596A13129D4393K14613
12877B59006a14322g640j58851B2328J71786a13360I8978a93761B26457d04372
12866i9348A69908O0533A11034q858a45110A59063l0724L7401a6143C74096B6335
12854A40715g1373b2542C7238K05477a91782A45503E8557j5801b57764A52676
12843E5809a12975j56701B03460H1057a46996j4433F54034B85879c5897o668A63019
12831A4599a65228I5361k3086d3107j64747Q9773L1526C8604a25169B25627a29798
$$ plain form
12912 182585 116265 57353 130178 130203 124293 381378 -107443 -83320 -11776 180179 17201 76229
12900 76229 65437 -43607 -210739 -72254 252723 156252 160515 -74671 -472486 293013 -92444
12888 6267 34357 292082 -23612 -109925 272351 50920 172536 679132 113129 44393 259006
12877 259006 -114322 -7640 -166491 22328 194114 -113360 98978 -193761 226457 -404372
12866 -99348 169908 230441 111034 102176 -145110 159063 128339 165740 -16143 374096 26335
12854 140715 -71373 -22542 37238 242715 -191782 145503 58557 42756 -257764 152676
12843 55809 -112975 -269676 203460 81057 -146996 -161429 654034 285879 -35897 -42565 163019
12831 14599 -165228 95361 72275 -43107 -207854 -118081 -86555 38604 -125169 225627 -129798
12819i8156A51641C4497K01351e4097o4981L7979B01657o7199J32439R7475A59966
12807E2493K79721h1202p7412A60922a1258j14260O2628k4865c386I3832a14851
12795I477K46994g614r355C9992K57748L2441j17380c70819H0464a96317I4016
12783D2421i7525a3073j21874j07918P7007B0083M01718A77107c33121F4366J46229
12772B10595a60372e1346A07464J78398a51070L5225A31511a14763j3241B4150
12761B72398a11458B24349C042d4225k54767B42955H5546l3804k5841J20446k6462
12750A19885C9397e4427E1442J92964b09241D4088Q4732E5202K5786c30263a05116
12738a04419k3512j37286l4532a01464A22036a51579B45688i4370J9911A01207
$$ plain form
12819 -98156 151641 34497 235848 -54097 -119078 -81099 201657 134458 266897 364372 159966
12807 52493 332214 -81202 -158614 160922 -11258 -125518 -62890 -87755 -3386 93832 -114851
12795 9477 256471 -7614 -16969 39992 297740 330181 212801 -370819 80464 -196317 94016
12783 42421 -97525 -13073 -134947 -242865 -165858 20083 421801 177107 -333121 64366 210595
12772 210595 -160372 -51346 107464 285862 -151070 -115845 131511 -114763 -128004 24150
12761 272398 -111458 224349 3042 -44225 -298992 242955 85546 51742 25901 146347 119885
12750 119885 39397 -54427 51442 244406 -209241 44088 128820 55202 80988 -330263 -105116
12738 -104419 -127931 -265217 -299749 -101464 122036 -151579 245688 -94370 -74459 101207
12727B14052m2536A7861q421h076C40122i4135c2086p6289m581k349B7604L10305
12715C37909D547L32430j66624n9681J50836j26545J0852K46151C0623M31590
12705D62213i7344I9300b0408j55402p606B93167Q7469l5138j66505j3463k1660
12694A43870c9020D77515a64060O4850a4009l5026C3415a94184C46446D2514h3464
12682i8273b3224D18662k08012r4906a2832A12206A0551J49415J17387a45917
12671c410D3038L12158O7703C5299K82171b11712b7689p7366K6653L198A65623
12659B15578d09732A12129K42295M7324A07836h01j32633p608e9871j02176J9820
12648a42227B27506a58763L4744B68770J2153A36285F1949e646j19075B02684
$$ plain form
12727 214052 171516 17861 9440 -8076 340122 -94135 -32086 -108375 -112956 -115305 27604 337909
12715 337909 4547 336977 170353 110672 261508 134963 145815 391966 30623 462213
12705 462213 -97344 99300 -20408 -175810 -183416 293167 380636 345498 178993 165530 143870
12694 143870 -39020 477515 -164060 -99210 -14009 -49035 33415 -194184 346446 42514 -83464
12682 -98273 -23224 418662 210650 115744 -12832 112206 10551 159966 277353 -145917
12671 -3410 43038 355196 422899 35299 317470 -211712 -27689 -105055 -78402 -75204 165623
12659 215578 -409732 112129 354424 401748 107836 -801 -133434 -141042 -59871 -162047 -142227
12648 -142227 227506 -158763 -124019 268770 280923 136285 61949 -5646 -124721 202684
12637c24999D07619c4023j27250H1474J1090j6102P6693p211M2099l1144c09013
12625D6441J91649h0809B9529R2572a08233C00692j02075M987K60401a75783d9353
12613A99532P127h7283E2464c2823A95673b32412C24663A25378a6067j14680C6407
12601A93705H7069l5029b47513r149C5089i1071H1791a33873d6460E8113a30826
12589A86449p5902O173f96137d2591B47222a18952b7842j30052c2158j79286H6086
12577a41262I8605a64941D13231a069A23062e0173o5978C26175G1206i3687B48832
12565A35584D4786a36161K0208I5996j4753f7225j40723B04230d57362c133l13891
12554c17024E9322a39751G4581Q0082p75Q958h8119A95699a70433A49560F8885
$$ plain form
12637 -324999 407619 -34023 -161273 81474 92564 76462 153155 145944 188043 156899 -309013
12625 46441 238090 -80809 29529 122101 -108233 300692 198617 203604 464005 -175783 -49353
12613 199532 206659 -87283 52464 -32823 195673 -232412 324663 125378 -16067 -130747 36407
12601 193705 87069 52040 -247513 -256662 35089 -91071 81791 -133873 -46460 58113 -130826
12589 186449 110547 116720 -696137 -42591 247222 -118952 -27842 -157894 -32158 -211444 86086
12577 -141262 98605 -164941 413231 -1069 123062 -50173 -116151 326175 71206 -93687 248832
12565 135584 44786 -136161 -115953 95996 81243 -67225 -207948 204230 -457362 -3133 -317024
12554 -317024 59322 -139751 74581 154663 153888 162846 -88119 195699 -170433 149560 68885
12542a79857F55054B95945e636l94504A18760a44633O1594p9643Q1012D86754
12531g7801B25530e9285m9469k01915h9207B17074r1185l0623J21426a91934K0891
12520a71043f3623A35965a3067A69638a03092G1805K289J04158a37464A94365
12509A44968o2960A6189L09767b74555B00198a08702A18325b85936B77676a966
12498b86840c7740j36128B69906a96242C64182a5365D5900J81693a55376A12286
12487a40371H4318N9352m0518O7416k1041a08250A26655a01079C0835K90176h2772
12475C14192A49160e9721A60371j05e5532k05875J29150A31531L5016a62311G6823
12463A17875K2718L269P5713q9340H715L36829l735A40745f9510m7442C07042
$$ plain form
12542 -179857 655054 295945 -5636 -400140 118760 -144633 -83039 -162682 -81670 486754
12531 -77801 225530 -59285 -108754 -310669 -89207 217074 125889 95266 216692 -191934 -171043
12520 -171043 -63623 135965 -13067 169638 -103092 71805 74094 178252 -137464 194365
12509 144968 82008 16189 325956 -274555 200198 -108702 118325 -285936 277676 -1966
12498 -286840 -37740 -173868 269906 -196242 364182 -15365 45900 227593 -155376 112286
12487 -140371 84318 143670 103152 170568 149527 -108250 126655 -101079 30835 321011 -82772
12475 314192 149160 -59721 160371 160266 -55532 -261407 -132257 131531 166547 -162311 76823
12463 117875 140593 143862 219575 130235 8715 345544 341809 140745 -69510 -116952 307042
12451F1316M6140P0299o4549b93853J10832p2807b2136A51350m1652e8654k39329
12440b97983o0238F0945J47988g7267j23476H0960n947P4243D8175a41821b0237
12428g3124j15600g1620D9674R4460b75707B13806E757M890a74103j16822e0245
12416e5263F6407a6830o5795a390k61436F5333M791l1652K23224b6536A74612
12404B14227b60879C43403J1718a92034m6884A98763J60667D129c5616k53510
12394b89126A03803J62494K3839b48365D3361J71478c8318j8229b017A8701O5598
12383H4299C8005J42572a97568R3419j14353j47889F2002a02760B51469G5121
12372e5236H7907I850a44452A06332i1770F5301Q0193c8292B5033K35255A14515
$$ plain form
12451 61316 107456 177755 113206 -293853 -183021 -255828 -22136 151350 109698 -58654 -297983
12440 -297983 -358221 60945 208933 -77267 -200743 80960 75013 149256 48175 -141821 -20237
12428 -73124 -188724 -71620 49674 144134 -275707 213806 5757 10647 -174103 -290925 -50245
12416 -55263 66407 -16830 -82625 -1390 -262826 65333 70124 38472 261696 -26536 174612
12404 214227 -260879 343403 355121 -192034 -238918 198763 359430 4129 -35616 -289126
12394 -289126 103803 266297 290136 -248365 43361 214839 -38318 -56547 -2017 18701 84299
12383 84299 38005 180577 -197568 -104149 -218502 -366391 62002 -102760 251469 75121
12372 -55236 87907 9850 -144452 106332 -91770 65301 145494 -38292 25033 260288 114515
12360B191K3177E684h9298k30934c9292q2279k0162A92288p9852c81C7635b91383
12347F8551b63202A13430c31820J64875A16661g2680r9452B99702i9024A62267
12336A75588q3174c2009p5509B30572a28752k36149B96843j28271f5776A91507
12325B4304M0341b9736I9920Q2975N8574p6087L2516I1844K50899k6496q8708
12314B27539p7911a76149D5299J91954i7701A98299K60818B17594a93615B7902
12303i5042A75292R1593c09407D9549R2845k4421d3001B04388c2713G5009b18647
12291g1031K3523k2634j19665I7823J16842r9934J71982k9320j21234a48173C2800
12279a00074B47151j14617a214G7412C5930J75456c6207B32546N9760C4734a78455
$$ plain form
12360 2191 25368 5684 -89298 -320232 -39292 -121571 -141733 192288 112436 -381 37635 -291383
12347 68551 -263202 113430 -331820 -166945 116661 -72680 -172132 299702 -99024 162267
12336 175588 92414 -32009 -107518 230572 -128752 -364901 296843 168572 -65776 191507
12325 24304 64645 -29736 99920 182895 241469 165382 197898 91844 342743 316247 227539
12314 227539 149628 -176149 45299 237253 -97701 198299 459117 217594 -193615 27902
12303 -95042 175292 266885 -309407 49549 142394 117973 -43001 204388 -32713 75009 -218647
12291 -71031 -47508 -70142 -189807 97823 214665 114731 286713 257393 136159 -148173 32800
12279 -100074 247151 132534 -1214 77412 35930 211386 -36207 232546 292306 34734 -178455
12267A2755a60151H1576g1342E7881N87264B51501B9719g7871k07833e2514G2483
12255A50906L16002M325A11970L7382j8858a13686B50471p6332D2291L01413m4436
12244B99268a96435q605A7068J09311B8942J30338r718G102f8262B64653a9264
12232d4981C75907o6471e4364l0999A42883c2360A59809l2456j0594R398e7930
12220C04726M0061P0561E9757j8503K58471J73815k35353F7332K80425b41087
12209I2229L9534m5643l2806O5501a01594m3892B07158J08627k846I5413K97370
12198C92783a23302N7372B43122M63K30463E2014K84092I3792c1890D9478R142
12187E8620B3504Q7293d4666C4023Q8717L978K40906A67367j24A9157N7131K597
$$ plain form
12267 12755 -160151 81576 -71342 57881 645145 251501 29719 -77871 -285704 -52514 72483
12255 150906 466908 471233 111970 149352 130494 -113686 250471 174139 42291 343704 299268
12244 299268 -196435 -205040 17068 126379 28942 159280 149562 7102 -68262 264653 -19264
12232 -44981 375907 309436 -54364 -85363 142883 -32360 159809 127353 116759 126157 -57930
12220 304726 344787 415348 59757 41254 299725 473540 238187 67332 347757 -241087
12209 92229 131763 86120 53314 118815 -101594 -145486 207158 315785 312939 95413 392783
12198 392783 -123302 -65930 243122 243585 474048 52014 336106 93792 -31890 49478 58620
12187 58620 23504 110797 -44666 34023 122740 126718 367624 167367 167243 19157 76288 78885
12175G8885Q1238J71667i8846B26254N4015n5802j03118J2176J23124n2864r0872
12164A12913L06294d9260J8122o3305B06154c4063F7476i2692A52516b8499B72681
12152A48627C9171b82303B04687m9197H12K29195Q9591A49692o3576J01075J2620
12141A99811a3695B19414e2526j63473a5624p9679Q969A90922g4243B81254D8230
12129A06601m6169b02393D6572p747M57878c9129D008M1101J36807g691j0300
12118a7991l621j22028f8788J7925B61190I1253a19162f948A52645b74834a07241
12106i2641B85010B4588i4529D9384N7857h7213a7599G6238a63417c0238B63005
12094h6512l31620f2214A69209h8751C7860b35248C794M18188i3603f211o913
$$ plain form
12175 78885 160123 331790 -98846 226254 280269 224467 121349 133525 256649 203785 112913
12164 112913 419207 -49260 -31138 -94443 206154 -34063 67476 -92692 152516 -28499 272681
12152 148627 39171 -282303 204687 155490 812 230007 319598 149692 86116 187191 199811
12141 199811 -13695 219414 -52526 -215999 -15624 -95303 -86334 190922 -74243 281254 48230
12129 106601 60432 -202393 46572 38825 496703 -39129 4008 45109 181916 -7691 -17991
12118 -17991 -21612 -143640 -68788 -50863 261190 91253 -119162 -6948 152645 -274834 -107241
12106 -92641 285010 24588 -94529 49384 107241 -87213 -17599 76238 -163417 -30238 263005
12094 -86512 -418132 -62214 169209 -88751 37860 -235248 3794 421982 -93603 -6211 -13124
12083a3124A31881n5890d7933C0418b99779B31341j8772Q5545E9844Q6446K7702
12072A73992a17935I0914R2655l1427b83529g8386E5133K70654i6517j8182A37014
12060a0751A46870Q2783E9653i8067B11310r6651A0788J09910N2428a42855A28085
12048c55902B79180b6956A9932a53934A35787e9591K5586O253Q945B5345b34417
12036I2561d9195D0706a26548F2491a56709B46886d9744A47186o0563a14634e3276
12024a76188h2437d232j21246I7849D1511a27377B33981L349a45154C8084J00899
12013A38983J1238p0962J9667K1721a20848E5885e1969C7690F622J80092b96824
12001c88916C3548a30827A74399R6840H651K6738e491H0243a16171c3411a4683
$$ plain form
12083 -13124 131881 75991 -47933 30418 -299779 231341 212569 298114 59844 146290 173992
12072 173992 -117935 90914 183569 152142 -283529 -78386 55133 325787 -96517 -114699 137014
12060 -10751 146870 229653 59653 -98067 211310 114659 10788 120698 173126 -142855 128085
12048 -355902 279180 -26956 19932 -153934 135787 -59591 -34005 -27752 -18807 25345 -234417
12036 92561 -49195 40706 -126548 62491 -156709 246886 -49744 147186 86623 -114634 -53276
12024 -176188 -82437 -4232 -125478 97849 41511 -127377 233981 237330 -145154 38084 138983
12013 138983 150221 79259 98926 120647 -120848 55885 -51969 37690 6622 186714 -296824
12001 -388916 33548 -130827 174399 271239 8651 35389 -5491 80243 -116171 -33411 -14683
11989A05452g0712A93549h0619B18941j737e69j09668k10494B07752e1632k09201
11978b60833A07492c21940A46646a22346A86478G31M5632c9494m9549A89435b02231
11966b49124c4256j4098q6467L9330I9523J22112a64720O7246j53228a8477j99219
11955b17696A65370f1873j96160i130j53896A112a94848k444k3911B58617d17450
11943a7875A89627a16853k30150J58615B1106J92379c3375k11231D44032a895
11932a87472n487C0350J40039F4218c7451A81718A8769b51771a6105o7925A58932
11920h5320n1563B1170J42588E727P1417R5422c22941a41747A8466b1955D8145
11908b54314B46657b16634C55325A838b22564E7600K09477A7174K59020a22179
$$ plain form
11989 105452 -70712 193549 -80619 218941 217204 -569 -110237 -320731 207752 -51632 -260833
11978 -260833 107492 -321940 146646 -122346 186478 731 46363 -39494 -89043 189435 -202231
11966 -249124 -34256 -48354 -134821 -95491 99523 221635 -164720 -97474 -250702 -18477 -217696
11955 -217696 165370 -61873 -258033 -9130 -163026 1112 -194848 -197292 -221203 258617 -417450
11943 -17875 189627 -116853 -347003 -188388 21106 213485 -33375 -244606 444032 -1895
11932 -187472 -192959 30350 170389 64218 -37451 181718 18769 -251771 -16105 -84030 158932
11920 -85320 -136883 21170 163758 5727 77144 172566 -322941 -141747 18466 -21955 48145
11908 -254314 246657 -216634 355325 1838 -222564 57600 267077 17174 276194 -122179
11897c58041a44362C06926b30966r4375B2055g8168p0403r876A72153p5790b67345
11885a67635a1795k15962A61719j6624d7418B11062q1577i4601K9216B17350b44533
11873D3207o485d12111a6851j72476e7084k36961A27784a22952k14758A8863f4007
11861b44821a8368B90790I7845d78407K10772e6030k5431I9995B7772c11788a5480
11849b54165A29048J96877F5187O0183j9349k5643b90620a34325k3258B21706
11838d0761o2233A62175j9542J93251A03948a83892n4244B25514o1124B6591M9380
11827G5971J14258b71982J35596m528A31009d2452R450j06954l2464D19289a81021
11815I9585A6085e6814B0760a13681B19223I8873g2248j1943j34488A60422m8689
$$ plain form
11897 -358041 -144362 306926 -230966 -325341 22055 -78168 -148571 -158447 172153 96363 -267345
11885 -167635 -11795 -227757 161719 145095 -47418 211062 129485 -94601 -65385 217350 -244533
11873 43207 36722 -412111 -16851 -189327 -57084 -294045 127784 -122952 -337710 18863 -64007
11861 -244821 -18368 290790 97845 -478407 -267635 -56030 -81461 99995 27772 -311788 -15480
11849 -254165 129048 325925 65187 125370 106021 80378 -290620 -134325 -157583 221706
11838 -40761 -102994 162175 142633 335884 103948 -183892 -238136 225514 164390 26591 75971
11827 75971 190229 -271982 -136386 -140914 131009 -42452 -33002 -139956 -172420 419289 -181021
11815 99585 16085 -56814 20760 -113681 219223 98873 -72248 -84191 -218679 160422 111733
11804A11733b40529a2774k66k59437H5603m395C8333E676a14642a3280C4509c66720
11791a42121A44799i6585C7300J27694b0204B46534c4006B9253Q4803a58041j60899
11780c18940C6452a3406j88557H3094b27634o3921B07709a87637j21804k4933
11770c34374A0727J5001d12067k4382J49332c400q2327A91802E943a50237A00817
11758A33860a24278j17085B87225j27448a82954a6100j6890r5096M7537F5804
11747B13901a89135M9479G3689P8292E9861J31531a72006n3091J03546A22865
11736g4088m902j9807j03995A6005a65767g6161E0767a63863N1089B327a37228
11724a4570A52242b46426A64356M3808b60217K3926H8796a80916j53186a01916
$$ plain form
11804 111733 -240529 -12774 -13040 -272477 85603 81208 38333 5676 -114642 -13280 34509 -366720
11791 -142121 144799 -96585 37300 164994 -20204 246534 -34006 29253 114056 -158041 -318940
11780 -318940 36452 -13406 -201963 83094 -227634 -291555 207709 -187637 -309441 -334374
11770 -334374 10727 25728 -412067 -436449 -287117 -3400 -85727 191802 5943 -150237 100817
11758 133860 -124278 -241363 287225 159777 -182954 -16100 -32990 -128086 -80549 65804
11747 213901 -189135 -139656 73689 151981 59861 191392 -172006 -225097 -121551 122865
11736 -74088 -78990 -98797 -202792 16005 -165767 -76161 50767 -163863 -112774 2327 -137228
11724 -14570 152242 -246426 164356 208164 -260217 -236291 88796 -180916 -334102 -101916
11713a72696m44335B17149L2547J46236b73646C28435b63280H2230N3667a50793
11702d6217B0016c261B87649a51227b8011C19158a855B65685j26351D9042M3061
11691I2103C2479M9887a19496h491o8675N29B26685o0273b03110D4810b75388
11679G7549L7238a1701k8899E4352j1795L2412e8296m2292b3165E6440a04617
11667D21860f576B57217J02957i106D6963e8986j8985j57256A76181e7423B4856
11655A34267a21700B02573b63531H918b10729A36151a8524j70516o5502j29698
11645c84240J90329R2210A81134e3835B06396a45258G4478J22563D4659g8719
11634b24398G5186h119j48970b169B16147c36457A87748i3793A68002J09824a25061
$$ plain form
11713 -172696 -617031 217149 249696 395932 -273646 328435 -263280 82230 135897 -150793
11702 -46217 20016 -3261 287649 -151227 -28011 319158 -1855 265685 139334 49042 92103
11691 92103 32479 82366 -119496 -8491 -77166 -76637 226685 166412 -203110 44810 -275388
11679 77549 114787 -11701 -40600 54352 42557 74969 -58296 -100588 -23165 56440 -104617
11667 421860 -6576 257217 360174 -9106 46963 -58986 -77971 -235227 176181 -57423 24856
11655 134267 -121700 202573 -263531 8918 -210729 136151 -18524 -189040 -254542 -384240
11645 -384240 -193911 -101701 181134 -53835 206396 -145258 74478 197041 44659 -78719
11634 -224398 75186 -8119 -157089 -2169 216147 -336457 187748 -93793 168002 277826 -125061
11622A43997J86887F9911n584Q8541B8302a73325g9134A16457b56745k18407g9322
11610A93647b13580A73117e4444o3662a2918d604l1170j0841E496L4134L67969
11599D07599a20594B3228N7942N5195C8606J20355O6764C5856L65151j78682B626
11587c8196E1944b56124J14154D788L22199d0403A56783m7740M3610J93505D7820
11575B1460J81565b46577A84827L03204a30873G980H17h1191j3580A04754b1021
11563C866A150b18886e2073B31137D7429J25362o6505F069K52823b16590E9900
11551b46752a5766F2866c0087A4449a08864n9685B36575i2741K300A58557L2217
11540A90774n2757B1838L598J60374M76468b25787B42134H8546a28688G9625c23962
$$ plain form
11622 143997 330884 69911 64327 152868 28302 -173325 -79134 116457 -256745 -475152 -79322
11610 193647 -213580 173117 -54444 -118106 -12918 -4604 -35774 -46615 5496 39630 407599
11599 407599 -120594 23228 81170 136365 38606 158961 225725 35856 401007 222325 2626
11587 -38196 51944 -256124 -141970 4788 326987 -40403 156783 109043 152653 346158 47820
11575 21460 203025 -246577 184827 488031 -130873 7980 817 -81191 -94771 104754 -21021
11563 3866 1150 -218886 -52073 231137 47429 172791 106286 6069 258892 -216590 59900
11551 -246752 -15766 62866 -30087 14449 -108864 -168549 236575 -92741 -90441 158557 190774
11540 190774 138017 21838 25436 185810 662278 -225787 242134 88546 -128688 79625 -323962
11528b20375a06360A66028G7342A7088L9816N3037b95581h734F5061b13247O1924
11517a51323A72459h6163j18736B66757i0380A04688d6657l3806B30793K00986
11507D31779B04880B4586J57282L18686b3146B10N9835O134M9532J62797B4252
11495a4104j95020R9458H0262l2027A3002b7620A53931i8887E7631J70221D0564
11483A56500K7166J857J57862A56937c9612o9734B43377K9180k0627A3007L97690
11472D10697O165c997A73608q0416c9132A86428N8464G6996N2037K7518J3191
11461A69742b1149F7475c9553G3744g7775C69507C3537a24947B34305K1509j02444
11450A53370O700h7127B98752a1279j5381C3952o231K21701A05418J45870n2529
$$ plain form
11528 -220375 -106360 166028 77342 17088 56904 109941 -295581 -8734 65061 -213247 -151323
11517 -151323 172459 -86163 -204899 266757 -90380 104688 -46657 -80463 230793 431779
11507 431779 204880 24586 181868 500554 -23146 210 60045 66179 115711 278508 24252
11495 -14104 -209124 -109666 80262 48235 13002 -27620 153931 -98887 57631 227852 40564
11483 156500 183666 185523 343385 156937 -39612 -109346 243377 272557 251930 13007 410697
11472 410697 416862 -3997 173608 93192 -39132 186428 244892 76996 129033 156551 169742
11461 169742 -21149 67475 -39553 73744 -77775 369507 33537 -124947 234305 255814 153370
11450 153370 160070 -87127 298752 -11279 -26660 33952 27721 249422 105418 251288 198759
11439A98759L4200A5071a62590A28892l4418d51768h2673r0917A29318d4399k26334
11428b70733A9800J56501c34082B58264i6016j20343E7141a73046B156R8337C0730
11416a27060r3402A00928j9652a69707J0394B10213i4862A52003J89818j65669
11406A76152e6998J1673C7817a67193a6293H1455J67581j15764a56529C31147
11395a41395k6255n625A14281a10268A34439g015j03363A35907a94633j31913
11385c26546C5874R8837d2113B00527a77390B15590d68231A91211o1763g9193
11374C2497j111h209D8401a44296K3586A05995h708j19673j83514A48500D922
11362a14318B20542a17761d1872I3406J43792i604A11100J82558n890A39793b0333
$$ plain form
11439 198759 232959 15071 -162590 128892 94474 -451768 -82673 -173590 129318 -44399 -270733
11428 -270733 19800 176301 -334082 258264 -96016 -216359 57141 -173046 2156 100493 30730
11416 -127060 -220462 100928 81276 -169707 -159313 210213 -94862 152003 341821 176152
11406 176152 -56998 -45325 37817 -167193 -16293 81455 249036 133272 -156529 331147
11395 -141395 -167650 -173275 114281 -110268 134439 -7015 -110378 135907 -194633 -326546
11385 -326546 35874 134711 -42113 200527 -177390 215590 -468231 191211 129448 -79193
11374 32497 31386 -8209 48401 -144296 -120710 105995 -8708 -128381 -311895 148500 4922
11362 -114318 220542 -117761 -41872 93406 237198 -9604 111100 293658 287768 139793 -20333
11350a44386a8650B60873b28869h7141H717M1956K6747a76317D97312A72656c2589
11338a31877B24999B4434e7886j88127e7366A240b17037A26824f0923A53744o4948
11327H8796a95587B21025H7860h7846A55784a58475A2576c65435D5481A3014Q6139
11316I9153D2465a09505j13217o3542O8061J07873c3769A63774g9111G0928e6934
11304f3994B35386d9487j04350k72225a27668A25574f5108j5443L9592B1051K95719
11293C16770B7594J42211b0171C278a21944B39376d7518o4791A62722b96030H809
11281A21551J55521g0943A57477b45112A29984b84087A40286C705b58352B6745
11270b5321k99474h6472m0790M7075k28626A5800d8629G4291M522c19305J15795
$$ plain form
11350 -144386 -18650 260873 -228869 -87141 8717 50673 77420 -176317 497312 172656 -32589
11338 -131877 224999 24434 -57886 -246013 -57366 1240 -217037 126824 -60923 153744 88796
11327 88796 -195587 221025 87860 -87846 155784 -158475 12576 -365435 45481 13014 99153
11316 99153 42465 -109505 -222722 -286264 -218203 -110330 -33769 163774 -79111 70928 -56934
11304 -63994 235386 -49487 -153837 -426062 -127668 125574 -65108 -80551 -40959 21051 316770
11293 316770 27594 169805 -20171 3278 -121944 239376 -47518 -112309 162722 -296030 8809
11281 121551 277072 -70943 157477 -245112 129984 -284087 140286 3705 -258352 26745
11270 -25321 -324795 -86472 -127262 -80187 -308813 15800 -48629 74291 78813 -319305 -203510
11259b03510B33864E6049a06446C4856J46612E263a30618e0422r885p1954o78
11248a32939q0336i4652A22622l7932J9839j4576a93964M3664B9855e9120A96020
11236I9535B7390b28141g3296J3951G9661b35490e6266A4353f5851A00688a2263
11224b03143D1555b1786k26886F5623b35637e481o6319m3091j4658A66602D2421
11212b81540A43447b35198g1838D012M8286b6947j66444M342g7660j18687o6021
11201b62368o4351a45556a7555k01803g6853c6115r3901D5361k176i583A08425
11189B22068d2183j33922e0689I1056k1363R5051g6038D8873a58411I0207g5613
11177A01555a67974B28716i5572B1368b48407Q0560A19721K6738j7110j0259J06913
$$ plain form
11259 -203510 233864 56049 -106446 34856 181468 5263 -130618 -50422 -60307 -132261 -132939
11248 -132939 -213275 -94652 122622 84690 104529 89953 -193964 -150300 29855 -59120 196020
11236 99535 27390 -228141 -73296 -59345 79661 -235490 -56266 14353 -65851 100688 -12263
11224 -203143 41555 -21786 -248672 65623 -235637 -5481 -71800 -114891 -129549 166602 42421
11212 -281540 143447 -235198 -71838 4012 52298 -26947 -193391 -189049 -77660 -196347 -262368
11201 -262368 -326719 -145556 -17555 -219358 -76853 -36115 -130016 45361 43185 -9583 108425
11189 222068 -42183 -176105 -50689 91056 69693 164744 -76038 48873 -158411 90207 -75613
11177 101555 -167974 228716 -95572 21368 -248407 -167847 119721 146459 129349 119090 226003
11166B26003C2233h1938A64622N4712g2151M480L1816p5929o6754k8661C94847
11154d20375c783p7619k59379j56386f5867B46479j07622N3581p4081m2508J60725
11143B36574a74249d031r8613a8574A07187b83625J16009B49567b31569c7545
11132A01997g1244E4374d1408r4557d9161A14652A5733J08926J15356J65981j42955
11121B63041I7318a98221L9689c5383k76946a39297C3156K28525a8383k04171
11111b22554g5490A78207a35123D24308g1077j6799q1858B58157H2512a43304
11100A99807N226n5274J63643H4766M8169L29826A39252J0248K76009F0932J74437
11089B35369k2582o7142i7858C0319e7132A67315b5550B62530J71371k16560H3782
$$ plain form
11166 226003 32233 -81938 164622 219334 -72151 -67671 -35855 -111784 -178538 -207199 394847
11154 -420375 -3783 -81402 -340781 -497167 -65867 246479 138857 192438 118357 75849 236574
11143 236574 -174249 -4031 -102644 -18574 107187 -283625 -167616 249567 -231569 -37545
11132 101997 -71244 54374 -41408 -135965 -49161 114652 15733 124659 240015 405996 263041
11121 263041 97318 -198221 -158532 -35383 -312329 -139297 33156 261681 -18383 -222554
11111 -222554 -75490 178207 -135123 424308 -71077 -87876 -169734 258157 82512 -143304
11100 199807 205033 149759 313402 84766 132935 462761 139252 149500 425509 60932 235369
11089 235369 212787 145645 -97858 30319 -57132 167315 -25550 262530 433901 217341 83782
11077D02174c3479A6344J80098L26399E6373K21497L6603Q3454A51476e8233D47772
11065F43176B61310L56248B18713K76055p6986j71122O6746L32915B68309J28194
11055C96503K61038l15336K06478J40893k73505A01314N74661r1689J07888K01676
11045H93850L6466J79197k35642k72122k7719j83914L53300j51247L01091k11354
11035F81906j08680J52340q436J8513k85272J1718K27995j8609l00415M67638
11025H38698m9246B89616N64679j16464m1726j42663R571N9704r0903l2091J46700
11014F46423K086k63324J79914k0962o3290N0867j26555J37712j41080L05140
11004G06931m3472m3743K41347m22525L18335J52072l54553j067K46321j60880
$$ plain form
11077 402174 -33479 16344 196442 522841 56373 277870 314473 397927 151476 -58233 447772
11065 643176 261310 617558 218713 494768 417782 246660 313406 646321 268309 396503
11055 396503 657541 342205 548683 689576 416071 101314 675975 584286 692174 893850
11045 893850 930316 1109513 873871 601749 574030 390116 743416 592169 893260 681906
11035 681906 573226 725566 717130 735643 450371 462089 690084 671475 371060 838698
11025 838698 789452 289616 854295 737831 696105 553442 563013 622717 531814 499723 646423
11014 646423 648509 385185 565099 544137 480847 531714 405159 542871 401791 706931
11004 706931 663459 619716 861063 438538 756873 908945 554392 553325 799646 638766
10994F38766j29406Q4822m7870M0793j4873L13680o7275j86015K43106l1536K95033
10983A139225l36707J36986J49699k94463J50183M20703J45157r6168L75191K87520
10973B077326J1844L37736M0175J27869n8751o3345L6881j67866l84801N118l37568
10962A624618m56695J58881P8714m4327p2222j80149P2949m85707N49459m34102
10952H11419p0516j1668l48410L08507k82779p0856P1374j92039Q7077N6794C9694
10940B95039c1920G964K25799H7890D581g8325j35181g8574C45372B8464a45314
10928B35212F4854c9439G1329a44014A69253D0451c50960D685i0251B71290A20323
10916D97979A02912K3533B6083K2286L7738L1880c37171C5673M4800J06784d15414
$$ plain form
10994 638766 509360 594182 546312 587105 572232 885912 818637 632622 875728 844192 1139225
10983 1139225 802518 939504 1089203 794740 944923 1365626 1510783 1414615 1789806 2077326
10973 2077326 2089170 2426906 2467081 2594950 2536199 2472854 2509735 2341869 1957068 1962186 1624618
10962 1624618 1167923 1326804 1405518 1361191 1288969 1108820 1181769 696062 1245521 811419
10952 811419 740903 729235 380825 689332 406553 335697 407071 215032 302109 358903 39694
10940 295039 -31920 7964 233763 87890 4581 -78325 -213506 -78574 345372 28464 -145314
10928 235212 64854 -39439 71329 -144014 169253 40451 -350960 4685 -90251 271290 120323
10916 497979 102912 126445 26083 48369 86107 117987 -337171 35673 80473 187257 -415414
10904C6249J24733a07879q989p4053K0985j14690g2679G0972N1085j044f1101
10892i1604D4286K40504a42802C57594Q1601E6985J21919J0803a09977M9362K4308
10881c6307B9504e7659G1324b19703e8793j47A3835d8810A16051b56258B36676
10869H365b42113C42368c79459a36246L5721j28956B43946c74906H1057M6458
10859A27515a40835k5309r6022e1913A12230c43360A13321e1920q3998N6323b4071
10847a58484c8624j26804C3885b46575B04942c85845I7972h1621j23618M0110
10837a65129C950L2027b77520d5756B03940d05778a39043J9050B859b14738A82870
10825H8129A4006g446m27874B76482k308b96552J3178J01493l0523j10737h0539
$$ plain form
10904 36249 160982 -107879 -116868 -190921 -169936 -284626 -72679 70972 122057 121013 -61101
10892 -91604 44286 284790 -142802 357594 439195 56985 178904 189707 -109977 -60615 -36307
10881 -36307 29504 -57659 71324 -219703 -58793 -58940 13835 -48810 116051 -256258 236676
10869 8365 -242113 342368 -379459 -136246 -100525 -229481 243946 -374906 81057 127515
10859 127515 -140835 -166144 -262166 -51913 112230 -343360 113321 -51920 -135918 -79595 -24071
10847 -158484 -38624 -165428 33885 -246575 204942 -385845 97972 -81621 -205239 -165129
10837 -165129 3950 35977 -277520 -45756 203940 -405778 -139043 -119993 2859 -214738 182870
10825 88129 14006 -7446 -435320 276482 274174 -296552 -283374 -181881 -212404 -323141 -80539
10813B13830d05392a93279A45181b1341a373l33984d6001H7109b07768i414A51889
10801E138R4931Q1922j4351o0007d71448e4506a396j14937A65368b11707A76194
10789a59423p0505d915A0428J90794b00087a5591E0304a29180a7810j6557a625
10777A20408J59459b1635A64046r893p6905J72082h3983k6198M7434k40577J9202
10766b84122d4630n3747E586d7524H4267g3249h354A07589N7645c05787E4846
10754a15969j123j88707b0649j82602P1163A9579a84599G8465e6930b3360r517
10743c2877J2013n5584c950A8236f0698B21639D9655b58756A18760a03740j37999
10732b41739k8687a7195A92245l5095b21823R5290k49251H6068O8645J15519I8863
$$ plain form
10813 213830 -405392 -193279 145181 -21341 -1373 -335357 -46001 87109 -207768 -9414 151889
10801 5138 100069 181991 167640 107633 -471448 -54506 -1396 -116333 165368 -211707 176194
10789 -159423 -229928 -4915 10428 201222 -200087 -15591 50304 -129180 -17810 -34367 -1625
10777 120408 279867 -21635 164046 154153 77248 249330 -83983 -110181 -62747 -303324 -284122
10766 -284122 -44630 -98377 5586 -47524 84267 -73249 -8354 107589 165234 -305787 54846
10754 -115969 -117092 -305799 -20649 -203251 -132088 19579 -184599 78465 -56930 -23360 -32877
10743 -32877 -20864 -76448 -3950 18236 -60698 221639 49655 -258756 118760 -103740 -241739
10732 -241739 -270426 -17195 192245 157150 -221823 -126533 -375784 86068 154713 270232 98863
10720A4519N846c16105B02280c63558a9214j5993C9121b87716A81846b08340D4176
10708b57495H211i1335A37137c7961k60049B12778A03180a3756B8727a86709m0411
10697b27120E9515b38940F52J83527a62688A3360K8645J90761d3666A13381d4795
10685a60915B49897d4143k45129c5200G6948K14686c5120M203j75334B10313a67917
10673a41561q1538C72593B4565c5070j1357k31417j3208h0093A80156a40957A79016
10661b73578E450a00863H6507e2671k32407k25465a90993P0477j20048H295a2345
10649B26157a45904l5753C1513N0966K29322A4725J08257c4816A32688P202a72740
10637b35471B17942c47300G1225f692I0703P185f6949l7188k89A46395b5855m9680
$$ plain form
10720 14519 20365 -316105 202280 -363558 -19214 -35207 39121 -287716 181846 -208340 44176
10708 -257495 8211 -91335 137137 -37961 -298010 212778 103180 -13756 28727 -186709 -227120
10697 -227120 59515 -238940 652 184179 -162688 13360 42005 232766 -43666 113381 -44795
10685 -160915 249897 -44143 -289272 -35200 76948 291634 -35120 -30917 -206251 210313 -167917
10673 -141561 -223099 372593 24565 -35070 -46427 -277844 -291052 -80093 180156 -140957 179016
10661 -273578 5450 -100863 86507 -52671 -285078 -510543 -190993 -120516 -240564 8295 -12345
10649 226157 -145904 -181657 31513 82479 311801 14725 122982 -34816 132688 139890 -172740
10637 -235471 217942 -347300 71225 -6692 90703 97888 -66949 -104137 -104426 146395 -25855 -75535
10625g5535l16032J23660g4512A49953c9309B81627g0339l1858J7170I9637b50247
10613a9885r3164q5725H082a51942G7145b7876j56247C55800A27784n9347h5280
10601b78798a08009K9363L6404r242B0649P2265b51456I2403b84813a18223B47646
10589C5296a66734D34157A37229a33986M6992c2558j8282j08691A29002k9845
10579I9157a25754D53092A0544b4443F6923a51965l82864B00497H805b13148j06315
10568c19463A76740i1770o0735A60076b5023A01539a77117K4531c2822C0604J10259
10557A40863N337A001a4547D9189b74161J04986B5590g5712B85941F5043J63654
10546B28697a63800e7819A42869n9608K92528n04a73052J1299j27610F3924J47093
$$ plain form
10625 -75535 -391567 -267907 -74512 149953 -39309 281627 -70339 -102197 -85027 99637 -250247
10613 -19885 -113049 -198774 8082 -151942 77145 -27876 -184123 355800 127784 68437 -85280
10601 -278798 -108009 -78646 -42242 -51484 20649 92914 -251456 92403 -284813 -118223 247646
10589 35296 -166734 434157 137229 -133986 -86994 -32558 -50840 -159531 129002 99157
10579 99157 -125754 453092 10544 -24443 66923 -151965 -534829 200497 8805 -213148 -319463
10568 -319463 176740 -91770 -152505 160076 -25023 101539 -177117 -152586 -32822 30604 140863
10557 140863 146200 1001 -14547 49189 -274161 -169175 25590 -75712 285941 65043 228697
10546 228697 -163800 -57819 142869 83261 375789 375285 -173052 -161753 -289363 63924 211017
10535B11017r3272E1953r507L0183i6808A01695l2036a79174B1984b01632k3353
10524b24985g3636b9006A62812b37724G6155M6444b95111E4868B6171h1557l0733
10513a12290K2770A38641o4620a42747B84845A07561f4915B15683h3611E9052
10502a57016A8081a48993e6360r307c431F4037C127R3348m7822K1234a5901o1403
10490g7304A69325B7318O6427a51964j88798D7343K9906J53501d1401A22029J39450
10479B61479c8938q94C94541l2440f911F7680J36104H9471J25348c1156k71658
10468c02814A14410E1936K9630d32357g3634k2088D3840K67207a23635j79376
10458c03011D1659K08321A0848P7538a78895e0422r0577P215k42042A6470a68629
$$ plain form
10535 211017 117745 51953 42446 72629 -96808 101695 69659 -179174 21984 -201632 -224985
10524 -224985 -73636 -29006 162812 -237724 76155 122599 -295111 54868 26171 -81557 -112290
10513 -112290 -89520 138641 74021 -142747 284845 107561 -64915 215683 -83611 59052
10502 -157016 18081 -148993 -56360 -65667 -3431 64037 3127 96475 48653 69887 -15901 -77304
10490 -77304 169325 27318 93745 -151964 -340762 47343 77249 230750 -41401 122029 261479
10479 261479 -38938 -39832 394541 362101 -6911 67680 203784 89471 214819 -31156 -302814
10468 -302814 114410 51936 81566 -432357 -73634 -95722 43840 311047 -123635 -303011
10458 -303011 41659 249980 10848 88386 -178895 -50422 -140999 -133784 -375826 16470 -168629
10446A12245b57622a04775j84851D9204h008k46703A32152G649J11056b22868
10435c4030k00738f2521p5330A20212c27553B8804a12157j8960N2528E4939M07111
10424D62050a52805A15088c2479J3865k98295J49411O848B32096b14723c6693
10413A66641n5552J2809f7215i129r237j98674d1696l9750A35181a69937k3441
10402a93378E3366b13947d5804k37164D32949I8001a02027D2623b34804h3041
10391B37959b9578k47624A10365K68241A42891j3879N1831p2316J0558h1438j36440
10380b17878C74070A74237k7236J47331G7472R1188L07733b1567B88979j8038
10370B70941M2328r7256K82917k07601J01622j15788J4168K02537o4053B04835
$$ plain form
10446 112245 -257622 -104775 -289626 49204 -8008 -254711 132152 7649 118705 -222868
10435 -34030 -234768 -62521 -137851 120212 -327553 28804 -112157 -131117 -78589 54939 462050
10424 462050 -152805 115088 -32479 -18614 -316909 -167498 -160650 232096 -214723 -36693
10413 166641 111089 123898 -67215 -9129 -18366 -217040 -41696 -81446 135181 -169937 -193378
10402 -193378 53366 -213947 -45804 -282968 432949 98001 -102027 42623 -234804 -83041
10391 237959 -29578 -277202 110365 378606 142891 129012 180843 108527 119085 -81438 -217878
10380 -217878 374070 174237 147001 294332 77472 168660 476393 -21567 288979 270941
10370 270941 313269 216013 498930 291329 392951 277163 291331 493868 429815 204835
10359B23879c9267A1097J16802L03284d9432B52251O6769L4353p3481K01784j75320
10348C06356K89696j45442a20440A71660J44971O8618A50348K04009j43015n3150
10338A58192G8768J0732A3251d7532F4162Q7773o6389k915a01157A65094Q6745
10327B51839A7684K16800A16846J84231L5617H5368J758L9166D3838c0969k46267
10316b77236C7919M08531A87509a40092c4345B30539d8665F0479g2796j41971
10306b14767o6118C07838I6758A6614K7677b4850A9252L1674g0838k13388B05051
10294a17297I626J44915a31677a4807D7806K5971c95683J38013A92795a68940
10283A24383d2898j3033l43399B31712A8015c5065j33046F5938a61754N2277b9093
$$ plain form
10359 223879 -39267 11097 127899 431183 -49432 252251 319020 353373 279892 481676 306356
10348 306356 596052 450610 -120440 171660 316631 385249 150348 354357 211342 158192
10338 158192 78768 89500 13251 -47532 64162 151935 85546 82631 -101157 165094 251839
10327 251839 17684 234484 116846 301077 336694 85368 87126 126292 43838 -30969 -277236
10316 -277236 37919 446450 187509 -140092 -34345 230539 -48665 60479 -72796 -214767
10306 -214767 -280885 307838 96758 16614 44291 -24850 19252 50926 -70838 -284226 205051
10294 -117297 9626 154541 -131677 -14807 47806 73777 -395683 -257670 192795 -168940
10283 124383 -42898 -55931 -399330 231712 18015 -35065 -168111 65938 -161754 -109477 -29093
10271a72675A01438B1363a20335B20906p0273l0370j8180b708B25302q8644m2123
10260I4535a17626C63162k7225O5526A25732J07861m0208o3132b18007e720A22955
10248F8693A8659b29031l0364b4345l61270J28043B1616a43298o8256d035k3998
10237b8033D3835a19924G6586h4862I7246A3871a23139J8338k10103A57731g6682
10225a6060A37424c2938r3601l1879A81056m8633a50358j5844A5100J64729e5920
10213F5561a53128P0569q543l3834A2991b626G2954a55965j43795A22295c28702
10201b9546B53443a70312p1350g7727A80129b7130j5321n0217G4518h9236B3506
10189H1052P8822a42756O2235p2916D6161P5743b91673g286l40387a5210k2386
$$ plain form
10271 -172675 101438 21363 -120335 220906 150633 120263 102083 -2708 225302 136658 94535
10260 94535 -117626 363162 335937 401463 125732 233593 193385 130253 -218007 -5720 122955
10248 68693 18659 -229031 -259395 -24345 -385615 -257572 21616 -143298 -211554 -4035 -28033
10237 -28033 43835 -119924 76586 -84862 97246 13871 -123139 -104801 -314904 157731 -76682
10225 -16060 137424 -32938 -126539 -158418 181056 132423 -150358 -166202 15100 179829 -55920
10213 65561 -153128 -82559 -91102 -124936 12991 -2626 72954 -155965 -299760 122295 -328702
10201 -29546 253443 -170312 -241662 -77727 180129 -27130 -42451 -92668 74518 -89236 23506
10189 81052 159874 -142756 -80521 -153437 46161 121904 -291673 -7286 -347673 -15210 -37596
10178c7596o8925k0139M0927F4682a25076q0219N9149C8366J89768I9799a15436
10166b94351C8924M3070a03316B46930m3895H2153a97385A94882G8083a45902
10155a8973C26528a96574A22006d81327a34279B17720H0376l5166b94447R2348
10145b02099j35017C79135i4306j95974P2163c8184j29392B08219E8120K4764
10135H2884g4087h093H9473d51025F1511i1467k47564b2815o4572k36318h2741
10123a24661k0436m0199l721o4018J04700O8022b9004A55076c0839H6457a11231
10111E7256J71855D0563b11389N4989m4489O6691A36027i7781H0126b2588j72057
10100a94645P6219p8942b8327j11951I4140e6066k31137L6144d5382F4382J7508
$$ plain form
10178 -37596 -106521 -126660 -85733 64682 -125076 -205295 -146146 38366 228134 99799 -115436
10166 -294351 38924 81994 -103316 246930 203035 82153 -197385 194882 78083 -145902
10155 -18973 326528 -196574 122006 -481327 -134279 217720 80376 45210 -294447 -202099
10145 -202099 -337116 379135 -94306 -290280 -218117 -38184 -167576 208219 58120 82884
10135 82884 -74087 -8093 89473 -451025 61511 -91467 -339031 -22815 -87387 -323705 -82741
10123 -124661 -145097 -185296 -189017 -253035 -148335 -80313 -29004 155076 -30839 86457 -111231
10111 57256 229111 40563 -211389 -156400 -200889 -134198 136027 -97781 80126 -22588 -194645
10100 -194645 -118426 -197368 -28327 -140278 94140 -56066 -287203 -251059 -45382 64382 81890
10089H1890e00881J44569a12187o9712j07743E7807K72697j18046n5733b14502
10078A20074a15214C7789a66933J6919N3001r6986Q0066B52928h1591c6499m4707
10067h1206A2351g4658A32391l8148a79882A74041N786G402R6634b0202F3793
10055B4006a21462r4315M3712r0737a07396n9993c8235j28275k02553C8855J15092
10044A53947E8252a03034k74917c6542k72618E3264h4670C2560k51b90214i1107
10032A3620K53902c42812b4741j61970A15407b6004A82382D7588a28268d1220
10021C09204r3830c758B49532b46949B9681N018j0405a96727q9838L2859a20977
10009a42171d5801J6952j49796k51055A00994b88403k648i6846A74886L790a29778
$$ plain form
10089 81890 -500881 -356312 -112187 -181899 -289642 57807 330504 212458 156725 -214502
10078 120074 -115214 37789 -166933 -150014 -97013 -193999 -113933 252928 -81591 -36499 -81206
10067 -81206 12351 -74658 132391 94243 -179882 174041 179827 7402 104036 -20202 63793
10055 24006 -121462 -215777 -172065 -262802 -107396 -167389 -38235 -166510 -369063 38855 153947
10044 153947 58252 -103034 -377951 -36542 -309160 53264 -84670 32560 32309 -290214 -91107
10032 13620 267522 -342812 -24741 -186711 115407 -26004 182382 47588 -128268 -41220
10021 309204 215374 -3758 249532 -246949 29681 34699 24294 -196727 -286565 -253706 -120977
10009 -142171 -45801 -28849 -178645 -429700 100994 -288403 -291051 -96846 174886 178676 -129778
9997C9239b42985h3387J9732k01705J22667G2295l4871a61727m1507k90004a88302
9985a88124A9495d7453A52803a81488H0055E969a41131k40402B33152h7774p096
9974i4870B52225p3185i658j4504G3764g1359k4909l4334a0765j39830b7388B74820
9961b15349J07411c581j68343d2765E4809f4543H6848g7487H2581h8299m8344
9950a36643O2091j12915J1784D0624b07691P8366A75292d7568k2105J1288q6754
9939a45139B64179F4621K69047b23814A23578a44907A92122I3019E169K0281b93544
9927c4705j20362j02138c2377l23361a18970J456C52178a698I225b60678a00621
9915B51286j331C7306a32442j66538C24406c670k03713A41330e4644k23461b6524
$$ plain form
9997 39239 -242985 -83387 -63655 -265360 -142693 72295 37424 -161727 -203234 -493238 -188302
9985 -188124 19495 -47453 152803 -181488 80055 5969 -141131 -381533 233152 -87774 -94870
9974 -94870 252225 179040 -9658 -24162 73764 -71359 -96268 -130602 -10765 -150595 -27388 274820
9961 -215349 -107938 -3581 -171924 -42765 54809 -64543 86848 -77487 82581 -88299 -136643
9950 -136643 -74552 -187467 -175683 40624 -207691 -129325 175292 -47568 -69673 -58385 -145139
9939 -145139 264179 64621 333668 -223814 123578 -144907 192122 93019 5169 25450 -293544
9927 -34705 -155067 -257205 -32377 -355738 -118970 -117514 352178 -1698 9225 -260678 -100621
9915 251286 249955 37306 -132442 -298980 324406 -3670 -207383 141330 -54644 -278105 -26524
9903b47007B76618l9360c31543G4635a35254f5223A6948L9858a0433j27072A00068
9891e6606K6847n7523J8590D9035f4456K9586I6195J05054f9745o518k30795A11860
9878b36461B7905K22421a46354a7403k8519k70390A87094b99490h8039k51125
9868c39164a49554k9936A55306b5737q4461l9340m7802F5179c8065I3118c41210
9856B77803a80013A58008d00826g8494o49L7569B79881H3453c216j5660C86032
9844A70977B9000a92891C2053c20782M3974C487h6036M2267I7915J02088c03785
9832c3391B42441b8798k1100j75898H2799a29598A10682B0741b09027C4781b55577
9820a0911k48114F6863a86768E16355a38319B5937a7395k00660m384j45902a65904
$$ plain form
9903 -247007 276618 237258 -331543 74635 -135254 -65223 16948 56806 -10433 -137505 100068
9891 -56606 -29759 -87282 -68692 49035 -64456 -34870 96195 201249 -69745 -76263 -307058 111860
9878 -236461 27905 250326 -146354 -17403 -45922 -316312 187094 -299490 -88039 -339164
9868 -339164 -149554 -179490 155306 -25737 -110198 -149538 -197340 65179 -38065 93118 -341210
9856 277803 -180013 158008 -400826 -78494 -79143 -41574 279881 83453 -3216 -18876 386032
9844 170977 29000 -192891 32053 -320782 -276808 3487 -86036 -43769 97915 200003 -303785
9832 -33391 242441 -28798 -49898 -225796 82799 -129598 110682 20741 -209027 34781 -255577
9820 -10911 -259025 66863 -186768 516355 -138319 25937 -17395 -218055 -222439 -368341 -165904
9808B21055n4980c58716B80301a66338j37362B442b48314n0947i9454G3626J56106
9797B29732c5214A15971c26961f7612l3682A7782b74834r4101a67337q4614c6223
9785i4762r9789J0578l6309D6433b4818E7988a13869f861r3430M0348K457B10398
9772a090A42427a10408b3455j16447r3675m9303c7998p5645G1859b17630Q6130
9761a31500M9848j13971P9236j77405a20301A53508h9761b0764I0099a17958C30405
9749a17815A77021o2868K48784e8069A2311f8393b6859E4255b12106J440j93879
9738d04545E3531d3705k59523k07826f4733j9245A31626c22157a58138A66020
9727C2223i6784B7118b74666l8867O8699J18809F6796J49476a65279j04493B77040
$$ plain form
9808 221055 166075 -358716 280301 -166338 -303700 2442 -248314 -299261 -99454 73626 229732
9797 229732 -35214 115971 -326961 -67612 -101294 17782 -274834 -368935 -167337 -251951 -36223
9785 -94762 -194551 -183973 -220282 46433 -24818 57988 -113869 -6861 -100291 -59943 -57486 210398
9772 -1090 142427 -110408 -23455 -139902 -233577 -282880 -37998 -113643 71859 -217630 -131500
9761 -131500 -81652 -195623 -116387 -293792 -120301 153508 -89761 -20764 90099 -117958 330405
9749 -117815 177021 114153 362937 -58069 12311 -68393 -26859 54255 -212106 -210666 -404545
9738 -404545 53531 -43705 -303228 -511054 -64733 -83978 131626 -322157 -158138 166020
9727 32223 -96784 27118 -274666 -313533 -244834 -126025 66796 216272 -165279 -269772 277040
9715D2675a29143E156c72738J76927e9453A40912P4396A06470l7135a49824C13035
9703a50233d6273k44119C3235i3729C0383Q474K80916e04494b3528K992j06776
9692a27312m773C85726b63965P0666g823r6969I556a09101B62116c38617G4941
9680A10415c41612A17978a86907A06707J38540b30666a01132K4478m4946e632
9669A05946e1079A07345b0235l55231b3377j6734D1582L46557b01675g8333A16904
9657B02622j5540a77576N0960k11714J27674d3731o8580C5114K40667o0775f0560
9645C27221A1339k51N3422a72703E7473b44133j60702A25416b79617H2645b42088
9633C13311f6129B61493b32657d4654A07005i7394P308B1324f8402A13318a31516
$$ plain form
9715 42675 -129143 5156 -372738 -195811 -59453 140912 215308 106470 69335 -149824 313035
9703 -150233 -46273 -290392 33235 -93729 30383 38857 319773 -504494 -23528 -20536 -127312
9692 -127312 -132085 385726 -263965 -193299 -7823 -104792 9556 -109101 262116 -338617 74941
9680 110415 -341612 117978 -186907 106707 245247 -230666 -101132 -76654 -121600 -5632
9669 105946 -51079 107345 -20235 -375466 -23377 -40111 41582 388139 -201675 -78333 116904
9657 202622 187082 -177576 -126616 -338330 -210656 -43731 -112311 35114 275781 215006 -60560
9645 327221 11339 11088 64510 -172703 57473 -244133 -404835 125416 -279617 82645 -242088
9633 313311 -66129 261493 -232657 -44654 107005 -97394 -90086 21324 -68402 113318 -131516
9621d777E5944a66273Q108f6837j46560Q6137k43445J79600B79828A5944a93935
9609a38713d3843M616j67183g4525n12688g9762A33161a13081N4424j23511h5856
9597h777j50381k06124h9685L2933k47201a16731C8344h4693B80853j16251A4355
9585a28003N9931j18080k8553P8088e0201G2579J03822a49727L0316A44434I09
9573a53873L257K3159B34760f6161e568j24489N6296D2362b29398e5791j47427
9562b03218B20752I5755b12211a7844A54006a33449r554A07825m5329b79722J6970
9551b62752A87084c65242a25582k19751G469a95101O2780k95520D4890a84634
9540c15804J810J38502r7780d1694A64983B4725a1397k13322A4916L2719K41640
$$ plain form
9621 -4777 55944 -166273 -158165 -66837 -213397 -127260 -370705 -191105 279828 15944 -193935
9609 -138713 -43843 -39227 -206410 -74525 -587213 -79762 133161 -113081 -58657 -182168 -85856
9597 -8777 -159158 -365282 -89685 -56752 -303953 -116731 38344 -84693 280853 164602 14355
9585 -128003 -68072 -186152 -214705 -136617 -50201 72579 176401 -149727 -119411 144434 909
9573 -153873 -150616 -127457 234760 -66161 -5568 -130057 -73761 42362 -229398 -55791 -203218
9562 -203218 220752 95755 -212211 -17844 154006 -133449 -143003 107825 62496 -279722 -262752
9551 -262752 187084 -365242 -125582 -345333 7469 -195101 -132321 -427841 44890 -184634
9540 -315804 -313994 -175492 -273272 -41694 164983 24725 -11397 -224719 14916 47635 289275
9529B89275B5751F029c110B46325a14875K6017A06309R2519b46700A82628B9265
9517h7726j33277d438l13169A7710J61076a471j35303e3704j46368P7864l8564
9506a60772j6973M8952g98I516b14775j98956d972C9814o125c68764J61149M4865
9494a62750c7936j8185k9372I6613b29831A28272d5724k10637B2914b34532N3886
9483a80646H3726a7833F1191L5409c6664o7566J1331E0649g8788B4295a28212
9471b68220A24761l2209A8200o275a93535i1073a3815p2635j59040N8547B5163
9459c991C40301p5734a207q5041c4637N606j17078A82470b36700A50518p472b10187
9446H5242a59248d5132E7676c36145R4597P028a4060j79624A8186a99913N4838
$$ plain form
9529 289275 25751 6029 -3110 246325 -114875 -88858 106309 198828 -246700 182628 29265
9517 -87726 -221003 -4438 -317607 17710 178786 -1471 -136774 -53704 -200072 -122208 -160772
9506 -160772 -177745 -128793 -798 9516 -214775 -413731 -4972 39814 33689 -368764 -207615 -162750
9494 -162750 -37936 -56121 -85493 96613 -229831 128272 -45724 -256361 22914 -234532 -180646
9483 -180646 83726 -17833 61191 96600 -36664 -104230 -92899 50649 -78788 24295 -128212
9471 -268220 124761 92552 18200 11925 -193535 -91073 -13815 -86450 -245490 -186943 25163
9459 -3991 340301 264567 -1207 -86248 -34637 -29031 -146109 182470 -236700 150518 143046 -210187
9446 85242 -159248 -45132 57676 -336145 -241548 -234520 -14060 -193684 18186 -199913 -145075
9435a45075C36405a13402A5781a42482k75966A9357a83596d8079l720k6547C27077
9423C5089i5383d6680K1367k13142l1690b9169B5211b3891m9844j47018C5127
9411a43083C54692b8060c650A46875k3240a84694A7303b855m5228I5364g8572
9399D2701K8087b05939B33584r1244L437c60566a50562A98761D3793a17346D9578
9387a98058D6762e6828n7463j6410j23903A44159c02282L1808m2456A01431b66757
9375C33915A7790K18333F4166d0272H4796a82494G0536O3700N8605b48388A28887
9363B48907c33352C71185d8470K1602k09935f4070j66950A3912e48930a93242
9352a48530M5847J4948g555F6321K6762f498j71460A118h5513b3283j9931k69033
$$ plain form
9435 -145075 336405 -113402 15781 -142482 -418448 19357 -183596 -48079 -51799 -78346 327077
9423 35089 -95383 -46680 -25313 -238455 -270145 -29169 25211 -23891 -73735 -220753 35127
9411 -143083 354692 -28060 -3650 146875 123635 -184694 17303 -2855 -48083 95364 -78572
9399 42701 70788 -205939 233584 142340 145777 -360566 -150562 198761 43793 -117346 49578
9387 -198058 46762 -56828 -114291 -130701 -254604 144159 -302282 -270474 -312930 101431 -266757
9375 333915 17790 236123 64166 -40272 84796 -182494 70536 134236 192841 -248388 128887
9363 248907 -333352 371185 -48470 -26868 -236803 -64070 -231020 13912 -548930 -193242
9352 -148530 -102683 -87735 -7555 66321 93083 -6498 -177958 1118 -85513 -23283 -43214 -312247
9340c12247E253a48153F3530c57102f8221A04045K8232K4724a70823P6595L3438
9329f0790B65316F8266c01249B86438E4471M5420n915b7153j70465A72642b14603
9317B90744b79628N5458a08561E5988K4668b33074h7398P685G9924b88613N6738
9306b31875j31883K3519M2321I1294a22117j61858P8268k670i9129n7380d021
9294f728j55979G3236a45511c1941l96578a59884A77550p6966O159K36681a6545
9282B35359J0773a43548k40414J79002l81701g1909a1147A38534P8680A3757a58600
9270C499L2208L65269d49549f9416A99724f3313A3057O2186a02749A5675a03385
9258a84328C03868c31670H4886b30633m0816N8597h4423i069j3618G0852J22795
$$ plain form
9340 -312247 5253 -148153 63530 -357102 -68221 104045 132277 157001 -170823 -94228 -60790
9329 -60790 265316 68266 -301249 286438 54471 99891 93976 -27153 -197618 172642 -214603
9317 290744 -279628 -224170 -108561 55988 80656 -233074 -87398 -79713 79924 -288613 -231875
9306 -231875 -363758 -340239 -297918 91294 -122117 -283975 -205707 -208377 -99129 -156509 -4021
9294 -6728 -162707 73236 -145511 -31941 -428519 -159884 177550 100584 106743 343424 -16545
9282 235359 246132 -143548 -383962 -204960 -586661 -71909 -11147 138534 217214 13757 -158600
9270 3499 35707 400976 -449549 -69416 199724 -63313 13057 75243 -102749 15675 -103385
9258 -184328 303868 -331670 84886 -230633 -271449 -212852 -84423 -9069 -22687 70852 193647
9247A93647a07645B39148a39049A30548k169o2123a84110g5983j17992f619k08704
9236b15323h3995k84236A97883e3212A64522g0642r272F3864g896C4818g8572
9224e3428j62643d6828j46878Q5315B10264C6161Q2007L5375J0857B5364e6108
9212a08697j44644B63819I8758a93811b8397D9100a15162e269j34437j82269A95891
9200a74587C4175a71366A74292j5712h5137A40159b44184B36464c09483i6929
9189d6778j40108L3273O6200C6919c38379a02821A6324b02171c0041M962k29037
9178b54116i9865A65293a05092J7526A78840a83033B79797A18573a23495K8976
9168i4519B3273f2335q6946D38541a7805A38499k9115O3353a64185A24588c18635
$$ plain form
9247 193647 -107645 239148 -139049 130548 128379 66256 -184110 -75983 -193975 -6619 -215323
9236 -215323 -83995 -368231 197883 -53212 164522 -70642 -79914 63864 -7896 34818 -78572
9224 -53428 -216071 -46828 -193706 -108391 210264 36161 118168 153543 164400 25364 -56108
9212 -108697 -253341 263819 98758 -193811 -28397 49100 -115162 -5269 -139706 -321975 195891
9200 -174587 34175 -171366 174292 158580 -85137 140159 -244184 236464 -309483 -96929
9189 -46778 -186886 -153613 -87413 36919 -338379 -102821 16324 -202171 -30041 -25079 -254116
9178 -254116 -99865 165293 -105092 -87566 178840 -183033 279797 118573 -123495 -94519
9168 -94519 23273 -62335 -149281 438541 -17805 138499 109384 172737 -164185 124588 -318635
9156a27088j14889h811l9859k07108B59026b45285B18811b20392d1635j77405
9146b19040d6854l8949A74374F7422r655a16351j30653c0611p6443E695J77286
9135A82981K24833c77487g6876l13020R2715a3932l75055H6775a74159L3812L4397
9124a05950A8861b06325A19183n7593J60803a21886p9498j4333j25000h094A21451
9112b49495h6853M205k1136C6296L63033c37991A28087A9670L3667c65921I4121
9100B0730e1925m9337j81490E4744a76252o3629a03191j58573L3778j9920R792
9089b38114r4821F6231A8479a87474a1747o4766l1099k68012J45602B46544b60264
9077b91383a10702n3029A1968K1761a83762N6528L1733j34601A54397d3347j84046
$$ plain form
9156 -127088 -241977 -8811 -48670 -255778 259026 -245285 218811 -220392 -41635 -219040
9146 -219040 -46854 -85803 174374 67422 57767 -116351 -247004 -30611 -107054 5695 182981
9135 182981 407814 -377487 -76876 -389896 -297181 -13932 -388987 86775 -174159 -140347 -105950
9124 -105950 18861 -206325 119183 61590 222393 -121886 -201384 -215717 -340717 -8094 121451
9112 -249495 -86853 -82648 -103784 36296 399329 -337991 128087 19670 53337 -365921 94121
9100 20730 -51925 -101262 -282752 54744 -176252 -239881 -103191 -261764 -227986 -247906 -238114
9089 -238114 -332935 66231 18479 -187474 -11747 -76513 -107612 -375624 -230022 246544 -260264
9077 -291383 -110702 -163731 11968 33729 -183762 -127234 -95501 -230102 154397 -43347 -227393
9066b27393a07285j90695b43j80545m9104A28201P5976b6884j39499o9490c8740
9054a68067j44667C8394a01408p7238I5425K0229M5043c29539c8934I5941a21223
9042G500b58958A15978N0987g2056H6245e6644r0011j58367A38849d3527C63250
9030G0964P9039a95396k10042B2298J06627c13285A06580L8048F3352b38705a00700
9018b04291A63182M1100c5292B47062a77795C84882b46792h9103j10539L6977
9008a62665J8208l05420f7096o92E9215J03010G1585d88073H0559c0569n8568
8997h9137B06643c4376l97249A26746g9408j37861f916m58859H3985c4958k20781
8986b55739B7567J20741j1986L340a35891A05527A4991b30867B4471a60145F2581
$$ plain form
9066 -227393 -107285 -297980 -243 -180788 -229892 128201 204177 -26884 -166383 -235873 -38740
9054 -168067 -312734 38394 -101408 -178646 95425 115654 160697 -329539 -38934 95941 -121223
9042 7500 -258958 115978 166965 -72056 86245 -56644 -146655 -305022 138849 -43527 363250
9030 70964 150003 -195396 -405438 22298 128925 -313285 106580 144628 63352 -238705 -100700
9018 -204291 163182 204282 -35292 247062 -177795 384882 -246792 -89103 -199642 -162665
9008 -162665 -144457 -449877 -67096 -67788 59215 162225 71585 -488073 80559 -30569 -89137
8997 -89137 206643 -34376 -431625 126746 -79408 -217269 -6916 -465775 83985 -34958 -255739
8986 -255739 27567 148308 136322 139662 -135891 105527 14991 -230867 24471 -160145 62581
8974g1828k03076C4889J17053a06977F7891d8707N650j05302A47136d0139J6373
8963b3766D097K80465d3764A7951a95037B49349r1659a60241A4829i0949j1341
8952a02290A596P5633c78221E5235K3701h1813j0322o7353b0931A32288A2287
8940D540b29999D6300i4023R74p1703c1874G1859c09420I1299J11433f7724k555
8928g0279A05089b49347J8102B16908J56182A81048O87178R63318q83131f0667
8917c1001A25115a09304B18305B0290b24997B70981a43453J8523H0204E47J72335
8906A72882a71760f8210L0122C0848d8720I9212A8304g7015p5839B34823A09933
8894C8010M3624f5116j49369O8584k43890A92859b39078B20650a72963N6979j15476
$$ plain form
8974 -71828 -274904 34889 151942 -106977 67891 -48707 -43057 -148359 147136 -40139 -23766
8963 -23766 4097 284562 -43764 17951 -195037 249349 157690 -160241 14829 -90949 -102290
8952 -102290 1596 77229 -378221 55235 78936 -81813 -92135 -159488 -20931 132288 12287
8940 4540 -229999 46300 -94023 -93049 -164752 -31874 71859 -309420 91299 202732 -67724 -70279
8928 -70279 105089 -249347 -231245 216908 373090 181048 868226 1831544 948413 -60667
8917 -31001 125115 -109304 218305 20290 -224997 270981 -143453 -124930 80204 547 172882
8906 172882 -171760 -68210 -38088 30848 -48720 99212 18304 -77015 -152854 234823 109933
8894 38010 81634 -65116 -214485 -145901 -389791 192859 -239078 220650 -172963 -115984 -231460
8883b31460A62831a39868A00945C6020a13267e1964C0064Q0446f7924q5166H1546
8871A51683a50502m9258P4495B15255j1451a29447A03455b37382M0855Q9529k39486
8860c46484A16377D5932a05281R18h086k97842A31021i9580j81219J29432F8060
8848A14099c6255M302J3083m25744B0959J22090e6514j74927P7611A29294N4214
$$ plain form
8883 -231460 162831 -139868 100945 36020 -113267 -51964 30064 110510 -67924 -153090 81546
8871 151683 -150502 -199760 -125265 215255 203804 -129447 103455 -237382 -196527 -106998 -346484
8860 -346484 116377 45932 -105281 -104363 -8086 -305928 131021 -99580 -280799 -151367 68060
8848 114099 -36255 -31953 -18870 -444614 20959 143049 -56514 -231441 -153830 129294 183508
$$ [...]
##END NTUPLES=NMR SPECTRUM
##END=
