##TITLE=NES1086_santa_lucia_9885092_Txwg26jtW8
##JCAMPDX= 6.0         $$ Bruker NMR JCAMP-DX V2.0
##DATA TYPE= NMR SPECTRUM
##DATA CLASS= NTUPLES
##ORIGIN= BRUKER
##OWNER= Administrator
$$ 1.72 TOPSPIN		Version 2.1
$$ 2016-08-27 21:40:31.304 -0500  Administrator@X
$$ Compression mode = diff/dup
##.OBSERVE FREQUENCY= 400.02188249412
##.OBSERVE NUCLEUS= ^1H
##.ACQUISITION MODE= SIMULTANEOUS (DQD)
##.ACQUISITION SCHEME= undefined
##.AVERAGES= 8
##.DIGITISER RES= 22
##SPECTROMETER/DATA SYSTEM= spect
##.PULSE SEQUENCE= zg30
##.SOLVENT NAME= COFFEE_meoh
##.SHIFT REFERENCE= INTERNAL, COFFEE_meoh, 1, 14.98509
##AUDIT TRAIL= $$ (NUMBER, WHEN, WHO, WHERE, PROCESS, VERSION, WHAT)
$$ ##TITLE= Audit trail, TOPSPIN		Version 2.1
$$ ##JCAMPDX= 5.01
$$ ##ORIGIN= Bruker BioSpin GmbH
$$ ##OWNER= Administrator
$$ $$ E:\/data/COFFEE/nmr/NES1086_santa_lucia_9885092_Txwg26jtW8/10/pdata/1/auditp.txt
$$ ##AUDIT TRAIL=  $$ (NUMBER, WHEN, WHO, WHERE, PROCESS, VERSION, WHAT)
(   1,<2016-08-27 21:40:24.211 -0500>,<Administrator>,<X>,<go>,<TOPSPIN 2.1>,
      <created by zg
	started at 2016-08-27 21:39:18.617 -0500,
	POWCHK enabled, PULCHK disabled,
       configuration hash MD5:
       21 0F 79 D6 B3 7B B4 F6 88 20 88 DB 03 48 BD 9F
       data hash MD5: 64K
       0D 7A 8A 97 80 9F D6 70 5F 70 9F 57 89 7E 83 C8>)
(   2,<2016-08-27 21:40:27.273 -0500>,<Administrator>,<X>,<proc1d>,<TOPSPIN 2.1>,
      <Start of raw data processing
       efp LB = 0 FT_mod = 6 PKNL = 1 PHC0 = 0 PHC1 = 0 SI = 32K 
       data hash MD5: 32K
       84 7A 67 89 D3 14 94 9A DA 37 8B 71 18 0D 72 B5>)
(   3,<2016-08-27 21:40:27.554 -0500>,<Administrator>,<X>,<proc1d>,<TOPSPIN 2.1>,
      <pk PHC0 = 90.64819 PHC1 = 0 
       data hash MD5: 32K
       A5 30 C0 59 87 FD AF 1B A6 8C 17 85 0C FD E2 FA>)
(   4,<2016-08-27 21:40:27.664 -0500>,<Administrator>,<X>,<proc1d>,<TOPSPIN 2.1>,
      <abs ABSG = 1 
       data hash MD5: 32K
       19 B2 A2 1D 4A 74 D6 EF FD 68 4C 77 3A D8 1F 7F>)
(   5,<2016-08-27 21:40:27.726 -0500>,<Administrator>,<X>,<proc1d>,<TOPSPIN 2.1>,
      <abs ABSG = 2 
       data hash MD5: 32K
       1A 19 9D 41 FA 4C 60 B3 35 4B 19 D0 21 B9 40 7C>)
(   6,<2016-08-27 21:40:27.789 -0500>,<Administrator>,<X>,<proc1d>,<TOPSPIN 2.1>,
      <abs ABSG = 3 
       data hash MD5: 32K
       BA 37 58 54 2B 55 D5 CA 93 09 66 33 C1 EE 35 A6>)
(   7,<2016-08-27 21:40:27.836 -0500>,<Administrator>,<X>,<proc1d>,<TOPSPIN 2.1>,
      <abs ABSG = 4 
       data hash MD5: 32K
       80 13 D5 9F 7A 92 94 77 22 F4 CA 96 97 AD 00 D9>)
(   8,<2016-08-27 21:40:27.898 -0500>,<Administrator>,<X>,<proc1d>,<TOPSPIN 2.1>,
      <abs ABSG = 5 
       data hash MD5: 32K
       B2 CA 40 D4 F4 79 5D F8 22 02 6C CB F2 60 C6 C3>)
$$ ##END=
$$ 
$$ $$ hash MD5
$$ $$ FF 69 36 16 8D 5F 8F E8 3B A2 1D B6 66 22 81 D6
##$RELAX= 
##$RELAX= 
##$RELAX= 
##$RELAX= 
##$RELAX= 
##$RELAX= 
##$RELAX= 
$$ Bruker specific parameters
$$ --------------------------
##$DU= <E:\>
##$EXPNO= 10
$$ [...]
##$TP= (0..7)
150 150 150 150 150 150 150 150
##$TP07= 0
##$TPNAME0= <>
##$TPNAME1= <>
##$TPNAME2= <>
##$TPNAME3= <>
##$TPNAME4= <>
##$TPNAME5= <>
##$TPNAME6= <>
##$TPNAME7= <>
##$TPOAL= (0..7)
0.5 0.5 0.5 0.5 0.5 0.5 0.5 0.5
##$TPOFFS= (0..7)
0 0 0 0 0 0 0 0
##$TUNHIN= 0
##$TUNHOUT= 0
##$TUNXOUT= 0
##$USERA1= <user>
##$USERA2= <user>
##$USERA3= <user>
##$USERA4= <user>
##$USERA5= <user>
##$V9= 5
##$VALIST= <valist>
##$VCLIST= <CCCCCCCCCCCCCCC>
##$VD= 0
##$VDLIST= <DDDDDDDDDDDDDDD>
##$VPLIST= <PPPPPPPPPPPPPPP>
##$VTLIST= <TTTTTTTTTTTTTTT>
##$WBST= 1024
##$WBSW= 4
##$XGAIN= (0..3)
0 0 0 0
##$XL= 0
##$YL= 0
##$YMAX_a= 610746
##$YMIN_a= -518067
##$ZGOPTNS= <>
##$ZL1= 120
##$ZL2= 120
##$ZL3= 120
##$ZL4= 120
##$ABSF1= 14.98509
##$ABSF2= -5.573092
##$ABSG= 5
##$ABSL= 3
##$ALPHA= 0
##$AQORDER= 0
##$ASSFAC= 0
##$ASSFACI= 0
##$ASSFACX= 0
##$ASSWID= 0
##$AUNMP= <proc_prof1d_extract_pilot.lims>
##$AXLEFT= 0
##$AXNAME= <>
##$AXNUC= <1H>
##$AXRIGHT= 0
##$AXTYPE= 0
##$AXUNIT= <>
##$AZFE= 0.1
##$AZFW= 0.1
##$BCFW= 0
##$BC_mod= 0
##$BYTORDP= 0
##$COROFFS= 0
##$CY= 15
##$DATMOD= 1
##$DC= 0
##$DFILT= <>
##$DTYPP= 0
##$F1P= 0
##$F2P= 0
##$FCOR= 0.5
##$FTSIZE= 32768
##$FT_mod= 6
##$GAMMA= 0
##$GB= 0
##$INTBC= 1
##$INTSCL= 1
##$ISEN= 128
##$LB= 0
##$LEV0= 0
##$LPBIN= 0
##$MAXI= 10000
##$MC2= 0
##$MEAN= 0
##$ME_mod= 0
##$MI= 0
##$NCOEF= 0
##$NC_proc= -8
##$NLEV= 6
##$NOISF1= 0
##$NOISF2= 0
##$NSP= 0
##$NTH_PI= 0
##$NZP= 0
##$OFFSET= 14.98509
##$PC= 1
##$PHC0= 90.64819
##$PHC1= 0
##$PH_mod= 1
##$PKNL= yes
##$PPARMOD= 0
##$PPDIAG= 0
##$PPIPTYP= 0
##$PPMPNUM= 2147483647
##$PPRESOL= 1
##$PSCAL= 4
##$PSIGN= 0
##$PYNMP= <proc.py>
##$REVERSE= no
##$SF= 400.02
##$SI= 32768
##$SIGF1= 0
##$SIGF2= 0
##$SINO= 400
##$SIOLD= 32768
##$SPECTYP= <>
##$SREGLST= <1H.CDCl3>
##$SSB= 0
##$STSI= 32768
##$STSR= 0
##$SW_p= 8223.68421052631
##$SYMM= 0
##$S_DEV= 0
##$TDeff= 65536
##$TDoff= 0
##$TI= <>
##$TILT= no
##$TM1= 0
##$TM2= 0
##$TOPLEV= 0
##$USERP1= <user>
##$USERP2= <user>
##$USERP3= <user>
##$USERP4= <user>
##$USERP5= <user>
##$WDW= 1
##$XDIM= 32768
##$YMAX_p= 449428876
##$YMIN_p= -709991
##$CURPLOT= <Network HP LaserJet P1505>
##$CURPRIN= <$Network HP LaserJet P1505>
##$DFORMAT= <normdp>
##$LAYOUT= <+/1D_H.xwp>
##$LFORMAT= <normlp>
##$PFORMAT= <normpl>
##$SURQMSG= 1
$$ End of Bruker specific parameters
$$ ---------------------------------
##NTUPLES= NMR SPECTRUM
##VAR_NAME=  FREQUENCY,     SPECTRUM/REAL,   SPECTRUM/IMAG
##SYMBOL=    X,             R,               I
##VAR_TYPE=  INDEPENDENT,   DEPENDENT,       DEPENDENT
##VAR_FORM=  AFFN,          ASDF,            ASDF
##VAR_DIM=   32768,         32768,           32768
##UNITS=     HZ,            ARBITRARY UNITS, ARBITRARY UNITS
##FACTOR=    0.250966925370066, 1,           1
##FIRST=     8223.43324360094, -189174,      23732
##LAST=      0,             5154,            62827
##MIN=       0,             -709991,         0
##MAX=       8223.43324360094, 449428876,    0
$$ Real data points
##PAGE= N=1
##DATA TABLE= (X++(R..R)), XYDATA
$$ [...]
23823 -142903 426755 278869 223310 -236930 -140618 13582 1317 245159 236108 120249 34598
23811 -27239 -173337 -76986 396269 105372 -13704 -131036 154070 -148810 -309863 -143659
23800 45254 -7992 -324064 180076 -214900 111912 13786 -257318 311579 -22594 -80886 -24292
23788 -198962 157734 271653 -49781 -106387 -36266 -328675 -11562 40556 -241436 78372 -107428
23776 17808 -88213 136473 -15911 -216985 -9482 141788 -34459 -72105 -332834 -186546 79388
23764 -225730 239765 -182115 289818 -217681 -175354 175562 43041 131527 -201924 -59761
23753 151305 19772 52387 -4087 44238 -7145 -119240 -91107 246269 87631 99356 275844
23742 275844 -30839 148651 248426 -114584 115574 8098 -345751 -91036 87397 -23990 -285398
23731 -285398 182351 -134050 -219433 176866 288847 266414 134243 -116518 -153483 -296776
23721 -296776 -13692 -237539 -138178 14234 37646 170806 -58894 55660 -82907 -205089 -100775
23709 76880 -321925 -30158 20540 -99887 17094 4171 -173623 -89281 51486 -39876 338546
23697 40237 -41730 94714 -87771 -41704 -21386 264747 -247879 48674 -45206 -68910 -312630
23686 -312630 -117895 213523 136303 -342737 39740 -113555 -147224 -279605 286336 36925
23675 -144209 125149 104335 -114107 201459 225174 -90769 -467301 271723 -26512 -168568
23665 -168568 -148928 37703 -9199 91304 -192275 14848 -5009 225762 -159810 -6746 -168712
23654 -168712 22811 51564 148923 -116301 65342 303624 -403493 -67440 220917 -102394
23643 -143977 -99555 -53727 110287 -435055 108576 94732 96503 43654 -172735 -77694 354420
23631 147854 349288 -231560 -387446 -163137 -67722 289832 -222142 -109076 127176 -98132
23620 -46562 88508 -273239 -184814 -32720 36591 -150089 218938 171855 26057 -186364 -75998
23608 22690 -145323 80950 -59762 316682 -97126 23694 -117943 -154595 -133652 -107748 232997
23596 -246349 134057 13273 56747 -4363 -51294 42624 -184898 259536 -29022 318777 390698
23585 390698 155795 74352 40519 299899 79798 53786 -243919 -166547 -147304 107230 -160293
23573 -106742 -100634 -106141 223474 -250543 -73993 34251 173566 88748 57311 161449 -69198
23561 182953 109649 7923 -91006 -11191 -40694 34279 -36768 12981 -258748 179540 118066
23550 118066 -117261 123288 13068 -34596 -100797 94510 -237172 62277 -351494 -332427 -104822
23538 365435 121633 -128059 161703 -129250 89620 -126361 -226682 16763 -223192 -57370
23527 -259314 100488 154937 117558 49502 1843 8720 315130 77288 -72619 -92221 -38713
23515 -46190 -111432 -28810 -20876 66669 91125 -175696 -19486 -168556 4474 21492 88314 -3974
23502 112066 30518 -36118 -181969 21937 66431 28538 11978 41554 43304 65178 92595
23491 92595 -20540 -165539 28941 33548 -167512 337025 3704 126496 149940 180834 230784
23480 230784 248445 -224201 12092 41125 -36845 -142945 114906 50138 -3065 257289 -20777
23468 -203754 -316454 -335052 49772 -25276 -66176 11044 -73017 -194290 -134505 -14298 113157
23456 -218629 -150373 -223719 30669 -136773 -170924 -74226 41842 130675 -136575 69527 -60431
23444 347527 26560 66178 222049 -44382 -165750 -269684 -360756 -39063 240146 -129281
23433 -72048 32226 -67747 -284131 -142509 -59639 -83438 47784 286409 245178 115338 91274
23422 91274 218146 70837 -267583 -64888 30963 16723 -15414 -109113 126300 158224 -17484
23410 272319 -11625 -34213 -337129 44537 -89182 -203834 14922 -27817 215555 -87621 264775
23398 208180 -63579 -102128 234444 -239455 209117 -293880 -102901 -7428 -44111 157299
23387 52049 -358167 75629 -144196 66297 -325834 -10290 60531 -24339 -206645 -163943 155522
23375 124659 89194 -330766 222225 -55170 244025 39997 103294 276512 -55854 -194662
23365 -194662 136411 136724 -66641 -164790 -22858 -215672 -109224 -23887 -96555 -34019 -310863
23354 -310863 -208986 -243568 42164 184520 -50879 -180446 -182211 90647 233014 -68990 71360
23342 34060 -96845 205105 -130145 88976 -76677 131690 8098 -88123 94250 158459 18791
23330 -112368 -40692 -248171 -48343 -115616 -58445 -54590 129516 -174989 160628 162226 118796
23319 118796 -73189 113744 -138958 156335 10245 51614 -193525 129403 -97746 -180432
23309 -180432 -176699 -39286 215254 -121561 -158049 -99953 -396114 55399 -19319 20834 184896
23298 184896 -104465 300371 126666 35543 150059 151491 -59359 138591 209944 124874 -173913
23286 -50074 -172560 -129837 -139146 -236444 277177 104271 55369 13278 -150502 250683 -63214
23274 -140937 45354 -19471 -128298 -9987 -62116 -401469 -2916 -4789 23121 -206693 -68519
23262 -479230 -103358 108207 -121258 -540445 164010 -140217 -77756 -143695 -52338 166044
23251 37655 -122642 274387 11767 -63873 54163 -72419 -89300 337309 -190192 -146515 -89107
23240 -89107 -23680 234169 4208 -68823 -15449 10139 43936 -186320 42866 -139287 36450
23228 -305467 -100761 -169194 6466 258349 -36373 61169 228926 373512 -424597 -99645 145138
23216 -32123 52937 89619 -122978 24204 -256383 -317181 -40178 -93115 -261823 289810 -54659
23204 -297785 257521 13373 -90018 199139 145584 124159 -137835 261806 155082 -111431
23193 -179332 -120575 73525 -260693 92333 95026 -72805 303190 -105347 74970 124478 -292104
23181 -225434 -202671 -130047 106419 -155615 147411 123505 -109243 -1720 -227698 134041
23170 -147817 -146230 -59123 39699 224746 -92098 -107916 104612 40145 340127 -170323 39615
23158 -178528 126800 -75257 -362650 -149118 40777 84105 54969 227669 -126367 -119849 -167162
23147 -167162 70916 -41467 221113 -236787 -224700 131276 -89576 78211 -108851 -133228 73928
23135 -211517 -22088 124583 130932 5868 -264628 199373 31938 -107858 164601 43826 -176035
23123 184679 -87545 10364 -83085 141356 -54486 -205589 138747 10221 103055 -141005 125634
23111 105244 -242806 388057 107301 -83930 -86994 444002 115067 -5252 -136345 141820
23100 -32184 66942 -269302 -78554 -45598 141401 371480 -2177 -89090 -70455 -174382 163875
23088 85776 -138781 435978 -197476 -211706 293004 206970 82859 -327632 170809 88305
23078 88305 -107881 -27220 39946 -175386 -101879 -115489 112228 214978 -146222 30858 -5270
23066 -99441 262348 -74322 7434 56318 -84550 -112983 -132322 -73653 165219 41909 329924
23055 329924 -127213 125138 84703 -204019 -291169 -61016 329102 -319983 38730 66424
23045 66424 66824 108064 148632 214007 69177 87545 -156599 76454 -302441 -328170 -144222
23033 106474 112629 107289 135746 297350 98308 -257138 62321 -36492 225773 -140777 -27904
23021 -54944 -155106 4465 -269072 192307 -18874 -224097 -246486 -178554 -99838 134407 -204369
23009 -106776 -23082 -202989 -5223 -27673 48598 -7156 15658 -179173 -288556 236399 66280
22997 -37323 -58189 -33162 -32793 -4002 224447 7611 22271 110297 -29962 223654 -116306 -125580
22985 -125580 205720 -254229 -54286 -180762 171301 134531 -5698 118757 -746 117160 -243143
22973 -247017 193856 71119 -222238 -110089 66124 -107260 347387 237068 -138473 -14573
22962 -234045 84514 183450 54833 -198783 13699 42882 83966 121314 -281045 -117009 -124404
22951 -124404 60791 -101954 -40329 -30607 -202394 82138 77844 -10532 86795 -125376 367790
22939 91485 1103 62869 -128652 -181071 -288526 -92369 305063 188750 184615 -266861 343721
22927 40427 100080 -21184 -82257 243834 -453791 12843 22577 -121966 90921 120911 148293
22916 148293 -317754 112469 -280799 -34707 -123702 3914 90071 20181 22531 31195 -129097
22904 -456425 -106391 -3243 -24340 123420 375817 374861 -27202 -291058 -53544 93312 -50740
22892 -22276 -136027 151060 -335542 39172 120694 -308649 -113818 92638 -49880 -97288 83272
22880 98207 58251 139849 -251915 -273822 -133723 -293491 -139942 117162 -63553 34080 101008
22869 101008 68320 -74419 76395 63327 -59841 -15929 30192 -197461 90504 -240076 40707
22857 -117413 53319 -211667 -223734 -64551 -83164 -70214 -270586 -232767 -143088 104347 -7354
22845 129654 -63041 -44448 67753 -368411 82657 275657 -211122 170370 72305 83174 -14609
22833 -66201 -125188 -200524 12637 179351 239727 104501 -51757 90847 -217034 -245270 80885
22821 -138039 -291065 -50120 30123 222492 96419 146211 166813 -303951 -93280 -55622 -184154
22810 -184154 -346741 -51646 256332 -66943 -163936 252470 -23517 -67660 -280664 -71478 -189660
22799 -189660 37545 -94071 257635 107161 -35636 119742 -217697 -240756 -309839 -119319
22788 -14501 -196173 193808 -99756 403923 33808 -194348 77905 36172 -232375 -182823 -185097
22777 -185097 -27272 62153 -299472 105682 -162727 -45485 47697 -152885 -30397 41371 -22481
22765 -48329 -249565 -130395 -190207 29032 -146890 -146588 -56575 -81617 -72276 -121985 -59536 313352
22752 -67072 -118453 -5106 123363 118697 -69947 231492 -13778 -113400 -55645 -15380 318069
22740 168709 169852 207853 66232 -18975 105642 111793 -24410 -289035 -1791 6486 361437 -4521
22727 -32303 -241732 52272 -23858 225573 -115567 307703 161352 -259950 -204974 -4435 -9603
22716 -9603 129848 -50065 -183724 67026 50239 -328876 -425084 -199654 11377 117398 106771
22705 106771 30808 -289263 3940 507985 199979 -57481 -31018 180157 118831 48388 237995
22694 237995 189846 -98213 30861 -130034 -1896 -31116 -199426 -369586 -244937 226032 94509
22682 47378 -122061 225714 -437969 -66818 -210414 70198 -110800 90021 95867 9593 -26832
22670 346775 88684 -48425 -79003 20830 -18280 -32193 295231 86949 -267359 -24932 10381
22658 -144179 -39683 191992 -183044 -287523 162000 -211084 -175593 50281 -339430 -31096
22647 -95363 -91256 -89039 225528 -123917 100830 -186346 49037 -730 147038 -106844 -132759
22636 -132759 -164236 -392801 -17752 -2869 -136131 119325 91641 -106194 -199601 38231 -38540
22624 10228 -92846 -376816 -167705 -250873 8627 -55223 -474947 -120033 -47175 150638 -58584
22612 -82674 13394 207254 240000 276954 -285431 -123120 29294 -2901 171908 -113056 -42642
22600 173220 -89396 90172 -74315 -317190 -112683 -25241 6173 -26642 -88615 130470 115752
22589 115752 -120932 -19287 -235784 595581 173309 -37323 -70366 197382 -237763 -64230
22578 -291653 79374 -327691 -500606 207487 138 -52717 -34470 209456 241298 90705 -151727
22566 175376 285512 -21531 50122 -89077 -204193 210231 14424 -56183 348214 -6982 -134365
22555 -134365 -196756 103526 -193279 -141181 -85679 136235 281179 -22304 255652 68350
22544 -48809 -265923 39652 81775 123 8343 -253466 -197044 -173671 -109732 -69734 72225 -162219
22531 14533 -177083 194478 27408 -227684 181275 55181 -87955 -94379 -21672 -153440 -203754
22520 -203754 -54015 -41664 -219121 -118884 52048 99302 67057 79727 -304461 52938 79254
22509 79254 1766 223644 148264 -23158 188297 -288283 -51037 -303779 112892 188466 8041
22497 -71672 -220740 148832 -75810 -281091 -223874 326272 29375 -456024 152377 -171690
22486 -12255 -164699 -221251 -35481 -377142 -269786 107557 29465 -133110 -392449 122416
22475 -128392 -296267 -562151 102589 -109266 122189 -140915 296608 27813 -367058 -84592
22464 -12444 -125788 -152581 88134 -80567 205714 6550 -63337 -34922 -152321 -178893 -177966 -18333
22451 -51718 138757 6873 -233645 42390 79968 4325 132497 86101 85095 165807 -137962
22439 -73971 -67346 -141603 -33733 141840 5319 -124250 -261723 209475 -70684 105225 -215916
22427 -179288 299691 -182803 85207 -131026 26414 -40972 -83005 434780 -206808 -64347
22416 -26802 -48161 -135453 -169979 -401307 73294 -295592 82988 -97337 70099 48370 91150
22405 91150 -171128 -16349 -31165 288347 2791 -70801 -230910 -76422 18730 -280729 219461
22393 -22909 72637 115178 135396 12292 -36482 50741 56293 -147956 -125891 -122772 116522 -75636
22380 424107 58791 -481067 116204 30350 -310780 115485 -61055 103767 -80563 353273
22369 -88307 -4711 -125998 91200 -90497 43759 -331594 210479 104463 -271588 -492029 109866
22357 -155680 57172 -73383 -200732 -188271 16585 -25863 -116516 -68171 170112 -299641 71559
22345 -20598 233224 26834 -169308 17168 254925 -280108 41751 29378 -128316 -160697 -70524
22333 -257910 -161701 40068 -216647 176151 -94592 -258759 685 -25584 -130056 -259005 -85042
22321 -131167 32799 -103395 -164620 -64304 -213370 -76720 -40434 -30731 90596 136326 116971
22310 116971 -327531 286215 -32935 120976 -204154 -122142 -68115 250788 -11836 160227
22299 206204 -45899 197785 112632 88382 -165585 -118120 -64070 -63549 -231273 107947 56839
22288 56839 -15378 25886 -428896 -209391 -103535 14585 -136214 44965 67340 -18052 -237833
22277 -237833 32473 -155514 -76377 101540 -160022 -94072 -60998 110781 128084 19240 200292
22266 200292 175043 18064 21779 69496 -48060 -215760 225411 58759 -285138 244229 -62521
22254 -231051 -313388 -181604 -68620 -120274 138400 -73111 95473 -41766 -228351 -34426 -265135
22243 -265135 -147882 -319753 -103266 -134946 175592 -56354 -76138 -122934 -146478 16667 13587
22232 13587 -362774 21913 41031 -137813 37664 -336827 287687 -174860 15899 -113373
22221 -157569 -75179 71151 -71043 -144005 105480 -104935 49639 7720 58703 -69994 -9532
22209 -67889 -54323 -30043 -89761 217951 -38664 -180218 10943 180413 28746 232838 -39271
22197 -331940 -263604 -165068 -62497 4202 180139 -170390 -65805 -45673 146273 -134019 -75765
22186 -75765 -7852 -267027 -154261 -171970 67873 -181994 23228 -303162 -230677 198331 -337851
22174 19774 -143438 28834 86375 -345399 -214215 202150 -251683 -168288 -398460 -400056 -95119
22162 -146763 -181628 -31076 219789 -120841 74307 -55799 -111462 -167550 174892 -156720 44288
22150 -8493 -349471 -273507 -43994 -36018 -280343 171425 36425 95344 169806 -93953 49317
22138 -11363 -83724 -139275 309012 -130391 -221340 296662 -245229 -80265 -492636 256833
22127 -310918 342534 -76415 59064 -92631 335144 -104533 -215517 -34762 1641 -183694 -68252
22115 -207295 -177546 -114169 -86381 71525 127990 16562 -2585 -69786 -166962 6119 18057 -184734
22102 197862 -81626 1592 -44539 46683 -125914 30997 -274677 -87635 103331 -420261 -66587
22090 258126 135952 -51239 -61608 298176 87063 21401 -218136 -140472 53024 231043 -521
22078 -111337 119492 19135 -24522 -133897 132463 -145887 -275435 -30056 -86883 -131603
22068 -131603 36471 -131937 -179958 -11126 -524688 -7155 180953 361433 77408 301648 12435
22056 -28873 -63944 59747 275198 -103430 203695 -131160 226122 101427 -113580 -244477
22046 -244477 -202296 229762 -21435 301271 94323 -100567 -89037 30016 -220330 -65707 -18671
22034 -158115 -191573 -12288 -297558 56141 -70313 179932 87138 -205115 60950 309563 -53436
22022 22304 -44661 -137303 45410 -283499 46915 -29705 -161789 161309 49089 123703 295808
22011 295808 -437979 -227689 99759 -22856 138151 -43919 66120 -3600 -53031 191181 -187399
21999 -286645 202166 -198765 -351979 -50492 40367 178241 135227 4190 -200956 -62558 39369
21987 -240128 -125816 -171394 -254801 164292 -160357 -66360 313739 259690 -346573 133550
21976 -358745 -183092 -47149 -26779 1486 60806 31793 -41035 200011 -48703 189171 -144534
21964 17806 215330 -374659 -213903 219223 158391 -41352 130653 116296 -187573 94330
21953 225709 -108229 -13828 -28120 30654 -251813 -358286 -362278 387164 74595 -330661 -131304
21941 -378039 314216 -168982 15965 -30437 150174 -301057 -91971 171886 -135633 -167188
21931 -167188 -157528 -150929 -89601 -122620 -237804 -189566 109301 36863 109692 -138552 -45336
21919 -70268 -251364 139910 -121411 -102731 81735 -69727 -159557 67016 143086 -176890 -104576
21908 -104576 79013 -84660 -202498 -247610 275658 -116525 171577 95012 -332819 -147762
21897 154279 153460 280815 380257 -51740 -147124 -236722 205647 -124574 -87248 211965 -219068
21885 -84868 236339 -95556 -183651 -39394 -27025 -60374 -60798 -229570 182485 -11561 -344058
21874 -344058 -93651 187347 -211059 -155902 30207 -209355 168573 -139214 -69799 156090
21863 128425 -209717 -48492 -31981 165763 -189087 -104262 68964 228924 311248 -338785
21852 250466 100936 -158182 -131199 -52674 -134566 -117598 -264075 -165737 7510 -396692 -227990
21841 -227990 -266489 41010 -66403 -36685 -273261 -67416 -252852 -232968 75877 166389 1613
21829 178954 -30028 220749 -72373 -360625 268695 -256954 -5278 56014 -82112 22294 -143154
21817 -43349 -403737 120666 -28275 -151431 -14805 -14722 -101796 -431861 -56074 -105939 145447
21805 71705 -132018 -128783 -213997 -163909 46262 -100169 119384 120164 13417 -59239 -167067
21794 -167067 23978 -130076 -90540 118482 -9716 -336701 321569 -64664 -145737 -242009 -114177
21782 -261515 -88420 184613 27042 -33222 -125305 -48086 212845 -235007 -248506 -29397 -46556
21771 -46556 69728 -30025 175647 235205 17365 30347 -227657 -39446 163755 184866 -73410
21759 23073 152185 222339 473327 -224586 -29107 -132521 -352388 267415 -199607 112608
21748 -95668 -122016 15915 -153783 -96584 32232 24057 -144525 321052 69896 -71551 -315236
21737 -315236 -102284 -207781 68847 74573 351983 138304 244612 4946 380318 -255495
21726 147508 299353 58874 -261317 228196 -272404 233964 -3869 -97769 9390 34121 38405
21715 38405 167037 -272526 71752 -3005 -325443 -90989 217208 38942 157977 161250 97920
21704 97920 11338 -161675 -348185 -159650 99572 -48815 -185690 -64496 -261521 -182753 51374
21692 -92918 -38556 -119218 220197 108933 -7564 -265375 -46581 68552 -235555 -34681 -413382
21681 -413382 -159422 -165066 106046 -180998 -584001 185312 -260196 -156951 -52112 -415398
21671 -415398 40538 -74041 46684 284627 -204011 -68133 -42041 9461 84294 -45115 61576
21659 333529 -167030 -391000 -468350 -124183 -280039 -57131 -255769 -192240 102019 -113228
21648 -84282 -437946 -33213 -99044 -23018 -242672 -157971 -60264 -237994 -17754 304958 237380
21637 237380 -8332 184496 -236583 -73735 290609 45905 -270439 -224685 51629 -249831 -184127
21626 -184127 56001 45938 -20391 -23375 60460 144975 -91989 292992 -187112 -152861 39089
21614 102143 -540292 187372 -138236 -60358 -219160 -214697 -163625 -95891 -168678 -34414 -361370
21603 -361370 103631 341538 106485 -119967 50961 38742 -100458 215138 -22356 -67402
21593 -67402 8013 -33354 -314038 -190293 12764 41405 41783 29965 133586 110712 36518 -212990
21580 -207301 234008 -4425 46770 -241523 220258 137680 -90824 -29344 -178115 106258 73599
21569 73599 68491 -315943 135376 -83401 -53730 506566 -141902 3032 -40546 -295609 -31984
21557 -226727 59481 356877 -48563 245200 -166895 -176029 -27108 -13565 -344725 -134545 -127470
21546 -127470 80707 -79894 57709 -3651 97209 83854 -9224 -69826 372065 162634 9507 -133569
21533 42806 101243 67764 -229747 -9525 95958 -233612 22111 90612 -191080 71974 -248478
21521 33011 175007 159315 -301542 165591 75235 -209668 29895 100055 -145992 -321951
21511 -321951 94196 -448778 -391621 -28458 -53678 -436020 103931 -160561 -152624 2108 -190500
21499 -181962 49032 -315605 193621 54442 -100966 92510 19295 -96347 -184129 -333632 -184724
21488 -184724 39573 -148187 -322937 -123999 56921 -104792 179475 -137804 -231947 -238292
21478 -238292 -36414 -90468 87081 -371680 2607 -104481 -93389 -50202 304327 161465 -38386
21466 -129327 -145791 -259275 195738 78296 -141649 12565 -163528 114803 -7755 -282142
21456 -282142 -115808 -210863 -83782 -81196 255733 -16514 -337454 -222594 -107233 90548 -136647
21444 -92379 120259 134780 -83945 123702 304375 229347 105570 23733 137527 -232608
21433 11529 26060 -130942 391932 211576 287561 -623 9348 -200658 -336195 100756 -380645
21421 -143322 -149281 -196926 -116222 -228508 -118970 -57226 -127481 34681 -83348 230745 -109952
21409 127560 -64377 46184 -142360 -5480 -136147 -58446 -42371 -73326 -2184 178916 26862
21397 -370021 -39751 -220400 96705 48278 110475 -145255 95916 -198518 -246 -98153 -45254
21385 -276614 222137 -126696 -121980 -129152 75134 -330448 -473366 104801 -142770 -290737
21375 -290737 12874 170711 -47096 82569 99100 -453064 6037 35331 -87853 80493 171794
21364 171794 146809 160406 119817 -155019 21040 14327 -404145 -49806 -132882 -12319 408473
21352 -298551 55532 136166 -46830 -188356 -143342 -61832 -50149 -222695 9082 -357914 -166670
21340 10665 213259 -28538 -99544 138839 -329303 26062 -154 -143623 -155455 92130 -371840
21328 516018 -52334 147123 153922 136333 -118176 395947 -209783 86914 -357533 -209388
21318 -209388 -203692 -135078 -256081 -70803 -334491 -13709 20326 -209397 -128523 49938 -104256
21306 -57015 91237 -82724 302821 8186 -133887 -130802 -44611 221376 -48196 -138762 -169483
21295 -169483 183403 149027 -91062 -74297 -337903 -144441 271792 82776 26147 -120374
21284 -88090 -108190 118816 -109793 -85120 168696 -161157 -202850 -298202 125768 -96704 30826
21272 -247008 -43127 -82004 124179 -164643 68367 42108 51055 -90685 145049 -381732 9755
21260 -26197 -180148 -230718 108008 -302433 -140503 352906 -121083 -163654 165531 -179598
21249 -78819 135538 -257707 73641 -32993 -308221 -284002 -160017 -26153 -76760 198570 -60709
21237 151319 -36730 -192509 333770 -18220 -160010 23889 -82610 91284 -210594 22235 37568
21226 37568 -314699 41781 24877 172371 238483 -186781 -93272 -104107 -210666 -130949 16418
21214 132041 -258767 16089 -341285 -102944 -94263 172973 -128701 -78999 -140567 -343113
21204 -343113 80890 -297596 16956 143393 -186603 69550 -85212 -173502 136781 -44602 -60986
21193 -60986 43106 -352157 -41443 54085 104715 -6244 29778 -211528 -312270 -93674 -99263
21182 -99263 433728 122948 -136295 -98066 -21140 -100359 -200653 344470 141875 86680
21172 86680 -14107 81414 134244 58855 -342167 -180197 -128616 -257282 -280060 -94116 -236694
21161 -236694 -195549 -66345 -151472 -135126 59499 -11345 -511703 -67871 169180 198288 -87199
21149 -2381 236706 175960 -328737 -194766 -107574 -82673 137919 78231 -69977 70650 80306
21138 80306 156076 -96798 -37318 -57386 -145412 20392 -91814 -92123 -180770 -173484 -31068 -163257
21126 -163257 -419 -75626 -142857 106841 24628 26072 128391 -89701 -286352 -12127 -68900
21115 -68900 -223847 38794 -197315 45650 1864 -212684 236646 -59516 -124813 -126467 -249032
21104 -249032 -415713 -34357 -2101 -104872 37064 -195045 144885 5031 230727 146429 144667
21093 144667 42832 -87781 -70319 256169 -324705 -438229 -20358 -107822 -139836 84809 94897
21082 94897 -114742 17743 -61473 -100315 -271263 -323288 135332 -111949 -25033 26826 152553
21071 152553 -19080 72992 133341 -7368 -373170 -56037 -301470 3508 -118486 226204 479179
21060 479179 53662 -56679 -81138 -39529 157447 156343 56475 -8100 75854 -247273 -94554
21048 56044 61171 -319732 -494778 -189728 -60812 -138069 153767 -154960 25046 83342 111237
21037 111237 74946 -217508 48685 126013 10123 181144 -284586 -32830 -41119 5693 -109288
21025 41355 -297583 -354652 -138333 12101 82333 -144090 64333 15510 -329574 81141 -5469
21013 63934 -85734 286696 -49633 -24465 54118 180830 -7203 -88352 217918 -367131 -114690
21001 -292032 -136195 168585 -31893 -38509 -210489 75612 38648 -20012 -199313 -3711 -200966
20990 -200966 -374523 72534 -124575 74974 132583 -81192 -179643 316364 -243219 69215 -129390
20978 -208877 -213833 -37095 -9183 6754 95970 -73860 -38841 -216139 -73301 8095 241432 -125283
20965 40601 173772 -9928 -96312 3252 -6832 45352 74495 -61888 -178147 -171848 -171850 -120850 -251704
20952 -251704 203223 227661 40238 398384 -8965 214334 261664 23775 -6760 285096 -55578
20940 299208 281166 112814 -418778 -17062 -83986 -105630 181331 -127433 -101026 -264051
20930 -264051 41836 -443771 77803 -231166 -51498 1646 -147679 57520 53734 -513759 111835
20918 -414122 -199695 -334692 52483 -112333 -382263 168882 157720 -120099 -29985 -257073
20908 -257073 212050 -48206 60157 45233 -212153 10589 -114189 300540 -65767 -361261
20898 -361261 24971 -217671 -23604 -113332 97918 134405 1472 -77598 -228806 144136 -212439
20886 -67203 -125380 -75122 -439643 49164 53568 -68271 -261283 136428 141154 5455 -103028
20874 -233234 32368 311274 -138544 138153 39958 -218883 -27373 -77713 -53515 -106429 -47377
20862 28575 53633 113190 50660 236440 28388 -33344 -217064 -173239 43928 106367 36508
20850 303626 169871 -114523 322516 252837 -182952 -297503 63123 1649 -151493 -121882
20840 -121882 -175343 -292371 37127 12859 138587 253019 -63229 -75764 -266025 -167884 189804
20828 -83180 128231 -135492 -3949 115475 -211301 -91099 -133875 -246854 56586 -63453 -149452
20817 -149452 101492 -76915 -68893 -45678 -53360 71011 140518 7462 -220273 -109549 -111077 35991
20804 -565790 29411 -277870 -5632 -26439 -103910 6266 -116807 -9661 34801 12959 128102
20793 128102 -69269 64099 -160914 -172026 -84697 -293778 97381 -124462 -205525 -211385 -413161
20782 -413161 -236851 -96287 80786 171507 -227521 -141030 -157860 124219 137471 -417207 -167777
20770 55364 -193157 -262280 13152 193283 -81310 -239820 -328051 -13882 75122 -413644 -86602
20758 -164949 201426 114279 113722 67655 113611 -142027 109106 39318 -312898 168631 -15844
20746 -166970 -274762 412373 45347 -43615 222562 176485 257056 183011 -243122 12835 -88345
20734 -114953 -130947 -146796 -280622 134415 75955 -297193 -58386 328589 -125639 -165040
20724 -165040 -23654 -317642 -330987 24109 172604 -229956 -253930 40564 154655 16551 28947
20713 28947 72948 106619 57219 -102393 42103 -65425 18483 335309 -260219 9898 -80039
20701 -113563 -1300 53300 147541 245000 -146308 -91160 76634 -186368 -72381 130771 -53872
20689 7556 161624 -321521 -192211 -299318 109895 140162 -225934 188822 -195776 -287717
20679 -287717 -401481 -94830 144509 -192213 98762 -174170 -1508 -253789 -52713 154139
20668 -35782 -271716 -227769 23718 -134048 29670 -219773 178445 137866 -48853 -200670 281324
20656 36941 -321912 -20822 -250920 57996 60557 -140639 123252 -276853 -138183 23619 100983
20645 100983 -411747 20353 -93870 -229453 -70150 -27222 -159994 214788 -11750 -361085
20635 -361085 301725 193626 -153626 -65212 -371496 -94152 86144 -221335 251431 -2715
20624 24298 258135 66992 -295882 -135990 -86020 3470 -194386 -3688 48424 -52362 -104697
20613 -104697 -185101 -91367 -92204 127371 -74241 34207 -152469 -257137 139064 -36873 -98834
20602 -98834 183844 -194925 101838 -8030 31335 -171107 -19158 121193 253615 26427 -210595
20590 -85478 -359369 19646 -197703 112885 114345 229368 -41331 442 -37465 35015 48180
20579 48180 62076 109991 -283291 514684 -164925 -93834 -162025 -47369 2561 -94845 -212566
20568 -212566 -79845 151207 114087 115887 206050 -111306 -10371 -67631 -280475 49957 269131
20557 269131 -315483 289156 166750 -10862 -67371 -179059 -116009 300398 -361266 -57404
20546 -263120 -118443 -219240 -50343 92315 -76057 -292131 -87270 -331710 -203136 -213018 -42829
20534 -106125 129722 182020 -219634 -246138 370750 -35458 -14756 71279 -220485 -163439 108053
20522 -97730 80309 -47859 -302512 2151 -257221 -234208 61129 -113394 -178895 -168171 -61545
20510 17571 -223751 -148421 -183784 -335034 93468 -146926 26945 209 195893 336585 -86802
20498 123051 -163217 -121129 -109188 313758 136022 -159477 125588 -153739 -182937 -150297
20488 -150297 4263 90640 -340126 17266 -62251 45464 -374754 -253698 -327869 409072 64441
20476 82168 -66917 11517 -298493 -68279 -262171 39479 230863 270590 -302277 -426613 204331
20464 -421161 -278982 -248750 79102 -19909 197243 141567 -35079 44756 -64334 -143581 -22569
20452 -13248 -33019 208323 -188760 15487 -425161 -143255 -208600 -299837 -41505 192324 231000
20441 231000 -75800 99930 84432 77321 -148932 110864 343329 -104659 -47778 -194189 -86889
20429 -91250 -34718 -370585 10347 -270790 -98335 124627 -242710 154641 -256791 59507
20418 -15706 139481 -37344 -35254 -335010 -64903 73824 -276840 -99967 -495445 -51087 -256475
20407 -256475 -92700 75497 -132685 147537 -189585 58740 -43167 16759 -437732 111532
20396 -156865 18072 -19134 65080 -162910 -74769 -8179 -62569 598 346489 285973 -70309 -72910
20384 -72910 -222073 -219251 -32122 -6396 -50928 -187635 -88988 -122861 -21495 -97760 119678
20372 -141801 -57011 -314547 -385009 -127363 -110091 -81926 3210 -99144 -58479 -174759 18946
20360 -80888 -45861 65609 375930 -13171 268786 -230137 -25029 -533230 -38514 -85268 142766
20348 -29097 178156 -113559 87256 -263844 -82212 -94199 55686 -217497 -50821 137380 69220
20337 69220 -28999 106957 -146749 266088 -41754 -111466 49940 -334372 -225236 257656
20326 -111075 280399 -245726 -429281 -111648 -70351 -154815 58826 292931 32674 -400684
20315 -92574 -171905 -541832 207410 -96765 31869 -397828 130145 4404 -131534 -93443 -223928
20304 -223928 112200 -78041 56196 189470 280405 -94262 -321528 216346 154641 -22663 251351
20292 183327 -247534 -114922 21930 -58842 13620 -224540 -265993 -646899 -82974 -141534 -196606
20281 -196606 2469 -142493 -96790 -210646 -5369 33821 -15907 156982 189406 -215840 -225014
20270 -225014 189854 153238 184842 -290303 20277 232883 -103855 -158210 -1272 -152456 -267229
20259 -267229 -55609 -274139 -119837 124311 33915 204618 -308256 -361738 3573 173320
20249 173320 -189670 -83713 10933 -50999 -68765 -97268 220089 -172365 -340867 -303507 -93907
20237 42538 -82529 -305880 -27354 -115834 -40739 -198046 148133 -118389 44806 32404 -98442
20225 -191444 -128800 -161001 -148871 -254355 146179 -309619 55918 -52787 -103368 53567 -140347
20213 87568 -207685 228700 101126 2813 -67669 -63815 157430 -231589 -2405 33658 -119539
20201 -170686 78805 -141070 -216579 204729 28684 -123339 -66799 -198664 71488 -110428
20190 119605 -176134 441408 -94632 -44812 1102 -123037 291468 -4597 93384 221952 -188235
20178 -132684 234969 6 -301324 -191723 143712 -109913 325572 -380407 66767 -85907 159
20166 336612 -22358 6255 -69428 13580 116364 -8472 -117278 4678 -11619 129576 241293
20155 241293 -345481 -174454 -45081 179217 -235246 15377 98357 216585 149646 64319
20144 -26974 207418 43838 24004 723799 269026 105889 73759 -89234 263007 -204162
20133 -70091 195135 -381320 -50427 -222427 -85214 89003 -243762 -379590 -315646 -73929 -67871
20122 -67871 -60742 222157 -94999 -188305 147979 -40509 -160109 220628 -137629 221771 -157814
20110 177657 91425 136481 -95143 82503 -465722 -423131 -184992 -61983 -212067 -48883 66784
20098 -46614 218644 30433 -51512 81562 -251863 -17265 17662 -81970 -110928 18601 280214
20087 280214 -62720 38020 178877 -200060 -73433 120181 -409941 -87003 -95854 -1282 75817
20075 -241515 -12694 159368 -267844 166335 -44181 -58242 70075 -345390 -125142 82069
20064 -206018 134944 -35356 2252 -72803 166813 -121941 -139559 2010 -37360 202452 102611
20053 102611 353563 -366413 96370 -78170 -344809 -44286 -107703 -32053 84884 -321152 205255
20041 14646 -226961 411372 -167207 42725 -176399 -19600 20490 -67735 -176834 -107271 32582
20029 -86207 -173745 -493469 -21233 199962 122795 274019 -80567 -179390 -140777 -235856 130138
20017 136349 -76644 53659 -89635 -64184 125831 74836 -199535 -30422 -283210 -35904 -29459
20006 -29459 67033 82705 23847 -207200 260277 -213734 98447 49981 215746 526882 -54683
19994 -52869 104179 220476 99988 -46202 77761 -64724 -57219 52448 143499 31731 -113991
19982 226279 382724 -57062 207187 247708 293829 -23281 -159757 -43992 -267582 -84137 43100
19970 120135 -210931 93358 36158 -257062 118905 -124979 130242 -228178 354286 36336
19959 62389 -42715 339786 19556 28368 -40224 -77730 -139011 -159945 -2630 80292 -97004 -130090
19947 -130090 100840 -115561 142684 -158094 16880 -164870 -149360 -327678 -358484 -16808
19936 208750 62699 -396125 26287 205963 31183 -614 -292890 98189 -68758 122661 -299807
19924 26809 -186613 -37217 -189461 -49286 -3812 -315501 -211244 -155719 -206452 -115716 -95 -26675
19912 -26675 106503 60899 -205092 -215655 -278669 -293351 -128996 -267628 -80051 -58247 371710
19900 -142493 12621 -19167 -317356 -22633 -35602 226270 56542 -262827 143796 207058 -111848
19888 75775 -307509 -16318 -276170 -77404 -143671 -434195 -51553 41592 -238199 192715 -154885
19876 64426 -108239 -155310 139006 81788 -30031 -33636 4775 79790 -76735 -3285 -288300 -326911
19864 -326911 -102188 -103073 -127983 146826 143104 -48577 -348142 32847 -89899 -51150 -78098
19853 -78098 37875 135530 77708 -126373 -519188 -31031 18086 196499 127709 -40720 -160401
19842 -160401 -97870 -127298 -127357 -136157 -134887 93270 102927 47146 -58324 -145460 -70697 -128022 -146064
19829 -146064 172234 -360140 94550 3188 -244955 -190316 -58907 -95581 -28802 -95154 38032
19817 138253 172944 -194531 4074 216014 80916 -257199 -56348 -13108 -266312 143139 -148346
19805 168194 234028 -66589 -83996 280435 151036 181150 58349 134291 -391006 -98208 82200
19793 95149 -205572 125099 -106332 -74224 -126804 71363 -168510 106688 -343970 364471
19782 82393 -238849 -141922 117721 4322 27174 -92402 -311516 -88175 -148310 -550031 -25033
19770 -278372 -334519 -103079 -83978 -461740 29737 -232712 -137101 -5019 285458 267105 103954
19758 -120153 63562 -190492 59069 -211496 -39061 -192698 -171816 8387 60798 110748 81820
19747 81820 89770 -50342 -46628 -74280 -257502 1648 92979 315751 -291025 -155264 38585
19735 62673 414478 -140621 -150848 -70129 -90283 192933 138188 194136 2410 268941 17382
19723 169365 9227 220333 -139706 11730 64939 -1944 8020 39198 -529273 -201037 -111477
19712 -111477 -224956 69137 29567 -84706 -116066 2519 309375 187263 84013 -189267 513089
19700 43518 -204648 95845 253713 214228 187294 10347 -73516 141480 -182216 -7881 -161063
19689 -161063 -290560 305750 -302982 87541 -168550 8392 -318492 -66231 206917 -124171
19678 -190484 -118116 -69774 44286 -97426 -246174 25816 242034 -157354 64387 -145530 106894
19666 -124285 18464 -226212 -46150 363113 32505 -212221 -10701 -118101 210113 308919
19656 308919 -252595 154431 -157466 186527 -251041 -256323 27256 412405 -245659 100440
19645 -12978 -245827 -101318 -68789 109628 -400101 -137547 -77571 -58652 -419445 -24094
19634 319432 -324636 16193 -141953 128698 -77557 -335941 42620 44000 -363268 104094
19623 -99734 -199461 192692 286878 -205441 -104539 171552 -36045 6597 107734 66822 -292917
19611 -260474 139605 -37687 -68972 -45405 -40287 -615002 162112 10505 191600 -44028 187306
19599 -181040 -53546 -238356 -209378 -404761 -93599 -330530 -58628 -175748 16458 -153581
19588 39139 -226895 -322223 49853 -59948 -322193 34328 292502 -74391 -13255 -222677 -24717
19576 79213 -121515 35603 -231881 54502 44427 137568 -105049 41658 -202678 -62395 156797
19564 -151645 151542 -148047 -238904 6428 -70149 141866 -42032 -145389 -226205 -6349 -161656
19553 -161656 -193055 -137846 -182641 -296814 -47034 -191752 -149349 -346616 -205558 324363
19542 -228982 -233306 -287134 -188014 174118 15065 -39364 53985 16493 148796 -14417 -147268
19531 -147268 -6732 -482356 -199688 275071 -268885 115989 -217326 -260813 -29728 51945
19520 -112092 -54488 -91738 144318 10337 -188338 31523 -104655 74239 -149082 -105281 -337016
19509 -337016 108704 -256771 122271 46835 -193599 -4 -135784 -134349 -38090 125571 159279
19498 159279 -176791 -143324 -74141 -403637 -76736 -48441 -303132 -62508 20084 -148200 -240208
19487 -240208 -232798 -25012 -216217 -275146 -97859 312594 -158043 92204 -47335 -56734 62210
19475 164008 -181621 -31670 -100090 -183641 44783 1433 33218 -53748 120188 -227958 -4179
19463 252575 -44462 -272514 58914 -124918 59090 173792 -31297 -167298 -48560 -30937 -116946
19452 -116946 -16069 -108429 -158281 -95355 89742 60326 -121069 -354811 -6587 -164076 -61699
19440 36737 -39360 -305321 -174515 -376809 -267973 -304879 -29736 103197 138305 91015 -121506
19428 215844 17493 -161389 -195255 -140820 -175157 -146820 282332 216664 -152999 -145696 165897
19416 -233220 -106822 60364 95129 -191749 -13062 -20775 -296042 -81678 101709 -164818 -176159
19405 -176159 235230 -178361 38274 -162459 -184270 -113298 87061 207955 -250805 -179644
19395 -179644 -22513 64573 92697 -376211 16796 27260 -397258 122722 -35810 -286122 -101380
19383 8942 -257486 184937 -943 -226438 132495 -153284 -146197 -79057 -313245 -128546 -142016
19372 -142016 124325 -34940 -213997 52148 -242413 -269059 -41082 -96670 42080 -59925 63650
19360 -221998 -360892 14389 82840 -190886 -197961 -148954 -300136 -314592 93477 -165266 30701
19348 -51094 -31972 -168733 36970 -67570 122588 -48943 64601 -329028 -70135 42731 -92590
19336 -114726 -71202 -46036 -141829 -3279 75452 -109790 66968 -171864 86267 141096 -283886
19324 -106978 -306857 70584 -150471 -314057 -49976 144330 144835 -23097 -46418 -79919 -9479
19312 -97619 24697 38001 4609 68343 -10081 -50491 16302 94940 -26145 -170899 66945 185094
19300 185094 37445 8502 60663 33616 87046 45217 -125 -329477 -202130 -43158 -63046 17710
19287 -192445 -30001 -791 4750 -546363 -26971 128196 306533 -70478 92676 -92504 202462
19275 -489437 -101521 -171728 -124646 132174 -43022 -294897 -240787 208569 -18937 239167
19264 145308 -447218 -167769 -327031 122782 -141164 175383 -316202 -386772 -161182 14778
19253 197667 1143 -35833 214260 136140 102537 -318012 -186864 -91093 -85777 -186908 -68295
19241 217908 -358089 -370490 -305558 -78149 -184643 19316 -92386 -155076 -172221 -120584 -190945
19230 -190945 141821 -90101 141624 -130850 -110330 113290 -110470 -77867 48404 58916
19220 58916 -106542 37226 87734 -143697 -161859 -343242 -149500 -140313 6773 -232652 23209
19208 -342540 202723 -3487 -383793 115196 28351 -168265 -78999 204731 -91963 95826 68178
19197 68178 -291011 117103 53687 -48182 14779 -179781 -121 -72052 -234064 12317 -168789
19185 -212248 -103216 -93637 -11492 -264460 6058 12808 99227 -169188 -67316 -216261 -12080
19173 -317321 -192282 71371 -87552 -67252 194344 -150144 -296633 -93630 -156725 217963
19162 -288169 -248279 -11911 -237338 -126586 -104693 61377 -20680 -14938 36948 -357641 50506
19150 75006 9745 80839 -123005 24403 324673 -57044 -82385 189919 -103824 -139592 90421
19138 -208280 124580 -164602 -63732 -9627 -84651 -335321 -106687 54607 155261 56769 175276
19127 175276 98638 211469 -333893 -277601 15528 -272497 -255665 -48945 -278344 -64574 29217
19115 68149 3994 234365 -227385 -207930 -276748 -49699 -73564 -158623 197101 196520 174425 -56537
19102 -246890 -36321 -242211 -277811 -209433 -176588 -35414 217991 94353 -173246 -111894 11251
19090 -124934 194038 -161455 -68334 -168851 46593 164374 -312784 116136 -192552 35483
19079 12364 -84628 69353 48801 212069 -80534 -81611 141934 -42598 -2078 18882 96062 50336
19067 50336 120605 7452 39675 -121579 -24123 43421 224934 106291 -52064 -23663 -82403
19056 -82403 -171678 -81551 -104565 -242796 -294875 92954 -102865 169348 -364358 -105484 105811
19044 -72462 -20218 -78256 -245913 -217892 314729 64283 2059 34020 305841 -263531 -44686
19032 2644 203478 -474813 -133486 -116263 -138429 -94792 -129178 179597 29298 87530 -80359
19020 9035 21168 -93110 -204014 -237894 139087 278273 35112 -186198 56562 209271 40432
19008 -51214 -16871 -83388 -36306 -271362 139181 -5625 -88942 126929 186220 -152671 83343
18996 -18256 -44551 -73960 317052 213893 18308 -27881 -189153 -137247 -41185 425178 87730
18984 115161 18902 -204281 -126625 -176283 158355 -176987 -182256 41533 226745 78229 -197994
18972 -5684 94586 166605 283061 146888 -153672 99341 -303719 -204909 -10652 112948 -296985
18960 226924 -249504 293099 -225421 -62153 -17093 -72271 46670 -151158 -102526 -92164 -78191
18949 -78191 80418 52996 33349 -78319 16113 174670 82128 75105 18791 -93350 -13252 -125876
18937 -125876 25825 -133480 56856 3547 -198063 -311873 -428457 82804 -263020 -27511 -551979
18926 -551979 -104548 -149720 -111975 -155175 -215598 -120603 -41210 9433 -36551 -66762 -88656
18915 -88656 -4399 137524 -49147 45750 43351 6115 454571 202249 241138 98222 -84842 152605
18902 123009 -45694 12775 -416013 -352551 -100754 -36174 64325 139232 -115458 -416586 -69660
18890 -113969 -126370 21116 -453900 -65948 -47261 -83424 -198413 -284386 150057 -106771 -193132
18879 -193132 -50015 26458 -242922 120637 -204127 -440727 203453 -234604 61238 33208
18869 33208 -194518 -49266 -216409 -176846 -9519 62604 67674 -418065 -63690 72990 -43820
18857 72925 -154580 116496 61097 10858 -342132 -77358 -69749 -145907 -255052 -150963 -13777
18845 44947 -142394 181597 354154 121238 91179 -79102 -227142 -117208 -134179 -257994
18835 -257994 287679 -217087 108344 -452995 -77896 -262146 -249317 51153 -369888 62109
18824 -71880 94888 -129617 331232 89171 257937 -89949 123311 -121428 -99367 -266181
18814 -266181 -56188 -2248 136905 186088 404376 33940 -298961 170856 -82347 188358 -152733
18802 27566 43093 -57283 -67520 -244592 -54862 81278 -205279 -3016 65584 -57770 472057
18790 -62834 77385 -292721 -129508 -175404 -40572 127138 7310 -133184 -14938 75805 79614
18779 79614 -339607 20904 207031 -303439 -19811 -207350 -122950 199869 -345559 -41004
18768 -317894 40869 317675 134769 344493 129581 169302 67474 175456 43912 116764
18758 116764 -206290 -160839 47467 -249189 -330496 175828 -45205 -56487 -394461 -102649
18747 -88737 -279352 -249286 -327415 235281 3505 95509 33566 309840 -230923 -197131 -270558
18736 -270558 -213657 -154078 -47236 16853 126267 -171233 -51129 -48840 -99529 38424 12886
18724 5837 -89238 11972 -66721 1675 38788 138909 -78988 -39536 -174725 284197 -133510
18712 -146961 -209206 106144 -270129 -244240 -55299 -477865 91658 85998 25750 106205 92970
18701 92970 -181556 -100932 -254385 129876 -118114 101920 -59352 -135891 -131499 -186785 -79738
18689 93302 129790 232318 58334 -99387 14802 -147642 -206370 -182275 -101598 177840 -121992
18677 -285371 -215260 -354038 -136381 -347173 205762 46976 291205 -61856 47524 -62035
18666 -442127 -46877 -185165 80095 -249099 -172798 -335028 -275550 -191800 117977 208809 -172604
18654 -31152 -279254 -92724 -129667 -385463 -80706 78073 -54958 -69848 303945 228662 -175629
18642 35671 -97329 -47434 138837 -303693 17920 74448 -27028 -90168 -47082 -287873 120299
18630 -243928 -192675 178485 -198080 90648 -327900 254265 125940 51227 86552 -321177
18619 215085 1947 -134417 102013 -163850 -60693 -257350 -118266 -238168 -118816 -43308
18608 -193689 -137959 -140412 186479 -92528 -90920 -310778 57376 -51875 119949 -30358 -122402
18597 -122402 -248118 -47047 171163 -228494 -95685 68239 -99902 135882 -253823 -214715
18587 -214715 134229 129056 -201408 470754 -92754 -44822 -130714 -188313 -73018 90334 -180334
18575 92071 -187359 -200376 -241060 37858 16761 167159 219902 132184 -137974 -27079 27745
18563 -8271 -258882 59832 -132250 57663 -343997 -143792 -398232 -19473 78831 30262 -164046
18551 -50134 88354 -38719 -11203 -62416 -403738 -1070 -49556 -53097 -85778 -408223 -32865 -86199
18539 -86199 56733 -70290 -88877 286680 42973 255227 -72698 -174915 -200 -9666 -274252
18528 -274252 168874 -367116 -216382 51966 -11704 -152641 -242003 -123116 273244 -543800
18517 102185 50597 -60452 -112459 101129 -110118 -219998 -214206 -108388 -79326 230684 -16986
18505 -122653 -157885 -15474 42570 133447 7337 30886 39431 193855 162470 -29313 -15056 41282
18492 -310926 -64736 -137718 -307 -177389 -256399 -314973 -167531 -137453 -17595 -172991 179965
18480 -330797 -7064 -151454 -154239 59620 -68780 16490 -335239 -264365 -193350 360032 3375
18468 -11500 1403 -111856 -392671 105324 -81089 -137678 4184 220504 105433 -96555 -133366
18457 -133366 165670 50972 -29894 -136658 34547 476945 130671 -238546 -6261 -222358
18447 -222358 -53005 307507 15286 123808 308787 594823 -34794 -144786 39952 -6972 -329130
18436 -329130 -213989 -10970 191876 -311886 -231502 52031 24277 -120089 -362983 -197327
18426 -197327 -47191 -82274 128760 14380 -152996 -43274 -9718 -162810 18739 -192709 -229787
18415 -229787 119729 -150706 -95714 41360 83710 96996 100296 -33131 338606 -122468 147404
18403 -59950 -57696 -83508 188219 -29974 140675 90492 -96340 -100757 21263 -24361 39624 58950
18391 58950 208144 172064 -264498 64702 -146961 115870 73480 69478 -38739 -160938 3304
18379 64712 -107563 185060 139534 5301 -471445 108694 -209829 -145796 -395015 -89995 -140250
18368 -140250 128476 316891 120945 -111629 -2990 162822 -201536 -104822 87070 105676
18358 105676 28278 -260278 20946 -222292 123788 -238793 32257 43552 150646 -145719
18347 158979 -10052 134478 -112556 -34250 69022 112666 -274345 -19938 73657 -54233 3705
18335 -260548 -205415 50036 180230 48035 186414 -76599 -279706 91031 23594 -21093 -70874
18324 -70874 -71622 130643 -116629 -166861 -252558 325747 -418141 -180784 -46909 -107843 -68891
18313 -68891 -41544 390777 -18992 -17618 167144 -266903 -168915 57051 -134556 -193371 306954
18301 -235947 465963 -270945 -250100 -388696 40843 124784 124241 -31702 -342764 52691 -160194
18289 -192159 -135496 -192620 -339681 47250 -119505 40011 9054 -28412 -148398 -111023 -335035
18278 -335035 86098 -424004 94727 20211 115015 38972 2167 167995 -437879 254738 74085
18266 -341397 213626 -170439 61650 -186171 343257 -7745 72714 200987 105662 -281347
18255 -21833 -299250 -10125 -213145 41949 -148782 -220456 113575 -153035 -319045 107839
18244 -205478 75694 -327776 -215225 -247827 94640 -322278 71469 -67154 219780 -68379 93177
18232 304387 -149554 -156804 -277792 -168470 -15927 545207 -119249 -100105 -80771 -59044 -205977
18221 -205977 -16973 -9043 -5090 24559 52655 30730 -257378 87571 -37686 147483 -21225
18209 -57609 -9285 -170481 290394 -197622 16411 -128668 351060 458292 302067 -67541
18198 -344615 98016 127596 -66357 80890 119228 157786 126752 -58618 169439 -261701 -255273
18187 -255273 -50812 87616 62447 -40014 -144351 32016 32116 -56971 -125109 -194063 -182264 -45542
18174 -308009 265693 -126349 17522 -90482 -63784 191882 -221758 79367 -227963 99478
18163 163716 -158463 -113657 -42005 -44038 -31681 290560 -154679 -84233 -38658 255636 -179990
18151 218897 -210602 58466 34355 -161443 -139981 212593 -24954 -101520 176570 -221567
18140 -312368 -69977 -9617 76066 -88955 -236582 -108277 -15919 -150760 -23548 -100368 -82663
18129 -82663 -23490 -481880 271032 288016 29444 202156 -37417 -124546 -254786 -15746 214790
18117 -6450 -218905 -83666 -115178 -22001 -61326 62541 -160899 -91488 -57996 -37673 -44645 103175
18104 -293208 208123 -199914 -305253 19830 -41574 257204 20143 -43700 66394 -119046
18093 -4494 -175663 -39031 -19327 -194845 5387 -14255 173237 -350031 -73946 -5607 -178005
18082 -178005 205900 -278809 93562 142893 -139637 62037 165058 -32388 -131641 -170118 -8321
18070 -187131 -39897 54528 -159687 -14693 -61015 269679 235299 -45977 90304 189274 -70237
18058 -129673 -68650 -48991 -6804 -99227 64253 216544 372061 -94752 -111084 46026 -84464
18046 -6320 170117 2788 -184420 -37663 -90918 -21352 -260637 -38443 -278956 50112 -135419
18034 73926 -101186 -81445 -20375 -319852 -9145 194086 -307856 31419 148116 -154273 -143086
18023 -143086 -44238 -64449 127398 -17036 132047 595472 -20424 161923 -254733 218237
18012 -196227 193016 -59296 -5708 361157 169518 221810 -98589 -79089 -82444 -181264 -176437
18001 -176437 1021 -36151 -32959 294319 -195850 -94244 -114419 -237880 3688 -7022 -215415
17990 -215415 -84484 -231648 89815 117579 -145201 -236824 -217756 295613 -125954 65920 -136382
17978 -117413 146675 19905 116524 -30064 -79497 -436644 169817 -150435 -297507 -69241
17967 -117257 176592 13718 -115753 -190200 -61318 113078 123204 -100102 32270 -362162
17956 155997 -187767 204593 -378781 -229713 -264440 -226453 -227947 222666 -75796 -80530 246045
17944 169078 79652 -260663 186496 -298853 -204212 -2944 -133696 122287 -116441 -171286
17934 -171286 58909 27990 222029 -55849 -145768 -223858 -170077 -125035 43951 -98117 151536
17922 -75149 84937 34509 193670 97050 -296366 -112167 169448 -25896 -4671 730 60122
17911 60122 209130 22561 -308399 225516 147792 1484 -277547 -180984 227066 82050 -3468
17899 -251965 -171545 55205 -335071 -54506 56271 209406 95786 -3888 40297 108042 219915
17888 219915 -199516 81969 -258846 208433 -175848 -300241 -96735 -61377 216098 302223
17878 302223 31153 -114126 187586 -231149 156912 44613 -374614 -78589 169935 92529
17868 92529 -37445 144476 14416 -98275 158878 54331 124512 -62597 63983 263727 62283
17856 128232 -15427 490506 -14339 -106535 28085 -155212 -37825 177755 181573 -215122 -285571
17845 -285571 118707 -116456 161513 -173245 -141618 181957 95313 103738 206267 -15381
17834 284554 -109507 -100116 30024 57775 -108901 32142 75825 -137833 -32795 174768 -130959
17822 -199550 509876 52413 80264 -3191 50017 -72728 -10781 -77118 -34802 -259955 107640
17810 493 1876 137552 217771 -84311 -21238 -23743 -155368 -112522 -56843 -311687 3923 96031
17798 96031 -74038 643 57988 -288784 242152 -168822 -197021 -153918 204849 182883 310917
17787 310917 -202649 131717 191087 206958 127353 -244064 18962 126107 188441 422872
17777 422872 105097 -37112 177151 -1693 -88280 -105270 -10181 200150 -46581 149098 197673
17766 197673 -19312 -280346 279736 246731 -73083 184667 -329867 126732 -147270 -185629
17756 -185629 102019 -16894 13692 139138 115830 -422256 417954 -39960 18299 -57906 173062
17744 142404 -124279 -53136 173340 -177571 118990 60294 -135991 -305228 -32516 292800
17733 -38479 -256923 -62505 12181 -213283 -7954 264771 189058 31839 -52495 235810 18713
17721 -87850 228653 424359 -38045 70081 -340351 353383 -127032 -25353 -175064 134654
17710 -270725 -117774 -146259 -54143 86618 357619 51668 369152 163352 181898 -71941 -98978
17699 -98978 -72242 317256 157490 -76488 -3499 233453 -101250 74582 -113399 255 76161
17688 76161 212753 -167618 73600 -93443 46721 297920 -226307 -130892 -138170 111890 -129250
17676 48549 115404 323278 -114116 -57620 294695 271106 88383 -48737 261757 131388 201159
17665 201159 81474 227552 -2876 -312816 18008 -28238 -119071 69146 262730 209817 42041
17653 -61958 -211014 101782 109801 116027 9630 -92611 221819 -67388 169892 -38459 -123817
17642 -123817 -227973 167757 25744 -157057 197270 98726 233371 337947 67329 289805
17632 289805 103529 -83579 9852 -35359 -25049 8195 80677 -108076 -42245 163792 183073
17621 183073 -45237 -124816 72749 -359 -117727 285961 67798 290613 120544 198880 102524
17610 102524 49497 181151 -305979 -438281 49084 167824 264689 292383 440970 -1382 -76413
17599 -76413 -174643 -264978 12007 104769 258000 53995 91275 -98186 -37010 126088 95307
17588 95307 85601 -116866 -300977 185662 22351 -144730 192014 -158311 297619 273640
17578 273640 -98823 215430 5983 -99340 -147168 4538 324899 115374 -103159 192217 -49988
17566 198537 60858 47811 98704 -141809 -93834 71852 69526 112393 -26278 50310 188343
17555 188343 80929 217872 289930 -187072 181400 115021 -162335 336885 484063 174266
17544 275335 -71670 175171 -96076 -170835 84660 100148 269860 177891 123729 107503 -96548
17532 389717 -85786 -184014 243536 -12090 309759 -188018 451398 165285 239343 392401
17522 392401 123872 327776 593346 314398 245717 220149 406254 154289 251795 224559
17512 224559 262718 15214 201964 492450 205072 207971 531550 324858 495533 369434
17502 369434 414500 103938 -46060 367109 127701 202998 180587 -59162 350243 195430
17492 195430 38651 -22176 224854 63756 181802 344246 459992 187335 37388 392085
17482 392085 203989 88889 348668 115547 301876 434883 310084 72428 393305 -97174
17471 73891 59649 346188 52239 276961 100265 281138 237080 5779 54522 233366 130303
17460 130303 6043 128226 185420 170573 262769 -47316 155429 180630 247374 467271 317132
17449 317132 270898 1128899 374994 322813 122476 417369 619215 112394 106807 293973
17439 293973 134226 356224 360415 137233 142893 274685 235796 252922 263982 110016 -274246
17427 584338 115795 -211743 262328 107080 50568 283668 110239 54522 61629 124812
17417 124812 319940 384749 66777 422590 247401 9733 154026 76034 30531 379935 194925
17406 194925 292197 173023 514790 350457 -53592 371710 -8272 117895 -232677 549145
17395 8496 -42124 179340 83127 -67803 119679 248009 573988 299841 294572 125108 82020
17384 82020 265022 -101567 430724 173480 657883 271316 2491 -29391 -23305 94295 212681
17373 212681 387226 -139831 160616 -1854 -77592 354869 172417 102268 139885 270738
17363 270738 134373 185395 234579 189834 -41157 176477 41247 33770 161123 -209803 390411
17351 388995 519773 310876 55515 366260 -12478 153187 122862 97761 96316 259086 181926
17340 181926 -48239 -2000 128185 188006 140984 255946 144171 329013 241659 -16572 327696
17328 28568 368682 97809 250710 242802 414703 -332863 246838 -80802 115951 432998
17318 432998 267780 212451 -34966 76171 144557 355839 182155 -5341 -85959 62437 -161068
17306 242608 -38898 272723 308325 17108 428646 95261 224935 375546 216762 518075
17296 518075 335884 125108 79680 147513 131221 168697 281907 22127 115103 167038 227997
17285 227997 209233 270678 201022 411057 55481 173414 129915 183184 151287 235288 350579
17274 350579 122591 359461 -2102 366217 197432 516631 526469 164968 234017 339746
17264 339746 -23222 -162505 391814 -81089 -20078 78930 122297 235575 -34838 639463 424119
17253 424119 252665 116664 356316 167444 365459 69072 220283 -109014 618438 149947
17242 37371 179211 -11245 88310 114248 158650 56982 55952 -94098 1602 250227 186237 122635
17230 122635 338804 194258 140666 424323 -47653 117340 321662 397823 156703 270171
17220 270171 94266 64220 638769 352308 308272 138576 390781 204823 393641 34508
17209 287846 60470 156820 67785 219226 178457 282799 288325 105050 32837 401921 293550
17198 293550 410145 335154 42109 675040 334841 192193 610584 -90238 437937 373213
17188 373213 -104026 70518 490709 126472 334312 651681 159470 620060 401410 295832
17178 295832 376742 48582 29113 536037 248821 630754 197098 444627 195344 285163
17168 285163 420109 163372 224599 283000 263976 116071 396180 266925 540441 156863
17157 390462 468423 375316 321333 98892 213264 210614 489751 373438 237918 217822 215655
17146 215655 66659 321905 131778 401371 297453 311839 368254 482052 650676 315817
17135 214609 168146 284343 437383 63583 301455 375084 163239 423090 40843 497787
17125 497787 199787 566686 436477 226362 630639 466409 381537 594838 409449 280698
17115 280698 256189 56421 252863 427653 380433 151712 599624 189909 316795 267414
17105 267414 592522 514990 348267 602277 352552 203721 184497 458227 417889 329133
17095 329133 221221 384489 187815 295937 777154 429482 920366 755758 248938 703639
17085 703639 455290 226121 496376 480865 397911 915479 699624 432091 683387 470626
17075 470626 783735 434537 530522 617486 395839 228075 312462 277262 493212 697543
17065 697543 312404 394757 171528 466499 320968 466743 601663 757250 349329 468668
17055 468668 829183 735054 624285 568537 488381 438299 708742 523777 836320 362169
17044 551384 312683 532946 544212 493198 1122375 658050 802803 912062 694077 494565
17034 494565 589254 534301 546784 634151 807677 663570 562784 546735 762181 865904
17024 865904 813713 716234 777654 988592 489647 888350 802496 766247 977667 826641
17014 826641 927759 1162324 656846 813055 603610 725352 943661 790820 1104261 781689
17004 781689 1017096 1300596 783709 838158 829039 728377 774914 1127071 764079 894194
16994 894194 940781 713228 979208 876812 1057659 877729 986498 899280 780496 830681
16984 830681 905911 1114616 929656 1084331 1056027 1240168 1056870 1237057 1054028 531707
16974 531707 879571 995499 1452315 1330212 1373927 1060826 1182905 1052654 1594857 1101681
16964 1101681 1166375 1125784 978306 1269599 1333234 1051451 1358703 1178713 1235062 1271991
16954 1271991 1256218 1376110 1174437 1265635 1364450 1316969 773922 1326745 1211161 1247521
16944 1247521 1614046 1390360 1414866 1663468 1056338 1138607 1405173 1448826 1451365 1598939
16934 1598939 1564558 1458346 1498916 1795872 1690325 1490001 1420198 1318722 1674946 1754042
16924 1754042 1863569 1972087 1663546 1770298 1691325 1675708 1680434 1759868 2026185 1744182
16914 1744182 2009581 2088709 1991642 1967342 1859426 2032794 1926998 2205867 1976471 1903998
16904 1903998 2210463 2243057 2133297 2387296 2064591 2171434 2330897 2250589 2182016 2425580
16894 2425580 2358670 2617342 2292572 2550116 2389452 2531008 2705722 2579334 2773991 2564605
16884 2564605 2595545 3120091 3051674 2976276 2876386 2824386 2871853 2858862 2947393 3245791 2996176
16873 2996176 3497966 3127661 3371804 3297120 3318301 3362440 3188745 3329973 3795499 3487714
16863 3487714 3689798 3789029 3858464 3555701 3733224 4054278 4009832 4075840 3927198 4298612
16853 4298612 4299374 4132230 4246744 4491362 4397407 4547374 4612243 4545188 4719742 4721836 4908478
16842 4908478 4922357 4934138 5252064 5471206 5144599 5024363 5508500 5795063 5738389 6188101
16832 6188101 5690249 6101518 6379581 6488679 6450250 6748384 6836080 6862290 6940409 7032756
16822 7032756 6893919 7368887 7446517 7401502 7682396 7944096 7771707 8128511 8381034 8614391
16812 8614391 8974931 9312036 9344752 9618440 9914305 10299354 10044823 10593147 10917623 10895736
16802 10895736 11625859 11630202 11956512 12002203 12448394 12682484 13342655 13529458 13956850 14377101
16792 14377101 14738078 15110514 15474417 16211266 16272772 17087734 17425434 18030492 18568926
16783 18568926 19267923 19916036 20283483 20895961 21677852 22717052 22886145 23884021 24679950
16774 24679950 25866954 26375679 27409466 28399859 29608962 30715465 31568061 32751086
16766 32751086 33989360 35528417 36811877 38389396 39925529 41496498 43241484 44845255
16758 44845255 46999138 49119217 51349159 53466842 55424204 58143730 60621074 63283118
16750 63283118 66313062 69122690 72027748 75613033 78408578 82410763 85631035 89173789
16742 89173789 92996823 96952650 100870726 104668216 108399403 112046630 115743892 119338323
16734 119338323 122244069 126102104 128050370 130873274 132890404 134363561 135610687 136225836
16726 136225836 136365228 136254547 135549781 134344587 132101047 130045910 127960668 125156973
16718 125156973 121878372 118647124 115138089 111502839 107736387 104024960 100256281 96641927
16710 96641927 92766110 88945208 85770080 82132532 78529116 75505411 72749030 69221112
16702 69221112 66538366 63970105 60936845 58535096 56208324 53693859 51658305 49466974
16694 49466974 47607918 45900612 43801503 42306438 40700893 39438598 37742296 36440963
16686 36440963 34814652 33594827 32268642 31383976 30279642 28893801 28181260 27500805
16678 27500805 26270310 25146847 24781035 23842753 23137388 22087622 21982429 21369004 20407389
16669 20407389 19991994 19412355 18906240 18287654 17527663 17105860 16441817 16121670 15921712
16660 15921712 15387958 14882669 14692041 14692997 13681363 13530879 12925051 12576232 12457425 12470637
16650 12470637 12151452 11635225 11540229 11415626 10679711 10481168 10255798 10182422 9780479 9508682
16640 9508682 9433582 9631235 9454611 8782291 8953912 8231095 8278699 8454207 7969218 8191468
16630 8191468 7670299 8081090 7675148 7439936 7068867 7423770 7147722 6953962 6696290
16621 6696290 6649431 6414732 6693722 6068767 6238947 6373730 5987477 5795316 5779416 5806023
16611 5806023 5595807 5459136 5338236 5567393 5296017 5332145 5018607 5079531 5130444 4862224
16601 4862224 4861216 4468218 4630019 4731534 4360881 4455828 4266383 4487536 4505533 4342819
16591 4342819 4053678 4243544 4179133 3684037 4178281 3627443 3859295 3750278 3996156 3584821
16581 3584821 3704339 3597211 3559365 3730339 3883773 3138566 3620849 3454988 3339240 3506408
16571 3506408 3163050 3099949 3332593 3195401 3156858 2977906 2986328 2958211 3104458 3136859
16561 3136859 2888208 2829997 2792949 2579093 2855074 2722646 2584799 2498008 2401603 2552402
16551 2552402 2839129 2420183 2200954 2523252 2873978 2624572 2421272 2151289 2371988
16542 2371988 2101256 2463265 2340253 2519219 2275837 2161580 2149118 2176546 2018287 2019932
16532 2019932 2302474 2332494 2207773 2154145 2240535 2210546 1942268 1754400 1970530 2007278
16522 2007278 1818401 2066115 1811853 1853469 2124030 1946744 2155742 1940777 2219887 1726620
16512 1726620 1979671 1859836 1932263 1589817 1688382 1831523 1685294 1690726 1795558 2043318
16502 2043318 1769273 1732447 1702706 1578049 1459377 1930795 1654769 1590127 1674956 1525052
16492 1525052 1399493 1775301 1594278 1619957 1452777 1459736 1335021 1575414 1602321 1384241
16482 1384241 1535731 1502476 1485948 1421842 1246584 1170184 1254541 1770156 1565145 1288624
16472 1288624 1482210 1271770 1264273 1368736 1258654 1280456 1272015 1583848 1165470 1477602
16462 1477602 1234520 1337924 1401677 1132736 927750 1237659 1292273 1057953 1181113 1163083
16452 1163083 1154387 1399645 1398809 1357020 1308676 1062211 1040748 1303673 1220629 1140786 900809
16441 900809 1175231 1066560 1316488 1202074 1265196 907147 1143970 1139313 1215499 992973
16431 992973 941696 1201215 1474608 1198110 1125626 1139533 996613 726244 915581 1050644
16421 1050644 794495 870400 1388306 722029 1009977 988027 1170756 984195 957629 1150152
16411 1150152 991851 786752 903779 955814 931476 1043281 1095453 768118 1036668 849818
16401 849818 1089634 1299756 1111734 1064639 1247123 1122176 673039 977587 759330 929260
16391 929260 1136728 847943 773633 736001 768316 983395 459437 938266 829610 1141015
16381 1141015 848516 709885 904180 860429 804342 1034749 852609 890463 826171 874258
16371 874258 530393 823960 940881 982112 1008433 879461 959166 884259 717039 726616 1032893
16360 1032893 974477 1033311 772382 703661 913393 786514 944013 608765 619652 821222
16350 821222 1264341 792643 891099 653031 428011 928187 853551 977059 953082 798814
16340 798814 855236 801904 612232 696854 925446 974056 967839 764098 524122 695363 936890
16329 936890 724404 858067 961967 893557 906697 861045 682797 745974 892413 760017
16319 760017 550463 1029731 580148 738486 599963 808355 746440 758820 815705 664816
16309 664816 591985 809013 684917 839758 517931 785927 576127 623221 662424 839786
16299 839786 1030608 887190 571980 655065 367700 728925 831302 249102 635265 603800
16289 603800 665344 705026 573844 448021 601038 769318 454197 707374 642454 474641
16279 474641 746993 512080 729449 622804 637992 493778 462643 499412 758730 653419
16269 653419 885347 402764 492061 600448 693340 573836 810517 445734 392479 516014
16259 516014 469994 936083 558802 559517 432405 574732 538862 689464 666932 352619 156268
16247 555506 507029 350173 781934 574698 494074 784252 452589 467451 595331 398773
16237 398773 542276 345672 524983 822521 634796 658973 688277 323390 532872 224317
16226 484373 566623 326369 389922 498849 554789 483838 663995 685737 472006 236164
16216 236164 471534 307147 420743 394831 719661 397790 766940 387658 798647 338227
16205 458152 470151 290182 467898 599030 397530 259384 528697 383606 216076 469302
16195 469302 452925 427307 61087 368292 154019 577870 514094 255048 222531 280023 43283
16183 275321 181511 454526 368209 281013 383875 368346 545216 -99057 597833 512699 208409
16171 101194 571977 705200 281902 414015 589448 351741 643202 611988 374510 345375
16161 345375 28072 385581 254921 690882 131862 558497 240887 620125 267652 342860
16151 342860 204425 22108 91054 468194 260723 403054 280771 236303 239232 456630
16141 456630 377766 246932 141765 -68328 271563 412761 235144 523235 184622 432662
16131 432662 173994 201383 324085 97820 241458 224030 64779 140878 196576 273505 89736
16119 73817 305462 191520 200986 152795 243315 215190 600156 200305 -95553 70463 5966
16107 316847 201484 68118 293806 185111 211633 169693 201325 198165 188797 82381 25802
16095 278678 166483 26199 97760 273331 122719 274376 115126 189702 568218 417732
16085 417732 6545 108644 257531 26364 -121355 163000 -137011 187626 -49558 70276
16074 324215 196687 57653 281453 54825 275296 366019 185405 51927 278061 -206471
16063 397809 393252 357385 -9529 184591 294413 79422 366985 135469 -140571 -68815 162439
16051 98272 212153 84479 232570 103674 140129 152776 206245 224167 25381 318877 169571
16040 169571 28114 -28512 -16809 183856 146109 46985 14767 17671 290393 -105170 239519
16028 281480 -224892 144883 -30436 117509 209092 -368805 169703 122199 189740 85163
16017 51540 -154271 1417 78927 323888 243409 -89878 104086 -196525 205005 -49503 247052
16005 123304 133045 -14013 45570 128503 827 320626 7931 -145548 158819 -133398 92454
15993 142059 -29630 157852 -26587 388976 -234713 301006 456208 579334 939421 1076797
15983 1076797 749141 715783 504317 443876 -271088 178459 152664 361160 164398 -70838
15972 335095 202363 127581 142237 271327 -413916 -124719 85235 -85647 -240683 166679
15961 399142 -95577 -139920 136571 -209951 -97018 130043 -155461 -61549 67615 -59298 -140551
15950 -140551 224267 -113031 57583 61915 -12789 423958 216141 521254 -72485 -16821 -98519
15939 -98519 216345 -13269 16837 -106163 -150862 123103 -141267 116113 42989 -96465 104843
15927 19531 170075 -46892 -204654 137790 -282812 -82607 38942 32154 -387207 -79565 139106
15915 113512 147539 -11809 -103174 -78448 -67011 146514 -397177 -326662 12150 350579 371819
15904 371819 -20756 76120 -127515 172706 14339 -139653 -22943 88922 -63307 -318021 -93312
15892 260244 106426 56740 98991 87555 15854 -245334 -92232 1010 -23548 -36331 218742
15880 117442 20513 83680 -119065 -85520 -31953 -146162 -309063 77425 -116068 23569 -210764
15868 -233622 414685 -144943 -182830 -244651 -140195 46065 138708 -277799 -203262 -234519 3287
15856 -18309 -73367 -179747 -1477 202547 -296312 202968 -61480 8424 -12896 290372 59458
15844 -107664 -86512 -256269 -194058 -315410 49839 -109111 102241 106932 135926 -270080 -171522
15833 -171522 64813 -35542 9054 -428408 -36230 152895 -127301 110872 113113 96838 -351341
15821 -107358 180662 -2182 189225 133540 -81495 7921 -125806 101428 41258 -162989 259275
15809 -147495 113272 -274837 48499 77800 -50787 191673 -162458 125547 -131055 -75399
15799 -75399 164288 39972 59211 183250 3871 -219745 76005 63484 -52550 -160213 -140127
15788 -140127 -123931 -347395 60084 276527 -89483 -283430 80655 -122681 243690 -240589
15777 -418172 -66752 -321453 235004 110299 -12677 -216887 -4475 400810 248569 128681
15767 128681 -284935 107842 -20185 257918 -308726 -87233 -103716 454049 383707 144435
15756 -242640 59418 131020 120906 -209570 -56271 -25810 -40012 -45063 -144257 -27100 194845
15744 157344 176434 -219402 -47458 -130444 54896 -304502 13728 -173125 292835 -136075
15733 -106167 -195098 320070 -13503 147551 -234625 72394 -285125 179098 -197784 -263634
15723 -263634 -66905 -76536 43128 172682 105464 28938 4944 -529307 -62279 -19733 98860
15711 146588 -20737 -314768 -27880 -215449 -111359 -30466 -5590 -107740 -203779 158955 -105435
15699 38812 -189021 -114994 59843 115695 -290692 178413 -3607 35056 63200 10664 -74945
15687 -309601 -103713 -127344 54530 119935 136853 -210047 -55882 194203 -134938 71776 105535
15676 105535 64276 -259663 -51258 46912 -198568 161182 35357 -202351 -83239 -136697 94338
15664 103159 276896 -90562 236830 -518941 102672 42077 -317103 -165315 -649790 -156548
15653 -116385 46436 -233466 -248936 -192183 98387 309872 422 -124470 66324 -89039 3140
15641 188784 101491 8055 350794 6674 192813 -173765 -35762 89331 -9304 23524 -159981
15629 -54412 -188783 173183 22732 169304 61412 -116509 110965 -125724 -129097 -17721 -298360
15618 -298360 404988 13644 -332161 -205746 -187708 -96073 -255434 -208243 -249999 180770
15607 -140885 154767 -21341 56112 -79329 19970 -162478 89486 -85504 -31854 152284 125849
15596 125849 82430 287663 -141658 39181 30850 -190697 -61266 -3154 168007 -249982 103947
15584 43737 -228576 107196 260806 132736 -168496 103586 -149209 -210726 -68907 -98358
15574 -98358 -82308 241405 -12310 -148398 168541 -96080 37543 -130063 83545 -140818 85839
15562 -263629 5044 -48631 177917 32391 -291983 -205646 241850 -61434 69870 11331 -266
15550 -48605 53047 -275832 63249 -342664 29723 -111093 145869 123823 98100 -81157 630107
15538 -184851 243898 266443 -124081 -280551 135067 -81854 279103 -12891 -167645 -137307
15528 -137307 105625 336017 -191801 -463363 -90677 46355 -32045 -271585 193737 12751
15517 -218881 2633 -23195 31236 102202 222714 199288 332647 103764 213565 312617 17743
15505 84160 233612 14432 231075 -319986 -120142 216024 273605 71312 17969 -237884
15494 57378 -313096 -77320 -32052 -214306 148492 -4764 -229099 99811 151293 -262506 -113453
15482 -29580 162219 -383418 -48952 -32777 146042 270813 -93062 17867 361652 293012 208232
15471 208232 386233 158860 -105030 -59183 -36035 170100 364505 179533 251515 -294504
15460 -183317 68670 -172949 -91281 88730 32639 -18043 -188197 63035 74522 -78498 -56250
15449 -56250 159479 -30251 221792 65103 -272732 207746 68966 110543 -84324 385003 403193
15438 403193 358182 -144715 46171 242801 143838 166206 281554 -1934 -245337 147366 609596
15427 609596 -322981 -36995 -194275 213005 -124398 178305 268091 190383 -57511 -135422
15417 -135422 -23017 -104471 100115 -231222 34331 -180592 82316 -2777 159922 97450 -17758
15405 -22111 169714 10299 -1026 80760 -113703 143353 -106495 64121 87005 21039 211254
15394 211254 160580 -41012 -45333 182131 5859 -83794 314409 134893 98126 -134302 5224
15382 -182622 76651 50341 33179 227431 -244634 -201066 16126 10998 -206180 113525 7123
15370 276440 -58126 -65445 100309 58659 -170844 345419 -44928 178600 -28557 -411762 135893
15358 22565 157396 11548 251043 238163 260951 102477 196989 -50533 272244 235426 -98279
15346 329751 -154051 -130717 -437734 197864 204239 499722 -111395 -182513 139459 -225328
15335 20327 -75870 -81393 40272 84687 128049 90734 -73741 185432 -160235 334494 114231
15323 92380 20046 -296221 -82487 187716 997 -39906 331986 210124 109998 37647 251148
15312 251148 57005 -99219 285006 -182865 238964 309351 12174 229415 -101220 -36076
15301 -12648 -285293 -191108 21166 -51102 84978 -58422 10589 -64342 31383 134047 -22622
15289 -184779 211907 -19838 99121 -276202 89456 -27589 77051 38524 80859 -439565 50256
15277 331740 -71383 -60350 208149 168737 87539 -127588 -240733 -59173 -114539 -11319 -190305
15266 -190305 175526 -56346 -78246 80116 58346 20053 -88243 -16237 -187385 8189 2613
15254 97095 216061 154605 -6786 353033 307689 867571 898377 1134614 1027767 939157 781372
15243 781372 6240 125903 666 154343 -57514 35139 -153508 -225815 -28844 -2557 40501 313822
15231 313822 135042 297253 -1388 77015 -237965 143610 -193137 -108826 -30521 -103167 116380
15219 -45822 123623 83024 320500 -154033 1308 -2716 85045 -143418 -53821 142318 203200
15208 203200 213406 147755 324088 117183 35822 -86523 -168788 274773 226455 -107165 140963
15196 -189943 11511 -146998 -33296 72525 633800 55452 -157749 142382 195421 -139966
15185 126449 1495 -114389 148771 -235705 -134264 -709991 -293137 223691 206700 -91395
15174 -60630 154166 -14670 -36583 -152938 24369 60592 221710 20816 -20446 29233 -265201
15162 287016 208867 -299153 259355 245172 210783 -41567 -71642 329620 176569 89915 23678
15150 121767 -53272 146147 282616 77165 -121510 199065 -30417 148775 430203 -215444
15139 -343999 192594 275513 -665 71897 246562 -145895 134090 102045 -251424 -128885 -80999
15128 -80999 80308 -153466 -1702 325844 218040 -104098 206707 11498 447974 212333
15117 263485 120321 9132 62132 99917 118905 166274 -103884 200456 228749 303764 93714
15105 340334 -80736 460162 158516 360070 74341 -271791 187133 63832 6131 359172
15095 359172 -123236 -11668 282435 -3931 -69642 137144 -94093 383918 -104222 14066 -123935
15083 159329 70064 -119794 137096 110038 239468 311487 50737 273109 -3711 -187785 265109
15071 353307 276458 -50910 -30101 193920 150543 204838 454530 16915 336785 -268154 -294951
15060 -294951 242284 11489 186639 243457 59036 -1653 -59160 210211 55206 70118 92423
15049 92423 263206 395653 407253 141087 94177 -42346 217036 311416 273846 -37908 113594
15037 17166 125708 475821 -76000 6226 344293 157280 85509 13185 167027 361539 570593
15026 570593 246082 178880 510563 449008 197364 79300 530289 143099 295487 -106050
15015 350405 281908 348102 258387 -168274 130230 151484 431063 155445 469006 177366
15004 466717 513141 165674 497764 153437 466787 147580 -35994 64723 11139 102655
14994 102655 203622 43010 512461 326763 -58918 129909 370092 -38159 273888 348228
14984 348228 303678 190260 126575 354716 14760 509934 396042 294241 490852 213387
14973 148916 233238 -32969 135911 335962 243430 255090 165891 385757 289033 5929 311534
14962 311534 -252 333877 222558 457705 216181 144647 24773 308730 240017 154434 214637
14951 214637 237949 112218 330109 282504 289831 47047 45875 308013 381937 276294 80719
14939 488292 277122 586515 232348 312546 556988 279706 325040 105716 158282 421248
14929 421248 636940 659000 635044 356065 698045 773385 559106 592021 455315 633175
14919 633175 649665 451243 837987 1155718 786370 778567 967164 570852 647534 376195
14909 376195 634198 441697 333399 296596 352345 382249 344806 423145 522336 320536 220634
14898 220634 453599 -116350 17476 -44008 220684 291320 596038 312862 262068 110828
14887 507752 234724 251705 400947 320031 554248 176093 494614 309638 639335 90525
14876 375621 388450 556980 473584 684684 364051 707435 677363 312956 104987 126278
14866 126278 299322 585401 384653 464858 391626 236015 265713 307283 134793 184019
14856 184019 318521 751392 527654 386792 36523 325565 592176 123289 413829 213273
14846 213273 363319 494891 229774 177257 591450 348809 354734 386142 432205 948130
14836 948130 421645 558554 603688 733745 418571 604592 578015 332493 576070 262626
14825 286764 517958 619159 211539 571644 781366 378777 427776 400578 648969 376766
14815 376766 493414 608150 699262 565244 432209 678128 357950 227402 394147 478388
14805 478388 510211 329311 613304 364835 513934 559591 389964 1006238 440308 444302
14795 444302 410210 646925 326034 392114 689043 501646 714905 757191 246913 505117
14785 505117 639552 738826 259784 804328 230396 566550 440523 818815 414362 596547
14775 596547 750271 487374 371009 624538 513264 658983 270330 827868 615560 617602
14765 617602 737421 548866 545082 644687 605335 848522 331242 616898 682682 564466
14755 564466 699885 648738 464593 457215 631014 611081 563947 723590 773346 493419 734357
14744 734357 684712 828872 661438 515639 745364 1053304 584945 870385 764059 578701
14734 578701 981275 743577 983334 902994 786030 896888 739169 694750 730994 769648
14724 769648 1046026 846439 1125801 1221417 1040196 1003654 683713 765031 1001603 933247
14714 933247 596784 988454 801461 541808 800935 711235 976257 753628 338941 813500
14704 813500 734690 839792 731153 1075401 867303 507704 877430 805063 613163 1156739
14694 1156739 1221515 1054278 901790 1148433 724383 785122 858208 592740 891034 778986
14684 778986 916954 766871 867362 1002364 691172 1188005 1027026 926959 912076 806118
14674 806118 798189 833521 1073025 939793 1108653 1175757 972159 1112213 892752 771572
14664 771572 1181291 926236 940820 757682 1066946 1042326 1118697 1096314 1080496 851831
14654 851831 973969 1001840 919465 679387 914029 881702 1073860 1020946 1020925 1172755 1242391
14643 1242391 1052671 1113718 746305 1090739 1189712 1098147 1203603 1444266 1222857 1127470
14633 1127470 915223 857852 1117873 1484118 1292626 1404539 1325523 1376085 1395672 1343010
14623 1343010 1164938 1213249 1264192 1239258 1308623 1333017 1306008 892468 1316365 1297237 1259279
14612 1259279 1328563 1389662 1237312 1600971 1471803 1515356 1466706 1483298 1495202 1397450 1422085
14601 1422085 1410114 1623001 1771623 1499845 1589049 1511060 1606892 1135071 1598011 1443015
14591 1443015 1550491 1382249 1701928 1467466 1572792 1544387 1910047 1661904 1769645 1747105
14581 1747105 1751181 1773540 2102713 1360826 2116309 2106966 1780551 1587947 2009191 1945852
14571 1945852 2016665 1911144 2239976 2093291 2327812 2010004 1971439 2337731 2182301 2396833
14561 2396833 2277690 2108071 2555362 2535512 2723030 2876674 3072268 3224341 3388922 4390224
14551 4390224 4761608 6001267 8485152 13101892 22530970 36660659 35728791 19952940
14543 19952940 8966442 4746003 3078280 2389367 2469780 1950970 1833335 1840566 1925828
14534 1925828 1946333 2122045 1978529 2225793 2063898 2328378 2467155 1952304 2219365 2287561
14524 2287561 2278129 2341812 2190997 2526494 2532681 2291121 2189603 2629688 2782364 2200943
14514 2200943 2443831 2991703 2402233 2655717 2784573 2435672 2700870 2696712 2857118 2866749
14504 2866749 2680242 2551185 2773720 2871499 2650699 3250580 2864131 3047886 2782946 3303544
14494 3303544 3216936 3008449 3598208 3207409 3347915 3155053 3356114 3497598 3372102 3432157
14484 3432157 3423476 3348734 3773153 3404373 3518042 3452855 3517640 3586309 3536436 3709978 3617919
14473 3617919 3864223 3903027 3905574 4293133 3897687 4188543 3917234 3832304 4281776 4273614
14463 4273614 4227798 4065183 4211585 4522942 4637088 4797126 4498481 4772573 4684993 4904401
14453 4904401 4920569 4733435 4766384 4763931 4815857 5242746 5100289 5192416 5384226 5791759
14443 5791759 5371922 5376551 5343439 5840742 5650803 5808266 6107278 5606138 5990335 5989249
14433 5989249 6115675 6523177 6341517 6691641 6537399 6929443 6839885 6909927 7009030 6774168
14423 6774168 7465596 7196876 7065651 7772974 7503115 7801252 8132514 8258878 8249550 8103997
14413 8103997 7837200 8332388 8206963 8437162 8456998 8583506 8750697 9409925 9190578 9187372
14403 9187372 9620642 9470873 10141174 10048745 9795517 10509798 10457431 10345647 10495755 11015371
14393 11015371 11159277 11291128 11155423 11988301 11582419 12319384 12397295 12613517 13185129
14384 13185129 12774171 13286086 13321491 13611001 13764506 14128153 14419410 14691834 14758100 15087737
14374 15087737 15528363 15890115 16411339 16376049 16908169 17368015 17509652 18024673 18227744
14365 18227744 18668686 18709067 19484013 19556795 20106971 20726578 21365233 21883670 21991454 22556385
14355 22556385 23430896 24017418 24217155 24726244 25523963 26320077 26400465 27403982 28249192
14346 28249192 28857286 29565614 30475183 31221023 32040623 33117388 33899071 34683764 35494542
14337 35494542 36521998 38144243 39045990 40389190 41473405 42882734 43727064 45554073
14329 45554073 46668344 48234752 50274498 51350723 53270387 55387725 57076226 58977800
14321 58977800 61184110 63715544 65936151 67861593 70636821 73430328 75912974 79106720
14313 79106720 82276843 85507467 89148598 92992492 96818234 100900569 105431161 110131918
14305 110131918 115291272 120786211 126043408 132256816 138505583 145423409 152449548 160208252
14297 160208252 168348186 177031197 186024465 195928092 206048466 216842827 228404461
14290 228404461 240611140 253154436 266457752 280331715 294503380 309314529 323989097
14283 323989097 339315718 354644079 369854262 384548147 398520210 411827336 423500469
14276 423500469 433972721 442362740 447636426 449428876 448275032 447006759 445075815 442379663
14268 442379663 438445896 434008066 426268729 415648683 403377593 390353122 376076116
14261 376076116 361313556 345952190 330631010 315394096 300400561 285757697 271760768
14254 271760768 258844263 246224723 233818814 222187069 210635099 200444466 190422856
14247 190422856 181171405 172407014 164063492 156649579 148938547 142269827 135640548 129549637
14239 129549637 123733143 118641195 113313720 108353605 103701626 99141882 95456116 91365480
14231 91365480 88104188 84486803 81341885 78021298 75132064 72336208 69727787 67135529
14223 67135529 64617616 62427890 60414288 58417918 56402346 54309855 52801077 50863823
14215 50863823 49698790 48125460 46772837 45049131 43756812 42180641 41252954 40025239
14207 40025239 39060336 38062710 36793585 35719330 34599769 33978814 33178710 32418853 31528242
14198 31528242 30501843 30160390 29136261 28494247 27861842 26872415 26357134 25697772 25251212
14189 25251212 24422877 24032421 23785021 23004763 22325737 21778066 21272785 20941917 20568901
14180 20568901 20030351 19662149 19327348 18707485 18639845 18347452 18019734 17404440 17081522
14171 17081522 16336121 16393219 16198683 15642964 15425769 14998722 14879984 14914162 14427342 14782294
14161 14782294 14039769 13774608 13295274 13475567 13033803 12776160 12774994 12341085 12277560 12044400
14151 12044400 11520028 11747029 11087536 11343026 10884555 10636265 10220688 10475480 10303531
14142 10303531 9957871 10077081 9846617 9861369 9306541 9307410 9110655 8819476 8988868 9012356
14132 9012356 8785192 8302549 8720290 8412749 8232821 8345429 7867784 7960422 7609371 7653618
14122 7653618 7518911 7541208 7458922 7362111 7395127 7450470 7021047 6965538 6756781 6875964
14112 6875964 6487844 6954559 6531531 6509430 6594223 6416179 5988156 5967454 6114633 6265799
14102 6265799 5777094 5689932 5629606 5603166 5563371 5424738 5480457 5346318 5287040 5416631
14092 5416631 5453331 5340802 5331540 4896817 5245125 5099847 4815395 4992165 4738394 4756228
14082 4756228 4665113 4974165 4736828 4754642 4432925 4444638 4161597 4351821 4371629 4607848
14072 4607848 4526060 4034307 3993661 3918112 3956689 4162979 3961822 3928573 4073319 4021163
14062 4021163 4082828 3712076 4114177 3842351 3938477 3761272 3452667 3663745 3745377 3362335
14052 3362335 3577334 3382881 3273835 3429451 3434261 3005883 3270802 2958332 3336041 3018303
14042 3018303 3283787 3269466 3177550 3229739 3094783 3006658 3105129 3086063 3122039 2982624 3305592
14031 3305592 2780817 2957259 2951221 2560629 2620414 2599602 2586090 2366508 2416448 2887052
14021 2887052 2773986 2417494 2592190 2642473 2539892 2342147 2411257 2357158 2278385 2199293
14011 2199293 2251522 2344542 2409689 2276041 2045499 2130117 2051301 2164567 2079638 1957739
14001 1957739 1939811 2287425 2065084 2113710 2114761 2056042 1872686 1937827 2029000 2177794 2489753
13990 2489753 3202995 4738103 7948705 15520895 30817589 36998317 24382582 13087109
13982 13087109 8148598 5825336 5037726 3858032 3525923 3420209 3226454 3108929 2611499
13973 2611499 2738367 2653122 2493259 2470143 2464158 2420762 2329940 2310043 1998299 2292544 2101487
13962 2101487 2494530 2244613 2125614 1768493 2353035 1965137 1988455 2022014 2201253 2008516
13952 2008516 2186697 1993843 1790908 2070324 2051068 1987351 2235291 1687262 1790822 1929454
13942 1929454 2003057 1653562 1514825 1583179 1593692 1549151 1846072 1785904 1560419 1532144
13932 1532144 1585828 1779663 1530979 1625928 1514215 1779006 1464509 1422707 1383429 1395613
13922 1395613 1336890 1115788 1656553 1376291 1587774 1511507 1163944 1447276 1310721 1339561
13912 1339561 1437250 1218459 1301493 1189951 1350187 1361211 1092330 1235475 1156136 1535784
13902 1535784 1450413 1067332 1347319 927643 1503606 1083045 1497108 1414652 1117776 1283795
13892 1283795 1354506 1387729 1222441 1254712 1046163 1336857 1274325 1549017 1330797 1332763
13882 1332763 1121744 1013932 1245697 801807 919644 942559 1123002 1129533 1110988 955260
13872 955260 1400212 1238521 642997 1223916 1120598 980761 982988 1243046 820409 1162661
13862 1162661 965516 1220629 1021055 882261 1324990 1083432 994288 937146 1092880 781914
13852 781914 1355565 953647 749770 927515 953615 887956 1148415 1087696 902542 907579
13842 907579 900781 1263012 852209 823100 1026852 870154 842731 1014596 733550 911970
13832 911970 677996 832331 726931 1150614 898200 917994 697756 813721 1194566 833151
13822 833151 715171 576129 1083093 1047621 1146763 996259 897974 990355 743912 1037727
13812 1037727 994661 783521 850218 516024 852396 1052766 926191 810958 902267 800465
13802 800465 882770 957168 1061807 713075 696246 714996 732740 954085 782055 683028 714221
13791 714221 609368 628849 666380 743129 754476 701735 747387 815718 753987 693026 578277
13780 578277 782281 1287185 912087 836391 888041 574333 772340 911362 622755 626234
13770 626234 735706 787219 934799 795543 475385 790587 553030 534197 841601 606440
13760 606440 998721 591249 671102 875587 378163 456333 312629 583463 458661 451360
13750 451360 637167 876950 372594 242961 792130 1031544 597934 661404 879279 559553
13740 559553 691749 643258 781926 543454 966120 888429 732403 923481 552905 614023
13730 614023 388868 471150 466770 623273 213753 245752 646788 574329 471109 488139 365943
13719 365943 617972 612460 695073 606055 397817 701789 674626 418859 546807 380913
13709 380913 968343 607068 617848 501741 589242 210746 372413 315482 601748 641117
13699 641117 580881 282980 322424 396854 388645 336619 322554 437193 296759 614390 324638
13688 324638 844862 497107 446491 663186 534807 369403 626538 338639 54298 520351
13678 520351 411676 321263 946522 711610 321210 400945 564346 309170 469394 317888
13668 317888 554825 402806 236748 496054 368943 467717 282748 680258 493249 366097
13658 366097 502111 521596 234665 684034 333062 492888 404799 557030 -45709 453572
13647 347187 319296 476104 547357 385594 440957 216790 275616 475912 467712 856765 408405
13635 364628 359402 495490 229805 288814 348587 540057 273588 257929 225208 416539 395853
13624 395853 531685 249374 386928 168801 637057 364196 736731 506233 293735 69870
13613 669875 391267 162552 363027 309929 450803 52963 598214 303586 262666 513461
13603 513461 305459 346880 42049 106864 43862 348591 290011 249412 103695 248845 533391
13592 533391 703708 491552 373371 305713 575665 278968 578316 555928 168699 443019
13582 443019 237107 250089 164383 228643 149306 439805 603243 80160 221393 319537 367304
13571 367304 746000 417274 607212 296303 486607 160261 563645 602115 525531 129633
13560 335869 254380 429254 276505 148043 550531 349634 278388 291826 348814 243123
13550 243123 207722 152786 261290 199931 -110967 188471 302427 363380 401182 293841
13540 293841 279233 389023 237191 187990 362698 409408 322832 471600 346594 245138
13530 245138 192533 87251 366343 -153966 438087 103215 128025 250920 319682 296504
13520 296504 256897 244873 -2999 174864 311457 581949 150222 246053 187026 478249 208134
13508 405175 139186 294627 392095 381056 283757 497324 201211 393592 318161 308069
13498 308069 201884 254441 232943 -16880 172229 226643 -121595 265839 322856 262146 399640
13487 399640 351952 -59064 485268 148421 187978 -27441 239127 358605 56562 255814
13477 255814 443594 663266 -62687 232951 364023 160496 217574 56678 265971 -39325
13466 -33711 421844 102454 558120 189608 165381 139922 308380 64007 81963 187350
13456 187350 300264 127621 248594 212900 324906 56095 40761 149160 145185 -46058 389268
13444 -2074 -115363 372764 192493 342082 307001 31027 134129 439434 -15074 468935
13433 192836 164366 -38950 564442 187426 126512 257267 254925 178585 69049 484669 7503
13421 68654 399942 123251 167549 70055 -35306 229129 421647 367569 355096 -74687 234284
13409 -26945 431751 282793 -38890 364825 389067 69856 160244 43203 179676 447213 252674
13398 252674 157386 164367 293160 235583 -37698 159318 486386 444197 100392 208615 -282488
13386 296143 -20072 225188 343559 -44357 215836 154380 496840 277794 210957 164656
13376 164656 14737 219902 163133 402954 190423 231183 389519 394479 326515 191978 -16295
13364 407178 537813 413243 415074 10023 276662 115438 289122 516453 186188 -68432
13353 167107 189310 454933 276584 79785 139386 103992 466665 225233 239636 191573 457832
13342 457832 224447 158190 445679 631343 375028 229711 301610 141539 407682 296193
13332 296193 243857 302607 430884 187491 149875 376958 -56003 121043 113770 277102 100062
13320 250040 611275 265689 269455 340115 126536 434920 281241 128845 629103 83000
13309 244490 3284 -12993 106297 269231 304546 133399 264206 6608 -54076 98528 244558
13298 244558 136309 -7641 279843 101445 72343 137222 46368 302580 406298 -9591 -378042
13287 -378042 50977 6273 181026 388433 128520 157767 363321 -185507 146829 447240
13277 447240 -304678 55425 -54603 228554 242385 7991 340583 441149 319147 -85516 279862
13265 139321 172709 -23245 -14118 -102136 -122273 1366 284635 -67147 -50131 323273 301228
13254 301228 23556 -42129 -225251 -124321 -291428 2431 180182 -88014 -105305 523461 359748
13243 359748 196269 201150 57661 169507 73874 168986 4165 120266 253036 -122726 444160
13231 60966 361476 73939 -7369 33729 -23 325990 294738 62859 61377 -28965 213458 -79476
13218 152356 208386 265245 -49990 31777 263900 -190157 262196 12358 -244555 168082
13207 358588 158662 317479 -200761 62530 180154 67962 -206680 276474 -108221 10395
13196 201662 169036 304790 177503 71013 162700 386472 55635 326000 -17482 20747 -129417
13184 80193 -46894 -94652 -75046 75085 254909 -201404 83490 -114596 179411 172825 358169
13173 358169 -170634 297654 217384 -5065 145462 28239 229233 11462 80323 27142 233919
13162 233919 204452 69881 437129 19475 73716 -218905 -188906 -50680 83258 -54856 14065
13150 120154 140442 400037 124470 157097 110210 187706 169328 -302090 -44484 28104 207350
13139 207350 -23984 -249241 -4997 46793 -2446 115279 20109 246454 58309 -52605 115098
13127 19977 -49760 -73123 315055 216434 136239 31977 193347 4895 349503 -38531 -20645
13116 -20645 -41348 -49336 38264 123730 190020 338172 276119 -43179 17441 -10758 378627
13104 -72232 57184 -5576 82521 157497 243268 -133361 87427 58035 75709 -54642 68030 135566
13092 135566 129829 302642 -112454 288516 196517 -106123 158098 -66853 67453 230037
13082 230037 319414 -27400 42166 202579 -73207 260543 133853 293175 412100 -3555 -117032
13071 -117032 101753 68361 20247 -56086 26378 99081 -130895 13513 -190637 -43138 6551
13059 170706 207609 7614 58137 -43661 192055 41929 -112495 199515 -49084 -18218 56400
13047 11714 121321 -97088 -32955 -62611 -129374 3011 -368622 262641 -373469 283723 -19517
13035 207453 -90568 -35360 95123 3646 149846 -407119 -46048 87347 -267260 271240 325415
13024 325415 -125993 124046 -95927 229400 371856 -231692 160721 -36649 10697 33466
13014 33466 165957 -62368 397888 -83672 138854 325726 171895 81460 -18955 54359 -152474
13002 -84692 -100485 94894 -117137 197837 -78005 144066 15616 312896 47964 -212862 39089
12990 -8548 254191 -243532 -121197 -137474 277157 247186 136095 413538 113370 3958 168272
12979 168272 -55431 301475 -83356 -363008 125876 327072 -27672 -317463 148864 -49889
12968 55767 -44246 201162 136088 473389 -135721 138206 77901 -261574 -203825 48509 -129928
12956 -97111 336131 -18415 -30059 -19871 -20783 -86748 14644 -287761 -240019 22950 217308
12945 217308 154740 237531 -301085 -254904 222641 -54209 -103572 141895 -293626 234292
12934 208287 345447 66974 111884 -171930 -69027 -232918 27076 108214 167129 -120938 -53749
12922 -156652 2289 -70735 -31514 136692 300879 164626 -215107 173940 117385 349910
12912 349910 143338 -24748 -169940 -34244 42975 79244 203414 -141288 256331 -93316
12901 200555 329693 212645 280622 179392 -61773 340129 -10460 185841 67633 247824
12891 247824 -135310 39553 -199089 -20883 183294 283951 39231 116995 34693 -144826
12880 -95238 37751 -14132 -31000 90921 -103100 133819 -102979 332930 -146116 132076
12869 273710 -72745 69052 -138515 -113313 -69758 189906 88445 53725 309670 146563 32967
12857 231869 136141 -137919 -63762 143173 -42025 -148315 -9839 -4737 35560 -93397 -34168
12845 -91893 33661 -81761 143453 -116492 149474 -4724 13053 259763 141560 17630 -378071
12833 302729 -217176 88048 -104204 -56376 -114416 -188227 -210668 -125750 -122083 -158077 137017
12821 -30597 201073 -142949 96872 -145089 32018 -222483 137826 -119533 279919 124073
12810 -72245 247846 203285 -130139 112387 -187556 231263 167100 67778 89904 -319759
12799 62299 -15915 298458 235326 28662 128533 247797 164948 158551 58588 176588 -76360
12787 -23482 -127749 -2695 60627 -54182 -418421 102007 304845 -16564 -156670 25478 -17014
12775 -126374 -231643 -79135 145240 35269 89304 -86348 299919 20266 214638 -156933
12764 216495 318404 -130237 -78813 -201301 -113152 -26280 -65839 93281 -65349 -65288 16333
12752 -169566 -93408 -87537 35708 -559129 32147 62378 50729 132644 -12884 195645 -44769
12740 -50207 -122727 -165043 298123 -81514 -91886 101844 76294 -111283 -205515 77901 159835
12729 159835 -43616 -663 -198365 -120470 -302178 -111346 -435 -161136 15628 126680 -200996
12717 -63828 -128501 -61592 263981 174859 94045 -224577 158976 435487 129888 219894 61440
12705 -9773 469706 -66632 285944 -222515 60850 -405090 -41724 -8114 36219 142769 -79847
12693 99038 -175825 53601 -26128 217656 50330 31109 38569 158779 179409 134236 94495
12682 94495 200173 -77816 159231 -15953 273156 -23100 45715 -126471 46878 167612 92749
12671 92749 195110 -263023 139778 -29031 59846 297318 82418 -43169 -15886 105786 119598
12660 119598 171469 -103042 289861 -100104 16428 -279415 -308281 -80133 71255 93222 218267
12649 218267 135650 52036 102850 36454 -79395 109573 -184405 25983 49312 -154319 -36149
12637 29884 -157279 85741 -62655 346641 -101639 49358 170356 -101330 292180 231367
12627 231367 12809 149531 73139 216400 74737 -240169 -9028 232199 2927 88157 -136057
12615 -66998 349491 -8802 180323 14999 -13877 376358 124061 -28854 -35963 30149 243104
12604 243104 352657 198640 -137034 239121 353892 173586 -197069 -36711 87724 -71782
12593 253059 66103 -110633 41732 74503 -358999 175823 146972 122670 353465 146156
12582 54681 -157434 85074 77828 154947 -49435 109621 -15243 195361 39706 -77077 222264
12570 -86516 -27292 105815 257588 116957 150710 -171716 50815 -90663 207250 103516
12559 128529 131218 -37218 123293 -24046 52305 -98781 -83137 -74748 -38611 125404 -280502
12547 77234 23997 -41025 -70748 124555 165224 9180 -79805 -48423 306269 -276427 -45262
12535 -173522 311130 124314 -307982 -114665 59023 -215825 129471 197498 -10906 -270355
12525 -270355 181279 119840 -171781 -104275 -202593 279036 -129529 194119 70137 386181
12515 386181 603693 194374 -227519 -11160 139688 481488 -13074 170437 75767 107943
12505 107943 -124374 -120245 338237 302240 -299936 -156346 -99272 -44918 -381018 293037
12494 -77072 -305595 71883 20820 53421 147976 220683 161267 -82657 76630 66853 186837
12483 186837 171016 -9593 -89729 59937 65593 30956 -250370 102357 -219288 -243082 68366
12471 -86546 -128293 -32484 29203 -216170 348321 -305597 -223753 -3031 -67570 -170578 -205322
12460 -205322 184165 -92832 -309717 155639 8438 256862 275255 432067 36985 267 30583
12449 30583 -102783 158869 377576 -175846 38916 -66942 27506 -106538 127513 90131
12439 90131 152327 50239 162334 -145908 -42872 -27370 -11401 -281372 2353 285003 -282352
12427 13911 163152 -26792 56467 128947 -105626 51153 -415038 -113374 134405 -43504 198430
12415 -316108 115938 -100152 -161850 68509 -138329 -61854 -136732 119420 -66035 386492
12404 -350517 -64086 188361 -28899 -155428 183145 168677 56855 34038 43997 86536 -140604
12392 100618 11880 -159262 42379 75492 -90958 -81524 29319 418497 -163796 11399 235485
12381 235485 160638 -76249 -192452 -132391 114347 254943 118069 -187775 29108 307082
12371 307082 265570 64628 -6382 107767 59159 79023 75273 -126842 -304654 518108 79985
12359 97270 -132849 -65121 -306340 147120 -162658 -267105 97409 -155814 -213538 70404
12348 -9405 62520 -162642 -36936 -204322 117943 215517 206710 41092 -108880 7696 -215841
12336 92800 37619 24534 233405 61237 -168088 111165 261203 -153451 265495 407649
12326 407649 160061 144284 -42191 396878 -12245 40785 -30363 309138 40458 243114 23060
12314 -22332 -48306 65167 -1502 476091 231805 -70768 -274600 244070 190512 118422 -288195
12302 138400 69225 -188102 -154044 -208264 -31552 -181343 -168392 -81717 163994 194708 104435
12291 104435 104301 281236 207078 157973 -146606 -43059 273321 -14983 396215 142249 387209
12280 387209 -151373 104890 -190647 61037 32491 197062 213384 147555 195922 42504 -49090
12268 -107034 -148044 287231 330684 61105 -178062 -76530 -31632 357846 93833 249285 -342978
12256 308697 26703 81403 323562 -104625 299763 64601 145587 41250 50972 397607 245193
12245 245193 -285871 -59748 -81813 -41469 18811 153587 -108873 61819 -120910 89051 29648
12233 -1071 -24571 -237102 133062 122458 -102377 109072 357231 201510 -2082 47165 120807
12222 120807 325669 479622 520358 205093 220704 115471 310253 444729 144861 195006
12212 195006 435390 68432 -138752 206386 33224 418077 -7008 66190 277741 265674 116974
12200 -8779 44135 229741 124777 86455 87699 230146 250656 243884 248819 175867 282828 97899
12187 278924 -77149 98119 238062 382859 204735 152273 254092 574337 -36499 240491
12176 53045 -75339 -126818 225483 247735 28625 11540 112212 295628 257492 291642 298346
12165 298346 55105 207219 141772 351969 31384 61946 -276491 27403 -11512 -19306 52073
12153 1649 -92675 73967 185309 19296 -106506 -134309 117238 -233760 -155345 -294032 170410
12141 130277 -47587 -230933 173672 34293 100571 272693 -372219 59686 246146 11938
12130 -223937 -23133 151930 115528 49689 195755 -67664 30335 -74646 134296 185191 -13742
12118 -89941 -128926 -63001 94360 -154900 -204811 -107914 -97471 -231220 96451 45798 432962
12107 432962 -29906 192026 -73990 -25667 152380 70794 -36030 -105408 136687 -194107 260627
12095 -19940 48470 80040 55006 54185 170502 268777 120396 -8209 352373 271724 94779 35169
12082 118767 37251 -152218 301067 52020 -225016 -262815 12939 261215 -95073 10902 -154704
12070 53704 -320069 149995 -161977 -33973 255671 137291 51399 -70119 543990 -51654
12059 -336214 350986 -317643 -36034 -110793 -188413 -24310 159753 -36361 32928 -28651 -21218
12048 -21218 5552 -110427 77856 -99757 51540 -79701 -209603 -102956 232805 7745 190880
12037 190880 192503 4156 225908 265556 -51677 183874 137035 82756 193929 235888 124983
12026 124983 -152925 -92130 -37793 77041 232328 -20248 125849 114730 38179 44327 -144452
12014 179392 -9033 -154712 221876 -120012 -2430 119708 -101102 258624 114781 68579
12004 68579 75425 -93964 95334 -51702 191746 141306 -346732 30566 6153 -28036 276944
11992 -135698 64002 -312893 226712 -326209 -4328 -17778 160187 -255672 -170147 -15459 -152703
11981 -152703 -127556 -17238 219493 -165951 -23534 41788 -121882 72564 -23768 62296 110745
11970 110745 -15164 116845 43926 -46712 -79565 120422 143522 29822 -69041 -163540 399770
11958 -75467 306637 -55413 -33133 -336300 -246076 -153664 -27956 -127498 67853 135338 106300
11947 106300 323026 -72467 48524 249142 -89433 -17674 328619 -174334 -57955 -260001
11937 -260001 -149714 -30583 -171875 -95960 -211606 150967 -210865 -66588 80307 206237
11927 206237 -243597 72218 -42278 86993 -35497 1572 -130316 -3244 -126919 -198090 106863
11915 -204161 148543 38872 35269 102225 56178 61793 -169300 368853 86208 62607 -103335
11903 -160831 -50784 -62573 62954 -299137 -70235 -104294 160187 27430 -108436 8990 -161696
11891 -273410 -151175 24704 -200920 -310807 209748 54946 -4416 -17221 42020 59663 93626
11880 93626 -206326 -101264 -88640 306488 -112236 -4487 -146231 15834 -289738 -177533
11870 -177533 87367 109057 21 -82578 -93228 57171 -189161 -106863 185682 241368 77153 -262414
11857 9702 -130689 -104189 -13933 1910 344750 -237629 -7887 -10096 68752 -34901 -111352 -124484
11845 -124484 143072 -42670 341999 258841 109715 -50192 114063 125950 -70624 -122308 82182
11833 -22085 -66623 104070 143505 -76914 -71516 104030 -166108 -72940 84806 82691 -235090
11821 168915 285167 -183158 -41208 41204 -202692 -140006 98720 -72937 42304 -72168 -68960
11810 -68960 95435 150841 62999 -205926 184057 2521 469202 -24599 80622 -207002 37712
11798 -231910 -126117 -212070 204416 -36199 -249049 115720 -199876 79354 -138939 -55480
11787 123391 -66330 39526 -151698 -63201 18235 -303477 122142 -62896 47397 -92826 -983
11775 245327 131771 22828 26953 -198078 209647 103497 -41339 120270 -50337 200190
11764 214828 -231023 391155 -44101 15128 -28111 172899 47178 -114720 108234 -165585
11753 -93983 61273 -8541 -273192 -145221 10829 -174729 77165 -326833 -47703 -208948 -90253
11741 -113422 -164903 211320 30920 -250905 13961 -303972 -26026 -196723 -176415 -118657 -109653
11730 -109653 -118735 279040 215663 50166 -4543 -100545 23918 12959 40171 -57754 -68019 -82763
11718 -82763 -287822 -75323 10952 60682 -80277 91993 90394 228781 -54941 100189 168139
11707 168139 192515 -99623 -37414 76993 -289203 190202 201370 -238662 -33457 294551 -93451
11695 -158948 94192 90733 -3024 -107111 348956 -130112 146635 350270 -25393 225589 79149
11683 239495 -49884 49390 192552 53052 41737 -223954 123776 63864 335381 80140 208649
11672 208649 -94175 99567 5656 211355 -81846 -32198 32136 -15934 -72580 198862 111572
11661 111572 -111092 65913 617 -213476 -91473 -80607 114622 -351 70193 1353 -51211 -3845
11648 -208402 -94154 -27324 -264470 -40138 131742 -160859 -7825 -40107 -88727 137703 -108067
11636 -81398 -5305 177168 -198660 309201 -114443 156146 348406 102448 71752 51260
11626 51260 77115 52081 -48520 361152 -295112 245640 -51174 -249586 544 225800 33212
11614 -111176 250444 -136902 20815 95604 152509 -410704 -356194 -49098 -18138 166735 -357489
11602 89852 99744 -250001 189134 -239075 -131294 133666 64342 -57164 -46068 -103147 21336
11590 -252136 128706 118443 102250 252054 159095 353803 364747 163021 23668 -88374 52800
11578 305143 258315 377580 108065 -12665 173096 115935 -34982 14950 -13858 387220 -106846
11566 202738 -163723 337776 13681 -152333 -22139 39701 119204 -45680 -35921 38923 84976
11555 84976 141303 -197330 -191213 55986 85142 -41087 -72491 -62860 114746 -169696 151984
11543 -77329 -43974 6846 77702 544750 162881 17564 -192802 38776 -180753 271009 48142
11531 51831 310245 -221212 344266 259727 241821 38454 203064 106258 -46197 216357 129631
11520 129631 369974 170986 148357 320326 -35844 139792 -45712 -129068 312625 -82239
11509 170160 -61621 178056 186846 41649 -152073 -29988 -56397 -105461 -17 53306 230081 327223
11497 327223 -38190 319024 348655 58544 -134079 -25573 -38249 -42737 -36458 221634 205993
11486 205993 -106611 275181 88343 362424 830 122090 166006 -84212 -182851 170139 45342
11474 69305 -19489 194893 105944 -11138 103276 252092 -155472 502007 3547 205631 -105386
11462 17411 282572 82844 120370 559867 347676 151165 -130994 77728 305209 128138
11451 49139 -149074 180762 247236 -46858 -192551 241565 236800 25221 -145123 -118559 -278893
11440 -278893 126283 -82464 214937 181762 5713 421287 30108 180 143374 -58314 -171433
11429 -171433 5165 434324 95059 123166 4237 16377 -45878 -14648 -27919 67665 93213 16790
11416 -58923 81709 272138 -224926 24255 -307644 26715 117005 -15874 12383 -2201 186672
11404 93589 -30547 -108251 365655 244112 130407 -36659 222135 -99731 9369 74605 38181
11393 38181 152216 -130432 45260 -228307 6773 -21291 -210727 -45768 -54145 97633 106791
11382 106791 7407 -89864 -268987 -50025 86102 74473 -154238 136592 230869 74898 123876
11371 123876 -16170 98856 -283884 46540 35869 -43708 159141 -206621 175014 186170 -196007
11359 31071 -222520 -106386 151813 -143213 -33212 -255641 -312313 -88933 225789 67693
11348 -246707 290715 136323 -295374 45270 126134 80116 28142 140135 178224 9155 -92453
11336 141229 54623 -117637 -224416 -1104 -61417 95283 -205658 -146814 415707 -56877 105545
11324 -28303 -203921 -58971 101897 98818 41898 30175 128596 32033 -240298 -41071 -161321
11313 -161321 -295464 -270580 -291294 85395 -109326 -217984 -127614 -203877 100149 246423
11303 246423 -43343 175995 -86241 183715 16274 298315 -76468 172771 -26940 138276
11292 -155482 -294630 17523 -58419 327478 -93967 -145904 -192172 9375 -30589 -222887 161035
11280 -204434 -29510 -23806 -132247 148550 -182 40802 4818 188286 -402043 -244711 91690
11268 78116 17422 -319841 -101259 -129650 -237325 -194569 -381665 154644 -60339 -137309 -237976
11257 -237976 -25672 -208987 127756 -136379 67836 64832 -31468 -359306 161692 175667 220717
11246 220717 -197467 -13115 74333 -118212 218032 44715 -24566 213303 282984 -263453
11235 74895 165967 -26113 18488 -97945 -269131 -10059 -196947 -89724 -156505 95161 332196
11224 332196 112880 -85561 89207 205560 -370389 -278997 -15231 199951 28288 26754 145656
11213 145656 -214401 -305628 223242 -58833 309042 191873 268455 -113959 -166898 -190819
11203 -190819 111 -406699 -106786 -336928 315567 -141457 121688 -245431 -5290 -9854 81914
11191 259702 44683 132936 -62372 231618 -194669 203673 -144003 -92419 -262203 -152811
11181 -152811 -198714 19113 -40195 72101 -279932 -240337 -192618 165941 -257641 -357796 -174642
11169 -93655 -22121 -292406 -93114 201797 -260013 206317 -88753 -15272 55046 -155957 -197159
11158 -197159 -336378 -320493 62748 -134039 -270628 -225132 106770 -74925 152154 132087
11148 132087 127206 35988 1198 6954 -155660 241045 -65809 176846 169800 256855 164887 -42909
11135 -135584 -7554 91685 378187 97845 -98056 101614 114885 199734 -207198 -157763 403616
11123 -4948 138595 176299 -249184 102862 -109287 141574 -12995 228163 -187333 87394
11112 245331 329467 -51313 82085 -343879 -81366 -255307 230356 9379 216177 193287 264751
11101 264751 476484 -72017 118728 -197615 -103062 169034 4482 26893 78269 -63137 176427
11089 -74033 216062 382932 70423 98114 90984 326174 -65087 141845 631729 111526 97900
11078 97900 82813 158414 72001 349349 189843 298600 371632 454752 640960 287899 122177
11066 149430 722826 754825 595025 361074 775883 514853 616213 192145 474150 407965
11056 407965 373081 595549 598485 401791 692582 606408 773495 585686 486684 565495 1026398
11045 1026398 844745 499142 446228 657039 499094 817509 660298 763810 838711 959173
11035 959173 779778 841074 654518 791555 614730 911082 569235 532914 672151 366273
11025 366273 730604 751366 614671 663315 570297 577894 675740 494526 749899 503774 445605
11014 445605 570140 724459 585301 789330 391600 838598 606140 458765 501336 617447
11004 617447 884379 780630 607720 1061594 477646 491211 676584 731934 856712 763411
10994 763411 364012 469325 437127 770884 432921 760962 684356 674196 1109660 829528
10984 829528 895494 888674 1005885 575412 1195868 1220295 1307881 1527807 1462639 1832342 1780482
10973 1780482 2180039 2584054 2566580 3026321 2944615 3147412 3149610 2573113 3007610 2468884
10963 2468884 1790253 1857260 1493051 1493915 1506380 1400913 1424060 1567126 1178175 1222949 924300
10952 924300 938252 811338 643745 1128110 630939 257937 641851 34191 286492 299184
10942 299184 158178 -179825 262973 -69685 215660 242166 204565 301617 -7773 142866 -137271
10930 -62806 105615 -116503 130762 124544 89190 296689 -2508 227096 164156 222536 -128698
10918 -10172 -44322 -315146 95844 -339105 294984 95713 -197673 -44377 -136346 67475 -56213
10906 -189062 -16549 231714 200589 114895 122793 104309 93411 -5423 -132358 -6135 93077 -160969
10893 1879 -90149 39579 -41577 178302 -45603 -212305 131150 10077 -33989 15951 -154828
10881 93309 -64311 84054 9974 193346 -134298 -99235 -143919 -233252 43314 20673 115173
10870 115173 170598 293664 -326520 49978 90987 58742 -128390 33771 228405 -38133 -54827
10859 -54827 -236056 154373 85588 50601 -89238 -4839 116475 2886 -15271 -215978 -45926
10847 -526 -392851 135458 161011 -286506 -113821 27455 -264019 135395 215010 -325838 -133796
10835 -210922 12992 139203 -20904 -81427 67526 -337038 -206465 -203397 335834 33191 9494
10823 57255 78512 239318 175745 -99359 29890 -157320 101621 -7307 -87758 -232852 -223025
10812 -223025 -134842 53012 -153887 -264034 -188873 281415 30131 -75844 25751 -124185 -24318
10800 123937 -116818 -169027 -35233 148847 -337448 367055 -133272 88762 -33813 -96992
10790 -96992 -137602 -253849 -159170 -44955 23080 -378764 -125610 135023 160237 -14516 -178046
10779 -178046 140037 -383499 204236 285187 -46714 -36527 -66963 57947 -263360 -192515 259215
10767 97020 127822 12637 -361 -73660 -182464 -59468 124150 -18518 164437 23180 135154
10756 135154 -105655 -337423 193183 40127 -83923 200870 -14553 -61183 -111114 -156727 184501
10744 20510 137353 172805 -48577 -221865 42908 -78889 -158576 -29940 -32698 -413852 370732
10732 -309418 182425 -93022 -93874 250371 -320248 -42284 162233 -357472 -5766 -221680 -268565
10721 -268565 -189533 129559 44019 30411 -128959 -196702 -279054 36830 251792 -112819 -85270
10710 -85270 5131 1452 -57876 -46119 -123686 -14835 -72152 -75998 -45911 -133859 -21140 -271180
10698 -271180 95983 -52353 -105622 -63395 -65337 -231149 239210 -94450 -53016 -150536 -98829
10687 -98829 -263722 -123916 -35582 -206820 -15928 -18439 -185183 -37557 139094 203802 -170597
10675 -91663 74148 -243625 -134720 102096 204474 -249854 -69085 -56422 -164186 47591
10664 -32026 -385732 -130100 -223003 9319 -36541 -224311 -199680 124260 170787 -423100 -40667
10652 -295735 -504688 44979 -425392 -242377 -52582 158154 -196840 138763 69433 179593
10642 179593 -23046 -159649 54732 22693 -5699 3585 156545 -95251 -128634 -74233 -318464
10631 -318464 -161816 -27624 -89386 123150 51963 30954 -62707 -72591 -8299 -147632 -2343
10619 37515 -48973 10464 28872 -292246 -39919 -205246 -8476 -107881 -385014 -285497 -31892
10607 -245103 84919 -145649 74315 -153147 -220419 153435 55072 -9042 -53009 -58455 103461
10595 -166036 -236791 87086 -89776 -41986 5630 -369144 -127306 -64630 -185233 -156049 -210634
10584 -210634 -26361 -283122 -173661 277643 87150 13163 205329 -257221 93559 60681
10574 60681 297132 242715 263253 -63683 -171780 -2825 -210933 -298117 -116425 47991 -10215
10562 -17052 35043 378465 90207 -372280 89234 -174364 -37190 37516 -43341 50946 -238005
10550 232392 102928 17040 -182352 154829 -300348 157667 -12118 -202932 -19917 -312543
10540 -312543 48418 11815 97325 -31600 -406089 293562 253095 -29138 -364830 -69123 -154269
10529 -154269 63599 -131541 165143 -143123 -389822 -153123 -276474 31889 6195 -178604
10518 -77963 62583 122365 -91836 -230583 288956 106590 8460 -50761 13179 -286625 78777
10506 15547 169130 36064 -415348 -134981 -334456 -80856 -199019 19913 75094 -408388
10495 -16985 -61809 79275 -72449 -252538 -35941 158919 54688 -214417 80651 -214102 40120
10483 -108767 507427 192809 265008 12074 91397 357070 281511 200638 -210495 233828
10472 261817 271893 -221557 -14780 -261112 130097 -156966 35138 85708 307509 -135837
10461 203272 -89737 -182749 -8019 -15770 27060 -422542 -237121 18846 272758 -225034 -26269
10449 -3173 428609 202584 34925 209948 -227389 -116400 -225726 -240100 -504832 109263
10438 -225413 -52865 53328 -287421 -173349 -124140 -218705 54054 -5192 -215977 110408 -72711
10426 70060 -69701 137619 -306893 -132980 -229806 221468 -187083 462203 -4225 -131483
10416 -131483 -10442 -173682 135531 217348 -281432 -84948 170370 -248516 -206067 -201335 40445
10404 -17369 -27660 135428 -159899 -7433 -163463 140414 23919 233809 -166023 14833 -30886
10392 -95469 255181 -1018 -50788 314853 122950 15243 -118484 12363 42827 30996 -19451
10380 74104 92311 239496 -60657 343153 -2168 179209 -85080 378096 223974 71834 291850
10369 291850 341781 263417 376343 509278 622746 619536 324945 127740 344811 238006
10359 238006 384609 403872 471676 331973 101778 488912 -80334 103331 242828 426313
10349 426313 794610 760129 524004 362740 276175 17141 400582 441517 391548 271174
10339 271174 305503 135705 74326 225074 135144 144098 -83151 -8869 26610 344614 -23395
10327 97144 -164341 58904 154306 31153 42996 83755 502078 290978 210817 363718 180636
10315 -10830 167673 200048 -192947 -141461 -304412 212932 -91110 18361 -364776 -181827
10304 -78236 -3225 204190 -163921 -27749 124415 93074 -184794 -55362 53640 -332220 -280703
10293 -280703 -254988 -119582 94307 -270755 -122369 -19223 -5502 -283850 -90992 208141 -131361
10281 -151227 195917 -174781 -137709 -10084 -74871 -35211 107790 -189694 -48834 -156907
10271 -156907 305837 -318172 -110352 213104 426245 108942 -130815 -416257 -101245 267591
10260 -88197 169873 135173 216179 -71526 235238 296573 -33146 383736 -101509 176318 -53815
10248 254362 28620 -132248 -117326 143848 -116815 245877 -245225 -138427 -127901 40281
10237 15677 -316893 33225 -45265 302387 -169643 -236627 -94852 304944 170360 -118054
10226 93766 -2774 -211545 213534 -15965 -222518 -154222 -236722 -154395 -123386 -109623 -170077
10215 -170077 231843 16043 -46992 166485 260874 -61559 142127 173849 -88405 24574 -50051
10203 -254329 122629 -53082 85496 -95421 -239626 -101027 -227870 54111 -390884 104896
10192 -95526 -161823 -32670 179063 -246434 -141287 -203114 -95563 184133 -127511 -113041 -132944
10181 -132944 -273282 204570 -158225 93365 153046 -228123 -19461 72609 -198954 -72382
10170 -93858 -402863 100160 -157269 -66343 -423253 -108163 21683 -38290 -134198 159622
10159 -14176 -407403 73313 -31436 -76213 -62605 -219320 -277913 -67081 -345864 -206488 -123626
10148 -123626 -83257 134172 -183291 167450 62048 -107797 -101823 1115 -80551 -140824 -48303
10136 -330981 150596 -257080 -131609 -216964 -35503 -202335 -304272 -114640 36616 100504
10126 100504 -316005 8483 -92379 -138392 -188253 -311 -213879 99543 -118209 24859 77155
10115 77155 -153775 -103754 -254129 -248534 -111624 -76326 271871 108735 -89344 126321 -128269
10103 -101157 35953 -228837 -334274 119963 -17103 -59744 -258295 40819 -108718 -181302
10093 -181302 -31784 158222 -498945 -148744 114464 76816 -184648 86683 244452 -104103
10082 -70557 60298 -306066 -199862 94810 -24219 -55556 -4797 -173017 -69820 -295572 -167433
10071 -167433 -3312 337362 134435 -55906 34829 103485 -137773 34615 -60210 -158294 223901
10059 256400 77300 52213 -118250 44917 72008 -302325 -42011 148164 -175804 -306281
10049 -306281 302551 189609 126780 -72473 2991 316214 -186477 -22464 -208810 -319628
10039 -319628 36639 -216140 -190463 -74217 42399 32228 164395 147687 109136 119052 -18737
10027 345124 34462 -48767 -156821 -259557 307525 -104024 -48729 -246306 -118638 -166653
10017 -166653 -141502 -170478 156875 -73276 87387 -98976 -55305 -143051 -583864 241448 -101989
10005 170576 -26196 -45597 -241387 80779 -436672 42453 -306808 -287310 39758 3341 -78831
9993 38810 52752 -184817 -399574 -208813 -10984 35487 -467550 -36917 -91809 -33983 -120159
9982 -120159 -165150 -139021 -190621 112651 -34122 -276914 235787 117268 3788 -259270 -103953
9970 275613 -339331 -11437 253014 -175960 -89544 176175 -250709 61110 -273803 -1377 -150194
9959 -150194 148824 237324 399150 -368463 17312 -94837 -154731 -6056 -402428 -24983 64689
9947 -22142 -72599 51460 -179124 -213516 2699 -186525 -218731 -353126 -21850 73310 -87683
9935 -129217 -246548 119097 75056 -37000 -201109 82714 -149069 -19216 -159928 -33869 -38818
9924 -38818 -156602 -192454 20061 -95099 143747 103757 127016 -169497 -89754 291541 45507
9912 -64568 -53736 -235482 -164299 -50047 -52812 174620 27016 -181864 2276 -199805 -100199
9901 -100199 -296783 -18805 -235400 -421130 296850 51281 -43465 183260 -66906 230812
9890 -36939 -237921 86269 64924 -144414 12252 -12103 229967 -224291 -189183 347452 81364
9878 -133707 -277122 -69748 -226586 -224298 -158448 26496 275083 -294401 -138132 313098 -94671
9866 42317 -143323 98333 252294 200130 150293 61581 -309296 -9107 123047 196216 213057
9855 213057 -64472 -32276 196388 -209236 14089 45063 -47248 44743 103716 -83685 -150980
9844 -150980 -181334 38577 -479288 -253844 -178634 -29645 81032 -225065 174310 -23813 144666
9832 -37464 35077 -17360 -323300 -198119 260354 -124729 -270699 -104285 -155706 46777 -281284
9820 50228 121971 -133586 -571842 71618 -395369 166834 -205591 112456 155238 -226195
9809 -60642 18901 -10217 -245069 -207640 -115251 -150518 -23057 279527 -147176 -319452 66815
9797 -245829 -92846 -193787 -240689 277818 322525 -425920 68666 -91504 197192 131162 228987
9786 228987 -86175 -223788 27727 245785 -376362 179980 -98732 195172 103387 -186761
9775 132480 -18308 -606755 14842 -301515 -221361 -152749 -80155 -270043 -325517 -744 -147624
9764 -147624 -94444 -126956 -274735 -12316 -230744 -379522 -67768 -216723 -91435 -330732 -291742
9753 -291742 -16684 22987 34923 6375 -4539 -191974 -137283 -105726 -70493 198226 -320543
9741 194082 176909 -101750 -201517 10988 -308062 235172 115841 -245517 -156644 122556
9730 -336554 -123465 -14669 -170109 174951 146869 -291330 67459 64210 -198578 -55234 4092
9718 288344 -140276 -177227 -142893 -42936 -127353 113042 -26491 -197008 9767 41940 203822
9707 203822 -330976 -30605 151275 -151110 -37518 -175529 123066 -78065 -101787 -351637
9697 -351637 103649 -109418 46211 70819 -7304 153484 -296507 -150034 214741 -84754 140134
9685 140658 130067 -18724 130578 -198344 -13277 -91464 -62610 65044 -56227 60469 109032
9674 109032 -38278 152776 -152425 -143601 -103349 -478206 46003 -367083 -150310 153467 -29099
9662 114446 -129648 -19062 55097 -90675 82017 -262462 -325370 121917 -141663 -194087 -161443
9651 -161443 -178755 -136005 -119005 100494 -109379 22168 17625 124797 44003 194422 -95701
9639 29650 212092 -7173 -87199 14828 11787 -442804 181051 -43991 -289168 57021 -28358
9627 6762 176859 -193313 -156156 -170424 90661 -114788 74192 1185 -145923 -110467 -213910
9616 -213910 -75176 -113572 -222769 159710 106443 207493 126249 -131339 -114836 29941 -50469
9604 326145 27429 79457 -77006 125721 -198821 -31479 124090 -8902 31381 -307455 293328
9592 195602 43469 -177125 -390804 -186359 217153 15671 -167725 -185680 -62009 -140689 -80197
9581 -80197 -248152 -319845 -105362 -189877 -106789 -175537 -69349 17398 -414158 -47650 -383059
9570 -383059 -44893 -175908 189475 -400747 165664 -213432 68676 172078 -123347 3009
9559 -245182 106070 104284 130141 -168322 254342 -495213 100411 1301 -16808 -6012 75243
9547 92534 -88450 28310 -69014 37442 122244 -75178 186083 -92111 -199758 41706 -32562
9535 200014 178694 88951 -31021 -250119 300476 -31414 2983 71773 -410895 255895 -111839
9523 119345 -135431 -108973 -674589 -100868 -373250 -101967 210987 -136480 198446 -49388
9512 -101010 99480 85148 59078 -331339 59297 -61551 -76352 -184240 -69541 38453 -95883
9500 -299789 -257546 -508016 -73330 -53187 -146281 77571 -165308 -32257 -265469 -51891 23605
9488 -34847 60217 -271971 57556 -87940 -158464 -98928 -92724 -237773 26189 -345748 -64695
9476 4307 -105942 -118831 -73718 -81142 -193143 49383 -50034 -88202 -100129 163514 -181625
9464 170149 -92070 -86917 -86278 -93156 -72698 60796 -233469 2007 172937 164169 48444 183519
9452 183519 -60960 15164 -7514 -179083 -249549 -214938 242623 -251510 -116221 49172 -133790
9440 -60651 -159902 208580 -12472 174099 -72560 -50957 50994 -657938 50386 -25424 109827
9428 171724 -8938 -131914 152379 -176752 91654 -127096 -48319 123064 -126414 -150505 35963
9416 -125841 -225381 -52746 25627 127360 -303844 30316 122751 -111079 -256465 -170161 144778
9404 86661 -273484 171527 -42154 -55399 91667 -17148 -123489 -85909 -59038 -64565 49901
9392 -89154 172377 -78797 -292273 -59568 280708 44851 -266211 -44278 -26699 414067 7708
9380 -204072 -385444 138188 -100705 -280595 -46942 -319571 -172177 -299299 -218990 123269
9369 129135 57979 -103961 56771 34714 30645 -293593 -136759 99328 357783 -151629 -219326
9358 -219326 -50380 -273283 -205830 -41131 -273994 -313153 -132393 -161501 -231668 -63214 -176561
9347 -176561 -209591 332827 -316599 -72675 19351 -245658 -19462 -8107 -261348 -208031 189453
9335 -85219 71314 -92447 -52562 99201 -8431 -178406 8887 -232744 60067 285829 -108702
9323 -247355 -235181 -321541 -192073 -204759 132847 69077 64862 -73565 -212611 159412 -221175
9311 -253482 -141852 66055 169682 158804 2033 -17045 -9325 154796 102925 -36933 6097 36378
9299 36378 35971 926 -236003 58130 -225809 -72702 -200393 -56439 -8143 -49425 58160 -18905
9286 70303 -128774 -392502 173725 119848 -186825 -214474 -173225 -30116 33247 57906 -184486
9274 88829 155396 112952 -350020 -445526 69306 -20255 33228 77696 -183731 -380505 -64656
9262 36451 68703 -202520 -94726 43319 63430 -147371 110320 261714 68141 59767 116438
9251 116438 116720 -208638 -179854 12215 -279841 380982 57246 28301 63455 96006 -34493
9239 -154681 -6950 266017 -169172 -56074 -97086 160403 -96317 -51674 -11232 -313415 59950
9227 -33577 -228540 416949 -244604 260008 -81296 -109242 46331 178966 -93430 -62037 239812
9215 -344562 18020 -252900 43340 -260084 -206116 -220173 162479 -207991 -97301 156680 47932
9203 31961 -327119 93067 -22400 63070 -267864 -42463 15522 -162527 -211072 -130220 -145424
9192 -145424 -66868 -75103 -122731 -453528 473521 -275899 -92012 -62785 -18768 26315 62751
9181 62751 -14503 -36877 -253814 -369171 -84675 -19742 -226312 269348 -45673 -333738 -205307
9170 -205307 160845 -166826 244328 -301425 -284672 -344650 -32737 164492 -75908 -243595
9160 -243595 183064 -203461 -40173 -16968 220863 91548 -252200 -85040 73711 9494 -91731
9148 -121688 -200208 200340 196171 -120415 184287 -468805 -243233 -250397 -148010 -267758 161910
9136 -12427 411415 43658 200515 -39018 -372831 78335 -28709 -31443 -109579 -205191 138600
9124 -80175 43802 309981 -291538 -138993 -214202 -135471 -284213 56324 -170793 158509 55285
9112 -313 183059 -137592 227474 -144557 -171613 -63906 -184209 165521 164700 -179378 117811
9100 1373 -33999 102627 26977 -239070 163711 -138649 305036 13184 -12708 -249640 -198156
9089 -198156 -267297 251075 -144023 -196478 -163534 -99899 -229361 172831 34592 -225424 -74695
9077 -155715 -167507 1718 -121588 -79093 -28765 -94968 -203462 -278739 82918 201205 251838
9066 251838 -59456 -181720 143912 -6519 -34569 -141780 95779 -69415 236746 105586 310159
9055 310159 -83179 -75476 -64200 -24247 -119356 158741 -182639 71312 -67182 -118870 26455
9043 14629 -215049 -173963 86351 64958 148784 -97815 -13159 -36696 -110030 120158 -111244
9031 -19451 55356 -51388 171806 -38774 86351 21866 46623 -5577 -391962 4597 -123717 -107778
9019 -107778 123641 -98121 -262858 -16623 -58111 25912 -166521 -96329 -257581 -88863 -53426
9008 -53426 561550 15787 -47644 -93688 41346 32302 439992 -25145 35762 -51275 -65195 -238269
8996 -238269 -252412 -285754 -93168 -227669 25620 -333854 -61783 -301509 -238514 -118690 -20830
8984 -54910 66202 207190 -167551 -20683 -332119 -297174 -193354 71637 54865 -156989 -140873
8973 -140873 -14831 93308 -164653 -148185 28942 -2112 190404 -233026 43779 103535 179814
8962 179814 -136000 -109216 -52359 -25992 5280 -176449 -23121 -17825 -102425 -488316 -100431
8950 -66903 3652 -79360 48622 61538 -57097 145745 -111138 167758 -272605 -324141 -20984
8938 -128773 -85654 -6302 36282 80309 99807 -20428 105696 -196779 -57240 -213604 -319755
8927 -319755 -24080 -145344 -157897 78687 379650 191612 685414 2046929 442792 336596
8917 336596 -178362 -58762 50804 -155262 -417396 172648 51867 179850 -163778 -16706
8906 -41024 -205241 -87864 72706 114679 106217 -277741 -160677 -193104 -1505 164212 -279709
8894 -193309 -217669 383399 219691 -31488 -82256 -120602 -100656 -6314 -150300 -104709 -80427
8883 -80427 141257 91203 141559 44978 -236839 37365 -123359 -625327 -417804 -159494 249920
8871 -135524 117685 270823 89895 -40193 129940 -5494 -50148 57544 -48862 -96784 148766
8859 -161276 106164 -204050 65035 -79493 104726 -296926 -267253 116043 -108671 -204896
8849 -204896 -96045 -17417 -405681 -43607 12246 -133569 -191838 147997 -264815 -48665 95812
8837 -122382 -137419 -29988 131107 -133423 22814 -235430 154801 -132905 157939 64915
8826 15176 115483 -201673 -301026 -74264 -67098 -42054 -117196 24102 -6942 -89324 -163224 -244016
8814 -244016 -208338 400994 -296107 -160662 -47871 252046 365571 -31126 175587 243386
8804 243386 -35389 37983 -104280 71838 5469 -276101 -175895 123455 -112928 199202 -3534
8792 227940 3120 -3412 -114114 -373685 3237 -265869 -261404 128741 -95607 349593 -347021
8780 335183 -80458 124161 -122158 -81447 -253915 -188094 -7145 33016 36211 18551 -189204
8768 -261604 227728 29057 3731 -57695 114639 30491 -177662 44191 -91344 -149479 32984
8756 20197 199753 -145632 -105600 -110302 -47198 693 -78669 65418 2763 -85015 -120404 36197
8743 -318775 -124164 89441 -31360 -14062 -75468 -53306 191753 -153070 -20269 -264379 114919
8731 87805 -78809 66949 -84802 -82771 11700 -116160 -174097 220823 -199205 -97197 55260
8719 -101184 -220173 -27014 -259547 -201756 -103737 203926 -74378 149142 9373 -33037 101869
8707 -154521 47787 -145879 -315479 70298 107346 -108644 -16214 68611 -124898 -322519 58437
8695 -47669 -58077 -13479 329970 176562 140430 -16734 50969 145757 65644 -71849 144959
8683 -196422 106973 -318594 -239332 501027 -75804 98948 -248119 -9580 -98621 34147 -22615
8671 132508 -66769 -69394 20130 178283 -236646 157009 -257632 -236598 -44058 -243326 -103147
8659 -161702 48747 -175920 -564366 54651 -340063 -192303 175753 -27145 -254329 -46324
8648 13681 45095 -189340 -172437 -6524 190173 105385 -21224 -123537 42087 -121147 444 46353
8636 46353 -115145 124233 37386 -141646 -126690 -152623 -198967 17473 -204873 111479 66322
8625 66322 -66864 -161917 61813 -73927 179728 -32847 -302260 -9607 -415370 96456 19769
8613 -40320 -285512 -175353 -370900 -73455 60668 -126177 -36154 68298 -190709 49565 16355
8601 -491896 -60759 -313078 -175485 156257 42641 28538 165650 129746 48511 -134958 35157
8589 -338065 266412 -301810 190299 177698 -231845 -201404 -63773 -342716 11635 7490 221992
8578 221992 -212279 53200 -32581 24131 -52316 96928 -51224 -230687 -212498 142303 35644
8566 -202928 -278748 180399 -76116 136017 -44900 159279 -281145 157761 -81434 188693
8555 -308894 -103523 123488 130746 -144176 235548 23846 -339843 -278634 -539874 174380
8544 26824 -31214 -113828 -117427 -149148 -38359 -37568 -90910 129725 144754 -37534 170186 19951
8531 92343 36380 188174 -186682 206932 -351991 61930 112912 -27506 -65473 920 -132976
8519 -249620 169974 -220218 154704 -243628 -246894 3003 2215 -319938 -7620 165426 -273585
8507 -285754 -191764 -10538 -93882 -149843 125212 53656 -317340 -48976 -124275 207950 -89345
8495 -17990 -91437 107429 -350977 -256764 10016 -106796 105024 -264389 -133273 -115722 170919
8483 -32924 -225437 -279839 57178 188773 134025 272038 13995 6354 -84848 51293 -327074
8471 248 -325996 -177793 -80856 135269 9164 -245255 -96263 19850 -161578 34765 29479 165239
8459 165239 73241 232720 14710 316062 -12945 -306986 -217012 -142538 60798 -90288 155860
8447 113740 -52047 -94000 21016 -18789 171898 -172482 142719 32388 -148412 -115996 -18240
8435 -372440 -134634 -276599 297568 41823 -88891 -406240 122573 8157 32586 56460 -138660
8423 149065 -135039 32435 19010 43994 -294816 174015 172660 -156418 -37416 143183 113611
8412 113611 -206613 270861 -163831 -117629 -102025 172652 -388777 -139467 -293275 -87365
8401 346364 -54888 83604 -123891 -214015 -108288 182740 -91698 -201958 14854 -164739 -358284
8390 -358284 22542 -247042 -270170 292422 58194 141525 100743 48137 -2071 -32337 92393
8378 -236218 412020 271125 50799 10088 -7411 389391 305 -36619 53298 -77109 18732 -18711
8365 40981 -318262 99536 135684 150106 -215802 146486 112671 -51956 261339 10003 -48041
8353 91324 -219825 145769 -233214 -142377 -87652 -129855 38983 46782 99163 -285457 -183739
8342 -183739 -173679 -32604 -343264 -141530 -550751 -178452 -29376 252790 166348 48063 127236
8331 127236 -241033 -124137 36029 28688 118293 -233645 -206970 55113 35005 -272571 -70870
8319 -208803 -20506 -272439 164174 -287852 211066 -305661 -287760 -88160 83497 136746 -135501
8307 151538 310222 -98893 128746 -157362 -208831 185921 139054 -47966 118207 -200652
8296 -110490 -207693 64184 -128981 -8266 -24683 13637 -275717 -75458 -3996 24143 -64932 -5803
8283 -103202 296951 304 88106 -26922 51875 305656 -338861 33682 2164 129108 -128780
8271 55004 -159772 -192229 -183083 98499 5193 -345694 -387189 -306532 -159942 71825 105343 -296723
8258 -95138 -388037 86100 -362469 -182471 -66885 174489 97674 -52013 -137111 -162559 -142870
8247 -142870 -161952 43753 -258464 -184713 129762 -164500 -34038 4153 -160559 -144013 -11549
8235 -36908 15501 156246 -443722 66648 294495 -115968 98906 234884 -260300 16696 -130902
8223 47289 -182874 130957 -283860 94786 -54161 197825 4190 -127448 -131269 111575 -111729
8211 -352615 9435 18335 -150251 122003 120283 -169605 -62782 -18565 15300 -290192 113672
8199 -31742 -38793 -92667 29125 188077 265492 -39117 -377219 -75861 -217099 -80420 51998
8187 91658 -227799 -21471 35292 -140619 126710 -5652 18932 141689 -66867 -108147 -68262
8176 -68262 28076 -243442 180808 -149771 101469 1640 58670 -536783 -2846 187090 -210841
8164 -34938 -291753 219190 -7371 55403 -25925 75950 154639 30777 -89950 -57689 123947
8152 -203950 193138 -269575 233638 -72894 95640 77139 102506 -119190 39290 -83367 9387
8140 -112676 40323 -223443 323819 -120923 59443 -40977 22275 -39100 69024 2818 -8476
8128 163679 3892 84224 69714 517462 -67206 -44394 -85746 66303 218424 117241 -57214
8116 -305079 -257719 228067 -492474 34175 -324872 -525442 234912 -456826 54988 295405
8106 295405 -118110 40527 -10125 416935 -94954 -135455 -80264 -57690 -54301 -222653 -142224
8095 -142224 -251135 120012 41670 67272 359235 229176 -98868 -101487 -22817 -286747 74517
8083 92309 42464 -177753 207412 -49729 -105342 13987 -230174 -22638 -94417 -179303 188088
8071 -289709 58246 156000 -248888 313165 114411 32522 144845 -18758 109917 -116701
8060 -26959 204113 -40054 -22056 -201970 -131288 19499 92267 65205 212361 -24016 -196475
8049 -196475 -228140 -3396 97667 -263652 58188 -62519 -209053 -253175 10199 -172760 -81570
8037 -93479 -135384 -244068 -173595 159680 -213989 -10238 -421262 -147410 70058 -78817 185298
8025 35570 -301568 34415 94550 31870 100324 56194 246445 -87749 -250496 -207875 -14345
8013 49162 -29255 -39606 148096 -169162 -227396 -170535 -344580 73251 -133459 211121 210465
8002 210465 -9503 -112511 -40388 36399 -266450 -250640 -101207 -53157 34605 -255331 -252537
7991 -252537 64671 132932 54086 1258 -48132 -343424 -325482 -273429 214985 77580 23136
7979 -184957 49960 -114500 -146748 -179742 -56711 -148172 19500 -277987 -108011 80987 -202062
7967 24702 21539 154233 -159190 87696 510455 -214615 -80994 -22063 -117279 -14119 -19094
7956 -19094 145220 148621 -183856 83800 -196964 50445 207412 -326164 87555 -71647 -148632
7945 -148632 136182 12378 -33492 45507 -264259 -91702 -158582 104326 -72654 -150081 -143071
7934 -143071 -201421 -153373 -138308 38331 -296365 -23848 11218 80753 -152161 72150 -209115
7922 212686 -291356 31768 -170473 292696 215869 -210266 62939 -81810 -19263 -106411 -91523
7911 -91523 -292881 -148365 153162 -207280 -34620 -44768 -37098 -282054 124847 -277850 11190
7899 -13079 -142137 304515 -20809 -258873 -52732 75524 -129540 -348691 31303 192990 -58119
7887 -204543 30591 121673 182297 -47175 -112893 73093 77456 -49566 -140732 -194665 75546 253785
7875 253785 111834 71628 -78132 9391 27959 -22554 -41942 -37154 174872 -218975 -115191
7864 -115191 221577 83359 -25273 -175864 -4611 -46536 66812 87496 -257626 220094 125228
7853 125228 14782 88750 -102485 -46705 26493 84850 165699 -79433 1264 6737 274473 58466
7840 59130 -308787 -287691 214741 -234138 61595 -125974 95565 132485 132572 56267 55693 -169339
7827 -277429 -85897 97981 -279366 85784 -84274 -108160 -48424 -199286 133062 -243554 -4876
7815 -279919 -73929 -96608 -194091 -16390 30289 -112068 394892 275110 339934 168553 -116218
7803 82058 -17277 -109380 116627 59072 -309846 -64677 -21270 -218574 -171095 -63954 -39577
7792 -39577 -103762 -362253 -118053 330755 185037 112795 -138643 -240242 -8234 -81848 42592
7780 42080 -322573 36373 -195900 259643 199034 52458 29716 110235 -149160 186281 -344114
7768 -274231 -103546 58749 4846 -356105 -57487 32144 -29940 -95604 -272461 -114604 87822
7756 -171344 -75476 180625 -100234 13676 -271907 274559 -332305 263157 -326784 -80815
7745 4964 -39264 -205508 -161144 98630 99980 -226613 253066 -53599 -200802 15979 -133417
7733 -430587 -156044 130384 -215250 -55524 -217819 16132 239446 2555 154675 324564
7723 324564 284376 -103552 233550 36874 -46892 -128422 149556 -19989 35302 -152278 -436354
7712 -436354 -190464 169460 -30546 154401 28454 199901 -22608 -112477 -37157 -9031 281115
7700 35193 -73767 -165680 177858 142473 31036 69421 -202857 345463 47708 50752 53107 -350044
7687 -48396 38748 -44579 192556 1559 298626 -45286 -250451 -84379 58956 195044 -375597
7675 -177063 109684 -12587 33547 131908 -36747 -219924 82415 144504 -189088 -541486 -2489
7663 -61185 111618 50425 -158106 22171 178703 442 -134951 324521 160938 -134378 -53341
7651 219553 158963 31439 268858 -226823 -47439 254328 8582 -114357 19159 86725 -41209
7639 46304 -16437 110741 -197080 -233119 13036 -314112 -193694 -21094 104479 19822 -82947
7627 -212133 -84274 163194 24074 300402 -8295 -42501 -134460 -72641 48120 -193053 247970
7615 97292 37539 7199 17882 -185409 -315866 198162 -29244 199494 -240455 76377 -300717
7603 241661 82320 -134056 26325 198119 81496 -77834 -330193 -141239 -88549 165727 -36980
7591 210604 -173863 231768 251889 291955 -17341 -63094 13687 -42128 -156241 -79119 130607
7579 244744 -120884 -212694 -150450 -182785 -182042 -314804 -70220 -17258 81369 1796 -232932 -76942
7566 -212666 -173387 210440 -130197 24080 62051 88231 -10174 -273760 -18809 385793 -3672
7554 -293478 -37976 55586 -54438 330582 -14255 -23676 -83610 -156192 -45033 267489 155239
7543 155239 -257312 -375731 182277 31774 -151021 -90742 -200222 -83466 -87023 -84295 -328030
7532 -328030 -144430 98147 -83250 55795 -145218 298605 -91602 7391 -76548 -48448 -94139
7521 -94139 -285965 327769 -39820 854 341583 -12966 129715 -63759 -253258 -100188 -159120
7510 -159120 -143440 -140764 -87846 8119 -246176 -195211 -247800 -199096 -212303 -179623 -7208 -137264
7498 -137264 -16404 366081 145979 221926 271082 183066 -152837 -103354 -198212 173673 -212687
7486 -174281 269844 151413 -112851 -60729 97593 78128 -60387 -23611 72268 29255 -221184
7474 -40678 122038 342885 -37203 -6623 -196423 24302 -2237 -250784 -133422 -16854 -101853
7463 -101853 163358 -45353 -82515 -188617 -94687 -108982 -242162 -94763 67851 -120436 -282574
7452 -282574 -192248 -171352 115950 242273 -156489 -168420 -49618 -246763 58356 197794 -400727
7440 271083 -10746 117830 -10544 -328719 -23253 -289094 -240525 -334174 65590 124971 55659
7428 4703 355069 -206441 145645 -127644 154473 -38749 270764 232143 -13555 121787 -58484
7416 26176 -16390 -28066 107877 232756 71092 -202026 73482 244602 20671 -114766 -4425
7404 152068 -104359 -127584 -183116 -160768 -85610 -138305 -304372 -248018 95091 126558 -348283
7392 363065 111027 15963 330728 -152233 -151284 11824 133984 220708 158612 66542 136438
7381 136438 -87339 4440 -90648 -257676 -2190 141146 88647 7760 -57930 84292 -227271 -8416
7368 171690 -119870 87761 77634 73879 -15280 -42286 -834 -84979 183919 43190 -91710 69773
7355 -430515 -228839 -11749 -58008 18925 -23702 57479 -85032 -85048 -145597 -31226 35602 -24628
7342 14740 -56843 -327860 -159009 -395151 -47333 -122907 181329 -108428 -116293 -276579 288076
7330 -101956 96050 -164488 73594 -198459 28684 10484 -295245 41322 -139322 -66684 -42341
7319 -42341 248088 -122158 59789 -249862 147913 -191797 -258074 102930 -186752 7978 124273
7308 124273 -56447 -274848 202872 -186614 126614 -215779 32776 218411 -20021 -227544
7298 -227544 273220 -14129 3812 -83444 95917 81946 25999 233232 56347 -228526 -173519
7287 -173519 -13003 -103999 -206945 -40457 -183335 -258894 93490 259590 66183 207988 -37920
7275 214986 188651 -124084 -209194 -171128 254429 -136318 -286760 163180 170319 -76270 217350
7263 -30361 188742 218542 -204105 -214689 290009 -129683 221126 -204842 255891 -281822
7252 246364 79479 -2553 307437 113102 -84690 81563 -298922 -52285 -47660 -204136 5212
7240 4381 -44382 -50526 120835 194404 2097 -19323 -172762 110446 -16374 -69725 15613 -38158
7227 220417 37859 -119318 -189855 162166 37943 -187257 30235 -301340 65287 154057 144786
7216 144786 62001 119140 110916 194042 -79706 -108690 -12691 -30297 -2621 271763 -17601 -153459
7204 -153459 19807 54134 231656 -235517 43767 -50303 -181920 -248334 -112469 142410 51218
7192 -139457 66467 -218585 -23344 92113 -107429 17866 -221380 -112581 179141 -356235
7181 -85493 -176959 -2695 -9687 49403 -246896 323225 -198640 -188431 -107596 -42975 -154532
7170 -154532 -204415 102372 -141481 -51438 -85495 -116796 -210929 -85361 35928 209918 -146272
7158 -334720 -149684 -56309 -337620 -90381 -88465 -123814 -26235 -289122 -267093 18633 -52209
7146 -93904 -75591 42550 -120293 -214109 -33200 -186850 23108 -142889 45044 -340543 159614
7134 -171144 -13948 -658235 -39055 178242 -49246 -50318 242547 -51012 -138966 -80949 -100424
7123 -100424 198673 110383 -6016 -7333 -112165 41476 -402412 -286710 -141710 50291 202741
7112 202741 -196636 -240799 162958 36200 -281227 -72749 103101 -17573 -143863 -91275 -12567
7100 38625 153627 -51578 50575 66458 -162029 -65969 -140306 386155 123598 247258 73227
7088 -105522 -80855 11007 137040 61198 -2842 -180517 405270 -345834 -68951 -158670 73131
7076 -12416 -30392 205442 -96334 215225 14960 -175506 103053 -309784 296008 -122957
7065 -239009 395150 203813 58421 42484 -3857 17139 -91102 -92135 18742 -386335 -85752
7053 -78772 -408270 109104 -19801 -80566 -17593 -36646 103742 168413 -224630 102769 -40021
7041 -76700 182950 -42568 184165 151359 -125891 57486 -39581 -214207 113062 -137418 -299550
7030 -299550 -144007 -34352 173710 23034 111113 -42315 97369 -59556 -133755 42644 -93074
7018 94181 -333682 308411 505 -79239 92061 -227475 -89246 -142635 -240798 -125818 262834
7006 -34301 -320893 -82978 -16015 153696 125157 168640 4437 -47983 -176638 57561 -27139
6994 -50223 41759 -174382 3120 96511 247977 251110 24853 131644 -43889 -103835 -201059 -213242
6982 -213242 24473 -113922 -223309 215889 -70165 105926 -111252 22618 -108580 37422
6971 -10565 -67331 -181800 -76857 22880 -213644 -93749 -96026 -105756 -132323 223000 -2279 181131
6958 -149497 214532 -66495 -115604 -36699 293831 98944 239198 -1654 244694 -75142 158787
6946 196318 162135 220792 109515 -278667 -84375 7102 -67057 -85264 27563 9906 -54691 72158
6933 -107044 -18849 -173806 24657 -286239 -135987 12053 68840 -55252 185677 -38867 -77509
6922 -77509 -25424 -11429 -174021 -138236 -119046 79788 38396 -215874 -12612 284924 -25623
6910 -253841 120086 -19674 372203 -186580 -72309 -126968 -130466 64234 -308774 203110 56942
6898 221944 189729 -74580 -168940 -57993 21690 -55555 188862 12275 28445 76116 -111139
6886 -78571 444039 269742 -82691 -2859 122237 -120492 -108638 -59530 261244 152041 10235
6874 224055 -466200 230280 -77061 -7592 -299910 259361 136242 -186926 -487479 154307
6863 -130412 -269087 -122091 -491986 231591 114764 200064 96031 157403 -236944 -29192
6852 -77653 -179703 -124842 -86425 -302155 -200042 174242 157495 -105137 -168309 13293 -96559
6840 99198 72109 95154 113985 -73142 -318506 -100091 -175261 87000 -341425 -45795 -205370
6829 -205370 63568 209499 -83092 -319626 -29105 149372 -97209 -118205 -80663 78679 36373
6817 85973 84097 224932 -89617 -19407 62016 189096 99007 -169122 -224118 255480 -72786
6805 -29063 -256042 -161501 203728 94332 82143 239579 -187371 165301 35145 -87948 58977
6793 -172312 -88542 103176 148809 -33212 49960 210340 -82965 86794 133134 -145238 -49735
6781 -40209 61042 -56754 -124049 -129488 -33914 -115076 135790 140001 125347 -101968 263717 449411
6769 449411 -86731 377596 58567 -30138 -377870 271300 25714 4887 -36493 58562 -106492
6757 111221 -75855 89713 105133 406026 7876 17502 -402630 89024 -17154 -437920 -66023
6745 -229168 -95013 -207140 -176321 -172312 55038 176560 -110494 329759 -148704 -153587 108546
6733 -52993 -138121 -24911 -95050 257313 57856 160793 -362233 93883 132402 -114232 192148
6721 -62500 -30525 -35378 -78896 136731 -135024 -25594 -406773 -142058 -152987 -131201 -54391
6709 14500 66968 -152215 -84461 -163147 -162013 -282703 -59918 -183500 68516 -122814 197041
6697 114338 249386 81141 -148779 53043 -276157 22058 236656 116946 37993 -371716
6686 -10031 124411 -67416 115631 -130967 236551 -59410 -26926 45003 168013 -284810 -19327
6674 -41074 -193019 -81525 135322 19259 -132534 -263169 -42346 -20156 -69500 -44973 152602
6662 36650 58326 -106603 -203480 120736 1736 -47258 -392236 -52061 87223 407080 -226469
6650 235227 73911 185002 191838 88015 -286692 -232051 33680 -77068 37340 40835 -225317
6638 -66144 -111127 169586 48029 -27075 -14143 -86482 -240284 20656 -395528 -22115 -67908
6627 -67908 109318 244278 -100427 6707 146143 15101 -132684 -121841 359432 112892 -87961
6615 -50324 -490115 -141579 -89225 -209855 -206493 -20423 -346240 16294 23498 -164606 -243819
6604 -243819 14932 178057 194839 197861 -419936 -234466 147068 -17628 125881 -189444 -269452
6593 -269452 -44491 87684 54762 114391 -236349 158617 9712 98464 156704 -125277 89248
6581 167168 -95431 72395 97187 107897 -411930 -161424 25090 129802 332338 -31325 60294
6569 127228 271977 -81586 248683 53459 -41999 182187 -23706 180020 -90175 245675 45584
6557 187403 -274789 121590 178738 -75050 -55533 62458 -84788 -192386 -163057 465642 4501
6545 -138607 183959 -294007 -67517 -219145 -17101 -139534 -80795 -51223 -72879 9580 -225042
6533 87070 -49394 -274787 -33711 34876 -220398 298236 -454879 -53561 134677 184876 -183355
6521 12352 180105 -66890 55501 8944 -242731 -183754 23461 -78818 150992 -49681 -130464
6510 -130464 -21213 136638 194802 11787 9061 -143393 -400534 -315906 -85551 -110615 32154
6498 93814 138204 -90867 -103065 -177981 -264471 16498 268360 -96625 82139 -116072 139771
6486 -44050 -223069 -331439 -91729 69837 47280 -157657 -20285 100758 -86615 -35233 -142902
6475 -142902 109884 139867 42695 -140437 -136536 329312 51722 -275862 250561 14624 -12116
6463 -19727 -122412 -182246 -111811 66889 66337 -54299 62631 16914 -122640 -417677 -2893 -47498
6451 -47498 -288141 14304 44927 -128208 158175 23947 65228 -257254 371344 -145500 115567
6439 -161105 17692 -313980 47784 -135049 64586 292302 -206444 168668 -57051 -45523 29754
6427 24172 -214892 231986 14222 128024 -237820 19623 -53266 115433 289515 131442
6416 -17970 -76304 -177837 -232090 -134753 -15220 -83156 -107598 -83565 48238 -100103 54381
6404 -340961 101375 92482 -36940 -185489 -202860 27702 -135313 90187 109317 53477 -35797
6392 242754 -6916 38426 -4233 -272194 432933 -84680 -183655 -205551 -185258 -96136 125839
6380 -31740 -148977 -76222 251255 -32683 70307 112149 -53802 -187001 -174518 141431 320119
6369 320119 -293303 237687 141385 -439645 224958 110065 -233601 68336 24592 146874
6359 146874 -128789 -66722 374567 86485 34110 -252273 -108449 325096 88343 -246966
6348 248148 -403407 221296 -83783 -183946 -9387 -155020 47982 190562 56850 -43054 134567
6336 124629 -36828 -147375 -69322 183929 385048 3007 258335 -337935 -58891 -48954 -108154
6325 -108154 281434 327397 215777 -125262 -117710 -155163 -126480 -78709 150506 -147985 107057
6313 342132 140872 198553 -234905 -16347 14886 95768 22752 -177509 364994 -89119 -44161
6301 -232801 -273187 36532 -59251 40525 150342 -94519 106540 -68382 266681 -12899 -351705
6290 -351705 -112202 235433 109015 -200809 79498 -253308 -237710 270836 -24617 -4140 -208215
6279 -208215 316438 166307 116497 80664 -197363 60546 104567 75226 -311976 -196870 -51144
6267 4056 63914 92060 49127 167240 -114842 -25557 38472 -73416 -37789 -266048 -137479
6256 -137479 -194185 -59230 -142950 -69431 266184 21892 393617 -14749 60512 343207 26972
6244 8071 -186382 39733 49839 -71007 -82110 127682 237595 -35599 296378 193387 12943
6232 38993 -126202 77749 -196552 173125 -31680 -167552 80595 29256 -243369 -178717 -48152
6220 114394 115305 -122268 -135668 -231797 273745 20320 -199602 -56734 -69035 228961 113300
6208 -281463 -54809 -49312 -198440 150325 42122 154910 -90050 -177242 -641 148062 -72946
6196 -252279 96669 -10292 46232 -114529 154511 -248771 42324 165193 -76465 325725 -235711
6184 -74387 -45595 -43032 -177168 89690 343486 238233 13689 -379075 42731 -140180 51746
6172 -44004 -182466 -66034 -10037 -137992 -19672 105572 -147504 202156 -28909 95449 248376
6161 248376 -182057 180323 -344153 131404 6182 -87921 34290 67487 103210 241163 278770
6150 278770 140842 218013 -69525 -234180 122516 233322 -219033 -71352 413403 -15231
6139 -335729 -35340 -270336 -157320 -194493 35674 224489 339607 -317245 31690 -156567
6128 -48386 151995 73225 -304214 -156644 206168 42286 72792 82691 -48446 -405049 -44395
6116 -42393 201189 -101020 83813 -71500 109821 -104308 353333 -62246 35538 302749 -104587
6104 -44609 156292 -184971 49792 -244966 -70958 41711 -136850 51271 -12312 -124730 -114075
6093 -114075 -382243 85065 284497 13080 -33606 -271854 110195 160770 96654 133551 60769
6081 -34067 43860 -11374 195577 -131772 106610 118849 -152513 33213 -345034 52195 150393
6070 150393 176058 230070 229749 61720 -71312 267389 39308 -182765 -89166 -88832 -226408 -105820
6057 383469 139168 -208233 -324111 -158337 -255458 -236748 131374 68146 57934 -383477
6046 -18735 67986 90187 -84566 5049 54615 -38936 -227533 69184 96246 -190 330227 -341528
6033 114318 -160131 10262 -104309 -7959 -366188 -91176 -262899 -264756 124730 130365 66691
6022 66691 -270675 -214143 -106294 24284 47405 221618 -193473 -261391 374840 -129760 -13937
6010 -48234 14797 -58882 -258175 -58520 -206291 276752 176447 986 -394490 89453 171597
5999 171597 -112911 173072 -26004 74885 -135140 176541 -136008 311468 148900 54153
5988 -54659 81181 313490 47998 -141981 22440 -133752 -150104 10999 112972 -4614 6018
5976 -22274 -24414 68 367568 384464 -117276 179277 -205999 31797 -269234 -273956 -125044 -93606
5964 -93606 113526 137584 -14074 13517 -346337 106406 37234 98948 -127419 -215169 203972
5952 44887 -206996 258047 -68307 54258 332386 17126 78336 -141277 -3523 -122548 378000
5940 -217945 -24690 -182547 238260 22327 206856 -224831 117573 -16678 -54165 152621
5929 -124569 -69338 -58770 -3624 153250 -246628 424800 -129591 -35340 -2125 -92889 134788
5917 55569 -320132 -223412 -252497 40756 -439337 195057 91480 -142527 136041 32489 -227264
5905 120606 50168 -210191 94147 -133943 65529 272980 -185536 -99622 130481 -86216 -6017
5893 90573 178854 -274665 -87494 163538 130341 -63375 16625 118184 192772 133947 44680
5881 80192 119076 175178 -80765 -323503 -23058 -29369 -11333 186722 -305410 -412311 58695
5869 313599 -152290 166255 49300 71334 -227882 78278 -103258 37817 183135 -169248
5858 -335604 -17512 13219 35651 -94704 179792 -202591 -76583 -166554 82804 55394 -265080
5846 102392 -181829 -122272 47686 -27021 -33743 -84020 109716 4281 -36093 26865 -333841
5834 112483 109125 -151425 48283 79702 -246426 -268637 58876 63955 -43008 236658 -56838
5822 -12777 -303448 -160359 -127228 -32534 -220400 87572 38377 -166816 140586 -189340 -70447
5810 -316677 126928 -149270 -130240 222526 45615 162732 212597 -118172 -201449 50025 78151
5799 78151 -99583 -61474 -134547 -161267 -48287 250001 278917 -31718 -10741 195362 -138589
5787 160510 -62928 51527 -76286 133543 21170 -37093 190519 -78998 78741 -8238 191949
5775 208376 -130332 -369922 159772 220487 -56083 160529 -45190 246839 143025 31282
5764 73942 -144591 110426 19820 -161589 -125524 91903 -219913 -216995 -112754 -252990 320743
5752 83312 -263305 100318 197451 -419453 107184 218427 -7328 244473 -190662 -55465 -364644
5741 -364644 -8249 -61321 21219 -2204 -24552 -395570 133078 14672 -138842 -49794 -66236
5730 -66236 -193826 -9959 25306 76061 -131881 183572 190221 165906 -345378 -242442 14785
5718 -357344 281240 -42576 -26893 -179485 69687 106027 211846 -178386 -117616 110259 346221
5707 346221 23261 297833 -48183 64871 -38794 -2432 166326 -399267 -56007 55662 -105683
5695 -224611 165877 -187792 -98247 18720 143854 -229103 -104157 -318924 53557 182032
5685 182032 93173 -75842 -218148 -191176 76872 -232061 88703 96706 302410 -24425 77678
5673 -168591 -15602 -45790 -17015 196270 15862 -74842 224980 -86601 -45227 -145158 -94326
5662 -94326 72495 104462 170252 -36259 20266 214014 300141 -126007 136226 -44638 105532
5650 -16242 -65262 -14011 -131512 -214583 30328 -115744 30106 255036 -86081 -59540 262480
5638 -16635 -46428 125619 22645 -16174 -132449 -97032 -245000 132126 233807 -148158 -255305
5627 -255305 179107 -101822 -54133 30786 91129 -216319 -106147 -252095 3070 121407 89081
5616 89081 -104925 -90535 51322 105404 -180599 -141721 -91066 188821 -126206 3588 279614
5605 279614 167869 -382154 75461 -240066 296770 -3070 -75037 97106 82796 -125754 119668
5593 -263659 289670 -196953 1689 -5179 7490 65242 335056 -65051 120477 78571 94369
5582 94369 284009 -138318 125453 346038 -73775 -287698 -242446 -113160 266325 5181 307315
5571 307315 -264698 207352 -57183 107572 -161337 -13658 92503 -128564 447544 -43782
5560 -86420 -3559 36877 -202685 302007 73301 -202068 87758 31328 95468 -77058 -106797
5549 -106797 -46050 23508 -71485 111595 -69508 -61622 -13727 -171447 -113702 26230 39549
5538 39549 -7252 49717 147863 408868 155491 -10936 -248724 44976 -341788 -87060 -2228
5526 86244 -180691 39011 13058 -8070 -129061 -12511 -50373 24735 434043 -121334 21089
5514 252321 178427 141567 354450 -15769 25246 -173872 154483 44881 171765 -191009 -48581
5502 117472 -158675 23387 -19826 -128616 -203005 61692 -33538 107701 119333 -190019 -89757
5490 -97615 -274485 60755 101000 -30994 211314 -54972 -162110 165974 -126583 -36707 115875
5478 72275 78892 -86240 -45004 111947 -27041 -21220 -30995 -86519 65739 120721 270004 -145423
5465 84377 223588 358739 62925 3703 -107007 -121385 108234 108092 -230846 -202032 -261172
5454 -261172 -5964 309563 -14909 -73532 26938 17966 9760 227842 -42066 -241938 -132634
5443 -132634 344985 -354896 134896 -160960 4684 367257 92421 45041 -19969 69321 367686
5432 367686 121943 640547 113694 32498 -208438 -72871 197185 -170863 162220 -272832
5421 103896 168699 -94504 -185636 189628 45086 -112579 167163 80782 -320420 22397 -312940
5409 7810 81637 264589 53677 -95688 -108858 238577 -61831 34064 -151035 -36446 -222137
5398 -222137 26981 258071 152783 210717 33989 363886 -185053 -144199 276724 -141823
5387 234922 41558 -67180 216384 58039 130127 364318 170235 32620 -228401 106218 -239057
5375 142544 334894 -35725 -253551 8907 57968 -119344 289454 134260 -52737 -500084 145321
5363 40661 79598 254514 -10651 -51572 -179134 79016 -28347 415005 296997 -177874 -306531
5352 -306531 91956 -87231 -372368 233421 -91998 201003 85877 72311 198128 131873 75374
5341 75374 -221086 -249923 170300 -64807 163235 -99158 165644 -1686 -88580 17412 61384
5330 61384 -235427 234294 129073 -203504 -361520 -117497 166139 85915 -122045 -88009
5320 -88009 47029 129744 181600 -131440 25046 68976 -284759 -162935 5634 -89930 22034
5308 -122134 -60926 -107297 243090 -38598 -95714 -28637 166311 266664 -169306 63763 -5355
5296 149191 62465 128154 188362 54801 -166740 -83833 -210128 139805 -205849 -207835 94194
5284 -174009 -91140 -454315 -45169 186739 -159750 105804 -228253 109003 252646 42276
5273 83985 -77855 136028 -92174 -94384 132435 84919 75923 -83075 -79102 -153542 12811 55920
5261 55920 -51555 412361 67037 105623 -40961 399719 -137688 17691 -145651 -32796 249540
5249 101923 -185459 68176 5581 45273 40929 -24224 164508 109690 -244164 -8798 111518
5237 29251 -26842 263441 -10097 -111261 326997 -108600 -210203 -239299 -208249 457301 50941
5225 103615 -16531 -19173 177509 43320 46494 -114888 136292 -225363 -44392 9382 398046
5214 398046 -149491 -460445 359620 9374 -79863 -314376 320892 194867 -169424 -175635 204495
5202 136979 -57043 -156559 123177 -24980 -254067 24771 233798 117471 136244 -196514 -33439
5190 126156 26917 35898 -35165 -219110 95162 14329 -183983 186058 260402 177506 67210
5178 160848 -8643 -152411 -73116 -113930 -241284 -9536 -418752 -112458 1902 -176232 -38267
5166 -77730 280807 -29231 23273 -32636 -127782 -149776 5395 -12547 208493 -152546 -200908
5155 -200908 -188826 160270 20043 53729 -75661 222619 41386 -233578 -175183 -173000 -261799
5144 -261799 41319 387107 108909 248216 -74686 174191 155464 18576 -93209 -34830 -156499
5133 -156499 98637 51979 155059 281260 14892 61144 24906 398268 220972 166380 -192023
5121 -27274 -3250 -147588 -20177 -72742 -9516 -37879 27477 151763 59024 -116752 57362 104214
5109 104214 -28297 -178030 38493 248838 216637 71360 -53970 -342459 -8994 -119051 114288
5097 -215524 211463 -11591 5270 -108090 151343 58631 420798 -30761 62261 104266 -146553
5085 -234320 69784 213462 -167701 -12415 223789 -126436 139055 -168138 80627 -95378
5074 207518 24530 -1691 123001 60122 -187389 -376670 68547 29760 -9066 -92741 -146954
5063 -146954 -356140 98204 131741 57697 -15901 53036 -152975 7964 82119 -26025 -103436
5052 -103436 7123 -116224 62139 219761 165698 -268636 219982 196129 1023 -153302 137948
5040 351343 -108839 -451729 -87807 -110629 -26507 -31060 229615 -25081 -93090 -333148 322244
5028 -24139 -51337 -248288 144763 359030 52381 238968 -294259 -282029 166330 43490 164093
5017 164093 -42967 178986 -131920 -65590 -291363 121587 363850 -14075 75608 -113490
5006 59653 -259351 2470 -338760 -33984 26471 138514 -14912 -138195 -34382 -215046 -112661
4995 -112661 377814 -82430 34699 -136416 36814 103082 110455 -254410 9750 112960 -353323
4983 77115 -79233 57549 -190195 197726 -3266 447304 224049 -162276 -171880 242386 80290
4971 -157729 105804 -1552 118505 98862 -64425 89793 177194 169429 85004 -90271 127612
4959 -75010 -32516 39849 -315113 -121208 171644 52283 249489 -258982 -102309 -127052 -79987
4948 -79987 -152598 -122457 70947 -87873 72760 45291 26545 14994 -128977 16484 -1709 603
4935 180725 -130612 213506 -154965 -1607 88844 -44584 -133571 80922 -142023 195388 40419
4923 57536 -329829 235021 11630 -2010 191610 340581 63902 -54470 59821 -74569 -175247
4912 -175247 180674 -55189 92650 211762 253647 -242561 -201698 -118762 -98489 199900 128262
4901 128262 -86614 -163875 275158 144919 61375 177158 -171626 297774 15585 -39476 25325
4889 -64417 -42428 -58608 85311 -77026 -31751 164385 -3614 71198 -272198 49719 137495 70324
4877 70324 23590 -87581 111246 140107 -187308 128500 -67947 41578 49475 -36056 103426
4865 42598 -406025 187896 13770 246428 -37371 -18128 -101750 90127 122414 -308118 83213
4853 -138782 -44905 -67558 -54333 -377143 -20061 39419 -61801 71438 80292 -162253 -10048
4841 156437 -63793 116899 79125 -200374 44036 -149247 61294 13756 150411 63249 95381
4830 95381 -184317 202879 -188607 166091 -69943 -123143 -123962 -299074 77457 -63873 203377
4818 129950 -76906 -14332 50105 -402826 -66469 -113331 -155420 97449 49216 190605 103774
4807 103774 76176 42484 -47673 312682 101992 -97126 339854 280231 -185360 71500 -101489
4795 -106802 304180 -124041 95421 -100060 141243 130367 -180661 -58525 142469 -58889
4784 62257 142837 -72095 -122702 5076 -282845 17020 5972 228025 -36654 -23177 -119327 300996
4771 37456 508852 60475 56456 60389 54921 172472 -49915 -221164 -102927 190992 -96027
4759 56780 74461 27163 192021 -7764 11557 -103600 -190001 -37738 -143760 264707 137268
4748 137268 25202 -275634 -142950 63062 -110546 493634 -140269 176491 -123297 -72857
4738 -72857 85154 92561 -327565 -240021 260342 -130543 313476 70679 -79834 -126748 166399
4726 -485014 132099 164321 116780 -184687 92855 142712 408238 -50520 53963 -276456 17587
4714 75927 -349091 -24015 -37594 -17247 -73506 -1327 253346 -134336 -215687 -232861 -41030
4702 -285331 22019 -42151 174632 305905 -59481 -23754 225247 57347 -203240 130271 75381
4691 75381 71164 4013 61582 -69134 -54426 65612 15670 113682 -195649 135671 353628 -17036
4678 -201215 339610 182904 33241 142773 81608 51453 34978 -96320 121256 126428 -222782
4666 192921 -23688 -188264 220098 264199 226959 -96814 207146 147434 177971 -130665 84211
4654 -87929 -120671 159339 -82607 -54848 163915 -106263 -73222 131759 -89907 167150 -80452
4642 -37704 228547 -82405 86621 -142773 1650 -158067 218514 16596 186765 -154252 175107
4630 160772 228710 -209191 122020 -184299 219827 -14037 -199356 -9615 307903 -48366 7678
4618 -156552 -49224 -4260 193709 2128 -291116 236914 41252 -79282 90990 83995 72253 -189667
4605 381239 10568 -2510 180149 -234600 173827 -36021 34271 31352 -30627 -75802 123298
4593 -142582 82380 -186673 185062 -71549 -141579 157049 114863 -229060 -80204 423 -29936
4581 161387 -30094 159064 45646 -252117 -248756 77775 -266433 -397788 -150530 -115881 -134829
4570 -134829 -39537 168324 -68856 -151992 945 168189 81336 -340394 -301284 -11183 -47462
4559 -47462 377927 33458 59708 312960 275947 45526 -156852 -264062 -144259 112607 -36814
4547 -33769 -12059 123283 -38062 -200688 -44437 171309 74467 -107382 1477 -53721 64507
4535 35671 -17513 227519 -126329 -190654 161016 367964 151234 16647 -75767 182085 4510
4523 -70979 80851 212764 289089 -45250 314941 276741 -28689 103259 300367 -221196 104867
4511 115369 46389 -159376 -249979 146865 81740 46761 -120281 325617 -12243 -172949 119227
4499 46966 -65333 -216008 -49971 -310807 32913 -16420 -230541 -118040 135073 -76261 -298701
4488 -298701 108769 161053 -58440 87464 -69869 -7029 172080 -45005 53767 314175 -72487
4476 -29741 260156 -117182 -272547 -143581 -46505 -185622 -133163 231485 -199429 -86930
4465 16078 109902 -56175 -362520 -61088 220604 -16500 -83641 -65489 301029 196565 15866
4453 16340 323311 113940 -28225 82250 10648 -155662 176842 -167013 -1877 -170698 71985
$$ [...]
##END NTUPLES=NMR SPECTRUM
##END=
