##TITLE=NES1086_santa_lucia_9885092_Txwg26jtW8
##JCAMPDX= 6.0         $$ Bruker NMR JCAMP-DX V2.0
##DATA TYPE= NMR SPECTRUM
##DATA CLASS= NTUPLES
##ORIGIN= BRUKER
##OWNER= Administrator
$$ 1.72 TOPSPIN		Version 2.1
$$ 2016-08-27 21:53:35.070 -0500  Administrator@X
$$ Compression mode = diff/dup
##.OBSERVE FREQUENCY= 400.02188249412
##.OBSERVE NUCLEUS= ^1H
##.ACQUISITION MODE= SIMULTANEOUS (DQD)
##.ACQUISITION SCHEME= undefined
##.AVERAGES= 64
##.DIGITISER RES= 22
##SPECTROMETER/DATA SYSTEM= spect
##.PULSE SEQUENCE= noesygpps1d.comp
##.SOLVENT NAME= COFFEE_meoh
##.SHIFT REFERENCE= INTERNAL, COFFEE_meoh, 1, 14.96173
##AUDIT TRAIL= $$ (NUMBER, WHEN, WHO, WHERE, PROCESS, VERSION, WHAT)
$$ ##TITLE= Audit trail, TOPSPIN		Version 2.1
$$ ##JCAMPDX= 5.01
$$ ##ORIGIN= Bruker BioSpin GmbH
$$ ##OWNER= Administrator
$$ $$ E:\/data/COFFEE/nmr/NES1086_santa_lucia_9885092_Txwg26jtW8/12/pdata/1/auditp.txt
$$ ##AUDIT TRAIL=  $$ (NUMBER, WHEN, WHO, WHERE, PROCESS, VERSION, WHAT)
(   1,<2016-08-27 21:53:29.914 -0500>,<Administrator>,<X>,<go>,<TOPSPIN 2.1>,
      <created by zg
	started at 2016-08-27 21:41:59.586 -0500,
	POWCHK enabled, PULCHK disabled,
       configuration hash MD5:
       21 0F 79 D6 B3 7B B4 F6 88 20 88 DB 03 48 BD 9F
       data hash MD5: 64K
       93 B3 B9 07 AB 00 EB E2 E0 71 98 D3 67 1C 0C 67>)
(   2,<2016-08-27 21:53:33.008 -0500>,<Administrator>,<X>,<proc1d>,<TOPSPIN 2.1>,
      <Start of raw data processing
       efp LB = 0.3 FT_mod = 6 PKNL = 1 PHC0 = 0 PHC1 = 0 SI = 128K 
       data hash MD5: 128K
       EB 8D 26 D3 EF 90 09 22 D3 0D E8 E8 EA 02 60 DA>)
(   3,<2016-08-27 21:53:33.898 -0500>,<Administrator>,<X>,<proc1d>,<TOPSPIN 2.1>,
      <pk PHC0 = -85.51208 PHC1 = 0 
       data hash MD5: 128K
       32 76 06 18 AD 7F A3 A3 40 7B D6 B9 3C B2 3C 21>)
(   4,<2016-08-27 21:53:34.258 -0500>,<Administrator>,<X>,<proc1d>,<TOPSPIN 2.1>,
      <abs ABSG = 1 
       data hash MD5: 128K
       A1 37 65 5F DE C3 18 55 EB 2C 6C 16 1A 49 90 7E>)
(   5,<2016-08-27 21:53:34.351 -0500>,<Administrator>,<X>,<proc1d>,<TOPSPIN 2.1>,
      <abs ABSG = 2 
       data hash MD5: 128K
       32 DC B6 28 2B E7 D7 BA AD 05 D8 F5 31 72 64 F2>)
(   6,<2016-08-27 21:53:34.429 -0500>,<Administrator>,<X>,<proc1d>,<TOPSPIN 2.1>,
      <abs ABSG = 3 
       data hash MD5: 128K
       C7 DD 98 98 BC 79 2D C5 E6 99 3C D0 49 5D B4 10>)
(   7,<2016-08-27 21:53:34.523 -0500>,<Administrator>,<X>,<proc1d>,<TOPSPIN 2.1>,
      <abs ABSG = 4 
       data hash MD5: 128K
       9B 0D 66 69 4B 43 FD 4B FF 3A 1B 77 96 35 4B D8>)
(   8,<2016-08-27 21:53:34.617 -0500>,<Administrator>,<X>,<proc1d>,<TOPSPIN 2.1>,
      <abs ABSG = 5 
       data hash MD5: 128K
       60 C9 BF 2B 35 E7 03 1A 30 E6 16 A3 CB 73 DD EA>)
$$ ##END=
$$ 
$$ $$ hash MD5
$$ $$ 85 37 37 29 B1 A0 5B D9 C8 D0 58 30 A6 36 FE CF
##$RELAX= 
##$RELAX= 
##$RELAX= 
##$RELAX= 
##$RELAX= 
##$RELAX= 
##$RELAX= 
##$RELAX= 
$$ Bruker specific parameters
$$ --------------------------
##$DU= <E:\>
##$EXPNO= 12
$$ [...]
##$TP07= 0
##$TPNAME0= <>
##$TPNAME1= <>
##$TPNAME2= <>
##$TPNAME3= <>
##$TPNAME4= <>
##$TPNAME5= <>
##$TPNAME6= <>
##$TPNAME7= <>
##$TPOAL= (0..7)
0.5 0.5 0.5 0.5 0.5 0.5 0.5 0.5
##$TPOFFS= (0..7)
0 0 0 0 0 0 0 0
##$TUNHIN= 0
##$TUNHOUT= 0
##$TUNXOUT= 0
##$USERA1= <user>
##$USERA2= <user>
##$USERA3= <user>
##$USERA4= <user>
##$USERA5= <user>
##$V9= 5
##$VALIST= <valist>
##$VCLIST= <CCCCCCCCCCCCCCC>
##$VD= 0
##$VDLIST= <DDDDDDDDDDDDDDD>
##$VPLIST= <PPPPPPPPPPPPPPP>
##$VTLIST= <TTTTTTTTTTTTTTT>
##$WBST= 1024
##$WBSW= 4
##$XGAIN= (0..3)
0 0 0 0
##$XL= 0
##$YL= 0
##$YMAX_a= 6514798
##$YMIN_a= -12455486
##$ZGOPTNS= <>
##$ZL1= 120
##$ZL2= 120
##$ZL3= 120
##$ZL4= 120
##$ABSF1= 14.96173
##$ABSF2= -5.596452
##$ABSG= 5
##$ABSL= 3
##$ALPHA= 0
##$AQORDER= 0
##$ASSFAC= 0
##$ASSFACI= 0
##$ASSFACX= 0
##$ASSWID= 0
##$AUNMP= <proc_prof1d_extract.lims>
##$AXLEFT= 0
##$AXNAME= <>
##$AXNUC= <1H>
##$AXRIGHT= 0
##$AXTYPE= 0
##$AXUNIT= <>
##$AZFE= 0.1
##$AZFW= 0.1
##$BCFW= 0
##$BC_mod= 0
##$BYTORDP= 0
##$COROFFS= 0
##$CY= 15
##$DATMOD= 1
##$DC= 0
##$DFILT= <>
##$DTYPP= 0
##$F1P= 0
##$F2P= 0
##$FCOR= 0.5
##$FTSIZE= 131072
##$FT_mod= 6
##$GAMMA= 0
##$GB= 0
##$INTBC= 1
##$INTSCL= 1
##$ISEN= 128
##$LB= 0.3
##$LEV0= 0
##$LPBIN= 0
##$MAXI= 10000
##$MC2= 0
##$MEAN= 0
##$ME_mod= 0
##$MI= 0
##$NCOEF= 0
##$NC_proc= -2
##$NLEV= 6
##$NOISF1= 0
##$NOISF2= 0
##$NSP= 0
##$NTH_PI= 0
##$NZP= 0
##$OFFSET= 14.96173
##$PC= 1
##$PHC0= -85.51208
##$PHC1= 0
##$PH_mod= 1
##$PKNL= yes
##$PPARMOD= 0
##$PPDIAG= 0
##$PPIPTYP= 0
##$PPMPNUM= 2147483647
##$PPRESOL= 1
##$PSCAL= 4
##$PSIGN= 0
##$PYNMP= <proc.py>
##$REVERSE= no
##$SF= 400.020009345573
##$SI= 131072
##$SIGF1= 0
##$SIGF2= 0
##$SINO= 400
##$SIOLD= 131072
##$SPECTYP= <>
##$SREGLST= <1H.CDCl3>
##$SSB= 0
##$STSI= 131072
##$STSR= 0
##$SW_p= 8223.68421052631
##$SYMM= 0
##$S_DEV= 0
##$TDeff= 65536
##$TDoff= 0
##$TI= <>
##$TILT= no
##$TM1= 0
##$TM2= 0
##$TOPLEV= 0
##$USERP1= <user>
##$USERP2= <user>
##$USERP3= <user>
##$USERP4= <user>
##$USERP5= <user>
##$WDW= 1
##$XDIM= 131072
##$YMAX_p= 383539615
##$YMIN_p= -10705
##$CURPLOT= <Network HP LaserJet P1505>
##$CURPRIN= <$Network HP LaserJet P1505>
##$DFORMAT= <normdp>
##$LAYOUT= <+/1D_H.xwp>
##$LFORMAT= <normlp>
##$PFORMAT= <normpl>
##$SURQMSG= 1
$$ End of Bruker specific parameters
$$ ---------------------------------
##NTUPLES= NMR SPECTRUM
##VAR_NAME=  FREQUENCY,     SPECTRUM/REAL,   SPECTRUM/IMAG
##SYMBOL=    X,             R,               I
##VAR_TYPE=  INDEPENDENT,   DEPENDENT,       DEPENDENT
##VAR_FORM=  AFFN,          ASDF,            ASDF
##VAR_DIM=   131072,        131072,          131072
##UNITS=     HZ,            ARBITRARY UNITS, ARBITRARY UNITS
##FACTOR=    0.0627417313425164, 1,          1
##FIRST=     8223.62146879497, -873,         -50946
##LAST=      0,             1256,            -50946
##MIN=       0,             -10705,          0
##MAX=       8223.62146879497, 383539615,    0
$$ Real data points
##PAGE= N=1
##DATA TABLE= (X++(R..R)), XYDATA
$$ [...]
63530F31123j1613j5512j9735k3393k5696k6888k7679k8099k7501k5675k3368
$$ 631123 619510 603998 584263 560870 535174 508286 480607 452508 425007 399332 375964
63519C75964k1497k0198j8911j7145j4901j2543j0525r161q443q005p434o604
$$ 375964 354467 334269 315358 298213 283312 270769 260244 251083 242640 234635 227201 220597
63507B20597n730n077m646m112l096j584p8Q28J061J037J054J025R39J218K273
$$ 220597 214867 209790 205144 201032 197936 196352 196274 197102 198163 199200 200254 201279 202218 203436 205709
63492B05709L910N506O678P482Q126Q846R889J1199J2186J2307J1855J1590J1532
$$ 205709 209619 215125 221803 229285 237411 246257 256146 267345 279531 291838 303693 315283 326815
63479C26815J0815Q921O390L929J441j490m661p486r780j1661j2922j3247j2923
$$ 326815 337630 346551 352941 356870 358311 356821 352160 344674 334894 323233 310311 297064 284141
63466B84141j2564j2230j1510j0385r266q096o411m422l108k748k305q76R16J852
$$ 284141 271577 259347 247837 237452 228186 220090 213679 209257 206149 203401 201096 200220 201136 202988
63452B02988J843J848K358K913L111L303L980N037N927O303O383O799Q066R929
$$ 202988 204831 206679 209037 211950 215061 218364 222344 227381 233308 239611 245994 252793 260859 270788
63438B70788J1496J2216J2638J3750J5750J7883J9529K0941K2781K5295K8120
$$ 270788 282284 294500 307138 320888 336638 354521 374050 394991 417772 443067 471187
63427D71187L0728L2840L4493L5654L5792L4091L0298K5128J9474J3466O788j80
$$ 471187 501915 534755 569248 604902 640694 674785 705083 730211 749685 763151 769939 769759
63415G69759o126r841j1197j1025j0365r858r570r326r342j0381j2930j6396j9566
$$ 769759 763633 753792 742595 731570 721205 711347 701777 692451 683109 672728 659798 643402 623836
63402F23836k1765k3130k3947k4374k4735k5251k5320k3894k0928j7766j5613
$$ 623836 602071 578941 554994 530620 505885 480634 455314 431420 410492 392726 377113
63391C77113j4223j2662j0732q929p347n560l526j851r66n24K61J901M285O773
$$ 377113 362890 350228 339496 330567 323220 317660 314134 312283 311317 310793 311054 312955 317240 324013
63377C24013Q589R468R970J0942J2708J4947J7204J9229K0859K1978K2802K3841
$$ 324013 332602 342070 352040 362982 375690 390637 407841 427070 447929 469907 492709 516550
63365E16550K5438K7282K8496K8251K6302K3072J9127J4645R494L888j317n183
$$ 516550 541988 569270 597766 626017 652319 675391 694518 709163 718657 722545 721228 716045
63353G16045p482q718r486r967r988r462q706q463r448j1780j4919j8165k1094
$$ 716045 708563 699845 690359 680392 670404 660942 652236 643773 634325 622545 607626 589461 568367
63340E68367k3463k5017k5648k5561k5023k4033k2482k0489j8386j6466j4921
$$ 568367 544904 519887 494239 468678 443655 419622 397140 376651 358265 341799 326878
63329C26878j3807j2919j1877j0604r461q638p680o104m302l232l213l568l525
$$ 326878 313071 300152 288275 277671 268210 259572 251892 245788 241486 238254 235041 231473 227948
63316B27948l047k534k200k020j984k028j903j382n46L34J102J734K176K344K254
$$ 227948 224901 222367 220167 218147 216163 214135 212232 210850 210304 210638 211740 213474 215650 217994 220248
63301B20248K015J694J264O63q3q08j242j241r31o51p29j309k202k831k577j542
$$ 220248 222263 223957 225221 225884 225801 224993 223751 222510 221579 220928 220199 218890 216688 213857 211280 209738
63285B09738p60j202k556l430k883j377o5M46L55P4j79k81k13j26j99l72m03k02
$$ 209738 208978 207776 205220 201790 198907 197530 197465 197911 198266 198340 198161 197880 197667 197541 197342 196970 196567 196365
63267A96365J24N34J152J996K739K891K309J439J025J400K165K673K827L101L720
$$ 196365 196489 197023 198175 200171 202910 205801 208110 209549 210574 211974 214139 216812 219639 222740 226460
63252B26460M227M153L781L766M137M296M049M068M987O520P869Q728R356R945
$$ 226460 230687 234840 238621 242387 246524 250820 254869 258937 263924 270444 278313 287041 296397 306342
63238C06342J0434J0973J1964J3446J4898J5856J6344J6480J6126J5367J4872
$$ 306342 316776 327749 339713 353159 368057 383913 400257 416737 432863 448230 463102
63227D63102J5106J5448J4850J3430J2620J3437J5300J6882J7602J7672J7142
$$ 463102 478208 493656 508506 521936 534556 547993 563293 580175 597777 615449 632591
63216F32591J5780J3775J1838J0358Q900O692L343j005n800j0264j3777j6338
$$ 632591 648371 662146 673984 684342 693242 699934 703277 702272 696472 686208 672431 656093
63204F56093j8421k0283k1696k2362k2277k1500j9930j7523j4519j1269q065n248
$$ 656093 637672 617389 595693 573331 551054 529554 509624 492101 477582 466313 458248 453000
63192D53000l076j311P16L257N790P850R775J2017J4154J5380J5825J6477J7663
$$ 453000 449924 448613 449329 452586 458376 466226 476001 488018 502172 517552 533377 549854 567517
63179E67517J8552J8506J8081J8074J8310J8090J7423J6886J6536J5770J4324
$$ 567517 586069 604575 622656 640730 659040 677130 694553 711439 727975 743745 758069
63168G58069J2607J0883Q789N952K532j201n309r832j4338j8238k1355k3831k5706
$$ 758069 770676 781559 790348 796300 798832 797631 792322 782490 768152 749914 728559 704728 679022
63155F79022k6957k7689k7896k7218k5412k2978k0836j9341j8012j6297j4195
$$ 679022 652065 624376 596480 569262 543850 520872 500036 480695 462683 446386 432191
63144D32191j2072j0241q880p993p253o184m800l782l695m210m403l766k590j442
$$ 432191 420119 409878 400998 393005 385752 379568 374768 370986 367291 363081 358678 354912 352322 350880
63130C50880o41l10n17j089j458j075p4P50P46J10m22m55k39j39q1K15P09J043
$$ 350880 350239 349929 349412 348323 346865 345790 345716 346466 347212 347322 346900 346445 346206 346067 345986 346201 346910 347953
63112C47953J024Q79J010J598K400K880K611J758R86P34P04L48k75m83J82J469
$$ 347953 348977 349856 350866 352464 354864 357744 360355 362113 363099 363833 364537 364885 364610 364127 364309 365778
63096C65778K750L571L806L627L444L560L801L729L242K715K492K603L026L789
$$ 365778 368528 372099 375905 379532 382976 386536 390337 394066 397308 400023 402515 405118 408144 411933
63082D11933M723N416N679N688N598N361N108N249N911O665P105P318P610Q121
$$ 411933 416656 422072 427751 433439 439037 444398 449506 454755 460666 467331 474436 481754 489364 497485
63068D97485Q948J0158J1332J1748J1469J1698J3361J5817J7704J8666J9460K0672
$$ 497485 506433 516591 527923 539671 551140 562838 576199 592016 609720 628386 647846 668518
63056F68518K2218K3985K5976K7818K8944K9431K9938L0725L1451L2059L2927
$$ 668518 690736 714721 740697 768515 797459 826890 856828 887553 919004 951063 983990
63045I83990L3927L4237L3529L2580L2188L2153L1981L1955L2646L3718L4115
$$ 983990 1017917 1052154 1085683 1118263 1150451 1182604 1214585 1246540 1279186 1312904 1347019
63034A347019L3392L2139L0873K9069K5586J9859J2519M811k498r575j6871k4267
$$ 1347019 1380411 1412550 1443423 1472492 1498078 1517937 1530456 1535267 1532769 1523194 1506323 1482056
63022A482056l1094l6875m1445m4449m5385m4396m2447m0263l7561l3751k8973
$$ 1482056 1450962 1414087 1372642 1328193 1282808 1238412 1195965 1155702 1118141 1084390 1055417
63011A055417k3907j8955j4090r341m768j77M636R421J3707J7369K0526K3031
$$ 1055417 1031510 1012555 998465 989124 984356 984179 988815 998236 1011943 1029312 1049838 1072869
62999A072869K4685K5825K7122K8628K9592K9495K8778K8345K8608K9230K9514
$$ 1072869 1097554 1123379 1150501 1179129 1208721 1238216 1266994 1295339 1323947 1353177 1382691
62988A382691K8831K6917K4016K0582J6709J1991O076q26q139j5493k2868l0268
$$ 1382691 1411522 1438439 1462455 1483037 1499746 1511737 1517813 1516987 1508848 1493355 1470487 1440219
62976A440219l7463m4030m9566n3800n6544n7705n7393n6032n4158n2000m9401
$$ 1440219 1402756 1358726 1309160 1255360 1198816 1141111 1083718 1027686 973528 921528 872127
62965H72127m6218m2725l9395l6413l3563l0551k7289k3934k0831j8429j6994
$$ 872127 825909 783184 743789 707376 673813 643262 615973 592039 571208 552779 535785
62954E35785j6318j5779j4832j3424j1951j0837j0093r361q408p517p113p090
$$ 535785 519467 503688 488856 475432 463481 452644 442551 433190 424782 417265 410152 403062
62942D03062o798n857m649l798l466l357l189k843k279j659j400j754k434k916
$$ 403062 396264 390407 385758 381960 378494 375137 371948 369105 366826 365167 363767 362013 359579 356663
62928C56663k999k846k630k493k627l034l309l157k840k756k690k123j221p33
$$ 356663 353664 350818 348188 345695 343068 340034 336725 333568 330728 327972 325282 323159 321938 321205
62914C21205q69r65n72j81m49j140j406q68J6N41L99j78p03q76q65r33q77k47
$$ 321205 320336 319371 318799 318618 318169 317029 315623 314755 314771 315312 315711 315533 314830 313954 313089 312156 311279 311032
62896C11032P98J382J033L98M05R95J334J051O61O66Q75Q67P14Q43J329J714J571
$$ 311032 311830 313212 314245 314643 315048 316043 317377 318428 319089 319755 320630 321497 322211 323054 324383 326097 327668
62879C27668J056O67N54L93Jk35N8N44M98j54p29p79o48q04j159j375j367j153
$$ 327668 328724 329391 329945 330338 330339 330104 330162 330706 331204 331050 330321 329542 328894 328090 326931 325556 324189 323036
62861C23036o69j69l30j375k474k637j919j133o78l92k84n17o94j55Q84J366Q44
$$ 323036 322367 322198 321868 320493 318019 315382 313463 312330 311652 311260 310976 310459 309765 309610 310494 311860 312704
62844C12704K7l94o01q67p73N5J111J719K030K470K676J953O32r5K70R92J266
$$ 312704 312731 312337 311736 310869 310096 310151 311262 312981 315011 317481 320157 322110 322742 322647 322917 323909 325175
62827C25175J113Q93P13O58R82J579J843J492J078J209J654J787J500J130P68
$$ 325175 326288 327181 327894 328552 329534 331113 332956 334448 335526 336735 338389 340176 341676 342806 343574
62812C43574L50J71N85J209J205N15P2N21J412K082K668L640M829N652O097O728
$$ 343574 343924 344095 344680 345889 347094 347609 347681 348202 349614 351696 354364 358004 362833 368485 374582 381310
62796C81310P763Q831R754J0924J2668J4772J6924J9165K1649K4351K7320L0804
$$ 381310 389073 397904 407658 418582 431250 446022 462946 482111 503760 528111 555431 586235
62784E86235L4679L8203M0916M3445M6747N0774N4641N7956O1107O3997O5458
$$ 586235 620914 659117 700033 743478 790225 840999 895640 953596 1014703 1078700 1144158
62773A144158O4489O1330N6719N0633M2649L3112K3009J2749J985r167j9616k8465
$$ 1144158 1208647 1269977 1326696 1377329 1419978 1453090 1476099 1488848 1490833 1481666 1462050 1433585
62761A433585l6058m3239m9988n5406n8871o0600o1066o0377n8470n5595n2342
$$ 1433585 1397527 1354288 1304300 1248894 1190023 1129423 1068357 1007980 949510 893915 841573
62750H41573m9254m6464m3709m0691l7403l4108l0973k7888k4743k1709j9062
$$ 841573 792319 745855 702146 661455 624052 589944 558971 531083 506340 484631 465569
62739D65569j6888j5124j3751j2670j1532j0065q537p461o838o051m719l214k106
$$ 465569 448681 433557 419806 407136 395604 385539 377002 369541 362703 356652 351933 348719 346613
62726C46613j402p19J08R03J599K348L224M089M803N375N916O679Q002R944J2034
$$ 346613 345211 344492 344600 345503 347102 349450 352674 356763 361566 366941 372857 379536 387538 397482 409516
62711D09516J3742J5173J6883J9026K1191K3226K5672K8970L2713L6220L9560
$$ 409516 423258 438431 455314 474340 495531 518757 544429 573399 606112 642332 681892
62700F81892M3397M7945N2649N6840O0172O2351O3086O2492O1058N8883N5302
$$ 681892 725289 773234 825883 882723 942895 1005246 1068332 1130824 1191882 1250765 1306067
62689A306067M9573M1622L1876K0789Q929k854j3837k3932l3341m1945m9336n5244
$$ 1306067 1355640 1397262 1429138 1449927 1458856 1456002 1442165 1418233 1384892 1342947 1293611 1238367
62677A238367n9520o1867o2168o0987n9187n7031n4192n0608m6763m2980l9158
$$ 1238367 1178847 1116980 1054812 993825 934638 877607 823415 772807 726044 683064 643906
62666F43906l5366l2137k9734k7680k5432k3078k0941j8887j6608j4307j2521
$$ 643906 608540 576403 546669 518989 493557 470479 449538 430651 414043 399736 387215
62655C87215j1397j0558r596q357o946n757n329n655n908n306m079l055k470j863
$$ 387215 375818 365260 355664 347307 340361 334604 329275 323620 317712 312406 308327 305272 302802 300939
62641C00939j086o66j028j943k921l665l920l441k342j155l40k1k08p92j296j182
$$ 300939 299853 299187 298159 296216 293295 289630 285710 282269 279927 278772 278432 278411 278203 277411 276115 274933
62625B74933n81j18J05O76J711K345J935J186J273K244L069L156L010L360M205
$$ 274933 274352 274234 274339 275015 276726 279071 281006 282192 283465 285709 288778 291934 294944 298304 302509
62610C02509M968N325N637O594Q326J0031J0755J0648J0870J2122J3865J5455
$$ 302509 307477 312802 318439 325033 333359 343390 354145 364793 375663 387785 401650 417105
62598D17105J7264K0013K3433K6475K8538K9703L0088K9856K9640K9889K9746
$$ 417105 434369 454382 477815 504290 532828 562531 592619 622475 652115 682004 711750
62587G11750K7686K3522J8755J4561J0405N190j016p184j2619j7216k0867k3465
$$ 711750 739436 762958 781713 796274 806679 811869 810853 803669 791050 773834 752967 729502
62575G29502k5401k7264k9059l0128k9999k8833k7100k5100k2987k0978j9328
$$ 729502 704101 676837 647778 617650 587651 558818 531718 506618 483631 462653 443325
62564D43325j8120j7127j5948j4444j2939j1808j0920r860q632p678p060o242
$$ 443325 425205 408078 392130 377686 364747 352939 342019 332159 323527 315849 308789 302547
62552C02547m950l758l373l736m225m418m206l555k698k256k565l075k986k273
$$ 302547 297597 293839 290466 286730 282505 278087 273881 270326 267628 265372 262807 259732 256746 254473
62538B54473j486p87R0J031J538J656K015K791L368L480L895N399P572R219R780
$$ 254473 252987 252200 252290 253321 254859 256515 258530 261321 264689 268169 272064 277463 285035 294254 304034
62523C04034R793J0203J1684J4335J7537K0307K2216K3858K5919K8092K9559L0348
$$ 304034 313827 324030 335714 350049 367586 387893 410109 433967 459886 487978 517537 547885
62511E47885L1318L2664L3302L2187K9576K6344K2666J8105J2661O913J153m773
$$ 547885 579203 611867 645169 677356 706932 733276 755942 774047 786708 793621 794774 790001
62499G90001j0677j5839j9971k3599k7122k9980l1417l1572l1138l0266k8626
$$ 790001 779324 763485 743514 719915 692793 662813 631396 599824 568686 538420 509794
62488E09794k6399k4344k2703k0910j8635j6410j4705j3086j1023r015q041q067
$$ 509794 483395 459051 436348 415438 396803 380393 365688 352602 341579 332564 324523 316456
62476C16456p936o796n014l498k724k678l148l657l614k890k081j746j661j207
$$ 316456 308520 301724 296710 293212 290488 287810 284662 281005 277391 274501 272420 270674 269013 267806
62462B67806k93N77J045J225J263J093P92P51J235K033K823L595M385M901M839
$$ 267806 267513 268090 269135 270360 271623 272716 273508 274259 275494 277527 280350 283945 288330 293231 298070
62447B98070M438M254M403M511M417M429M630M489L470J734j46j813l158m050
$$ 298070 302508 306762 311165 315676 320093 324522 329152 333641 337111 338845 338699 336886 333728 329678
62433C29678m536n006n591n687m809l718l760m973n858n332m011k990k264j245
$$ 329678 325142 320136 314545 308858 304049 300331 296571 291598 285740 280408 276397 273407 271143 269898
62419B69898j82N1n77j057o91J91R75J456J572J211O80P73J922L570M797N274
$$ 269898 269716 269767 269190 268133 267442 267633 268608 270064 271636 272847 273527 274300 276222 279792 284589 289863
62403B89863N304N198N049M929N007N420O188P119P820Q012P909P937Q050P737
$$ 289863 295167 300365 305414 310343 315350 320770 326958 334077 341897 349909 357818 365755 373805 381542
62389C81542O885O054N579M886L364J507M30M28P42Q28J049J840K850L426L580
$$ 381542 388427 394481 400060 404946 408310 409817 410247 410675 411417 412245 413294 415134 417984 421410 424990
62374D24990L962N074O918R231J1714J4044J6119J8313K1236K5055K9243L3101
$$ 424990 428952 434026 440944 450175 461889 475933 492052 510365 531601 556656 585899 619000
62362F19000L6425L9529M2701M5705M7817M8316M6925M3854L9506L4249K8485
$$ 619000 655425 694954 737655 783360 831177 879493 926418 970272 1009778 1044027 1072512
62351A072512K2707J7270J2112O853J255m497r989j4966j9526k3972k8458l2693
$$ 1072512 1095219 1112489 1124601 1131454 1132709 1128212 1118223 1103257 1083731 1059759 1031301 998608
62339I98608l6026l7949l8637l8765l8773l8399l7076l4673l1644k8634k6097
$$ 998608 962582 924633 885996 847231 808458 770059 732983 698310 666666 638032 611935
62328F11935k4223k2975k2104k1327k0553j9793j8847j7361j5291j3136j1461
$$ 611935 587712 564737 542633 521306 500753 480960 462113 444752 429461 416325 404864
62317D04864j0323r331q221p096o094n006l466j512K68J308J762K351L437M442
$$ 404864 394541 385210 376989 369893 363799 358793 355327 353815 354083 355391 357153 359504 362941 367383
62303C67383M533L755L074L229L918M283L845K750J397K24l92m51m90r68j597
$$ 367383 371916 375671 378745 381974 385892 390175 394020 396770 398167 398391 397999 397548 397058 396090 394493
62288C94493j683j161p81j051j464j132K5J197J762J968K461L375M237M760N373
$$ 394493 392810 391649 390868 389817 388353 387221 387246 388443 390205 392173 394634 398009 402246 407006 412379
62273D12379O726Q772J0787J2368J3997J6228J8696K0557K1917K4092K8116L3412
$$ 412379 419105 427877 438664 451032 465029 481257 499953 520510 542427 566519 594635 628047
62261F28047L8405M2205M5155M7888N0230N1268N0133M6538M0759L3335K4831
$$ 628047 666452 708657 753812 801700 851930 903198 953331 999869 1040628 1073963 1098794
62250A098794J5797O831j459q743j5133k0948k6276l0894l4660l7731m0276m2167
$$ 1098794 1114591 1121422 1119963 1111220 1096087 1075139 1048863 1017969 983309 945578 905302 863135
62238H63135m3097m3052m2271m0787l8263l4581l0369k6570k3511k0817j8190
$$ 863135 820038 776986 734715 693928 655665 621084 590715 564145 540634 519817 501627
62227E01627j5830j3856j1870r640p774p001o905o202m439k666k014k222k151
$$ 501627 485797 471941 460071 450431 442657 435656 428751 422549 418110 415444 413430 411208 409057
62214D09057j339k87N85J470K546L455L797L787L990M608N279N586N544N564O088
$$ 409057 407718 407431 408016 409486 412032 415487 419284 423071 427061 431669 436948 442534 448078 453642 459730
62199D59730P260Q886J0616J2165J3430J4598J6111J8324K1026K3446K4945K5616
$$ 459730 466990 475876 486492 498657 512087 526685 542796 561120 582146 605592 630537 656153
62187F56153K5934K5976K5325K3689K1169J7793J3374Q200L474M86o00n76M1J610
$$ 656153 682087 708063 733388 757077 778246 796039 809413 817613 821087 821573 820973 820397 820438 822048
62173H22048M533Q426J2518J6593K0976K5598K9506L1583L1535K9984K7619K4496
$$ 822048 826581 835007 847525 864118 885094 910692 940198 971781 1003316 1033300 1060919 1085415
62161A085415K0223J4713Q615K928j676n168p969j0645j3730j7401k1172k4123
$$ 1085415 1105638 1120351 1128966 1131894 1130218 1125050 1117081 1106436 1092706 1075305 1054133 1030010
62149A030010k5739k6360k6616k6527k5548k3395k0477j7452j4764j2646j1136
$$ 1030010 1004271 977911 951295 924768 899220 875825 855348 837896 823132 810486 799350
62138G99350r890q347o464m942m340m203l520j948r1J348K241K751K908K805K882
$$ 799350 789460 781113 774649 769707 765367 761164 757644 755696 755605 756953 759194 761945 764853 767658 770540
62123G70540L654N149O885Q434R865J1534J3472J5148J5925J5743J5101J4402
$$ 770540 774194 779343 786228 794662 804527 816061 829533 844681 860606 876349 891450 905852
62111I05852J3524J2278J1010J0377J0626J1411J2185J2554J2225J1164R812Q890
$$ 905852 919376 931654 942664 953041 963667 975078 987263 999817 1012042 1023206 1033018 1041908
62099A041908Q726R008R275R476R994J1271J3440J6105J8610K0653K2580K4754
$$ 1041908 1050634 1059642 1068917 1078393 1088387 1099658 1113098 1129203 1147813 1168466 1191046 1215800
62087A215800K6898K8501K9781L1585L4285L7348M0130M2462M4245M5139M5084
$$ 1215800 1242698 1271199 1300980 1332565 1366850 1404198 1444328 1486790 1531035 1576174 1621258
62076A621258M4554M3778M2287L9737L6763L4375L2802L1563L0338K9115K7716
$$ 1621258 1665812 1709590 1751877 1791614 1828377 1862752 1895554 1927117 1957455 1986570 2014286
62065B014286K5875K3692K1385J8619J4807J0121N578J953q63l332n625p725r744
$$ 2014286 2040161 2063853 2085238 2103857 2118664 2128785 2134363 2136316 2135453 2132121 2126496 2118771 2109027
62052B109027j1840j4064j6408j8786k0855k2113k2246k1231j9264j6771j4366
$$ 2109027 2097187 2083123 2066715 2047929 2027074 2004961 1982715 1961484 1942220 1925449 1911083
62041A911083j2337j0395q295o466n418m782l758k402j585j510j244k11Q13P75
$$ 1911083 1898746 1888351 1880056 1873590 1868172 1863390 1859632 1857230 1855645 1854135 1852891 1852680 1853493 1854268
62027A854268k09j175j621j775j955k262k744l295l515l142k420j737j104l48
$$ 1854268 1854059 1852884 1851263 1849488 1847533 1845271 1842527 1839232 1835717 1832575 1830155 1828418 1827314 1826966
62013A826966N39J615L139M999O430O961P309Q526J0542J2374J3624J4745J5786
$$ 1826966 1827505 1829120 1832259 1837258 1843688 1850649 1857958 1866484 1877026 1889400 1903024 1917769 1933555
62000A933555J5879J4437J2019R514P028M061L26m113r090j4178j8555k1598k3537
$$ 1933555 1949434 1963871 1975890 1985404 1992432 1996493 1996819 1992706 1983616 1969438 1950883 1929285 1905748
61987A905748k5056k6393k7138k6902k5793k4199k2408k0549j8760j7326j6581
$$ 1905748 1880692 1854299 1827161 1800259 1774466 1750267 1727859 1707310 1688550 1671224 1654643
61976A654643j6567j6786j6511j5490j4201j3262j2808j2586j2413j2252j2056
$$ 1654643 1638076 1621290 1604779 1589289 1575088 1561826 1549018 1536432 1524019 1511767 1499711
61965A499711j1839j1831j2170j2468j2068j0876r595q938q816q559p822p002
$$ 1499711 1487872 1476041 1463871 1451403 1439335 1428459 1418864 1409926 1401110 1392551 1384729 1377727
61953A377727o693o926p103o615n428l957k537j165K48J572K572L181L552L909
$$ 1377727 1371034 1364108 1357005 1350390 1344962 1341005 1338468 1337303 1337551 1339123 1341695 1344876 1348428 1352337
61939A352337M400N020N503N434M708L884L739M366M981M781L855K979K604K377
$$ 1352337 1356737 1361757 1367260 1372694 1377402 1381286 1385025 1389391 1394372 1399153 1403008 1405987 1408591 1410968
61925A410968J738P17l7Q1J132K831N039P984J1996J6999K2290K6982L0854L4718
$$ 1410968 1412706 1413423 1413386 1413467 1414599 1417430 1422469 1430453 1442449 1459448 1481738 1508720 1539574 1574292
61911A574292L9672M5910N2398N7975O2561O7173P2810P9634Q7283R5650J05063
$$ 1574292 1613964 1659874 1712272 1770247 1832808 1899981 1972791 2052425 2139708 2235358 2340421
61900B340421J15767J27463J39465J51144J62146J72167J80557J86058J86798
$$ 2340421 2456188 2583651 2723116 2874260 3036406 3208573 3389130 3575188 3761986
61891C761986J80563J65435J40665J07109O6831K2232k4379p0477j13065j49275
$$ 3761986 3942549 4107984 4248649 4355758 4422589 4444821 4420442 4349965 4236900 4087625
61881D087625j77337j96925k08552k12938k10972k03944j93434j80872j67308
$$ 4087625 3910288 3713363 3504811 3291873 3080901 2876957 2683523 2502651 2335343
61872B335343j53509j40073j27292j15098j03321r2102q1885p2975o5172n7916
$$ 2335343 2181834 2041761 1914469 1799371 1696050 1603948 1522063 1449088 1383916 1326000
61862A326000n0790m3793l7191l1207k5877k1033j6462j2177q450n485l031n60
$$ 1326000 1275210 1231417 1194226 1163019 1137142 1116109 1099647 1087470 1079020 1073535 1070504 1069944
61850A069944K080M387N659N611M489K802J014p13k596m926p490r589j0713j0981
$$ 1069944 1072024 1076411 1082070 1087681 1092170 1094972 1095986 1095273 1092677 1087751 1080261 1070672 1059959 1048978
61836A048978j0719r919q445o415m025j274J707M324O061P088P706P417N433K077
$$ 1048978 1038259 1028340 1019895 1013480 1009455 1008181 1009888 1014212 1020273 1027361 1035067 1042484 1047917 1049994
61822A049994j341m255p461j1412j4947j6601j6629j6601j7269j7825j7277j5698
$$ 1049994 1048653 1044398 1036937 1025525 1010578 993977 977348 960747 943478 925653 908376 892678
61810H92678j3800j1957j0066p917n399k548L75L046N372P464R354J1015J2617
$$ 892678 878878 866921 856855 848938 843539 840991 841366 844412 849784 857248 866602 877617 890234
61797H90234J4419J6444J8477K0525K2849K5570K8556L1726L5080L8397M1368
$$ 890234 904653 921097 939574 960099 982948 1008518 1037074 1068800 1103880 1142277 1183645
61786A183645M4199M7651N2313N8161O4937P2431Q0183Q7629R5004J03631J14610
$$ 1183645 1227844 1275495 1327808 1385969 1450906 1523337 1603520 1691149 1786153 1889784 2004394
61775B004394J27611J41605J56486J73104J91825K11956K32727K53998K75571
$$ 2004394 2132005 2273610 2430096 2603200 2795025 3006981 3239708 3493706 3769277
61766C769277K96493L15527L31689L43554L48457L43142L25288K93904K48527
$$ 3769277 4065770 4381297 4712986 5056540 5404997 5748139 6073427 6367331 6615858
61757F615858J89166J17593L8259m2771j19903j89110k47633k93533l25837l44885
$$ 6615858 6805024 6922617 6960876 6918105 6798202 6609092 6361459 6067926 5742089 5397204
61747E397204l52097l49394l38747l22119l01581k79214k56685k34829k13735
$$ 5397204 5045107 4695713 4356966 4034847 3733266 3454052 3197367 2962538 2748803
61738B748803j93434j74377j57178j41935j28135j15227j03124r2112q2465p4164
$$ 2748803 2555369 2380992 2223814 2081879 1953744 1838517 1735393 1643281 1560816 1486652
61728A486652o6797n9786n2915m6643m1517l7238l2880k8248k4460k2615k2316
$$ 1486652 1419855 1360069 1307154 1260511 1218994 1181756 1148876 1120628 1096168 1073553 1051237
61717A051237k2217k1790k1749k2651k3915k4600k4504k4027k3330k2238k0766
$$ 1051237 1029020 1007230 985481 962830 938915 914315 889811 865784 842454 820216 799450
61706G99450j9261j8013j6988j6009j4978j3935j2952j1995j0906r659q562p924
$$ 799450 780189 762176 745188 729179 714201 700266 687314 675319 664413 654754 646192 638268
61694F38268p597p188o780o841p320p425o789o248o727p765p960o821n394m908
$$ 638268 630671 623483 616703 609862 602542 595117 588328 582080 575353 567588 559628 552807 547413 542505
61680E42505n418o065o092n379m374l738l790m138m144l819l758m117m244l684
$$ 542505 537087 531022 524930 519551 515177 511439 507649 503511 499367 495548 491790 487673 483429 479745
61666D79745k947k696k695k250j469j199j680k039j543o88n25j177j684j259k05
$$ 479745 476798 474102 471407 469157 467688 466489 464809 462770 461227 460539 460014 458837 457153 455894 455689
61651D55689O65J081J383J777K031K017K094K604L264L448L001K326J717J033
$$ 455689 456354 457435 458818 460595 462626 464643 466737 469341 472605 476053 479054 481380 483097 484130
61637D84130K24l31l00J66P60J522K553L486L787L589L704M654O059P177P699
$$ 484130 484354 484023 483723 483889 484649 486171 488724 492210 495997 499586 503290 507944 514003 521180 528879
61622E28879P815P747P504O897N558L137k23l705o410q150r396j0514j1403j1907
$$ 528879 536694 544441 551945 558842 564400 567537 567314 563609 557199 549049 539653 529139 517736 505829
61608E05829j2138j2164j1737j0710r550q897q667q080o740n298m671m875n091
$$ 505829 493691 481527 469790 459080 449530 440633 431966 423886 417146 411848 407177 402302 397211
61595C97211m712l947l294k834k277j510q48o86j009j339j172n14J39L31J40M4
$$ 397211 392499 388552 385258 382424 380147 378637 377789 377103 376094 374755 373583 373069 373208 373539 373679 373723
61579C73723M76J534K952M131M447L897L296L418L976M087L720M006N689P894
$$ 373723 374199 375733 378685 382816 387263 391160 394456 397874 401850 405937 409657 413663 419352 427246
61565D27246R109R080Q937R554J0497J0896J0667J0401J0398J0395J0133R782
$$ 427246 436355 445435 454372 463926 474423 485319 495986 506387 516785 527180 537313 547095
61553E47095R627R686R786R824R742R375Q639P815P310P060O475N300M170L880
$$ 547095 556722 566408 576194 586018 595760 605135 613774 621589 628899 635959 642434 647734 651904 655784
61539F55784M159L801K152p7j832l071m502o265p634q082q019q083q202p794o684
$$ 655784 659943 663744 665896 665819 663987 660916 656414 650149 642515 634433 626414 618331 610129 602335 595651
61524E95651n308m029k708j152M22J678K745M092N887P803R604J1482J3587J5646
$$ 595651 590343 586314 583606 582454 582876 584554 587299 591391 597278 605081 614685 626167 639754 655400
61510F55400J7457J9473K2300K5736K8972L1800L4955L9008M3585M8158N2973
$$ 655400 672857 692330 714630 740366 769338 801138 836093 875101 918686 966844 1019817
61499A019817N8528O4476O9780P3831P6781P8802P9603P8697P5574O9540O0046
$$ 1019817 1078345 1142821 1212601 1286432 1363213 1442015 1521618 1600315 1675889 1745429 1805475
61488A805475M7450L3069J8200L388j1113k4620l6143m5121n1625n5970n8368
$$ 1805475 1852925 1885994 1904194 1907582 1896469 1871849 1835706 1790585 1738960 1682990 1624622
61477A624622n9000n8154n6157n3217m9446m5088m0591l6295l2038k7425k2571
$$ 1624622 1565622 1507468 1451311 1398094 1348648 1303560 1262969 1226674 1194636 1167211 1144640
61466A144640j8234j4906j2112r070n771k846m58J975M846P819J0455J2855J5310
$$ 1144640 1126406 1111500 1099388 1090318 1084547 1081701 1081243 1083218 1088064 1095883 1106338 1119193 1134503
61453A134503J7712J9752K1373K2761K3980K4902K5377K5306K4703K3881K3395
$$ 1134503 1152215 1171967 1193340 1216101 1240081 1264983 1290360 1315666 1340369 1364250 1387645
61442A387645K3593K4291K4887K4702K3299K0774J7791J5052J2727J0616Q719
$$ 1387645 1411238 1435529 1460416 1485118 1508417 1529191 1546982 1562034 1574761 1585377 1594096
61431A594096P123N533L567J551K40l85j203k553l672m043m422n698p478q741
$$ 1594096 1601219 1606752 1610319 1611870 1612110 1611725 1610522 1607969 1604297 1600254 1595832 1590134 1582656 1573915
61417A573915r422j0271j1445j2289j2410j2143j1905j1803j1844j1820j1182
$$ 1573915 1564493 1554222 1542777 1530488 1518078 1505935 1494030 1482227 1470383 1458563 1447381
61406A447381r764q514q567r685j0604j0836j1103j1795j2230j1877j1249j0896
$$ 1447381 1437617 1429103 1420536 1410851 1400247 1389411 1378308 1366513 1354283 1342406 1331157 1320261
61394A320261j0450r349p831o372m687k069J667O176J1109J6095K0694K5018K9972
$$ 1320261 1309811 1300462 1292631 1286259 1281572 1279503 1281170 1287346 1298455 1314550 1335244 1360262 1390234
61381A390234L6201M3121M9740N5989O2418O8938P4780P9637Q3827Q7259Q9126
$$ 1390234 1426435 1469556 1519296 1575285 1637703 1706641 1781421 1861058 1944885 2032144 2121270
61370B121270Q8804Q6281Q1448P3717O2818M9422L4598J9127L684j0757k3299
$$ 2121270 2210074 2296355 2377803 2451520 2514338 2563760 2598358 2617485 2621169 2610412 2587113
61359B587113l3751m2637n0603n7942o4477o9812p3856p7079p9880q1812q1951
$$ 2587113 2553362 2510725 2460122 2402180 2337703 2267891 2194035 2116956 2037076 1955264 1873313
61348A873313q0174p7396p4308p0535o5587n9980n4718m9988m5279m0621l6760
$$ 1873313 1793139 1715743 1641435 1570900 1505313 1445333 1390615 1340627 1295348 1254727 1217967
61337A217967l3833l0769k6495k1256j6218j2068q618n519k698j0K962O387R753
$$ 1217967 1184134 1153365 1126870 1105614 1089396 1077328 1068710 1063191 1060493 1060483 1063445 1069832 1079585
61324A079585J2305J3856J4930J6216J7986J9999K1684K2477K2284K1652K1312
$$ 1079585 1091890 1105746 1120676 1136892 1154878 1174877 1196561 1219038 1241322 1262974 1284286
61313A284286K1428K1536K1167K0177J8388J5379J1138O521K543o80l743o863
$$ 1284286 1305714 1327250 1348417 1368594 1386982 1402361 1413499 1420020 1422563 1421883 1418140 1411277
61301A411277r522j1362j2684j3853j4678j4856j4579j4293j4103j3942j4015
$$ 1411277 1401755 1390393 1377709 1363856 1349178 1334322 1319743 1305450 1291347 1277405 1263390
61290A263390j4541j5145j5112j4257j3054j1870j0596r147p791o693n545m049
$$ 1263390 1248849 1233704 1218592 1204335 1191281 1179411 1168815 1159668 1151877 1145184 1139639 1135590
61278A135590k509j557j455j964k787l758m593m835m193k873j462n53l22n09q21
$$ 1135590 1133081 1131524 1130069 1128105 1125318 1121560 1116967 1112132 1107939 1105066 1103604 1103051 1102729 1102220 1101399
61263A101399j396k647m531o264p098p122o938o613n501l147J14L686P440J1539
$$ 1101399 1100003 1097356 1092825 1086561 1079463 1072341 1065403 1058790 1053289 1050142 1050256 1053942 1061382 1072921
61249A072921J5845J9950K3805K7868L2419L6934M0320M1772M1403L9915L7722
$$ 1072921 1088766 1108716 1132521 1160389 1192808 1229742 1270062 1311834 1353237 1393152 1430874
61238A430874L4376K9051K1584J2820L750n461j5276k5600l5176m2413m6728m8868
$$ 1430874 1465250 1494301 1515885 1528705 1532455 1526994 1511718 1486118 1450942 1408529 1361801 1312933
61226A312933m9965n0410m9734m7449m3811l9740l6069l3027l0408k8102k6265
$$ 1312933 1262968 1212558 1162824 1115375 1071564 1031824 995755 962728 932320 904218 877953
61215H77953k4970k3839k2136j9418j6076j3034j0761q787o396l620j016J416
$$ 877953 852983 829144 807008 787590 771514 758480 747719 738932 732536 728916 727900 729316
61203G29316M343P818J0609J1561J1114J0673J0596R845P744N054K876J284k50
$$ 729316 733659 741477 752086 763647 774761 785434 796030 805875 813619 818673 821549 822833 822583
61190H22583j693k591l009l498m202m755n135n845p059q202q728q877r286j0204
$$ 822583 820890 818299 815290 811792 807590 802835 797700 791855 784796 776594 767866 758989 749703 739499
61176G39499j1314j2072j1985j0949r627r135r891j1002j1252j0494r642r350
$$ 739499 728185 716113 704128 693179 683552 674417 664526 653524 642272 631778 622136 612786
61164F12786r299q845p883o769n742m690l365j691L4J136R69m80k562m715p025
$$ 612786 603487 594642 586759 579990 574248 569558 566193 564502 564536 565672 566641 566161 563599 558884 551859
61149E51859r819j2834j5136j5949j5392j4302j3449j2945j2354j1235r635q002
$$ 551859 542040 529206 514070 498121 482729 468427 454978 442033 429679 418444 408809 400807
61137D00807o715n796n074m487m052l668l143k400j473l39J068K550L655M095
$$ 400807 394092 388296 383222 378735 374683 371015 367872 365472 363999 363660 364728 367278 370933 375028
61123C75028M116M263M857N771O728P647Q691R974J1290J2155J2181J1487J0614
$$ 375028 379144 383407 388264 394035 400763 408410 417101 427075 438365 450520 462701 474188 484802
61110D84802J0015R539Q535O510L735J072q90k384l980n601o496o314n807n960
$$ 484802 494817 504356 512891 519401 523136 524208 523318 520934 516954 511353 504857 498543 492736 486776
61096D86776o721p178o870o287n928n575m887m085l606l421l296l365l830m319
$$ 486776 480055 472877 466007 459720 453792 448217 443330 439245 435639 432218 428922 425557 421727 417408
61082D17408m159l328k546k350k563k754k705k343j676r78o35o36n57j90J94L81
$$ 417408 413249 409921 407375 405025 402462 399708 397003 394660 392984 392006 391371 390735 390178 389988 390182 390563
61066C90563N19P16Q19Q79J365K428L392L560L273L610M999O640P357O729N327
$$ 390563 391082 391798 392617 393496 394861 397289 400681 404241 407514 411124 416123 422763 430120 436849 442176
61051D42176M134L769M102M540M735M867N266N940O653P230P590P752Q000Q702
$$ 442176 446310 450079 454181 458721 463456 468323 473589 479529 486182 493412 501002 508754 516754 525456
61037E25456R781J0707J1295J2132J3764J5922J8087K0364K3095K5948K8180K9657
$$ 525456 535237 545944 557239 569371 583135 599057 617144 637508 660603 686551 714731 744388
61025G44388L0861L1973L2858L3879L5884L9223M3662M9268N6453O4953P3771
$$ 744388 775249 807222 840080 873959 909843 949066 992728 1041996 1098449 1163402 1237173
61014A237173Q2493R1758J02317J14802J30821J52720J81412K15683K54736L00107
$$ 1237173 1319666 1411424 1513741 1628543 1759364 1912084 2093496 2309179 2563915 2864022
61004B864022L54070M18078M94938N91098P14160Q68741J055816J269563J482745
$$ 2864022 3218092 3636170 4131108 4722206 5436366 6305107 7360923 8630486 10113231
60995A0113231J631675J630093J420810J027342N54209J30712j51472k58936k01759
$$ 10113231 11744906 13374999 14795809 15823151 16377360 16508072 16356600 16097664 15895905
60986A5895905k3417J91951L26576K76295J1880m00690q41638j203464j430401
$$ 15895905 15872488 16064439 16391015 16667310 16679190 16278500 15436862 14233398 12802997
60977A2802997j516577j485327j372334j215397j045826q83125p36464o09557
$$ 12802997 11286420 9801093 8428759 7213362 6167536 5284411 4547947 3938390
60969C938390n02995m14362l39962k77690k27247j87886j57489j34028j16370
$$ 3938390 3435395 3021033 2681071 2403381 2176134 1988248 1830759 1696731 1580361
60960A580361j03238r2719q3443p5281o8268o1751n5221m9082m3763l8792l3661
$$ 1580361 1477123 1384404 1300961 1225680 1157412 1095661 1040440 991358 947595 908803 875142
60949H75142k9145k6621k6252k6723k6756k6157k5295k4340k3306k2298k1320
$$ 875142 845997 819376 793124 766401 739645 713488 688193 663853 640547 618249 596929
60938E96929k0164j8793j7568j6837j6427j5747j4340j2344j0406r143q543q027
$$ 596929 576765 557972 540404 523567 507140 491393 477053 464709 454303 445160 436617 428590
60926D28590p233o525o450o854p000o528n767n051m292l482l035l207l596l675
$$ 428590 421357 414832 408382 401528 394528 388000 382233 377182 372890 369408 366373 363166 359570 355895
60912C55895l535l490l336k703k027k285l555m651m557l629k816k280j570q18
$$ 355895 352360 348870 345534 342831 340804 338519 334964 330313 325756 322127 319311 317031 315461 314643
60898C14643p40j385j811j423r15j224k025k094r96M20J275J635J925K045J711
$$ 314643 313903 312518 310707 309284 308369 307145 305120 303026 302030 302450 303725 305360 307285 309330 311041
60883C11041J264J363J938K208J882J656K165K953L097K481J896J856J989J699
$$ 311041 312305 313668 315606 317814 319696 321352 323517 326470 329567 332048 333944 335800 337789 339488
60869C39488R60J93l34o18p27p31p41p74o84m21k28l29n66n98l79j61l9J79O24
$$ 339488 340448 340641 340307 339689 338962 338231 337490 336716 336032 335611 335383 335054 334488 333890 333511 333350 333311 333490 334114
60850C34114J203J836K574L302L651L433K952K712K891L333L833M165M010L255
$$ 334114 335317 337153 339727 343029 346680 350113 353065 355777 358668 362001 365834 369999 374009 377264
60836C77264K366K069K547L164L185K621K180K499L547M767N609N916N846N569
$$ 377264 379630 381699 384246 387410 390595 393216 395396 397895 401442 406209 411818 417734 423580 429149
60822D29149N104M427L625K895K430K363K664L016K972K429J808J506J300O78
$$ 429149 434253 438680 442305 445200 447630 449993 452657 455673 458645 461074 462882 464388 465688 466366
60808D66366l45j156j421j489j783k246k743l532m773n892o119n565n113n143
$$ 466366 466021 464865 463444 461955 460172 457926 455183 451651 446878 440986 434867 429302 424189 419046
60794D19046n052m256l129k466k418k432k065j359n37K84R85J443J710J944K187
$$ 419046 413994 409738 406609 404143 401725 399293 397228 395869 395332 395616 396601 398044 399754 401698 403885
60779D03885K382K625L127L857M526M980N377N823O069N857N365N078N142N141
$$ 403885 406267 408892 412019 415876 420402 425382 430759 436582 442651 448508 453873 458951 464093 469234
60765D69234M650L869L468L801M422M554M008L363L150L144K750J986J583J980
$$ 469234 473884 477753 481221 485022 489444 493998 498006 501369 504519 507663 510413 512399 513982 515962
60751E15962K670K798K288J877K117K698K897K402J410J75j220k575l473l664
$$ 515962 518632 521430 523718 525595 527712 530410 533307 535709 537119 537294 536074 533499 530026 526362
60737E26362l437l316l472l612l526l418l578l933m089l780l016j982j019n59
$$ 526362 522925 519609 516137 512525 508999 505581 502003 498070 493981 490201 487185 485203 484184 483625
60723D83625p78j278j436j117p92q82j311j753j991j839j160k11L05n3r20j620
$$ 483625 482847 481569 480133 479016 478224 477342 476031 474278 472287 470448 469288 469077 469382 469329 468409 466789
60707D66789j997k342k643k515j891j323j397k095k857l064k444j302l57j35m68
$$ 466789 464792 462450 459807 457292 455401 454078 452681 450586 447729 444665 442221 440919 440562 440427 439959
60692D39959q03r71j246j734k160k398k672l063l270l149l058l363l944m480m828
$$ 439959 439156 438185 436939 435205 433045 430647 427975 424912 421642 418493 415435 412072 408128 403648 398820
60677C98820m854m336l485l099l640m486m717m321l998m001l950l672l406l122
$$ 398820 393966 389630 386145 383046 379406 374920 370203 365882 361884 357883 353933 350261 346855 343733
60663C43733k446j439p19n40m06Q3P03J251K033L104L742L366K621K694L789M987
$$ 343733 341287 339848 339129 338589 338183 338266 338969 340220 342253 345357 349099 352465 355086 357780 361569 366556
60647C66556N575N666N517M932L716K247J219J027J552K350K918L034K961L237
$$ 366556 372131 377797 383314 388246 391962 394209 395428 396455 398007 400357 403275 406309 409270 412507
60633D12507M098N255O230O727O701O326O039O259O935P543P725P790Q360R629
$$ 412507 416605 421860 428090 434817 441518 447844 453883 460142 467077 474620 482345 490135 498495 508124
60619E08124J1094J2045J2123J1520J0750J0228R971R598Q633O836M342J586r15
$$ 508124 519218 531263 543386 554906 565656 575884 585855 595453 604086 610922 615264 616850 615935
60606F15935k891m527o277q351j0411j1863j2387j2113j1375j0461r602q996q672
$$ 615935 613044 608517 602240 593889 583478 571615 559228 547115 535740 525279 515677 506681 498009
60593D98009q403p910p158o360n656m924l983k865j810j054p26p95r69p46J57
$$ 498009 489606 481696 474538 468178 462522 457598 453615 450750 448940 447886 447160 446365 445396 444650 444807
60578D44807J397K273K467K319K347K727L313L868M126L879L296K952L324M278
$$ 444807 446204 448477 450944 453263 455610 458337 461650 465518 469644 473523 476819 479771 483095 487373
60564D87373N271N885O053N876N483M968M274L286K234J795K419L681M691N112
$$ 487373 492644 498529 504582 510458 515941 520909 525183 528469 530703 532498 534917 538598 543289 548401
60550E48401N414O099P090Q102R220J0887J3395J6544J9681K1988K2927K2537
$$ 548401 553815 559914 567004 575106 584326 595213 608608 625152 644833 666821 689748 712285
60538G12285K1173J8882J5236R933L363l548r980j5468j9673k2218k2864k1767
$$ 712285 733458 752340 767576 777509 780872 777324 767344 751876 732203 709985 687121 665354
60526F65354j9423j6371j2984r536o348l740j819l94P72J697K201K156J679J143
$$ 665354 645931 629560 616576 607040 600692 596952 595133 594739 595511 597208 599409 601565 603244 604387
60512F04387J047J763L319N502Q206J1510J5353J9336K3053K6569L0412L5161
$$ 604387 605434 607197 610516 616018 624224 635734 651087 670423 693476 720045 750457 785618
60500G85618M0999M7432N3360N7918O1424O5252P0488P7107Q4861R4412J06908
$$ 785618 826617 874049 927409 985327 1046751 1112003 1182491 1259598 1344459 1438871 1545779
60489A545779J22686J41097J61315J82213K01118K13458K14325K00368J70605
$$ 1545779 1668465 1809562 1970877 2153090 2354208 2567666 2781991 2982359 3152964
60480C152964J26365P1016R302n3608j12509j62196j98379k19449k26921k23727
$$ 3152964 3279329 3350345 3359647 3306039 3193530 3031334 2832955 2613506 2386585 2162858
60470B162858k12424j95240j74950j54474j35569j18473j02847q8648p6191o5808
$$ 2162858 1950434 1755194 1580244 1425770 1290201 1171728 1068881 980233 904042 838234
60460H38234n7531n0824m4731l8640l2789k7786k3815k0602j7956j5854j4077
$$ 838234 780703 729879 685148 646508 613719 585933 562118 541516 523560 507706 493629
60449D93629j2312j0600r322q652q283p796p020o045n090m386m014l866l845m066
$$ 493629 481317 470717 461395 452743 444460 436664 429644 423599 418509 414123 410109 406243 402398 398332
60435C98332m624n319n811n973n918n780n617n448n190m739m123l445k610j405
$$ 398332 393708 388389 382578 376605 370687 364907 359290 353842 348652 343913 339790 336345 333735 332330
60421C32330K7J192J839K190K299J816P21l23q58j277j878j957q10Q31J538J233
$$ 332330 332357 333549 335388 337578 339877 341693 342414 342091 341233 339956 338078 336121 335311 336142 337680 338913
60405C38913J218K114L027L157L050L570M520N045M835M201L506L125L519M594
$$ 338913 340131 342245 345272 348429 351479 355049 359569 364614 369449 373650 377156 380281 383800 388394
60391C88394N347M875L542K416J753Q43o36j896k097j559j378k020k797k812k078
$$ 388394 393741 398616 402158 404574 406327 407170 406534 404638 402541 400982 399604 397584 394787 391975 389897
60376C89897j388j266j497j765k212k949l399k873j673q22o60m02N53J710K329
$$ 389897 388509 387243 385746 383981 381769 378820 375421 372548 370875 370053 369393 368991 369544 371254 373583
60361C73583K543K927L447L660L652L911M351M277L507K749K592K689K426J904
$$ 373583 376126 379053 382500 386160 389812 393723 398074 402351 405858 408607 411199 413888 416314 418218
60347D18218J730K009K145J676P85j30j010j909k486k219j189k35n6m49o52l03
$$ 418218 419948 421957 424102 425778 426563 426433 425423 423514 421028 418809 417620 417385 417329 416880 416228 415925
60331D15925L01P33Q48P08M60L06K72K9p03j571j839j347p11m09j62L80Q43N67
$$ 415925 416226 416959 417807 418515 418975 419281 419553 419582 418879 417308 415469 414122 413411 413002 412840 413220 414063 414630
60313D14630l64j119j084m49K27O10O78M16k26j178k109k604k534k213k039k046
$$ 414630 414266 413147 412063 411614 411841 412451 413129 413545 413319 412141 410032 407428 404894 402681 400642 398596
60297C98596j975j765j629j601j430j108j059j549k177k374k137j839j556j086
$$ 398596 396621 394856 393227 391626 390196 389088 388029 386480 384303 381929 379792 377953 376397 375311
60283C75311n26l11n48p65n41q3O6j84k81L95J836L328M053L773K963K417K681
$$ 375311 374785 374474 373926 373161 372620 372537 372603 372419 372138 372533 374369 377697 381750 385523 388486 390903 393584
60266C93584L747N110O119O430O113N358M302L277K874L278L781L566K898K783
$$ 393584 397331 402441 408560 414990 421103 426461 430763 434040 436914 440192 443973 447539 450437 453220
60252D53220L442L887L386K510K202K500K936L690N360P763R923J1292J2341J3716
$$ 453220 456662 460549 463935 466445 468647 471147 474083 477773 483133 490896 500819 512111 524452 538168
60238E38168J5468J7351J9341K1471K3495K5150K6636K8523L1072L3914L6472
$$ 538168 553636 570987 590328 611799 635294 660444 687080 715603 746675 780589 817061
60227H17061L8656M0894M3309M5140M5463M4357M2813M1340L9256L5712L0884
$$ 817061 855717 896611 939920 985060 1030523 1074880 1117693 1159033 1198289 1234001 1264885
60216A264885K5627K0327J4794Q988L247k180p317j2121j6314j9540k1420k1683
$$ 1264885 1290512 1310839 1325633 1334621 1337868 1335688 1328371 1316250 1299936 1280396 1258976 1237293
60204A237293k0526j8677j6675j4312j1197p476l534P31N670J1107J6529K1874
$$ 1237293 1216767 1198090 1181415 1167103 1155906 1148430 1144896 1145627 1151297 1162404 1178933 1200807
60192A200807K7427L3021L8072M2401M6218M9321N1151N1716N1532N0481M7646
$$ 1200807 1228234 1261255 1299327 1341728 1387946 1437267 1488418 1540134 1591666 1642147 1689793
60181A689793M2640L6262K9394K2149J4569P222L54o735j4536k2104k8055l2366
$$ 1689793 1732433 1768695 1798089 1820238 1834807 1842029 1842383 1835648 1821112 1799008 1770953 1738587
60169A738587l6080l9411m1290m0958l8996l6374l3191k8922k3440j7231j0815
$$ 1738587 1702507 1663096 1621806 1580848 1541852 1505478 1472287 1443365 1419925 1402694 1391879
60158A391879m413J901Q047J3936J9406K4137K7798L0294L1682L1842L0448K7434
$$ 1391879 1387466 1389367 1397414 1411350 1430756 1454893 1482691 1512985 1544667 1576509 1606957 1634391
60146A634391K3336J8912J4395R482M154q24m568o953q472r354r348q310o466
$$ 1634391 1657727 1676639 1691034 1700516 1704670 1703846 1699278 1692325 1683853 1674499 1665151 1656841 1650375
60133A650375l980p41L231P613J2373J8107K5314L3525M1619M9060N6459O4809
$$ 1650375 1646395 1645654 1648885 1656498 1668871 1686978 1712292 1745817 1787436 1836496 1892955 1957764
60121A957764P4386Q4561R4529J04023J13130J21682J29168J35254J39984J43078
$$ 1957764 2032150 2116711 2211240 2315263 2428393 2550075 2679243 2814497 2954481 3097559
60111C097559J43516J40291J33431J23774J11846R7535Q0817O2154M2053K0753
$$ 3097559 3241075 3381366 3514797 3638571 3750417 3847952 3928769 3990923 4032976 4053729
60101D053729j297k3180m3964o3175q0599r5953j08822j18648j24717j26657j24995
$$ 4053729 4052432 4029252 3985288 3922113 3841514 3745561 3636739 3518091 3393374 3266717 3141722
60090C141722j20757j14479j06164r6219q5604p4780o3319n0971l8415k6431j5045
$$ 3141722 3020965 2906486 2800322 2704103 2618499 2543719 2480400 2429429 2391014 2364583 2349538
60079B349538m143N695J3803K0329K5750K9819L1839L1707K9894K6587K1661J5520
$$ 2349538 2345395 2351090 2364893 2385222 2410972 2440791 2472630 2504337 2534231 2560818 2582479 2597999
60067B597999R079K862l351r869j6613k3276k9510l4946l9478m3434m7123n0361
$$ 2597999 2607078 2609940 2606589 2596720 2580107 2556831 2527321 2492375 2452897 2409463 2362340 2311979
60055B311979n2891n4911n6620n7522n6958n5154n2874n0170m6413m1569l6402
$$ 2311979 2259088 2204177 2147557 2090035 2033077 1977923 1925049 1874879 1828466 1786897 1750495
60044A750495l1248k5600j9259j2912p028r72O003J3539K0692K7185L3427L9520
$$ 1750495 1719247 1693647 1674388 1661476 1654448 1653476 1659479 1673018 1693710 1720895 1754322 1793842
60032A793842M4985M9264N2018N2982N2020M9321M5197L9745L2906K4766J5598
$$ 1793842 1838827 1888091 1940109 1993091 2045111 2094432 2139629 2179374 2212280 2237046 2252644
60021B252644N781m165j3779k3050l2287m1325m9228n5056n8605o0139n9863n8063
$$ 2252644 2258425 2254260 2240481 2217431 2185144 2143819 2094591 2039535 1980930 1920791 1860928 1802865
60009A802865n5290n1837m7304m1296l4275k7160k0223j3104n770J270P756J4012
$$ 1802865 1747575 1695738 1648434 1607138 1572863 1545703 1525480 1512376 1506606 1507876 1515632 1529644
59997A529644K0345K6755L3337M0356M7610N4329O0116O5421P0536P4507P5764
$$ 1529644 1549989 1576744 1610081 1650437 1698047 1752376 1812492 1877913 1948449 2022956 2098720
59986B098720P3698O9062O2772N4952M5324L4116K2163J0199j576j3300k4995
$$ 2098720 2172418 2241480 2304252 2359204 2404528 2438644 2460807 2471006 2469430 2456130 2431135
59975B431135l6344m6747n5451o1774o5415o6539o5457o2257n7003n0214m2766
$$ 2431135 2394791 2348044 2292593 2230819 2165404 2098865 2033408 1971151 1914148 1863934 1821168
59964A821168l5102k6940j8173r692k685K859Q218J4327K0719K6425L1322L5987
$$ 1821168 1786066 1759126 1740953 1731261 1728576 1731435 1739653 1753980 1774699 1801124 1832446 1868433
59952A868433M0536M4300M6654M7574M7344M6204M4343M1802L8214L3114K6717
$$ 1868433 1908969 1953269 1999923 2047497 2094841 2141045 2185388 2227190 2265404 2298518 2325235
59941B325235K0079J4211R333N241K045K16M1J501M517R052J5016K2386L1320
$$ 2325235 2345314 2359525 2368858 2374099 2376144 2376360 2376401 2377902 2382419 2391471 2406487 2428873 2460193
59928B460193M1878N3692O6252P9370R2961J06332J18221J27722J34807J39667
$$ 2460193 2502071 2555763 2622015 2701385 2794346 2900678 3018899 3146621 3281428 3421095
59918C421095J41796J40074J33571J21985J05371Q3810N7598K7745l841l4809
$$ 3421095 3562891 3702965 3836536 3958521 4063892 4147702 4205300 4233045 4229204 4194395
59908D194395o3188q7867j08345j24248j35247j41333j42858j40283j34214j25627
$$ 4194395 4131207 4043340 3934995 3810747 3675500 3534167 3391309 3251026 3116812 2991185
59898B991185j15644j04821r3005q0132o6842n3935m1542k9274j7077n405N463
$$ 2991185 2875541 2770720 2677715 2597583 2530741 2476806 2435264 2405990 2388913 2383508 2388971
59887B388971J5761K5669L4880M3045N0277N6702O1661O3864O2473N7706N0198
$$ 2388971 2404732 2430401 2465281 2508326 2558603 2615305 2676966 2740830 2803303 2861009 2911207
59876B911207M0270K8036J3986j130j6878l3122m9333o4370p7155q7218r4437
$$ 2911207 2951477 2979513 2993499 2992369 2975491 2942369 2893036 2828666 2751511 2664293 2569856
59865B569856r8671j00055r9303r7196r3944q9406q3780p7483p0578o2925n4910
$$ 2569856 2471185 2371130 2271827 2174631 2080687 1991281 1907501 1830018 1759440 1696515 1641605
59854A641605m7406m0824l4709k8483k2197j6360j1446p771n502m487m381m991
$$ 1641605 1594199 1553375 1518666 1490183 1467986 1451626 1440180 1432409 1426907 1422420 1418039 1413048
59842A413048o235p753r012r820j0305j0281r423q167p718q725j0716j3089j5777
$$ 1413048 1406813 1399060 1390048 1380228 1369923 1359642 1350219 1342052 1334334 1325609 1314893 1301804 1286027
59829A286027j8403j9807j9427j8365j8001j8077j7391j5915j4768j4255j3434
$$ 1286027 1267624 1247817 1228390 1210025 1192024 1173947 1156556 1140641 1125873 1111618 1098184
59818A098184j1867j0357r451q474o748m766l238j829K01K723N004O920Q978J1353
$$ 1098184 1086317 1075960 1066509 1058035 1051287 1046521 1043283 1041454 1041655 1044378 1049382 1056302 1065280 1076633
59804A076633J3701J5913J8262K0759K2890K4170K4538K4138K3083K1495J9472
$$ 1076633 1090334 1106247 1124509 1145268 1168158 1192328 1216866 1241004 1264087 1285582 1305054
59793A305054J6958J3906J0587P518N071L374K539K700L842N845Q711J2404J6469
$$ 1305054 1322012 1335918 1346505 1354023 1359094 1362468 1365007 1367707 1371549 1377394 1386105 1398509 1414978
59780A414978K0270K3820K8020L3766M0988M8886N6868O5005P3599Q2879R3124
$$ 1414978 1435248 1459068 1487088 1520854 1561842 1610728 1667596 1732601 1806200 1889079 1982203
59769A982203J04600J17054J29475J40618J49361J54136J52298J40908J18500
$$ 1982203 2086803 2203857 2333332 2473950 2623311 2777447 2929745 3070653 3189153
59760C189153Q5996M6165K782l9705p6800j05213j23669j32539j33082j27258
$$ 3189153 3275149 3321314 3324096 3284391 3207591 3102378 2978709 2846170 2713088 2585830
59750B585830j17433j05481r2297p8482o5117n3224m2831l3310k4451j6541r539
$$ 2585830 2468397 2362916 2270619 2192137 2127020 2073796 2030965 1997655 1973204 1956663 1947124
59739A947124k979L373R431J5415K1785K8517L5073M1271M7555N4292O1491O9222
$$ 1947124 1944145 1947518 1956949 1972364 1994149 2022666 2057739 2099010 2146565 2200857 2262348 2331570
59727B331570P7625Q6432R5316J04854J16139J29117J42430J55406J69197J85021
$$ 2331570 2409195 2495627 2590943 2695797 2811936 2941053 3083483 3238889 3408086 3593107
59717C593107K02239K19249K35481K51138K65420K76392K82733K84455K81757
$$ 3593107 3795346 4014595 4250076 4501214 4766634 5043026 5325759 5610214 5891971
59708E891971K74363K62413K47113K29966K12062J94575J79182J67168J58396
$$ 5891971 6166334 6428747 6675860 6905826 7117888 7312463 7491645 7658813 7817209
59699G817209J51723J46210J41306J36061J28971J18853J05549Q9450P0736M9504
$$ 7817209 7968932 8115142 8256448 8392509 8521480 8640333 8745882 8835332 8906068 8955572
59689H955572K6540L409j8464l8511n6477p1381q1589q6015q4859p8902o8482
$$ 8955572 8982112 8985521 8967057 8928546 8872069 8800688 8719099 8633084 8548225 8469323 8400841
59678H400841n3571l4618j2746J1057L6577O4035R3258J23419J53583J83268K12238
$$ 8400841 8347270 8312652 8299906 8310963 8347540 8411575 8504833 8628252 8781835 8965103 9177341
59667I177341K39742K64269K84171K98225L05191L03103K89657K63525K24711
$$ 9177341 9417083 9681352 9965523 10263748 10568939 10872042 11161699 11425224 11649935
59658A1649935J73715J11118L8613m0038j19753j95749k64148l21677l65766l95245
$$ 11649935 11823650 11934768 11973381 11933343 11813590 11617841 11353693 11032016 10666250 10271005
59648A0271005m10450m12576m03167l84201l58092l27437k94889k63310k35661
$$ 10271005 9860555 9447979 9044812 8660611 8302519 7975082 7680193 7416883 7181222
59639G181222k14670k02719k01646k11763k30643k53345k74400k89892k97953
$$ 7181222 6966552 6763833 6562187 6350424 6119781 5866436 5592036 5302144 5004191
59630E004191k98106k90789k77335k59700k39723k18668j97407j76781j57526
$$ 5004191 4706085 4415296 4137961 3878261 3638538 3419870 3222463 3045682 2888156
59621B888156j39946j23939j09438r6697q5940p6860o8660o0691n2908m5737l9636
$$ 2888156 2748210 2624271 2514833 2418136 2332196 2255336 2186676 2125985 2073077 2027340 1987704
59610A987704l4749l0822k7292k3640j9826j6370j3956j2961j3258j4333j5661
$$ 1987704 1952955 1922133 1894841 1871201 1851375 1835005 1821049 1808088 1794830 1780497 1764836
59599A764836j7053j8659k0525k2294k3556k4318k4831k5137k5128k4874k4399
$$ 1764836 1747783 1729124 1708599 1686305 1662749 1638431 1613600 1588463 1563335 1538461 1514062
59588A514062k3345k1444j9307j7890j7125j5902j3726j1534j0319r735q823p376
$$ 1514062 1490717 1469273 1449966 1432076 1414951 1399049 1385323 1373789 1363470 1353735 1344912 1337536
59576A337536n770l945j617P62K314L054M014N815P862R195R644R830J0444J1722
$$ 1337536 1331766 1327821 1326204 1326966 1329280 1332334 1336348 1342163 1350025 1359220 1368864 1378694 1389138 1400860
59562A400860J3341J4683J5506J6363J8137K1148K4922K8754L2201L5175L8033
$$ 1400860 1414201 1428884 1444390 1460753 1478890 1500038 1524960 1553714 1585915 1621090 1659123
59551A659123M1420M5652N0300N4873N9718O5630P2613P9707Q6220R2456R8819
$$ 1659123 1700543 1746195 1796495 1851368 1911086 1976716 2049329 2129036 2215256 2307712 2406531
59540B406531J04550J07747J06530J00267R0027P8060O6477N6121M6750L8014
$$ 2406531 2511081 2618828 2725358 2825625 2915652 2993712 3060189 3116310 3163060 3201074
59530C201074K9877K2181J4405O176k310j0563j8212k5143l1554l7883m4265m9952
$$ 3201074 3230951 3253132 3267537 3273713 3271403 3260840 3242628 3217485 3185931 3148048 3103783 3053831
59518C053831n3721n4986n4182n1953m8396m3199l6073k6820j5505k794J0330
$$ 3053831 3000110 2945124 2890942 2838989 2790593 2747394 2711321 2684501 2668996 2666202 2676532
59507B676532K3481L7181N1850O6880Q1055R3527J03793J10954J13689J11227
$$ 2676532 2700013 2737194 2789044 2855924 2936979 3030506 3134299 3245253 3358942 3470169
59497C470169J03931R2574P7216N7286L2947O043k0872m6333p0252r2288j10819
$$ 3470169 3574100 3666674 3743890 3801176 3834123 3840166 3819294 3772961 3702709 3610421 3499602
59486C499602j24196j32404j36532j36950j33155j25381j15180j03997r2150p9653
$$ 3499602 3375406 3243002 3106470 2969520 2836365 2710984 2595804 2491807 2399657 2320004
59476B320004o7094n4994m3088l1111j9665r491j71R436J9620K9454L8012M5278
$$ 2320004 2252910 2197916 2154828 2123717 2104052 2094561 2094390 2103826 2123446 2152900 2190912 2236190
59464B236190N1710N7496O2436O6158O8192O8037O5306N9759N1289M0112K6874
$$ 2236190 2287900 2345396 2407832 2473990 2542182 2610219 2675525 2735284 2786573 2826685 2853559
59453B853559J2377k816j8335l3700m8249o1328p2439q1364q8211r3213r6322
$$ 2853559 2865936 2863120 2844785 2811085 2762836 2701508 2629069 2547705 2459494 2366281 2269959
59442B269959r7263r6073r3287q9492q4999q0182p5587p1271o6480o0631n4373
$$ 2269959 2172696 2076623 1983336 1893844 1808845 1728663 1653076 1581805 1515325 1454694 1400321
59431A400321m8948m4660m0682l6457l2420k9069k5989k2376j8162j4020j0437
$$ 1400321 1351373 1306713 1266031 1229574 1197154 1168085 1142096 1119720 1101558 1087538 1077101
59420A077101p281m271j328J713N212R144J2507J3799J2269Q482L782n69l627
$$ 1077101 1069820 1065549 1064221 1065934 1071146 1080290 1092797 1106596 1118865 1127347 1131129 1130560 1126933
59407A126933m786m075k215J24L048O789J0460J2133J0510O141P12m409q581j1337
$$ 1126933 1122147 1118072 1115857 1115981 1119029 1125818 1136278 1148411 1158921 1165062 1165774 1161365 1152784 1141447
59393A141447j2117j0651p263k779J850N940R327J2223J4797J7097J9325K1850
$$ 1141447 1129330 1118679 1111416 1108637 1110487 1116427 1125754 1137977 1152774 1169871 1189196 1211046
59381A211046K4827K8090L1553L5419L9771M4303M8657N2767N6763O0883O5613
$$ 1211046 1235873 1263963 1295516 1330935 1370706 1415009 1463666 1516433 1573196 1634079 1699692
59370A699692P1479P8478Q6234R4891J05247J17560J30975J44670J59026J74734
$$ 1699692 1771171 1849649 1935883 2030774 2136021 2253581 2384556 2529226 2688252 2862986
59360B862986J91269K07160K21524K34255K44762K51555K53408K50197K42376
$$ 2862986 3054255 3261415 3482939 3717194 3961956 4213511 4466919 4717116 4959492
59351D959492K30467K15372J98521J81148J63736J46297J28736J10621R1214P0133
$$ 4959492 5189959 5405331 5603852 5785000 5948736 6095033 6223769 6334390 6425604 6495737
59341F495737M7594K3601k656l2080o4552r8854j33405j66681j97185k23520k44542
$$ 6495737 6543331 6566932 6564276 6532196 6467644 6368790 6235385 6068704 5871519 5647999 5403457
59330E403457k59284k67002k67664k62218k52054k38228k21558k03161j84345
$$ 5403457 5144173 4877171 4609507 4347289 4095235 3857007 3635449 3432288 3247943
59321C247943j65890j47900j30488j14215r9617q6582p4585o3416n3347m4573
$$ 3247943 3082053 2934153 2803665 2689450 2589833 2503251 2428666 2365250 2311903 2267330
59311B267330l6733k9161k1484j3887o817o04M667R161J3260J7347K1411K4971
$$ 2267330 2230597 2201436 2179952 2166065 2159248 2158644 2163311 2172472 2185732 2203079 2224490 2249461
59299B249461K7603K9366L0340K9907K7046K1640J4974Q610L109j711n694q326
$$ 2249461 2277064 2306430 2336770 2366677 2393723 2415363 2430337 2438947 2442056 2440345 2434651 2426325
59287B426325r649j0362j0796j0502r261p637o015l693Q5M697Q751J2004J5572
$$ 2426325 2416676 2406314 2395518 2385016 2375755 2368118 2362103 2358410 2358495 2363192 2371943 2383947 2399519
59274B399519K0072K4726K8664L2085L5403L8159L9658L9995L9504L7746L4070
$$ 2399519 2419591 2444317 2472981 2505066 2540469 2578628 2618286 2658281 2697785 2735531 2769601
59263B769601K8727K2397J5010O247k968j0965j7397k3408k9410l4125l6479l7163
$$ 2769601 2798328 2820725 2835735 2841982 2839014 2828049 2810652 2787244 2757834 2723709 2687230 2650067
59251B650067l7421l7255l6022l3982l2072l0555k8933k7038k5312k4201k3892
$$ 2650067 2612646 2575391 2539369 2505387 2473315 2442760 2413827 2386789 2361477 2337276 2313384
59240B313384k4409k5312k5738k5487k5634k7154k9270l0267k9722k8829k8519
$$ 2313384 2288975 2263663 2237925 2212438 2186804 2159650 2130380 2100113 2070391 2041562 2013043
59229B013043k8370k7660k6433k4951k3012k0342j7140j3649r649m868L94N572
$$ 2013043 1984673 1957013 1930580 1905629 1882617 1862275 1845135 1831486 1821837 1816969 1817363 1822935
59217A822935J0682J6441K3510L1692M0037M7897N5890O5394P6860Q9113J00805
$$ 1822935 1833617 1850058 1873568 1905260 1945297 1993194 2049084 2114478 2191338 2280451 2381256
59206B381256J11984J23392J34622J44045J50525J53998J54085J49341J38510
$$ 2381256 2493240 2616632 2751254 2895299 3045824 3199822 3353907 3503248 3641758
59197C641758J21773J00130P4292M4824J2907j9825n1923q2125j09072j31542
$$ 3641758 3763531 3863661 3937953 3982777 3995684 3975859 3923936 3841811 3732739 3601197
59187C601197j48841j60640j66776j67629j64271j57803j48762j37633j25499
$$ 3601197 3452356 3291716 3124940 2957311 2793040 2635237 2486475 2348842 2223343
59178B223343j13565j02243r1200q0249o9748o0218n2047m5367l9839l4618k9040
$$ 2223343 2109778 2007535 1916335 1836086 1766338 1706120 1654073 1608706 1568867 1534249 1505209
59167A505209k3322j8229j4090j0498o964l502m95J808L591N406P685J0215J2297
$$ 1505209 1481887 1463658 1449568 1439070 1432106 1428604 1428109 1429917 1433508 1438914 1446599 1456814 1469111
59154A469111J3574J4475J5596J6991J8459K0189K2533K5183K7188K7950K7833
$$ 1469111 1482685 1497160 1512756 1529747 1548206 1568395 1590928 1616111 1643299 1671249 1699082
59143A699082K7615K7684K7832K7611K6700K5150K3341K1582J9787J7645J5098
$$ 1699082 1726697 1754381 1782213 1809824 1836524 1861674 1885015 1906597 1926384 1944029 1959127
59132A959127J2418R840P336M800K265m9j786k578k307j156O66L147O231R613
$$ 1959127 1971545 1981385 1988721 1993521 1995786 1995737 1993951 1991373 1989066 1987910 1988576 1991723 1997954 2007567
59118B007567J3027J6619K0661K5023K9324L3386L7107L9955M1295M1333M1088
$$ 2007567 2020594 2037213 2057874 2082897 2112221 2145607 2182714 2222669 2263964 2305297 2346385
59107B346385M1121M0794L9245L6596L3743L1288K9266K7761K7141K7600K8939
$$ 2346385 2387506 2428300 2467545 2504141 2537884 2569172 2598438 2626199 2653340 2680940 2709879
59096B709879L0978L3778L7431M1747M6277N0312N2986N3703N2555M9945M5779
$$ 2709879 2740857 2774635 2812066 2853813 2900090 2950402 3003388 3057091 3109646 3159591 3205370
59085C205370L9547L1280K1813J1715M67j2601k6923m0959n3774o5648p6983q7263
$$ 3205370 3244917 3276197 3298010 3309725 3310192 3297591 3270668 3229709 3175935 3110287 3033304 2946041
59073B946041r5530j01444j05431j07943j08995j08327j05820j01740r6715r1407
$$ 2946041 2850511 2749067 2643636 2535693 2426698 2318371 2212551 2110811 2014096 1922689
59063A922689q6121q0830p5526p0315o5193n9990n4719m9705m5249m1351l7883
$$ 1922689 1836568 1755738 1680212 1609897 1544704 1484714 1429995 1380290 1335041 1293690 1255807
59052A255807l4742l1725k8595k5426k2628k0406j8518j6734j5130j3735j2276
$$ 1255807 1221065 1189340 1160745 1135319 1112691 1092285 1073767 1057033 1041903 1028168 1015892
59041A015892j0639r092p674n824l149j48K503M981P849J0807J2877J3783J4292
$$ 1015892 1005253 996161 988487 982663 979514 979366 981869 986850 994699 1005506 1018383 1032166 1046458
59028A046458J5003J5575J5429J4481J2910J0796Q351O014L949J894k74k160l315
$$ 1046458 1061461 1077036 1092465 1106946 1119856 1130652 1139003 1145017 1148966 1150860 1150586 1148426 1145111
59015A145111l696l477k829k075j582j293p70O6Q10J338K026K777K583P49j898
$$ 1145111 1141415 1137938 1135109 1133034 1131452 1130159 1129389 1129455 1130265 1131603 1133629 1136406 1138989 1139738 1137840
59000A137840l875m863n951q073j0999j3910j6356j8309j9727k0488k0622k0365
$$ 1137840 1133965 1129102 1123151 1115078 1104079 1090169 1073813 1055504 1035777 1015289 994667 974302
58988I74302j9896j9151j7926j6223j4387j2776j1345r747p854n947m346l087
$$ 974302 954406 935255 917329 901106 886719 873943 862598 852851 844997 839050 834704 831617
58976H31617j998r24J71J158J849K326K976L948M787N132N435O298P284P412O847
$$ 831617 829619 828695 828866 830024 831873 834199 837175 841123 845910 851042 856477 862775 870059 877471 884318
58961H84318O937Q178R288R027P966P455P561P152N680L800K348J620J613K235
$$ 884318 891255 899433 908721 917748 925714 933169 940730 947882 953562 957362 959710 961330 962943 965178
58947I65178L168M096N095O315P479Q219Q679R183R559R405Q863Q462Q368Q521
$$ 965178 968346 972442 977537 983852 991331 999550 1008229 1017412 1026971 1036376 1045239 1053701 1062069 1070590
58933A070590R264J0962J3134J4860J6056J7461J9362K1337K3384K6142K9655
$$ 1070590 1079854 1090816 1103950 1118810 1134866 1152327 1171689 1193026 1216410 1242552 1272207
58922A272207L2932L5367L7711M0924M4829M8626N2226N6200O0748O5540P0424
$$ 1272207 1305139 1340506 1378217 1419141 1463970 1512596 1564822 1621022 1681770 1747310 1817734
58911A817734P5582Q1151Q7217R4054J01855J10269J18711J27124J35943J45304
$$ 1817734 1893316 1974467 2061684 2155738 2257593 2367862 2486573 2613697 2749640 2894944
58901B894944J54720J63596J71818J79668J87413J94996K01940K07514K11089
$$ 2894944 3049664 3213260 3385078 3564746 3752159 3947155 4149095 4356609 4567698
58892D567698K12309K10828K06021J97090J83349J64332J39866J10338P6852M0839
$$ 4567698 4780007 4990835 5196856 5393946 5577295 5741627 5881493 5991831 6068683 6109522
58882F109522L534l3978p0342j03900j33234j57671j77161j91838k01741k07036
$$ 6109522 6113056 6079078 6008736 5904836 5771602 5613931 5436770 5244932 5043191 4836155
58872D836155k08349k06710k02925j97095j89057j79305j69022j59069j49351
$$ 4836155 4627806 4421096 4218171 4021076 3832019 3652714 3483692 3324623 3175272
58863C175272j39526j29956j21379j13857j06700r9475r2527q6351q0957p6156
$$ 3175272 3035746 2905790 2784411 2670554 2563854 2464379 2371852 2285501 2204544 2128388
58853B128388p1988o8417o4907o0781n5955n0930m6140m1689l7625l4033l0715
$$ 2128388 2056400 1987983 1923076 1862295 1806340 1755410 1709270 1667581 1629956 1595923 1565208
58842A565208k7234k3442j9660j6133j2657r052n724l262j629r3J936M318O390
$$ 1565208 1537974 1514532 1494872 1478739 1466082 1457030 1451306 1448044 1446415 1446322 1448258 1452576 1458966
58829A458966P612Q007Q224R110J0923J3082J4893J6427J8326K0982K4320K8275
$$ 1458966 1466578 1474585 1482809 1491919 1502842 1515924 1530817 1547244 1565570 1586552 1610872 1639147
58817A639147L2770L7203M0766M3618M7015N1809N7394O2729O7908P3864Q0834
$$ 1639147 1671917 1709120 1749886 1793504 1840519 1892328 1949722 2012451 2080359 2154223 2235057
58806B235057Q8085R5180J02722J11521J21564J32250J43237J54588J66197J77456
$$ 2235057 2323142 2418322 2521044 2632565 2754129 2886379 3029616 3184204 3350401 3527857
58796C527857J87640J96450K03992K10111K13946K14341K10589K02473J89602
$$ 3527857 3715497 3911947 4115939 4326050 4539996 4754337 4964926 5167399 5357001
58787E357001J71257J47114J17785Q4412M8150J0317k7456o3797r7975j29279
$$ 5357001 5528258 5675372 5793157 5877569 5925719 5936036 5908580 5844783 5746808 5617529
58777E617529j56397j78131j94465k06252k13987k17639k17592k14905k10341
$$ 5617529 5461132 5283001 5088536 4882284 4668297 4450658 4233066 4018161 3807820
58768C807820k03893j95489j85632j74987j63908j52685j41785j31477j21593
$$ 3807820 3603927 3408438 3222806 3047819 2883911 2731226 2589441 2457964 2336371
58759B336371j12036j03156r5212q7838q0527p3431o7107o1585n6215n0621m5258
$$ 2336371 2224335 2121179 2025967 1938129 1857602 1784171 1717064 1655479 1599264 1548643 1503385
58748A503385m0739l6811l2472k7198k1727j7325j4411j2221r872p283m884k960
$$ 1503385 1462646 1425835 1393363 1366165 1344438 1327113 1312702 1300481 1290609 1283326 1278442 1275482
58736A275482j739j790l591o737j0178j3415j6904k0993k4946k7502k8207k7780
$$ 1275482 1273743 1271953 1268362 1261625 1251447 1238032 1221128 1200135 1175189 1147687 1119480 1091700
58724A091700k7187k6659k5781k4327k2681k1378k0455j9600j8785j8300j8146
$$ 1091700 1064513 1037854 1012073 987746 965065 943687 923232 903632 884847 866547 848401
58713H48401j7855j7202j6592j6417j6442j6302j6120j6068j5739j4685j3244
$$ 848401 830546 813344 796752 780335 763893 747591 731471 715403 699664 684979 671735
58702F71735j2124j1306j0284r205q796r046q966p969o647n749n233m774m551
$$ 671735 659611 648305 638021 628816 620020 610974 602008 594039 587392 581643 576410 571636 567085
58689E67085m911n729o596p296p688p569p030o538o231n608m304k742j514n24
$$ 567085 562174 556445 549849 542553 534865 527296 520266 513728 507497 501889 497585 494843 493329 492805
58675D92805O95K169L573M866O309P941R504J0710J1290J1009J0009Q854P831
$$ 492805 493500 495669 499242 504108 510417 518358 527862 538572 549862 560871 570880 579734 587565
58662E87565O493M335J647q71l047n149p030q108q182p678p002o201n395m944
$$ 587565 594058 598393 600040 599169 596122 590973 583943 575835 567653 559975 552973 546772 541377 536433
58648E36433m919m858m367l634l139l051l213l467l699l713l318k542j541l67
$$ 536433 531514 526656 522289 518655 515516 512465 509252 505785 502086 498373 495055 492513 490972 490605
58634D90605R71K272L177L575L770M097M501M725M840N180N756O173O346O839
$$ 490605 491576 493848 497025 500600 504370 508467 512968 517693 522533 527713 533469 539642 545988 552827
58620E52827Q115R792J1159J2157J3251J4539J5728J6919J8692K1208K3926K6373
$$ 552827 560942 570734 581893 594050 607301 621840 637568 654487 673179 694387 718313 744686
58608G44686K8622L0829L2944L5124L7742M0676M3300M5593M8554N2835N7649
$$ 744686 773308 804137 837081 872205 909947 950623 993923 1039516 1088070 1140905 1198554
58597A198554O1624O4216O5561O5558O3948O0916N6625N0522M2044L1829K1111
$$ 1198554 1260178 1324394 1389955 1455513 1519461 1580377 1637002 1687524 1729568 1761397 1782508
58586A782508J0061k114j5204k7395l7142m4655n0822n5543n8075n8483n7663
$$ 1782508 1792569 1790455 1775251 1747856 1710714 1666059 1615237 1559694 1501619 1443136 1385473
58575A385473n5966n2830m7992m2373l7288l3137k9277k4972k0088j4951j0030
$$ 1385473 1329507 1276677 1228685 1186312 1149024 1115887 1086610 1061638 1041550 1026599 1016569
58564A016569n831k735o46J017K649L938M279L472J719r79m797r441j4076j8105
$$ 1016569 1010738 1008003 1007357 1008374 1011023 1014961 1019240 1022712 1024431 1023452 1018655 1009214 995138 977033
58550I77033k1563k4481k6420k7036k6708k6042k5022k3259k0854j8418j6226
$$ 977033 955470 930989 904569 877533 850825 824783 799761 776502 755648 737230 721004
58539G21004j3980j1523r341q035p560p217o396n151m056l534l451l510l883m987
$$ 721004 707024 695501 686160 678125 670565 663348 656952 651801 647745 644211 640760 637250 633367 628380
58525F28380o590p605p226n917m870m697n106n671o297o883p054o507n469m587
$$ 628380 621790 614185 606959 601042 596172 591475 586369 580698 574401 567518 560464 553957 548488 543901
58511E43901m429m922n302m732l205j566m62M03J619L000L769L646L118K624K139
$$ 543901 539472 534550 529248 524516 521311 519745 519283 519686 521305 524305 528074 531720 534838 537462 539601
58496E39601J765K078L364M915N655N410N074N480O502P439P953Q312Q756R068
$$ 539601 541366 543444 546808 551723 557378 562788 567862 573342 579844 587283 595236 603548 612304 621372
58482F21372Q890Q179P083N627L817J944L68j022k731m957p321r315j0682j1325
$$ 621372 630262 638441 645524 651151 654968 656912 657280 656258 653527 648570 641249 631934 621252 609927
58468F09927j1297j0941j0632j0160q978p141n429m293l343k312j826k433l434
$$ 609927 598630 587689 577057 566897 557919 550778 545349 541056 537713 535401 533575 531142 527708
58455E27708l553k571j422p60l13L17R98J506J979K632L440M271N012N374N033
$$ 527708 524155 521584 520162 519402 519089 519406 520404 521910 523889 526521 529961 534232 539244 544618 549651
58440E49651M240L903M705O283P622Q124Q049P965Q048Q149Q275Q625R039Q784
$$ 549651 553891 557794 562499 568782 576404 584528 592577 600542 608590 616739 625014 633639 642678 651462
58426F51462P298M990K828J206l02j959l344m026m181m090l529k269p47K95O92
$$ 651462 658760 663750 666578 667784 667482 665523 662179 658153 653972 649882 646353 644084 643337 643632 644324
58411F44324Q69J196J800K812M158N337N992O525P599R044R944R859R210Q358
$$ 644324 645193 646389 648189 651001 655159 660496 666488 673013 680612 689656 699600 709459 718669 727027
58397G27027P003M905K680J233O11J3j073k233k791k773k742k804k353j004O25
$$ 727027 734030 738935 741615 742848 743459 743472 742399 740166 737375 734602 731860 729056 726703 725699 726324
58382G26324J642K024K405K912K935K266J642J791K519L160L428L394L029K313
$$ 726324 727966 729990 732395 735307 738242 740508 742150 743941 746460 749620 753048 756442 759471 761784
58368G61784J539J075R98J198J605K131K721L541M780O078O730O671O688P407
$$ 761784 763323 764398 765396 766594 768199 770330 773051 776592 781372 787450 794180 800851 807539 814946
58354H14946Q623R880J1021J1863J2077J1919J2310J3611J4941J5335J4910J4244
$$ 814946 823569 833449 844470 856333 868410 880329 892639 906250 921191 936526 951436 965680
58342I65680J3251J1508R247P217N782M782L980L215K435J897J939K342K583K836
$$ 965680 978931 990439 999686 1006903 1012685 1017467 1021447 1024662 1027097 1028994 1030933 1033275 1035858 1038694
58328A038694L864N669P298Q353R398J0511J0861J0562J1226J3525J5788J6437
$$ 1038694 1042558 1048227 1055525 1063878 1073276 1083787 1094648 1105210 1116436 1129961 1145749 1162186
58316A162186J6406J7407J9145K0276K0953K2265K3838K4264K3468K2589K1808
$$ 1162186 1178592 1195999 1215144 1235420 1256373 1278638 1302476 1326740 1350208 1372797 1394605
58305A394605K0320J8252J6651J5602J4213J2493J1455J1408J1719J2270J3464
$$ 1394605 1414925 1433177 1449828 1465430 1479643 1492136 1503591 1514999 1526718 1538988 1552452
58294A552452J4947J5983J6935J8675K0707K1747K2010K3004K5046K6911K8027
$$ 1552452 1567399 1583382 1600317 1618992 1639699 1661446 1683456 1706460 1731506 1758417 1786444
58283A786444K9090L0379L1361L2118L3391L5062L6437L7988M0835M4470M7172
$$ 1786444 1815534 1845913 1877274 1909392 1942783 1977845 2014282 2052270 2093105 2137575 2184747
58272B184747M8763N0780N3681N6156N7514N8462N9108N8510N6737N5154N4071
$$ 2184747 2233510 2284290 2337971 2394127 2451641 2510103 2569211 2627721 2684458 2739612 2793683
58261B793683N2389N0070M8713M9079N0323N2190N5479N9732O3112O5513O9173
$$ 2793683 2846072 2896142 2944855 2993934 3044257 3096447 3151926 3211658 3274770 3340283 3409456
58250C409456P5232Q2114Q8307R4204J00118J05186J09557J15137J22751J30838
$$ 3409456 3484688 3566802 3655109 3749313 3849431 3954617 4064174 4179311 4302062 4432900
58240D432900J38261J46044J55078J64479J73600J83335J94273K05819K18245
$$ 4432900 4571161 4717205 4872283 5036762 5210362 5393697 5587970 5793789 6012034
58231F012034K33073K50290K67800K84751L02689L22576L43781L67046L94956
$$ 6012034 6245107 6495397 6763197 7047948 7350637 7673213 8016994 8384040 8778996
58222H778996M28050M63961N01864N44210N92603O45919P04242P70700Q47499
$$ 8778996 9207046 9671007 10172871 10717081 11309684 11955603 12659845 13430545 14278044
58213A4278044R34331J032720J147664J282969J439608J621072J835738K091963
$$ 14278044 15212375 16245095 17392759 18675728 20115336 21736408 23572146 25664109
58205B5664109K396094K757580L190426L707443M319344N041372N893066O889209
$$ 25664109 28060203 30817783 34008209 37715652 42034996 47076368 52969434 59858643
58197E9858643Q040601R368839J0913864J2727304J4870424J7415969K0422063
$$ 59858643 67899244 77268083 88181947 100909251 115779675 133195644 153617707
58190A53617707K3870571K7596078L1200110L3934972L4674219L2203542K5859398
$$ 153617707 177488278 205084356 236284466 270219438 304893657 337097199 362956597
58183C62956597J6101354M481664p042060j6909915k4316413k9079972l1379152
$$ 362956597 379057951 383539615 376497555 359587640 335271227 306191255 274812103
58176B74812103l1602867l0271350k7929026k5040710k1958481j8938075j6148136
$$ 274812103 243209236 212937886 185008860 159968150 138009669 119071594 102923458
58169A02923458j3672237j1530983r714029q194937o934002n888102n022196m307821
$$ 102923458 89251221 77720238 68006209 59811272 52877270 46989168 41966972 37659151
58161C7659151l716250l220978k804008k453407k157239j904571j689124j506606
$$ 37659151 33942901 30721923 27917915 25464508 23307269 21402698 19713574 18206968
58153A8206968j350482j214308j095523r92889r02499q20040p44873o78256o19281
$$ 18206968 16856486 15642178 14546655 13553766 12651267 11831227 11086354 10408098 9788817
58144I788817n65692n16941m73455m34338l98403l66096l38207l14108k93114
$$ 9788817 9223125 8706184 8232729 7798391 7399988 7033892 6695685 6381577 6088463
58135F088463k75811k62077k49566k36164k22283k09001j95843j82339j69859
$$ 6088463 5812652 5550575 5301009 5064845 4842562 4633561 4437718 4255379 4085520
58126D085520j59679j50771j41621j32769j25490j19346j13095j06843j01337
$$ 4085520 3925841 3775070 3633449 3500680 3375190 3255844 3142749 3035906 2934569
58117B934569r6215r0805q5736q1882p8642p4885p0765o7091o3759o0310n7162
$$ 2934569 2838354 2747549 2661813 2579931 2501289 2426404 2355639 2288548 2224789 2164479 2107317
58106B107317n4823n2670m9984m7403m5948m5248m4108m2226m0182l8219l6183
$$ 2107317 2052494 1999824 1949840 1902437 1856489 1811241 1767133 1724907 1684725 1646506 1610323
58095A610323l4186l2300l0210k7879k5973k4823k3778k2417k1529k2014k3658
$$ 1610323 1576137 1543837 1513627 1485748 1459775 1434952 1411174 1388757 1367228 1345214 1321556
58084A321556k5761k8119l0501l2069l2316l1844l1349l0616k9346k7977k6822
$$ 1321556 1295795 1267676 1237175 1205106 1172790 1140946 1109597 1078981 1049635 1021658 994836
58073I94836k5296k2973k0574j8981j7953j6793j5403j3919j2149j0235q976q603
$$ 994836 969540 946567 925993 907012 889059 872266 856863 842944 830795 820560 811584 802981
58061H02981q186p149o372o743p658q126q364r064r934j0242j0090r867r178p668
$$ 802981 794795 787646 781274 774531 766873 758747 750383 741319 731385 721143 711053 701186 692008 684340
58047F84340o200n873o384o651o524o527o487n813m783m161l793k936j753j193
$$ 684340 678140 672267 665883 659232 652708 646181 639694 633881 629098 624937 621144 618208 616455 615262
58033F15262j481j965k368l020l824m198m115m180m614m996n135n270n415n313
$$ 615262 613781 611816 609448 606428 602604 598406 594291 590111 585497 580501 575366 570096 564681 559368
58019E59368n079n077n172m858m143l554l297l088k799k616k576k539k573k789
$$ 559368 554289 549212 544040 539182 535039 531485 528188 525100 522301 519685 517109 514570 511997 509208
58005E09208k952k784k420k068j459l04J010J875K306K697L005K938K607K226
$$ 509208 506256 503472 501052 498984 497525 497221 498231 500106 502412 505109 508114 511052 513659 515885
57991E15885J479N5j529k497k960l569m271m460m208m171m381m190l512l040l056
$$ 515885 517364 517419 515890 513393 510433 506864 502593 498133 493925 489754 485373 481183 477671 474631 471575
57976D71575l054k838k956l674m347m237l287j799j05J147J249L62m43n71o47
$$ 471575 468521 465683 462727 459053 454706 450469 447182 445383 445278 446425 447674 448036 447593 447022 446375
57961D46375j387k445l053l264l749m570m985m442l285k277j808j651j254j85
$$ 446375 444988 442543 439490 436226 432477 427907 422922 418480 415195 412918 411110 409459 408205 408020
57947D08020J494L179M203M482M613N118N719N630M669L574K926K249P37j402
$$ 408020 409514 412693 416896 421378 425991 431109 436828 442458 447127 450701 453627 455876 456613 455211
57933D55211l216m492n974p879r237r323q825q797r179r166q565p779o839n420
$$ 455211 451995 447503 441529 433650 424413 415090 406265 397468 388289 379123 370558 362779 355940 350520
57919C50520l747k598k251k151j720r72l15j19m63r66r58j76R39J894K756L717
$$ 350520 346773 344175 341924 339773 338053 337081 336766 336647 336184 335218 334260 334084 335023 336917 339673 343390
57903C43390M524M860M942N111N207M949M574M383L992K807J001p50k242l677
$$ 343390 347914 352774 357716 362827 368034 372983 377557 381940 385932 388739 389740 388990 386748 383071
57889C83071m923n638o003o469o974p170p156p153o681n153l118j822j563j454
$$ 383071 378148 372510 366507 360038 353064 345894 338738 331585 324904 319751 316633 314811 313248 311794
57875C11794r27k56M01J317K294K629K401K721M191N997P037P143O736O062N374
$$ 311794 310867 310611 311012 312329 314623 317252 319653 322374 326565 332562 339599 346742 353478 359540 364914
57860C64914N023M864M205K816J314J25j154k790m107m411m109m133m679n195
$$ 364914 369937 374801 379006 381822 383136 383261 382107 379317 375210 370799 366690 362557 357878 352683
57846C52683n287m991m425l742l202k827k289j431o49l79n69r63j525k176k554
$$ 352683 347396 342405 337980 334238 331036 328209 325920 324489 323840 323461 322892 321929 320404 318228 315674
57831C15674k393j888j402j176j528k728m376n549n941o230o809o996o209n167
$$ 315674 313281 311393 309991 308815 307287 304559 300183 294634 288693 282463 275654 268658 262449 257282
57817B57282m923n213m901l837l085l274l759l728l299l061l168l254k975k246
$$ 257282 252359 247146 242245 238408 235323 232049 228290 224562 221263 218202 215034 211780 208805 206559
57803B06559j173NJ079K083L247M667O127P252P730P503O966O815P479Q658R593
$$ 206559 205386 205391 206470 208553 211800 216467 222594 229846 237576 245079 252045 258860 266339 274997 284590
57788B84590R871R741R667R641R085P460M983K552P48q56l033n762q241j0030
$$ 284590 294461 304202 313869 323510 332595 340055 345038 347590 348338 347482 344449 338687 330446 320416
57774C20416j1384j2319j2246j1038r690r168r136q651p684p029o822o293n100
$$ 320416 309032 296713 284467 273429 263739 254571 245435 236784 229100 222071 215249 208956 203856
57761B03856l961l580l586l111j983q39k88l60o50o76j78N86R81O45kj29N18J342
$$ 203856 199895 196315 192729 189618 187635 186796 186508 186148 185498 184822 184644 185230 186211 186856 186854 186725 187243 188585
57743A88585J722J860K400L316L770L301K634K740L440L652K887J745R11M77M58
$$ 188585 190307 192167 194567 197883 201653 204954 207588 210328 213768 217420 220307 222052 222963 223440 223898
57728B23898J072K053K444J803J002J101J913K499K648K933L536L993M169M448
$$ 223898 224970 227023 229467 231270 232272 233373 235286 237785 240433 243366 246902 250895 255064 259512
57714B59512M879M953M506M047L856L549K986K880L882N635P329Q770J0221J1597
$$ 259512 264391 269344 273850 277897 281753 285302 288288 291168 295050 300685 308014 316784 327005 338602
57700C38602J2560J3165J3589J3315J1441Q042M443J852L50l98j54J431L802N837
$$ 338602 351162 364327 377916 391231 402672 410714 415157 417009 417359 416961 416807 418238 422040 427877
57686D27877P204Q709J1147J4420J8076K2080K6663L1864L7686M4535N2892O2694
$$ 427877 435081 443790 454937 469357 487433 509513 536176 568040 605726 650261 703153 765847
57674G65847P3519Q5403R9006J14949J33406J54159J75901J94540K02708J92548
$$ 765847 839366 924769 1023775 1138724 1272130 1426289 1602190 1796730 1999438 2191986
57664B191986J60621J10963N3477r92m5082p6148r4908j03776j05920j04574j02087
$$ 2191986 2352607 2463570 2517047 2516055 2470973 2394825 2299917 2196141 2090221 1985647 1883560
57653A883560r9496r6997r4569r2013q8861q4845q0319p5784p1184o6133o0637
$$ 1883560 1784064 1687067 1592498 1500485 1411624 1326779 1246460 1170676 1099492 1033359 972722
57642I72722n5177n0134m5593m1592l7967l4157k9789k5356k1675j8675j5535
$$ 972722 917545 867411 821818 780226 742259 708102 678313 652957 631282 612607 597072
57631E97072j2109r282p671o795n905m838l623k020p4J593K680L812N653Q016
$$ 597072 584963 575681 568010 561215 555310 550472 546849 544829 544755 546348 549028 552840 558493 566509
57617E66509J0448J3013J5722J7855J8947K0013K2650K7063L1950L6232L9897
$$ 566509 576957 589970 605692 623547 642494 662507 685157 712220 744170 780402 820299
57606H20299M3108M5568M7103M8096M8877M9122M8060M4930L9247L1139K1532
$$ 820299 863407 908975 956078 1004174 1053051 1102173 1150233 1195163 1234410 1265549 1287081
57595A287081J1442J122r706k0803l1163l9831m6349n0523n2451n2896n2856n2542
$$ 1287081 1298523 1299645 1289939 1269136 1237973 1198142 1151793 1101270 1048819 995923 943067 890525
57583H90525n1329m8881m5710m2418l9147l6031l3461l1460k9357k6636k3672
$$ 890525 839196 790315 744605 702187 663040 627009 593548 562088 532731 506095 482423
57572D82423k1183j9335j7819j6427j5084j3657j2102j0662r569q772q130p595
$$ 482423 461240 441905 424086 407659 392575 378918 366816 356154 346585 337813 329683 322088
57560C22088o982n983m701l765l552l654l442k884k370k032j723j378r90m12M21
$$ 322088 315106 309123 304422 300657 297105 293451 290009 287125 284755 282723 281000 279622 278632 278220 278641
57545B78641J192J483J257Q29N54P00J346K145K537K494K687L547M621N264N602
$$ 278641 279833 281316 282573 283402 283956 284656 286002 288147 290684 293178 295865 299412 304033 309297 314899
57530C14899O185P079P929Q641R400J0203J1031J2277J4236J6373J7945J9204
$$ 314899 321084 328163 336092 344733 354133 364336 375367 387644 401880 418253 436198 455402
57518D55402K1120K3833K6387K8205K9842L1970L4476L7036L9620M1792M2428
$$ 455402 476522 500355 526742 554947 584789 616759 651235 688271 727891 769683 812111
57507H12111M0971L8373L5778L2825K8231K1699J4086N894l118j2642k1330k8139
$$ 812111 853082 891455 927233 960058 988289 1009988 1024074 1029968 1026850 1014208 992878 964739
57495I64739l3327l7559m0734m2314m2294m1135l9117l6382l3423l0863k8860
$$ 964739 931412 893853 853119 810805 768511 727376 688259 651877 618454 587591 558731
57484E58731k7074k5157k2856j9949j6564j3437j1330j0126r046p636o096m646
$$ 558731 531657 506500 483644 463695 447131 433694 422364 412238 403192 395556 389460 384814
57472C84814l151j530L6J450K810L996M717N151O034P755R806J1547J3056J4719
$$ 384814 381663 380133 380169 381619 384429 388425 393142 398293 404327 412082 421888 433435 446491 461210
57458D61210J6475J8089J9921K2525K5573K7896K8944K9539L0865L3105L5376
$$ 461210 477685 495774 515695 538220 563793 591689 620633 650172 681037 714142 749518
57447G49518L6789L7095L6390L4594L1328K6237J9307J0976J941p175j5980k4197
$$ 749518 786307 823402 859792 894386 925714 951951 971258 982234 984175 977000 961020 936823
57435I36823l1397l6941m0383m2004m2724m3172m2949m1231l8114l4800l2256
$$ 936823 905426 868485 828102 786098 743374 700202 657253 616022 577908 543108 510852
57424E10852l0195k7868k5313k3203k1704k0207j8178j5680j3105j0919r708r718
$$ 510852 480657 452789 427476 404273 382569 362362 344184 328504 315399 304480 294772 285054
57412B85054j0195r823q233o519n888o207o355n695m620l807l490l532l763m015
$$ 285054 274859 265036 256803 250284 244396 238189 231834 226139 221519 217712 214222 210690 206927 202912
57398B02912m027l600k847k220k101k393k606k427k066j859j713j299o54j97p1
$$ 202912 198885 195285 192438 190218 188117 185724 183118 180691 178625 176766 175053 173754 173100 172903 172832
57383A72832N2L43M73J65l22n76o35p74r23p44k39J64K15J98M59Q68R26L57n61
$$ 172832 172884 173227 173700 173865 173543 172967 172332 171558 170635 169891 169652 169816 170031 170229 170688 171556 172482 172839 172278
57364A72278j286j499j271q21k63L27P78R04O94L06p4l12l46k68k28j71J83Q47
$$ 172278 170992 169493 168222 167401 167138 167465 168243 169147 169841 170147 170073 169761 169415 169147 168919 168748 168931 169778
57346A69778J360J373J218J404J794J823J458J205J142P33j50p69n51J02M76N76
$$ 169778 171138 172511 173729 175133 176927 178750 180208 181413 182555 183288 183138 182369 181818 181920 182396 182972
57330A82972P71R69P65K33j21p5J69M46P55J014J176J486K131K729K678K005J362
$$ 182972 183743 184712 185477 185710 185589 185514 185683 186129 186884 187898 189074 190560 192691 195420 198098 200103 201465
57313B01465J172J264J420J714K154K390K157J714J617K158L075L789L886L559
$$ 201465 202637 203901 205321 207035 209189 211579 213736 215450 217067 219225 222300 226089 229975 233534
57299B33534L470M014M854N440N716N989O197N958N302M878N196O060O898P367
$$ 233534 237004 241018 245872 251312 257028 263017 269214 275172 280474 285352 290548 296608 303506 310873
57285C10873P529P724Q334R323J0027R823R040Q674R046R339Q704P340N973M738
$$ 310873 318402 326126 334460 343783 353810 363633 372673 381347 390393 399732 408436 415776 421749 426487
57271D26487L168J053j185k996m188m994n891p197q657r611r867j0072j0778j1430
$$ 426487 429655 430708 429523 426527 422339 417345 411454 404257 395600 385989 376122 366050 355272 343842
57257C43842j0964r279p411o190n390m502l650l201k971k463j691j111p86k66
$$ 343842 332878 323599 316188 309998 304608 300106 296456 293255 290284 287821 286130 285019 284233 283967
57243B83967N80J193J094O25N48J147K059K820L260L476L693M100M579M681M147
$$ 283967 284547 285740 286834 287459 288007 289154 291213 294033 297293 300769 304462 308562 313141 317822 321969
57228C21969L377K991L111L414L789M371M869M596L467K405K275K857L389L679
$$ 321969 325346 328337 331448 334862 338651 343022 347891 352487 355954 358359 360634 363491 366880 370559
57214C70559M040M432M438M109M042M518N181N781O494P221P223O107M797M701
$$ 370559 374599 379031 383469 387578 391620 396138 401319 407100 413594 420815 428038 434145 438942 443643
57200D43643N972P300P570P183P303Q223R088R170Q836Q917R591J0381J1064J1920
$$ 443643 449615 456915 464485 471668 478971 487194 496282 505452 514288 523205 532796 543177 554241 566161
57186E66161J2989J3703J3640J3186J2971J2991J2781J2327J2182J2692J3587
$$ 566161 579150 592853 606493 619679 632650 645641 658422 670749 682931 695623 709210
57175G09210J4353J4673J4470J3950J3550J3494J3393J2815J2139J2216J3099
$$ 709210 723563 738236 752706 766656 780206 793700 807093 819908 832047 844263 857362
57164H57362J3866J3946J3875J4305J4940J5106J4953J5265J6363J7795J9049
$$ 857362 871228 885174 899049 913354 928294 943400 958353 973618 989981 1007776 1026825
57153A026825J9954K0523K0899K1510K2684K4065K4867K4826K4542K4738K5549
$$ 1026825 1046779 1067302 1088201 1109711 1132395 1156460 1181327 1206153 1230695 1255433 1280982
57142A280982K6615K7537K8133K8502K9104L0453L2590L4951L6910L8312L9463
$$ 1280982 1307597 1335134 1363267 1391769 1420873 1451326 1483916 1518867 1555777 1594089 1633552
57131A633552M0684M1992M3234M4458M6185M9025N2955N7186O1099O5076P0032
$$ 1633552 1674236 1716228 1759462 1803920 1850105 1899130 1952085 2009271 2070370 2135446 2205478
57120B205478P6279Q3328R0729R8507J06750J15393J24667J35232J47453J60983
$$ 2205478 2281757 2365085 2455814 2554321 2661071 2776464 2901131 3036363 3183816 3344799
57110C344799J75412J91051K08833K29842K55401K87172L26582L74312M30872
$$ 3344799 3520211 3711262 3920095 4149937 4405338 4692510 5019092 5393404 5824276
57101E824276M97566N76401O69246P77676R03393J047917J211556J393128J590730
$$ 5824276 6321842 6898243 7567489 8345165 9248558 10296475 11508031 12901159 14491889
57092A4491889J802183K024529K253416K482503K702314K899425L057619L159481
$$ 14491889 16294072 18318601 20572017 23054520 25756834 28656259 31713878 34873359
57084C4873359L184582L106006K894110K532198K033490J442228Q15122J98609
$$ 34873359 38057941 41163947 44058057 46590255 48623745 50065973 50881095 51079704
57076E1079704l80968r12549j391667j815521k181146k484083k718386k878764
$$ 51079704 50698736 49786187 48394520 46578999 44397853 41913770 39195384 36316620
57068C6316620k963074k973172k914758k797231k633045k435949k219190j994636
$$ 36316620 33353546 30380374 27465616 24668385 22035340 19599391 17380201 15385565
57060A5385565j772295j559625j361403j180651j019446q78617p57349o54008
$$ 15385565 13613270 12053645 10692242 9511591 8492145 7613528 6856179 6202171
57052F202171n67239m95815m37731l90239l50850l17593k88485k61565k35901
$$ 6202171 5634932 5139117 4701386 4311147 3960297 3642704 3354219 3092654 2856753
57043B856753k11982j90738j72403j56427j42032j28553j15639j03383r2079q1743
$$ 2856753 2644771 2454033 2281630 2125203 1983171 1854618 1738979 1635596 1543517 1461774
57033A461774p2132o3165n4699m5836l5326k3093j0494J577J3635K5117L1645
$$ 1461774 1389642 1326477 1271778 1225942 1190616 1167523 1157029 1158606 1172241 1197358 1229003
57022A229003K7143R703j5687m0987o0792p3827q0620q1801p8434p2167o4371
$$ 1229003 1256146 1265849 1250162 1209175 1148383 1074556 993936 912135 833701 761534 697163
57011F97163n5853m7603m0853l5986l2122k8310k4606k1540j9188j7275j5750
$$ 697163 641310 593707 552854 516868 484746 456436 431830 410290 391102 373827 358077
57000C58077j4673j3755j2600j1196r761q245o396m276k292p68L42J441L129N731
$$ 358077 343404 329649 317049 305853 296092 287847 281451 277175 274883 274115 274457 275898 279027 284758
56986B84758Q770J1223J2513J2852J2366J0503O900K271k290o454j0307j3315
$$ 284758 293528 304751 317264 330116 342482 352985 359885 362156 359866 353412 343105 329790
56974C29790j4721j4818j4667j4462j3305j0782p733n010k546p4K207M319O935
$$ 329790 315069 300251 285584 271122 257817 247035 239302 234292 231746 231672 233879 238198 245133
56961B45133J0271J3360J5313J6609J8101J9262J8494J4991R312K456m591j0577
$$ 245133 255404 268764 284077 300686 318787 338049 356543 371534 380846 383302 378711 368134
56949C68134j4423j6247j7047j7193j6085j3466j0184p218m715k404l07J612L898
$$ 368134 353711 337464 320417 303224 287139 273673 263489 256271 251556 249152 248845 250457 254355
56936B54355P124J1168J5395J9288K2458K4336K4335K2138J7574J0499J355q351
$$ 254355 261479 272647 288042 307330 329788 354124 378459 400597 418171 428670 430025 421674
56924D21674j6608k2177k5117k6160k5876k4457k2021j8934j5838j3328j1613
$$ 421674 405066 382889 357772 331612 305736 281279 259258 240324 224486 211158 199545
56913A99545j0491r674q925p942o418m498k865k093j959j712r87k11l0m87r52
$$ 199545 189054 179380 170455 162513 156095 151597 148732 146639 144680 142968 141981 141770 141740 141253 140301
56898A40301q24j58N41J159K231M173O456Q052Q691R152J0216J1792J3203J3821
$$ 140301 139477 139319 139860 141019 143250 147423 153879 161931 170622 179774 189990 201782 214985 228806
56884B28806J3130J0736O974L062K5k276m496o456p318o934o081n180l721j386
$$ 228806 241936 252672 259646 262708 262733 260457 255961 249505 242187 235253 229172 223992 220271 218885
56870B18885J099K963M629P107J0504J3973J7040K0191K3967K8109L1731L3822
$$ 218885 219984 222947 227576 234683 245187 259160 276200 296391 320358 348467 380198 414020
56858D14020L3348K9462K2063J2055R00r845j8600k4050k5807k4656k1786j8015
$$ 414020 447368 476830 498893 510948 511848 502003 483403 459353 433546 408890 387104 369089
56846C69089j3845r795o113k415J861O759J1953J7416K3344K9568L5636M1482
$$ 369089 355244 345449 339336 336921 338782 345541 357494 374910 398254 427822 463458 504940
56834E04940M7234N1976N3289M8660L7316K0712J730j6361l0878m0602m5905m7793
$$ 504940 552174 604150 657439 706099 743415 764127 765857 749496 718618 678016 632111 584318
56822E84318m6835m3216l7427l0445k3265j6553j0622n373l12M982J0438J5806
$$ 584318 537483 494267 456840 426395 403130 386577 375955 370582 370270 375252 385690 401496
56810D01496K1191K6881L2524L6869L8357L5725K8303J6430J899j2494k4351l2678
$$ 401496 422687 449568 482092 518961 557318 593043 621346 637776 639675 627181 602830 570152
56798E70152l7591l9459l8653l5730l1520k6830k2237j8019j4144j0378o490k356
$$ 570152 532561 493102 454449 418719 387199 360369 338132 320113 305969 295591 289101 286745
56786B86745K047O497J0423J3313J5323J7058J8505J8477J5560R516J562o601
$$ 286745 288792 295289 305712 319025 334348 351406 369911 388388 403948 413464 415026 408425
56774D08425j3713j9132k2678k4458k4736k3822k2101k0030j7884j5630j3228
$$ 408425 394712 375580 352902 328444 303708 279886 257785 237755 219871 204241 191013
56763A91013j0952r150p794o616n624n058m849m588m193m072m336m317l421k121
$$ 191013 180061 170911 163117 156501 150877 145819 140970 136382 132189 128117 123781 119464 116043 113922
56749A13922j410j389j135j18R77J236P69L60L12K52kr5K16O83R86J068Q89L29
$$ 113922 112512 111123 109988 109870 110847 112083 112852 113212 113524 113776 113774 113679 113895 114578 115564 116632 117521 117850
56731A17850l80n85L3R11J250R85O64O12N83K21n72j618k487k627j891q97m44
$$ 117850 117470 116885 116918 117829 119079 120064 120728 121340 121923 122144 121572 119954 117467 114840 112949 112052 111608
56714A11608o16q14o71m21l66n08q02j247j558j252l86K74K00k43m09k33l3J95
$$ 111608 110992 110178 109507 109086 108720 108212 107410 106163 104605 103353 102967 103241 103441 103198 102789 102556 102523 102718
56696A02718O19J042J095R08R63J290J391J082Q32J067J565J876J923J861J578
$$ 102718 103337 104379 105474 106382 107345 108635 110026 111108 111940 113007 114572 116448 118371 120232 121810
56681A21810Q20k79j092j093l97L45N56K26k01l97m74o47p93o22k28m6k02k90
$$ 121810 122630 122351 121259 120166 119769 120114 120670 120896 120695 120298 119824 119177 118384 117762 117534 117488 117286 116996
56663A16996lL84M92M28M56M13j2n35n28o2L7n33r07k36R96J577J172N53K92J41
$$ 116996 116993 117377 117869 118297 118753 119166 119154 118619 118091 118029 118066 117533 116626 116390 117386 118963 120135 120688 120980 121121
56643A21121j50j97K49O24K24p27j366j336j052r40r88j117j375j606j447r17
$$ 121121 120971 120774 121023 121647 121871 121144 119778 118442 117390 116450 115462 114345 112970 111364 109917 109000
56627A09000o05r17j493j709j512j313j213q39k1Q06J096Q58N70N51O91P16N46
$$ 109000 108395 107478 105985 104276 102764 101451 100238 99399 99378 100184 101280 102138 102708 103259 103950 104666 105212
56610A05212K48j43o36j098j249r02j54O80J216J203P12J60PL02O62P66P13P68
$$ 105212 105460 105317 104681 103583 102334 101432 101278 101958 103174 104377 105089 105249 105256 105558 106220 106986 107699 108467
56592A08467R60J065R30O37L92L77O41J032J279J300J313J519J780J808J517J082
$$ 108467 109427 110492 111422 112059 112451 112828 113469 114501 115780 117080 118393 119912 121692 123500 125017 126099
56576A26099P02N17O38R91J247J155R35J103J909L084M142M743M888M938N396
$$ 126099 126801 127318 127956 128947 130194 131349 132284 133387 135296 138380 142522 147265 152153 157091 162487
56561A62487O378P357P673P244O584O202O212O436O608O438N815M894L865K741
$$ 162487 168865 176222 183895 191139 197723 203925 210137 216573 223181 229619 235434 240328 244193 246934
56547B46934J581O56J34k33p80j505k334l448m837n872o067n987o587p743q349
$$ 246934 248515 249171 249305 249072 248292 246787 244453 241005 236168 230296 224229 218242 211655 203912 195563
56532A95563p948p221o672n900m616l439k923k705k295k073k528l060k620j271
$$ 195563 187615 180394 173722 167822 163206 159767 156844 154139 151844 149771 147243 144183 141563 140292
56518A40292j56P7j04j73l39r53j736k040j642r13l52j19n0K2L3j29l43l91l22
$$ 140292 140136 140213 140109 139936 139597 138644 136908 134868 133226 132313 131961 131842 131792 131814 131847 131718 131375 130984 130662
56499A30662l88n84o40n51o09p64n72j9J70m16j069q88m5N66O50O80R05R79O86
$$ 130662 130274 129690 129050 128499 127890 127126 126554 126535 126705 126289 125220 124332 124287 124853 125503 126183 127088 128067 128753
56480A28753L17J63J69K63O03J220J773J934J838J911K304K645K407J623J038
$$ 128753 129070 129233 129402 129665 130268 131488 133261 135195 137033 138944 141248 143893 146300 147923 148961
56465A48961J280K000K289K015K073L007M080M272L699L295L405L511L148K373
$$ 148961 150241 152241 154530 156545 158618 161625 165705 169977 173676 176971 180376 183887 187035 189408
56451A89408J299o3j485k472k733k402j798j284j139j199r07j43L09k56j387k067
$$ 189408 190707 190644 189159 186687 183954 181552 179754 178470 177331 176132 175225 175082 175391 175135 173748 171681
56435A71681k108k101k207j958j268o86m48j88J83J47n56j364j634j367r05n06
$$ 171681 169573 167472 165265 163307 162039 161353 160905 160717 160900 161047 160491 159127 157493 156126 155221 154715
56419A54715m31q76j491j507o59M81J285J619J454O50m59r69m39M44P77N33L20
$$ 154715 154284 153408 151917 150410 149751 150232 151517 153136 154590 155240 154781 153812 153373 153817 154594 155127 155447
56402A55447M07N78O73P23P63Q57J174J665J916J566P89K7m38m46J54J202J999
$$ 155447 155854 156432 157105 157828 158591 159448 160622 162287 164203 165769 166558 166585 166147 165701 165855 167057 169056
56385A69056J879R86J28q6K00L84J25k71k33K98O76M15m3O2O17P49J44n35p08
$$ 169056 170935 171921 172049 171963 172163 172547 172672 172401 172168 172466 173142 173557 173514 173576 174193 174942 175086 174551 173843
56366A73843n65l36K94J466K440K426J701J209J239J261R40O04O44R74J265J368
$$ 173843 173278 172942 173236 174702 177142 179568 181269 182478 183717 184978 185918 186522 187166 188140 189405 190773
56350A90773J340J328J508J935K384K451J932J061L98M18J142K117K816L006K716
$$ 190773 192113 193441 194949 196884 199268 201719 203651 204712 205110 205528 206670 208787 211603 214609 217325
56335B17325K100J469J220J420J649J627J676K076K361J937J193J034J401J323
$$ 217325 219425 220894 222114 223534 225183 226810 228486 230562 232923 234860 236053 237087 238488 239811
56321B39811N72J92R09K030K566K605K843L370L762L853L715L253K539K161K564
$$ 239811 240383 240575 241484 243514 246080 248685 251528 254898 258660 262513 266228 269481 272020 274181 276745
56306B76745L293L553L220K800K598K600K918L698M632N140N043M663M386M430
$$ 276745 280038 283591 286811 289611 292209 294809 297727 301425 306057 311197 316240 320903 325289 329719
56292C29719M832N317N363M791M021L493L183L012L251M007M746M960M896N053
$$ 329719 334551 339868 345231 350022 354043 357536 360719 363731 366982 370989 375735 380695 385591 390644
56278C90644N348N548O109P662R783J1258J1659J1881J2903J4664J6539J8344
$$ 390644 395992 401540 407649 415311 425094 436352 448011 459892 472795 487459 503998 522342
56266E22342K0520K3498K7167L0934L4296L7373M0807M5010M9751N4562N9234
$$ 522342 542862 566360 593527 624461 658757 696130 736937 781947 831698 886260 945494
56255I45494O3698O7820P1586P5120P8149P9910P9890P8263P5153P0113O2949
$$ 945494 1009192 1077012 1148598 1223718 1301867 1381777 1461667 1539930 1615083 1685196 1748145
56244A748145N4520M5856L6828K6672J5537M639n153j3941k1921k8710l3888l7628
$$ 1748145 1802665 1848521 1885349 1912021 1927558 1932197 1927044 1913103 1891182 1862472 1828584 1790956
56232A790956m0488m2900m4994m6605m7467m7676m7876m8595m9647n0547n1221
$$ 1790956 1750468 1707568 1662574 1615969 1568502 1520826 1472950 1424355 1374708 1324161 1272940
56221A272940n1768n1823n0880m9130m7239m5399m3304m0977l8829l6807l4368
$$ 1272940 1221172 1169349 1118469 1069339 1022100 976701 933397 892420 853591 816784 782416
56210G82416l1475k8856k6881k4941k2332j9248j6415j4135j2235j0616r432q703
$$ 782416 750941 722085 695204 670263 647931 628683 612268 598133 585898 575282 565850 557147
56198E57147q084p089n565l951k950k773k811k355j516j063j338j737j375q7J363
$$ 557147 549063 541974 536409 532458 529508 526735 523924 521569 520053 518990 517652 515915 514540 514453 515816
56183E15816J989J499O19M34J300K558L325L398L280L607M681O231P483P813P501
$$ 515816 517805 519304 519923 520357 521657 524215 527540 530938 534218 537825 542506 548737 556220 564033 571534
56168E71534P474Q181R239J0280J1484J2913J4132J4938J5829J7230J8866K0480
$$ 571534 579008 587189 596428 606708 618192 631105 645237 660175 676004 693234 712100 732580
56156G32580K2479K5173K8130L1012L4382L8808M3900M9275N5798O4621P5505
$$ 732580 755059 780232 808362 839374 873756 912564 956464 1005739 1061537 1126158 1201663
56145A201663Q7378J00249J15116J32010J49348J65175J77856J85388J85456J76909
$$ 1201663 1289041 1389290 1504406 1636416 1785764 1950939 2128795 2314183 2499639 2676548
56135B676548J60863J40378J19515J02164R0360Q3222P8040P2320O4363N2676
$$ 2676548 2837411 2977789 3097304 3199468 3289828 3373050 3451090 3523410 3587773 3640449
56125C640449L6441J6823l334k1536l6933n0002o2183p5875r3371j14990j38556
$$ 3640449 3676890 3693713 3690379 3668843 3631910 3581908 3519725 3443850 3350479 3235489 3096933
56114C096933j60670j77993j87925j89432j83576j72459j57565j39823j20873
$$ 3096933 2936263 2758270 2570345 2380913 2197337 2024878 1867313 1727490 1606617
56105A606617j02928q7231p3638o1819n1775m3149l5200k7825k1653j6946j3245
$$ 1606617 1503689 1416458 1342820 1281001 1229226 1186077 1150877 1123052 1101399 1084453 1071208
56094A071208j0175p738n676l495j222O89K219L765N394O970Q728J0744J2269
$$ 1071208 1061033 1053295 1047619 1044124 1042902 1043591 1045810 1049575 1054969 1061939 1070667 1081411 1093680
56081A093680J2694J2778J3571J4494J4033J2072R930Q301O777N345M528M060
$$ 1093680 1106374 1119152 1132723 1147217 1161250 1173322 1183252 1191553 1198330 1203675 1208203 1212263
56069A212263L196K376K798M280N538O563Q560J1262J2729J2400J2082J3102J4641
$$ 1212263 1215459 1217835 1220633 1224913 1230451 1237014 1245574 1256836 1269565 1281965 1294047 1307149 1321790
56056A321790J5730J6785J8054J8664J8437J8707K0133K1436K1609K1551K2275
$$ 1321790 1337520 1354305 1372359 1391023 1409460 1428167 1448300 1469736 1491345 1512896 1535171
56045A535171K3200K3637K4274K5756K7236K7776K7813K8027K8197K8390K9738
$$ 1535171 1558371 1582008 1606282 1632038 1659274 1687050 1714863 1742890 1771087 1799477 1829215
56034A829215L2590L5387L6780L7569L9136M1307M3165M4706M6327M7768M8847
$$ 1829215 1861805 1897192 1933972 1971541 2010677 2051984 2095149 2139855 2186182 2233950 2282797
56023B282797N0204N2221N4344N6316N8799O1968O4936O7409P0202P3437P6128
$$ 2282797 2333001 2385222 2439566 2495882 2554681 2616649 2681585 2748994 2819196 2892633 2968761
56012B968761P8417Q1986Q7210R2199R5948J00036J05684J11526J16129J20468
$$ 2968761 3047178 3129164 3216374 3308573 3404521 3504557 3610241 3721767 3837896 3958364
56002C958364J26025J32522J39296J46769J54858J62128J68372J75721J85393
$$ 3958364 4084389 4216911 4356207 4502976 4657834 4819962 4988334 5164055 5349448
55993E349448J95865K06076K17719K32133K47713K62885K78965K97638L18248
$$ 5349448 5545313 5751389 5969108 6201241 6448954 6711839 6990804 7288442 7606690
55984G606690L40191L65180L94557M27085M62091N01761N47687N98309O52785
$$ 7606690 7946881 8312061 8706618 9133703 9595794 10097555 10645242 11243551 11896336
55975A1896336P14024P84967Q65404R55672J059732J181339J321424J482889J673619
$$ 11896336 12610360 13395327 14260731 15216403 16276135 17457474 18778898 20261787 21935406
55966B1935406J901410K171255K491747K878387L346011L904374M565841N349172
$$ 21935406 23836816 26008071 28499818 31378205 34724216 38628590 43194431 48543603
55958D8543603O269499P333780Q555480R967296J1614792J3550946J5844669J8571094
$$ 48543603 54813102 62146882 70702362 80669658 92284450 105835396 121680065 140251159
55950A40251159K1759426K5326088K9005192L2234605L4039235L3140014K8471800
$$ 140251159 162010585 187336673 216341865 248576470 282615705 315755719 344227519
55943C44227519J9886117Q478135l796225j4937559k3566613k9119738l1700145
$$ 344227519 364113636 372591771 368795546 353857987 330291374 301171636 269471491
55936B69471491l1833656l0236257k7610177k4512016k1325471j8295065j5557539
$$ 269471491 237637835 207401578 179791401 155279385 133953914 115658849 100101310
55929A00101310j3164029j1112838r381721p938388o740171n743465m915053m229033
$$ 100101310 86937281 75824443 66442722 58504334 51764163 46020698 41105645 36876612
55921C6876612l658540l178759k773933k433759k145880j898057j684017j500584
$$ 36876612 33218072 30039313 27265380 24831621 22685741 20787684 19103667 17603083
55913A7603083j341635j200520j075555r67546q73939p90309p15467o50383n93861
$$ 17603083 16261448 15060928 13985373 13017827 12143888 11353579 10638112 9987729 9393868
55904I393868n43456m98714m59713m24409l91041l60995l35629l12610k89233
$$ 9393868 8850412 8351698 7891985 7467576 7076535 6715540 6379911 6067301 5778068
55895E778068k67019k48826k33440k17450k00915j86749j75451j64748j53869
$$ 5778068 5511049 5262223 5028783 4811333 4610418 4423669 4248218 4083470 3929601
55886C929601j44192j35804j27003j17345j08250j00576r4212q9768q8024q7786
$$ 3929601 3785409 3649605 3522602 3405257 3297007 3196431 3102219 3012451 2924427 2836641
55876B836641q6838q4932q3605q3202q2330q0187p7223p3560o8841o3645n9295
$$ 2836641 2749803 2664871 2581266 2498064 2415734 2335547 2258324 2184764 2115923 2052278 1992983
55865A992983n6104n3324n0669m8409m6339m4179m2622m2386m2595m1723l9830
$$ 1992983 1936879 1883555 1832886 1784477 1738138 1693959 1651337 1608951 1566356 1524633 1484803
55854A484803l8345l7855l7640l7147l6491l5672l4554l3505l2893l2305l1260
$$ 1484803 1446458 1408603 1370963 1333816 1297325 1261653 1227099 1193594 1160701 1128396 1097136
55843A097136l0174k9500k8605k6754k4576k3170k2340k1164j9689j8556j7505
$$ 1097136 1066962 1037462 1008857 982103 957527 934357 912017 890853 871164 852608 835103
55832H35103j5783j3723j2313j1526j0503r161q175p612p019o569o785p334p490
$$ 835103 819320 805597 793284 781758 771255 762094 753919 746307 739288 732719 725934 718600 711110
55819G11110p584q438r637r906r163q689r083r588r595r523r782j0089j0126r965
$$ 711110 703526 695088 685451 675545 666382 657693 648610 639022 629427 619904 610122 600033 589907 579942
55805E79942r586q828p949p400o913n784m091k767k350k438k436k098j304q8J136
$$ 579942 570356 561528 553579 546179 539266 533482 529391 526624 524274 521836 519400 517302 515998 515910 517046
55790E17046K060L230N569R171J3095J6138J7165J5165R965K924l946r413j3167
$$ 517046 519106 522336 527905 537076 550171 566309 583474 598639 608604 611528 607582 598169 585002
55777E85002j5067j5288j4834j4653j4301j2580r507o669n512o142p856r834j1276
$$ 585002 569935 554647 539813 525160 510859 498279 488772 482103 476591 470449 462593 452759 441483
55764D41483j1682j1342j0869j0270r131p609o420n855n538n187m939m876n009
$$ 441483 429801 418459 407590 397320 388189 380580 374160 368305 362767 357580 352641 347765 342756
55751C42756n597o796q054q559q352q192q437q725q733q478p884o796n481m520
$$ 342756 337159 330363 322309 313750 305398 297206 288769 280044 271311 262833 254949 248153 242672 238152
55737B38152m149m205m507m759m449l458k481k047j713j027p37j804l615m595
$$ 238152 234003 229798 225291 220532 216083 212625 210144 208097 206384 205357 204620 202816 199201 194606
55723A94606m375l987l916l515k664k389l256m324m462l770l030k429j538j37
$$ 194606 190231 186244 182328 178813 176149 173760 170504 166180 161718 157948 154918 152489 150951 150814
55709A50814J402K279J843M45m85rQ89M39j493l303m011m252m613m518l527k476
$$ 150814 152216 154495 156338 156783 156298 156289 157178 157617 156124 152821 148810 144558 139945 135427 131900 129424
55693A29424k286k548k254j336n08j18L3Q6N7O9J69J86J94O03J424K007J949J688
$$ 129424 127138 124590 122336 121000 120492 120374 120407 120493 120550 120619 120788 120974 121168 121771 123195 125202 127151 128839
55675A28839J662J572J116P73J059J501J307P03O10J195J664J567J394J619J882
$$ 128839 130501 132073 133189 133962 135021 136522 137829 138532 139142 140337 142001 143568 144962 146581 148463
55660A48463J583P89J19q5p0j91m15m40j10M20R13J279J506J599J709K127K862
$$ 148463 150046 150835 150954 150869 150799 150608 150193 149753 149643 150063 150976 152255 153761 155360 157069 159196 162058
55643A62058L427L298K546J716J194R76Q85P00K24m06o49k66J34k48j295k176
$$ 162058 165485 168783 171329 173045 174239 175215 176100 176800 177024 176618 175969 175703 175837 175589 174294 172118
55627A72118k553k863l328l525l181k720k654k924l210l439l619l589l289k936
$$ 172118 169565 166702 163374 159849 156668 153948 151294 148370 145160 141721 138102 134513 131224 128288
55613A28288k700k496k292k260k382k326j891j270p15l16k02n02r05q55m27m60
$$ 128288 125588 123092 120800 118540 116158 113832 111941 110671 109956 109640 109438 108936 108031 107176 106749 106289
55597A06289j403k532k778k024j077o89r98j703k263k169j371m38R6L68R00J829
$$ 106289 104886 102354 99576 97552 96475 95786 94788 93085 90822 88653 87282 86844 86940 87308 88208 90037
55581I0037K800L566M301N258O395P485Q480R627J1203J3175J5095J6361J6447
$$ 90037 92837 96403 100704 105962 112357 119842 128322 137949 149152 162327 177422 193783 210230
55568B10230J4998J1962P726K934k017p014j1652j5042j6584j6633j5975j4971
$$ 210230 225228 237190 244916 247850 245833 238819 227167 212125 195541 178908 162933 147962
55556A47962j3710j2590j1950j1376j0137q256o459n065l798k650k061k004j819
$$ 147962 134252 121662 109712 98336 88199 79943 73484 68419 64621 61971 59910 57906 56087
55543E6087j270r87j404j977j908j161k55M21P00M56j78p46r52q61n20J31P71
$$ 56087 54817 53830 52426 50449 48541 47380 47125 47546 48246 48702 48524 47778 46826 45965 45445 45576 46347
55526D6347P60N3n42m03Q8K28Pj1M83J257J820J785J262J010J623K448K105M34
$$ 46347 47107 47160 46618 46215 46303 46531 46538 46527 47010 48267 50087 51872 53134 54144 55767 58215 60320 60754
55508F0754q80k90J652L065K943J874R53P63J227J745J552M27r83j883k124k013
$$ 60754 59874 59584 61236 64301 67244 69118 70071 70834 72061 73806 75358 75785 74802 72919 70795 68782
55492F8782j745j480j557k104k681k859k811k884k930k640k223k075k108j993
$$ 68782 67037 65557 64000 61896 59215 56356 53545 50661 47731 45091 42868 40793 38685 36692
55478C6692j806j831j934j824j689j879k143j896j145m40J7M43P16L64n40j246
$$ 36692 34886 33055 31121 29297 27608 25729 23586 21690 20545 20105 20122 20565 21281 21645 21105 19859
55462A9859j332j180j211j215q72l54o3l2o8j57m36q56j180j199q28r7P45J252
$$ 19859 18527 17347 16136 14921 14049 13695 13632 13600 13532 13375 12939 12083 10903 9704 8876 8779 9524 10776
55444A0776J054K05q47j561j668j292p70l61r2J27L37N30O79P69P80P17N14J16
$$ 10776 11830 12035 11188 9627 7959 6667 5897 5536 5444 5571 5908 6438 7117 7886 8666 9383 9897 10013
55426A0013k74j69N76J340J374Q13M30M57L84P8J92J042J911K063J818J841J973
$$ 10013 9739 9570 10146 11486 12860 13673 14103 14560 14944 15022 15214 16256 18167 20230 22048 23889 25862
55409B5862J597P04k11j033j854k188j409rO18j41j403k034j868j398q76k88K18
$$ 25862 27459 28163 27952 26919 25065 22877 21468 21459 22077 21936 20533 18499 16631 15233 14357 14069 14287
55392A4287L95K60Q6J12M06Q79J298J424J229R06O47M51J75l55j137j868k145
$$ 14287 14682 14942 15028 15140 15546 16425 17723 19147 20376 21282 21929 22380 22555 22200 21063 19195 17050
55375A7050j937j608j395j144p39l85k09N3N32Q51P17N29P76J162J040M55M6l9
$$ 17050 15113 13505 12110 10966 10227 9842 9633 9686 10218 11069 11786 12315 13091 14253 15293 15748 15794 15755
55357A5755k59p43r82o52j29O2j88o57j034r52k88M78O78K33m42j109j769k048
$$ 15755 15496 14753 13771 13119 12990 13052 12864 12207 11173 10221 9933 10411 11089 11322 10880 9771 8002 5954
55339E954j452l21K95K2m01l74k69m92n58M5P68O78j12o44n25k13J0M11R29Q85
$$ 5954 4502 4181 4476 4498 4097 3723 3454 2962 2404 2449 3217 3895 3783 3139 2614 2401 2411 2822 3751 4636
55319D636j7r94j124n24l7n7k43k90l43D39c64q55p40m16L25g04A201J434L14
$$ 4636 4619 3625 2501 1977 1940 1883 1640 1350 1007 439 -364 -1219 -1959 -2375 -2050 -704 1201 2635 2949
55300B949n44p99H01D5c46b8H04P26K54n5O0N29J071J158M85l63l52N47J041K10
$$ 2949 2405 1606 801 45 -346 -28 804 1530 1784 1729 1789 2318 3389 4547 5032 4669 4317 4864 5905 6115
55280F115j190j816j449p80r4P49J370J173M97M22J155J674J194J73n00n69l18
$$ 6115 4925 3109 1660 880 786 1535 2905 4078 4575 4997 6152 7826 9020 9193 8693 8124 7806
55263G806m5Ql02p23p80m75k97l84l12P4K23k70q95q71j63O28J135J543J998K144
$$ 7806 7761 7769 7467 6744 5964 5489 5192 4808 4496 4570 4793 4523 3628 2757 2594 3222 4357 5900 7898 10042
55243A0042J384l66k194k772j708j51M23j18o24l18L68O84N54L09P5j50k71l52
$$ 10042 11426 11060 8866 6094 4386 4235 4658 4540 3916 3598 3966 4650 5204 5513 5588 5438 5167 4815
55225D815o97j283A305B67I9M66P54R17Q72L66m10q03l78O19J482J605R17p3o60
$$ 4815 4118 2835 1305 267 99 565 1319 2236 3108 3474 3064 2261 1883 2502 3984 5589 6506 6433 5773
55206E773n37RM37M78L37M64J026J525J229J56p35p07k14j85o71r21o08j73J7
$$ 5773 5236 5245 5682 6160 6497 6961 7987 9512 10741 10897 10162 9455 9241 9056 8385 7464 6856 6683 6700
55187F700L3j35o28j112r14l4P37Q77O08J33o39j372j202J8J237J512J058M79
$$ 6700 6733 6598 5970 4858 3944 3910 4647 5524 6132 6265 5626 4254 3052 3070 4307 5819 6877 7356
55169G356k22j114j631j325p59p67C06a097j018k79Q61I18L798L862K485N58r82
$$ 7356 7134 6020 4389 3064 2305 1538 306 -1097 -2115 -2394 -1533 918 4716 8578 11063 11621 10639
55152A0639j776j871j543j255j192r76k99M01M59j4k94m1L98O32O40N58M84L99
$$ 10639 8863 6992 5449 4194 3002 2026 1727 2128 2587 2573 2279 2238 2636 3268 3908 4466 4950 5349
55134E349Q9o14j234q91M40J512J316M50R4K30m1p21q77k71K37J76J67O78J098
$$ 5349 5438 4824 3590 2699 3139 4651 5967 6417 6511 6741 6700 5979 5102 4831 5068 5244 5411 6089 7187
55115G187P71J62K45J193K257K678K250J219J42l48N6J067K052K515K363J849
$$ 7187 7958 8120 8365 9558 11815 14493 16743 17962 18104 17756 17812 18879 20931 23446 25809 27658
55099B7658J266O31j61q35q62l17p6o42j250r35%M14jm60m73l63m11m09l39n30
$$ 27658 28924 29555 29394 28559 27697 27380 27304 26662 25412 24477 24477 24891 24890 24430 23957 23594 23183 22774 22435 21905
55079B1905r25r95o66m63m98k40M37R02Q62P64O89m8j492k374j774o00l21q85
$$ 21905 20980 19985 19319 18856 18358 18118 18555 19457 20319 21083 21772 21724 20232 17858 16084 15484 15163 14278
55061A4278j122o24l2K67N54R31J178J371J768K010J444K57n82o51n13o58q38
$$ 14278 13156 12532 12500 12767 13321 14252 15430 16801 18569 20579 22023 22280 21698 21047 20534 19876 19038
55044A9038p20m48k26OJ61n0m85n18j7K91j17o95n81K24R91J189P77p3r42j154
$$ 19038 18318 17870 17644 17650 17811 17761 17276 16758 16741 17032 16915 16220 15639 15863 16854 18043 18820 18747 17805 16651
55024A6651m91K89K97k48l15M71J340J508J117P54O40P15J024J521J805J511Q58
$$ 16651 16160 16449 16746 16498 16183 16654 17994 19502 20619 21373 22013 22728 23752 25273 27078 28589 29447
55007B9447L67J48j06n70j058j292j109m85K99O62L24j28J37J066J707J510J028
$$ 29447 29814 29962 29856 29286 28228 26936 25827 25342 25641 26303 26627 26499 26636 27702 29409 30919 31947
54990C1947R70J166R57K50m35p50p81o08j53M45P41M97nk74q3L85P56P92O31O19
$$ 31947 32917 34083 35040 35290 34855 34105 33324 32716 32563 33008 33749 34246 34241 33967 33884 34269 35025 35817 36448 37067
54970C7067Q45R94Q54O54O24N20K6o12q32n68k48n0K85Q31J241J320J294J309
$$ 37067 37912 38906 39760 40414 41038 41558 41584 40972 40140 39572 39324 39274 39559 40390 41631 42951 44245 45554
54952D5554J163Q34P68J282K022K404K374K389K821L729M951O191P162P920Q892
$$ 45554 46717 47551 48319 49601 51623 54027 56401 58790 61611 65340 70291 76482 83644 91564 100456
54937A00456J0364J2154J3944J5544J6530J6059J3605R739N604J716k229o357
$$ 100456 110820 122974 136918 152462 168992 185051 198656 208395 213999 215715 213486 207129
54925B07129j0031j2518j3773j4207j4039j3262j2119j1069j0200r027p195n140
$$ 207129 197098 184580 170807 156600 142561 129299 117180 106111 95911 86884 79689 74549
54913G4549l708l161k934k505j990j658j249l56P66J426J530J743K505L471M218
$$ 74549 70841 67680 64746 62241 60251 58593 57344 56988 57754 59180 60710 62453 64958 68429 72647
54898G2647M941O051P456Q735R733J0623J1539J2419J3019J2849J1434Q880N863
$$ 72647 77588 83639 91095 99830 109563 120186 131725 144144 157163 170012 181446 190326 196189
54885A96189K726r12n214r282j1978j3230j3796j3923j3177j1567r941q974q424
$$ 196189 198915 198003 192789 183507 171529 158299 144503 130580 117403 105836 95895 86921 78497
54872G8497p706o648n405m145l121k568k249j569m19N51Q60Q45R90J082O73l7
$$ 78497 70791 64143 58738 54593 51472 48904 46655 45086 44667 45218 46078 46923 47913 48995 49668 49631
54856D9631m13l12j79l08o24j098j813k504k622k056j368j103j227j401j442j351
$$ 49631 49218 48906 48727 48419 47795 46697 44884 42380 39758 37702 36334 35231 34004 32603 31161 29810
54840B9810j164j050j222j550j578j065l02L67R57J460J450O08n51j084p76l39
$$ 29810 28646 27596 26374 24824 23246 22181 21879 22246 23203 24663 26113 26721 26170 25086 24310 23971
54824B3971l57n50l97JJ64J9pL05P04Q81Q36O90M92L88O87J363J769J250R4n88
$$ 23971 23614 23064 22667 22668 22832 22851 22844 23149 23853 24734 25570 26260 26752 27140 27827 29190 30959 32209 32303 31715
54804C1715j36Q51J286R30N02N49Q24R28J059J596K317K668K663K902L554M003
$$ 31715 31579 32430 33716 34646 35148 35697 36521 37449 38508 40104 42421 45089 47752 50654 54208 58211
54788E8211L916M019N219P231Q847R583J0283J1848J3884J5108J4812J3304J1058
$$ 58211 62127 66146 71365 78596 87443 97026 107309 119157 133041 148149 162961 176265 187323
54775A87323Q035M144o1l628o149q054r874j1435j2124j1735j0749r715q645p245
$$ 187323 195358 199502 199441 195813 189664 181610 171736 160301 148177 136442 125693 115978 107333 100088
54761A00088n539l991l062k794k902l052l034k712k025j097k39L53R05J878L295
$$ 100088 94549 90558 87496 84702 81800 78748 75714 73002 70977 69880 69641 69994 70899 72777 76072
54746G6072M512M970N043N667P102Q599R504J0113J1085J2453J3742J4707J5189
$$ 76072 80584 85554 90597 96264 103366 111965 121469 131582 142667 155120 168862 183569 198758
54733A98758J4479J1691O930J472l429p434j0629j2881j4101j4680j5071j5123
$$ 198758 213237 224928 231858 233330 229901 222467 211838 198957 184856 170176 155105 139982
54721A39982j4359j2808j1096r729q645p556o408n306m235l134k151j650j737
$$ 139982 125623 112815 101719 91990 83345 75789 69381 64075 59840 56706 54555 52905 51168
54708E1168j999j912j495j204j111o56M24J375J262K90m95p31r92j438j291k15
$$ 51168 49169 47257 45762 44558 43447 42791 43215 44590 45852 46142 45647 44916 43924 42486 41195 40980
54692D0980P32M68m75o98K0N67K67k70l26o4j7k14l77l84j65M35J244J671J420
$$ 40980 41712 42180 41705 41007 41027 41594 41861 41591 41265 41201 41184 40970 40593 40209 40044 40479 41723 43394 44814
54673D4814R88R87J324J520J525J619J709J424Q76O91J057J285P23l25r47p82
$$ 44814 45802 46789 48113 49633 51158 52777 54486 55910 56786 57477 58534 59819 60542 60217 59270 58488
54657E8488l79l84p44r40p77n77n62m48J27R05J240R25M50K49K31K60O10J423
$$ 58488 58109 57725 56981 56041 55264 54687 54125 53677 53804 54709 55949 56874 57324 57573 57804 58064 58674 60097
54639F0097K066J773Q66N23J228K154K425K373K903M162N455O316O895P393P739
$$ 60097 62163 63936 64802 65325 66553 68707 71132 73505 76408 80570 86025 92341 99236 106629 114368
54624A14368P843P688P011N491L309J069r65k980m789n599n145m427m604n538
$$ 114368 122211 129899 136910 142401 145710 146779 145814 142834 138045 132446 127301 122874 118270 112732
54610A12732o096n697m809m006l356k828k563k451k075j439j203j781k620k937
$$ 112732 106636 100939 96130 92124 88768 85940 83377 80926 78851 77412 76209 74428 71808 68871
54596F8871k792k789k956k621j550m74j96n66p40k87L87N97J26o71j240j284r90
$$ 68871 66079 63290 60334 57713 56163 55689 55493 54927 54187 53900 54287 54884 55010 54339 53099 51815 50825
54579E0825q67j197j663j677j126n14k50q2M03R67R50K52m60o65n79n74n44k78
$$ 50825 49958 48761 47098 45421 44295 43781 43531 43449 43852 44819 45769 46021 45561 44896 44317 43743 43199 42921
54561D2921l6k14p05j097j280j351j159n86j00k64p57o81N8N41K73m8K88Q56Q47
$$ 42921 42885 42671 41966 40869 39589 38238 37079 36493 36393 36129 35372 34691 34749 35290 35563 35515 35803 36659 37506
54542C7506L65J62L95N41M17M24P05Q22M98J42K47O91R85R99R59R37P00K47J48
$$ 37506 37871 38033 38428 38969 39386 39810 40515 41337 41835 41977 42224 42915 43900 44899 45858 46795 47495 47742 47890
54523D7890J013K642L983M138L274K348K106K611L484M196M139L039J391P8o91
$$ 47890 48903 51545 55528 59666 62940 65288 67394 70005 73489 77685 81824 84863 86254 86332 85641
54508H5641j460k427k871k222j168r62j858k867l037k405j649j286j329j494j569
$$ 85641 84181 81754 78883 76661 75493 74531 72673 69806 66769 64364 62715 61429 60100 58606 57037
54493E7037j624j724j526n93Q04J709J703J486J751J992J331O3o22l21J25m3o61
$$ 57037 55413 53689 52163 51570 52374 54083 55786 57272 59023 61015 62346 62409 61787 61466 61591 61548 60887
54476F0887j225j483j235l80N42O69L2l20J81P37M46l43o19j54M34P15P13M73
$$ 60887 59662 58179 56944 56564 57106 57775 57807 57487 57668 58405 58851 58508 57889 57735 58169 58884 59597 60070
54458F0070M2k46j45l0m00j019j165p13k00J65P75J681K157J662P12K06K54J92
$$ 60070 60112 59866 59721 59691 59291 58272 57107 56394 56194 56359 57134 58815 60972 62634 63346 63552 63806 63998
54440F3998l93j184j667j726j608j533j521j393q89L6R51J217P21J78L45J010
$$ 63998 63605 62421 60754 59028 57420 55887 54366 52973 52084 52120 53071 54288 55009 55187 55532 56542
54424E6542J228O22l3O4N11K86p16j507j423q53l15L63J331J960J616Q14O59J305
$$ 56542 57770 58392 58359 58423 58934 59220 58504 56997 55574 54721 54406 54769 56100 58060 59676 60490 61149 62454
54406F2454J853J798J665J997K549K880L072L247L062K214J180O98P96Q67N53
$$ 62454 64307 66105 67770 69767 72316 75196 78268 81515 84577 86791 87971 88669 89465 90332 90885
54391I0885K4n31j082j462j487j367j459j555j066p5N18J77n64j014j315j818
$$ 90885 90909 90378 89296 87834 86347 84980 83521 81966 80900 80825 81343 81520 80956 79942 78627 76809
54375G6809k084j431j97M81J57n22j051j636k288k259j128K84Q92P63P12Q95P52
$$ 76809 74725 73294 73097 73578 73735 73213 72162 70526 68238 65979 64851 65135 66027 66790 67502 68397 69149
54358F9149K44N9M15O04J65k67J18J060J666J723J809K156K164J360K77j10M34
$$ 69149 69393 69452 69867 70471 70636 70369 70487 71547 73213 74936 76745 78901 81065 82425 82702 82592 83026
54341H3026J159J307R12M94K72J2m70r88j322j547j783j913j777j575j672k027
$$ 83026 84185 85492 86404 86898 87170 87182 86712 85724 84402 82855 81072 79159 77382 75807 74135 72108
54325G2108k163j813j334j298j812k384k446j887j132p36q42j055r54o10m04m04
$$ 72108 69945 68132 66798 65500 63688 61304 58858 56971 55839 55103 54261 53206 52252 51642 51238 50834
54309E0834k47K58O76L77o84j793k110j455m32P9l06j226j987k210j974j509r57
$$ 50834 50587 50845 51521 51898 51214 49421 47311 45856 45424 45503 45197 43971 41984 39774 37800 36291 35334
54292C5334m20m5J19J73K70M72P37R26Q79N76K60K34N60J047J478J709J584J074
$$ 35334 34914 34869 34988 35161 35431 35903 36640 37566 38445 39021 39281 39515 40075 41122 42600 44309 45893 46967
54274D6967M60J73L14N72O90P58R67J289J530J591J455J069L99m45j172j481j276
$$ 46967 47427 47600 47914 48486 49176 49934 50901 52190 53720 55311 56766 57835 58234 57789 56617 55136 53860
54257E3860p54k96j44j77r2K76P91J106Q71M8q53j153p44k25p9j13o5k44q89j315
$$ 53860 53106 52810 52666 52489 52397 52673 53464 54570 55441 55489 54636 53483 52739 52514 52435 52322 52257 52013 51124 49809
54237D9809o38P87J572J104J53m88r85j594j821j230l75j14m13o24n62m72k58
$$ 49809 49171 49958 51530 52634 52787 52299 51314 49720 47899 46669 46294 46180 45767 45143 44581 44109 43851
54220D3851M16J352J864J612R28K87o4p8J5j74o04n96K20J084R60n3r17j112r82
$$ 43851 44267 45619 47483 49095 50023 50310 50246 50168 50183 50009 49405 48809 49029 50113 51073 51020 50103 48991 48009
54201D8009p77l53L6k37j026j275n50J89m4q76j273j020o19k81Q2J16o90j954
$$ 48009 47232 46879 46915 46678 45652 44377 43827 44016 43972 43096 41823 40803 40184 39903 39985 40101 39411 37457
54183C7457k519j866p93l39n39n91N9J142J912J819Q88l06j085j170q31n40n29
$$ 37457 34938 33072 32279 31940 31401 30810 30869 32011 33923 35742 36630 36324 35239 34069 33238 32698 32169
54166C2169o46n63j84J73N3n78j143j003k32L41L4p89j007j3J414J878J048J27
$$ 32169 31523 30960 30776 30949 31002 30424 29281 28278 28046 28387 28421 27632 26625 26612 28026 29904 30952 31079
54148C1079L49J345J631N64q54j340q56l49l72o07m93J23J003J697J656O36q70
$$ 31079 31428 32773 34404 34968 34114 32774 31918 31569 31197 30590 30097 30220 31223 32920 34576 35212 34342
54131C4342j871j785r88l79m70r84j177n79N31J318J191L95l06l91P0P39J288
$$ 34342 32471 30686 29698 29319 28849 27865 26688 26109 26640 27958 29149 29544 29238 28847 28917 29656 30944
54114C0944J371P28m37j439j692j243n37J79R60J719K044J573N15m18o40k83p0
$$ 30944 32315 33043 32606 31167 29475 28232 27695 27874 28834 30553 32597 34170 34685 34267 33627 33344 33274
54097C3274m73j048r27L3R16Q37Qn70l16M89J326J900J989J431N84K43O90J168
$$ 33274 32801 31753 30826 30859 31775 32612 32620 32050 31734 32223 33549 35449 37438 38869 39453 39696 40386 41554
54079D1554Q54J6k91L38J212J549J384J225J274J351J328J250J133R22O58M59
$$ 41554 42408 42424 42133 42471 43683 45232 46616 47841 49115 50466 51794 53044 54177 55099 55757 56216
54063E6216L67L33L39L93M16L14K15M51J170J949K027J072l09j066p50P9N89N78
$$ 56216 56583 56916 57255 57648 58064 58378 58593 59044 60214 62163 64190 65262 64953 63887 63137 63216 63805 64383
54045F4383M78O93J219J804K151K066J626J222J186J470J852K311K823L063K736
$$ 64383 64861 65554 66773 68577 70728 72794 74420 75642 76828 78298 80150 82461 85284 88347 91083
54030I1083K073J586J380J272J368J847K263J869Q25J30J89K72j56n29k63J81
$$ 91083 93156 94742 96122 97394 98762 100609 102872 104741 105566 105696 105885 106157 106001 105472 105209 105390
54014A05390R1l52o86j226k408l555l573k696k233k576k708j923q99n42p66j009
$$ 105390 105481 105129 104443 103217 100809 97254 93681 90985 88752 86176 83468 81545 80646 80104 79338 78329
53998G8329j170j410j586j494j312j280j305j210j081r81p70n28p20j489k149
$$ 78329 77159 75749 74163 72669 71357 70077 68772 67562 66481 65500 64730 64202 63482 61993 59844
53983E9844j926r41n4J59j22l41q5O37J343J447Q82K27JJ17K03J51J15J89M18
$$ 59844 57918 56977 56923 57082 56960 56619 56534 57171 58514 59961 60843 61070 61071 61188 61391 61542 61657 61846 62264
53964F2264Q62J415J756J710J418R73L44j14L13J627K566J928J98j012j018p40
$$ 62264 63126 64541 66297 68007 69425 70398 70742 70628 70941 72568 75134 77062 77260 76248 75230 74490
53948G4490j059j460q50P54K136K365J780J404J723K408K950L251L484L809M386
$$ 74490 73431 71971 71121 71875 74011 76376 78156 79560 81283 83691 86641 89892 93376 97185 101571
53933A01571N329O310O514N622M509M310M769M508L069J635J129P01p85k619l025
$$ 101571 106900 113210 119724 125346 129855 134165 138934 143442 146511 148146 149275 149976 149191 146572 143547
53918A43547j755m48k72n81l65K44O65J059J774K253J555j74j700k126j685j111
$$ 143547 141792 141344 141072 140491 140126 140370 141035 142094 143868 146121 147676 147502 145802 143676 141991 140880
53902A40880q10p84q47p56m86n15j408k973m227m467m068l930m345m800m790m381
$$ 140880 140070 139286 138439 137683 137197 136682 135274 132301 128074 123607 119539 115609 111264 106464 101674 97293
53886I7293l868l270k428j529j122j512k271k582k062j092l49j25k48m84p82j103
$$ 97293 93425 90155 87727 86198 85076 83564 81293 78711 76649 75557 75208 75083 74835 74351 73569 72466
53870G2466j254j101q12o70p80j081j552k082k179j316K72J502J530O90j0j27
$$ 72466 71212 70111 69299 68629 67849 66768 65216 63134 60955 59639 59911 61413 62943 63633 63623 63496
53854F3496o9k93p61j208j483j420q65k8N49O35N83P66J068J183J112R79O95J54
$$ 63496 63427 63134 62373 61165 59682 58262 57397 57369 57918 58553 59136 59902 60970 62153 63265 64244 64939 65093
53836F5093m35q02r76j061q99l44L24P07Q67J084J233Q59k4p57p08J38J297K137
$$ 65093 64658 63856 62880 61819 60920 60576 60900 61607 62474 63558 64791 65650 65626 64869 64161 64299 65596 67733
53818F7733K180J458O02K87N86J202J996K785K906J872M37J26J397L078L957M124
$$ 67733 69913 71371 71973 72260 72846 74048 76044 78829 81735 83607 84044 84170 85567 88645 92602 96726
53802I6726M222M225L794L206L006K975K400J248L05J08L96O59O17J32p11j332
$$ 96726 100948 105173 108967 112173 115179 118154 120554 121802 122107 122215 122611 123270 123887 124019 123308 121976
53786A21976j102k61K36k1l96k78J1j58o56q51o79p51j414k209k409j858j103
$$ 121976 120874 120613 120849 120828 120432 120154 120165 120007 119351 118500 117821 117070 115656 113447 111038 109180 108077
53769A08077q62j377k201k632k436k036j888j898j668j107n06o2K48L90J70l87
$$ 108077 107215 105838 103637 101005 98569 96533 94645 92747 91079 89972 89466 89404 89652 90042 90212 89825
53753H9825q75q61l27L57P42O00M5n09o81m86k13n4N2R1j14n55q18n30J19N31
$$ 89825 88950 88089 87762 88119 88861 89461 89506 88997 88316 87830 87617 87563 87615 87706 87592 87037 86219 85689 85808 86339
53733H6339L72j40n56o36m60l03l77o29p31l67M16J195J528J336J027J202K111
$$ 86339 86711 86571 86015 85379 84919 84616 84239 83610 82879 82512 82928 84123 85651 86987 88014 89216 91327
53716I1327L314M029L934L396K823K081Q49o05j531j557j002k75O74K040L666
$$ 91327 94641 98670 102604 106000 108823 110904 111753 111148 109617 108060 107058 106783 107457 109497 113163
53701A13163N166O299O900O674N506L884K616J998J635J184Q74J043J526J874
$$ 113163 118329 124628 131528 138202 143708 147592 150208 152206 153841 155025 155899 156942 158468 160342
53687A60342K047K381K918L248L155K949K868K633K007J417J393J665J447O47
$$ 160342 162389 164770 167688 170936 174091 177040 179908 182541 184548 185965 187358 189023 190470 191117
53673A91117kj03j42n46r11p35l02k14m38n25n09q07j400j772j676j352r51l85
$$ 191117 191115 191012 190870 190324 189413 188678 188376 188162 187724 187199 186690 185883 184483 182711 181035 179683 178732 178347
53655A78347J93L84J23k33m73p16r28q77o42n91p18o02j20L52O22Q81J065P66
$$ 178347 178540 178924 179047 178814 178341 177625 176697 175820 175178 174587 173869 173267 173147 173499 174121 175002 176067 176833
53637A76833Q8k20J26M57L10K48Q63J647J742J252R78J212J625K042K464K557
$$ 176833 176921 176701 176827 177284 177594 177842 178705 180352 182094 183346 184324 185536 187161 189203 191667 194224
53621A94224K036J380J394K094K813L242L604L903L923L948M605N760O479O300
$$ 194224 196260 197640 199034 201128 203941 207183 210787 214690 218613 222561 227166 232926 239405 245705
53607B45705N778N483N248M791M342M125L847L222K586K475K851L245L451L635
$$ 245705 251483 256966 262214 267005 271347 275472 279319 282541 285127 287602 290453 293698 297149 300784
53593C00784L887L965L536K550J426Q00R15J335J550J659K007K314J902P95j68
$$ 300784 304671 308636 312172 314722 316148 316948 317863 319198 320748 322407 324414 326728 328630 329425 329257
53578C29257m98o82j302k176k738k737k261j545j069j300j928j981j167m98r60
$$ 329257 328759 328077 326775 324599 321861 319124 316863 315318 314249 312949 311021 309040 307873 307375 306415
53563C06415k125k840k773k463k191j743j244j251j838k299k087j502j180j283
$$ 306415 304290 301450 298677 296214 294023 292280 291036 289785 287947 285648 283561 282059 280879 279596
53549B79596j448j225m25P54J721J894J282N68M93J173K100K674K703K419K114
$$ 279596 278148 276923 276498 277252 278973 280867 282149 282717 283210 284383 286483 289157 291860 294279 296393
53534B96393J909J937K489L637M801N275N187N421O359P312P600P596Q163R434
$$ 296393 298302 300239 302728 306365 311166 316441 321628 327049 333408 340720 348320 355916 364079 373513
53520C73513J0855J2076J3078J3676J3668J3448J3715J4452J4929J4873J5011
$$ 373513 384368 396444 409522 423198 436866 450314 464029 478481 493410 508283 523294
53509E23294J6104J7960J9786K1126K2087K2903K3691K4548K5547K6626K7524
$$ 523294 539398 557358 577144 598270 620357 643260 666951 691499 717046 743672 771196
53498G71196K7874K7439K6390K5269K4490K3978K3519K3300K3745K4793K5806
$$ 771196 799070 826509 852899 878168 902658 926636 950155 973455 997200 1021993 1047799
53487A047799K6291K6386K6492K6757K7094K7349K7319K6785K5773K4615K3615
$$ 1047799 1074090 1100476 1126968 1153725 1180819 1208168 1235487 1262272 1288045 1312660 1336275
53476A336275K2790K2011K1140J9956J8228J6094J4207J3175J2923J2711J1817
$$ 1336275 1359065 1381076 1402216 1422172 1440400 1456494 1470701 1483876 1496799 1509510 1521327
53465A521327J0153Q214O474M898L055P21j880m431o831q988j0635j1799j3043
$$ 1521327 1531480 1539694 1546168 1551066 1554121 1554842 1552962 1548531 1541700 1532712 1522077 1510278 1497235
53452A497235j4809j6623j7731j8330j9441k1415k3372k4419k4680k4669k4359
$$ 1497235 1482426 1465803 1448072 1429742 1410301 1388886 1365514 1341095 1316415 1291746 1267387
53441A267387k3553k2675k2410k2774k3151k3072k2442k1232j9571j8041j7165
$$ 1267387 1243834 1221159 1198749 1175975 1152824 1129752 1107310 1086078 1066507 1048466 1031301
53430A031301j6671j5819j4487j3223j2170j0716q506o123m255k711q39J464L694
$$ 1031301 1014630 998811 984324 971101 958931 948215 939709 933586 929331 926620 925781 927245 930939
53417I30939N516O998Q277R522J1180J3664J6669J9298K1006K1976K2515K2720
$$ 930939 936455 943453 951730 961252 972432 986096 1002765 1022063 1043069 1065045 1087560 1110280
53405A110280K3052K4527K7517L0797L2600L2715L2700L3934L6201L8547M0691
$$ 1110280 1133332 1157859 1185376 1216173 1248773 1281488 1314188 1348122 1384323 1422870 1463561
53394A463561M2956M5287M7321M9189N1400N3873N5829N6917N7768N9082O0681
$$ 1463561 1506517 1551804 1599125 1648314 1699714 1753587 1809416 1866333 1924101 1983183 2043864
53383B043864O1865O2366O2478O2477O2289O1590N9980N7245N3759N0315M7241
$$ 2043864 2105729 2168095 2230573 2293050 2355339 2416929 2476909 2534154 2587913 2638228 2685469
53372B685469M3928L9690L4835L0348K6659K3353K0046J6809J3647J0225O452
$$ 2685469 2729397 2769087 2803922 2834270 2860929 2884282 2904328 2921137 2934784 2945009 2951461
53361B951461K701r44n092j0138j5388j9889k3921k8917l5813m3944n1668n7647
$$ 2951461 2954162 2953218 2948126 2937988 2922600 2902711 2878790 2849873 2814060 2770116 2718448 2660801
53349B660801o1443o3426o4404o5021o5232o4584o3069o1322n9870n8582n7180
$$ 2660801 2599358 2535932 2471528 2406507 2341275 2276691 2213622 2152300 2092430 2033848 1976668
53338A976668n5906n5197n4940n4541n3660n2457n1175m9849m8460m6997m5311
$$ 1976668 1920762 1865565 1810625 1756084 1702424 1649967 1598792 1548943 1500483 1453486 1408175
53327A408175m3236m0889l8540l6091l3110k9507k5898k3083k1291k0129j9037
$$ 1408175 1364939 1324050 1285510 1249419 1216309 1186802 1160904 1137821 1116530 1096401 1077364
53316A077364j7631j5753j3533j1359r632q488p761p093o057m429k473q37O7N24
$$ 1077364 1059733 1043980 1030447 1019088 1009456 1000968 993207 986114 980057 975628 973155 972318 972385 972909
53302I72909J203K405L750M647N006N450O770R150J1976J4555J6823J9169K1629
$$ 972909 974112 976517 980267 984914 989920 995370 1002140 1011290 1023266 1037821 1054644 1073813 1095442
53289A095442K3713K5146K6352K7855K9422L0281L0099K9478K9249K9478K9371
$$ 1095442 1119155 1144301 1170653 1198508 1227930 1258211 1288310 1317788 1347037 1376515 1405886
53278A405886K8200K6185K4225K2813K1510J9664J7299J4895J2611J0348Q354
$$ 1405886 1434086 1460271 1484496 1507309 1528819 1548483 1565782 1580677 1593288 1603636 1611990
53267A611990P024O055M558K279k8j845l710o276r227j1868j4250j6874j9701
$$ 1611990 1619014 1625069 1629627 1631906 1631878 1630033 1626323 1620047 1610820 1598952 1584702 1567828 1548127
53254A548127k2276k4574k6875k9012l0622l2052l4005l6300l7862l8172l7807
$$ 1548127 1525851 1501277 1474402 1445390 1414768 1382716 1348711 1312411 1274549 1236377 1198570
53243A198570l7331l6499l5018l3207l1470k9711k7866k6389k5654k5335k4915
$$ 1198570 1161239 1124740 1089722 1056515 1025045 995334 967468 941079 915425 890090 865175
53232H65175k4446k4248k4293k4407k4667k4981k4632k3013k0603j8512j7105
$$ 865175 840729 816481 792188 767781 743114 718133 693501 670488 649885 631373 614268
53221F14268j5759j4040j2352j1196j0401r524q645q345q908r897j0556j0551
$$ 614268 598509 584469 572117 560921 550520 540996 532351 524006 515098 505201 494645 484094
53209D84094j0189r905r667r062q023p129o978p442p857p762p259o679o250o044
$$ 484094 473905 464000 454333 445271 437248 430119 423141 415699 407842 400080 392821 386142 379892 373848
53195C73848o045o149o236o278o296o258o088n752n261m743m438m505m655m367
$$ 373848 367803 361654 355418 349140 342844 336586 330498 324746 319485 314742 310304 305799 301144 296777
53181B96777l601l063l407m337m856m372l238k178j558j320j360j615j849j619
$$ 296777 293176 290113 286706 282369 277513 273141 269903 267725 266167 264847 263487 261872 260023 258404
53167B58404p24L70P90K42n00l96N10J011J82j520k759k751j795p44k51m37r54
$$ 258404 257680 258050 258840 259082 258582 258186 258696 259707 259889 258369 255610 252859 251064 250320 250069 249632 248678
53150B48678j390j731k236k788k829k152j343j028j031q85o96r00j349j466j213
$$ 248678 247288 245557 243321 240533 237704 235552 234209 233181 232150 231265 230569 229669 228320 226854 225641
53135B25641j131j327j249o96l36p48j547j987j960j903j968j861j406q31m65
$$ 225641 224510 223183 221934 221238 220902 220154 218607 216620 214660 212757 210789 208928 207522 206691 206226
53120B06226m56p73j268j712j925j890j723j597j670j968k283k354k174j931j717
$$ 206226 205770 204997 203729 202017 200092 198202 196479 194882 193212 191244 188961 186607 184433 182502 180785
53105A80785j543j550j822k001j596q25n69j195j937j919j379j325k168l276l790
$$ 180785 179242 177692 175870 173869 172273 171448 170879 169684 167747 165828 164449 163124 160956 157680 153890
53090A53890l384k314j153n13n51p26l91L69Q16N03k81r95j354j297r11n41n89
$$ 153890 150506 148192 147039 146526 145975 145249 144858 145227 146043 146546 146265 145270 143916 142619 141708 141167 140578
53073A40578r63j092p03k41k70p85j362j724j802j524r77n77o23p72m05M90J182
$$ 140578 139615 138523 137820 137579 137309 136524 135162 133438 131636 130112 129135 128558 127935 127163 126758 127248 128430
53056A28430J062L03l62l86J55N58N5j286k293j791j8J566J962J603J370J310
$$ 128430 129492 129795 129433 129047 129202 129760 129815 128529 126236 124445 124427 125993 127955 129558 130928 132238
53040A32238R26K87J8L17P12Q43Q49Q39O07J02k94l32k92m94q12j033j390k200
$$ 132238 133164 133451 133469 133786 134498 135341 136190 137029 137636 137738 137444 137112 136820 136326 135514 134481 133091 130891
53022A30891l218l824l790l445l060k529j722q11j53j4n17j518k516k913k498
$$ 130891 127673 123849 120059 116614 113554 111025 109303 108492 108339 108325 107808 106290 103774 100861 98363
53007I8363j572n64K33O23M86j5m98p22p38o10k62J82K70k69j018j187m33P72
$$ 98363 96791 96227 96460 97083 97569 97554 97056 96334 95596 94986 94724 94906 95176 94907 93889 92702 92269 93041
52989I3041J607J556P43k60q60q74m98P9Q75J788K329K030J089K47n6j38m95j082
$$ 93041 94648 96204 96947 96687 95827 94953 94455 94534 95409 97197 99526 101556 102645 102892 102836 102698 102203 101121
52971A01121j412j281j009r36q95m65L63R92Q53J04n13n30k35j41k17q7J77%p10
$$ 101121 99709 98428 97419 96483 95588 95123 95486 96478 97331 97435 96922 96392 96157 96016 95799 95712 95889 95889 95179
52952I5179j100m32P63J260Q00L83P35J240J003K82J09O89J099O79n5k68P9M68
$$ 95179 94079 93647 94410 95670 96470 96853 97588 98828 99831 100113 100222 100911 102010 102689 102634 102366 102445 102913
52934A02913P46J211J861K185J809R81K29j70j84K61J165K068K203J336K13j94
$$ 102913 103659 104870 106731 108916 110725 111706 111935 111765 111581 111842 113007 115075 117278 118614 118827 118633
52918A18633J65M67K98K58R77J984K270J654Q78M25P8k19OR08J800K036J834J685
$$ 118633 118798 119265 119563 119821 120798 122782 125052 126706 127584 128009 128087 127868 127874 128782 130582 132618 134452 136137
52900A36137J440Q03J97L19J023J547J700J968K401K338J604J049J424K293K645
$$ 136137 137577 138380 138577 138896 139919 141466 143166 145134 147535 149873 151477 152526 153950 156243 158888
52885A58888K190J430Q01L25Rj4J82K42m4n26r74j407j902k271k206j742j328
$$ 158888 161078 162508 163309 163634 163643 163629 163811 164053 164009 163483 162509 161102 159200 156929 154723 152981 151653
52868A51653j272j319j102q41j098j817k170j706j075j037j312j109m93k06k61
$$ 151653 150381 149062 147960 147119 146021 144204 142034 140328 139253 138216 136904 135795 135302 135096 134835
52853A34835J72J240J846J232K32J43R06J340Q78J34k21l62p82j464j895j732
$$ 134835 135007 136247 138093 139325 139557 139700 140606 141946 142824 142958 142737 142375 141593 140129 138234 136502
52837A36502j178p60p77r60p83j10N90Q34O29K28k94r16j348j283q71n43m46m56
$$ 136502 135324 134564 133787 132827 132044 131934 132524 133358 133987 134215 133921 133005 131657 130374 129503 128960 128514 128058
52819A28058o42j171j748j652o30O01J069M98o01j553j927j562o82N3j3q02j486
$$ 128058 127416 126245 124497 122845 122215 122816 123885 124383 123782 122229 120302 118740 118058 118111 118098 117296 115810
52802A15810j399q05l99l38k20K1j17q04j363j206p93r11j348j178l24K12j86
$$ 115810 114411 113606 113207 112869 112649 112670 112553 111749 110386 109180 108387 107476 106128 104950 104626 104838 104652
52785A04652r14j183j018p63l72J93M89K48j4K13N39L80J7R1L87K13k20l0P81
$$ 104652 103738 102555 101537 100774 100402 100595 101084 101332 101318 101531 102070 102450 102467 102558 102945 103158 102938 102908 103689
52766A03689J096L37o83j030q76q95j163j253r76m94k9Q0m91j489k118k073k016
$$ 103689 104785 105122 104439 103409 102533 101638 100475 99222 98246 97752 97723 97803 97312 95823 93705 91632 89616
52749H9616k505k950k416j192o31j419k726l323k909k041j217n77k70m98j064
$$ 89616 87111 84161 81745 80553 79922 78503 75777 72454 69545 67504 66287 65710 65440 64942 63878
52734F3878j297p98p4j6p23j287r62o3O13Q52R67R89P11L94O12J195J144n0j572
$$ 63878 62581 61783 61709 61693 60970 59683 58721 58658 59271 60123 61090 62079 62790 63184 63796 64991 66135 66085 64513
52715F4513k269j975j415j208j370j602j563j106m40Q3M43Q41J094P12j47n56
$$ 64513 62244 60269 58854 57646 56276 54674 53111 52005 51565 51648 52091 52932 54026 54738 54591 54035
52699E4035j43K35k03q60o57K48P03L32n0J83O81R07Q44N85j1q28j268r57k38
$$ 54035 53892 54127 53924 53064 52407 52655 53358 53690 53640 53823 54504 55411 56255 56840 56829 56001 54733 53776 53538
52680E3538L19N27M69K09q1r8K58P46J122J298J101M39k14j05P56J419J204N32
$$ 53538 53857 54384 54853 55062 54981 54883 55141 55887 57009 58307 59408 59847 59633 59528 60284 61703 62907 63439
52662F3439P2k56q05j217q39J37P49N42M5j62j49k02k60j67r4l28p69j019q37
$$ 63439 63511 63255 62450 61233 60394 60531 61280 61822 61867 61705 61556 61354 61094 60927 60833 60505 59736 58717 57880
52643E7880l59J34M57O51Q67J145J283J057O45O11J257K112K349J716Q95P42J278
$$ 57880 57521 57655 58112 58763 59630 60775 62058 63115 63760 64371 65628 67740 70089 71805 72700 73442 74720
52626G4720J705J389N78J0QL05N67P34P91O12K24JL26J115J839J961J266Kj188
$$ 74720 76425 77814 78392 78402 78410 78715 79282 80016 80807 81419 81643 81644 81970 83085 84924 86885 88151 88153 86965
52607H6965j620j112j75M24K89l83j027j090m66L16N45J00m49o48p41j150j624
$$ 86965 85345 84233 84058 84482 84771 84388 83361 82271 81805 82121 82666 82766 82317 81669 80928 79778 78154
52590G8154j451m53O29R83O24K73M29Q32R23O80P16J421K316K565K018J268P55
$$ 78154 76703 76250 76879 77862 78486 78759 79188 80020 80943 81623 82339 83760 86076 88641 90659 91927 92682
52573I2682L70N6J27O15R16O28K33L19O02M63J29L91J221J632J086J93k49k64
$$ 92682 93052 93108 93235 93850 94766 95394 95627 95946 96548 97011 97140 97531 98752 100384 101470 101663 101414 101150
52555A01150l62o64q25n43Q7N55K88o36j234o25P48J574J381R74R90J009N82K05
$$ 101150 100788 100124 99299 98756 98843 99398 99686 99050 97816 97191 97939 99513 100894 101868 102858 103867 104449 104654
52537A04654M83J010R89N28L93P45R58O28K0m28m79J5R20J621J550R61O32P98
$$ 104654 105137 106147 107136 107664 108057 108802 109760 110388 110408 109980 109501 109516 110436 112057 113607 114568 115200 115998
52519A15998Q80L44o38j456j698j448j189j338j612j238j55N47K1r11p44N39J424
$$ 115998 116878 117222 116584 115128 113430 111982 110793 109455 107843 106605 106450 106997 107018 106107 105363 105902 107326
52502A07326J005O5m09n35q04r11k96P58J373J216P64N99Q78J368J578J089R9
$$ 107326 108331 108396 107987 107452 106648 105737 105441 106199 107572 108788 109552 110151 111029 112397 113975 115064 115163
52485A15163n92m73O6L03M8m04p80q55l51O87J560J576Q29J2l89k99K47J055J585
$$ 115163 114571 114098 114164 114467 114515 114111 113331 112476 112125 112812 114372 115948 116777 116789 116400 116101 116348 117403 118988
52466A18988J316M04m47o39o6R36J650J327j3j366j805j556j419j469j122l18
$$ 118988 120304 120708 120261 119622 119556 120492 122142 123469 123456 122090 120285 118729 117310 115841 114719 114401
52450A14401L07N39R52J820K471K225J351O03K88K46L59M93K69n29j442j733j291
$$ 114401 114708 115247 116199 118019 120490 122715 124066 124669 124957 125203 125562 126055 126324 125795 124353 122620 121329
52433A21329p24n84q29j116j292j392j376j120o64k98k53l39j44L87P80O40J82
$$ 121329 120605 120021 119192 118076 116784 115392 114016 112896 112232 111934 111681 111342 111198 111585 112365 113005 113187
52416A13187j26k00k31j53K36O78O27J34m9M76J131J143N26j32m80n46l50J21
$$ 113187 113061 112861 112630 112477 112713 113391 114018 114152 114103 114579 115710 116853 117379 117247 116767 116221 115871 115992
52398A15992O26Q27P03N24M35L59K78L43O02Q13O86K50JM53J463K137J794R34
$$ 115992 116618 117445 118148 118672 119107 119466 119744 120087 120689 121502 122188 122438 122439 122892 124355 126492 128286 129220
52380A29220P70J634K494K275J215L93L17O53J049J589K304K828K792K321J924
$$ 129220 129990 131624 134118 136393 137608 138001 138318 138971 140020 141609 143913 146741 149533 151854 153778
52365A53778J915K008J592N89r5N36K164L273L016K223K051K264J893J035P84
$$ 153778 155693 157701 159293 159882 159787 160323 162487 165760 168776 170999 173050 175314 177207 178242 179026
52350A79026J461K120K122K068K572L131K885J928J074P97J041J714K661L413
$$ 179026 180487 182607 184729 186797 189369 192500 195385 197313 198387 199184 200225 201939 204600 208013
52336B08013L604L590L987M713N014M520L758L566M263N436O281O246N601N320
$$ 208013 211617 215207 219194 223907 228921 233441 237199 240765 245028 250464 256745 262991 268592 273912
52322B73912O083P584R066J0249J1217J1743J1502J0977J1257J2687J4325J5182
$$ 273912 279995 287579 296645 306894 318111 329854 341356 352333 363590 376277 390602 405784
52310D05784J5365J5548J5842J5838J5421J4895J4405J3835J3219J2713J2177
$$ 405784 421149 436697 452539 468377 483798 498693 513098 526933 540152 552865 565042
52299E65042J1299J0197R336Q779Q014O791N562M776M140L128J865R52N38J29
$$ 565042 576341 586538 595874 604653 612667 619458 625020 629796 633936 637064 638929 639881 640419 640548
52285F40548o36j562k433l405m607n653n995n612n001m482l847k827j631p74l49
$$ 640548 639912 638350 635917 632512 627905 622252 616257 610645 605644 601162 597315 594488 592857 592083 591734
52270E91734K56J648L486M669M684M457N360P495R557J0503J0685J1065J1839
$$ 591734 591990 593638 597124 601793 606477 610934 616294 623789 633346 643849 654534 665599 677438
52257F77438J2501J2799J2904J2748J2073J1127J0609J0602J0267Q974P208N811
$$ 677438 689939 702738 715642 728390 740463 751590 762199 772801 783068 792042 799250 805061
52245H05061M822L663K259J132M86j25j029j995k805l732m972o003o193n872o096
$$ 805061 809883 813546 815805 816937 817423 817298 816269 814274 811469 807737 802765 796762 790569 784697 778601
52230G78601p244q353q310p257o401o453o878o728n850m913m486m463m346l828
$$ 778601 771357 763004 754694 747437 741036 734583 727705 720977 715127 710214 705728 701265 696919 693091
52216F93091l005k146j369n86K73J067J599J984K566L388L985L988L675L615L876
$$ 693091 690086 687940 686571 685985 686258 687325 688924 690908 693474 696862 700847 704835 708510 712125 716001
52201G16001M059L965L770L567L209K768K586K682K563J955J267R89J007R04O26
$$ 716001 720060 724025 727795 731362 734571 737339 739925 742607 745170 747125 748392 749381 750388 751292 751918
52186G51918L28m5n73r56r12p59r85j482j792k058k835l989m660m588m569n108
$$ 751918 752246 752201 751628 750672 749760 749001 748016 746534 744742 742684 739849 735860 731200 726612 722043 716935
52170G16935n426m601l111k345k846l825m398m479m426m399m415m521m665m670
$$ 716935 711509 706908 703797 701452 698606 694781 690383 685904 681478 677079 672664 668143 663478 658808
52156F58808m494m254l881l152k184j608j850k536k907k736k488k552k684k347
$$ 658808 654314 650060 646179 643027 640843 639235 637385 634849 631942 629206 626718 624166 621482 619135
52142F19135j449n51l21r03j817k435k461k059j552j107n71L03J387K060J782
$$ 619135 617686 617135 616814 615911 614094 611659 609198 607139 605587 604480 603909 604212 605599 607659 609441
52127F09441Q87N06J504L634N870P405Q095Q260Q360Q835R837J1113J2359J3552
$$ 609441 610328 610834 612338 615972 621842 629247 637342 645602 653962 662797 672634 683747 696106 709658
52113G09658J4685J5366J5155J4304J3640J3633J3991J4276J4424J4464J4215
$$ 709658 724343 739709 754864 769168 782808 796441 810432 824708 839132 853596 867811
52102H67811J3556J2616J1431R823P949O493N791N170L770J766J27p24j307k133
$$ 867811 881367 893983 905414 915237 923186 929679 935470 940640 944410 946176 946303 945579 944272 942139
52088I42139l040l697m206m837n577o277o975p721q251q150p314o072m835l723
$$ 942139 939099 935402 931196 926359 920782 914505 907530 899809 891558 883408 876094 870022 865187 861464
52074H61464k525j075L42J125J113J100K175M480O900Q242Q441Q453R067J0126
$$ 861464 858939 857864 858206 859331 860444 861544 863719 868199 875099 883341 891782 900235 909302 919428
52060I19428J0857J0806J0305R980R950R757R134Q457Q126P829O941N442L825
$$ 919428 930285 941091 951396 961376 971326 981083 990217 998674 1006800 1014629 1021570 1027012 1030837
52047A030837K226L73j565k902l572m467o195q119r353j0073j0991j2026j2481
$$ 1030837 1033063 1033436 1031871 1028969 1025397 1020930 1014735 1006616 997263 987190 976199 964173 951692
52034I51692j2443j2937j4462j6175j6909j6474j5577j4948j4840j5080j5239
$$ 951692 939249 926312 911850 895675 878766 862292 846715 831767 816927 801847 786608
52023G86608j4910j4120j3276j2683j2233j1728j1240j1044j1296j1857j2315
$$ 786608 771698 757578 744302 731619 719386 707658 696418 685374 674078 662221 649906
52012F49906j2276j1775j1350j1437j1740j1621j0999j0451j0431j0834j1391
$$ 649906 637630 625855 614505 603068 591328 579707 568708 558257 547826 536992 525601
52001E25601j1948j2271j2158j1941j2286j3186j3719j3210j2123j1289j0791
$$ 525601 513653 501382 489224 477283 464997 451811 438092 424882 412759 401470 390679
51990C90679j0241r728r686r997j0098r851r624r419q707p425o345o100o362o409
$$ 390679 380438 370710 361024 351027 340929 331078 321454 312035 303328 295903 289558 283458 277096 270687
51976B70687o106n809n657n496n362n472n714n605m962m258m087m475m921m990
$$ 270687 264581 258772 253115 247619 242257 236785 231071 225466 220504 216246 212159 207684 202763 197773
51962A97773m624l957l133k376j958j932k060k114k172k382k573k454k050j664
$$ 197773 193149 189192 186059 183683 181725 179793 177733 175619 173447 171065 168492 166038 163988 162324
51948A62324j460j384j524k045k651k651j861r83p64j064j246j117r40q04o09
$$ 162324 160864 159480 157956 155911 153260 150609 148748 147765 147001 145937 144691 143574 142634 141830 141221
$$ [...]
##END NTUPLES=NMR SPECTRUM
##END=
