##TITLE=NES1088_T11_9884960_lD6dxsbMPy
##JCAMPDX= 6.0         $$ Bruker NMR JCAMP-DX V2.0
##DATA TYPE= NMR SPECTRUM
##DATA CLASS= NTUPLES
##ORIGIN= BRUKER
##OWNER= Administrator
$$ 1.72 TOPSPIN		Version 2.1
$$ 2016-08-27 16:27:32.211 -0500  Administrator@X
$$ Compression mode = diff/dup
##.OBSERVE FREQUENCY= 400.02188249412
##.OBSERVE NUCLEUS= ^1H
##.ACQUISITION MODE= SIMULTANEOUS (DQD)
##.ACQUISITION SCHEME= undefined
##.AVERAGES= 8
##.DIGITISER RES= 22
##SPECTROMETER/DATA SYSTEM= spect
##.PULSE SEQUENCE= zg30
##.SOLVENT NAME= COFFEE_meoh
##.SHIFT REFERENCE= INTERNAL, COFFEE_meoh, 1, 14.98509
##AUDIT TRAIL= $$ (NUMBER, WHEN, WHO, WHERE, PROCESS, VERSION, WHAT)
$$ ##TITLE= Audit trail, TOPSPIN		Version 2.1
$$ ##JCAMPDX= 5.01
$$ ##ORIGIN= Bruker BioSpin GmbH
$$ ##OWNER= Administrator
$$ $$ E:\/data/COFFEE/nmr/NES1088_T11_9884960_lD6dxsbMPy/20/pdata/1/auditp.txt
$$ ##AUDIT TRAIL=  $$ (NUMBER, WHEN, WHO, WHERE, PROCESS, VERSION, WHAT)
(   1,<2016-08-27 16:27:25.195 -0500>,<Administrator>,<X>,<go>,<TOPSPIN 2.1>,
      <created by zg
	started at 2016-08-27 16:26:19.539 -0500,
	POWCHK enabled, PULCHK disabled,
       configuration hash MD5:
       21 0F 79 D6 B3 7B B4 F6 88 20 88 DB 03 48 BD 9F
       data hash MD5: 64K
       A0 AC 2B 13 2D 03 FB 6B 7F 97 34 A8 E6 12 72 52>)
(   2,<2016-08-27 16:27:28.195 -0500>,<Administrator>,<X>,<proc1d>,<TOPSPIN 2.1>,
      <Start of raw data processing
       efp LB = 0 FT_mod = 6 PKNL = 1 PHC0 = 0 PHC1 = 0 SI = 32K 
       data hash MD5: 32K
       3C 53 C6 4F 7E 57 D9 01 8E 97 40 60 3E CB A5 F6>)
(   3,<2016-08-27 16:27:28.476 -0500>,<Administrator>,<X>,<proc1d>,<TOPSPIN 2.1>,
      <pk PHC0 = 94.03198 PHC1 = 0 
       data hash MD5: 32K
       9D 0F C5 46 C5 60 C9 09 10 6D 06 29 08 70 90 D3>)
(   4,<2016-08-27 16:27:28.586 -0500>,<Administrator>,<X>,<proc1d>,<TOPSPIN 2.1>,
      <abs ABSG = 1 
       data hash MD5: 32K
       01 83 B0 2F 4E 90 6C 3E 6C B0 15 DE 09 87 AB 76>)
(   5,<2016-08-27 16:27:28.664 -0500>,<Administrator>,<X>,<proc1d>,<TOPSPIN 2.1>,
      <abs ABSG = 2 
       data hash MD5: 32K
       DA BC 11 C0 D8 EB 0A B7 C3 88 4F 60 71 A5 84 C3>)
(   6,<2016-08-27 16:27:28.711 -0500>,<Administrator>,<X>,<proc1d>,<TOPSPIN 2.1>,
      <abs ABSG = 3 
       data hash MD5: 32K
       C0 4B E0 17 55 D7 4D 32 6C 59 3E 57 1E 44 D1 A1>)
(   7,<2016-08-27 16:27:28.773 -0500>,<Administrator>,<X>,<proc1d>,<TOPSPIN 2.1>,
      <abs ABSG = 4 
       data hash MD5: 32K
       80 FE 24 09 88 88 C6 C0 6A 90 0A 39 DA 1C 3E 67>)
(   8,<2016-08-27 16:27:28.836 -0500>,<Administrator>,<X>,<proc1d>,<TOPSPIN 2.1>,
      <abs ABSG = 5 
       data hash MD5: 32K
       62 EE B8 29 14 86 FA 17 01 D4 93 FA 62 BF 2D BC>)
$$ ##END=
$$ 
$$ $$ hash MD5
$$ $$ EA 2D C0 37 E2 0E E2 C9 CA 83 C1 EE 2A B7 84 3A
##$RELAX= 
##$RELAX= 
##$RELAX= 
##$RELAX= 
##$RELAX= 
##$RELAX= 
##$RELAX= 
$$ Bruker specific parameters
$$ --------------------------
##$DU= <E:\>
##$EXPNO= 20
##$NAME= <NES1088_T11_9884960_lD6dxsbMPy>
##$PROCNO= 1
$$ [...]
150 150 150 150 150 150 150 150
##$TP07= 0
##$TPNAME0= <>
##$TPNAME1= <>
##$TPNAME2= <>
##$TPNAME3= <>
##$TPNAME4= <>
##$TPNAME5= <>
##$TPNAME6= <>
##$TPNAME7= <>
##$TPOAL= (0..7)
0.5 0.5 0.5 0.5 0.5 0.5 0.5 0.5
##$TPOFFS= (0..7)
0 0 0 0 0 0 0 0
##$TUNHIN= 0
##$TUNHOUT= 0
##$TUNXOUT= 0
##$USERA1= <user>
##$USERA2= <user>
##$USERA3= <user>
##$USERA4= <user>
##$USERA5= <user>
##$V9= 5
##$VALIST= <valist>
##$VCLIST= <CCCCCCCCCCCCCCC>
##$VD= 0
##$VDLIST= <DDDDDDDDDDDDDDD>
##$VPLIST= <PPPPPPPPPPPPPPP>
##$VTLIST= <TTTTTTTTTTTTTTT>
##$WBST= 2048
##$WBSW= 25
##$XGAIN= (0..3)
0 0 0 0
##$XL= 0
##$YL= 0
##$YMAX_a= 604774
##$YMIN_a= -508766
##$ZGOPTNS= <>
##$ZL1= 120
##$ZL2= 120
##$ZL3= 120
##$ZL4= 120
##$ABSF1= 14.98509
##$ABSF2= -5.573092
##$ABSG= 5
##$ABSL= 3
##$ALPHA= 0
##$AQORDER= 0
##$ASSFAC= 0
##$ASSFACI= 0
##$ASSFACX= 0
##$ASSWID= 0
##$AUNMP= <proc_prof1d_extract_pilot.lims>
##$AXLEFT= 0
##$AXNAME= <>
##$AXNUC= <1H>
##$AXRIGHT= 0
##$AXTYPE= 0
##$AXUNIT= <>
##$AZFE= 0.1
##$AZFW= 0.1
##$BCFW= 0
##$BC_mod= 0
##$BYTORDP= 0
##$COROFFS= 0
##$CY= 15
##$DATMOD= 1
##$DC= 0
##$DFILT= <>
##$DTYPP= 0
##$F1P= 0
##$F2P= 0
##$FCOR= 0.5
##$FTSIZE= 32768
##$FT_mod= 6
##$GAMMA= 0
##$GB= 0
##$INTBC= 1
##$INTSCL= 1
##$ISEN= 128
##$LB= 0
##$LEV0= 0
##$LPBIN= 0
##$MAXI= 10000
##$MC2= 0
##$MEAN= 0
##$ME_mod= 0
##$MI= 0
##$NCOEF= 0
##$NC_proc= -8
##$NLEV= 6
##$NOISF1= 0
##$NOISF2= 0
##$NSP= 0
##$NTH_PI= 0
##$NZP= 0
##$OFFSET= 14.98509
##$PC= 1
##$PHC0= 94.03198
##$PHC1= 0
##$PH_mod= 1
##$PKNL= yes
##$PPARMOD= 0
##$PPDIAG= 0
##$PPIPTYP= 0
##$PPMPNUM= 2147483647
##$PPRESOL= 1
##$PSCAL= 4
##$PSIGN= 0
##$PYNMP= <proc.py>
##$REVERSE= no
##$SF= 400.02
##$SI= 32768
##$SIGF1= 0
##$SIGF2= 0
##$SINO= 400
##$SIOLD= 32768
##$SPECTYP= <>
##$SREGLST= <1H.CDCl3>
##$SSB= 0
##$STSI= 32768
##$STSR= 0
##$SW_p= 8223.68421052631
##$SYMM= 0
##$S_DEV= 0
##$TDeff= 65536
##$TDoff= 0
##$TI= <>
##$TILT= no
##$TM1= 0
##$TM2= 0
##$TOPLEV= 0
##$USERP1= <user>
##$USERP2= <user>
##$USERP3= <user>
##$USERP4= <user>
##$USERP5= <user>
##$WDW= 1
##$XDIM= 32768
##$YMAX_p= 440040935
##$YMIN_p= -687605
##$CURPLOT= <Network HP LaserJet P1505>
##$CURPRIN= <$Network HP LaserJet P1505>
##$DFORMAT= <normdp>
##$LAYOUT= <+/1D_H.xwp>
##$LFORMAT= <normlp>
##$PFORMAT= <normpl>
##$SURQMSG= 1
$$ End of Bruker specific parameters
$$ ---------------------------------
##NTUPLES= NMR SPECTRUM
##VAR_NAME=  FREQUENCY,     SPECTRUM/REAL,   SPECTRUM/IMAG
##SYMBOL=    X,             R,               I
##VAR_TYPE=  INDEPENDENT,   DEPENDENT,       DEPENDENT
##VAR_FORM=  AFFN,          ASDF,            ASDF
##VAR_DIM=   32768,         32768,           32768
##UNITS=     HZ,            ARBITRARY UNITS, ARBITRARY UNITS
##FACTOR=    0.250966925370066, 1,           1
##FIRST=     8223.43324360094, 43517,        -148329
##LAST=      0,             189800,          128516
##MIN=       0,             -687605,         0
##MAX=       8223.43324360094, 440040935,    0
$$ Real data points
##PAGE= N=1
##DATA TABLE= (X++(R..R)), XYDATA
$$ [...]
19496b86332l3657R6808J6015B46764a26125B9630c17750F089Q246e692j08926
19485a14618e3545A36699a14137A20979J20613i3027D8558b93305A42067b22108
19474D4040J36647h1561C9403a60228j14345o2020c928I8215c6636J6329k28661
19463b48968M5526i1665k82868a14949c672k79318I0191g0972j95988a25928q6036
19452b11964C62377j71755g4415j99273N0384J06115j24834j2541h6411d060A7157
19440A19913i5519A43030J19609a35835F0631c05589l3911h2264J4858A33881
19429b55689f708E6320J3081a42066C8502c54298i6455n7320K4525c3392A30315
19417F2360b34507B37624c42668J40897r3891A71116b23684N3588E6128c88622
$$ y = [-286332, -319989, -223181, -207166, 246764, -126125, 29630, -317750, 6089, 14335, -5692, -114618, -53545, 136699, -114137, 120979, 241592, -93027, 48558, -293305, 142067, -222108, 44040, 180687, -81561, 39403, -160228, -274573, -336593, -3928, 98215, -36636, -20307, -248968, -203442, -91665, -374533, -114949, -3672, -282990, 90191, -70972, -266960, -125928, -211964, 362377, 190622, -74415, -273688, -223304, -117189, -242023, -254564, -86411, -4060, 17157, 119913, -95519, 143030, 262639, -135835, 60631, -305589, -339500, -82264, -67406, 133881, -255689, -6708, 56320, 69401, -142066, 38502, -354298, -96455, -153775, -129250, -33392, 130315, 62360, -234507, 237624, -342668, -201771, -295662, 171116, -223684, -170096, 56128, -388622]
19406B8473L5189k835a52393e7077j40493R2105C4872A2894a38123r7105J3361
19395b21867d9215B18256a29885J3451c6309B24146b08690B27948d8400k35433
19385b83833J19840B91855B460L2504m522a03764p1189J8045n8247i7951J6938
19374h1013k1311k52746B82800b96831A25159b76251a08863A18064n5510A010
19363b43542e8397l21193a6444m18013i6898j33607J14243k26202c4069j69064
19353b03133O9058d2344l71452B02022H376a38917K2559k27282a10153j6655p441
19342a34249o2697I080N6016j3826a77954d9911I2944A7662o723a76147A46470
19330f0817A55242e3454E6453j3779j9339H028d0318B04934q0018A785f7193j07752
$$ y = [28473, 63662, 60827, -152393, -57077, -197570, -105465, 34872, 12894, -138123, -235228, -221867, -49215, 218256, -129885, -116434, -36309, 224146, -208690, 227948, -48400, -283833, -163993, 291855, 2460, 34964, 30442, -103764, -174953, -156908, -215155, -97951, -81013, -102324, -355070, 282800, -296831, 125159, -276251, -108863, 118064, 62554, 1010, -243542, -58397, -379590, -16444, -434457, -96898, -230505, -116262, -342464, -34069, -203133, -134075, -42344, -413796, 202022, 8376, -138917, -116358, -343640, -110153, -126808, -134249, -196946, 9080, 65096, 51270, -177954, -49911, 92944, 17662, 10939, -176147, 146470, -60817, 155242, -53454, 56453, 42674, 23335, 8028, -40318, 204934, 124916, 1785, -67193, -174945]
19318a74945F1933b9471D8420a90692D3418J03433d5738k6187D4980J45331B0986
19306b36117d0636m8758k22648H2253J03705K5303F7967a34021G3567g8478k14716
19295b93194b7287A00964d1783k23126H688J73077b43989C644Q1059a52912P265
19284a45647A38113N8324i4847D0650a03185l7186A62632K5314g7745m8459K4326
19273a01878j69134A27041l1833c1422k00948r6636F6669d53246i2150b4725j51675
19262a76400j02533Q2414R7443C9803a8510A12411c1195H7717J10080H7437B324
19250A07526Q3463i9759H5090e8477A3120J34741F0766b02795J4925e0178j14305
19239a64483N7539C36615c84235a38402j05437J12665n383A76096h9943A50254
$$ y = [-174945, 61933, -29471, 48420, -190692, 43418, 146851, -45738, -71925, 44980, 190311, 20986, -236117, -40636, -89394, -312042, 82253, 185958, 211261, 67967, -134021, 73567, -78478, -293194, -27287, 100964, -41783, -264909, 8688, 181765, -243989, 3644, 84703, -152912, -145647, 138113, 196437, -94847, 40650, -103185, -140371, 162632, 187946, -77745, -126204, -101878, -271012, 127041, 95208, -31422, -232370, -329006, 66669, -453246, -92150, -24725, -176400, -278933, -196519, -99076, 39803, -18510, 112411, -31195, 87717, 197797, 87437, 2324, 107526, 190989, -99759, 85090, -58477, 13120, 147861, 60766, -202795, -187870, -50178, -164483, -106944, 336615, -384235, -138402, -243839, -131174, -136557, 176096, -89943, 150254]
19228b16039N8535i079j63629j59222A70981a62575J6283l83753K39195J9745
19218b71105C4752P3634b61933A60525a19012e8223j20503e9892B7233O8894b6282
19206A30378c01573e6175p5824J1440D667e0881j22568B2132c98408g0247A53045
19194B21701c07809a6895I3837b90892a24979M4464r6700B8886K8974A1762f1563
19182I809c68454B31239A05894a31638H633e746k91051c9668j07919m4005N3764
19171a37828d4876j27266F0567b956B1866J40664H0096b82434R9144P2844F2894
19159F6021a45337k39026a66183C60474A9004N8192a66386g6444A63722f8333
19148a2162A22446b73472g978B183c2025A19894K73095b05749j9786b5243k7629
$$ y = [-216039, -157504, -9079, -172708, -331930, 170981, -162575, -146292, -530045, -290850, -271105, 34752, 108386, -261933, 160525, -119012, -58223, -178726, -59892, 27233, 96127, -26282, 130378, -301573, -56175, -131999, -120559, 4667, -50881, -173449, 22132, -398408, -70247, 153045, 221701, -307809, -16895, 93837, -290892, -124979, -80515, -177215, 28886, 57860, 11762, -61563, 9809, -368454, 231239, 105894, -131638, 8633, -5746, -296797, -39668, -147587, -191592, -137828, -44876, -172142, 60567, -2956, 21866, 162530, 80096, -282434, -183290, -110446, 62894, 66021, -145337, -384363, -166183, 360474, 19004, 77196, -166386, -76444, 163722, -68333, -12162, 122446, -273472, -7978, 2183, -32025, 119894, 392989, -205749, -225535, -25243, -52872]
19137e2872o9585k55583B8146R5359P6130f9650A11424f0214k5639r4678o8039
19126b48570a8414j05314k00628d442A27936a50688A0635a317j45641A55448m8711
19115A06737a80574F2076g8192j0749k11916A75670I991b78423F0233a6666I3443
19103h1642k16030L8257J13762B02385m6920g1007B03382G206a1257j91363K5369
19092a77251F5857b36260j1146I9230e8429j1698J7898k3966D89461b47325m2880
19081b90205A41999e1457m03151A18113a75360k01916A72905h3008A32271k9929
19071A02342c34806E882k011R6077m762a57559j27764i9065K9054I8971b00418
19059C67243h3770q0788c2452j34217n81M2855A12964e4553j06256I7358a26159
$$ y = [-52872, -122457, -378040, 28146, 123505, 199635, -69650, 111424, -60214, -85853, -180531, -248570, -18414, -123728, -324356, -4442, 127936, -150688, 10635, -1317, -146958, 155448, 106737, -180574, 62076, -78192, -88941, -300857, 175670, 9991, -278423, 60233, -16666, 93443, -81642, -297672, -259415, -145653, 202385, 155465, -71007, 203382, 7206, -11257, -202620, -177251, 65857, -236260, -247406, 99230, -58429, -70127, -52229, -76195, 489461, -247325, -290205, 141999, -51457, -454608, 118113, -175360, -377276, 172905, -83008, 132271, 102342, -334806, 5882, 3871, 99948, 95186, -157559, -285323, -99065, -70011, 98971, -200418, 367243, -83770, -164558, -32452, -166669, -167250, -124395, 112964, -54553, -160809, 97358, -126159]
19047A46162b25031A22511l1935a01890l23613H3740i6076d1697a5792j423n3057
19036g0272B39509a48432j76130J50460A98973b32697d2188j6813j11529N9530
19026a11000l3251A55929h5862A11492d3952A88889G3274L06750e8975G4743M1961
19015A16704E4315a1044G0223a00822C27162e6243H9149o793J01940F275c5280
19003e1397j5930B47792b676k43385I2495a1326l9452A56381a82792a579l9914
18992d1493E2354j1144j7144h715k3574k12875H1168B0941c722n74575b70046
18980B2669a21507j35572a07150E9095g9577A43138J66904j6364Q6786j36053
18970B44411l3246j4565a9493N60A91718c33120c8403p4780A60920j490k8509
$$ y = [146162, -225031, 122511, 90576, -101890, -425503, 83740, -96076, -41697, -15792, -17215, -70272, 239509, -148432, -324562, -174102, 198973, -232697, -42188, -59001, -170530, -111000, -144251, 155929, -85862, 111492, -43952, 188889, 73274, 380024, -58975, 74743, 116704, 54315, -11044, 70223, -100822, 327162, -56243, 89149, 82356, 184296, 6275, -35280, -51397, -67327, 247792, -2676, -246061, 92495, -11326, -50778, 156381, -182792, -1579, -41493, 52354, 41210, 24066, -8715, -32289, -245164, 81168, 20941, -3722, -578297, -270046, 22669, -121507, -257079, -107150, 59095, -79577, 143138, 310042, 293678, 380464, 244411, 211165, 196600, -19493, -18933, 191718, -333120, -38403, -113183, 160920, 159430, 130921]
18959A30921b37205A69347a35283A7762O2611b4906p2739m6258M7360H5240A9067
18947A5587J52760B2000a57987K9009k4792f5398J0980R322F9415a83881m8422
18936b32303b2265j03000H7233Q7506a46939I0425d09008f8771K9431k56078B19529
18924b18509H1479b76484B62510J00398h396A74458c04310c8418E851a33265l924
18913a37189l47994E3764L5195P3121K90865A22707b41614G0204K4245a5480m724
18902b0204k25456A20496h5229A34186a17214b279G3952l0803a06575r8978A19196
18890I2188j1789c29982c8819r78A42046d58H4386c72396a84856b997j16823G5587
18877b02174A8908b6209C4895K8269b8568A30526b74971a4147A28675b35095L5824
$$ y = [130921, -237205, 169347, -135283, 17762, 80373, -24906, -97645, -143903, -96543, 85240, 19067, 15587, 168347, 22000, -157987, -128978, -153770, -65398, -54418, -45096, 69415, -183881, -232303, -22265, -125265, 87233, 174739, -146939, 90425, -409008, -68771, -39340, -295418, 219529, -218509, 81479, -276484, 262510, 362908, -8396, 174458, -304310, -38418, 5851, -133265, -137189, -485183, 53764, 88959, 162080, 452945, 122707, -241614, 70204, 94449, -15480, -20204, -245660, 120496, -85229, 134186, -117214, -2279, 73952, 43149, -106575, -205553, 119196, 92188, 80399, -329982, -38819, -39797, 142046, -458, 84386, -372396, -184856, -2997, -119820, 75587, -202174, 18908, -26209, 34895, 63164, -28568, 130526, -274971, -14147, 128675, -235095, -199271]
18866a99271B59896G302J47597O974c04325a17435A38363a12822A26647G505P2466
18855G9971J96261a71507A84301b0900A8290b13477k5288A10447f7293a9668H8564
18843A13489h6255A90120b631k35454M9319j52001D007c3284j80264J5969j84565
18832c82144b6698j93514F113d770n5016A41425b93151A07658a93828L3187O5802
18821i4839D6086a91285n5307C56275c6202D6641M5561a33454K1293d8545A67424
18809g9733L6352H7984L7200m3328H464O0817c6613B729K59719b09270c3966B3725
18796a81101H8787N8431c03687H7546J89270a38731j7616A39468B1506K2808a65468
18784e243k1628C9056b59643A83644c04969m968J36356l7127N5177j23735e8848
$$ y = [-199271, 259896, 7302, 154899, 161873, -304325, -117435, 138363, -112822, 126647, 7505, 79971, 276232, -171507, 184301, -20900, 18290, -213477, -238765, 110447, -67293, -19668, 88564, 113489, -86255, 190120, -2631, -238085, -188766, -340767, 4007, -33284, -213548, -197579, -382144, -26698, -220212, 6113, -4770, -59786, 141425, -293151, 107658, -193828, -160641, -94839, 46086, -191285, -246592, 356275, -36202, 46641, 92202, -133454, -112161, -48545, 167424, -79733, -43381, 87984, 125184, 81856, 8464, 69281, -36613, 2729, 262448, -209270, -33966, 23725, -181101, 88787, 147218, -303687, 87546, 276816, -138731, -156347, 139468, 21506, 44314, -165468, -5243, -26871, 39056, -259643, 183644, -304969, -309937, -173581, -210708, -155531, -279266, -58848]
18772a07252b9159j07041j05445E430b7532j2633q2427j01390j10150c7434l5701
18761g3135B89236b0765E554e6836G7887Q7422b09397e7677D6950N5022A6613
18749b05545c1587p4240A36709a23268B3858a34472A82233G1029b00012D3535
18738c4147A42595J18959A26179m2172K24049E5392a92267q6135h9982L3898A14713
18726b15044h4751j83690F0829a9158j17375A43635e1194k00250D27975d7027
18715e196A5682a68691N6774r5567C8755a77900n2917J14074N569I129P1938b18120
18702a64032d844F8849K29448A835J2780R8080b8469r0206A22551d3175C11024
18690H3494k1115e34668H7283b73803h6590j66053D1694c31760A19517B1613K68187
$$ y = [-107252, -29159, -136200, -241645, 5430, -27532, -40165, -122592, -223982, -334132, -37434, -73135, 289236, -20765, 5554, -56836, 77887, 165309, -209397, -57677, 46950, 101972, 16613, -205545, -31587, -105827, 136709, -123268, 23858, -134472, 182233, 71029, -200012, 43535, -34147, 142595, 261554, 126179, 84007, 308056, 55392, -192267, -278402, -89982, -56084, 114713, -215044, -84751, -268441, 60829, -19158, -136533, 143635, -51194, -251444, 427975, -47027, -5196, 15682, -168691, -111917, -207484, 38755, -177900, -230817, -116743, -111174, 9129, 81067, -218120, -164032, -4844, 68849, 298297, 1835, 14615, 112695, -28469, -118675, 122551, -43175, 311024, 83494, 62379, -534668, 87283, -273803, -86590, -252643, 41694, -331760, 119517, 21613, 289800]
18679B89800d49644c5402k58023i5043p0913M3946F9031b45698a8716j24494C01689
18667a00025c1068k23406a08787a2583k13042N8501f4082l8219j24459c7168I2504
18655A69097c5605l11903M5209b7199E7704p615e23196a81708A44099P1444f6346
18643i9668j92884B156K74779d4647N810M799o0916l9508l1707e5506C3513a69033
18630A52569a33786D9575a77100B01977a20140j38126J01041o8877i2768B9340
18619F3452j5462e95682h1063a9862j09339k03329J14613c7315G849J64682a0542
18607e5879A48695g0439D40996b26955N971H9885j6641d4170A26158C184d40152
18595c7926n0360m6357c6482H2241e7953j93036p755c5463n3307j23838A31405
$$ y = [289800, -449644, -35402, -293425, -95043, -165956, -122010, 69031, -245698, -18716, -143210, 301689, -100025, -31068, -254474, -108787, -12583, -225625, -167124, -64082, -102301, -226760, -37168, 92504, 169097, -35605, -347508, -302299, -27199, 57704, 50089, -523196, -181708, 144099, 215543, -66346, -99668, -292552, 2156, 276935, -44647, -38837, -34038, -94954, -134462, -166169, -55506, 33513, -169033, 152569, -133786, 49575, -177100, 201977, -120140, -258266, -157225, -226102, -92768, 29340, 63452, 47990, -595682, -81063, -19862, -129201, -332530, -217917, -37315, 7849, 172531, -10542, -55879, 148695, -70439, 440996, -226955, -220984, 89885, 73244, -44170, 126158, 3184, -440152, -37926, -88286, -134643, -36482, 82241, -57953, -250989, -258744, -35463, -88770, -212608, 131405]
18583a30761j09182h4888o4624d8975D6426A1551a08854J3616H3506a68395j31796
18572c00191i2608G263c3916k27419e7478k90067j67959a6429j15107C3527c4850
18560B1868O7614C1916J2545J92719f9402j63865P8186G5004a76490P3867q0391
18549a83014c3545k62255G4279d26210a64026L7427a5587A24819L32154A97499
18538e1481k82391A61527G8350h0077B15486A9216J9938d1153A20086Q4140a72815
18526e9694G9561a36766j1093C5505r971N1999A1665L4426K61285b04187D7827
18514a41196K0659N7072q4677g3724j87610k46009B6592L09439i4459C32587a97885
18502b37638J13853C39843A30220a70605a4851k49870P1981B18669b18997A1150
$$ y = [-130761, -239943, -84888, -149512, -48975, 46426, 11551, -108854, -95238, 83506, -168395, -300191, -92608, 7263, -33916, -261335, -57478, -347545, -515504, -16429, -131536, 33527, -34850, 21868, 89482, 31916, 44461, 237180, -69402, -233267, -155081, 75004, -176490, -102623, -183014, -33545, -295800, 74279, -426210, -164026, -126599, -15587, 124819, 456973, 197499, -51481, -333872, 161527, 78350, -80077, 215486, 19216, 39154, -41153, 120086, 204226, -172815, -59694, 79561, -136766, -147859, 35505, 25534, 77533, 11665, 46091, 307376, -204187, 47827, -141196, -120537, -63465, -148142, -73724, -261334, -507343, 26592, 336031, -94459, 332587, -197885, -237638, -123785, 339843, 130220, -170605, -14851, -264721, -192740, 218669, -218997, 11150]
18491c74421A1610a39065N6683A06455a40279C7797l21J59109G8531e2615n7472
18480a10087A8460b36135B05976b33084H3668J9625a74550d1727A14929a52209
18469b85217g2344k8100n7686A11959J09108i4420J2254A32578n8418c7803j13212
18458a51015B82592b9853j76390A05939J12569d27974C23028C4322i3513j91686
18448b85199J8510A18611d59579C2153c3612n1500l9858B06767q9484g3125G4957
18436A39886K9633j5905b68045f882j86103c4526B07846D955L84717b78541q9782
18425c68323a61975a1814k13978A30632j7967K14114H3197G034d8941c376l64150
18414c67526a53627A6705a06904b2588A07690j1255a28025b3642j64202B60657
$$ y = [-374421, 11610, -139065, -82382, 106455, -140279, 37797, 37476, 196585, 78531, -52615, -110087, 18460, -236135, 205976, -233084, 83668, 103293, -174550, -41727, 114929, -152209, -285217, -72344, -100444, -158130, 111959, 221067, -94420, -82166, 132578, 74160, -37803, -151015, 282592, -29853, -206243, 105939, 218508, -427974, 323028, 34322, -93513, -285199, -266689, 118611, -459579, 32153, -33612, -85112, -124970, 206767, 117283, -73125, 74957, 139886, 169519, 153614, -268045, -6882, -192985, -34526, 207846, 4955, 389672, -278541, -368323, -161975, -11814, -225792, 130632, 112665, 326779, 83197, 7034, -48941, -3376, -367526, -153627, 16705, -106904, -22588, 107690, 96435, -128025, -23642, -187844, 260657]
18403i8197C19287G9128b7250A31289l2387J30092B6523J6999O6819a35395j28770
18392b64165M5672B81816a84672A78672n4651b75527A66446G6996b22466a8296
18381A00398a43535A90258p0186M9722C7251j5921P8300h9510k0955O643j42651
18370b46473A70620b12822A82276K0151a51079B90987a0313j36103f997C9089
18359E9310B4043c6776k10973O9003A41933A0417e0526B0819h1262B77906a84374
18347b3413E789K84897b31855I3393b5077a597j67267k37112B6807a62555l0679
18336a93234M7709f2049A8284O8630K74848c57290H3117A9595b403A36107f2614
18324a14110A6150b0951A05543P2806n6070B2899P578K00167c05131e6396A36361
$$ y = [-98197, 319287, 79128, -27250, 131289, 98902, 228994, 26523, 43522, 110341, -135395, -264165, -218493, 281816, -184672, 178672, 124021, -275527, 166446, 76996, -222466, -18296, 100398, -143535, 190258, 120072, 169794, 37251, 21330, 99630, -89510, -110465, -103822, -246473, 170620, -212822, 182276, 202427, -151079, 290987, -10313, -146416, -6997, 39089, 59310, 24043, -36776, -247749, -178746, 141933, 10417, -50526, 20819, -81262, 277906, -184374, -23413, 5789, 290686, -231855, 93393, -25077, -1597, -168864, -405976, 26807, -162555, -193234, -145525, -62049, 18284, 86914, 361762, -357290, 83117, 19595, -2403, 136107, -62614, -114110, 16150, -20951, 105543, 178349, 122279, 22899, 30477, 230644, -305131, -56396, 136361]
18312f5036j13276j30706A0890O3987f6059B61303d50831B40246F6885L0490a86298
18300D9903H836L3910k0495b20714M9885e6638o9907m689B06779b64038P7971
18289a86067n7310O3042I6985a28192e0862j16768b0612A35385J60326b64626
18278B05024c05924g1502m4833D13620a60937I1538Q5363p2704L9357a79519j71378
18267c50897g6096j72B36726D4083a62331j19037C5623a61794d8475j29900K4276
18256a54099K3722d9195G7804h983C06159b1872A90536e9835J3818j74859k04004
18245d24880a98723j44935F9675a79014e8948D8128e1279l20632A57131a6925
18234b33376P0602c6091j21677g073j20669K7733j50839h854b508A5703C703J61995
$$ y = [-65036, -178312, -309018, 10890, 74877, -66059, 261303, -450831, 240246, 66885, 97375, -186298, 49903, 8836, 42746, 22251, -220714, -170829, -56638, -126545, -131234, 206779, -264038, -186067, -243377, -180335, 96985, -128192, -50862, -167630, -20612, 135385, 295711, -264626, 205024, -305924, -71502, -116335, 413620, -160937, 91538, 176901, 104197, 143554, -179519, -350897, -76096, -76268, 236726, 44083, -162331, -281368, 35623, -161794, -48475, -178375, -154099, -130377, -49195, 77804, -8983, 306159, -21872, 190536, -59835, -46017, -220876, -424880, -198723, -343658, 69675, -179014, -58948, 48128, -51279, -371911, 157131, -16925, -233376, -162774, -36091, -157768, -7073, -127742, -100009, -250848, -8854, -2508, 15703, 3703, 165698]
18222A65698D5319P428g3367b4748k38420g3762D2669b04032I8066b97264m7719
18211c44983D84605c94145e3306K6002J3363A84726h5476l20343a7335A82331
18200A62941a83526g5405o6446l03568D2472G616K50439C5284b8173l6385j12266
18189a76824C5283K66571a58358B47748a39676a5530B53036a94940C7051a1124
18178a84609A23979D4908a56251P1331R995b4224o63381G0724k6719N6802d3111
18166a24048I917J92165q1009D2604L9253A0278J22454a06629B90937d30217e0557
18154A79897r254a83161A09258e4305j3544B12864L1731n1657a38251j9148e8926
18142b29004j31520a26942M6702A09080K1289c3691A00201i3838L5865j53250
$$ y = [165698, 45319, 52747, -73367, -24748, -263168, -73762, 42669, -204032, 98066, -297264, -344983, 484605, -394145, -53306, -27304, -13941, 184726, -85476, -405819, -17335, 182331, 162941, -183526, -75405, -141851, -445419, 42472, 7616, 258055, 35284, -28173, -64558, -176824, 35283, 301854, -158358, 247748, -139676, -15530, 253036, -194940, 37051, -11124, -184609, 123979, 44908, -156251, -84920, -74925, -24224, -687605, 70724, 44005, 100807, -43111, -124048, 9917, 202082, 121073, 42604, 81857, 10278, 132732, -106629, 290937, -430217, -50557, 179897, 170643, -183161, 109258, -54305, -67849, 212864, 244595, 192938, -138251, -157399, -58926, -229004, -360524, -126942, -80240, 109080, 130369, -33691, 100201, -93838, -57973, -211223]
18132b11223I3911d7294G517K21161j09542a20159E5535J23212a40966q0766C25778
18120g7794k99123e7159j38018f286r6343G0696h40l97332a96487P1968B20563
18108a95015A98443A9866b04175L5436H9259a75099b6538E7796J12511g7526C74731
18096h4730D06740d4546l250C6222b29226a01525B1454O9364j0087K31654d4411
18084B54856b63431i5948A08941i3685M3886l0457l0492N1789k8790A86363b20109
18072a88659h5122A3673a8339q4443A52275a50793n5992j61438G4988b18535d8793
18060b9811m11732H4107i2968A44004K7432Q1133a55521A6496K71388e5634C03629
18048a25051m8735O4493B66579L3141a73687j26159i6503A13628b83952B12085
$$ y = [-211223, 93911, -47294, 7517, 228678, 119136, -120159, 55535, 178747, -140966, -221732, 325778, -77794, -376917, -57159, -195177, -6286, -102629, 70696, -840, -398172, -196487, -124519, 220563, -195015, 198443, 19866, -204175, -168739, 89259, -175099, -26538, 57796, 170307, -77526, 374731, -84730, 406740, -44546, -47796, 36222, -229226, -101525, 21454, 90818, 80731, 312385, -44411, 254856, -263431, -95948, 108941, -93685, -49799, -80256, -110748, -58959, -87749, 186363, -220109, -188659, -85122, 13673, -18339, -102782, 152275, -150793, -206785, -368223, 74988, -218535, -48793, -29811, -441543, 84107, -92968, 144004, 171436, 252569, -155521, 16496, 287884, -55634, 303629, -125051, -173786, -109293, 266579, 299720, -173687, -299846, -96503, 113628, -283952, 212085]
18037a7557m57852a43741N8596B81186A6456L8919L24797I9157a35110F1868N4889
18026A16757M0612a22805O0846p4376M6420B75204A05892a51512g0373k4517I1547
18014i1794j0752o832H2549J54206J26371A36467f2057L0468H7253a67030B63745
18002I0822M0574Q0190b41254q076I6712a75231j36341m5352a28392F6967a20748
17990a57160L6318e2547G689J70474b32102B01646L2386r4731J7518J90270i3897
17978d27737a63824H2448N6786a72906E2497D538K36591b42379J02972E8212E463
17966f0223j383C9089R416R1416a78251B01431B6816a53736a66p4948C06821b54536
17953a9380p5261c4888A04967e465k7822j54617A99411O8466b0919j50352A02446
$$ y = [-17557, -475409, -143741, -85145, 281186, 16456, 55375, 380172, 99157, -135110, 61868, 116757, 157369, -122805, -61959, -136335, -89915, 275204, 105892, -151512, -70373, -94890, 91547, -91794, -102546, -109378, 82549, 236755, 363126, 136467, -62057, -31589, 87253, -167030, 263745, 90822, 131396, 211586, -241254, -249330, 96712, -175231, -311572, -356924, -128392, 66967, -120748, -157160, -120842, -52547, 7689, 178163, -232102, 201646, 234032, 139301, 156819, 347089, -93897, -427737, -163824, 82448, 139234, -172906, 52497, 4538, 241129, -242379, -139407, 58212, 5463, -60223, -61606, 39089, 48505, 139921, -178251, 201431, 26816, -153736, -166, -75114, 306821, -254536, -19380, -94641, -34888, 104967, -5465, -33287, -187904, 199411, 267877, -20919, -171271, 102446]
17941c541r3288P990D2481O7300a29852o0715H8806b13460m3741A43506M5943
17930A89449e2868A42821a22043l8834D38160A08346k2945K0208A1021M0572J96972
17919B48565b94821K1580A08740J2925A5056M5321a2286e895k69912a37740C23549
17907G7879k6580P4183J2421M329P624N8980j1194a4557H1466A8799e622A08024
17894b83862R9488h5431J1493l8764K8686K4877C76696b85631A02719e7462B947
17882d47032a68866A43683D0523b46584H5407f8437F5977j8025e6642k2004C99397
17870F3077A9584c53730i8191H112a58931e7350j02676A12606n0825A5855J33309
17859A49164e1922n1821A005M2112O2919l9153K5276b30491B23001B2711e6987
$$ y = [-3541, -96829, -88839, 42481, 109781, -129852, -190567, 88806, -213460, -257201, 143506, 189449, -52868, 142821, -122043, -160877, 438160, 108346, 85401, 105609, 11021, 51593, 248565, -294821, -273241, 108740, 121665, 15056, 60377, -12286, -5895, -275807, -137740, 323549, 77879, 51299, 125482, 137903, 142232, 149856, 208836, 197642, -14557, 81466, 18799, -5622, 108024, -283862, -184374, -85431, -73938, -112702, -84016, -59139, 376696, -285631, 102719, -57462, 2947, -447032, -168866, 143683, 40523, -246584, 85407, -68437, 65977, 47952, -56642, -78646, 399397, 63077, 19584, -353730, -98191, 8112, -158931, -57350, -160026, 112606, 61781, 15855, 149164, -51922, -103743, 1005, 43117, 106036, 66883, 92159, -230491, 223001, 22711, -56987]
17847a0596B21661b00741a8177B65092l1352b2997j39040A8418h8802B8182e1469
17835A21574Q2008A235a83183N6394N189F5518e342E21599G0232J40991o4871
17824A46352i6430A16642R3173b93212a22755d9563l2236b928B04795f8632F537
17812b59570A28320j6163M9933n0142a28782q8355A05606B9336M6474K94607a74426
17800a3254F5329b18527A23429f3230G3645k8313N1966L07316b54832D963f3887
17788d3065r85A47917b51177b4798k7472B22573b42660a8987p4274A88587a15890
17776B4780P5472J67535j08804E5136a80314B11933i7122J5000A85883f9981B39738
17764I7672R9913J51397B2390K18235a18115A39702b23128J10340N3465k79857
$$ y = [-10596, 221661, -200741, -18177, 265092, 233740, -22997, -162037, 18418, -88802, 28182, -51469, 121574, 203582, 1235, -183183, -126789, -121600, 65518, -5342, 521599, 70232, 211223, 146352, -96430, 116642, 209815, -293212, -122755, -49563, -81799, -2928, 204795, -68632, 6537, -259570, 128320, 112157, 162090, 111948, -128782, -217137, 105606, 29336, 75810, 370417, -174426, -13254, 65329, -218527, 123429, -63230, 73645, 45332, 97298, 404614, -254832, 4963, -63887, -43065, -44050, 147917, -251177, -24798, -52270, 222573, -242660, -18987, -93261, 188587, -115890, 24780, 100252, 267787, 158983, 55136, -180314, 211933, -97122, -82122, 185883, -69981, 239738, 97672, 197585, 348982, 22390, 240625, -118115, 139702, -223128, -112788, -59323, -339180]
17754c39180G2203J53789a3683l69847C7428b231o488B27028a41799c4947A02971
17742A41801C0399j3075J5098f0865q075H5978l6937b42575J2710A59567J76016
17731C35583a28097B56456o8231R4753C2300a53174N013C07206b90076A88647
17720C05594J070f411A87791e5862G7827a74687A67288f1585m6271D28K9745J79697
17708B09870m2425i8872B5841J61729d802j74490A55520P7896e3086B04980F4660
17696B82218E4150O0243A8087d1555F4113d5666j34709c8725C871A764K68047
17685B69811A2702J72199Q4676G6582a39520A07587c30995a7403j06828K9861
17675i4370A20438a48075A10323b11092B26223L06744A29984c40305a07795A25713
$$ y = [-339180, 72203, 225992, -13683, -383530, 37428, -2231, -8719, 227028, -141799, -34947, 102971, 141801, 30399, 17324, 32422, -60865, -68940, 85978, 49041, -242575, -229865, 159567, 335583, -128097, 256456, 188225, 282978, 32300, -153174, -148161, 307206, -290076, 188647, 305594, 306664, -6411, 187791, -55862, 77827, -174687, 167288, -61585, -107856, 428, 30173, 209870, 167445, -98872, 25841, 187570, -4802, -179292, 155520, 233416, -53086, 204980, 64660, 282218, 54150, 114393, 18087, -41555, 64113, -45666, -180375, -38725, 3871, 1764, 269811, 12702, 184901, 269577, 76582, -139520, 107587, -330995, -17403, -124231, -94370, 120438, -148075, 110323, -211092, 226223, 532967, 129984, -340305, -107795, 125713]
17664H9660G254J61491B1556J06184a62642H4875K13716f7645D7628B3222M470
17653B7692a28510E4792Q4025a28886L2986A55143b02837C17776j37854a54124
17642a33444A53542a61718N1851c9824A96260J50909I771K8658K25374G2623h5792
17630h7206a017C6685i1751l9972B17987B1949P035b2886r0970p3685D5215a19436
17617e098C7267K14220B613e7411A51413K63869b9200D656b4149D72034o8603
17606D03431j67323g915B21433f5477K9350B93989L5673c4279D51601A63886N1985
17595B15871b68560n5136p7867A88267C2482g1897A10948b9612o5402j6972c8469
17583a60134l4824c4944q0116A96468d4876o4580F4611L2574K98567j65237F5454
$$ y = [89660, 7254, 168745, 21556, 127740, -162642, 84875, 298591, -67645, 47628, 23222, 27692, -128510, 54792, 138817, -128886, -95900, 155143, -202837, 317776, 179922, -154124, -133444, 153542, -161718, -109867, -39824, 196260, 347169, 9771, 38429, 263803, 72623, -85792, -87206, -1017, 36685, -91751, -131723, 217987, 21949, 28984, -22886, -113856, -187541, 45215, -119436, -5098, 37267, 251487, 2613, -57411, 151413, 415282, -29200, 4656, -24149, 472034, 403431, 236108, -7915, 221433, -65477, -36127, 293989, 329662, -34279, 451601, 163886, 215871, -268560, -323696, -401563, 188267, 32482, -71897, 110948, -29612, -95014, -111986, -38469, -160134, -194958, -34944, -115060, 196468, -44876, -109456, 64611, 97185, 395752, 230515, 65454]
17571G5315c14894A29809k9393K11974e6641A570L90257j62136b3760B62627a7299
17559A30703J08210q0280Q1033l3172R370Q36I7808b05304H1410J87335A03228
17547A60797J76945A6157L15176o5139a51061D26485f2375k586o2632C45795A6692
17535I7142J38262C3158P4811K2991J84960A57823M0578c2367A95868g443C18076
17523E23071q0115K09904j47416j39885L9941A64972P1295q0377M45387k81459
17513C19818A12374K74294L46011A57228K52139k0886L64965m5180j89597j20310
17503C98359k5923J0076A61716p6161K30998K75382B33484K61160k30335p5929
17493A88380J15998j12649M02991B8015J79271Q3966m1736n2620r0561h2903C11844
$$ y = [75315, -314894, 129809, 100416, 312390, -56641, 1570, 391827, 229691, -23760, 262627, -17299, 130703, 238913, 158633, 239666, 206494, 215864, 216700, 97808, -205304, 81410, 268745, 103228, 160797, 337742, 16157, 331333, 266194, -151061, 426485, -62375, -64961, -127593, 345795, 16692, 97142, 235404, 33158, 107969, 130960, 315920, 157823, 198401, -32367, 195868, -7443, 318076, 523071, 442956, 652860, 505444, 365559, 405500, 164972, 236267, 155890, 601277, 319818, 112374, 386668, 732679, 157228, 409367, 388481, 753446, 708266, 518669, 398359, 372436, 382512, 161716, 85555, 316553, 591935, 233484, 494644, 264309, 188380, 304378, 191729, 594720, 28015, 207286, 291252, 249516, 196896, 106335, -82903, 311844]
17481B99807k9083j06427E3843j1754L40631e3278a8611A46217J87565J833f7911
17469C9969J64105m3382m0137b26374A41765J81817r8066M0343o8798n0015H444
17457A33260a16015G982M97220f7558C71172N8585j96606M65775l03719O2433
17447D57640A27392K12130f1031H5244J3102O3314K98782j29425n1389A09819
17436B93235P2337N6980b564B94049A39657E1531J72887B3671L43603q4884k5788
17425B56602H5931M26241k27341r1077K57720j19874e6759B81039j14000l0432
17415A36607C3805M25545j76248N0327n6903b70091A31444J18383a12370K2692
17405h9678F23374B37070d750A81766C0223L28792F614J93999P8808a44793B46052
$$ y = [299807, 270724, 164297, 53843, 42089, 382720, -53278, -18611, 146217, 333782, 335615, -67911, 39969, 204074, 160692, 120555, -226374, 141765, 323582, 225516, 265859, 197061, 147046, 8444, 133260, -116015, 7982, 505202, -67558, 371172, 429757, 233151, 698926, 395207, 457640, 127392, 339522, -61031, 85244, 98346, 161660, 460442, 331017, 279628, 109819, 293235, 365572, 422552, -2564, 294049, 139657, 51531, 224418, 23671, 367274, 282390, 256602, 85931, 512172, 284831, 193754, 451474, 331600, -56759, 281039, 167039, 136607, 33805, 459350, 283102, 333429, 276526, -270091, 131444, 249827, -112370, -89678, 623374, 237070, -4750, 181766, 30223, 359015, 6614, 200613, 279421, -144793, 246052]
17393D52231A53923M2329M6682h9901C1554L31275b9381C92468j69832H8989A6928
17381G7222J15050O4330j25208R9650k7904J24752A38228J09984A2633L71972
17371C84605j31166l9229K30185D5447a44844C10679j04462R1690h9622m10849
17361e00471B27601j12369J51557J6745F4200K90524h2884L9522F2362J26635
17351A88997J8437J29019G5353P6930J65951c8890A05998J83131R3284k1207A63292
17339C51066J99845B45420I7506a44857B95033a19845C73848a12375A13759K2288
17329A36047h0760I9386R9356a6713A10636R0091P7106j21906O2377J08410D1094
17317c999B27994J99993J27762c920B16476a09211F5612B2200a38560B89825M1050
$$ y = [452231, 153923, 196252, 242934, -89901, 31554, 362829, -29381, 392468, 222636, 88989, 16928, 77222, 192272, 256602, 131394, 231044, 203140, 327892, 138228, 248212, 12633, 384605, 253439, 214210, 444395, 45447, -144844, 310679, 206217, 297907, -89622, -500471, 227601, 115232, 266789, 283534, 64200, 354724, -82884, -43362, 62362, 188997, 207434, 336453, 75353, 152283, 318234, -38890, 105998, 289129, 382413, 361206, 163292, 351066, 550911, 245420, 97506, -144857, 295033, -119845, 373848, -112375, 113759, 136047, -80760, 99386, 198742, -16713, 110636, 200727, 277833, 155927, 218304, 326714, 41094, -3999, 227994, 427987, 555749, -3920, 216476, -109211, 65612, 22200, -138560, 289825, 330875]
17306C30875c5434I5130j2956J2227l4423J50546O0066o285j25312C3416M45432
17295D78848A38365L6846i9432A32030O2698P5136j28805J26406A02751L70405
17285D73156C2442J37607k8971E1786L14368J27906A74913h7084B16977p5572
17275A41405L34196A43061N7543l3230J45584j08326P9317K5024K4264J95005
17265E28242E5762J46995J48263J57046A22557K39860o6613A05850K5710J52455
17255B84015K0453j49970L05592B11637O9548j2690e0477D22490k9554j95784
17245A97152P0552P4047q7807P4011K63151A02205N1693J95523a3673A00642M37698
17234E38340B290J52915Q784L00050d6341D31118j57020Q6060j70132B0293L46440
$$ y = [330875, -35434, 95130, 82174, 94401, 59978, 210524, 270590, 264305, 138993, 33416, 478848, 138365, 175211, -99432, 132030, 194728, 269864, 141059, 267465, 102751, 473156, 32442, 170049, 141078, 51786, 366154, 494060, 174913, -87084, 216977, 141405, 475601, 143061, 200604, 167374, 312958, 204632, 283949, 308973, 333237, 528242, 55762, 202757, 351020, 508066, 122557, 362417, 295804, 105850, 131560, 284015, 304468, 154498, 460090, 211637, 281185, 268495, -50477, 422490, 392936, 197152, 267704, 341751, 253944, 327955, 591106, 102205, 153898, 349421, -13673, 100642, 538340, 2290, 155205, 163989, 464039, -46341, 431118, 274098, 360158, 190026, 20293, 366733]
17223C66733j71005K01500E9924J50967K28208A6503N30331B49085J86523j2641
17213D22967j33840j13016L30588k44034r0711K79225p1014A10213A2767f7956
17202C30238j03064j01914J34455N5139A34328k5531J47998R195L6856O5328N8296
17191D26470j55254J86965r2350l1077A66155l0953K49933q0541H8320J33799
17181B22119L38567m6406B22592j2377p2189O39342C16665A30873J12261L4469
17171B77603o3411K69024j81381E4414N817K62395q4043j6808Q659J82476j91431
17160B21479J59677A53294K88664K8530A70638J29042P8504m0907J31017N2543
17150E20837k43465J26108P526j03922K35812B18483K19609O5671j55468Q1748
$$ y = [366733, 195728, 397228, 59924, 210891, 439099, 16503, 546834, 249085, 435608, 422967, 289127, 176111, 506699, 262665, 171954, 451179, 380165, 110213, 12767, -67956, 330238, 227174, 125260, 259715, 314854, 134328, 108797, 256795, 265990, 302846, 368174, 426470, 271216, 458181, 365831, 334754, 166155, 135202, 385135, 304594, 88320, 222119, 560686, 514280, 222592, 210215, 138026, 777368, 316665, 130873, 243134, 277603, 214192, 483216, 301835, 54414, 60231, 322626, 238583, 221775, 230434, 412910, 221479, 381156, 153294, 441958, 470488, 170638, 299680, 378184, 337277, 468294, 520837, 277372, 403480, 411006, 307084, 542896, 218483, 438092, 503763, 348295, 430043]
17140D30043g215B37135J05140K51398o9817R6214B69280L6528K6646k9761J2824
17129C15517J54717l7297j59243J98904J47871J37216k33068j44046j28179J1790
17119B64182n3623R6392M26120k70413j67209j45374M05524M979j14145K18584
17109F65017L175d4227A92157M2485J38966L74093C22881L59785A12644M22766
17099E35410j16617L35206j21684M7761l12928L58275k5637k39260p2323K06963
17089E95166J20739r9566M616j32377K41801l19586M06145n2594j39758j05056
17079E19530j27152p608L48670j41190O6323J3609q8887j02692J20092J10845
17069G11540J25704p6321K4461k01840M9591k62909O47282D92543J60028j80854
$$ y = [430043, -7215, 237135, 342275, 593673, 523856, 620070, 269280, 305808, 332454, 302693, 315517, 470234, 432937, 273694, 472598, 620469, 757685, 524617, 380571, 252392, 264182, 210559, 306951, 733071, 462658, 295449, 150075, 555599, 560578, 446433, 665017, 668192, -44227, 192157, 234642, 373608, 747701, 322881, 682666, 112644, 535410, 418793, 753999, 632315, 680076, 367148, 725423, 699786, 460526, 388203, 595166, 715905, 616339, 620955, 488578, 730379, 410793, 816938, 764344, 624586, 519530, 392378, 384770, 733440, 592250, 658573, 672182, 583295, 480603, 600695, 711540, 837244, 760923, 785384, 583544, 633135, 370226, 1017508, 492543, 652571, 471717]
17059D71717M2656J93365j81877J18405L27645D63387J96460p6962L0942J91853
17049H05680J12513l85476K86628k40200k10977L16468j62779K46727K2808r7613
17039F93779L4120K57814j773l7982j2470J1785j10296j26234L81327l40707j67261
17028E82102Q0276r2192K42869k51688J97791j02474J32091N3641l03646L65988
17018I04758j05649J95627j66075R9965j25782J91873l22568M33552k34580k11490
17008F59631j4791N30619j19993l99770K61227M8164j2881j96457N54258m23163
16998H86844J88042O2124K7060P070r0638j8784J19273k4671J53504j88175N8976
16987A180625l6085n4906j67742J60212J06942j04598J61614j55782J0244j04139
$$ y = [471717, 514373, 707738, 525861, 644266, 971911, 463387, 659847, 582885, 613827, 805680, 918193, 532717, 819345, 579145, 368168, 684636, 521857, 768584, 791392, 693779, 727899, 985713, 983940, 945958, 933488, 945273, 834977, 708743, 1090070, 749363, 582102, 662378, 570186, 813055, 561367, 759158, 656684, 788775, 842416, 538770, 904758, 799109, 994736, 828661, 928626, 802844, 994717, 672149, 1105701, 871121, 659631, 644840, 1175459, 1055466, 655696, 916923, 965087, 952206, 755749, 1310007, 886844, 1074886, 1137010, 1164070, 1171140, 1080502, 1061718, 1180991, 1156320, 1309824, 1121649, 1180625, 1144540, 1089634, 921892, 1082104, 1189046, 1084448, 1246062, 1090280, 1100524, 996385]
16977I96385K17293k32843J64520K20748l85534Q9420K25867j60684K87272j91930
16967A230514k52189L12382k1275L2122o3955J99503q4871q7169K0908L91036
16957A677006k47424j56071j1806M2291J40725j83334M95566k33629L1710l6652
16947A518382J2769k88778L81623K16276k48562j94402J25150j41113M30926j07252
16937A705019J6966j16160K19210j22704L36743j81076Q9889J9713J59535k00914
16927A926221k7650j1277j14600J71267J32982P6200l67152J48318o4920N41456
16917B410845n25583J53454K83192N163q9973j53474J18299k7015L7790j87870
16907B024828K83433j9104K86509k8727l7871m75824N82895P5062j0049J7090
$$ y = [996385, 1213678, 980835, 1145355, 1366103, 980569, 1069989, 1295856, 1135172, 1422444, 1230514, 978325, 1290707, 1269432, 1301554, 1237599, 1437102, 1352231, 1265062, 1285970, 1677006, 1429582, 1273511, 1261705, 1303996, 1444721, 1261387, 1756953, 1523324, 1555034, 1518382, 1531151, 1242373, 1623996, 1840272, 1591710, 1397308, 1522458, 1381345, 1812271, 1705019, 1721985, 1605825, 1825035, 1702331, 2039074, 1857998, 1947887, 1967600, 2127135, 1926221, 1898571, 1887294, 1772694, 1943961, 2076943, 2153143, 1785991, 1934309, 1869389, 2410845, 1885262, 2038716, 2321908, 2327071, 2237098, 2083624, 2201923, 2174908, 2212698, 2024828, 2308261, 2289157, 2575666, 2546939, 2509068, 2033244, 2616139, 2691201, 2681152, 2698242]
16897B698242k2707p388Q285n2827J72172j68801L99643m29316K58531Q2422o5689
16886B872567J05185k28449R6329J38447K64361j12306J09020k7317M07557l28754
16876C296640Q0359J5729n8758K31129M7275N8208N1330J58753J40435K05267
16866D226367m85177J45129M54906m7419L7731k64870L57658N6947L5666o944
16856D509994N06636l32471J24358l09602O72405n6268j9811J56372J93730k15452
16846E229891J29090L40849j11152J52186K82897j66268M47108J72469q7616j85796
16836F203658P14621r7070K211J82115L80337j89544L9713K38716M17804J42371
16826H034932j04974K86226J47634O577K30931J71527L83789M79086l58230M96798
$$ y = [2698242, 2675535, 2668147, 2676432, 2623605, 2795777, 2626976, 3026619, 2597303, 2855834, 2938256, 2872567, 2977752, 2749303, 2845632, 2984079, 3248440, 3136134, 3245154, 3217837, 3625394, 3296640, 3376999, 3392728, 3333970, 3565099, 3612374, 3670582, 3721912, 3880665, 4021100, 4226367, 3741190, 3886319, 4341225, 4293806, 4331537, 4066667, 4424325, 4481272, 4516938, 4509994, 5016630, 4684159, 4808517, 4498915, 5171320, 5115052, 5095241, 5251613, 5445343, 5229891, 5358981, 5699830, 5588678, 5740864, 6023761, 5857493, 6304601, 6477070, 6389454, 6203658, 6918279, 6821209, 6823420, 7005535, 7385872, 7196328, 7236041, 7474757, 7892561, 8034932, 7929958, 8216184, 8363818, 8370395, 8601326, 8772853, 9156642, 9635728, 9277498, 9774296]
16816I774296p1895K29249M94372K54029K84268j91034Q60351J8691P2698K84523
16806A2009548N67162M06393N3155K44147L37811O28994k8564P08371j48213Q69396
16796A5648200J8490Q29109N84217K19266N65295Q61240n283P28567Q89071L06702
16786B0644874M66587Q22892Q01913L98895Q39099N28733J265095N15124J026921
16777B7310133Q29164J017309O70555J262401R73403J095580Q53370J304742J447903
16768C6764560J004841J823579J304865J266998J886277J570013J597468J699567
16760D8918168J614822K156601J750158K419067J765486K047087K540850J805195
16752F5017434K932507K452267K504401K340326L040377K606506K333135L239018
$$ y = [9774296, 9702401, 9931650, 10426022, 10680051, 10964319, 10773285, 11633636, 11652327, 11725025, 12009548, 12576710, 12983103, 13036258, 13280405, 13618216, 14247210, 14218646, 14927017, 14778804, 15648200, 15666690, 16495799, 17080016, 17299282, 17864577, 18725817, 18720534, 19449101, 20338172, 20644874, 21111461, 21934353, 22736266, 23135161, 23974260, 24502993, 25768088, 26283212, 27310133, 28139297, 29156606, 29827161, 31089562, 32062965, 33158545, 34011915, 35316657, 36764560, 37769401, 39592980, 40897845, 42164843, 44051120, 45621133, 47218601, 48918168, 50532990, 52689591, 54439749, 56858816, 58624302, 60671389, 63212239, 65017434, 67949941, 70402208, 72906609, 75246935, 78287312, 80893818, 83226953, 86465971]
16744H6465971K215008K600044K623163K427960K455494K387932K076713K177428
16736A05429713J688959J663201J482450J023063R06599L79902M29774k61604
16728A12742057o098k32375j193154j246369r14925j937627j917431j718273k066446
16719A01509359k670022k139142k679804k459596k958489k255695k932130k245657
16711H1168824k648178k479666k719319k460445k201092k358495k539588k130454
16703F1631587k346569j753255k207778j941460j857709j772014j808899j222490
16695D6721413j779019j586733j521561j604647q31097j233618j656092j214985
16687C5293661j331879p74214j162676j138953o19251q27876q98747p47480j018161
$$ y = [86465971, 88680979, 91281023, 93904186, 96332146, 98787640, 101175572, 103252285, 105429713, 107118672, 108781873, 110264323, 111287386, 112193985, 112573887, 113003661, 112742057, 112735959, 112503584, 111310430, 110064061, 109149136, 107211509, 105294078, 103575805, 101509359, 98839337, 96700195, 94020391, 91560795, 88602306, 86346611, 83414481, 81168824, 78520646, 76040980, 73321661, 70861216, 68660124, 66301629, 63762041, 61631587, 59285018, 57531763, 55323985, 53382525, 51524816, 49752802, 47943903, 46721413, 44942394, 43355661, 41834100, 40229453, 39398356, 38164738, 36508646, 35293661, 33961782, 33187568, 32024892, 30885939, 30266688, 29438812, 28540065, 27792585, 26774424]
16678B6774424p68117o78540n97691q27501p35933n00587o58348p55292l81888
16669B0870527n49312n35693m31631o95017m77696l04826j59639p02661p35448
16660A6278604o7856j81858q24100k51038k4332o96311J91425l45358o69272m12145
16650A2997759j04665l04679l96904J04087o20089r8728p7989m57441m81052N7348
16640A0617647k3739j05040m60943j37808k53088j71288j11748J19757l51424
16631I122326k29618j83688j67785k40719j22515k72232N12718k78950o2024l28027
16621G749486j58460L9697m05131j10582n9284j31004l16910L13007j30857l01884
16611F488078r6214K28540l16063l06494J01045J74286n20974J17534J13700l06572
$$ y = [26774424, 26006307, 25327767, 24730076, 23902575, 23166642, 22666055, 22007707, 21252415, 20870527, 20321215, 19785522, 19353891, 18658874, 18181178, 17876352, 17716713, 17014052, 16278604, 16210748, 16028890, 15204790, 14953752, 14929420, 14233109, 14424534, 14079176, 13409904, 12997759, 12893094, 12588415, 12191511, 12295598, 11675509, 11576781, 11498792, 11041351, 10560299, 10617647, 10593908, 10488868, 10027925, 9890117, 9637029, 9465741, 9353993, 9473750, 9122326, 8892708, 8709020, 8541235, 8300516, 8178001, 7905769, 8418487, 8139537, 8077513, 7749486, 7591026, 7630723, 7225592, 7115010, 7055726, 6924722, 6607812, 6920819, 6789962, 6488078, 6391864, 6620404, 6304341, 5997847, 6098892, 6273178, 5752204, 5869738, 5983438, 5676866]
16601E676866K18184k64241k42016l87339m0252L71745k27731J72775k14086j56181
16591D907724k12477J69408j72467K00589l51628J2457P1916k26893q6610K08029
16581D520048j36381N8894L2812l16556Q9112n8970j53189O0485l7219m21493
16571C637543L92714l31380K51393k83137J16426j69416K17519l29936M688q0562
16561C425852J67256J76031k9972l07183j11049J73798n50461M78022k23161j2935
16551C186198J589J67194j51623q2124j62931M9747j71370J87147J35127j18029
16541C040925N5320q0199j42563L29216k92649r4006J58681k5530l0421j76697
16531B742077j37317K88898j35657r014q8432l3749k8092J63719k76419L48101
$$ y = [5676866, 5895050, 5630809, 5388793, 5001454, 4961202, 5332947, 5105216, 5277991, 5063905, 4907724, 4695247, 4864655, 4692188, 4892777, 4541149, 4553606, 4625522, 4398629, 4312019, 4520048, 4383667, 4442561, 4475373, 4158817, 4247929, 4188959, 4035770, 4096255, 4059036, 3637543, 4030257, 3698877, 3950270, 3667133, 3783559, 3614143, 3831662, 3501726, 3506414, 3425852, 3593108, 3769139, 3739167, 3431984, 3320935, 3494733, 2944272, 3422294, 3199133, 3186198, 3187787, 3354981, 3203358, 3121234, 2958303, 3008050, 2836680, 3023827, 3158954, 3040925, 3096245, 3016046, 2873483, 3202699, 2910050, 2816044, 2974725, 2949195, 2918774, 2742077, 2604760, 2893658, 2758001, 2748987, 2660555, 2626806, 2598714, 2762433, 2486014, 2834115]
16521B834115l84395L28172k64742j53642j3658J83263n25253L68738J3108J66016
16511B551722j49365L401j51552R9915J31341j26209k20564Q0394j39339N6799
16501B136543L3689J01280k69385n0291K26355q8869J90825J79612o97040J58885
16491A921604J96086Q7019k18064j66223j37841M15517l33562J48117R4098k21643
16481A785108K75412J82147n19913J44778J32964K42088j37724l05130K90964
16472B090694k19746J73064m1775j26540K11408k29539l01954K91397j61476M73713
16462B159246k64751j97533Q8337k03170J54496k31027K14377K67828j24673k66104
16452A597026L65544l02987k0934K9267R0936j73161K46062k41917J96713k88219
$$ y = [2834115, 2449720, 2777892, 2513150, 2359508, 2345850, 2529113, 2003860, 2372598, 2385706, 2551722, 2402357, 2405758, 2254206, 2354121, 2485462, 2359253, 2138689, 2219083, 2079744, 2136543, 2170232, 2271512, 2002127, 1951836, 2178191, 2089322, 2280147, 2459759, 1762719, 1921604, 2117690, 2204709, 1986645, 1820422, 1682581, 2098098, 1764536, 1912653, 2006751, 1785108, 2060520, 2242667, 1722754, 1867532, 2000496, 2242584, 2104860, 1799730, 2090694, 1870948, 2044012, 2002237, 1875697, 2087105, 1857566, 1555612, 1847009, 1685533, 2159246, 1894495, 1696962, 1785299, 1582129, 1736625, 1505598, 1719975, 1987803, 1863130, 1597026, 1962570, 1659583, 1638649, 1667916, 1758852, 1585691, 1831753, 1589836, 1786549, 1498330]
16442A498330k48576K28356K21397j95146R1222J40751K3659p6958k54668N8650
16432A487017K13153j8221M1105l33543J83813M2973k42577q4888K52869j24179
16422A417522J87726k01558L53012k16250k04064J13082J46966m54522L77542
16413A519456j56427J84407j82162P0538n6198J39207n1191J17757k19027k53285
16403A113075K97006L25709j61817j43829j13580J18678n782L671k35270K58408
16393A456269j35684L1231J47818k37303j18779K94392J02197p4941J33022k59649
16383A338573K93106l9566k20894l34958M35151n40739O28565n4879J23605o20086
16373A007878L40982O2053J05558j51530k55415O37323n24107j72913K21269J59788
$$ y = [1498330, 1249754, 1478110, 1699507, 1504361, 1595583, 1736334, 1759993, 1683035, 1428367, 1487017, 1700170, 1681949, 1723054, 1389511, 1573324, 1616297, 1373720, 1288832, 1541701, 1417522, 1605248, 1403690, 1756702, 1540452, 1336388, 1449470, 1596436, 1141914, 1519456, 1363029, 1547436, 1365274, 1435812, 1379614, 1518821, 1467630, 1585387, 1366360, 1113075, 1410081, 1735790, 1573973, 1430144, 1316564, 1435242, 1429460, 1433131, 1197861, 1456269, 1320585, 1351816, 1499634, 1262331, 1143552, 1437944, 1540141, 1465200, 1598222, 1338573, 1631679, 1592113, 1371219, 1036261, 1471412, 930673, 1559238, 1504359, 1627964, 1007878, 1348860, 1410913, 1516471, 1364941, 1109526, 1746849, 1222742, 1049829, 1271098, 1430886]
16363A430886j80115L6086p9059L15582k20619l06435Q8339J22086K26507j77078
16353A256180J3973N5055q4221k20780k52064O56365l47689L49317K4053m45527
16343A004662L10380p297j84184K48490l7891R443l95434K26596K69526K6446
16333A470737k23793J81142k86392j81654N59821l48638N3760j51014J31335J04136
16323A309440L608J62702k64062k2777J99126n98035L98340J95254j03218l86348
16313H94030L02706M02545o84269P8291P0792J29784k32850L8363M43057k88954
16303A153495j40460J06564p7155P176O7301j03633N0171K17231o20856L69887
16293A029721o2748k11995K12780J43422M7641k20326r7263k9283J53995J39390
$$ y = [1430886, 1250771, 1286857, 1207798, 1523380, 1302761, 996326, 1084665, 1206751, 1433258, 1256180, 1270153, 1325208, 1240987, 1020207, 768143, 1424508, 1076819, 1426136, 1450189, 1004662, 1315042, 1307745, 1123561, 1372051, 1334160, 1343603, 948169, 1174765, 1444291, 1470737, 1246944, 1428086, 1141694, 960040, 1519861, 1171223, 1224983, 1073969, 1205304, 1309440, 1313048, 1475750, 1211688, 1188911, 1388037, 790002, 1188342, 1383596, 1280378, 894030, 1196736, 1599281, 915012, 993303, 1064095, 1193879, 961029, 999392, 1442449, 1153495, 1013035, 1119599, 1042444, 1049620, 1116921, 1013288, 1063459, 1280690, 659834, 1029721, 966973, 754978, 967758, 1111180, 1158821, 938495, 841232, 811949, 965944, 1105334]
16283A105334K42444l62040j23662J62730r0600j00071P2332J04666J72959k76405
16273I07687N9996P6863K43703m35342K06172O6180k27912J01728j19375N7568
16263I37268M1599n0048J1917j75510j39449K86714j17991K8084K36717k45027
16253H14274P1064R7477j62082J67042j03338J74286E04221L25283K7918Q2408
16243I39830J43847k10930r1115q013J65703m56918P19741o111n51787M2078K67904
16232I54229j05906o4182k9775k05791K73351k72664M04515m7997k96096Q1862
16222F91546J57471l22175J53484J04486p1150P9377K20691m16690K18013j51360
16212F63693j20731L87560l26224J06030N2401j89465q3878M96830r9608q0982
$$ y = [1105334, 1347778, 985738, 862076, 1024806, 934206, 834135, 906467, 1011133, 1184092, 907687, 967683, 1044546, 1288249, 852907, 1059079, 1125259, 897347, 999075, 879700, 937268, 978867, 928819, 940736, 765226, 625777, 912491, 794500, 822584, 1059301, 814274, 885338, 982815, 820733, 987775, 884437, 1058723, 504221, 829504, 857422, 939830, 1083677, 872747, 781632, 773619, 939322, 482404, 1202145, 1196034, 644247, 686325, 954229, 848323, 784141, 754366, 548575, 821926, 549262, 953777, 905780, 609684, 691546, 849017, 526842, 680326, 784812, 713662, 793039, 1013730, 597040, 815053, 663693, 542962, 930522, 604298, 710328, 762729, 573264, 489386, 986216, 886608, 805626]
16202H05626J62557j85809l07576J75275m8930J307K99931j77700J93259j27466
16192G90474k4732j26975j24571L07878C83595L67576K30942l77247r8339j79671
16182C26856L8730L74718j78589J62538j9608O317J0760j21133J2679J33887r1900
16171F55255k7881j37026K27968m9174q0594K3139l04741A48630L92507J8639
16161E59776J53528k08069A07698N88956k78874j6003A75552K42970K32325N7076
16151G07923j72905r8631k10994L54724j31236k12120M38869C13529Q6277A01586
16140E12154J10155j0528k53337M0514p2469K4888j1188N5100K76656o7363B86109
16128D45254o5169M1995j81104L34705j2994R7263A95378L35725k29831J24579
$$ y = [805626, 968183, 782374, 474798, 650073, 601143, 602450, 902381, 724681, 917940, 790474, 765742, 638767, 514196, 822074, 383595, 751171, 982113, 604866, 506527, 326856, 365586, 740304, 561715, 724253, 704645, 710962, 721722, 600589, 613268, 747155, 655255, 627374, 490348, 718316, 669142, 588548, 611687, 306946, 148630, 541137, 559776, 713304, 505235, 107698, 696654, 417780, 401777, 175552, 418522, 650847, 707923, 535018, 436387, 225393, 580117, 448881, 236761, 675630, 313529, 399806, 101586, 512154, 622309, 611781, 358444, 398958, 326489, 351377, 340189, 395289, 671945, 604582, 286109, 445254, 380085, 422080, 240976, 575681, 562687, 659950, 195378, 531103, 301272, 425851]
16118D25851p0005J22065p3247j98604m014L62475B34885K9673k9380Q2717R0468
16107D08363L72881C48198A32111L47949j22243k9142J16029j44324K45021j12084
16097D33317r2084n6228n2824Q3842E2874L73689A05360D3423G962K72055G9447
16085B40380k5958L30958k68398n0531l3516f0229E0118L07224J64428l9112A63645
16073A85260g4177C33255J62998A12431K16744A42005O2717A00585K0887J69963
16063B91435A2783M04323j16498M5683j27849J63831A38873J70567a80760f0121
16052F0474K31393q7383J52334D9078J76923j05934K97164j55643p1085A0252
16041d7711A78171K31209A53827K8422M0177E3219L16432b07417G0657M40516
$$ y = [425851, 355846, 477911, 404664, 206060, 202046, 564521, 234885, 264558, 235178, 317895, 408363, 781244, 348198, 132111, 480060, 357817, 328675, 444704, 300380, 545401, 433317, 341233, 285005, 232181, 316023, 52874, 426563, 105360, 43423, 7962, 280017, 79447, 240380, 214422, 545380, 276982, 226451, 192935, -60229, 50118, 357342, 521770, 482658, 163645, 185260, -74177, 333255, 496253, 112431, 329175, 142005, 204722, 100585, 121472, 291435, 12783, 417106, 300608, 346291, 218442, 382273, 138873, 309440, -180760, -60121, 60474, 291867, 204484, 356818, 49078, 226001, 120067, 417231, 261588, 190503, 10252, -47711, 178171, 409380, 153827, 182249, 222426, 53219, 369651, -207417, 70657, 511173]
16031E11173H3402e0596D36918q7797j73796K57377C1323a40075A48055A693J18049
16020A19742a56475D26733j88735I8139Q820J43863A15442Q5043J89684H0225
16009C78341A81296a78817C10042a02167A10212k8315a25689d3548B47273q4523
15999A62750R4843A7082a88569C00653j26896O0239H8354P3993Q7256C4680L03430
15988C38110N2222L27017O45032k67683m12350J23644k86431j25858a9191C11689
15977a0618D35281a65900D81891A76701C36K34483f1734a1317A44534B2977c14819
15965I5240N8117a01146A93044b13970C5198h5627B0526M0382b0445A09445J62220
15954B71665D3451a39754a3621D7369P3249d1081k04873E5405J87374B6813M2475
$$ y = [511173, 83402, -50596, 436918, 349121, 175325, 432702, 31323, -140075, 148055, 1693, 119742, -156475, 426733, 237998, 98139, 106959, 250822, 115442, 200485, 390169, 80225, 378341, 181296, -178817, 310042, -102167, 110212, 81897, -125689, -43548, 247273, 162750, 257593, 17082, -188569, 300653, 173757, 233996, 88354, 162347, 249603, 34680, 338110, 390332, 717349, 1362381, 1094698, 682348, 805992, 519561, 393703, -19191, 311689, -10618, 435281, -165900, 481891, 176701, 336, 234819, -61734, -11317, 144534, 22977, -314819, 95240, 153357, -101146, 193044, -213970, 35198, -85627, 20526, 60908, -20445, 109445, 271665, 43451, -139754, -13621, 47369, 120618, -41081, -245954, 55405, 242779, 26813, 69288]
15943F9288M6058N7377E2846b3980j81810G9017a11899A84681d42705A7772L8515
15932E6287c40255a23417L4010C00065a6274j7936A34785c2376k4160k08655B81344
15920I7151g1192A97315e2367D191a71727i688H1391K1267b17057c4270B05653
15908A48836f4930r606K0500C0167A2567J97100b12663N7516B22630I6635K28362
15897C24997h0381d966j03956A97258k8720K14136H9149h0754L2478j18319a9638
15885D16016a84990A81457b44203M5099A42085b7358C81912A55725d4790A64034
15874A2308e6228a3606E8679O4484K7330b4066j12465I5189a9097m8508K3643
15863d3962A88774B5999E092d58683B38592J08540D945b13523F2611a58161c1838
$$ y = [69288, 115346, 172723, 52846, -23980, -205790, 79017, -111899, 184681, -442705, 17772, 56287, -340255, -123417, -89407, 300065, -16274, -34210, 134785, -32376, -56536, -265191, 281344, 97151, -71192, 197315, -52367, 4191, -171727, -9688, 81391, 102658, -217057, -34270, 205653, 148836, -64930, -74536, -54036, 30167, 12567, 209667, -212663, -155147, 222630, 96635, 324997, -80381, -4966, -108922, 197258, 168538, 382674, 89149, -80754, -48276, -166595, -19638, 416016, -184990, 181457, -244203, -199104, 142085, -27358, 381912, 155725, -44790, 164034, 12308, -56228, -13606, 58679, 123163, 150493, -24066, -136531, 95189, -19097, -67605, -43962, 188774, 25999, 5092, -458683, 238592, 347132, 4945, -213523, 62611, -158161, -31838]
15851d1578n1411H1854a0500D1906J94266D4366j1939a180C93471j74937n6544
15840A61990F5805M2049b79830A02322i5020F3631J10034D0716J21462c2234p1074
15829a03308B51981j17297i245G0377i1074A95072g261B12181r5932i0018C74395
15817a13081k19372J7387c3000j62185e299j28924r7334l0278A94047c71367F5744
15805c1754n5144P194L759A35034J59075b53592a18346k3672F051J55477e7975
15793g5572j31253O3403K1857j96543K1190C10762b15014A55794b18611E0184
15782c60820a39102H5450a22455A34724a98433a0232j94290e7354m2077a4761
15771a69142e2566H1690K4387R0951b49765J07061A9883L8277f1675C6311h3951
$$ y = [-41578, -92989, 81854, -10500, 41906, 236172, 44366, 32427, -1180, 393471, 218534, 161990, 65805, 107854, -279830, 102322, -95020, 63631, 173665, 40716, 162178, -32234, -103308, 251981, 134684, -9245, 70377, -91074, 195072, -7261, 212181, 116249, -90018, 374395, -113081, -332453, -315066, -33000, -195185, -5299, -134223, -231557, -261835, 194047, -371367, 65744, -31754, -86898, -79704, -75945, 135034, 294109, -253592, -118346, -142018, 6051, 161528, -57975, -75572, -206825, -143422, -121565, -318108, -296918, 310762, -215014, 155794, -218611, 50184, -360820, -139102, 85450, -122455, 134724, -198433, -10232, -204522, -57354, -99431, -14761, -169142, -52566, 81690, 106077, 197028, -249765, -142704, 19883, 58160, -61675, 36311, -83951]
15759E9616j9472K22838d6386m11723C68535B634K22381F4873b71270D4090N6723
15748A00813c9464j07016k36346d8017A61497n2158C1921a0785I4402a80590p952
15737a88542o5585J00695a259D02532a12412q9164A63338j1652h049p1182B58022
15725d85k44459N2626L6686M8722B54472O1450G5808a89184n173B36776j07510
15714A29266O2739D9693e0035a800G1802b08635C8694a42952G4822i1457D17c8411
15701A27571J9280L3913b07500l0291a5805j07815L2531E2089g9465j33014j8286
15690b30765g9246A04653c80627H7123E393J33427A6641J07755b70485B35306
15679i7499b0829r2985G8721a96104A29908J29687a13396H8173a8453q4213A3802
$$ y = [59616, 40144, 262982, -46386, -458109, 368535, 2634, 225015, 64873, -271270, 44090, 100813, -39464, -146480, -382826, -48017, 161497, 109339, 31921, -10785, 94402, -180590, -188542, -254127, -153432, -1259, 402532, -112412, -201576, 163338, 151686, -8049, -79231, 258022, -485, -244944, -192318, -155632, -106910, 254472, 315922, 75808, -189184, -194357, 236776, 129266, 192005, 49693, -50035, -1800, 71802, -208635, 38694, -142952, 74822, -91457, 417, -38411, 127571, 146851, 180764, -207500, -237791, -15805, -123620, -91089, 52089, -79465, -212479, -230765, -79246, 104653, -380627, 87123, 5393, 138820, 16641, 124396, -270485, 235306, -97499, -20829, -113814, 78721, -196104, 129908, 259595, -113396, 88173, -18453, -102666, 13802]
15667c0537j68288B2537c3931j06956A4442K19578H5525a19986D0662b77145g9738
15655a13269B4342a23308F1880b50974M5659A9898K04911d413k79845R2197C2257
15643A8857K13093J00801A06889a23564p4696C6886r587b30312f4933A87152c3585
15631B326K7200b20978m1692M029A27991e8530J663o1396F4859a6110k40085A02025
15618B54375a81411c0679C2936L94647a39666c5583m9436q4738A63230b86007
15607a98666D9084f7050a553l70158J24263B9298c46498A12411h5194l069J2084
15596g6179k28480B38002b92258a35691j03566f3235B63555d12523i5465K5981
15586f9484b6039k0594k61067A40621e7787p6295j62806i5795F9558b62864A38625
$$ y = [-30537, -198825, 22537, -33931, -140887, 14442, 234020, 85525, -119986, 40662, -277145, -79738, -113269, 24342, -123308, 61880, -250974, -205315, 19898, 224809, -4413, -284258, -192061, 32257, 18857, 231950, 332751, 106889, -123564, -198260, 36886, 27299, -230312, -64933, 187152, -33585, 2326, 29526, -220978, -262670, -258641, 127991, -58530, -56867, -118263, 64859, -16110, -256195, 102025, 254375, -181411, -30679, 32936, 427583, -139666, -35583, -85019, -169757, 163230, -286007, -198666, 49084, -67050, -1553, -371711, -247448, 29298, -346498, 112411, -85194, -88263, -76179, -304659, 238002, -292258, -135691, -239257, -63235, 263555, -412523, -95465, -69484, -26039, -46633, -307700, 140621, -57787, -134082, -296888, -95795, 69558, -262864, 138625]
15574a2788F1395d2949r8389L1439A40352k7536g9717c1249l17273C24941I8875
15562f77C39110b33871P6543e6444E9516a33784f2273A10204m7239d5934B30084
15550A3131K01715B70f9159L394k18070A61385l0167b94467J28621A52754k8675
15539A24079m1604g9485B09185f7636q9643A53664h0524c2688j44247A70931a71911
15527i7658M4665j06243R262g241j39424A26561b22921B0029R1129j673i673B45943
15514e0332J0366E8374a26286A53271J98967D6535a40715l8018A44733l4075N0181
15503A60839l9186K1188D0235j8090f9350p0721N3291J7332A44547f3800B33987
15491A73753b4004o6853k2356I0020b02086C1561b23041o1569d1100A31468a11045
$$ y = [-12788, 61395, -42949, -141338, -109899, 140352, 112816, -79717, -31249, -348522, 324941, 98875, -677, 339110, -233871, -157328, -56444, 59516, -133784, -62273, 110204, 62965, -45934, 230084, 13131, 214846, 270, -69159, -65765, -283835, 161385, 131218, -294467, -165846, 152754, 124079, 82475, -79485, 209185, -67636, -157279, 153664, -80524, -32688, -176935, 170931, -171911, -97658, -52993, -159236, -149974, -7241, -146665, 126561, -222921, 20029, 111158, 109485, -9673, 245943, -50332, -39966, 58374, -126286, 153271, 352238, 46535, -140715, -178733, 144733, 110658, 160839, 121653, 142841, 40235, 22145, -69350, -140071, -86780, -69448, 144547, -63800, 233987, 173753, -24004, -90857, -113213, 90020, -202086, 31561, -223041, -284610, -41100, 131468, -111045]
15479a6723C39465H2049K5364E1058i2470E23467i3079C83508C856a23382K5450
15468i7932k15034a10707A62313l491l279b57821E5280G252K04744H4698n329
15457G9369J8904b09335P9764P337j55703E3464g6145A27314L7756H2322J93772
15446B76094a56425q9048D0290Q2962L49974J19579R4707j40720A2516Q3097P2357
15435A67970J00554j08124E9474B1691J64783A7576a8212B44624q9670f5739G3730
15423A00183K5918b46183A26504D7519j3156L6665J12999e08234d4733p6805l7273
15412a58811j76874J40648N4928I1370D10J05185m7946J55596a43332j36069g2823
15400a48399k12257F8978j3637J45231C4345L3509j880L05928D1694d0596E050
$$ y = [-16723, 339465, 82049, 107413, 51058, -92470, 523467, -93079, 383508, 3856, -123382, -97932, -312966, -110707, 162313, 158822, 155543, -257821, 55280, 7252, 211996, 84698, 79369, 98273, -209335, -129571, -122234, -277937, 53464, -76145, 127314, 165070, 82322, 276094, -156425, -245473, 40290, 123252, 473226, 592805, 687512, 546792, 12516, 95613, 167970, 268524, 160400, 59474, 21691, 186474, 17576, -18212, 244624, 154954, -65739, 73730, 100183, 126101, -246183, 126504, 47519, 34363, 71028, 184027, -508234, -44733, -121538, -158811, -335685, -195037, -140109, 91370, 410, 105595, 57649, 213245, -143332, -279401, -72823, -148399, -360656, 68978, 55341, 200572, 34345, 67854, 65974, 371902, 41694, -40596, 5050]
15388b24058A08038L4327F693a50350A76791N8090J16733e3626C9131Q2359J73398
15377B94888J0431H0075g263o1690C23161k8322c9028B2887h5436B20848i5365
15365a00243B45373B1571M48886i6559M3438D24656a08888A54031N0502a80017
15354a52255C21166K21427E4369J16995L1237g6209g115l8160I2798B0764K37760
15343B58524j4797j05795F1708M6781K02641J92124k39645q4143q7140N1702E4821
15331A06537J88726C7678a73120B25340a81852C99988I2476c4837G7369a16951
15320a6825G1203k5599r627P7672c1481p6410B35396A6082a06485o5743G1896
15308a73590E8862A521J30502K16149p4241Q0669K5970c0491B79603A02518k1226
$$ y = [-224058, 108038, 142365, 6693, -150350, 176791, 234881, 351614, -53626, 39131, 121490, 294888, 305319, 80075, -7263, -68953, 323161, 294839, -39028, 22887, -85436, 220848, -95365, -100243, 245373, 21571, 470457, -96559, -53121, 424656, -108888, 154031, 204533, -180017, -152255, 321166, 542593, 54369, 171364, 202601, -76209, -7115, -45275, 92798, 20764, 258524, 243727, 137932, 61708, 108489, 311130, 503254, 263609, 179466, 92326, 144028, 54821, 106537, 295263, 37678, -173120, 225340, -181852, 399988, 92476, -34837, 77369, -116951, -16825, 71203, 45604, 35977, 113649, -31481, -107891, 235396, 16082, -106485, -172228, 71896, -173590, 58862, 1521, 132023, 348172, 273931, 354600, 380570, -30491, 279603, 102518, 81292]
15297H1292R1462a47745A13291b42708R0421B15748C3411a54037A6469e5667k2356
15286g8023P299b8858a145A9154a22688j9466F8416N0598h9008f3B73674a45327
15273F5411j2933a58644b9787B37975a33329D17301d9686o0503D1559J33381b55401
15261A49004a14843L0482I3153b36623j13130G4976g6785k52037a14636E0234
15250A06534Q067k8750P03032L56282r4552j54351J58060C81056j36930J22690
15240C66816A57343m7591J28132j5413A07929K16084a18966b5531k68380B77458
15229i1614n7421B53998r6065A651P7707a24392B24301a56578a8436j05617m00087
15218e24140d6262A54581J51989D0209N8336K3635a02710b2685A09875a99860
$$ y = [81292, 172754, -147745, 113291, -242708, -152287, 215748, 33411, -154037, 16469, -55667, -78023, -70724, -28858, -1145, 19154, -122688, -142154, 68416, 119014, -89008, -63, 273674, -145327, 65411, 52478, -158644, -29787, 237975, -133329, 417301, -49686, -110189, 41559, 174940, -255401, 149004, -114843, -84361, 93153, -236623, -349753, 74976, -76785, -328822, -114636, 50234, 106534, 114601, 85851, 788883, 1145165, 1050613, 896262, 1054322, 381056, 244126, 366816, 157343, 109752, 237884, 222471, 107929, 324013, -118966, -25531, -293911, 277458, -91614, -149035, 253998, 157933, 1651, 79358, -124392, 224301, -156578, -18436, -124053, -524140, -46262, 154581, 306570, 40209, 98545, 122180, -102710, -22685, 109875, -199860]
15207B8504J36795P6730c2938A408a73855F1056b11218C52091h9832A20214a84850
15195I0109Q1501f4301A43212Q8751K33750D5345J0398b322B03204g7403b8258
15183B54683A4904J88881j0666h3223A57134F0155J38841A7437a24179I4221J8550
15172A12771J4079O302f4425C04044Q0029a83634g2401H676c28256J50726B03968
15160A01539g8008A48246L3722J4258F5491a10653C26265m1403D2306g8725q5102
15149a63827e5798A34837b39238a06802B66325h7934B29796c2603C59028d7670
15138c35437A49866k7780M6880c4068B35751b92732G6366J81030p3364o9034n0579
15127F4419J86159L30880b00041R6370C46340H9325K87405A1379L37600F1954
$$ y = [28504, 165299, 242029, -32938, 1408, -173855, 61056, -211218, 352091, -89832, 120214, -184850, 90109, 171610, -64301, 143212, 231963, 465713, 45345, 55743, -2322, 203204, -77403, -28258, 254683, 14904, 203785, 193119, -83223, 157134, 60155, 198996, 17437, -124179, 94221, 112771, 126850, 133152, -64425, 304044, 384073, -183634, -72401, 8676, -328256, -177530, 203968, 101539, -78008, 148246, 181968, 196226, 65491, -110653, 326265, 284862, 42306, -78725, -163827, -55798, 134837, -239238, -106802, 266325, -87934, 229796, -32603, 359028, -47670, -335437, 149866, 122086, 168966, -34068, 235751, -292732, 76366, 257396, 184032, 114998, 64419, 250578, 581458, -200041, -103671, 346340, 89325, 376730, 11379, 348979, 61954]
15116D13081j84377J35465b66460f1253C00839A6246c249k18159A95085l8456
15106A56629a59543A21513B6304K91601a30497H2327K5301a3446B5251Q2125h0575
15094B45759m9946a59501C19323k5488j31544f9201j89790a18533j388j42325
15084b62246A41166e4494D40469E6122L27852e8432A49400J3996A4614c9403A36624
15072h1501K331A32327E7365J37421G3219l1611J30064L47631A19121n9203K62787
15061C22705N5155j39683B6736J57498L33450D2366N7247j7257d2837A30956e8156
15049B89995l4965I0083K74019j34351M5677L7031K66685B19784P9139j00737
15039A98186K91878B05458K00135j04483j48446L98836B09771J89948O7884C4979
$$ y = [413081, 228704, 364169, -266460, -61253, 300839, 16246, -3249, -221408, 195085, 156629, -159543, 121513, 26304, 317905, -130497, 82327, 107628, -13446, 25251, 107376, -80575, 245759, 195813, -159501, 319323, 293835, 162291, -69201, -258991, -118533, -119921, -262246, 141166, -54494, 440469, 56122, 383974, -58432, 149400, 163396, 14614, -39403, 136624, -81501, -79170, 132327, 57365, 194786, 73219, 41608, 171672, 519303, 119121, 59918, 322705, 377860, 238177, 26736, 184234, 517684, 42366, 99613, 82356, -42837, 130956, -58156, 289995, 255030, 90083, 364102, 229751, 275428, 312459, 579144, 219784, 298923, 198186, 490064, 205458, 405593, 301110, 152664, 551500, 209771, 399719, 467603, 34979]
15028C20369P4306j56259L47955l3199B15497r3940J77585K27096o0274L00513
15018G66477B09843J12121D2549L72885K63436k11051B2957K28475A05504I017
15007B56561J23953q8035P2499m9157j9628n8552C4907L15326Q9145A64685L3942
14996A98627K34416j33003o689J30947j08402c4623B27158N8986j11021K85400
14986D60523A65529P9608J5056J5871M52062B66252L68480J5523J46841k94907
14976E02189j35528j18676J8735M1449A12040D0370A4865K40294P44667B90574
14965D26048P1227j18334j27646o5863P8463a14096A71824K45799j41791m3980
14955B31852M41299l25535D3681K50244A06881L513K06060J94142j83415j22403
$$ y = [320369, 394675, 238416, 586371, 553172, 215497, 121557, 299142, 526238, 465964, 766477, 209843, 321964, 42549, 415434, 678870, 467819, 22957, 251432, 105504, 9017, 256561, 380514, 292479, 364978, 315821, 296193, 237641, 34907, 350233, 439378, 164685, 198627, 433043, 300040, 293351, 424298, 315896, -34623, 227158, 286144, 175123, 460523, 165529, 245137, 260193, 276064, 728126, 266252, 634732, 650255, 797096, 502189, 366661, 247985, 266720, 308169, 112040, 40370, 14865, 255159, 999826, 290574, 426048, 497275, 378941, 251295, 185432, 263895, -114096, 171824, 417623, 275832, 231852, 673151, 347616, 43681, 293925, 106881, 110394, 316454, 510596, 327181, 204778]
14945B04778J86360K44236m5072n2916j97964R1912j71202L20915r7954A04663
14934D53613k15934O0936M00188B62760M20954Q6648k01331K59787O9811l67528
14924E31101N83829j94424O215R623r4473K07871o0808K21468K76285m04126O6766
14913A149327j76836n6928j68855j41008j7906n6100L253r6243m9121j3776j54181
14902B21626r6683L35596C8621K49705j06578L64049m2168k30514O9947J30413
14892D73475j03428q1660J09438G0982N67746j86765N9935J05895M3413j42046
14882E19160J72961L8402j39791B83413J32213o3461K48277o4576K5053B52224
14871C26484p9569K19269j16821j65792L66653K4869k38565L35793J40130l24678
$$ y = [204778, 391138, 635374, 590302, 537386, 339422, 431334, 260132, 581047, 483093, 104663, 453613, 237679, 298615, 698803, 262760, 683714, 770362, 569031, 828818, 898629, 531101, 1114930, 920506, 926721, 936344, 841871, 1049742, 988934, 1210402, 1486687, 1082561, 1149327, 972491, 915563, 746708, 605700, 587794, 531694, 534947, 438704, 389583, 375807, 221626, 124943, 460539, 38621, 288326, 181748, 545797, 503629, 273115, 343062, 473475, 370047, 288387, 397825, 70982, 638728, 451963, 511898, 617793, 661206, 519160, 692121, 730523, 590732, 283413, 415626, 352165, 600442, 535866, 560919, 252224, 326484, 246915, 466184, 349363, 183571, 550224, 575093, 336528, 672321, 812451, 487773]
14861D87773J37874B82455J51807b9866D70075B09870K33395m8941E0697M21360
14851D72057j7795A73923c6916E45584Q5669B52088L26479k33477J22590q2312
14841C85368l347O45103j21509j20269l2504L25944E01725M03716J16321B52259
14830F67713O0879k92326B13869J95569A90646K30472l6394n3047j25127K90602
14820D97152q9384k370K54415K79181k45686B90221J83469R687j22585R9035J11555
14809E71382J26599l05015j43972J43707K06961j53226k4606N9834O07137E09775
14798D52176J86336A60393L28777L2958l1499J93928m8471j43298q9150J39795
14788E43433j32754J45481n7209j25695J11184J06949K46080k41482j89845K72863
$$ y = [487773, 625647, 282455, 434262, -29866, 470075, 209870, 443265, 394324, 50697, 472057, 454262, 173923, -36916, 545584, 631253, 252088, 578567, 345090, 467680, 385368, 382021, 1027124, 905615, 785346, 752842, 1078786, 501725, 905441, 1021762, 252259, 667713, 728592, 436266, 213869, 409438, 190646, 421118, 384724, 331677, 206550, 497152, 407768, 405398, 659813, 938994, 693308, 290221, 473690, 483377, 360792, 459827, 571382, 697981, 392966, 248994, 392701, 599662, 446436, 421830, 481664, 1088801, 509775, 452176, 638512, 160393, 489170, 522128, 490629, 684557, 636086, 492788, 403638, 543433, 410679, 556160, 498951, 373256, 484440, 591389, 837469, 595987, 406142, 679005]
14778F79005j56894Q9554R8213j38453k40649L13779k30581L36935B97189M03655
14768G00844k78909J03263m1336K71520p431m6869j95857N9439O9683M6766j2595
14757F68518a171E72800K0930l7474L1982k61952r8772M93543q1435j56839J02834
14746E85617l5338J61522J67790j39027k56150J99604k0251k57969K28136j55774
14736D78160J10844k41008M23207J33473j95801p0787J76754Q1025j70521j024
14726G24322J46511N5473L65496n03476J58820K05876L3816k18460j30301j66271
14716F71806j97507J11789K2178k2778k22771M44392O100q4163n567J5345P8916
14705H17740p9554J10859P2410J6713m9803K64679L07480k7789J51864l60430
$$ y = [679005, 522111, 611665, 709878, 571425, 330776, 644555, 413974, 750909, 297189, 700844, 421935, 525198, 483862, 755382, 747951, 701082, 505225, 564664, 634347, 681113, 668518, -1171, 572800, 593730, 556256, 588238, 326286, 227514, 721057, 639622, 482783, 585617, 550279, 711801, 879591, 740564, 484414, 684018, 663767, 405798, 633934, 478160, 589004, 347996, 771203, 904676, 708875, 638088, 814842, 895867, 725346, 724322, 870833, 926306, 1291802, 788326, 947146, 1153022, 1186838, 968378, 838077, 671806, 474299, 586088, 608266, 585488, 362717, 807109, 813209, 729046, 723479, 738824, 817740, 738186, 849045, 921455, 938168, 888365, 1153044, 1460524, 1432735, 1584599, 1224169]
14695A224169j54074J80k75945r0542K05380o9010j92970K08231k91305L99674
14685I63788o9347k9694P4155K8112k34831R2949N0955R5657k27334j62207K60064
14674H42267L30983m24286L7181J18674p2600R5461Q6008j13951k23050K76286
14664I52973l94350K15992Q9213K97892j34279j02240K34931m48439M6960J4451
14654G73104k14377N33569j17039L00246m45763K11701m13946P11009k21589k48008
14644H68907Q7040J1392J63961k78041O9513K65483m1250O3335j30648M12406
14634A492098l34467J26101k87168m5875j27834M27612l25156J46935j51831J38417
14624A058832R1641N8395j82208j41187Q534N76288j46737R355m05274L61553
$$ y = [1224169, 1070095, 1070275, 794330, 703788, 909168, 840158, 647188, 855419, 564114, 963788, 894441, 864747, 938902, 967014, 732183, 825132, 876087, 971744, 744410, 582203, 842267, 1173250, 748964, 786145, 904819, 832219, 927680, 1013688, 899737, 676687, 952973, 558623, 774615, 863828, 1161720, 1027441, 925201, 1160132, 711693, 758653, 773104, 558727, 1092296, 975257, 1275503, 829740, 1041441, 627495, 1338504, 1116915, 868907, 955947, 967339, 1131300, 853259, 922772, 1188255, 1147005, 1210340, 1079692, 1492098, 1157631, 1283732, 996564, 950689, 822855, 1250467, 925311, 1072246, 920415, 1058832, 1150473, 1208868, 1026660, 885473, 894007, 1470295, 1323558, 1332913, 927639, 1289192]
14614A289192j56078J87387N9092J30082j55769j09121Q8591q7955K5790J28285
14604A399496j19155P5871j09837l9569J23436K05037j67664K50227j36831k8284
14594A452727J13175k2495N876K8495k06016K0447K91489n7465j94423K78061
14584A709871k98532L22183k1512j21461L3088M3998J05790q1498k09314O86181
14574B168794m69555Q8512R751j97333J47891o5460L91152N1372k07855J87009
14564B104278P9844r3344K10615Q2508O2026L8220K75236j2053J71507J56883
14554C075720R0462M00304M16032P87513J248387K408701M456972Q339208J2353234
14545C3576533q38371j4700274p978369m765186k165972l39329o38637O035j61867
$$ y = [1289192, 1133114, 1320501, 1379593, 1509675, 1353906, 1244785, 1333376, 1245421, 1271211, 1399496, 1280341, 1356212, 1246375, 1206806, 1330242, 1535279, 1367615, 1617842, 1481011, 1452727, 1565902, 1543407, 1549283, 1577778, 1371762, 1392209, 1683698, 1626233, 1431810, 1709871, 1411339, 1733522, 1712010, 1590549, 1623637, 1667635, 1773425, 1691927, 1482613, 2168794, 1699239, 1787751, 1797502, 1600169, 1748060, 1682600, 2073752, 2125124, 1917269, 2104278, 2184122, 2090778, 2301393, 2383901, 2445927, 2484147, 2759383, 2747330, 2918837, 3075720, 3166182, 3566486, 3982518, 4770031, 6018418, 8427119, 12884091, 21223299, 33576533, 32738162, 18037888, 10059519, 5294333, 3128361, 2789032, 2150395, 2156430, 1994563]
14536A994563l0368m200L95645l22372j85611K26925o2363j03224o0565Q5773
14526A934203p8805M12168k20933o6576J21210Q3124k11636K85815J47587k84949
14516B121208J51839o6131L3437P8872L89816j32292p294k93884L52597j38973
14506B489195N1853K8105K45841j74712J14K85876p5627J39346l06403P3457J16854
14495B873899k01511J45399P5038r1361L01442L23126n04911p241K30773j09676
14485C034977j10419O2805R4728K83216j71835O75227k14774k06531p2516N05373
14475C880251j89033q7245m8773K63687j09519Q2564K04224J01991k93867K90915
14465D095195j15387L22564l45535K39859R2713K32350l57897M0755L60173l49645
$$ y = [1994563, 1964195, 1959995, 2355640, 2033268, 1847657, 2074582, 2012219, 1908995, 1848430, 1934203, 1855398, 2267566, 2046633, 1980057, 2101267, 2184391, 1972755, 2258570, 2406157, 2121208, 2273047, 2206916, 2240353, 2319225, 2709041, 2576749, 2569455, 2275571, 2628168, 2489195, 2541048, 2569153, 2814994, 2640282, 2640396, 2926272, 2850645, 2989991, 2683588, 2757045, 2873899, 2672388, 2817787, 2892825, 2801464, 3102906, 3426032, 2921121, 2913880, 3144653, 3034977, 2924558, 2987363, 3082091, 3365307, 3193472, 3868699, 3653925, 3447394, 3374878, 3880251, 3691218, 3603973, 3555200, 3818887, 3709368, 3791932, 3996156, 4098147, 3804280, 4095195, 3979808, 4302372, 3956837, 4196696, 4289409, 4521759, 4163862, 4204617, 4564790, 4215145]
14455D215145M32698j79028K2438J41482j27498K34236J59719K56492o9925K26583
14445E312342Q3751m31411K15807j36023L35075O5312P2927J43523j21988R9356
14435E638671K87652j89042J72789K27606r6079L40267P9437l79781L66236M15282
14425F863038l2844m80259P10311l37377O04119j45372N6573J84804K93908J14627
14415G831528J19726J79207l32376J50758L35857l7878L94806l82323M9885L53345
14405H662535K89956p0109L58343M46060k28791K34746O2783j39552M27895k5718
14395A0018148M77801l0681K29515J86918J84695R7420J79218K02466N75304P7771
14385A2198575k83375L04064M84749O5411L41139L68176J7082M78264M32637j6329
$$ y = [4215145, 4647843, 4468815, 4491253, 4632735, 4505237, 4739473, 4899192, 5155684, 5085759, 5312342, 5396093, 4964682, 5180489, 5044466, 5379541, 5444853, 5517780, 5661303, 5539315, 5638671, 5926323, 5737281, 5910070, 6137676, 6041597, 6381864, 6461301, 6081520, 6447756, 6863038, 6830194, 6349935, 7060246, 6722869, 7326988, 7181616, 7238189, 7422993, 7716901, 7831528, 7951254, 8130461, 7798085, 7948843, 8284700, 8246822, 8641628, 8259305, 8309190, 8662535, 8952491, 8882382, 9240725, 9686785, 9457994, 9692740, 9755523, 9615971, 10043866, 10018148, 10495949, 10465268, 10694783, 10881701, 11066396, 11163816, 11343034, 11545500, 12120804, 12198575, 11915200, 12219264, 12704013, 12769424, 13110563, 13478739, 13495821, 13974085, 14406722, 14390393]
14375A4390393J61948K69516L48035K3026J61824Q74293j47125P88579K43700
14366A7114189O70960K37634O70548O9890j2361O76532L65769L47959N18848M46960
14356B1106928M88235N35982O97041L00150L11580Q88181N27917R87609L39334
14347B6182957Q80620M22617Q88797P41032Q63322R10901R42147Q06987J125767
14338C3765147M97913J225726R71881J067477J478048J079472R48931J299953
14330D2334548R20123J551472J861028J362748K096665J011083K158507K012136
14322E5308310J767077J857157K119453K165574K520408K296706K171175K903322
14314G3109182K923158L197203L096954L474044L393346L921943M000659M079263
$$ y = [14390393, 14552341, 14821857, 15169892, 15192918, 15354742, 16229035, 16081910, 16870489, 17114189, 17785149, 18022783, 18693331, 18763221, 18750860, 19427392, 19793161, 20141120, 20659968, 21106928, 21595163, 22131145, 22828186, 23128336, 23439916, 24328097, 24856014, 25843623, 26182957, 27063577, 27486194, 28374991, 29116023, 29979345, 30890246, 31832393, 32639380, 33765147, 34263060, 35488786, 36460667, 37528144, 39006192, 40085664, 41034595, 42334548, 43254671, 44806143, 46667171, 48029919, 50126584, 51137667, 53296174, 55308310, 57075387, 58932544, 61051997, 63217571, 65737979, 68034685, 70205860, 73109182, 76032340, 79229543, 82326497, 85800541, 89193887, 93115830, 97116489, 101195752]
14306A01195752M406617M823741N216985N235657N653779O201599O102120O617139
14298A45453389O982521P592708Q056041Q711509Q948245R378205J0044922J0653967
14290B15821507J1141812J1766714J2253442J2675395J3371199J4043933J3989150
14283C05063152J4475601J4564819J5091260J4714748J4490125J3806711J3388144
14276D05594560J2059184J0533968P456073L014685P75549J35898M71018j694453
14268D38346482m486709o613073o365676p367811r205327j2192126j3863592j4767061
14260C63485107j5412686j5707010j5605920j5580900j4611505j4495593j3502069
14253B58569424j2480276j2638443j2491508j0926547j0747185j0176669r348885
$$ y = [101195752, 105602369, 110426110, 115643095, 120878752, 126532531, 132734130, 138836250, 145453389, 152435910, 160028618, 168084659, 176796168, 185744413, 195122618, 205167540, 215821507, 226963319, 238730033, 250983475, 263658870, 277030069, 291074002, 305063152, 319538753, 334103572, 349194832, 363909580, 378399705, 392206416, 405594560, 417653744, 428187712, 435643785, 438658470, 439434019, 439569917, 440040935, 438346482, 433859773, 427246700, 420881024, 413513213, 404307886, 392115760, 378252168, 363485107, 348072421, 332365411, 316759491, 301178591, 286567086, 272071493, 258569424, 246089148, 233450705, 220959197, 210032650, 199285465, 189108796, 179759911]
14246A79759911r210118q195236p727284p322151p190478o688493o278011n367028
14238A21781112n620714n188639m619630m501683m557545m303479l382454l220486
14230H6386482l617192l324493l111867k881717k891376k654756k496806k352875
14222F3055400j887803k524442j764937j833070j851518j923252j560039j814232
14214D7896107j119519j286297j581709j389769r03359j663737j227228k13502
14206C8510987j303350j065404j148220r22684j195540p42003k79874j144444
14198C0709468j171652o61430p84921q48132j14064r21171l34909o27054r41507
14189B4304628p05619m79265l86068j82568n94733n16189p51111m53387k69455
$$ y = [179759911, 170549793, 162354557, 154627273, 147305122, 140114644, 133426151, 127148140, 121781112, 116160398, 110971759, 106352129, 101850446, 97292901, 92989422, 89606968, 86386482, 82769290, 79444797, 76332930, 73451213, 70559837, 67905081, 65408275, 63055400, 61167597, 58643155, 56878218, 55045148, 53193630, 51270378, 49710339, 47896107, 46776588, 45490291, 43908582, 42518813, 41615454, 39951717, 38724489, 38510987, 37207637, 36142233, 34994013, 34071329, 32875789, 32133786, 31853912, 30709468, 29537816, 28876386, 28091465, 27243333, 27129269, 26208098, 25873189, 25246135, 24304628, 23599009, 23119744, 22733676, 22551108, 21956375, 21440186, 20689075, 20235688, 19966233]
14180A9966233m15952l43451n24738m04789l56025j72690l13612o64372q0118
14171A6690486q18138J86688o66307l6612l02889j76999m47015k42420P0810n48484
14161A3709120R3784r04682N2373m07986j20878l6702m02522P2185n87578j95523
14151A1271591J49030k61710k32456k01193j07596k34649k45874N63922p09325
14142I991740Q2889l10157l73620M2296k42232k20331r746L4352n00929k32637
14132H261625M76162m53693M7583j00633n01238L66083k37221j12026k20707j34968
14122G390967J22149o343m13274j04876k20267J8114J72160k72405k97212K09793
14112F598806k47806P129p237K03312o18034L35352l17115j11995J54645k79174
$$ y = [19966233, 19550281, 19206830, 18682092, 18277303, 17921278, 17748588, 17434976, 16770604, 16690486, 15872348, 16059036, 15392729, 15356117, 15053228, 14876229, 14429214, 14186794, 14257604, 13709120, 13802904, 12898222, 12950595, 12542609, 12421731, 12385029, 11982507, 12054692, 11467114, 11271591, 11420621, 11158911, 10926455, 10725262, 10617666, 10383017, 10137143, 10701065, 9991740, 10074629, 9764472, 9390852, 9433148, 9190916, 8970585, 8960839, 8995191, 8494262, 8261625, 8737787, 8284094, 8331677, 8231044, 7729806, 8095889, 7858668, 7746642, 7525935, 7390967, 7513116, 7506773, 7093499, 6988623, 6768356, 6786470, 6958630, 6686225, 6389013, 6598806, 6351000, 6358129, 6350892, 6554204, 5936170, 6271522, 5954407, 5842412, 5997057, 5717883]
14102E717883k24525J38422n4203l00004K38496k1884o5988l00657J18761L3932
14092E280233k84683R4072j00674m69977M57143r6495k03928K24339q8769j50627
14082D660634k46335K11760j04109p7571j43359k6566p6248j16624K48830j30305
14072D200107q9225m8536q0614J4071k84367K81785o3724k10550M12074l06627
14062C824394j01120K5413k02901K43954j99799k897l27436O4433K12759k39160
14052C297640j64224Q8892K06299l75822J61364R2981j96816l34852L73899k95644
14042B853717M22023l34884L4751l625q9905L0288j3457M9423m9013R2895P6576
14031C068789l98382N26308o76004K34529l7722L7996m70222M60843k64146l5169
$$ y = [5717883, 5493358, 5631780, 5577577, 5277573, 5516069, 5494185, 5428197, 5127540, 5246301, 5280233, 4995550, 5089622, 4988948, 4518971, 4976114, 4879619, 4675691, 4900030, 4811261, 4660634, 4414299, 4626059, 4521950, 4444379, 4301020, 4274454, 4198206, 4081582, 4330412, 4200107, 4110882, 4062346, 3981732, 3995803, 3711436, 3993221, 3929497, 3718947, 4131021, 3824394, 3723274, 3748687, 3545786, 3789740, 3589941, 3587044, 3259608, 3324041, 3536800, 3297640, 3133416, 3222308, 3428607, 3052785, 3214149, 3307130, 3110314, 2775462, 3149361, 2853717, 3275740, 2940856, 2975607, 2971982, 2882077, 2912365, 2898908, 2948331, 2899318, 2992213, 3068789, 2670407, 3196715, 2520711, 2755240, 2717518, 2755514, 2285292, 2746135, 2481989, 2446820]
14021B446820j30318j65562L99254k22703L88003m00788N43025j20031o58726
14012B078974L26495j18524J14775j86212K7644M0252j00705K57696l39936j11891
14002A988568P492L81934m95722K73650o6811k8145j40456J77205J0120o5926
13992B041909M58674l58201J155430J354131L112247O857409J3388563P443203
13984C5453365j2247378j0015783m520656k395387j425207q84047p09431l2916
13976C222560m63403K9599L9728n07131K52403k52034p476N5862k2478k98991
13966B048639J60156O23j71317J97713j48191n614k56306O5372R3405k30570M86285
13955B240195l59407l6272J95989m61743K72597j01311q4050K29924n0579q7021
$$ y = [2446820, 2316502, 2150940, 2550194, 2327491, 2715494, 2314706, 2857731, 2737700, 2078974, 2405469, 2286945, 2401720, 2215508, 2243152, 2283404, 2182699, 2440395, 2100459, 1988568, 1996060, 2377994, 1882272, 2155922, 2089111, 2060966, 1920510, 2097715, 2107835, 2041909, 2500583, 2142382, 3297812, 4651943, 7764190, 14621599, 28010162, 35453365, 23205987, 13190204, 8669548, 6274161, 4848954, 3964907, 3255476, 3222560, 2759157, 2788756, 2828484, 2321353, 2573756, 2321722, 2314246, 2370108, 2347630, 2048639, 2208795, 2209418, 2038101, 2235814, 2087623, 2082009, 1825703, 1891075, 1984480, 1753910, 2240195, 1880788, 1844516, 2040505, 1578762, 1851359, 1750048, 1665998, 1895922, 1845343, 1758322]
13945A758322L2112l9018p0018J51195L0296m05624K39110k81770M29546j51756
13935A692395O6068l4066k38128K32328J002m06077K57989k05713L47816m70992
13925A242622J18903J73070k89302K94063N4317n21528K69256J41498j23057L14880
13915A674722k10446J81696l36563L48318k38223J24610n2312n1809K2223k15453
13905A246763R5407J12512q6502J2651k52264J88864J64721k52754J31133j07716
13895A252815K56938l96048K11542m11522K08917K08236k38051L70290n54829
13886I08288M40185k76650M39905k26786j32343j19932O8913J97676r0015k77761
13876I31480N5227n2081L07098k47694J48605p5277m72358M33682J07508k39760
$$ y = [1758322, 1790434, 1751416, 1681398, 1832593, 1862889, 1457265, 1696375, 1414605, 1844151, 1692395, 1758463, 1724397, 1486269, 1718597, 1719599, 1313522, 1571511, 1365798, 1713614, 1242622, 1361525, 1534595, 1245293, 1539356, 1593673, 1072145, 1341401, 1482899, 1359842, 1674722, 1464276, 1645972, 1309409, 1657727, 1419504, 1544114, 1491802, 1439993, 1462216, 1246763, 1342170, 1454682, 1368180, 1380831, 1128567, 1317431, 1482152, 1229398, 1360531, 1252815, 1509753, 1113705, 1325247, 913725, 1122642, 1330878, 1092827, 1463117, 908288, 1348473, 1071823, 1511728, 1284942, 1152599, 1032667, 1101580, 1299256, 1209241, 931480, 986707, 934626, 1241724, 994030, 1142635, 1067358, 595000, 1028682, 1136190, 896430]
13866H96430K51273l37430L60993k36562M184R7023o80J13970p7450k8712M08234
13855A451273j67913k59250J04123r0367j14725N9839N02531n16567j72631j04662
13845F91651P7552K80544k99987J42618j01579n8697K26814j24460M0611m0140
13835H34927K66351j67383m2199r1643K73532k35919n1153j09692M63469l16959
13825H23331J14604K3776J17965q4869k22047K09652j73467K50801m37235M22014
13815A044525k19325k2106n4103K22495k36340p4280J94508J47670l12361M6485
13805G37168J37797L5826j62625n5663K11960m10902M36327l62289O7385J07432
13795G42416j09708K75386j65807J80412m42664J76283J211k3343J28707j1447
$$ y = [896430, 1147703, 810273, 1171266, 934704, 938888, 1035911, 1035231, 1149201, 1071751, 1043039, 1451273, 1283360, 1024110, 1128233, 1037866, 923141, 982980, 1485511, 968944, 796313, 691651, 769203, 1049747, 749760, 892378, 790799, 732102, 958916, 834456, 875067, 834927, 1101278, 933895, 891696, 800053, 1073585, 837666, 786513, 676821, 1140290, 823331, 937935, 961711, 1079676, 994807, 772760, 982412, 808945, 1059746, 622511, 1044525, 825200, 803094, 748991, 971486, 735146, 660866, 855374, 1003044, 690683, 737168, 874965, 910791, 748166, 692503, 904463, 493561, 929888, 567599, 634984, 742416, 632708, 908094, 742287, 922699, 480035, 656318, 657529, 634186, 762893, 751446]
13785G51446K26748j49309k65373P2967M03224m88551J03545j13511k24403R73151
13775A289934D67686A75383M48540l5875n6479L19323o2509j23174J18634P3328
13765H57171l44905K17054C46719M53772j70326j11732j06480L1207K02535n4328
13755E91367o599K04018j78951K53970p6683p7546j29194J8634j68499L70541
13745H01058k03730j85661o2667N16527l13864P5827k74037M99705k77645J0007
13735E85520j3802M27230D65586L02474j00511M2181k43612J1302r7814K64739
13725F44345k30853N6596K97914l6857j31056J68629k28326J16116k37485J15716
13715E34739J66802k13049M10147l14897j28718B19153O4275J91095j16082P7706
$$ y = [751446, 978194, 828885, 563512, 636479, 1039703, 551152, 654697, 541186, 316783, 1289934, 467686, 175383, 623923, 588048, 531569, 850892, 788383, 665209, 783843, 857171, 512266, 729320, 346719, 800491, 630165, 518433, 411953, 443160, 645695, 591367, 584768, 788786, 609835, 863805, 787122, 709576, 580382, 599016, 430517, 801058, 597328, 411667, 349000, 865527, 551663, 627490, 353453, 853158, 575513, 585520, 571718, 998948, 465586, 768060, 667549, 709730, 466118, 477420, 379606, 644345, 413492, 470088, 768002, 731145, 600089, 768718, 540392, 656508, 419023, 534739, 701541, 488492, 898639, 583742, 455024, 219153, 283428, 474523, 358441, 436147]
13705D36147j7999J63303k55874L7569j74743J56340L59790j93323L7007K02358
13695G50575C61494K66995o3468k10057P00552D39436j75787J30273J37032j26469
13685D04485J18075j15832k4470l6334o618K7453O3638j39048O7661O1795R9973
13674E20778j54483L8997O333K43031k76582j07622k1027L86815k50482j71957
13664B13801Q8662J16856R0319j65235L66994B21792J9485Q1984L03640A25092
13653C66400J41404k00418r0006K57553n4020K11196o9475B03734K45814J81223
13643F30771j08418L6056j80034K13801Q161m4113k58170M25452A39623K43034
13633C82657j01381L37735C06462K81896P7536J85338l09705A10357K07675m3834
$$ y = [436147, 418148, 581451, 325577, 363146, 188403, 344743, 704533, 511210, 548217, 750575, 361494, 628489, 565021, 354964, 1055516, 439436, 263649, 393922, 530954, 404485, 522560, 406728, 382258, 345924, 339306, 366759, 430397, 291349, 359010, 420805, 520778, 366295, 405292, 411625, 654656, 378074, 270452, 249425, 636240, 385758, 213801, 302463, 419319, 509638, 344403, 711397, 221792, 241277, 323261, 626901, 125092, 366400, 507804, 307386, 217380, 474933, 420913, 632109, 562634, 203734, 449548, 630771, 522353, 558409, 378375, 592176, 600337, 556224, 298054, 723506, 139623, 382657, 281276, 619011, 306462, 588358, 665894, 851232, 541527, 110357, 318032, 274198]
13623B74198m6326l7331J18548m7852K69810n255k30103j45529F5937K89064J80910
13612E35911A86127K90992q9935K60520j98407A3989N84628B76868I6184l5316
13602F0868M21298k01468K65513k07839j689p4634L46798B50078n1334L84157
13592E82901k38765J4883j65956Q3590O6269K41263r3961A87653Q1351L3140P5814
13581C77958K6522A32500M02090B59324j03372N41634C34163N6713P0775r0257
13571C71394M0852J31145B59218E0517K22818c457E42775k56745J74942j15313
13561C45659N4569j29107J23221K32388B66111l4315J00824A41655K63354p6165
13551C28844j2017A15501p039K33895M7485j53693J00401O2029m9293j00603Q3188
$$ y = [274198, 227872, 190541, 309089, 261237, 531047, 525792, 295689, 150160, 65937, 355001, 535911, 186127, 477119, 387184, 647704, 449297, 13989, 598617, 276868, 96184, 60868, 482166, 280698, 546211, 338372, 336683, 262049, 608847, 250078, 198744, 582901, 344136, 359019, 193063, 276653, 342922, 584185, 490224, 187653, 269004, 302144, 377958, 404480, 132500, 534590, 259324, 155952, 697586, 334163, 390876, 461651, 371394, 412246, 543391, 259218, 50517, 273335, -3457, 542775, 286030, 460972, 345659, 400228, 271121, 394342, 626730, 266111, 231796, 332620, 141655, 405009, 328844, 316827, 115501, 108462, 342357, 389842, 236149, 336550, 398579, 349286, 248683, 331871]
13540C31871j65790d960C09997j00361K55375b93104D00559j14659N5107A30428
13529A062f3258C80401a91232B79638G2702a08720F3181K12759J53947d0813A41314
13517D54309N9091B13188L61218j94824J67269l2367B26291N8376A14728N55705
13507F70433C15152m2564D276M99346B33563G9051k8376J71906O7122j26913L03248
13496D66038A92875Q1921r9856M4290j0906K43064A56136M0250F5595K63116A36720
13484C96513P6571j29047L9467K76417F3002O9528J57388j6637f8799F3756J45415
13473B09171J1758K98895a0085E95160C6625L52603A06805Q4710K41458k10700
13463B22273I6082D4073J50206J48942A25127K1414e3041C6753i2806C37239e2664
$$ y = [331871, 166081, -4960, 309997, 209636, 465011, -293104, 400559, 285900, 341007, 130428, 1062, -63258, 380401, -191232, 279638, 72702, -108720, 63181, 275940, 429887, -40813, 141314, 454309, 513400, 213188, 574406, 379582, 546851, 514484, 226291, 284667, 114728, 670433, 315152, 272588, 4276, 503622, 233563, 79051, 50675, 222581, 289703, 162790, 466038, 192875, 274796, 174940, 219230, 208324, 451388, 156136, 196386, 65595, 328711, 136720, 396513, 473084, 344037, 383504, 659921, 63002, 132530, 289918, 273281, -68799, 63756, 209171, 220929, 519824, -10085, 595160, 36625, 389228, 106805, 191515, 432973, 222273, 96082, 44073, 194279, 343221, 125127, 146541, -53041, 36753, -92806, 337239, -52664]
13451C89557l4158A03960K67566j41966o1797n7191b4010A96959D9814Q2376a32525
13439f443C47029Q7636A50444K16856L1078A70314O8783B8210a75307B02606f6116
13427B00948K1877J36650A59908M5038B8937K63645P1618L4844j59839k1191k7065
13416A90949m694R3351J73861A06836O6179C5951L96323b16671D7643M0692K37793
13405C26128q137C3588J68401J4969l5980N48419C57854K22026B23477q8580A6222
13393E9031J10179K2694J26002H4443L85102J9088B13175J50272j630C9295L30817
13382C70112G0103c5166L809q9169G8202i1441C50498M0899A35455K64558q8356
13371C11657A37247k9250J4234l7750J10649I2985b8753C09420l130j5789A36343
$$ y = [389557, 355399, 103960, 371526, 229560, 167763, 110572, -24010, 196959, 49814, 132190, -132525, -6443, 347029, 434665, 150444, 367300, 398378, 170314, 239097, 28210, -175307, 202606, -66116, 200948, 222825, 359475, 159908, 204946, 28937, 292582, 364200, 399044, 239205, 218014, 190949, 186255, 279606, 453467, 106836, 173015, 35951, 432274, -216671, 47643, 88335, 326128, 317991, 33588, 201989, 216958, 180978, 729397, 357854, 579880, 223477, 134897, 16222, 59031, 169210, 191904, 317906, 84443, 469545, 488633, 213175, 363447, 361817, 39295, 370112, 70103, -35166, -31357, -120526, 78202, -91441, 350498, 391397, 135455, 400013, 311657, 137247, 107997, 122231, 84481, 195130, 92985, -28753, 309420, 306290, 290501, 136343]
13359A59369K47433a47642C64967I9467j4291J91207J83705j18575j08030K42227
13349D75710A17020L50738A10937j7209L51753q9855J1136O4224C6036L42975
13339C79011J32718c6980D1506L02326J95333k21303G1404K86445j4737j64745
13329A78367J01099L21047j75526a61496E9522M0057K62741b66843d9961C73978
13318C17775a43211C63167G142J06324J90242P8865a4248A05842J3440K72778
13308C92060F8033J26736M8297c9158A94093q2286c4444a297p6175e546H7685
13296C19824j17017a7743k3491A60653K14226O0813j45686H5633J03959L5152
13286B24744d0302A43714Q087f2670C49754A66883a63797F2267m782J20959C3995
$$ y = [159369, 406802, -147642, 364967, 99467, 85176, 276383, 460088, 341513, 233483, 475710, 117020, 467758, 110937, 93728, 445481, 355626, 366762, 430986, 36036, 379011, 511729, -36980, 41506, 343832, 539165, 317862, 71404, 357849, 343112, 178367, 279466, 600513, 424987, -161496, 59522, 99579, 362320, -266843, -49961, 373978, 317775, -143211, 363167, 7142, 113466, 303708, 382573, -14248, 105842, 119282, 392060, 68033, 194769, 243066, -39158, 194093, 111807, -34444, -1297, -77472, -5546, 87685, 319824, 202807, -17743, -41234, 160653, 374879, 435692, 290006, 85633, 189592, 224744, -40302, 143714, 151801, -62670, 349754, 166883, -163797, 62267, 57485, 178444, 33995]
13274a30600A42267K96215h7727C44476B0539K37133J26670A6416J44918J85139
13264C46473g0234B8355R4633J02967b2856j3868F3822a72585D69822A71712i0670
13252D40056k11369A612L90665n1015E039J94878c477I1647a80765A97480c09235
13240B39520a54877P0481C00452H3078P1183n7405K74172O8212a1410E0823K6602
13229G7425J63683b22355A23270C423M3805K92935g7430D32129j80652b7662j6045
13218d3707P314A29209L1040F0556e2044A55255a1424B11136d8362A74727m3358
13207A31369M3398a19959A02381R8301b99335D28487A19590i7909d6227A61997
13196e9819A02191L63J41122Q3350a08695A39879J02728b0805e32D31925b55555
$$ y = [-130600, 142267, 438482, -87727, 344476, 20539, 257672, 384342, 16416, 161334, 346473, -70234, 28355, 122988, 225955, -22856, -36724, 63822, -172585, 469822, 171712, -90670, 440056, 228687, 1612, 392277, 341262, 5039, 199917, -3477, 91647, -180765, 197480, -309235, 239520, -154877, -84396, 300452, 83078, 154261, 96856, 371028, 439240, -11410, 50823, 77425, 241108, -222355, 123270, 3423, 47228, 340163, -77430, 432129, 251477, -27662, -43707, -36393, 129209, 160249, 60556, -52044, 155255, -11424, 211136, -48362, 174727, 131369, 174767, -119959, 102381, 200682, -299335, 428487, 119590, -97909, -46227, 161997, -59819, 102191, 102554, 243676, 327026, -108695, 139879, 242607, -20805, -532, 431925, -255555]
13184H3989b0849A92969H8284Q2927e000p0493C473J68021J92937j75248J32411
13173C21594C0106R4051L1533K65912A094c4022G0577g7594b3618A07742L3484
13162A41226a6143C3595M39881A05600J09115D8511J18600J06622A01390l6589
13152F4801c9514A57488c0077B69372A04348A8929c214j06012B8029J89238f7050
13140c6295A39745a6734r5964D016Q9834L10476e9293G9516M0100J44754p0660
13129A93710H7387K50127n7265a16087A50488G3764B0039N7282b3337I4885A6329
13117A51578O3513m3220l8572J81601b9669D008K2003a15249l6768B6871b1017
13105i1841p848D5691J21415o1582j3027j2805b34948C17J50390a16283A24179
$$ y = [83989, -20849, 192969, 88284, 171211, -5000, -75493, 3473, 171494, 364431, 189183, 321594, 30106, 124157, 155690, 421602, 1094, -34022, 70577, -77594, -23618, 107742, 141226, -16143, 33595, 473476, 105600, 214715, 48511, 167111, 273733, 101390, 64801, -39514, 157488, -30077, 269372, 104348, 18929, -3214, -109226, 28029, 217267, -67050, -36295, 139745, -16734, -112698, 4016, 93850, 404326, -59293, 79516, 119616, 264370, 193710, 87387, 337514, 280249, -116087, 150488, 73764, 20039, 77321, -23337, 94885, 16329, 151578, 215091, 171871, 133299, 314900, -29669, 4008, 26011, -115249, -152017, 26871, -21017, -91841, -99689, 45691, 167106, 105524, 92497, 79692, -234948, 317, 150707, -116283, 124179]
13093I5754L7643n100e2107j63179G3469j1020k8781Q8539b8883j09020B41116
13081B18144J37373a31962A28814g0415G2490a00250K7287B92239B0307L4186
13071E4493J10808J16134n0961d3981B11340G3629j812A9471a65676j90C46389
13059C37319l3628J026D0844K69027C1895b5684g276I7166B2719f0233k04170
13048b64403E7219J31959c8623E9607J46511a01563C55063j27065a27180a4013
13037I9295D5082N2783k6279C2104M0397b1126C23534A01352a46701A2771J49549
13026A62320N9675N1640P2375B2318K15508J25750M4901c8037A435P4521a10887
13014D26981B213K30060C6589J75402c1888F4718a12847j6084C83398G1956c2724
$$ y = [95754, 133397, 128297, -52107, -215286, 73469, 62449, 33668, 122207, -28883, -137903, 241116, 218144, 355517, -131962, 128814, -70415, 72490, -100250, -72963, 292239, 20307, 54493, 165301, 281435, 230474, -43981, 211340, 73629, 71817, 19471, -165676, -165866, 346389, 337319, 303691, 304717, 40844, 309871, 31895, -25684, -7276, 97166, 22719, -60233, -264403, 57219, 189178, -38623, 59607, 206118, -101563, 355063, 227998, -127180, -14013, 99295, 45082, 97865, 71586, 32104, 72501, -21126, 323534, 101352, -146701, 12771, 162320, 221995, 273635, 346010, 22318, 237826, 363576, 408477, -38037, 1435, 75956, -110887, 426981, 2213, 232273, 36589, 211991, -31888, 64718, -112847, -128931, 383398, 71956, -32724]
13002B62729a0515E8208D268J07605J71311B2682K88748D5256A2469N464L13334
12991C31267b16298G8102g7242k93649F4621k533g9198A84187G3459c3846I3910
12979B3741d17691k7933c4509A53515a30444A96010H4864J55401p7622b15774
12968B95108A35298l6986f0715a756k08088A27720a20622D33176I3594C5319J4713
12957E0032K53902A16603P6808a22701r5227B7477K70737d7884j19597E8417P1873
12946A30290D2224K2568J20489C9892a42007f1372b5766J2817A25956C19b59187
12934i2370j7140c5343A54266f7797A2125a88348P1122B05391H8908N9934c26320
12922D02991a56536b7254I5645J65581E919d9377j13357B50967c788A64450a5023
$$ y = [262729, -10515, 58208, 4268, 111873, 283184, 22682, 311430, 45256, 12469, 17933, 331267, -216298, 78102, -77242, -370891, 64621, 62088, -79198, 184187, 73459, -33846, 93910, 23741, -417691, -445624, -34509, 153515, -130444, 196010, 84864, 240265, 162643, -215774, 295108, 135298, 98312, -60715, -1756, -209844, 127720, -120622, 433176, 93594, 35319, 50032, 303934, 116603, 193411, -122701, -217928, 27477, 298214, -47884, -167481, 58417, 130290, 42224, 64792, 185281, 39892, -142007, -61372, -25766, -12949, 125956, 319, -259187, -92370, -109510, -35343, 154266, -67797, 12125, -188348, -117226, 205391, 88908, 148842, -326320, 402991, -156536, -27254, 95645, 261226, 5919, -49377, -162734, 250967, -3788, 164450, -15023]
12910A61111b23084j69458A48154D607Q8504L4019d3384C8360g8067I8634J06040
12899B04674q2455a16744D6008f4749n269J321A20476R8026G7371b12919c2012
12887I4906B1107g0199o8908M5478k83382A97557a43596A24323A5761i1699c6886
12875b15644D3056J14723j8174l9428b2459r735F9723j1774J42270e2588j87550
12864b40138J15891F9343J21170N4039p6865m3854b18821A38951l259P8025c5299
12852h8987B2333K51868I4233c47710d3899J3068k65053a28715C30778H3817b5070
12840b02244A35770n3068K2432f4272B7701O86a56517J5193A97064c05601A33829
12828A6812a49947D28589j30194A7509b8778C17538A39719P0975i0718A71433
$$ y = [161111, -223084, -392542, 148154, 4607, 93111, 127130, -43384, 38360, -78067, 98634, 204674, 122219, -116744, 46008, -64749, -70018, -68697, 120476, 218502, 77371, -212919, -32012, 94906, 21107, -70199, -139107, -93629, -377011, 197557, -143596, 124323, 15761, -91699, -36886, -215644, 43056, 157779, 139605, 100177, -22459, -32194, 69723, 57949, 200219, -52588, -240138, -124247, 69343, 190513, 244552, 167687, 123833, -218821, 138951, 135692, 213717, -35299, -88987, 22333, 274201, 94233, -347710, -43899, -30831, -295884, -128715, 330778, 83817, -25070, -202244, 135770, 82702, 105134, -64272, 27701, 28387, -156517, -141324, 197064, -305601, 133829, 16812, -149947, 428589, 298395, 17509, -28778, 317538, 139719, 210694, -90718, 171433]
12817D2223d3392e200A55081b81113C8898J16297i384A17006J86122C6637b66591
12805A79417b1053r7556j32876h7970A54490n740e100E0048J29968P772q905B4736
12792a73239m3756a5518m3444B6105K80603P1142A7411a7154C25865j59280a6905
12780b30072h7372F6766a75172l1262H0759a03462B24850D2920a54726j4502h0696
12768D5504L9160M0779B677J2477b5495e584k23460A44154a77845D1406O7324
12757A08730h3478Q56B28585A6868c32198A75964L63563I3626m365a74382j41437
12746c15819a1910A01426a17102a690A6348m150a8812A82006I256J20893a84826
12734A45598A4390Q7841O3079B4720a86535B12403n0237m3855d7326A44470g848
$$ y = [42223, -43392, -5200, 155081, -281113, 38898, 155195, -9384, 117006, 303128, 36637, -266591, 179417, -21053, -118609, -251485, -87970, 154490, 148750, -5100, 50048, 180016, 187788, 178883, 24736, -173239, -216995, -15518, -58962, 26105, 306708, 377850, 17411, -17154, 325865, 166585, -16905, -230072, -87372, 66766, -175172, -206434, 80759, -103462, 224850, 42920, -154726, -169228, -80696, 45504, 84664, 125443, 2677, 15154, -25495, -5584, -229044, 144154, -177845, 41406, 108730, -83478, -82622, 228585, 16868, -332198, 175964, 539527, 93626, 89261, -174382, -315819, -11910, 101426, -117102, -1690, 16348, 12198, -18812, 182006, 9256, 130149, -184826, 145598, 14390, 102231, 165310, 24720, -186535, 212403, 162166, 118311, -47326, 144470, -7848]
12722e2204G6448L980j295c5994F3789g0312f620j55564B0089O233K08086m7714
12710A86694a29258A26640D686K0759N794M05851A08662A8859e5743I1756a76852
12698a70902D0432J36576a14908B12333E761Q6860i6051c9338B45172a10162a0723
12686C10609J5196j38684P9231I0777a55646M5211A15095E5292e3367Q617E9981
12674B92368n7714H5448N7395E7758F141P0830a30417M2014H4427O5034e7505
12662b31179P5733A12040i7793M6167C53004A75764b08840C88858a60137B44454
12651a41288a4435I3075g7071E41735A4589l148g2710l3965b5403j80855L7877
12640a68381l2521a8482a487j80242f7019C1489K65117b94394A76562K750L48566
$$ y = [-52204, 76448, 80428, 79133, -35994, 63789, -70312, -6620, -162184, 20089, 26322, 234408, 186694, -129258, 126640, 4686, 25445, 31239, 437090, 108662, 18859, -55743, 91756, -176852, -170902, 40432, 177008, -114908, 212333, 5761, 92621, -96051, -39338, 245172, -110162, -10723, 310609, 325805, 187121, 266352, 90777, -155646, -110435, 115095, 55292, -53367, -44750, 59981, 292368, 234654, 85448, 142843, 57758, 6141, 76971, -130417, -88403, 84427, 149461, -57505, -231179, -155446, 112040, -97793, -51626, 353004, 175764, -208840, 388858, -160137, 244454, -141288, -14435, 93075, -77071, 541735, 14589, 11441, -72710, -106675, -25403, -206258, -168381, -200902, -18482, -1487, -181729, -67019, 31489, 296606, -294394, 176562, 179312, 527878]
12629E27878A87886J2476q0187c3826A04841D6191a04679B4762J48295L20145
12619D93202a36992A2265f3647k4004A25109A3808g3759A35097i9412A80016B9307
12607A1317N2917g5458A91858r3796M8864b67819G5232N5847L6418O1209q9667
12596A39039a56068A19638J19239G6433c5641A59648E2454b17881f6840A18773
12585c15461f8426n4881A23240a03629j55937D994R3313o95a00085B29078b03382
12573A94776k7785a45913a1259j3819E3917c41626f022j90026h6853j12815e4857
12561B46768b78674D8028N4241i5193j8624C2824p768d6055l15867A14077i139
12549d31862G414c6996E1456b8336B17724l666J13012A6378d0303C6026a27215
$$ y = [527878, 187886, 200362, 120175, -33826, 104841, 46191, -104679, 24762, 173057, 493202, -136992, 12265, -63647, -87651, 125109, 13808, -73759, 135097, -99412, 180016, 29307, 11317, 64234, -75458, 191858, 98062, 146926, -267819, 75232, 131079, 167497, 228706, 139039, -156068, 119638, 238877, 76433, -35641, 159648, 52454, -217881, -66840, 118773, -315461, -68426, -123307, 123240, -103629, -259566, 4994, 98307, 97612, -100085, 229078, -203382, 194776, 166991, -145913, -11259, -25078, 53917, -341626, -6022, -196048, -86853, -199668, -54857, 246768, -278674, 48028, 102269, -95193, -113817, 32824, 25056, -46055, -361922, 114077, -9139, -431862, 7414, -36996, 51456, -28336, 217724, 214058, 327070, 16378, -40303, 36026, -127215]
12537C1966b09455N6482C2794Q5495B8987c9928A17792a44428k0119N877K4163
12526a34507E21a36700N5990G9774M734c7108C15303a79157E3909B313L19645
12515C21958a33508A92773l5842B1147R6859K87250A91118k2192a7739l815j07513
12504a29067m8284A25347a28888G8121J97982A30237a02094D00304j90209d0708
12493i9235D3335L39865b04265A21263i612j57846c5426j54982A04369j0189e58831
12481h2119C0337a90743B35695q8292c8839G8991a78511d0047B9196b39836C30539
12469C2559J02268d24189Q8716a3809k3157E3113c6567q1732d5661H4827L5633
12458A20460e8545A23795M35598a30361e4375K3558A7242e3478o2912D6693a99476
$$ y = [31966, -209455, -152973, 32794, 118289, 28987, -39928, 117792, -144428, -164547, -158670, -134507, 521, -136700, -80710, 79774, 84508, -37108, 315303, -179157, 53909, 2313, 321958, -133508, 192773, 156931, 21147, 118006, 405256, 191118, 168926, -17739, -21554, -129067, -177351, 125347, -128888, 78121, 276103, 130237, -102094, 400304, 210095, -40708, -99235, 43335, 383200, -204265, 121263, -9612, -167458, -35426, -190408, 104369, 94180, -558831, -82119, 30337, -190743, 235695, 147403, -38839, 78991, -178511, -40047, 29196, -239836, 330539, 32559, 134827, -424189, -335473, -13809, -36966, 53113, -36567, -118299, -45661, 84827, 120460, -58545, 123795, 559393, -130361, -54375, -30817, 17242, -53478, -116390, 46693, -199476]
12446c65596a53026F2561M6208a18943L6346k06854a9057C2231h5769A7379J19149
12435A36528a37759c1661C31557I5170R3551j2469D2686f8823B64400i3806B42739
12423a15833f362A0569c97646C988J55858D0375a89465n916F4394d4656q9151
12412a33807D2525Q0934J08079n1021H8163c74583B2868e0549k3546L5938r5976
12401a34133A27371L3771j0642J60971A8308M5261R4909n9803g7388c3865D7587
12389A64355J56123G1025K0654D1727H231J10129Q8317p5768A7491A478a94624
12377A47609a12949e6065j78011L6421C88489e17895a58382B95876j19769a64023
12366e4662B55239A13250K208h4343n5663A46007f5938B0380J91559i4727B20638
$$ y = [-365596, -153026, 62561, 108769, -118943, -82597, -289451, -19057, 32231, -85769, 17379, 136528, -137759, -31661, 331557, 95170, 188721, 176252, 42686, -68823, 264400, -93806, 242739, -115833, -6362, 10569, -397646, 3988, 159846, 40375, -189465, -195381, 64394, -44656, -133807, 42525, 123459, 231538, 180517, 88163, -374583, 22868, -50549, -74095, -38157, -134133, 127371, 161142, 150500, 311471, 18308, 63569, 158478, 98675, -77388, -33865, 47587, 164355, 320478, 71025, 91679, 41727, 8231, 118360, 206677, 130909, 17491, 1478, -194624, 147609, -112949, -56065, -234076, -197655, 388489, -517895, -158382, 295876, 176107, -164023, -54662, 255239, 113250, 115458, -84343, -140006, 146007, -65938, 20380, 211939, -94727, 220638]
12354G4667i8222j07591C0125J59762i8428C54949c1268J2297D9587J77455I5740
12342I5377h3821j60644j41234a58543C33662a37975N7762B91474A42264J37095
12332B79359A25489N0972p889m2034h2654c5222I0737g1049C1680a30745A98904
12320a02190A49300A9137J43046g17I3044J9977a6632l2714J6076A92801m4688
12309A48113I047J0526a96092E2141L47521a5233H1156B109P9793h0101r5385
12298a75486K5834D8407B3261J03198a97218A56558m1713J0108j7098m6314L08461
12287C70002j53222I0571M0857d4627A43171b5507F8508J11903c2762m5021j08277
12276a86060I4504a39561A03024b04238H9755A3638J08120f4666A30644a41933
$$ y = [74667, -98222, -205813, 30125, 189887, -98428, 354949, -31268, -18971, 49587, 227042, 95740, 95377, -83821, -244465, -385699, -158543, 333662, -137975, -80213, 291474, 142264, 279359, 125489, 176461, 168572, 126538, -82654, -35222, 90737, -71049, 31680, -130745, 198904, -102190, 149300, 19137, 162183, -717, 93044, 113021, -16632, -49346, -33270, 192801, 148113, 9047, 19573, -196092, 52141, 399662, -15233, 81156, 2109, 81902, -80101, -175486, -149652, 48407, 23261, 126459, -197218, 156558, 114845, 124953, 107855, 61541, 370002, 216780, 90571, 131428, -44627, 143171, -25507, 68508, 180411, -32762, -77783, -186060, 94504, -139561, 103024, -204238, 89755, 13638, 121758, -64666, 130644, -141933]
12265e0462D46820a12784C15289E2441a3191j06652C62573j06726H2643l720B9789
12253H0395L13710a3222A46544J50413q53g3714A24367J33221m9683a9237C5358
12241a78492A79141R7914b20419B75319C3504o800L31080H9736f2430D3850O3859
12230A07709P8552b69788A42165a19739A70679D8411O7549K6973j0042J2181M14433
12219E59505B55420A18457K66012a04809D7813J62644r6361J3549K20392H5521
12208E1371K30397A07231i5838C13889f469D33970f1038b8415B54722B1081K2729
12197D3810K06702C5889N8450N9660P6376A07297M7321o8432K64603j36906F2908
12185A50274K58330d4101B12040J32353r2923j05646J67607A9823c52713E8389
$$ y = [-50462, 446820, -112784, 315289, 52441, -13191, -119843, 362573, 255847, 82643, 78923, 29789, 80395, 394105, -13222, 146544, 296957, 296104, -73714, 124367, 257588, 207905, -19237, 35358, -178492, 179141, 277055, -220419, 275319, 33504, 26704, 357784, 89736, -62430, 43850, 107709, 186261, -269788, 142165, -119739, 170679, 48411, 115960, 142933, 132891, 145072, 559505, 255420, 118457, 384469, -104809, 47813, 210457, 114096, 127645, 348037, 85521, 51371, 281768, 107231, -95838, 313889, -6469, 433970, -61038, -28415, 254722, 21081, 43810, 250512, 35889, 94339, 153999, 230375, 107297, 154618, 86186, 350789, 213883, 62908, 150274, 408604, -44101, 212040, 344393, 251470, 145824, 313431, 19823, -352713, 58389]
12174A05894P8074p6007c4073C44450A6744a46579D64125A27218J9855n8452R3384
12163A82005g707A89419C2177N27889q4500A95866p9078g5015j73964A12380C9732
12151f7950A13196P6837b43113A65248K02751A1236L9676J44209F8230A265b28675
12139B87117r5336K90772L2060a49466d1187l0148A86427j7291b37437a16544
12128d9236D4863i1559B42621b81260E6503b56891C17491h4333B22123B8298i3435
12116D48447j14764A1667L94962I7105J09548c0436j21249D4936J09265B3939
12105I9052K6195m8271C2317K88505A47428c4691D956M5678j785J41551J8865
12094B09265b87799f791E635b8910G8129b40643A65222e8527b2063k05291J12455
$$ y = [105894, 183968, 107961, -34073, 344450, 16744, -146579, 464125, 127218, 147073, 88621, 182005, -7707, 189419, 32177, 560066, 475566, 195866, 116788, -75015, -248979, 112380, 39732, -67950, 113196, 190033, -243113, 165248, 367999, 11236, 50912, 195121, 68230, 1265, -228675, 287117, 191781, 482553, 514613, -149466, -41187, -71335, 186427, 169136, -237437, -116544, -49236, 44863, -91559, 242621, -281260, 56503, -256891, 317491, -84333, 222123, 28298, -93435, 448447, 333683, 11667, 406629, 97105, 206653, -30436, -151685, 44936, 154201, 23939, 99052, 125247, 76976, 32317, 320822, 147428, -34691, 4956, 50634, 48849, 190400, 209265, -287799, -6791, 5635, -28910, 78129, -240643, 165222, -58527, -22063, -227354, -114899]
12083a14899j44425c3513C4333P6876B2535J06354l5377D1096R6376k559d6217
12071C4418R4100K84746E2696J39902m3146c4071G9570b15813B58738a4529A84158
12059A6600K06342b16785H7422R406a47076B70950a60503B32439j14521n1631
12049F6287g5355L0553j40605A75484J83652e07474K16941d0910B57970i7808
12038h0807c7165D6671e3425B30788F8925b07866R7939A38588l1152f2139A2246
12026f4870B02300g6172E333J60479A2597K21477h2329m8707D2362b10817A54687
12014a41990J5477p7979c8036I9087a74422J2307n1021B91146e8971j26947A37169
12002B82045f9242k730k6078k6477B32426n6397c0381C09786A25256a5745l33272
$$ y = [-114899, -259324, -33513, 34333, 111209, 22535, 128889, 93512, 41096, 137472, 134913, -46217, 34418, 128518, 413264, 52696, 192598, 149452, -34071, 79570, -215813, 258738, -14529, 184158, 16600, 222942, -216785, 87422, 96828, -147076, 270950, -160503, 232439, 117918, 66287, -75355, -44802, -185407, 175484, 359136, -507474, -290533, -40910, 257970, -97808, -80807, -37165, 46671, -53425, 230788, 68925, -207866, -109927, 138588, 107436, -62139, 12246, -64870, 202300, -76172, 5333, 165812, 12597, 234074, -82329, -131036, 42362, -210817, 154687, -141990, -126513, -204492, -38036, 99087, -174422, -162115, -213136, 291146, -58971, -185918, 137169, 282045, -69242, -71972, -98050, -124527, 232426, 176029, -30381, 309786, 125256, -15745, -349017]
11991c49017G5778c06761H6438a66345C38464b18999p3038A79646B7390A166J23081
11980A24247C9563r041J09557K80934b43443H528a75032c1956H5342j4853c60242
11968d42145f4834D7433b73334a07238L1167A16089P292c00994a48113B21795
11957h7504p0856O5567A32362f4600k23609a22475j77233B31110b13158G5939
11946A01481d647k16691H5878M6784L1975k1919F558L9678J17628O1900F1815
11934B07433k6848K2931c94737A82350R3014G0814O3306j3637b43478k529O0234
11923a85773l785k65391A6206J19486K3051a09971I5448i5430L3972o4165l3458
11912a59081E9424h3358F358J13598g4933j4010r0659M8070A22372D4465f6834
$$ y = [-349017, 75778, -306761, 86438, -166345, 338464, -218999, -292037, 179646, 27390, 1166, 124247, 39563, 30522, 140079, 421013, -243443, 8528, -175032, -31956, 85342, 70489, -360242, -442145, -64834, 47433, -273334, -107238, -76071, 116089, 123381, -300994, -148113, 221795, -87504, -158360, -92793, 132362, -64600, -288209, -122475, -299708, 231110, -213158, 75939, 101481, -4647, -221338, 85878, 132662, 164637, 142718, 6558, 46236, 163864, 225764, 61815, 207433, 180585, 203516, -394737, 182350, 275364, 70814, 134120, 120483, -243478, -246007, -185773, -189558, -454949, 16206, 135692, 158743, -109971, 95448, -95430, -61458, -125623, -159081, 59424, -83358, 6358, 119956, -74933, -88943, -179602, -131532, 122372, 44465, -66834]
11900i4453p8662A3521J57788a28164E4864M7850L9947a50135j25884D2983J68272
11889B11255b03813A55427c5948B69604a06162B78811h3654q5576C54821l2877
11879C21944i1561k39432C9189b39279A33565F5771d2403k31019a5903l06346
11869c22249J28365G0216g6838E3574i8126m6751B3530b36489G4006a7747F9242
11857A17045c36708B02240c4585B27253N4938I092a15472A4762K10101b07622
11846i3748A01060k5522J24579Q9957c42825H4832e4496A26324b0811l81604C05401
11834B09575E856K0711b3096M691A05008a00595a3047A08336O7924b91613A4009
11822c2319a863A64904b37990c9856l36818H936c26609i3898p5848j35401O2521
$$ y = [-94453, -173115, 13521, 171309, -128164, 54864, 102714, 142661, -150135, -276019, 42983, 211255, -203813, 155427, -35948, 269604, -106162, 278811, -83654, -169230, 354821, 321944, -91561, -330993, 39189, -239279, 133565, 65771, -42403, -273422, -15903, -322249, -193884, 70216, -76838, 53574, -98126, -144877, 23530, -236489, 74006, -17747, 69242, 117045, -336708, 202240, -34585, 227253, 282191, 9092, -115472, 14762, 224863, -207622, -93748, 101060, 75538, 200117, 290074, -342825, 84832, -54496, 126324, -20811, -402415, 305401, 209575, 5856, 26567, -23096, -18405, 105008, -100595, -13047, 108336, 176260, -291613, 14009, -32319, -1863, 164904, -237990, -39856, -376674, 8936, -326609, -93898, -169746, -305147, -242626]
11811b42626A3102c10729L3516A01795a88312f1776k00657g2050K4490k49743
11801b97303A11068f9181R761A84455C9050a27051j05074d9778k4908B23758n9683
11790A64075m5188f5446k67009a6934o2415q8500p374C3151a36661E9653a12682
11778e069o0591j1104k8847k79199b5772j87323F5166a59025A17236a93384e4411
11766H6544J5274b1307j3932A49452a4947B04662I9221O3739J39735I7875R1237
11755A89112f6814n0853N7261n0878A27842J3445b27538F4221O7413C0136a79210
11743H1937h0956B13135E4611e2438B38275a45833A84744J0023M2947b60487g0591
11731B67731j9136e14232a42040O1204C89228C7031K9859g4779A9491J22933b73254
$$ y = [-242626, 13102, -310729, -277213, 101795, -188312, -61776, -262433, -72050, -47560, -297303, 111068, -69181, -59420, 184455, 39050, -127051, -232125, -49778, -74686, 223758, 164075, 118887, -65446, -332455, -16934, -79349, -167849, -175223, 33151, -136661, 59653, -112682, -5069, -65660, -76764, -105611, -384810, -25772, -213095, 65166, -159025, 117236, -193384, -54411, 86544, 101818, -21307, -35239, 149452, -14947, 204662, 99221, 162960, 302695, 97875, 189112, -66814, -117667, -60406, -111284, 127842, 141287, -227538, 64221, 131634, 30136, -179210, 81937, -80956, 213135, 54611, -52438, 238275, -145833, 184744, 194767, 237714, -260487, -70591, 267731, 248595, -514232, -142040, -80836, 389228, 37031, 66890, -74779, 19491, 142424, -273254]
11719E4774b92197e7210A19346d5446n6114E2802c33188C6973f9045B12287M4296
11708B56583a01057q8959P8015q9798l6157A28640m4416N8772a2383j43623G7258
11696d0384r3271A55255a83074A40929a18353l8445j50280B00064H4596K32205
11686C16801A20021L581L8292J39993G7892A1264J94835J14170I6416i2470F2853
11674f5602j02736A74796b66626B18417p2849e9116B84982j01217o6659b02118
11663a11591A41664F6119a32573e5782j75789A30522b74218f9044A83458p3896
11653A09562a11264A26086b17074Q0080L0766C42890j53065J19441e0193j78493
11643b28686j4547B1779a18916A22922K26779C906J03047a82904B89110a13800
$$ y = [54774, -292197, -57210, 119346, -45446, -101560, 52802, -333188, 36973, -69045, 212287, 256583, -101057, -190016, -112001, -201799, -237956, 128640, 84224, 142996, -12383, -156006, 77258, -40384, -133655, 155255, -183074, 140929, -118353, -156798, -307078, 200064, 84596, 316801, 120021, 123602, 161894, 301887, 77892, 11264, 206099, 320269, 96416, -92470, 62853, -65602, -168338, 174796, -266626, 218417, 145568, -59116, 284982, 183765, 117106, -202118, -111591, 141664, 66119, -132573, -55782, -231571, 130522, -274218, -69044, 183458, 109562, -111264, 126086, -217074, -136994, -106228, 342890, 189825, 309266, -50193, -228686, -243233, 21779, -118916, 122922, 349701, 3906, 106953, -182904, 289110, -113800]
11632a4018B21795E0882K61595f9002A94607g7632D0649b59878R5377E8699a78386
11620C9358M52a99080M5593B21510a24375A31092J7201i5220A63902b8973B1286
11608d6575j64615A24656Q2924a06669L0267a3318j56049H6701a20053A48333
11597B4491M09040A50640G1163J76277f2297q0873A66920C7881J6782a08457B36402
11585B73958a74337N5209B36404c0946I9345d8493J3828C8661a12208H4845J30120
11574B14965m6820e1528j6413I140Q9535J21765n3933B5086i0877p83C5385M1183
11562G6568Q9271B3845J63222c0186C18606F8671a50062F9499a18315a1523j43147
11551a54670A07810R0039G8272k5153g2960j12154A36295o5357a93455B06915
$$ y = [-14018, 221795, 50882, 312477, -69002, 194607, -77632, 40649, -259878, -164501, 58699, -178386, 39358, 39810, -199080, -153487, 221510, -124375, 131092, 148293, -95220, 163902, -28973, 21286, -46575, -211190, 124656, 207580, -106669, -76402, -13318, -169367, 86701, -120053, 148333, 24491, 433531, 150640, 71163, 247440, -62297, -143170, 166920, 37881, 54663, -108457, 236402, 273958, -174337, -119128, 236404, -30946, 99345, -48493, -34665, 38661, -112208, 84845, 214965, 168145, -51528, -67941, 9140, 98675, 220440, 166507, 25086, -90877, -91660, 35385, 76568, 165839, 23845, 187067, -30186, 318606, 68671, -150062, 69499, -118315, -11523, -154670, 107810, 197849, 78272, 53119, -72960, -185114, 136295, 70938, -193455, 206915]
11540a3434D13949b1841A45928C526R6177h7080c3298B93695A5909c3607B66325
11528f4664F5634K86621a06376A92012q9059J14758H6408P5199o6321J78737F4897
11516B60432H0090i4303A3298J40605J48347b21015K4421C11638A54839c1587
11505A36525d40770A11806M4342C9647b27479E7650B3148P9203J55186E4884j3930
11494D0954J60279m6846i187j43810B15201H1140K93293a02922j35374F2009D670
11482A31481C3715i6484J9483j61153A5066Q9519L02204G2320q417J41464d3112
11470B72808A13011R936a46163j23354A21935b54838M5471M4423j46318a01613
11459c21502B90896h382j3238C92008a5021k84341C45378H19J68192A7168a05737
$$ y = [-13434, 413949, -21841, 145928, 3526, 99703, -87080, -33298, 293695, 15909, -33607, 266325, -64664, 65634, 352255, -106376, 192012, 102953, 217711, 86408, 161607, 95286, 274023, 64897, 260432, 80090, -94303, 13298, 153903, 302250, -221015, -196594, 311638, 154839, -31587, 136525, -440770, 111806, 156148, 39647, -227479, 57650, 23148, 102351, 257537, 54884, 40954, 201233, 154387, -9187, -152997, 215201, 81140, 374433, -102922, -238296, 62009, 4670, 131481, 33715, -96484, -77001, -238154, 15066, 104585, 406789, 72320, 63903, 205367, -43112, 272808, 113011, 122947, -146163, -269517, 121935, -254838, -209367, -164944, -311262, -101613, -321502, 290896, -8382, -21620, 392008, -15021, -299362, 345378, 819, 169011, 17168, -105737]
11447C311K8957O0624J67287a23813A7017Q3765k9131Q9521a19865B5954Q415
11436C4369f9482A66769a7346k3920a4377C72037l6532b19749B48196M874j4504
11425B38566b05032A7238a95910k15887D6878b25938a7531A58359G4096H904K87525
11414B96429a71198I6096B5935L24222b47997P4260F2499J0250g5133b5800A55626
11402a01016j85341A14019b79990H1122a38060B48355M651a78166A66228E4943
11391b55618A69302f6348j11649g266D1478a9443f535C4089i9378b3366A63095
11379B42629g6405B35473J1374h9895A44285b91369c8959C57009E874a73058r5254
11368b68312i0390j8013j71714A92383d55226E0601a18150j56812f6353A25183
$$ y = [3311, 32268, 92892, 260179, -123813, 17017, 100782, 71651, 161172, -119865, 25954, 34369, -69482, 166769, -17346, -41266, -14377, 372037, 335505, -219749, 248196, 253070, 238566, -205032, 17238, -195910, -411797, 46878, -225938, -17531, 158359, 74096, 8904, 296429, -171198, 96096, 25935, 350157, -247997, -173737, 62499, 72749, -75133, -25800, 155626, -101016, -286357, 114019, -279990, 81122, -138060, 248355, 253006, -178166, 166228, 54943, -255618, 169302, -66348, -177997, -7266, 41478, -19443, -6535, 34089, -99378, -23366, 163095, 242629, -76405, 235473, 246847, -89895, 144285, -291369, -38959, 357009, 5874, -173058, -268312, -90390, -108403, -280117, 192383, -455226, 50601, -118150, -274962, -66353, 125183]
11357b15107A82108c2255j79988A50804c37429d9144F3232Q1615D438O6070a19026
11345B77227H7579a06629B66041c1435j00763B1581J64572b688j85719e22p413
11334g935B15537a56894N2306a5401G2030a28536l6544K8980N6327p9216H5094
11322a7328C8759b7543A22984b986A60749G1762b63904A33158A0775b0798A60037
11310a08341A27709A395O1720b8202q3184e4847k60998a05308l30633B9891N9458
11299H9349e1749n3091d5108H8893c6858q8504B33494g2968C77064F7635J41221
11288B08856f5420j09967A68499h041j5408B03295p9393f0593j82745N5217E0329
11276G6084B5042b08261j02170E22071a93275B6643h8258A35704a67912B03154
$$ y = [-215107, 182108, -32255, -212243, 150804, -337429, -49144, 63232, 144847, 4438, 70508, -119026, 277227, 87579, -106629, 266041, -31435, -132198, 21581, 186153, -2688, -188407, -522, -7935, 215537, -156894, -104588, -15401, 72030, -128536, -165080, -136100, -79773, -158989, 85094, -17328, 38759, -27543, 122984, -2986, 160749, 71762, -263904, 133158, 10775, -20798, 160037, -108341, 127709, 1395, 63115, -28202, -111386, -54847, -315845, -105308, -435941, 29891, 89349, -51749, -104840, -45108, 88893, -36858, -125362, 233494, -72968, 377064, 67635, 208856, -65420, -175387, 168499, -8041, -23449, 203295, 123902, -60593, -243338, -188121, 50329, 76084, 25042, -208261, -310431, 522071, -193275, 26643, -88258, 135704, -167912, 203154]
11265d2482B13815a022k7961j24652d4567j62101j23058H291b87736L7896H7173
11253G5634M3243m5708c70557A69479a52142A37055l5709O014b41116J0463R9165
11242a31488l4741p4439A43613F2133b8939p2836j13304m9598C85387A05289m1851
11231F3438J10767L55690E6955d95818K22967h2841k13430R5661d8734l1054C48430
11219g7225A53064L11G1186g7090B00086a54983j65854f1870j48458a5069D05726
11207c41289i7551L9802E1868g1632m3761j27800E115J50714O6917r5902R6206
11196B23050J68582i8222a0040p6342j24016A69852p4189D5087a9486A01634d3274
11184B0665f6583M581j17510j19425A84561a15932j74825h2352k05219J21833
$$ y = [-42482, 213815, -1022, -28983, -153635, -44567, -206668, -329726, 8291, -287736, -249840, 87173, 75634, 118877, 73169, -370557, 169479, -152142, 137055, 101346, 107360, -241116, -230653, -131488, -166229, -240668, 143613, 62133, -28939, -101775, -215079, -264677, 385387, 105289, 63438, 174205, 529895, 56955, -495818, -272851, -82841, -296271, -200610, -48734, -79788, 348430, -77225, 153064, 153375, 71186, -77090, 200086, -154983, -320837, -61870, -210328, -15069, 405726, -341289, -97551, -57749, 51868, -71632, -115393, -243193, 5115, 155829, 222746, 126844, 223050, 391632, -98222, -10040, -86382, -210398, 169852, 95663, 45087, -19486, 101634, -43274, 20665, -66583, -62002, -179512, -298937, 184561, -115932, -290757, -82352, -287571, -165738]
11174a65738A74165b08943A29226i9544A95795E0017a39638E2883b85407e1441
11163B25220e20794B6638J29066n8047b87743J22898C07675h3212b3323l1710
11153e5033A07733J31358h4020B18270C4342h2228A09164g7285B7962e297j24437
11142a29734E224a61832B28977g0883j7141j21592A07672a53216J459r1322A75402
11130b8014j79452g6908E8583h2525A59047E5984a4445k39260A9227a03843B49290
11118g0032H3886L486Q753A6032J23757A7707a91601E5606J27541a29131J7374
11107a11757L1519l2695C09299F718L77319C6514L219J27917b8797H6810J12803
11096A99613B1659P0331J14811i5747B49015J7673j14080M9580K29138A18806
$$ y = [-165738, 174165, -208943, 129226, -99544, 195795, 50017, -139638, 52883, -285407, -51441, 225220, -520794, 26638, 155704, 97657, -287743, -164845, 307675, -83212, -23323, -55033, 107733, 239091, -84020, 218270, 34342, -82228, 109164, -77285, 27962, -5297, -129734, 5224, -161832, 228977, -70883, -88024, -209616, 107672, -153216, -151757, -243079, 175402, -28014, -207466, -76908, 58583, -82525, 159047, 55984, -14445, -253705, 19227, -103843, 249290, -70032, 83886, 87372, 96125, 16032, 139789, 17707, -191601, 55606, 183147, -129131, -111757, -80238, -112933, 309299, 6718, 384037, 36514, 39733, 167650, -28797, 86810, 199613, 21659, 91990, 206801, -95747, 249015, 266688, 152608, 202188, 431326, 118806]
11085D41848a95890A02252J8268R9289i0067A71369K48282I377Q0518m3779J00105
11074A46221Q2722q5429J03626G830M62175A73470M6155r9257J34531A06913M18155
11063E25068j3537j25645A22506l2420K31914A44552K42203j08035K29052q4915
11053D22857n9942K933k858E7930K84981J24167j27987A12994K25589L06612k78633
11042C66562E5203K45331N1471J31532j78526J4892J51693j7043j29735J15646
11032D40464O0762k24213J63200j70962M14154B39270R7222K55551k66548K43431
11022E68926j04371F6481L94724K38022k7737k34108N3970B13663H7125L2419
11012A19544J94764p9183L760O198J1735J88905I2922J52381P7079q3535L03223
$$ y = [441848, -195890, 102252, 120520, 219809, -90067, 171369, 419651, 9377, 89895, 46116, 146221, 228943, 143514, 247140, 7830, 470005, 173470, 219625, 120368, 254899, 106913, 525068, 511531, 385886, 122506, 90086, 322000, 144552, 386755, 278720, 507772, 422857, 362915, 365848, 362990, 57930, 342911, 467078, 339091, 112994, 338583, 645195, 366562, 55203, 300534, 352005, 483537, 305011, 319903, 471596, 454553, 324818, 440464, 501226, 277013, 440213, 269251, 683405, 239270, 336492, 592043, 325495, 568926, 464555, 66481, 461205, 699227, 671490, 437382, 491352, 213663, 87125, 119544, 314308, 235125, 238885, 245083, 256818, 445723, 92922, 245303, 322382, 238847, 542070]
11001E42070j69386r9411l683J39100m9703P2775L21094B08610L25876A22442
10990F45031J85072C63349J12163j8465K46384n9797B96666O23654j00507l8090
10980G81723k34660M2710K73330q4553O9466L84206Q149k38831L12586n6730L6439
10969A293835O67166l08613l6952K00235J7379k43088m358k09550M1946k99108
10959A118892j34042K73051j06665J4901j6499L62089j43762j07249K59656m99224
10949A021148r3444l07995K38856l36746j05423B03860J01631J17569A53158R8982
10939B52140J54888j74421L4624F683K40944r7796b6497j60883c2446n4965k3698
10928a11109d3331Q908l4976A01142b65760K8791C9842e3213C7923a88453B0982
$$ y = [542070, 372684, 273273, 269590, 408690, 358987, 431762, 752856, 208610, 534486, 122442, 645031, 830103, 363349, 475512, 457047, 703431, 643634, 296666, 920320, 819813, 781723, 547063, 589773, 863103, 778550, 848016, 1232222, 1240371, 1001540, 1314126, 1257396, 1293835, 1961001, 1652388, 1615436, 1815671, 1833050, 1589962, 1585604, 1376054, 1418000, 1118892, 984850, 1257901, 1151236, 1166137, 1149638, 1511727, 1367965, 1260716, 1520372, 1021148, 927704, 619709, 858565, 521819, 416396, 203860, 305491, 423060, 153158, 252140, 407028, 232607, 267231, 6683, 247627, 149831, -26497, -187380, -32446, -87411, -111109, -43331, -34423, -69399, 101142, -265760, -236969, 39842, -53213, 37923, -188453, 20982]
10916A64786n3929J87055a19062J5811j15366b4782A5357d57060g6581b0103B46686
10904A62494a55875j50457e1537A5829M15123i0382l7773A459K82203a90612A79409
10892d730B13575A4432b46740A21330d2652I1338c43872f4901G23a01249C31451
10880E9688R1302c8698k44851j56071b08905B6462b30560A03857m2140J41102
10870B02819K45948a39992A52699B1815b03093A86692C0748L5744B8994b08255
10859F0390J30102n8807c20072i6514q5792A23093n4110a75292B6164l145c75377
10847a44692f8219m5125m9514A00288k0988P9541K780b25625J01640K609b7004
10835A06832l3320J31177a6518F246Q9866a50227q325e3497C44832D0292o072
$$ y = [164786, 110857, 297912, -119062, -103251, -218617, -24782, 15357, -457060, -76581, -20103, 246686, 162494, -155875, -306332, -51537, 15829, 430952, -90382, -128155, 1459, 283662, -190612, 179409, -4730, 213575, 14432, -246740, 121330, -42652, 91338, -343872, -64901, 723, -101249, 331451, 59688, 150990, -38698, -283549, -439620, -208905, 26462, -230560, 103857, 61717, 202819, 448767, -139992, 152699, 21815, -203093, 186692, 30748, 66492, 28994, -208255, 60390, 190492, 131685, -320072, -96514, -182306, 123093, 68983, -175292, 26164, 23019, -375377, -144692, -68219, -113344, -162858, 100288, 79300, 158841, 161621, -225625, -123985, -121376, -27004, 106832, 73512, 204689, -16518, 6246, 96112, -150227, -158552, -53497, 344832, 40292, 34220]
10824C4220O0478d4816j6975A68816N9479a95802H6866c46280m5172J30443A92367
10812a25368b0528k18639b4586j06060N9593l1449Q755k73384D2126e479j44750
10801a50229P1225C5887a20317B96931H4544N3451b09280g6637C74804A09262
10790a65947A20436j4877O8018g9634B71142i3947a0712k56067P5294B67027J72439
10779D39466a72451k95703a70255e9620l08268a62034p4379E2383b40999g6605
10768B31900c3769H7556i6408j35375i1071A58472b63890A68198P200a55373K1111
10757a34262B97866b17451H7130a16638e1239m65955G6445a11854A70630b1330
10746A12507a29799m6046p3000A55641D2694a91005C0022b44766H7249C9733J59022
$$ y = [34220, 94698, -44816, -61791, 168816, 228295, -195802, 86866, -346280, -391452, -261009, 192367, -125368, -20528, -239167, -24586, -130646, -71053, -102502, -93747, -367131, 42126, -5479, -150229, -79004, 35887, -120317, 296931, 84544, 137995, -209280, -76637, 374804, 109262, -165947, 120436, 105559, 173577, -79634, 271142, -93947, -10712, -266779, -191485, 267027, 439466, -172451, -468154, -170255, -59620, -367888, -162034, -236413, 52383, -240999, -76605, 231900, -33769, 87556, -96408, -231783, -91071, 158472, -263890, 168198, 175398, -155373, -134262, 297866, -217451, 87130, -116638, -51239, -517194, 76445, -111854, 170630, -21330, 112507, -129799, -175845, -248845, 155641, 42694, -191005, 30022, -244766, 87249, 39733, 198755]
10735A98755R2217b28837r0516A65680K8859a1487j47057D9146A1458b60339b7294
10723A14526c78660c8885k3756B43082a50529A26366a98518N4980k08987I3085
10712d7251j91054d7835j47667f8996B54371a10399P275j80811Q8159J1669k03113
10701c87220C6074K5411r028a6616j1780l47978A57706e7121P92B50633A200b50662
10688A36934b70968M6863f1702a562B63081A7142J0699h9860l04845A19633C265
10676B8300b12331g5368j01005L3127A9287Q3869m4249a07332A98098d2952C4734
10664D6207J23250G9263K6275b17925D1781b38508H0635d7051E0963c28720a01897
10652A23440B7068b174l29430f2801k26544k1778Q0690F3254A2532J3826a45693
$$ y = [198755, 290972, -228837, -319353, 165680, 194539, -11487, -158544, 49146, 11458, -260339, -27294, 114526, -378660, -38885, -62641, 243082, -150529, 126366, -198518, -143538, -352525, 93085, -47251, -238305, -47835, -195502, -68996, 254371, -110399, -103124, -283935, -195776, -184107, -387220, 36074, 61485, 52457, -16616, -28396, -376374, 157706, -57121, -56329, 250633, 1200, -250662, 136934, -270968, -224105, -61702, -1562, 263081, 17142, 27841, -89860, -394705, 119633, 3265, 28300, -212331, -75368, -176373, -143246, 19287, 103156, 58907, -107332, 198098, -42952, 34734, 46207, 169457, 79263, 105538, -217925, 41781, -238508, 80635, -47051, 50963, -328720, -101897, 123440, 27068, -2174, -331604, -62801, -289345, -311123, -230433, 63254, 12532, 26358, -145693]
10640C48205E6106N2182b61293r0527l8679C17681a46442A47847b66277B25964
10629a2873p1054p5384G6854K9240A9438K12987a3110j16871A4948J45112G0010
10617a05822B12388c4365H4667i6115j99658B67338b42272Q6808g0268q1316N1928
10606i9656m2864A59290A8470a54697E3435d97925A49377a32254A70760a09723
10595b169H42K40695b55197B3481b48112A20888E8755a2313A02810a02014A43029
10583f8781n17G8126B9688K2184c5885J1648H0472o903C5471b05884C01804b14923
10570c81543f7267a7372B86106j26350d13736c0167A67062c8635r3352j1068A18352
10558D2408a47557e5051r4052a9350m5457A6184a74306k6327A76909e8803F5999
$$ y = [348205, 56106, 108288, -261293, -351820, -390499, 317681, -146442, 147847, -266277, 225964, -12873, -83927, -159311, 76854, 106094, 19438, 232425, -13110, -129981, 14948, 160060, 70010, -105822, 212388, -34365, 84667, -96115, -295773, 267338, -242272, -155464, -70268, -151584, -99656, -142520, 159290, 18470, -154697, 53435, -497925, 149377, -132254, 170760, -109723, -2169, 842, 241537, -255197, 23481, -248112, 120888, 58755, -12313, 102810, -102014, 143029, -68781, -69298, 78126, 29688, 51872, -35885, -24237, 80472, 73569, 35471, -205884, 301804, -214923, -381543, -67267, -17372, 286106, 159756, -413736, -30167, 167062, -38635, -131987, -143055, 118352, 42408, -147557, -55051, -149103, -19350, -64807, 16184, -174306, -200633, 176909, -58803, 65999]
10546b7219H0850P1086p3313A436a72042g9516L723p1479A08142b32007b1667
10534h94k557j78178P6010J3816G1814c11980i8270A27425a35022c3737A30610
10522b6172D7927a62196l2188N2582A42494b08401Q8317j52048d318A95504E9758
10510G9347a62327q3296r2587i1117l08614f4380A54787F5023b54820K5261j43680
10499c73239J59871b3148k52587A29752c77945N3952g0386A0469a94580N1663
10489a42917d9154A92304b92673a10269A44946A666k56g0270I760K58485F0614
10477I601M64871q9142C22L7881b28641Q1102f2836A53198a29952B7421q823K57464
10465B76062n7169r2564a94758A05800c8477A86950a14516k47113I7904L5640
$$ y = [-27219, 80850, 151936, 78623, 1436, -172042, -79516, -75793, -147272, 108142, -232007, -21667, -894, -3451, -181629, -105619, -91803, 71814, -311980, -98270, 127425, -135022, -33737, 130610, -26172, 47927, -162196, -194384, -141802, 142494, -208401, -120084, -272132, -4318, 195504, 59758, 79347, -162327, -245623, -338210, -91117, -399731, -64380, 154787, 65023, -254820, -229559, -373239, -213368, -23148, -275735, 129752, -377945, -323993, -70386, 10469, -194580, -142917, -49154, 192304, -292673, -110269, 144946, 1666, 1410, -70270, 9760, 268245, 60614, 9601, 474472, 385330, 322, 38203, -228641, -147539, -62836, 153198, -129952, 27421, 18598, 276062, 218893, 126329, -194758, 105800, -38477, 186950, -114516, -361629, 97904, 133544]
10455A33544a10728J5663l2322l16175A66263q1739a36645j56290A73239a00225
10444E3982a98313e6659j92504d212l40272f6305m306o238H9588a50038j56073
10433c06111D1143a00375L2118L3799j05925O8330j61754B13762b8276A41844
10422C63873a08509d2740k39032C82353j53474A2631d4961j14617N3070r0483
10412a96991Q345J3491a6456j2517A78828E1016c1509A86919G0905g8592L698
10401g4894p2118A75863b22977R0274N64H2500c2054j75710A37489J5991a98546
10389B10610H9424f0342A16143k1592f6604F0174a67316A05264N5066L5613m2634
10378A53309k2145J25511K74621h0494A45387h9741A56224G8023j8706a38098
$$ y = [133544, -110728, -95065, -127387, -443562, 166263, 84524, -136645, -292935, 173239, -100225, 53982, -198313, -56659, -249163, -4212, -344484, -66305, -70611, -76849, 89588, -150038, -306111, 41143, -100375, -68257, -34458, -140383, -72053, -233807, 213762, -28276, 141844, 363873, -108509, -42740, -281772, 382353, 228879, 12631, -44961, -159578, -106508, -196991, -188646, -175155, -16456, -28973, 178828, 51016, -31509, 186919, 70905, -78592, -74894, -147012, 175863, -222977, -132703, -132139, 82500, -32054, -207764, 137489, 153480, -198546, 210610, 89424, -60342, 116143, 94551, -66604, 60174, -167316, 105264, 160330, 195943, 153309, 131164, 256675, 531296, -80494, 145387, -89741, 156224, 78023, 59317, -138098]
10367B88211L2392A7881L08027L91856G8681J62428l254F4707O7010L2028M0322
10356B04067J02714b4650F0806R2721I494L14771d0152H5088B6729J74735J52420
10345C53884A62199N8589b8883C97242q0913A06942J62599d4403G7174Q8514G2575
10333G242O5830a01772A64964G0216a0684k38873g0124B2106a40605A72989M3490
10322B16479O282r4173a00251L2280F4116J65112L20895C8986M8151i4568k27039
10311c21607a19827J681A5973O0553O9651c457l5566j35525L2455D17259b37534
10299b15990K435A7680a93746Q7240l8199B32638E8726B3930M9692b61154B98625
10287h743G7644B2680J67312p3405c7915G0491d3402m4888L3569A41195J7712
$$ y = [288211, 320603, 17881, 325908, 717764, 78681, 241109, 237855, 64707, 131717, 163745, 204067, 306781, -24650, 60806, 153527, 9494, 324265, -40152, 85088, 26729, 201464, 353884, 162199, 220788, -28883, 397242, 316329, 106942, 269541, -44403, 77174, 165688, 72575, 7242, 73072, -101772, 164964, 70216, -10684, -249557, -70124, 22106, -140605, 172989, 216479, 222761, 128588, -100251, -67971, 64116, 229228, 550123, 38986, 87137, -94568, -321607, -119827, -118146, 15973, 76526, 146177, -3457, -39023, -174548, -142093, 417259, -237534, -215990, -213555, 17680, -193746, -106506, -144705, 232638, 58726, 23930, 73622, -261154, 298625, -8743, 77644, 22680, 189992, 116587, -37915, 70491, -43402, -88290, -54721, 141195, 158907]
10276A58907f1196A76353b01865N5557k9916J5618P1892B7407c59242I6648a47737
10264b39483A03244R9172G2255d1806k5345j39281j54699E4552e930A75135N0056
10253B25191j0726j01974J74631i8340A9280d0134k8129F7669a28308l59A78892
10241e47144a29246D6993b25805G1833Q5179A5530O3076A0200J95587d4143D6068
10229E1177a74021o494B10138e5898M640k40325F9165c50p9291j93476f8879B25189
10216A18265N0912m9943b23394K3393j6937i8176j89611J31546e9447k21605A29672
10204c57101C29044e6414B66715J9683c18186f7391L3003k59286P555D4939a03972
10192B08643J00212c1910A3576a77671B3524J4902A8102b25829e6269l3066G84
$$ y = [158907, -61196, 176353, -201865, -146308, -176224, -160606, -88714, 27407, -359242, 96648, -147737, -239483, 103244, 202416, 72255, -41806, -67151, -206432, -361131, 54552, -5930, 175135, 225191, 214465, 112491, 287122, -98340, 19280, -40134, -68263, 67669, -128308, -128667, 178892, -547144, -129246, 46993, -225805, 71833, 157012, 15530, 78606, 10200, 205787, -44143, 46068, 51177, -174021, -180515, 210138, -55898, -51258, -291583, 69165, -350, -79641, -273117, -68879, 225189, 118265, 169177, 119234, -223394, -200001, -216938, -98176, -287787, -156241, -59447, -281052, 129672, -357101, 329044, -56414, 266715, 286398, -318186, -67391, -34388, -293674, -286119, 44939, -103972, 208643, 308855, -31910, 13576, -177671, 23524, 38426, 18102, -225829, -56269, -89335, 784]
10180a35902e2275p3974k22104g2704q2229J5390m137L0185j29825A87225b48534
10168E1658b41657A39286a01907A33381J08240C5325L0164i3849A0377f3439A78245
10156A66948h4104C14761a84544k35725A28666L0340a25895A4717J63407c1472
10145b73915d6391j1364o7954M3789j70089B2123c00613E3945h1654E9788i4513
10133c27007d0824p3221j14696f9193j5870j45877D2368h4861a1619E4090b67689
10121A41437d5024k73321C62672a02907j10689c1668D57690G2280d73016I3814
10110A54447d64777a27062j2264j11786a1111m4133b5736A13114h0368d0180k17335
10099b57515g6753B25348F3754b77389F270g3560K6623E7034P9961e121A5898
$$ y = [-135902, -52275, -126249, -348353, -72704, -154933, -139543, -143680, -113495, -243320, 187225, -248534, 51658, -241657, 139286, -101907, 133381, 241621, 35325, 65489, -93849, 10377, -63439, 178245, 166948, -84104, 314761, -184544, -420269, 128666, 159006, -125895, 14717, 178124, -31472, -273915, -46391, -57755, -125709, -81920, -252009, 22123, -300613, 53945, -81654, 59788, -94513, -327007, -40824, -114045, -228741, -69193, -85063, -230940, 42368, -84861, -11619, 54090, -267689, 141437, -45024, -318345, 362672, -102907, -213596, -31668, 457690, 72280, -473016, 93814, 154447, -464777, -127062, -139326, -251112, -11111, -55244, -25736, 113114, -80368, -40180, -257515, -76753, 225348, 63754, -277389, 6270, -73560, -46937, 57034, 136995, -5121, 15898]
10087h3816k11295L9052e5039G0673N9813c32082J4972h6090k98305a15328j84774
10076c00102A12600b14199d6179H1922d3721l26960a9801D4686N0990K98275f6921
10064b18590D5175N7653g1536n8458d4351A51733f5097J5693A880a24308q1914
10053b06222d6473O273j81241h3317j9853r341l43691h4050q6771Q1947C18151
10041b05508g5038B667e4788B0537K66041a61613A8451a66105C3877K34495a9710
10029a2012A02273b24133F4185a49306o5434J02663A95688a78175o6390P6949
10019a67616A1964a43635e2260j12389d4707A8172K6229M8903a61479K2766j40110
10008b78823B6498K6443K12139b47283J05509B09279c3135o6245D92328d1285
$$ y = [-83816, -295111, -256059, -55039, 70673, 130486, -332082, -317110, -86090, -384395, -115328, -300102, 112600, -214199, -46179, 81922, -43721, -370681, -19801, 44686, 95676, 393951, -66921, -218590, 45175, 102828, -71536, -129994, -44351, 151733, -65097, -49404, 1880, -124308, -206222, -46473, -40200, -221441, -83317, -103170, -112511, -456202, -84050, -170821, -88874, 318151, -205508, -75038, 2667, -54788, 20537, 286578, -161613, 18451, -166105, 33877, 268372, -19710, -12012, 102273, -224133, 64185, -149306, -214740, -112077, 195688, -178175, -244565, -167616, 11964, -143635, -52260, -164649, -44707, 18172, 44401, 93304, -161479, -138713, -278823, 26498, 52941, 265080, -247283, -141774, 209279, -33135, -99380, 492328, -41285]
9997C3509J09429L46309f0748f38q9904d1569D8148J1903j9867b32724l1539J28130
9985a36133c9922B24325F0195b60435A1452c01340E1743c8493j28518K807c2317
9973A32123c63487F3922J00372c2762A20434c43683c381j22429j28172C54668
9962B1659Q8644Q6838a79200L0890N0518o7742B090J1288a95010r8563O7105i4217
9949G1229L6336K11248G4273b14993o7193a31272E6691M6424m6059Q5720b3269
9937b14914g7133j10196H8642a46576N5293E6522a23631a2200B2382d4069l39853
9926c83922B40054a45351j17896A09573b27988l9701g1936C39146I0279b31833
9915i7025j85865J4721B79223a79470B66723H7699P461b1539l84696A62966a67043
$$ y = [33509, 142938, 489247, -60748, -638, -90542, -41569, 48148, 60051, 40184, -232724, -264263, -136133, -39922, 224325, 60195, -260435, 11452, -301340, 51743, -38493, -167011, -164204, -32317, 132123, -363487, 63922, 164294, -32762, 120434, -343683, -3381, -125810, -253982, 354668, 21659, 110303, 197141, -179200, -148310, -97792, -165534, 2090, 13378, -195010, -293573, -226468, -94217, 71229, 107565, 318813, 74273, -214993, -282186, -131272, 56691, 103115, 57056, 142776, -23269, -214914, -77133, -187329, 88642, -146576, -91283, 56522, -123631, -12200, 22382, -44069, -383922, 240054, -145351, -263247, 109573, -227988, -267689, -71936, 339146, 90279, -231833, -97025, -282890, -268169, 279223, -179470, 266723, 87699, 95160, -21539, -406235, 162966, -167043]
9903B91413b30692D3718f66256d5764E7266a29724l19254J90025k78683H8731
9892F4492J32195D7321L1989d6564A10455B2760K46286d5471j97360E8847K62699
9881C21546f9649B46409f398B12407b58231F3835g0533p4974a3960n46758c2578
9869b5927D117a27322A08065L9602K46081A04889a23368D3968j3438R4107a55252
9857C33441f5334j88653F5992g2691L3367n3154j5891M1425j25735N3255A59879
9845B11899o3488a11816M395A38732j9332K97214b35732a12900B42292c29990
9834d9771B6310i8782p6458m4964O2782j6201E4278J8076a7605D2474a05183e434
9821b45892m1615r1638d2784k18230A09120f0919F3286J04064C3927g8412D79435
$$ y = [291413, -230692, 43718, -666256, -45764, 57266, -129724, -448978, -258953, -537636, 88731, 64492, 196687, 47321, 79310, -46564, 110455, 22760, 269046, -45471, -242831, 58847, 321546, -69649, 246409, -6398, 212407, -258231, 63835, -70533, -145507, -13960, -560718, -32578, -25927, 4117, -127322, 108065, 147667, 393748, 104889, -123368, 43968, 30530, 124637, -155252, 333441, -65334, -253987, 65992, -72691, -39324, -92478, -108369, -66944, -192679, -139424, 159879, 211899, 148411, -111816, -107421, 138732, 119400, 416614, -235732, -112900, 242292, -329990, -49771, 26310, -98782, -175240, -220204, -157422, -173623, 54278, 72354, -17605, 42474, -105183, -5434, -245892, -287507, -379145, -42784, -261014, 109120, -60919, 63286, 167350, 33927, -78412, 479435]
9809c03186C2237J99669c1016B33215b00955C14871a57390b3241B00090a71846
9798B9693a30443K4325a5666n0433A49298h5988j30490A41147A4457L0700f3964
9786c46540G4499c71485J22068b5696q932o6409q3916h0057H9857L1281j4078
9775A07060i0400m2309c330r8220B35768F8325a42545j19280f8844j50509B8719
9763b31655A27693A0369N3914a03492J5175F1961f1600B21507a85259J0735P7129
9752i7395a239o7464p9811C34333c71241a9943B62224a63288k1509G8967a3230
9740b33158g7942m0352k10711d010F5420J87487a83711C23713i8147l65893I7317
9728D46786a31725A46949o294g6743c8317f058m83995b1517j54105c6012j28907
$$ y = [-303186, 32237, 231906, -31016, 233215, -200955, 314871, -157390, -23241, 200090, -171846, 29693, -130443, -106118, -15666, -66099, 149298, -85988, -216478, 141147, 14457, 45157, -63964, -346540, 74499, -371485, -249417, -25696, -34628, -101037, -184953, -80057, 89857, 121138, 107060, -90400, -132709, -3330, -101550, 235768, 68325, -142545, -261825, -68844, -219353, 28719, -231655, 127693, 10369, 64283, -103492, -88317, 61961, -61600, 221507, -185259, -174524, -97395, -1239, -68703, -148514, 334333, -371241, -19943, 262224, -163288, -184797, 78967, -13230, -233158, -77942, -118294, -329005, -4010, 65420, 252907, -183711, 323713, -98147, -464040, 97317, 446786, -131725, 146949, 140655, -76743, -38317, -6058, -490053, -21517, -175622, -36012, -164919]
9717a64919A87054H5507J74817I1845a90257j24j35778J0409d464I65Q6124a4974
9704b41592g9063A40306c5332k38378A02686A9050a26364A04359g9368k08393
9694b87761a4455l6063r1086N5180H4605d3136r283m2103G024b74916B80113f4586
9681c9930l6757k76738J44293N5075l6609N4521j42947j87886H5625b36587E5108
9669A37191a92985K4578k20235A2514a38723D1138b79367A85977c0290L578A5154
9657C286J20485g8776p0711A02822a6256j78891j4634R3301p1700b276A6378a69707
9644a13048B69839a05964b7074k02208A0420a23525J9478K3374J9689C39125A04991
9632f806I2198b1349k02709A06186a38239K9712b5670j83994E7356g0793l19966
$$ y = [-164919, 187054, 85507, 260324, 91845, -190257, -190381, -326159, -315750, -4464, 965, 87089, -14974, -241592, -79063, 140306, -35332, -273710, 102686, 19050, -126364, 104359, -79368, -287761, -14455, -50518, -141604, -86424, 84605, -43136, -52419, -94522, 7024, -274916, 280113, -64586, -39930, -76687, -353425, -209132, -154057, -190666, -136145, -279092, -466978, 85625, -236587, 55108, 137191, -192985, -168407, -388642, 12514, -138723, 41138, -279367, 185977, -30290, -26712, 15154, 3286, 123771, -78776, -149487, 102822, -16256, -195147, -209781, -116480, -188180, -2276, 16378, -169707, -113048, 269839, -105964, -27074, -229282, 10420, -123525, -104047, -80673, -60984, 339125, 104991, -6806, 92198, -21349, -224058, 106186, -138239, -108527, -25670, -209664, 57356, -70793, -390759]
9621c90759d6964l8624a525j3333l91486g697h20r115j66965K9189N0302k6991
9609a24400n5973A48800b26562B19396a01805A57430c13689g0621j62413D4146
9598I7345d4927k50213J45793q4673A51526C74a70647N6134E9775b79884f1134
9586D9994J3503J36583d05362c8963B28397J48869b72273B02137f7005k20870
9576b87875B19115n6252B5847Q1525a17374H8967d56318G0157k7853j0627J09610
9565A41287a05584j32477d9894G9825b86347g0024A93726D1857j3920K59198j22148
9554A64987a43711j33414C3634J2395d3348j40654j62714d8613j70262d8722m395
9543e3117K6419j75524m8541I9761a41996p1428d6739j41334C7429J96388a25231
$$ y = [-390759, -46964, -85588, -1525, -14858, -406344, -7697, -820, -9935, -176900, -147711, -97409, -124400, -180373, 148800, -226562, 219396, -101805, 157430, -313689, -70621, -233034, 44146, 97345, -44927, -295140, -149347, -234020, 151526, 374, -170647, -114513, 59775, -279884, -61134, 49994, 63497, 200080, -405362, -38963, 228397, 377266, -272273, 202137, -67005, -287875, 219115, 162863, 25847, 107372, -117374, 88967, -456318, 70157, 42304, 31677, 141287, -105584, -238061, -49894, 79825, -286347, -70024, 193726, 41857, 27937, 287135, 164987, -143711, -277125, 33634, 46029, -43348, -184002, -346716, -48613, -218875, -48722, -53117, -26698, -202222, -250763, 99761, -141996, -213424, -46739, -188073, 37429, 233817, -125231]
9531b35417B9410c03191E296a98169B95437c90647K625Q5482J12276B21762J43967
9520C65729B4916J55223l4509L1020c21015B54619B1519a95025e0821A06098m6904
9509E9194R3108P1353L4214F7625G901J6856a45341i57k01582J940N8590M7597
9497i4412j12467B24222f9921E8581L428a576I5789g3868n1732F6114b81556i0207
9484a08185A29785a05864B43505D2242a61580P0260k9490o5997o1942J21562F1305
9472B9154a7826A84616J50965i5942j35479B48925i7343q9186F0998a70434f332
9460F2169A3008N7289O4917j8833D5798J1777A0441L71466a32751f4158d095k45621
9448b49716g639k34485j8195A14042l2234d69107D1149b08773P5701a6183A07826
$$ y = [-235417, 29410, -303191, 5296, -198169, 295437, -390647, -388022, -302540, -190264, 221762, 365729, 24916, 180139, 145630, 176650, -321015, 254619, 21519, -195025, -50821, 106098, 59194, 152302, 223655, 257869, 67625, 7901, 24757, -145341, -957, -202539, -200599, -142009, -94412, -206879, 224222, -69921, 58581, 62009, -1576, 95789, -73868, -125600, 66114, -281556, -90207, -108185, 129785, -105864, 243505, 42242, -161580, -91320, -120810, -186807, -248749, -127187, 61305, 29154, -17826, 184616, 335581, -95942, -231421, 248925, -97343, -186529, 60998, -170434, -6332, 62169, 13008, 70297, 135214, 116381, 45798, 57575, 10441, 381907, -132751, -64158, -4095, -249716, -7639, -242124, -260319, 114042, 81808, -469107, 41149, -208773, -133072, -16183, 107826]
9436b86098N7310j17613b3851p290l3740A24444c5725l1894E0931a66583A14104
9424c6335A4946a29178d571j54329A08378a40280k44865D3391M4841b811k47496
9413b50307F320b68389L8684c0625q1107A09160m585a53531N298A11361c1030
9401a90837C31579a39592N0442A43170i4148j64177j0867G439c80529J04665G6047
9389a32120A17906n12i980B79071j33503a53387I5543b93342A70657a05554K2244
9378h3310B65065e75561E4884a51139J2783b935A28245D5705J77431I4888b04037
9366a20853P050c9426j6542j0088j69278F282J20171C197g1563B86889i9023k03993
9354c03016A94783b48968i6632M8311n3414B13960A3786a16665M6977A915i8186
$$ y = [-286098, -228788, -346401, -23851, -31141, -64881, 124444, -35725, -67619, 50931, -166583, 114104, -36335, 14946, -129178, -4571, -158900, 108378, -140280, -385145, 43391, 88232, -2811, -250307, 6320, -268389, -229705, -30625, -111732, 109160, 104575, -153531, -148233, 111361, -31030, -190837, 331579, -139592, -89150, 143170, -94148, -258325, -269192, 7439, -380529, -275864, 76047, -132120, 117906, 117394, -9980, 279071, 145568, -153387, 95543, -293342, 170657, -105554, -83310, 265065, -575561, 54884, -151139, -138356, -2935, 128245, 45705, 223136, 94888, -204037, -120853, -113803, -39426, -55968, -66056, -235334, 6282, 126453, 3197, -71563, 286889, -99023, -303016, 194783, -248968, -96632, -48321, -101735, 213960, 13786, -116665, -69688, 1915, -98186]
9342a86371d8332J8557a975k47166a20584Q573m2873K4553A35223a5762l14791
9331c30553B14686N1602a04985D46712A24991d36594a39613B10021h2641j6751
9321i9392A34617a33617B2022b16783B68680B1833L413J93394G067c0788j26105
9310a56893r1829Q4162a0212j80127d4809A45314a13630B9305g4100j16655j70875
9299c61630a14546E910a3062e255r9040B27260b64453d3889n8570D3607c8335
9287f5196l22025j8225K01530e3433k4160k6782o0039A26984a08009l6451b2051
9275a28732A91176d6715a4180j43912c0111j79247N0433L4463A5358b1912k25139
9264b47051H100b66034N9963g6967j53138Q4987o3193j12879A96916c28224a40577
$$ y = [-186371, -48332, -29775, -1975, -249141, -120584, -112011, -154884, -130331, 135223, -15762, -330553, 214686, 266288, -104985, 446712, 124991, -436594, -139613, 210021, -82641, -99392, 134617, -133617, 22022, -216783, 268680, 21833, 25246, 218640, 7067, -30788, -156893, -248722, -164560, -10212, -190339, -44809, 145314, -113630, 29305, -74100, -190755, -361630, -114546, 5910, -13062, -5255, -104295, 227260, -264453, -43889, -102459, 43607, -38335, -65196, -387221, -405446, -203916, -53433, -77593, -104375, -164414, 126984, -108009, -144460, -22051, -128732, 191176, -46715, -14180, -158092, -30111, -209358, -158925, -124462, 15358, -21912, -247051, 8100, -266034, -206071, -76967, -230105, -145118, -208311, -321190, 196916, -328224, -140577]
9252b1426r1346j81799A72703b39185r3611J12667E2343J79640C3234b54168F4583
9240c93338f5039k4579H3736b82548B8077Q6567C2033d3885j40625K4793i791
9228F3666b22192i7302d0208I6827h7327B58833d6026L767J1158l16174a5032
9216E7322e91861A13870c98825A7846b1300A09183f3149I6205K42718E3588J5370
9205F8958a98774b6650j33901f4688j60305j69973a47058F769J41560a59395E2259
9193c2632j60733a127A33956D6945c1939j21515c6421k32704e274j18137J3587
9182a09824j07072A91631f8114F4761a90720C9749N775a81498C60570d4695k0186
9171f4881B753R8098j6075B2369c32662C0259i0518M1132C1417M0058c77346C1
$$ y = [-21426, -112772, -294571, 172703, -239185, -332796, -220129, 52343, 231983, 33234, -254168, 64583, -393338, -65039, -89618, 83736, -282548, 28077, 114644, 32033, -43885, -184510, -159717, -9791, 63666, -222192, -97302, -40208, 96827, -87327, 258833, -46026, -42259, -31101, -347275, -15032, 57322, -591861, 113870, -398825, 17846, -21300, 109183, -63149, 96205, 338923, 53588, 68958, -198774, -26650, -160551, -64688, -224993, -394966, -147058, 6769, 148329, -159395, 52259, -32632, -193365, -1127, 133956, 46945, -31939, -153454, -36421, -269125, -5274, -123411, -109824, -216896, 191631, -68114, 64761, -190720, 39749, 45524, -181498, 360570, -44695, -64881, 2753, 100851, 84776, 22369, -332662, 30259, -90518, -49386, 31417, 71475, -377346, 31]
9158g8095m9073n6350r8205R1135B87304a45888B84447b22210h4369r3658C24698
9146c70298F2966c36947B14103A4343g9294j8233H0382e0140C5516a24857B12294
9134d91935a72065F4065b3788n6476K976B21110i6065b1670q1220r5650A42319
9122C37006c58931D1233e703k70275i002k51810a02951r6637d4419B44977a77605
9110f1191r7792a4281H689J3222c09404h8579c2710G4053a56257o753A58809c72010
9097B6248J88609f4649j88285a13342F2756o739B1561f5898A72711a12385q2419
9086a94804l9397A04228a8989r1014j6068b1194E053a70027A70395c76897B23615
9074A31955a22898j44964I6476R3890a51721A80752L8806g0901k9400J8116p9855
$$ y = [-78095, -127168, -183518, -281723, -190588, 287304, -145888, 284447, -222210, -84369, -178027, 324698, -370298, 62966, -336947, 214103, 14343, -79294, -97527, 80382, -50140, 35516, -124857, 212294, -491935, -172065, 64065, -23788, -80264, -77288, 221110, -96065, -21670, -102890, -198540, 142319, 337006, -358931, 41233, -5703, -275978, -9002, -260812, -102951, -199588, -44419, 244977, -177605, -61191, -158983, -14281, 8689, 21911, -309404, -88579, -32710, 74053, -156257, -163010, 158809, -372010, 26248, 214857, -64649, -252934, -113342, 62756, 56017, 21561, -65898, 172711, -112385, -194804, -234201, 104228, -18989, -110003, -126071, -21194, 5053, -170027, 170395, -376897, 223615, 131955, -122898, -267862, 96476, 190366, -151721, 180752, 219558, -70901, -100301, -82185, -162040]
9063a62040B2464a1217k23179N613D4734L8097j3825a78091A32114a11680A2010
9051B96196F8942J13546a03571G7996c07842b5391A64659J25603j27386n3648
9041A09228B3173c63424B90806b96989B06418d04r386F1881d8284F2462J56503
9030B18965j03391C9586K94653A56342H188f3896B64985j21558a83974F9306e2461
9018F2883a82358B022J39217a56863A1913K3136b70970B5489a44896N4366d4030
9006a04984A99041k095J54673E4570b53215a19271q6029R016M195C19521e5530
8994b5792k7876r7214q199d6198q6417I1579a77560C6383I011c19573c7936j1688
8982d9624o8180n117A27698J25069a31806k59087h1114E8956f7037j41000Q1014
$$ y = [-162040, 22464, -11217, -234396, -228783, 44734, 82831, 69006, -178091, 132114, -111680, 12010, 296196, 68942, 182488, -103571, 77996, -307842, -25391, 164659, 290262, 162876, 109228, 23173, -363424, 290806, -296989, 206418, -404, -9790, 61881, -48284, 62462, 218965, 115574, 39586, 334239, 156342, 8188, -63896, 264985, 143427, -183974, 69306, -52461, 62883, -182358, 2022, 141239, -156863, 11913, 35049, -270970, 25489, -144896, -90530, -44030, -104984, 199041, 196946, 351619, 54570, -253215, -119271, -205300, -196284, -192089, 319521, -55530, -25792, -53668, -150882, -159081, -46198, -132615, 91579, -177560, 36383, 9011, -319573, -37936, -49624, -117804, -122921, 127698, 252767, -131806, -390893, -81114, 58956, -67037, -208037, -127023]
8971a27023K3611a332k40391l7747k0656I8723a38771B4016a02018A11990C9719
8959a04421k07384C1878J29154a08667o4269n3393H104a40688K0452A34893k6216
8948A08677a81399B74707A30554h4000k6091I5508m2427a60930j40376p6110e3741
8936a96090B01120G3074c0380A22672M3216g619A44622a01525L4072n6144N9495
8925f4102l0333N223B35894R2809F9169O88231J127688E22245A17643N2829a53797
8913c29958G6329a54707J0960j86313e7976B13394k2979H5228h5541H6949A7795
8901b01366A17662B9443P0303L9132g7028j89775a27927d0018G1159L9998A5193
8889A35348A5144h8515p1873N9595r7307O1806c5683k17245h3415G6610b68205
$$ y = [-127023, -103412, -1332, -241723, -279470, -300126, 98723, -138771, 24016, -102018, 111990, 39719, -104421, -311805, 31878, 161032, -108667, -172936, -226329, 8104, -140688, -120236, 134893, 108677, -181399, 274707, 130554, -84000, -110091, 95508, 53081, -160930, -301306, -377416, -53741, -196090, 201120, 73074, -30380, 122672, 165888, -7619, 144622, -101525, -67453, -123597, -64102, -94435, -89212, 235894, 328703, 69169, 757400, 1885088, 522245, 117643, 170472, -153797, -329958, 76329, -154707, -143747, -330060, -57976, 213394, 190415, 85228, -85541, 86949, 17795, -201366, 117662, 29443, 99746, 138878, -77028, -266803, -127927, -40018, 71159, 111157, 15193, 135348, 15144, -88515, -160388, -100793, -198100, -136294, -35683, -252928, -83415, 76610, -268205]
8877c5746O740j18743J1960L9532k99452B00954A7831b0142q5644A59027b46311
8865d49427i6124D8036d1752j11368H4574k1377a83565e5987A30944h2517L2855
8854d9662p370k1275r1673A40393B8028L7047g9191D8230L43436B4256a66128
$$ y = [-35746, -29006, -147749, -135789, -96257, -395709, 200954, 17831, -20142, -105786, 159027, -246311, -449427, -96124, 48036, -41752, -153120, 84574, 63197, -183565, -55987, 130944, -82517, -49662, -57032, -78307, -169980, 140393, 28028, 65075, -79191, 48230, 391666, 24256, -166128]
$$ [...]
##END NTUPLES=NMR SPECTRUM
##END=
