##TITLE=NES1088_T11_9884960_lD6dxsbMPy
##JCAMPDX= 6.0         $$ Bruker NMR JCAMP-DX V2.0
##DATA TYPE= NMR SPECTRUM
##DATA CLASS= NTUPLES
##ORIGIN= BRUKER
##OWNER= Administrator
$$ 1.72 TOPSPIN		Version 2.1
$$ 2016-08-27 16:40:35.539 -0500  Administrator@X
$$ Compression mode = diff/dup
##.OBSERVE FREQUENCY= 400.02188249412
##.OBSERVE NUCLEUS= ^1H
##.ACQUISITION MODE= SIMULTANEOUS (DQD)
##.ACQUISITION SCHEME= undefined
##.AVERAGES= 64
##.DIGITISER RES= 22
##SPECTROMETER/DATA SYSTEM= spect
##.PULSE SEQUENCE= noesygpps1d.comp
##.SOLVENT NAME= COFFEE_meoh
##.SHIFT REFERENCE= INTERNAL, COFFEE_meoh, 1, 14.96245
##AUDIT TRAIL= $$ (NUMBER, WHEN, WHO, WHERE, PROCESS, VERSION, WHAT)
$$ ##TITLE= Audit trail, TOPSPIN		Version 2.1
$$ ##JCAMPDX= 5.01
$$ ##ORIGIN= Bruker BioSpin GmbH
$$ ##OWNER= Administrator
$$ $$ E:\/data/COFFEE/nmr/NES1088_T11_9884960_lD6dxsbMPy/22/pdata/1/auditp.txt
$$ ##AUDIT TRAIL=  $$ (NUMBER, WHEN, WHO, WHERE, PROCESS, VERSION, WHAT)
(   1,<2016-08-27 16:40:30.414 -0500>,<Administrator>,<X>,<go>,<TOPSPIN 2.1>,
      <created by zg
	started at 2016-08-27 16:29:00.633 -0500,
	POWCHK enabled, PULCHK disabled,
       configuration hash MD5:
       21 0F 79 D6 B3 7B B4 F6 88 20 88 DB 03 48 BD 9F
       data hash MD5: 64K
       99 AD 7C 0D 81 DC C7 7F 4F 1E E9 89 9B 3A 54 BC>)
(   2,<2016-08-27 16:40:33.508 -0500>,<Administrator>,<X>,<proc1d>,<TOPSPIN 2.1>,
      <Start of raw data processing
       efp LB = 0.3 FT_mod = 6 PKNL = 1 PHC0 = 0 PHC1 = 0 SI = 128K 
       data hash MD5: 128K
       B5 02 5B 03 EC 60 2F 82 8C C8 74 E6 B5 20 FF D3>)
(   3,<2016-08-27 16:40:34.383 -0500>,<Administrator>,<X>,<proc1d>,<TOPSPIN 2.1>,
      <pk PHC0 = -82.79846 PHC1 = 0 
       data hash MD5: 128K
       A1 DB 91 7C 8A 56 F0 B4 B7 A7 33 D9 4F 41 3F A4>)
(   4,<2016-08-27 16:40:34.758 -0500>,<Administrator>,<X>,<proc1d>,<TOPSPIN 2.1>,
      <abs ABSG = 1 
       data hash MD5: 128K
       69 96 66 4B 1A C5 C4 56 99 4C 8C 59 F5 63 BF 49>)
(   5,<2016-08-27 16:40:34.867 -0500>,<Administrator>,<X>,<proc1d>,<TOPSPIN 2.1>,
      <abs ABSG = 2 
       data hash MD5: 128K
       75 50 EA A0 AD B6 93 BB 7E 0C AA FA 05 45 E5 C2>)
(   6,<2016-08-27 16:40:34.945 -0500>,<Administrator>,<X>,<proc1d>,<TOPSPIN 2.1>,
      <abs ABSG = 3 
       data hash MD5: 128K
       E9 CE 97 C5 BD 1E 54 24 CE D1 19 A4 99 37 E0 0A>)
(   7,<2016-08-27 16:40:35.039 -0500>,<Administrator>,<X>,<proc1d>,<TOPSPIN 2.1>,
      <abs ABSG = 4 
       data hash MD5: 128K
       B4 E2 42 B7 48 DD 60 04 DD 50 69 06 D9 B8 1B F4>)
(   8,<2016-08-27 16:40:35.164 -0500>,<Administrator>,<X>,<proc1d>,<TOPSPIN 2.1>,
      <abs ABSG = 5 
       data hash MD5: 128K
       7E 86 CC 41 49 EF 10 78 17 F0 1C 4E 25 78 DF 03>)
$$ ##END=
$$ 
$$ $$ hash MD5
$$ $$ 19 BF 9C 9F 93 30 9D 6B F1 4F F3 33 D5 16 1F BD
##$RELAX= 
##$RELAX= 
##$RELAX= 
##$RELAX= 
##$RELAX= 
##$RELAX= 
##$RELAX= 
##$RELAX= 
$$ Bruker specific parameters
$$ --------------------------
##$DU= <E:\>
##$EXPNO= 22
$$ [...]
##$TP07= 0
##$TPNAME0= <>
##$TPNAME1= <>
##$TPNAME2= <>
##$TPNAME3= <>
##$TPNAME4= <>
##$TPNAME5= <>
##$TPNAME6= <>
##$TPNAME7= <>
##$TPOAL= (0..7)
0.5 0.5 0.5 0.5 0.5 0.5 0.5 0.5
##$TPOFFS= (0..7)
0 0 0 0 0 0 0 0
##$TUNHIN= 0
##$TUNHOUT= 0
##$TUNXOUT= 0
##$USERA1= <user>
##$USERA2= <user>
##$USERA3= <user>
##$USERA4= <user>
##$USERA5= <user>
##$V9= 5
##$VALIST= <valist>
##$VCLIST= <CCCCCCCCCCCCCCC>
##$VD= 0
##$VDLIST= <DDDDDDDDDDDDDDD>
##$VPLIST= <PPPPPPPPPPPPPPP>
##$VTLIST= <TTTTTTTTTTTTTTT>
##$WBST= 2048
##$WBSW= 25
##$XGAIN= (0..3)
0 0 0 0
##$XL= 0
##$YL= 0
##$YMAX_a= 6247813
##$YMIN_a= -12830421
##$ZGOPTNS= <>
##$ZL1= 120
##$ZL2= 120
##$ZL3= 120
##$ZL4= 120
##$ABSF1= 14.96245
##$ABSF2= -5.595732
##$ABSG= 5
##$ABSL= 3
##$ALPHA= 0
##$AQORDER= 0
##$ASSFAC= 0
##$ASSFACI= 0
##$ASSFACX= 0
##$ASSWID= 0
##$AUNMP= <proc_prof1d_extract.lims>
##$AXLEFT= 0
##$AXNAME= <>
##$AXNUC= <1H>
##$AXRIGHT= 0
##$AXTYPE= 0
##$AXUNIT= <>
##$AZFE= 0.1
##$AZFW= 0.1
##$BCFW= 0
##$BC_mod= 0
##$BYTORDP= 0
##$COROFFS= 0
##$CY= 15
##$DATMOD= 1
##$DC= 0
##$DFILT= <>
##$DTYPP= 0
##$F1P= 0
##$F2P= 0
##$FCOR= 0.5
##$FTSIZE= 131072
##$FT_mod= 6
##$GAMMA= 0
##$GB= 0
##$INTBC= 1
##$INTSCL= 1
##$ISEN= 128
##$LB= 0.3
##$LEV0= 0
##$LPBIN= 0
##$MAXI= 10000
##$MC2= 0
##$MEAN= 0
##$ME_mod= 0
##$MI= 0
##$NCOEF= 0
##$NC_proc= -2
##$NLEV= 6
##$NOISF1= 0
##$NOISF2= 0
##$NSP= 0
##$NTH_PI= 0
##$NZP= 0
##$OFFSET= 14.96245
##$PC= 1
##$PHC0= -82.79846
##$PHC1= 0
##$PH_mod= 1
##$PKNL= yes
##$PPARMOD= 0
##$PPDIAG= 0
##$PPIPTYP= 0
##$PPMPNUM= 2147483647
##$PPRESOL= 1
##$PSCAL= 4
##$PSIGN= 0
##$PYNMP= <proc.py>
##$REVERSE= no
##$SF= 400.020009056863
##$SI= 131072
##$SIGF1= 0
##$SIGF2= 0
##$SINO= 400
##$SIOLD= 131072
##$SPECTYP= <>
##$SREGLST= <1H.CDCl3>
##$SSB= 0
##$STSI= 131072
##$STSR= 0
##$SW_p= 8223.68421052631
##$SYMM= 0
##$S_DEV= 0
##$TDeff= 65536
##$TDoff= 0
##$TI= <>
##$TILT= no
##$TM1= 0
##$TM2= 0
##$TOPLEV= 0
##$USERP1= <user>
##$USERP2= <user>
##$USERP3= <user>
##$USERP4= <user>
##$USERP5= <user>
##$WDW= 1
##$XDIM= 131072
##$YMAX_p= 369406811
##$YMIN_p= -12676
##$CURPLOT= <Network HP LaserJet P1505>
##$CURPRIN= <$Network HP LaserJet P1505>
##$DFORMAT= <normdp>
##$LAYOUT= <+/1D_H.xwp>
##$LFORMAT= <normlp>
##$PFORMAT= <normpl>
##$SURQMSG= 1
$$ End of Bruker specific parameters
$$ ---------------------------------
##NTUPLES= NMR SPECTRUM
##VAR_NAME=  FREQUENCY,     SPECTRUM/REAL,   SPECTRUM/IMAG
##SYMBOL=    X,             R,               I
##VAR_TYPE=  INDEPENDENT,   DEPENDENT,       DEPENDENT
##VAR_FORM=  AFFN,          ASDF,            ASDF
##VAR_DIM=   131072,        131072,          131072
##UNITS=     HZ,            ARBITRARY UNITS, ARBITRARY UNITS
##FACTOR=    0.0627417313425164, 1,          1
##FIRST=     8223.62146879497, 2395,         -45618
##LAST=      0,             4611,            -45535
##MIN=       0,             -12676,          0
##MAX=       8223.62146879497, 369406811,    0
$$ Real data points
##PAGE= N=1
##DATA TABLE= (X++(R..R)), XYDATA
$$ [...]
64610 61404 60222 59230 58302 57633 57585 58076 58754 59618 60771 61704 61739 61283 61704 63628 66082 67691 68016 67324
64592 67324 65921 64434 64065 65534 67949 69460 69019 67003 64354 61821 60026 59468 60110 61300 62326
64577 62326 62888 63039 62992 63079 63580 64388 64962 64778 63808 62584 61829 61931 62671 63523 64254 65069 66115 67100 67616
64558 67616 67641 67452 67193 66821 66387 66044 65799 65515 65143 64716 64149 63250 61981 60560 59345 58694 58799 59469
64540 59469 60180 60560 60672 60672 60461 59972 59559 59602 59880 59810 59269 58652 58124 57391 56357 55459 55042 54869 54607 54392
64520 54392 54509 54776 54762 54474 54389 54795 55431 55803 55674 55257 55089 55625 56687 57424 57111 55977 54972 54695 54871
64501 54871 54983 55062 55573 56732 58252 59723 60934 61680 61537 60123 57617 54764 52286 50450 49356 49335
64485 49335 50622 52660 54274 54883 55176 56218 58033 59529 59738 58715 57248 56184 56140 57297 59083 60408
64469 60408 60625 60138 59780 59847 60022 59920 59247 57726 55553 53810 53657 54900 56051 56150 55905 56563 58153 59511
64451 59511 59788 59247 58678 58576 58937 59354 59231 58277 56879 55709 54997 54576 54550 55316 56792 58173 58834 59039
64433 59039 59378 59806 59731 58894 57727 56787 56199 55744 55329 55196 55690 56864 58308 59420 59835 59594 59012 58499
64415 58499 58361 58520 58505 57991 57331 57231 57894 58885 59864 60957 62197 63079 63086 62368 61511 60830 60259 59799 59700 60149
64395 60149 60999 61796 62062 61672 61006 60486 59988 59112 58066 57716 58466 59646 60439 60884 61419 61943 62070 61964
64377 61964 62135 62571 62826 62834 62846 62715 62182 61862 62910 65398 67967 69484 70245 71035 71851 72278 72488 73020 73920
64358 73920 74782 75353 75505 74961 73773 72832 73081 74329 75467 75784 75371 74353 72696 70977 70443 71700 73886
64341 73886 75648 76528 76919 77114 77082 77000 77326 78260 79551 80926 82312 83590 84566 85408 86791 89269 92585
64324 92585 95901 98697 101346 104824 109903 116504 123717 130543 136749 143001 150043 157842 165615 172524
64310 172524 178119 182184 184454 184551 182092 176912 169444 160799 152185 144149 136651 129809 124120 119817 116474
64295 116474 113585 111135 109221 107500 105573 103743 102815 103124 104246 105651 107123 108426 109115 109005 108540
64280 108540 108377 108723 109236 109425 108962 107764 105945 103680 101090 98354 95872 94066 92984 92274 91621 90980
64264 90980 90358 89653 88852 88185 87851 87755 87645 87439 87332 87630 88482 89686 90792 91562 92241 93151 94099 94540 94312
64245 94312 93854 93648 93884 94755 96582 99305 102211 104573 106370 108081 109912 111603 112847 113640 114174 114637
64229 114637 115098 115514 115819 116025 116121 115932 115304 114467 113927 113950 114367 114917 115451 115749 115599 115180 114931 114819 114307
64210 114307 113344 112822 113522 115080 116618 118004 119748 121923 124044 126063 128704 132586 137522 142892 148304
64195 148304 153732 159399 165670 172733 180285 187768 194948 201912 208481 214002 217775 219326 218251 214314
64181 214314 207922 200118 191885 183698 175793 168455 161851 156000 151127 147668 145670 144522 143553 142581 141611
64166 141611 140479 139237 138572 139214 141001 143033 144745 146406 148514 151163 154195 157630 161694 166553 172259
64151 172259 178811 186139 194084 202549 211602 221269 231220 240815 249528 257165 263557 268213 270547 270476 268573
64136 268573 265558 261765 257143 251512 244770 237114 229244 221994 215462 208834 201484 194001 187576 182541
64122 182541 178155 173826 169778 166260 162855 159159 155714 153596 153199 153907 154919 155972 157195 158600 159936
64107 159936 160943 161709 162723 164439 166786 169342 172079 175551 180135 185396 190565 195404 200147 204796
64093 204796 209020 212711 216112 219227 221592 222866 223310 223386 223107 222114 220237 217661 214569 210881 206485
64078 206485 201578 196673 192282 188654 185820 183821 182700 182234 181780 180674 178880 177135 176362 176956 178680
64063 178680 181126 184050 187254 190384 193175 195879 199154 203317 207853 211968 215552 219312 223884 229117
64049 229117 234385 239329 244099 249095 254731 261321 268861 276921 284906 292385 299106 304835 309419 312896
64035 312896 315372 316939 317979 319322 321675 324931 328454 332058 336309 341800 348571 356331 364828 373774
64021 373774 382904 392440 403064 414910 426837 437269 445672 452737 459168 464867 469429 472874 475499
64008 475499 477321 478083 477788 477036 476781 477827 480408 484136 488448 493254 499091 506597 515939 526836 539025
63993 539025 552545 567633 584530 603434 624511 647848 673399 701034 730718 762685 797398
63982 797398 835215 876082 919634 965599 1014103 1065655 1121016 1181109 1246901 1319346 1399543
63971 1399543 1488954 1589316 1702466 1830595 1976682 2144296 2336833 2557409 2809808 3099128
63961 3099128 3431007 3810292 4240557 4724099 5261227 5849322 6483214 7156791 7863921
63952 7863921 8597865 9350373 10111364 10868439 11605819 12304152 12942519 13501635 13966202
63943 13966202 14325611 14573637 14707531 14726574 14630709 14420268 14096964 13665473 13134820 12518912
63933 12518912 11835654 11104811 10345674 9575542 8808994 8057684 7330842 6636371 5981533
63924 5981533 5372537 4813775 4307670 3854914 3454365 3103003 2796674 2531058 2301754
63915 2301754 2103804 1931891 1781300 1648524 1531078 1427205 1335694 1255362 1184464 1120865
63905 1120865 1062855 1009430 959835 913364 869665 828679 790019 752917 717011 682695 650346
63894 650346 619646 590029 561432 534203 508541 484481 462153 441621 422547 404450 387245
63883 387245 371253 356740 343692 331946 321302 311583 302716 294660 287142 279707 272213 265010 258449
63870 258449 252497 247028 242130 237782 233644 229651 226497 224910 224580 224382 223602 222460 221430 220649 220067
63855 220067 219705 219548 219528 219648 219780 219322 217548 214490 211068 208121 205587 202764 199103 194597 189701 184971
63839 184971 180546 175939 170672 165110 160173 156124 152225 147898 143611 140142 137436 134819 132022 129345
63825 129345 126947 124599 122195 119948 118003 116314 114928 113954 113106 111755 109685 107423 105581 104160 102789
63810 102789 101406 100334 99823 99813 100091 100443 100642 100500 99960 99086 98021 97059 96567 96625 96845 96781 96414 96039 95692
63791 95692 95070 93982 92567 90966 89187 87430 86182 85637 85359 84936 84719 85377 86763 87853 87978 87529
63775 87529 87179 86881 86197 85258 84743 84915 85287 85435 85657 86450 87638 88452 88426 87896 87575 87854 88558 89188 89261
63756 89261 88617 87606 86883 86846 87273 87652 87822 88087 88703 89565 90554 91886 93809 96115 98338 100377 102576
63739 102576 105166 108030 111116 114711 119090 124173 129733 135681 141839 147706 152765 156874 160094 162328
63725 162328 163467 163722 163366 162236 159988 156828 153515 150529 147717 144918 142433 140571 139112 137668 136296
63710 136296 135309 134654 133968 133187 132562 131928 130491 127696 124058 120712 118264 116463 114979 114013 113838 114076
63694 114076 113930 113102 112164 111944 112866 114917 117816 120953 123522 125222 126744 129146 132779 137094 141450
63679 141450 145673 149822 153921 158089 162514 166946 170541 172576 173159 172881 171943 170002 166879 162948 158672
63664 158672 154066 148948 143617 138916 135452 132913 130442 127670 125077 123185 121806 120497 119531 119747 121393
63649 121393 123723 126020 128419 131261 134204 136706 139104 142372 146793 151654 156485 161850 168453 176013
63635 176013 183668 191254 199504 209015 219558 230564 241936 254103 267501 282228 298070 314612
63623 314612 331286 347519 362853 376834 388750 397681 403035 404990 404224 401326 396738 391277 386182
63610 386182 382183 378793 375010 370638 366371 362577 358602 353563 347252 339862 331298 321382 310526 299545
63596 299545 288876 278520 268693 259969 252631 246493 241514 238039 236089 234977 234093 233683 234269 235571
63582 235571 236696 237388 238481 240838 244274 247838 250995 254248 258623 264675 272043 279905 287781 295804
63568 295804 304322 313553 323744 335322 348528 363037 378192 393398 407975 420852 430968 437980
63556 437980 442160 443689 442632 439699 436399 434020 432828 432479 432764 433611 434794 436163 437876 439912 441463
63541 441463 441351 439041 434932 429671 423493 416169 407276 396485 383912 370188 355926 341213 325936
63528 325936 310530 295947 282809 270969 260046 249986 240817 232227 223796 215563 208042 201662 196374
63515 196374 191809 187609 183599 179837 176608 174239 172752 171768 170901 170241 170167 170598 170765 170032 168817 168273
63499 168273 169075 170907 173187 175821 178990 182652 186671 191209 196568 202732 209354 216086 222664 228854
63485 228854 234643 240310 245918 250817 254055 255246 254752 253039 250243 246284 241051 234514 227060 219686
63471 219686 213456 208612 204556 200712 197078 193879 191146 188842 187131 186308 186597 188003 190167 192386 194151
63456 194151 195690 197703 200572 204150 208237 212803 217710 222715 227879 233635 240407 248578 258760 271387
63442 271387 285916 301092 316325 332197 349369 367719 387027 407777 430539 454967 480053
63431 480053 504971 529018 551011 569497 583548 592890 597526 597833 594823 589678 583067 575393 567533
63418 567533 560643 555224 550875 546946 542888 537969 531230 521917 509688 494549 477064 458463 439912
63405 439912 421637 403332 385412 369152 355424 343889 333664 324240 315565 307800 301351 296687
63393 296687 293844 292429 292244 293405 295707 298502 301549 305443 310812 317556 325258 333830 343298 353500
63379 353500 364653 377708 393353 410804 428331 444996 461330 478370 496559 515504 534109
63368 534109 550805 564206 573792 579741 582190 581176 577256 571545 564928 557736 550358 543528 537609 532112
63354 532112 526401 520396 513984 506141 495550 482126 467192 451887 436019 418857 400574 382361
63342 382361 365326 349820 335792 323280 312298 302579 293737 285609 278284 271894 266487 261939 257790
63329 257790 253370 248396 243470 239700 237730 237311 237797 238707 239690 240391 240747 241193 242112 243133 243478 243073 242901
63312 242901 243940 246049 248195 249655 250644 251788 253272 254673 255473 255596 255347 254938 254218 253034 251711 250806
63296 250806 250282 249249 246896 243523 240338 238318 237577 237797 238734 240105 241360 241938 241707 240957 240089 239418
63280 239418 239114 239142 239362 239811 240702 242012 243299 244211 244966 246047 247534 249086 250491 251864 253340 254913
63264 254913 256594 258388 260051 261284 262215 263323 264747 266103 267229 268751 271498 275537 280134 284616
63250 284616 288994 293747 299240 305351 311587 317545 323363 329635 336843 344955 353667 362885 372824 383738
63236 383738 395667 408450 421926 436113 451174 467069 483332 499355 514892 530021 544651
63225 544651 558423 571291 583914 597237 611779 627337 643206 658656 673494 688242 703417
63214 703417 718521 732100 742887 750462 754607 754716 750367 742042 730664 716621 699797 680429 659425
63201 659425 637873 616601 596118 576648 558308 541534 527078 515310 505841 498302 493119 490942
63189 490942 491604 494382 499076 506035 515114 525469 536593 548906 563053 579126 596726 615259 633930
63176 633930 651934 668900 684871 699868 713969 727756 742002 756699 770933 783865 795211
63165 795211 804615 811244 814377 813810 809423 800956 788585 773112 755148 734658 711764 687415 662742
63152 662742 638195 613865 590193 567852 547303 528927 513125 499688 487572 475948 465149
63141 465149 455951 448376 441907 436473 432362 429374 426899 424685 422749 420699 418072 415316 413505 412975
63127 412975 413060 413289 413909 414976 415857 416141 416299 416840 417416 417376 416743 416026 415424 414860 414600 415151 416485 417879
63109 417879 418695 419075 419784 421489 424212 427342 430143 432230 433565 434194 434277 434320 434913 436077 437254 438131 439112
63092 439112 440603 442211 443178 443492 444098 445917 449018 452786 456621 460330 464074 468171 472823 477944 483362
63077 483362 489244 496032 503786 511754 519006 525472 532060 539638 548277 557684 567920 579202 591262
63064 591262 603532 615957 628999 642796 657051 672052 689053 708952 731124 754303 778322
63053 778322 804175 832528 862967 894753 927519 961014 994811 1028576 1062121 1094980 1126525
63042 1126525 1156841 1186950 1217769 1249158 1280383 1311148 1341754 1372536 1403565 1434648 1465192
63031 1465192 1494191 1520671 1543983 1563350 1577336 1584212 1582818 1572836 1554439 1528133 1494879 1455941
63019 1455941 1412582 1366099 1318077 1270186 1223696 1179440 1138213 1100903 1068174 1040329 1017544
63008 1017544 999955 987493 979885 976933 978567 984583 994604 1008335 1025580 1045839 1068208 1091873
62996 1091873 1116521 1142064 1168174 1194377 1220484 1246571 1272522 1297871 1322236 1345733 1368677
62985 1368677 1390859 1411274 1428657 1442193 1451517 1456007 1454402 1445399 1428572 1404419 1373548 1336164
62973 1336164 1292540 1243722 1191439 1137433 1083075 1029451 977371 927199 878988 833016 789991
62962 789991 750575 714878 682632 653661 627854 604768 583701 564312 546840 531524 518024
62951 518024 505695 494286 484049 475149 467229 459629 451886 444017 436471 429847 424430 419842 415234
62938 415234 409984 404202 398457 393095 388003 383000 378259 374089 370407 366634 362268 357482 353022 349525
62924 349525 347033 345161 343582 342225 341111 340131 339061 337759 336290 334749 332971 330591 327651 324971
62910 324971 323532 323376 323457 322791 321455 320189 319298 318394 317157 315922 315413 316048 317545 319041 319668 319259 318506
62893 318506 318250 318595 318859 318306 316692 314196 311143 307894 304801 302173 300316 299453 299391 299456 299126 298651 298734
62876 298734 299618 300861 301908 302493 302532 302170 301951 302369 303107 303310 302790 302338 302523 302830 302484 301502 300299 298756
62858 298756 296492 293777 291379 289531 287808 286004 284436 283246 282055 280560 278852 276915 274389 271235
62844 271235 268244 266361 265705 265627 265506 265144 264547 263851 263460 263848 264967 266128 266714 266914 267491 268823 270380
62827 270380 271331 271529 271660 272396 273690 275013 276055 276944 277958 279264 280858 282488 283724 284426 285119 286621
62811 286621 289240 292616 296338 300322 304497 308592 312562 316948 322405 328948 336036 343392 351516 361298
62797 361298 373251 387124 402167 417755 433783 450533 468242 487071 507509 530497 556789
62786 556789 586326 618564 653398 691505 733679 780095 830312 883801 940192 999064 1059691
62775 1059691 1121053 1182026 1241488 1298168 1350406 1396228 1433894 1462389 1481237 1489846 1487417 1473684
62763 1473684 1449521 1416485 1375824 1328328 1275110 1218077 1159306 1100100 1040899 982012 924194
62752 924194 868561 816152 767554 722798 681562 643569 608758 577095 548344 522221 498603
62741 498603 477374 458127 440335 423848 409010 396235 385629 376935 369615 363040 356977 351926
62729 351926 348558 346651 345022 342816 340500 339185 339250 340154 341470 343521 346870 351620 357472 364225 371959
62714 371959 380874 391132 402898 416369 431768 449243 468808 490363 513829 539251 566843 597032
62702 597032 630479 667767 708917 753354 800542 850490 903432 959057 1016208 1073198 1128237
62691 1128237 1179717 1226364 1267088 1300526 1324967 1339022 1342336 1335362 1318638 1292696 1258492 1217356
62679 1217356 1170482 1119019 1064681 1009513 954719 900300 846326 794031 745008 699675 657298
62668 657298 617454 580699 547648 518007 490932 465907 442883 421792 402470 385029 369856
62657 369856 356970 345618 334818 324252 314352 305478 297416 289900 283302 278277 274761 271878 268968
62644 268968 266241 264118 262335 260220 257632 255102 253036 251252 249424 247592 245959 244419 242554 240073
62630 240073 237097 234032 231258 228928 226994 225450 224464 224203 224571 225279 226184 227414 229026 230701 232019
62615 232019 233053 234509 237095 240796 244927 248935 252965 257551 263014 269512 277488 287542 299697 313247
62601 313247 327619 343062 360138 378956 399499 422425 448695 478179 509274 540267 570685
62590 570685 600945 631092 660316 687437 711265 730582 744300 751884 753396 749083 739233 724453
62578 724453 705748 684033 659727 633070 604765 576072 548140 521374 495559 470614 447061
62567 447061 425651 406656 389746 374447 360422 347303 334760 323036 313050 305507 299974 295172
62555 295172 290078 284405 278271 272002 266270 261740 258290 254990 251138 246983 243183 239992 237342 235350
62541 235350 234275 234109 234573 235418 236459 237500 238579 240125 242567 245902 249950 254792 260560 266967 273562
62526 273562 280366 287851 296402 306288 318058 332239 348546 366000 384116 403495 425022 448960
62514 448960 475098 503225 532962 563473 593812 623412 651871 678413 701870 721142 735477
62503 735477 744497 748154 746543 739605 727242 709811 688189 663243 635698 606741 578113 551013
62491 551013 525240 499993 475242 451764 430114 410314 392476 376973 363842 352587 342701 333944
62479 333944 326079 318902 312641 307737 303949 300191 295620 290509 285797 282125 279604 278176 277696 277856 278365
62464 278365 279185 280400 281974 283781 285742 287853 290230 293230 297202 301899 306459 310289 313829 318061
62450 318061 323340 328947 333774 337177 339152 339958 339751 338496 336065 332363 327393 321325 314592 307746 301076
62435 301076 294398 287482 280627 274504 269425 265034 260884 256979 253611 250917 248858 247504 247108 247888 249769
62420 249769 252248 254548 256196 257560 259546 262628 266411 270240 273952 277811 282062 286867 292411 298642
62406 298642 304989 310757 315905 321195 327483 334920 342841 350337 356963 362917 368487 373457 377318 380016
62392 380016 382006 383393 383519 381818 378764 375511 372820 370816 369599 369441 370315 371792 373686 376512 381070
62377 381070 387796 396669 407574 420607 436107 454456 475802 499987 526829 556415 588975 624554
62365 624554 662903 703506 745409 787103 827024 864302 898747 930001 956927 978057 992558
62354 992558 1000700 1003512 1002037 996796 987743 974588 957062 934962 908267 877484 843772 808470
62342 808470 772588 736942 702539 670389 640896 613810 588898 566323 546184 528015 511009
62331 511009 494606 478679 463322 448758 435416 423833 414277 406453 399624 393151 387039 381962 378698
62318 378698 377506 378037 379750 382247 385224 388302 391048 393194 394868 396524 398490 400527 401999 402550 402412
62303 402412 401883 400805 398842 396072 392912 389621 386279 383181 380721 378823 376954 374930 373374 373083 374168
62288 374168 376020 377951 379658 381262 383140 385696 389153 393529 398794 404941 411940 419755 428447 438119
62274 438119 448873 460995 475058 491456 509860 529537 550367 573219 599134 628396 660529
62263 660529 694800 730415 766402 801610 834801 864683 890080 910224 924729 933252 935499 931775
62251 931775 923168 910837 895240 876321 854258 829686 803235 775185 745679 715146 684502 654963
62239 654963 627563 602684 580152 559774 541681 526102 513058 502303 493306 485231 477392 470002
62227 470002 464079 460204 457654 455193 452501 450321 449290 449172 449280 449270 449341 449940 451372 453512 455874 458097
62211 458097 460274 462699 465468 468623 472432 477056 482046 486758 491360 496933 504361 513491 523585 534225
62197 534225 545494 557624 570827 585323 601220 618319 636145 654047 671253 687107 701496
62186 701496 714867 727575 739369 749721 758648 767003 776024 786713 799576 814766 832391 852721
62174 852721 876010 902150 930599 960612 991237 1021030 1048160 1071207 1089796 1104252 1114848
62163 1114848 1121752 1125547 1127139 1126935 1124472 1119200 1111385 1102011 1091858 1081007 1069183 1056324 1042831
62150 1042831 1029488 1017197 1006577 997666 990103 983633 978343 974410 971865 970699 970944 972380 974327
62137 974327 976125 977787 979874 982674 985893 989316 993396 998788 1005480 1012832 1020495 1028901 1038667 1049701
62123 1049701 1061214 1072568 1083969 1096223 1109953 1125193 1141728 1159548 1178780 1199336 1220963
62112 1220963 1243576 1267046 1290486 1312219 1330975 1347047 1361992 1377306 1393720 1411476 1430551
62101 1430551 1450313 1469402 1486474 1501101 1513889 1525933 1538319 1551911 1567185 1584094 1602228
62090 1602228 1621175 1640858 1661655 1684262 1709306 1736886 1766472 1797329 1829057 1861594 1894712
62079 1894712 1927658 1959565 1990227 2020310 2050584 2081017 2110867 2139600 2167363 2194371 2220167
62068 2220167 2243877 2265012 2283617 2299585 2312230 2320697 2324692 2324759 2321998 2317462 2311567 2304026 2294463
62055 2294463 2282971 2269812 2254789 2237451 2218114 2198258 2179566 2162770 2147514 2133038 2118731
62044 2118731 2104384 2090332 2077265 2065586 2055026 2045145 2036009 2028013 2021104 2014642 2008081 2001435 1994840
62031 1994840 1988010 1980493 1972370 1964355 1957055 1950342 1943638 1936764 1930226 1924556 1919556 1914436 1908592 1902071
62017 1902071 1895350 1888968 1883336 1878538 1874179 1869722 1865136 1861002 1857797 1855327 1853050 1850653 1848045 1844999
62003 1844999 1841202 1836652 1831707 1826635 1821182 1814536 1805766 1794494 1781240 1766830 1751349 1734041 1714462
61990 1714462 1693317 1671846 1650814 1630606 1611825 1594938 1579480 1564434 1549498 1535272 1522054
61979 1522054 1509249 1496294 1483445 1471208 1459568 1448314 1437622 1427695 1418169 1408534 1398926 1389899
61967 1389899 1381533 1373420 1365437 1357904 1350871 1343886 1336697 1329702 1323366 1317583 1311971 1306513 1301540 1297167
61953 1297167 1293147 1289329 1286002 1283674 1282616 1282756 1283983 1286400 1290198 1295332 1301555 1308814 1317430 1327723
61939 1327723 1339589 1352726 1367153 1383188 1400910 1419998 1440229 1461881 1485456 1511201 1539159
61928 1539159 1569549 1602849 1639517 1679843 1724238 1773637 1829509 1893306 1965786 2046976 2137027
61917 2137027 2237071 2349055 2474785 2615507 2772453 2947228 3141229 3354979 3588548
61908 3588548 3842427 4117346 4413023 4727364 5056692 5395914 5737854 6072706 6388473
61899 6388473 6671914 6909158 7086471 7192082 7218560 7164237 7033094 6833746 6578015 6279221
61889 6279221 5950616 5604627 5252680 4904668 4568102 4247895 3947087 3667488 3409682
61880 3409682 3173109 2956802 2759990 2581789 2420690 2274921 2143237 2024890 1918841
61871 1918841 1823438 1737041 1658668 1587926 1524515 1467855 1416991 1370835 1328771 1291021 1258150
61860 1258150 1230091 1205971 1184920 1166714 1151445 1138887 1128438 1119467 1111568 1104686 1099172 1095383
61848 1095383 1092965 1090796 1088015 1084869 1082106 1079796 1077337 1074594 1072396 1071670 1072483 1074225 1076374 1078806
61834 1078806 1081604 1084915 1088916 1093648 1098930 1104602 1110689 1117108 1123278 1128415 1132336 1135803 1139931 1145361
61820 1145361 1152111 1160076 1169372 1180124 1192080 1204744 1217958 1232259 1248508 1267241 1288535 1312458
61808 1312458 1339421 1369949 1404264 1442285 1484005 1529627 1579279 1632815 1690100 1751505 1817867
61797 1817867 1889918 1967887 2051852 2142430 2240885 2348614 2466777 2596583 2739676 2898019
61787 2898019 3073479 3267784 3482794 3720538 3982954 4271889 4589452 4938112 5320246
61778 5320246 5737614 6191235 6681324 7206746 7764174 8347546 8947849 9552725 10145794
61769 10145794 10706457 11210947 11634488 11953745 12149047 12206632 12121111 11897268 11549668 11099665
61759 11099665 10571459 9989269 9376015 8752420 8135847 7539571 6972973 6442089 5949867
61750 5949867 5496589 5080984 4701430 4356230 4043181 3759546 3502722 3270651 3061394
61741 3061394 2872597 2701586 2545953 2403923 2274304 2156181 2048575 1950283 1860125 1777389
61731 1777389 1701866 1633367 1571326 1514977 1463659 1416732 1373372 1332843 1294997 1260197 1228593
61720 1228593 1199640 1172479 1146660 1122321 1099667 1078463 1058125 1038268 1019010 1000684 983323
61709 983323 966605 950308 934607 919827 906124 893549 882215 872021 862313 852213 841379 830142
61697 830142 818894 807730 796857 786871 778260 770810 763866 757025 750213 743270 735912 728147 720355
61684 720355 712866 705740 698956 692482 686067 679314 672102 664710 657343 649845 642063 634280 627025 620534
61670 620534 614567 608665 602567 596553 591406 587794 585493 583485 580961 578040 575358 573320 572009 571473
61656 571473 571631 572038 572207 572126 572122 572228 572072 571380 570250 568890 567405 565898 564549 563440 562468 561447 560246
61639 560246 558920 557794 557208 556968 556312 554794 552949 551640 550975 550457 550017 550097 550703 551173 551165 551139 551468 551712
61621 551712 551273 550252 549084 547724 545741 542967 539535 535560 531305 527382 524241 521546 518524 514819
61607 514819 510650 506373 502349 499007 496481 494270 491791 489146 486846 484917 482939 480895 479295 478403
61593 478403 477989 477999 478840 480751 483372 486146 488712 490791 492263 493631 495874 499477 504045 509118 514795
61578 514795 521220 528011 534814 541940 549867 558490 567544 577514 589328 603188 618372 634285 651062
61565 651062 668916 687460 705976 724059 741670 758822 775456 791523 807008 821898 836185
61554 836185 849745 862283 873641 884264 895087 906737 918973 930981 942061 951919 960504 967856
61542 967856 974054 979086 982677 984340 983728 980962 976587 971120 964626 956872 948076 939323 931886 926069
61528 926069 921005 915838 910835 907067 905188 904963 905984 908399 912715 919223 928017 939451 954179 972605
61514 972605 994560 1019702 1048188 1080828 1118616 1162150 1211469 1266398 1327055 1394014 1467991
61503 1467991 1549475 1638785 1736368 1842757 1958122 2082047 2213773 2352393 2496507 2643735
61493 2643735 2790573 2932522 3064259 3180190 3275501 3346939 3392569 3411225 3402778 3369019 3313718
61482 3313718 3241472 3156605 3063060 2964778 2865630 2768953 2677186 2591624 2512305 2438440 2369440
61471 2369440 2305594 2247619 2195746 2149555 2108621 2072919 2042537 2017326 1997091 1981897 1971873
61460 1971873 1966778 1966038 1969342 1977019 1989610 2007143 2028942 2054027 2081433 2110174 2139369 2168763
61448 2168763 2198911 2230493 2263504 2297370 2331765 2366922 2403092 2440050 2477224 2513981 2549636
61437 2549636 2583392 2614518 2642561 2667350 2688968 2707692 2723775 2737224 2747963 2756115 2761821 2764760
61425 2764760 2764283 2760167 2752934 2743242 2731298 2717068 2700810 2683065 2664203 2644145 2622490 2598918
61413 2598918 2573675 2547740 2522237 2497703 2474259 2452486 2433573 2418262 2406034 2395620 2386009
61402 2386009 2376677 2367283 2357616 2347609 2337079 2325709 2313659 2301888 2291442 2282697 2275754 2271310
61390 2271310 2270591 2274610 2284041 2299700 2322614 2353629 2393396 2442671 2502154 2572135 2652750 2744444
61378 2744444 2847631 2961916 3086247 3219778 3361917 3511380 3665709 3821729 3975781
61369 3975781 4123285 4258827 4377273 4474649 4547970 4594978 4614688 4607868 4576362 4521938 4446065
61358 4446065 4350591 4238163 4111888 3974723 3829206 3677650 3522557 3366756 3213015 3063512
61348 3063512 2919848 2783410 2655378 2536344 2426265 2324931 2232298 2148357 2072986 2006061
61338 2006061 1947510 1897229 1855124 1821100 1794683 1774772 1760271 1751005 1747518 1749863 1757140 1768383
61326 1768383 1783338 1802035 1824098 1848984 1876630 1907405 1941429 1978077 2015957 2053286 2088598
61315 2088598 2121264 2151052 2177161 2198181 2213267 2222950 2228531 2231132 2231627 2230921 2229636 2227705 2224781
61302 2224781 2220872 2216163 2210448 2203238 2194387 2184184 2172800 2159975 2145274 2128432 2109512 2088920
61290 2088920 2067186 2044642 2021399 1997683 1973872 1950166 1926642 1903836 1882722 1863700 1846060
61279 1846060 1828940 1812448 1797296 1783711 1771448 1760673 1751971 1745306 1739515 1733049 1724874 1714539
61267 1714539 1701779 1686335 1668114 1647575 1625996 1605114 1586248 1569969 1556770 1547624 1543474 1544577
61255 1544577 1550966 1563252 1582309 1608322 1640940 1680298 1727161 1781904 1843936 1912197 1985612
61244 1985612 2062904 2142582 2223229 2303114 2379262 2447633 2504714 2548584 2578153 2591901 2588044
61233 2588044 2565779 2526020 2471080 2403931 2327600 2244923 2158757 2072227 1988375 1909307 1835836
61222 1835836 1767903 1704970 1646032 1589908 1535982 1484406 1435405 1388822 1344730 1304125 1268429
61211 1268429 1238351 1213514 1193159 1176901 1164856 1157231 1153825 1153779 1155821 1158664 1161129 1162114 1160967
61198 1160967 1158001 1154265 1150642 1147450 1144820 1142774 1140616 1136946 1130889 1122969 1114226 1104835 1094195 1082073
61184 1082073 1068877 1054825 1039610 1023156 1006088 989081 972047 954381 935904 917335 899839
61173 899839 884135 870023 856714 843695 831274 820225 811010 803478 797254 792228 788574 786384 785247
61160 785247 784194 782106 778168 771808 762298 748899 731637 711646 690407 668846 647443 626825
61148 626825 607667 590035 573408 557521 542834 530101 519803 512019 506398 502080 498100 494200
61136 494200 491024 489283 488953 489557 490890 493103 496214 499992 504319 509384 515533 523174 532725 544197
61122 544197 556770 569199 580875 592194 603672 615077 625763 635503 644395 652024 657349 659596
61110 659596 658789 655261 649163 640861 631376 621841 612671 603727 595119 587230 579973 572670 564968 557369
61096 557369 550494 544141 537500 530130 522329 514612 507148 499784 492425 485218 478465 472390 467043 462467
61082 462467 458849 456392 454932 453823 452347 450258 447988 446382 446153 447352 449280 451007 452064 452632 453214
61067 453214 454367 456654 460430 465403 470555 474795 477790 480244 483345 487768 493016 497832 501471 504423
61053 504423 507649 511362 515070 518690 522916 528272 534412 540685 546947 553470 560483 568225 577107 587328
61039 587328 598530 610227 622376 635265 649101 664085 680669 699249 719721 741778 765540
61028 765540 791563 820265 851652 885515 921562 959434 998776 1039225 1080251 1121435 1163256
61017 1163256 1207381 1255847 1310244 1371915 1442344 1522759 1613735 1715946 1831260 1962832 2114804
61006 2114804 2292689 2503524 2754715 3053210 3406887 3826443 4325045 4917427 5621684
60997 5621684 6461561 7464558 8657910 10067133 11708502 13557507 15499686 17312410
60989 17312410 18726419 19549591 19766021 19535153 19103553 18707680 18520635 18626168 18986138
60980 18986138 19418656 19640514 19384502 18524046 17119229 15362872 13481013 11656064 9999286
60971 9999286 8558422 7337821 6318418 5472574 4772077 4191230 3708453 3307087 2974069
60962 2974069 2697456 2465661 2268808 2099674 1952912 1824025 1709333 1606204 1512810 1427871
60952 1427871 1350702 1280949 1217995 1160904 1109070 1062412 1020621 982502 946355 910863 875539
60941 875539 840685 807147 775892 747491 721987 699223 679059 661226 645293 630943 618031
60930 618031 606237 594949 583713 572632 562108 552372 543420 535188 527493 519947 512202 504278 496444
60917 496444 488850 481496 474524 468264 462933 458393 454283 450253 446080 441774 437699 434513 432762 432375
60903 432375 432578 432383 431261 429406 427422 425824 424833 424452 424535 424778 424802 424434 423928 423888 424830 426633 428413 429195
60885 429195 428948 428773 429772 431807 433724 434753 435232 435840 436602 436989 436660 435606 433793 431212 428258 425548
60869 425548 423200 420656 417449 413834 410501 407962 406512 406449 407842 410212 412903 415818 419386 423705 428163
60854 428163 432172 435906 439962 444580 449619 455109 461242 467793 474134 480028 485867 491766 496963 500706
60840 500706 503469 506568 510592 514880 518730 522449 526830 532047 537574 542909 547810 551989 555183 557587
60826 557587 559785 562082 564196 565655 566191 565692 564233 562325 560724 559615 558301 556033 552906 549499 545859
60811 545859 541436 536019 530169 524462 518734 512442 505559 498753 492743 487678 483143 478687 474346 470684
60797 470684 468144 466393 464576 462376 460469 459616 459576 459365 458533 457721 457923 459590 462548 466306 470204 473657
60781 473657 476696 480107 484624 490034 495414 500194 504556 508766 512644 516055 519559 524061 529852 536417
60767 536417 543163 549874 556331 562066 566953 571703 577168 583126 588345 592021 594692 597419 600469 603211
60753 603211 605092 606154 606676 606825 606850 607145 607742 607937 606732 603680 599173 593995 588805 583976 579650 575680
60737 575680 571603 566885 561415 555765 550808 546951 543818 540771 537641 534691 531962 529026 525574 521979
60723 521979 518909 516431 513816 510346 506105 501815 498031 494703 491404 487716 483408 478532 473588 469372
60709 469372 466374 464313 462507 460682 459179 458382 458294 458819 460051 461942 463895 465089 465215 464655 463983 463489
60693 463489 463108 462465 460954 458073 453836 448726 443228 437569 431857 426134 420164 413468 405913 398222 391678
60678 391678 387120 384198 381669 378557 375041 372084 370195 368872 367424 366000 365369 365889 367122 368431 369543
60663 369543 370603 372120 374802 378907 383705 388146 392151 396619 401933 407143 411040 413513 415420 417613
60649 417613 420644 424874 430062 435040 438504 440200 440955 441718 443084 445497 449172 453718 458413 462974 467654
60634 467654 472649 477953 483758 490353 497526 504778 512312 521001 530895 540413 547813 553084 557664 562495
60620 562495 567113 570722 573357 575592 577584 578949 579441 579273 578724 577757 576230 574221 571904 569179 565657
60605 565657 560981 554940 547341 538208 528253 518740 510511 503330 496527 490114 484847 481273 479159 477866
60591 477866 476835 475690 474376 473438 473773 475692 478432 480899 482784 484674 487183 490280 493529 496682 499833
60576 499833 503101 506371 509433 512235 514796 516992 518646 519811 520633 520853 519801 517211 513737 510361 507531
60561 507531 505191 503341 502064 501212 500583 500311 500571 501151 501955 503748 507588 513547 520823 529263 539750
60546 539750 552771 567642 583894 602593 625334 652322 682273 713886 746530 779487 811133
60535 811133 838908 859810 871319 872601 864826 849941 829386 804399 777099 750275 726042 705319
60523 705319 688538 676053 667673 662502 659610 658516 658894 660269 662205 664484 667064 670214 674641 680947
60509 680947 689013 698476 709889 724711 743979 767625 795401 827835 865803 909660 959140 1013593
60497 1013593 1071798 1131966 1192601 1253305 1314575 1377282 1442903 1514047 1594240 1687270 1796838
60486 1796838 1926302 2077945 2252316 2448251 2662678 2889239 3116789 3329912 3511594
60477 3511594 3646118 3720914 3727858 3664594 3535370 3350727 3126018 2878843 2625789 2379624
60467 2379624 2148410 1936544 1746166 1577813 1430632 1302745 1191736 1095001 1010165 935600
60457 935600 870487 814202 765712 723766 687440 656105 628800 604121 581127 560209 542541
60446 542541 528511 517054 506704 496862 487577 478503 468919 458886 449611 442240 436761 432380 428502
60433 428502 424843 421029 416682 411810 406630 401158 395411 389818 384994 381223 378583 377368 377767 379270
60419 379270 381002 382639 384413 386230 387551 388282 389101 390572 392503 394542 396867 399870 403558 407726 412374
60404 412374 417565 423135 428915 434960 441191 447149 452566 457934 463945 470476 476633 481765 485993 489707
60390 489707 492996 495717 497741 498935 499187 498730 498336 498891 500592 502618 503791 503680 502949 502452 502188 501515
60374 501515 500243 498951 498079 497299 496073 494367 492445 490432 488545 487262 486655 485926 484422 482919 483044
60359 483044 485316 488478 490966 492442 493631 495186 497134 499126 500877 502522 504590 507424 510577 513101
60345 513101 514493 514942 514628 513347 511054 508336 505923 504050 502536 501162 499686 497891 496008 494767 494582
60330 494582 494949 495125 495210 496003 497839 500089 501889 502941 503483 503788 503891 503653 503006 502233 501945 502573 503906
60313 503906 505359 506629 507739 508480 508267 506837 504808 503197 502401 501904 500935 499146 496619 493531 490122
60298 490122 486910 484528 483096 481904 479962 476827 472794 468461 464439 461412 459925 459900 460633 461535 462640
60283 462640 464230 466322 468821 471856 475483 479279 482788 486295 490574 495724 500831 505074 508782 513009
60269 513009 518330 524435 530781 537175 543662 550217 556790 563486 570446 577529 584322 590605 596672 603042
60255 603042 609915 617144 624738 633131 642758 653623 665560 678784 693809 710758 729075 748139
60243 748139 768070 789760 814201 841903 872964 907507 945881 988440 1035338 1086669 1142737
60232 1142737 1203895 1270092 1340797 1415427 1493544 1574506 1657219 1740431 1822927 1903103 1978655
60221 1978655 2047268 2107644 2159511 2202701 2236650 2260815 2275141 2279989 2275970 2263959 2244975 2219979
60209 2219979 2190176 2157575 2124767 2093851 2065837 2041264 2020972 2006026 1997294 1995537 2001602 2016032
60197 2016032 2038717 2069359 2108207 2155854 2212390 2277165 2349319 2428029 2512095 2599652 2688382
60186 2688382 2775735 2858915 2935162 3002309 3058884 3103587 3135082 3152558 3156146 3146433 3123796 3088617
60174 3088617 3041991 2985742 2921784 2851903 2778251 2703604 2630857 2562539 2500884 2447879 2404720
60163 2404720 2371396 2347275 2332177 2326607 2331111 2345841 2370661 2405071 2447733 2496449 2548815 2602552
60151 2602552 2655104 2703577 2745644 2780176 2806531 2823716 2831047 2829350 2820536 2805890 2785682 2760725
60139 2760725 2733384 2706467 2681871 2661045 2646162 2639783 2643414 2657286 2681683 2717749 2766677 2828695
60127 2828695 2903457 2991265 3093455 3211555 3346335 3497763 3665603 3849641 4049153 4262434
60117 4262434 4487173 4721151 4962030 5206369 5449366 5685969 5911850 6122944 6314544
60108 6314544 6481689 6620435 6728239 6803142 6843325 6847715 6816520 6750877 6652375 6523282 6367009
60097 6367009 6188042 5991582 5783346 5569280 5354900 5144868 4943339 4754406 4581703
60088 4581703 4427507 4292586 4177055 4081152 4005089 3948445 3910139 3889063 3884506 3895780 3921544
60077 3921544 3959684 4007836 4063706 4124787 4187953 4249610 4306222 4354630 4392074 4416387 4426335
60066 4426335 4421788 4403509 4372755 4330721 4278005 4214637 4140856 4057814 3967310 3870977 3770147
60055 3770147 3666429 3561946 3458845 3358898 3263656 3174572 3092754 3018994 2954289 2899947 2856899
60044 2856899 2825241 2804864 2796252 2800184 2816823 2845617 2886096 2938263 3002036 3076535 3160091 3250672
60032 3250672 3346038 3443420 3539209 3629187 3709411 3777023 3830181 3867264 3886649 3887487 3870307 3836296
60020 3836296 3786143 3720131 3639436 3546826 3445939 3340248 3232917 3127094 3025674 2930689
60010 2930689 2843297 2764504 2695692 2638288 2593099 2560221 2539555 2531145 2534922 2550538 2577824 2617243
59998 2617243 2669401 2734159 2810754 2898773 2998331 3108846 3228184 3353412 3481813 3610468
59988 3610468 3735233 3851125 3953862 4040601 4109415 4158861 4188180 4197166 4185629 4153550 4101902
59977 4101902 4032682 3947979 3849830 3741426 3627714 3514028 3404373 3301425 3207546 3124926
59967 3124926 3054895 2997876 2954107 2923894 2907171 2903346 2911766 2932097 2964184 3007759 3062247 3126590
59955 3126590 3199261 3278594 3362985 3450579 3538936 3625300 3707087 3782084 3848561 3905606 3953083
59944 3953083 3990891 4018580 4036203 4045147 4047444 4044492 4037390 4028508 4021802 4021231 4029549 4048940 4082010
59931 4082010 4131447 4199154 4286276 4393815 4522618 4672899 4844193 5035656 5245947 5472753
59921 5472753 5712665 5961345 6213370 6461768 6697922 6912188 7095028 7238198 7335484 7382730
59911 7382730 7377603 7319980 7212872 7062621 6877598 6666456 6437284 6197737 5955209 5716592
59901 5716592 5487929 5274105 5078560 4903168 4748548 4614713 4501707 4410007 4340343 4292894
59891 4292894 4266650 4259855 4271192 4300222 4346647 4409608 4487827 4579782 4683143 4794306 4908896
59880 4908896 5022531 5130796 5228853 5311671 5374546 5413083 5423189 5402020 5349205 5266829 5158285
59869 5158285 5027503 4879100 4718521 4551566 4383680 4219275 4061199 3910972 3769937
59860 3769937 3639905 3522054 3415442 3317483 3225959 3139931 3058867 2982153 2910004 2843870 2785118
59849 2785118 2733834 2689500 2652265 2622688 2600554 2584764 2574234 2568182 2565468 2564230 2562341 2557987
59837 2557987 2550058 2538480 2524104 2507752 2489335 2468234 2444358 2418178 2389725 2358356 2323860
59826 2323860 2287299 2250363 2214304 2179938 2148324 2120801 2098191 2080283 2066271 2055650 2048756
59815 2048756 2046523 2049691 2058183 2071382 2089016 2111439 2138757 2169883 2202859 2236083 2268776 2300192
59803 2300192 2328897 2353246 2372321 2386073 2394808 2399103 2400270 2400336 2401245 2404272 2410363 2420726 2436785
59790 2436785 2459773 2490722 2530846 2581717 2645141 2722973 2816855 2927855 3056516 3203539 3370295
59779 3370295 3558226 3767707 3997547 4245119 4505859 4771717 5029729 5262108 5448395
59770 5448395 5569462 5612432 5574373 5462655 5292072 5080981 4848207 4610655 4381245 4168027
59760 4168027 3975118 3804531 3657265 3533289 3431267 3348794 3283213 3232554 3195803 3172258
59750 3172258 3160759 3159922 3169049 3188256 3217507 3256026 3303027 3358668 3423899 3499637 3586492 3685054
59738 3685054 3796042 3920241 4058579 4212152 4382006 4569133 4774875 5000942 5248687
59729 5248687 5518682 5811431 6128129 6470021 6837057 7227589 7639146 8068637 8511452
59720 8511452 8960820 9408339 9845116 10262711 10653918 11013664 11339836 11633832 11900578
59711 11900578 12147568 12382952 12613869 12845998 13083691 13329367 13582551 13840027 14097088
59702 14097088 14348281 14587142 14806287 14998667 15158794 15282816 15368177 15413962 15421535 15394590
59692 15394590 15338710 15261147 15170572 15076209 14986748 14910059 14853646 14824834 14830278 14875468 14964828
59681 14964828 15102021 15289850 15529865 15822191 16165685 16558069 16995776 17473637 17984463
59672 17984463 18518362 19062022 19598709 20109222 20572994 20968566 21274093 21469200 21537951
59663 21537951 21471129 21266999 20931494 20478411 19928573 19307044 18639699 17951062 17263422
59654 17263422 16595946 15963361 15374914 14833750 14336292 13871969 13424312 12973788 12501751
59645 12501751 11994740 11448052 10866937 10264435 9657079 9060778 8488280 7948223 7445574
59636 7445574 6982808 6560656 6177942 5831748 5518805 5236662 4983117 4755079 4549132
59627 4549132 4363173 4196489 4048141 3916245 3799013 3695430 3604438 3524344 3453728 3392194
59617 3392194 3339476 3294270 3254578 3218872 3186332 3156197 3127397 3098623 3068464 3035685 2999651
59606 2999651 2960146 2916650 2868454 2815898 2760848 2705237 2649618 2593820 2538606 2485780 2436769
59595 2436769 2391922 2351176 2314653 2282395 2254096 2229444 2208404 2191022 2177234 2166995 2160377
59584 2160377 2157448 2158073 2161838 2168119 2176444 2186887 2199855 2215298 2232446 2250623 2269941 2290792
59572 2290792 2313004 2336100 2360280 2386571 2415973 2448913 2485581 2526389 2571962 2622909 2679688
59561 2679688 2742477 2811266 2886293 2968272 3057950 3155564 3260973 3374233 3495697 3625692
59551 3625692 3764297 3911194 4065303 4224674 4387114 4550904 4714659 4876680 5034601
59542 5034601 5185090 5323259 5442897 5538588 5608336 5653979 5679168 5687273 5680773 5661342 5629701
59531 5629701 5585794 5529717 5462582 5386650 5305063 5221562 5139962 5063562 4995205 4937890 4894886
59520 4894886 4869089 4862688 4877599 4915708 4978334 5065742 5177312 5311719 5466561 5638011 5821005
59509 5821005 6009338 6195319 6369828 6523371 6647232 6733802 6776791 6772185 6719177 6619740
59499 6619740 6477408 6296914 6084844 5849746 5600920 5347052 5095750 4853502 4625276
59490 4625276 4414181 4221970 4049985 3899360 3770330 3661940 3572910 3502698 3451401 3418701
59480 3418701 3403416 3404257 3420658 3452551 3499540 3560654 3634810 3721125 3818627 3925803 4040457
59469 4040457 4159848 4280903 4400375 4514819 4620437 4713100 4788724 4843661 4874755 4879438
59459 4879438 4856254 4805412 4728627 4628382 4507421 4368865 4216474 4054522 3887279 3718405
59449 3718405 3550619 3385933 3226187 3073227 2928538 2792939 2666772 2550180 2442936
59440 2442936 2344328 2253554 2170191 2094041 2024732 1961870 1905457 1855819 1813010 1776494 1745396
59429 1745396 1718914 1696595 1678354 1664157 1653688 1646638 1643298 1644232 1649111 1656580 1665812 1677383 1691574
59416 1691574 1706224 1717482 1722752 1722143 1717327 1710237 1703025 1697994 1696751 1699958 1708071 1721428 1739108
59403 1739108 1758547 1776981 1792940 1806187 1817213 1827530 1839720 1856164 1877862 1904910 1937571
59392 1937571 1976196 2020564 2070294 2125800 2188151 2257974 2335126 2419487 2511686 2612991 2724771
59381 2724771 2848038 2983266 3130811 3291669 3467649 3660727 3872660 4105429 4361424
59372 4361424 4642604 4949752 5282812 5641250 6023244 6424694 6839599 7261140 7681994
59363 7681994 8094349 8490899 8866098 9216126 9538120 9830392 10093199 10328118 10536294
59354 10536294 10717747 10872069 10998518 11094830 11156617 11178328 11154339 11079152 10947827 10757436
59344 10757436 10508275 10203703 9849574 9454328 9028875 8585224 8134726 7687467 7252452
59335 7252452 6837217 6446906 6084127 5749929 5444789 5168677 4920584 4698429 4499689
59326 4499689 4322275 4164813 4026054 3904228 3797264 3703604 3622401 3552761 3493139 3441716
59316 3441716 3397096 3358193 3323607 3291545 3260598 3230425 3201514 3174250 3148243 3122593 3096663
59305 3096663 3070516 3044597 3019361 2995389 2973599 2954867 2939429 2927020 2917769 2912626 2912662 2917982
59293 2917982 2927302 2938467 2949553 2959964 2970858 2984453 3002837 3027405 3059213 3099290 3148306
59282 3148306 3206074 3271618 3343631 3420835 3502086 3586299 3672128 3757631 3840386 3917992 3988282
59271 3988282 4048992 4097643 4132130 4151423 4155566 4145154 4121019 4084176 4035692 3976515 3907652
59260 3907652 3830517 3746961 3658886 3567902 3475332 3382323 3289823 3198480 3108714 3021012 2936247
59249 2936247 2855624 2780111 2709835 2644175 2582609 2525408 2473331 2426709 2385080 2347838 2315127
59238 2315127 2287882 2266989 2252513 2243853 2240570 2242898 2251524 2267089 2290098 2321183 2361213 2411066
59226 2411066 2471381 2542595 2625317 2720793 2831004 2958022 3103104 3266514 3448371 3649293
59216 3649293 3869735 4108722 4363621 4630995 4906976 5186270 5461161 5721996 5958813
59207 5958813 6162582 6325415 6440478 6502347 6507711 6455938 6349191 6192033 5990842 5753454
59197 5753454 5489150 5208396 4921758 4638342 4364822 4105672 3864002 3641959 3440499
59188 3440499 3259309 3097452 2954167 2828870 2720412 2626816 2546076 2477046 2419193 2371556
59178 2371556 2332379 2299909 2273217 2251967 2235506 2222483 2211353 2201138 2191741 2183761 2178042 2175261
59166 2175261 2175627 2178813 2184134 2190875 2198480 2206475 2214342 2221604 2228045 2233646 2238239 2241311 2242279 2240812
59152 2240812 2236813 2230256 2221230 2210084 2197278 2183072 2167434 2150235 2131556 2111923 2092357 2073962
59140 2073962 2057326 2042457 2029430 2018765 2010902 2005628 2002525 2001758 2003862 2008772 2015756 2024496 2035652
59127 2035652 2050034 2067704 2088318 2112005 2139337 2170645 2205830 2244884 2288131 2335765 2387395
59116 2387395 2442197 2499411 2558579 2619304 2680856 2742094 2801867 2859506 2914802 2967484 3016959
59105 3016959 3062711 3104876 3144269 3181918 3218662 3255021 3291205 3327310 3363777 3401703 3442327
59094 3442327 3485951 3531398 3576663 3619923 3659630 3693820 3719883 3735374 3738746 3728939 3704549 3664034
59082 3664034 3606781 3533395 3444894 3342400 3228022 3105366 2978331 2849597 2720740 2593380
59072 2593380 2469328 2349778 2235347 2127123 2026763 1935067 1851101 1773265 1700843 1634058
59062 1634058 1573034 1517333 1466317 1419457 1376332 1336737 1300764 1268466 1239426 1212789 1187718
59051 1187718 1163768 1141108 1120550 1103054 1088881 1077378 1067779 1059996 1054346 1050780 1048733 1047538
59039 1047538 1046577 1045185 1042883 1039756 1036293 1032829 1029366 1025858 1022392 1019190 1016726 1015652 1016166 1017483
59025 1017483 1018394 1018510 1018599 1019583 1021567 1024033 1026651 1029562 1032985 1036917 1041266 1046173 1052033 1059110 1067164
59010 1067164 1075730 1084847 1095205 1107225 1120212 1132846 1144469 1155401 1165921 1175409 1182712 1186970
58998 1186970 1187879 1185525 1180407 1173374 1165152 1155971 1145973 1135887 1126898 1119749 1114265 1109837 1106138 1103207
58984 1103207 1101140 1100039 1100214 1102004 1105188 1108819 1111958 1114606 1117629 1121704 1126566 1131445 1135980 1140433
58970 1140433 1145174 1150362 1156215 1163248 1172000 1182676 1195194 1209419 1225162 1242006 1259359 1276750
58958 1276750 1294008 1311163 1328242 1345157 1361738 1377827 1393362 1408379 1423032 1437632 1452670
58947 1452670 1468702 1486152 1505209 1525819 1547771 1570915 1595495 1622217 1651722 1683912 1718055
58936 1718055 1753759 1791668 1832982 1878344 1927431 1979653 2035017 2094115 2157361 2224357 2294120
58925 2294120 2365964 2440214 2518040 2600624 2688628 2782559 2883401 2992509 3110914 3239139
58915 3239139 3377900 3528653 3692996 3871687 4064607 4271751 4493876 4732145 4987463
58906 4987463 5260337 5550997 5859217 6183993 6523669 6876442 7240592 7614075 7993693
58897 7993693 8374458 8749658 9111693 9453013 9766274 10043881 10277985 10461317 10587923
58888 10587923 10653064 10653136 10586701 10455783 10265744 10023731 9737559 9415856 9068229 8704307
58878 8704307 8332465 7959451 7590765 7230850 6882984 6549412 6231641 5930435 5645747
58869 5645747 5377112 5124282 4887243 4665603 4458276 4263981 4081909 3911755 3753233
58860 3753233 3605749 3468585 3341286 3223714 3115651 3016422 2925076 2840977 2764129 2694768
58850 2694768 2632736 2577417 2528201 2484783 2446973 2414456 2386871 2364041 2345989 2332800 2324553
58839 2324553 2321272 2322696 2328117 2336672 2347964 2362327 2380378 2402431 2428516 2458825 2493836 2533868
58827 2533868 2578773 2628279 2682591 2742532 2809094 2882914 2964125 3052586 3148254 3251404 3362612
58816 3362612 3482686 3612680 3753734 3906712 4072122 4250685 4443781 4652872 4878603
58807 4878603 5121118 5381275 5660642 5959801 6277315 6610983 6959317 7320790 7691855
58798 7691855 8066649 8438498 8800771 9146231 9466545 9752874 9996404 10188398 10320993
58789 10320993 10388926 10390436 10326461 10199718 10014960 9779370 9501854 9191933 8859233 8513059
58779 8513059 8161359 7809899 7462459 7121297 6787071 6458994 6136050 5818238 5506667
58770 5506667 5203157 4910438 4632176 4371727 4130533 3908074 3703148 3514721 3341776
58761 3341776 3183130 3037532 2903584 2779729 2664904 2559125 2462807 2375475 2295722 2222505
58751 2222505 2155806 2095815 2042039 1993642 1950261 1912035 1878935 1850329 1825121 1802214 1780877
58740 1780877 1760736 1741357 1722033 1702199 1681933 1661689 1641495 1620695 1598519 1574643 1549210
58729 1549210 1522589 1495199 1467349 1439131 1410548 1381657 1352481 1322969 1293229 1263625 1234321
58718 1234321 1205018 1175556 1146616 1119238 1093650 1069064 1044724 1020750 997886 976880 958285
58707 958285 942397 929088 917862 908265 900100 893217 887291 881808 876033 869115 860529 850391 839004
58694 839004 826257 811921 796464 780948 766077 751948 738842 727564 718647 711852 706845 703881
58682 703881 703310 704886 708174 713386 721176 731746 744709 759846 777487 798038 821457 847328 875210
58669 875210 904816 936014 968679 1002378 1036077 1068113 1096133 1116919 1126686 1122454 1103735 1072899
58657 1072899 1033844 990393 945831 903157 864788 831683 803184 778189 756382 738098 723265
58646 723265 711086 700886 692783 687256 684303 683324 683662 685025 687531 691463 696811 703006 709384 716022
58632 716022 723678 732741 742768 753416 765245 779027 794712 811844 830605 851639 875065 900571
58620 900571 928367 959110 992773 1028645 1066742 1108315 1154559 1205587 1261220 1322020 1388864
58609 1388864 1461938 1540820 1625277 1715411 1811207 1912328 2018036 2126890 2236742 2345374
58599 2345374 2450868 2550992 2642522 2721628 2784747 2828903 2851752 2852149 2830702 2789348 2730391
58588 2730391 2656241 2569800 2474485 2373675 2270376 2167294 2066804 1970689 1880094 1795799
58578 1795799 1718380 1648156 1585115 1528902 1478905 1434561 1395660 1362108 1333328 1308262 1286254
58567 1286254 1267571 1252700 1241358 1232585 1225557 1219843 1214963 1210155 1204606 1197577 1188384 1176690 1162946
58554 1162946 1148229 1133528 1119208 1104975 1089975 1072951 1052781 1029190 1002804 974521 945076
58543 945076 915280 886286 859174 834276 811217 789674 769871 752233 736780 723150 711065
58532 711065 700386 690707 681369 672181 663695 656357 649670 642713 635378 628513 622819 617998 613107 607357
58518 607357 600641 593738 587989 584243 582007 580097 578145 576828 576524 576588 576376 576313 577351 579790 583225 587237
58502 587237 591524 595576 598904 601589 604156 606904 609693 612298 614670 616895 619218 622098 626034 631265
58488 631265 637585 644266 650210 654606 657593 659953 661980 663021 662268 659569 655264 649730 643411 636821
58474 636821 630122 623126 616059 609752 604604 599892 594720 589205 584078 579528 575201 571066 567429 564192
58460 564192 560872 557342 553928 550764 547720 544950 542873 541476 540225 538817 537491 536421 535284 533679
58446 533679 531678 529781 528518 528197 528795 530038 531710 533841 536454 539342 542409 545967 550247 554754 558547
58431 558547 561146 562751 563708 564229 564594 565045 565388 565148 564265 563312 562970 563630 565475 568492 572251 576075 579618
58414 579618 583073 586763 590881 595711 601689 608935 616866 624549 631418 637520 643175 648469 653174 657083
58400 657083 660320 663233 666065 668926 671922 674959 677473 678881 679430 680069 681281 682531 683239 683746 684859
58385 684859 686848 689430 692392 695722 699338 703175 707279 711418 714968 717750 720638 724676 729794 734968
58371 734968 739519 743614 747654 751804 756183 760991 766344 772267 778757 785594 792315 798716 805115 811812
58357 811812 818655 825549 832924 841097 849606 857766 865488 872940 879950 886531 893493 901488 909800 917138
58343 917138 923409 929660 936417 943281 950192 957788 966242 974824 983132 991820 1001625 1012388 1023580 1035219
58329 1035219 1047732 1061263 1075521 1090091 1104750 1119686 1135378 1151980 1168958 1185779 1202686
58318 1202686 1220207 1238114 1255589 1272274 1288434 1304156 1319187 1333543 1347590 1361525 1375475
58307 1375475 1389956 1405444 1421590 1437706 1453937 1471052 1489139 1507578 1526361 1546378 1568151
58296 1568151 1591264 1615343 1640717 1667784 1696506 1726778 1758571 1791525 1825204 1859921 1896493
58285 1896493 1935013 1974634 2014776 2055728 2097937 2141554 2186825 2233997 2282589 2331528 2380222
58274 2380222 2428826 2477469 2526136 2575222 2625123 2675086 2723624 2770304 2816163 2862187 2908472
58263 2908472 2955132 3002920 3052593 3104592 3159619 3218581 3281765 3349010 3420782 3497985 3580641
58252 3580641 3667952 3759831 3857117 3960059 4067871 4180095 4297248 4419912 4548410 4683538
58242 4683538 4826318 4976803 5134403 5299525 5473617 5657681 5852203 6058355 6277467
58233 6277467 6509295 6752867 7009204 7281143 7570310 7876549 8200809 8546326 8916247
58224 8916247 9312290 9736541 10192503 10683575 11212527 11783282 12401496 13073087 13804297
58215 13804297 14603482 15480676 16445548 17508621 18684802 19993317 21455183 23095217
58207 23095217 24947442 27055612 29469844 32248889 35467186 39214981 43590436 48696238
58199 48696238 54644156 61558108 69575571 78858015 89606199 102062062 116497378 133206283
58191 133206283 152494532 174634936 199782529 227855582 258333974 289924494 320239450
58184 320239450 345873384 363162886 369406811 363872199 347997287 324741478 297511338
58177 297511338 269190283 241616147 215595353 191300049 168732923 147981622 129211024
58170 129211024 112544292 97988105 85434171 74694257 65540250 57742373 51093800
58163 51093800 45414579 40547738 36360586 32745770 29614840 26891848 24514108 22432813
58155 22432813 20606690 18996187 17565866 16288682 15143945 14112918 13178876 12328916
58147 12328916 11552724 10841087 10187428 9588457 9040983 8539764 8080035 7659601 7276300
58138 7276300 6925503 6602425 6305007 6032090 5780147 5543946 5319373 5103868 4895552
58129 4895552 4693962 4500748 4317861 4145591 3983361 3831180 3688978 3555611 3429885
58120 3429885 3311615 3200587 3095605 2995754 2901442 2812977 2729199 2648744 2571549 2497915 2427137
58109 2427137 2358410 2292153 2229169 2169306 2112036 2057417 2005410 1955239 1906550 1860180 1816621
58098 1816621 1774834 1733948 1695005 1659336 1626014 1592650 1558210 1523529 1489475 1456208 1423941
58087 1423941 1392918 1362641 1332429 1302687 1274416 1247525 1220785 1193492 1166119 1139312 1113290
58076 1113290 1088409 1065297 1044071 1024118 1004907 986527 969293 953310 938525 924778 911827
58065 911827 899604 888371 878278 868954 859926 851267 843393 836398 829888 823259 815851 807170 797417
58052 797417 787518 778264 769680 761527 753959 747221 741111 735289 729841 725047 720878 717161 713966 711393
58038 711393 709306 707649 706619 706045 705084 703120 700576 698192 695792 692452 687638 681582 674641 666974 658791
58023 658791 650463 642356 634800 628024 621855 615799 609760 604308 599865 596027 592199 588453 585268 582775
58009 582775 580851 579578 579036 579016 579500 580985 583695 586935 590102 593849 599233 605948 612522 618213 623607
57994 623607 629196 634490 638917 642699 646278 649556 652218 654217 655446 655387 653649 650589 646965 643199 639306
57979 639306 635261 631071 626700 622375 618882 617173 617572 619570 622420 625802 629825 634503 639346 643422
57965 643422 645756 645642 642701 636906 628616 618450 606997 594658 581823 569139 557595 548264 541765
57952 541765 537738 535018 532720 531121 531184 533246 536626 540467 544365 548043 551065 553178 554468 554777 553518
57937 553518 550503 546565 542827 539666 536773 533952 531407 529518 528702 529195 530498 531301 530440 527730 523563
57922 523563 518107 511391 503716 495374 486283 476553 467100 458992 452347 446584 441586 437871 435746 435011
57908 435011 435472 436976 438922 440519 441643 442815 444202 445339 445849 445744 444849 442718 439453 435908 432641
57893 432641 429214 424938 419803 414239 408398 402178 395638 388939 382114 375343 369327 364970 362664 362093
57879 362093 362729 364352 367077 370922 375398 379715 383554 387437 392060 397487 403456 410166 418034 426600
57865 426600 434437 440452 444700 447664 449344 449508 448340 446248 443282 439221 434044 427960 421183 414015
57851 414015 406924 400195 393652 387123 380972 375781 371617 368090 365093 363030 362195 362234 362440 362446 362446 362752 363199
57834 363199 363057 361588 358646 354618 349802 344134 337550 330344 322989 315826 309099 303071 297798 292952
57820 292952 288166 283555 279661 276928 275376 274797 275063 276184 278124 280576 282899 284377 284648 283906 282727
57805 282727 281797 281767 283117 286001 290342 296172 303811 313630 325690 339659 354938 370905 387204 403841
57791 403841 420791 437497 452988 466495 477619 485778 489964 489407 484256 475317 463367 449082 433367
57778 433367 417192 401100 385240 369902 355637 342806 331361 321170 312232 304440 297479 291219
57766 291219 285936 281900 278908 276535 274729 273815 273888 274460 274833 274707 274368 274361 275075 276574 278808 281904 286121
57749 286121 291371 296923 301867 305984 309923 314430 319622 325123 330608 335853 340494 344248 347372 350410
57735 350410 353328 355344 355871 355334 354792 355027 356271 358475 361386 364511 367498 370593 374340 378834 383598
57720 383598 388195 392640 397121 401698 406459 411720 417763 424450 431207 437475 443307 449619 457635 467819
57706 467819 479430 491347 503233 515615 529019 543502 559007 575622 593379 612287 632797
57695 632797 655803 681895 710945 742736 777665 816501 859702 907336 959591 1017121 1081029
57684 1081029 1152643 1233070 1322763 1421693 1530056 1648422 1776906 1914589 2060104 2212507
57674 2212507 2371042 2534246 2699860 2865621 3029717 3190185 3343614 3483298 3597410
57665 3597410 3669168 3681092 3622201 3493604 3308653 3088018 2853170 2621491 2404215 2206796
57655 2206796 2030600 1874814 1737858 1618140 1514135 1424167 1346442 1279494 1222335 1173874
57645 1173874 1132406 1096225 1064751 1038472 1017646 1001598 989584 981704 978441 979592 984344 992265
57633 992265 1003586 1018454 1036517 1057531 1081983 1110728 1144187 1182191 1224509 1271339 1323307
57622 1323307 1381124 1445204 1515509 1591747 1673639 1760691 1851480 1943391 2033412 2119210 2199143
57611 2199143 2271125 2331760 2376898 2403077 2408591 2393503 2359038 2306991 2239487 2159047 2068756
57600 2068756 1972153 1872762 1773535 1676627 1583502 1495069 1411738 1333534 1260304 1191866 1128033
57589 1128033 1068642 1013663 963209 917363 876007 838871 805678 776066 749378 724726 701473
57578 701473 679654 659731 641865 625614 610496 596653 584618 574431 565407 556940 549231 542885
57566 542885 537962 533820 529863 526085 522810 520233 518335 517005 516055 515355 515132 515941 518100 521264 524807
57551 524807 528526 532787 538048 544491 552167 561221 571842 584067 597748 612660 628654 645819 664475
57538 664475 684903 707069 730794 756304 784464 816316 852345 892281 935549 981850 1031356
57527 1031356 1084525 1141825 1203594 1269934 1340442 1413928 1488573 1562637 1634986 1704611 1769470
57516 1769470 1826170 1871158 1902211 1918597 1920084 1906416 1877853 1835727 1782118 1719318 1649871
57505 1649871 1576760 1502880 1430234 1359897 1292724 1229692 1171494 1118184 1069454 1025141 985361
57494 985361 950261 919647 892769 868645 846928 828308 813636 802668 794188 787444 782796 780687
57482 780687 780736 782449 786268 793056 802783 814650 828494 845176 865261 888080 912725 939563 970178
57469 970178 1005905 1046842 1092187 1141097 1193104 1248101 1306244 1367849 1433061 1501341 1571135
57458 1571135 1640011 1705128 1763590 1812633 1849896 1873723 1883041 1876901 1854570 1816461 1764756 1702733
57446 1702733 1633497 1559582 1483382 1407166 1332520 1260333 1191604 1127767 1069760 1017034 967997
57435 967997 921531 877888 838083 802554 770540 740862 713237 688529 667507 649661 633673
57424 633673 618858 605530 593977 583805 574586 566462 559630 553681 548056 542844 538529 535130 532225
57411 532225 529694 527771 526271 524466 522105 520020 519259 519850 520950 522045 523444 525494 527818 529683 530916
57396 530916 532080 533807 536276 539335 542780 546420 550193 554420 559637 565879 572360 578206 583364 588455
57382 588455 593876 599446 604830 609835 614302 618240 622155 626771 632179 637688 642774 647786 653332 659263
57368 659263 664744 669267 673257 677651 683046 689283 695681 701636 707010 712028 716998 722261 728184 734879
57354 734879 742004 749220 756752 765082 774081 782999 791464 799992 809263 819326 829786 840358 850950
57341 850950 861596 872592 884300 896511 908388 919409 929951 940610 951403 962113 972915
57330 972915 984086 995433 1006690 1018199 1030518 1043534 1056701 1070039 1084149 1099209 1114674
57319 1114674 1130125 1145775 1161920 1178418 1195040 1211887 1229178 1246877 1264837 1283122 1301990
57308 1301990 1321635 1341995 1362764 1383639 1404676 1426276 1448657 1471602 1495003 1519359 1545218
57297 1545218 1572317 1599826 1627388 1655351 1684069 1713568 1744001 1775641 1808092 1840009 1870061
57286 1870061 1897933 1924188 1949379 1973469 1995769 2015267 2031222 2043642 2053047 2059856 2064364 2067262
57274 2067262 2069552 2071805 2073941 2075949 2078325 2081569 2085812 2091296 2098723 2108609 2120618 2134033 2148622
57261 2148622 2164524 2181532 2199094 2217066 2235894 2255933 2276886 2298104 2319170 2340092 2361111
57250 2361111 2382463 2404273 2426553 2449210 2472069 2494930 2517763 2540793 2564251 2588054 2611960
57239 2611960 2636056 2660793 2686426 2712670 2739059 2765325 2791250 2816491 2840968 2865261 2890161
57228 2890161 2915822 2941649 2967024 2991809 3016069 3039614 3062090 3083412 3103864 3123811 3143486
57217 3143486 3163064 3182700 3202355 3221741 3240724 3259685 3279178 3299182 3319016 3338187 3357005
57206 3357005 3376152 3395932 3416257 3437041 3458164 3479176 3499573 3519380 3539119 3559144 3579310
57195 3579310 3599246 3618641 3637350 3655564 3673823 3692467 3711192 3729511 3747491 3765488 3783267
57184 3783267 3800100 3815775 3830819 3845479 3859216 3871492 3882490 3892682 3902179 3910866 3918680 3925345
57172 3925345 3930227 3932856 3933282 3931656 3927928 3922268 3915266 3907275 3897996 3887178 3875364 3863450 3851896
57159 3851896 3840779 3830164 3819888 3809435 3798721 3788625 3780024 3772599 3765458 3758793 3754065 3752402
57147 3752402 3753603 3756846 3761687 3768010 3775504 3783675 3792194 3800957 3809897 3818798 3827145 3834133 3838963 3841166
57133 3841166 3840653 3837684 3832893 3827053 3820563 3813543 3806788 3802174 3801448 3804705 3810632 3818166 3827309 3838439
57119 3838439 3851550 3866430 3883208 3902677 3926501 3957146 3997047 4047675 4109683 4183930 4271883
57108 4271883 4375146 4495368 4635008 4797792 4988362 5212133 5475989 5788813 6161096
57099 6161096 6604543 7132686 7761828 8510979 9400564 10450733 11679964 13104015 14735057
57090 14735057 16580588 18641776 20911397 23371658 25991896 28726559 31514955 34283484
57082 34283484 36948530 39417707 41591499 43370629 44670440 45435382 45644541 45306596
57074 45306596 44450951 43122171 41378565 39291150 36940177 34409634 31781465 29130569
57066 29130569 26521005 24003968 21617727 19388667 17332291 15454258 13752451 12220103
57058 12220103 10848473 9627934 8548118 7598278 6767701 6045439 5419803 4878612 4410085
57049 4410085 4003378 3648709 3337746 3064058 2822819 2609910 2421509 2254243 2105110
57040 2105110 1971131 1849656 1739089 1638807 1548232 1466471 1392937 1327576 1270147 1219890
57030 1219890 1176391 1140303 1112799 1094784 1087084 1090891 1107330 1136912 1179896 1236240 1303074 1371101
57018 1371101 1424532 1446751 1428259 1370766 1284831 1183852 1079243 978984 888095 808954 741406
57007 741406 683780 634520 592816 557808 527912 501406 477380 455698 436252 418588 402223
56996 402223 386974 372938 360203 348537 337389 326456 316250 307782 301579 297351 294684 293585
56984 293585 294103 295948 298834 302676 306904 309955 310175 307194 301985 295737 289151 282675 276712 271485 267149
56969 267149 264168 263155 264241 266867 270290 274065 278151 282989 289509 298630 310559 324783 340591
56956 340591 357090 372663 385039 392312 393741 389532 380409 367648 353030 338113 323704 310307
56944 310307 298785 289992 283893 279653 276733 275474 276478 279944 285928 294809 306982 322244 340002
56931 340002 359943 381772 403921 423053 435522 439377 434800 422945 405056 382776 358534 334862
56919 334862 313255 293877 276306 260345 246158 233893 223396 214314 206410 199644 193879 188664
56907 188664 183568 178679 174484 171205 168584 166426 164950 164306 164089 163786 163590 164273 166136 168500 170598
56892 170598 172774 176451 182798 191701 202235 213909 226967 241375 255937 268747 278252 283571 284262
56879 284262 280565 273870 266210 258998 252662 247569 244547 244109 245814 249009 253858 261001 270519 281894
56865 281894 294971 310360 328734 350090 373848 399441 426547 454537 481410 503399 516388
56854 516388 518395 510650 496081 477141 455404 432579 410862 392154 377475 367253 361685 360735
56842 360735 364235 372174 384740 402110 424480 452192 485419 523757 566349 612090 658986 703237
56830 703237 739495 762472 768619 757043 729845 691677 648073 603470 560618 521375 487228 458928
56818 458928 436389 419367 407853 401697 400448 403919 412472 426417 445531 469472 498118 530933
56806 530933 566056 600165 628967 647892 653328 644170 622294 591263 554727 515962 478001 443147
56794 443147 412362 385622 362796 343849 328573 316834 309035 305741 306833 311562 319423 330397
56782 330397 344257 360185 377186 394210 409484 420268 423897 419127 406455 387569 364802 340605
56770 340605 316779 294056 272662 253134 236146 221626 208687 196725 186168 177768 171451 166353
56758 166353 161835 157980 155029 152791 150806 148759 146519 144041 141555 139681 139010 139559 140766 141905 142383
56743 142383 141878 140578 139184 138344 137963 137311 135835 133694 131518 129890 129017 128664 128316 127606 126613 125569
56727 125569 124422 122963 121336 120021 119265 118913 118891 119454 120687 122040 122693 122291 121144 119808 118635 117641
56711 117641 116715 115943 115683 116163 117029 117541 117318 116709 116347 116539 117140 117821 118386 118914 119644 120592 121340 121425 120933
56692 120933 120501 120743 121822 123461 125042 125849 125710 125378 125801 127015 128226 128980 129584 130253 130684 130909 131846
56675 131846 134246 137547 140367 141974 142733 143390 144496 146300 148577 150562 151581 151774 151801 151894 151641 150705
56659 150705 149298 147833 146488 145226 143991 142769 141604 140582 139686 138780 137858 137162 136850 136761 136730 136907 137392
56642 137392 137796 137560 136611 135335 134042 132895 132205 132269 132949 133872 135015 136555 138110 138772 138124 136721 135210
56625 135210 133455 130964 127966 125545 124661 125286 126544 127552 128017 128078 127761 126874 125500 124318 124034 124605
56609 124605 125352 125798 126011 126148 126121 125929 125905 126375 127211 127991 128503 128935 129651 130934 132790 134882 136662 137719
56591 137719 138097 138239 138626 139354 139993 139963 139164 138184 137753 138055 138713 139295 139699 140134 140973 142524 144682 146871
56573 146871 148587 149988 151709 154117 157027 160130 163398 166963 170833 174828 178648 182008 184928 187881
56559 187881 191433 195708 200375 205106 209758 214127 217874 220781 222797 223793 223594 222436 221029 219898 218804
56544 218804 217039 214249 210847 207624 204979 202459 199096 194299 188434 182402 176818 171808 167469 164013
56530 164013 161386 159122 156887 154933 153827 153845 154756 156028 157102 157576 157375 156737 155993 155323 154692 153920 152868
56513 152868 151633 150511 149645 148859 147995 147242 146901 146942 147080 147149 147059 146515 145289 143786 142856 142885 143400 143648 143240
56494 143240 142174 140714 139436 138995 139539 140623 141864 143322 145055 146670 147653 147951 147961 148129 148721 149761
56478 149761 150950 151948 152878 154285 156401 158789 161008 163267 166035 169276 172522 175510 178313 180976 183543
56463 183543 186359 189876 194032 198200 201914 205295 208585 211515 213456 214052 213526 212337 210755 208851 206772
56448 206772 204810 203122 201545 199797 197800 195678 193516 191337 189255 187491 186164 185175 184217 182865 180851
56433 180851 178463 176437 175205 174387 173407 172332 171606 171056 169918 167936 165814 164349 163682 163681 164471 166126
56417 166126 168231 170193 171751 172911 173678 174205 174892 175945 177095 178021 178789 179571 180190 180317 179895 179136 178351
56400 178351 178004 178522 179676 180513 180343 179478 178651 178126 177873 178199 179443 181240 182802 183901 184958 186137
56384 186137 186945 186869 186021 185000 184435 184668 185600 186806 188027 189393 190938 192184 192689 192777 193157 193972 194841
56367 194841 195817 197503 200025 202492 203898 204216 204307 204930 206058 207091 207610 207999 209208 211726 214958 217883
56351 217883 220105 221912 223603 225359 227597 230634 233895 236189 237128 237710 239188 241760 244686 247255 249251
56336 249251 250823 252340 254206 256487 258830 260973 263137 265751 268952 272568 276382 280259 284160 288168
56322 288168 292298 296202 299373 301814 304196 307082 310253 313096 315460 317804 320614 324024 327908 331929
56308 331929 335524 338212 340116 341928 344176 346684 348976 351008 353148 355401 357112 357790 357976 358804 360757
56293 360757 363306 365880 368670 372220 376680 381904 387912 394709 401860 408781 415476 422604 430860 440563
56279 440563 451651 463660 475976 488685 503005 520200 540107 561464 583793 608192 636009
56268 636009 667528 702418 740842 783399 830333 881555 937438 999084 1067591 1143158 1224864
56257 1224864 1311230 1401104 1494070 1589874 1687453 1784789 1879747 1970690 2056189 2134456 2203389
56246 2203389 2260977 2305687 2336898 2355237 2362135 2358809 2345841 2323950 2294664 2259811 2220595 2177507
56234 2177507 2130883 2081124 2028539 1973348 1915807 1856102 1794304 1730650 1665652 1599559 1532039
56223 1532039 1462961 1393369 1325056 1259079 1195217 1133111 1073420 1017409 965737 918161 874372
56212 874372 834638 799378 768376 740750 715664 692845 672429 654568 639255 626311 615325
56201 615325 605793 597479 590470 584697 579622 574756 570284 566713 563886 560862 556964 552644 549141 547454
56187 547454 547673 549022 550390 551081 551277 551738 553072 555461 558978 563773 569794 576622 583753 590945 598245
56172 598245 605915 614331 623699 633845 644523 655856 668167 681404 695109 708938 722778 736431
56160 736431 749801 763561 778939 796545 815927 836686 859535 885799 916313 951395 991613
56149 991613 1038089 1092150 1155189 1228800 1314711 1414532 1529676 1661093 1808356 1968657 2136588
56138 2136588 2304800 2465026 2609475 2732677 2833128 2913694 2980339 3039618 3095805 3148997
56128 3148997 3195378 3229421 3246468 3244412 3224394 3190564 3148524 3102655 3053920 2999478 2933905
56117 2933905 2851153 2746802 2620155 2475058 2318864 2160211 2006923 1864679 1736660 1624151
56107 1624151 1527441 1446071 1378594 1322870 1277072 1240191 1211542 1190189 1175001 1164901 1158849
56096 1158849 1156016 1156050 1158634 1162664 1166491 1169213 1171144 1172723 1173688 1173758 1173336 1172880 1172217 1171129 1170159 1170041
56080 1170041 1170801 1172166 1174522 1178612 1184490 1191519 1199350 1208191 1218170 1229067 1240693 1253045 1266068
56067 1266068 1279727 1294274 1310040 1326956 1344596 1362561 1380657 1398941 1417853 1437957 1459180
56056 1459180 1480729 1502225 1524462 1548474 1574189 1600621 1627116 1653750 1680693 1707888 1735408
56045 1735408 1763633 1793068 1824153 1857074 1891507 1926898 1963214 2000888 2039703 2078433 2116118
56034 2116118 2153023 2189683 2225831 2261285 2297334 2336086 2378592 2424543 2473526 2525534 2580399
56023 2580399 2637714 2697425 2759764 2824653 2891869 2961717 3034843 3111589 3192169 3277149 3366875
56012 3366875 3460670 3557550 3657621 3761912 3870932 3984277 4101640 4223374 4350087 4482299
56002 4482299 4620387 4764366 4914111 5070407 5235216 5410032 5594578 5788126 5991525
55993 5991525 6206719 6434813 6676000 6931123 7201903 7489739 7795573 8120835 8467391
55984 8467391 8836787 9230785 9652482 10105788 10594120 11120713 11689850 12306630 12976208
55975 12976208 13704790 14500896 15374335 16334847 17393761 18566713 19873556 21337060 22984387
55966 22984387 24849922 26975828 29412463 32222306 35483760 39289024 43738970 48941886
55958 48941886 55015498 62088639 70306176 79840179 90898395 103721730 118578190 135758870
55950 135758870 155558541 178221789 203856484 232296303 262844697 293899737 322698127
55943 322698127 345579029 358933908 360461257 350003556 329488784 302109182 271284286
55936 271284286 239895875 209957103 182623063 158378546 137269613 119098548 103555330
55929 103555330 90296860 78992610 69346251 61100761 54037230 47972528 42754207 38253213
55921 38253213 34359310 30979978 28038411 25469463 23217223 21235061 19484721 17933637
55913 17933637 16553552 15321130 14217570 13226532 12333187 11525038 10792063 10125482 9517263
55904 9517263 8960809 8450866 7982483 7550977 7152899 6785901 6447404 6134207 5843433
55895 5843433 5572974 5320978 5085847 4866764 4663283 4474102 4296934 4129773 3971839
55886 3971839 3823309 3684616 3555876 3436424 3325062 3221231 3125596 3038846 2960150 2887193
55876 2887193 2817201 2747236 2674269 2596349 2513889 2429096 2344277 2261195 2181460 2106293 2035903
55865 2035903 1969830 1907763 1849237 1792897 1737222 1682024 1628332 1576866 1527497 1480158 1435212
55854 1435212 1392739 1352412 1314252 1278678 1245592 1214148 1183714 1154349 1126185 1099081 1073160
55843 1073160 1048953 1026657 1005796 985950 967374 950660 936172 923886 913332 903576 893772 883892
55831 883892 874486 865625 856540 846449 835260 823390 811261 799007 786228 772068 756048 738848
55819 738848 721747 705250 688850 672215 655989 641189 628298 617157 607331 598400 590253 583203
55807 583203 577548 573060 569315 566447 565072 565540 567729 571482 576554 582129 587150 591256 594769 597655
55793 597655 599310 599598 599357 599607 600904 603619 607792 612020 613246 608648 597692 582028 563925 545336
55779 545336 527880 512604 499615 488473 479098 471898 466984 463519 459941 454757 447285 437854 427294
55766 427294 416206 404838 393566 382985 373316 364107 354865 345719 337193 329609 322989 317246 312043
55753 312043 306570 299911 291691 282311 272597 263306 254764 246799 239123 231797 225106 218992 213003 206988
55739 206988 201432 196835 193094 189877 187316 185899 185765 186445 187195 187378 186676 185218 183449 181632 179599
55724 179599 177141 174383 171532 168507 165190 161858 159019 156843 155063 153377 151703 150125 148878 148300
55710 148300 148525 149245 149984 150547 151012 151473 151988 152634 153296 153528 152985 151863 150600 149272 147703 146083 144953
55693 144953 144511 144403 144331 144488 145165 146296 147650 149227 151218 153675 156360 158835 160703 161951 163046 164366
55677 164366 165532 165703 164679 163276 162325 161723 160827 159384 157586 155563 153464 151906 151596 152494 153993 156056
55661 156056 159406 164286 169731 174650 179117 183948 189435 195260 201390 208059 214795 220416 224381 227444
55647 227444 230469 233155 234495 234091 232328 229587 226035 222221 219052 216899 215120 212763 209501 205684
55633 205684 201782 198017 194351 190593 186562 182289 177922 173378 168277 162412 156125 149960 144034 138002
55619 138002 131669 125370 119674 114919 111144 108209 105687 102828 99086 94825 91091 88438 86232 83496
55605 83496 80208 77276 75318 74048 72942 71963 71275 70656 69684 68325 66965 65886 64976 63881 62287 60154
55589 60154 57823 55706 53775 51618 49164 46972 45500 44506 43581 42881 42707 42659 41945 40529 39249 38718
55573 38718 38699 38715 38670 38694 38888 39446 40533 41797 42480 42339 41997 42040 42191 41824 40948 40206 40016 40165 40179 39758
55553 39758 38946 38142 37878 38315 39005 39383 39400 39451 39768 40165 40381 40430 40557 40982 41732 42632 43401 43848 44047 44372
55533 44372 45310 47036 49114 50790 51770 52571 53920 55990 58485 61209 64081 66765 68918 70845 73288
55518 73288 76424 79625 82413 85135 88368 92178 96251 100276 103790 106161 107199 107423 107306 106640 105071
55503 105071 102806 100177 96917 92574 87440 82329 77570 72909 68344 64292 60793 57205 52987 48322
55489 48322 43768 39691 36234 33477 31344 29580 27944 26285 24424 22299 20205 18574 17439 16492 15674
55474 15674 15239 15105 14642 13476 12126 11446 11631 12172 12654 13225 14234 15673 17091 17901 17736 16653 15143
55457 15143 13921 13448 13492 13247 12154 10620 9624 9578 9938 10086 10124 10393 10641 10265 9205 8038 7284 7090
55439 7090 7425 7960 7847 6475 4544 3654 4583 6608 8699 10555 12077 12758 12424 11957 12311 13141 13275
55422 13275 12395 11330 10706 10241 9566 9015 9164 10181 11945 14348 17038 19229 20265 20202 19534 18517 17089
55405 17089 15316 13515 11946 10628 9497 8501 7582 6708 5998 5619 5554 5564 5416 5059 4595 4200 4045 4160
55387 4160 4347 4405 4476 4979 6054 7228 7800 7557 6930 6497 6442 6545 6511 6246 5914 5859 6354 7272 8044 8084 7293
55366 7293 6054 4760 3530 2416 1680 1573 1942 2304 2439 2657 3271 3963 4016 3229 2274 1954 2289 2606
55348 2606 2387 1758 1155 802 664 664 760 877 952 1018 1175 1504 2027 2658 3189 3440 3469 3512 3618 3502 2869 1768
55326 1768 512 -608 -1410 -1750 -1599 -1127 -598 -264 -396 -1177 -2330 -3083 -2861 -1925 -999 -355 311 1070 1346
55307 1346 647 -601 -1368 -1148 -519 -488 -1368 -2434 -2734 -2141 -1425 -1226 -1241 -690 604 2011 2909 3308 3586
55288 3586 4078 4999 6317 7421 7373 5893 3857 2397 1752 1390 1031 969 1455 2337 3428 4714 5962
55271 5962 6531 5937 4439 2807 1660 1176 1275 1866 2936 4453 6131 7264 7066 5376 2907 616 -989
55253 -1827 -1857 -1122 -16 962 1724 2488 3131 3071 2011 407 -1058 -2210 -3250 -4165 -4665 -4673 -4491 -4382 -4267 -3867
55233 -3867 -2954 -1437 504 2292 3208 3054 2450 2280 2882 3872 4679 5109 5364 5662 5940 5956 5638 5174 4764
55214 4764 4408 4097 4045 4466 5172 5687 5774 5571 5231 4789 4488 4770 5656 6454 6492 5894 5282 4877 4424 3922
55194 3922 3886 4673 5869 6625 6473 5683 4928 4665 4796 4851 4526 3934 3303 2651 2064 2072 3268 5420 7361
55175 7361 8040 7496 6621 6127 5979 5728 5087 4113 3010 1960 1191 1053 1764 3015 4042 4277 3822 3178
55157 3178 2739 2782 3685 5619 8019 9827 10405 9907 8761 7218 5625 4640 4721 5561 6313 6332 5549 4362
55139 4362 3372 3049 3398 3990 4429 4678 4833 4920 5073 5653 6818 8181 9176 9627 9697 9495 9127 8903 9023
55120 9023 9120 8594 7465 6470 6225 6721 7692 9028 10541 11793 12549 13186 14233 15590 16568 16686 16190 15680
55102 15680 15487 15547 15746 16156 16819 17399 17335 16524 15731 15969 17378 18971 19674 19356 18681 18191 17921 17812 18035
55083 18035 18669 19375 19697 19598 19473 19631 19944 20063 19815 19316 18814 18509 18440 18410 18041 17130 15998 15387 15804 17033
55063 17033 18411 19520 20394 21068 21251 20726 19874 19411 19539 19715 19428 18941 18938 19587 20325 20558 20266 19817 19508
55044 19508 19502 19920 20671 21298 21373 21037 20824 20878 20680 19804 18652 18134 18632 19624 20366 20682 20879 21137 21347 21555
55024 21555 22191 23556 25272 26554 27077 27246 27526 27766 27452 26477 25420 25017 25537 26606 27531 27833 27680
55007 27680 27792 28727 30234 31479 31937 31863 31842 32100 32351 32170 31338 29919 28153 26324 24715 23622 23277
54990 23277 23608 24115 24201 23699 22977 22565 22793 23724 25144 26603 27754 28725 29924 31384 32636 33387 33993
54973 33993 34931 36087 36963 37479 38117 39261 40703 41961 42864 43742 45168 47562 50893 54745 58688 62593
54957 62593 66567 70797 75668 81863 89931 99736 110620 122189 134648 148249 162652 176990 190210
54944 190210 201113 208392 211117 209239 203359 194044 181719 167234 152077 137700 124700 112807
54932 112807 101494 90554 80339 71705 65544 61933 59751 57494 54552 51518 49309 48304 48361 49179
54918 49179 50389 51669 53150 55459 59020 63525 68479 74041 80899 89422 99457 110863 123594 137115
54904 137115 150277 162103 172340 180942 187359 190668 190211 185858 177903 167011 154130 140175 125889
54891 125889 112148 99976 89896 81423 73670 66436 60329 55788 52414 49429 46520 43939 41865
54878 41865 39955 37658 34862 32054 29797 28241 27277 26961 27408 28349 29164 29477 29417 29226 28966 28701 28604 28651
54860 28651 28571 28283 27971 27503 26343 24444 22723 21988 21801 21144 19985 19302 19535 19925 19651 18848 18077 17382
54842 17382 16471 15475 14864 14753 14790 14763 14949 15741 17199 19039 20902 22529 23779 24680 25401 26086 26618 26649
54824 26649 25982 24863 23796 23104 22873 23241 24340 25893 27230 27975 28388 28789 29042 29017 29238 30476 32824
54807 32824 35733 38907 42632 47191 52461 58207 64338 70756 77414 84630 92947 102514 112946 123948
54793 123948 135681 148292 161377 174004 184916 192590 195638 193572 187066 177352 165663 153321
54781 153321 141740 131762 123175 115235 107589 100459 94131 88606 83697 79285 75541 72911 71652 71294
54767 71294 70857 69861 68836 68686 69768 71788 74241 76669 78809 80906 83765 88145 94227 101915 111401
54752 111401 123083 136951 152358 168296 183715 197731 209770 219392 225882 228368 226695 221932
54740 221932 215577 208466 200806 192906 185194 177577 169525 160927 152292 143902 135284 125938 116202 106950
54726 106950 98574 90706 82968 75674 69580 65063 61731 58893 56229 53830 51720 49697 47721 46058
54712 46058 44782 43483 41848 40307 39604 39815 40266 40448 40556 40974 41637 42165 42381 42384 42247 41922 41461 41134
54694 41134 41226 41715 42273 42588 42615 42403 41859 40928 39976 39558 39744 40039 40131 40278 40695 41106 41397 42187 44051 46446
54674 46446 48263 49333 50543 52399 54302 55514 56054 56252 56122 55693 55430 55707 56193 56303 56023 55834 56062
54657 56062 56748 57917 59436 60786 61466 61559 61485 61300 60774 60114 60049 61048 62896 65213 68005 71486 75618
54640 75618 80093 84651 89331 94557 101006 109084 118433 128245 138207 148795 160408 172524 184080
54627 184080 194410 203261 210021 213590 213273 209417 202921 194398 184212 172945 161347 149829 138497
54614 138497 127762 118492 111286 105874 101432 97297 93139 88752 84046 79213 74610 70457 66831 63822
54600 63822 61410 59325 57387 55953 55545 55922 55958 54743 52561 50534 49491 49409 49699 49669 48835 47206 45306
54583 45306 43716 42539 41475 40364 39402 38777 38363 37925 37431 36989 36617 36249 35948 35894 36130 36455 36642 36658
54565 36658 36577 36320 35679 34655 33607 32952 32823 33102 33630 34197 34443 34162 33733 33914 35035 36647 38092 39160
54547 39160 39944 40347 40189 39709 39515 39889 40460 40776 40978 41713 43422 45847 48205 49800 50568 51089 52045 53694
54529 53694 55907 58625 61994 66020 70366 74722 79196 84068 89246 94290 98923 103221 107181 110390
54515 110390 112367 113051 112693 111328 108663 104584 99530 94212 89038 83978 78939 74079 69761 66303 63823
54500 63823 62192 61041 59915 58627 57438 56760 56612 56492 55872 54743 53606 53021 53251 54227 55580 56737
54484 56737 57210 56974 56427 55947 55630 55492 55620 55877 55771 54989 53981 53603 54145 55084 55805 56178 56313 56200 55867
54465 55867 55563 55413 55098 54279 53241 52686 52936 53617 54130 54107 53454 52316 51080 50109 49381 48660 48017 47831
54447 47831 48085 48138 47482 46470 45857 45842 45964 45897 45816 45888 45867 45490 44978 44791 45032 45440 45899 46535 47241 47509 47034
54426 47034 46227 45774 45797 45812 45495 45123 45178 45793 46755 47769 48526 48801 48771 49082 50211 51878 53381 54537 55960
54407 55960 58351 61736 65444 68658 70912 72291 73281 74337 75551 76757 77865 78901 79760 80196 80094
54392 80094 79571 78775 77806 76826 75914 74760 72858 70273 67846 66344 65597 64881 63969 63252 62796 61899 59974
54375 59974 57519 55714 55074 54930 54372 53362 52617 52592 52927 52937 52343 51433 50705 50493 50808 51357 51787 52038 52389
54356 52389 53120 54202 55425 56658 57872 59053 60226 61403 62345 62633 62262 61990 62714 64566 66939 69269
54340 69269 71371 73020 73724 73141 71404 68914 66099 63500 61650 60609 59833 58774 57425 56117 54991
54325 54991 53910 52715 51355 49895 48612 47923 47989 48447 48694 48428 47786 47047 46264 45177 43530 41542 39966
54308 39966 39367 39398 39141 38179 36927 35845 34886 33935 33252 33073 33159 33160 33086 32982 32540 31589 30654 30404 30746 31088
54288 31088 31380 32179 33653 35202 36215 36631 36610 36227 35755 35713 36210 36663 36514 35922 35422 35220 35246 35644 36664
54269 36664 38128 39431 40131 40246 39930 39231 38322 37738 38003 39007 39956 40141 39684 39370 39774 40767 41941 43224
54251 43224 44759 46368 47528 47947 47825 47525 47236 47046 47017 47042 46930 46825 47214 48209 49045 48741 47242 45517
54233 45517 44455 43989 43474 42663 41975 41893 42430 43272 44178 45012 45541 45529 45080 44608 44351 44091 43569 42965 42765
54214 42765 43200 44027 44830 45361 45625 45772 45920 45962 45648 44973 44376 44311 44671 44898 44594 43810 42786 41785 41177
54195 41177 41346 42266 43409 44219 44550 44551 44358 44012 43502 42755 41750 40734 40135 40129 40370 40313 39678 38528 37140
54176 37140 35848 34838 33969 32977 31963 31398 31486 31819 31940 31980 32372 33115 33724 33877 33678 33238 32459 31394
54158 31394 30517 30322 30718 31045 30695 29648 28472 27856 28062 28713 29175 29192 29093 29299 29704 29768 29225 28534 28470 29373
54138 29373 30915 32570 34096 35528 36873 37951 38511 38454 37972 37424 36945 36213 34917 33417 32575 32693 33043
54121 33043 32774 31935 31098 30333 29330 28383 28340 29338 30400 30720 30677 30971 31406 31302 30749 30553 31010 31609 32042
54102 32042 32683 33721 34487 34242 33249 32547 32782 33685 34638 35355 35949 36567 37156 37451 37199 36450 35608 35064 34758
54083 34758 34232 33278 32435 32656 34380 37000 39339 40681 41264 41834 42854 44187 45396 46243 46960 48101
54067 48101 49975 52163 53756 54334 54645 56022 59011 62725 65701 67307 68156 69192 70560 71543 71530 70820
54051 70820 70360 70847 72333 74598 77499 80796 84020 86876 89655 92906 96738 100787 104817 108986 113383
54036 113383 117703 121669 125592 130186 135765 141789 147246 151460 154597 157416 160481 163564 165918 167186
54022 167186 167838 168594 169575 170298 170370 169873 169047 167953 166609 165121 163377 160857 157153 152629 148171 144246
54006 144246 140564 136791 133208 130347 128252 126472 124609 122513 120033 117050 113817 110872 108462 106311
53992 106311 104125 101987 100051 98148 96034 93869 92107 90973 90294 89825 89418 88849 87756 85913 83459
53977 83459 80805 78396 76572 75468 74948 74661 74246 73549 72728 72248 72629 74035 76025 77837 78930 79210
53961 79210 78864 78193 77608 77427 77517 77364 76745 76219 76622 78106 79961 81473 82713 84344 86837 90105 93783
53944 93783 97564 101249 104734 108078 111477 115106 119007 123134 127394 131731 136321 141608 147834 154522
53930 154522 160813 166449 172026 178042 184071 189264 193356 196749 199843 202834 206017 209682 213691 217644
53916 217644 221526 225785 230757 236437 242743 249398 255515 259996 262621 264172 265238 265548 264779 263289 261504
53901 261504 259183 256052 252705 250069 248124 245880 242557 238197 233183 227747 221976 215821 209041 201553
53887 201553 193804 186417 179577 173093 166943 161282 156072 151261 147221 144401 142489 140495 137749 134370
53873 134370 130732 127060 123655 120909 118838 117027 115195 113351 111325 108693 105410 101993 98847 95908
53859 95908 93212 91198 89999 88896 87016 84280 81312 78732 76932 76200 76502 77225 77539 76994 75650 73942
53843 73942 72643 72541 73679 75127 75942 76155 76396 76772 76667 75653 74074 72641 71839 71795 72401 73401 74492
53826 74492 75459 76195 76706 77208 78055 79393 80969 82399 83465 84094 84371 84806 86186 88729 91634 93960
53810 93960 95774 97983 101130 104919 108883 112952 117241 121733 126428 131405 136562 141588 146394 151254
53796 151254 156281 160993 164687 167165 168869 170403 172044 173660 174927 175584 175550 174886 173720 172203 170450
53781 170450 168428 165963 162950 159472 155702 151811 148038 144586 141312 137734 133626 129403 125648 122442
53767 122442 119496 116760 114492 112779 111420 110246 109176 107924 106104 103709 101123 98635 96300 94301
53753 94301 92931 91977 90689 88717 86728 85661 85571 85613 85008 83663 81930 80221 78964 78597 79274 80594
53737 80594 81749 82036 81348 80197 79238 78780 78748 78926 79029 78667 77676 76505 75906 76020 76150 75735 75219 75502
53719 75502 76682 77874 78287 78070 77933 78315 79171 80295 81472 82337 82424 81501 79702 77323 74660 72241 71024
53702 71024 71990 75330 80141 85077 89250 92571 95365 97879 100020 101442 101857 101388 100537 99794 99330 99186
53686 99186 99511 100417 101737 103156 104520 105842 107156 108603 110415 112464 114022 114495 114341 114684 115954 117405
53670 117405 118168 118228 118105 118055 118028 118021 117990 117639 116751 115622 114831 114648 114948 115500 116031 116164 115701 114930 114336 114063
53650 114063 113934 113875 113985 114267 114649 115233 116179 117355 118434 119324 120162 120900 121299 121375 121490 121872 122392 122899 123435
53631 123435 123994 124462 124964 125860 127114 128121 128606 129345 131315 134204 136360 136439 134679 132400 130707 130010
53615 130010 130449 132086 134568 137043 138813 139986 141248 142998 144935 146523 147709 149020 151012 153760
53601 153760 156852 159756 162168 164146 166032 168190 170780 173764 177082 180699 184403 187689 190041 191363
53587 191363 192033 192521 193056 193658 194300 194950 195548 196120 196810 197692 198668 199674 200808 201959 202443 201508 199320
53570 199320 197021 195574 194945 194644 194628 195179 196227 197381 198450 199365 199719 199116 197996 197374 197534 197676 197208
53553 197208 196698 197021 198056 198945 199305 199534 199994 200563 201024 201460 202129 203260 204982 207209 209535 211484 212840
53536 212840 213630 213956 214074 214433 215297 216485 217808 219546 222096 225287 228571 231822 235434 239627 244170
53521 244170 248868 253824 259127 264723 270739 277488 284949 292639 300139 307403 314451 321307 328380 336319
53507 336319 345148 354086 362703 371792 382513 394980 408304 421876 435940 450896 466611 482623
53495 482623 498659 514733 530934 547287 563687 579909 595737 611084 626021 640777 655765
53484 655765 671328 687307 703045 718086 732674 747328 762162 776988 791941 807495 823809
53473 823809 840451 856884 872873 888329 903081 917004 930140 942499 953922 964322 973858 982668
53461 982668 990537 997116 1002397 1006744 1010346 1012850 1013688 1012682 1010161 1006462 1001548 995258 987794 979734
53447 979734 971525 963173 954443 945190 935430 925307 915095 905047 895065 884635 873242 860767 847455
53434 847455 833740 820191 807345 795317 783785 772582 762108 752829 744667 737293 730886 726021
53422 726021 722762 720310 717726 714710 711569 708828 707048 706747 708137 711003 714955 719717 725160 731239
53408 731239 738004 745594 754204 764106 775551 788313 801456 814028 826088 838686 852660 867941
53396 867941 884250 901970 921746 943470 966263 989461 1013234 1038152 1064492 1092069 1120497
53385 1120497 1149497 1179162 1209987 1242494 1276699 1311984 1347541 1382857 1417829 1452544 1487043
53374 1487043 1521170 1554667 1587406 1619482 1650881 1681030 1708886 1733605 1755149 1774114 1790917
53363 1790917 1805174 1815997 1822997 1826907 1828981 1829693 1828255 1823559 1815410 1804525 1791496 1776216 1758425
53350 1758425 1738348 1716405 1692452 1665808 1636145 1604107 1570843 1537077 1502879 1468276 1433816
53339 1433816 1400379 1368598 1338619 1310246 1283101 1256646 1230382 1204187 1178298 1152825 1127421
53328 1127421 1101638 1075531 1049723 1024874 1001296 979134 958695 940317 923871 908653 893921
53317 893921 879576 866154 854180 843665 834230 825458 816906 808037 798550 788831 779697 771579 764172
53304 764172 757037 750245 744279 739536 736205 734351 733710 733531 733052 732310 732167 733453 736261 740149 744761
53289 744761 750082 756239 763337 771465 780795 791560 803927 817798 832772 848388 864452 880997
53277 880997 897945 914910 931385 946982 961542 975170 988261 1001193 1013737 1024911 1033773 1040381
53265 1040381 1045638 1050047 1052905 1053095 1050524 1046393 1041940 1037299 1031835 1025292 1018073 1010373 1001564 990808
53251 990808 978068 964188 949989 935557 920447 904383 887582 870455 853160 835527 817420
53240 817420 799064 780907 763256 746201 729852 714351 699570 685064 670569 656362 642854
53229 642854 629932 617030 603854 590760 578360 566927 556244 545855 535411 524961 514998 506113
53217 506113 498543 492099 486506 481593 477108 472602 467723 462593 457716 453457 449595 445434 440412 434646
53203 434646 428767 423110 417191 410250 402282 394266 387322 381797 377238 373018 368875 364985 361620 358674
53189 358674 355563 351759 347406 343101 339037 334741 329860 324893 320754 317715 315070 311844 307693 303190
53175 303190 299356 296793 295085 293126 290224 286776 283749 281677 280394 279532 278887 278305 277630 276887 276258 275782
53159 275782 275188 274134 272440 270161 267618 265408 264064 263539 263133 262111 260311 258199 256459 255586 255588 255902
53143 255902 255770 254863 253461 251967 250413 248633 246693 244865 243231 241586 239776 237873 235914 233744 231280
53128 231280 228747 226398 224091 221480 218657 216244 214618 213330 211617 209384 207267 205703 204373 202716
53114 202716 200558 197977 194917 191428 188079 185568 183890 182351 180413 178127 175724 173277 170930 168947
53100 168947 167219 165212 162752 160452 158867 157584 155790 153594 152019 151619 151757 151529 150856 150270 149966 149562
53084 149562 148660 147295 145859 144793 144259 143937 143277 142153 141139 140887 141379 142099 142822 143816 145250 146799
53068 146799 147987 148635 148811 148625 148259 147981 147877 147743 147409 146973 146462 145490 143644 141108 138534 136241 133935
53051 133935 131323 128654 126386 124558 122755 120598 118044 115310 112719 110651 109407 109029 109188 109220 108354
53036 108354 106204 103256 100660 99272 98893 98651 98027 97231 96622 96157 95561 94723 93690 92458 91043 89663
53020 89663 88568 87721 86870 85957 85264 85089 85426 86009 86526 86679 86248 85286 84240 83660 83716 84090 84385 84482 84454
53001 84454 84285 83899 83376 82887 82390 81623 80513 79411 78775 78779 79401 80649 82346 83778 84061 83111 81974 81845
52983 81845 82804 83772 83708 82686 81702 81558 82090 82501 82296 81778 81584 81941 82485 82800 82862 82925 83125 83387 83623 83836
52963 83836 84015 84075 83980 83919 84236 85158 86605 88339 90240 92307 94376 96031 96986 97432 97796 98251 98717 99273
52945 99273 100136 101125 101605 101320 100968 101488 102902 104319 105123 105745 107068 109333 111897 113954 115286 116297
52929 116297 117436 118681 119605 119965 120150 120891 122611 125139 128016 130874 133504 135779 137686 139401 141223
52914 141223 143410 145991 148618 150656 151617 151590 151216 151159 151644 152431 153063 153172 152737 152029 151138 149649 147161
52897 147161 144176 141996 141374 141585 141269 139968 138387 137223 136349 135317 134191 133497 133571 134248 135074 135533 135148
52880 135148 133772 131899 130455 130062 130532 131144 131410 131426 131588 132140 133047 134137 135171 135868 136032 135733 135275
52863 135275 134989 135131 135816 136844 137582 137404 136414 135465 135328 136058 137373 139225 141540 143610 144403 143597 141848
52846 141848 139894 137846 135601 133511 132196 131868 132189 132670 132936 132744 132084 131276 130657 130163 129423 128345 127369
52829 127369 127087 127677 128706 129396 129141 127949 126418 125184 124438 124019 123807 123759 123686 123299 122509 121421 120081
52812 120081 118536 117143 116425 116405 116497 116318 116322 117247 119124 121220 122874 123953 124492 124406 123796 123206 123137 123461 123657
52793 123657 123610 123802 124593 125616 126138 125790 124677 122905 120490 117751 115358 113690 112391 110825 108788 106503
52777 106503 104193 102052 100482 99809 99709 99393 98475 97282 96162 95014 93759 92768 92341 92048 91149 89564
52761 89564 87932 86723 85667 84143 81812 78896 76059 73973 72729 71723 70479 69397 69188 69646 69661
52746 69661 68698 67552 67156 67181 66537 65010 63603 63159 63278 62893 61527 59643 58017 57106 56952 57403 58294
52729 58294 59470 60652 61360 61153 60067 58692 57670 57166 56875 56430 55677 54652 53580 52892 53007 53895 54987
52712 54987 55626 55517 54715 53378 51801 50487 49847 49740 49605 49132 48574 48281 48208 48142 48216 48842 50154 51735
52694 51735 52998 53704 54088 54551 55213 55749 55769 55410 55363 56062 57060 57515 57223 56762 56612 56584 56320 55993 56087 56668
52674 56668 57243 57350 57019 56555 56089 55554 55030 54821 55042 55265 54926 54142 53794 54568 56147 57669 58804 59894
52656 59894 61152 62292 63114 63949 65180 66664 67949 68850 69520 70128 70780 71611 72658 73707 74525 75169 75875
52639 75875 76697 77445 77917 78027 77745 77082 76102 74868 73460 72084 70960 69983 68778 67230 65708 64554
52623 64554 63642 62722 61880 61294 60810 60192 59597 59322 59235 58962 58521 58279 58372 58695 59309 60238 60905 60635 59822 59754
52603 59754 60953 62461 63214 63399 63790 64430 64787 64785 64778 64745 64470 64414 65422 67302 68636 68444 67419 67000 67747
52584 67747 69176 70794 72548 74379 76077 77712 79633 81718 83066 82890 81601 80655 81257 83446 86349
52569 86349 88986 90736 91475 91625 91942 92872 94097 94940 95238 95527 96333 97547 98618 99146 99135 98867 98699 98807
52551 98807 98931 98518 97366 96044 95437 95888 96894 97652 97783 97529 97367 97542 97945 98483 99396 101064 103467
52534 103467 106086 108376 110107 111179 111451 111004 110327 109951 110014 110390 111071 112123 113400 114635 115704 116542
52518 116542 116864 116363 115125 113530 111769 109812 107821 106184 105015 103999 102879 101842 101279 101432 102371
52503 102371 104002 105886 107273 107575 106771 105294 103685 102404 101731 101701 102281 103587 105632 107893 109538 110300
52487 110300 110773 111574 112556 113182 113350 113426 113658 113992 114355 114691 114778 114456 114069 114292 115394 116954 118353 119208
52469 119208 119296 118501 117098 115823 115359 115823 116899 118258 119621 120576 120686 119900 118702 117771 117512 117855 118379
52452 118379 118649 118552 118366 118405 118556 118255 117086 115423 114298 114483 115687 116816 116980 116232 115336 115000 115311 115742
52434 115742 115646 114889 114064 113920 114512 115141 115224 114932 114763 114816 114817 114646 114370 113884 113010 111958 111243 111007 110869 110545
52414 110545 110195 109949 109555 108903 108536 109111 110476 111706 112113 111860 111503 111264 110993 110661 110585 111065 111878 112384
52396 112384 112197 111651 111399 111659 112158 112753 113684 115032 116410 117480 118454 119660 120890 121644 121852 121848 121714 121223
52378 121223 120472 120030 120238 120790 121280 121861 123055 125139 127935 131006 133829 135932 137099 137419 137161 136777
52362 136777 136964 138257 140391 142438 143861 145030 146423 147777 148594 149165 150337 152301 154308 155730 156847
52347 156847 158313 160314 162576 164878 167199 169508 171683 173579 175029 175941 176515 177214 178399 180151 182490
52332 182490 185479 188927 192278 195104 197489 199729 201830 203642 205314 207200 209401 211752 214298 217459
52318 217459 221666 227043 233481 240763 248559 256556 264708 273226 282303 291961 302154 312744 323396
52305 323396 333726 343689 353666 364136 375406 387574 400417 413319 425738 437876 450583 464303
52293 464303 478432 491947 504391 515940 526781 536808 545826 553675 560271 565896 571378 577567 584494
52280 584494 591244 596761 600611 603050 604600 605640 606155 605850 604591 602656 600383 597784 594823 591932 589682
52265 589682 587910 585784 583000 580512 579642 580758 583144 585891 588513 590891 593162 595793 599438 604509
52251 604509 611016 618745 627464 636960 647031 657496 668144 678686 688884 698707 708290 717749 727059
52238 727059 736003 744207 751414 757780 763731 769415 774482 778525 781452 783225 783617 782626 780863 779001 776925
52223 776925 773955 769878 765199 760275 754780 748323 741154 733933 727078 720673 714714 709121 703610 697898
52209 697898 691927 685735 679282 672747 666839 662379 659520 657676 656260 655209 654666 654409 653943 653110 652347
52194 652347 652199 652715 653494 654248 654999 655649 655689 654702 653070 651812 651668 652506 653546 653826 652553 649577 645801
52177 645801 642684 640973 640073 638892 637014 634724 632209 629271 625842 622311 619118 616231 613179 609553
52163 609553 605461 601513 598320 595968 593998 591881 589386 586538 583494 580515 577711 574720 571017 566786
52149 566786 563010 560355 558333 556094 553646 551654 550187 548475 545959 542936 539967 537196 534591 532374
52135 532374 530798 529696 528553 526955 524794 522158 519196 516057 512977 510436 509013 508827 509211 509404 509491
52120 509491 510273 512154 514683 517304 520139 523776 528610 534600 541440 548796 556679 565613 576143 588088
52106 588088 600753 613890 627913 642935 658368 673894 690164 707789 726073 743578 759771
52095 759771 775359 791024 806579 821515 835667 848977 861022 871214 879335 885690 890786 895018
52083 895018 898542 901335 903240 903925 902857 899639 894556 888530 882349 876136 869751 863303 856917 850348
52069 850348 843424 836681 830909 826033 821091 815481 809753 804987 801776 799985 799130 798764 798811 799737 802084
52054 802084 805698 809720 813545 817424 821916 827068 832457 837695 842586 847013 851130 855441 860316 865412
52040 865412 869978 873689 876827 879599 881666 882505 881971 880293 877701 874262 870010 865032 859414 853196 846346
52025 846346 838709 830063 820441 810361 800478 790868 780861 769771 757672 745214 732768 720056
52013 720056 706610 692314 677444 662443 647708 633287 618755 603739 588688 574597 561734
52002 561734 549140 535800 521836 507958 494192 479971 465325 451067 437598 424287 410400
51991 410400 396103 382112 368755 355835 343180 330965 319483 308842 298858 289284 280180 271933
51979 271933 264644 257670 250218 242324 234741 227810 221119 214473 208536 204014 200689 197740 194732 191758
51965 191758 188899 186092 183365 180760 178068 175079 172039 169481 167653 166356 165236 163874 161756 158658
51951 158658 155155 152327 150755 149967 148976 147231 145026 143068 141687 140416 138493 135839 133263 131505 130326
51936 130326 128922 127065 125351 124346 123977 123873 123878 123926 123708 122807 121142 119095 117155 115560 114334 113533 113243
51919 113243 113290 113174 112536 111625 110995 110765 110563 110222 110026 110019 109586 108187 106225 104688 104059 103984 103820 103133 101825
51900 101825 100294 99357 99491 100143 100297 99758 99347 99678 100286 100262 99347 98073 97063 96503 96201 95926 95695 95762
51882 95762 96222 96702 96682 96131 95607 95626 96123 96539 96282 95193 93839 93259 94009 95480 96564 96980 97370 98059
51864 98059 98443 98012 97367 97571 98832 100462 101901 103115 104095 104612 104677 104680 104813 104780 104375 103958 103924 103967 103378 102112
51844 102112 101063 101048 101815 102381 102186 101608 101370 101699 102193 102331 102083 102053 102892 104406 105419 104998 103692 103017
51826 103017 103621 104703 105501 106476 108252 110049 110329 108860 107081 106269 106313 106530 106726 106881 106583 105568 104415
51809 104415 103990 104386 104990 105443 105945 106664 107340 107652 107670 107842 108614 110028 111593 112632 112891 112684 112396 112126
51791 112126 111925 112045 112644 113494 114297 115088 115995 116849 117421 117915 118754 119941 121037 121850 122759 124157 125856
51774 125856 127281 128133 128693 129520 130915 132761 134848 137266 140360 144302 148782 153093 156441 158306 158803
51759 158803 158654 158496 158185 157087 155051 152646 150403 148362 146597 145620 145746 146442 146818 146582 146078 145528 144721
51742 144721 143491 142165 141497 142123 143955 146105 147754 149122 151060 153541 155298 155430 154654 154274 154566 155005
51726 155005 155557 156607 157891 158718 159277 160578 162856 165093 166521 167646 169218 171056 172535 173640 174788
51711 174788 176009 176968 177590 178113 178662 179205 179782 180464 181199 181943 182765 183638 184353 184861 185436 186340 187595 189204
51693 189204 191230 193483 195582 197590 200146 203622 207561 211370 215144 219271 223468 226724 228115 227381
51679 227381 224923 221627 218462 215852 213553 211359 209582 208505 207750 206762 205666 205032 204970 205091 205249 205640
51663 205640 206191 206472 206384 206353 206610 206800 206561 206089 205821 205793 205629 204966 203711 202012 200186 198582 197345 196241
51645 196241 194744 192369 189150 185890 183645 182666 181998 180411 177560 173965 170185 166586 163753 162338 162203
51630 162203 162284 161645 160358 159068 158065 157131 156074 155013 154164 153603 153244 152899 152316 151267 149677 147783
51614 147783 146186 145500 145690 145925 145434 144452 143948 144433 145423 146101 146078 145399 144289 143111 142201 141505 140702 139850
51596 139850 139534 140107 141235 142516 144092 146119 147945 148492 147481 145755 144327 143479 142842 141985 140780 139463
51580 139463 138492 138181 138353 138474 138202 137630 136995 136323 135459 134317 133018 131823 131006 130750 131094 131964 133210
51563 133210 134586 135805 136682 137231 137622 138086 138839 139895 140931 141505 141594 141742 142479 143671 144608 144726 144164
51546 144164 143668 144000 145374 147380 149527 151778 154312 156802 158405 158768 158643 159038 160031 160923 161404 161877
51530 161877 162557 162903 162300 160846 159056 157041 154495 151364 148119 145263 142841 140579 138364 136423 135056
51515 135056 134288 133782 133107 132099 131059 130591 131143 132473 133629 133642 132429 130941 130325 131019 132657 134627
51499 134627 136486 138000 139019 139393 138953 137743 136331 135565 135748 136304 136643 137120 138582 141060 143572 145365
51483 145365 146773 148591 151110 154102 157260 160218 162438 163634 164180 164722 165524 166540 167880 169682 171609
51468 171609 173026 173780 174352 175139 175960 176437 176460 176100 175405 174562 173969 173853 174017 174244 174739 175813 177293 178652
51450 178652 179684 180593 181377 181563 180857 179711 178905 178750 179015 179443 179924 180211 180015 179472 179133 179289 179638 179883
51432 179883 180247 181000 181794 181994 181540 180919 180361 179678 179006 178985 179826 180753 180891 180350 179912 179950 180292 180975 182372
51413 182372 184433 186424 187764 188619 189267 189280 187901 185137 181953 179334 177508 176204 175182 174224 172904
51398 172904 170878 168379 166001 163940 161839 159578 157733 156875 156692 156327 155391 154085 152377 149851 146618
51383 146618 143668 141808 140699 139487 137977 136606 135567 134721 134226 134406 134842 134399 132564 130183 128452
51368 128452 127563 126888 126174 125944 126671 128022 129091 129200 128393 127271 126446 126115 126048 125853 125179 123795 121757
51351 121757 119558 117834 116823 116230 115683 115050 114252 113097 111581 110149 109365 109413 110094 111165 112405 113535
51335 113535 114365 114995 115618 116193 116587 116978 117734 118769 119387 118954 117629 116198 115276 114761 114068 112774 111059
51318 111059 109540 108687 108349 107921 106998 105884 105334 105764 106720 107238 106769 105606 104352 103185 101916 100602
51302 100602 99659 99274 99092 98614 97605 95908 93290 89882 86553 84357 83615 83796 84228 84605 84903 85209 85682
51285 85682 86362 86944 87052 86747 86494 86563 86795 87035 87433 88172 89110 89892 90223 89946 89097 88031 87228 86811 86394
51266 86394 85635 84690 83987 83754 84025 84871 86279 87890 89180 89947 90395 90692 90699 90191 89201 88069 87220 86935
51248 86935 87208 87732 88143 88405 88933 90168 91986 93634 94446 94577 94815 95616 96615 97202 97298 97260 97250 97149 96986
51229 96986 96932 96894 96610 96234 96244 96608 96643 96103 95806 96572 97930 98610 98134 97233 96808 97118 98030 99335 100709
51210 100709 101883 103052 104547 105982 106396 105589 104604 104359 104341 103391 101446 99630 98753 98528 98378 98253 98280
51193 98280 98190 97592 96525 95343 94312 93662 93742 94604 95591 95842 95226 94292 93261 91656 89259 86883 85573
51176 85573 85268 84879 83732 82336 81465 81027 80323 79130 78003 77540 77782 78424 79220 80035 80794 81584 82552 83487
51158 83487 83763 82978 81516 80194 79398 78868 78316 77870 77770 77937 78107 78246 78597 79327 80319 81302 82082 82645
51140 82645 83151 83809 84630 85317 85532 85264 84794 84284 83599 82641 81633 80890 80425 80023 79666 79641 80183 81187 82320
51121 82320 83274 83812 83784 83255 82564 82133 82251 83054 84470 86045 87077 87307 87359 88136 89675 91026 91448 91400
51103 91400 92030 93884 96451 98851 100620 101854 102949 104271 105776 106924 107256 107096 107267 107926 108193 107339
51087 107339 105961 105356 105909 106741 106990 106753 106576 106627 106772 107019 107388 107682 107846 108311 109444 110782 111371 110880
51069 110880 109873 108964 108218 107528 107001 106686 106319 105690 105021 104652 104611 104823 105549 107172 109547 111863 113247
51052 113247 113404 112731 111978 111729 112018 112390 112401 112086 111899 112312 113470 115043 116372 116956 116929 116887 117180 117662 118220
51033 118220 119135 120522 121818 122350 122223 122119 122329 122566 122769 123426 124858 126647 128158 129353 130789 132890
51017 132890 135431 137670 138983 139477 139973 141218 143220 145632 148533 152259 156464 160102 162732 165223 168649
51002 168649 172960 177361 181677 186535 192211 197994 202997 207173 211290 216196 222351 229823 238453 247962
50988 247962 258015 268338 278996 290693 304579 321409 340846 361850 383752 406806 431750
50977 431750 459162 489294 522269 558237 597356 639558 684198 730084 776232 822618 869818
50966 869818 917840 965577 1011472 1054296 1093103 1126974 1155393 1178675 1197526 1212229 1222648
50955 1222648 1229006 1232130 1232753 1231043 1227096 1221657 1215961 1210958 1206978 1204097 1202447 1201957 1201922 1201027 1197864
50940 1197864 1191494 1181656 1168545 1152337 1132856 1109655 1082427 1051315 1016823 979565 940126 899105
50928 899105 857087 814555 771877 729448 687939 648413 612124 579867 551388 525613 501739
50917 501739 480030 461237 445402 431627 419032 407378 396569 386180 376035 366905 359929 355367
50905 355367 352400 350116 348147 346301 344255 342015 340265 339767 340559 342001 343509 344972 346611 348727 351482
50890 351482 354740 358158 361600 365379 369874 375048 380553 386204 392089 398281 404776 411707 419362 427922
50876 427922 437404 447926 459822 473409 488861 506412 526432 549101 574220 601652 631864 665726
50864 665726 703752 745811 791806 842384 898699 961483 1030641 1105864 1187342 1275565 1370493
50853 1370493 1471183 1576213 1684266 1794150 1904408 2012972 2117129 2213873 2300590 2375547
50843 2375547 2437751 2486454 2521188 2542300 2551047 2549057 2538087 2520482 2499278 2477269 2456191 2437262
50831 2437262 2422185 2412916 2410435 2414211 2422690 2433564 2443558 2448854 2446293 2433951 2410594 2375329 2328091
50818 2328091 2269730 2200976 2121766 2032228 1934055 1830364 1724373 1618605 1514957 1414844
50808 1414844 1319246 1229145 1145805 1070247 1002592 942356 889218 842943 802852 768124 738523
50797 738523 714022 693694 675875 659748 645973 635326 627406 621142 615930 611619 607875 604302 600908
50784 600908 597812 594693 591073 586939 582508 577560 571672 565032 558324 551762 544906 537617 530552 524352
50770 524352 518806 513296 507800 503048 499756 497997 497331 497324 497842 498968 500830 503703 508200 514996 524130
50755 524130 534839 546491 559500 574924 593321 614538 638601 666055 697185 731435 768076
50744 768076 807114 849149 894591 943427 995577 1051077 1109924 1171929 1236609 1302969 1369542
50733 1369542 1434847 1497678 1556756 1610433 1657098 1695719 1725660 1746149 1756430 1756318 1746214 1726784
50721 1726784 1699286 1666263 1631160 1596888 1565085 1536904 1513824 1497149 1487081 1482745 1482926 1486337
50709 1486337 1491485 1496778 1500631 1501035 1495322 1481138 1457764 1425917 1386227 1338659 1283688 1223244
50697 1223244 1159904 1095706 1032333 971897 916433 866538 821304 779791 742043 708562 679551
50686 679551 655035 635145 619740 608089 599408 593473 590299 589511 590572 593416 598310 605105 613188
50673 613188 622155 631967 642356 652652 662503 672336 682719 693505 703920 713349 721782 729626 737342
50660 737342 745269 753678 762944 773621 786219 800895 817548 836199 857099 880466 906420 935180
50648 935180 966981 1001698 1038932 1078523 1120478 1164106 1207750 1249787 1289540 1326747 1360519
50637 1360519 1389573 1413373 1432376 1447083 1457435 1463191 1464351 1460998 1453275 1441855 1428116 1413529
50625 1413529 1399090 1385561 1373912 1365023 1359040 1355367 1353324 1352599 1353023 1354128 1355099 1355162 1353997 1351766
50611 1351766 1348767 1345104 1340694 1335437 1329131 1321254 1310936 1297178 1279033 1255733 1227003 1193354
50599 1193354 1155871 1115574 1073056 1028761 983450 938296 894632 853533 815388 779845 746299
50588 746299 714577 685026 658018 633688 612188 593811 578594 566050 555632 547349 541610 538460
50576 538460 537231 537030 537426 538547 540644 543700 547591 552507 558960 567180 576655 586572 596669 607432
50562 607432 619456 632981 648067 664828 683237 702919 723387 744299 765334 786084 806360
50551 806360 826475 846957 868074 889889 912632 936750 962603 990409 1020490 1053351 1089453
50540 1089453 1129075 1172445 1219907 1271877 1328675 1390423 1457113 1528781 1605451 1686704 1771317
50529 1771317 1857658 1944457 2030907 2115954 2197871 2274733 2344845 2406399 2457160 2495144 2519538
50518 2519538 2530601 2528736 2514047 2486607 2446728 2395012 2332716 2262089 2185929 2106704 2026427
50507 2026427 1947356 1872200 1803344 1742114 1688921 1643846 1607002 1578697 1559435 1549467 1548171 1554159
50495 1554159 1566100 1583205 1604823 1629984 1657470 1685824 1712818 1735123 1749031 1751616 1741248
50484 1741248 1717355 1680160 1630672 1570718 1502878 1430284 1356063 1282502 1210684 1141057 1074262
50473 1074262 1011289 953013 899817 851691 808488 770030 736085 706320 680293 657523 637583
50462 637583 620200 605388 593467 584679 578614 574310 571226 569874 571008 574443 579248 584946 591713
50449 591713 599379 607216 615086 623926 634454 646059 657676 669256 681593 695026 709118 723437
50437 723437 737933 752622 767531 782897 798859 815042 831009 847055 863950 881998 900940
50426 900940 920705 941611 963816 987290 1012348 1039582 1069174 1100907 1134933 1171756 1211305
50415 1211305 1252679 1295009 1337874 1380614 1422016 1461077 1497398 1530399 1558836 1581651 1598717
50404 1598717 1610196 1615634 1614174 1605126 1587794 1561419 1526075 1483205 1434464 1380421 1321300 1258677
50392 1258677 1195448 1134096 1075848 1021517 972221 928905 891854 861025 836397 817711 804352
50381 804352 795823 792045 793043 798648 808648 822800 840378 859930 879684 897990 913352 924458
50369 924458 930427 930816 925273 913519 895906 873696 848498 821496 793309 764331 734947 705551
50357 705551 676644 648906 623063 599559 578357 559024 541143 524790 510491 498527 488320
50346 488320 478700 468830 458794 449440 441768 436322 432840 430529 428820 427777 427643 428381 429989 432871
50332 432871 437299 442792 448631 454821 461801 469380 476907 484568 493511 504299 516034 527456 538207
50319 538207 548617 558980 569588 580750 592075 602386 611104 619161 627741 636646 644891 652486 660410
50306 660410 668971 677358 685002 692250 699314 705471 709940 712897 715055 716659 717366 716711 714190 709215 701571
50291 701571 691831 680936 669398 657176 644206 630748 617298 604453 592772 582400 572767 562950
50279 562950 552579 542324 533297 525971 519814 514085 508831 504875 502842 502468 503013 504097 505914 508744
50265 508744 512461 516433 519779 521917 523084 524214 526064 528588 531267 533747 535846 537242 537638 537142 536011
50250 536011 534178 531427 527953 524216 520310 515993 511338 506792 502552 498455 494581 491356 488804 486292
50236 486292 483367 480401 478096 476696 476011 475877 476279 477277 479015 481522 484372 486938 489201 491839 495281
50221 495281 499148 502866 506233 508997 510521 510509 509649 508889 508348 507497 506068 504125 501526 498032 493782 489018
50205 489018 483483 476865 469746 463290 457909 452946 447838 442830 438275 433888 429100 423727 417954 412087
50191 412087 406536 401675 397458 393517 389798 386646 384009 381158 377611 373878 370811 368604 366951 365902
50177 365902 365780 366337 366634 365929 364226 361816 358717 354851 350392 345560 340151 333670 326035 317981 310581
50162 310581 304426 299400 295194 291779 289241 287397 285861 284438 283191 282121 281063 279892 278620 277292
50148 277292 276029 275155 274908 275020 274942 274612 274584 275249 276327 277380 278367 279359 280148 280648 281350 282795 284778 286663
50130 286663 288399 290615 293643 297048 300312 303488 306954 310905 315330 320116 324923 329244 332948 336502
50116 336502 340393 344477 348223 351472 354703 358536 363128 368030 372563 376422 379967 383833 388220 392802
50102 392802 397359 402068 406915 411249 414430 416775 419355 422855 427085 431566 436119 440685 445060 449143
50088 449143 453215 457642 462473 467532 472796 478450 484660 491466 498845 506738 515114 524070 533753 544091
50074 544091 554829 566013 578233 592111 607705 624614 642494 661107 680055 699005 718274
50063 718274 738755 761079 785136 810569 837387 865734 895237 924934 953904 981804 1008664
50052 1008664 1034193 1057307 1076480 1090714 1100186 1105899 1108883 1109970 1110107 1110319 1111118 1112224 1112929 1112362
50038 1112362 1109312 1102395 1090915 1075259 1056053 1033227 1006428 976167 943968 911429 879631 849446
50026 849446 821707 796785 774397 754167 736099 720343 706779 695069 684926 676080 668177 660906
50014 660906 654098 647557 640926 633882 626342 618369 610068 601679 593506 585516 577196 568101 558453 548924
50000 548924 539893 531146 522281 513170 504050 495384 487660 481065 475231 469446 463260 456836 450688 445199
49986 445199 440446 436339 432718 429368 426135 423124 420650 418873 417559 416373 415377 415000 415376 415909 415759
49971 415759 414719 413404 412576 412445 412673 412862 412900 412936 413159 413637 414384 415541 417339 419807 422676 425773 429461
49954 429461 434402 440976 449124 458660 469403 481033 493376 507020 523235 542934 565886 591271
49942 591271 618758 648749 681642 717182 754549 792840 831330 869252 905418 938371 967412
49931 967412 993462 1018409 1043373 1068053 1091969 1115585 1139562 1163244 1184691 1202014 1213949
49920 1213949 1219251 1216483 1204848 1184751 1157318 1123837 1085842 1045063 1002775 959487 915520 871460
49908 871460 827775 784605 742476 702705 666369 633127 601821 572110 544692 519983 497539
49897 497539 477097 459249 444446 431929 420402 409426 399434 390568 382311 374342 366998 360595 354841
49884 354841 349311 344045 339206 334513 329521 324341 319567 315479 311734 307896 303896 299889 296049 292597
49870 292597 289697 287152 284574 282058 280281 279598 279378 278768 277887 277684 278617 280090 281427 282852 285119 288385
49854 288385 291881 294622 296167 296729 296844 296997 297365 297772 297933 297835 297843 298410 299691 301439 303277 305024 306736
49837 306736 308520 310426 312582 315299 318893 323470 329060 335860 344121 353721 364108 374858 386137
49824 386137 398527 412559 428631 447169 468493 492433 518330 545513 573555 601953 629804
49813 629804 656043 679964 701338 720107 736206 749737 761138 771067 780200 789160 798457 808214
49801 808214 817873 826186 831537 832276 826923 814425 794540 768074 736629 701968 665543 628570 592333
49788 592333 558131 526793 498382 472562 449183 428385 410193 394288 380233 367722 356604
49777 356604 346907 338937 332963 328608 324820 320816 316834 313549 310932 308189 304886 301654 299624 299422
49763 299422 300726 302469 303451 303192 302374 302149 302893 304003 304938 305912 307300 308945 310434 311647 312556 312946
49747 312946 312909 313245 314694 316920 318905 320228 321296 322425 323435 324294 325425 327044 328689 329716 329984
49732 329984 329846 329804 330249 331209 332224 332856 333345 334290 335616 336471 336376 335900 335832 336335 337283 338829 340959 342939
49714 342939 343921 343899 343436 342695 341427 339798 338461 337726 337234 336605 335923 335480 335519 336337 338146 340601 342900
49697 342900 344523 345546 346087 345971 345235 344528 344471 344906 345181 345059 344861 344772 344447 343547 342303 341340 340949 340785
49679 340785 340242 339045 337383 335621 334062 333044 332937 333794 335091 336128 336704 337118 337536 337695 337465 337323
49663 337323 337941 339426 341243 342819 343916 344480 344473 344028 343566 343510 343874 344214 344049 343374 342720 342629 343089 343557 343594
49644 343594 343323 343210 343553 344392 345760 347725 350091 352277 353606 353715 352735 351255 350082 349778 350229 350758
49628 350758 350830 350577 350580 351179 352219 353401 354719 356373 358388 360474 362332 364083 366277 369403 373335 377360
49612 377360 380818 383735 386827 390833 395856 401272 406231 410377 414165 418461 423675 429376 434852 440001
49598 440001 445438 451717 458740 466010 473198 480254 487151 493881 500612 507580 514836 522366 530387 539227
49584 539227 548849 558867 569155 580149 592319 605558 619367 633451 647870 662709 677923 693513
49572 693513 709579 726170 743257 760899 779206 798092 817272 836656 856585 877463 899172
49561 899172 921030 942392 963289 984394 1006280 1028725 1050827 1071850 1091826 1111249 1130308
49550 1130308 1148626 1165776 1181796 1197081 1211855 1225837 1238437 1249202 1258058 1265110 1270309 1273547
49538 1273547 1275171 1276137 1277261 1278330 1278329 1276663 1273871 1270969 1268360 1265704 1262690 1259593 1257051 1255551 1255198
49523 1255198 1255850 1257438 1260217 1264659 1271042 1279184 1288682 1299230 1310495 1321857 1332676 1342866 1352811
49510 1352811 1362540 1371306 1378245 1383253 1386924 1389758 1391769 1392819 1392946 1392251 1390651 1387936 1383930 1378479
49496 1378479 1371359 1362347 1351376 1338600 1324327 1308933 1292738 1275863 1258154 1239265 1218908 1197129
49484 1197129 1174433 1151542 1128948 1106697 1084622 1062663 1040839 1019061 997201 975353 953867
49473 953867 933136 913489 895173 878145 861931 845991 830319 815435 801772 789380 778207
49462 778207 768233 759112 750208 741351 733182 726303 720395 714666 708952 703773 699443 695733 692489 689924
49448 689924 688150 686913 686013 685581 685723 686286 687235 688868 691354 694406 697742 701554 706239 711967 718933
49433 718933 727701 738554 750382 760721 767248 769335 768200 765761 763383 761520 760375 760538 762697 766739
49419 766739 771634 776596 782064 789085 797829 807194 815994 824172 832698 842520 853839 866266 879378
49406 879378 892963 906831 920665 934275 947894 961887 976111 989856 1002580 1014392 1025659
49395 1025659 1036454 1046732 1056675 1066395 1075474 1083288 1089717 1095087 1099489 1102679 1104703 1106066 1107143
49382 1107143 1107897 1108412 1109229 1110771 1112758 1114610 1116267 1118231 1120886 1124133 1127724 1131583 1135699 1139874 1143807
49367 1143807 1147433 1151069 1155178 1160041 1165652 1171873 1178585 1185694 1193187 1201233 1210085 1219735 1229832 1240118
49353 1240118 1250781 1262215 1274495 1287405 1300866 1315122 1330560 1347515 1366089 1385805 1405645
49342 1405645 1424884 1443976 1464166 1486200 1509780 1534326 1559693 1585983 1613138 1641121 1670162
49331 1670162 1700395 1731458 1762784 1794188 1825917 1858195 1890864 1923359 1954924 1985142 2014356
49320 2014356 2043323 2072242 2100374 2126784 2151121 2173398 2193437 2211014 2226306 2239670 2251127
49309 2251127 2260510 2268034 2274190 2279035 2282016 2282593 2280750 2276880 2271542 2265342 2258677 2251523 2243810 2236033
49295 2236033 2229048 2223173 2217970 2213155 2209195 2206588 2204993 2203676 2202655 2202771 2204587 2207793 2211933 2217214
49281 2217214 2224134 2232595 2241901 2251651 2262099 2273451 2285131 2296175 2306100 2314956 2322561 2328195 2331289
49268 2331289 2332038 2330987 2328210 2323290 2316009 2306677 2295688 2283128 2269029 2253748 2237718 2220808 2202230
49255 2202230 2181318 2158368 2134587 2111170 2088555 2066451 2044218 2020982 1995753 1968139 1939082
49244 1939082 1910377 1883161 1857143 1831510 1806129 1781456 1757660 1734551 1712320 1691663 1672956
49233 1672956 1655802 1639651 1624596 1611226 1599911 1590469 1582323 1574787 1567372 1560177 1553965 1549523 1546787
49220 1546787 1544717 1542157 1538880 1535796 1534121 1534310 1535762 1537545 1539317 1541500 1544657 1548874 1553729 1558691
49206 1558691 1563472 1568108 1572854 1577973 1583654 1590135 1597711 1606393 1615560 1624290 1632226 1639973 1648491 1658154
49192 1658154 1668462 1678577 1688014 1696961 1706084 1715967 1726576 1737258 1747376 1756917 1766310 1775750 1784944
49179 1784944 1793599 1801887 1810212 1818663 1826992 1835089 1843164 1851404 1859718 1868041 1876603 1885641 1895026 1904574
49165 1904574 1914665 1926030 1938801 1952204 1965456 1978600 1992109 2006000 2019864 2033622 2047651
49154 2047651 2062117 2076665 2090942 2105016 2119057 2132968 2146536 2159596 2171690 2181924 2189788
49143 2189788 2196119 2202721 2210855 2220355 2230338 2240302 2250152 2259488 2267564 2274146 2279995 2286225 2293322 2301002
49129 2301002 2308730 2316057 2322589 2328093 2332740 2336966 2340999 2344736 2348050 2350889 2353043 2354310 2355117 2356495
49115 2356495 2358984 2361851 2363841 2364548 2364601 2364688 2364965 2365438 2366353 2367992 2370364 2373215 2376114 2378464 2379861 2380508
49099 2380508 2381008 2381613 2382019 2381994 2381796 2381714 2381607 2381277 2381122 2381975 2384277 2387694 2391581 2395637 2400032 2404957 2410148
49082 2410148 2414986 2419140 2422966 2426977 2430992 2434200 2436074 2436830 2436845 2436058 2434230 2431337 2427328 2421799 2414384
49067 2414384 2405241 2394707 2382685 2368927 2353814 2338183 2322268 2305329 2286608 2266215 2244816
49056 2244816 2222856 2200501 2178064 2155955 2134192 2112407 2090486 2068959 2048554 2029436 2011113
49045 2011113 1993070 1975404 1958708 1943420 1929448 1916533 1904828 1894883 1887009 1880885 1875981 1872206
49033 1872206 1869876 1868981 1868791 1868511 1868260 1869085 1871781 1875935 1880360 1884350 1888178 1892329 1896591 1900179 1902550
49018 1902550 1903786 1904241 1904107 1903518 1902808 1902387 1902260 1901921 1900894 1899320 1897797 1896631 1895455 1893701 1891269 1888505
49002 1888505 1885655 1882558 1878841 1874229 1868703 1862599 1856558 1851136 1846382 1841945 1837577 1833306 1829124 1824808
48988 1824808 1820193 1815451 1810982 1807178 1804226 1801878 1799385 1795963 1791438 1786185 1780431 1773988 1766802 1759279
48974 1759279 1751828 1744419 1736919 1729525 1722539 1715997 1709889 1704493 1700093 1696582 1693739 1691649 1690418 1689741
48960 1689741 1689313 1689549 1691361 1695248 1701035 1708397 1716989 1726159 1735198 1744065 1753332 1763260 1773504 1783919
48946 1783919 1794934 1806689 1818361 1828958 1838551 1848196 1858712 1869923 1880947 1890965 1899835 1908373
48934 1908373 1917933 1929448 1942811 1957365 1972819 1989449 2007502 2026771 2046838 2067530 2089133
48923 2089133 2112274 2137511 2164910 2194126 2225027 2258073 2293763 2331771 2370948 2410275 2449612
48912 2449612 2489524 2530568 2572807 2615814 2659019 2702141 2745284 2788508 2831365 2873131 2913549
48901 2913549 2953049 2992046 3030215 3066750 3101277 3134173 3165956 3196667 3226048 3254080 3280969
48890 3280969 3306641 3330602 3352485 3372490 3391055 3408236 3423687 3437160 3448706 3458298 3465571 3470201
48878 3470201 3472442 3473072 3472724 3471302 3468096 3462402 3453970 3442793 3428641 3411134 3390446 3367558 3343452
48865 3343452 3318084 3290522 3260124 3227256 3192802 3157308 3120851 3083397 3044932 3005313 2964291
48854 2964291 2921850 2878466 2835085 2792789 2752302 2713637 2676285 2639869 2604607 2571132 2539921
48843 2539921 2510836 2483163 2456293 2430513 2407032 2386825 2369557 2354039 2339831 2327827 2319060
48832 2319060 2313404 2309860 2307720 2306980 2307814 2310156 2313794 2318579 2324537 2331920 2340979 2351522 2362939 2374948
48818 2374948 2387991 2402519 2418221 2434440 2451034 2468167 2485418 2501862 2517127 2531717 2546150
48807 2546150 2560400 2574437 2588652 2603320 2618084 2632488 2646714 2661381 2676789 2692696 2708689
48796 2708689 2724536 2740307 2756361 2773032 2790160 2807201 2823914 2840656 2857759 2875055 2892384
48785 2892384 2910177 2928983 2948624 2968403 2988045 3007883 3028107 3048441 3068681 3089051 3109641
48774 3109641 3129821 3148527 3165006 3179157 3191352 3202115 3211749 3219975 3225951 3228856 3228486 3225216 3219378
48761 3219378 3210768 3198771 3182948 3163526 3141355 3117431 3092464 3066838 3040765 3014311 2987375
48750 2987375 2959761 2931351 2902188 2872530 2842880 2813794 2785458 2757646 2730342 2704289 2680656
48739 2680656 2660184 2642792 2627898 2614854 2603192 2592961 2584878 2579780 2577792 2578284 2580710 2585075 2591473
48726 2591473 2599564 2608840 2619069 2630129 2641652 2653142 2664333 2675123 2685395 2695156 2704688 2714247
48714 2714247 2723775 2733231 2743023 2753620 2764835 2775973 2786746 2797601 2809012 2820834 2832564 2843948
48702 2843948 2855160 2866601 2878665 2891508 2904919 2918633 2932857 2948169 2964798 2982379 3000629
48691 3000629 3019894 3040661 3062807 3085835 3109710 3134922 3161632 3189242 3217012 3244760 3272650
48680 3272650 3300569 3328068 3354852 3380961 3406383 3430756 3453565 3474520 3493548 3510480 3524873
48669 3524873 3536134 3543768 3547583 3547849 3545207 3540147 3532492 3521566 3507011 3489198 3468668 3445435 3419191
48656 3419191 3390077 3358827 3326094 3292018 3256440 3219230 3180277 3139567 3097448 3054581 3011386
48645 3011386 2967788 2923729 2879566 2835677 2791937 2747994 2703998 2660673 2618731 2578425 2539558
48634 2539558 2501634 2464074 2426699 2389987 2354578 2320552 2287504 2255321 2224451 2195286 2167615
48623 2167615 2140884 2114736 2089110 2064021 2039529 2015863 1993371 1972257 1952364 1933213 1914389
48612 1914389 1895994 1878612 1862662 1847955 1834108 1821209 1809644 1799361 1789761 1780419 1771464 1763155
48600 1763155 1755500 1748424 1741897 1735707 1729569 1723650 1718573 1714602 1711318 1708457 1706498 1705896 1706210 1706740 1707784
48585 1707784 1710414 1714980 1720560 1726018 1731039 1735989 1741349 1747543 1754784 1762721 1770557 1777788 1784586 1791305
48571 1791305 1797975 1804469 1810733 1816578 1821615 1825777 1829643 1833828 1838296 1842669 1847028 1851917 1857642 1863913
48557 1863913 1870163 1875847 1880489 1883933 1886606 1889132 1891585 1893428 1894319 1894515 1894288 1893361 1891434 1889037 1887290
48542 1887290 1886700 1886591 1885955 1884662 1883579 1883604 1884823 1886638 1888462 1890108 1891629 1893079 1894524 1896093 1897801
48527 1897801 1899416 1900736 1902033 1904010 1907203 1911540 1916549 1921924 1927778 1934472 1942332 1951466 1961664 1972520
48513 1972520 1983797 1995764 2009019 2023921 2040219 2057317 2074848 2092957 2112034 2132263 2153408
48502 2153408 2175032 2196875 2218938 2241207 2263401 2285199 2306623 2327991 2349371 2370320 2390293
48491 2390293 2409164 2427063 2443822 2458885 2471859 2482853 2492199 2500062 2506520 2511737 2515713 2518004
48479 2518004 2518112 2516290 2513644 2511206 2508997 2506195 2502028 2496341 2489378 2481398 2472613 2463249 2453427 2443013
48465 2443013 2431706 2419251 2405512 2390488 2374453 2357985 2341642 2325525 2309323 2292867 2276457
48454 2276457 2260495 2244980 2229556 2213994 2198399 2182934 2167571 2152254 2137178 2122740 2109188
48443 2109188 2096379 2083945 2071738 2060132 2049876 2041503 2034861 2029226 2023945 2018913 2014446 2010760 2007657
48430 2007657 2004789 2002142 2000079 1998889 1998372 1998112 1998086 1998712 2000236 2002335 2004494 2006518 2008367 2009775 2010464
48415 2010464 2010732 2011338 2012696 2014511 2016341 2018169 2020171 2022236 2024086 2025759 2027695 2030308 2033552 2036822
48401 2036822 2039274 2040448 2040706 2040868 2041249 2041288 2040313 2038378 2036031 2033463 2030353 2026508 2022230 2017910 2013518
48386 2013518 2008620 2002762 1995791 1988029 1980189 1972936 1966392 1960120 1953619 1946769 1939867 1933352 1927427 1921746
48372 1921746 1915604 1908648 1901388 1894764 1889260 1884698 1880859 1877783 1875340 1872932 1869991 1866600 1863300 1860443
48358 1860443 1858028 1856140 1855141 1855270 1856146 1856876 1856700 1855568 1854062 1852677 1851220 1849019 1845768 1842013 1838670
48343 1838670 1836169 1834152 1831972 1829328 1826388 1823399 1820305 1816774 1812537 1807569 1801986 1795958 1789778 1783791
48329 1783791 1777992 1771830 1764729 1756791 1748654 1740653 1732507 1723981 1715447 1707385 1699540 1691107 1681856 1672692
48315 1672692 1664818 1658471 1652824 1647130 1641602 1636888 1632948 1629017 1624782 1621088 1619077 1618963 1620084 1621960
48301 1621960 1624706 1628413 1632724 1637203 1641700 1646187 1650633 1655219 1660254 1665611 1670627 1674853 1678505 1681862
48287 1681862 1684632 1686351 1687129 1687347 1686743 1684404 1679825 1673526 1666442 1658974 1650862 1641771 1631795 1621316
48273 1621316 1610467 1598805 1585714 1571210 1556127 1541344 1526991 1512644 1498093 1483601 1469453
48262 1469453 1455636 1442059 1428869 1416371 1404604 1393029 1380759 1367382 1353597 1340681 1329222
48251 1329222 1318687 1308499 1298985 1290774 1283634 1276621 1269310 1262156 1255656 1249756 1244295 1239377 1235001
48238 1235001 1230726 1226113 1221263 1216705 1212821 1209481 1205994 1201522 1195870 1189907 1184732 1180412 1176059 1171249
48224 1171249 1166697 1163197 1160550 1158013 1155263 1152212 1148299 1142827 1136014 1129026 1122821 1117351 1111988 1106265
48210 1106265 1100021 1093221 1085858 1077967 1069627 1061056 1052662 1044776 1037391 1030363 1023702 1017401 1011066 1004203
48196 1004203 996966 990259 984860 980662 976918 973095 969298 965991 963447 961480 959681 957910 956458 955669
48182 955669 955558 955933 956684 957625 958240 958111 957694 958110 959907 962342 964231 965254 966073 967395 969298 971404
48166 971404 973296 974658 975303 975278 974879 974469 974316 974541 975107 975842 976537 977103 977607 978169 978890 979892 981315 983221
48148 983221 985411 987354 988426 988389 987641 986862 986439 986335 986430 986667 986827 986539 985734 984828 984193 983683 983006 982335
48130 982335 982094 982285 982554 982918 983871 985619 987662 989405 990734 991750 992360 992627 993114 994262 995634 996463
48114 996463 996920 998199 1001148 1005455 1010495 1016448 1024107 1033949 1045975 1060349 1077704 1098761 1124017
48101 1124017 1153842 1188593 1228694 1274748 1327112 1384271 1440953 1488402 1517689 1523921 1508211
48090 1508211 1476401 1436106 1394081 1354956 1321206 1293799 1272781 1257564 1247137 1240477 1236852 1235717
48078 1235717 1236458 1238491 1241547 1245676 1250930 1257208 1264284 1271717 1278766 1284747 1289636 1293984 1298071 1301481
48064 1301481 1303809 1305495 1307388 1309571 1311136 1311275 1310185 1308617 1306926 1304936 1302545 1299907 1296964 1293219
48050 1293219 1288296 1282542 1276749 1271249 1265496 1258636 1250385 1241181 1231586 1221776 1211706 1201481 1191270
48037 1191270 1180896 1169856 1157806 1144780 1130907 1116275 1101248 1086482 1072258 1057966 1042680
48026 1042680 1026141 1008827 991210 973372 955323 937144 918776 900184 881927 865013 849851
48015 849851 835709 821495 806803 791919 777302 763389 750540 738654 727173 715983 705939
48004 705939 697870 691298 684921 678240 671870 666208 660707 654788 648688 642987 637957 633912 631504 630896
47990 630896 631017 630472 629119 628016 627882 628314 628692 629199 630462 632572 634984 637293 639620 642104 644350 645778
47974 645778 646510 647494 649433 651847 653610 654345 654697 655160 655284 654508 653247 652466 652344 652046 650875 649124 647584
47957 647584 646579 645710 644246 641624 637749 633034 628116 623452 619160 615170 611384 607788 604581 602110
47943 602110 600485 599357 598290 597301 596744 596812 597483 598859 601147 604253 607803 611589 615567 619394 622510
47928 622510 624893 627274 630283 633754 637160 640335 643350 646057 648251 650013 651376 651842 650840 648617
47914 648617 646017 643291 639667 634346 627427 619541 611055 602109 593130 584638 576511 568065 559111 550524
47900 550524 543326 537479 532073 526714 522094 518932 516793 514496 511524 508467 506093 504525 503583 503376 504126
47885 504126 505700 507777 510361 513718 517876 522529 527420 532509 537798 543333 549326 555930 562935 570121
47871 570121 577830 586531 595634 603441 608840 612575 616222 620207 623535 625292 625566 624847 623365 621448 619781
47856 619781 618602 617027 613883 609133 603889 599092 594715 590327 585842 581440 577140 572868 568741 565010
47842 565010 561778 558968 556479 554299 552587 551699 551931 553095 554466 555294 555341 554964 554958 556212 559058 562706
47826 562706 565728 567368 568115 568736 569240 569236 568879 568746 569011 569390 569824 570500 571162 571109 570057 568461 566778 564965
47808 564965 562924 560876 558976 557042 555007 553218 551964 551081 550382 549999 549949 549787 549143 548339 548106 549000 551347
47791 551347 555261 560238 565294 570102 575560 582543 590514 598180 605212 612386 620219 628473 637022 646139
47777 646139 655737 665202 674309 683469 692695 701161 708271 714416 720132 725114 728672 730679 731481 731326 730471
47762 730471 729425 728417 726943 724399 720871 716748 711972 706426 700699 695566 690870 685743 679997 674418
47748 674418 669552 665087 660731 656934 654166 652081 650038 648137 647161 647614 649258 651582 654334 657549 661285
47733 661285 665427 669732 674100 678845 684551 691569 699761 708808 718642 729379 740920 752740 764186
47720 764186 774951 785200 795097 804256 811922 817841 822599 826803 830217 832244 833050 833484 833789 833065 830337
47705 830337 825604 819443 812037 803097 792448 780236 766776 752635 738704 725701 713656 702161
47693 702161 691017 680311 670090 660415 651697 644506 638966 634713 631463 629363 628770 629932 632841 637116
47679 637116 642131 647588 653815 661153 669249 677477 685892 695041 704840 714467 723577 732783 742476 751929
47665 751929 760229 767511 774471 781048 786459 790356 793132 795049 795809 795159 793305 790511 786772 782156 776988
47650 776988 771480 765519 759053 752363 745706 739053 732427 726181 720617 715648 711119 707250 704325 702111
47636 702111 700012 697789 695718 693949 692081 689631 686723 684046 682021 680182 677531 673514 668547 663465
47622 663465 658596 653526 647662 640739 632870 624538 616612 609926 604426 599021 592638 585307 577935 571212
47608 571212 565144 559494 554095 548670 542851 536713 531039 526642 523444 520349 516125 510428 504051 498172
47594 498172 493311 489061 484796 480378 475886 470952 464927 457763 450302 443450 437396 431872 426803 422359
47580 422359 418534 415107 411949 409161 406865 405103 403974 403677 404371 406027 408335 410689 412428 413333 413870
47565 413870 414747 416254 418146 420122 422126 424138 425941 427275 428159 428926 429914 431122 432105 432257 431246 429196
47549 429196 426414 423104 419456 415891 412899 410560 408482 406246 403702 400697 396809 391664 385513 379236
47535 379236 373708 369200 365348 361592 357655 353679 349982 346710 343845 341483 339792 338531 336836 333901
47521 333901 329907 326003 323293 322002 321585 321338 320795 319876 318901 318278 318017 317768 317498 317744 318813 320077 320658
47504 320658 320699 321242 322747 324500 325806 327115 329317 332408 335545 338261 340897 343806 346794 349476 351665
47489 351665 353272 354299 355084 356083 357183 357724 357428 356787 356101 354742 352002 348355 345126 343068 341920 341276
47473 341276 341128 341391 341643 341662 341721 342068 342615 343492 345327 348349 351564 353573 354158 354504 355771 357954 360212
47456 360212 361845 362695 362987 363142 363570 364397 365439 366552 367857 369513 371463 373555 375763 378131 380674
47441 380674 383549 387104 391448 396070 400266 403979 407898 412655 418233 424310 430852 438051 445875 454006
47427 454006 462258 470767 479736 489158 498834 508546 518178 527760 537406 547129 556724 565943 574734 583157
47413 583157 591095 598281 604569 609924 614085 616609 617475 617290 616447 614272 609580 602195 593481 585041 577200
47398 577200 569095 560052 550374 540839 531953 523982 517256 511925 507472 502985 498073 493246 489245 486310
47384 486310 484275 483129 483067 484050 485680 487554 489586 491971 495049 499112 504027 509129 513864 518636 524507
47369 524507 531834 539595 546406 551905 556730 561428 565947 570056 573618 576239 577203 576105 573344 569676
47355 569676 565366 559994 553042 544557 535290 526224 517956 510412 503082 495418 487079 478062 468806 459937
47341 459937 451605 443260 434401 425439 417352 410526 404410 398375 392381 386690 381455 376886 373261 370377
47327 370377 367466 364182 361305 359810 359512 359334 358856 358840 360108 362500 365203 367569 369351 370635 371943
47312 371943 374099 377504 381659 385621 388773 390895 391801 391414 390167 388838 387856 386978 385777 384199 382494
47297 382494 380833 379206 377613 376147 374860 373647 372309 370688 368738 366561 364432 362756 361900 362006 362933
47282 362933 364407 366242 368396 370841 373433 375989 378568 381606 385619 390634 396068 401284 406293 411725
47268 411725 418098 425305 432910 440667 448539 456341 463658 470109 475524 479965 483745 487357 491064 494549
47254 494549 497220 498884 499932 500812 501590 502026 501809 500607 498298 495330 492546 490319 488109 485171 481481
47239 481481 477595 473797 469923 466017 462658 460406 459216 458551 457865 456866 455619 454638 454618 455772 457508 458985
47223 458985 460044 461436 464166 468684 474582 480944 487062 493013 499539 507260 516039 525138 533893 542009
47209 542009 549370 555889 561716 567305 573011 578594 583157 585680 585682 583590 580471 577204 573740 569269 563223
47194 563223 556033 548701 541765 534940 527845 520767 514477 509418 505413 502169 499779 498537 498398 498959 499972
47179 499972 501658 504416 508379 513428 519440 526302 533767 541617 550046 559626 570668 582833 595535
47166 595535 608627 622443 637226 652710 668301 683439 697751 710996 722922 733161 741326 747351
47154 747351 751703 755066 757783 759752 760795 760829 759681 757099 753186 748517 743556 738118 731762 724610 717485
47139 717485 711206 705936 701181 696237 690671 684613 678579 672962 667833 663383 660174 658422 657190 655031
47125 655031 651661 648420 646714 646501 646729 646855 647329 648791 651420 655029 659304 663886 668684 674130 680624
47110 680624 687596 693616 697741 700295 702073 703176 703069 701428 698385 694043 688333 681387 673639 665396
47096 665396 656623 647215 637228 626798 616155 605840 596477 588087 579900 571216 562312 554159 547275
47083 547275 541128 534754 527784 520830 514942 510636 507373 504082 500320 496769 494405 493380 492999 492697 492597
47068 492597 493092 494368 496532 499779 504028 508636 512882 516650 520362 524301 528379 532494 536712 540978
47054 540978 544927 548190 550704 552683 554449 556401 558889 561850 564734 567064 569022 571238 574006 576983
47040 576983 579801 582726 586439 591166 596297 600957 604867 608543 612688 617525 622680 627582 631965 636068
47026 636068 640381 645111 649914 654263 658125 662106 666807 672172 677618 682707 687496 692368 697709 703756
47012 703756 710551 717959 725834 734133 742705 751017 758361 764395 769321 773459 776860 779450 781314 782618
46998 782618 783373 783535 783312 783124 783241 783570 783803 783666 782996 781825 780520 779698 779801 780732 782041 783484 785251
46981 785251 787634 790690 794328 798518 803161 807896 812419 816946 822000 827614 833170 838291 843569 850009
46967 850009 857888 866471 874770 882309 889245 896061 903097 910141 916537 921872 926364 930313 933423 935165
46953 935165 935681 935762 935947 936149 936131 935762 934725 932628 929664 926598 923853 921145 918284 915659 913531 911481
46937 911481 909160 907085 906005 905853 905979 906147 906646 907602 908861 910427 912408 914613 916778 919072 921864
46922 921864 925110 928660 932915 938409 944742 950782 956016 960862 965513 969437 972503 975724 980220 985993
46908 985993 992336 998881 1005525 1011728 1016736 1020402 1023109 1024879 1025161 1023573 1020358 1015908 1010310 1003673
46894 1003673 996713 990661 986418 983860 982125 980701 980130 981437 984973 990143 996275 1003313 1011485 1020701
46880 1020701 1030585 1040852 1051310 1061695 1071839 1081889 1092101 1102419 1112379 1121309 1128613 1134139
46868 1134139 1138413 1142232 1145850 1148856 1150975 1152649 1154575 1157069 1160170 1163920 1168151 1172434 1176793 1182161
46854 1182161 1189428 1198201 1207129 1215444 1223617 1232461 1242138 1252137 1261724 1270183 1277049 1282356 1286496 1289734
46840 1289734 1292009 1293184 1293232 1292211 1290252 1287531 1284083 1279827 1275007 1270278 1265877 1261030 1254853 1247737
46826 1247737 1241147 1236075 1232357 1229541 1227533 1226170 1225018 1224187 1224715 1227501 1232253 1238064 1244708 1252814
46812 1252814 1262949 1275083 1288858 1303869 1319649 1335714 1351739 1367571 1383140 1398458 1413468
46801 1413468 1427709 1440365 1450884 1459344 1466003 1470776 1473477 1474324 1473804 1472140 1469216 1464930 1459340 1452591
46787 1452591 1445026 1437259 1429736 1422268 1414292 1405635 1396824 1388696 1381861 1376375 1371679 1366998 1362143 1357765
46773 1357765 1354553 1352354 1350513 1348901 1347999 1348003 1348514 1349258 1350545 1352620 1355056 1357289 1359441 1361998 1364774
46758 1364774 1366863 1367903 1369017 1372021 1377717 1385197 1392921 1400247 1407721 1416066 1425316 1435052 1445095 1455564
46744 1455564 1466327 1476780 1486299 1494751 1502470 1509905 1517327 1524707 1531703 1537797 1542614 1546194 1548930
46731 1548930 1551166 1552824 1553577 1553420 1552909 1552635 1552625 1552667 1553117 1554796 1557874 1561433 1564614 1567773 1571866 1577008
46715 1577008 1582328 1587269 1592308 1598244 1605303 1613169 1621302 1628939 1635229 1639850 1643233 1645793 1647162 1646499
46701 1646499 1643347 1637770 1629806 1619359 1606683 1592488 1577262 1560795 1542668 1523078 1502815 1482393
46689 1482393 1461584 1439993 1417827 1395728 1373985 1352371 1330844 1309899 1289885 1270392 1250809
46678 1250809 1231295 1212607 1195071 1178345 1162306 1147555 1134676 1123391 1112849 1102532 1092599
46667 1092599 1083474 1075470 1068730 1063223 1058727 1054906 1051493 1048556 1046673 1046720 1049137 1053422 1058659 1064557
46653 1064557 1071577 1080007 1089409 1099164 1109040 1118897 1128348 1137187 1145750 1154260 1162041 1167908 1171234 1172193
46639 1172193 1171205 1168755 1165659 1162773 1160249 1157544 1154317 1150891 1147739 1145016 1142852 1141776 1142534 1145625
46625 1145625 1151135 1158774 1167952 1178064 1188904 1200694 1213712 1228020 1243478 1259716 1276047 1291745
46613 1291745 1306435 1319977 1332010 1342008 1349721 1355092 1357688 1356818 1352419 1345237 1335900 1324438 1311144
46600 1311144 1297176 1283554 1269966 1255396 1239715 1223905 1208788 1194383 1180575 1167625 1155706
46589 1155706 1144561 1133977 1124113 1114980 1106017 1096668 1087134 1078179 1070327 1063538 1057382 1051138 1043955
46576 1043955 1035466 1026329 1017715 1010150 1003095 995848 988542 981965 976564 971970 967588 963369 959791 957183
46562 957183 955314 953681 951970 950132 948267 946681 945920 946404 947993 950177 952719 955823 959542 963390 966864
46547 966864 970200 974243 979535 985752 992139 998307 1004492 1011109 1018282 1025866 1033801 1042253 1051372 1061135
46533 1061135 1071540 1082753 1094794 1107259 1119710 1132309 1145677 1160073 1175145 1190652 1206999
46522 1206999 1224693 1243634 1263384 1283834 1305130 1327044 1349016 1370808 1392654 1414671 1436550
46511 1436550 1458010 1479082 1499690 1519220 1536896 1552469 1566327 1578999 1590655 1600949 1609229
46500 1609229 1614963 1618118 1619063 1618192 1615899 1612921 1610219 1608143 1605918 1602350 1596993 1590416 1583492 1576745
46486 1576745 1570316 1564115 1557759 1550641 1542253 1532494 1521604 1509882 1497470 1484255 1469914 1454030
46474 1454030 1436159 1415848 1392915 1367944 1342395 1317759 1294373 1271219 1247043 1221588 1195719
46463 1195719 1170600 1146964 1125050 1104884 1086463 1069876 1055357 1043124 1033016 1024449 1017071 1011477
46451 1011477 1008913 1010013 1013994 1019387 1025403 1032304 1040567 1050143 1060572 1071355 1082065 1092468 1102714
46438 1102714 1113021 1122940 1131412 1137870 1142858 1147096 1150336 1151776 1151296 1149581 1147210 1144395 1141595 1139473
46424 1139473 1137974 1136249 1133977 1132159 1132033 1133595 1135788 1137940 1140499 1144508 1150816 1159789 1171324 1185027
46410 1185027 1200469 1217326 1235317 1254332 1274768 1297369 1322441 1349484 1377905 1407712 1439045
46399 1439045 1471290 1503281 1534312 1564439 1593762 1621961 1648547 1673056 1694816 1713027 1727377
46388 1727377 1738265 1746098 1750670 1751448 1748255 1741410 1731398 1718762 1704182 1688355 1671646 1654058
46376 1654058 1635572 1616458 1597175 1578077 1559344 1541347 1524951 1511171 1500309 1491663 1484368 1478469
46364 1478469 1474878 1474379 1477033 1482578 1490975 1502342 1516677 1533886 1553952 1576905 1602781 1631748
46352 1631748 1664098 1699923 1738930 1780615 1824537 1870264 1917198 1964568 2011512 2057144 2100710
46341 2100710 2141770 2180030 2214893 2245385 2270626 2290183 2303818 2311109 2311558 2304927 2291321 2271124
46329 2271124 2245015 2213888 2178548 2139622 2097882 2054333 2009718 1964170 1917793 1871481 1826748
46318 1826748 1784767 1745915 1710206 1677744 1648624 1622761 1600039 1580503 1564323 1551731 1542975
46307 1542975 1538100 1536748 1538425 1543017 1550778 1561695 1575230 1590912 1608890 1629578 1652892 1678116
46295 1678116 1704463 1731535 1759230 1787430 1815869 1844221 1872297 1900160 1927902 1955173 1981040
46284 1981040 2004465 2024912 2042377 2056937 2068517 2077088 2082751 2085488 2084981 2080927 2073448 2063096 2050485
46271 2050485 2036092 2020367 2003793 1986701 1969158 1951228 1933372 1916435 1901178 1887821 1876045
46260 1876045 1865402 1855713 1847143 1840035 1834731 1831513 1830563 1831812 1834803 1838825 1843253 1847756 1852208 1856585
46246 1856585 1861014 1865663 1870358 1874396 1876993 1877873 1877230 1875206 1871687 1866580 1859952 1851829 1842153 1831056
46232 1831056 1818901 1805931 1792139 1777586 1762617 1747551 1732456 1717331 1702187 1686840 1671021
46221 1671021 1654957 1639449 1624965 1611040 1597060 1583297 1570594 1559301 1549138 1539960 1531945 1525088
46209 1525088 1519216 1514516 1511349 1509401 1507849 1506641 1506871 1509452 1514051 1519822 1526560 1534490 1543428 1552904
46195 1552904 1562874 1573582 1584857 1596197 1607464 1618895 1630415 1641557 1652100 1662276 1672137 1681243
46183 1681243 1689244 1696437 1703483 1710751 1718113 1725184 1731596 1737226 1742310 1747255 1752317 1757494 1762734 1768096
46169 1768096 1773699 1779685 1786216 1793379 1801084 1809201 1817739 1826779 1836328 1846344 1856810 1867541 1877996
46156 1877996 1887623 1896386 1904830 1913642 1923254 1933668 1944353 1954470 1963511 1971671 1979312 1986320 1992392
46143 1992392 1997771 2003046 2008195 2012457 2015307 2017040 2018282 2019415 2020621 2021899 2022732 2022301 2020382 2017591
46129 2017591 2014408 2010522 2005599 2000141 1994899 1989810 1984162 1977676 1970729 1963660 1956446 1949114 1941837 1934602
46115 1934602 1927188 1919588 1912055 1904722 1897519 1890431 1883477 1876511 1869522 1863014 1857551 1852915 1848245 1843167
46101 1843167 1838191 1833896 1830289 1827196 1824698 1822806 1821166 1819539 1818204 1817468 1817058 1816441 1815449 1814243 1812926
46086 1812926 1811706 1811222 1812075 1814014 1816126 1817895 1819680 1822020 1824915 1828026 1831275 1834947 1839368 1844675
46072 1844675 1850802 1857503 1864487 1871674 1879223 1887137 1894926 1901942 1908151 1914325 1921277 1929042 1937112 1945369
46058 1945369 1954348 1964470 1975500 1987116 1999591 2013277 2027599 2041390 2054379 2067589 2081932
46047 2081932 2097043 2112029 2126786 2141808 2157063 2171881 2185960 2199682 2213313 2226541 2239058
46036 2239058 2251000 2262409 2272787 2281663 2289382 2296848 2304538 2312117 2318956 2324764 2329727 2334253 2338569
46023 2338569 2342445 2345259 2346497 2346193 2344829 2342897 2340580 2337856 2334758 2331543 2328535 2325710 2322482 2318207
46009 2318207 2313016 2307880 2303629 2300078 2296422 2292279 2287971 2283842 2279851 2276066 2273148 2271833 2271919 2272150 2271325
45994 2271325 2269409 2267446 2266488 2266840 2268265 2270524 2273371 2276225 2278365 2279637 2280641 2281943 2283304 2283976 2283645
45979 2283645 2282788 2282110 2281940 2282151 2282396 2282355 2282056 2282036 2282856 2284291 2285287 2285054 2284046 2283517 2284166 2285586 2286989 2288087
45961 2288087 2289129 2290373 2291874 2293625 2295657 2298036 2300893 2304377 2308416 2312617 2316587 2320346 2324235 2328511
45947 2328511 2333207 2338347 2344014 2350169 2356701 2363729 2371542 2380116 2388981 2397849 2407101 2417300 2428396
45934 2428396 2439776 2450976 2461924 2472486 2482277 2491061 2499041 2506547 2513734 2520736 2527767 2534803 2541411
45921 2541411 2547281 2552662 2557925 2562878 2567000 2570328 2573560 2577056 2580209 2582175 2582956 2583331 2583812 2584173 2584106
45906 2584106 2583982 2584554 2586106 2588209 2590343 2592403 2594431 2596136 2597078 2597287 2597402 2598051 2599296 2600840 2602632
45891 2602632 2605116 2608921 2614410 2621405 2629163 2636670 2643192 2648686 2653689 2658798 2664268 2670004 2675853 2681803
45877 2681803 2687920 2694073 2699775 2704402 2707624 2709571 2710624 2711125 2711261 2710997 2710022 2707938 2704617 2700238 2694884
$$ [...]
##END NTUPLES=NMR SPECTRUM
##END=
