##TITLE=NES1088_T11_9884960_lD6dxsbMPy
##JCAMPDX= 6.0         $$ Bruker NMR JCAMP-DX V2.0
##DATA TYPE= NMR SPECTRUM
##DATA CLASS= NTUPLES
##ORIGIN= BRUKER
##OWNER= Administrator
$$ 1.72 TOPSPIN		Version 2.1
$$ 2016-08-27 23:16:55.461 -0500  Administrator@X
$$ Compression mode = diff/dup
##.OBSERVE FREQUENCY= 400.02188249412
##.OBSERVE NUCLEUS= ^1H
##.ACQUISITION MODE= SIMULTANEOUS (DQD)
##.ACQUISITION SCHEME= undefined
##.AVERAGES= 8
##.DIGITISER RES= 22
##SPECTROMETER/DATA SYSTEM= spect
##.PULSE SEQUENCE= zg30
##.SOLVENT NAME= COFFEE_meoh
##.SHIFT REFERENCE= INTERNAL, COFFEE_meoh, 1, 14.98509
##AUDIT TRAIL= $$ (NUMBER, WHEN, WHO, WHERE, PROCESS, VERSION, WHAT)
$$ ##TITLE= Audit trail, TOPSPIN		Version 2.1
$$ ##JCAMPDX= 5.01
$$ ##ORIGIN= Bruker BioSpin GmbH
$$ ##OWNER= Administrator
$$ $$ E:\/data/COFFEE/nmr/NES1088_T11_9884960_lD6dxsbMPy/10/pdata/1/auditp.txt
$$ ##AUDIT TRAIL=  $$ (NUMBER, WHEN, WHO, WHERE, PROCESS, VERSION, WHAT)
(   1,<2016-08-27 23:16:48.351 -0500>,<Administrator>,<X>,<go>,<TOPSPIN 2.1>,
      <created by zg
	started at 2016-08-27 23:15:42.648 -0500,
	POWCHK enabled, PULCHK disabled,
       configuration hash MD5:
       21 0F 79 D6 B3 7B B4 F6 88 20 88 DB 03 48 BD 9F
       data hash MD5: 64K
       EC FF 36 34 70 38 32 33 5B 1F 24 39 10 36 B7 0A>)
(   2,<2016-08-27 23:16:51.445 -0500>,<Administrator>,<X>,<proc1d>,<TOPSPIN 2.1>,
      <Start of raw data processing
       efp LB = 0 FT_mod = 6 PKNL = 1 PHC0 = 0 PHC1 = 0 SI = 32K 
       data hash MD5: 32K
       E9 63 E7 2F CC 52 AC 3F 6C 44 75 C3 1A D9 30 88>)
(   3,<2016-08-27 23:16:51.726 -0500>,<Administrator>,<X>,<proc1d>,<TOPSPIN 2.1>,
      <pk PHC0 = 92.1698 PHC1 = 0 
       data hash MD5: 32K
       B4 CC 4E E4 20 B0 03 91 DA 73 34 50 2C 65 8B C9>)
(   4,<2016-08-27 23:16:51.836 -0500>,<Administrator>,<X>,<proc1d>,<TOPSPIN 2.1>,
      <abs ABSG = 1 
       data hash MD5: 32K
       36 54 78 A5 47 E2 14 CC 52 98 2C 6C C9 33 69 D4>)
(   5,<2016-08-27 23:16:51.883 -0500>,<Administrator>,<X>,<proc1d>,<TOPSPIN 2.1>,
      <abs ABSG = 2 
       data hash MD5: 32K
       5D 49 F2 A3 CD 51 E4 7B D5 A3 EC F0 49 45 CE CE>)
(   6,<2016-08-27 23:16:51.945 -0500>,<Administrator>,<X>,<proc1d>,<TOPSPIN 2.1>,
      <abs ABSG = 3 
       data hash MD5: 32K
       FF 1F CD BF 5A 59 1F 67 EA B5 C2 21 CA 38 AC 36>)
(   7,<2016-08-27 23:16:52.008 -0500>,<Administrator>,<X>,<proc1d>,<TOPSPIN 2.1>,
      <abs ABSG = 4 
       data hash MD5: 32K
       0C B4 A3 3E EB BB 8B 95 F2 B2 25 B8 CA 91 86 A5>)
(   8,<2016-08-27 23:16:52.054 -0500>,<Administrator>,<X>,<proc1d>,<TOPSPIN 2.1>,
      <abs ABSG = 5 
       data hash MD5: 32K
       91 B7 DA 1E 48 CB 7D 73 50 1A DD 67 86 7B 90 C1>)
$$ ##END=
$$ 
$$ $$ hash MD5
$$ $$ 5A D5 4A 1C 0C C7 D9 74 DE 6F 8C A6 CA 11 1B 1B
##$RELAX= 
##$RELAX= 
##$RELAX= 
##$RELAX= 
##$RELAX= 
##$RELAX= 
##$RELAX= 
$$ Bruker specific parameters
$$ --------------------------
##$DU= <E:\>
##$EXPNO= 10
##$NAME= <NES1088_T11_9884960_lD6dxsbMPy>
##$PROCNO= 1
$$ [...]
150 150 150 150 150 150 150 150
##$TP07= 0
##$TPNAME0= <>
##$TPNAME1= <>
##$TPNAME2= <>
##$TPNAME3= <>
##$TPNAME4= <>
##$TPNAME5= <>
##$TPNAME6= <>
##$TPNAME7= <>
##$TPOAL= (0..7)
0.5 0.5 0.5 0.5 0.5 0.5 0.5 0.5
##$TPOFFS= (0..7)
0 0 0 0 0 0 0 0
##$TUNHIN= 0
##$TUNHOUT= 0
##$TUNXOUT= 0
##$USERA1= <user>
##$USERA2= <user>
##$USERA3= <user>
##$USERA4= <user>
##$USERA5= <user>
##$V9= 5
##$VALIST= <valist>
##$VCLIST= <CCCCCCCCCCCCCCC>
##$VD= 0
##$VDLIST= <DDDDDDDDDDDDDDD>
##$VPLIST= <PPPPPPPPPPPPPPP>
##$VTLIST= <TTTTTTTTTTTTTTT>
##$WBST= 1024
##$WBSW= 4
##$XGAIN= (0..3)
0 0 0 0
##$XL= 0
##$YL= 0
##$YMAX_a= 562848
##$YMIN_a= -471643
##$ZGOPTNS= <>
##$ZL1= 120
##$ZL2= 120
##$ZL3= 120
##$ZL4= 120
##$ABSF1= 14.98509
##$ABSF2= -5.573092
##$ABSG= 5
##$ABSL= 3
##$ALPHA= 0
##$AQORDER= 0
##$ASSFAC= 0
##$ASSFACI= 0
##$ASSFACX= 0
##$ASSWID= 0
##$AUNMP= <proc_prof1d_extract_pilot.lims>
##$AXLEFT= 0
##$AXNAME= <>
##$AXNUC= <1H>
##$AXRIGHT= 0
##$AXTYPE= 0
##$AXUNIT= <>
##$AZFE= 0.1
##$AZFW= 0.1
##$BCFW= 0
##$BC_mod= 0
##$BYTORDP= 0
##$COROFFS= 0
##$CY= 15
##$DATMOD= 1
##$DC= 0
##$DFILT= <>
##$DTYPP= 0
##$F1P= 0
##$F2P= 0
##$FCOR= 0.5
##$FTSIZE= 32768
##$FT_mod= 6
##$GAMMA= 0
##$GB= 0
##$INTBC= 1
##$INTSCL= 1
##$ISEN= 128
##$LB= 0
##$LEV0= 0
##$LPBIN= 0
##$MAXI= 10000
##$MC2= 0
##$MEAN= 0
##$ME_mod= 0
##$MI= 0
##$NCOEF= 0
##$NC_proc= -8
##$NLEV= 6
##$NOISF1= 0
##$NOISF2= 0
##$NSP= 0
##$NTH_PI= 0
##$NZP= 0
##$OFFSET= 14.98509
##$PC= 1
##$PHC0= 92.1698
##$PHC1= 0
##$PH_mod= 1
##$PKNL= yes
##$PPARMOD= 0
##$PPDIAG= 0
##$PPIPTYP= 0
##$PPMPNUM= 2147483647
##$PPRESOL= 1
##$PSCAL= 4
##$PSIGN= 0
##$PYNMP= <proc.py>
##$REVERSE= no
##$SF= 400.02
##$SI= 32768
##$SIGF1= 0
##$SIGF2= 0
##$SINO= 400
##$SIOLD= 32768
##$SPECTYP= <>
##$SREGLST= <1H.CDCl3>
##$SSB= 0
##$STSI= 32768
##$STSR= 0
##$SW_p= 8223.68421052631
##$SYMM= 0
##$S_DEV= 0
##$TDeff= 65536
##$TDoff= 0
##$TI= <>
##$TILT= no
##$TM1= 0
##$TM2= 0
##$TOPLEV= 0
##$USERP1= <user>
##$USERP2= <user>
##$USERP3= <user>
##$USERP4= <user>
##$USERP5= <user>
##$WDW= 1
##$XDIM= 32768
##$YMAX_p= 434539195
##$YMIN_p= -700979
##$CURPLOT= <Network HP LaserJet P1505>
##$CURPRIN= <$Network HP LaserJet P1505>
##$DFORMAT= <normdp>
##$LAYOUT= <+/1D_H.xwp>
##$LFORMAT= <normlp>
##$PFORMAT= <normpl>
##$SURQMSG= 1
$$ End of Bruker specific parameters
$$ ---------------------------------
##NTUPLES= NMR SPECTRUM
##VAR_NAME=  FREQUENCY,     SPECTRUM/REAL,   SPECTRUM/IMAG
##SYMBOL=    X,             R,               I
##VAR_TYPE=  INDEPENDENT,   DEPENDENT,       DEPENDENT
##VAR_FORM=  AFFN,          ASDF,            ASDF
##VAR_DIM=   32768,         32768,           32768
##UNITS=     HZ,            ARBITRARY UNITS, ARBITRARY UNITS
##FACTOR=    0.250966925370066, 1,           1
##FIRST=     8223.43324360094, -85587,       -169073
##LAST=      0,             125953,          -161740
##MIN=       0,             -700979,         0
##MAX=       8223.43324360094, 434539195,    0
$$ Real data points
##PAGE= N=1
##DATA TABLE= (X++(R..R)), XYDATA
$$ [...]
19503a46098j02588O4810M3709k94913h2633J7314j38j79827J14259M2470A0750
$$ -146098 -248686 -183876 -140167 -435080 -82633 -65319 -65457 -245284 -131025 -88555 10750
19491C4384a92200C7501J26196a31382E1429a21454e8575h396r2633j67366i2652
$$ 34384 -192200 37501 163697 -131382 51429 -121454 -58575 -8396 -101029 -268395 -92652
19479i6200l71585a03629A03493a54595j26278d0922A54479b73471J15312n5424
$$ -96200 -467785 -103629 103493 -154595 -280873 -40922 154479 -273471 -158159 -213583
19469b13583K2841Q7833D6129K52757b2012A25259i2623k30010i7907B24294a38268
$$ -213583 -190742 -102909 46129 298886 -22012 125259 -92623 -322633 -97907 224294 -138268
19457b33391e0160B01119e4599j62872j01381G21a80309b7256G2165c30742i0644
$$ -233391 -50160 201119 -54599 -217471 -318852 721 -180309 -27256 72165 -330742 -90644
19445a45983R088F0978e0365A52041E3083O6005m2403a25623F0947c80q0826l2629
$$ -145983 -136895 60978 -50365 152041 53083 119088 76685 -125623 60947 -380 -81206 -113835
19433a13835C59427b31045i1461b1855F9677L52K07215r5316a16815B8525b12490
$$ -113835 359427 -231045 -91461 -21855 69677 70029 277244 181928 -116815 28525 -212490
19421b492k71630F5923J37853b60884d2645c35F4584j4781O554Q355a12921A01278
$$ -2492 -274122 65923 203776 -260884 -42645 -335 64584 49803 56357 64712 -112921 101278
19408a30929c9326k40400p8548A20677a20814A38156b32673A02082i0879d186
$$ -130929 -39326 -279726 -358274 120677 -120814 138156 -232673 102082 -90879 -4186
19397C3861a9164I7493c25903B31068B7138a4021k11204B49120j00335a34017
$$ 33861 -19164 97493 -325903 231068 27138 -14021 -225225 249120 148785 -134017
19386e2396r0177b0030G3322a75497h1514o9398j75269A3432g4403n8916b0713
$$ -52396 -142573 -20030 73322 -175497 -81514 -150912 -326181 13432 -74403 -133319 -20713
19374D3874N0647B8025a48803a8948k03830B20969a32q6308r5024c4298H9352
$$ 43874 94521 28025 -148803 -18948 -222778 220969 -132 -86440 -181464 -34298 89352
19362a17807B36741c6141k61430Q0838Q2180c4479m07683a72516E2548a87027
$$ -117807 236741 -36141 -297571 -216733 -134553 -34479 -442162 -172516 52548 -187027
19351D8587c53505h2112k84851f9323Q149j80379N1779A09655f4949n7851C5079
$$ 48587 -353505 -82112 -366963 -69323 -61174 -241553 -189774 109655 -64949 -122800 35079
19339a56139A63074P0799a13647C27537F4134O5551a76405b8117j53904d8194
$$ -156139 163074 233873 -113647 327537 64134 129685 -176405 -28117 -182021 -48194
19328A78828b22283f3546j23344B35928c39238a38596d1895E6174a16074j26510
$$ 178828 -222283 -63546 -186890 235928 -339238 -138596 -41895 56174 -116074 -242584
19318b42584A12749M9979J2814b02111g5114A75808h4594A95718b5554A05378
$$ -242584 112749 162728 175542 -202111 -75114 175808 -84594 195718 -25554 105378
19307d82k40936B8528c50306A46267C4663a65946E9027g8173p11b3060A104a34753
$$ -482 -241418 28528 -350306 146267 34663 -165946 59027 -78173 -78884 -23060 1104 -134753
19294I2499b07063A01320b69345A80323h4522B3798a28655C57369g8304I5522
$$ 92499 -207063 101320 -269345 180323 -84522 23798 -128655 357369 -78304 95522
19283b08799I0217b99521L4704A00240k8364c23151C6935a27293j8070E3969d6772
$$ -208799 90217 -299521 -264817 100240 71876 -323151 36935 -127293 -145363 53969 -46772
19271A66435A5391a06296q4459k9178K37F3436g6155L4968J4690R687m01509B62270
$$ 166435 15391 -106296 -190755 -219933 -219696 63436 -76155 -41187 -26497 -16810 -418319 262270
19258A02100h9808j5696D3050P0085b39867a15310o6884G8633R0416q1219J09910
$$ 102100 -89808 -105504 43050 113135 -239867 -115310 -182194 78633 169049 87830 197740
19247A97740b63236F7337b34886R1818j73206h4077E160b02698m3628h2033j6118
$$ 197740 -263236 67337 -234886 -143068 -316274 -84077 5160 -202698 -246326 -82033 -98151
19236i8151A8444J63093a95992P880G3779k2430K26054a03751j3979B2364J82761
$$ -98151 18444 181537 -195992 -188112 73779 51349 277403 -103751 -117730 22364 205125
19225B05125N7372h8863b399A47273b79085e8743o6807p69B80602h3565j43607
$$ 205125 262497 -88863 -2399 147273 -279085 -58743 -125550 -126319 280602 -83565 -227172
19214b27172A22832d3974h106k45818B63588e7010k6477n7056e8289k43514A07675
$$ -227172 122832 -43974 -8106 -253924 263588 -57010 -83487 -140543 -58289 -301803 107675
19202C02894H8293f7099k278j43915j92818O0117C6032b86968j55021C906P2667
$$ 302894 88293 -67099 -69377 -213292 -406110 -345993 36032 -286968 -441989 3906 76573
19191G6573a68170M2403d3555E3213a15294q1640L0814o7749D3663f6397j70714
$$ 76573 -168170 -125767 -43555 53213 -115294 -196934 -166120 -233869 43663 -66397 -237111
19180b37111G8127c0181j64982j16787A13154a35691a2553E6311N9534n2149K9336
$$ -237111 78127 -30181 -195163 -311950 113154 -135691 -12553 56311 115845 63696 93032
19169I3032L68371a13300j42030R6866j56042B49095b05711L0828J689k7625C71090
$$ 93032 461403 -113300 -255330 -158464 -314506 249095 -205711 -174883 -173194 -200819 371090
19157b16303C571e5674j18632m3320g7439j15054j21846P1234E5616E386g5359
$$ -216303 3571 -55674 -174306 -217626 -77439 -192493 -314339 -243105 55616 5386 -75359
19145a66228B29173a86598E2590b37187B40219c2380j56302A78e61048g5529d53
$$ -166228 229173 -186598 52590 -237187 240219 -32380 -188682 178 -561048 -75529 -453
19133a54459K4573j70876c188j25011e2152J6959a0134n33132f2691B32536q8262
$$ -154459 -129886 -300762 -3188 -128199 -52152 -35193 -10134 -543266 -62691 232536 144274
19122A44274E8926f2674G4433a67457j82577a64945A81114F8156g4026C53188
$$ 144274 58926 -62674 74433 -167457 -350034 -164945 181114 68156 -74026 353188
19111G6052c70300a06154k57571J56168M1279C42541C081K3728N2711C1804J39660
$$ 76052 -370300 -106154 -363725 -207557 -166278 342541 3081 26809 79520 31804 171464
19100A71464r838c7201B77403b71392f7784j17554j72927B31042a47730c1273
$$ 171464 161626 -37201 277403 -271392 -67784 -185338 -358265 231042 -147730 -31273
19089a26728D8926K0434F639i2293k046k99357a12636k06838C6572c94970a59359
$$ -126728 48926 69360 6639 -92293 -94339 -393696 -112636 -319474 36572 -394970 -159359
19077D2134j6614c08986F4879L9850c5446A73057j9621a79395M5332N3043F60
$$ 42134 25520 -308986 64879 104729 -35446 173057 153436 -179395 -134063 -81020 660
19065b04026H7519a35212N6306k39364a38968n0210B08944n1158E2551F164i2494
$$ -204026 87519 -135212 -78906 -318270 -138968 -189178 208944 157786 52551 6164 -92494
19053B0925J06759c47149E1770h2617k10838G0406K0622b55892B40897r0877b34913
$$ 20925 127684 -347149 51770 -82617 -293455 70406 91028 -255892 240897 150020 -234913
19041I234i3387k92711J4043A73616a08974k0910H8909k9493J0815a38256B5640
$$ 9234 -93387 -386098 -372055 173616 -108974 -129884 88909 59416 70231 -138256 25640
19029a05719D17080d3072A52113A2610J13821b62162J7595A77835a29751A07665
$$ -105719 417080 -43072 152113 12610 126431 -262162 -244567 177835 -129751 107665
19018A19629i2851j17908A91600r4562A8763L9107b60493B6321H459J44160C5453
$$ 119629 -92851 -210759 191600 97038 18763 57870 -260493 26321 8459 152619 35453
19006a06343A01645c6088D3450b7405A52696d39012a52647k9823d8887k69051
$$ -106343 101645 -36088 43450 -27405 152696 -439012 -152647 -182470 -48887 -317938
18996c17938f9358r1730J3128C3755g1983k10041N5052J13084A02944a87007A05425
$$ -317938 -69358 -161088 -147960 33755 -71983 -282024 -226972 -113888 102944 -187007 105425
18984E9547P6765a81053L6567j21795J30428K3376L3981b1279B3715g5336C73239
$$ 59547 136312 -181053 -144486 -266281 -135853 -112477 -78496 -21279 23715 -75336 373239
18972F1460K80731D0027e3680I833a7100A67153H1936J25564c18724J38653d4123
$$ 61460 342191 40027 -53680 9833 -17100 167153 81936 207500 -318724 -180071 -44123
18960f0188j40635m0324A83641h8170d176n5698a6809A02563c44011J18396B87751
$$ -60188 -200823 -241147 183641 -88170 -4176 -59874 -16809 102563 -344011 -225615 287751
18948A74250j0462a32143j40695J25860C79413a66087N0421C40506a85162I8737
$$ 174250 163788 -132143 -272838 -146978 379413 -166087 -115666 340506 -185162 98737
18937H2335J0798a04869j94543F3548c4104j8702A09835b49171g3968n55j60513
$$ 82335 93133 -104869 -299412 63548 -34104 -52806 109835 -249171 -73968 -74523 -235036
18926b35036l1683i559l02244A79356l4495J66583b97242a1205I2730m3484c61306
$$ -235036 -266719 -9559 -311803 179356 144861 311444 -297242 -11205 92730 49246 -361306
18914b27088H2343h5610f661G6394R7667M6476e6208n2340k5153A89820a27213
$$ -227088 82343 -85610 -6661 76394 174061 220537 -56208 -108548 -133701 189820 -127213
18902b293n7478k65227a48927G5191c54221e0786D5540O3622D7658a12175D0514
$$ -2293 -59771 -324998 -148927 75191 -354221 -50786 45540 109162 47658 -112175 40514
18890b92742D7523b72660C0015a84570B67105F3416k6419N4093a03571l2497j06285
$$ -292742 47523 -272660 30015 -184570 267105 63416 36997 91090 -103571 -136068 -242353
18879b42353l3138i5362j35744d1444A06044l9535I108E46c33570B48154a98317
$$ -242353 -275491 -95362 -231106 -41444 106044 66509 9108 546 -333570 248154 -198317
18867a73643j33661A89176a7214k3269J0366r0841a7017C3796a88055A30059b56769
$$ -173643 -307304 189176 -17214 -40483 -30117 -120958 -17017 33796 -188055 130059 -256769
18855c9956k9669j52989j73540F6710c9809A13916C1377a74732j0742f4867n5766
$$ -39956 -69625 -222614 -396154 66710 -39809 113916 31377 -174732 -185474 -64867 -120633
18844a20633K5257C06194M0344H372a67771g99I6922c3765l2042l399B43774j8155
$$ -120633 -95376 306194 346538 8372 -167771 -799 96922 -33765 -65807 -69206 243774 225619
18832B25619G2834a12122p6198G0240K10085a85964k06221B76291F7471J79804
$$ 225619 72834 -112122 -188320 70240 280325 -185964 -392185 276291 67471 247275
18822B47275b22040j25619A7086o761Q5268c14456e0932j29730B01796A6571a82032
$$ 247275 -222040 -347659 17086 10325 95593 -314456 -50932 -180662 201796 16571 -182032
18810e2631D4249O965b1060A60063N851f9483k1536q4071f8137A72764a80427
$$ -52631 44249 51214 -21060 160063 165914 -69483 -91019 -175090 -68137 172764 -180427
18798E7951P015d806B29867E1771J85918b37115g0532j42355Q5980k3754j36243
$$ 57951 64966 -4806 229867 51771 237689 -237115 -70532 -212887 -126907 -150661 -286904
18787b86904B3009P1757a94315M5560A2802f0827E3750a29308B07952H4320b74952
$$ -286904 23009 94766 -194315 -148755 12802 -60827 53750 -129308 207952 84320 -274952
18775D1949a1623B6306J57689c16261J05317i6056c9197M969A25175A6561b12445
$$ 41949 -11623 26306 183995 -316261 -210944 -96056 -39197 -34228 125175 16561 -212445
18763h907A83958i2051c377I8786a26341N7393j27181A80629b41733B10448g1444
$$ -8907 183958 -92051 -3377 98786 -126341 -68948 -196129 180629 -241733 210448 -71444
18751a0863j03596k79246d6496k87064G1332K7747c2827B52302e3081F2530e9712
$$ -10863 -114459 -393705 -46496 -333560 71332 99079 -32827 252302 -53081 62530 -59712
18739c0933k26679I4828E722g0712q0685A58391a24788k16375N1304C7193J61710
$$ -30933 -257612 94828 5722 -70712 -151397 158391 -124788 -341163 -289859 37193 198903
18728A98903e8631j53441K0623P7914j42540p7134J23182F1694a82745j760c4571
$$ 198903 -58631 -212072 -191449 -113535 -256075 -333209 -210027 61694 -182745 -184505 -34571
18716A81865C5140L9199q847f5699G8214J82946d8836k77866c8059j64382j49957
$$ 181865 35140 74339 65492 -65699 78214 261160 -48836 -326702 -38059 -202441 -352398
18705c52398J65421A84978g4243b638A42442b73364D5275A5276K29639A251J87446
$$ -352398 -186977 184978 -74243 -2638 142442 -273364 45275 15276 244915 1251 188697
18694A88697e1684o8261q4111a8569j2303A42762b4264E6455O4799D004a04378
$$ 188697 -51684 -119945 -204056 -18569 -30872 142762 -24264 56455 121254 4004 -104378
18682b78320M2985A96831b94047a25609j33756B78683J25832h7224a4535B85785
$$ -278320 -235335 196831 -294047 -125609 -259365 278683 404515 -87224 -14535 285785
18671a36614j64922A86614d32775J78492M8553A26584F2564d05055E1783j5140
$$ -136614 -301536 186614 -432775 -254283 -205730 126584 62564 -405055 51783 36643
18661C6643q018J20331M428a18416m8704N925B488c7490j8955A96652F706K35003
$$ 36643 28625 148956 153384 -118416 -167120 -161195 2488 -37490 -56445 196652 6706 241709
18649B41709C1380a45998B45913h3068k51608J27693J00276l2985d2399j55654
$$ 241709 31380 -145998 245913 -83068 -334676 -206983 -106707 -139692 -42399 -198053
18639a98053h7438j89945e1563G80g7559D4668P8680b96759i2752A16787a6384
$$ -198053 -87438 -277383 -51563 780 -77559 44668 123348 -296759 -92752 116787 -16384
18627f2006H12e5786I8511a00422b5751C3875c4856c547C4300J49335J1028F1506
$$ -62006 812 -55786 98511 -100422 -25751 33875 -34856 -3547 34300 183635 194663 61506
18614a68571M1940j48668p8834G2140b56886j882F9806b4320q6529k01054R1305
$$ -168571 -126631 -275299 -354133 72140 -256886 -258768 69806 -24320 -110849 -311903 -220598
18603b20598R440q5092A60480b56230A46997P538a54532c2890C9744a21893G5147
$$ -220598 -211158 -296250 160480 -256230 146997 154535 -154532 -32890 39744 -121893 75147
18591b82430A4072M0269a47181P1347A78755c55506J76613A26132c19886P5897
$$ -282430 14072 54341 -147181 -75834 178755 -355506 -178893 126132 -319886 -243989
18581b43989a09369M6381K2852j95831E0240R8769e1248A48306p3615b45516J15387
$$ -243989 -109369 -62988 -40136 -235967 50240 149009 -51248 148306 74691 -245516 -130129
18570a30129b851j70596A43685F7506a78724H220e84284A4233N9548c06473J25198
$$ -130129 -2851 -173447 143685 67506 -178724 8220 -584284 14233 73781 -306473 -181275
18559a81275a5157k07930N072B28894a28054j43621J20484j53537a09748D06200
$$ -181275 -15157 -223087 -218015 228894 -128054 -271675 -151191 -304728 -109748 406200
18548d5033A84768M2898d2647o4009q3019O6099C4082b6945m52224e90j06491
$$ -45033 184768 227666 -42647 -106656 -189675 -123576 34082 -26945 -479169 -590 -107081
18537a07081D10308b50205G7732a92577A24861b5529m4487B5616L68001A12707
$$ -107081 410308 -250205 77732 -192577 124861 -25529 -70016 25616 393617 112707
18526a16760A90576Q8808o30a50525J117C29881A1577K6351a91794d9584k4085
$$ -116760 190576 279384 278754 -150525 -149408 329881 11577 37928 -191794 -49584 -73669
18515g3669j73453L5350j42027H6460L15a34012G8866b1402r1155r4b169B28290
$$ -73669 -247122 -211772 -353799 86460 86775 -134012 78866 -21402 -112557 -112651 -2169 228290
18502A37767c35135F158b56590B21727I8695a16801B23802g7599A55579a02886
$$ 137767 -335135 6158 -256590 221727 98695 -116801 223802 -77599 155579 -102886
18491a11304C71711A79059e8270J8335p0040H5007a23780A27010j4889c4698k9030
$$ -111304 371711 179059 -58270 -39935 -109975 85007 -123780 127010 112121 -34698 -63728
18480f3728k33273a31162c6439j60638E2071N2025a11099F6362h5835j90935B41919
$$ -63728 -297001 -131162 -36439 -197077 52071 104096 -111099 66362 -85835 -276770 241919
18468d8178B01051A8455a28502A92381c9642B96052a5413j53097r7056A24315
$$ -48178 201051 18455 -128502 192381 -39642 296052 -15413 -168510 -265566 124315
18457A29257C256K51796g9826Q218J3343q1279m6435e8590A72019b79826h9857
$$ 129257 3256 255052 -79826 -71608 -58265 -139544 -185979 -58590 172019 -279826 -89857
18445G5177a475A94522E3273a70741E6221a31793C6224a16062A52540b5591j4069
$$ 75177 -1475 194522 53273 -170741 56221 -131793 36224 -116062 152540 -25591 -39660
18434c9660A6251a45467M2111b0390j17403d1391E4375d8307l03664a8748A47198
$$ -39660 16251 -145467 -103356 -20390 -137793 -41391 54375 -48307 -351971 -18748 147198
18422b02288K1181G545J47639k2463b47286L8106g8513A01965D6785g2044B7998
$$ -202288 -181107 7545 155184 132721 -247286 -209180 -78513 101965 46785 -72044 27998
18410F9423K5426l5344a89688o3704C4166N9759o7a59928A68985i3031l45179
$$ 69423 94849 59505 -189688 -253392 34166 93925 93858 -159928 168985 -93031 -438210
18399d38210i82B25971B2667J97009a6568j54162F8904L3773f6348B22008b29698
$$ -438210 -982 225971 22667 219676 -16568 -170730 68904 102677 -66348 222008 -229698
18387b12529I6861e8720C37855e4075C756e9738j47414O4496D069e1814A95357
$$ -212529 96861 -58720 337855 -54075 3756 -59738 -207152 -142656 4069 -51814 195357
18375D4943J02436C4621c3132I6961k2656a92245F5311a11556r5501f2293A23109
$$ 44943 147379 34621 -33132 96961 74305 -192245 65311 -111556 -207057 -62293 123109
18363d9051j82161P1120A82168G6206g5126L5082H4185K71570p0833A06800B5872
$$ -49051 -231212 -160092 182168 76206 -75126 -40044 84185 355755 284922 106800 25872
18351b69569e5536j61437F3582a91541B76510B9708I132c64069e5742j09178o8316
$$ -269569 -55536 -216973 63582 -191541 276510 29708 9132 -364069 -55742 -164920 -233236
18340b33236C16084b43245a627E8855A744f5504J2755J1907j01619M1475E4385
$$ -233236 316084 -243245 -1627 58855 1744 -65504 -52749 -40842 -142461 -100986 54385
18328I6680f7729M725o983b3134C7545E0b47982a07395B14555b083C6248a17445
$$ 96680 -67729 -63004 -69987 -23134 37545 50 -247982 -107395 214555 -2083 36248 -117445
18315F9772l3590c10763g3898j8661M1142B16719a13861C55220a47344A57513
$$ 69772 36182 -310763 -73898 -92559 -51417 216719 -113861 355220 -147344 157513
18304B44499d52857F1668a11785j35413l782e7347B65477C7185Q9624A5629h689
$$ 244499 -452857 61668 -111785 -247198 -250980 -57347 265477 37185 126809 15629 -8689
18292h0574o6816b6254j04031b2620f555k25096C9259f9812K6038o746p9201A602
$$ -80574 -147390 -26254 -130285 -22620 -6555 -231651 39259 -69812 -43774 -50520 -129721 1602
18279B5659a75127b2579j83731a00497A89745a91709N350O7346d3656B4335c0775
$$ 25659 -175127 -22579 -206310 -100497 189745 -191709 -186359 -119013 -43656 24335 -30775
18267b07941b0474B06188B2539a03419q5211A73114o8196a4441p9858B47682m3459
$$ -207941 -20474 206188 22539 -103419 -188630 173114 104918 -14441 -94299 247682 204223
18256B04223a09101L9854k04l69727a10601d3919j06332A86801E0297b74543a7763
$$ 204223 -109101 -69247 -69451 -439178 -110601 -43919 -150251 186801 50297 -274543 -17763
18244b82101i1947E4088b7172m2135j79358e20n0990j90798Q7138a7173k91932
$$ -282101 -91947 54088 -27172 -69307 -248665 -520 -51510 -242308 -155170 -17173 -309105
18233c09105F9332a86590B58868a78525H5683L05349A79699a78193G9733b70900
$$ -309105 69332 -186590 258868 -178525 85683 391032 179699 -178193 79733 -270900
18222a74056A72541a99531b4478G0048J32277B0429e5558p9001r9435h4160A6830
$$ -174056 172541 -199531 -24478 70048 202325 20429 -55558 -134559 -233994 -84160 16830
18210c17171a24855p6088A35451d04285a0794j5508A70868a77365C6237J2881
$$ -317171 -124855 -200943 135451 -404285 -10794 -26302 170868 -177365 36237 49118
18200D9118a78060B1523a19775a4498B991c30798a0576r4997A7046J02458a02296
$$ 49118 -178060 21523 -119775 -14498 2991 -330798 -10576 -105573 17046 119504 -102296
18188A09223m7006L69696A02716h2695j30455A67068J25003j35992n7947e6403
$$ 109223 62217 431913 102716 -82695 -213150 167068 292071 156079 98132 -56403
18177e7943j15581F4080k4256L8559b7314j03271L1099K7151C7254b24046d7253
$$ -57943 -173524 64080 39824 78383 -27314 -130585 -99486 -72335 37254 -224046 -47253
18165E8313a42900M5113A25287f9782j3676B94112F6841J86657a91632g4128C7035
$$ 58313 -142900 -97787 125287 -69782 -83458 294112 66841 253498 -191632 -74128 37035
18153A05706e1845A78131Q3497A10584J10755I7535b9137j14435b4683k16588
$$ 105706 -51845 178131 261628 110584 221339 97535 -29137 -143572 -24683 -241271
18143b41271b4562A46767C0149R4415A4118J48659R3634a676A34108a196k69623
$$ -241271 -24562 146767 30149 124564 14118 162777 256411 -1676 134108 -1196 -270819
18132b70819G0999a54326c6368F2270O0915c5976p6177j0745C3078i2584n9813
$$ -270819 70999 -154326 -36368 62270 123185 -35976 -112153 -122898 33078 -92584 -152397
18121a52397d6841I7158b86783C13152D2195c76115a40237J3991B33443r1199
$$ -152397 -46841 97158 -286783 313152 42195 -376115 -140237 -126246 233443 142244
18111A42244Q05n5467a61194f3595q0411p2933I3201O1647a89010L7383m148f8961
$$ 142244 143049 87582 -161194 -63595 -144006 -216939 93201 154848 -189010 -151627 -155775 -68961
18098i0654j3152M6627j0465A9378a28629r6737C3912d02185B9899g2876H6633
$$ -90654 -103806 -57179 -67644 19378 -128629 -225366 33912 -402185 29899 -72876 86633
18086a62649o1876A99374q8060a04971G4933a20429j89681a11966H2758c39801
$$ -162649 -224525 199374 111314 -104971 74933 -120429 -310110 -111966 82758 -339801
18075c7423k34471J01612A46674K2564b72468o7794h5331o756G1041h4915F9725
$$ -37423 -271894 -170282 146674 169238 -272468 -340262 -85331 -92087 71041 -84915 69725
18063A3943M930b09314d3543o0796A18481g2546B0362c7996p2473g3j42840m4299
$$ 13943 18873 -209314 -43543 -104339 118481 -72546 20362 -37996 -110469 -73 -142913 -187212
18051a87212c240C3868a28237A153c2280A14943J93775e4272k25817a01216A12340
$$ -187212 -3240 33868 -128237 1153 -32280 114943 308718 -54272 -280089 -101216 112340
18039A15573l9126b79705a2064q7757L7368e187A38490J96244I6732D0794g353
$$ 115573 76447 -279705 -12064 -99821 -62453 -5187 138490 334734 96732 40794 -7353
18027A97833a33319J7917q0793c6985A82488H2605J77896f2237A27623h0477B84276
$$ 197833 -133319 -115402 -196195 -36985 182488 82605 260501 -62237 127623 -80477 284276
18015B6303b81522A07384B3844i4717C87554A61999O956a81213C47904b59436
$$ 26303 -281522 107384 23844 -94717 387554 161999 168955 -181213 347904 -259436
18004D9019K50715b24913A46875c35286H4454c99880a62612k9347F2190G621g8852
$$ 49019 299734 -224913 146875 -335286 84454 -399880 -162612 -191959 62190 7621 -78852
17992b12678A74128k9449M9089l710A5317O7789o954E834O2561b5292A17921J62729
$$ -212678 174128 144679 193768 190058 15317 83106 76152 5834 68395 -25292 117921 280650
17980B80650h1752A89783c8025k0613A17267N5100K8283a42756A90708q8835o667
$$ 280650 -81752 189783 -38025 -58638 117267 172367 200650 -142756 190708 101873 95206
17969I5206b276A12498c62248a06171B37672a81545b0582c714C9935J25336i146
$$ 95206 -2276 112498 -362248 -106171 237672 -181545 -20582 -3714 39935 165271 -9146
17957B5189a68241g6290k1802E3189c2441o4608D0111P3772B2381a06400A46040
$$ 25189 -168241 -76290 -98092 53189 -32441 -97049 40111 113883 22381 -106400 146040
17945d174j93779B77774a40198A59261E0292N740a71041G5171e8595B21725a63642
$$ -4174 -197953 277774 -140198 159261 50292 56032 -171041 75171 -58595 221725 -163642
17933b15697c4743l35876a06276F6332h8687F8504h9487F8708b6587C4842a99183
$$ -215697 -34743 -370619 -106276 66332 -88687 68504 -89487 68708 -26587 34842 -199183
17921a49275G1979p958O265A4546a17761a3539q0859B79235A06104i799B96887
$$ -149275 71979 64021 70286 14546 -117761 -13539 -94398 279235 106104 -9799 296887
17909C33888c0405q0570A72225i0641o8499i835B26398A09520b6509k333C6970
$$ 333888 -30405 -110975 172225 -90641 -159140 -9835 226398 109520 -26509 -28842 36970
17897C29069j06829J23101B403a90376e1994A42071a70362A80307i7846B26848
$$ 329069 222240 345341 2403 -190376 -51994 142071 -170362 180307 -97846 226848
17886A85200b54326D33356A08719j5017a0891A39186a63795m9359g7299A84542
$$ 185200 -254326 433356 108719 93702 -10891 139186 -163795 -213154 -77299 184542
17875A35994n1030a85601A99991o805G6914K2534a93871M8397K6184A66865b42825
$$ 135994 84964 -185601 199991 193186 76914 99448 -193871 -145474 -119290 166865 -242825
17863a89924f6189n6267j0645C88185D5568d16469A45751a33043f0417A48808
$$ -189924 -66189 -122456 -133101 388185 45568 -416469 145751 -133043 -60417 148808
17852a09246C24553j49724C1696a84976A83239b22135f8401B09167a02071F6698
$$ -109246 324553 174829 31696 -184976 183239 -222135 -68401 209167 -102071 66698
17841C81340B938b64468A4910M5060b3912A74538q2042m2393b32173a4152A46003
$$ 381340 2938 -264468 14910 59970 -23912 174538 92496 50103 -232173 -14152 146003
17829C3361J49832a80900G2452K69020q6725R5641j1889a36794A62722b3199j83560
$$ 33361 183193 -180900 72452 341472 254747 350388 338499 -136794 162722 -23199 -206759
17818b06759Q8048o9571D6188k439K20128A0652K59563E8369b33451G5687e5852
$$ -206759 -118711 -188282 46188 43749 263877 10652 270215 58369 -233451 75687 -55852
17806D0893a45503L217j04769A2814f1801A94309a29129A48119a41895b1054j30292
$$ 40893 -145503 -142286 -247055 12814 -61801 194309 -129129 148119 -141895 -21054 -151346
17795a51346d6090a5555r157I6483M4514h4706A7848b19655i9789p4362B24545
$$ -151346 -46090 -15555 -24712 96483 140997 -84706 17848 -219655 -99789 -174151 224545
17783e0415A75333a6547j06913B33440l5604B4470J75190N3504A20247b28416
$$ -50415 175333 -16547 -123460 233440 197836 24470 199660 253164 120247 -228416
17772H0670B3172R4876c5085r1221b5389l41117H0107a32707e3180b0198E6609
$$ 80670 23172 118048 -35085 -126306 -25389 -366506 80107 -132707 -53180 -20198 56609
17760a17533d2204B8802J72225d4909A1162f1998C40891C6254K01391A410J34821
$$ -117533 -42204 28802 201027 -44909 11162 -61998 340891 36254 237645 1410 136231
17749A36231a97184C06117G7336Q7605n3399I568O9933i3765c9871A7247g7407
$$ 136231 -197184 306117 77336 164941 111542 9568 79501 -93765 -39871 17247 -77407
17737d6546l31720H6311m1422Q634a1284k40418A88003p9611A1095J8221J64076
$$ -46546 -378266 86311 44889 53523 -11284 -251702 188003 108392 11095 29316 193392
17726A93392n9808Q659J09901p7049N6648a83333c165B35411l4079B2374N4916
$$ 193392 133584 142243 252144 175095 231743 -183333 -3165 235411 201332 22374 77290
17715G7290h7335A20774j1467f4493K3498C36603q6197l6920I5038M3798a08300
$$ 77290 -87335 120774 109307 -64493 -40995 336603 250406 213486 95038 138836 -108300
17703b74502K5264B5916b87780D69174I6732O7376G1034J72990I0235A6586K9325
$$ -274502 -249238 25916 -287780 469174 96732 164108 71034 244024 90235 16586 45911
17692D5911K33658f0216l9075C44404b115A34540O329A5326K466d6537F8333K19358
$$ 45911 279569 -60216 -99291 344404 -2115 134540 140869 15326 17792 -46537 68333 287691
17680B87691a40888A63658a69046e3533j16360a7667j6507j90561A54890p3286
$$ 287691 -140888 163658 -169046 -53533 -169893 -17667 -34174 -224735 154890 81604
17670H1604B4648J13401a02895j24386I4639b67248a6872C05637d01306d2060
$$ 81604 24648 138049 -102895 -227281 94639 -267248 -16872 305637 -401306 -42060
17659F7363Q4855A8179G523M3037K1026K17072d6569C95122b4211C6186M59480
$$ 67363 152218 18179 7523 50560 71586 288658 -46569 395122 -24211 36186 495666
17648D95666a56004D2126c4472o7201A34811a620C01584h0707B77162B2678K65264
$$ 495666 -156004 42126 -34472 -101673 134811 -1620 301584 -80707 277162 22678 287942
17637B87942a11068D58621a2133A76388D53a63530A16527J79711a47074d9169
$$ 287942 -111068 458621 -12133 176388 453 -163530 116527 296238 -147074 -49169
17626A09392l1201a29437A62402d134B3171Q6218C6231e7035j76D324c22082B17614
$$ 109392 78191 -129437 162402 -4134 23171 109389 36231 -57035 -57211 4324 -322082 217614
17613B03993f4919j35318G976J17139a95412F0408B0424J58149f1838C02957b23073
$$ 203993 -64919 -200237 7976 125115 -195412 60408 20424 178573 -61838 302957 -223073
17601A26049N7208n3235C0908a34537A42645B7217O0717b15229C5247b72681B45534
$$ 126049 183257 130022 30908 -134537 142645 27217 87934 -215229 35247 -272681 245534
17589b30822B90827l4471b2142H4780I291a6204j0880D83959I0954l2011K04116
$$ -230822 290827 256356 -22142 84780 9291 -16204 -27084 483959 90954 58943 263059
17578B63059r154J54885B4924r381K20645A10896B2629L36318a2592k7429I8468
$$ 263059 253905 408790 24924 15543 236188 110896 22629 358947 -12592 -40021 98468
17566B10313c6017A75379L51913B39719A11063J95089R7104a14773H3721J76255
$$ 210313 -36017 175379 527292 239719 111063 306152 403256 -114773 83721 259976
17556B59976D3271J62531b621B73370O4122j0166o0505c9953j17733B50551B2199
$$ 259976 43271 205802 -2621 273370 337492 327326 266821 -39953 -157686 250551 22199
17544C87981A44490a16424D8467a50290A66096a49558I2342J14254C0661K72506
$$ 387981 144490 -116424 48467 -150290 166096 -149558 92342 206596 30661 303167
17534C03167l0050o1081k2204k5001J2558q6372Q0638m1636J86193q5415L1093
$$ 303167 273117 212036 189832 164831 177389 91017 171655 130019 316212 230797 261890
17523B61890M22927L1337j68762J74263j46772k01053J03501A40856J44505m4240
$$ 261890 684817 716154 547392 721655 574883 373830 477331 140856 285361 241121
17513B41121D9880K44929J20278p1270r6480N49381C04652L12766K90804l47152
$$ 241121 49880 294809 415087 343817 247337 796718 304652 617418 908222 561070
17503E61070H1042O599b208C11385A19487L12212j43524k58D5037J23924K73284
$$ 561070 81042 87641 -2208 311385 119487 431699 288175 287917 45037 168961 442245
17492D42245A73139D2252K3290J28413J29373g3044A61739q0295J01847m2593
$$ 442245 173139 42252 65542 193955 323328 -73044 161739 81444 183291 140698
17482A40698l60o5107M3627C7482K11085c9832j80011i4408o9370D1778J69935
$$ 140698 140338 75231 118858 37482 248567 -39832 -219843 -94408 -163778 41778 211713
17471B11713o9278K7377M7056M2429o3680f5404D52391k12893m0806n958r0411
$$ 211713 142435 169812 216868 259297 195617 -65404 452391 239498 198692 192734 102323
17460A02323a0514j74924A61109J7394c0823D93551D8351L98492J77121g9396
$$ 102323 -10514 -185438 161109 178503 -30823 493551 48351 446843 623964 -79396
17449A42528j7846C9757J35837a05575G2258h7401A58028J75539J1667A48563
$$ 142528 124682 39757 175594 -105575 72258 -87401 158028 333567 345234 148563
17438A34352K23726j0241P5437o1920j67341l0245f8337A73472l5181L46771j18665
$$ 134352 358078 347837 423274 361354 194013 163768 -68337 173472 138291 485062 366397
17427C66397L2948C4945J45095K74187A45546J27803k280J37571q5494c1385C89507
$$ 366397 399345 34945 180040 454227 145546 273349 271069 408640 323146 -31385 389507
17415A90086K22328A10424Q7501a2638C43330p0540r0512Q4773r6307H0686R0473
$$ 190086 412414 110424 197925 -12638 343330 272790 182278 267051 170744 80686 171159
17404A71159K01484b3790k33298B97370e5457C35259o974A06262A3307J32000
$$ 171159 372643 -23790 -257088 297370 -55457 335259 328285 106262 13307 145307
17394A45307J67003j39298O7298J76247r1047j1848j37774p0656L42041P2488
$$ 145307 312310 173012 240310 416557 325510 313662 175888 105232 447273 519761
17384E19761A86850i2461D48632j06557j15105l1805K25027j66553P0976A4040
$$ 519761 186850 -92461 448632 342075 226970 195165 420192 253639 324615 14040
17373C39348C6181K54741r5116A4338i4439p4035B20634d7390A13485M27783a23993
$$ 339348 36181 290922 195806 14338 -94439 -168474 220634 -47390 113485 541268 -123993
17361e6559A25391D1572N9976K98740A45308N7007d3382A45028g4617j24584A08605
$$ -56559 125391 41572 101548 400288 145308 202315 -43382 145028 -74617 -199201 108605
17349A7999L97689a42596B80836b62299J23546C67935j13901H0735J23937l7569
$$ 17999 415688 -142596 280836 -262299 -138753 367935 254034 80735 204672 167103
17339A67103L76882r8662G2169L2238M1619K08236r2361j16180e4373D69542B5569
$$ 167103 543985 445323 72169 104407 146026 354262 261901 145721 -54373 469542 25569
17327A43940l6410K95858J18479d552E6282J09779O0169j5546d301F4490a80748
$$ 143940 107530 403388 521867 -4552 56282 166061 226230 210684 -4301 64490 -180748
17315A80695k5039K1935H0572L56291j13921o8876L7318l1197L0506J8840N5094
$$ 180695 155656 177591 80572 436863 322942 254066 291384 260187 290693 309533 364627
17304C64627A35427K82430a26596A09213D9756B1247R6693J16945R6096j38998
$$ 364627 135427 417857 -126596 109213 49756 21247 117940 234885 330981 191983
17294A91983J54812n6752d9527C6444N30193B4434c2939D20743Q5976j29382j05637
$$ 191983 346795 290043 -49527 36444 566637 24434 -32939 420743 506719 377337 271700
17283B71700m0486j746K87226j31340A03042l5716L31131q1050p9252K70921C4101
$$ 271700 231214 229468 516694 385354 103042 67326 398457 317407 238155 509076 34101
17271A11812a31497e7981C84734j26233A02352K51123j68369k9653i22A00094
$$ 111812 -131497 -57981 384734 258501 102352 353475 185106 155453 -922 100094
17260A56572Q3008p4056K27186a28885A91101m0349J13480D3169L43732J98053
$$ 156572 239580 165524 392710 -128885 191101 150752 264232 43169 386901 584954
17250E84954B91635j09852G1520L0873K96421D0798K2309K65187O0262a24699
$$ 584954 291635 181783 71520 102393 398814 40798 63107 328294 388556 -124699
17239C43842M9374f4367C9307J49073L26528H0958J8851L53835C7915L69816j70536
$$ 343842 393216 -64367 39307 188380 514908 80958 99809 453644 37915 407731 237195
17228B37195d0202a9962D0270M46860A9806L89901A69637L56329A24021J79076
$$ 237195 -40202 -19962 40270 487130 19806 409707 169637 525966 124021 303097
17218C03097C6716N10762o6502A33764K55611q5424Q0418a19101A50526K00029
$$ 303097 36716 547478 480976 133764 389375 303951 384369 -119101 150526 350555
17208C50555J10013J01136B64731K02957b6146C29547j45133o0475J26295p1547
$$ 350555 460568 561704 264731 467688 -26146 329547 184414 123939 250234 178687
17198A78687K36189N32J74494j30241D497O9248K30395j3788I980M87874A92187
$$ 178687 414876 415408 589902 459661 4497 73745 304140 290352 9980 497854 192187
17186D14237A10595J51567J8191r6893J28146q4394Q1198j53697K52019K62872
$$ 414237 110595 262162 280353 183460 311606 227212 308410 154713 406732 669604
17176F69604H7105L72830j34752A47729M45644E4203J64879J27430q0988N0995
$$ 669604 87105 459935 325183 147729 593373 54203 219082 346512 265524 316519
17166C16519M7871J54247B18143C0184L36945K7694L3982j51174A16961N29785
$$ 316519 364390 518637 218143 30184 367129 394823 428805 277631 116961 646746
17156F46746B45847A14134M4218L21901j41642N680I9682O61065B38533K4119
$$ 646746 245847 114134 158352 480253 338611 344291 99682 760747 238533 262652
17146B62652l2227R3885R2929A93304p4907M00165A95041N9494O481R9092K40805
$$ 262652 230425 324310 417239 193304 118397 518562 195041 254535 261016 360108 600913
17135F00913k20105j41353p9441L8476K18222j15809J39169k3925J13854j7240
$$ 600913 380808 239455 160014 198490 416712 300903 440072 416147 530001 512761
17125E12761Q7011l2913A05663J24166M383N44730k07106r39F0775M23119J36771
$$ 512761 599772 566859 105663 229829 234212 778942 571836 570897 60775 483894 620665
17114F20665k29491L78348k31682A98900M15990j65004A01815J56839J77986J05165
$$ 620665 391174 769522 537840 198900 614890 449886 101815 258654 436640 541805
17104E41805B12574A8045N33833k69112M16216j44569J60109j25895k1759o9417
$$ 541805 212574 18045 551878 282766 698982 554413 714522 588627 566868 497451
17094D97451j45404J24153J81206A94114N34104C10206J31044J83091B80885K88942
$$ 497451 352047 476200 657406 194114 728218 310206 441250 624341 280885 569827
17084E69827j2551M1333o4057p9369K22544B29089O1658L68787j06575L11352
$$ 569827 557276 598609 534552 455183 677727 229089 290747 659534 552959 864311
17074H64311k20743p40r6412J68898o7872j39165p8027p4641q840M5122L2029
$$ 864311 643568 642828 546416 715314 647442 508277 430250 355609 346769 391891 423920
17063D23920R9204M9556q2310K41109k69158k21991J95417J04078j63634L38551
$$ 423920 523124 572680 490370 731479 462321 240330 435747 539825 376191 714742
17053G14742K5692L7632k70565L47467j53183L5324O7533L04110m76237j59868
$$ 714742 740434 778066 507501 854968 701785 737109 804642 1108752 632515 472647
17043D72647K64277M5411j64646p7725M73518l88819B62374L50996K13117k31081
$$ 472647 736924 782335 617689 539964 1013482 624663 262374 613370 826487 595406
17033E95406j65806L99267j59385P2961P8548k80902L69999k47800J13726k85706
$$ 595406 429600 828867 669482 742443 820991 540089 910088 662288 776014 490308
17023D90308K18356J34511J12038D01378J80801M40673R984k83494j69329K57380
$$ 490308 708664 843175 955213 401378 582179 1022852 1032836 749342 580013 837393
17013H37393j24450j01890K03692j3586K01150l07560o2892J00764P2685J9269
$$ 837393 712943 611053 814745 801159 1002309 694749 631857 732621 805306 824575
17003H24575J48824q9589j55052J35441N7890J24440j8171k30144K10310q68k74296
$$ 824575 973399 883810 728758 864199 922089 1046529 1028358 798214 1008524 1007656 733360
16992G33360J31600k02232L86529n0703j80323n4076K46928j46724L73539l15423
$$ 733360 864960 662728 1049257 998554 818231 764155 1011083 864359 1237898 922475
16982I22475j73969J21273K20344K40136k96360L2940J94511k29681o785K52777
$$ 922475 748506 869779 1090123 1330259 1033899 1066839 1261350 1031669 1024884 1277661
16972A277661j35779k490J03962r8575N0647k31114j51059M51135l7891J27675
$$ 1277661 1141882 1139392 1243354 1144779 1195426 964312 813253 1264388 1226497 1354172
16962A354172o547k58246K09959n4136K25901k26849j62809K54870k56868K94741
$$ 1354172 1347625 1089379 1299338 1245202 1471103 1244254 1081445 1336315 1079447 1374188
16952A374188k8535k56077L49276J133r5163K18211l6003J37598j91250P5587
$$ 1374188 1345653 1089576 1438852 1439985 1344822 1563033 1527030 1664628 1473378 1548965
16942A548965l14690J53594P9344N9641k09385P8176r7278N03903j71390j18285
$$ 1548965 1234275 1387869 1467213 1526854 1317469 1395645 1298367 1802270 1630880 1512595
16932A512595K81579K06622l96839n9969o157K16496J16175j38405J8725J66263
$$ 1512595 1794174 2000796 1603957 1543988 1537831 1754327 1870502 1732097 1750822 1917085
16922A917085j72376J07335o929k51043J47590q1684K57670K38155j01758k11232
$$ 1917085 1744709 1852044 1845115 1594072 1741662 1659978 1917648 2155803 2054045 1842813
16912A842813N49423l82300k18446L02754k30633J17744O21356m13501k90278
$$ 1842813 2392236 2009936 1791490 2094244 1863611 1981355 2602711 2189210 1898932
16903A898932O66891o6781p6817k81111J89471l53L29874l02521k26151L01516
$$ 1898932 2565823 2499042 2422225 2141114 2330585 2330232 2660106 2357585 2131434 2432950
16893B432950k02051L8349J88706L80720l29912J90013p6588J72753k6850J70107
$$ 2432950 2230899 2269248 2457954 2838674 2508762 2698775 2622187 2794940 2768090 2938197
16883B938197k92837M21261j11192Q4974p7212j05567j07523L10429r9653J20837
$$ 2938197 2645360 3066621 2955429 3040403 2963191 2857624 2750101 3060530 2960877 3081714
16873C081714N31526m18379l9627K90847N7354L0027j76682Q3100j32409L53837
$$ 3081714 3613240 3194861 3155234 3446081 3503435 3533462 3356780 3439880 3307471 3661308
16863C661308L36227j22283k14978K09438j46962K3457K58618K59345J02546N2176
$$ 3661308 3997535 3875252 3660274 3869712 3722750 3746207 4004825 4264170 4366716 4418892
16853D418892j55490N8346j57778K85330J22248L06456o2572j45070L33314j26689
$$ 4418892 4263402 4321748 4163970 4449300 4571548 4878004 4815432 4670362 5003676 4876987
16843D876987J94328L55840j29169L08902J81546l64029L30205J87072J84695
$$ 4876987 5071315 5427155 5297986 5606888 5788434 5424405 5754610 5941682 6126377
16834F126377J23307K9319j75583M08355J03573J70446l04388L50590J75012J64081
$$ 6126377 6249684 6279003 6103420 6511775 6615348 6785794 6481406 6831996 7007008 7171089
16824G171089m4264O06357m8602K5305N05658j59303N28912j75618N78087k92076
$$ 7171089 7126825 7733182 7684580 7709885 8215543 8056240 8585152 8409534 8987621 8695545
16814H695545L36787L45614o313L63854R2635j7090P25331k19723N41342J127
$$ 8695545 9032332 9377946 9371633 9735487 9828122 9811032 10536363 10316640 10857982 10859109
16804A0859109N08313J42899N6202M78278M56513M19786L83501K08463L45305
$$ 10859109 11367422 11510321 11566523 12044801 12501314 12921100 13304601 13513064 13858369
16795A3858369M23731M29014M42076K57686O10206K56674K45618Q17147M08119
$$ 13858369 14282100 14711114 15153190 15410876 16021082 16277756 16523374 17340521 17748640
16786A7748640K24371P00917L38710R46540M88111L86741M52100R24450J096128
$$ 17748640 17973011 18673928 19012638 19959178 20447289 20834030 21286130 22210580 23306708
16777B3306708O25146Q00003M85873J006087P45509J011868Q00637J437444Q33028
$$ 23306708 23931854 24731857 25217730 26223817 26969326 27981194 28781831 30219275 31052303
16768C1052303R37586J467808Q52785J304729J224849J705086J099731J603778
$$ 31052303 31989889 33457697 34310482 35615211 36840060 38545146 39644877 41248655
16760D1248655J204222J512210J822634J663014J851833J913530K349802J432230
$$ 41248655 42452877 43965087 45787721 47450735 49302568 51216098 53565900 54998130
16752E4998130K396195K029716K211321K581846K191065K188575K460665K576855
$$ 54998130 57394325 59424041 61635362 64217208 66408273 68596848 71057513 73634368
16744G3634368K510647K360392K659197K672090K174610K306707K257892K421233
$$ 73634368 76145015 78505407 81164604 83836694 86011304 88318011 90575903 92997136
16736I2997136K180807J849162J999234J831452J428595J430990R30344P34850
$$ 92997136 95177943 97027105 99026339 100857791 102286386 103717376 104647720 105382570
16728A05382570K25754M42126N8719n26475j67068j288207j048205j640051j308811
$$ 105382570 105608324 106050450 106109169 105582694 105415626 104127419 103079214 101439163 100130352
16719A00130352j742621k051841j731697k228467k270002k508053k266662k319140
$$ 100130352 98387731 96335890 94604193 92375726 90105724 87597671 85331009 83011869
16711H3011869k348654k831217k415694k304963k522858k461524j879452k586050
$$ 83011869 80663215 77831998 75416304 73111341 70588483 68126959 66247507 63661457
16703F3661457j808228k456661k005995j869671k086657j988810j790595j574346
$$ 63661457 61853229 59396568 57390573 55520902 53434245 51445435 49654840 48080494
16695D8080494j920314j510250j329123j460549j529847j426401j195861j061408
$$ 48080494 46160180 44649930 43320807 41860258 40330411 38904010 37708149 36646741
16687C6646741j152979j334801j314901q78629j030769r09423q86908p50704j207266
$$ 36646741 35493762 34158961 32844060 31965431 30934662 30025239 29138331 28387627 27180361
16678B7180361m95606q20759q88009n64196j214278q280q77075q64053m94580
$$ 27180361 26684755 25863996 24975987 24411791 23197513 23189233 22312158 21448105 20953525
16669B0953525n52330k39162p33458l68815o92645k53114p62402l80283k83388
$$ 20953525 20401195 20162033 19428575 19059760 18367115 18114001 17351599 16971316 16687928
16660A6687928n87948n14871l46131L9514k5442p56903m96231j15644j42112p40478
$$ 16687928 16099980 15585109 15238978 15278492 15253050 14496147 13999916 13884272 13742160 13001682
16650A3001682j28465q2007m53392l73090k26727q1519k81303j28698l50876m03088
$$ 13001682 12873217 12791210 12337818 11964728 11738001 11656482 11375179 11246481 10895605 10492517
16640A0492517l5467j99458j16468k54737k84788J00598n10710J4881j19471l4117
$$ 10492517 10457050 10257592 10141124 9886387 9601599 9702197 9191487 9206368 9086897 9052780
16630I052780m62195L2149j00380p9183m18533J08806Q2793o92980k3270j20633
$$ 9052780 8590585 8622734 8522354 8443171 8024638 8133444 8216237 7523257 7499987 7379354
16620G379354n18597M74779j09512l65800P9021k83135r8227O307k39476O8042
$$ 7379354 6860757 7335536 7226024 6860224 6939245 6656110 6557883 6564190 6324714 6392756
16610F392756m07888J39233l799K01514k02344l11830j87511L07493l92091J5444
$$ 6392756 5984868 6124101 6120302 6321816 6119472 5807642 5620131 5927624 5535533 5550977
16600E550977J47527m41973n978k34503J1680K47023n71160L75545r334m47692
$$ 5550977 5698504 5256531 5250553 5016050 5027730 5274753 4703593 5079138 5069804 4622112
16590D622112L74040l94661L7393p2654p9575j01772J31734k2588l40578l27760
$$ 4622112 4996152 4601491 4638884 4566230 4486655 4384883 4516617 4494029 4153451 3825691
16580C825691K97926j4465L2828k31041J74661K26072l59031j86846k00593M37921
$$ 3825691 4123617 4109152 4141980 3910939 4085600 4311672 3952641 3765795 3565202 4003123
16570D003123p6755m68891K93521j43824R371j45455N3195l489J22347O8587k79615
$$ 4003123 3926368 3457477 3750998 3607174 3616545 3471090 3524285 3520796 3643143 3711730 3432115
16559C432115M8723k53754n4103K68327j58248q9496p7539l77430M12963j46010
$$ 3432115 3480838 3227084 3172981 3441308 3283060 3193564 3116025 2738595 3151558 3005548
16549C005548K870R048J73708l13280j76929L65200k19599K56309k88089o2368
$$ 3005548 3008418 3017466 3191174 2877894 2700965 3066165 2846566 3102875 2814786 2752418
16539B752418j06900Q8711n0715K02503l33461p022Q8563j74691J63408L84936
$$ 2752418 2645518 2734229 2683514 2886017 2552556 2545534 2634097 2459406 2622814 3007750
16529C007750j17524k23065R6953j35047j00962m9759K84575l15270k02339J5356
$$ 3007750 2890226 2667161 2764114 2629067 2528105 2478346 2762921 2447651 2245312 2260668
16519B260668r6464P7910K18540j28559J71463o164r2262J2145j6703l0914j64756
$$ 2260668 2164204 2242114 2460654 2332095 2503558 2497394 2405132 2417277 2400574 2369660 2204904
16508B204904J30265j52422K52827l50569j49097J64853N9013k5135k79490M60071
$$ 2204904 2335169 2182747 2435574 2085005 1935908 2100761 2159774 2134639 1855149 2315220
16498B315220k06631k14353O1186K38504j04447k09696L37200k26199q7213J54792
$$ 2315220 2108589 1894236 1955422 2193926 2089479 1879783 2216983 1990784 1903571 2058363
16488B058363j82831L66557m31257K02545j78037k3767k73448L36773j6592P2810
$$ 2058363 1875532 2242089 1810832 2013377 1835340 1811573 1538125 1874898 1858306 1931116
16478A931116m3878j71918J04985k3884j59901K72115J2149k45758J98118P5960
$$ 1931116 1887238 1715320 1820305 1796421 1636520 1908635 1920784 1675026 1873144 1949104
16468A949104k21068J48702l79404L10229L769K23381m03460O3308j41957K73077
$$ 1949104 1728036 1876738 1497334 1807563 1811332 2034713 1631253 1694561 1552604 1825681
16458A825681p3223n3940j46516K18196J54814k72760k70859K20445m5213j51033
$$ 1825681 1752458 1698518 1552002 1770198 1925012 1652252 1381393 1601838 1556625 1405592
16448A405592J62259J53543j12161O3511k8393J34991k02653j01944N1516j26931
$$ 1405592 1567851 1721394 1609233 1672744 1644351 1779342 1576689 1474745 1526261 1399330
16438A399330q8991J22634K57186l03929r774L01094k79048J94306o08515L23735
$$ 1399330 1310339 1432973 1690159 1386230 1376456 1677550 1398502 1592808 984293 1308028
16428A308028K11959J75295k27799r6958J60045l12060M37305l7526J776k07744
$$ 1308028 1519987 1695282 1467483 1370525 1530570 1218510 1655815 1618289 1620065 1412321
16418A412321P9249k87873J29271K90066k52129o5834J61081k03456Q8053J60414
$$ 1412321 1491570 1203697 1332968 1623034 1370905 1305071 1466152 1262696 1350749 1511163
16408A511163m1340R5050o1089K8315k93347K04240k82562M2789K59821j93402
$$ 1511163 1469823 1564873 1503784 1532099 1238752 1442992 1160430 1203219 1463040 1269638
16398A269638Q1652l31362K27705J47731J25391k45113L7611n7135k16734K54489
$$ 1269638 1351290 1019928 1247633 1395364 1520755 1275642 1313253 1256118 1039384 1293873
16388A293873J90636m24658l771K6324J48590O1901P1446l09806L98546k78899
$$ 1293873 1484509 1059851 1056080 1082404 1230994 1292895 1364341 1054535 1453081 1174182
16378A174182n6983L96553k61071L20834m40260O8065k375O82535p72596m4710
$$ 1174182 1117199 1513752 1252681 1573515 1133255 1201320 1198945 1881480 1108884 1064174
16368A064174L43566j76681J32819k60496j04800K68587j57854k00488M55863
$$ 1064174 1407740 1231059 1363878 1103382 998582 1267169 1109315 908827 1364690
16359A364690k50177J50660k6526J86419k29090k67167M40705j04448J52567l16722
$$ 1364690 1114513 1265173 1238647 1425066 1195976 928809 1369514 1265066 1417633 1100911
16349A100911P0996l09145L57226p8310L37148k91202P5376j69888p5068J78185
$$ 1100911 1171907 862762 1219988 1141678 1478826 1187624 1263000 1093112 1018044 1196229
16339A196229q8001M48599l69655m48603L00401J00752l1702k39356J93424k08844
$$ 1196229 1108228 1556827 1187172 738569 1038970 1139722 1108020 868664 1062088 853244
16329H53244Q4316J11386j07443K26968j79114N7663J91527q4438N6043m8810
$$ 853244 937560 1048946 941503 1168471 989357 1047020 1238547 1154109 1210152 1161342
16319A161342l26422L44482o6347j29721K94415k61932k5361j71186K28311k45715
$$ 1161342 834920 1179402 1113055 983334 1277749 1015817 990456 819270 1047581 801866
16309H01866K31981j8313k05990J66345j49748K72378N6604n54862L13560L83013
$$ 801866 1033847 1015534 809544 975889 826141 1098519 1155123 600261 913821 1296834
16299A296834k24898m761k38925L59100j82087l00542O0229M00773j71322j45160
$$ 1296834 1071936 1067175 828250 1187350 1005263 704721 764950 1165723 994401 849241
16289H49241l3262L26K77587J98862p0294j47040q1040L01340m84136K65415j22511
$$ 849241 815979 816305 1093892 1292754 1222460 1075420 994380 1295720 811584 1076999 954488
16278I54488R2861j7793k94302O62569F28206M50019o6879m3023l66160L40578
$$ 954488 1047349 1029556 735254 1397823 628206 1078225 1011346 968323 602163 942741
16268I42741p3285m9468J34487J02773q3899r821j4919J8652l9195J14715o6785
$$ 942741 869456 819988 954475 1057248 973349 963528 948609 967261 928066 1042781 975996
16257I75996l35548M03908k81489j0016K62145r6438K54961m73327J15077N0279
$$ 975996 640448 1044356 762867 752851 1014996 918558 1173519 700192 815269 865548
16247H65548p1247J40122l42025K65566J01100l49833K56225O340n757P6695Q1752
$$ 865548 794301 934423 592398 857964 959064 609231 865456 871796 866039 942734 1024486
16236A024486K2491E06942K43045K42532k41846N6480P614j04853j9464Q8567
$$ 1024486 1046977 506942 749987 992519 750673 807153 814767 709914 690450 779017
16226G79017m998M1663K30116j79596k79502j9916K7857J25865J58301l19000
$$ 779017 774019 815682 1045798 866202 586700 566784 594641 720506 878807 559807
16216E59807J65652J98976C83593M25802k36436K48084l79497M3742J45419k4831
$$ 559807 725459 924435 383593 809395 572959 821043 441546 485288 630707 605876
16206F05876J1134K07222q3889m7401k17243q6583L82075k12513o2436J3139K88136
$$ 605876 617010 824232 740343 692942 475699 389116 771191 558678 496242 509381 797517
16195G97517J17792l88630M08508m08706J8220J99952l06148K85034B99690M33540
$$ 797517 915309 526679 935187 526481 544701 744653 438505 723539 299690 733230
16185G33230k46024J17445K32351B95771J81414N5247K4099M5303r8003N6061
$$ 733230 487206 604651 837002 295771 477185 532432 556531 601834 503831 559892
16175E59892r5356K70623k26360r5915o7676R2575K50724k36404K17697j05539
$$ 559892 464536 735159 508799 412884 345208 437783 688507 452103 669800 564261
16165E64261B21081K72880j92404K44230j62723J76727J4465l1215B06049L79791
$$ 564261 221081 493961 301557 545787 383064 559791 574256 543041 206049 585840
16155E85840k59330L57850k31714l067k05568L93973j4900j15627J04157B30499
$$ 585840 326510 684360 452646 449579 244011 637984 623084 507457 611614 230499
16144B42766J55612A32978M82332l00299m9453P7491Q0709A54982J05074J82659
$$ 242766 398378 132978 615310 315011 265558 343049 423758 154982 260056 442715
16134D42715N5245R3265I3715J21390J29240o2848L23276K658k43178j23812O9231
$$ 442715 497960 591225 93715 215105 344345 281497 604773 607431 364253 240441 309672
16123C09672L5881J03442b08797C88313m3408P7000j92820Q0904A17096L37441
$$ 309672 345553 448995 -208797 388313 344905 421905 229085 309989 117096 454537
16113D54537A65565E8684P810n529O01558l25656l4010J19120j12177I916O76847
$$ 454537 165565 58684 66494 60965 662523 336867 302857 421977 309800 9916 686763
16102F86763k50671I4160M64186l0121B34680j5526N4114m5271J79975A67933
$$ 686763 436092 94160 558346 528225 234680 219154 273268 227997 407972 167933
16091B41578K15117k08911R8054c8738C20799J14380A42761J34278N5825j53512
$$ 241578 456695 247784 345838 -38738 320799 435179 142761 277039 332864 179352
16081A79352e142D3190M53002I1466c5107C30797P7101A40614J8074L07610j42849
$$ 179352 -5142 43190 496192 91466 -35107 330797 407898 140614 158688 466298 323449
16070C23449J52675Q141j76457r9384B0311O43030C18892c9350C34381d4987D8601
$$ 323449 476124 484265 307808 208424 20311 663341 318892 -39350 334381 -44987 48601
16058B47806j07535m4398K3039K97853n324A53665n0669J92576a14857B06159
$$ 247806 140271 95873 118912 416765 411441 153665 102996 295572 -114857 206159
16047A55187P3645K8767l3794a73001G3801K31372r6582I6214J47626J81636D327
$$ 155187 228832 257599 223805 -173001 73801 305173 208591 96214 243840 425476 4327
16035E14002k20618I0089l4932B3873K11831K28419j02734j2420j65540P1674
$$ 514002 293384 90089 55157 23873 235704 464123 361389 348969 183429 255103
16025B55103p3562G2334d7936A05345K59929D1314a4093j6749B77015p9796m6207
$$ 255103 181541 72334 -47936 105345 365274 41314 -14093 -30842 277015 197219 151012
16014A51012b07348R2011A68104D3866f4888A03854Q4176H5625M5198i3727B08854
$$ 151012 -207348 -115337 168104 43866 -64888 103854 188030 85625 130823 -93727 208854
16002C21041l7304e6893C94771A84563j6639f9903p6365G3389J00794Q3796j05490
$$ 321041 283737 -56893 394771 184563 167924 -69903 -146268 73389 174183 257979 152489
15991A52489D8081L34405J15072N893L22132O8557K06843m45729K62721j69670
$$ 152489 48081 382486 497558 503451 825583 894140 1100983 655254 917975 748305
15981G48305A20700J05552r1950e9078A10060K7435M9094a03832B25230F9830
$$ 748305 120700 226252 134302 -59078 110060 137495 186589 -103832 225230 69830
15970I848L91323g3961j60531a7504A10272n3974B4833Q9239M8419c030A980M192
$$ 9848 401171 -73961 -234492 -17504 110272 56298 24833 114072 162491 -3030 1980 6172
15958F172L1610M02571g738o9321B18064b3723k64681A48246e0965D8434B0507
$$ 6172 37782 440353 -7738 -77059 218064 -23723 -288404 148246 -50965 48434 20507
15946a62671k5626A4971J0929A1017c33598G5962K18662j37275a99426A56186
$$ -162671 -188297 14971 25900 11017 -333598 75962 294624 157349 -199426 156186
15935F8849J94240m1990B2643P8043l3272C2845b5620A83531c24733B63992A3235
$$ 68849 263089 221099 22643 100686 67414 32845 -25620 183531 -324733 263992 13235
15923G8256j2669a31693D1196O8342L4807a23499l1392A3864L03946a8500k08034
$$ 78256 65587 -131693 41196 109538 144345 -123499 -154891 13864 317810 -18500 -226534
15912b26534d8788C76575D8649J95224a7180j23128Q292c4418H623a61752f9979
$$ -226534 -48788 376575 48649 243873 -17180 -140308 -132016 -34418 8623 -161752 -69979
15900g9444H849c55304d8038l3015B94328a58179d2592A99948r1970c1734r295
$$ -79444 8849 -355304 -48038 -81053 294328 -158179 -42592 199948 107978 -31734 -41029
15889d1029I8123e4798k0973k06125B05964i4411B75044i0326F1171c05107A1168
$$ -41029 98123 -54798 -75771 -281896 205964 -94411 275044 -90326 61171 -305107 11168
15877A29651a86608h8297E9585J68497b868D06490A46897B6160Q4207c83404a82634
$$ 129651 -186608 -88297 59585 228082 -2868 406490 146897 26160 110367 -383404 -182634
15865a10186d5490c180m8282k09334I705a17339K2904m5537b3506l4979H446a33063
$$ -110186 -45490 -3180 -51462 -260796 9705 -117339 -94435 -139972 -23506 -58485 8446 -133063
15852A74925K79598f5116k7515d1561H6962J26563a86544c6730I4414J13894B8570
$$ 174925 454523 -65116 -92631 -41561 86962 213525 -186544 -36730 94414 208308 28570
15840D37266D746J42469a89749G6272i3413e275B1261a66148B01599f5534G6716
$$ 437266 4746 147215 -189749 76272 -93413 -5275 21261 -166148 201599 -65534 76716
15828a29361A09867d6740B11666c09502A81048K6288b95668C0979c03504H695
$$ -129361 109867 -46740 211666 -309502 181048 207336 -295668 30979 -303504 8695
15817b20585A40560C788L24072i9868k9531D1041R6330f6288n0275j42380Q2446
$$ -220585 140560 3788 327860 -99868 -129399 41041 137371 -66288 -116563 -258943 -176497
15806a76497M9521n850I6173b17331R4773F261b09784A02015K09722p0155E0711
$$ -176497 -126976 -132826 96173 -217331 -122558 6261 -209784 102015 311737 241582 50711
15794I1914a66228c9962C02863d6604D65433a12398j13677F6366J06971b16454
$$ 91914 -166228 -39962 302863 -46604 465433 -112398 -226075 66366 173337 -216454
15783B4335c03121g2632C23721F6983b42661a9357j16259B5806a39429M2232J15
$$ 24335 -303121 -72632 323721 66983 -242661 -19357 -135616 25806 -139429 -97197 -97082
15772i7082E8184c47283d2714j3228A07798A6839G639K41181I5194O7510c65291
$$ -97082 58184 -347283 -42714 -55942 107798 16839 7639 248820 95194 162704 -365291
15760I61e5162H4655c4640A06350a27489e5560j92794E9690L8594a29832I7055
$$ 961 -55162 84655 -34640 106350 -127489 -55560 -248354 59690 98284 -129832 97055
15748e0367E0282C650a66171A32283a02709A71021a91984n8480A47581a48026
$$ -50367 50282 3650 -166171 132283 -102709 171021 -191984 -250464 147581 -148026
15737E2743c3301k38963h5951o3063O8174o515j8865n3063q7929B01880a91137
$$ 52743 -33301 -272264 -85951 -149014 -80840 -87355 -106220 -159283 -247212 201880 -191137
15725a64462B59870b86280f0807J2811l8521A3508J44950P1302C7256b25327a09714
$$ -164462 259870 -286280 -60807 -47996 -86517 13508 158458 229760 37256 -225327 -109714
15713G2669j6237f7468H316b1451j85315Q1239A86346B9106N5102c76285a4885
$$ 72669 56432 -67468 8316 -21451 -206766 -125527 186346 29106 84208 -376285 -14885
15701C4160c69960C33199A10841J1945M160c66849r8195a51207f4245j08614e4222
$$ 34160 -369960 333199 110841 122786 126946 -366849 -465044 -151207 -64245 -172859 -54222
15689A53520b18466G2848J51543i8821D0009K05806j09434E5279b70773N692j40813
$$ 153520 -218466 72848 224391 -98821 40009 245815 136381 55279 -270773 -265081 -405894
15678d05894g8132A9748I751f7270K7668B98286d8996A03850m5198a57850k08023
$$ -405894 -78132 19748 9751 -67270 -39602 298286 -48996 103850 58652 -157850 -365873
15667c65873A33045J21267b12944c8889j50743E7226Q3928o3285A216N5140J53685
$$ -365873 133045 254312 -212944 -38889 -189632 57226 141154 77869 1216 56356 210041
15656B10041a82431f0635A33933J1293P5181a59174E1571j1142b00305B32238
$$ 210041 -182431 -60635 133933 145226 220407 -159174 51571 40429 -200305 232238
15645a76072E5064B368a51323N22D4817a1601j66761d3040K1314C06558e0149
$$ -176072 55064 2368 -151323 -150801 44817 -11601 -178362 -43040 -21726 306558 -50149
15633c14623R5516J05943j5059A72079a33656D9572p625q940h3598b0420j25279
$$ -314623 -219107 -113164 -128223 172079 -133656 49572 41947 33007 -83598 -20420 -145699
15622a45699b4198L566o8754j62728B46535a43898A08463l5331K532a3095B56081
$$ -145699 -24198 -20632 -89386 -252114 246535 -143898 108463 73132 75664 -13095 256081
15610b09615P7146j74966N010B34891a83325b086k66572F6364b14099A07042a79986
$$ -209615 -132469 -307435 -302425 234891 -183325 -2086 -268658 66364 -214099 107042 -179986
15598f0127I8015c9990m988j78231C942K42299A10238n756D5606a16791j22527
$$ -60127 98015 -39990 -44978 -223209 3942 246241 110238 104482 45606 -116791 -239318
15587b39318b3825o6990O28i087j8833k55907J31364A02000b13257H4623Q6339
$$ -239318 -23825 -90815 -90187 -9087 -27920 -283827 -152463 102000 -213257 84623 170962
15576A70962a54222k2157E1902a32863K5593c4310C52693h6973j36608R9667l92286
$$ 170962 -154222 -176379 51902 -132863 -107270 -34310 352693 -86973 -223581 -123914 -516200
15565e16200D3438h0100A6197a08589D3377d88353e0813j59391B1152a70627B59777
$$ -516200 43438 -80100 16197 -108589 43377 -488353 -50813 -210204 21152 -170627 259777
15553g9731A70800R3997F2174N2723M9301D5994f7205q9820K3714C44149e4640
$$ -79731 170800 264797 62174 114897 164198 45994 -67205 -157025 -133311 344149 -54640
15541g2542o9028H9544a80592D7406a2706k02842B8783a21277B11451b42035N0309
$$ -72542 -141570 89544 -180592 47406 -12706 -215548 28783 -121277 211451 -242035 -191726
15530a91726O1343A41957b31644F9732d6922n399A7716J0979b54852B55912m8350
$$ -191726 -130383 141957 -231644 69732 -46922 -52321 17716 28695 -254852 255912 207562
15519B07562J7506F4096a95380B28405I4095L24994A75676q7421D1655K11916
$$ 207562 225068 64096 -195380 228405 94095 419089 175676 88255 41655 253571
15509B53571n8768h067B06546c1992A3650N4248c1798G7274e369j26058A38154
$$ 253571 194803 -8067 206546 -31992 13650 67898 -31798 77274 -5369 -131427 138154
15497e3300m8202M777j20675A38176E567L20883B4588h0196k38553A26414D8663
$$ -53300 -101502 -96725 -217400 138176 5567 326450 24588 -80196 -318749 126414 48663
15485I4085J93219C2317K38653q1655F1998a51764B63316j10005j8304K19286
$$ 94085 287304 32317 270970 189315 61998 -151764 263316 153311 135007 354293
15475C54293k4131A14553L45613j85628m6180d955F270k320K42118D7044L3564
$$ 354293 330162 114553 460166 274538 228358 -4955 6270 3950 246068 47044 80608
15464H0608i2811H8268P8634G4080K6378R0122b93011C2473Q0027a96373D04423
$$ 80608 -92811 88268 166902 74080 100458 190580 -293011 32473 112500 -196373 404423
15452e337E4633b1224p225A73347o5242a94383B24871i7707C43856K03652j92058
$$ -5337 54633 -21224 -28449 173347 108105 -194383 224871 -97707 343856 547508 355450
15441C55450L25161r4972n6543O765i4736B62197a70687e4343E3788K6735k0672
$$ 355450 680611 585639 529096 535861 -94736 262197 -170687 -54343 53788 80523 59851
15430E9851K85122l3553j05655m7412J2169G9602d6530k1064D07134j69780j13717
$$ 59851 344973 311420 205765 158353 170522 79602 -46530 -67594 407134 237354 123637
15419A23637i173C47270a48582K0145H9612a96401b9667B18696a22688Q463d1076
$$ 123637 -9173 347270 -148582 -128437 89612 -196401 -29667 218696 -122688 -114225 -41076
15407a67593F0118e3633k3274k12862L3541J23002A4869e3759j49799a4778j93173
$$ -167593 60118 -53633 -76907 -289769 -256228 -133226 14869 -53759 -203558 -14778 -207951
15396b07951R9371K9105q6601P0595l20746a36684N6246b2321A10893c24883I2811
$$ -207951 -108580 -79475 -166076 -95481 -416227 -136684 -80438 -22321 110893 -324883 92811
15384D6977c57322F7869K22680a21132j97648B9167K66551r4919D6706c43560
$$ 46977 -357322 67869 290549 -121132 -318780 29167 295718 200799 46706 -343560
15373a26200A91351b77174i1635B31799k3204f29187b05665j2100R1003A40331
$$ -126200 191351 -277174 -91635 231799 208595 -629187 -205665 -217765 -126762 140331
15362c6826A63874l8529m8469a45479A49997a5534I1068L6115c52506G9168a11173
$$ -36826 163874 125345 76876 -145479 149997 -15534 91068 127183 -352506 79168 -111173
15350A01088D8444P3213O8501F9414J94784d5548F3775J51415A01024P6192J31654
$$ 101088 48444 121657 190158 69414 264198 -45548 63775 215190 101024 177216 308870
15339C08870A38629L39536A04078L09948G1070K00126f6611r2028C9325P7069
$$ 308870 138629 478165 104078 414026 71070 271196 -66611 -158639 39325 116394
15329A16394i0448H6295a47592A60418J11836j11865J24825a4831E2571K85006
$$ 116394 -90448 86295 -147592 160418 272254 160389 285214 -14831 52571 337577
15319C37577h309o2921m423j94750A70473L42481A83835i9687B22641n5510a43835
$$ 337577 -8309 -71230 -75653 -270403 170473 512954 183835 -99687 222641 167131 -143835
15307g1199A61808F7065J071Q6214G1425J25735f342B22871a6291q3250B61961
$$ -71199 161808 67065 68136 154350 71425 197160 -6342 222871 -16291 -99541 261961
15295I6902M357D1449O2356J26784A01297M5973D7699K29917r5670a09379k4022
$$ 96902 101259 41449 103805 230589 101297 147270 47699 277616 181946 -109379 -133401
15284a33401A03499b29147B45744b93624B45032G055b2540A06690a23021G189
$$ -133401 103499 -229147 245744 -293624 245032 7055 -22540 106690 -123021 7189
15273I2997j4142K008c6412B3686K12667B1629L39318A06549N4862a15377K6551
$$ 92997 78855 80863 -36412 23686 236353 21629 360947 106549 161411 -115377 -88826
15262h8826d387R08p3974C1746a53719A54892a16066G3971J61000a14888B803
$$ -88826 -4387 -3479 -77453 31746 -153719 154892 -116066 73971 234971 -114888 2803
15250A55030P1278e2849G56395M83640m11430N1218L6212m27429j41320j12685
$$ 155030 226308 -52849 756395 1240035 828605 879823 916035 488606 347286 234601
15240B34601e2518A09580h8916L1508E1538K16271e6863A70495C9060P0662k9352
$$ 234601 -52518 109580 -88916 -57408 51538 267809 -56863 170495 39060 109722 80370
15229H0370J49872p4302a57460G5417K4306e3797a4819n3307R375b9030j18145
$$ 80370 230242 155940 -157460 75417 99723 -53797 -14819 -68126 -58751 -29030 -147175
15218a47175A8015f1505D2172P8264c8017A13057J48418q4954f2177j97731j62891
$$ -147175 18015 -61505 42172 120436 -38017 113057 261475 176521 -62177 -259908 -422799
15207d22799E0017K25602b73988A78668b43713A87627h7312B00741l1371a71178
$$ -422799 50017 275619 -273988 178668 -243713 187627 -87312 200741 169370 -171178
15196A46286d6487I9865b1072A51656b47660h4638E3108B6207K34249a3781F9236
$$ 146286 -46487 99865 -21072 151656 -247660 -84638 53108 26207 260456 -13781 69236
15184d3642B49380b1193C94357F401K47318o6178H8952J92269a67453F9857K02398
$$ -43642 249380 -21193 394357 6401 253719 187541 88952 281221 -167453 69857 272255
15173B72255b3950B1152a98843A78757C1297K8355g7290C37986j63299b28687
$$ 272255 -23950 21152 -198843 178757 31297 59652 -77290 337986 174687 -228687
15162a61383f2739B09357J177G8972P7159N8683d1218B09256n7315F1470K85041
$$ -161383 -62739 209357 210534 78972 156131 214814 -41218 209256 151941 61470 346511
15151C46511A12149f0626o0350B84517A34888F4899R1966F5828K44532K1338A597
$$ 346511 112149 -60626 -120976 284517 134888 64899 156865 65828 310360 331698 1597
15139A77985H1590g2421D5192K2964a10848r9140B33724o0545b30089A14705q602
$$ 177985 81590 -72421 45192 68156 -110848 -209988 233724 173179 -230089 114705 106103
15128A06103J89074f4702A35914n092m3049a53692B32014J66720A03074O6222
$$ 106103 295177 -64702 135914 130822 87773 -153692 232014 398734 103074 169296
15118A69296A4770K26035A020L18053a2296B5270d0510o89C29346e7900B04409
$$ 169296 14770 240805 1020 319073 -12296 25270 -40510 -41199 329346 -57900 204409
15106a58402F9168J30723J65376b40980B39747F6069f9059k0869j06328d2827
$$ -158402 69168 199891 365267 -240980 239747 66069 -69059 -89928 -196256 -42827
15095A30219f5695D6327J43990o2151a18297b957j42000J0226B65683a17209a9870
$$ 130219 -65695 46327 190317 128166 -118297 -2957 -144957 -134731 265683 -117209 -19870
15083C13723a71611e7918A93718d8339H1503C8070A6540L56033O8749A60919a66705
$$ 313723 -171611 -57918 193718 -48339 81503 38070 16540 372573 441322 160919 -166705
15071E0925b0438B75992I0158c4603B32697K01691A79569a18410E8535a17810
$$ 50925 -20438 275992 90158 -34603 232697 434388 179569 -118410 58535 -117810
15060a60035e9606B30220J1718N8443a0463B15824K3261H5926J34262a0235A90787
$$ -160035 -59606 230220 241938 300381 -10463 215824 239085 85926 220188 -10235 190787
15048F3021e3730A62214K43591j5334j02322j07693Q0234G5815K99034H3783M57579
$$ 63021 -53730 162214 405805 390471 288149 180456 260690 75815 374849 83783 541362
15037E41362A00126k018M2147C9462L82498j70195A9761K43344L7383N12131k95583
$$ 541362 100126 98108 140255 39462 421960 251765 19761 263105 300488 812619 517036
15026E17036J91684k11885A27169M6664J7755f3322B62311L51903A20871J19442
$$ 517036 708720 496835 127169 173833 191588 -63322 262311 614214 120871 240313
15016B40313o5021a35321n4388B15053L76007A26170L15493A38716J83518j54382
$$ 240313 175292 -135321 -189709 215053 591060 126170 441663 138716 322234 167852
15006A67852J50758A58857J81840G8087b42033A65795p9963j2326K68466o4006
$$ 167852 318610 158857 340697 78087 -242033 165795 85832 73506 341972 277966
14996B77966Q1672R9581B03526M5742J01594l9182n8444J35842G9897K15527L68434
$$ 277966 359638 459219 203526 249268 350862 311680 253236 389078 79897 295424 663858
14985F63858j97792j34232J35435A00620f523D05820A89180J98112R7104r845
$$ 663858 466066 331834 467269 100620 -6523 405820 189180 387292 484396 474551
14975D74551Q621j08332l6413J67776N0704j44961j75862J41016J3851k2413q5622
$$ 474551 483172 374840 338427 506203 556907 411946 236084 377100 390951 368538 282916
14964B82916j03351K79139A50633J06621M41526A71789j599p7220O4414L50031
$$ 282916 179565 458704 150633 257254 698780 171789 170190 92970 157384 507415
14954E07415L3461A48021c2901A85219L5415L99242j78018l3102A11593R7862
$$ 507415 540876 148021 -32901 185219 220634 619876 441858 408756 111593 209455
14944B09455P0194J8442J46449j75434J56933B09224J29854g3034F67641F9745
$$ 209455 279649 298091 444540 269106 426039 209224 339078 -73034 667641 69745
14933D64248m3191r7225K39602J4354M92171k80640n1707l3655j6836L37798M4433
$$ 464248 421057 323832 563434 577788 1069959 789319 737612 703957 687121 1024919 1069352
14922A069352k55832J01854l9240L6418K58351K1370m32632K65804L7828k28780
$$ 1069352 813520 915374 876134 912552 1170903 1192273 759641 1025445 1063273 834493
14912H34493m69Q602r2463C39168j46905K84744K55374l26177j79860L37788a5292
$$ 834493 834024 842626 750163 339168 192263 477007 732381 406204 226344 564132 -15292
14900C12351R4541L18641k85667A54443M94389l07273J89169m1343A56706P7349
$$ 312351 406892 725533 439866 154443 648832 341559 530728 489385 156706 234055
14890B34055K0836k188K6421J32003M4058J85183k42247j09118M27221B66727
$$ 234055 254891 252703 279124 411127 455185 640368 398121 289003 716224 266727
14879D94826K8842j48904K73006J68804l67577L88025k15238Q62C11215K00375
$$ 494826 523668 374764 647770 816574 448997 837022 621784 622646 311215 511590
14869E11590n4507k26960Q3092J25782L7740m7212O2845p4435D1521M9126J81354
$$ 511590 457083 230123 313215 438997 476737 429525 492370 417935 41521 90647 272001
14858B72001P7852J49699m7418j88710P986K4975G7553J63969p5113J54481J77439
$$ 272001 349853 499552 452134 263424 271410 296385 77553 241522 166409 320890 498329
14847D98329j81859c1193E22808o4074J70760O0515j42904K23018C64842L10360
$$ 498329 316470 -31193 522808 458734 629494 690009 547105 770123 364842 675202
14837F75202l8026J83060j23491N8609j13752N3570k91827j83064o1921K99278
$$ 675202 637176 820236 696745 755354 641602 695172 403345 220281 158360 457638
14827D57638L539J13888B20395M31793k03456j69480K85319K07355q7714k62920
$$ 457638 461177 575065 220395 652188 448732 279252 564571 771926 684212 421292
14817D21292l3475j18119O06573B17543I284N22284O9232m6321p3497A12018O00084
$$ 421292 387817 269698 876271 217543 9284 531568 600800 554479 480982 112018 712102
14806G12102k93434K11273j71445K19159K11081l90407n9997K1200J15831B83106
$$ 712102 418668 629941 458496 677655 888736 498329 438332 459532 575363 283106
14795H45639B65486J00335A01289N03685B28457N37423B54694J41666J64735j35641
$$ 845639 265486 365821 101289 604974 228457 765880 254694 396360 561095 425454
14785D25454J12200j40090P2097J81229B81208L28942j90808r668L54732l49015
$$ 425454 537654 397564 469661 650890 281208 610150 419342 409674 764406 415391
14775D15391L3477K70243A72912L16796k9027J28759m4761R21A66735J25875L79963
$$ 415391 448868 719111 172912 489708 460681 589440 544679 545600 166735 292610 672573
14764F72573J44718l02604n87l28L56750l00832r8305m03p0392M56042k86116
$$ 672573 817291 514687 514100 513772 870522 569690 471385 470982 400590 856632 570516
14753E70516M4823k52100J45606r6233J66554k39303K23138j21071k3807M55417
$$ 570516 615339 363239 508845 412612 579166 339863 563001 441930 418123 873540
14743H73540j88029C35205o0154K32687r6321M2255L62181j17638O3370j6321
$$ 873540 685511 335205 275051 507738 411417 453672 815853 698215 761585 745264
14733G45264O3674C66525L81017k19186J93222j98043L11197R7529K68833l77913
$$ 745264 808938 366525 747542 528356 721578 523535 834732 932261 1201094 823181
14723H23181K05647J85758p2835l86645K1363M747J73096K2508l97594J59900
$$ 823181 1028828 1214586 1141751 755106 776469 781216 954312 976820 579226 739126
14713G39126P9850J46590j80186O4454k31024j27127M79976j59350l81068M75382
$$ 739126 818976 965566 785380 849834 618810 491683 971659 812309 431241 906623
14703I06623J61258m7968k16316M96797p0860P403R895k89657j93374L40116k72205
$$ 906623 1067881 1019913 803597 1300394 1229534 1236937 1246832 957175 763801 1103917 831712
14692H31712J8974j46526L1590P4712J01746J28608k34419J20830k54912L10411
$$ 831712 850686 704160 735750 810462 912208 1040816 806397 927227 672315 982726
14682I82726m57710L06591l01972L35857k45143J12269O0157K84213m28007K43941
$$ 982726 525016 831607 529635 865492 620349 732618 792775 1076988 648981 892922
14672H92922q7330J75785D50910N33822j56599J3577Q5137K1985R7301k36442
$$ 892922 805592 981377 450910 984732 828133 841710 926847 948832 1046133 809691
14662H09691J14368r6196k86141J62262l9436L00652K46612l60872K11882j10583
$$ 809691 924059 827863 541722 703984 664548 965200 1211812 850940 1062822 952239
14652I52239j07059K70935p6378Q5960J50720k15396j54559q9648M4865J0922
$$ 952239 845180 1116115 1039737 1125697 1276417 1061021 906462 816814 861679 872601
14642H72601M969j44642K83372k59754K76212k05935L5194M02986K11227p13749
$$ 872601 877570 732928 1016300 756546 1032758 826823 862017 1265003 1476230 762481
14632G62481N00131j99627k02372K91771j76993K00594k85230M18888J14309l53134
$$ 762481 1262612 1062985 860613 1152384 975391 1175985 890755 1309643 1423952 1070818
14622A070818K1432O6894p7109J02137p9381l36613J21646L99875j24283N8547
$$ 1070818 1092250 1159144 1082035 1184172 1104791 768178 889824 1289699 1165416 1223963
14612A223963j41403K18570m00938K29405K90426k90478L55842j2591p6297K1846
$$ 1223963 1082560 1301130 900192 1129597 1420023 1129545 1485387 1472796 1396499 1418345
14602A418345o3465k57141J67045J20271j88658R6030J67865j18130j34755N9385
$$ 1418345 1354880 1097739 1264784 1385055 1196397 1292427 1460292 1342162 1207407 1266792
14592A266792q7097n146O3788M11362k35093j62318K54773K95686j07671k49649
$$ 1266792 1179695 1174549 1238337 1649699 1414606 1252288 1507061 1802747 1695076 1445427
14582A445427Q2904k83790K85033J0142N7948l9954O1357p9484o6942K60934P0873
$$ 1445427 1528331 1244541 1529574 1539716 1597664 1557710 1619067 1539583 1472641 1733575 1804448
14571A804448k92575N34042j9812l78563J54165J5313j2279Q1172J61210J4244
$$ 1804448 1511873 2045915 2026103 1647540 1801705 1817018 1804739 1885911 2047121 2061365
14561B061365j6862n1980L94964j60704l2693K24707M73539K27795J20836r1885
$$ 2061365 2044503 1992523 2387487 2226783 2194090 2418797 2892336 3120131 3240967 3149082
14551C149082J045840R94317K692052M101316P742678J2050425J106018j4207078
$$ 3149082 4194922 5189239 7881291 11982607 19725285 31775710 32881728 18674650
14543A8674650q963946m827917j971390j069059q4722N1223o502j60448L2613
$$ 18674650 9710704 4882787 2911397 1842338 1757616 1808839 1802337 1641889 1674502
14534A674502P7900j8735N8012q1387L9480m5220j43564L97179j19231r2446K03683
$$ 1674502 1752402 1733667 1791679 1710292 1749772 1704552 1560988 1958167 1838936 1746490 1950173
14523A950173r5654K78774J3631j50537J22791j23200n786J02355k41882K33697
$$ 1950173 1854519 2133293 2146924 1996387 2119178 1995978 1990192 2092547 1850665 2084362
14513B084362J56910J820k4112J61859J61159j67090J40241p4272J76621k14684
$$ 2084362 2241272 2243092 2218980 2380839 2541998 2374908 2515149 2440877 2617498 2402814
14503B402814m4976j74168M02088j81487j8272J75244J17409j81114k63329N16369
$$ 2402814 2357838 2183670 2585758 2404271 2385999 2561243 2678652 2497538 2234209 2750578
14493B750578j50585J89752o2204J14579K0532M53126k63688m80687K56348o253
$$ 2750578 2599993 2789745 2727541 2842120 2862652 3315778 3052090 2571403 2827751 2821498
14483B821498J88454k23279L13468k93094M86029j90885r2413J56505L51507m24418
$$ 2821498 3009952 2786673 3100141 2807047 3293076 3102191 3009778 3166283 3517790 3093372
14473C093372P2843p953J87026j63765N03122n6913n26814L81389l17719L95653
$$ 3093372 3166215 3158262 3345288 3181523 3684645 3627732 3100918 3482307 3164588 3560241
14463C560241K0890J18082K26358j72379M2163j69104K91557q9584J89218j89792
$$ 3560241 3581131 3699213 3925571 3753192 3795355 3626251 3917808 3828224 4017442 3827650
14453C827650Q1741K77742J7875M1812N5949R2195k8172J73314m80140P00057
$$ 3827650 3909391 4187133 4205008 4246820 4302769 4394964 4366792 4540106 4059966 4760023
14443D760023m02677J693L58382J67922k841k8700J70362j79269L28681j731J00072
$$ 4760023 4357346 4359039 4717421 4885343 4882502 4853802 5024164 4844895 5173576 5171845 5271917
14432E271917J12890j9790L89728o03163N44800J44586j43100K86938M2364J19834
$$ 5271917 5384807 5365017 5754745 5151582 5696382 5840968 5697868 5984806 6027170 6147004
14422F147004Q8563M0124j26706L47280M56057l05172J81758K39068m62618N87240
$$ 6147004 6235567 6275691 6148985 6496265 6952322 6647150 6828908 7067976 6605358 7192598
14412G192598K5337j46671N577Q7363K78575L40004J22479k06628K80415R978
$$ 7192598 7217935 7071264 7076841 7164204 7442779 7782783 7905262 7698634 7979049 7989027
14402G989027M21334j60172L66954N9641j22175J57182J87348J01447L09963N5327
$$ 7989027 8410361 8250189 8617143 8676784 8554609 8711791 8899139 9000586 9310549 9365876
14392I365876J45858L54320j25233K58554L20787J36172J98502M4607K57229L27423
$$ 9365876 9511734 9866054 9740821 9999375 10320162 10456334 10654836 10699443 10956672 11284095
14382A1284095N9445M19626L28307M48K02391K24884K45135J34647L51173O4371
$$ 11284095 11343540 11763166 12091473 12091921 12294312 12519196 12764331 12898978 13250151 13314522
14372A3314522K49536L70114L58900M23655J75580J79286P87549j16133M18085
$$ 13314522 13564058 13934172 14293072 14716727 14892307 15071593 15859142 15743009 16161094
14363A6161094M17010K78201M02572O51980j5860N35187M33783J87842P60827
$$ 16161094 16578104 16856305 17258877 17910857 17894997 18430184 18863967 19051809 19812636
14354A9812636K39746P19117O17663K08822Q08931k26488R79111P83912O04323
$$ 19812636 20052382 20771499 21389162 21597984 22406915 22180427 23159538 23943450 24547773
14345B4547773N14131O58180P64641O09308O83376P55314P76797O19625J143430
$$ 24547773 25061904 25720084 26484725 27094033 27777409 28532723 29309520 29929145 31072575
14336C1072575J163451P93603R07858J361724J028185Q13503J367498J128425
$$ 31072575 32236026 33029629 33937487 35299211 36327396 37140899 38508397 39636822
14328C9636822J104047J516144J362079J314779J721518J912523J361782K055519
$$ 39636822 40740869 42257013 43619092 44933871 46655389 48567912 49929694 51985213
14320E1985213J572717J883670J947622K576862K181787K528356K593866K672681
$$ 51985213 53557930 55441600 57389222 59966084 62147871 64676227 67270093 69942774
14312F9942774L133312K839339L441484L426520L790008L551582M424441L968474
$$ 69942774 73076086 75915425 79356909 82783429 86573437 90125019 94549460 98517934
14304I8517934M868519M678902N589575N422279O260796O448155P022947P053029
$$ 98517934 103386453 108065355 113654930 119077209 125338005 131786160 138809107 145862136
14296A45862136P621965Q625233Q858066R337944J0104757J0851972J1434712
$$ 145862136 153484101 162109334 170967400 180305344 190410101 201262073 212696785
14289B12696785J1661437J2945243J3295283J3872659J4417522J5309927J5030896
$$ 212696785 224358222 237303465 250598748 264471407 278888929 294198856 309229752
14282C09229752J5916523J5771089J5488979J5455780J4393858J3366690J2215550
$$ 309229752 325146275 340917364 356406343 371862123 386255981 399622671 411838221
14275D11838221J0618559Q382750L699665n26381p99068p31630j773875l378299
$$ 411838221 422456780 430839530 434539195 434012814 433213746 432482116 430708241 427329942
14267D27329942l435653o669923j0884621j2738326j4001455j5385973j6046947
$$ 427329942 423894289 417224366 406339745 393601419 379599964 364213991 348167044
14260C48167044j5497995j6089649j5784962j5431449j4928680j4317228j3193975
$$ 348167044 332669049 316579400 300794438 285362989 270434309 256117081 242923106
14253B42923106j2451571j2352234j1581670j1082131j0342994r733616r242489
$$ 242923106 230471535 218119301 206537631 195455500 185112506 175378890 166136401
14246A66136401q496387p654697p347960o942713p080507n887860n975263n437774
$$ 166136401 157640014 149985317 142637357 135694644 128614137 122726277 116751014 111313240
14238A11313240m707848m769591m649521m484375m101295l880744l156008k993278
$$ 111313240 106605392 101835801 97186280 92701905 88600610 84719866 81563858 78570580
14230G8570580l666801k804718k952378k776001k708141k501800j917433k476602
$$ 78570580 74903779 72099061 69146683 66370682 63662541 61160741 59243308 56766706
14222E6766706j744983j840243j745927k016050j521683j913200j463319j287751
$$ 56766706 55021723 53181480 51435553 49419503 47897820 45984620 44521301 43233550
14214D3233550j136083j596761j153044j227348q96009j122107j323678l98120
$$ 43233550 42097467 40500706 39347662 38120314 37224305 36102198 34778520 34380400
14206C4380400j352072j038093j022783o24423q64065n57109n37649q56894j090455
$$ 34380400 33028328 31990235 30967452 30343029 29478964 28921855 28384206 27527312 26436857
14197B6436857o27965q61846l12119p96091m65044m46484q42710n30996r31526
$$ 26436857 25808892 24947046 24634927 23838836 23373792 22927308 22084598 21553602 20622076
14188B0622076j17978m20596k65082p58173q0787o05661l72159m61997k31652
$$ 20622076 20504098 20083502 19818420 19060247 18979460 18373799 18001640 17539643 17307991
14179A7307991l23414l38923m83582k98081m19631k71697l6664k72335n71507
$$ 17307991 16984577 16645654 16162072 15863991 15444360 15172663 15135999 14863664 14292157
14170A4292157l32203k73725l6267n52276O3501l58564o8511j94468m86655p7379
$$ 14292157 13959954 13686229 13649962 13097686 13161187 12802623 12734112 12539644 12052989 11975610
14160A1975610k00390l36124O707j01682n54933K9702k739n00878J1883j85412
$$ 11975610 11775220 11439096 11445803 11344121 10789188 10818890 10816151 10315273 10327156 10141744
14150A0141744m58105M1489m74650Q1394k86548k86648L47618k38970m15240K98387
$$ 10141744 9683639 9725128 9250478 9331872 9045324 8758676 9106294 8867324 8452084 8750471
14140H750471m13720j23440j06127j84176J99589n66415J77175Q4976k19123M6225
$$ 8750471 8336751 8213311 8107184 7923008 8122597 7556182 7733357 7818333 7599210 7645435
14130G645435m79199L81376p61673M10770j07888l97444l05308q8847R7192J61964
$$ 7645435 7166236 7547612 6785939 7196709 7088821 6691377 6386069 6297222 6394414 6556378
14120F556378k4029j35035k80239J25332j96206K860j95027J687j08322j53765
$$ 6556378 6532349 6397314 6117075 6242407 6046201 6049061 5854034 5855721 5747399 5593634
14110E593634j8792j00414r1100j08551K6276L4363k21322j3105l00914L02701
$$ 5593634 5574842 5474428 5383328 5274777 5301053 5335416 5114094 5100989 4800075 5102776
14100E102776l846j59465k87085J99921k1719k42914q4516M3721j0101P5496k18838
$$ 5102776 5098930 4939465 4652380 4852301 4830582 4587668 4503152 4546873 4536772 4612268 4393430
14089D393430n3400N3513j17726k38084J90281r9845l1668J30986k63096Q5798
$$ 4393430 4340030 4393543 4275817 4037733 4228014 4128169 4096501 4227487 3964391 4050189
14079D050189k78666K22648l442l34606K92909j27227j40723l48041K95793j16786
$$ 4050189 3771523 3994171 3990729 3656123 3949032 3821805 3681082 3333041 3628834 3512048
14069C512048j91339j29203K76673L71801k30431l73188j42478K1039L14746l00806
$$ 3512048 3320709 3191506 3468179 3839980 3609549 3236361 3093883 3114922 3429668 3128862
14059C128862O0247j48830K65605k2405J6199K87825n35447n0302l0766m3235
$$ 3128862 3189109 3040279 3305884 3283479 3299678 3587503 3052056 3001754 2970988 2927753
14049B927753k42895L9358k16331K06199J75597k54873J26737k14244J08726l01336
$$ 2927753 2684858 2724216 2507885 2714084 2889681 2634808 2761545 2547301 2656027 2354691
14039B354691J87805p8153j76810L22249p7243J95616m87021J52613O379N5070
$$ 2354691 2542496 2464343 2287533 2609782 2532539 2728155 2241134 2393747 2400126 2455196
14029B455196j34251J7417L6143j75687r3108J06766j83979L2468J03717k00278
$$ 2455196 2320945 2338362 2374505 2198818 2105710 2212476 2028497 2060965 2164682 1964404
14019A964404K69256j15789K896k84676K88668j28355r4323J75233k30356K66252
$$ 1964404 2233660 2117871 2120767 1836091 2124759 1996404 1902081 2077314 1846958 2113210
14009B113210K06847n92584J45857j2870l5399K82452m74871K51839j49619J54813
$$ 2113210 2320057 1727473 1873330 1860460 1825061 2107513 1632642 1884481 1734862 1889675
13999A889675k61712N9554q5389O47268l73651k27333K08976N3824K86867M78460
$$ 1889675 1627963 1687517 1602128 2249396 1875745 1648412 1857388 1911212 2198079 2676539
13989B676539Q19713L431377O550470J2554338P667326r984698j1008298n550050
$$ 2676539 3496252 6927629 13478099 26032437 33699763 23715065 12706767 7156717
13981G156717k369871r41932m79690l70716K31218l76975j98943m77123j4999
$$ 7156717 4786846 3844914 3365224 2994508 3225726 2848751 2649808 2172685 2157686
13972B157686J83302j1521l18362J55543l60681K88603j13010l90632K49477k112
$$ 2157686 2340988 2329467 2011105 2166648 1805967 2094570 1981560 1590928 1840405 1838293
13962A838293J62880j70841j42353J28474j02533K5632L3692m8546l05166J93359
$$ 1838293 2001173 1830332 1687979 1816453 1713920 1739552 1773244 1724698 1419532 1612891
13952A612891K7921K7867j66296q6439j15199J89110M38543o95981L30909L4397
$$ 1612891 1640812 1668679 1502383 1415944 1300745 1489855 1928398 1232417 1563326 1597723
13942A597723l40639j67428M88674m7575l23019L85829k73581R9937N850j92996
$$ 1597723 1257084 1089656 1578330 1530755 1207736 1593565 1319984 1419921 1425771 1232775
13932A232775K31410O3292k98955j5627K54587J14235l59611P6800j14672j12429
$$ 1232775 1464185 1527477 1228522 1212895 1467482 1581717 1222106 1298906 1184234 1071805
13922A071805K69621k30790L85471k26897j45452J47809J01014k95270O4300p031
$$ 1071805 1341426 1110636 1496107 1269210 1123758 1271567 1372581 1077311 1141611 1134580
13912A134580K4323M4470n1297J42434k01118l044j52356M70077n9297r6115k18902
$$ 1134580 1158903 1203373 1152076 1294510 1093392 1090348 937992 1408069 1348772 1252657 1033755
13901A033755o6813L7259J99926k41980J95228n15207K23472K39239l1960j46987
$$ 1033755 966942 1004201 1204127 962147 1157375 642168 865640 1104879 1072919 925932
13891I25932j05284n1372L42383j14834J53581l92706K61641J22152n2955k95516
$$ 925932 820648 769276 1111659 996825 1150406 757700 1019341 1141493 1088538 793022
13881G93022P3631K56984l62640M6826K09578k59487J88585J52139m17583M52840
$$ 793022 866653 1123637 760997 807823 1017401 757914 946499 1098638 681055 1133895
13871A133895k50008J70967r802j71487J10292j54076P2455j31739J87183j96295
$$ 1133895 883887 1054854 1045052 873565 983857 829781 902236 770497 957680 761385
13861G61385J63864r4709L05227j23982m57439N38936k29019k484j42490n907
$$ 761385 925249 830540 1135767 1011785 554346 1093282 864263 861779 719289 713382
13851G13382K39999l93950m9857O23219l87172J71416L0582m55114J18728J31441
$$ 713382 953381 559431 509574 1132793 745621 917037 947619 492505 611233 742674
13841G42674k17366O67679k53931N0332j39015q235k1436k06748M35043m92861
$$ 742674 525308 1192987 939056 989388 850373 842138 820702 613954 1048997 556136
13831E56136K5684J57734K4750k74292M23622k91119L4722L68252j04386k72639
$$ 556136 581820 739554 764304 490012 913634 622515 657237 1025489 921103 648464
13821F48464j37708L20741k87101L35965j12643k51473K42390C09651R9183L72886
$$ 648464 510756 831497 544396 880361 767718 516245 758635 309651 408834 781720
13811G81720J51875k39151r1816K78667p3449K531r4349K47245l04268J20833
$$ 781720 933595 694444 602628 881295 807846 810377 716028 963273 659005 779838
13801G79838K22143l1003k23882C66782J49510Q9811q136k26701K71569j09372
$$ 779838 1001981 970978 747096 366782 516292 606103 597967 371266 642835 533463
13791E33463N6199R7448j10135k28229J20099R1865J81200j54181O1875Q8837
$$ 533463 589662 687110 576975 348746 468845 560710 741910 587729 649604 738441
13781G38441j33418j34568R8163K94326l29693o4611K52818m1953k32329A62214
$$ 738441 605023 470455 568618 862944 533251 468640 721458 679505 447176 162214
13770E22681A86513O9425L89984j64402p7496A93507N21443k57130O9516K32561
$$ 522681 186513 255938 645922 481520 404024 193507 714950 457820 527336 759897
13760G59897k7274j67087p2442j52188M94841l53219j36127J46295j37336J16599
$$ 759897 732623 565536 493094 340906 835747 482528 346401 492696 355360 471959
13750D71959K94988C22881K28652Q9782j07948L01318j89877k60408J59750L5150
$$ 471959 766947 322881 551533 641315 533367 834685 644808 384400 544150 579300
13740E79300B68358N50647P9716A30362J07176K68795q6142R506j41288L94871
$$ 579300 268358 819005 898721 130362 237538 506333 420191 429697 288409 683280
13730F83280k63145r201j16416K50436n7129N3139K30267K0955C13162j49285
$$ 683280 420135 410934 294518 544954 487825 540964 771231 792186 313162 163877
13720A63877L12094j29366N88559l83178q5347L85694l68287o1465K89423j35159
$$ 163877 475971 346605 935164 551986 466639 852333 484046 422581 712004 576845
13710E76845j07101J3005B33798K97675B62621P1791J59538J8510N8813k2665
$$ 576845 469744 482749 233798 531473 262621 334412 493950 512460 571273 548608
13700E48608j9164A09620L31138Q8995j62484j2456R8999M1077A81929K31187
$$ 548608 529444 109620 440758 529753 367269 354813 453812 494889 181929 413116
13690D13116K4544n4161M0037J78777j3804P5077j49271B56233K49332k23357
$$ 413116 437660 383499 423536 602313 588509 663586 514315 256233 505565 282208
13680B82208o659J09427K70488k12725j34679K71912k77066j2399J33332j770
$$ 282208 275549 384976 655464 442739 308060 579972 302906 290507 423839 422069
13670D22069A20776M71174O0648C14764K7813l0089K1142l1111a1203G60196B49186
$$ 422069 120776 591950 652598 314764 342577 312488 333630 302519 -11203 760196 249186
13658F53696j15990j34233H8338K85632k3337e2293B72433f8348D77525j3627
$$ 653696 537706 403473 88338 373970 350633 -52293 272433 -68348 477525 463898
13648D63898j97209J09962E7038N00812r4183j62767l1873J13252j55790K94258
$$ 463898 266689 376651 57038 557850 463667 300900 269027 382279 226489 520747
13638E20747N4258j31597j38690q5588Q4821J36160B14262b3586E70964A69696
$$ 520747 575005 443408 304718 219130 303951 440111 214262 -23586 570964 169696
13627C10283n2665A28358M51800B58062J42466j98197L1459K78437A83118l2690
$$ 310283 257618 128358 580158 258062 400528 202331 233790 512227 183118 150428
13617A50428K43431J5618j55587J46579j74027L60437r0804J6153K08513l16313
$$ 150428 393859 409477 253890 400469 226442 586879 496075 512228 720741 404428
13607D04428J63411p6678m2449H5254C1211K47689d3783B6861i9890A86120L8976
$$ 404428 567839 491161 448712 85254 31211 278900 -43783 26861 -99890 186120 225096
13596B25096a6711B212L50074F4068c5944B19315N25502E8754Q2510K76694A5244
$$ 225096 -16711 2212 352286 64068 -35944 219315 744817 58754 141264 417958 15244
13584D00832q5434p2640l9764a37241B70797J26695J36426B21776Q1914J6218
$$ 400832 315398 242758 202994 -137241 270797 397492 533918 221776 303690 319908
13574C19908j0702j3811K8337K1112O1768j09906R7463A64453J30708j41714J27771
$$ 319908 309206 295395 323732 344844 406612 296706 394169 164453 295161 153447 281218
13563B81218a27592C51144I179J90196e0555A37749K25844K861A75977p4620K44683
$$ 281218 -127592 351144 9179 199375 -50555 137749 363593 366454 175977 101357 346040
13552C46040A16299J91467J23782h5514B56301n8035K26241j09806q1561I4734
$$ 346040 116299 307766 431548 -85514 256301 198266 424507 314701 233140 94734
13541D54370A12560K5273K08165a11928B50692a535B09343k9504m9455J11336
$$ 454370 112560 137833 345998 -111928 250692 -1535 209343 179839 130384 241720
13531B41720N3847J72092A23417K85229o2018j8452D9264c0582H3774K26153G1887
$$ 241720 295567 467659 123417 408646 346628 328176 49264 -30582 83774 309927 71887
13519E22981B3186M08704A40236c2534I4305J06897G7044J56547Q3673A44285
$$ 522981 23186 431890 140236 -32534 94305 201202 77044 233591 317264 144285
13508D42659K01767j94824q9688j16324a44528A19335J3701J95274j27037n3191
$$ 442659 644426 449602 359914 243590 -144528 119335 133036 328310 201273 148082
13498A48082I398a76450N2337C53643J92045j54845e3815B10948J74848b9741
$$ 148082 9398 -176450 -124113 353643 545688 390843 -53815 210948 385796 -29741
13487E46055j63608P0015G7540J43057p1453F7484J72767r9274e7096B75532o2172
$$ 546055 382447 452462 77540 220597 149144 67484 240251 140977 -57096 275532 213360
13476B13360n7251k8110B4058J74941K80825B34515M2628q2695J9593Q3111j0147
$$ 213360 156109 127999 24058 198999 479824 234515 277143 194448 214041 297152 287005
13465B87005A4627O4238R242j0965J00752J74895A00139L7529K10407j23443p3738
$$ 287005 14627 78865 88107 77142 177894 352789 100139 137668 348075 224632 150894
13454A50894k3936M3136J46750o4900a9122B2665P8470M1964G1339I009J32682
$$ 150894 126958 170094 316844 251944 -19122 22665 101135 143099 71339 9009 141691
13443A41691J25506n6262K07553p2659j55679J20634n1483L09398k72420a78095
$$ 141691 267197 210935 418488 345829 190150 310784 259301 568699 296279 -178095
13432a6972D624K57455N699q821j26421J02861B6866K28892F7636J48453p7775
$$ -16972 4624 262079 267778 258957 132536 235397 26866 255758 67636 216089 138314
13421A38314A5181a5588o296j64305G8412K28610r1971j05337k8803J22900m7255
$$ 138314 15181 -15588 -21884 -186189 78412 307022 215051 109714 80911 203811 156556
13410A56556J6953b7563A59124i0788B56911B7505J83520P2763J31764h1044D46325
$$ 156556 173509 -27563 159124 -90788 256911 27505 211025 283788 415552 -81044 446325
13398C47254j17102j6643J16412n1805k1484q0220P3320I6671L5504K80123j37316
$$ 347254 230152 213509 329921 278116 256632 176412 249732 96671 132175 412298 274982
13387B74982R0625G0789F60a023k40793A59825d5811D44838d7735G5154R4045
$$ 274982 365607 70789 660 -1023 -241816 159825 -45811 444838 -47735 75154 169199
13376A69199E8222K4354J8099o657J3663J04133A2334J56537R6757K40949A08858
$$ 169199 58222 82576 100675 94018 107681 211814 12334 168871 265628 506577 108858
13364A97733J242a81635C81819j19802h849B7020J05284J10618a71176C28530
$$ 197733 198975 -181635 381819 262017 -8849 27020 132304 242922 -171176 328530
13353A67310G028a8118D05550B5000L67935M6971r9001I3625M574A5820b99618
$$ 167310 7028 -18118 405550 25000 392935 439906 340905 93625 98199 15820 -299618
13341A10977J43410b4838l5480J3265B61174m5903f7889a8719B09244K36305D2113
$$ 110977 254387 -24838 -60318 -47053 261174 215271 -67889 -18719 209244 445549 42113
13329D838J52131f1279C47845c7229A97377f1030A99410Q4305E0805M2493e0351
$$ 4838 156969 -61279 347845 -37229 197377 -61030 199410 283715 50805 93298 -50351
13317c4053H530L60261A36910c4498Q627A52009P9175Q70L9646b86561b5820C01743
$$ -34053 8530 368791 136910 -34498 -25871 152009 231184 232054 271700 -286561 -25820 301743
13304B43918L4441r1249L14197A5255K63494D6683J79368n925G4507b334j34682
$$ 243918 278359 187110 501307 15255 278749 46683 226051 220126 74507 -2334 -137016
13293a37016I2086c73168A28732E3709K50100A12288J64756H6210C0843J6046
$$ -137016 92086 -373168 128732 53709 303809 112288 277044 86210 30843 46889
13283D6889J71608J51159q0550j42000j9077f9715D9903K10020K9005A40204K59421
$$ 46889 218497 369656 289106 147106 128029 -69715 49903 259923 288928 140204 399625
13272C99625j56321H4585a04743A08135K00352P0995n7283J25090B12018b27373
$$ 399625 243304 84585 -104743 108135 308487 379482 322199 447289 212018 -227373
13261c5868C909c4569B08290A8765j334J29399k895J21034j14490N100G7194A0237
$$ -35868 3909 -34569 208290 18765 17431 146830 143935 264969 150479 155579 77194 10237
13248e5940C06168E1436K68676j50642b8471j12988C66165g923B74864o8206n8913
$$ -55940 306168 51436 320112 169470 -28471 -141459 366165 -7923 274864 206658 147745
13237A47745a28680A09112d1475A61992R1525b05053R6302I3656K60568d0555
$$ 147745 -128680 109112 -41475 161992 253517 -205053 -108751 93656 354224 -40555
13226A84631J02463G467L83837j22014b08129a763l38428A6649K59745j09504
$$ 184631 287094 7467 391304 269290 -208129 -1763 -340191 16649 276394 166890
13216A66890q3317K18801h048C14434j26710c3403l1448N648n4496m6130I193
$$ 166890 83573 302374 -8048 314434 187724 -33403 -64851 -59203 -113699 -159829 9193
13204A40053b03755B06237F6818g949A14625E747N50233A65766J1065e7846n2798
$$ 140053 -203755 206237 66818 -7949 114625 5747 555980 165766 176831 -57846 -110644
13193a10644a4708k34197C81383A6739f0570E51516c27121A99501C3708Q5868
$$ -110644 -14708 -248905 381383 16739 -60570 551516 -327121 199501 33708 119576
13183A19576p494J27825N9263f6082H3087d9897D5568K14053a40093A50176k1686
$$ 119576 112082 239907 299170 -66082 83087 -49897 45568 259621 -140093 150176 128490
13172A28490a15191A88296J83044a41036B36968b08729A41780d2708A20370J67735
$$ 128490 -115191 188296 371340 -141036 236968 -208729 141780 -42708 120370 288105
13162B88105j1922p8181B5526a1061H1764J00369b44250Q3471B58978A03814J18965
$$ 288105 276183 198002 25526 -11061 81764 182133 -244250 -160779 258978 103814 222779
13151B22779F8313J94306D7329k0275a94193A42247a08870A37934P1483r7488
$$ 222779 68313 262619 47329 27054 -194193 142247 -108870 137934 209417 111929
13141A11929L4033D6352b50207K9402b4274j70480h6325D6277J49047G3024o220
$$ 111929 145962 46352 -250207 -220805 -24274 -194754 -86325 46277 195324 73024 66804
13130F6804P4591b07533C67776a47111K0240B10437O1827j32830a37935A65895
$$ 66804 141395 -207533 367776 -147111 -126871 210437 272264 139434 -137935 165895
13119B58483A0211J83566A6698J06028N6812K21502j83936f3288A42353a00910
$$ 258483 10211 193777 16698 122726 179538 401040 217104 -63288 142353 -100910
13108A7646i7870G3988N7541d8395j01629m6769d432B23597i4802K4896A32552
$$ 17646 -97870 73988 131529 -48395 -150024 -196793 -4432 223597 -94802 -69906 132552
13096b33269B5706g014k2190E2945J32857q4514n0105K30351a56022E5338b2812
$$ -233269 25706 -7014 -29204 52945 185802 101288 51183 281534 -156022 55338 -22812
13084a12274k10898d9816b4900j57415D04596C7894K57500k9298B4338b5695A30632
$$ -112274 -323172 -49816 -24900 -182315 404596 37894 295394 266096 24338 -25695 130632
13072c3891j06526a5956A35111j2475a34299A22924i3642D3497L3825a3612B24654
$$ -33891 -140417 -15956 135111 122636 -134299 122924 -93642 43497 77322 -13612 224654
13060e0332A78765Q9932b4314P920C97352I6936b2509A79808B2627L1626J7562
$$ -50332 178765 268697 -24314 -16394 397352 96936 -22509 179808 22627 54253 71815
13049G1815b3680j30258G3366a54448A59337b27905b9306A15549O0972a45494
$$ 71815 -23680 -153938 73366 -154448 159337 -227905 -29306 115549 176521 -145494
13038D3638a51028B73622a1932A28434a57513C53817A54673a52256c659j39906
$$ 43638 -151028 273622 -11932 128434 -157513 353817 154673 -152256 -3659 -143565
13028a43565O3110A79314b22877D3612i4484a6412A18662d4682B38683j6568L4545
$$ -143565 -80455 179314 -222877 43612 -94484 -16412 118662 -44682 238683 222115 256660
13017B56660b4977p129j66217k2418A42567a64806A70688g6549B47854E9359b677
$$ 256660 -24977 -32106 -198323 -220741 142567 -164806 170688 -76549 247854 59359 -2677
13005G4032P6498K7014a04179C83892I4397M505k7406i0157E3096J45709h1571
$$ 74032 150530 177544 -104179 383892 94397 98902 71496 -90157 53096 198805 -81571
12993A63086r617b57435m2175A04349N3915J45554c9354D33763A85620o5251b99252
$$ 163086 153469 -257435 -299610 104349 158264 303818 -39354 433763 185620 120369 -299252
12981g6346C67283b0582H2062a33759A2443K7178a69196A0714b52329I40b9451
$$ -76346 367283 -20582 82062 -133759 12443 39621 -169196 10714 -252329 940 -29451
12969C46060D0144P0812l9253h4359A67862m541l0555K00094e3774H0424k274
$$ 346060 40144 110956 71703 -84359 167862 163321 132766 332860 -53774 80424 78150
12958G8150p224a39433B4519k548f8475E3428J5201j7907a74335B10192b12748
$$ 78150 70926 -139433 24519 21971 -68475 53428 68629 50722 -174335 210192 -212748
12946i9764C3157a06281B39518G6183j3130b07421J03011a8439C3442i3020G6780
$$ -99764 33157 -106281 239518 76183 63053 -207421 -104410 -18439 33442 -93020 76780
12934C7408R8209h0073D9609j35K50078A18927r478a68423O5971A65K06180b85474
$$ 37408 135617 -80073 49609 49474 299552 118927 109449 -168423 -102452 165 206345 -285474
12921g1604A10794B685c35654R0158G4703g1174j13380n9910A89409i8223k3395
$$ -71604 110794 2685 -335654 -245496 74703 -71174 -184554 -244464 189409 -98223 -121618
12910a21618F5055h4320A79771B3013L06245B9322a07820H449J86060a25751p3527
$$ -121618 65055 -84320 179771 23013 329258 29322 -107820 8449 194509 -125751 -199278
12899a99278B10213H9517K53155D8041Q161a92468A10137b18081D8699a25201
$$ -199278 210213 89517 342672 48041 56202 -192468 110137 -218081 48699 -125201
12888a81422A01135o970a1524j6497l8769F6060b8255j37206A28037D6359M1009
$$ -181422 101135 94165 -11524 -28021 -66790 66060 -28255 -165461 128037 46359 87368
12877H7368J45530j07148J65075d4211E8786i8698L9293k44655l2127c5890j67306
$$ 87368 232898 125750 290825 -44211 58786 -98698 -59405 -304060 -336187 -35890 -203196
12866b03196a00958d79k61838g020D75638c95392A82145o0883O8514O4974D5922
$$ -203196 -100958 -479 -262317 -7020 475638 -395392 182145 121262 189776 254750 45922
12854B67204b21128B13122a78813A97382A9394g9918k64204C46707A6476M5926
$$ 267204 -221128 213122 -178813 197382 19394 -79918 -344122 346707 16476 62402
12844F2402c4678p7924A34816n4559b85765A96361b69103a9470G1720h868j62076
$$ 62402 -34678 -112602 134816 80257 -285765 196361 -269103 -19470 71720 -8868 -170944
12833a70944B82664M3674b01822K9394c9097B391c73311I7048J02257b53736o2228
$$ -170944 282664 326338 -201822 -172428 -39097 2391 -373311 97048 199305 -253736 -315964
12822c15964e4648A11821a22419L539A45846J17576a87615A42440E4510K25706
$$ -315964 -54648 111821 -122419 -118880 145846 263422 -187615 142440 54510 280216
12812B80216a99843B18215a19233d478A59066E831f0001A09263b8109A65722C4463
$$ 280216 -199843 218215 -119233 -4478 159066 5831 -60001 109263 -28109 165722 34463
12800A1204M2454c21304a55861D396K21962d8525B11575H1961c99252c6034j73212
$$ 11204 53658 -321304 -155861 4396 226358 -48525 211575 81961 -399252 -36034 -209246
12789b09246A51835f0748A62830h0418j89711C02120P902i1820c3580q5934F2695
$$ -209246 151835 -60748 162830 -80418 -270129 302120 310022 -91820 -33580 -119514 62695
12777A19524b60069J16364J9332j9592B9888P58P4592i0864F572J00567m6589
$$ 119524 -260069 -143705 -124373 -143965 29888 30646 105238 -90864 6572 107139 60550
12766F0550h8513k20641g3627B11344c5949J5333D0998a38823K2232B53908a78352
$$ 60550 -88513 -309154 -73627 211344 -35949 -20616 40998 -138823 -116591 253908 -178352
12754A12622J95550B6984a955q8843B99287M7969a08235k65590i4601A54755n1453
$$ 112622 308172 26984 -1955 -90798 299287 347256 -108235 -373825 -94601 154755 103302
12743A03302B5728J78347g0060j58166L2094O0356A87694a21006J5547F8037J90956
$$ 103302 25728 204075 -70060 -228226 -196132 -135776 187694 -121006 -105459 68037 258993
12732B58993c326l4057p9637A16647a67509e0434k5847B18601p3685a51624B56806
$$ 258993 -3326 -37383 -117020 116647 -167509 -50434 -76281 218601 144916 -151624 256806
12720a34080K7085B13976D3934K46971j15106E4450b8568m49508B01192r6386
$$ -134080 -106995 213976 43934 290905 175799 54450 -28568 -478076 201192 104806
12710A04806L2649J14579o2923M5354m6636N6252e0001B76379O267a22560e5114
$$ 104806 137455 252034 189111 234465 187829 244081 -50001 276379 282646 -122560 -55114
12698e0268k05671M9694h1692A28010a38945g53C50303A03964a01983j75789c7255
$$ -50268 -255939 -206245 -81692 128010 -138945 -753 350303 103964 -101983 -277772 -37255
12686G9871i9506j89781d0608A44026b09571N8954A11312k6104a789j16620I8807
$$ 79871 -99506 -289287 -40608 144026 -209571 -150617 111312 85208 -1789 -118409 98807
12674B50948a40587n6339A60828n3455J69194D8478K71148a75257B1112P9977
$$ 250948 -140587 -196926 160828 107373 276567 48478 319626 -175257 21112 101089
12664A01089m0717c3966A64961Q3364A06213M3975L15106G3512j8827a2712p6509
$$ 101089 60372 -33966 164961 248325 106213 150188 465294 73512 54685 -12712 -89221
12653h9221B19364D673a6269j10335c3717I8178f6943J2456B8399a32140o5497
$$ -89221 219364 4673 -16269 -126604 -33717 98178 -66943 -54487 28399 -132140 -197637
12642a97637h4839p6403A16124f3368o6430j9342K4724B14930d1398B88483j0213
$$ -197637 -84839 -161242 116124 -63368 -129798 -149140 -124416 214930 -41398 288483 278270
12631B78270A29547K8262R7052m9511b14641B88634f0887A3611a46965m9470g6072
$$ 278270 129547 157809 254861 205350 -214641 288634 -60887 13611 -146965 -196435 -76072
12619F4749j2378k2762J21263c41592A37110C9023j6401L3976f1702b3695I9185
$$ 64749 52371 29609 150872 -341592 137110 39023 22622 56598 -61702 -23695 99185
12607h5160A30406A386L4774C515L37448h833k35738B78898a37991l5703h3569
$$ -85160 130406 1386 36160 3515 340963 -8833 -244571 278898 -137991 -173694 -83569
12595c17427G0986O4585i1251J8254B2822J02109a68006K2474m1601B8538J91417
$$ -317427 70986 135571 -91251 -72997 22822 124931 -168006 -145532 -187133 28538 219955
12584B19955B1119a31052A41024a27230H567M0133J82923p3352a92461a8502d06
$$ 219955 21119 -131052 141024 -127230 8567 48700 231623 158271 -192461 -18502 -406
12572A4381J69599a37825A24096k3209a33878L3223d9979d135I1115b28662j2539
$$ 14381 183980 -137825 124096 100887 -133878 -100655 -49979 -4135 91115 -228662 -241201
12561b41201N6504b6702p057B3743R366Q0686b42541a12660D4833I31L20452q1740
$$ -241201 -184697 -26702 -33759 23743 33109 113795 -242541 -112660 44833 931 321383 239643
12549B39643c4187j49748M7820j8129A81800P0483d6824k25602b2486k39158I5531
$$ 239643 -34187 -183935 -136115 -154244 181800 252283 -46824 -272426 -22486 -261644 95531
12537B4431L1207c9403a5985A66880P852a34060B40277b30046A39489a87292g3576
$$ 24431 55638 -39403 -15985 166880 174732 -134060 240277 -230046 139489 -187292 -73576
12525B30528c24189A17207J16487C5215L0172a13815A72217J7513a7045A94240
$$ 230528 -324189 117207 233694 35215 65387 -113815 172217 189730 -17045 194240
12514A89816o2460p595L9987b63465F1663N2431c3139k87697M1217A4406b18812
$$ 189816 127356 119761 159748 -263465 61663 114094 -33139 -320836 -279619 14406 -218812
12502i7048o867A80331A0209h7454C1330A305J65651p4236O5203c29617I9259
$$ -97048 -103915 180331 10209 -87454 31330 1305 166956 92720 157923 -329617 99259
12490a4996r930A46371j3609a28459q570E8434J1595P1830J63331h9423A8179
$$ -14996 -24926 146371 132762 -128459 -137029 58434 70029 141859 305190 -89423 18179
12478A21181l6736a69005F5853J15530J63505A16839a4013m188B81145j16335
$$ 121181 84445 -169005 65853 181383 344888 116839 -14013 -18201 281145 164810
12468A64810d7695k09379B6769b08713H2011J17536c6962k19923J23354L5632
$$ 164810 -47695 -257074 26769 -208713 82011 199547 -36962 -256885 -133531 -97899
12458i7899j13956D5239J61735E8893a11811n5051A79476H5964L635C7731F656
$$ -97899 -211855 45239 206974 58893 -111811 -166862 179476 85964 89599 37731 6656
12446A04132j2643m1885K26483b75715E3692A8574Q2625K45344H356c7173k01323
$$ 104132 91489 49604 276087 -275715 53692 18574 101199 346543 8356 -37173 -238496
12435b38496A32064Q2634b99678J35823j4515a0341k54462B6631b11601f8027
$$ -238496 132064 214698 -299678 -163855 -178370 -10341 -264803 26631 -211601 -68027
12424c875j13922A42042e0285b3931A98293b71043c8914J0678j6632I0377b03960
$$ -3875 -117797 142042 -50285 -23931 198293 -271043 -38914 -28236 -44868 90377 -203960
12412a5434j08792f1965b9026B84320H7326i8196I536O7478a1356A24998L6918
$$ -15434 -124226 -61965 -29026 284320 87326 -98196 9536 77014 -11356 124998 161916
12401A61916C874L6569J8830a77914l4656n2285K1868A14799L1599M1325b50423
$$ 161916 3874 40443 59273 -177914 -212570 -264855 -242987 114799 146398 187723 -250423
12389I3209c6079c80A71324K6169R9297j34156C3998N2387b61887A83389D1936
$$ 93209 -36079 -380 171324 197493 296790 162634 33998 86385 -261887 183389 41936
12377c26584E3127k4360h9935k2396A26093h7636B06072H158P9343e8883B14068
$$ -326584 53127 28767 -89935 -112331 126093 -87636 206072 8158 87501 -58883 214068
12365E8272A19P1723a67701M3037C3731g7090B46882a27708j06956A18836a1811
$$ 58272 119 71842 -167701 -124664 33731 -77090 246882 -127708 -234664 118836 -11811
12353B67126M4862D3334N9383e5434k13605c7579C58120K3104h8087F8801J25519
$$ 267126 311988 43334 102717 -55434 -269039 -37579 358120 381224 -88087 68801 194320
12342A94320a40808j51994a00865D6186a43247B49283a3043B25294f5833j36873
$$ 194320 -140808 -292802 -100865 46186 -143247 249283 -13043 225294 -65833 -202706
12332b02706e3120J0038j404A36481L33189A44583K30264j21460I2761b5743A47281
$$ -202706 -53120 -43082 -44486 136481 469670 144583 374847 253387 92761 -25743 147281
12320D21543F5052M048K2248K0227N388a3922n8628H6910b31983i0006B94192
$$ 421543 65052 69100 91348 111575 116963 -13922 -72550 86910 -231983 -90006 294192
12308A15777J81555C2854D256J53214a00499A46466k2479J07200a29054a3398
$$ 115777 297332 32854 4256 157470 -100499 146466 123987 231187 -129054 -13398
12297C31118a46908c9011A92289O9379H4988b21742A982c1105a4856j23388I9303
$$ 331118 -146908 -39011 192289 261668 84988 -221742 1982 -31105 -14856 -138244 99303
12285F7906C3331a62468A02417J72627a40130I4092A1579J70906F6660L2093I054
$$ 67906 33331 -162468 102417 275044 -140130 94092 11579 182485 66660 98753 9054
12273g8338p9479B69167j29035d0861I2314K48266F4728J33206C3202L52261a44190
$$ -78338 -157817 269167 140132 -40861 92314 340580 64728 197934 33202 385463 -144190
12261B35013p9320b7171j79705E5473a40825L5478B39577b98531J39201O5509
$$ 235013 155693 -27171 -206876 55473 -140825 -105347 239577 -298531 -159330 -93821
12251i3821J5170H3484j1686h6626A78200m672b8742B24179p7433g5519l4834
$$ -93821 -78651 83484 71798 -86626 178200 173528 -28742 224179 146746 -75519 -110353
12240a10353b9910E1159K29158a02038j35741C04252l4430A30363o4100O3079
$$ -110353 -29910 51159 280317 -102038 -237779 304252 269822 130363 66263 129342
12230A29342L6996b3789p2059A06304a36818A1068K7980a18013B37264Q2395c3339
$$ 129342 166338 -23789 -95848 106304 -136818 11068 39048 -118013 237264 319659 -33339
12218E3181R6648J09177D266J7390c757C44536j07913J75612B9148b26793G4787
$$ 53181 149829 259006 4266 21656 -3757 344536 236623 412235 29148 -226793 74787
12206G6957K34454o2832H3297a36310c3442F0949K72958G5201K1926c6908H9236
$$ 76957 311411 248579 83297 -136310 -33442 60949 333907 75201 97127 -36908 89236
12194A51063n0044m0109K26749a32069B23934q5107a7401q9430I1757b9633A75571
$$ 151063 101019 60910 287659 -132069 223934 138827 -17401 -106831 91757 -29633 175571
12182H7569K39903I1803f2039M031I3246J93337j06724a17369k2468A35463A2982
$$ 87569 327472 91803 -62039 -58008 93246 286583 179859 -117369 -139837 135463 12982
12170B06064j7110K83476A40681p536J85773f1238C20939p8096g7583C14930e2669
$$ 206064 188954 472430 140681 133145 318918 -61238 320939 242843 -77583 314930 -52669
12158g7834p8162C00431A42572K5442A3695O8002b30637a07281M2786k33800A48308
$$ -77834 -155996 300431 142572 168014 13695 81697 -230637 -107281 -64495 -298295 148308
12146A07722a45481d7252k6090e455B5361J25657a69404A49158Q8769J65637A88070
$$ 107722 -145481 -47252 -73342 -5455 25361 151018 -169404 149158 237927 403564 188070
12134C63172j36735i7050C3097J21733b09495I2378a32332j03744B83491N6865
$$ 363172 226437 -97050 33097 154830 -209495 92378 -132332 -236076 283491 340356
12124C40356h1253B71570a41609A89459B3546K19439a48937A16704J72627d3388
$$ 340356 -81253 271570 -141609 189459 23546 242985 -148937 116704 289331 -43388
12113C8985j4518K09662a4575A92354b4567p1949E6891e6424c006G2195K7451
$$ 38985 24467 234129 -14575 192354 -24567 -96516 56891 -56424 -3006 72195 99646
12102I9646A8739J96438p0868M1178k3700l6462E1552R6743A5943L5506c21460
$$ 99646 18739 215177 144309 185487 161787 125325 51552 148295 15943 51449 -321460
12090B5334i4583H1119a11203C11475b43972e0944j55168A17825L3987b16143
$$ 25334 -94583 81119 -111203 311475 -243972 -50944 -206112 117825 151812 -216143
12079A67456a52959L9243d3022r1324B10883a70903h1738C6204N0354J39792q4476
$$ 167456 -152959 -113716 -43022 -134346 210883 -170903 -81738 36204 86558 226350 141874
12068A41874q735a71945e5886G6912K0349K17883a88484l6932g75B28080a41556
$$ 141874 133139 -171945 -55886 76912 97261 315144 -188484 -225416 -775 228080 -141556
12056c3421F0309J9856B8217a45431C5772J3891g8766A16922b34148A08635e6126
$$ -33421 60309 80165 28217 -145431 35772 49663 -78766 116922 -234148 108635 -56126
12044A82337c736j76904B07718a3148A47527J2021F2495B8136L8119a99083b8518
$$ 182337 -3736 -180640 207718 -13148 147527 159548 62495 28136 66255 -199083 -28518
12032h7857A42984o248E1869J61861a46900A93003B729b01357q31P9632G7502
$$ -87857 142984 136736 51869 213730 -146900 193003 2729 -201357 -202188 -122556 77502
12020A64667A1052a83502J4608C87945a09580A0634a45405n1106A18021E3185
$$ 164667 11052 -183502 -168894 387945 -109580 10634 -145405 -196511 118021 53185
12009c57294C18110d8866A43113c10833N0319a0226A6799b0369D4901L31592i3509
$$ -357294 318110 -48866 143113 -310833 -260514 -10226 16799 -20369 44901 376493 -93509
11997b48466H6893l9460a16740B52459h4440B31881l5712F5038e6077B06199A3008
$$ -248466 86893 47433 -116740 252459 -84440 231881 196169 65038 -56077 206199 13008
11985I7368P6173b4273A936b80958R672b8778H315a69744k63383d3724r8820j96830
$$ 97368 173541 -24273 1936 -280958 -271286 -28778 8315 -169744 -433127 -43724 -142544 -339374
11973c39374J66140j3874o3418A3115i1552D0784Q1978a64242C6334L14835g7002
$$ -339374 -173234 -187108 -250526 13115 -91552 40784 122762 -164242 36334 351169 -77002
11961b9615C1390J36151a58378b3420I1728f00174A65042b66873B80083J4950
$$ -29615 31390 167541 -158378 -23420 91728 -600174 165042 -266873 280083 295033
11951B95033A26513L04075a01764B98173e365n7518r3877I8406a84711B2730b06084
$$ 295033 126513 430588 -101764 298173 -5365 -62883 -156760 98406 -184711 22730 -206084
11939B59495A01715a10518o4446B41657l8221b30132I2796a20614k6684B04404
$$ 259495 101715 -110518 -174964 241657 203436 -230132 92796 -120614 -147298 204404
11928a26587K4326j43793B4534I935J94452d34730g7744l504j27194b5161q1788
$$ -126587 -102261 -246054 24534 9935 204387 -434730 -77744 -81248 -208442 -25161 -106949
11917a06949j73509d2787m7116E0416O3916c7213A73757a59633B25866b7946j2516
$$ -106949 -280458 -42787 -89903 50416 114332 -37213 173757 -159633 225866 -27946 -40462
11906d0462A15035b7819H8637b09444C15509a62446A53761j7651b49491A85200
$$ -40462 115035 -27819 88637 -209444 315509 -162446 153761 136110 -249491 185200
11895c3294A05477f7017F1505L8442c65021a51732A8445d21516a24069p7653A22102
$$ -33294 105477 -67017 61505 99947 -365021 -151732 18445 -421516 -124069 -201722 122102
11883E0850a10007F1578a29447n6979B12462I8209P4015b43164A71884a00977
$$ 50850 -110007 61578 -129447 -186426 212462 98209 172224 -243164 171884 -100977
11872C55327c00583a22040J1107A47604o5209a51559E698a17264A48551i4328
$$ 355327 -300583 -122040 -110933 147604 82395 -151559 5698 -117264 148551 -94328
11861a26223L2107d2823j8067j6102j9698o5436D024h1633A11800a4120q0726
$$ -126223 -94116 -42823 -60890 -76992 -96690 -162126 4024 -81633 111800 -14120 -94846
11850i4846h940k8476k6538K9811k37603B10601D8031Q0700m1089b49491L241
$$ -94846 -8940 -37416 -63954 -34143 -271746 210601 48031 128731 87642 -249491 -246250
11839b46250O6006I6982a24435A46963e4774H4152e9355E6217b98556E7251O5468
$$ -246250 -180244 96982 -124435 146963 -54774 84152 -59355 56217 -298556 57251 122719
11828A22719a46207N6892L9795A04615a28106K7338b9798n5400A59966a5270A01385
$$ 122719 -146207 -89315 -49520 104615 -128106 -100768 -29798 -85198 159966 -15270 101385
11816b05781c273E9883a88870k5005j60032A50552a9826I7410a41790A55608a43333
$$ -205781 -3273 59883 -188870 -213875 -373907 150552 -19826 97410 -141790 155608 -143333
11804G7462a44511M4792C7037R7625f5582C1967d29823b7018D6193N7064D5667
$$ 77462 -144511 -99719 37037 134662 -65582 31967 -429823 -27018 46193 103257 45667
11792A5200b11344c4949d971A01254b29585i358j52524C79230g0224c1024j39234
$$ 15200 -211344 -34949 -4971 101254 -229585 -9358 -161882 379230 -70224 -31024 -170258
11781a70258l09270c0254j86648e7509q5940O4749n9170J1794k3248q3555F6910
$$ -170258 -479528 -30254 -216902 -57509 -143449 -78700 -137870 -126076 -149324 -232879 66910
11769f1974k9316b8827m8719A03711Q9142E916b69747G3905M4385d0911k33939
$$ -61974 -91290 -28827 -77546 103711 192853 5916 -269747 73905 118290 -40911 -274850
11758b74850F7218i13B08480I4194c9127n540j34675j36930H9527A9360a16747
$$ -274850 67218 -913 208480 94194 -39127 -44667 -179342 -316272 89527 19360 -116747
11746a62817I8394a30725B58677F6514K03032I8657A2351a18710G7825g2798j69410
$$ -162817 98394 -130725 258677 66514 269546 98657 12351 -118710 77825 -72798 -242208
11735b42208B72306A18361A4615b10385P5757l61755C5828a97791A82998a17498
$$ -242208 272306 118361 14615 -210385 -134628 -496383 35828 -197791 182998 -117498
11724f6603l3293l3732c7248a2022B72464d0199G451J77072a24664F6672a30727
$$ -66603 -99896 -133628 -37248 -12022 272464 -40199 7451 184523 -124664 66672 -130727
11712g1985K1419A06774h5017L8032j57707H1098N9229K02184j46989o5200c3241
$$ -71985 -50566 106774 -85017 -46985 -204692 81098 140327 342511 195522 130322 -33241
11700i0089a3767A16487a10910A53948a7525I0411l3755a74557F1406O5282J88593
$$ -90089 -13767 116487 -110910 153948 -17525 90411 56656 -174557 61406 126688 315281
11689C15281a1970k6653D49343E4512J16007a23792k9443F0216f6316D9965b68351
$$ 315281 -11970 -38623 449343 54512 170519 -123792 -153235 60216 -66316 49965 -268351
11677A80460a29955j64124H3643J91750c35910J63852E0796Q5916b09570C1715
$$ 180460 -129955 -294079 83643 275393 -335910 -172058 50796 136712 -209570 31715
11666B9739f6275l1496d1300B02096l3266J73891a90325A37207i0889d2413I8871
$$ 29739 -66275 -97771 -41300 202096 168830 342721 -190325 137207 -90889 -42413 98871
11654A31070f5326k49611E16928G7536b95115A8510d8799J0271A81068m3823a00466
$$ 131070 -65326 -314937 516928 77536 -295115 18510 -48799 -38528 181068 137245 -100466
11642D9037h8021H6580l7387a5432k65188C01500a7110j55840C75754F1912a07569
$$ 49037 -88021 86580 49193 -15432 -280620 301500 -17110 -172950 375754 61912 -107569
11630e914G8218J21252J23002F4081a42137C05229C3157M43084B5457a74838i174
$$ -5914 78218 199470 322472 64081 -142137 305229 33157 476241 25457 -174838 -9174
11618A05633c05006h1178A562K11762b99363R3267E9799M22982f75A60184a62449
$$ 105633 -305006 -81178 1562 213324 -299363 -206096 59799 482781 -675 160184 -162449
11606H7777a298B6491a14309C6308a41562P0035j41334L2146I1383J14704k5180
$$ 87777 -1298 26491 -114309 36308 -141562 -71527 -212861 -180715 91383 206087 180907
11595A80907h5341L7861B55510b70883R1890A35891n4184J42516a83175Q516C07898
$$ 180907 -85341 -47480 255510 -270883 -178993 135891 81707 224223 -183175 -174659 307898
11583C503J64934a3581j8234n5550b4047C16365j505a84083N4159j22385I4373
$$ 3503 168437 -13581 -31815 -87365 -24047 316365 314860 -184083 -129924 -252309 94373
11571B981J51885A9720a51899L2979A67818o9021F543c7020B25178a02641A3453
$$ 2981 154866 19720 -151899 -118920 167818 98797 6543 -37020 225178 -102641 13453
11559A0746a55311B16533H7041K77888a86890c6117I1833b7365H6220O1565k5696
$$ 10746 -155311 216533 87041 364929 -186890 -36117 91833 -27365 86220 147785 122089
11548A22089b49667A38760a66064p3322e8359A03897h8343L1517C76953j88353
$$ 122089 -249667 138760 -166064 -239386 -58359 103897 -88343 -56826 376953 188600
11538A88600a08379d1284l6025H3018b4909B62905a54041G0527b74763A58782
$$ 188600 -108379 -41284 -77309 83018 -24909 262905 -154041 70527 -274763 158782
11527a17540A65870R1340E1923A9255D514Q4490g4637B40394g4569A42651j9484
$$ -117540 165870 257210 51923 19255 4514 89004 -74637 240394 -74569 142651 123167
11516A23167n4612k0868d3714B71336G6248a72802M1611A00799D5709g480B50188
$$ 123167 68555 47687 -43714 271336 76248 -172802 -131191 100799 45709 -7480 250188
11504G7884K11794b87474B24642n4379d16604A41064q645K3163i4301j7083C56321
$$ 77884 289678 -287474 224642 170263 -416604 141064 132419 155582 -94301 -111384 356321
11492i7854E8073f6754B26341b0928j49877D47959A15598r037J86167r8376e5083
$$ -97854 58073 -66754 226341 -20928 -170805 447959 115598 106561 292728 194352 -55083
11480A46068b19634C0724a94267i3706A46052J50419F4438a37803A19036a38397
$$ 146068 -219634 30724 -194267 -93706 146052 296471 64438 -137803 119036 -138397
11469b03151N3778B77098a50941A90527H4897f8635E71032b31077C3551j1560
$$ -203151 -149373 277098 -150941 190527 84897 -68635 571032 -231077 33551 21991
11459B1991C826b7139A446J62923B6512M8016c16402a18090k55165i6294B52388
$$ 21991 3826 -27139 1446 164369 26512 74528 -316402 -118090 -373255 -96294 252388
11447H5247a7419I0781J8811o8K8285b2686n6979J0388A60173a30055A43476O9972
$$ 85247 -17419 90781 109592 109524 137809 -22686 -79665 -69277 160173 -130055 143476 213448
11435B13448a95865I0235a82321D26051D5509a558p4550B55500e88345a80554
$$ 213448 -195865 90235 -182321 426051 45509 -1558 -76108 255500 -588345 -180554
11424b38242R0662h786F6998d5561C51548A61269d4185I179a26029B1437b53345
$$ -238242 -147580 -8786 66998 -45561 351548 161269 -44185 9179 -126029 21437 -253345
11412D9730a23819B6619R2582f3452A08920b46643A24989J03235b97686a7615
$$ 49730 -123819 26619 119201 -63452 108920 -246643 124989 228224 -297686 -17615
11401b38568B06572a16893A69414h4936A11701K39954A02807h6059B05539C5553
$$ -238568 206572 -116893 169414 -84936 111701 351655 102807 -86059 205539 35553
11390D6819J58b13190B332K1654J06759K5084k1543b72271B44076B4061N7970
$$ 46819 46977 -213190 2332 23986 130745 155829 134286 -272271 244076 24061 82031
11379H2031a34620B44872a30037f1956A4568b90769H3576d07096C8737b46944
$$ 82031 -134620 244872 -130037 -61956 14568 -290769 83576 -407096 38737 -246944
11368F3203f0840G2607a19045k66341a26561B7557i6864L5115A27660c20793J08705
$$ 63203 -60840 72607 -119045 -385386 -126561 27557 -96864 -61749 127660 -320793 -212088
11357b12088C2330a3396C90768P8132A21897b88205h5317m338c3992k95989C093
$$ -212088 32330 -13396 390768 468900 121897 -288205 -85317 -89655 -33992 -329981 3093
11345B49040o6310L6402b34624B51745g3789A27883d3386C71857e2758a9575A43676
$$ 249040 182730 219132 -234624 251745 -73789 127883 -43386 371857 -52758 -19575 143676
11333i5281k92569J12683R0848A78467E3144J03156O6879p948a32965M7469p8238
$$ -95281 -387850 -275167 -184319 178467 53144 156300 223179 215231 -132965 -85496 -163734
11322a63734L3100j51790I9219h3250k1915A33089a38094j56567B4623b9134p7132
$$ -163734 -130634 -282424 99219 -83250 -105165 133089 -138094 -294661 24623 -29134 -106266
11311a06266c4634A05468b03067c3520j71566E4303J43237k1398h7440j5460B60490
$$ -106266 -34634 105468 -203067 -33520 -205086 54303 197540 176142 -87440 -102900 260490
11299a34774I5599a29559J847m9977g5667K6558o9079F8482b55362N7623G807
$$ -134774 95599 -129559 -127712 -177689 -75667 -49109 -118188 68482 -255362 -197739 7807
11287c00850G916Q6803b4686j02402k18955R2844A95434p828b47973A72607d3565
$$ -300850 7916 94719 -24686 -127088 -346043 -253199 195434 187606 -247973 172607 -43565
11275a5742l4236A60483B062b5405k03022e2206n1859A35862B0684a10934a8027
$$ -15742 -49978 160483 2062 -25405 -228427 -52206 -104065 135862 20684 -110934 -18027
11263B2162h1528k4127I532c46976e4661r6670E2496J16480i1756b5520j4025
$$ 22162 -81528 -105655 9532 -346976 -54661 -151331 52496 168976 -91756 -25520 -39545
11252c9545k3593j77149Q5816q8452e2462n0409p0590O8835A0009i4680A16802
$$ -39545 -63138 -240287 -154471 -242923 -52462 -102871 -173461 -104626 10009 -94680 116802
11240G4163a52517c2791A428R4617a74011A53312a60412P269M6616d6426A55505
$$ 74163 -152517 -32791 1428 96045 -174011 153312 -160412 -153143 -106527 -46426 155505
11228C24262f0316A93794c21366J12179r4486A48557A1832b84379D2420k0666
$$ 324262 -60316 193794 -321366 -209187 -303673 148557 11832 -284379 42420 21754
11218B1754d2657F4694b7443A50480M1993o3655c48698B69649J22859a98915R6457
$$ 21754 -42657 64694 -27443 150480 192473 128818 -348698 269649 392508 -198915 -102458
11207a02458m3545G3071K10337e8160j68599d4702G6824h1304l10383A95421E5046
$$ -102458 -146003 73071 283408 -58160 -226759 -44702 76824 -81304 -391687 195421 55046
11195i4229I1834d8314j55783N3870j9287g4598l3111r1662A03399b45947B47648
$$ -94229 91834 -48314 -204097 -150227 -169514 -74598 -107709 -199371 103399 -245947 247648
11183f5632k77824a11282p9034h3510b3325j37545B13353a94911E248b62686N1061
$$ -65632 -343456 -111282 -190316 -83510 -23325 -160870 213353 -194911 5248 -262686 -211625
11172b11625a02290B21358a44355j03853E6258e5569F5604l0483L5490B1517d27121
$$ -211625 -102290 221358 -144355 -248208 56258 -55569 65604 35121 70611 21517 -427121
11160A83222h9152j51661d3860q4518B8439J19212e5423l3204L942k8011C6758
$$ 183222 -89152 -240813 -43860 -128378 28439 147651 -55423 -88627 -84685 -112696 36758
11148b81284a5034C7043J97779b67405j61125A34011a73406F4848k9657M25931
$$ -281284 -15034 37043 234822 -267405 -428530 134011 -173406 64848 35191 461122
11138D61122a9896k5272B28361N8095f4032A81916c0051C26063a51873N3234m4618
$$ 461122 -19896 -45168 228361 286456 -64032 181916 -30051 326063 -151873 -98639 -143257
11127a43257h605o1607b0302D0608K32092j01786a42478a5094B63667a68744B66704
$$ -143257 -8605 -70212 -20302 40608 272700 170914 -142478 -15094 263667 -168744 266704
11115e3908j28910K3752f8211F479a62711a8322j63499A45773l8595b09824R7909
$$ -53908 -182818 -159066 -68211 6479 -162711 -18322 -181821 145773 107178 -209824 -111915
11104a11915C3505k192J88592p5255M1687e40630I3155P4520i231D5291e8100
$$ -111915 33505 31313 219905 144650 186337 -540630 93155 167675 -9231 45291 -58100
11092E08367E2660J87621m532D3609b1613A0075A017O0587K3686J1481H0Q3051
$$ 508367 52660 240281 235749 43609 -21613 10075 1017 61604 85290 96771 80 83131
11080H3131K89868a86668B62881j21757L44733A76307M0512A06381J30623n8287
$$ 83131 372999 -186668 262881 141124 485857 176307 216819 106381 237004 178717
11070A78717h666D27920A04028K17371O8164j18547M116J7252N8039k1518E0925
$$ 178717 -8666 427920 104028 321399 389563 271016 275132 292384 350423 328905 50925
11058B85626K9198A45129N19845C31521p6136L8458j18316K37041j52696k1179
$$ 285626 314824 145129 664974 331521 255385 293843 175527 412568 259872 238693
11048B38693K36181O8941R4609j66074B18839R0029m598j07912N68724C02765
$$ 238693 474874 543815 638424 472350 218839 308868 304270 196358 765082 302765
11037C88476M7149k272q9773J93586O5184p8428J29547k60114j26140L16105r9305
$$ 388476 435625 433353 343580 537166 602350 523922 653469 393355 267215 583320 484015
11026D84015F4499N07131A73264K84840J2687j41947K7671j16847J46161q9777
$$ 484015 64499 571630 173264 458104 470791 328844 356515 239668 385829 296052
11016B96052n7064K00155J08438L9943j0813k76483j03091R5310J94193B31831
$$ 296052 238988 439143 547581 587524 576711 300228 197137 292447 486640 231831
11005B42901p4305M8818c006A52117L50737G5615K68743j55251J79013M5725A19080
$$ 242901 168596 217414 -3006 152117 502854 75615 344358 189107 368120 413845 119080
10993D93270l2855j04926j38322p542K05014p9104J84162j72224O2428M5609J79808
$$ 493270 460415 355489 217167 209625 414639 335535 519697 347473 409901 455510 635318
10982F35318J01200J0765l52956J78616k04052L23488J74670K02678k40790K20327
$$ 635318 736518 747283 394327 572943 368891 692379 867049 1069727 828937 1049264
10972A049264K42132q8747L1052K90076J11162l39738J58722M21183m76950l1194
$$ 1049264 1291396 1202649 1233701 1523777 1634939 1295201 1453923 1875106 1398156 1366962
10962A366962o6615m9758n5091j64054J85601n0962l15215K41913J09798j14752
$$ 1366962 1300347 1250589 1195498 1031444 1217045 1166083 850868 1092781 1202579 1087827
10952A087827O7849j48677k43278K83553k96092j34848k15862O3963N2132J41182
$$ 1087827 1155676 1006999 763721 1047274 751182 616334 400472 464435 516567 657749
10942F57749j64330a02809A55662K6524b63018A75582C5115O2705J49748j03576
$$ 657749 493419 -102809 155662 182186 -263018 175582 35115 97820 247568 143992
10932A43992J25073r5351r442e1205H7956P050N5043a99312A25304j0269c391
$$ 143992 269065 173714 164272 -51205 87956 95006 150049 -199312 125304 115035 -3391
10920A22692b30914g0244G292g7309j6525a0097j33718N054e6265N897m8852k19205
$$ 122692 -230914 -70244 7292 -77309 -93834 -10097 -143815 -138761 -56265 -50368 -99220 -318425
10908c18425B4726J4891d19078J85048A72059i5899C980e5019o460D6658a51991
$$ -318425 24726 39617 -419078 -234030 172059 -95899 3980 -55019 -61479 46658 -151991
10896c46234d82k59718A43603B465a06391J386e1159A00028d9306r7867k51537
$$ -346234 -482 -260200 143603 2465 -106391 -105005 -51159 100028 -49306 -147173 -398710
10885c98710h8873k40141f5494F8443c691A69381B5456f78l3030j20336O6364
$$ -398710 -88873 -329014 -65494 68443 -3691 169381 25456 -678 -33708 -154044 -87680
10874h7680D49444E1983a44968n8110d3025k41069i7322G1671b07427R1491A05512
$$ -87680 449444 51983 -144968 -203078 -43025 -284094 -97322 71671 -207427 -115936 105512
10862A41247J9872D8473h946q7373A1575O4105d5888g254q8850k89953A64618
$$ 141247 161119 48473 -8946 -96319 11575 75680 -45888 -7254 -96104 -386057 164618
10850A49247a03560F1457k769R4028a40096r2925I6529O14f9926p5945I0388a36024
$$ 149247 -103560 61457 58688 152716 -140096 -233021 96529 97143 -69926 -145871 90388 -136024
10837A40735r132d2479B0036a23966a1692l2566k0163A78901e7829E459J23194
$$ 140735 131603 -42479 20036 -123966 -11692 -44258 -64421 178901 -57829 5459 128653
10826A28653N5269g1604k41106A95054a39798I5564a23920B52590a27969A55313
$$ 128653 183922 -71604 -312710 195054 -139798 95564 -123920 252590 -127969 155313
10815a44290A22021a57485g953l9930q4408D6976e2k80462f3506A11581c03689
$$ -144290 122021 -157485 -7953 -47883 -132291 46976 -52 -280514 -63506 111581 -303689
10803C00a72405E1927b75963C05434e6350A28847b8746j78772c3822B2227g0517
$$ 300 -172405 51927 -275963 305434 -56350 128847 -28746 -207518 -33822 22227 -70517
10791A68035e3531k19051g699G3705a7711m9373j07967M6799H521K0108a19744
$$ 168035 -53531 -272582 -7699 73705 -17711 -67084 -175051 -128252 8521 28629 -119744
10779a87346j18354J25103J2268e4653C67613B3434b01668B0785e3930j94587
$$ -187346 -305700 -180597 -168329 -54653 367613 23434 -201668 20785 -53930 -248517
10769b48517J20051D5282a5836j77960A0174b93240A68062f450k16685J10341
$$ -248517 -128466 45282 -15836 -193796 10174 -293240 168062 -6450 -223135 -112794
10759a12794I2165g669m80l6252o6152A22627K03625b76356A63813a78231J8582
$$ -112794 92165 -7669 -8149 -44401 -110553 122627 326252 -276356 163813 -178231 -159649
10748a59649A15737k5063b27810B4625a88193k35010C2449a55703N89d6410F2423
$$ -159649 115737 90674 -227810 24625 -188193 -423203 32449 -155703 -155114 -46410 62423
10736h2365H4223a77796B72959a19752m8954G1700J09513a89354B13578j03704
$$ -82365 84223 -177796 272959 -119752 -168706 71700 181213 -189354 213578 109874
10726A09874n2292B6176N0491a97742A44412a85724l51904A51119f1905j97246
$$ 109874 57582 26176 76667 -197742 144412 -185724 -537628 151119 -61905 -259151
10716b59151n2498f1112k39127B0938P925J8039J59932O3364j03624a21431r1104
$$ -259151 -311649 -61112 -300239 20938 28863 46902 206834 270198 166574 -121431 -212535
10705b12535E291e7929j33600O0947A76172P134O0895K1607l1943a17249d3143
$$ -212535 5291 -57929 -191529 -130582 176172 183306 244201 265808 233865 -117249 -43143
10693I5136J70827b06940e0824j713l20764e306F4482a82842A98265a94499B7972
$$ 95136 265963 -206940 -50824 -52537 -373301 -5306 64482 -182842 198265 -194499 27972
10681H2490b99925j19383e3440C44115g9801G4903b91852a10115j62142B18501
$$ 82490 -299925 -419308 -53440 344115 -79801 74903 -291852 -110115 -272257 218501
10670c9153B40571A10281k854d20913J48921P8016F1724i8511l21738J94297H0760
$$ -39153 240571 110281 107427 -420913 -271992 -193976 61724 -98511 -420249 -225952 80760
10658e20554i0818H0618O6216O0508p6112b61025A22875B2165J60050a52021A71602
$$ -520554 -90818 80618 146834 207342 131230 -261025 122875 22165 182215 -152021 171602
10646b79290I8352d8122j40897A5255b08307A90179d2993j29870O1576A06246
$$ -279290 98352 -48122 -189019 15255 -208307 190179 -42993 -172863 -111287 106246
10635A37093F3647f8963k19385I2903e9811m1009B24395D949f1294p3611A8122
$$ 137093 63647 -68963 -288348 92903 -59811 -100820 224395 4949 -61294 -134905 18122
10623d7464k38690J532B66449B3391b613I7822h7438j5844A30345g1530B9104
$$ -47464 -286154 -284622 266449 23391 -2613 97822 -87438 -103282 130345 -71530 29104
10611F9355c1207C25574q0422b28941L6995m4930B88275a65989k69301a05992
$$ 69355 -31207 325574 245152 -228941 -191946 -236876 288275 -165989 -435290 -105992
10600B22498k2271a12806k30215J06160i0465j84227a5444C78894a97691N194
$$ 222498 200227 -112806 -343021 -236861 -90465 -274692 -15444 378894 -197691 -192497
10590a92497d908H0803b34543i0977C7823F017a06722j65116Q1213g4412n8005
$$ -192497 -4908 80803 -234543 -90977 37823 6017 -106722 -271838 -190625 -74412 -132417
10579a32417C3580a38233a9529j13058B0535M0828R639a4487k5079g82l03463
$$ -132417 33580 -138233 -19529 -132587 20535 61363 71002 -14487 -39566 -782 -304245
10568c04245a10590d4322D5123J8907L7170L512a89692k72760i7718k76090a00575
$$ -304245 -110590 -44322 45123 64030 101200 104712 -189692 -462452 -97718 -373808 -100575
10556b48844L3664J02132L5657r8561A51023a77971l31670a03420B0845a70852
$$ -248844 -215180 -113048 -77391 -175952 151023 -177971 -509641 -103420 20845 -170852
10545a95391A49389a45951A23846a99407C6031L6750b29663A715a74032N2353
$$ -195391 149389 -145951 123846 -199407 36031 72781 -229663 1715 -174032 -121679
10535a21679K1854C6645O9073K8932c0428A58514j3383a29488N8280m5700j32213
$$ -121679 -99825 36645 105718 134650 -30428 158514 145131 -129488 -71208 -116908 -249121
10524b49121p5554K8516A85633c11712m7109d5861A06800d21924A01815J03228
$$ -249121 -324675 -296159 185633 -311712 -358821 -45861 106800 -421924 101815 205043
10514B05043a61114B34245h2974j47932k202C8631N3876J20838d7290A12606J3279
$$ 205043 -161114 234245 -82974 -230906 -233108 38631 92507 213345 -47290 112606 125885
10503A25885k0216a98808C09822a43950D64332A73341a76582m849A62171g53B5272
$$ 125885 105669 -198808 309822 -143950 464332 173341 -176582 -181431 162171 -753 25272
10491A95997p7937O7988e6652A8049b14333J4644j09230D2845i9346a7846B3930
$$ 195997 118060 186048 -56652 18049 -214333 -199689 -308919 42845 -99346 -17846 23930
10479A45042D6190J99577m7134c2066B90144D3285J18603b65051A51732Q4594
$$ 145042 46190 245767 198633 -32066 290144 43285 161888 -265051 151732 236326
10469B36326j9121h4379A28262e3612q6791c4148j0141o2859C1117a97920c9307
$$ 236326 217205 -84379 128262 -53612 -140403 -34148 -44289 -107148 31117 -197920 -39307
10457b34437E3392i6894C43037e2412J2811k7951o5308A185P9589B2218R5224
$$ -234437 53392 -96894 343037 -52412 -39601 -67552 -132860 1185 80774 22218 117442
10446A17442i2387l8315C6319e883l7616k32361F5528a27397E1552n501g2069
$$ 117442 -92387 -130702 36319 -5883 -43499 -275860 65528 -127397 51552 46051 -72069
10434f8951A7192c04463c5737k2097m0989n7005a6911j91110i2594A62419I690
$$ -68951 17192 -304463 -35737 -57834 -98823 -155828 -16911 -208021 -92594 162419 9690
10422H0535a82945k02004B75767A07711L2661d7746k14342B3866L4668b01253
$$ 80535 -182945 -384949 275767 107711 140372 -47746 -262088 23866 58534 -201253
10411d9531m3671o9986B95438F08f6309q7907A92014b36672C371M724R0986O5599
$$ -49531 -93202 -163188 295438 608 -66309 -154216 192014 -236672 3371 8095 99081 164680
10399A64680A9991a9638A33455J67581E8797h15j61571k4192F2171K53818C9461
$$ 164680 19991 -19638 133455 301036 58797 -815 -162386 -186578 62171 315989 39461
10387F4014Q0337B0909e130B71613a82784A54211b05705f9105B00416b18169F1793
$$ 64014 144351 20909 -5130 271613 -182784 154211 -205705 -69105 200416 -218169 61793
10375c7804A04084a50194B00159I5861Q2652p5887J66642f2331A16788J86244
$$ -37804 104084 -150194 200159 95861 178513 102626 269268 -62331 116788 303032
10365C03032B3415J67634n0952K50162j52149j720r1781A2449L43742G7938J27236
$$ 303032 23415 191049 140097 390259 238110 236390 144609 12449 356191 77938 205174
10354B05174c3336A54621d7565B895K57306A29290J72737a1258k18955C06534
$$ 205174 -33336 154621 -47565 2895 260201 129290 302027 -11258 -230213 306534
10343A01750K07097a61033g9635C92368A92714J03868J3061J50701j74083A37935
$$ 101750 308847 -161033 -79635 392368 192714 296582 309643 460344 286261 137935
10332B99167J47089a53854K8334C31148A11202a03429A19732f7846j70333b222
$$ 299167 446256 -153854 -125520 331148 111202 -103429 119732 -67846 -238179 -2222
10321a97461I2695P8955p7153d0876A63204a900j05056B82778j12349M0962a11392
$$ -197461 92695 171650 94497 -40876 163204 -1900 -106956 282778 170429 211391 -111392
10309b1741E7116e5698f634C4305c60222B77209f7123A83330C4321J38401c89585
$$ -21741 57116 -55698 -6634 34305 -360222 277209 -67123 183330 34321 172722 -389585
10297a55262B08388F6326R0481f3577n0646c8272C60527c26705a19331m4755L0484
$$ -155262 208388 66326 156807 -63577 -114223 -38272 360527 -326705 -119331 -164086 -133602
10286a33602B14985a01810A04859a76276b2323k21537J18537r7325b0404k71665
$$ -133602 214985 -101810 104859 -176276 -22323 -243860 -125323 -222648 -20404 -292069
10276b92069l1674F2074a16727j05291j11787B8728R577N4600J17442o2641J9971
$$ -292069 -323743 62074 -116727 -222018 -333805 28728 38305 92905 210347 147706 167677
10265A67677e7981B86674c7402j44579E2330J10765F4055K01191O497c1128A21507
$$ 167677 -57981 286674 -37402 -181981 52330 163095 64055 265246 271743 -31128 121507
10253B42018A09522i5025A25018P352a63230n2458c3771B2482A0548R2450C9280
$$ 242018 109522 -95025 125018 132370 -163230 -215688 -33771 22482 10548 102998 39280
10241g6848r3542K3271P602A79213a55823A69790H3998J31200E6475b1497j95598
$$ -76848 -170390 -147119 -139517 179213 -155823 169790 83998 215198 56475 -21497 -217095
10230b17095h5705k25306A518a83810b5199j18233B29370f3677B52142i2267G2552
$$ -217095 -85705 -311011 1518 -183810 -25199 -143432 229370 -63677 252142 -92267 72552
10218b73599h352j4475D44d21912a6404B10185b29965L4061R800f3573I7188K60036
$$ -273599 -8352 -22827 444 -421912 -16404 210185 -229965 -195904 -186104 -63573 97188 357224
10206C57224H9655h0204j59191J01651E0236K1672N8951a48038j27725P6492e2065
$$ 357224 89655 -80204 -239395 -137744 50236 71908 130859 -148038 -275763 -199271 -52065
10194a47984L969A21416K6758C5756e588A2194a2480D3420b31909F57J0911e32007
$$ -147984 -144015 121416 148174 35756 -5588 12194 -12480 43420 -231909 657 11568 -532007
10181I8509a40003j19245j79080f0301n879o8766O6800K2727j87040R1834q5840
$$ 98509 -140003 -259248 -438328 -60301 -66180 -134946 -68146 -45419 -232459 -140625 -226465
10170b26465b5213E9121a62095o0775G05b36762J13974l184j89714e4573l1662
$$ -226465 -25213 59121 -162095 -222870 705 -236762 -122788 -125972 -315686 -54573 -86235
10159h6235k07270i5345C9664J10572a19555j02409k68572c1372N954A66204b06913
$$ -86235 -293505 -95345 39664 150236 -119555 -221964 -490536 -31372 -25418 166204 -206913
10147I2773e2010k48568Ba49766b2492m17655J66413k5636K2373a5585C8841K1780
$$ 92773 -52010 -300578 2 -149766 -22492 -440147 -273734 -299370 -276997 -15585 38841 60621
10135F0621e368A0243a66273b2124O249C199M3198h4193m1826B0575J7914c58515
$$ 60621 -5368 10243 -166273 -22124 -15875 3199 46397 -84193 -126019 20575 38489 -358515
10122E6946f8969B2145d550I489K12916I7511B5559L41462j06352a19467m4569
$$ 56946 -68969 22145 -4550 9489 222405 97511 25559 367021 260669 -119467 -164036
10111a64036A40367J2016D4707k1593c14927F0018P211D379c28730a47302l61751
$$ -164036 140367 152383 44707 23114 -314927 60018 67229 4379 -328730 -147302 -509053
10100e09053B81843F6206b05945q0762a1848l3847N130A25090a95833j36505J02448
$$ -509053 281843 66206 -205945 -286707 -11848 -45695 -40565 125090 -195833 -332338 -229890
10089b29890b689j66088N7107r1378B74443q9246b68167R131h5233a29B55871
$$ -229890 -2689 -168777 -111670 -203048 274443 185197 -268167 -259036 -85233 -129 255871
10077a94308A12140B9770J31011a90299r0351d5216l02305A20554a82855L6878
$$ -194308 112140 29770 160781 -190299 -280650 -45216 -347521 120554 -182855 -145977
10067a45977A44154d07160B13986M7941A24560A6016a6568j99146I9165j7016
$$ -145977 144154 -407160 213986 261927 124560 16016 -16568 -215714 99165 82149
10057H2149d1546k398k91465e0099l18259m1900c2454F3550a91501B71868a21411
$$ 82149 -41546 -43944 -335409 -50099 -368358 -410258 -32454 63550 -191501 271868 -121411
10045a68885d9091n7294A73460G5649J1403b28715J02237f9k66296h5167B17794
$$ -168885 -49091 -106385 173460 75649 87052 -228715 -126478 -69 -266365 -85167 217794
10033a24981q0161B22292j04699a13298a3732C08K12340b50731K6172N1421M1829
$$ -124981 -205142 222292 117593 -113298 -13732 308 212648 -250731 -224559 -173138 -131309
10022a31309j67254A30011c5375A94935a00796B93332c6365C05283A8807c82260
$$ -131309 -298563 130011 -35375 194935 -100796 293332 -36365 305283 18807 -382260
10011a48951m9880K1284B505b62518D3605P2583b44679B7343a65859b7893j30421
$$ -148951 -198831 -177547 2505 -262518 43605 116188 -244679 27343 -165859 -27893 -158314
10000a58314M4180I9411M100R8921a38067j60948H6642a47319j41063M8755A33663
$$ -158314 -114134 99411 103511 202432 -138067 -299015 86642 -147319 -288382 -239627 133663
9988A84013J21211a85417A72688a79220j17496g6396B07348o9480h1437l23545
$$ 184013 305224 -185417 172688 -179220 -296716 -76396 207348 137868 -81437 -404982
9978d04982C3965a04090A63885A5138a0457F2440b67191b764o4782m6971N0728
$$ -404982 33965 -104090 163885 15138 -10457 62440 -267191 -2764 -67546 -114517 -63789
9967f3789C02359i1384k22949B63657a29756o17j10653O2994N4339j28701m8138
$$ -63789 302359 -91384 -314333 263657 -129756 -130373 -241026 -178032 -123693 -252394 -300532
9956c00532n43B34878a90324A23495J42482b6385k06k27553A60622a71523F0802
$$ -300532 -301075 234878 -190324 123495 265977 -26385 -26591 -254144 160622 -171523 60802
9944e4884l06298g4663p4697r4241g4137j81464Q8986M4450j43046g9324n0922
$$ -54884 -361182 -74663 -149360 -243601 -74137 -255601 -166615 -122165 -265211 -79324 -130246
9933a30246C62787e2844j75470E370K7176K28344f2188b6473j2572A20655F0192
$$ -130246 362787 -52844 -228314 5370 32546 260890 -62188 -26473 -39045 120655 60192
9921d35781E3965i3151k01900J10030n8674g6932a8416E3088P4743l2846L562
$$ -435781 53965 -93151 -295051 -185021 -243695 -76932 -18416 53088 127831 94985 98547
9910I8547a41273A57004a94287D0536c59548b761j64891d2908B87819a965A78533
$$ 98547 -141273 157004 -194287 40536 -359548 -2761 -167652 -42908 287819 -1965 178533
9898g655C19491C619a24156A86821o8722K5266a73314B26184I0911J2125R9721
$$ -7655 319491 3619 -124156 186821 118099 143365 -173314 226184 90911 103036 202757
9887B02757b03084K7133j62800J1239Q8733j8481A87518e5294k18176a5808j38914
$$ 202757 -203084 -175951 -338751 -327512 -238779 -257260 187518 -55294 -273470 -15808 -154722
9876a54722k10010R9896K9739f2516F1560g8703l37866A79996c50759c4488j68002
$$ -154722 -364732 -264836 -235097 -62516 61560 -78703 -416569 179996 -350759 -34488 -202490
9865b02490Q924D8937j9262O8565c4246m079k20298j66207e389m182H8491K23285
$$ -202490 -193566 48937 29675 98240 -34246 -38325 -258623 -424830 -5389 -9571 88491 311776
9853C11776C5513f63166b73709C25918A48079g0137j59839j74051J56342E9280
$$ 311776 35513 -663166 -273709 325918 148079 -70137 -229976 -404027 -247685 59280
9842b07976N9031j01509A87302m068j9388p2668b41438f9020q732r8579A49049
$$ -207976 -148945 -250454 187302 183234 163846 91178 -241438 -69020 -77752 -176331 149049
9830C9706a13905B18032D7272j4052h2914j79691F7537h7813D3329a73489A3849
$$ 39706 -113905 218032 47272 33220 -82914 -262605 67537 -87813 43329 -173489 13849
9818a75509K0727L2391A6414g00979A68205B8230N5581e5242A3461a6357k74424
$$ -175509 -154782 -122391 16414 -700979 168205 28230 83811 -55242 13461 -16357 -290781
9807b90781n2296J0024F4860a62144A2110K94a26947j93927A60066f6328I5339
$$ -290781 -343077 -333053 64860 -162144 12110 12404 -126947 -320874 160066 -66328 95339
9795c9906k7898J5583k95100A94426N2128c62872H954d80057H5541c63861H1269
$$ -39906 -67804 -52221 -347321 194426 246554 -362872 8954 -480057 85541 -363861 81269
9783e2900F7468e4980k61446d7031j20822Q3632B10553a99703h818m7596A8806
$$ -52900 67468 -54980 -316426 -47031 -167853 -84221 210553 -199703 -8818 -56414 18806
9771A6221K98764a63134d4832j24606K3626b3673A34450b22186B07157r1034c7253
$$ 16221 314985 -163134 -44832 -169438 -145812 -23673 134450 -222186 207157 116123 -37253
9759B1854b8290j90494L2129e9613K2093n8505A35673g8650q8957m7542j80619
$$ 21854 -28290 -218784 -186655 -59613 -37520 -96025 135673 -78650 -167607 -215149 -395768
9748c95768B01218b17497n3659O6240B6698N2098b27622j6980J08871L3439f138
$$ -395768 201218 -217497 -271156 -204916 26698 78796 -227622 -244602 -135731 -102292 -6138
9736d3692k07812A20978l9742c12581O4373B3749R1044m9533a58806c7139G5856
$$ -43692 -251504 120978 81236 -312581 -248208 23749 114793 65260 -158806 -37139 75856
9724b2904E857b24712B71455a93252b3443A57465a08906A70615a70659p1391b1359
$$ -22904 5857 -224712 271455 -193252 -23443 157465 -108906 170615 -170659 -242050 -21359
9712g0243A29032b34808B06803c9842G7148k9402c7285B77264b09114A53934h3276
$$ -70243 129032 -234808 206803 -39842 77148 47746 -37285 277264 -209114 153934 -83276
9700b33372A82484F473b82287G1997b48690B51908A21170K35411j68574a73368
$$ -233372 182484 6473 -282287 71997 -248690 251908 121170 356581 188007 -173368
9689H6278h8616A23339J25427g9908o7780K0079j26908e1330b338k60591A85784
$$ 86278 -88616 123339 248766 -79908 -147688 -127609 -254517 -51330 -2338 -262929 185784
9677b5492F5069a62165j13960C5308c09036A98111a45781I4901H149h9798K1037
$$ -25492 65069 -162165 -276125 35308 -309036 198111 -145781 94901 8149 -89798 -68761
9666f8761j74892a670C20349e0765i426r8109C1233j1889M58372a9571b977k74092
$$ -68761 -243653 -1670 320349 -50765 -9426 -107535 31233 19344 477716 -19571 -2977 -277069
9654b77069N6653D9637h0247n3334A63303D8956e5349k99144F637a20053A02627
$$ -277069 -220416 49637 -80247 -133581 163303 48956 -55349 -354493 6637 -120053 102627
9642F5932c0660j54306q145O3010B74772d11838a39416n5187F6537a77650j7001
$$ 65932 -30660 -184966 -193111 -130101 274772 -411838 -139416 -194603 66537 -177650 -194651
9631a94651O1506A44542g1964J1683B9391J87009G5572a60986N3043m42837B02674
$$ -194651 -133145 144542 -71964 -60281 29391 216400 75572 -160986 -107943 -550780 202674
9619i972o9463A27034j4125a25272k9963r2723n9222A21133b6565A0998b53777
$$ -9972 -79435 127034 112909 -125272 -155235 -247958 -307180 121133 -26565 10998 -253777
9607e1772m84E17b02012f9687L0133k21633J28906r3043o2721G3470N0103L12649
$$ -51772 -52256 517 -202012 -69687 -39554 -261187 -132281 -225324 -288045 73470 123573 436222
9595D36222a91897A13687a71846F920K6310b25836b3734j67665A6466b057j12639
$$ 436222 -191897 113687 -171846 6920 33230 -225836 -23734 -191399 16466 -2057 -114696
9584a14696B72439g2740j0210A4408b66562h7325C9384a9491l98436a74219H1434
$$ -114696 272439 -72740 -82950 14408 -266562 -87325 39384 -19491 -417927 -174219 81434
9572H0378a01022A41726g5645a679r8420k09144g4683a1823j86343l9221R9889
$$ 80378 -101022 141726 -75645 -1679 -100099 -309243 -74683 -11823 -198166 -237387 -137498
9561a37498j52243r9641l7433A90786p9351i1221j72896f4412A61059i7392G8706
$$ -137498 -289741 -389382 -426815 190786 111435 -91221 -264117 -64412 161059 -97392 78706
9549a7694l18608J39271E1763B5580i701m5116n08A05314e6130D279N9549a28150
$$ -17694 -336302 -197031 51763 25580 -9701 -54817 -55325 105314 -56130 4279 63828 -128150
9536b46466P4467I9251e0502l7089A17543A6519a58344O4209j9374a861k29472
$$ -246466 -171999 99251 -50502 -87591 117543 16519 -158344 -94135 -113509 -1861 -231333
9525b31333j57851D3569M17270G1031G764J20608a73615A96003e4114c498o5735
$$ -231333 -389184 43569 460839 71031 7764 128372 -173615 196003 -54114 -3498 -69233
9514f9233B2357a00543n8225F7104j6081R4164J2924a25218C40007k8760a91142
$$ -69233 22357 -100543 -158768 67104 51023 145187 158111 -125218 340007 311247 -191142
9502d971B97612E7215a74501D8558b59450A68116m789e1125q5922a0092m769j281
$$ -4971 297612 57215 -174501 48558 -259450 168116 163327 -51125 -137047 -10092 -14861 -16142
9490a6142k2026A2514a58473N1249j43665a14004n4535b1254j08670F8545c37472
$$ -16142 -38168 12514 -158473 -107224 -250889 -114004 -168539 -21254 -129924 68545 -337472
9478E4956a87324b0939j43278d1869k39402B23448a50724b6100j67153h8585A76957
$$ 54956 -187324 -20939 -164217 -41869 -281271 223448 -150724 -26100 -193253 -88585 176957
9466c1036D6090J1180c41792j18496D7912b42741l9783N3091A85027J20902b53170
$$ -31036 46090 57270 -341792 -460288 47912 -242741 -282524 -229433 185027 305929 -253170
9454h3583L3175j20507j71052G4492e056C8407P831a09768b4810g753B03274b5676
$$ -83583 -50408 -170915 -341967 74492 -5056 38407 46238 -109768 -24810 -7753 203274 -25676
9441a98736B6600a11229K260N3693A71130G2455k7062a64060o1664G751a42415
$$ -198736 26600 -111229 -108969 -55276 171130 72455 45393 -164060 -225724 7751 -142415
9429D4964a26706l57295B41788a67603j00532a7083m8615B02588A2445J61975
$$ 44964 -126706 -484001 241788 -167603 -268135 -17083 -65698 202588 12445 174420
9419A74420p2263a18745A06484b40282G4808c22175F8064a23742Q251J1098j94792
$$ 174420 102157 -118745 106484 -240282 74808 -322175 68064 -123742 -115491 -104393 -299185
9408b99185A01952Q2993c32945J08268k8810Q0384j84005b0284C15022q2559a69251
$$ -299185 101952 184945 -332945 -224677 -253487 -173103 -357108 -20284 315022 232463 -169251
9396C36047b6246n0515b4539q5620b8883I4886b50840F068d81564J45904e1860
$$ 336047 -26246 -76761 -24539 -110159 -28883 94886 -250840 6068 -481564 -335660 -51860
9384a19912B89091D0065Q4967b36114j09346E5M2774d197A1880a16297l77454
$$ -119912 289091 40065 125032 -236114 -345460 55 42829 -4197 11880 -116297 -493751
9373d93751F6652a63657a8519j08314B97606a94664C25690g9293l05450A89963
$$ -493751 66652 -163657 -18519 -126833 297606 -194664 325690 -79293 -384743 189963
9362b88836F1933P7127a39709D2834e9812j75505h209k49667C613d2620l34827
$$ -288836 61933 139060 -139709 42834 -59812 -235317 -8209 -257876 3613 -42620 -377447
9351c77447A16513J93538a82188A69015f507j01238B01758b13672L0685M3046
$$ -377447 116513 310051 -182188 169015 -6507 -107745 201758 -213672 -182987 -139941
9341a39941l53167B5924a33919I3536a00687j01935f1796j50065g792G6355J10786
$$ -139941 -493108 25924 -133919 93536 -100687 -202622 -61796 -211861 -7792 76355 187141
9330A87141c1984A69597i761B1181K63687e5403G762M9567K8947J24174E6774
$$ 187141 -31984 169597 -9761 21181 284868 -55403 7762 57329 86276 210450 56774
9318a37459J1715d675G8020M1051l1911d0615j12576n8217P7686A34828c3776
$$ -137459 -125744 -4675 78020 119071 87160 -40615 -153191 -211408 -133722 134828 -33776
9306b14494K0923e5633r2262G5559J9811b17080a08112k44750b1430m0970k75397
$$ -214494 -193571 -55633 -147895 75559 95370 -217080 -108112 -352862 -21430 -62400 -337797
9295c37797J59476A87808b9295B99778d65701a54666D6670d4894o2744d043q1414
$$ -337797 -178321 187808 -29295 299778 -465701 -154666 46670 -44894 -107638 -4043 -85457
9284h5457r86D5596O4740a12359A91925A2243J60032h910H980b33166A28184a81364
$$ -85457 -86443 45596 110336 -112359 191925 12243 172275 -8910 8980 -233166 128184 -181364
9271b7067l64830B61986b96029d172j76148d735m68032I7246m6645c5884j38336
$$ -27067 -391897 261986 -296029 -4172 -180320 -4735 -472767 97246 50601 -35884 -174220
9260a74220r4272C09605b48665f8839p9393r8564A05971a56491j4051k1543b9534
$$ -174220 -268492 309605 -248665 -68839 -148232 -246796 105971 -156491 -170542 -192085 -29534
9248b43639a791A59154c0765E6290E313K40837c2744A56451h4055j71830M9195
$$ -243639 -1791 159154 -30765 56290 5313 246150 -32744 156451 -84055 -255885 -206690
9237b06690M1028M6001I1616b50241K8113N4750A47710a7550k76379A76595c00457
$$ -206690 -165662 -119661 91616 -250241 -222128 -167378 147710 -17550 -293929 176595 -300457
9225B99825b19740A81053A4224b36356I4446c05126N3731e9364b7723A54129Q3411
$$ 299825 -219740 181053 14224 -236356 94446 -305126 -251395 -59364 -27723 154129 237540
9214B37540a25244d493p3120o9336C36335d781C03680B7219J40148d63593d3811
$$ 237540 -125244 -4493 -77613 -146949 336335 -4781 303680 27219 167367 -463593 -43811
9202A55844F3359i5745j39716B53185o7441a75454O0111a4621c608j31027j92477
$$ 155844 63359 -95745 -235461 253185 185744 -175454 -115343 -14621 -3608 -134635 -327112
9191c27112a60534B155b11176N6285m1313A33176d5536C1095a53054K1367j88305
$$ -327112 -160534 2155 -211176 -154891 -196204 133176 -45536 31095 -153054 -131687 -319992
9180c19992n4871J71061E6734a64070A02572J60360o6844g6086k5576L4921j8154
$$ -319992 -374863 -203802 56734 -164070 102572 262932 196088 -76086 -101662 -66741 -84895
9169h4895o8339D18744j10232f8851k07328e5080p0678e324q404k822m2916m9782
$$ -84895 -153234 418744 308512 -68851 -276179 -55080 -125758 -5324 -13728 -16550 -59466 -109248
9157a09248J8459A6024c9362j63973R7604b2002r9677C911K6668a17694A1182
$$ -109248 -90789 16024 -39362 -203335 -105731 -22002 -121679 3911 30579 -117694 11182
9145d6183J4660C9127b90828a07874k39562i6514A85477A3917c40479J63131L9233
$$ -46183 -31523 39127 -290828 -107874 -347436 -96514 185477 13917 -340479 -177348 -138115
9134a38115a5463j27135B52662I7877b47681A14413a95373e0320d8B677K52476
$$ -138115 -15463 -142598 252662 97877 -247681 114413 -195373 -50320 -48 2677 255153
9123B55153Q8753C5839K89835a32495d2386n7885l94192D2370a45162p5847e623
$$ 255153 343906 35839 325674 -132495 -42386 -100271 -494463 42370 -145162 -221009 -5623
9111D3271c9347A9220f3568b6169j33171p730D5994J15080N7868b60611L2343
$$ 43271 -39347 19220 -63568 -26169 -159340 -167070 45994 161074 218942 -260611 -228268
9100b28268h3067k13879Q5622h2878A85933a44490g0757A98573c9433J0869p1163
$$ -228268 -83067 -296946 -211324 -82878 185933 -144490 -70757 198573 -39433 -28564 -99727
9089i9727b7041B1730a40658o455C4082a75485A45046J51631C0098c3222j66528
$$ -99727 -27041 21730 -140658 -147113 34082 -175485 145046 296677 30098 -33222 -199750
9078a99750C4705A5281P6985a51049A22683E6168a5503I2892d5251B864d3218
$$ -199750 34705 15281 92266 -151049 122683 56168 -15503 92892 -45251 2864 -43218
9066D9603a62364B6291b49525b5325l09972A36492i5085H7124d12177a09573b7090
$$ 49603 -162364 26291 -249525 -25325 -335297 136492 -95085 87124 -412177 -109573 -27090
9054A3065b80215A0719a76486K7237j29930r7945f0838j32735A29128M3675i3637
$$ 13065 -280215 10719 -176486 -149249 -279179 -377124 -60838 -193573 129128 172803 -93637
9042h5801J5775j03706M2161e6109n9653p4735b3557H7999J01737c6850l77213
$$ -85801 -70026 -173732 -131571 -56109 -115762 -190497 -23557 87999 189736 -36850 -414063
9031d14063A50962g1068o5737e456l0432E8104J07250c31510E5571b02908A935
$$ -414063 150962 -71068 -136805 -5456 -35888 58104 165354 -331510 55571 -202908 1935
9019A56824b95720J35365d8883j40469Q8373B15864J03089j39787R160f5741k30079
$$ 156824 -295720 -160355 -48883 -189352 -100979 215864 318953 179166 188326 -65741 -295820
9008b95820A03847a08499A95658b24726C7791K39216f2369D5283b57506A39415
$$ -295820 103847 -108499 195658 -224726 37791 277007 -62369 45283 -257506 139415
8997A63938R705J32298A28675A4227M7173a47192O872B29100h6162l5717A03643
$$ 163938 173643 305941 128675 14227 61400 -147192 -140320 229100 -86162 -121879 103643
8985a36136K6844j34385i0703c1329n4729A88199e7933m980j9740c2182i125o1612
$$ -136136 -109292 -243677 -90703 -31329 -86058 188199 -57933 -62913 -82653 -32182 -9125 -70737
8973g0737j11868C9467b42925D8609K63951c32835A12863J15725h657p7349B473
$$ -70737 -182605 39467 -242925 48609 312560 -332835 112863 228588 -8657 -86006 2473
8961f9597G1792c90413C78485e0730b2862A29104f6595D4549b11937D8186b18154
$$ -69597 71792 -390413 378485 -50730 -22862 129104 -66595 44549 -211937 48186 -218154
8949b64119J29807K0456l20344C45983q1653p2832J12270D6519H488c33122a41655
$$ -264119 -134312 -113856 -434200 345983 264330 191498 303768 46519 8488 -333122 -141655
8937h7127C1490b50160N4497G4555J23327k7861d6571B3692b27644E5587a6593
$$ -87127 31490 -250160 -195663 74555 197882 170021 -46571 23692 -227644 55587 -16593
8925b87611a27368e3524l4893a7111A23887M45186J170821m70074F37M6468J40567
$$ -287611 -127368 -53524 -88417 -17111 123887 569073 1739894 1269820 637 47105 187672
8914A87672p1831K798a0235n2974B8215a88834j18098B3071L0232b76859R5840
$$ 187672 115841 118639 -10235 -63209 28215 -188834 -306932 23071 53303 -276859 -181019
8903a81019k03844i881B5243J4426a2197k70491K3601E454i4970K3291n1789j43054
$$ -181019 -384863 -9881 25243 39669 -12197 -282688 -259087 5454 -94970 -71679 -123468 -266522
8891b66522B82725C8780b60885E7079b47953H5089A6149a01752B41069b09975
$$ -266522 282725 38780 -260885 57079 -247953 85089 16149 -101752 241069 -209975
8880F3581b25139A03014b9434E4317a64553k4342A17950a8707E8684g6989j89750
$$ 63581 -225139 103014 -29434 54317 -164553 -188895 117950 -18707 58684 -76989 -266739
8869b66739D4729c41743A19018b26534b1836n3617F1422j0247c53374J38578j36483
$$ -266739 44729 -341743 119018 -226534 -21836 -75453 61422 51175 -353374 -214796 -351279
8858c51279c3786A89119l2072b59546a26340B9651b52413B53478C737c5124A24680
$$ -351279 -33786 189119 157047 -259546 -126340 29651 -252413 253478 3737 -35124 124680
8846a55231E06411I4143g2391I4392a16223n3739A7553M9425c28506e8362k41847
$$ -155231 506411 94143 -72391 94392 -116223 -169962 17553 66978 -328506 -58362 -300209
$$ [...]
##END NTUPLES=NMR SPECTRUM
##END=
