##TITLE=NES1088_T11_9884960_lD6dxsbMPy
##JCAMPDX= 6.0         $$ Bruker NMR JCAMP-DX V2.0
##DATA TYPE= NMR SPECTRUM
##DATA CLASS= NTUPLES
##ORIGIN= BRUKER
##OWNER= Administrator
$$ 1.72 TOPSPIN		Version 2.1
$$ 2016-08-27 23:29:58.836 -0500  Administrator@X
$$ Compression mode = diff/dup
##.OBSERVE FREQUENCY= 400.02188249412
##.OBSERVE NUCLEUS= ^1H
##.ACQUISITION MODE= SIMULTANEOUS (DQD)
##.ACQUISITION SCHEME= undefined
##.AVERAGES= 64
##.DIGITISER RES= 22
##SPECTROMETER/DATA SYSTEM= spect
##.PULSE SEQUENCE= noesygpps1d.comp
##.SOLVENT NAME= COFFEE_meoh
##.SHIFT REFERENCE= INTERNAL, COFFEE_meoh, 1, 14.96252
##AUDIT TRAIL= $$ (NUMBER, WHEN, WHO, WHERE, PROCESS, VERSION, WHAT)
$$ ##TITLE= Audit trail, TOPSPIN		Version 2.1
$$ ##JCAMPDX= 5.01
$$ ##ORIGIN= Bruker BioSpin GmbH
$$ ##OWNER= Administrator
$$ $$ E:\/data/COFFEE/nmr/NES1088_T11_9884960_lD6dxsbMPy/12/pdata/1/auditp.txt
$$ ##AUDIT TRAIL=  $$ (NUMBER, WHEN, WHO, WHERE, PROCESS, VERSION, WHAT)
(   1,<2016-08-27 23:29:53.492 -0500>,<Administrator>,<X>,<go>,<TOPSPIN 2.1>,
      <created by zg
	started at 2016-08-27 23:18:23.711 -0500,
	POWCHK enabled, PULCHK disabled,
       configuration hash MD5:
       21 0F 79 D6 B3 7B B4 F6 88 20 88 DB 03 48 BD 9F
       data hash MD5: 64K
       6C 08 7A 79 9A A4 A5 0C DC 8F 44 DF 8F 55 58 90>)
(   2,<2016-08-27 23:29:56.711 -0500>,<Administrator>,<X>,<proc1d>,<TOPSPIN 2.1>,
      <Start of raw data processing
       efp LB = 0.3 FT_mod = 6 PKNL = 1 PHC0 = 0 PHC1 = 0 SI = 128K 
       data hash MD5: 128K
       D8 2D 28 0B 4B 6F 21 F8 B3 7F 87 B9 DA CF 48 35>)
(   3,<2016-08-27 23:29:57.617 -0500>,<Administrator>,<X>,<proc1d>,<TOPSPIN 2.1>,
      <pk PHC0 = -84.53979 PHC1 = 0 
       data hash MD5: 128K
       5C 4E 65 2B 3E 65 1B 66 41 47 8F 96 2D CD 89 42>)
(   4,<2016-08-27 23:29:58.008 -0500>,<Administrator>,<X>,<proc1d>,<TOPSPIN 2.1>,
      <abs ABSG = 1 
       data hash MD5: 128K
       1E 0E 4C A7 21 E8 3E FF 3F AD CF 41 54 AF 1E 4A>)
(   5,<2016-08-27 23:29:58.086 -0500>,<Administrator>,<X>,<proc1d>,<TOPSPIN 2.1>,
      <abs ABSG = 2 
       data hash MD5: 128K
       83 D3 63 2B FB 66 74 D1 3D 3E 12 43 04 19 3D 77>)
(   6,<2016-08-27 23:29:58.179 -0500>,<Administrator>,<X>,<proc1d>,<TOPSPIN 2.1>,
      <abs ABSG = 3 
       data hash MD5: 128K
       5C 52 DB 23 88 A4 6B C8 4F 3D AE E0 9D 08 2B DA>)
(   7,<2016-08-27 23:29:58.273 -0500>,<Administrator>,<X>,<proc1d>,<TOPSPIN 2.1>,
      <abs ABSG = 4 
       data hash MD5: 128K
       27 E5 D2 AD 69 3D 86 CC E8 90 41 9C 1D 2C 57 1F>)
(   8,<2016-08-27 23:29:58.367 -0500>,<Administrator>,<X>,<proc1d>,<TOPSPIN 2.1>,
      <abs ABSG = 5 
       data hash MD5: 128K
       D3 5D 8F 75 EC A9 28 28 46 CE 7C AE B5 2E 7F B7>)
$$ ##END=
$$ 
$$ $$ hash MD5
$$ $$ FC 16 A5 FE 86 33 0B AA 35 07 A9 78 DB B9 E9 2D
##$RELAX= 
##$RELAX= 
##$RELAX= 
##$RELAX= 
##$RELAX= 
##$RELAX= 
##$RELAX= 
##$RELAX= 
$$ Bruker specific parameters
$$ --------------------------
##$DU= <E:\>
##$EXPNO= 12
$$ [...]
##$TP07= 0
##$TPNAME0= <>
##$TPNAME1= <>
##$TPNAME2= <>
##$TPNAME3= <>
##$TPNAME4= <>
##$TPNAME5= <>
##$TPNAME6= <>
##$TPNAME7= <>
##$TPOAL= (0..7)
0.5 0.5 0.5 0.5 0.5 0.5 0.5 0.5
##$TPOFFS= (0..7)
0 0 0 0 0 0 0 0
##$TUNHIN= 0
##$TUNHOUT= 0
##$TUNXOUT= 0
##$USERA1= <user>
##$USERA2= <user>
##$USERA3= <user>
##$USERA4= <user>
##$USERA5= <user>
##$V9= 5
##$VALIST= <valist>
##$VCLIST= <CCCCCCCCCCCCCCC>
##$VD= 0
##$VDLIST= <DDDDDDDDDDDDDDD>
##$VPLIST= <PPPPPPPPPPPPPPP>
##$VTLIST= <TTTTTTTTTTTTTTT>
##$WBST= 1024
##$WBSW= 4
##$XGAIN= (0..3)
0 0 0 0
##$XL= 0
##$YL= 0
##$YMAX_a= 5915540
##$YMIN_a= -12154867
##$ZGOPTNS= <>
##$ZL1= 120
##$ZL2= 120
##$ZL3= 120
##$ZL4= 120
##$ABSF1= 14.96252
##$ABSF2= -5.595662
##$ABSG= 5
##$ABSL= 3
##$ALPHA= 0
##$AQORDER= 0
##$ASSFAC= 0
##$ASSFACI= 0
##$ASSFACX= 0
##$ASSWID= 0
##$AUNMP= <proc_prof1d_extract.lims>
##$AXLEFT= 0
##$AXNAME= <>
##$AXNUC= <1H>
##$AXRIGHT= 0
##$AXTYPE= 0
##$AXUNIT= <>
##$AZFE= 0.1
##$AZFW= 0.1
##$BCFW= 0
##$BC_mod= 0
##$BYTORDP= 0
##$COROFFS= 0
##$CY= 15
##$DATMOD= 1
##$DC= 0
##$DFILT= <>
##$DTYPP= 0
##$F1P= 0
##$F2P= 0
##$FCOR= 0.5
##$FTSIZE= 131072
##$FT_mod= 6
##$GAMMA= 0
##$GB= 0
##$INTBC= 1
##$INTSCL= 1
##$ISEN= 128
##$LB= 0.3
##$LEV0= 0
##$LPBIN= 0
##$MAXI= 10000
##$MC2= 0
##$MEAN= 0
##$ME_mod= 0
##$MI= 0
##$NCOEF= 0
##$NC_proc= -2
##$NLEV= 6
##$NOISF1= 0
##$NOISF2= 0
##$NSP= 0
##$NTH_PI= 0
##$NZP= 0
##$OFFSET= 14.96252
##$PC= 1
##$PHC0= -84.53979
##$PHC1= 0
##$PH_mod= 1
##$PKNL= yes
##$PPARMOD= 0
##$PPDIAG= 0
##$PPIPTYP= 0
##$PPMPNUM= 2147483647
##$PPRESOL= 1
##$PSCAL= 4
##$PSIGN= 0
##$PYNMP= <proc.py>
##$REVERSE= no
##$SF= 400.020009028433
##$SI= 131072
##$SIGF1= 0
##$SIGF2= 0
##$SINO= 400
##$SIOLD= 131072
##$SPECTYP= <>
##$SREGLST= <1H.CDCl3>
##$SSB= 0
##$STSI= 131072
##$STSR= 0
##$SW_p= 8223.68421052631
##$SYMM= 0
##$S_DEV= 0
##$TDeff= 65536
##$TDoff= 0
##$TI= <>
##$TILT= no
##$TM1= 0
##$TM2= 0
##$TOPLEV= 0
##$USERP1= <user>
##$USERP2= <user>
##$USERP3= <user>
##$USERP4= <user>
##$USERP5= <user>
##$WDW= 1
##$XDIM= 131072
##$YMAX_p= 334916171
##$YMIN_p= -11739
##$CURPLOT= <Network HP LaserJet P1505>
##$CURPRIN= <$Network HP LaserJet P1505>
##$DFORMAT= <normdp>
##$LAYOUT= <+/1D_H.xwp>
##$LFORMAT= <normlp>
##$PFORMAT= <normpl>
##$SURQMSG= 1
$$ End of Bruker specific parameters
$$ ---------------------------------
##NTUPLES= NMR SPECTRUM
##VAR_NAME=  FREQUENCY,     SPECTRUM/REAL,   SPECTRUM/IMAG
##SYMBOL=    X,             R,               I
##VAR_TYPE=  INDEPENDENT,   DEPENDENT,       DEPENDENT
##VAR_FORM=  AFFN,          ASDF,            ASDF
##VAR_DIM=   131072,        131072,          131072
##UNITS=     HZ,            ARBITRARY UNITS, ARBITRARY UNITS
##FACTOR=    0.0627417313425164, 1,          1
##FIRST=     8223.62146879497, 727,          -40887
##LAST=      0,             2917,            -41213
##MIN=       0,             -11739,          0
##MAX=       8223.62146879497, 334916171,    0
$$ Real data points
##PAGE= N=1
##DATA TABLE= (X++(R..R)), XYDATA
$$ [...]
67622 69641 68950 68244 67453 66671 66012 65602 65450 65264 64761 64183 64225 65362 67439 69902 72063 73185 72802 71178
67604 71178 69151 67378 65993 65065 64856 65418 66359 67338 68424 69645 70586 70882 70836 70995 71310 71262 70739 70224
67586 70224 70080 70134 70091 69877 69462 68719 67716 66848 66421 66327 66298 66274 66376 66702 67272 67992 68604 68921 69201 69935
67566 69935 71095 71962 72013 71612 71490 71844 72394 73028 73769 74217 73752 72429 71124 70579 70731 71127 71487 71581 71083
67547 71083 69983 68789 67861 66898 65584 64436 64306 65128 65868 65826 65352 65058 64951 64739 64559 64853 65738 66936
67529 66936 68248 69653 71003 72045 72828 73708 74769 75467 75190 74079 73054 72904 73518 74192 74594 75062 75833
67512 75833 76344 75765 74121 72372 71276 70658 70028 69471 69405 69734 69762 68970 67525 66057 65221 65381 66366 67499
67494 67499 68239 68795 69792 71335 72883 74070 75144 76329 77230 77318 76671 75818 75005 74046 72836 71638 70851
67477 70851 70709 71170 71874 72322 72363 72448 73089 74154 74970 75143 74929 74795 75016 75768 77181 79038 80690 81577
67459 81577 81671 81311 80791 80310 80005 79800 79432 78971 78998 79884 81052 81493 80983 80261 79945 79835 79529 79196 79290 79781
67439 79781 80111 79840 79003 77945 77084 76754 76987 77510 78165 79163 80629 82069 82757 82602 82142 81659 80839 79545
67421 79545 78430 78373 79491 81046 82184 82505 82126 81484 81055 81081 81534 82331 83321 84111 84316 84196 84524 85490
67403 85490 86221 85924 85058 84654 84775 84569 83802 83392 84122 85643 87218 88816 90858 93309 95620 97347 98342
67386 98342 98516 97886 96777 95684 94965 94799 95125 95394 94856 93529 92516 92806 93982 94794 94820 94875 95744 97221
67368 97221 98544 99231 99242 98846 98535 98662 98974 98908 98493 98442 99147 100107 100722 101132 101788 102611 103169 103446 103857 104575
67348 104575 105305 105690 105590 105078 104505 104446 105142 106101 106698 107015 107591 108412 108835 108624 108423 108877 109871 110998 112269
67329 112269 113800 115124 115439 114531 112988 111561 110680 110572 111345 112754 114221 115328 116149 116961 117807 118495
67313 118495 118880 118970 118902 118984 119603 120770 121790 121750 120563 119273 119050 120042 121499 122916 124473 126239 127521
67296 127521 127559 126609 125736 125589 125894 126206 126578 127254 128228 129452 131022 132693 133573 132958 131381 130274 130512
67279 130512 131749 133190 134483 135679 136798 137788 138643 139227 139242 138641 137961 137959 138963 140708 142672 144350 145395
67262 145395 145802 145989 146512 147651 149291 151109 152743 153935 154704 155361 156248 157529 159268 161451 163708 165216
67246 165216 165343 164367 163293 162915 163278 164026 164899 165829 166800 167844 169050 170515 172363 174734 177513 180108
67230 180108 181847 182696 183294 184147 185112 185863 186444 187011 187289 186841 185828 185039 184971 185236 185166 184805 184996 186370
67212 186370 188547 190551 191935 193153 194682 196207 197093 197476 198272 200032 202363 204682 206925 209082 210595
67197 210595 210974 210773 211182 212690 214735 216728 218692 220736 222580 224030 225414 227041 228590 229580 230198
67182 230198 231094 232415 233585 234141 234379 234963 236159 237721 239359 241041 242853 244746 246554 248221 249860
67167 249860 251525 253103 254575 256329 258865 262160 265576 268536 271026 273237 275045 276205 276930 277898 279640
67152 279640 282178 285246 288531 291701 294514 297036 299491 301781 303463 304382 305114 306492 308786 311560 314269
67137 314269 316774 319312 322187 325497 328988 332134 334562 336462 338481 341082 344144 347271 350369 353689
67123 353689 357290 360746 363603 366018 368622 371671 374599 376714 378172 379936 382734 386390 390304 394255
67109 394255 398367 402506 406224 409391 412491 416058 420092 424269 428522 433060 437861 442486 446509 449917
67095 449917 452999 456026 459139 462445 466051 470082 474719 480075 485942 491749 496950 501449 505538 509506
67081 509506 513489 517681 522432 527943 533887 539566 544550 549172 554256 560275 566862 573242 579034 584439
67067 584439 589726 594943 600201 605830 611931 618053 623755 629347 635639 642986 650962 659023 667075 675249
67053 675249 683481 691546 699317 706802 714113 721479 729103 736874 744462 751775 759072 766536 774058 781653
67039 781653 789685 798379 807394 816304 825260 834750 844810 854910 864595 873867 882939 891988 901197 910717
67025 910717 920527 930547 940858 951499 962147 972456 982754 993901 1006208 1018852 1030675 1041373
67013 1041373 1051679 1062644 1074908 1088396 1102422 1116184 1129438 1142627 1156310 1170631 1185438
67002 1185438 1200559 1215648 1230107 1243667 1256903 1270704 1285258 1300013 1314689 1329753 1345664
66991 1345664 1362153 1378681 1395291 1412435 1430029 1447286 1463693 1479735 1496287 1513466 1530551
66980 1530551 1547030 1563354 1580417 1598479 1616917 1635018 1652758 1670650 1688984 1707431 1725445
66969 1725445 1742879 1760034 1777152 1794051 1810454 1826565 1843102 1860661 1879111 1897708 1915722
66958 1915722 1932934 1949620 1966184 1982834 1999533 2016227 2032983 2049775 2066242 2081943 2096939
66947 2096939 2111857 2127159 2142599 2157607 2172046 2186234 2200378 2214342 2227953 2241173 2253916
66936 2253916 2266013 2277471 2288476 2299034 2308904 2317995 2326555 2334807 2342648 2349917 2356689 2363058 2368804
66923 2368804 2373670 2377866 2382003 2386423 2390797 2394421 2396772 2397716 2397422 2396260 2394739 2393271 2391785 2389683
66909 2389683 2386418 2382143 2377573 2373103 2368334 2362696 2356307 2349835 2343633 2337360 2330399 2322329 2313020 2302692
66895 2302692 2291919 2281228 2270601 2259648 2248176 2236156 2223267 2209121 2194098 2179198 2164780
66884 2164780 2150107 2134562 2118605 2102969 2087512 2071692 2055715 2040315 2025513 2010420 1994332
66873 1994332 1977344 1959884 1942289 1924893 1907919 1891121 1874059 1856795 1839838 1823331 1806864
66862 1806864 1790164 1773351 1756374 1738891 1720974 1703318 1686322 1669512 1652309 1634884 1617773
66851 1617773 1601084 1584636 1568503 1552831 1537324 1521494 1505344 1489314 1473611 1458106 1442805
66840 1442805 1427895 1413293 1398597 1383618 1368589 1353689 1338741 1323600 1308577 1294192 1280578
66829 1280578 1267355 1254021 1240418 1226823 1213691 1201284 1189498 1177951 1166197 1153906 1141035
66818 1141035 1127959 1115303 1103479 1092383 1081622 1070906 1060126 1049194 1038024 1026681 1015372
66807 1015372 1004251 993343 982616 972054 961686 951607 941903 932477 923044 913425 903712 894030
66795 894030 884317 874573 865174 856566 848690 841043 833402 826094 819338 812663 805356 797349 789243 781405
66781 781405 773401 764549 754840 745059 736068 728180 721228 714965 709218 703876 698951 694517 690388 685920
66767 685920 680416 673815 666760 659904 653350 646850 640318 633927 627798 621819 615830 609881 604299 599405
66753 599405 595112 590816 585904 580393 574836 569555 564230 558489 552680 547696 543992 540981 537456 532588
66739 532588 526563 520375 515010 510760 507311 504349 501834 499659 497377 494544 491121 487341 483308 479031
66725 479031 474727 470736 467099 463466 459496 455236 451084 447458 444471 441761 438698 434869 430395 425743
66711 425743 421356 417516 414306 411467 408468 405017 401362 397889 394572 391210 388043 385682 384352 383610
66697 383610 382894 382030 381096 380100 378942 377448 375362 372566 369383 366371 363713 361149 358532 356038 353614
66682 353614 350726 347101 343378 340552 338839 337513 335778 333421 330671 327865 325381 323543 322383 321592
66668 321592 320763 319552 317646 314854 311321 307526 303961 300917 298588 297064 296153 295412 294564 293663 292678 291173
66652 291173 288848 286240 284350 283403 282520 280909 278900 277246 275777 273624 270701 268044 266276 264611 262140
66637 262140 259489 258202 258639 259477 259424 258533 257431 256115 254217 252045 250537 250139 250225 249745 248222 246132
66621 246132 244451 243773 243714 243257 241785 239604 237346 235214 233140 231361 230274 229766 229193 228164 226931 225846
66605 225846 224789 223367 221485 219421 217471 215748 214294 213144 212253 211538 211058 211011 211399 211751 211402 210158
66589 210158 208600 207549 207287 207452 207631 207736 207769 207529 206826 205779 204678 203621 202479 201138 199577 197823
66573 197823 196009 194406 193189 192223 191306 190529 190147 190128 190064 189598 188753 187833 187106 186584 185978 184908 183307 181530
66555 181530 179944 178556 177263 176268 175869 175891 175741 175027 173794 172198 170426 168981 168502 169007 169725 169975 169861
66538 169861 169825 169885 169727 169263 168618 167748 166516 165132 164080 163601 163495 163430 163149 162439 161239 159833 158675 158014
66520 158014 157855 158124 158565 158619 157898 156744 155851 155313 154601 153547 152714 152407 151943 150476 148189 146079 144767
66503 144767 144083 143683 143489 143478 143566 143810 144290 144707 144518 143655 142726 142292 142279 142253 141884 140935 139237 137111 135452
66484 135452 134872 134846 134250 132704 130982 130034 130017 130384 130572 130383 129974 129748 130042 130750 131328 131360 131051 130987 131453
66465 131453 132160 132600 132536 132063 131354 130494 129585 128817 128222 127443 126091 124446 123472 123814 124995 125965 126280 126272 126155
66446 126155 125570 124168 122150 120028 118292 117540 118321 120332 122213 122779 122270 121836 121962 122140 122015 122022 122551
66429 122551 123111 122875 121735 120373 119397 118826 118358 117848 117404 117179 117183 117298 117495 117932 118675 119394 119556 119039 118309
66410 118309 117878 117790 117754 117589 117333 117052 116791 116625 116512 116141 115130 113469 111706 110547 110258 110397 110237 109529
66392 109529 108763 108516 108638 108431 107603 106646 106095 105827 105417 104860 104450 104193 103885 103686 104006 104694 104916 104153 102922
66373 102922 102142 102039 102128 102100 102188 102568 102863 102564 101751 101094 101097 101558 101871 101703 101226 100771 100429 100102 99745 99443
66353 99443 99263 99190 99209 99359 99624 99795 99473 98330 96462 94525 93316 93152 93707 94506 95382 96274 96812 96502
66335 96502 95383 94145 93454 93349 93494 93737 94142 94510 94276 93114 91534 90595 90919 92046 92921 92971 92528 92166
66317 92166 91944 91535 90885 90354 90188 90249 90344 90494 90672 90613 90169 89656 89517 89792 90195 90564 90851 90718 89678 87802
66297 87802 85922 84834 84512 84293 83705 82824 81959 81293 80873 80726 80879 81382 82253 83333 84233 84659 84802 85169
66279 85169 85906 86552 86636 86296 86041 86011 85838 85240 84452 83927 83816 83873 83721 83148 82300 81675 81720 82312 82910 83293
66259 83293 83845 84853 85921 86492 86667 86941 87303 87257 86689 86042 85489 84680 83588 82863 82848 82838 82037 80824 80301
66240 80301 80805 81612 81995 81843 81220 80099 78716 77571 76814 76118 75362 74916 75014 75377 75764 76383 77357 78228
66222 78228 78489 78218 77760 77117 76209 75465 75511 76338 77309 77991 78510 79046 79414 79241 78310 76696 74816 73254
66204 73254 72236 71395 70383 69585 69751 71038 72904 74866 76752 78171 78481 77623 76420 75691 75515 75725
66188 75725 76537 78126 79972 81303 82030 82657 83308 83427 82541 80904 79284 78415 78710 80093 81937 83436
66172 83436 84210 84391 84097 83142 81442 79464 77955 77270 77140 77041 76650 75951 75102 74356 74001 74184 74655 74799
66154 74799 74155 72966 72059 72059 72824 73695 74169 74182 73901 73538 73308 73328 73428 73233 72552 71672 71179 71415 72076 72448
66134 72448 72155 71601 71399 71408 70743 68972 66918 65908 66430 67908 69557 70883 71440 70812 69193 67583 67011
66117 67011 67658 68880 69917 70415 70452 70305 70181 70072 69889 69667 69505 69395 69336 69568 70348 71441 72213 72316 72004
66098 72004 71651 71374 71265 71493 71838 71551 70196 68329 66895 66133 65586 65012 64710 64945 65561 66223 66612 66387
66080 66387 65442 64316 63899 64599 66120 68027 69993 71418 71590 70598 69531 69236 69360 69151 68722 68739 69205
66063 69205 69439 69246 69157 69322 69035 67849 66520 66176 66905 67755 67963 67587 67055 66609 66307 66140 65948 65545 65077
66044 65077 65014 65593 66418 66818 66512 65819 65260 65128 65461 66264 67518 68920 69832 69802 69121 68570 68501 68496 68130 67701
66024 67701 67827 68501 69063 69030 68509 67802 67091 66621 66709 67351 68103 68556 68580 68043 66811 65311 64555 65099 66265
66005 66265 66925 66788 66455 66449 66764 67243 67700 67664 66707 65220 64306 64579 65483 66069 66045 65724 65339 64909 64629 64847
65985 64847 65585 66347 66584 66270 65963 66279 67280 68384 68923 68713 67953 66736 65028 63122 61735 61416 62029
65968 62029 62954 63580 63538 62808 61859 61463 62033 63159 63992 64030 63431 62698 62223 62077 62093 62185 62545 63351 64316 64854
65948 64854 64788 64556 64499 64362 63829 63237 63292 64228 65627 66985 68032 68502 68083 66788 65184 64047 63784 64120
65930 64120 64323 63902 63203 63097 63890 64821 64958 64329 63754 63731 64031 64340 64775 65571 66640 67609 68109 67980 67468
65911 67468 67174 67493 68070 68136 67394 66213 64979 63742 62565 61728 61337 61146 60990 60983 61034 60602 59352 57748
65893 57748 56612 56269 56455 56836 57249 57557 57631 57453 57067 56551 56221 56628 58052 60182 62498 64691 66357
65876 66357 66681 65071 62102 59259 57637 57266 57703 58680 59957 61027 61440 61249 60818 60310 59633 58769 57914
65859 57914 57252 56782 56448 56382 56914 58236 60015 61444 61894 61525 61105 61244 61954 62873 63582 63668 62875 61509
65841 61509 60415 60255 60850 61543 62041 62550 63144 63455 63128 62295 61405 60835 60826 61522 62751 63935 64558 64671 64666
65822 64666 64661 64485 64237 64367 64960 65387 65021 64034 63153 62799 62877 63234 63791 64265 64284 63980 64035 64865 66024 66703
65802 66703 66618 66184 66014 66485 67636 69127 70328 70724 70311 69552 68928 68656 68740 69106 69632 70096 70165 69509 68123
65783 68123 66552 65561 65438 65780 66063 66205 66359 66404 66040 65314 64696 64566 64870 65340 65834 66340 66809 67079 66957
65764 66957 66357 65440 64593 64159 64201 64571 65107 65647 65949 65829 65316 64549 63544 62293 61054 60328 60430 61142
65746 61142 61770 61569 60286 58525 57397 57587 58768 60036 60764 60819 60284 59410 58726 58626 58818 58677 58205 58095
65728 58095 58717 59574 60069 60297 60677 61201 61542 61625 61641 61652 61630 61762 62267 63000 63625 64080 64474 64661 64412 63949
65708 63949 63720 63520 62493 60324 57922 56430 55889 55411 54504 53674 53661 54596 56068 57700 59357 60968 62392
65691 62392 63439 63908 63702 63030 62351 61867 61181 59745 57614 55454 53790 52623 51912 51935 52835 54162 55378
65674 55378 56556 57998 59307 59595 58735 57690 57309 57400 57405 57364 57640 58094 58275 58178 58096 57879 57107 56031 55617
65655 55617 56360 57588 58213 57768 56550 55218 54558 55119 56640 58085 58666 58596 58513 58459 57961 56951 56025 55703
65637 55703 55857 56039 56074 56130 56409 57008 57953 59154 60279 60893 60884 60705 60955 61623 61941 61282 60055 59292 59350 59515
65617 59515 59075 58259 57700 57394 56806 55877 55253 55428 56163 56894 57400 57833 58358 58910 59125 58500 56877 54841
65599 54841 53306 52605 52333 52172 52406 53364 54772 56131 57405 58796 60037 60496 60074 59492 59457 59936 60469
65582 60469 60863 61219 61485 61419 61016 60650 60594 60552 59961 58763 57694 57601 58487 59462 59694 59218 58661 58385 58241 58118
65562 58118 58337 59273 60853 62643 64285 65551 66097 65515 63767 61378 59111 57532 56902 57210 58100 58944
65546 58944 59285 59232 59254 59585 59995 60116 59789 59057 58139 57514 57739 58861 60129 60544 59713 58042 56258 54991
65528 54991 54656 55259 56222 56710 56329 55383 54455 53980 54218 55217 56593 57688 58242 58646 59296 59994 60376 60656
65510 60656 61424 62810 64318 65542 66572 67588 68511 69280 70110 71180 72273 73030 73444 73833 74365 74836 74881
65493 74881 74317 73304 72240 71442 70876 70282 69629 69248 69381 69738 69789 69491 69499 70488 72321 74046 74830 74892 75323
65474 75323 76886 79129 80947 81872 82427 83134 83695 83481 82449 81036 79300 76821 73603 70516 68452 67386
65458 67386 66678 66074 65847 65929 65598 64415 63054 62610 63137 63472 62686 61251 60444 60850 61842 62425 62206 61527
65440 61527 60942 60702 60651 60509 60260 60104 60037 59750 59167 58792 59118 59921 60590 61020 61595 62315 62524 61677 59859
65421 59859 57477 55076 53636 54253 56902 60053 62119 62946 63323 63481 62914 61499 59884 58608 57551 56505
65405 56505 55762 55848 56920 58644 60443 61794 62536 62953 63397 63885 64304 64799 65561 66340 66706 66772 67117 67928
65387 67928 68784 69430 70216 71503 73128 74757 76351 77990 79632 81357 83396 85648 87614 89208 91178
65372 91178 94198 97927 101585 105143 109282 114298 119709 124938 129778 134100 137707 140604 142925 144379
65358 144379 144264 142350 139404 136493 133976 131442 128428 124904 121160 117537 114305 111589 109340 107408
65344 107408 105629 103803 101669 99011 95817 92288 88743 85497 82768 80608 78870 77281 75596 73740
65330 73740 71838 70075 68513 67140 66038 65372 65108 64865 64232 63198 62187 61654 61774 62463 63548 64813
65314 64813 65938 66519 66307 65512 64787 64659 64946 64930 64233 63288 62770 62749 62711 62326 61860 61786 62210 62803 63132 63005
65294 63005 62519 61874 61121 60198 59187 58381 58008 58013 58253 58742 59452 60005 59861 58842 57258 55549 53998 52835
65276 52835 52325 52639 53675 55013 56018 56128 55318 54226 53572 53471 53510 53414 53291 53214 53066 52977 53533 55131 57276
65257 57276 58909 59490 59498 59803 60694 61699 62259 62428 62770 63659 64874 65928 66584 66922 67129 67440 68088 68974
65239 68974 69506 69197 68389 67968 68249 68574 68211 67276 66489 66287 66472 66571 66236 65439 64516 63932 63782 63589 62836
65220 62836 61590 60420 59757 59566 59560 59558 59576 59721 59962 59989 59416 58284 57185 56660 56549 56206 55294 54090 53043
65201 53043 52357 52116 52549 53884 55959 58141 59668 60121 59645 58795 58109 57743 57496 57180 56920 57041 57620 58255
65183 58255 58371 57806 56966 56353 56029 55649 54872 53599 51988 50536 50037 50972 52870 54579 55353 55368 55128 54825
65165 54825 54552 54648 55332 56250 56852 57055 57100 56925 56248 55210 54342 53828 53329 52714 52416 52743 53295 53480 53351
65146 53351 53458 54031 54721 55160 55363 55478 55415 54973 54234 53599 53431 53728 54197 54548 54652 54475 54073 53664 53514
65127 53514 53607 53574 53183 52758 52843 53533 54427 55284 56366 57925 59609 60650 60633 59951 59470 59820 60928 62220
65109 62220 63249 64110 65203 66711 68475 70300 72133 73907 75470 76789 78056 79473 81030 82602 84231
65094 84231 86253 89144 93130 97809 102285 105922 108871 111570 113884 115261 115737 116168 117111 118028 118042 117107
65078 117107 115840 114440 112374 109162 104947 100270 95685 91660 88420 85740 83159 80501 77925 75460
65064 75460 72858 70054 67399 65252 63601 62285 61329 60846 60764 60817 60679 60054 58916 57738 57157 57180 57099 56473
65046 56473 55808 55801 56206 56059 54928 53308 51768 50405 49369 49278 50504 52412 53845 54315 54289 54387 54757 55292
65028 55292 56037 57088 58298 59255 59522 58853 57387 55680 54395 53787 53595 53512 53634 54242 55209 55844 55488 54247
65010 54247 53040 52800 53561 54465 54698 54288 53801 53489 53155 52793 52805 53331 53858 53893 53725 54035 54974 56107 57090
64991 57090 57818 58033 57433 56346 55586 55403 55139 54314 53520 53688 54811 55961 56369 56013 55303 54738 54793 55553
64973 55553 56432 56668 56204 55665 55473 55460 55424 55516 55804 55905 55444 54607 53826 53114 52084 50598 49068 48053 47746
64954 47746 47903 48231 48751 49687 50942 51897 52024 51598 51408 51706 51936 51630 51111 50937 51091 51170 51117 51270 51778
64935 51778 52444 53052 53446 53375 52721 51891 51513 51705 52073 52484 53285 54568 55667 55782 54819 53368 52117 51537
64917 51537 51803 52600 53142 52811 51780 50808 50465 50743 51263 51552 51239 50347 49451 49213 49682 50311 50724 51144 51946
64898 51946 53056 54004 54385 54060 53082 51757 50658 50256 50443 50663 50612 50606 51125 52154 53161 53637 53449 52710
64880 52710 51581 50353 49526 49553 50454 51743 52759 53083 52751 52185 51878 52003 52290 52348 52111 51911 52096 52689
64862 52689 53409 53951 54202 54243 54195 54027 53550 52628 51403 50232 49380 48803 48239 47536 46891 46714 47149 47792 48124
64843 48124 48240 48815 50136 51599 52538 53251 54528 56289 57429 57244 56308 55599 55344 55246 55328 55787 56240 55889
64825 55889 54562 53032 52147 52000 52090 51930 51345 50432 49431 48555 47901 47627 48066 49354 51045 52423 53229
64808 53229 53743 54181 54441 54461 54353 54026 53153 51790 50591 50016 49678 48931 47896 47387 47913 49181 50630 51982
64790 51982 53150 53966 54306 54331 54328 54335 54110 53588 53183 53402 54122 54503 53866 52523 51415 51025 51051 51153 51513 52355
64770 52355 53333 53861 53865 53790 53947 54257 54597 55009 55437 55562 55113 54218 53328 52818 52684 52563 52110 51371 50755 50539
64750 50539 50565 50553 50536 50736 51111 51303 51051 50418 49579 48622 47649 46970 47052 48249 50448 52943 54827 55703 55942
64731 55942 56100 56313 56476 56692 57106 57375 56840 55339 53450 51835 50697 50048 50007 50564 51323 51843 52090 52301
64713 52301 52593 52907 53189 53401 53497 53624 54173 55311 56494 56790 55765 53901 52212 51606 52519 54708 57214
64696 57214 58850 59145 58824 59028 59967 60621 59998 58468 57393 57503 58154 58401 58260 58402 58997 59538 59737 59817
64678 59817 59832 59351 58145 56644 55326 54146 53026 52485 53134 54780 56588 58047 59248 60273 60882 60940
64662 60940 60732 60733 61294 62488 63839 64273 62914 60187 57675 56663 57094 58080 58919 59288 58984 58129 57429 57564
64644 57564 58279 58538 57737 56410 55585 55726 56483 57239 57692 57996 58533 59505 60698 61692 62322 62776 63165 63238 62695
64625 62695 61647 60549 59782 59451 59516 59846 60200 60469 60924 61897 63142 63878 63731 63274 63308 63880 64409 64622 64796
64606 64796 65054 65014 64374 63450 62783 62520 62443 62402 62341 62096 61558 60949 60579 60305 59623 58378 57115 56553 56885 57701
64586 57701 58419 58674 58458 58101 58030 58433 59130 59769 60051 59731 58653 57007 55488 54876 55363 56396 57285 57810
64568 57810 58187 58618 59095 59573 60054 60471 60696 60739 60731 60643 60274 59700 59391 59600 59841 59433 58476 57798 57903 58401
64548 58401 58627 58400 57977 57619 57459 57478 57355 56649 55456 54600 54799 55814 56794 57262 57434 57655 57987 58319 58533
64529 58533 58530 58351 58235 58335 58432 58209 57708 57233 56911 56657 56442 56229 55788 55032 54431 54552 55168 55370 54666 53467
64509 53467 52344 51372 50493 50022 50365 51457 52820 53989 54675 54752 54297 53492 52386 50970 49519 48478 47943
64492 47943 47636 47544 48051 49208 50421 51211 51802 52460 52762 52179 51090 50490 50781 51483 52099 52664 53344 54006
64474 54006 54389 54385 54073 53707 53678 54162 54847 55288 55508 55905 56580 57106 56975 56039 54491 52774 51455 50849 50782
64455 50782 50969 51496 52523 53627 54041 53642 53223 53541 54559 55759 56812 57629 58108 58166 57861 57303 56601 55975
64437 55975 55680 55702 55776 55766 55748 55711 55548 55417 55675 56291 56797 57007 57313 57947 58449 58302 57686 57106 56614 55963 55342
64416 55342 55354 56242 57550 58564 58819 58261 57238 56269 55629 55277 55254 55754 56430 56208 54533 52511 51975 53343
64398 53343 55154 55843 55261 54297 53753 53997 55035 56334 56964 56546 55816 55820 56686 57620 57927 57596 57013 56594 56721
64379 56721 57594 58959 60156 60621 60245 59375 58609 58488 59067 59758 59836 59150 58192 57464 57026 56693 56398 56201 56130
64360 56130 56212 56559 57255 58141 58885 59303 59603 60249 61435 62649 62941 61885 60287 59600 60493 62264 63840
64343 63840 65054 66500 68358 69981 70839 71298 72046 73096 73892 74278 74766 75774 77125 78475 79858 81477
64327 81477 83355 85589 88672 93015 98249 103459 108132 112524 117035 121709 126489 131534 136982 142625
64313 142625 148043 152884 156882 159886 162035 163578 164191 162820 158676 152263 144975 137773 130800 124243
64299 124243 118807 114920 111930 108740 105121 101925 99946 99015 98405 97787 97443 97707 98576 99912 101637 103453
64283 103453 104596 104306 102621 100489 98991 98596 99137 100162 101091 101321 100576 99120 97395 95505 93328 91012
64267 91012 89000 87490 86219 84925 83797 83267 83498 84226 84994 85423 85387 85083 84846 84791 84692 84333 83916 83980 84925
64248 84925 86595 88333 89474 89925 90253 91139 92787 95015 97711 100825 103912 106227 107546 108497 109793
64233 109793 111441 113062 114584 116074 117086 116897 115474 113719 112548 112161 112307 112761 113229 113152 112102 110350
64217 110350 108789 108239 108802 109768 110115 109350 108003 107158 107430 108603 110249 112283 114689 117152 119345 121440
64201 121440 123915 126958 130384 134089 138213 142856 147953 153509 159702 166620 173970 181087 187163 191583
64187 191583 194234 195465 195663 194903 193058 190037 185722 179949 172927 165519 158702 152789 147557 143028 139593
64172 139593 137274 135499 133903 132892 133043 134194 135537 136416 136707 136603 136451 136768 138072 140549 144012 148125
64156 148125 152580 157187 162027 167481 173902 181232 189006 196716 204148 211507 219267 227651 236112 243581
64142 243581 249446 254002 257655 260022 260318 258462 255188 251121 246326 240867 235112 229180 222596 214981
64128 214981 206747 198680 191203 184508 179108 175486 173171 170798 167389 163206 159142 155671 152730 150279
64114 150279 148441 147172 146228 145651 145952 147552 150230 153315 156342 159326 162438 165623 168689 171633 174742
64099 174742 178376 182659 187363 192032 196268 199970 203338 206594 209669 212186 213792 214540 214861 215023 214651
64084 214651 212970 209646 205261 200836 197027 193965 191581 189626 187455 184403 180591 176908 173945 171399
64070 171399 168910 166991 166483 167344 168679 169882 171092 172496 173914 175305 177053 179385 181971 184470 187061
64055 187061 190087 193585 197574 202412 208288 214631 220620 226202 232066 238624 245520 252211 258528 264534
64041 264534 270237 275664 280917 285961 290595 294766 298705 302560 306135 309144 311663 314155 317170 321054
64027 321054 325820 331191 336901 343024 349917 357807 366533 375678 384786 393473 401614 409475 417354 424883
64013 424883 430997 434873 436765 437696 438424 438998 439187 439035 438935 439388 440801 443342 446868 451048 455655 460783
63997 460783 466791 474111 483069 493851 506535 521125 537568 555838 576077 598583 623482 650462
63985 650462 679045 709184 741423 776381 814323 855321 899610 947407 998515 1052475 1109418
63974 1109418 1170772 1239069 1316886 1405763 1506085 1618276 1744282 1887816 2053096 2243619
63964 2243619 2462399 2713139 3000630 3329858 3704839 4128164 4601040 5123326 5693438
63955 5693438 6308219 6962819 7650775 8364366 9094785 9831567 10561756 11269944 11939507
63946 11939507 12554067 13098341 13558636 13923486 14184300 14335514 14374328 14300259 14114712 13820870
63936 13820870 13424344 12934197 12363087 11726033 11038911 10317808 9578780 8836898 8104877
63927 8104877 7392714 6708662 6060201 5453915 4894710 4385362 3926617 3517503 3155680
63918 3155680 2837924 2560591 2319847 2111674 1931862 1776168 1640778 1522776 1419995
63909 1419995 1330172 1250430 1178013 1111527 1050980 996428 946969 901213 858225 817561 778790
63898 778790 741573 706040 672475 640676 610105 580688 552912 527034 502737 479743 458237
63887 458237 438352 419707 401869 384920 369138 354424 340547 327743 316488 306710 297774 289226
63875 289226 281111 273516 266346 259740 254142 249599 245371 240740 235952 231931 229121 226996 224760 222160
63861 222160 219517 217227 215420 214040 213063 212592 212679 213125 213567 213875 214301 215033 215680 215411 213653 210510 206456
63844 206456 201813 196673 191215 185873 181112 177104 173610 170175 166390 162096 157467 152954 149017 145791
63830 145791 143044 140495 138084 135791 133386 130633 127693 124961 122490 119996 117556 115843 115250 115175 114651
63815 114651 113475 112162 110933 109463 107709 106299 105753 105747 105561 104899 103899 102640 101104 99488 98168 97362
63799 97362 97051 97040 96839 95715 93376 90524 88289 87068 86345 85619 85002 84774 84903 85274 85881 86413 86117 84702
63781 84702 83117 82707 83574 84434 84215 83217 82406 82125 82070 82163 82711 83685 84409 84267 83419 82572 82239 82400 82738
63762 82738 83006 83202 83509 84024 84563 84913 85249 85943 86837 87071 86094 84551 83686 83931 84654 85230 85764 86544 87465
63743 87465 88440 89908 92351 95569 98989 102504 106482 111073 116083 121468 127280 133006 137665 140928 143582
63728 143582 146521 149687 152442 154507 155928 156439 155609 153583 151072 148540 145951 143355 141075 139058 136645
63713 136645 133469 130190 127804 126455 125434 124225 122978 121921 120862 119525 118002 116583 115341 114152
63699 114152 112961 111786 110534 109084 107634 106740 106927 108256 110266 112234 113540 113985 113925 114113 115306 117897
63683 117897 121766 126368 131039 135420 139645 144015 148439 152331 155174 157056 158476 159769 160956 162043
63669 162043 162990 163270 161934 158533 153754 148707 143748 138497 132973 128021 124400 121977 120219 118994 118350
63654 118350 117863 116929 115673 114896 115028 115715 116610 117998 120304 123401 126832 130393 134085 137759 141303 145077
63638 145077 149706 155477 162232 169818 178212 187228 196524 206049 216183 227316 239465 252391 265806
63625 265806 279429 293026 306522 319841 332482 343466 351892 357524 360798 362382 362690 361688 359160
63612 359160 355321 351072 347316 344035 340447 336171 331790 328023 324678 320787 315514 308587 300166 290814
63598 290814 281523 273232 266093 259441 252585 245496 238725 232865 228121 224252 220888 217994 215935 215020
63584 215020 215115 215906 217311 219371 221871 224488 227254 230503 234354 238637 243333 248682 254724 261187 268038
63569 268038 275767 284818 295016 305862 317170 329116 341751 354732 367441 379192 389405 397799
63557 397799 404373 409115 411865 412626 411780 409854 407253 404430 402081 400792 400618 401308 402711 404576 406079
63542 406079 406108 404117 400401 395514 389854 383788 377577 370919 363036 353572 343031 331976 320255 307556
63528 307556 294371 281704 269915 258565 247456 237143 228097 219947 211998 204141 196840 190505 185262
63515 185262 181067 177560 174036 170137 166495 164080 162906 162001 160788 159815 159755 160317 160716 160814 161129 161940 163064
63498 163064 164464 166429 169020 171882 174794 178002 181822 186270 191284 196907 203008 209197 215266 221421
63484 221421 227720 233580 238195 241215 242699 242624 240897 237696 233382 228160 222221 216144 210602 205633 200654
63469 200654 195363 190243 185926 182452 179447 176813 174867 173907 173863 174410 175292 176523 178303 180669 183288
63454 183288 185783 188270 191314 195317 200182 205663 211772 218684 226527 235425 245501 256619 268383
63441 268383 280668 293912 308593 324661 341842 360170 379754 400164 420637 440841 460862
63430 460862 480318 498067 512950 524429 532355 536764 538238 537901 536504 533845 529580 524309 519225
63417 519225 514840 510656 506000 500519 493777 485095 474211 461710 448428 434587 419865 404175 388112
63404 388112 372608 358247 344876 331946 319342 307805 298280 290909 285011 280055 276167 273571 272042
63391 272042 271239 271097 271546 272285 273369 275659 280039 286402 294000 302665 312881 324645 337066 349389
63377 349389 361792 374869 388870 403838 419934 437048 454394 470966 486187 499728 510996
63366 510996 519355 524654 527076 526665 523624 518971 514218 510153 506423 502427 498089 493500 488280 481789
63352 481789 473762 464394 453935 442453 429925 416325 401734 386566 371546 357209 343460 329881
63340 329881 316489 303927 292872 283403 275020 267221 259992 253768 248904 245186 241917 238528 234998
63327 234998 231634 228631 226055 224083 222913 222410 222146 221887 221792 222012 222394 222775 223366 224533 226309 228437
63311 228437 230778 233319 235751 237477 238269 238621 239197 240117 241109 242092 243149 243934 243673 242031 239707 237811
63295 237811 236767 236105 235220 233998 232648 231303 230087 229392 229673 230828 232053 232545 232297 231942 231873 231831 231464
63278 231464 230982 230986 231815 233308 235101 236906 238568 240072 241470 242598 243047 242716 242207 242256 242866 243547 244331
63261 244331 245819 248087 250287 251780 253027 254845 257350 260317 264079 269142 275135 280983 286102 290692
63247 290692 294934 298806 302790 307835 314230 321269 328436 336167 344946 354407 364063 374391 386279 399657
63233 399657 413543 427353 441390 456008 471084 486526 502567 519136 535417 550515 564310
63222 564310 577360 590192 603069 616207 629748 643505 657048 670138 682779 694786 705508
63211 705508 714088 719854 722340 721195 716333 708047 696660 682097 664239 643819 622559 602065 582743
63198 582743 564152 546182 529479 514799 502439 492363 484481 478649 474822 473353 474758 478977 485230
63185 485230 492886 502098 513253 526129 540038 554535 569497 584687 599743 614574 629297 643868
63173 643868 658187 672512 687237 702161 716500 729744 741977 753103 762222 768279 771056 771088 768707
63160 768707 763565 755083 743070 727877 710188 690700 669865 647943 625399 603110 581882 561806
63148 561806 542398 523518 505790 489850 475454 461793 448621 436634 426591 418550 412226 407653
63136 407653 404921 403450 402171 400536 398837 397398 396024 394522 393264 392741 392916 393493 394575 396447 398778
63121 398778 400597 401142 400438 399100 397975 397889 399143 401136 402904 404215 405670 407597 409359 410163 410124 410030
63105 410030 410307 410739 411132 411684 412525 413293 413534 413425 413774 415197 417433 419631 421225 422304 423135 423711 424063
63088 424063 424701 426271 428820 431846 435114 438944 443519 448382 452950 457269 461867 467029 472552 478157
63074 478157 483842 489797 496222 503280 511084 519652 528890 538614 548608 558772 569266 580461 592719
63061 592719 606246 621039 636828 653215 670182 688492 709228 732769 758469 785458 813464
63050 813464 842656 873069 904499 936811 969910 1003403 1036580 1068874 1100289 1131338 1162523
63039 1162523 1193836 1224771 1254929 1284478 1313809 1342876 1371236 1398698 1425342 1450662 1473132
63028 1473132 1490959 1502950 1508488 1507156 1498840 1483889 1462716 1435528 1402782 1365559 1325027 1281935
63016 1281935 1237241 1192835 1150743 1111636 1075024 1041024 1011085 986639 967726 953483 943466
63005 943466 937964 937318 941430 949803 961654 976118 992695 1011463 1032633 1055960 1080765 1106393
62993 1106393 1132368 1158235 1183592 1208383 1232929 1257512 1281986 1305824 1328364 1348864 1366383
62982 1366383 1379859 1388433 1391610 1388996 1380100 1364665 1343082 1316033 1283730 1245977 1203174 1156794
62970 1156794 1108512 1059265 1009492 959850 911160 864019 819031 777130 738914 703898 671222
62959 671222 640983 614080 590765 570271 551939 535737 521354 507794 494498 482100 471421
62948 471421 462335 454248 447047 440780 434914 428813 422678 417139 412103 406815 400996 395129 389585 384234
62934 384234 379074 374521 370754 367256 363406 359276 355545 352764 350812 348913 346169 342234 337522 332738
62920 332738 328414 324989 322868 321893 321048 319309 316769 314404 312797 311655 310573 309585 308744 307751 306346
62905 306346 304718 303336 302653 303068 304705 307038 309144 310556 311476 312055 311957 310917 309206 307164 304719 301748
62889 301748 298533 295442 292531 289899 288060 287320 287100 286475 285271 284056 283225 282824 283139 284662 287227 289886
62873 289886 291981 293749 295482 296699 296744 295884 295062 294686 294257 293266 291868 290430 288902 287055 285099 283600
62857 283600 282769 282140 281023 279118 276655 274144 272033 270376 268713 266493 263780 261375 260050 259797 260007
62842 260007 260199 260222 259888 258935 257460 256010 255020 254435 254093 254167 254912 256137 257260 257838 257826 257467 257192 257528
62824 257528 258693 260178 261035 260792 259997 259724 260611 262454 264627 266680 268520 270178 271658 273124 275117
62809 275117 278279 282800 288206 293709 298715 303065 307098 311548 317150 324179 332565 342463 354296 368009
62795 368009 382656 397200 411590 426663 443200 461552 482015 504882 530008 556912 585634
62784 585634 617109 652434 692050 735831 783519 834686 888531 944167 1000968 1058350 1115350
62773 1115350 1170725 1223328 1272046 1315485 1352084 1380613 1400307 1410673 1411508 1403103 1386006 1360543
62761 1360543 1326864 1285589 1238116 1186227 1131613 1075750 1019779 964307 909648 856491 806008
62750 806008 759047 715484 674649 636196 600263 567060 536733 509502 485470 464306 445483
62739 445483 428764 414106 401158 389357 378600 369340 361825 355702 350582 346532 343613 341304 338870
62726 338870 336164 333666 331852 330875 330734 331380 332723 334885 338341 343420 349765 356682 364074 372580 382769
62711 382769 394642 408032 423088 440145 459493 481430 506195 533664 563449 595521 630353
62700 630353 668249 708963 752281 798476 847701 899232 951810 1004396 1055980 1104926 1149280
62689 1149280 1187763 1219835 1244773 1261322 1268467 1266045 1254441 1234227 1206288 1171725 1131345 1085724
62677 1085724 1036095 984579 933022 882014 831572 782385 735659 691888 650536 610985 573263
62666 573263 537757 504794 474737 448028 424834 404899 387862 373382 360745 348804 336788
62655 336788 325026 314453 305447 297486 289961 282945 276902 271901 267478 263267 259402 256043 252756 248807
62641 248807 244135 239621 236132 233615 231462 229468 227949 226978 226052 224606 222487 219890 217256 215292 214506
62626 214506 214408 213741 211915 209812 208738 209027 210200 212012 214416 216746 218023 218330 219021 221160 224435 228057
62610 228057 232043 236913 242653 248861 255691 263836 273495 284109 295372 307950 322842 340296 359646
62597 359646 380068 401255 423558 447652 474045 502685 532920 563687 593714 621782 647084
62586 647084 669238 687745 701673 710290 713851 713124 708145 698136 682931 663804 642385 619301
62574 619301 594552 568722 542888 517427 491871 466219 441660 419536 400094 382692 366870
62563 366870 352668 340067 328750 318498 309435 301693 295020 288860 282711 276353 269915 263858 258735
62550 258735 254712 251291 247696 243618 239447 235679 232325 229176 226500 224979 224769 225070 225006 224681 224929 226154
62534 226154 227958 229972 232477 235898 240138 244813 249968 256104 263546 272177 281823 292552 304456 317426
62520 317426 331412 346729 363825 382749 403127 424747 447944 473152 500187 528203 556332
62509 556332 584030 610692 635279 656682 674385 688516 699290 706558 709735 707910 700157 686304
62497 686304 667476 645615 622199 597645 571978 545688 519721 494912 471728 450341 430594
62486 430594 412064 394453 377930 362896 349544 337868 327898 319513 312061 304658 297054 289932 284071
62473 284071 279451 275427 271675 268572 266544 265372 264513 263976 264412 266107 268277 269852 270787 272040 274224
62458 274224 276848 279145 281113 283361 286342 290213 295090 300823 306673 311796 315992 319492 322080 323094
62444 323094 322375 320607 318458 315892 312583 308472 303518 297355 289849 281813 274573 268699 263502 257923
62430 257923 251743 245828 241274 238391 236540 234990 233774 233547 234600 236365 238019 239341 240755 242731
62416 242731 245323 248240 251165 254061 257237 260962 265024 268957 272836 277531 283847 291606 299833 307687
62402 307687 314908 321614 328081 334647 341377 347732 352915 356613 359192 361117 362513 363295 363366 362540 360612
62387 360612 357750 354624 351924 349866 348342 347442 347627 349430 353137 358740 366110 375171 385955 398527
62373 398527 412930 429276 447836 468954 492916 519980 550359 583911 619806 656790 693859
62362 693859 730540 766453 800831 832627 860935 885119 904616 918885 927601 930867 929180 923147
62350 923147 913123 899068 880845 858700 833416 805895 776630 745729 713535 681245 650663
62339 650663 623053 598123 574430 550965 528202 507419 489271 473399 459167 446161 433966
62328 433966 422114 410612 400138 391352 384226 378271 373158 368867 365480 363184 362293 362955 364906 367690
62314 367690 370916 374112 376659 378306 379534 380959 382510 383636 384189 384530 384743 384297 382664 379840 376132
62299 376132 371884 367681 364322 362146 360612 358913 356900 355130 354115 353892 354260 355142 356615 358769 361560
62284 361560 364757 368092 371568 375499 380145 385392 390972 396879 403406 410866 419554 429963 442696 457955
62270 457955 475291 494053 514078 535796 559693 585866 614127 644299 676074 708532 740097
62259 740097 769151 794637 815959 832590 844165 850940 853749 853244 849327 841418 829149 812702 792678
62246 792678 769853 744981 718691 691494 663896 636482 609991 585379 563608 544984 528748
62235 528748 513772 499796 487630 477912 470063 462819 455540 448624 442828 438517 435443 432908 430287
62222 430287 427687 425936 425568 426029 426314 426180 426197 426720 427535 428627 430564 433747 437806 442117 446543 451262
62206 451262 456237 461360 466912 473354 480691 488421 496167 504086 512689 522512 533971 547198 561852
62193 561852 577206 592550 607498 621937 635792 648942 661348 673148 684525 695503 706012
62182 706012 716238 726682 737706 749290 761586 775462 791901 810944 831849 854336 878843
62171 878843 905165 931625 956261 978369 998183 1015482 1029436 1039693 1046757 1051220 1053342 1053491
62159 1053491 1052234 1049675 1045300 1038813 1030620 1021165 1010361 998191 985497 973612 963358 954798 947787
62146 947787 942197 937685 933831 930709 928970 929091 930693 932816 934810 936751 939025 941730 944691 947921
62132 947921 951702 956172 961194 966866 973757 982154 991370 1000453 1009571 1019980 1032396 1046044 1059735
62119 1059735 1073351 1087740 1103549 1120739 1139018 1158169 1177938 1198114 1218681 1239550 1260124
62108 1260124 1279529 1297328 1313742 1329300 1344673 1360665 1377727 1395307 1412175 1427645 1442114
62097 1442114 1456233 1470110 1483739 1497821 1513480 1531175 1550361 1570288 1590829 1612400 1635378
62086 1635378 1659795 1685475 1712260 1740101 1768975 1798697 1828807 1858706 1887950 1916391 1944062
62075 1944062 1971041 1997510 2023799 2050152 2076370 2101778 2125648 2147530 2167100 2183889 2197449
62064 2197449 2207765 2215200 2219949 2221828 2220783 2217342 2212229 2205663 2197325 2187005 2174945 2161509 2146851
62051 2146851 2131076 2114565 2097917 2081653 2066107 2051552 2038236 2026160 2014878 2003679 1992182
62040 1992182 1980803 1970475 1961760 1954280 1947147 1939880 1932736 1926259 1920686 1915779 1911032 1905941 1900259
62027 1900259 1894075 1887635 1881119 1874685 1868669 1863456 1859035 1854797 1849905 1843911 1837088 1830200 1823908 1818272
62013 1818272 1812880 1807471 1802277 1797609 1793365 1789282 1785517 1782553 1780469 1778664 1776406 1773337 1769370 1764406
61999 1764406 1758313 1750872 1741637 1730145 1716487 1701392 1685496 1668779 1650910 1631918 1612264 1592512
61987 1592512 1573235 1555010 1538106 1522264 1507022 1492218 1477999 1464516 1451830 1439968 1428797
61976 1428797 1418003 1407434 1397206 1387233 1376989 1366184 1355398 1345429 1336204 1327033 1317893 1309605
61964 1309605 1302494 1295630 1287907 1279406 1271182 1264054 1258084 1252991 1248496 1244317 1240283 1236526 1233349 1230972
61950 1230972 1229520 1229089 1229583 1230690 1232383 1235236 1239822 1245920 1252857 1260636 1270082 1281688 1294843 1308677
61936 1308677 1323331 1339809 1358681 1379450 1401372 1424475 1449484 1476953 1506822 1538901 1573549
61925 1573549 1611780 1654849 1703896 1759874 1823571 1895634 1976728 2067805 2170162 2285138 2413868
61914 2413868 2557403 2716972 2893949 3089595 3304887 3540431 3796226 4071351 4363935
61905 4363935 4671220 4989231 5312115 5631944 5939256 6223706 6474227 6679297 6828112
61896 6828112 6912348 6927375 6872446 6750433 6567551 6332693 6056291 5749278 5422709 5087488
61886 5087488 4753410 4427945 4115967 3820685 3544592 3289433 3055626 2842317 2648196
61877 2648196 2472192 2313416 2170709 2042501 1927114 1823103 1729347 1644947 1569124 1501193
61867 1501193 1440507 1386371 1338016 1294718 1255927 1221272 1190547 1163798 1141303 1123064 1108167
61856 1108167 1094995 1082482 1071068 1062006 1055710 1051177 1047091 1043032 1039304 1036033 1032984 1030166 1028019
61843 1028019 1026848 1026390 1026091 1025626 1025020 1024495 1024393 1025071 1026693 1029168 1032331 1036033 1039968 1043638 1046783 1049751
61827 1049751 1053237 1057652 1062895 1068666 1074760 1081076 1087629 1094609 1102250 1110537 1119251 1128436 1138652 1150600
61813 1150600 1164658 1180941 1199624 1220898 1244711 1270895 1299642 1331593 1367360 1407124 1450801
61802 1450801 1498354 1549817 1605233 1664819 1729104 1798701 1874091 1955851 2045026 2142961 2250798
61791 2250798 2369377 2499701 2643216 2801651 2976886 3171076 3386590 3625545 3889669
61782 3889669 4180838 4501496 4854179 5240654 5661705 6117372 6606739 7127182 7673884
61773 7673884 8239700 8814703 9385430 9934909 10443917 10892528 11261205 11531938 11690103
61764 11690103 11726458 11638335 11429884 11111722 10699806 10213345 9672624 9097616 8507109 7917539
61754 7917539 7341884 6789693 6268022 5781830 5333459 4922559 4547295 4205813 3896505
61745 3896505 3617363 3365726 3138808 2934219 2749892 2583780 2433798 2298048 2174966
61736 2174966 2063205 1961397 1868151 1782373 1703499 1631271 1565376 1505451 1451224 1402229 1357420
61725 1357420 1315532 1276006 1239133 1205172 1173847 1144931 1118678 1095049 1072943 1050992 1028979
61714 1028979 1007768 987956 969335 951755 935643 921264 908071 895235 882369 869356 855969
61703 855969 842261 829041 817275 807025 797476 788017 778811 770225 762152 754209 746318 738774 731765
61690 731765 725022 718046 710559 702682 694729 686963 679583 672752 666388 659996 653033 645577 638364 631998
61676 631998 626271 620463 614121 607376 600623 594252 588641 584085 580502 577279 573650 569399 565181 561946
61662 561946 559894 558171 555819 552892 550303 548711 547987 547774 547943 548297 548407 548103 547706 547373 546607 544955
61646 544955 542815 541010 539806 538989 538622 538943 539510 539274 537827 535996 534839 534434 534002 532966 531592 530663
61630 530663 530633 531055 530923 529770 528259 527386 527276 527232 526816 526230 525600 524582 522918 520805 518384 515397 511701
61613 511701 507711 503919 500297 496509 492411 488090 483805 480164 477885 476936 476239 474686 472160 469211 466252
61598 466252 463577 461734 461108 461271 461390 461191 460992 460950 460929 461069 461753 462938 464116 465082 466292 468320 471368
61581 471368 475327 479886 484557 489135 494202 500645 508516 516947 525370 534266 544445 556189 569449
61568 569449 584307 600702 618004 635401 652529 669406 685994 702195 718050 733589 748604
61557 748604 762846 776305 789144 801582 814041 826933 839961 852063 862548 872002 881483 891128
61545 891128 900219 908421 916082 923221 929039 932770 934420 934306 932346 928285 922329 915097 907148 898940
61531 898940 891062 884059 877958 872265 866559 861023 856421 853662 853304 855345 859446 865382 873175 882840
61517 882840 894301 907769 924035 944043 968216 996418 1028593 1065143 1106591 1153177 1205050
61506 1205050 1262753 1327221 1399203 1478904 1566318 1661744 1765668 1878131 1998418 2125439
61496 2125439 2258057 2394730 2532951 2669328 2800153 2921594 3029490 3119617 3188676 3234943
61486 3234943 3257929 3257766 3235316 3192661 3133005 3059929 2976823 2886892 2793333 2699348 2607885 2521118
61474 2521118 2439938 2364149 2293531 2228664 2170409 2118789 2072948 2032244 1996803 1966819 1941913
61463 1941913 1921544 1905668 1894542 1888253 1886843 1890547 1899306 1912256 1928319 1947227 1969324 1994384
61451 1994384 2021338 2049410 2078801 2109877 2142186 2174836 2207518 2240565 2274139 2307849 2341164
61440 2341164 2373809 2405774 2437244 2468491 2499397 2529008 2555904 2579268 2599410 2617076 2632415
61429 2632415 2644828 2653672 2658880 2660841 2659889 2656031 2649165 2639433 2627333 2613520 2598465 2582160 2564108
61416 2564108 2543771 2521262 2497546 2473758 2450386 2427396 2405070 2384193 2365258 2348006 2332133
61405 2332133 2318014 2306128 2296000 2286391 2276531 2266554 2256601 2246204 2234979 2223483 2212851 2203799
61393 2203799 2196432 2190947 2188049 2188605 2193254 2202575 2217418 2238872 2267944 2305420 2352006 2408480 2475578
61380 2475578 2553761 2643074 2743195 2853541 2973351 3101799 3238049 3380965 3528535 3677553
61370 3677553 3823936 3963280 4091133 4203158 4295673 4366283 4413871 4437927 4438111 4414549 4368250
61359 4368250 4301007 4214942 4112257 3995308 3866747 3729530 3586641 3440646 3293488 3146876
61349 3146876 3002813 2863426 2730231 2603867 2484700 2373351 2270491 2176436 2091326 2015432
61339 2015432 1948920 1891358 1841847 1799638 1764439 1736148 1714534 1699165 1689441 1684789 1685060 1690623
61327 1690623 1701715 1717713 1737374 1759843 1785048 1813035 1843312 1875142 1908119 1942045 1976275
61316 1976275 2009526 2040416 2068064 2092204 2112868 2129965 2143129 2152035 2156961 2158958 2159309 2158803 2157582
61303 2157582 2155488 2152368 2148062 2142422 2135400 2126924 2116687 2104308 2089846 2073888 2056903 2038743
61291 2038743 2019061 1998051 1976382 1954452 1932134 1909378 1886618 1864359 1842680 1821523 1801272
61280 1801272 1782666 1766102 1751264 1737488 1724385 1712169 1701477 1692719 1685412 1678296 1670275 1661080
61268 1661080 1650795 1639030 1625008 1608391 1589640 1569677 1549651 1530942 1514748 1501540 1491382
61257 1491382 1484951 1483693 1488791 1500488 1518702 1543716 1575827 1614830 1660376 1712501 1771188 1835625
61245 1835625 1904424 1976428 2050759 2126104 2200413 2271228 2335957 2391924 2436669 2468247 2485060
61234 2485060 2485656 2469309 2436749 2389904 2330980 2262254 2186526 2106930 2026009 1945439 1866767 1791790
61222 1791790 1721852 1657196 1597232 1541100 1487843 1436669 1387582 1341532 1299576 1262047 1228726
61211 1228726 1199502 1174512 1153864 1137551 1125433 1117106 1111913 1109385 1109392 1111608 1115029 1118307 1120446
61198 1120446 1120981 1119864 1117499 1114618 1111616 1108106 1103482 1097763 1091414 1084386 1075922 1065379 1052831 1038747
61184 1038747 1023563 1007845 992431 977810 963424 948048 931111 913433 896405 880538 865154
61173 865154 849575 834250 820349 808420 798012 788629 780468 773901 768702 764370 760932 758796 757728
61160 757728 756443 753358 747485 738575 726797 712545 696314 678465 659167 638684 617635 596859
61148 596859 577111 558942 542727 528582 516296 505483 495908 487588 480573 474709 469757 465704 462812
61135 462812 461318 461176 462208 464346 467535 471503 475910 480776 486522 493493 501618 510542 519953 529693
61121 529693 539682 549776 559609 568727 577140 585551 594521 603382 610496 614749 616305 615773 613305 608916
61107 608916 603038 596168 588375 579750 570935 562586 554603 546537 538451 530690 523117 515433 508048 501624
61093 501624 495731 489015 480949 472512 464788 457807 451173 444973 439372 434031 428680 423749 419683 416101
61079 416101 412459 409207 407407 407259 407817 408213 408511 409181 410370 411922 413662 415408 417037 418735 420958
61064 420958 423946 427506 431330 435259 439160 442753 445764 448137 450071 451995 454451 457673 461176 464097
61050 464097 466168 468213 471479 476538 482995 490098 497310 504305 510817 516870 523109 530569 539915 550998
61036 550998 563239 576263 589974 604264 619091 634882 652413 672122 693808 717181 742453
61025 742453 770095 800198 832326 865902 900606 936513 973971 1013251 1054343 1097384 1143455
61014 1143455 1194605 1252805 1319122 1394045 1478242 1572822 1679599 1802047 1946020 2119254
61004 2119254 2330452 2589191 2905686 3289094 3746233 4283877 4913414 5652661 6522964
60995 6522964 7545548 8738608 10108415 11629492 13225305 14772200 16134850 17212158
60987 17212158 17962583 18400572 18582566 18597843 18554267 18542710 18591309 18646096 18598918 18341337
60977 18341337 17804314 16967158 15850681 14511589 13035972 11522529 10059025 8706199
60969 8706199 7496469 6441615 5540469 4783633 4156587 3642170 3222425 2880022 2599467
60960 2599467 2367724 2174208 2010527 1870143 1747820 1639323 1541745 1453733 1374683 1303506
60950 1303506 1238529 1178621 1123879 1074861 1031340 991937 954843 918806 883637 849878 817948
60939 817948 787718 758995 732166 707911 686340 666838 648819 632207 617041 603030 589813
60928 589813 577374 565903 555353 545356 535556 525829 516294 507176 498657 490764 483487 476945 471256
60915 471256 466180 461083 455443 449255 442885 436674 430860 425757 421788 419260 418107 417858 417830 417476 416588
60900 416588 415263 413783 412587 412134 412471 413042 413292 413481 414487 416620 418992 420408 420628 420483 420929 422352
60884 422352 424587 427153 429419 430983 432032 433032 433945 434029 432634 429963 426849 423940 421364 418990 416646
60869 416646 414068 410990 407463 403916 400787 398267 396485 395664 395840 396628 397637 399108 401766 405932 411102
60854 411102 416546 422015 427629 433292 438698 443879 449414 455849 463039 470218 476717 482530 488172 493907
60840 493907 499256 503456 506460 509234 512792 517091 521161 524286 526707 529113 531749 534228 536083 537296
60826 537296 538291 539454 540687 541500 541641 541492 541661 542190 542436 541780 540230 538194 535810 532663 528122 521981
60810 521981 514877 508007 502181 497101 491756 485553 478876 472552 467122 462711 459231 456406 453843 451391
60796 451391 449344 448083 447636 447749 448204 448865 449583 450314 451246 452575 454291 456395 459156 462843 467227 471670
60780 471670 475652 478978 481618 483750 485959 488920 492694 496680 500406 504050 507993 512208 516463 520854
60766 520854 525731 531160 536871 542756 549000 555515 561574 566390 570004 573266 576881 580680 583960 586292
60752 586292 587762 588543 588599 587877 586567 585010 583406 581695 579653 577073 573941 570446 566695 562452 557428
60737 557428 551844 546430 541692 537403 533039 528486 524100 520239 517043 514483 512313 510037 507273 504162
60723 504162 501113 498204 495104 491604 487864 484076 480178 476076 471849 467598 463273 458837 454520 450794
60709 450794 448101 446575 445910 445538 445122 444853 445075 445744 446505 447208 447953 448654 449000 448935 448695 448236 447091 445027
60691 445027 442347 439194 435040 429445 423007 416892 411529 406354 400864 395320 390205 385421 380380 374700
60677 374700 368655 363039 358637 355619 353438 351470 349733 348743 348730 349401 350453 351891 353599 355099 356151
60662 356151 357353 359657 363334 367779 372284 376634 380933 385232 389579 394060 398544 402536 405657 408245
60648 408245 411145 414827 418914 422715 426020 429095 432040 434601 436800 439427 443446 448921 454900 460482
60634 460482 465716 471189 477031 482767 488141 493589 499674 506352 513118 519653 525939 531812 536833 540798
60620 540798 544069 547128 549929 551860 552360 551512 550123 549224 549319 549939 550052 549013 547016 544535 541590 537816
60604 537816 533070 527628 521768 515451 508487 500878 492995 485533 479193 474234 470398 467445 465534 464770
60590 464770 464586 464123 463259 462734 463160 464384 466034 468134 470817 473876 477020 480288 483728 486933 489391
60575 489391 491158 492661 493898 494350 493793 492748 491913 491433 490976 490306 489549 488895 488217 487127 485487 483775
60559 483775 482655 482172 481714 480977 480576 481271 482917 484767 486791 490065 495676 503650 513217 523801 535592
60544 535592 549390 566132 586395 610137 636807 665634 695627 725455 753583 778533 798805
60533 798805 812763 819154 817859 809804 796144 777991 756853 734601 712637 691618 672302 656017
60521 656017 643743 635150 629213 625444 623909 624292 625720 627549 629747 632511 636133 641287 648822 659029
60507 659029 671669 686951 705953 729658 757974 790164 825945 865758 910077 958832 1011406
60496 1011406 1066879 1124362 1183470 1244587 1308623 1376725 1450478 1532296 1625195 1732073 1855242
60485 1855242 1996380 2156256 2333891 2525727 2725342 2923710 3109833 3271787 3398049
60476 3398049 3478763 3506812 3478769 3395615 3262752 3089248 2886633 2667387 2443088 2222809
60466 2222809 2012782 1817306 1639516 1481105 1341875 1220318 1114756 1023717 945465 877850
60456 877850 818896 767197 721699 681547 646391 616321 591059 569443 550134 532623 517100
60445 517100 503450 490988 479281 468674 459693 452234 445670 439554 433817 428330 422669 416569 410389
60432 410389 404792 399950 395265 390090 384558 379415 375136 371578 368567 366392 365409 365413 365824 366303 366826 367311
60416 367311 367673 368244 369579 371689 373889 375689 377487 380077 383742 388103 392696 397336 402010 406701 411371
60401 411371 416024 420733 425641 430800 436041 441171 446323 451777 457346 462300 466191 469453 472794 476238
60387 476238 479140 481018 481943 482170 481872 481334 480967 480870 480621 479770 478423 477160 476359 475677 474268 471602 468129
60370 468129 465000 463004 461937 461165 460535 460344 460599 460852 460904 461160 462032 463374 464789 466222 467925 470027
60354 470027 472491 475303 478308 480943 482599 483350 484000 485215 486833 488224 489063 489457 489438 488751 487296 485522
60338 485522 484066 483049 481968 480306 478130 475980 474368 473543 473627 474721 476754 479341 481907 483991 485427
60323 485427 486230 486328 485576 484171 482902 482610 483313 484185 484636 485043 486052 487464 488396 488447 488033 487499 486570 484969
60305 484969 482941 480714 477953 474427 470949 468835 468404 468574 468068 466498 464129 461157 457636 453785 449949
60290 449949 446438 443626 442015 441815 442587 443675 444972 446959 449935 453485 456813 459451 461602 463976 467347
60275 467347 472010 477530 483116 488324 493296 498299 503290 508099 512818 517725 522886 528098 533224 538361
60261 538361 543642 549033 554427 559811 565310 571140 577485 584337 591485 598857 606881 616298 627569 640588
60247 640588 655094 671188 689349 709991 733083 758119 784530 812345 842461 876052 913653
60236 913653 955080 1000295 1049904 1104504 1163897 1227340 1294346 1364743 1438130 1513802 1591167
60225 1591167 1669623 1747787 1823315 1893877 1958127 2015524 2065496 2107089 2139314 2161623 2174161
60214 2174161 2177794 2173818 2163402 2147240 2125869 2100240 2071960 2042922 2014720 1988319 1964305 1943612
60202 1943612 1927945 1919239 1918623 1926102 1941294 1964139 1994792 2033295 2079725 2134328 2196965 2266533
60190 2266533 2341318 2419906 2501218 2583600 2664338 2740405 2809544 2870465 2922160 2963302 2992338
60179 2992338 3008105 3010372 2999763 2977173 2943353 2899150 2846024 2786073 2721544 2654520 2587040
60168 2587040 2521256 2459267 2402862 2353408 2311870 2278908 2255089 2241041 2237268 2243850 2260367 2286026
60156 2286026 2319623 2359500 2403859 2451061 2499305 2546110 2588734 2625348 2655400 2678584 2694002
60145 2694002 2700827 2699388 2690962 2676659 2657191 2633716 2608236 2582986 2559983 2541399 2529739 2527006
60133 2527006 2533803 2549776 2574969 2610565 2658405 2720066 2796350 2887271 2992414 3111551 3245085
60122 3245085 3393825 3558200 3737710 3931114 4136946 4353632 4579091 4810271 5043171
60113 5043171 5273363 5496582 5708871 5906334 6084939 6240756 6370326 6470790 6539798 6575648
60103 6575648 6577624 6546085 6482180 6387651 6265030 6117812 5950144 5766411 5571309 5370197
60093 5370197 5168772 4971997 4783367 4605355 4440390 4291102 4159657 4047172 3953828 3879299
60083 3879299 3823004 3784236 3762423 3757174 3767830 3792903 3830037 3876507 3929613 3986670 4044811
60072 4044811 4100983 4152153 4195603 4229142 4251174 4260665 4257184 4240970 4212750 4173208 4122637 4061250
60060 4061250 3989818 3909808 3822865 3730377 3633641 3534266 3434235 3335563 3239941 3148652 3062773
60049 3062773 2983490 2912204 2850249 2798543 2757605 2727869 2709748 2703436 2708936 2726396 2756111 2797919
60037 2797919 2850799 2913308 2984257 3062627 3146861 3234538 3322796 3408860 3490065 3563585 3626374
60026 3626374 3675561 3709037 3725810 3725743 3709015 3675944 3627299 3564477 3489237 3403552 3309966 3211694
60014 3211694 3111938 3013186 2917498 2827147 2744347 2670378 2605594 2550491 2506225 2473907 2453826
60003 2453826 2445750 2449624 2465654 2493925 2534283 2586518 2650518 2726330 2813982 2912803 3020790
59992 3020790 3134994 3252680 3371660 3489316 3601952 3705669 3797527 3875465 3937544 3982017
59982 3982017 4007909 4014847 4002440 3970562 3920275 3853895 3774082 3683398 3584788 3481793 3377921
59971 3377921 3276244 3179681 3091079 3012578 2945226 2889569 2846383 2816542 2800428 2797736 2807669
59960 2807669 2829166 2861204 2903160 2954677 3015031 3082840 3156523 3234672 3315675 3397363 3477414
59949 3477414 3553865 3624889 3688427 3742684 3786962 3821546 3846860 3863316 3872061 3875221 3874962 3872674
59937 3872674 3869528 3867735 3870829 3882657 3906198 3943370 3995662 4064778 4152675 4261024 4390594
59926 4390594 4541053 4711321 4900101 5105947 5326626 5558338 5795588 6031876 6260443
59917 6260443 6474440 6666759 6830230 6958224 7045201 7087076 7081742 7029597 6933526 6798217
59907 6798217 6629500 6434153 6219774 5994247 5765034 5538665 5320518 5114756 4924505
59898 4924505 4752174 4599547 4467665 4356920 4267463 4199406 4152579 4126400 4120146 4133136 4164457
59887 4164457 4212798 4276709 4354692 4444618 4543275 4646909 4752095 4855599 4953514 5041026 5113228
59876 5113228 5165923 5195733 5200044 5177316 5127410 5051574 4952248 4832811 4697138 4549238 4393444
59865 4393444 4234701 4077933 3926624 3782284 3645522 3517242 3398357 3288805 3187612
59856 3187612 3093963 3007562 2927848 2853653 2784230 2720276 2663387 2614544 2573485 2539379 2511554
59845 2511554 2489514 2472794 2461013 2453587 2449024 2444924 2439233 2431400 2421877 2410695 2397126 2380724
59833 2380724 2361914 2341184 2318244 2292499 2264078 2233862 2202632 2170630 2137992 2105184 2073060
59822 2073060 2042755 2015610 1992756 1974509 1960358 1949773 1943038 1941213 1945306 1955491 1971038 1990925
59810 1990925 2014452 2041251 2070744 2101764 2132818 2162555 2189872 2213774 2233516 2248881 2260135
59799 2260135 2267712 2272218 2274780 2277067 2280733 2286904 2296316 2309852 2328814 2354806 2389548 2434817 2492371
59786 2492371 2563733 2650004 2751972 2870517 3006831 3162078 3336730 3530195 3740835 3965836
59776 3965836 4200546 4437762 4667486 4877237 5053086 5181729 5253283 5263335 5213083 5108189
59766 5108189 4957729 4773424 4568342 4355070 4144431 3945040 3762968 3601226 3460082
59757 3460082 3338669 3236616 3154096 3090572 3043990 3011484 2990815 2981047 2982009 2993343 3014241
59746 3014241 3043952 3082269 3129501 3186262 3253435 3331999 3422466 3524569 3637921 3763090 3901780
59735 3901780 4055944 4226961 4415727 4623201 4850657 5099558 5371212 5666310 5984653
59726 5984653 6325405 6687547 7069653 7468966 7880854 8299344 8718036 9130579 9530852
59717 9530852 9913444 10274255 10610757 10922025 11209050 11475105 11725408 11965923 12201998
59708 12201998 12437677 12675701 12917561 13163088 13409895 13653438 13887967 14107608 14306762
59699 14306762 14480114 14623050 14732387 14806617 14845615 14850735 14825433 14775365 14707449 14628973 14547694
59688 14547694 14472099 14410663 14370605 14357799 14377941 14437242 14541480 14694519 14898030 15152431
59678 15152431 15457487 15811698 16211396 16650840 17123015 17619706 18130422 18641452 19136186
59669 19136186 19596244 20002411 20335516 20577901 20715139 20737130 20638665 20420306 20089256 19658921
59659 19658921 19146961 18573195 17958218 17322255 16683722 16057978 15456498 14886024 14347716
59650 14347716 13837287 13346370 12864177 12379026 11880588 11362750 10825135 10272037 9710347
59641 9710347 9148558 8596427 8063651 7557904 7083986 6644502 6240652 5872439 5538865
59632 5538865 5238293 4968546 4726807 4510019 4315569 4141377 3985435 3845840 3721378
59623 3721378 3611519 3515511 3431771 3358432 3294200 3238383 3190195 3148294 3111041 3077115 3045783
59612 3045783 3016444 2987967 2958773 2927712 2894485 2858859 2819866 2776423 2728632 2677828 2625358
59601 2625358 2571916 2518133 2465079 2413798 2364815 2318480 2275386 2236109 2200860 2169680 2142661
59590 2142661 2119688 2100317 2084297 2071873 2063195 2057745 2054873 2054677 2057741 2064008 2072515 2082436 2093966
59577 2093966 2107869 2124345 2142687 2162020 2182188 2203748 2227148 2252260 2279000 2308196 2341308
59566 2341308 2379113 2421183 2466998 2517136 2572917 2635167 2703947 2779325 2861788 2951817 3049651
59555 3049651 3155620 3270193 3393347 3524264 3661964 3805904 3955576 4109733 4266455
59546 4266455 4423881 4580427 4734208 4882485 5021659 5147576 5256048 5343807 5409604 5454371
59536 5454371 5480138 5488748 5481483 5459456 5423935 5376428 5318877 5253750 5183586 5110461 5036306 4963911
59524 4963911 4897171 4840024 4795412 4765502 4752517 4758796 4786115 4835439 4907327 5001966 5118505
59513 5118505 5254527 5406291 5569183 5737735 5905510 6065286 6209488 6330569 6421481 6476331
59503 6476331 6490914 6462966 6392345 6281172 6133488 5954474 5750004 5526846 5292633 5054945
59493 5054945 4820190 4593471 4379160 4180988 4001406 3841279 3700586 3579400 3478108
59484 3478108 3396863 3335064 3291466 3264776 3254189 3259432 3280355 3316522 3367147 3431256 3507752
59473 3507752 3595407 3692890 3798803 3911418 4028262 4145981 4260708 4368577 4465932 4549202
59463 4549202 4614881 4659843 4681879 4679871 4653431 4602479 4527414 4429753 4312381 4178980 4033218
59452 4033218 3878520 3718317 3556077 3394873 3236997 3084050 2937342 2798091 2667265
59443 2667265 2545301 2432066 2327197 2230539 2142223 2062293 1990363 1925730 1867787 1816144 1770407
59432 1770407 1730009 1694410 1663402 1637123 1615724 1599021 1586431 1577270 1571100 1567848 1567667 1570708
59420 1570708 1576923 1585879 1596667 1608016 1618563 1627046 1632473 1634499 1633760 1631638 1629525 1628438 1629413 1633778
59406 1633778 1642463 1655067 1670041 1685890 1701872 1717577 1732482 1746369 1759898 1774345 1790887
59395 1790887 1810460 1834161 1863278 1898790 1941050 1990016 2045572 2107673 2176592 2253154 2338455
59384 2338455 2433215 2537700 2652431 2778596 2917455 3069718 3236087 3418279 3618954 3840461
59374 3840461 4083988 4350000 4638977 4951300 5286545 5643031 6017728 6406203 6802776
59365 6802776 7201102 7594918 7978467 8346715 8695540 9021752 9322861 9597011 9843345
59356 9843345 10062083 10253702 10417809 10552783 10656180 10725038 10755814 10744560 10687515 10581609
59346 10581609 10424747 10216309 9957828 9653172 9308114 8929970 8527483 8110305 7687902
59337 7687902 7268802 6860688 6470450 6103412 5762498 5448552 5161534 4901249 4667124
59328 4667124 4457850 4271516 4106024 3959406 3830086 3716982 3619104 3534893 3462091 3398490
59318 3398490 3342749 3294241 3252211 3215315 3182062 3151432 3122786 3095365 3068175 3040482 3012166
59307 3012166 2983509 2954884 2926806 2899974 2874908 2851671 2830304 2811395 2795804 2783875 2775462
59296 2775462 2770853 2771101 2776958 2787768 2801820 2817682 2835006 2854335 2876643 2902978 2934113 2970404
59284 2970404 3012238 3060528 3116361 3179959 3250180 3325113 3402971 3482396 3562176 3640902 3716790
59273 3716790 3787710 3851502 3906344 3950737 3983133 4001902 4005955 3995315 3970861 3933573 3884243
59262 3884243 3823927 3754368 3677712 3595806 3509932 3421121 3330485 3239076 3147640 3056776 2967414
59251 2967414 2880910 2798530 2720901 2648044 2579853 2516404 2457859 2404222 2355308 2310971 2271349
59240 2271349 2236836 2207748 2184075 2165699 2152826 2145960 2145441 2151267 2163594 2183110 2210614 2246385
59228 2246385 2290456 2343571 2407525 2484332 2575296 2681011 2802000 2939070 3093150 3265023
59218 3265023 3455113 3663193 3888133 4127969 4379966 4640204 4903037 5161342 5407603
59209 5407603 5634581 5834862 6000462 6123922 6200169 6226952 6203475 6129451 6006225 5838435
59199 5838435 5633777 5400961 5148249 4883581 4614913 4349562 4093318 3850428 3624045
59190 3624045 3416260 3227935 3059026 2909130 2777523 2662830 2563176 2476920 2403141 2341365
59180 2341365 2290863 2250219 2217479 2190709 2168468 2149780 2133813 2119864 2107747 2097925 2091040 2087349
59168 2087349 2086605 2088214 2091364 2095442 2100582 2107482 2116189 2125280 2132815 2138087 2141923 2145220 2147746 2148634
59154 2148634 2147483 2144466 2139603 2132499 2122909 2111173 2097852 2083089 2066599 2048385 2029317 2010833
59142 2010833 1994004 1978899 1964887 1951435 1938674 1927313 1918158 1911655 1907831 1906691 1908541 1913711
59130 1913711 1921949 1932435 1944640 1958977 1976386 1997468 2022237 2050580 2082588 2118482 2158455
59119 2158455 2202512 2250241 2300808 2353441 2407871 2464071 2521649 2579778 2637651 2694690 2750362
59108 2750362 2804181 2855951 2905619 2952782 2996726 3037258 3075362 3112770 3150812 3189679 3228711
59097 3228711 3267356 3305840 3344873 3384762 3424993 3464622 3502542 3537018 3565373 3584784 3593339
59086 3593339 3589872 3572950 3540780 3492325 3428012 3349239 3257740 3155571 3045123 2928637 2807953
59075 2807953 2684898 2561495 2439521 2320273 2205081 2095650 1993393 1898677 1811064 1730115
59065 1730115 1655572 1587074 1524168 1466556 1414043 1366304 1322918 1283442 1247213 1213398 1181672
59054 1181672 1152578 1126704 1103691 1082539 1062843 1045148 1030051 1017474 1006956 998158 990850 984765
59042 984765 979747 975810 972788 970132 967296 964220 961248 958667 956429 954245 951864 949327 946990 945285
59028 945285 944455 944598 945803 948005 950736 953357 955623 957736 959790 961602 963320 965825 970038 975926 982578
59013 982578 989250 996049 1003585 1012280 1022111 1032672 1043346 1053647 1063534 1073160 1082173 1089603 1094738
59000 1094738 1097849 1099666 1100329 1099316 1096315 1091597 1085511 1078246 1070334 1062778 1056175 1050158 1044271 1039044
58986 1039044 1035498 1033746 1032856 1032222 1032327 1033817 1036411 1039229 1041853 1044572 1047701 1051094 1054367 1057343 1060216
58971 1060216 1063434 1067514 1072935 1080182 1089615 1101007 1113312 1125394 1137167 1149643 1163645 1178802
58959 1178802 1194096 1208953 1223403 1237508 1251312 1265275 1280053 1295664 1311344 1326537 1341679
58948 1341679 1357695 1375000 1393322 1412436 1432623 1454331 1477667 1502439 1528570 1556290 1586009
58937 1586009 1618154 1653054 1690720 1730816 1773191 1818507 1867889 1921678 1979001 2038971 2101970
58926 2101970 2169055 2240363 2315005 2392691 2474663 2562618 2657316 2758827 2867718 2985470 3113925
58915 3113925 3254648 3408554 3575751 3756002 3949690 4158130 4382584 4623375 4880442
58906 4880442 5154375 5446129 5755770 6082047 6423058 6776654 7140009 7509319 7880043
58897 7880043 8247013 8604156 8944540 9260891 9545889 9792132 9992532 10141225 10234038 10268142
58887 10268142 10241809 10154937 10009749 9810926 9565169 9280448 8965084 8627009 8273719 7912503
58877 7912503 7550134 7192177 6842848 6505512 6182781 5876068 5585621 5311376 5053453
58868 5053453 4811669 4585110 4372657 4173666 3987826 3814742 3654023 3505429 3368416
58859 3368416 3241801 3124346 3015533 2915256 2823021 2738064 2660198 2589777 2526658 2469806
58849 2469806 2418278 2372076 2331630 2296855 2267229 2242605 2223345 2209582 2200764 2196020 2194747 2196718
58837 2196718 2201917 2210431 2222331 2237534 2255929 2277788 2303849 2334771 2370621 2411113 2456259 2506500
58825 2506500 2562288 2623927 2691921 2767032 2849715 2939794 3037038 3141984 3255823 3379558 3513591
58814 3513591 3658199 3814122 3982625 4165226 4363483 4578732 4811662 5062104 5329439
58805 5329439 5613333 5914036 6231822 6565909 6913713 7271009 7632677 7993173 8346331
58796 8346331 8685114 9001887 9288986 9538948 9744433 9898563 9995832 10032981 10009254 9926114
58786 9926114 9786876 9596473 9361336 9089180 8788505 8467797 8134765 7795890 7456215
58777 7456215 7119244 6787136 6461186 6142235 5830731 5526908 5231386 4945597 4671338
58768 4671338 4410019 4162651 3930441 3714742 3516116 3333800 3166358 3012592 2871614
58759 2871614 2742426 2623983 2515598 2416848 2327033 2245116 2170325 2102507 2041595 1986975 1937642
58748 1937642 1892902 1852569 1816501 1784317 1755719 1730688 1708934 1689322 1670318 1651053 1631628
58737 1631628 1612358 1593098 1573431 1552988 1531350 1508006 1482864 1456549 1429854 1403056 1376072
58726 1376072 1348959 1321805 1294348 1266285 1237937 1210074 1183071 1156648 1130438 1104370 1078430
58715 1078430 1052616 1027282 1003101 980481 959397 939910 922404 907046 893433 881102 870073
58704 870073 860620 852729 846040 840016 833894 826784 818258 808663 798532 787789 775890 762690 748837
58691 748837 735320 722843 711629 701627 692843 685570 680184 676637 674363 672995 673115 675997 682504
58678 682504 692430 704952 719547 736341 755715 777806 802456 829522 858971 890577 923641 957158
58666 957158 990169 1021663 1050070 1073014 1087765 1092103 1085084 1067369 1040934 1008234 971426 932258
58654 932258 892407 853544 816992 783554 753739 727948 706371 688843 674928 664115 655962 650235
58642 650235 646827 645414 645327 646066 647858 651339 656656 663159 670016 676853 683826 691402 700130 710328 721962
58627 721962 735062 750112 767595 787327 808802 832144 858054 886790 917997 951771 988978
58616 988978 1030091 1074549 1121987 1173498 1230859 1294843 1365021 1440852 1522117 1608435 1699257
58605 1699257 1794480 1894424 1998811 2106066 2213607 2318448 2417519 2507889 2586977 2652470
58595 2652470 2702060 2733508 2745083 2736027 2706923 2659784 2597555 2523101 2438725 2346688 2249737
58584 2249737 2150705 2051854 1955065 1862319 1775322 1694790 1620716 1553318 1493097 1439962 1392978
58573 1392978 1351231 1314444 1282547 1255120 1231613 1211791 1195558 1182576 1172312 1164400 1158638 1154566
58561 1154566 1151165 1147122 1141521 1134366 1126275 1117567 1107815 1096446 1083545 1069719 1055189 1039290 1020890
58548 1020890 999196 974295 947152 919048 890810 862592 834490 807129 781466 758193 737548
58537 737548 719425 703387 688822 675437 663462 653055 643821 635254 627300 619932 612583 604732 596894
58524 596894 590192 584883 580041 574781 569079 563254 557461 552037 547626 544420 541789 539170 536895 535637
58510 535637 535391 535568 535892 536591 537818 539431 541430 544082 547403 550813 553609 555652 557330 558972 560604
58495 560604 562414 565076 569205 574540 580105 585268 590224 595269 600128 604321 607744 610345 611652 611340
58481 611340 610050 608833 607678 605268 600414 593297 585178 577329 570389 564307 558600 552834 546963 541125
58467 541125 535345 529830 525275 522192 520039 517677 514731 511812 509369 507122 504833 502745 500838 498438
58453 498438 495187 491767 489013 486791 484453 482080 480544 480461 481637 483465 485442 487368 489409 491876 494709
58438 494709 497390 499670 502035 505009 508214 510651 511791 511941 511604 510956 509974 508675 507175 505815 505281
58423 505281 506253 508787 512189 515602 518623 521387 524203 527141 529954 532416 534810 538020 542961 549790
58409 549790 557544 564584 569785 573627 577885 583732 590245 595406 598532 600922 603894 607115 609496 610987
58395 610987 612539 614653 616975 619228 621648 624297 626716 628650 630561 633016 635879 638522 640595 642158
58381 642158 643170 643292 642436 641299 641082 642550 645428 648763 651766 654251 656406 658475 660720 663465 666975
58366 666975 671302 676236 681373 686281 690859 695559 701010 707340 714018 720444 726555 732759 739423 746471
58352 746471 753457 760056 766545 773582 781316 788975 795739 801817 808117 814938 821619 827575 833037 838500
58338 838500 844071 849725 855746 862442 869700 877276 885302 894125 903747 913758 923765 933703 943762
58325 943762 954163 965021 976355 988234 1000746 1013683 1026484 1038868 1051326 1064591 1078709
58314 1078709 1093030 1106922 1120037 1132151 1143431 1154687 1166593 1178764 1190441 1201960 1214496
58303 1214496 1228327 1242550 1256772 1271768 1287961 1304562 1321066 1338541 1358339 1380299 1403195
58292 1403195 1426375 1450003 1474235 1499166 1525217 1552659 1581036 1609785 1639185 1670071 1702923
58281 1702923 1737815 1774811 1813743 1854056 1895536 1938665 1983619 2029444 2075033 2120372 2165982
58270 2165982 2211601 2256344 2299765 2341915 2382723 2422249 2461248 2500630 2540664 2581480 2623956
58259 2623956 2669220 2717619 2769001 2823603 2881799 2943402 3008216 3076942 3150624 3229480 3313144
58248 3313144 3401625 3495127 3593347 3696037 3803893 3917971 4038580 4165705 4300013 4442350
58238 4442350 4592715 4750891 4917678 5094351 5281372 5478859 5687887 5910104 6146530
58229 6146530 6398052 6666601 6954464 7262845 7592549 7945726 8325665 8735348 9177656
58220 9177656 9656461 10176095 10740471 11354434 12025374 12761895 13571789 14463407 15448590
58211 15448590 16542571 17762244 19127217 20662503 22398915 24373064 26631134 29233873
58203 29233873 32258018 35796892 39964529 44898320 50753089 57690855 65874529 75463865
58195 75463865 86611540 99469942 114211953 131038239 150138226 171607671 195341699
58188 195341699 220892886 247294816 272954763 295786428 313627503 324753184 328223179
58181 328223179 323968366 312708710 295790562 274933535 251891412 228143567 204752282
58174 204752282 182395113 161469025 142182031 124623659 108823734 94783632 82470117
58167 82470117 71796975 62626206 54790676 48118851 42449419 37636673 33550550 30074728
58159 30074728 27106501 24558704 22359921 20451675 18785690 17322763 16031102 14883746
58151 14883746 13857572 12933942 12098089 11337207 10640297 9999697 9410660 8868699 8368685
58142 8368685 7906671 7480735 7089171 6729205 6398108 6094072 5814964 5557305 5317424
58133 5317424 5092831 4881749 4682158 4492196 4311015 4138536 3974682 3819259 3672130
58124 3672130 3533093 3401831 3278146 3161823 3052151 2948101 2849063 2754900 2665282 2579706
58114 2579706 2498243 2421472 2349356 2280901 2215255 2152528 2093118 2036870 1983361 1932567 1884716
58103 1884716 1839767 1797369 1757147 1718806 1682155 1647182 1613880 1581938 1550929 1520784 1491618
58092 1491618 1463005 1433999 1404162 1374155 1345019 1317139 1290152 1263562 1237122 1210809 1184696
58081 1184696 1158773 1132850 1106821 1081092 1056460 1033410 1011706 990812 970536 951243 933597
58070 933597 918104 904644 892394 880463 868691 857653 847849 839125 830953 822991 815214 807632 800045
58057 800045 792067 783491 774614 766038 757948 749806 740992 731592 722275 713610 705893 699376 694116 689596
58043 689596 685034 680203 675580 671662 668504 665959 663915 662155 660388 658540 656694 654624 651797 647991
58029 647991 643571 638965 634186 629058 623552 617709 611482 604888 598059 591024 583716 576365 569529 563525
58015 563525 558127 553095 548674 545230 542638 540414 538321 536506 535161 534415 534486 535581 537619 540361 543874
58000 543874 548569 554674 561900 569744 577838 585838 593213 599537 604988 610216 615587 620711 624820 627417
57986 627417 628408 627868 626015 623280 620010 616056 611084 605373 599948 595699 592663 590400 588723 587778 587698
57971 587698 588525 590286 592768 595392 597591 599137 599779 598883 595923 591148 585208 578269 570059 560691 550819
57956 550819 540968 531374 522593 515491 510376 506697 503950 502303 501953 502488 503427 504897 507080 509290 510406
57941 510406 510157 509319 508565 507745 506470 504843 503217 501603 499768 497810 496213 495296 494846 494401 493678 492576
57925 492576 490872 488199 484372 479557 473999 467694 460469 452284 443340 434038 425049 417299 411490 407551
57911 407551 404790 402690 401342 400982 401369 401879 402166 402529 403517 405223 407011 408098 408359 408304 408092 406949 404042
57894 404042 399734 395290 391283 386948 381461 375245 369458 364591 360195 355816 351505 347410 343515 340053
57880 340053 337737 337184 338335 340673 343825 347682 352150 357194 363087 370159 378072 385719 392222 397812
57866 397812 403305 408804 413483 416759 419066 421063 422492 422452 420590 417450 413622 409134 403790 397651 390975
57851 390975 384053 377278 371049 365458 360296 355483 351187 347511 344398 341931 340257 339117 337992 336900
57837 336900 336472 336885 337308 336921 335897 334741 333185 330561 326909 322740 317828 311295 303123 294651 287164
57822 287164 280630 274290 267915 261999 257176 253930 252501 252510 252945 253070 253215 254188 256040 257927 259126 259613
57806 259613 259589 259057 258232 258039 259731 264003 270622 278842 288103 298399 310116 323462 338016 352875
57792 352875 367272 380935 393757 405341 415048 422394 427116 428879 427237 422058 413852 403446 391398
57779 391398 377920 363380 348628 334654 321910 310134 298881 288135 278337 269841 262513 255964
57767 255964 250166 245621 242807 241456 240597 239424 238070 237343 237724 238838 240061 241481 243827 247416 251496
57752 251496 254997 257698 260309 263465 267093 270844 274674 278732 283003 287439 292208 297355 302352 306406
57738 306406 309273 311354 312918 313671 313290 312115 311052 310935 312107 314409 317361 320482 323634 327034 330910
57723 330910 335322 340309 345922 351848 357348 361891 365751 369645 373926 378493 383420 389223 396283 404330
57709 404330 412714 421077 429592 438681 448643 459507 471084 483217 496123 510501 527160 546395
57697 546395 567794 590712 615040 641469 671029 704426 741871 783488 829726 881298 938819
57686 938819 1002634 1073038 1150638 1236405 1331298 1435705 1549251 1671111 1800428 1936362
57676 1936362 2077874 2223670 2372326 2522243 2671440 2817553 2957910 3089022 3205423
57667 3205423 3299043 3360267 3380410 3354111 3280508 3163151 3009256 2828682 2632661 2432171
57657 2432171 2236324 2051529 1881821 1729622 1595906 1479930 1379576 1292630 1217730 1154048
57647 1154048 1100446 1055357 1017396 985709 959777 939199 923668 912838 906121 902887 902973 906722
57635 906722 914371 925563 939728 956847 977647 1002911 1032759 1066735 1104617 1146919 1194460 1247557
57623 1247557 1305872 1369023 1437038 1510110 1588115 1670443 1755931 1842671 1928075 2009340 2083818
57612 2083818 2148891 2201889 2240478 2262979 2268157 2255129 2224027 2176540 2115258 2042554 1960506
57601 1960506 1871657 1779061 1685320 1592047 1500379 1411446 1326183 1245271 1169597 1100237 1037544
57590 1037544 980620 928203 879843 835787 796023 759969 727009 696823 669158 643716 620340
57579 620340 599061 579875 562644 547161 533090 519976 507651 496555 487243 479539 472559 465637
57567 465637 458896 452756 447323 442486 438326 434989 432303 429884 427648 425981 425369 426023 427854 430682 434367
57552 434367 438832 443995 449723 455952 462896 470995 480521 491309 503025 515604 529304 544448 561373
57539 561373 580506 602131 626067 651933 679835 710447 744310 781506 822237 867188 916785
57528 916785 970484 1027473 1087851 1152293 1220519 1290913 1361861 1432590 1502184 1568395 1628131
57517 1628131 1678684 1717938 1743884 1755002 1751257 1734035 1704928 1664969 1615066 1556590 1491385
57506 1491385 1421617 1349774 1278348 1209184 1143239 1080970 1022632 968254 917746 871206 828801
57495 828801 790361 755634 724985 699277 678711 662213 648285 636140 625837 617813 612616 610630
57483 610630 611589 614654 619280 625725 634428 645399 658669 674769 694113 716327 740936 768444 799955
57470 799955 835868 875755 919409 967180 1019208 1075082 1134386 1196770 1261278 1326289 1390325
57459 1390325 1452164 1509892 1560695 1602078 1632605 1651023 1655589 1645212 1620665 1583722 1535510
57448 1535510 1476678 1409032 1335869 1260453 1184835 1110186 1037452 967340 900331 837168 778859
57437 778859 725864 677647 633380 592745 555802 522460 492516 465889 442427 421612 402810
57426 402810 385660 369991 355512 341944 329260 317503 306508 296149 286646 278212 270539 263123
57414 263123 256111 250223 245632 241418 236512 230857 225297 220566 216770 213695 211131 208774 206146 202875
57400 202875 199028 195067 191482 188467 185913 183683 181831 180514 179730 179290 179056 179020 179063 178843 178092 176903
57384 176903 175539 174101 172592 171227 170351 170006 169838 169541 169201 169023 168927 168609 167982 167355 167118 167318 167579 167484
57366 167484 167039 166718 167019 167928 168918 169486 169656 169909 170661 171829 172902 173467 173652 174008 174907 176125 177119 177650
57348 177650 177995 178570 179535 180760 182045 183273 184429 185533 186567 187439 188053 188350 188274 187799 187085 186501 186332
57331 186332 186563 187134 188241 190099 192453 194675 196458 198098 200050 202497 205508 209181 213406 217738 221931
57316 221931 226383 231676 237725 243746 249146 254200 259708 266135 273191 280183 286714 293023 299673 307054
57302 307054 315329 324732 335562 347726 360585 373479 386278 399255 412675 426661 441229 456112
57290 456112 470706 484478 497375 509496 520471 529457 535731 539033 539354 536679 530977 522313 510990
57277 510990 497677 483198 467955 451801 434758 417573 401086 385284 369596 354083 339635
57266 339635 326904 315682 305550 296505 288624 281668 275470 270252 266110 262520 258883 255304 252388
57253 252388 250407 249125 248216 247463 246697 246002 245825 246403 247210 247491 247311 247542 248705 250290 251376 251496 250778
57236 250778 249728 249130 249728 251578 253925 256036 258010 260461 263612 267081 270467 273703 276794 279616 282254
57221 282254 285237 289061 293558 298042 302178 306414 311352 316959 322667 328152 333609 339268 345013 350669
57207 350669 356312 361998 367475 372531 377499 383034 389405 396266 403101 409678 416125 422859 430385 438805
57193 438805 447519 455667 462909 469517 475852 482182 488943 496568 504831 512898 520380 527932 536498 546298
57179 546298 556917 567964 579271 590787 602786 615837 630009 644446 658428 672637 688481
57168 688481 706187 724514 742599 761188 781457 803348 825777 848056 870347 892994 916178
57157 916178 940196 965430 991870 1019131 1046983 1075470 1104441 1133481 1162544 1192339 1223836
57146 1223836 1257536 1293327 1330840 1369799 1410165 1452065 1495561 1540573 1587200 1635968 1687415
57135 1687415 1741519 1797943 1856802 1918663 1983680 2051304 2121122 2193464 2268766 2346842 2427321
57124 2427321 2510453 2596828 2686545 2779335 2875454 2975758 3080845 3190807 3306137 3428351
57114 3428351 3559387 3700775 3853723 4019702 4200636 4398766 4616775 4858025 5126572
57105 5126572 5427202 5765762 6149578 6587697 7091348 7674749 8355509 9154033 10092517
57096 10092517 11194234 12482578 13978904 15699705 17654773 19847121 22273826 24926861
57088 24926861 27793809 30858358 34099812 37491071 40995585 44563818 48128343 51596540
57080 51596540 54843671 57714324 60040014 61671133 62509128 62522062 61738084 60226179 58077878
57071 58077878 55395857 52287102 48857806 45210633 41444922 37657223 33939014 30371671
57063 30371671 27021244 23934907 21139621 18643384 16439179 14510173 12833981 11385190
57055 11385190 10137126 9063579 8140109 7344474 6656750 6059698 5539026 5082975 4681543
57046 4681543 4326173 4009958 3727615 3474895 3247962 3043296 2858019 2690044 2537813
57037 2537813 2399838 2274463 2160025 2055212 1959328 1872267 1794330 1725939 1667306 1618171
57027 1618171 1578112 1547331 1527013 1518528 1522159 1536765 1560372 1590273 1622116 1649551 1665683 1665086
57015 1665086 1644342 1601505 1536615 1453309 1358957 1261924 1168302 1081066 1001524 930562 868529
57004 868529 814883 768609 728786 694582 664988 638949 615752 595136 576978 560957 546495
56993 546495 533035 520362 508623 497990 488376 479551 471486 464464 458932 455306 453695 453496 453281 451430
56979 451430 447093 440541 432617 424015 415004 405549 395597 385480 376171 368966 364625 362862 362777 363725 365701
56964 365701 369009 373812 380114 387988 397590 408795 420932 433021 444281 454180 461951 466373 466411 462000
56950 462000 453927 443023 429803 414939 399642 385255 372603 361888 353119 346493 342437 341330
56938 341330 343115 347170 352841 360248 370311 383680 399753 416899 433433 448027 459302 465637
56926 465637 465804 459681 448092 432013 412169 389393 365126 341195 319032 299134 281318 265353
56914 265353 251251 239035 228465 219131 210755 203410 197391 192805 189284 186194 183246 180774 179229
56901 179229 178552 178340 178570 179751 182230 185688 189596 193922 199092 205432 212940 221543 231275 242142 253990
56886 253990 266485 279008 290572 300054 306650 310040 310158 307052 301137 293471 285499 278418 272742 268471
56872 268471 265593 264332 265029 268007 273644 282403 294519 309694 327328 347056 368889 392772 418094
56859 418094 443493 466932 486043 498962 505077 504822 498721 487048 470604 451308 431538 413061
56847 413061 396896 383854 374682 369845 369709 374877 385811 402178 423181 448662 479291 515368
56835 515368 555836 598633 641416 681515 715644 740446 753449 753448 740344 715267 680815 640585
56823 640585 598133 556319 517314 482679 453279 429448 411421 399438 393488 393314 398832 410243
56811 410243 427523 450099 477097 507440 539206 569205 593925 611117 620122 620737 612398 594841
56799 594841 569120 537578 503020 468174 435430 406279 380971 359271 341585 328795 320948 316888
56787 316888 315604 317355 322909 332127 344003 357766 373082 389033 403591 414426 419916 419316 412552
56774 412552 400191 383314 363142 340936 318262 296715 277023 258800 241631 226066 213094
56763 213094 202853 194485 187134 180536 174638 169300 164573 160765 157907 155501 153089 150799 149017 147769
56749 147769 146744 145678 144347 142367 139538 136427 134064 132860 132171 131182 129858 128689 127741 126501 124673
56734 124673 122697 121237 120453 120022 119712 119632 119913 120399 120731 120641 120102 119262 118329 117475 116834 116556 116779 117405 117972
56715 117972 117929 117154 116141 115578 115780 116534 117390 117965 118055 117669 117073 116686 116794 117296 117790 117961 117881 117848 117981 118067
56695 118067 117962 118002 118804 120548 122687 124545 126064 127707 129627 131276 132000 131844 131547 131867 133035 134773
56679 134773 136538 137774 138231 138237 138513 139535 141126 142736 144056 145261 146714 148538 150417 151759 152102 151454
56663 151454 150189 148638 146896 145014 143109 141123 138779 136087 133713 132419 132244 132604 133104 133666 133872
56648 133872 132920 130742 128626 128053 129015 130007 129697 128166 126526 125745 126018 126877 127595 127664 127172 126729 126885 127527
56630 127527 127937 127431 125967 124113 122468 121198 120123 119104 118169 117378 116815 116653 116881 116990 116432 115535 115424
56613 115424 116659 118372 119286 119239 119080 119301 119525 119388 119210 119536 120552 122163 124209 126331 128026 129112
56597 129112 129850 130479 131043 131809 133233 135141 136476 136461 135667 135313 135784 136489 137007 137594 138379 138824 138421 137532
56579 137532 137085 137566 138679 139921 141195 142729 144575 146415 147937 149279 150908 153039 155413 157774 160341
56564 160341 163532 167406 171660 176065 180519 184721 188223 191036 193846 197336 201409 205304 208336 210339
56550 210339 211498 212057 212209 211992 211172 209390 206589 203171 199562 195776 191661 187526 184060 181449 178945
56535 178945 175713 171845 168071 164635 161117 157474 154515 152884 152077 151067 149629 148384 147707 147262 146692
56520 146692 146107 145607 144908 143869 143022 143079 144015 145037 145412 145031 144186 143156 142062 140884 139497 137834 136080
56503 136080 134573 133439 132553 131932 131963 132941 134486 135683 135937 135483 134997 134884 135036 135128 134892 134236 133345 132669
56485 132669 132588 133080 133872 134882 136186 137596 138733 139736 141432 144346 147766 150372 151774 152950 155079
56470 155079 158349 162128 165830 169282 172525 175724 179181 182976 186566 189152 190622 191831 193720 196368
56456 196368 199154 201549 203351 204301 204090 202875 201315 199780 197927 195486 193092 191696 191257 190684 189182
56441 189182 187098 185164 183419 181318 178592 175514 172456 169601 167067 164994 163425 162226 161136 159795
56427 159795 157905 155572 153412 152120 151942 152645 153807 155009 155992 156890 158127 159782 161260 161927 161882 161690
56411 161690 161571 161376 161287 161871 163277 164905 166176 167115 167854 168027 167209 165701 164351 163639 163369 163279 163479 164098
56393 164098 164825 165149 164941 164583 164518 164874 165564 166505 167606 168649 169447 170113 170959 172084 173269 174393 175666
56376 175666 177253 178886 180157 181069 181993 183182 184608 186205 187878 189256 189884 189814 189744 190373 191855 194011
56360 194011 196763 200026 203363 206114 207954 209131 210076 210893 211339 211343 211394 212222 214010 216100 217691 218689 219613
56343 219613 220794 221985 222816 223261 223539 223843 224317 225099 226169 227328 228561 230327 233256 237484 242335 246717
56327 246717 249975 252433 255008 258202 261630 264710 267459 270268 273133 275714 278097 280824 283983 286904
56313 286904 288987 290326 291263 291978 292903 294853 298059 301505 304053 305916 308265 311528 314958 317856 320281
56298 320281 322307 323498 323711 323822 324973 327438 330809 334986 340266 346512 352950 359057 365129 371639 378417
56283 378417 384984 391541 399075 408275 418747 429643 440903 453480 468323 485541 504690 525538
56271 525538 548232 572908 599619 628751 661213 698046 739917 787000 839189 896323 958381
56260 958381 1025573 1098155 1176048 1258666 1345212 1435018 1527437 1621400 1715216 1806836 1894235
56249 1894235 1975658 2049701 2115283 2171373 2216755 2250268 2271519 2281238 2280669 2270718 2251921 2225129
56237 2225129 2191773 2153308 2110730 2064759 2016094 1965141 1911780 1855769 1797248 1736525 1673636
56226 1673636 1608601 1542036 1474994 1408148 1341562 1275431 1210638 1148355 1089297 1033507 980667
56215 980667 930536 883258 839332 799162 762714 729816 700579 675052 652538 631928 612912
56204 612912 596291 582732 571714 562072 553182 545109 537918 531436 525662 520925 517508 515254 513531
56191 513531 511553 508984 506358 504614 504046 504017 503966 504259 505606 507949 510551 513086 516109 520337 525825 531926
56175 531926 537842 543232 548521 554580 561960 570538 579989 590268 601294 612525 623395 634057 645204
56162 645204 657240 670105 683752 698200 713109 728015 743306 760435 780842 805055 833171
56151 833171 865836 904298 949712 1002930 1065075 1137897 1223228 1322041 1434161 1558800 1694997
56140 1694997 1841102 1993743 2147644 2296764 2435780 2560965 2670604 2765167 2846647 2916960
56130 2916960 2976816 3026148 3065007 3093252 3109683 3112656 3101962 3079428 3047307 3006467 2956346
56119 2956346 2895868 2823704 2738132 2637624 2522029 2393174 2254581 2110933 1967528 1829445
56109 1829445 1700645 1583712 1480208 1390965 1315953 1254218 1204272 1164620 1133920 1110813 1093843
56098 1093843 1081616 1072959 1066979 1063077 1060937 1060294 1060564 1060798 1060153 1058356 1055560 1051934 1047679 1043358 1039704
56083 1039704 1036957 1034743 1032781 1031390 1031085 1032034 1034184 1037628 1042486 1048613 1055682 1063394 1071410 1079391
56069 1079391 1087480 1096504 1107250 1119628 1132849 1146333 1160115 1174512 1189751 1205865 1222634 1239674
56057 1239674 1256798 1274254 1292439 1311527 1331483 1352226 1373612 1395574 1418387 1442305 1466743
56046 1466743 1490472 1513169 1536193 1561166 1588204 1616243 1644678 1673756 1703640 1734098 1765143
56035 1765143 1797133 1830124 1863798 1898143 1933522 1970029 2007433 2045884 2086041 2128385 2172940
56024 2172940 2219752 2269118 2321252 2376179 2433943 2494448 2557141 2621430 2687368 2755492 2826145
56013 2826145 2899505 2976044 3056237 3139949 3226854 3317292 3412016 3511315 3615234 3724429 3839804
56002 3839804 3961419 4088807 4222315 4363117 4511813 4668100 4831962 5004284 5186180
55993 5186180 5378620 5582718 5799482 6029372 6273106 6532773 6810996 7109206 7428059
55984 7428059 7769344 8136023 8530512 8954697 9411803 9906638 10443858 11027768 11664126
55975 11664126 12360442 13124366 13963756 14888859 15912832 17050406 18318719 19740327 21343793
55966 21343793 23162089 25234460 27612071 30361416 33564758 37323581 41764322 47037620
55958 47037620 53309433 60752313 69539203 79834819 91791309 105562794 121328878
55951 121328878 139289879 159614010 182351981 207323404 233950776 261069979 286863625
55944 286863625 309074636 325476714 334375635 334916171 327151222 311962579 290892540
55937 290892540 265877204 238904541 211703884 185574905 161371300 139572694 120374270
55930 120374270 103763526 89582935 77584539 67479366 58978131 51816579 45765009
55923 45765009 40629511 36251061 32501700 29277253 26490979 24071300 21960481 20111159
55915 20111159 18482970 17042007 15761049 14617869 13593200 12670732 11837677 11083529
55907 11083529 10398310 9772715 9199427 8673182 8189517 7743922 7331998 6949998 6595329
55898 6595329 6266535 5962279 5680155 5416983 5170397 4939508 4723865 4522568 4334673
55889 4334673 4159601 3996576 3844250 3701456 3567856 3443353 3327345 3219115 3118601
55880 3118601 3026170 2941703 2864159 2791762 2722284 2653397 2583246 2510959 2436705 2361401 2286261
55869 2286261 2212286 2140040 2069962 2002726 1939060 1879372 1823749 1771902 1722742 1674538 1626365
55858 1626365 1579212 1534865 1493817 1455111 1418054 1383044 1350450 1319760 1290304 1262046 1235128
55847 1235128 1209258 1184090 1159670 1136027 1112765 1089563 1066785 1045199 1025349 1007411 991303
55836 991303 976599 962713 949456 937120 925811 915035 904189 893012 881377 869086 856236
55825 856236 843312 830522 817320 802998 787458 771167 754654 738397 722878 708349 694676
55814 694676 681662 669294 657535 646259 635694 626567 619427 614048 609811 606485 604324 603629 604454
55801 604454 606575 609455 612471 615367 618348 621495 624326 626149 626623 625876 624402 623026 622527 622861 622976
55786 622976 621679 618462 613230 605619 595157 582030 567337 552616 539268 528168 519439 512639 507306
55773 507306 503214 499898 496288 491144 483752 474020 462205 448879 434914 421073 407654 394785 382798
55760 382798 372063 362634 354364 347091 340386 333468 325887 318086 310746 303784 296574 289005 281636 274754
55746 274754 268010 261150 254527 248562 243215 238341 234115 230705 227850 225184 222713 220574 218520 216103
55732 216103 213294 210488 207925 205565 203520 202126 201360 200563 199097 197006 194741 192446 189958 187373 185066
55717 185066 183032 180739 177928 175199 173402 172681 172478 172318 172182 172193 172375 172715 173044 172876 171837 170379 169590
55700 169590 169989 170829 170845 169420 166816 163683 160811 159045 158839 159744 160763 161380 162008 163317 165352 167534
55684 167534 169403 171089 172971 175068 176952 178251 178997 179379 179359 178701 177336 175487 173512 171764 170471
55669 170471 169489 168285 166497 164549 163456 163997 166323 170274 175617 181816 187978 193348 197808 201845 206165
55654 206165 211248 216913 222332 226768 230350 233690 236806 239000 239924 240128 240203 239978 239009 237345 235246 232583
55638 232583 229160 225414 222081 219269 216391 213002 209185 205107 200711 195926 190796 185284 179314 173104
55624 173104 167161 161740 156503 150847 144602 138357 133054 129113 125989 122784 119261 115867 112774 109506
55610 109506 105793 102147 99086 96396 93844 92103 92016 93137 93965 93643 92542 91134 89255 86819 84408
55595 84408 82568 81133 79684 78185 76680 74846 72434 69772 67278 64785 61940 59037 56795 55372
55581 55372 54261 53216 52665 52938 53540 53623 52993 52268 52090 52481 52974 53178 53004 52516 51794 50975 50210 49450 48482
55562 48482 47339 46526 46557 47264 47859 47745 47158 46906 47590 49031 50389 50881 50547 50213 50517 51121 51159 50333 49133
55543 49133 48049 47088 46258 45934 46343 47057 47477 47702 48436 50071 52232 54290 56022 57664 59540 61826
55527 61826 64517 67448 70348 72954 75130 76909 78424 79894 81683 84302 88092 92781 97510 101526
55513 101526 104814 107813 110554 112458 113093 112772 112064 110951 108908 105832 102480 99733 97565 95013 91219
55498 91219 86313 81172 76386 71776 66983 62298 58562 56264 55014 53991 52610 50577 47588 43432
55484 43432 38506 33897 30674 29074 28453 28002 27358 26585 25805 25056 24427 24089 24168 24693 25611 26664 27353 27353
55466 27353 27008 27006 27439 27561 26729 25215 23741 22612 21769 21381 21680 22341 22728 22796 23097 23744 24031 23413 22300
55447 22300 21426 20850 20141 19320 19057 19852 21328 22476 22539 21739 21158 21744 23375 25087 26219 26949 27593 27878
55429 27878 27349 26238 25410 25480 26280 27163 27529 27116 26101 24991 24191 23639 22987 22130 21398 21194 21574 22245
55411 22245 22895 23503 24214 24849 24740 23434 21535 20402 20766 21999 22977 23265 23117 22672 21773 20449 19082
55394 19082 18022 17444 17569 18625 20478 22567 24289 25295 25459 24835 23696 22401 21286 20715 20949 21659
55378 21659 21882 21044 19863 19560 20169 20417 19492 18198 17843 18523 19115 18722 17551 16466 16107 16465 16938 16852
55360 16852 16188 15711 16121 17147 17765 17284 15906 14273 12844 11796 11214 11097 11245 11338 11158 10778 10520 10679
55342 10679 11193 11699 11964 12187 12688 13434 14030 14146 13750 13008 12175 11521 11076 10467 9302 7765 6557 6156
55324 6156 6360 6665 6825 6915 7073 7402 7919 8425 8631 8600 8820 9567 10432 10859 10968 11398 12373 13400 14039 14492
55304 14492 15166 15943 16227 15603 14225 12697 11731 11788 12770 14059 14996 15358 15313 15105 14920 14929 15160 15360 15210
55285 15210 14741 14291 14037 13767 13234 12602 12329 12640 13232 13554 13298 12542 11513 10359 9271 8593 8549 8899
55267 8899 9164 9237 9481 10104 10806 11268 11656 12205 12591 12262 11361 10749 10966 11581 11781 11268 10367 9535 9075 9143
55247 9143 9734 10603 11341 11523 10899 9611 8262 7504 7471 7758 8022 8316 8770 9235 9462 9385 9005 8270 7306
55228 7306 6559 6398 6729 7256 7955 8982 10257 11484 12506 13303 13769 13865 13977 14612 15645 16315 16155 15572
55210 15572 15229 15175 14972 14427 13780 13194 12532 11760 11229 11327 12008 12848 13466 13724 13614 13231 12882 12953 13533 14240
55190 14240 14560 14295 13639 12918 12337 11935 11704 11750 12305 13364 14362 14513 13639 12386 11454 10916 10536 10314 10229
55171 10229 9831 8848 8007 8425 10058 11564 11960 11706 11793 12463 13299 13968 14244 13832 12841 12030 11891 11827 11011
55152 11011 9811 9505 10609 12316 13641 14381 14657 14285 13054 11283 9697 8884 8927 9360 9476 9039 8702
55135 8702 9344 10964 12637 13545 13570 12899 11705 10434 9737 9748 9891 9768 9787 10480 11615 12524 13025 13509 14262
55116 14262 15180 16040 16686 16973 16861 16554 16279 16061 15949 16268 17262 18554 19329 19150 18382 17753 17697 18112 18587
55097 18587 18790 18742 18730 18953 19335 19720 20090 20474 20779 20821 20474 19737 18872 18443 18946 20250 21718 22994 24307
55078 24307 25753 26719 26497 25207 23684 22609 22172 22343 22938 23498 23677 23751 24190 24751 24633 23729 23088 23679
55060 23679 25108 26096 26014 25409 25058 25018 24794 24089 23100 22195 21592 21381 21591 22058 22365 22162 21538 20937 20733
55041 20733 21061 21945 23211 24281 24496 23869 23120 22776 22660 22570 22924 24108 25563 26333 26354 26478 27172 28006
55023 28006 28561 29109 30016 31090 31989 32804 33782 34778 35492 35943 36275 36327 35904 35329 35213 35627 35923 35439 34121
55004 34121 32424 30906 29944 29592 29540 29309 28603 27487 26217 24970 23693 22239 20769 19950 20480 22249
54988 22249 24229 25444 25910 26387 27365 28562 29349 29465 29286 29471 30306 31381 32146 32779 34075 36213 38140
54971 38140 38712 38178 37874 38581 39861 41061 42266 43956 46288 49136 52528 56599 61229 66092 71043
54956 71043 76360 82603 90238 99222 108971 118992 129497 141054 153608 166243 177913 187874 195279
54943 195279 199053 198693 194822 188456 180086 169921 158580 146858 135095 123499 112909 104306 97416
54930 97416 90676 82995 75027 68303 63602 60632 58871 58076 58023 58296 58497 58497 58460 58753 59800 61882 65058
54913 65058 69284 74568 80986 88645 97629 107842 118966 130732 143089 155758 167753 177759 185051
54900 185051 189541 190914 188396 181825 172361 161533 149951 137524 124629 112287 101171 91115
54888 91115 81785 73322 66095 60201 55472 51720 48769 46344 44108 41825 39502 37406 35836 34802
54874 34802 34090 33681 33780 34236 34318 33497 32162 31080 30429 29861 29266 28761 28126 27090 26187 26409 27770 29015
54856 29015 29078 28157 27001 25939 25062 24623 24569 24180 22930 21311 20193 19702 19358 18963 18628 18196 17445 16770
54838 16770 16925 18054 19540 20765 21487 21590 21162 20854 21471 23056 24916 26587 28219 29936 31444 32518
54822 32518 33344 34116 34706 34901 34647 34006 33316 33341 34591 36386 37333 37056 36766 37724 39809 42127 44424 47230
54804 47230 50982 55662 61101 67091 73408 80184 88023 97283 107492 117993 128883 140614 152786
54791 152786 163989 172907 179066 182469 183063 180754 175612 167949 158433 148079 137761 127774 118158 109280
54777 109280 101590 94915 88629 82626 77566 73988 71701 70251 69484 69355 69600 69924 70204 70277 70006 69925 71340
54760 71340 75204 81106 87889 95115 103324 112885 123190 133314 143096 153207 164252 176061 187822
54747 187822 198655 207845 214654 218351 218739 216539 212863 208230 202396 195176 187054 178767 170649 162690
54733 162690 154946 147442 139788 131396 122226 113048 104861 98105 92423 87016 81302 75416 70076 65839
54719 65839 62564 59743 57168 54957 53031 50930 48288 45215 42153 39580 37948 37625 38599 40279 41788
54704 41788 42555 42637 42530 42653 42978 43174 43063 42756 42314 41560 40462 39415 38814 38532 38221 37944 38008 38255 38169
54685 38169 37768 37709 38266 38836 38887 38876 39604 41066 42603 43983 45644 47862 50265 52284 53694 54619 55380
54668 55380 56362 57703 59041 59909 60370 60864 61462 61732 61488 61153 61129 61230 61083 60763 60613 60652 60523 59962 59090
54649 59090 58334 58261 59303 61373 63899 66490 69476 73479 78522 83885 88889 93598 98691 104777 111896
54634 111896 119593 127481 135757 145031 155503 166462 176733 185431 192104 196392 198036 197190 194330 189741
54620 189741 183426 175532 166551 156964 147082 137382 128646 121395 115346 109722 103998 98126 92249 86551
54606 86551 81334 76846 72995 69528 66538 64466 63418 62797 61871 60517 59150 58087 57319 56815 56602 56444
54590 56444 55796 54339 52362 50428 48874 47766 47069 46528 45588 43841 41535 39359 37817 37096 37360 38573
54574 38573 40024 40680 40279 39631 39529 39828 39902 39583 39170 38877 38780 39057 39736 40371 40492 40269 40218 40377 40311 39878
54554 39878 39406 39158 39151 39513 40387 41426 42042 42297 42880 43988 44894 44981 44514 44009 43481 42882 42685 43323 44485
54535 44485 45659 47016 49030 51537 53960 56312 59152 62588 66130 69559 73163 76967 80530 83787
54521 83787 87400 91879 96889 101774 106130 109424 110778 109866 107718 105829 104565 103056 100521 97055 93104
54506 93104 88847 84456 80443 77291 74880 72593 69979 67181 64729 63007 61848 60628 58841 56655
54492 56655 54859 54151 54504 55211 55541 55335 55038 55170 55810 56585 57088 57127 56586 55363 53678 52280 51968 52844
54474 52844 54247 55470 56321 57003 57738 58626 59577 60187 59936 58763 57272 56090 55214 54353 53686 53719 54344 54699
54456 54699 54258 53555 53376 53599 53405 52456 51186 50026 49018 48362 48561 49521 50016 48784 46027 43294 41900
54439 41900 41929 42808 44221 46116 48196 49873 50696 50659 50130 49596 49396 49498 49500 48986 47936 46800 46210 46599
54421 46599 47916 49621 51021 51749 51941 51976 52096 52334 52676 53224 54205 55827 58068 60563 62831 64694 66404
54404 66404 68304 70424 72550 74542 76417 78147 79600 80760 81794 82784 83449 83326 82258 80613 79012
54389 79012 77823 76907 75812 74206 72185 70187 68552 67241 65991 64740 63713 63025 62418 61532 60344
54374 60344 59091 57844 56457 55027 54078 54045 54713 55374 55494 55080 54485 54068 54012 54305 54837 55562 56514 57641
54356 57641 58760 59781 60808 61839 62539 62578 62148 61873 62278 63525 65495 67717 69309 69562 68765 68014 67989
54339 67989 68259 68051 67326 66651 66265 65716 64418 62268 59778 57794 56988 57290 57844 57759 56863 55570 54177
54322 54177 52652 51030 49550 48287 46965 45341 43614 42281 41629 41423 40978 39600 37179 34393 32223
54307 32223 31204 31217 31827 32545 32898 32681 32308 32572 33828 35609 37187 38237 38816 38972 38698 38070 37194 36164
54289 36164 35259 34951 35351 35856 35787 35265 35011 35252 35390 34886 34083 33807 34467 35768 37097 37888 37853 37236 36748
54270 36748 36906 37430 37617 37297 37115 37752 39172 40744 41878 42353 42313 42274 42928 44520 46301 47000 46084 44439
54252 44439 43564 44123 45461 46528 46999 47384 48248 49596 50960 51771 51553 50120 47934 46119 45668 46511 47627
54235 47627 48198 48303 48328 48122 47203 45588 43913 42767 42303 42469 43045 43361 42629 40954 39525 39300 39824 39880
54217 39880 39049 37943 37042 36133 35152 34816 35850 37952 40072 41552 42534 43374 44105 44568 44731 44747 44861 45250
54199 45250 45759 45858 45191 44180 43715 44041 44327 43632 42076 40664 40070 40050 40086 40125 40375 40711 40771 40587 40629 41050
54179 41050 41213 40334 38481 36592 35460 35008 34678 34264 34033 34164 34437 34597 34701 34888 35021 34857 34494 34274
54161 34274 34239 34062 33696 33720 34693 36311 37603 37904 37341 36445 35685 35436 35892 36765 37423 37622 37828 38465 39106
54142 39106 38842 37334 35077 32734 30672 29169 28503 28606 29019 29488 30270 31592 33074 34042 34248 33965 33483
54125 33483 32910 32433 32369 32784 33270 33262 32576 31617 31129 31646 33041 34589 35572 35746 35227 34201 33064 32581 33318
54106 33318 34804 35792 35640 35049 35073 35759 36330 36555 37206 38951 41318 43163 43861 43640 42967 42141 41487 41460
54088 41460 42253 43528 44724 45503 45744 45342 44285 42854 41500 40559 40188 40425 41059 41599 41768 42035 43243
54071 43243 45582 48294 50570 52345 53912 55153 55631 55298 54611 54003 53734 54248 56091 59174 62515 65090
54055 65090 66785 68253 70011 71997 73896 75581 77209 79114 81620 84750 88091 91164 93961 96967
54041 96967 100567 104625 108734 112686 116546 120392 124230 128130 132307 136958 142079 147445 152640 157121
54027 157121 160466 162699 164308 165857 167544 169191 170576 171661 172527 173237 173787 174068 173858 172915 171140 168611
54011 168611 165456 161801 157848 153909 150230 146829 143508 140014 136225 132307 128665 125583 122895 120214
53997 120214 117468 114989 112988 111242 109461 107675 105918 103824 101019 97858 95349 94184 94063 94034 93313
53982 93313 91825 90144 88953 88362 87800 86779 85621 85067 85207 85276 84557 83082 81315 79625 78303 77681
53966 77681 77865 78552 79308 79858 79971 79517 78811 78481 78651 78698 78223 77777 78078 78876 79317 79201 79173 79770 80980
53947 80980 82733 85073 87770 90452 93305 97008 101706 106672 111257 115633 120269 125273 130682 136824
53933 136824 143770 150789 156922 161946 166333 170543 174830 179476 184518 189333 193077 195660 197903 200708
53919 200708 204399 208824 213649 218505 223247 228128 233433 238953 244152 248877 253427 257881 261830 264936
53905 264936 267311 269076 269898 269249 266985 263470 259375 255450 252170 249365 246403 242865 238751 233952 228059
53890 228059 221157 214279 208363 202933 196541 188601 180152 172555 166038 159927 153886 148359 143894 140481
53876 140481 137664 134968 132150 129242 126473 124005 121693 119209 116401 113356 110075 106391 102350 98441
53862 98441 95147 92430 89997 87942 86644 85935 84936 83136 81171 80015 79584 78798 77046 74971 73569
53847 73569 73057 73039 73305 73934 74766 75370 75513 75293 74829 74244 73967 74538 75912 77323 78096 78283 78272 78125 77659
53828 77659 76935 76240 75731 75509 75962 77475 79717 81675 82650 82896 83058 83322 83468 83509 83816 84694 86166 88206
53810 88206 90842 93992 97483 101279 105443 109800 113967 117897 122102 127119 132892 138873 144592 149870
53796 149870 154665 158998 162989 166673 169768 171927 173223 174085 174677 174665 173798 172450 171240 170286 169201 167828
53780 167828 166487 165316 163725 160920 156845 152216 147605 142966 138209 133748 130071 127027 124151 121579
53766 121579 119919 118994 117393 113895 109009 104473 101373 99364 97693 96180 94917 93689 92304 91140
53752 91140 90731 90885 90796 90008 88796 87492 85999 84211 82431 80928 79420 77554 75748 74934 75373 76256
53736 76256 76682 76536 76071 75166 73577 71734 70550 70410 70851 71345 71838 72320 72452 72107 71921 72747 74619 76648
53718 76648 77944 78360 78360 78471 78878 79370 79644 79680 79658 79407 78274 75931 73074 70888 69996 70339 71887 74720
53700 74720 78380 81925 84976 88173 92106 96256 99477 101276 102077 102384 102255 101661 100914 100468 100471 100731 101093
53683 101093 101732 102941 104626 106217 107318 108324 110064 112770 115765 118256 120033 121190 121627 121258 120477
53668 120477 119962 120020 120377 120515 120002 118714 117008 115555 114683 114083 113461 113201 113892 115225 116004 115411 113909
53651 113909 112644 112285 112621 113086 113378 113550 113711 113770 113581 113308 113403 114087 115064 115933 116663 117409 118102 118650 119346
53632 119346 120573 122097 123154 123363 123171 123259 123881 124955 126386 128022 129515 130524 130982 131062 131018 131076 131308
53615 131308 131577 131810 132265 133257 134648 136001 137254 138785 140700 142594 144257 146136 148673 151552 154034
53600 154034 155858 157422 159216 161428 163967 166567 168907 170864 172571 174107 175369 176451 177799 179639
53586 179639 181547 183006 184154 185515 187134 188550 189564 190460 191337 191787 191526 190979 190913 191628 192709 193473
53570 193473 193540 193101 192659 192438 192139 191418 190465 189752 189247 188393 186967 185575 184966 185133 185382 185162 184564 184113
53552 184113 184307 185326 186907 188450 189391 189624 189618 190092 191475 193520 195446 196545 196756 196615 196709 197272 198243
53535 198243 199489 200886 202343 203850 205456 207182 209067 211250 213877 216935 220344 224176 228523 233199
53521 233199 237795 242139 246418 250778 255105 259330 263665 268347 273385 278831 285025 292243 300265 308637
53507 308637 317263 326455 336408 346898 357551 368217 379091 390635 403283 416993 431154 445234
53495 445234 459395 474140 489424 504582 519220 533715 548537 563513 578125 592302 606431
53484 606431 620704 634907 648930 663107 677852 693206 708889 724609 740153 755322 770033
53473 770033 784446 798786 813002 826732 839687 851948 863824 875440 886533 896678 905672 913744
53461 913744 921346 928723 935642 941616 946397 950163 953096 954911 954957 952886 949076 944373 939541 934883 930108
53446 930108 924351 916643 906777 895770 885076 875277 865734 855577 844698 833601 822619 811641
53434 811641 800452 788942 777052 764905 753064 742318 732997 724722 716971 709707 703243 697642 692541
53421 692541 687631 683118 679637 677727 677431 678363 680080 682303 684749 686984 688745 690437 692997 697024 702222
53406 702222 707908 713881 720571 728420 737492 747710 759129 771795 785584 800408 816447 833884
53394 833884 852481 871697 891312 911692 933262 955892 979090 1002793 1027599 1054093 1082135
53383 1082135 1111113 1140693 1171045 1202392 1234653 1267528 1300582 1333217 1364983 1396109 1427333
53372 1427333 1458931 1490178 1520042 1548114 1574526 1599348 1622468 1643819 1663093 1679443 1692163
53361 1692163 1701677 1709228 1715384 1719393 1720227 1717718 1712406 1704746 1694890 1682914 1668827 1652499 1633848
53348 1633848 1612966 1589919 1564699 1537537 1508935 1479166 1448139 1416056 1383842 1352514 1322416
53337 1322416 1293429 1265615 1239128 1213712 1188785 1163935 1138944 1113585 1087893 1062454 1037870
53326 1037870 1014083 990816 968526 948099 929542 911748 893878 876371 860151 845420 831696
53315 831696 818713 806739 796154 787043 779063 771433 763272 754339 745356 737310 730422 724031 717426
53302 717426 710568 704040 698489 694202 691038 688692 687008 686104 686246 687685 690515 694566 699483 705034 711296
53287 711296 718428 726398 735147 744828 755504 766804 778402 790776 804790 820350 836103 850880
53275 850880 864852 878810 892838 906374 919231 931701 943686 954395 963105 969768 974771 978470
53263 978470 981076 982610 982844 981636 979374 976707 973648 969385 963280 955761 947822 939808 931094 920921
53249 920921 909150 896157 882341 867980 853315 838403 822900 806297 788580 770505 753034
53238 753034 736505 720509 704549 688599 673020 658159 644155 631005 618621 606805 595302
53227 595302 583955 572811 562021 551580 541117 530135 518562 507023 496388 487167 479447 473178
53215 473178 468077 463474 458793 454234 450397 447097 443227 438096 432311 426806 421527 415820 409725 404016
53201 404016 398963 393860 387989 381491 375003 368954 363510 358834 354973 351655 348456 345131 341633 337994
53187 337994 334319 330791 327491 324260 320782 316823 312403 307840 303552 299716 296148 292670 289465 286869
53173 286869 284902 283221 281502 279636 277625 275609 273934 272842 272088 271227 270238 269469 268877 267872 266095
53158 266095 263918 261881 260018 258111 256248 254668 253279 251835 250542 249952 250180 250593 250413 249401 247795
53143 247795 245897 243905 241973 240168 238389 236527 234711 233220 232100 230985 229436 227410 225277 223408
53129 223408 221795 220101 217982 215387 212665 210342 208609 207001 204842 202040 199249 197123 195622 194184
53115 194184 192305 189827 186929 184086 181767 179896 177901 175550 173334 171663 170114 168120 166042 164715
53101 164715 164107 163310 161877 160301 158945 157463 155678 154196 153543 153273 152562 151223 149583 147789 145840
53086 145840 143949 142279 140590 138731 137180 136492 136415 136223 135750 135480 135695 136197 136883 137922 139241 140361
53070 140361 140938 141126 141279 141597 142086 142551 142645 142276 141847 141681 141311 139948 137633 135298 133539 131977 130074
53053 130074 128019 126344 125122 124030 122940 121968 121079 120027 118668 117092 115512 114175 113217 112409 111207
53038 111207 109235 106659 103908 101237 98743 96639 95141 94051 92760 90892 88838 87460 87197 87599 87921
53023 87921 87987 88169 88518 88498 87854 87223 87277 87650 87431 86549 85806 85529 85154 84394 83897 84148 84567 84478 84322 84942
53003 84942 86057 86466 85723 84651 84049 83741 83238 82586 82101 81757 81348 80925 80594 80171 79503 78954 79099 79892
52985 79892 80622 80791 80731 81135 82144 83178 83623 83539 83634 84618 86539 88629 89785 89385 87840 86298 85632 85736
52967 85736 85924 85901 86006 86465 86892 86850 86598 86804 87617 88509 89053 89432 89991 90682 91205 91492 91736 92112 92761 93925
52947 93925 95746 97862 99535 100359 100654 101000 101532 101966 102225 102691 103676 104892 105760 106196 106767 107959 109549
52930 109549 110890 111709 112456 113875 116365 119637 122858 125217 126628 127885 129904 132726 135416 137093 137818
52915 137818 138354 139176 140030 140429 140260 139758 139121 138432 137866 137643 137682 137536 136882 135936 135206 134889 134758 134576 134290
52896 134290 133818 133042 132173 131778 132063 132372 131877 130692 129781 129700 129895 129557 128731 128174 128353 129004 129583 129699 129183
52877 129183 128267 127745 128438 130158 131633 131824 131104 130703 131253 132338 133307 133945 134214 133977 133266 132527 132284 132742
52859 132742 133862 135538 137461 139118 140251 141129 142098 143046 143603 143669 143355 142576 141110 139073 136976 135293
52843 135293 134245 133872 133937 133822 132974 131556 130303 129690 129573 129660 129912 130308 130629 130639 130256 129459 128372 127468
52825 127468 127232 127438 127243 126226 124900 123935 123374 122963 122751 122811 122801 122339 121605 120992 120451 119758 119213 119321 119816
52806 119816 119848 119295 119158 120205 121813 122710 122616 122542 123461 125142 126454 126583 125683 124393 123045 121572 119989
52789 119989 118542 117346 116269 115299 114622 114074 113015 111170 109194 107855 106888 105316 102775 99851 97173
52774 97173 94871 93046 92015 91732 91532 90845 89810 88869 88204 87895 88154 88856 89161 88184 86023 83624 81654
52757 81654 79979 78271 76659 75498 74827 74387 74074 74034 74263 74365 73910 72883 71596 70281 69096 68439 68717
52740 68717 69591 69945 69104 67789 67319 67997 68861 68907 67996 66523 64845 63275 62090 61220 60277 59173 58360
52723 58360 58185 58321 58138 57396 56343 55338 54649 54490 54981 56045 57387 58531 59068 59080 59192 59790 60369 60201
52705 60201 59527 59343 59921 60333 59779 58629 57716 57264 57014 56793 56362 55228 53327 51462 50423 50028 49699
52688 49699 49594 50350 51979 53783 55200 56083 56367 56210 56277 57039 57917 57950 57256 56918 57356 57735 57229 56019
52670 56019 54731 53641 52810 52349 52142 51861 51623 52050 53289 54462 54614 53774 52735 52190 52491 53799 55928
52653 55928 58294 60430 62398 64447 66624 69006 71856 75027 77536 78359 77595 76392 75718 75494 74947 73561
52637 73561 71699 70397 70342 70974 70896 69387 67210 65656 65135 65033 64689 64012 63285 62780 62568 62411 61910 60941
52619 60941 59832 58894 58069 57264 56759 56877 57471 58129 58667 59049 59123 58952 59185 60396 62114 63223 63383 63381 63890
52600 63890 64605 64944 65007 65299 65919 66589 67243 67976 68577 68604 67992 67204 66750 66906 67810 69319 70645 70787 69659
52581 69659 68442 68336 69294 70470 71592 73110 75077 76800 77983 79378 81670 84281 86060 86769 87068
52566 87068 87321 87368 87423 88106 89326 90095 89952 89789 90604 92075 93128 93459 93721 94414 95337 96102 96563 96706 96566
52547 96566 96326 96193 96193 96372 97000 98214 99627 100700 101396 102064 102813 103420 103779 103977 103962 103664 103435 103865 104989
52528 104989 106041 106186 105358 104341 104155 105217 106863 107864 107709 107129 107072 107512 107769 107657 107552 107496 107126 106499
52510 106499 106216 106542 107121 107684 108279 108602 107959 106284 104457 103178 102231 101369 101152 102090 103511 104153 103642
52493 103642 102673 101962 101691 101873 102513 103429 104446 105716 107338 108718 108994 108191 107407 107614 108681 109755 110222
52476 110222 110096 109774 109677 110047 110908 112187 113826 115659 117320 118463 119032 119143 118829 118095 117126 116187 115401
52459 115401 114819 114580 114666 114714 114416 114045 114109 114549 114764 114553 114563 115531 117383 119282 120379 120370 119572 118674 118212 118074
52439 118074 117631 116495 115022 113886 113294 112841 112112 111215 110614 110489 110410 109738 108384 106928 105915 105229 104398
52422 104398 103375 102621 102434 102583 102756 103007 103568 104413 105278 105943 106319 106375 106208 106059 106055 105979 105547 104890 104518 104714
52402 104714 105141 105250 104985 104884 105455 106612 107866 108898 109752 110517 111138 111629 112193 112959 113767 114415 114920 115322
52384 115322 115476 115308 115151 115410 116022 116674 117486 118938 120998 122845 123780 124021 124245 124698 125169 125636 126411 127613
52366 127613 128931 129985 130660 131035 131245 131534 132233 133520 135256 137126 138855 140294 141456 142567 143945
52351 143945 145721 147727 149685 151435 152899 154021 154930 156114 158143 161042 164108 166481 167887 168726 169541
52336 169541 170560 171738 172966 174119 175045 175756 176575 178018 180446 183820 187700 191426 194485 196848 199000
52321 199000 201559 204892 208996 213559 218075 222180 226129 230812 237030 244716 253015 261076 268697 276346
52307 276346 284678 293955 303762 313445 322947 332963 344040 355847 367704 379537 391685 403970
52295 403970 415735 426959 438556 451172 464209 476504 487658 498225 508788 519207 528743 536727
52283 536727 543264 549310 555795 562571 568589 573185 576661 579358 580879 580817 579739 578677 577925 577014 575707
52268 575707 574249 572715 570838 568608 566408 564468 562737 561379 560827 561179 562119 563581 565896 569027 572333
52253 572333 575422 578782 583135 588613 594971 602156 610200 618903 628085 637856 648193 658580 668532 678174
52239 678174 687753 696901 705086 712560 720082 727684 734439 739601 743314 746064 748056 749483 750784 752118
52225 752118 752965 752704 751284 748924 745468 740686 735045 729523 724462 719100 712521 704799 696898 689654 683154
52210 683154 677041 671079 665270 659632 654107 648681 643466 638606 634248 630607 627952 626400 625745 625555 625403
52195 625403 625070 624648 624483 624805 625319 625398 624869 624361 624579 625397 626052 626131 625864 625447 624605 623088 621152 619196
52177 619196 617205 614894 612178 609151 605809 602228 598916 596510 595022 593724 591851 589220 586093 582739
52163 582739 579332 576101 573329 571190 569602 568205 566564 564530 562417 560667 559254 557589 555062 551601
52149 551601 547639 543705 540110 536901 533926 530975 527978 525051 522279 519539 516591 513382 510182 507405
52135 507405 505274 503635 502056 500153 497936 495839 494337 493507 492918 492030 490675 489158 487950 487370 487593
52120 487593 488777 490980 493938 497096 500019 502753 505786 509662 514626 520541 527171 534561 543025 552709
52106 552709 563358 574776 587307 601400 616718 632280 647641 663381 680096 697420 714491
52095 714491 730852 746318 760420 772846 784223 795537 806808 817120 826052 834122 841604 847844
52083 847844 852300 855425 857881 859489 859737 858786 857209 855028 851844 847710 843099 838131 832611 826797 821303
52068 821303 816118 810492 804060 797396 791155 785341 779858 775201 772000 770212 769343 769239 770069 771724 773778
52053 773778 776086 778892 782230 785728 789120 792598 796373 800305 804290 808633 813506 818265 822051 825118
52039 825118 828767 833514 838003 840467 840876 840730 840893 840662 839165 836666 833815 830383 825606 819399 812383
52024 812383 804839 796392 786805 776472 766047 755948 746285 736800 726834 715770 703645 691044 678432
52011 678432 665892 653356 640648 627372 613306 598863 584596 570288 555223 539447 524025
52000 524025 509702 496046 482240 468125 453961 439788 425672 412138 399594 387587 375282
51989 375282 362592 350231 338677 327679 316884 306460 296858 288239 280297 272529 264635 256752 249270
51976 249270 242357 235781 229307 223088 217422 212247 207128 201705 195975 190214 184806 180024 175880 172246
51962 172246 169138 166646 164521 162233 159645 157245 155374 153608 151332 148658 146264 144493 143069 141582
51948 141582 139861 137957 136212 135237 135399 136337 137269 137684 137416 136330 134480 132439 130885 129809 128608 126924
51932 126924 124897 122688 120370 118344 117192 116916 116831 116426 115844 115368 114941 114403 113701 112648 110989 109027
51916 109027 107660 107409 107770 107844 107305 106451 105705 105370 105523 105745 105259 103704 101593 99749 98587 98082 97986 97728
51898 97728 96620 94656 92769 91797 91518 91151 90450 89695 88936 87943 86797 85907 85438 85280 85466 86098 86921 87539
51880 87539 87997 88600 89259 89687 90198 91458 93264 94413 94150 93125 92464 92497 92885 93436 94133 94722 94949 95066
51862 95066 95556 96380 96969 96947 96477 95960 95743 96045 96781 97521 97992 98594 99953 101930 103574 104250 104336 104497 104666
51843 104666 104227 103088 102005 101750 102330 103203 103968 104542 104808 104539 103730 102775 102079 101664 101393 101427 102138 103517
51825 103517 105007 106106 106860 107498 107775 107092 105308 103088 101259 100093 99419 99236 99822 101214 102901 104194
51809 104194 104797 104886 104775 104694 104822 105285 106035 106868 107632 108329 108974 109491 109862 110262 110922 111879 112972 114067 115160
51790 115160 116225 117032 117224 116695 115925 115824 116952 118810 120197 120482 120296 120741 122066 123537 124501 125078 125750
51773 125750 126673 127681 128640 129569 130592 131996 134059 136570 138731 139913 140401 141080 142436 144171 145698
51758 145698 146655 146888 146298 144956 143195 141416 139902 138833 138302 138253 138492 138808 139008 138936 138748 139083 140529
51741 140529 142766 144605 145196 144922 144783 145129 145448 145325 145130 145531 146631 147852 148616 148983 149562 150884 152907
51724 152907 155117 156988 158213 158655 158450 158269 159034 161001 163311 164824 165267 165275 165476 166043 167028 168507 170209
51707 170209 171530 172187 172550 173080 173807 174589 175470 176435 177179 177579 178110 179272 180792 181958 182656 183511 184972
51690 184972 186858 188984 191663 195208 199277 203167 206577 209724 212740 215257 216691 216773 215809 214447 213195
51675 213195 212127 211108 210232 209813 209823 209569 208264 205944 203604 202302 202218 202653 202873 202742 202504 202217 201639
51658 201639 200623 199312 197886 196397 195007 194050 193577 193091 192143 190980 190135 189468 188167 185796 182850 180082
51642 180082 177694 175475 173337 171345 169499 167898 166881 166621 166649 166182 164899 163126 161317 159704 158469
51627 158469 157820 157646 157325 156185 154145 151755 149631 148004 146878 146363 146531 146957 146852 145944 144893 144417
51611 144417 144210 143375 141855 140707 140652 141089 140992 140273 139584 139165 138655 137912 137348 137378 138057 139318 141025 142747
51593 142747 143936 144481 144685 144627 144099 143280 142912 143438 144401 145117 145567 146140 146712 146570 145332 143497 141919 140898
51575 140898 139999 138725 137219 136188 136096 136557 136704 136070 134885 133563 132247 131007 130186 130257 131395 133333
51559 133333 135509 137318 138351 138624 138544 138581 138990 139768 140732 141588 142168 142663 143418 144478 145512 146219 146556 146547
51541 146547 146216 145854 145990 146874 148270 149935 151924 154110 155792 156231 155441 154055 152612 151342 150440 149995
51525 149995 149676 148918 147492 145630 143637 141675 139813 137923 135678 133078 130858 129785 129577 129156 128056
51510 128056 126946 126574 126871 127461 128404 129848 131353 132244 132441 132425 132526 132713 132967 133313 133498 133188 132590 132504
51492 132504 133512 135401 137520 139494 141355 143172 144788 146051 147165 148620 150578 152448 153451 153690
51478 153690 154202 155667 157488 158609 158901 159123 159705 160359 160895 161651 162805 163922 164580 164944 165344 165802 166428
51461 166428 167737 169879 171902 172606 172042 171429 171538 171880 171741 171340 171487 172489 173937 175443 177086 179035
51445 179035 181033 182429 182694 181849 180415 178992 177935 177365 177262 177351 177078 176049 174550 173343 172789 172418
51429 172418 171571 170309 169419 169523 170361 171123 171390 171562 172213 173250 174040 174378 174840 175903 177187 178071 178742
51412 178742 179907 181521 182561 182261 180955 179392 177818 176161 174589 173323 172196 170917 169549 168229
51398 168229 166675 164574 162318 160742 160058 159610 158753 157545 156379 155340 154157 152555 150506 148333 146570
51383 146570 145493 144783 143905 142840 142037 141580 140829 139137 136652 134192 132433 131393 130544 129349 127815 126542
51367 126542 126077 126254 126444 126353 126162 125873 125054 123493 121663 120170 119100 118233 117570 117198 116901 116421 115956 115925
51349 115925 116201 116082 115126 113681 112402 111535 110853 110141 109487 109083 108847 108395 107539 106721 106697 107664 108965 109871
51331 109871 110403 111061 112025 113032 113932 114760 115172 114386 112118 109302 107422 107046 107311 106932 105578 104072 103291
51314 103291 103081 102515 101129 99547 98640 98373 97822 96300 94066 91914 90360 89350 88478 87332 85777 84110
51298 84110 82856 82310 82393 82922 83860 85181 86640 87850 88485 88402 87769 87144 87188 87996 88842 88878 88073 87248 87131
51279 87131 87644 88203 88489 88717 89288 90418 92060 93899 95281 95428 93999 91485 88880 86981 86041 85926
51263 85926 86324 86779 86919 86831 86922 87219 87129 86258 85214 85094 86207 87796 89104 90201 91526 93083 94516
51246 94516 95728 96951 98263 99408 100170 100608 100809 100565 99507 97599 95469 94168 94376 95751 97191 97884
51230 97884 97951 97939 97953 97615 96711 95456 94107 92769 91716 91487 92297 93579 94426 94462 94096 94076 94986 96956 99513
51211 99513 101701 102720 102573 101957 101478 101168 100782 100286 99867 99633 99496 99278 98841 98145 97296 96508 95930 95559
51193 95559 95366 95372 95522 95568 95161 94057 92299 90347 89015 88915 89757 90465 90227 89290 88394 87726 86900 85871
51175 85871 85203 85172 85148 84300 82672 81128 80322 80045 79568 78374 76569 74824 73898 74014 74653 75164 75475 75980
51157 75980 76781 77464 77779 78155 79131 80399 80895 80023 78537 77888 78721 80261 81290 81502 81663 82514 83819
51140 83819 84618 84241 82876 81283 80201 79999 80561 81368 81818 81699 81330 81155 81315 81697 82252 83013 83809 84295
51122 84295 84368 84333 84483 84737 84977 85483 86622 88110 89088 89096 88597 88265 88100 87641 86840 86259 86360 86958 87541 87898
51102 87898 88317 89227 90710 92372 93758 94890 96200 97834 99325 100183 100516 100761 101054 101313 101685 102408 103344
51085 103344 104208 105112 106227 106982 106436 104669 103008 102521 102945 103449 103710 103749 103429 102882 102893 103967 105366 105894
51067 105894 105440 104938 104974 105283 105588 106037 106700 107341 107910 108557 108992 108527 107116 105749 105433 106214 107542 109093
51049 109093 110776 112293 113242 113540 113404 113065 112719 112541 112502 112332 111887 111375 111064 111014 111311 112182 113542 114709
51031 114709 115027 114665 114355 114468 114748 114996 115543 116792 118560 120198 121321 122218 123454 125216 127194 129060
51015 129060 130825 132602 134272 135686 137103 139032 141618 144542 147594 150916 154477 157786 160569 163468
51001 163468 167503 172810 178374 183150 187110 190994 195334 200125 205418 211729 219520 228454 237656 246813
50987 246813 256655 268120 281327 295726 311086 327862 346602 367401 390071 414623 441404 470888
50975 470888 503281 538197 574866 612906 652752 694966 739235 784454 829667 874370 917937
50964 917937 959479 998490 1035029 1068917 1099221 1124911 1145641 1161595 1173031 1180368 1184314 1185492
50952 1185492 1184207 1180922 1176568 1171995 1167424 1162878 1158764 1155502 1152928 1150558 1148155 1145382 1141052 1133437
50938 1133437 1121407 1104905 1084422 1060488 1033617 1004186 972295 938009 901646 863532 823711
50927 823711 782479 741003 700783 662523 626108 591637 559792 531001 504910 480941 458916
50916 458916 438915 421025 405440 392353 381478 372023 363378 355508 348566 342542 337529 333849 331539
50903 331539 330040 328718 327417 326225 325048 323830 322908 322748 323398 324519 325809 327156 328523 330040 332161
50888 332161 335439 340083 345844 352274 358972 365638 372066 378176 384136 390495 398034 407155 417480 428387
50874 428387 439938 452871 467617 483902 501569 521284 543888 569443 597525 628353 663101
50863 663101 703021 748608 799668 855929 917511 984980 1058943 1139473 1225918 1317313 1412809
50852 1412809 1511592 1612647 1714832 1816903 1917147 2013145 2102342 2182815 2253283 2312648
50842 2312648 2360031 2395267 2418898 2431628 2434260 2428268 2415947 2399663 2381251 2362380 2345145 2331760
50830 2331760 2323532 2320286 2320772 2323403 2326619 2328747 2327815 2321677 2308416 2286587 2255113 2213198 2160533
50817 2160533 2097517 2025064 1944215 1856095 1762172 1664333 1564772 1465937 1370341 1279898 1195378
50806 1195378 1116866 1044742 979701 921780 870053 823734 783039 748414 719328 694474 672891
50795 672891 654242 638195 624391 613022 604572 598582 593418 587722 581658 576286 572182 569185 566993
50782 566993 565261 563285 560267 555961 550606 544392 537483 530469 524092 518420 512866 507115 501448 495983
50768 495983 490298 484216 478413 473760 470455 468306 467497 468465 471207 475337 480749 487748 496461 506638
50754 506638 518151 531393 547003 565366 586461 610052 636034 664695 696564 731917 770577
50743 770577 812304 857140 905169 956246 1010179 1066842 1125679 1185439 1245019 1304330 1363632
50732 1363632 1422062 1477520 1528066 1572678 1610519 1640336 1661064 1672482 1674785 1668069 1652856 1630847
50720 1630847 1604484 1575907 1546740 1518576 1492967 1470880 1452715 1438950 1430250 1426608 1426652 1428128
50708 1428128 1429033 1428125 1424476 1416800 1403382 1382662 1353839 1317012 1272982 1223069 1169010 1112626
50696 1112626 1055454 998720 943646 891433 842837 797940 756599 718998 685661 657022 633141
50685 633141 613735 598294 586166 576719 569618 564973 563122 564071 567150 571470 576830 583864 592971 603369
50671 603369 613629 623006 631747 640196 648309 656177 664408 673534 683379 693268 702614 711152 719098 727326
50657 727326 736995 748596 761667 775722 791076 808449 828195 850432 875488 903577 934214 966561
50645 966561 1000244 1035296 1071423 1107902 1144185 1179887 1214059 1245132 1271941 1294510 1313484
50634 1313484 1329004 1340408 1346983 1348793 1346757 1341973 1335048 1326243 1316192 1306052 1296729 1288254 1280325
50621 1280325 1273184 1267477 1263460 1260888 1259577 1259434 1259868 1259847 1258806 1257063 1255008 1252335 1248390 1242902 1235898
50606 1235898 1227077 1215710 1201143 1183093 1161432 1135972 1106663 1073916 1038617 1001724 963851
50595 963851 925294 886427 847936 810535 774618 740333 707817 677171 648365 621568 597492
50584 597492 576941 559888 545298 532131 520298 510523 503466 499158 497114 496731 497607 499663 502961
50571 502961 507397 512591 518159 524051 530591 538182 546999 556956 567997 580316 594068 608875 623917
50558 623917 638775 653975 670398 688292 707074 726060 745061 764389 784591 806130 829005
50547 829005 852662 876619 901211 927414 955904 986594 1019251 1054292 1092801 1135863 1183922
50536 1183922 1236607 1293076 1352705 1415508 1481863 1551892 1625180 1700869 1777686 1853980 1928089
50525 1928089 1998747 2064915 2125267 2178145 2222009 2255703 2278429 2289838 2290077 2279362 2257519 2224445
50513 2224445 2181074 2129431 2071590 2008980 1942814 1874700 1806538 1740165 1677388 1620037 1569633
50502 1569633 1526991 1492297 1465457 1446414 1435321 1432301 1436733 1446884 1460798 1477524 1496975 1518463
50490 1518463 1539983 1559126 1573999 1582945 1584061 1575722 1557283 1528860 1490713 1443464 1388706 1328858
50478 1328858 1266297 1202792 1139534 1077348 1016939 959197 905165 855568 810501 769685 732801
50467 732801 699537 669689 643356 620686 601310 584499 570093 558648 550353 544416 540007 537230
50455 537230 536528 537633 539801 542800 546952 552459 559339 567707 577432 587755 598027 608632 620407
50442 620407 633275 646289 658963 671631 684449 697006 709244 721873 735433 749618 764022
50431 764022 779013 795299 812937 831255 849569 867767 886359 906163 927723 950954 975594
50420 975594 1001952 1030727 1062081 1095413 1130179 1166299 1203484 1240776 1277244 1312674 1347017
50409 1347017 1379512 1408889 1434235 1455131 1471001 1480865 1483884 1479905 1469356 1452605 1429430 1399169
50397 1399169 1361605 1317681 1269149 1217571 1164046 1109828 1056561 1005580 957442 912485 871443
50386 871443 835192 804280 779052 759768 746128 737127 732036 731269 735623 744813 757358 771816 787452
50373 787452 803629 819201 832685 842589 847602 847097 841694 832728 820753 805001 784732 760725 734941
50360 734941 708956 683242 657897 633360 610154 588323 567519 547590 528831 511674 496341
50349 496341 482781 470754 459844 449607 439976 431453 424653 419568 415544 412045 409212 407443 406717
50336 406717 406676 407313 409137 412541 417295 422821 428738 434987 441650 448893 456939 465808 475134 484509 494006
50321 494006 504047 514674 525281 535321 544987 554820 564772 574211 582907 591466 600466 609597 618191
50308 618191 626297 634557 643039 650942 657689 663712 669668 675316 679762 682609 684280 685235 685401 684510 682464
50293 682464 679085 673836 666246 656498 645283 633133 620193 606690 593248 580502 568569 557170
50281 557170 546202 535898 526399 517497 509024 501306 494899 489928 485953 482516 479545 477177 475450 474335
50267 474335 473899 474226 475280 477008 479438 482514 485933 489330 492558 495657 498552 500999 502817 504025 504739
50252 504739 505052 505010 504546 503454 501591 499197 496857 495032 493647 492186 490105 487158 483464 479426 475539
50237 475539 472038 468684 465023 461073 457603 455476 454643 454087 453015 451880 451885 453541 456155 458814 461434
50222 461434 464515 468144 471707 474511 476402 477793 479319 481455 484056 486191 486737 485417 483032 480502
50208 480502 477827 474287 469552 464233 459192 454606 449976 444966 439900 435285 431019 426383 420892 414929
50194 414929 409340 404507 400067 395596 391263 387534 384379 381128 377229 372878 368768 365409 362871 360975
50180 360975 359406 357712 355659 353662 352512 352423 352584 351879 349834 346678 342780 338465 334204 330393 326799
50165 326799 322636 317476 311799 306413 301547 296826 292042 287583 283949 281080 278370 275411 272518 270342
50151 270342 269019 267961 266611 265134 264119 263742 263598 263335 263072 263077 263312 263503 263479 263270 263037 263045 263635 265103
50133 265103 267542 270750 274187 277183 279447 281396 283772 286903 290535 294293 297920 301149 303810 306278
50119 306278 309313 313163 317173 320628 323663 326969 330893 335255 339830 344486 348927 352829 356338 360042
50105 360042 364280 368722 372779 376239 379416 382763 386510 390583 394809 399054 403127 406672 409476 411898
50091 411898 414690 418265 422404 426856 431783 437345 443200 448886 454457 460351 466820 473945 481969 491012
50077 491012 500547 509787 518673 527964 538205 549148 560388 572095 584849 599074 614890 632264
50065 632264 651053 671042 692109 714190 737099 760679 785142 810838 837565 864508 891063
50054 891063 917272 943176 968094 990947 1010980 1027857 1041389 1051645 1059205 1064825 1068891 1071522
50042 1071522 1073069 1074040 1074474 1073756 1071097 1065940 1057811 1046147 1030544 1011054 988138 962375 934301
50029 934301 904465 873625 842930 813741 787055 763066 741400 721771 704218 688768 675123
50018 675123 662894 652000 642706 635264 629536 624879 620381 615350 609679 603633 597258 590183 582152 573547
50004 573547 565047 556780 548190 538866 529198 519920 511201 502564 493600 484369 475111 466010 457417 449884
49990 449884 443654 438345 433440 428873 424834 421231 417788 414530 411726 409416 407476 406146 405963 406949 408269
49975 408269 408936 408614 407569 406231 405066 404547 404803 405334 405372 404524 402951 401094 399471 398623 398865 400004 401494
49958 401494 403019 404844 407529 411332 415987 421103 426691 433188 440978 450126 460712 473174 488071
49945 488071 505633 525818 548651 574145 602072 632221 664777 699839 736544 773359 809396
49934 809396 844768 879339 911910 941368 968127 993726 1019208 1044533 1069238 1092838 1114566
49923 1114566 1133519 1149235 1161508 1169388 1170983 1164717 1150530 1129582 1103086 1071837 1036633 998577
49911 998577 958738 917775 876139 834608 794272 755769 718705 682288 646585 612700 581488
49900 581488 552625 525467 500415 478670 460664 445428 431676 418917 407259 396648 386790 377588
49888 377588 369210 361770 355117 348931 342868 336694 330416 324258 318479 313230 308488 304023 299545 295129
49874 295129 291385 288880 287398 286140 284643 283149 281960 280868 279469 277746 276074 274831 274219 274293 274913
49859 274913 275809 276801 277858 278885 279669 280185 280629 281049 281221 281154 281378 282383 283971 285495 286569 287214 287492
49842 287492 287467 287503 288131 289505 291275 293130 295161 297595 300415 303490 306946 311223 316703 323355 330722
49827 330722 338372 346486 356007 368013 382779 399558 417353 435960 456194 479041 504536 531450
49815 531450 558214 584109 609378 634141 657538 678345 696236 711972 726305 739215 750505
49804 750505 760666 770559 780295 788942 795444 799326 800203 797016 788405 773840 753966 729747 701755
49791 701755 670571 637488 604272 572268 541997 513513 486777 461711 438331 417022 398417
49780 398417 382799 369721 358339 347979 338400 329751 322383 316520 311999 308453 305743 303954 302888
49767 302888 301943 300659 299129 297676 296424 295469 295132 295637 296645 297494 297860 297968 298248 299034 300395 301924
49751 301924 302791 302469 301427 300777 301192 302442 303969 305434 306656 307456 307830 308048 308383 308894 309598 310613 311984
49734 311984 313544 315109 316612 317932 318791 319025 318834 318633 318770 319411 320449 321339 321339 320265 318922 318464 319301
49717 319301 320793 321978 322420 322433 322729 323883 325913 328241 330129 331212 331612 331618 331439 331231 331140 331227 331433 331681
49699 331681 331906 331931 331464 330390 329039 327959 327397 327121 326854 326739 327165 328157 329139 329412 328752 327468 326034
49682 326034 324812 323963 323399 322842 322160 321578 321367 321359 321111 320592 320371 320935 322090 323307 324337 325172 325583 325240
49664 325240 324372 323860 324384 325697 326958 327652 327909 328009 327994 327891 327993 328519 329038 328606 326706 323885 321304
49647 321304 319849 319824 321193 323657 326524 329011 330875 332449 333954 335151 335895 336616 337837 339453 340910
49632 340910 341940 342676 343116 342949 342015 340584 339114 338057 337901 338977 341011 343229 345176 347180 349814
49617 349814 353146 356728 360066 362840 364948 366708 368835 371878 375716 379886 384255 389006 394072 399094
49603 399094 403987 409074 414504 419941 425128 430384 436209 442559 448874 454764 460406 466313 472952 480514
49589 480514 488777 497223 505544 514030 523181 532961 542793 552437 562480 573655 585893 598474 611036
49576 611036 624014 637983 652946 668508 684487 701043 718287 736003 753812 771428 788795
49565 788795 806179 824125 843088 863003 883382 903908 924721 946012 967565 988940 1009899
49554 1009899 1030423 1050431 1069836 1088764 1107335 1125252 1142009 1157511 1172061 1185613 1197563
49543 1197563 1207553 1216012 1223418 1229431 1233373 1235347 1236181 1236280 1235250 1232859 1229760 1226851 1224391 1222124 1220019
49528 1220019 1218400 1217434 1216897 1216552 1216562 1217503 1219959 1224013 1229128 1234747 1241038 1248741 1258163 1268661 1279296
49513 1279296 1289552 1299162 1307772 1315370 1322683 1330383 1337954 1344058 1348071 1350585 1352276 1352987 1352280 1350215
49499 1350215 1347048 1342592 1336420 1328538 1319327 1308962 1297263 1284088 1269548 1253868 1237303 1220076
49487 1220076 1202080 1182821 1162025 1140235 1118407 1096917 1075347 1053293 1030965 1008838 987123
49476 987123 965874 945319 925759 907199 889346 871926 854827 838018 821539 805667 790923
49465 790923 777786 766362 756330 747195 738586 730335 722383 714683 707210 699986 693046 686489 680553
49452 680553 675518 671447 668126 665305 662815 660367 657605 654683 652559 652227 653663 655983 658654 662031
49438 662031 666551 671929 677573 683443 690015 697548 705734 713915 721258 726867 730195 731443 731332 730545 729643
49423 729643 729359 730348 732624 735733 739612 744735 751228 758444 765847 773843 783094 793423 804096 814968
49409 814968 826570 838980 851481 863576 875680 888365 901478 914509 927411 940443 953546
49398 953546 966498 979496 992804 1005864 1017439 1026842 1034455 1040903 1046354 1050936 1055193 1059473 1063248
49385 1063248 1065704 1066863 1067599 1068623 1069993 1071552 1073304 1075212 1077091 1078878 1080711 1082604 1084449 1086497
49371 1086497 1089409 1093496 1098215 1102765 1107014 1111466 1116466 1121814 1127167 1132471 1137903 1143672 1149987 1157072
49357 1157072 1165054 1173904 1183518 1193801 1204651 1215978 1227789 1240204 1253349 1267296 1282062 1297668
49345 1297668 1314207 1331915 1350995 1371253 1392020 1412722 1433541 1455333 1478820 1504054 1530663
49334 1530663 1558377 1587122 1616773 1647012 1677408 1707556 1737244 1766612 1796081 1825923 1855938
49323 1855938 1885612 1914584 1942900 1970870 1998707 2026168 2052441 2076599 2098325 2118082 2136315
49312 2136315 2152705 2166586 2177975 2187605 2195841 2202086 2205613 2206583 2205834 2203918 2200848 2196678 2191839 2186855
49298 2186855 2182026 2177385 2172646 2167251 2160924 2154232 2148200 2143270 2139053 2135275 2132470 2131335 2131779 2133119
49284 2133119 2135121 2138386 2143680 2151127 2160117 2169826 2179840 2190359 2201679 2213413 2224467 2234039 2242291
49271 2242291 2249623 2255595 2259245 2260395 2259884 2258274 2254971 2249086 2240654 2230460 2218960 2206027 2191622
49258 2191622 2176063 2159502 2141635 2122264 2101794 2080828 2059362 2036781 2012666 1987321 1961347
49247 1961347 1934937 1907896 1880264 1852560 1825297 1798600 1772547 1747573 1724027 1701426 1678717
49236 1678717 1655527 1632782 1611862 1593368 1576954 1562033 1548344 1535948 1525066 1515899 1508387 1502145
49224 1502145 1496739 1491901 1487385 1482902 1478560 1475116 1473334 1473102 1473590 1474268 1475323 1476974 1478918 1480782 1482770
49209 1482770 1485448 1489081 1493523 1498614 1504272 1510228 1516115 1521949 1528188 1535128 1542516 1549987 1557635 1565757
49195 1565757 1574190 1582344 1590020 1597785 1606302 1615552 1624986 1634234 1643323 1652328 1661242 1670166 1679236 1688253
49181 1688253 1696739 1704516 1711964 1719578 1727526 1735733 1744050 1752173 1759736 1766756 1773756 1781215 1789213 1797821
49167 1797821 1807425 1818208 1829689 1841305 1853252 1866197 1880282 1894947 1909639 1924090 1937999
49156 1937999 1951175 1964153 1977907 1992621 2007275 2020822 2033309 2045488 2057731 2069807 2081393
49145 2081393 2092331 2102572 2112242 2121624 2130821 2139652 2148097 2156537 2165206 2173722 2181584 2188882 2196017
49132 2196017 2202883 2208903 2213856 2218218 2222654 2227534 2232908 2238531 2243874 2248551 2252829 2257368 2262361 2267306
49118 2267306 2271675 2275340 2278172 2279658 2279370 2277643 2275435 2273565 2272261 2271415 2270989 2271134 2271979 2273439 2275254
49103 2275254 2277215 2279308 2281534 2283707 2285538 2286906 2287925 2288745 2289386 2289745 2289711 2289392 2289259 2289912 2291538 2293790
49087 2293790 2296383 2299545 2303556 2308111 2312607 2316874 2321109 2325180 2328611 2331326 2333745 2335958 2337454 2337941
49073 2337941 2337849 2337502 2336280 2333171 2327806 2320519 2311644 2301332 2289797 2277170 2263206 2247718 2231214
49060 2231214 2214470 2197406 2179006 2158575 2136610 2114150 2091676 2069035 2046209 2023724 2002282
49049 2002282 1982183 1963130 1944526 1926016 1907810 1890547 1874853 1860991 1848714 1837301 1825995
49038 1825995 1814748 1804444 1796097 1789867 1785178 1781626 1779279 1778118 1777739 1777880 1778822 1780951 1784234 1788332
49024 1788332 1792877 1797370 1801172 1803968 1806045 1807810 1809322 1810582 1811908 1813495 1814851 1815233 1814510 1813071
49010 1813071 1811062 1808367 1805253 1802288 1799501 1796362 1792782 1789362 1786238 1782496 1777412 1771652 1766407 1761755
48996 1761755 1756812 1751307 1745918 1741007 1736106 1731051 1726662 1723601 1721202 1718258 1714560 1710836 1707420 1703853
48982 1703853 1699748 1695148 1689855 1683246 1675275 1667023 1659674 1653283 1647074 1640611 1634048 1627454 1620726 1614296
48968 1614296 1609167 1605814 1603531 1601245 1598665 1596203 1594166 1592678 1592243 1593639 1596944 1601199 1605412 1609671
48954 1609671 1614879 1621579 1629401 1637660 1646052 1654684 1663697 1673154 1683128 1693626 1704366 1714804 1724556
48941 1724556 1733780 1743041 1752735 1762691 1772448 1781829 1791166 1800941 1811384 1822494 1834261 1846731 1859991
48928 1859991 1874297 1890125 1907899 1927666 1949208 1972380 1997092 2023040 2049830 2077443 2106254
48917 2106254 2136485 2167951 2200504 2234345 2269604 2305941 2342973 2380910 2420285 2461084 2502573
48906 2502573 2543985 2584998 2625545 2665617 2705368 2744947 2784039 2821952 2858453 2894063 2929167
48895 2929167 2963203 2995295 3025399 3054100 3081299 3105892 3127163 3145957 3163875 3181545 3198171
48884 3198171 3212759 3225216 3236104 3245766 3254140 3261185 3267022 3271513 3274012 3273742 3270375 3264188 3255746
48871 3255746 3245500 3233532 3219549 3203220 3184647 3164322 3142499 3118753 3092495 3063862 3033689
48860 3033689 3002562 2970254 2936319 2900888 2864607 2827973 2791086 2753910 2716438 2678604 2640403
48849 2640403 2602212 2564702 2528334 2493162 2459315 2427433 2398280 2371900 2347411 2323845 2301082
48838 2301082 2279818 2260717 2243846 2229035 2216416 2206321 2198715 2193076 2188890 2185986 2184362 2184032 2185169
48825 2185169 2188067 2192713 2198639 2205470 2213429 2222991 2234188 2246598 2259884 2273961 2288642 2303486
48813 2303486 2318081 2332300 2346234 2360056 2373895 2387652 2401051 2414136 2427590 2442174 2457894
48802 2457894 2474068 2490149 2506032 2521612 2536620 2551077 2565432 2580023 2594809 2609775 2625089
48791 2625089 2640598 2655756 2670484 2685601 2701901 2719166 2736656 2754222 2772309 2791062 2810145
48780 2810145 2829344 2848706 2868064 2887006 2905423 2923568 2941498 2958951 2975812 2992135 3007540
48769 3007540 3021140 3032331 3041176 3047785 3051820 3052967 3051486 3047853 3042099 3033816 3022586 3008184 2990700
48756 2990700 2970710 2949057 2926172 2901985 2876713 2851195 2825933 2800295 2773448 2745782 2718664
48745 2718664 2692876 2668121 2643998 2620658 2598260 2576637 2555971 2537143 2520882 2506968 2494809
48734 2494809 2484448 2476429 2470896 2467464 2465945 2466599 2469519 2474240 2480180 2487207 2495510 2505014 2515144 2525185
48720 2525185 2534864 2544591 2555025 2566275 2577560 2587879 2597006 2605723 2615036 2625352 2636434 2647907
48708 2647907 2659627 2671622 2683902 2696370 2708855 2721189 2733286 2745213 2757148 2769259 2781588
48697 2781588 2794098 2806926 2820587 2835804 2853034 2872176 2892774 2914461 2937068 2960449 2984406
48686 2984406 3008873 3034019 3060019 3086742 3113733 3140504 3166869 3192980 3219018 3244816 3269760
48675 3269760 3293080 3314229 3332995 3349388 3363504 3375334 3384561 3390626 3393223 3392690 3389627 3384152 3375841
48662 3375841 3364506 3350593 3334526 3316020 3294527 3270203 3243866 3215928 3185886 3153155 3118046
48651 3118046 3081549 3044341 3006339 2967155 2926686 2885283 2843607 2802339 2761757 2721570 2681316
48640 2681316 2640979 2600972 2561516 2522324 2483062 2443855 2405140 2367233 2330366 2295006 2261681
48629 2261681 2230353 2200210 2170328 2140489 2111262 2083325 2056768 2031046 2005631 1980690 1956980
48618 1956980 1934962 1914173 1893779 1873679 1854661 1837351 1821414 1806091 1791208 1777205 1764289
48607 1764289 1752061 1740054 1728209 1716699 1705657 1695298 1685977 1677781 1670265 1662986 1656178 1650516
48595 1650516 1646165 1642481 1638827 1635361 1632765 1631357 1630805 1630640 1630795 1631578 1633376 1636526 1641245 1647449 1654653
48580 1654653 1662172 1669485 1676391 1682955 1689491 1696493 1704243 1712343 1719806 1725823 1730400 1734218 1738039 1742399
48566 1742399 1747625 1753737 1760273 1766544 1772190 1777363 1782324 1787170 1792054 1797322 1803022 1808439 1812544 1815017
48552 1815017 1816535 1817925 1819274 1820040 1819897 1819184 1818465 1817854 1816992 1815728 1814619 1814551 1815810 1817678 1819101 1819641
48536 1819641 1819702 1819930 1820616 1821614 1822612 1823453 1824364 1825889 1828367 1831445 1834368 1836889 1839626 1843345 1848131 1853563
48520 1853563 1859516 1866346 1874303 1883188 1892771 1903158 1914504 1926611 1939167 1952233 1966153 1980995
48508 1980995 1996467 2012480 2029481 2047910 2067547 2087664 2107812 2128152 2148946 2170042 2191106
48497 2191106 2212197 2233720 2255700 2277309 2297359 2315279 2331483 2346766 2361407 2374867 2386328
48486 2386328 2395529 2403064 2409820 2416044 2421052 2424010 2424932 2424709 2424088 2422910 2420546 2416884 2412503 2407878 2402709
48471 2402709 2396242 2388093 2378632 2368616 2358565 2348420 2337703 2326025 2313449 2300335 2286876 2272990
48459 2272990 2258689 2244236 2229740 2214835 2199072 2182497 2165550 2148549 2131629 2115110 2099456
48448 2099456 2084782 2070782 2057330 2044747 2033284 2022702 2012619 2002947 1993668 1984525 1975452 1967051
48436 1967051 1960121 1954725 1950161 1945863 1941827 1938190 1934895 1932085 1930294 1929845 1930257 1930630 1930540 1930347 1930680 1931772
48420 1931772 1933236 1934383 1934874 1935094 1935690 1936715 1937557 1937896 1938340 1939698 1941897 1944141 1946067 1948178 1950972
48405 1950972 1954072 1956537 1957818 1958225 1958554 1959460 1961007 1962629 1963544 1963363 1962301 1960781 1958961 1956790 1954338
48390 1954338 1951795 1949134 1945980 1941977 1937109 1931573 1925511 1919072 1912629 1906579 1900819 1894716 1887838 1880537
48376 1880537 1873500 1866873 1860254 1853563 1847445 1842559 1838817 1835585 1832381 1829028 1825354 1821271 1817161 1813730
$$ [...]
##END NTUPLES=NMR SPECTRUM
##END=
