##TITLE=NES1089_ptc170_9885004_iPXpzVtu0R
##JCAMPDX= 6.0         $$ Bruker NMR JCAMP-DX V2.0
##DATA TYPE= NMR SPECTRUM
##DATA CLASS= NTUPLES
##ORIGIN= BRUKER
##OWNER= Administrator
$$ 1.72 TOPSPIN		Version 2.1
$$ 2016-08-27 18:04:45.914 -0500  Administrator@X
$$ Compression mode = diff/dup
##.OBSERVE FREQUENCY= 400.02188249412
##.OBSERVE NUCLEUS= ^1H
##.ACQUISITION MODE= SIMULTANEOUS (DQD)
##.ACQUISITION SCHEME= undefined
##.AVERAGES= 8
##.DIGITISER RES= 22
##SPECTROMETER/DATA SYSTEM= spect
##.PULSE SEQUENCE= zg30
##.SOLVENT NAME= COFFEE_meoh
##.SHIFT REFERENCE= INTERNAL, COFFEE_meoh, 1, 14.98509
##AUDIT TRAIL= $$ (NUMBER, WHEN, WHO, WHERE, PROCESS, VERSION, WHAT)
$$ ##TITLE= Audit trail, TOPSPIN		Version 2.1
$$ ##JCAMPDX= 5.01
$$ ##ORIGIN= Bruker BioSpin GmbH
$$ ##OWNER= Administrator
$$ $$ E:\/data/COFFEE/nmr/NES1089_ptc170_9885004_iPXpzVtu0R/20/pdata/1/auditp.txt
$$ ##AUDIT TRAIL=  $$ (NUMBER, WHEN, WHO, WHERE, PROCESS, VERSION, WHAT)
(   1,<2016-08-27 18:04:38.242 -0500>,<Administrator>,<X>,<go>,<TOPSPIN 2.1>,
      <created by zg
	started at 2016-08-27 18:03:32.570 -0500,
	POWCHK enabled, PULCHK disabled,
       configuration hash MD5:
       21 0F 79 D6 B3 7B B4 F6 88 20 88 DB 03 48 BD 9F
       data hash MD5: 64K
       E2 E2 4C 9E 76 C7 83 D4 83 2E 57 ED 59 CF 00 46>)
(   2,<2016-08-27 18:04:41.898 -0500>,<Administrator>,<X>,<proc1d>,<TOPSPIN 2.1>,
      <Start of raw data processing
       efp LB = 0 FT_mod = 6 PKNL = 1 PHC0 = 0 PHC1 = 0 SI = 32K 
       data hash MD5: 32K
       E9 68 86 6C 5C 0A C8 81 45 BD 91 2D B7 A7 F6 9B>)
(   3,<2016-08-27 18:04:42.211 -0500>,<Administrator>,<X>,<proc1d>,<TOPSPIN 2.1>,
      <pk PHC0 = 95.15808 PHC1 = 0 
       data hash MD5: 32K
       6D 09 49 EF 44 1B 6A 6F 1B AE 7B 9C 6F AE D9 A1>)
(   4,<2016-08-27 18:04:42.320 -0500>,<Administrator>,<X>,<proc1d>,<TOPSPIN 2.1>,
      <abs ABSG = 1 
       data hash MD5: 32K
       29 3C FA AD B9 7E 1E 84 66 AE 6D A3 59 BD A1 3F>)
(   5,<2016-08-27 18:04:42.383 -0500>,<Administrator>,<X>,<proc1d>,<TOPSPIN 2.1>,
      <abs ABSG = 2 
       data hash MD5: 32K
       FA 8B D6 B5 2F FE 83 35 36 BA A1 E3 12 CA 59 8B>)
(   6,<2016-08-27 18:04:42.429 -0500>,<Administrator>,<X>,<proc1d>,<TOPSPIN 2.1>,
      <abs ABSG = 3 
       data hash MD5: 32K
       ED 2D CB 02 A1 21 D6 84 BB DE 35 C3 08 34 D5 22>)
(   7,<2016-08-27 18:04:42.492 -0500>,<Administrator>,<X>,<proc1d>,<TOPSPIN 2.1>,
      <abs ABSG = 4 
       data hash MD5: 32K
       73 29 E2 3E B8 D2 CA B5 0E 0C 2E 74 46 5A E8 79>)
(   8,<2016-08-27 18:04:42.554 -0500>,<Administrator>,<X>,<proc1d>,<TOPSPIN 2.1>,
      <abs ABSG = 5 
       data hash MD5: 32K
       FD 00 8B 6A 14 28 73 90 EA 73 A4 EC 68 6A 36 48>)
$$ ##END=
$$ 
$$ $$ hash MD5
$$ $$ CF FD 84 E1 1E AA 53 0D 50 8C 42 A3 6A FC 8A 4E
##$RELAX= 
##$RELAX= 
##$RELAX= 
##$RELAX= 
##$RELAX= 
##$RELAX= 
##$RELAX= 
$$ Bruker specific parameters
$$ --------------------------
##$DU= <E:\>
##$EXPNO= 20
##$NAME= <NES1089_ptc170_9885004_iPXpzVtu0R>
##$PROCNO= 1
$$ [...]
150 150 150 150 150 150 150 150
##$TP07= 0
##$TPNAME0= <>
##$TPNAME1= <>
##$TPNAME2= <>
##$TPNAME3= <>
##$TPNAME4= <>
##$TPNAME5= <>
##$TPNAME6= <>
##$TPNAME7= <>
##$TPOAL= (0..7)
0.5 0.5 0.5 0.5 0.5 0.5 0.5 0.5
##$TPOFFS= (0..7)
0 0 0 0 0 0 0 0
##$TUNHIN= 0
##$TUNHOUT= 0
##$TUNXOUT= 0
##$USERA1= <user>
##$USERA2= <user>
##$USERA3= <user>
##$USERA4= <user>
##$USERA5= <user>
##$V9= 5
##$VALIST= <valist>
##$VCLIST= <CCCCCCCCCCCCCCC>
##$VD= 0
##$VDLIST= <DDDDDDDDDDDDDDD>
##$VPLIST= <PPPPPPPPPPPPPPP>
##$VTLIST= <TTTTTTTTTTTTTTT>
##$WBST= 2048
##$WBSW= 25
##$XGAIN= (0..3)
0 0 0 0
##$XL= 0
##$YL= 0
##$YMAX_a= 543563
##$YMIN_a= -463686
##$ZGOPTNS= <>
##$ZL1= 120
##$ZL2= 120
##$ZL3= 120
##$ZL4= 120
##$ABSF1= 14.98509
##$ABSF2= -5.573092
##$ABSG= 5
##$ABSL= 3
##$ALPHA= 0
##$AQORDER= 0
##$ASSFAC= 0
##$ASSFACI= 0
##$ASSFACX= 0
##$ASSWID= 0
##$AUNMP= <proc_prof1d_extract_pilot.lims>
##$AXLEFT= 0
##$AXNAME= <>
##$AXNUC= <1H>
##$AXRIGHT= 0
##$AXTYPE= 0
##$AXUNIT= <>
##$AZFE= 0.1
##$AZFW= 0.1
##$BCFW= 0
##$BC_mod= 0
##$BYTORDP= 0
##$COROFFS= 0
##$CY= 15
##$DATMOD= 1
##$DC= 0
##$DFILT= <>
##$DTYPP= 0
##$F1P= 0
##$F2P= 0
##$FCOR= 0.5
##$FTSIZE= 32768
##$FT_mod= 6
##$GAMMA= 0
##$GB= 0
##$INTBC= 1
##$INTSCL= 1
##$ISEN= 128
##$LB= 0
##$LEV0= 0
##$LPBIN= 0
##$MAXI= 10000
##$MC2= 0
##$MEAN= 0
##$ME_mod= 0
##$MI= 0
##$NCOEF= 0
##$NC_proc= -8
##$NLEV= 6
##$NOISF1= 0
##$NOISF2= 0
##$NSP= 0
##$NTH_PI= 0
##$NZP= 0
##$OFFSET= 14.98509
##$PC= 1
##$PHC0= 95.15808
##$PHC1= 0
##$PH_mod= 1
##$PKNL= yes
##$PPARMOD= 0
##$PPDIAG= 0
##$PPIPTYP= 0
##$PPMPNUM= 2147483647
##$PPRESOL= 1
##$PSCAL= 4
##$PSIGN= 0
##$PYNMP= <proc.py>
##$REVERSE= no
##$SF= 400.02
##$SI= 32768
##$SIGF1= 0
##$SIGF2= 0
##$SINO= 400
##$SIOLD= 32768
##$SPECTYP= <>
##$SREGLST= <1H.CDCl3>
##$SSB= 0
##$STSI= 32768
##$STSR= 0
##$SW_p= 8223.68421052631
##$SYMM= 0
##$S_DEV= 0
##$TDeff= 65536
##$TDoff= 0
##$TI= <>
##$TILT= no
##$TM1= 0
##$TM2= 0
##$TOPLEV= 0
##$USERP1= <user>
##$USERP2= <user>
##$USERP3= <user>
##$USERP4= <user>
##$USERP5= <user>
##$WDW= 1
##$XDIM= 32768
##$YMAX_p= 420009630
##$YMIN_p= -797494
##$CURPLOT= <Network HP LaserJet P1505>
##$CURPRIN= <$Network HP LaserJet P1505>
##$DFORMAT= <normdp>
##$LAYOUT= <+/1D_H.xwp>
##$LFORMAT= <normlp>
##$PFORMAT= <normpl>
##$SURQMSG= 1
$$ End of Bruker specific parameters
$$ ---------------------------------
##NTUPLES= NMR SPECTRUM
##VAR_NAME=  FREQUENCY,     SPECTRUM/REAL,   SPECTRUM/IMAG
##SYMBOL=    X,             R,               I
##VAR_TYPE=  INDEPENDENT,   DEPENDENT,       DEPENDENT
##VAR_FORM=  AFFN,          ASDF,            ASDF
##VAR_DIM=   32768,         32768,           32768
##UNITS=     HZ,            ARBITRARY UNITS, ARBITRARY UNITS
##FACTOR=    0.250966925370066, 1,           1
##FIRST=     8223.43324360094, 83288,        -58177
##LAST=      0,             136183,          -190629
##MIN=       0,             -797494,         0
##MAX=       8223.43324360094, 420009630,    0
$$ Real data points
##PAGE= N=1
##DATA TABLE= (X++(R..R)), XYDATA
$$ [...]
$$ plain form
19575 -10678 97594 10290 6383 -176207 -346956 37879 8799 -33253 132011 -432914 115103
19563 9994 -213017 97450 124412 -258475 70471 43493 238142 -81880 13989 -43767 293329
19551 -142415 20530 92775 175775 83059 -168687 -374519 -283385 -199059 258559 38934 -39679
19539 -139935 47406 -63256 -36218 -78513 111829 147415 -265149 202217 72050 3085 116250
19528 116250 -277871 102401 18812 -166415 -371656 -174681 -166525 -74156 -9461 70848 -143965
19516 -206942 4319 -292939 -309616 140372 156128 -14203 -12547 -113932 -22289 13381 141865
19505 141865 -133008 -129554 -106209 -195845 14148 -166583 23806 -17711 -52632 124172 -134620
19493 42981 14611 -114044 -351041 -169811 119374 -123201 -213823 -290289 -117628 -48187
$$ packed form
19575a0678I7594A0290l907a76207j70749C7879H799c3253A32011d32914A15103
19563I994b13017I7450K6962b58475G0471k6978J94649h1880A3989d3767B93329
19551a42415B0530P2245Q3000H3059a68687k05832R1134Q4326B58559C8934c9679
19539a39935D7406f3256K7038m2295A11829L5586b65149B02217G2050C085J13165
19528A16250b77871A02401A8812a66415k05241a74681Q156g4156i461G0848a43965
19516b06942D319b92939j6677A40372J5756a4203J656j01385b2289A3381J28484
19505A41865a33008L454K3345q9636A4148a66583B3806a7711l4921A24172a34620
19493D2981A4611a14044k36997a69811A19374a23201r0622p6466a17628d8187
$$ plain form
19482 -27238 261582 -203421 38181 69322 -202483 -181778 -5292 170701 -208694 -37023 -128179
19471 -128179 23319 -32239 312750 -135671 -113875 -175907 -69116 27302 17606 30394 71560
19460 71560 -295774 -52656 76936 -94588 -239477 -126829 140391 82506 267419 74742 -257296
19448 93427 -96677 -282930 -306595 -295535 264381 -203059 6781 5523 -266232 16869 -225260
19436 287672 10504 -111823 10773 419339 -303994 186543 -65026 53616 -264382 38806
19425 109618 -134702 -124824 -204957 63038 259827 -318179 143874 -66092 -156335 -68313 -264960
19414 -264960 -17630 74079 258676 50545 -263021 -103045 111746 -17552 -26261 -102626 -52520
19403 -52520 38987 -272087 184764 182205 -472708 47540 -10506 -290569 -198617 11570 154880
$$ packed form
19482b7238B61582b03421C8181L1141b02483K0705e292A70701b08694c7023r1156
19471a28179B3319c2239C12750a35671K1796o2032f9116B7302r696J2788M1166
19460G1560b95774e2656G6936i4588j44889J12648A40391n7885J84913G4742b57296
19448I3427i6677j86253k3665J1060B64381b03059F781j258b66232A6869b25260
19436B87672A0504a11823A0773M08566c03994A86543f5026E3616b64382C8806
19425A09618a34702R878q0133F3038J96789c18179A43874f6092r0243f8313j96647
19414b64960a7630G4079J84597E0545b63021a03045A11746a7552q709p6365N0106
19403e2520C8987b72087A84764k559d72708D7540a0506k80063R1952A1570J43310
$$ plain form
19392 154880 69828 -119755 -117858 -85829 -183498 -263388 -172051 148312 -40493 -86225 146889
19380 -109759 -71036 -188790 70617 160631 -214558 289522 96319 -26767 -276503 -43568 234231
19368 294531 -151186 131534 -48237 -271759 105984 -58759 -116909 -93186 -440520 -35774
19357 -271146 215772 -38498 -62996 32558 -411331 127889 -23247 -66326 16546 -211057 136892
19345 -361907 -455320 -25578 -444027 215990 -193009 -159080 -46523 290288 -298939 -200638
19335 -200638 -131217 -311306 78890 9645 -141263 -145935 -283007 -139631 46240 137205 -218496
19323 -448818 258037 -171257 480640 -69272 -166112 -259130 -234032 24235 -661123 -53867 -162191
19312 -162191 -72687 -29071 -77712 -9237 -101220 -11195 -125410 -85495 94254 51615 -99578
$$ packed form
19392A54880F9828a19755J897L2029r7669p9890R1337A48312d0493m5732A46889
19380a09759L8723j17754G0617R0014b14558B89522I6319b6767k49736d3568B34231
19368B94531a51186A31534d8237k23522A05984e8759n8150K3723l47334c5774
19357b71146B15772c8498k4498C2558d11331A27889b3247m3079A6546b11057A36892
19345c61907r3413b5578m18449B15990a93009L3929d6523B90288b98939R8301
19335b00638O9421j80089G8890I645a41263m672j37072a39631D6240R0965b18496
19323d48818B58037a71257D80640f9272r6840r3018K5098B4235f61123e3867j08324
19312a62191g2687b9071m8641i237r1983a1195j14215L9915I4254m2639i9578
$$ plain form
19300 -82917 -218604 -415981 50062 -169728 -136107 -164927 -238767 62600 35864 90882 276519
19289 276519 318912 -232598 -82739 -61230 -171947 199826 20254 -259376 125391 -21900
19278 -195170 -75376 -182468 251978 -101719 -374924 142181 -91747 140953 -125753 67905
19267 -96619 362943 17568 -241552 -88044 209795 16344 -208486 166067 34628 942 -291804
19255 132070 -157501 -129727 -192161 -437662 -29196 -205735 -443290 -116109 -116873 -40873 -109689
19244 -109689 -62847 -242283 16537 93902 -55155 -140675 -102186 -43099 14468 9467 14580 -316238
19231 320420 130435 39972 245785 -4489 -144326 106495 87838 -58111 -142790 -102155 -167008
19220 -167008 -166240 202096 -186974 -19523 -58100 -81957 -128722 -61971 80468 87941 202141
$$ packed form
19300h2917j35687j97377E0062a69728L3621k8820p3840F2600k6736N5018J85637
19289B76519M2393b32598h2739K1509j10717A99826B0254b59376A25391b1900
19278a95170g5376j07092B51978a01719k73205A42181i1747A40953a25753F7905
19267i6619C62943A7568b41552h8044B09795A6344b08486A66067C4628I42b91804
19255A32070a57501K7774o2434k45501b9196j76539k37555a16109p64d0873o8816
19244a09689M6842j79436A6537P7365e5155q5520L8489d3099A4468n001N113c16238
19231C20420A30435C9972K05813d489j39837A06495j8657e8111q4679M0635o4853
19220a67008P68B02096a86974a9523l8577k3857m6765f1971H0468P473J14200
$$ plain form
19209 202141 -94538 -318105 -220848 -85560 175574 3142 -64196 -13913 -258943 -121351 -47342
19197 -128804 105136 -289354 88972 -252746 267783 -217691 103095 -310436 -210918 -290029
19187 -290029 -163222 -187552 95574 -274171 67827 -140604 137491 231657 282641 -242805
19176 -270852 -216235 40342 351544 249392 12970 200626 -475683 -45487 -42570 -268801 -171927
19165 -171927 65467 -222702 87468 -120658 -209787 -274539 -242777 -40703 -507390 -91502 -215962
19154 -215962 94744 -151987 29157 -37029 -14101 -226496 -175896 -290188 -317660 -447448 220606
19142 216044 112716 -193639 -28040 -207622 -102760 -183406 85001 73392 -197304 90141
19131 -160739 -142875 51581 74910 183604 -299808 119173 229806 179936 -187970 -35179
$$ packed form
19209B02141i4538k23567R7257h5560A75574C142f4196a3913k45030a21351d7342
19197a28804A05136b89354H8972b52746B67783b17691A03095c10436R9518p9111
19187b90029J26807k4330I5574b74171F7827a40604A37491R4166N0984b42805
19176b70852N4617D0342L11202j02152A2970J87656d75683d5487K917k26231R6874
19165a71927F5467b22702H7468a20658q9129o4752L1762d0703m66687i1502j24460
19154b15962I4744a51987B9157c7029a4101k12395N0600j14292k7472j29788B20606
19142B16044j03328a93639b8040j79582a02760q0646H5001j1609a97304I0141
19131a60739J7864E1581K3329J08694b99808A19173J10633m9870a87970c5179
$$ plain form
19120 -25417 118029 -308896 76247 -59359 -9871 291968 34229 12033 -292316 88123 -60284
19108 -25988 33522 -42546 -105982 -51738 -106971 60365 5141 102305 -46670 32705 92628 -197124
19095 -142086 -10187 23955 -82423 161781 100821 -393167 -249304 -110498 -151232 -211030 217547
19083 -252594 -31576 330251 118080 -122076 47918 -38328 -127457 -106358 -18888 -64596 85751
19071 137776 -137195 42253 -46610 144249 79679 106378 -180214 290439 -213743 -217427 127299
19059 163386 186155 -54601 -454561 -96587 -101871 -47465 168561 -211541 132130 -90622 79479
19047 343576 -182687 -168141 -113133 2815 97022 162512 -101516 -40392 -400970 -165137 -81851
19035 150314 176390 -161551 -22047 38409 437835 46219 -224922 -79703 -48709 36865 -3671
$$ packed form
19120b5417A18029c08896G6247e9359i871B91968C4229A2033b92316H8123f0284
19108b5988C3522d2546o3436e1738n5233F0365E141R7164d6670C2705N9923a97124
19095a42086a0187B3955h2423A61781o0960c93167J43863a10498m0734n9798B17547
19083b52594c1576C30251A18080a22076D7918c8328q9129K1099a8888m5708H5751
19071A37776a37195D2253d6610A44249o4570K6699a80214B90439b13743l684A27299
19059A63386K2769e4601l99960i6587n284d7465A68561b11541A32130i0622G9479
19047C43576a82687J4546N5008B815R4207O5490a01516d0392l60578a65137h1851
19035A50314K6076a61551b2047C8409L99426D6219b24922g9703L0994C6865c671
$$ plain form
19023 -164544 272262 102110 -108453 -165524 -191312 -24004 -7649 3794 42757 14276 3354
19011 -52308 -144330 -386464 -18661 -86001 35841 -110295 -108502 164678 -263869 48648 -41040
18999 81837 -179746 -97452 46104 47455 -75774 -273036 170969 185071 -3264 -285021 77247
18987 -161912 109566 -161256 -254836 -149447 -200313 -187597 -109384 -131782 -89585 120388 63248
18976 63248 -179269 125864 -434729 109395 -133022 -8057 177335 -18419 73660 -63595 -36909
18965 -36909 -113968 -67241 101049 -162513 -64543 204408 -199764 230790 -248727 -4664 215775
18953 -301472 -192854 -131420 2821 191832 93644 260867 -189188 40439 -222727 -532288
18943 -532288 -139673 -93006 153657 -166619 172687 -66069 -219791 81882 7776 -134177
$$ packed form
19023a64544B72262A02110a08453n7071k5788b4004g649C794L8963A4276C354
19011e2308r2022k42134a8661o7340C5841a10295J793A64678b63869D8648d1040
18999H1837a79746Q2294D6104J351g5774j97262A70969J4102c264k81757G7247
18987a61912A09566a61256r3580J05389n0866J2716P8213k2398M2197A20388n7140
18976F3248a79269A25864d34729A09395a33022h057A77335a8419G3660f3595K6686
18965c6909p7059M6727A01049a62513f4543B04408a99764B30790b48727d664B15775
18953c01472J08618O1434B821J89011I3644J67223a89188D0439b22727l09561
18943e32288a39673M6667A53657a66619A72687f6069j53722H1882G776a34177
$$ plain form
18932 320281 -39962 141638 36621 58545 -75911 -132138 -97984 -303861 -206661 628 152581
18921 152581 89789 3395 158912 -7122 14164 107920 -141915 38376 136255 -208398 -17785
18909 313236 -50838 47598 -164514 -244221 -112038 259492 27048 -122838 11188 -64226 -58425
18898 -58425 -178469 -118812 -59403 255670 -89217 -83281 19839 -356161 112706 365889 531150
18887 531150 -248202 -250466 -134746 160148 84253 -341457 -35754 -88750 -199621 -31189 -120993
18876 -120993 31714 -94285 -40010 152620 -241487 -19114 -297177 120800 183327 25911 -363067
18864 -56367 20171 -31398 320490 -34192 -43601 338973 -188187 -119625 45810 83363 294604
18853 294604 63505 -145562 -95213 -99397 165718 26935 109628 149293 -66051 -797494 -291206
$$ packed form
18932C20281c9962A41638C6621K1924g5911n6227L4154k05877R7200F28J51953
18921A52581o2792C395J55517g122A4164R3756a41915C8376R7879b08398a7785
18909C13236e0838D7598a64514p9707a12038B59492B7048a22838A1188f4226N801
18898e8425j20044N9657e9403B55670h9217N936A9839c56161A12706K53183J65261
18887E31150b48202k264J15720A60148p5895c41457c5754n2996j10871c1189q9804
18876a20993C1714i4285d0010A52620b41487a9114k78063A20800O2527B5911c63067
18864e6367B0171c1398C20490c4192r409C38973a88187O8562D5810L7553K11241
18853B94604F3505a45562N0349m184A65718B6935Q2693L9665f6051p31443b91206
$$ plain form
18841 -64175 -146375 135125 -172352 44302 249635 155285 -366110 5522 -134702 144625 -221980
18829 46574 -122144 -152827 -103296 -109149 25308 -15054 175881 -45016 -136216 -76838 66950
18817 430786 -182818 70623 -220833 -446103 413009 -99486 -72009 191520 -56276 16141
18806 -69618 -98237 53976 53365 -85355 -255422 -97661 184690 -154677 -159965 96173 -71279 -261326
18794 -261326 -134132 -211053 -52393 -38135 -102853 -97533 -33931 132995 275716 -221117 -183338
18783 -183338 -182296 259359 -9985 27554 -30713 -307466 -142994 65136 -105468 -12676 80062
18771 -80568 -49439 -164056 92702 95452 -175794 83252 -122609 -357462 173361 88098 -17172
18759 -128834 335417 217276 -200957 -242304 104646 16077 -308787 -55999 -70880 -216828
$$ packed form
18841f4175q2200A35125a72352D4302K05333r4350c66110E522a34702A44625b21980
18829D6574a22144l0683M9531n853B5308a5054A75881d5016r1200N9378F6950
18817D30786a82818G0623b20833k25270D13009i9486K7477A91520e6276A6141
18806f9618k8619E3976o11h5355j70067i7661A84690a54677n288I6173g1279j90047
18794b61326J27194p6921e2393J4258o4718N320c3931A32995J42721b21117L7779
18783a83338J042B59359i985B7554c0713k76753a42994F5136a05468a2676H0062
18771h0568L1129j14617I2702K750a75794H3252a22609k34853A73361q5263a7172
18759a28834C35417j18141b00957m1347A04646A6077c08787e5999j4881j45948
$$ plain form
18749 -216828 -143181 -211988 -195438 -284374 52082 -140363 -187205 -28746 -486466 -144580 214034
18737 35399 118091 90419 201227 -36102 -248126 135368 -159248 23362 -334323 121141
18726 -48298 -72524 29165 118521 -5057 -220158 -346812 -78818 -39925 -291022 -84651 -3335
18714 285746 -50406 -10594 74328 150999 -167238 54715 -111788 -184899 69131 -366522 -68829
18702 -9935 27632 -349566 -130341 -142475 -129126 122310 121647 -394943 -331166 324031 -111759
18690 -12702 -38237 -212195 83968 -266405 -340541 -185106 67334 84515 -82169 104494 -1925
18678 95472 -113835 -27176 122343 161518 68491 -124890 39351 126114 -18243 -481754 57813
18666 36492 -28543 30751 -211783 184884 -147019 -11549 10152 -183865 189283 -11837 -42075
$$ packed form
18749b16828P3647o8807J6550q8936E2082a40363m6842b8746m57720a44580B14034
18737C5399Q2692k7672J10808c6102k12024A35368a59248B3362c34323A21141
18726d8298k4226B9165Q9356e057k15101j26654g8818L8893k51097h4651c335
18714B85746e0406a0594G4328P6671a67238E4715a11788p3111F9131c66522f8829
18702i935B7632c49566a30341j2134J3349A22310o63c94943O3777C24031a11759
18690a2702k5535j73958H3968b66405p4136J55435F7334J7181h2169A04494a925
18678I5472a13835b7176A22343L9175F8491a24890C9351Q6763a8243m63511E7813
18666C6492b8543C0751b11783A84884a47019a1549A0152a83865A89283a1837l0238
$$ plain form
18655 -42075 -74011 -193343 -222587 104646 259972 -201577 -60127 -212970 211717 271523
18645 271523 76912 92257 -114790 -131697 130747 -449802 -107712 -112338 -81159 -140292 34587
18633 -124459 47935 33516 95573 -213640 -155885 -74353 -157480 -210252 -129914 -309782 -104714
18621 81468 -397905 149836 33330 146831 -140230 -285781 37573 -189647 -266743 27930
18610 76735 -89208 7718 -27004 147575 62093 -163458 395375 -192889 -86935 -131350 -134355
18599 -134355 209584 38487 38590 -141146 10276 118636 -35436 -308240 -139754 -357583 -112185
18587 -173808 -374471 136743 -240286 414322 191483 185312 -113013 37407 -327513 77103
18576 198611 -281689 -50679 -134143 -90150 -62455 16025 53929 110891 -215265 -43613 119583
$$ packed form
18655d2075l1936j19332k9244A04646J55326b01577f0127j52843B11717N9806
18645B71523G6912J5345a14790j6907A30747d49802a07712m626L1179n9133C4587
18633a24459D7935j4419O2057b13640N7755g4353q3127n2772Q0338j79868a04714
18621H1468c97905A49836C3330J13501a40230j45551C7573a89647p7096B7930
18610G6735h9208G718b7004A47575F2093a63458C95375a92889h6935m4415l005
18599a34355B09584C8487J03a41146A0276J08360c5436k72804a39754k17829a12185
18587a73808k00663A36743b40286D14322A91483o171a13013C7407c27513G7103
18576A98611b81689e0679q3464M3993K7695A6025L7904N6962b15265d3613A19583
$$ plain form
18564 136239 -42970 -172868 82220 -57432 -94992 -145292 -18145 -63243 -13402 -332279 142631
18552 35873 112624 118850 -283130 -143627 182223 -238013 -417078 -256103 -124362 124805
18541 19258 121526 -82954 243918 -39889 -75677 72613 -174727 -80269 -58857 35701 79464
18530 79464 -72066 -332223 28242 -85020 85843 -99789 -202238 -181454 -196668 -128634 18045
18518 -176396 -51337 23355 172760 -107823 -151682 -107529 -175169 132366 -249021 -58725 137151
18506 -142549 29155 34832 12505 -391796 429098 -69530 -359224 -27796 2334 -265649 -13032
18494 -15417 -120908 -333389 -107899 -214491 -91726 -235959 166461 176903 233351 -169323
18483 -199368 -222894 187154 -324716 261750 -488276 43410 -96380 31656 -187310 -46648
$$ packed form
18564A36239d2970j29898H2220e7432l7560n0300a8145m5098a3402l18877A42631
18552C5873P6751O226b83130J39503A82223b38013j79065J60975a24362A24805
18541A9258J02268h2954B43918c9889l5788G2613a74727h0269K1412C5701M3763
18530G9464g2066k60157B8242h5020H5843i9789j02449K0784j5214O8034A8045
18518a76396e1337B3355J49405a07823m3859M4153o7640A32366b49021e8725A37151
18506a42549B9155N677A2505c91796D29098f9530k89694b7796B334b65649a3032
18494a5417j05491k12481a07899j06592i1726j44233A66461J0442N6448a69323
18483a99368k3526A87154c24716B61750d88276D3410i6380C1656a87310d6648
$$ plain form
18472 -201194 -296002 -183098 -492637 -322768 29961 -400541 128789 128392 -158143 76223 -238724
18460 187379 -159371 189994 20646 -173092 -17026 -133351 -187393 -97725 28468 -481598
18449 -359391 -156594 -176001 215697 -154607 -73298 114335 -15140 -199929 19372 98654
18439 98654 389946 -43420 -105785 -174589 42326 58937 -102206 -99298 -132952 -236019 95873
18427 -143448 -55381 -104593 2452 53150 29189 98297 -167458 -340391 -249196 -130441 -107406
18416 -107406 125443 23715 65563 197979 -38034 272730 62696 358693 -74840 45122 147215
18405 147215 169068 267327 -160448 -174495 -229065 -13047 -118843 -294322 -375990 -214159 -242648
18394 -242648 73582 -47565 29845 254579 -110758 73789 -369063 -176373 -319075 16520
$$ packed form
18472b01194r4808J12904l09539J69869B9961d00541A28789l97a58143G6223b38724
18460A87379a59371A89994B0646a73092a7026j16325n4042Q9668B8468d81598
18449c59391a56594j9407B15697a54607g3298A14335a5140j84789A9372P9282
18439I8654K91292d3420o2365o8804D2326J6611a02206K908l3654j03067I5873
18427a43448e5381m9212B452N0698k3961O9108a67458j72933R1195J18755K3035
18416a07406A25443B3715M1848J32416c8034B72730F2696K95997g4840D5122J02093
18405A47215K1853R8259a60448j4047n4570a3047j05796j75479q1668J61831k8489
18394b42648G3582d7565B9845K24734a10758G3789c69063a76373j42702A6520
$$ plain form
18383 -28363 233011 -296408 27278 133074 442111 -64030 -63185 -179247 144980 -211490 12506
18371 82496 -28833 -32126 56195 -391827 59367 -48851 324622 -372551 -32979 89709 -9962
18359 -336874 -188924 -44658 -204699 296752 20206 -103244 -83292 -341011 -136854 -12982
18348 -74915 -208622 -188438 -197110 -47544 -48696 164649 28096 81807 19944 -33068 -32579 -179198
18336 -179198 -397911 417914 -119900 39643 -140535 -46605 -48801 -131130 82273 84525 71286
18325 71286 -298897 -173688 -86238 -211748 -26563 68437 -463458 -9269 -175743 -366253 14087
18313 167505 -37485 25632 34863 -51794 -203059 -13714 -102553 -278290 46060 -195944 -199252
18302 -199252 187644 282473 187128 -306590 -176635 -10956 -7295 127459 -57648 98906 120763
$$ packed form
18383b8363B33011b96408B7278J05796L09037f4030Q45j16062A44980b11490A2506
18371H2496b8833l293E6195c91827E9367d8851C24622c72551c2979H9709i962
18359c36874J47950d4658j60041B96752B0206a03244J9952k57719a36854a2982
18348g4915j33707K0184q672d7544j152A64649B8096N3711A9944c3068M89j46619
18336a79198k18713D17914a19900C9643a40535d6605k196q2329H2273K252j3239
18325G1286b98897J25209h6238j25510b6563F8437d63458i269j66474j90510A4087
18313A67505c7485B5632R231e1794j51265a3714q8839j75737D6060a95944l308
18302a99252A87644R4829r5345c06590J29955a0956L661A27459e7648I8906K1857
$$ plain form
18291 120763 -41222 -131379 -195727 100552 -41690 -127828 2721 93255 35710 430177 -267430
18279 321041 142989 -176127 -240356 247340 -222316 332566 133930 32011 114915 59434
18269 59434 -107491 97275 3674 119421 225999 -365260 -43976 -227865 -118873 20132 70918
18258 70918 -11315 -80866 86534 -85835 167794 164328 -208990 -29511 -125335 -56203 103180
18246 -234662 35458 3142 60549 275564 8939 24355 107030 -182414 -348370 -15219 219864
18234 -432159 -104338 28843 291446 -98235 -259798 -322419 25846 -95300 55516 -52506 -6315
18222 -339946 -166309 5597 -171056 300413 132307 -386171 127484 172617 -271289 -60066
18211 198362 314448 -228082 -180219 233217 156408 -287462 -132011 -408569 137077 -108220
$$ packed form
18291A20763d1222r0157o4348A00552d1690q6138B721R0534C5710L94467b67430
18279C21041A42989a76127o4229B47340b22316C32566A33930C2011Q2904n5481
18269E9434a07491I7275C674J15747J06578c65260d3976j83889J08992B0132N0786
18258G0918a1315o9551H6534h5835A67794l466b08990b9511r5824e6203A03180
18246b34662C5458C142N7407K15015H939J5416Q2675a82414j65956a5219B19864
18234d32159a04338B8843K62603i8235j61563o2621B5846i5300E5516e2506f315
18222c39946a66309E597a71056C00413A32307c86171A27484M5133b71289f0066
18211A98362J16086b28082M7863B33217p6809b87462a32011k76558A37077a08220
$$ plain form
18200 132803 -49698 -118314 -226968 -305674 -82828 -315310 83840 -27045 207059 46792 477
18188 -214701 -128815 -168369 -52595 -228787 299877 117943 -358219 50943 -48512 -165152
18178 -165152 113824 -152428 -148318 50751 -202614 -18808 123422 136126 110820 142503 148130
18167 148130 -4482 -14507 -519955 -27207 88610 -139488 -212355 92383 -173341 6416 -76513
18155 -219151 -65344 -271134 -183546 333349 55899 334311 -23028 173770 -81568 -147470 -137635
18144 -137635 56094 -46064 -155232 185417 239235 -302953 -215152 -321615 -138225 -118232
18134 -118232 -182109 28488 -58837 104166 -108080 -136131 153457 5037 139978 -26365 -213118
18123 -213118 -31505 240136 57247 -283227 52259 162544 252410 254942 -53472 95755 -145091
$$ packed form
18200A32803d9698o8616j08654p8706h2828k32482H3840b7045B07059D6792D77
18188b14701Q5886l9554e2595j76192B99877A17943c58219E0943d8512j16640
18178a65152A13824a52428M110E0751b02614a8808A23422J2704k5306L1683N627
18167A48130d482j0025n05448b7207H8610a39488p2867I2383a73341F416g6513
18155b19151f5344k05790Q7588C33349E5899K78412b3028A73770h1568o5902R835
18144a37635E6094d6064j09168A85417N3818c02953Q7801j06463a38225J9993
18134a18232o3877B8488e8837A04166a08080k8051A53457E037J34941b6365j86753
18123b13118c1505B40136E7247b83227E2259J10285Q9866K532e3472I5755a45091
$$ plain form
18111 -86898 208738 -369206 19968 -189084 -319176 158574 -192320 -141662 27171 -65300
18100 -228009 -358173 85772 -78083 -3234 -174423 204019 93355 7215 -104785 72905 -210269
18088 -258467 -284491 -140551 9221 -90897 -51117 -171903 -129131 11963 -121748 9617 -229351
18076 65153 315984 180517 189034 9687 -21003 -176053 -28557 26642 91743 -110975 60670
18064 -249574 16453 61559 368298 -155227 183216 -209791 191092 123534 -80589 -55691
18054 -55691 -164159 -34965 -47542 82483 19150 73302 -176641 106514 -273557 -471643 -143069
18042 -45770 90034 140639 252456 145706 -326797 -27754 122562 43370 -258965 -362177
18032 -362177 24266 80548 99244 -99835 123724 -301381 63677 -137743 -121745 4385 -248829
$$ packed form
18111h6898B08738c69206A9968a89084j30092A58574a92320N0658B7171f5300
18100b28009j30164H5772g8083c234j71189B04019I3355G215a04785G2905b10269
18088b58467k6024a40551I221i0897L9780j20786M2772A1963a21748I617b29351
18076F5153K50831j35467Q517I687b1003j55050b8557B6642O5101a10975F0670
18064b49574A6453M5106L06739a55227A83216b09791A91092o7558h0589K4898
18054e5691j08468c4965j2577H2483A9150N4152a76641A06514b73557j98086a43069
18042d5770I0034N0605J11817j06750c26797b7754A22562D3370b58965j03212
18032c62177B4266N6282J8696i9835A23724c01381F3677a37743J5998D385b48829
$$ plain form
18020 -354357 -30900 -58748 -212012 -172758 -91074 -115860 -5871 295010 180425 -131773 -253293
18009 -253293 -313352 29591 -165209 230358 -14643 -60284 -89982 257909 174520 -120850 -168065
17998 -168065 174713 391261 -13235 220358 207863 -116923 180115 -54769 -169273 -186678
17988 -186678 188824 48530 -25496 41992 162575 199070 -51829 139983 142306 -165689 -44704
17976 -378363 189298 128301 18856 -5194 76772 140087 -164985 189232 -100156 -46388 -119213
17965 -119213 -42382 -18365 34979 -22286 40531 26117 -184247 -150245 -264990 -130906 -129613
17954 -129613 6675 160924 -50834 374757 -20182 -55513 157977 121010 62583 -210588 -243484
17943 -243484 132359 171108 280696 -6176 -42131 -192173 -158069 -305126 -423674 235894
$$ packed form
18020c54357c0900k7848j53264L9254Q1684k4786e871B95010j14585a31773j21520
18009b53293o0059B9591a65209B30358a4643m5641k9698B57909q3389a20850m7215
17998a68065A74713K16548a3235B20358j2495a16923A80115e4769j14504j7405
17988a86678A88824D8530b5496D1992J20583L6495e1829A39983K323a65689d4704
17976c78363A89298o0997A8856e194G6772O3315a64985A89232a00156d6388p2825
17965a19213d2382a8365C4979b2286D0531j4414a84247L4002j14745a30906J293
17954a29613F675J54249e0834C74757b0182l5331A57977l6967n8427b10588l2896
17943b43484A32359L8749J09588f176l5955j50042L4104j47057j18548B35894
$$ plain form
17932 113090 31931 -66889 -98791 -277951 33242 -80822 -222315 64259 104096 -101018 -86780
17921 -86780 197680 -331517 -160094 157194 185846 1952 193780 14719 -267167 -100679
17910 76351 14336 -311657 -252388 45033 -98153 -50985 -165312 -264952 -327875 158262 251097
17899 251097 78396 -103841 -50468 156008 -76883 -150144 -125377 -299765 65418 82956 83828
17888 83828 -222308 -109162 -487932 -205083 -123222 166543 282258 180924 -380030 -827
17877 6297 -154993 -174776 -66296 -158293 -130181 -76737 -44667 72259 159475 -76674 -28539 -48515
17865 -48515 -319723 107783 10428 26606 141383 153737 -147635 6924 206219 119095 -68582
17853 31657 -214203 107049 222166 -207887 -178250 208585 36345 9279 -210049 177101
$$ packed form
17932A13090C1931f6889l1902j79160C3242h0822j41493F4259L9837a01018J4238
17921h6780A97680c31517a60094A57194K8652A952J91828A4719b67167a00679
17910G6351A4336c11657N9269D5033i8153M7168j14327r9640o2923A58262R2835
17899B51097G8396a03841e0468A56008g6883p3261K4767j74388F5418J7538Q72
17888H3828b22308a09162l78770b05083Q1861A66543J15715j01334c80030h27
17877F297a54993j9783f6296r1997K8112N3444L2070G2259Q7216g6674b8539j9976
17865d8515k71208A07783A0428J6178J14777J2354a47635F924J99295q7124f8582
17853C1657b14203A07049J15117b07887K9637B08585C6345I279b10049A77101
$$ plain form
17842 229766 43630 99068 -120465 -116249 104382 -8076 -171828 314361 -238642 203861 205308
17831 205308 17831 -116935 39208 141670 -51046 29364 27123 -426205 -98963 265763 268846
17820 268846 208646 38309 31486 84071 -113793 -365910 97999 -171536 217290 -37857 -52488
17809 -52488 162166 -255438 242175 -14299 -45244 -66546 -80214 -192237 105636 -44598 5111
17797 -107301 1359 43319 -44102 -250152 58578 -404127 103059 -195577 40797 -141246 55860
17785 -103522 -99425 76981 82815 136355 161350 -147086 231883 -223242 181107 47153 -87654
17773 60425 -406853 61023 -528273 193887 -75853 -79626 37638 207686 21699 371748 -122630
17761 -321602 217285 -74641 -189431 -173703 -84251 16344 84758 102518 362860 -197192 105865
$$ packed form
17842B29766D3630N5438a20465M216A04382h076j63752C14361b38642B03861J447
17831B05308A7831a16935C9208J02462e1046B9364k241d26205i8963B65763L083
17820B68846o0200C8309o823N2585a13793k52117I7999a71536B17290c7857j4631
17809e2488A62166b55438B42175a4299l0945k1302j3668j12023A05636d4598E111
17797a07301A359M1960d4102k06050E8578d04127A03059a95577D0797a41246E5860
17785a03522M097G6981N834N3540K4995a47086B31883b23242A81107D7153h7654
17773F0425d06853F1023e28273A93887g5853l773C7638J70048B1699L50049a22630
17761c21602B17285g4641j14790J5728h4251A6344O8414J7760K60342a97192A05865
$$ plain form
17749 -93205 -74083 -269677 -333830 137728 72846 125524 -170821 148348 -124619 21531 78263
17738 78263 -192137 -295528 -203417 -36716 -170384 -90199 -147556 -86750 -115220 140513 -213475
17726 113847 23957 -61336 109053 -63331 281106 -242193 -192338 71204 -44947 -400078 138169
17714 -19592 76865 107566 -370549 -18453 -97460 -100150 -46597 276075 -77256 -28251 -45668
17703 -45668 -17761 148968 153959 -158321 -278532 -28958 403415 -313983 -379788 -151916 191131
17691 -230085 -30501 6831 -44532 -197878 -16481 -176232 134096 148695 -79513 178506 154241
17680 154241 86257 -33855 -215904 -240272 111280 73949 119859 158809 166411 -104483 -119282
17669 -119282 57487 250014 -4067 -188047 -217376 188598 81116 143872 -186152 -170199 -83142
$$ packed form
17749i3205J9122j95594o4153A37728o4882N2678a70821A48348a24619B1531N6732
17738G8263a92137j03391R2111c6716j33668Q0185n7357O0806k8470A40513b13475
17726A13847B3957f1336A09053f3331B81106b42193M9855G1204d4947l55131A38169
17714a9592G6865L0701c70549a8453p9007k690d6597B76075g7256b8251j7417
17703d5668a7761A48968M991a58321j20211b8958D03415c13983o5805a51916A91131
17691b30085c0501F831d4532j53346a6481j59751A34096J4599g9513A78506k4265
17680A54241o7984c3855j82049k4368A11280l7331M5910L8950P602a04483j4799
17669a19282E7487J92527d067j83980k9329A88598H1116O2756a86152J5953h3142
$$ plain form
17657 301559 49348 -44583 -307734 8109 149608 -251608 55000 188093 -75202 79994 -144533
17645 27731 205548 237365 -43303 78713 51273 74380 -6852 116330 182591 -28023 -103657
17634 -103657 -20849 89855 155806 277889 10795 -32361 -271786 137231 -197186 71544 -2679
17622 -175892 19689 179085 25081 19240 69399 49566 100375 -68633 -222020 -97796 79367
17610 -113622 723 -64721 -127862 -180953 142391 307056 -21878 -140790 344985 -183976 -214973
17599 -214973 137000 262411 -1944 82424 -22112 -143002 -277381 138358 72929 296023
17589 296023 -82906 82881 -119415 28002 197116 247555 -103170 -191901 -36772 -82730 -337562
17578 -337562 -91714 72033 225145 125724 -17900 -87623 234703 -65993 -47977 16260 269631
$$ packed form
17657C01559D9348d4583k63151H109J41499b51608E5000J33093g5202G9994a44533
17645B7731J77817L1817d3303G8713k7440K3107f852A16330O6261b8023p5634
17634a03657b0849H9855O5951J22083A0795c2361k39425A37231a97186G1544b679
17622a75892A9689J59396B5081n841N0159j9833N0809f8633j53387i7796G9367
17610a13622G23f4721o3141n3091A42391J64665b1878j18912C44985a83976l0997
17599b14973A37000J25411a944H2424b2112j20890j34379A38358o5429K23094
17589B96023h2906H2881a19415B8002J69114N0439a03170q8731c6772m5958k54832
17578c37562i1714G2033J53112r9421a7900o9723B34703f5993J8016A6260K53371
$$ plain form
17567 269631 405643 65628 122618 133681 218159 -111961 33191 56169 10294 -259372 279599
17555 32036 -95200 -94631 7585 -88547 -15512 57880 -287339 216296 204485 -291802 -9163 224116
17542 -105146 123980 -58024 -224333 168642 -247239 52152 -34740 142986 -59909 154342
17531 358310 98146 -161304 -10391 31638 -86576 -236753 -228840 -48859 -173399 32173 255312
17520 255312 255118 -59779 2783 139473 -50039 -11587 219860 -17977 71340 -94889 67257 -151397
17507 -4636 95155 -191572 -200677 73704 276527 318181 -288267 -82163 -172339 -69021 -5563 6385
17494 313014 -155670 183591 282095 427207 53622 88549 72359 -150968 216984 213412 188146
17483 188146 366649 205096 -121764 -62977 156578 1012 79367 164350 139983 130436 103973
$$ packed form
17567B69631J36012F5628N6990J1063Q4478a11961C3191K2978A0294b59372B79599
17555C2036i5200N69G585h8547a5512E7880b87339B16296j1811b91802i163B24116
17542a05146A23980e8024j66309A68642b47239E2152c4740A42986e9909A54342
17531C58310I8146a61304a0391C1638h6576j50177P913d8859j24540C2173K23139
17520B55312j94e9779B783J36690e0039a1587B19860a7977G1340i4889F7257a51397
17507d636I5155a91572r105G3704K02823M1654b88267h2163r0176f9021e563F385
17494C13014a55670A83591R8504J45112E3622L4927j6190a50968B16984l572k5266
17483A88146J78503j61553a21764N8787A56578A012P8355Q4983k4367r547k6463
$$ plain form
17472 103973 238848 148460 328161 197509 268881 237242 -107745 54067 -51970 364445
17461 -59842 -471581 222928 48789 101241 -77570 69911 15050 119638 173358 -62284 149627
17449 434616 357387 203217 240157 201509 311537 125380 -91922 191093 -137911 131092
17438 379165 80655 110078 85403 270646 166934 271785 -145722 311150 130069 281599
17428 281599 450004 213818 289936 184418 263857 102583 134169 191117 77739 293131
17418 293131 18513 551338 -58923 180092 285131 -134774 200527 -55521 366767 200145
17408 200145 154728 160986 -108148 -234066 63397 137470 153590 306829 307451 241763 322265
17397 322265 215963 -115915 177643 205062 -109680 -20855 -23089 -8380 72303 309693 30097
$$ packed form
17472A03973J34875r0388J79701j30652P1372l1639a07745E4067e1970C64445
17461e9842m11739B22928D8789N2452g7570F9911A5050J04588N3720f2284A49627
17449D34616p7229j54170L6940l8648J10028A25380i1922A91093a37911A31092
17438C79165H0655K9423k4675J85243j03712J04851a45722C11150A30069J51530
17428B81599J68405B13818P6118j05518P9439A02583L1586N6948G7739K15392
17418B93131A8513N32825e8923A80092J05039a34774B00527e5521C66767j66622
17408B00145m5417O258a08148j25918F3397P4073J6120J53239O22o5688Q0502
17397C22265j06302a15915A77643K7419a09680b0855k234h380G2303K37390C0097
$$ plain form
17385 -9147 219775 152241 -65434 146808 197065 -20198 220953 336351 -59690 115122 365631
17374 365631 8565 51112 231804 133055 -154814 97179 -7058 320366 94707 -251410 -13580
17362 122989 19431 -89278 230923 -3284 100171 179969 -155214 -169424 477504 206661 307768
17351 307768 382997 21621 184041 49402 447583 41246 -101715 217260 -1842 58752 299465
17340 299465 11868 266103 -199192 39177 203143 -42132 313334 421050 54140 -310998
17329 159417 67651 222407 231491 257723 -109949 -32446 -20467 -54295 133763 289718 -32664
17317 391047 118871 -32146 374358 -187945 -35583 -57030 -49483 24561 -16930 44384 14247
17305 241098 121151 137759 39437 -233021 36788 513428 457512 402682 75407 210100 108680
$$ packed form
17385i147B19775o7534f5434A46808N0257b0198B20953J15398e9690A15122K50509
17374C65631H565M2547J80692r8749a54814I7179g058C20366I4707b51410a3580
17362A22989A9431h9278B30923c284A00171P9798a55214j4210D77504B06661J01107
17351C07768P5229B1621J62420D9402L98181D1246a01715B17260a842E8752K40713
17340B99465A1868K54235a99192C9177J63966d2132C13334J07716E4140c10998
17329A59417F7651J54756R084K6232a09949c2446J1979l3828A33763J55955c2664
17317C91047A18871c2146C74358a87945c5583k1447P547B4561a6930D4384A4247
17305B41098j19947J6608C9437b33021C6788M76640n5916n4830G5407J34693j01420
$$ plain form
17294 108680 331228 192310 -98088 -17651 -62640 -257247 23312 231676 11973 22711 2557
17282 267849 89274 163357 39470 1716 -140281 445106 124169 258673 199953 157042 216758
17271 216758 261319 -7516 -105710 400901 -202282 65938 210974 41017 -39920 -260894 167162
17259 274313 -92873 4904 172775 238963 465831 -1759 20943 166947 -67954 -175185 -158281
17248 -158281 -32457 383357 120528 80218 502815 -377451 -92323 -219512 413011 141241
17237 279624 124836 227913 147139 -39452 -116127 40557 35254 375613 4063 -221052 -60863
17225 69467 32355 125482 218301 200229 -56019 79632 304921 37382 159259 -190778 174006
17213 -4969 325839 206069 154204 -43606 123039 18558 -129508 -64131 184283 255534 36072
$$ packed form
17294A08680K22548j38918i8088a7651m4989j94607B3312K08364A1973J0738B557
17282B67849H9274P4083C9470A716a40281D45106A24169J34504n8720m2911N9716
17271B16758M4561g516r8194D00901b02282F5938J45036D1017c9920k20974A67162
17259B74313i2873D904J67871O6188K26868a759B0943J46004f7954j07231J6904
17248a58281c2457C83357A20528m0310M22597c77451i2323j27189D13011A41241
17237B79624A24836J03077q0774c9452p6675D0557n303L40359D063b21052f0863
17225F9467C2355R3127R2819j8072e6019G9632K25289C7382J21877a90778A74006
17213d969C25839j19770n1865d3606A23039A8558a29508f4131A84283P1251C6072
$$ plain form
17201 109215 175941 257937 80168 313504 366661 350696 -30154 60815 63153 389694 -16955
17189 158461 342184 -43666 362293 84030 222074 47329 218004 -82540 122824 238835
17179 238835 -37986 147881 337724 257367 214092 -52723 74426 373000 122331 178099 245376
17168 245376 163739 -67383 395568 69315 -172349 -32681 218156 -132615 220905 234966
17158 234966 -11533 367344 219607 117946 281980 173246 279333 259949 216883 244255
17148 244255 160334 81903 164370 243854 42471 474343 -150061 354036 398526 103000 418022
17137 418022 183683 294952 249523 493604 443481 160621 343397 34157 -90336 318890
17126 362726 345502 226274 99170 97105 335075 41413 214588 150990 263190 -145113 181267
$$ packed form
17201A09215O6726Q1996H0168K33336N3157j5965c0154F0815K338L26541a6955
17189A58461J83723d3666C62293H4030J38044D7329J70675h2540A22824J16011
17179B38835c7986A47881J89843q0357m3275e2723G4426K98574A22331N5768O7277
17168B45376q1637f7383C95568F9315a72349c2681B18156a32615B20905J4061
17158B34966a1533C67344j47737j01661J64034j08734J06087j9384m3066K7372
17148B44255q3921p8431Q2467P9484D2471M31872a50061C54036M4490A03000L15022
17137D18022A83683J11269m5429K44081n0123A60621J82776C4157i0336C18890
17126C62726j7224j19228I9170k065K37970D1413J73175o3598J12200a45113A81267
$$ plain form
17114 516549 90456 581263 279327 438587 239276 416736 275814 425795 254829 355237
17104 355237 540336 242368 252805 91601 -74354 431264 231292 1500 247192 296247 183770
17093 183770 246438 325349 192189 182907 348728 274716 344887 60511 219710 918556 284562
17081 282517 363947 6221 98180 589578 113801 251515 183236 403424 304917 501747 733057
17070 733057 116104 140594 298897 169751 537513 450366 279997 399069 318571 490603
17060 490603 229528 708486 167120 474918 374150 307965 166448 118373 620765 418420
17050 418420 428394 592996 501848 200358 399001 359625 449220 182603 258942 502545 305839
17039 305839 693125 384998 286140 511795 199500 422306 428882 475387 569919 440032
$$ packed form
17114E16549I0456M90807B79327J59260j99311J77460j40922J49981j70966J00408
17104C55237J85099B42368J0437I1601g4354D31264j99972A500K45692M9055j12477
17093A83770O2668P8911j33160r282J65821p4012P0171F0511J59199O98846B84562
17081B82517Q1430F221R1959M91398A13801J37714o8279K20188r8507J96830K31310
17070G33057A16104K4490J58303j29146L67762q7147j70369J19072q0498J72032
17060D90603B29528M78958A67120L07798j00768o6185j41517m8075N02392k02345
17050D18420R974J64602r1148B00358J98643l9376Q9595A82603P6339K43603j96706
17039C05839L87286l08127r8858K25655A99500K22806O576M6505R4532j29887
$$ plain form
17029 440032 689134 641588 678511 690995 397042 597182 388180 524508 304537 420730
17019 420730 259458 726926 544284 501382 336297 458750 535513 485548 513380 363426
17009 363426 697874 281161 507258 323880 415270 613326 484736 670206 293874 739071
16999 739071 611563 540912 204235 737759 524510 485983 408593 549405 336245 949099
16989 949099 562437 424633 729266 561484 444185 511456 615257 659317 715228 630367
16979 630367 985212 443387 579128 469629 815797 650036 393126 767187 721988 598121
16969 598121 542415 664049 720762 906572 686012 572002 853716 578300 845065 841599
16959 841599 744313 848327 754396 611783 496848 636219 620083 502891 681056 729531
$$ packed form
17029D40032K49102m7546L6923J2484k93953K00140k09002J36328k19971J16193
17019D20730j61272M67468j82642m2902j65085J22453P6763m9965K7832j49954
17009C63426L34448B81161K26097j83378R1390J98056j28590J85470B93874M45197
16999G39071j27508p0651B04235N33524k13249l8527p7390J40812k13160O12854
16989I49099l86662j37804L04633j67782j17299O7271J03801M4060N5911q4861
16979F30367L54845D43387J35741j09499L46168j65761k56910L74061m5199j23867
16969E98121n5706J21634N6713J85810k20560j14010K81714k75416K66765l466
16959H41599r7286J04014r3931j42613j14935J39371j6136j17192J78165M8475
$$ plain form
16949 729531 762125 856777 849366 636738 925694 863683 545420 956415 671340 1049175
16939 1049175 1126436 904214 750109 842130 760963 848534 1074466 858184 975482 881982
16929 881982 1174033 1167368 1206123 1056968 1192177 887469 1091051 891693 1302214 1350689
16919 1350689 1187423 996502 698776 1039494 947055 1154369 1351302 1001126 1231392 1055109
16909 1055109 996205 1182249 1020669 1130998 1373713 1092856 1232852 1135595 1474491 1281555
16899 1281555 1384929 1275251 1410361 1445699 1131508 1338830 1337323 1130784 1373310 1339004
16889 1339004 1288862 1754427 1341013 1474891 1661990 1482089 1670096 1198783 1829472 1339951
16879 1339951 1696099 1672375 1690369 1601952 1520303 1716552 1832063 2013626 2093204 2051651
$$ packed form
16949G29531L2594R4652p411k12628K88956o2011l18263M10995k85075L77835
16939A049175P7261k22222j54105R2021q1167Q7571K25932k16282J17298r3500
16929H81982K92051o665L8755j49155J35209l04708K03582j99358M10521M8475
16919A350689j63266j90921k97726L40718r2439K07314J96933l50176K30266j76283
16909A055109n8904J86044j61580J10329K42715k80857J39996r7257L38896j92936
16899A281555J03374j09678J35110L5338l14191K07322j507k06539K42526l4306
16889A339004n0142M65565m13414J33878J87099j79901J88007m71313O30689m89521
16879A339951L56148k3724J7994q8417q1649J96249J15511J81563P9578m1553
$$ plain form
16869 2051651 1857827 1927679 1868294 1868591 1774760 1877624 2147786 1981175 2084736 1890320
16859 1890320 2148809 2144123 2353484 2150787 1988452 2367984 2225442 2372043 2122294 2315370
16849 2315370 2528606 2305644 2468378 2453126 2696521 2624270 2528849 2982771 2375293 2983481
16839 2983481 2781193 2845982 3044207 2982048 3139942 3267043 3303894 3498380 3131554 3161163
16829 3161163 3585938 3098222 3608589 3934528 3812800 3918504 3812200 3829638 3894957 4271383
16819 4271383 3991422 3885907 4304274 4153635 4465546 4668621 4479263 4727140 4754528 5021887
16809 5021887 5028408 5244726 5014191 4872514 5650529 5692186 5648399 5574996 5696067 5996428
16799 5996428 6101330 6293058 6842163 6704208 6887195 7116703 7352255 7430646 7555974 7561653
$$ packed form
16869B051651j93824O9852n9385K97r3831J02864K70162j66611J03561j94416
16859A890320K58489m686K09361k02697j62335L79532j42542J46601k49749J93076
16849B315370K13236k22962J62734j5252K43395p2251r5421M53922o07478O08188
16839B983481k02288O4789J98225o2159J57894J27101L6851J94486l66826K9609
16829C161163M24775m87716N10367L25939j21728J05704j06304J7438O5319L76426
16819D271383k79961j05515M18367j50639L11911K03075j89358K47877K7388K67359
16809E021887O521K16318k30535j41677P78015M1657m3787p3403J21071L00361
16799E996428J04902J91728N49105j37955J82987K29508K35552P8391J25328N679
$$ plain form
16789 7561653 8142592 8176645 8344567 8615696 8561823 8969560 9238900 9482940 9774627 9741532
16779 9741532 10689445 10775952 10880113 11048086 12065772 12117587 12431263 12774002 13418221 13988539
16769 13988539 14328196 14981192 15611101 16102539 16577544 17190295 18135515 18556637 19472826
16760 19472826 20109627 20908844 21822149 23072235 23871732 25020551 25805248 27399963 28223997
16751 28223997 29768146 31568761 32560862 34595112 36339202 38075935 40098446 42130559
16743 42130559 44604656 47053530 50025252 53280577 56140104 59776242 63349583 67583557
16735 67583557 71843650 76224799 81205924 86589525 92223287 98070469 104491366 111077723
16727 111077723 118083030 125133424 132665213 139615950 146855738 153178413 159898305 164941607
$$ packed form
16789G561653N80939L4053J67922K71129n3873M07737K69340K44040K91687l3095
16779I741532R47913Q6507J04161J67973J017686N1815L13676L42739O44219N70318
16769A3988539L39657O52996O29909M91438M75005O12751R45220M21122R16189
16760A9472826O36801P99217R13305J250086P99497J148819P84697J594715Q24034
16751B8223997J544149J800615R92101K034250J744090J736733K022511K032113
16743D2130559K474097K448874K971722L255325K859527L636138L573341M233974
16735F7583557M260093M381149M981125N383601N633762N847182O420897O586357
16727A11077723P005307P050394P531789O950737P239788O322675O719892N043302
$$ plain form
16719 164941607 170013540 173627169 175583346 176685585 176498133 174331605 171386014 167029111
16711 167029111 161690466 155561526 148663447 141657366 134596306 126852537 119573424 112444611
16703 112444611 105379011 98807597 92786871 86715380 81413897 76064517 71517476 67256728
16695 67256728 62958106 59275555 55645483 52811717 49302720 46328112 44181234 41531080
16687 41531080 39391069 37304282 35246506 33445848 31850426 30379424 28839407 27551185
16679 27551185 26259630 25280111 23902778 22918226 21805708 20957551 20205905 19026219 18296522
16670 18296522 17642791 16986347 16307904 15564160 14955000 15037707 14102030 13661644 13300517
16661 13300517 12648952 12472114 11764734 11326682 11094395 10517596 10457419 9985641 9804550
$$ packed form
16719A64941607N071933L613629J956177J102239j87452k166528k945591m356903
16711A67029111n338645o128940o898079p006081p061060p743769p279113p128813
16703A12444611p065600o571414o020726o071491n301483n349380m547041m260748
16695F7256728m298622l682551l630072k833766l508997k974608k146878k650154
16687D1531080k140011k086787k057776j800658j595422j471002j540017j288222
16679B7551185j291555r79519j377333r84552j112518q48157p51646j179686p29697
16670A8296522o53731o56444o78443p43744o09160Q2707r35677m40386l61127
16661A3300517o51565j76838p07380m38052k32287n76799o0177m71778j81091
$$ plain form
16652 9804550 9413319 9395209 9058370 8459855 8062245 8235175 7975458 7583363 7412613 7251060
16642 7251060 7118195 6766867 6481235 6330954 6383033 6186800 5966865 5957424 5920480 5296577
16632 5296577 5308387 5389302 5135188 5138235 4982811 5029997 4875660 4829045 4611671 4445874
16622 4445874 4181139 3996110 4250170 4436160 4042163 4157319 3662939 4083834 3701119
16613 3701119 3485647 3426171 3495298 3445446 3398693 3210059 3451835 3353688 2904023 3233194
16603 3233194 2903953 2557010 2599743 2409833 2474349 2502654 2904154 2608665 2661465 2299678
16593 2299678 2381863 2267824 2078651 2315065 2164856 2112561 2074017 2255363 2053034 2298472
16583 2298472 2108025 1778091 2302025 2250496 1923646 1988273 1935687 1945113 2202439 2044264
$$ packed form
16652I804550l91231j8110l36839n98515l97610J72930k59717l92095j70750j61553
16642G251060j32865l51328k85632j50281N2079j96233k19935r441l6944o23903
16632E296577J1810Q0915k54114L047j55424M7186j54337m6615k17374j65797
16622D445874k64735j85029K54060J85990l93997J15156m94380M20895l82715
16613C701119k15472n9476O9127m9852m6753j88634K41776r8147m49665L29171
16603C233194l29241l46943M2733j89910O4516K8305M01500k95489N2800l61787
16593B299678Q2185j14039j89173K36414j50209n2295l8544J81346k02329K45438
16583B298472j90447l29934N23934n1529l26850O4627n2586R426K57326j58175
$$ plain form
16573 2044264 1777835 1789088 1412649 1850496 1682122 1741612 1400692 1450336 1604315 1601473
16563 1601473 1648939 1562092 1413985 1637475 1445669 1558340 1435005 1420188 1396479 1599471
16553 1599471 1499753 1207759 1320205 1256049 1427826 1425727 1250094 1358643 1271197 1204883
16543 1204883 1312618 1436050 1544997 1333573 1308200 860780 1169318 923191 914108 1012545
16533 1012545 1077701 1251550 936243 906762 1139094 1056925 1026382 1111739 775618 974736
16523 974736 1243248 933997 938901 890859 743237 1007146 862485 717909 556065 984813
16513 984813 918529 639431 771543 1103437 889925 671251 988253 555991 944892 739776
16503 739776 660165 1105888 730484 649149 773472 664083 970000 681258 814546 391227
$$ packed form
16573B044264k66429J1253l76439M37847j68374N9490l40920M9644J53979k842
16563A601473M7466q6847j48107K23490j91806J12671j23335j4817k3709K02992
16553A599471r9718k91994J12446o4156J71777k099j75633J08549q7446o6314
16543A204883J07735J23432J08947k11424k5373m47420L08538k46127r083R8437
16533A012545O5156J73849l15307k9481K32332q2169l0543Q5357l36121J99118
16523I74736K68512l09251M904m8042j47622K63909j44661j44576j61844M28748
16513I84813o6284k79098J32112L31894k13512k18674L17002m32262L88901k05116
16503G39776p9611M45723l75404q1335J24323j09389L05917k88742J33288C91227
$$ plain form
16492 539573 810810 376064 630045 709689 987461 510786 327947 815540 471966 457282
16482 457282 581420 371693 799408 756624 403151 857023 596907 796876 506385 668236
16472 668236 617051 463572 427599 483739 658936 751272 333511 411278 124746 564309
16462 564309 419567 642192 493258 203017 305793 377534 592324 378982 494373 521712
16452 521712 398409 300268 176844 663480 762210 603680 371481 477297 192568 543705
16442 543705 455938 652909 333053 468896 408352 392921 172169 358153 626287 444908
16432 444908 230262 304427 714760 218195 553452 478828 413478 586774 588740 664981 347901
16421 347901 468394 236962 359504 264142 117438 454872 61496 208107 539757 178885
$$ packed form
16492E39573K71237C76064K53981P9644K77772m76675j82839M87593l43574j4684
16482D57282J24138k09727M27715m2784l53473M53872k60116J99969k90491J61851
16472F68236n1185j53479l5973N6140J75197R2336C33511P7767A24746M39563
16462E64309j44742K22625j48934B03017J02776P1741K14790k13342J15391K7339
16452E21712j23303r8141j23424M86636R8730j58530k32199J05816A92568L51137
16442E43705q7767J96971l19856J35843o0544j5431A72169J85984K68134j81379
16432D44908k14646P4165M10333B18195L35257p4624o5350J73296J966P6241l17080
16421C47901J20493k31432J22542r5362A17438L37434F1496J46611L31650A78885
$$ plain form
16410 263845 174085 524248 144542 183512 251100 571383 278632 840470 256793 591894
16400 591894 379965 432453 159460 257322 108407 342272 221815 367497 371299 353244
16390 353244 554342 532611 281492 -113547 463783 360213 389145 300849 -35000 198528
16379 493944 504865 359100 355471 215360 253459 382095 159756 420604 308000 -180787
16368 196358 77518 176495 114285 224725 134742 397622 339384 71836 304152 162648 390939
16357 390939 -135852 125876 348002 209642 193281 42919 341785 106142 295626 5895
16346 24990 191547 352928 15351 -38222 186560 -155736 198487 -157164 27622 158714
16336 158714 160794 292617 -56530 25450 255107 -50531 113309 550109 74396 191077 -122746
$$ packed form
16410B63845q9760L50163A44542L8970O7588L20283B78632N61838B56793L35101
16400E91894k11929N2488A59460R7862A08407K33865j20457J45682L802j8055
16390C53244K01098k1731k51119a13547D63783j03570K8932q8296c5000A98528
16379D93944J0921j45765l629j40111L8099J28636A59756K60848j12604a80787
16368A96358G7518R8977o2210J10440q9983K62880n8238G1836K32316j41504K28291
16357C90939a35852A25876K22126j38360j6361D2919K98866A06142J89484E895
16346B4990J66557J61381A5351c8222A86560a55736A98487a57164B7622J31092
16336A58714K080J31823e6530B5450K29657e0531A13309M36800G4396J16681a22746
$$ plain form
16324 137623 63773 326817 212820 269675 116528 290775 104045 -18707 12071 52104
16314 52104 46540 -24568 380750 289195 56920 65921 -205098 -45700 258691 226735 105598
16302 515091 254979 369711 221874 241997 231560 380507 172262 304544 -209001 -70464
16291 -106005 -17399 563693 335011 60585 145272 -7884 280286 274629 75 -101129 -49017 -217869
16279 -217869 72850 290281 93698 91443 -45345 101991 332506 14742 -30609 62209 27449
16267 -122698 170883 272287 -109073 -91614 -94629 280625 407174 76342 194184 69166
16256 45709 58812 143613 104559 307772 59173 46352 -185680 33041 77192 -167988 -177224
16245 -177224 -43227 211200 92310 -39843 -43669 220110 188062 -5892 -17675 90504 -98116
$$ packed form
16324A37623F3773K63044j13997N6855A16528J74247A04045a8707A2071M0033
16314E2104n564b4568C80750r1555E6920R001b05098d5700B58691l1956A05598
16302E15091B54979J14732j47837K0123j0437J48947A72262J32282b09001g0464
16291a06005a7399E63693k28682F0585Q4687g884B80286n657G5a01129d9017j68852
16279b17869G2850K17431I3698k255d5345A01991K30515A4742c0609F2209B7449
16267a22698A70883J01404a09073J7459l015B80625J26549G6342J17842F9166
16256D5709J3103Q4801l9054K03213E9173j2821a85680C3041M4151a67988r236
16245a77224d3227B11200I2310c9843l826B20110l2048e892j1783I0504i8116
$$ plain form
16233 41185 -68356 210811 -92957 18297 -24986 205402 124530 349760 16679 -100059 218982
16221 130036 296966 -106720 -255858 107445 187872 114845 7720 -180394 45214 -263930
16210 369358 121864 123266 168472 151347 160300 287726 365517 16108 -36281 15088 -234703
16198 270045 157986 -52869 -139287 -87863 295748 266384 336757 83877 174382 -56178 -4 -153735
16186 -153735 -71035 -19180 13023 164535 102397 -114164 13818 41960 126604 1708 167081
16175 167081 -18493 -91769 50725 -141794 462117 51444 -87788 -232917 -88328 -224991 -38757
16163 64973 122369 190171 33505 110015 81273 46578 258171 -118379 338725 -125155 -31442
16151 -175529 102243 -47277 172515 54780 73642 -175800 -104853 25110 -189233 169362
$$ packed form
16233D1185f8356B10811i2957A8297b4986B05402q0872K25230A6679a00059B18982
16221A30036J66930a06720j49138A07445Q0427p3027G720a80394D5214b63930
16210C69358A21864J402M5206j7125Q953J27426P7791A6108c6281A5088b34703
16198B70045j12059e2869q6418N1424B95748k9364P0373H3877R0505e6178dj53731
16186a53735g1035a9180A3023J51512o2138a14164A3818K8142Q4644A708J65373
16175A67081a8493p3276E0725a41794D62117E1444h7788j45129h8328j36663c8757
16163F4973N7396O7802C3505P6510k8742l4695K11593a18379C38725a25155c1442
16151a75529A02243d7277A72515E4780J8862a75800P0947B5110a89233A69362
$$ plain form
16140 136729 385458 144383 -34215 186302 198453 -224434 185573 170537 50065 -398979
16129 34504 264965 411311 156179 -143352 -165184 202678 -149466 53120 -31846 50972
16118 -44368 -207278 195299 187196 -234978 6732 -118517 182284 -20410 -351104 -308187 100303
16106 -86932 -13416 126481 -95630 -174037 -128208 -183779 -141643 -112972 -73099 377106 -260084
16094 -235466 -12245 -42471 -359533 128781 -227012 -69659 -209492 212482 -326540 68410
16083 11127 65350 64952 -82458 -189996 -68006 -418228 -296788 177957 -61167 -33241 168572
16071 -145388 -86699 74337 -5339 -290680 -23379 145885 15898 -133138 311568 -157941 -648948
16060 -648948 370578 116184 -1925 152126 37358 -26027 129111 -147354 141585 -225026
$$ packed form
16140A36729K48729A44383c4215A86302J2151b24434A85573j5036E0065c98979
16129C4504K30461J46346A56179a43352k1832B02678a49466E3120c1846E0972
16118d4368j62910A95299q103b34978F732a18517A82284b0410l30694M2917A00303
16106h6932a3416A26481i5630p8407M5829n5571M2136K8671L9873C77106b60084
16094b35466a2245l0226l17062A28781b27012f9659j39833B12482c26540F8410
16083A1127N4223l98h2458j07538f8006l50222J21440A77957f1167K7926A68572
16071a45388N8689G4337e339k85341b3379A45885A5898a33138C11568a57941m91007
16060f48948C70578A16184a925A52126C7358b6027A29111a47354A41585b25026
$$ plain form
16049 -68692 -195394 357304 -15540 19534 163257 96430 -119787 240867 170308 47507 23842
16038 23842 169013 -95319 -128516 144187 79877 329045 37423 -268653 -311718 -43472 85503
16026 261504 -130897 -214374 -98599 -17440 159550 210845 210030 -30250 14918 -257846 239693
16014 -122309 -150909 -80943 12662 -23166 -264132 -21051 -17053 -101246 -42666 7716 53689 -234264
16001 326256 -368424 231564 178817 -136925 -43607 -92561 83030 -93325 209599 -236413
15990 91882 9713 -35393 -32627 32028 153637 443203 350509 -2194 261068 97255 187822 230134
15978 230134 -25985 -128888 98294 -182337 -383802 -33121 -291395 55610 -59077 294321
15967 -206061 63071 66549 -139469 -10824 -166724 443204 -245553 -141110 -11555 123558
$$ packed form
16049f8692j26702C57304a5540A9534J43723o6827a19787B40867p0559D7507k3665
16038B3842J45171i5319l3197A44187o4310K49168C7423b68653m3065d3472H5503
16026B61504a30897q3477i8599a7440A59550N1295q15c0250A4918b57846B39693
16014a22309k8600O9966A2662b3166k40966b1051L998q4193d2666G716M5973b34264
16001C26256c68424B31564n2747a36925d3607m8954H3030i3325B09599b36413
15990I1882I713c5393K766C2028J21609K89566r2694b194B61068I7255R0567M2312
15978B30134b5985j02903I8294a82337k01465c3121k58274E5610e9077B94321
15967b06061F3071L478a39469a0824j55900D43204b45553J04443a1555A23558
$$ plain form
15956 172524 76901 -29952 258949 423558 38940 -180899 144648 36507 -17247 250700
15945 -51481 352739 -100147 -13935 -175096 -253788 -73310 53426 -242399 277603 -185732
15934 10431 -83288 30858 -22404 -159411 13940 -11442 -173434 93676 194554 62897 -305688
15922 161201 -211564 82065 77252 -191583 -22477 36615 92176 -269981 -71706 -6204 332665
15910 -240514 -126826 -430716 -414319 54566 -166376 104001 278063 -28252 20040 -175354
15899 30550 92449 -152579 -283553 175634 -231522 8169 55550 239233 20558 -321077 -38186
15887 -129720 -47588 82273 -79236 137731 73908 31454 -129124 -196096 189830 -48040 -112715
15876 -112715 24750 -86283 -135652 40492 -11379 -150428 -268635 -107238 -185357 119264 -67822
$$ packed form
15956A72524G6901b9952B58949J64609C8940a80899A44648C6507a7247B50700
15945e1481C52739a00147a3935j61161p8692g3310E3426b42399B77603a85732
15934A0431h3288C0858b2404j37007A3940a1442j61992I3676J00878F2897c05688
15922A61201b11564H2065m813a91583b2477C6615N5561b69981g1706f204C32665
15910b40514J13688l03890J6397E4566a66376A04001J74062b8252B0040a75354
15899C0550O1899a52579j30974A75634b31522H169M7381J83683B0558c21077c8186
15887a29720d7588H2273g9236A37731o3823C1454a29124o6972A89830d8040o4675
15876a12715B4750h6283m9369D0492a1379j39049j18207a07238p8119A19264f7822
$$ plain form
15864 -130079 -226954 21213 -192422 -105176 235460 -1532 -143314 -266051 -63640 -74839 -99383
15853 -99383 49667 -86937 34006 -206439 167640 -373917 -430512 -374192 -3512 8458 56386
15842 56386 203487 90501 -185458 -182449 26114 -136143 104199 74246 -50493 -213601 -45432
15830 186159 -37581 -135564 266636 -229670 -35714 111540 -97937 196825 -186741 -109612
15820 -109612 -310499 -194877 -123209 -272870 -162441 -65385 -88630 93468 -77140 -65441 125336
15808 39381 -173479 -155996 38435 251985 -269979 -88271 -180716 326034 -202492 142641
15797 125308 -245734 -176054 -312268 -123915 48187 -467949 133012 106136 -12371 -255799
15787 -255799 35991 165102 -230142 77215 -167131 32823 -84368 -48354 58995 323979 354512
$$ packed form
15864a30079r6875B1213a92422Q7246B35460a532j41782j22737f3640j1199k4544
15853i9383D9667h6937C4006b06439A67640c73917n6595N6320c512H458M7928
15842E6386J47101I0501a85458L009B6114a36143A04199k9953e0493j63108d5432
15830A86159c7581r7983B66636b29670c5714A11540i7937A96825a86741P7129
15820a09612k00887J15622P1668j49661J10429f5385k3245I3468g7140J1699A25336
15808C9381a73479J7483C8435K13550b69979h8271r2445C26034b02492A42641
15797A25308b45734O9680j36214a23915D8187d67949A33012k6876a2371k43428
15787b55799C5991J29111b30142G7215a67131C2823h4368L6014E8995K64984L0533
$$ plain form
15776 354512 -318986 -31081 -85717 -78958 159305 -139362 -39424 159804 -122305 -4238 51290
15764 76510 -218158 -81443 -149775 -167189 -32591 223314 80910 289569 256974 -161439 209540
15752 193799 -151508 -20911 30560 -58079 -201713 98342 300381 207320 265166 77959 117070
15741 117070 -331208 -68616 300897 91948 109823 220365 366387 -42443 -69101 -368755
15731 -368755 -83383 -58817 -267903 2692 -224223 118900 176038 103042 78843 -129343 147071
15719 37920 -46543 -56738 -9666 105033 -227613 121722 42406 -18825 -185906 37765 44270
15708 44270 -346510 -126468 34332 -76757 95288 366301 3009 -11107 375859 106935 117224
15697 117224 -123811 79811 -53852 742 -80975 -1406 -124258 -132898 -72818 -117733 336226 -130640
$$ packed form
15776C54512c18986c1081n4636O759A59305a39362c9424A59804a22305d238E1290
15764G6510b18158h1443o8332j7414c2591B23314H0910K08659l2595a61439B09540
15752A93799a51508b0911C0560e8079j43634I8342K02039r3061N7846G7959L9111
15741A17070c31208f8616C00897I1948J7875J10542J46022d2443k6658k99654
15731c68755h3383K4566k09086B692b24223A18900N7138p2996k4199a29343A47071
15719C7920d6543j0195i666A05033b27613A21722D2406a8825j67081C7765O505
15708D4270c46510a26468C4332g6757I5288K71013C009a1107C75859A06935J0289
15697A17224a23811G9811e3852G42h0975a406j22852q640O0080m4915C36226a30640
$$ plain form
15684 -15808 104930 21776 -142758 33392 -18605 110370 -207177 -82445 -132866 -170482 160750
15672 -168258 254277 -140144 -130769 13043 -136849 4773 147937 -211268 -91083 -139978 58904
15660 431517 -105621 -318050 -250468 -175993 -243512 41832 181994 293177 -22461 126180
15649 20700 -323237 -199616 -37924 151982 -54451 -75560 142660 81733 -217991 -71891 -352024
15638 -352024 -331597 -40768 -244552 90040 -34658 -386862 -279180 -164006 -105026 8636 15128
15627 15128 -63815 -18672 -130731 82651 -197187 127636 66827 -343992 -178425 271471
15616 -173049 -101861 179657 170281 -246113 1218 -373960 29527 150236 -52909 -93697 -233109
15605 -233109 -23339 248739 -10289 337331 -188444 -140424 256729 369565 -157779 229252
$$ packed form
15684a5808A04930B1776a42758C3392a8605A10370b07177h2445n0421l7616A60750
15672a68258B54277a40144R375A3043a36849D773J43164b11268i1083m8895E8904
15660D31517a05621k12429O7582P4475o7519D1832J40162J11183b2461A26180
15649B0700c23237J23621c7924A51982e4451k1109A42660o0927b17991g1891k80133
15638c52024K0427d0768k03784I0040c4658l52204J07682J15174N8980H636O492
15627A5128f3815a8672j12059H2651a97187A27636o0809c43992J65567B71471
15616a73049P1188A79657r376b46113A218c73960B9527J20709e2909m0788j39412
15605b33109b3339B48739a0289C37331a88444M8020B56729J12836a57779B29252
$$ plain form
15594 -423723 -270571 -165806 170354 -21572 -73925 24324 -22198 -87995 -51477 193615 239281
15583 239281 -213157 -402394 217104 76421 67001 -79147 52527 -121723 -241120 -256737 257552
15571 73329 49747 -224403 35833 -114116 -369078 -215144 -275437 -125612 136859 18088
15560 -181455 -36408 50443 -52396 259122 -173718 -231534 227613 -136282 -204834 86053 -231231
15548 11961 -63769 -146995 -24105 54426 -277600 -190307 -23980 281169 -82369 -146736 78068
15536 5602 236262 -16564 -79335 49047 -69725 -20748 -232663 -132539 -331635 -129726 -42124
15524 139005 274264 -14249 -41327 -128036 -236392 -347550 101867 68918 178926 99373
15514 99373 -347666 -151193 121213 -37250 -147883 290992 58257 170050 -284916 -45740
$$ packed form
15594d23723J53152J04765A70354b1572n2353B4324b2198o5797L6518A93615M5666
15583B39281b13157j89237B17104G6421r420g9147E2527a21723j19397j5617B57552
15571G3329k3582b24403C5833a14116k54962J53934o0293a25612A36859A8088
15560a81455c6408E0443e2396B59122a73718n7816B27613a36282o8552H6053b31231
15548A1961f3769q3226b4105E4426b77600Q7293b3980B81169h2369o4367G8068
15536E602K30660a6564o2771D9047f9725b0748k11915J00124j99096a29726d2124
15524A39005J35259a4249k7078q6709j08356j11158A01867l2949J10008p9553
15514I9373c47666a51193A21213c7250j10633B90992E8257J11793b84916d5740
$$ plain form
15503 -39879 -87273 -242046 372937 -252524 188046 -8505 52666 13530 -49717 -112959 -207759
15492 -207759 81115 256819 -1229 190300 -11226 -93808 -115707 -95352 39211 147151 -89405
15480 -43263 335895 -46985 92300 56386 -30872 285076 145956 1238 66075 32566 -71226
15468 163369 133044 -117328 19879 -197111 -13056 -241277 -94180 26639 -184315 93041 63200
15457 63200 -226268 -203544 -85561 96283 76237 89616 200344 24656 -76928 54373 -125708
15445 -40546 -79693 -25216 -116496 -55268 -307932 105577 156569 226531 53233 -36323 -259407
15434 -259407 -221870 -204070 194904 -291837 -252361 261098 -439988 190315 2980 -163028
15423 -98307 162696 -61743 -64842 -103213 127294 12367 138821 89707 84683 -132979 1639
$$ packed form
15503c9879m7394j54773C72937b52524A88046h505E2666A3530d9717o3242r4800
15492b07759H1115J75704a229A90300a1226q2582k1899K0355C9211J07940h9405
15480d3263C35895d6985I2300l5914c0872B85076j39120A238O4837C2566g1226
15468A63369l0325a17328A9879a97111a3056k28221i4180B6639a84315I3041k9841
15457F3200b26268K2724h5561I6283k0046J3379J10728B4656g6928E4373a25708
15445d0546l9147b5216r1280e5268k52664A05577N0992O9962E3233c6323k23084
15434b59407L7537J7800A94904b91837L9476B61098d39988A90315B980a63028
15423i8307A62696f1743l099l8371A27294A2367J26454m9114n024a32979A639
$$ plain form
15411 141363 -195287 -4854 158448 24293 172576 -273510 193892 391067 -100694 -141523
15401 -141523 113015 291238 329487 -193655 -12980 -426218 -96559 68446 -137404 311147
15390 60916 -9459 178360 92035 457840 -103821 231493 -328051 -52742 93774 -45307 -100671
15379 -100671 -19255 -64254 -27816 13591 100519 19900 -15346 -16021 -280263 314760 253541
15368 253541 -57264 -24444 53731 -36901 -330287 -83434 211319 131556 -167076 -404007 83999
15356 236553 -71843 -183684 33403 286655 -5324 -1396 -285242 -95362 59445 110001 -86447
15344 -307224 -137391 -95247 84413 -137738 -170014 116991 151673 12876 -18895 314460 55620
15332 40881 -56078 -102300 37995 -104392 79029 -38407 273581 -264662 -35016 386948 -227541
$$ packed form
15411A41363a95287d854A58448B4293J48283b73510A93892J97175a00694m0829
15401a41523A13015J78223L8249a93655a2980m13238i6559F8446a37404C11147
15390F0916i459A78360q6325L65805a03821B31493c28051e2742I3774d5307n5364
15379a00671a9255m4999b7816A3591Q6928A9900a5346o75k64242C14760o1219
15368B53541e7264b4444E3731c6901k93386h3434B11319p9763a67076k36931H3999
15356B36553g1843j11841C3403K53252e324a396k83846i5362E9445N0556h6447
15344c07224a37391M2144H4413a37738l2276A16991L4682A2876a8895C14460E5620
15332D0881e6078m6222C7995a04392G9029c8407B73581b64662c5016C86948b27541
$$ plain form
15320 -276863 -211487 345764 -116912 359200 -235803 -249703 69164 -85484 -334570 -22933
15309 44725 -172927 121479 80707 -175561 -78885 -99963 -81905 30277 -42415 93937 76960
15298 76960 -239605 32790 52344 -20535 148701 9893 -283031 -114546 209994 -212408 133009
15286 136493 -87256 -152722 54817 140455 110777 117962 255946 14047 -116645 110130 -198198
15274 1936 -105068 -15244 104337 288494 -145444 -149436 -71905 -59193 -28512 -183148 332312
15262 117635 -27900 -88149 234259 -18027 -29634 -89003 201527 -117853 261280 421591
15252 421591 113659 386285 1071714 904488 740006 1149534 235010 376881 235378 -29308
15241 129146 -118192 -152476 -171545 272543 214027 42505 -267909 -198549 -151255 77299 170114
$$ packed form
15320b76863O5376C45764a16912C59200b35803j3900F9164h5484k49086b2933
15309D4725a72927A21479m0772a75561g8885k1078J8058C0277d2415I3937j6977
15298G6960b39605C2790J9554b0535A48701I893b83031a14546B09994b12408A33009
15286A36493h7256o5466E4817Q5638k9678P185J37984A4047a16645A10130a98198
15274A936a05068a5244A04337J84157a45444l992g1905J2712b8512j54636C32312
15262A17635b7900o0249B34259a8027j1607n9369B01527a17853B61280J60311
15252D21591A13659K72626O85429j67226j64482M09528B35010J41871j41503b9308
15241A29146a18192l4284j9069B72543n8516D2505b67909O9360M7294G7299R2815
$$ plain form
15230 170114 -317247 63608 -8142 109928 245626 51622 -176102 19305 -275067 71651 -2683
15218 207087 -122709 -134224 24654 114415 228058 -70255 205069 57975 172116 108343 -62459
15206 -46227 161091 181515 -38222 -326913 -104723 -84290 177473 -285119 197419 23533
15195 291738 229751 278654 -221476 -221620 29905 -46954 393942 159046 -102267 209372 132941
15184 132941 -146238 -323000 89593 5887 -109198 -64881 370635 -254288 133262 255359
15174 255359 74472 9070 25302 359708 32478 308474 38558 199010 -295632 198389 157561
15163 157561 -175626 358636 -42347 -122962 -8803 104083 297405 20170 -342514 17746 58615
15152 58615 116399 -11787 106655 -137754 -249372 15671 124376 -271079 9574 92777 75199
$$ packed form
15230A70114c17247F3608h142A09928J35698E1622a76102A9305b75067G1651b683
15218B07087a22709j1515B4654Q9761J13643g0255B05069E7975J14141o3773f2459
15206d6227A61091K0424c8222k88691a04723K0433A77473b85119A97419B3533
15195B91738o1987M8903b21476j44B9905d6954C93942A59046a02267B09372p6431
15184A32941a46238j76762H9593E887a09198M4317C70635b54288A33262J22097
15174B55359G4472I070J6232L34406C2478K75996C8558J60452b95632A98389m0828
15163A57561a75626C58636d2347q0615h803A04083J93322B0170c42514A7746M0869
15152E8615N7784a1787A06655a37754j11618A5671J08705b71079I574Q3203j7578
$$ plain form
15141 75199 -49025 -75988 -131910 186318 5984 -44102 161684 46161 -126297 391067 -17485
15129 49596 554915 81710 178085 575451 -56872 -81801 98084 147285 669228 188696 -11094
15117 -297902 -106746 70513 180603 -196867 190578 174455 12546 204050 61649 -44743
15106 110040 287682 111222 135192 31064 63341 164340 -165884 58515 -304 85822 198308
15095 198308 257163 58135 271086 136323 103997 -217531 50360 -187833 182808 246267
15085 246267 -12303 113723 94682 -234310 142234 -24343 -167931 -23334 240312 -140345
15074 36333 -198506 109941 189103 245146 95521 -73517 109519 -3053 50700 8734 129494
15063 129494 -87611 27105 -230678 454760 5131 -145734 83219 -178964 -348393 257243
$$ packed form
15141G5199d9025k6963n5922A86318E984d4102A61684D6161a26297C91067a7485
15129D9596N05319H1710R6375L97366e6872k4929I8084M9201N21943A88696a1094
15117b97902a06746G0513J10090a96867A90578j6123A2546J91504F1649d4743
15106A10040J77642A11222K3970C1064L2277J00999a65884E8515c04H5822J12486
15095A98308N8855E8135K12951j34763l2326b17531E0360a87833A82808O3459
15085B46267a2303A13723j9041b34310A42234b4343j43588b3334B40312a40345
15074C6333a98506A09941P9162N6043I5521g3517A09519c053E0700H734J20760
15063A29494h7611B7105b30678D54760E131a45734H3219a78964j69429B57243
$$ plain form
15052 409156 294271 85912 -226514 68070 366218 -101543 315579 80682 -42899 249825
15041 262275 207583 389172 187232 284671 48500 287094 183900 -143955 301132 114723
15030 378284 10618 448498 -46224 429787 228784 -174932 -80174 340943 -24084 -33944 -195235
15019 -195235 120894 160096 103231 -15433 25053 296492 352889 -83948 153958 462755 280649
15008 280649 195545 79199 160079 -259138 392799 497158 226658 217231 129318 142242 104744
14997 104744 385952 -18885 126452 307176 -96412 117521 357997 -17502 19868 -66215
14986 82322 201084 212699 970 268657 519268 -13433 393306 384713 12657 366947 -132543
14974 -194078 517863 -186179 515554 -108989 -49845 -46003 145028 151247 -4342 14369 147391
$$ packed form
15052D09156j14885H5912b26514F8070K98148a01543C15579H0682d2899B49825
15041B62275n4692J81589A87232R7439D8500K38594j03194a43955C01132A14723
15030C78284A0618M37880d6224D29787k01003a74932h0174C40943b4084r860j61291
15019a95235A20894L9202n6865a5433B5053K71439N6397h3948A53958L08797j82106
15008B80649q5104G9199Q0880b59138C92799J04359B26658r427q7913J2924l7498
14997A04744K81208a8885A26452J80724i6412A17521K40476a7502A9868f6215
14986H2322J18762J1615I70K67687K50611a3433C93306q593A2657L54290a32543
14974a94078E17863a86179E15554a08989d9845L842A45028O219d342A4369J33022
$$ plain form
14963 147391 84868 -60457 283826 164389 205137 169226 309443 125284 -7792 169853 -19122
14951 -61963 367998 -83821 -165605 -219941 145284 105107 -236909 97973 509303 249803 268413
14940 268413 7321 -28619 215618 -55400 260201 513628 136080 117432 166238 -67203 177105
14928 596309 53708 -244778 135402 19499 486076 20244 222062 80006 310417 40505
14917 307182 393415 117074 360939 249835 203133 305957 45590 172147 188337 -70377
14906 201708 289109 374290 341511 6452 -47232 258182 77840 312223 209798 415971 -11075
14894 -134513 145044 409357 241619 495982 224660 471901 150937 163445 189817 -12203
14883 279963 93915 442076 105505 363659 266383 206876 545945 533583 202169 310404
$$ packed form
14963A47391o2523f0457B83826j19437M0748l5911J40217A25284g792A69853a9122
14951f1963C67998h3821q1784n4336A45284m0177b36909I7973M11330B49803J8610
14940B68413G321b8619B15618e5400B60201K53427A36080j8648M8806f7203A77105
14928E96309E3708b44778A35402A9499M66577B0244K01818H0006K30411D0505
14917C07182Q6233A17074K43865j11104m6702J02824D5590J26557J6190g0377
14906B01708Q7401Q5181l2779F452d7232B58182G7840K34383j02425K06173a1075
14894a34513A45044K64313j67738K54363B24660K47241A50937J2508K6372a2203
14883B79963I3915L48161A05505K58154r7276n9507L39069j2362B02169J08235
$$ plain form
14873 310404 459927 220374 119167 166802 258821 95621 268782 145299 491933 108302
14862 -185736 125345 204352 431816 154969 483075 368450 244142 20849 154231 156578
14852 156578 401864 114432 434275 263281 428291 231224 463011 294633 519387 216823
14841 592388 234452 282931 441890 339812 329267 304378 284265 382521 354857 -11782 341968
14829 228445 -110936 443837 250827 -110727 241463 368929 617485 301875 429347 486027
14819 486027 125908 228765 339036 505181 217403 348653 907146 214110 339099 325323
14809 325323 479011 374221 406580 260526 331141 349249 597017 404823 340365 649377
14799 649377 478682 665089 88287 677241 696377 292824 339777 336457 604718 524709 39826
$$ packed form
14873C10404J49523B20374j01207M7635R2019I5621J73161j23483L46634A08302
14862a85736A25345P9007K27464A54969L28106j14625j24308B0849J33382K347
14852A56578K45286A14432L19843j70994J65010j97067K31787j68378K24754B16823
14841E92388B34452M8479J58959j02078j0545k4889k0113R8256k7664a1782C41968
14829B28445a10936D43837j93010a10727B41463J27466K48556C01875J27472N6680
14819D86027A25908J02857J10271J66145B17403J31250N58493B14110J24989j3776
14809C25323J53688j04790L2359j46054P0615J8108K47768j92194o4458L09012
14799F49377j70695J86407H8287N88954J9136B92824M6953l320K68261q0009C9826
$$ plain form
14787 211842 356320 449749 601481 596658 385104 598041 529098 682916 691493 372054 480799
14776 480799 200231 719508 362090 362486 341587 224724 415667 359929 283615 316471 686001
14765 686001 359139 503903 639437 394476 520997 605004 379116 767368 356041 687890
14755 687890 461583 771522 444947 362189 543903 371002 234511 151885 -12130 230482
14744 609949 338624 366772 246660 718363 592619 737097 679045 497548 437464 289672
14734 289672 278190 531768 570257 630142 769962 495949 443766 315482 617370 216614
14723 695927 683547 392597 405428 687957 835829 564894 871470 704559 439683 592758
14713 592758 449265 895926 552298 774068 705835 699584 566787 460968 498791 646491
$$ packed form
14787B11842J44478R3429J51732m823k11554K12937o8943J53818Q577l19439J08745
14776D80799B00231N19277l57418L96k0899j16863J90943n5738p6314L2856L69530
14765F86001l26862J44764J35534k44961J26521Q4007k25888L88252C56041L31849
14755F87890k26307L09939l26575q2758J81714j72901j36491q2626a2130B30482
14744F09949k71325K8148j20112M71703j25744J44478n8052j81497o0084j47792
14734B89672j1482K53578L8489N9885J39820k74013n2183j28284L01888B16614
14723F95927j2380k90950J2831K82529J47872k70935L06576j66911k64876J53075
14713E92758j43493M46661l43628K21770o8233o251j32797j05819L7823J47700
$$ plain form
14703 646491 703645 998904 558241 491045 738612 757413 563809 590689 684828 707190 531253
14692 531253 741478 502893 612383 707580 615322 687938 773982 599980 989901 1037479
14682 1037479 858981 1014003 501681 747508 831259 537702 757712 581256 722259 755470
14672 755470 841126 750573 473871 752699 795060 809475 494824 554484 1089644 846405
14662 846405 812849 633151 743930 1019649 825756 614910 758120 1029563 1003486 950554
14652 950554 857897 743140 871942 561456 600256 715498 933318 767927 893144 867649
14642 867649 1012448 1001468 992016 717696 893571 1131730 1075456 1065139 1213652 1098803
14632 1098803 1094689 1133890 1348578 922409 828599 954459 1057375 1226865 881943 931579
$$ packed form
14703F46491N7154K95259m40663o7196K47567J8801j93604K6880R4139K2362j75937
14692E31253K10225k38585J09490R5197r2258P2616Q6044j74002L89921M7578
14682A037479j78498J55022E01681K45827Q3751k93557K20010j76456J41003L3211
14672G55470Q5656r0553k76702K78828M2361J4415l14651N9660N35160k43239
14662H46405l3556j79698J10779K75719j93893k10846J43210K71443k6077n2932
14652I50554r2657j14757J28802l10486L8800J15242K17820j65391J25217k5495
14642H67649J44799j0980r452k74320J75875K38159n6274j0317J48513j14849
14632A098803m114L9201K14688m26169r3810J25860J02916J69490l44922M9636
$$ plain form
14622 931579 1277845 1182027 1209921 1148392 1170850 1102350 966842 931229 978990 1011755 1070893
14611 1070893 1046305 1217251 1183569 1182279 1117736 1248443 840282 1307315 1428038 1100633
14601 1100633 922207 1259689 1313777 1260911 1411216 1273053 1345951 1384907 1399998 1229486
14591 1229486 1150999 1087738 1230255 1567378 1477172 1172384 1331579 1430246 1576748 1671109
14581 1671109 1339378 1702840 1389577 1273216 1692606 1408110 1498957 1494416 1493634 1746949
14571 1746949 1903184 2118543 1918772 1776952 1665728 1893441 1744571 2038799 1825853
14562 1825853 1968647 2133654 2419438 2024355 2224929 2303172 2407235 2507907 2758500 2935665
14552 2935665 3430205 3893032 4948831 7000700 11392564 20446011 36022926 34401063
$$ packed form
14622I31579L46266r5818K7894o1529K2458o8500j35508l5613M7761L2765N9138
14611A070893k4588J70946l3682j290o4543J30707m08161M67033J20723l27405
14601A100633j78426L37482N4088n2866J50305j38163P2898L8956J5091j70512
14591A229486p8487o3261J42517L37123r0206l04788J59195R8667J46502R4361
14581A671109l31731L63462l13263j16361M19390k84496R0847m541p82K53315
14571A746949J56235K15359j99771j41820j11224K27713j48870K94228k12946
14562A825853J42794J65007K85784l95083K00574P8243J04063J00672K50593J77165
14552B935665M94540M62827J055799K051869M391864R053447J5576915j621863
$$ plain form
14544 34401063 14894258 5492648 3141846 2047651 1431556 1855212 1691517 2008184
14536 2008184 1639780 1498652 1434665 1626989 1475233 1782018 1742956 1581867 1455732 1784371
14526 1784371 1376226 1771203 1584469 1842836 1956184 1903692 1897914 2148858 1640253 1735965
14516 1735965 1910722 2147453 1961700 1931967 2056314 2114036 1921964 2077535 2091796 2025629
14506 2025629 2617573 1989434 2142921 2008064 2529967 2248335 2327304 2442786 2462545 2115079
14496 2115079 2404553 2602810 2451998 2763809 3010540 2302021 2685072 2456989 3175087
14487 3175087 2547818 2763861 3202372 3039184 2961480 3015942 3204079 3072942 2765761 3432549
14477 3432549 3023796 3247798 3009090 3129205 3377704 3291034 3476901 3357716 3293186 3588415
$$ packed form
14544C4401063A4894258E492648k350802j094195o16095M23656j63695L16667
14536B008184l68404j41128o3987J92324j51756L06785l9062j61089j26135L28639
14526A784371m08145L94977j86734K58367J13348n2492n778K50944n08605R5712
14516A735965J74757K36731j85753k9733J24347N7722j92072J55571J4261o6167
14506B025629N91944o28139J53487j34857N21903k81632P8969J15482J9759l47466
14496B115079K89474J98257j50812L11811K46731p08519L83051k28083P18098
14487C175087o27269K16043M38511j63188p7704N4462J88137j31137l07181O66788
14477C432549m08753K24002k38708J20115K48499q6670J85867j19185o4530K95229
$$ plain form
14467 3588415 3738860 3331426 3477856 3666407 3670429 3410536 3833359 3715274 4033604 4075552
14457 4075552 3905360 3915747 4028371 4028565 4353428 4187705 4260230 3874827 4265021 4471699
14447 4471699 4461200 4655864 4529397 4567180 4655419 4548490 4896165 4666646 4901791 4839081
14437 4839081 5211698 5024629 5082393 5335765 5319331 5524895 5375554 5430304 5325222 5391252
14427 5391252 5670779 5548750 5760512 6262801 5951955 5711392 5996554 5992323 6218970 6554246
14417 6554246 6209418 6778002 6787777 6570330 6948291 6986440 7071818 7021776 6960737 7511713
14407 7511713 7441454 7730073 7764275 7734480 8009245 7848900 8010793 8174802 8597180 8607801
14397 8607801 8442511 8563537 9049973 9119920 9439174 9564876 9379005 9522962 9963973 10130626
$$ packed form
14467C588415J50445m07434J46430J88551M022k59893M22823j18085L18330M1948
14457D075552j70192J0387J12624J94L24863j65723P2525l85403L90194K06678
14447D471699j0499J94664j26467L7783Q8239j06929L47675k29519K35145o2710
14437D839081L72617j87069N7764K53372j6434K05564j49341N4750j05082O6030
14427E391252K79527j22029K11762N02289l10846k40563K85162m231K26647L35276
14417F554246l44828N68584R775k17447L77961L8149Q5378n0042o1039N50976
14407G511713p0259K88619L4202k9795K74765j60345J61893J64009M22378J0621
14397H607801j65290J21026M86436O9947L19254J25702j85871J43957M41011J66653
$$ plain form
14387 10130626 10413867 10706885 10612292 10988968 10911906 11114070 11258798 11766598 11765808 12356654
14377 12356654 12057291 12511848 12826159 12957716 13176729 13646312 13851057 14026456 14276617
14368 14276617 14765811 15211257 15430240 15661722 16025635 16407367 16763041 16730403 17598868
14359 17598868 18127600 18344405 18662655 19218877 19440620 19930987 20264130 20634886 21550478
14350 21550478 21849802 22477134 23294358 23361576 24282436 24985129 25572223 25599536 27129905
14341 27129905 27772480 28245831 29373268 29871685 30968767 31865706 32738435 33519263 34773625
14332 34773625 35625266 36824610 37875034 39348522 40311662 41897361 42888363 44530774
14324 44530774 46412760 47620290 49407508 51447818 52894734 55308972 57135036 59134084
$$ packed form
14387A0130626K83241K93018r4593L76676p7062K02164J44728N07800p90N90846
14377A2356654k99363M54557L14311J31557K19013M69583K04745J75399K50161
14368A4276617M89194M45446K18983K31482L63913L81732L55674l2638Q68465
14359A7598868N28732K16805L18250N56222K21743M90367L33143L70756R15592
14350B1550478K99324O27332Q17224O7218R20860P02693N87094K7313J530369
14341B7129905O42575M73351J127437M98417J097082Q96939Q72729P80828J254362
14332C4773625Q51641J199344J050424J473488R63140J585699R91002J642411
14324D4530774J881986J207530J787218K040310J446916K414238J826064J999048
$$ plain form
14316 59134084 61588873 63983667 66714154 69204641 72029956 75003213 78465319 81310892
14308 81310892 85109093 89115437 93120759 97560024 102105363 106902357 112082217 117391670
14300 117391670 123567911 129547946 136371107 143352227 151312858 159168888 168306242 177062091
14292 177062091 186998669 196970334 208139448 219832904 232114672 244945795 257890584
14285 257890584 271740735 285693791 300042668 314881882 329760903 344073865 357947676
14278 357947676 371508495 383916511 395228648 405104735 413219854 418658983 419818396
14271 419818396 420009630 419585433 419214607 415419398 411160410 403504190 392632706 380259646
14263 380259646 366624977 351522453 336706907 321113725 305839495 290576179 276571788
$$ packed form
14316E9134084K454789K394794K730487K490487K825315K973257L462106K845573
14308H1310892L798201M006344M005322M439265M545339M796994N179860N309453
14300A17391670O176241N980035O823161O981120P960631P856030R137354Q755849
14292A77062091R936578R971665J1169114J1693456J2281768J2831123J2944789
14285B57890584J3850151J3953056J4348877J4839214J4879021J4312962J3873811
14278C57947676J3560819J2408016J1312137R876087Q115119N439129J159413
14271D19818396J91234m24197l70826l795209m258988p656220j0871484j2373060
14263C80259646j3634669j5102524j4815546j5593182j5274230j5263316j4004391
$$ plain form
14256 276571788 262453619 248505758 235363334 223129033 211108373 199874337 189084735
14249 189084735 179365945 169852948 161143020 152861104 145411021 138646202 131351998 125176597
14241 125176597 119089423 113270757 108121540 103485452 98758851 94363252 90000399 86461047
14233 86461047 82614069 79012310 76291874 73107887 70145808 67158287 64596630 62148507
14225 62148507 59716805 57562799 55295664 53432831 51856641 50011807 48278315 46409607
14217 46409607 44790208 43406892 42013139 40920047 39817992 38351484 37387056 36260686
14209 36260686 35178984 33832012 33361006 32517644 31656272 30576571 29591973 28608685 28073128
14200 28073128 27829283 27022472 25611906 25105628 24471116 23915743 23869074 22957744 22428614
$$ packed form
14256B76571788j4118169j3947861j3142424j2234301j2020660j1234036j0789602
14249A89084735r718790r512997q709928q281916p450083o764819p294204o175401
14241A25176597o087174n818666n149217m636088m726601m395599m362853l539352
14233H6461047l846978l601759k720436l183987k962079k987521k561657k448123
14225F2148507k431702k154006k267135j862833j576190j844834j733492j868708
14217D6409607j619399j383316j393753j093092j102055j466508r64428j126370
14209C6260686j081702j346972m71006q43362q61372j079701r84598r83288n35557
14200B8073128k43845q06811j410566n06278o34512n55373m6669r11330n29130
$$ plain form
14191 22428614 21705640 20792870 20683947 20433398 19834959 19097167 18515462 18516371 17997614 17703705
14181 17703705 17025579 16676842 16691033 16245830 15997455 15620702 15243242 15157703 14573904 14437720
14171 14437720 14062340 13712140 13217623 13154311 12955156 12533021 12425291 12023300 12329496
14162 12329496 12061404 11363181 11599477 11468686 11283240 10775733 10655744 10568539 10281486
14153 10281486 10088354 10108457 9579288 9605490 9696856 9332497 9217223 9021476 8846046 8976751
14143 8976751 8679004 8319032 8304186 8203537 8475037 7943173 8111748 7726523 7810387 7652759
14133 7652759 7568370 7506049 7356366 7457989 6981917 7181335 6903249 6760866 6427560 6445548
14123 6445548 6560540 6318093 6200519 6200955 6247628 6254845 5997456 6033646 5994047 5824604 5737139
$$ packed form
14191B2428614p22974r12770j08923k50549n98439p37792n81705R09n18757k93909
14181A7703705o78126l48737J4191m45203k48375l76753l77460q5539n83799j36184
14171A4437720l75380l50200m94517o3312j99155m22135j07730m01991L06196
14162A2329496k68092o98223K36296j30791j85446n07507j19989q7205k87053
14153A0281486j93132K0103n29169K6202R1366l64359j15274j95747j75430J30705
14143H976751k97747l59972j4846j00649K71500n31864J68575l85225Q3864j57628
14133G652759q4389o2321j49683J01623m76072J99418k78086j42383l33306J7988
14123F445548J14992k42447j17574M36M6673P217k57389L6190l9599j69443q7465
$$ plain form
14112 5737139 5752523 5224199 5406986 5353131 5214408 5291954 4959778 5136841 5099019 4824665
14102 4824665 4665616 4822096 4896523 4893367 4831567 4696650 4622826 4544440 4473168 4098235 4534150
14091 4534150 4275425 4040634 4406012 4002132 4129435 4055994 3836440 4026189 3699047 3979047
14081 3979047 3832027 3704963 4156695 3794887 3929365 3741213 3269041 3781778 3619923
14072 3619923 3371123 3300990 3440131 3588839 3457313 3488900 3330028 3689640 3639061 3036090
14062 3036090 3227057 2998004 3087552 3088532 3271395 3219673 3057160 2896134 3049645 2975251
14052 2975251 2864793 2758540 3001096 2767422 2909210 2880130 2716026 2767874 2815783 2922254
14042 2922254 2542181 2662149 2865305 2530253 2568316 2541593 2692071 2311568 2365797 2269953
$$ packed form
14112E737139J5384n28324J82787n3855j38723P7546l32176J77063l7822k74354
14102D824665j59049J56480P4427l156o1800j34917p3824p8386p1272l74933M35915
14091D534150k58725k34791L65378m03880J27303p3441k19554J89749l27142K80000
14081C979047j47020j27064M51732l61808J34478j88152m72172N12737j61855
14072C619923k48800p0133J39141J48708j31526L1587j58872L59612n0579o02971
14062C036090J90967k29053Q9548R80J82863n1722j62513j61026J53511p4394
14052B975251j10458j06253K42556k33674J41788k9080j64104N1848M7909J06471
14042B922254l80073J19968K03156l35052L8063k6723J50478l80503N4229r5844
$$ plain form
14032 2269953 2620703 2490717 2678299 2512506 2480035 2373481 2438481 2503818 2366570 2130513
14022 2130513 2208545 2433821 2323905 1833890 2075732 2125486 2064935 2296878 2265700 1777416
14012 1777416 2087244 2017805 1858905 1929482 1726340 2241098 1767864 1600844 1817477 1886276
14002 1886276 1688865 1823891 1705903 2114531 1860598 1804833 1665949 1722266 1717750 1717933 2166925
13991 2166925 2205359 2617517 3561537 6390180 14192880 30324115 36624668 19841471
13983 19841471 9973090 6214056 4516361 3447101 3177542 2802327 2875518 2816625 2419243
13974 2419243 2168167 2413341 1952507 1831522 2172615 1995991 1989362 1956196 1892399 1980339
13964 1980339 1731221 1877999 1643881 2142205 1825711 1424384 1932604 1519095 1413949
$$ packed form
14032B269953L50750j29986J87582j65793l2471j06554O5000O5337j37248k36057
14022B130513P8032K25276j09916m90015K41842M9754o0551K31943l1178m88284
14012A777416L09828o9439j58900P0577k03142N14758m73234j67020K16633O8799
14002A886276j97411J35026j17988M08628k53933n5765j38884N6317m516J83M48992
13991B166925L8434M12158R44020K828643P802700J6131235O300553j6783197
13983A9841471r868381l759034j697695j069260k69559l75215P3191n8893l97382
13974B419243k51076K45174m60834j20985L41093j76624o629l3166o3797Q7940
13964A980339k49118J46778k34118M98324l16494m01327N08220m13509j05146
$$ plain form
13955 1413949 1624845 1569744 1460599 1803891 1494485 1404948 1473654 1671740 1510460 1494996
13945 1494996 1528795 1586012 1542759 1416273 1619271 1356279 1532990 1318953 1185665 1619497
13935 1619497 1463374 1209835 1280796 1615051 1537497 1546792 1322559 1300589 1379005 1119326
13925 1119326 1273503 1333546 1277073 1598709 1491058 1299257 1272803 1563058 1643472 1220294
13915 1220294 1239159 1272314 983044 1377249 1078796 1401066 1052183 1431579 1221057 1050993
13905 1050993 1031246 1089779 1263640 854168 1108211 1332109 1098118 1028099 689171 693630
13895 693630 1146936 1019665 1194987 944980 647326 921377 1090242 1133811 1033077 894271
13885 894271 1151647 751295 1132574 994995 1125073 1297090 1133757 1002869 785419 1201546
$$ packed form
13955A413949K10896n5101j09145L43292l09406q9537O8706J98086j61280j5464
13945A494996L3799N7217m3253j26486K02998k62992J76711k14037j33288M33832
13935A619497j56123k53539P0961L34255p7554R295k24233k1970P8416k59679
13925A119326J54177O0043n6473L21636j07651j91801k6454K90255Q0414m23178
13915A220294J8865L3155k89270L94205k98453L22270l48883L79396k10522j70064
13905A050993j9747N8533J73861m09472K54043K23898k33991p0019l38928M459
13895F93630M53306j27271J75322k50007k97654K74051J68865M3569j00734j38806
13885H94271K57376m00352L81279j37579J30078J72017j63333j30888k17450M16127
$$ plain form
13875 1201546 967561 624631 1222020 997216 468751 1228662 1002478 842487 935386 730011
13865 730011 880426 988501 975222 894807 883640 1075615 731435 586107 766826 641756
13855 641756 690223 882736 1046614 709909 1065289 1035575 501315 859762 919500 679405
13845 679405 647103 773494 530222 1011325 772979 821251 771127 892378 533757 812103
13835 812103 901697 959988 1047250 597351 445560 586871 788503 677232 633664 1017543
13825 1017543 872838 867570 1012699 981494 497582 577743 1025237 657047 463493 961059
13815 961059 704123 882978 534111 621999 898223 533672 822155 630256 683752 170329
13804 503094 807773 703179 958658 572213 638502 513714 664410 805722 571758 467939
$$ packed form
13875A201546k33985l42930N97389k24804D68751P59911k26184j59991R2899k05375
13865G30011J50415J08075j3279q0415j1167J91975l44180j45328J80719j25070
13855F41756M8467J92513J63878l36705L55380k9714E01315L58447N9738k40095
13845F79405l2302J26391k43272M81103k38346M8272n0124J21251l58621K78346
13835H12103Q9594N8291Q7262m49899j51791J41311K01632j11271m3568L83879
13825A017543j44705n268J45129l1205m83912Q0161M47494l68190j93554M97566
13815I61059k56936J78855l48867Q7888K76224l64551K88483j91899N3496A70329
13804E03094L04679j04594K55479l86445O6289j24788J50696J41312k33964j03819
$$ plain form
13794 467939 601742 464892 402425 584650 583744 489662 385171 536194 658641 915158
13784 915158 591439 234686 814324 427469 738401 571716 375325 618315 726042 631052
13774 631052 992094 644568 452504 447982 581356 367327 779700 404954 673574 558495
13764 558495 576971 817340 300042 721812 403396 322116 759292 431300 736327 670039
13754 670039 198003 603618 609482 615053 330199 548646 356707 477670 510721 665506
13744 665506 482137 633695 273373 634746 147111 730693 530052 331818 295169 838648
13734 838648 442659 401336 565672 717943 720690 474308 372873 782695 438103 295363
13724 295363 557416 385156 425144 418704 269618 199965 456760 519134 369616 613840
$$ packed form
13794D67939J33803j36850o2467J82225r06r4082j04491J51023J22447K56517
13784I15158l23719B34686N79638l86855L10932j66685j96391K42990J07727r4990
13774F31052L61042l47526j92064m522J33374k14029M12373l74746K68620j15079
13764E58495J8476K40369C00042M21770l18416q1280M37176l27992L05027o6288
13754F70039A98003M05615N864N571k84854K18447j91939J20963L3051J54785
13744F65506j83369J51558B73373L61373A47111N83582k00641j98234l6649N43479
13734H38648l95989m1323J64336J52271K747k46382j01435M09822l44592j42740
13724B95363K62053j72260L9988o440j49086o9653K56795O2374j49518K44224
$$ plain form
13714 613840 437202 552582 455565 472082 244300 562392 466366 123401 379503 642710
13704 642710 416018 660262 523630 182227 657357 422521 267162 448321 568019 68646
13693 299746 445603 365131 721009 379995 274242 459087 585832 634018 320169 336161
13683 336161 430287 458818 510154 429996 468461 213796 445013 220889 141677 674950 293519
13671 357673 334850 410330 434702 397561 530320 178053 376501 274995 504355 158059
13660 566810 251226 403249 275777 103720 298079 269929 265279 246282 4487 244765 384997
13649 384997 567765 454241 462657 278597 -77493 226717 249142 47030 161359 321386
13639 321386 -31949 401186 431590 363696 420292 487169 416607 172876 351232 319562 375624
$$ packed form
13714F13840j76638J15380r7017J6517k27782L18092r6026A23401K56102K63207
13704F42710k26692K44244j36632A82227M75130k34836j55359J81159J19698F8646
13693B99746J45857q0472L55878l41014j05753J84845J26745M8186l13849J5992
13683C36161R4126K8531N1336q0158L8465B13796K31217B20889p9212N33273B93519
13671C57673k2823P5480K4372l7141J32759A78053J98448j01506K29360A58059
13660E66810B51226J52023j27472A03720J94359k8150m650j8997D487K40278J40232
13649C84997J82768j13524Q416j84060g7493B26717K2425D7030J14329J60027
13639C21386c1949D01186L0404o7894N6596O6877p0562A72876J78356l1670N6062
$$ plain form
13628 375624 415052 -59414 272673 148434 427190 561628 370958 428494 578410 257071
13617 534679 467024 341739 90058 -27836 327564 230349 452908 442348 414999 410145 125498
13605 470759 202019 159560 326370 -19663 230573 288700 300665 530224 314102 425255
13595 425255 137403 252396 342374 642376 322907 575519 416499 229812 355451 445018
13585 445018 109983 441094 379635 438533 188175 458632 539148 93735 729720 127014
13574 229794 326491 297822 468767 283934 271324 290322 319178 389286 164970 295207 6945
13562 183123 267246 181761 387589 260334 229796 343271 662882 200532 105417 308552
13552 308552 62792 223478 503149 169180 30891 205444 566690 232972 208955 421514
$$ packed form
13628C75624L9428e9414B72673j24239K78756J34438j90670N7536J49916B57071
13617E34679o7655j25285I0058b7836C27564r7215K22559j0560k7349m854A25498
13605D70759B02019m2459J66810a9663B30573N8127J1965K29559k16122J11153
13595D25255A37403J14993Q9978L00002l19469K52612j59020j86687J25639Q9567
13585D45018A09983L31111o1459N8898A88175K70457Q0516I3735O35985A27014
13574B29794R6697k8669J70945j84833j2610J8998K8856P0108A64970J30237F945
13562A83123Q4123q5485K05828j27255l0538J13475L19611B00532r5115K03135
13552C08552F2792J60686K79671A69180C0891J74553L61246B32972k4017K12559
$$ plain form
13542 421514 21838 229555 351795 259803 107334 250810 -685 357071 225202 150861 25081
13530 269230 155199 209688 149548 396198 322047 -124605 388808 342875 75218 370043
13520 370043 398110 360296 53146 92693 603292 93903 108470 216476 98235 182321 412353
13509 412353 156880 328013 394552 482218 484528 418092 459805 18019 146237 255616 48253
13497 -124043 390961 -81258 -18352 245560 523031 275398 274121 71348 276031 232347 182574
13486 182574 191319 47517 248596 225361 62782 157849 123402 35533 25138 21920 147996
13475 147996 384966 98996 153536 135857 47317 279961 339431 410174 -3442 237617 158729
13464 158729 23247 513880 172881 601515 67175 251570 412496 -3075 144698 281758
$$ packed form
13542D21514B1838K07717J22240r1992A07334J43476f85C57071j31869p4341B5081
13530B69230j14031N4489o0140K46650p4151a24605C88808m5933G5218K94825
13520C70043K8067l7814E3146L9547N10599I3903J4567J08006I8235Q4086K30032
13509D12353A56880J71133O6539Q7666K310o6436M1713A8019J28218J09379D8253
13497a24043C90961h1258a8352B45560K77471k47633j277G1348K04683m3684m9773
13486A82574Q745D7517K01079k3235F2782R5067l4447C5533j0395l218J26076
13475A47996K36970I8996N4540j7679D7317K32644N9470P0743c442B37617p8888
13464A58729B3247M90633A72881M28634F7175J84395J60926c075A44698J37060
$$ plain form
13454 281758 19889 -107303 312902 287170 440963 522939 34218 189136 187107 211852 -58468
13442 280837 236682 250185 144142 16822 106728 8060 253937 285444 113709 -36063 263207
13430 -60477 432620 -85523 179729 171054 15249 -99344 41938 222464 220660 214654 -101828
13418 263344 302356 -113374 202152 519197 258131 -112752 350919 288654 191007 237555
13408 237555 142953 -95966 21926 397117 148059 406077 308704 433430 202855 301511
13398 301511 342077 -82548 595710 84570 -98115 -2622 401926 90935 252747 78426 70526
13387 70526 117393 275040 -40210 262162 183844 -120080 -26782 244694 210106 230516 244142
13376 244142 199852 433417 131577 152258 453622 96279 -8245 440063 320567 355541 236838
$$ packed form
13454B81758A9889a07303C12902k5732J53793Q1976C4218J54918k029K4745e8468
13442B80837m4155J3503j06043A6822Q9906H060K45877L1507A13709c6063B63207
13430f0477D32620h5523A79729q675A5249i9344D1938J80526j804o006a01828
13418B63344L9012a13374B02152L17045B58131a12752C50919o2265r7647M6548
13408B37555r4602i5966B1926L75191A48059K58018r7373J24726B02855R8656
13398C01511M0566h2548E95710H4570i8115b622D01926I0935J61812G8426p900
13387G0526M6867J57647d0210B62162p8318a20080b6782B44694l4588K0410J3626
13376B44142m4290K33565A31577K0681L01364I6279h245D40063j19496L4974j18703
$$ plain form
13365 236838 313067 374014 177551 356029 253831 230273 481339 162157 313372 276551
13355 276551 52914 232522 180696 221654 104148 283205 -190352 252157 408660 -103363
13344 442120 106272 155097 442575 207648 214959 -69943 254623 18479 149213 190918 113828
13333 113828 172038 181916 198285 58011 -33227 161159 295009 50667 363324 119707 57237
13321 12731 -158753 26421 160103 -116228 255983 -109349 37576 459030 93134 -68114
13310 236885 -35689 -35223 106857 64317 -94336 382581 197644 197879 183849 -51037 -20082 118381
13297 103883 101306 -140595 165327 345537 326161 35255 60665 208713 98876 385608 -352031
13285 55011 641018 134313 70815 390708 13348 22467 151849 203993 191771 342508 51501
$$ packed form
13365B36838P6229O0947A77551J78478j02198k3558K51066A62157J51215l6821
13355B76551E2914J79608n1826M0958A04148J79057a90352B52157J56503a03363
13344D42120A06272M8825K87478B07648P311f9943B54623A8479J30734M1705p7090
13333A13828N8210R878J6369E8011c3227A61159J33850E0667L12657A19707E7237
13321A2731a58753B6421J33682a16228B55983a09349C7576M21454I3134f8114
13310B36885c5689M66A06857m2540i4336C82581j84937K35j4030e1037b0082A18381
13297A03883k577a40595A65327J80210j9376C5255K5410J48048I8876K86732c52031
13285E5011N86007A34313o3498L19893A3348R119J29382N2144j2222J50737E1501
$$ plain form
13273 138690 100106 196571 -227933 -44402 71805 64052 -20192 242321 -234343 202292 434776
13262 434776 54248 379954 219146 -70489 149736 211098 35086 166963 249012 -196143
13251 -115711 -103177 235145 136187 -35238 273002 -226480 169935 383484 95223 455048
13241 455048 331342 -32539 377535 197973 194644 -137242 -263088 251906 -100692 260398
13230 39145 197692 144619 19811 289136 -168317 305157 194186 241893 130401 113263
13220 113263 77464 34611 271037 101257 207409 -167527 -165174 -43907 -5627 -17040 90531
13208 110675 161706 227041 48006 -43995 -156738 -128236 -130666 238779 347852 62630 126534
13197 126534 242247 3824 101719 56928 -231309 36562 239343 126779 5279 -205898 266344
$$ packed form
13273A38690l8584R6465b27933d4402G1805p753b0192B42321b34343B02292K32484
13262D34776E4248L25706j60808g0489A49736O1362C5086J31877Q2049a96143
13251a15711J2534B35145r8958c5238B73002b26480A69935K13549I5223L59825
13241D55048j23706c2539C77535j79562l329a37242j25846B51906a00692B60398
13230C9145J58547n3073A9811K69325a68317C05157j10971M7707j11492j7138
13220A13263l5799C4611K36426A01257J06152a67527K353d3907e627j1413I0531
13208A10675N1031O5335D8006d3995j12743K8502k430B38779J09073F2630O3904
13197A26534J15713C824R7895m4791b31309C6562K02781j12564E279b05898B66344
$$ plain form
13185 588653 331692 -21126 -73666 482145 186871 -28425 -300889 106906 -14172 133993
13174 224501 5714 -128829 120689 131472 60223 147171 252649 -143187 101359 -55638 88505
13162 -55006 117345 64908 -64337 156192 -119219 33866 84053 319166 314955 90891 41567
13150 56289 -61888 228534 118004 151360 4041 -9088 75683 284435 31773 -91842 274912
13138 153184 -78891 150953 -230760 220304 -92956 463783 245941 -118588 221251 183350
13128 183350 272324 365151 9390 21883 1838 -4565 71665 -142958 314227 -170707 -26764
13116 -137172 -34679 274291 134179 145531 18488 289716 -158100 199258 192150 -23015 -28387
13105 -28387 125948 74872 168973 -398895 221408 -44084 150423 35578 28245 -274533 136031
$$ packed form
13185E88653k56961b1126n2540D82145A86871b8425k72464A06906a4172A33993
13174B24501E714a28829A20689J0783F0223Q6948J05478a43187A01359e5638H8505
13162e5006A17345n2437f4337A56192a19219C3866N0187K35113m211I0891D1567
13150E6289f1888B28534j10530L3356D041i088G5683K08752C1773i1842B74912
13138A53184g8891A50953b30760B20304i2956D63783k17842a18588B21251l7901
13128A83350Q8974R2827I390J2493A838d565G1665a42958C14227a70707b6764
13116a37172c4679B74291A34179J1352A8488K71228a58100A99258p108b3015n372
13105b8387A25948n1076R4101c98895B21408d4084A50423C5578p333b74533A36031
$$ plain form
13093 494093 -36602 -122899 99618 167908 4904 393596 112547 -120300 -56672 -312751 -38348
13081 167154 158142 90024 -98480 -103467 68907 173861 190880 -170573 30401 154992 36216
13069 305374 79304 -14178 467801 -88020 32806 153077 162621 -7968 221284 233546 262507
13058 262507 -203289 103760 -44933 118657 204692 16120 72114 134608 27948 185808 -99940
13046 11222 -50293 -92040 347111 -39447 -137383 -114341 141711 129270 24381 -40729 269824
13034 87756 9054 190088 124193 173455 403665 139665 198815 -82240 -36116 -210486 61203
13022 -205929 550703 -35494 231246 -354594 -88580 229896 230527 14587 185922 6024 99699
13011 99699 123280 148550 239092 -81606 -71313 303763 32223 90707 -131499 153470 86577
$$ packed form
13093D94093c6602q6297I9618O8290D904L88692A12547a20300e6672k56079c8348
13081A67154r012o8118i8480m987F8907J04954J7019a70573C0401J24591C6216
13069C05374G9304a4178D67801h8020C2806J20271R544g968B21284J2262K8961
13058B62507b03289A03760d4933A18657Q6035A6120N5994O2494B7948J57860i9940
13046A1222e0293m1747C47111c9447r7936K3042A41711j2441B4381d0729B69824
13034H7756I054J81034o5895M9262K30210A39665N9150h2240c6116j74370F1203
13022b05929E50703c5494B31246c54594h8580B29896O31A4587J71335F024R3675
13011I9699K3581K5270R0542h1606J0293C03763C2223N8484a31499A53470o6893
$$ plain form
13000 86577 189015 259066 -49774 166377 -198037 -62553 -155791 123895 225518 8886 -55018
12988 74709 35928 145993 60269 -54850 250681 -149159 72499 -3030 157127 46537 63105
12977 63105 228970 -46931 239804 98236 -103034 -4109 163489 443906 -231182 -1520 111533
12965 -88503 420205 58063 49084 117868 -63009 -50531 236637 91622 5337 186356 173373
12954 173373 89393 -177852 -38480 -95306 88857 251169 -148395 56948 -227299 57876 279114
12943 279114 -5080 -72883 -253113 108059 20658 461877 54989 114783 231916 155240 -85126
12931 168591 -209928 -420162 -163569 291694 228050 251885 200666 19693 155175 240263
12921 240263 147897 155547 -120451 81759 -184496 85933 -169058 194890 156342 36350 -47022
$$ packed form
13000H6577J02438P0051d9774A66377a98037f2553r3238A23895J01623H886e5018
12988G4709C5928J10065F0269e4850B50681a49159G2499c030A57127D6537J6568
12977F3105J65865d6931B39804I8236a03034d109A63489K80417b31182a520A11533
12965h8503D20205E8063q979O8784f3009J2478B36637I1622E337J81019j2983
12954A73373q3980a77852c8480n6826H8857J62312a48395E6948b27299E7876K21238
12943B79114e080o7803j80230A08059B0658M41219E4989N9794J17133p6676h5126
12931A68591b09928k10234a63569B91694o3644K3835n1219A9693J35482Q5088
12921B40263r2366P650a20451H1759a84496H5933a69058A94890l8548C6350d7022
$$ plain form
12909 46190 -32053 33627 -98406 151896 -18292 242539 118827 127337 -35713 -179276 -327474
12898 -327474 -35119 -123949 -105094 22115 248066 -9224 -41927 -880 7919 -148273 63309 82042
12886 82042 251629 193454 408049 -72711 142848 97525 236427 -137401 147902 -163724
12875 -140139 202371 5999 117656 -31117 -33027 43650 194428 71736 -28040 199721 -126512
12863 115493 47450 -117320 -115211 94341 -16568 347242 204068 257442 -161568 -167206 192929
12851 63505 -53639 15232 83354 -212379 228420 62276 -231205 -56509 93591 -7809 -107239
12840 -107239 254736 29156 62736 77666 -10128 -152697 129795 -161515 369338 -182366
12829 -137435 -21315 57869 245543 136039 72027 -7000 -83924 -4250 62368 301039 98450
$$ packed form
12909D6190c2053C3627i8406A51896a8292B42539A18827Q510c5713j43563j48198
12898c27474c5119q8830J8855B2115K25951i224l2703h80G919a48273F3309J8733
12886H2042J69587n8175K14595g2711A42848m5323J38902a37401A47902a63724
12875a40139B02371E999J11657c1117j910D3650J50778G1736b8040A99721a26512
12863A15493D7450a17320K109I4341a6568C47242j43174N3374a61568n638A92929
12851F3505e3639A5232O8122b12379B28420F2276b31205e6509I3591g809r9430
12840a07239B54736B9156L3580J4930a0128j42569A29795a61515C69338a82366
12829a37435b1315E7869J87674j09504o4012g000p6924d250F2368K38671I8450
$$ plain form
12817 51996 35973 222241 401669 -961 -314607 -199409 -7588 -50379 -40943 175177 169509 -29958
12804 -6675 127053 48977 198337 -24134 -50429 79605 285334 -89300 -149105 -241868 51375
12792 -102854 91728 -154229 -127638 9304 -139881 -146445 156036 243093 -120042 29288 -186364
12780 -201272 105122 -221660 -172532 -199712 -203013 82893 295214 -229108 230571 21748 -323557
12768 -173455 54846 -3286 -68414 174945 -116950 -111295 16623 149771 -52688 11407 104204
12757 104204 -100560 -48758 150622 -9633 140051 211561 -87041 176138 5019 -105181 -21893
12745 24700 99942 -62531 -12827 1159 18863 96559 -8526 211591 137268 237136 119296 146052
12733 146052 -99637 258151 163857 186355 -79878 212631 -141849 -17129 -12225 348307 -48390
$$ packed form
12817E1996j6023J86268J79428i61l13646J15198g588m2791R436A75177n668b9958
12804f675A27053D8977J49360b4134k6295G9605K05729h9300n9805r2763E1375
12792a02854I1728a54229K6591I304a39881o564A56036Q7057a20042B9288a86364
12780b01272A05122b21660M9128k7180l301H2893K12321b29108B30571B1748c23557
12768a73455E4846c286o5128A74945a16950N655A6623J33148e2688A1407R2797
12757A04204a00560d8758A50622i633A40051P1510h7041A76138E019a05181b1893
12745B4700P5242f2531a2827A159J7704P7696h526B11591p4323R9868j17840K6756
12733A46052i9637B58151r4294K2498g9878B12631a41849a7129M904C48307d8390
$$ plain form
12721 -22115 73263 65288 -17222 158190 -111729 69958 -92301 -156355 -180374 81005 250729
12710 250729 -54048 272489 81475 492858 189971 95048 443881 123130 -46914 96770
12699 -72369 -126189 358943 320383 -20022 210582 -111544 245437 -446973 299812 -71916
12688 419596 61666 40208 71133 217553 -147252 202503 240194 143049 184684 337056 135180
12676 -98212 88361 288351 132330 117158 -47091 -41456 88161 10458 224148 131911 367761
12665 367761 186240 75036 260242 -190 -71228 215519 -308060 105147 -57492 79076 -5279
12653 162387 97274 4762 301740 206237 -72212 -218013 122010 287717 -150930 340403
12642 -209912 -96363 -241264 -3479 117880 204704 278323 124097 310817 -103457 316853
$$ packed form
12721b2115G3263p975a7222A58190a11729F9958i2301o4054k4019H1005J69724
12710B50729e4048B72489H1475M11383A89971r4923L48833A23130d6914I6770
12699g2369n3820C58943l8560b0022B10582a11544B45437d46973B99812g1916
12688D19596F1666k1458L0925J46420a47252B02503L7691r7145M1635J52372A35180
12676i8212H8361J99990A32330j5172d7091N635H8161A0458K13690r2237K35850
12665C67761j81521G5036J85206a90p1038B15519c08060A05147e7492G9076e279
12653A62387o5113D762K96978r5503g2212j45801A22010J65707a50930C40403
12642b09912i6363j44901c479A17880Q6824P3619A24097J86720a03457C16853
$$ plain form
12631 209407 87934 121719 294470 174253 105132 486108 76241 99111 47292 230811 298078
12620 298078 -77314 -152986 322289 15440 29766 93511 -174636 103062 56004 -28252 199094
12608 -2778 228658 -52769 17958 -182889 -227503 -268720 132205 -121413 -279010 319036 -361064
12596 -32128 112244 -196563 111903 -187036 403052 -148862 106365 155391 -75532 478 -242129
12584 -206190 235775 -166649 136408 342815 -95724 108343 -66526 -117005 -27683 184116
12573 380889 -154566 -147215 -77456 158327 -93563 -432636 359862 80872 -37884 -118413 -9411
12561 -168147 -121603 -378755 203270 -178853 -92225 -55347 139065 61743 167053 -38845
12550 -25930 23387 -145213 -19845 -63160 1319 86985 183529 -150172 142956 -346110 -64213
$$ packed form
12631B09407H7934L3785J72751j20217o9121L80976G6241K2870D7292J83519O7267
12620B98078g7314p5672C22289A5440J4326O3745a74636A03062m7058b8252A99094
12608b778B28658e2769A7958a82889m4614m1217A32205a21413j57597C19036c61064
12596c2128A12244a96563A11903a87036D03052a48862A06365M9026g5532D78b42129
12584b06190B35775a66649A36408K06407i5724A08343f6526n0479b7683A84116
12573C80889a54566P351O9759A58327i3563l39073C59862H0872c7884q0529i411
12561a68147M6544k57152B03270a78853Q6628L6878A39065F1743J05310c8845
12550b5930B3387a45213a9845m3315A319Q5666R6544a50172A42956c46110f4213
$$ plain form
12538 -133911 61608 179721 -52429 127380 -161669 75507 115275 -2536 122543 -157646 331032
12526 -90814 -379637 72341 104465 7922 -66429 99970 -132404 -90077 -227013 -62839 -265816
12515 -265816 -130779 -52425 -117040 2252 -121245 -481707 51638 -64415 60844 31334 -47976
12503 143373 -234522 -74686 -84307 -148583 192228 16510 -62607 -139698 85697 182183 158237
12492 158237 43379 58450 89560 86619 191493 225700 -185187 -113637 -195444 79918 186259
12481 186259 -133673 -33024 62749 56131 130869 73360 -17961 -93179 -96537 -109610 -419900
12470 -419900 -34112 -245294 66808 244489 295663 127215 -208054 -149758 -222686 50408 88277
12459 88277 266443 258593 337968 -141388 148826 -183234 69748 15842 -241951 -58621 155986
$$ packed form
12538a33911F1608J18113e2429A27380a61669G5507L9768b536A22543a57646C31032
12526i0814k88823G2341L2124G922f6429I9970a32404M2327j36936f2839k02977
12515b65816a30779e2425o4615B252a21245l60462E1638f4415F0844k9510d7976
12503A43373b34522g4686r621o4276A92228A6510f2607p7091H5697R6486k3946
12492A58237D3379J5071L1110k941J04874L4207a85187P1550q1807G9918J06341
12481A86259a33673c3024F2749o618P4738n7509a7961p5218l358j3073l10290
12470d19900c4112k11182F6808J77681N1174A27215b08054N8296p2928E0408L7869
12459H8277J78166p850P9375a41388A48826a83234F9748A5842b41951e8621A55986
$$ plain form
12447 -226779 283393 231692 71706 -26040 157124 72424 -45972 -157831 -16855 -253525 -137483
12436 -137483 -128122 -127878 -20951 -64141 5003 6901 62110 91536 41226 57091 123367 304061
12424 304061 -402145 -130108 -72586 -154276 -25027 -232342 69606 139718 57151 87394 -26641
12412 10726 242747 -13183 185648 -114471 -114689 242 288662 46696 -256650 394399 143097
12400 20642 252403 151049 264037 -84475 -177990 19834 76011 43652 264678 -17516 -94999
12389 -94999 -224188 -177322 -291905 151839 -56673 -58542 389660 56864 -86631 61755 19295
12377 -316094 220413 -350030 132670 279142 -195502 48257 25606 -118577 201061 -72997
12366 178024 -245289 155683 -73794 -45214 13895 289150 -145208 -203040 -243563 -1641 -69894
$$ packed form
12447b26779B83393n1701G1706b6040A57124G2424d5972j11859a6855k36670J16042
12436a37483R361K44b0951m3190E003J898N5209K9426D1226J5865O6276J80694
12424C04061d02145a30108N7522q1690b5027k07315F9606P0112E7151L0243b6641
12412A0726K32021a3183A85648a14471k18B42K88420D6696b56650C94399A43097
12400B0642K31761j01354J12988h4475r3515A9834N6177l2359K21026a7516p7483
12389i4999j29189M6866j14583A51839e6673j869C89660E6864h6631F1755A9295
12377c16094B20413c50030A32670J46472a95502D8257k2651a18577B01061g2997
12366A78024b45289A55683g3794K8580A3895K75255a45208n7832m0523a641o8253
$$ plain form
12355 -69894 -84336 -105356 14167 239818 -86739 -125779 -30570 21907 -82920 91434 59439
12344 59439 64482 385208 -3164 306421 159664 -137290 126528 20374 348374 -118755 -40166
12332 -122903 -6914 -265117 14836 -54824 -46883 -64291 -6012 139715 -174622 -329475 56283
12320 -33407 -76177 -203979 -83848 -153125 -24041 398204 -274365 221902 134030 68406 -448907
12308 179645 -341389 149463 196533 38586 -66331 58902 -47093 -127574 -180120 -47988 33011
12296 189203 52866 68246 -82962 -93839 99229 -246467 30426 449108 17199 208967 306542
12285 306542 -21717 -180871 191893 35530 8435 36687 -153232 70096 162160 203297 247679
12274 247679 36276 182167 28050 172393 84185 -287166 218027 -44929 -95772 285581
$$ packed form
12355f9894j4442k1020A4167K25651h6739l9040c0570B1907h2920I1434l1995
12344E9439N043L20726c164C06421j46757a37290A26528B0374L28000a18755d0166
12332a22903f914k58203A4836e4824P941j7408f012A39715a74622j54853E6283
12320c3407m2770j27802h3848o9277b4041C98204b74365B21902q7872o5624d48907
12308A79645c41389A49463M7070C8586f6331E8902d7093q0481n2546d7988C3011
12296A89203E2866J5380h2962j0877I9229b46467C0426M18682A7199J91768R7575
12285C06542b1717j59154A91893C5530H435K8252a53232G0096R2064M1137M4382
12274B47679C6276J45891B8050J44343H4185b87166B18027d4929n0843B85581
$$ plain form
12263 -193763 -44713 -170154 -212088 455966 -121026 138096 -101510 315128 158379 93818
12253 93818 238399 117278 -145530 82511 81425 362864 147123 -18243 166513 -27122 100386
12241 109734 -156112 -226374 50744 -46209 417161 -19172 109371 98412 -194199 90069 1476
12229 224827 278925 38543 -4483 64123 206981 443402 507639 107700 -46121 255930 269620
12218 269620 346552 224177 53298 43657 376671 330088 80773 383771 249667 -247955 312373
12206 187639 -89454 67023 6219 129255 342451 204490 211772 179967 453051 173726 -11494
12194 10560 79309 110141 -88980 172726 242369 18810 316712 -7586 413038 -60127 338493
12182 236990 -173960 247762 137066 188769 -86466 127445 207015 24528 54390 545026
$$ packed form
12263a93763d4713j25441m1934D55966a21026A38096a01510C15128j56749o4561
12253I3818J44581A17278a45530H2511j086K81439A47123a8243A66513b7122A00386
12241A09734a56112p0262E0744d6209D17161a9172A09371j0959a94199I0069A476
12229B24827N4098C8543d483F4123J42858K36421O4237A07700d6121B55930J3690
12218B69620P6932j22375E3298r641L33014m6583H0773L02998j34104b47955C12373
12206A87639h9454F7023F219J23036K13196j37961P282l1805K73084A73726a1494
12194A0560O8749L0832h8980A72726O9643A8810K97902g586D13038f0127C38493
12182B36990a73960B47762j10696N1703h6466A27445P9570B4528K9862M90636
$$ plain form
12172 545026 275328 -154047 154817 -8228 398463 139792 69458 158754 207963 3841 -109604
12160 67068 70731 2735 6708 202364 182747 201275 -98119 116636 62027 574208 -137814
12148 106637 417709 -206001 56869 167857 -131042 76760 219229 58521 128272 50703
12137 12290 90832 -230138 32408 16375 -202840 66696 -50174 51620 -248954 124677 -211727
12125 -137775 137908 28480 4941 148733 210146 89019 -87097 7850 -125803 291242 -245179
12113 18964 -125955 -153315 13647 -210355 92004 485093 -90837 -353319 268896 14734 -310663
12101 36230 75516 -53258 92921 19000 6287 -182 209394 34179 2186 -5728 107665 209183
12089 209183 115902 -128633 29942 138954 -36908 332351 -53310 -235980 279841 -185369
$$ packed form
12172E45026k69698a54047A54817h228C98463A39792F9458Q9296M9209C841a09604
12160F7068L663B735L973J95656j9617J8528i8119A16636n4609N12181a37814
12148A06637L11072b06001E6869J10988a31042G6760J42469E8521O9751E0703
12137A2290P8542b30138C2408j6033b02840F6696e0174E1620b48954A24677b11727
12125a37775A37908B8480D941J43792O1413H9019h7097G850a25803B91242b45179
12113A8964a25955k7360A3647b10355I2004L93089i0837k62482B68896A4734c10663
12101C6230L9286e3258I2921A9000F287a82B09394C4179B186e728A07665J01518
12089B09183r3281a28633B9942J09012c6908C32351e3310j82670B79841a85369
$$ plain form
12078 120543 288831 37872 462515 1018463 653601 223217 -108605 421524 -64189 -153030
12068 -153030 -42515 16555 251058 53736 -29337 -77918 226538 -145561 -16349 49783 -78523
12056 482052 834 -267024 11173 -333788 245229 -352981 -119821 -6195 -27012 -309780 3384
12044 144123 -8978 -162745 -46107 -205529 27710 -141140 -24879 -300596 -85613 -16161 38064
12032 371578 -105634 -277975 -215968 -35650 -91742 4237 27664 -14392 412939 -145546 56265
12020 55840 164256 -146898 -263839 -203969 20606 127761 -47738 -64034 -76157 318195 -254017
12008 208255 213938 -209479 330116 -92910 14672 293159 -216004 -228693 -10061 22153 20378
11997 20378 42160 -221895 -114724 -30605 179735 -297316 48073 6707 -110901 2175 -9946
$$ packed form
12078A20543J68288C7872M24643N55948l64862B23217a08605D21524f4189q8841
12068a53030d2515A6555K34503E3736b9337m8581B26538a45561a6349D9783g8523
12056D82052H34b67024A1173c33788B45229c52981a19821f195k0817k82768C384
12044A44123h978j53767d6107j59422B7710a41140b4879k75717h5613a6161C8064
12032C71578a05634j72341O2007c5650n6092D237K3427a4392D12939a45546E6265
12020E5840J08416a46898j16941N9870B0606J07155d7738j6296j2123C18195b54017
12008B08255N683b09479C30116i2910A4672K78487b16004j2689a0061B2153j775
11997B0378K1782b21895J07171c0605A79735b97316D8073F707a10901B175i946
$$ plain form
11985 -178481 -192949 -237280 -65314 171967 -270501 -124413 -95798 -14447 -110896 -255192 5254
11973 -172149 -69574 12399 -10414 -248836 84515 -161910 -320864 15243 7430 118440 76480
11962 76480 322761 120417 136589 18175 -21514 -118676 21683 -148478 -151589 14641 -83037
11950 -260155 170032 -112570 236895 -13825 17521 124389 186586 -81828 157128 -243965
11939 290318 -22257 -175911 98675 105863 180183 23430 40251 -143169 365646 150734 198999
11928 198999 -216489 -131128 -104262 267271 -324760 94943 191707 293034 -69949 -65636 -374437
11917 -374437 -227574 33803 53909 -81134 121782 110942 313007 -165476 -15933 144568
11906 -28738 197412 -245057 -139509 -30527 -272006 63455 68918 -982 215631 66383 -60858
$$ packed form
11985a78481j4468m4331f5314A71967b70501a24413K8615a4447r6449j44296E254
11973a72149f9574A2399a0414k38422H4515a61910j58954A5243G430J11010m1960
11962G6480K46281A20417J6172A8175b1514r7162B1683a48478l111A4641h3037
11950b60155A70032a12570B36895a3825A7521J06868O2197h1828A57128b43965
11939B90318b2257j53654I8675P188P4320B3430J6821a43169C65646A50734M8265
11928A98999b16489Q5361K6866B67271c24760I4943R6764J01327f9949M313l08801
11917c74437J46863C3803K0106h1134A21782j0840K02065a65476a5933A44568
11906b8738A97412b45057J05548c0527k41479F3455N463i82B15631F6383f0858
$$ plain form
11894 -115678 348379 69 155396 -111005 147583 -39462 -69694 -141916 -42357 -89173 -379872
11883 -379872 -259137 -39700 -169835 -233525 -39570 76622 -36072 -94583 32966 166666 -109082
11871 46673 89126 -73299 -195971 124628 -131102 -137966 -106616 37868 -163718 256057 32636
11859 -10453 21852 163721 -155111 -126674 16760 -129572 -121682 -193756 140135 -99165 -66838
11848 -66838 -174190 72928 -19402 155859 -255227 160459 93167 -36327 -187109 29781 207306
11837 207306 81908 -171562 31665 -30948 -87832 7822 -142838 193090 82168 -129542 125204
11825 199038 -175217 -55621 -362390 239717 42701 79860 -190341 312534 110123 -40552
11814 -43040 -181719 12121 128637 115609 175194 204248 -324441 442043 255583 239349 144746
$$ packed form
11894a15678C48379F9J55327a11005A47583c9462l0232p2222d2357m6816k90699
11883c79872J20735c9700j30135o3690c9570G6622c6072n8511C2966J33700a09082
11871D6673M2453g3299j22672A24628a31102o864L1350C7868a63718B56057C2636
11859a0453B1852J41869a55111K8437A6760a29572P890p2074A40135i9165L2327
11848f6838j07352G2928a9402A55859b55227A60459o7292c6327j50782B9781J77525
11837B07306H1908a71562C1665c0948n6884G822a42838A93090H2168a29542A25204
11825A99038a75217e5621l06769B39717D2701L7159a90341C12534A10123d0552
11814d3040j38679A2121J16516j3028N9585K9054c24441D42043j86460j6234r4603
$$ plain form
11803 144746 129637 -33631 -286497 -242435 114061 -123750 -7411 120779 252717 50374 191703
11792 191703 -142221 28761 317057 -153198 -37190 -72811 32619 -17625 37997 -107999 52427
11780 -144342 44465 134142 -295961 -24492 33211 -3561 -36813 219948 -220173 -232083 57378
11768 123273 -303110 -139312 -118727 -79477 -168774 -20217 -265167 -212080 -59788 506697 -148674
11756 -118328 7726 -91926 -124743 -63358 -250761 -189796 45956 -385066 65658 216399 105969
11744 150487 -38143 123043 -238539 -260919 76886 -14394 284224 190862 40216 29585 -34498
11732 104141 -82389 -66189 12121 51788 -170959 53144 143882 -74577 -100282 317691 -54865
11720 24303 78384 101794 -28947 -397449 382697 59665 -139918 -35253 -51297 19493 25094
$$ packed form
11803A44746j5109c3631k52866M4062A14061a23750g411A20779J31938E0374J41329
11792A91703a42221B8761K88296a53198c7190l5621C2619a7625C7997a07999E2427
11780a44342D4465Q9677b95961b4492C3211c561l3252B19948b20173j1910E7378
11768A23273c03110a39312K0585L9250q9297b0217k44950N3087e9788E06697a48674
11756a18328G726i1926l2817O1385j87403O0965D5956c85066F5658J50741A05969
11744A50487c8143A23043b38539k2380G6886a4394B84224r3362D0216j0631c4498
11732A04141h2389J6200A2121L9667a70959E3144R0738g4577k5705C17691e4865
11720B4303N4081K3410b8947l68502C82697E9665a39918c5253j6044A9493N601
$$ plain form
11709 25094 131486 -24625 63115 -92438 48294 25869 124272 98241 104799 235687 192005
11698 192005 -154256 26736 90333 138825 -48608 -102613 155519 -245438 -230562 222185 -67381
11686 11577 252152 -349661 72109 58632 -363677 -237179 -1963 326924 -201877 194747
11675 158971 85952 -74660 140085 42856 -208237 -203603 -495381 -88685 -199824 3821 8055
11664 8055 -35614 182547 194753 -250710 109247 22855 375553 146340 -202438 -54733 -161717
11653 -161717 -184531 41711 -42212 -129883 384926 -17022 -372365 -267661 66276 107072 -54756
11641 -176977 -56705 -189115 39021 94016 82528 40085 178582 -135681 -100657 -223253 -159920
11630 -159920 137388 471058 -7219 217201 205484 182787 114156 174597 13147 5894 -38433
$$ packed form
11709B5094J06392b4625F3115i2438D8294k2425R8403k6031O558J30888m3682
11698A92005a54256B6736O3597M8492d8608n4005A55519b45438J4876B22185f7381
11686A1577K40575c49661G2109j3477c63677J26498a963C26924b01877A94747
11675A58971p3019g4660A40085D2856b08237M634k91778h8685j11139C821M234
11664H055c5614A82547J2206b50710A09247B2855L52698A46340b02438e4733j06984
11653a61717k2814D1711d2212q7671C84926a7022l55343J04704F6276M0796e4756
11641a76977e6705j32410C9021N4995j1488D0085J38497a35681L5024j22596O3333
11630a59920A37388L33670g219B17201j1717k2697o8631O0441A3147E894c8433
$$ plain form
11618 -96558 54708 435978 226198 12717 -73062 -136604 41170 -24305 -119021 444141 250903
11607 250903 -48632 -78654 190842 71102 341926 -177027 -18384 111437 223288 -15308
11596 202389 -118783 -30724 393181 -179644 277780 -163142 155076 -3484 174609 174933 149160
11585 149160 342976 36010 279178 -181620 94280 -48163 82855 26269 -2505 91011 -34031
11573 -48152 -233631 195395 -43241 55781 -5157 -236268 258089 74558 219925 283059 196275
11562 196275 88515 71267 315111 -60798 217579 95410 65329 331894 1632 212311 -2211
11550 144087 -182415 5143 -15476 182843 -5484 209033 81553 106303 46919 -94763 19389
11538 7474 -13233 -23538 -102 10048 7408 45586 217349 37430 132317 109208 89860 -285620
$$ packed form
11618i6558E4708L81270k09780A2717g3062o3542D1170b4305r4716D44141j93238
11607B50903d8632l0022A90842G1102K70824a77027a8384A11437J11851a5308
11596B02389a18783c0724C93181a79644B77780a63142A55076c484A74609L24k5773
11585A49160J93816C6010K43168a81620I4280d8163H2855B6269b505I1011c4031
11573d8152j85479A95395d3241E5781e157k31111B58089G4558J45367O3134q6784
11562A96275H8515j7248K43844f0798B17579I5410l0081K66565A632K10679b211
11550A44087a82415E143a5476A82843e484B09033H1553K4750D6919i4763A9389
11538G474a3233j0305a02A0048k640L8178J71763C7430R4887k3109j9348b85620
$$ plain form
11525 -155063 -168802 219061 -30750 -53817 253366 118506 -138636 409098 296479 -101474
11514 3860 236495 -330941 50423 172129 250379 -87904 -75682 207781 29109 7578 48271
11503 48271 165597 363043 81550 -215869 -42609 -79995 -24888 21290 119420 68223 -201354
11491 -89171 123764 252552 328164 196177 620941 -122425 280681 242771 264505 59725
11480 -6694 203425 217699 45323 176628 216516 292596 -6732 93176 53888 324937 -6670 249092
11467 -519 58657 289237 14417 103035 9838 350538 -17773 333316 92874 142750 -107729
11455 -28488 22438 -9301 299689 -139274 482683 66657 139315 210774 -276868 -55888 -111450
11444 -111450 93015 -23943 261199 -21044 -159016 14507 -655 87542 190975 219297 189697
$$ packed form
11525a55063j3739B19061c0750k3067B53366A18506a38636D09098j12619a01474
11514C860K32635c30941E0423J21706P8250h7904J2222B07781B9109G578M0693
11503D8271J17326J97446H1550b15869d2609l7386b4888B1290R8130n1197b01354
11491h9171A23764J28788P5612j31987M24764a22425B80681l7910K1734E9725
11480f694B03425J4274D5323J31305L9888P6080f732I3176l9288K71049f670B49092
11467e19E8657K30580A4417Q8618I838L40700a7773C33316I2874M9876a07729
11455b8488B2438i301B99689a39274D82683F6657P2658P1459b76868e5888n5562
11444a11450I3015b3943B61199b1044j37972A4507f55H7542J03433K8322k9600
$$ plain form
11433 189697 51937 244693 -94774 -95028 -70661 53143 -183180 28921 81019 184078 304686
11422 304686 64403 -181513 110763 -205449 -131062 9875 336776 -66165 118478 109907 2349
11410 155937 47381 -63825 291720 49575 -61046 47867 -418673 328913 -218242 39181 -190107
11398 148665 10955 -166620 -94248 -261144 -71767 307206 104417 -42542 -305238 67147
11387 51444 -41539 187063 -138478 -251407 -104410 27720 -175202 -268242 388467 -79272
11376 65278 -32969 -67528 55120 40325 16446 -5251 -17276 -149357 64504 180308 36122
11364 -217986 -119485 -27132 -177484 -260255 -193083 -234041 -236146 -179381 109966 102133 194877
11353 194877 161497 35874 -146741 86393 -190760 -218753 -52594 215132 77452 93181 -67855
$$ packed form
11433A89697E1937J92756i4774k54K4367E3143a83180B8921N2098J03059J20608
11422C04686F4403a81513A10763b05449P4387I875L26901f6165A18478q571B349
11410A55937D7381f3825B91720D9575f1046D7867d18673C28913b18242C9181a90107
11398A48665A0955a66620P2372j66896g1767C07206A04417d2542k62696F7147
11387E1444d1539A87063a38478j12929a04410B7720a75202r3040C88467g9272
11376F5278c2969l4559E5120j4795A6446e251j2025j32081F4504J15804C6122
11364b17986R8501b7132j50352q2771O7172m0958k105N6765A09966p833R2744
11353A94877l3380C5874a46741H6393a90760k7993e2594B15132G7452J5729f7855
$$ plain form
11341 35798 326240 -135377 -194442 73495 80943 -103834 92189 -137546 -198131 -50809 -4367
11329 -102746 154570 208452 -86449 194080 62806 -212793 -339266 182590 -14820 -246959
11319 -246959 -13248 -28503 -5644 102182 86646 -92168 -55247 -158468 -30322 337318 -232924
11307 -195151 -245121 142904 239640 -48886 -10636 111634 168126 -141656 -62466 -80496 -261398
11296 -261398 -29321 77442 -77412 -659 43271 -188035 74149 -164292 322710 -153228 12908
11284 -223079 -193747 -116860 -137543 -240558 -68000 -144788 208839 -136241 103012 18855 -216151
11272 119551 -29612 321704 -52003 -187357 242293 -161212 283911 8823 -46590 -83092 -12978
11260 -331940 157731 -52217 -190008 -193634 13828 288167 135312 -142532 -37812 81620 -44242
$$ packed form
11341C5798K90442a35377n9065G3495P448a03834I2189a37546o0585e0809d367
11329a02746A54570N3882h6449A94080F2806b12793j26473A82590a4820k32139
11319b46959a3248j5255e644A02182j5536i2168L6921j03221c0322C37318b32924
11307a95151m9970A42904R6736d8886a0636A11634N6492a41656f2466j8030j80902
11296b61398b9321G7442g7412f59D3271a88035G4149a64292C22710a53228A2908
11284b23079K9332P6887k0683j03015f8000p6788B08839a36241A03012A8855b16151
11272A19551b9612C21704e2003j35354B42293a61212B83911H823d6590l6502a2978
11260c31940A57731e2217j37791l626A3828K74339A35312a42532c7812H1620d4242
$$ plain form
11248 175432 134348 -90133 -66283 -254414 -113173 -1428 26450 -117559 222624 -233754 166939
11236 -90275 -34712 -15732 -68240 111364 134976 -24078 -105506 149463 -259942 57104 33623
11225 33623 -138002 -209201 -39598 -22296 52933 158495 -29210 -215005 -157672 91249 -38286
11213 56859 -252566 226277 -358392 122162 47626 -87996 56446 -40934 -184042 144257
11202 243617 -89436 -162491 -75619 36739 118972 -85899 -739898 229883 -296854 -143137 -215234
11191 -215234 -301030 -107489 13072 254623 389001 -51926 26573 -204922 232904 -32285
11180 -161862 -183923 -7330 176202 200840 -93345 -275876 277356 -128955 35944 165167 -284405
11168 -30331 154524 183135 70629 283774 69159 71215 360247 233681 -798 -230944 72417
$$ packed form
11248A75432m1084i0133K3850j88131a13173a428B6450a17559B22624b33754A66939
11236i0275c4712a5732n2508A11364K3612b4078q1428A49463b59942E7104k3481
11225C3623a38002p1199c9598J7302E2933J05562b9210j85795N7333I1249c8286
11213E6859b52566B26277c58392A22162D7626h7996E6446d0934j43108A44257
11202B43617h9436p3055g5619C6739Q2233h5899o53999B29883b96854a43137p2097
11191b15234q5796a07489A3072K41551J34378e1926B6573b04922B32904c2285
11180a61862k2061g330A76202K4638i3345j82531B77356a28955C5944J29223b84405
11168c0331A54524K8611G0629K13145F9159K056K89032j26566g98k30146G2417
$$ plain form
11156 -53853 -90983 -12918 -93929 -260718 -295820 -30506 39333 278812 173458 -503773 -120149
11144 180152 -112556 404545 12359 -82324 -62444 -66132 32417 -47136 296755 -57595 354830
11132 -13522 -434851 100526 -60705 311541 89429 207939 84703 -160560 83630 13246 121134
11121 121134 -244684 12980 226056 -54023 139068 -253549 73699 268411 244554 88110
11110 75351 -123712 11635 178223 -37055 1753 152102 236997 -110610 122971 179307 -156392
11098 332952 -12932 167166 298054 75178 301313 62764 220175 138153 202672 -103571
11087 126452 45977 273673 -109244 -47938 -26549 219776 439756 241209 388657 229534
11077 229534 438328 172145 93221 297339 211161 167546 405038 327147 556773 395374
$$ packed form
11156e3853l7130a2918q1011j66789l5102c0506C9333K39479j05354e03773a20149
11144A80152a12556D04545A2359h2324J9880l688C2417d7136B96755e7595C54830
11132a3522m21329A00526f0705C11541H9429J18510H4703a60560H3630A3246J07888
11121A21134b44684A2980K13076e4023A39068b53549G3699J94712k3857H8110
11110G5351a23712A1635J66588c7055A753J50349Q4895a10610A22971N6336a56392
11098C32952a2932A67166J30888G5178K26135F2764J57411q2022O4519a03571
11087A26452D5977K27696a09244d7938K1389B19776K19980j98547J47448j59123
11077B29534K08794A72145p8924K04118q6178m3615K37492p7891K29626j61399
$$ plain form
11067 395374 247486 198339 391083 697133 506585 299898 414852 379239 123984 43499
11056 483303 507800 725288 484389 400794 399803 574142 699152 660648 830648 504199 1132020
11045 1132020 576451 507264 746150 382162 635537 535708 422745 782859 464446 548272
11035 548272 369725 692476 461599 547721 496510 604355 635273 679272 542869 375162
11025 375162 792576 701172 528320 600986 610435 450199 447048 572398 476487 714701 409405
11014 409405 506312 419619 336145 502370 374861 565403 599270 269751 377935 585979
11004 585979 490512 822325 587434 110258 784314 1031271 193097 664107 376283 625709
10994 625709 805293 834114 883699 599469 705499 821453 860840 764967 568730 965889
$$ packed form
11067C95374j47888m9147J92744L06050j90548k06687J14954l5613A23984D3499
11056D83303K4497K17488k40899q3595r91J74339J25010l8504J70000l26449O27821
11045A132020n55569o9187K38886l63988K53375r9829j12963L60114l18413Q3826
11035E48272j78547L22751k30877Q6122n1211J07845L0918M3999j36403j67707
11025C75162M17414r1404j72852P2666R449j60236l151J25350r5911K38214l05296
11014D09405R6907q6693q3474J66225j27509J90542L3867B69751J08184K08044
11004E85979r5467L31813k34891A10258O74056K46957A93097M71010k87824K49426
10994F25709J79584K8821M9585k84230J06030J15954L9387r5873j96237L97159
$$ plain form
10984 965889 978762 830659 1022300 629585 1041166 1046079 1246901 1403927 1666015 1939097
10974 1939097 2088401 2367687 2353855 2168169 2275501 2167643 1856018 1836970 1573331 1225575
10964 1225575 1489403 1335671 1307808 1354452 1325052 1317116 1353354 1413174 1500987 1248183 1230509
10953 1230509 815710 694578 633273 564218 254642 313617 296100 509790 167308 398880
10943 398880 108928 255643 133125 271194 275332 236092 28172 80988 118223 232261 108430
10931 -52803 104716 -173556 33058 76594 -52822 -274283 27665 -12176 -200079 -372305 142880
10919 48920 63115 -28355 -196708 173347 -193067 -9364 12698 -36795 -373490 57293 110622
10908 110622 -266792 -5782 1563 -63032 60884 223548 100628 -6967 -249373 6661 168940
$$ packed form
10984I65889J2873j48103J91641l92715M11581M913K00822J57026K62088K73082
10974A939097J49304K79286j3832j85686J07332j07858l11625j9048k63639l47756
10964A225575K63828j53732k7863M6644k9400p936L6238N9820Q7813k52804j7674
10953A230509m14799j21132o1305o9055B54642N8975j7517K13690A67308K31572
10943C98880A08928J46715j22518J38069M138l9240B8172N2816L7235J14038A08430
10931e2803A04716a73556C3058M3536e2822k21461B7665a2176j87903j72226A42880
10919D8920J4195b8355j68353A73347a93067i364A2698c6795l36695E7293N3329
10908A10622b66792e782A563f3032F0884J62664A00628f967k42406F661J62279
$$ plain form
10897 168940 -9443 69431 -52668 -61245 3118 -141117 -10141 159283 70959 15947 197364
10886 197364 40896 -22327 -33100 -74555 214972 105841 69126 -60800 -202005 58075 96876
10875 96876 162029 4221 -166789 -132668 -88421 -187776 308108 -47256 251574 -73526 6470
10863 -144587 -149639 120572 169093 -89675 205323 215995 198573 118691 145605 -99797 137893
10851 175420 16271 -77188 341690 -284972 -157991 -199820 -6323 -173541 345544 1199 142171
10840 142171 -26221 35553 36479 -377355 -184407 -154073 46238 109701 -8594 -54814 -179718
10829 -179718 -180518 -133964 -163963 10505 177763 161575 -120359 11684 284101 -149505 -176493
10818 -176493 54662 261614 74285 -405882 -256438 34163 51238 69469 -126038 137078
$$ packed form
10897A68940i443F9431e2668q577C118a41117a0141A59283G0959A5947J81417
10886A97364D0896b2327j0773m1455B14972A05841l6715f0800j41205E8075L8801
10875I6876O5153D221a66789L4121M4247r9355C08108d7256B51574g3526F470
10863a44587n052A20572M8521h9675B05323J0672j7422p9882K6914i9797A37893
10851A75420A6271g7188C41690b84972J26981m1829f323j67218C45544A199J40972
10840A42171b6221C5553R26c77355a84407L0334D6238O3463h594m6220j24904
10829a79718q00M6554k9999A0505J67258j6188a20359A1684K72417a49505k6988
10818a76493E4662K06952G4285d05882J49444C4163J7075J8231a26038A37078
$$ plain form
10807 -291677 -131983 -414132 -201086 257038 6385 -6793 -107298 -120653 -51752 183497 124052
10796 124052 -35455 14154 -147632 -178959 206829 93832 -288647 -282460 -7408 -55068 407197
10784 -6593 -200084 -136359 -148060 -183725 -37589 -129114 -108429 161875 -15293 263123 -2551
10772 -171273 256337 -280682 -99836 112943 219954 -6788 77973 34746 -394617 270106
10761 -338291 116868 -296286 256999 169030 -286878 110177 71915 -184438 146781 120969
10751 120969 -78147 -73533 -303851 80702 257392 -115331 123505 8936 -266417 40659 266786
10740 266786 -104312 19267 209113 -64752 105258 7681 -179453 -233364 61619 129232 220454
10729 220454 98815 -129521 86532 31053 -334609 188228 206550 55376 3478 21179 -113192
$$ packed form
10807b91677a31983k82149b01086B57038F385f793j00505j3355e1752A83497n9445
10796A24052c5455A4154a47632l1327B06829I3832b88647O187g408m7660D07197
10784f593j93491O3725j1701l5665c7589r1525K0685A61875a5293B63123b551
10772a71273B56337b80682i9836A12943J07011f788G7973C4746c94617B70106
10761c38291A16868b96286B56999q7969b86878A10177l8262a84438A46781k5812
10751A20969g8147M614k30318H0702J76690a15331A23505H936b66417D0659K26127
10740B66786a04312A9267J89846f4752A05258G681a79453n3911F1619O7613R1222
10729B20454I8815a29521H6532C1053c34609A88228J8322E5376C478J7701a13192
$$ plain form
10717 214368 288629 -377047 51510 -9570 -82808 769 -36492 111483 -458024 321864 -210206
10705 -66025 -8996 478417 -5049 162567 -262939 29335 150218 50444 -140527 -211207 167115
10693 148681 7380 16734 -259952 15951 253774 -198559 -348245 -61474 15436 -2751 -105881
10682 -105881 16383 -50840 -129583 128341 137708 187997 223821 349140 141348 -27115 -330090
10671 -330090 -250363 -120649 128838 81333 62529 -53414 209131 -80051 15741 -260785 11219
10659 106833 1101 5489 -60659 101861 377676 235856 -138713 -79576 -37969 -72017 31214
10647 -179602 -96999 -395064 67090 -160862 -19241 -56243 -27820 -298336 128105 12450 -128997
10635 82264 -62171 47421 83276 -11790 -33523 -331167 42679 99627 -144443 -115854 -35691
$$ packed form
10717B14368P4261c77047E1510i570p3238G69c6492A11483d58024C21864b10206
10705f6025h996D78417e049A62567b62939B9335J20883E0444a40527p0680A67115
10693A48681G380R354b59952A5951K37823a98559j49686f1474A5436b751j03130
10682a05881A6383e0840p8743A28341R367N0289L5824J25319A41348b7115l02975
10671c30090P9727a20649A28838m7505j8804e3414B09131h0051A5741b60785A1219
10659A06833A101M388f0659A01861K75815j41820a38713N9137c7969l4048C1214
10647a79602Q2603k98065F7090a60862a9241l7002b7820k70516A28105A2450a28997
10635H2264f2171D7421L5855a1790k1733k97644D2679N6948a44443K8589c5691
$$ plain form
10623 -5663 -43068 24767 84641 -58151 62867 -255847 182292 53664 -87229 8473 104975 -141087
10610 -458077 -204119 288103 37340 67695 -263685 -237953 -69350 -219792 -121411 -348773
10600 -348773 -147855 -227976 -132492 344504 65870 173606 -19804 155971 31153 110552 141423
10589 141423 -155849 -37615 -226122 -234222 -24895 -170130 -38749 -168079 174964 -354343
10578 29202 -113364 94890 -283807 -201661 -301123 8159 -213034 -117278 -243865 58885 2846
10566 -76242 180571 6432 -198848 62677 97826 -4455 -209805 5887 -231705 -128553 -4345
10554 -206508 -60253 -92645 -49214 47889 84688 100396 -28680 21416 -73839 181749 -128305
10542 119173 -92545 -123165 -42661 -12133 -56372 236556 231468 -76766 -154878 -163615 -23501 278768
$$ packed form
10623e663l7405B4767N9874e8151F2867b55847A82292E3664h7229H473R6502a41087
10610d58077b04119B88103C7340L0355b63685K5732f9350j50442R8381k27362
10600c48773a47855q0121R5484C44504F5870J07736a9804A55971C1153P9399L0871
10589A41423a55849c7615j88507q100b4895j45235c8749j29330A74964c54343
10578B9202a13364I4890b83807Q2146r9462H159b13034R5756j26587E8885B846
10566g6242A80571F432a98848F2677L5149d455k05350E887b31705J03152d345
10554b06508f0253l2392M3431D7889L6799J5708b8680B1416g3839A81749a28305
10542A19173i2545l0620d2661a2133m4239B36556n088g6766p8112q737b3501B78768
$$ plain form
10529 -184116 9339 91036 175007 -103922 87593 223614 -124477 -212494 174379 -215954 -137194
10518 -137194 148376 200880 -47196 98491 280111 -253595 66775 115086 -65291 41659 -135875
10506 186737 179751 199236 -150122 -138694 -148829 -7537 -37426 -179062 252122 -427757 -64446
10494 115080 -154799 -183972 141095 -125444 -102820 -90242 181300 142081 -254076 130446
10483 444170 29270 382175 384682 293031 -145283 206473 66495 71016 128829 69554 43482
10472 43482 -111695 -3847 -37226 25647 106278 51629 54281 -45974 222619 284883 -76914 -15701
10459 -28607 120126 194308 116046 -94720 -73101 25838 -202116 -196298 -26578 -159709 -4696
10447 -235508 -11346 148582 -302650 -139773 -132681 14543 173372 -30665 127529 -123717
$$ packed form
10529a84116I339Q1697Q3971a03922H7593J36021a24477q8017A74379b15954P8760
10518a37194A48376N2504d7196I8491J81620b53595F6775M8311f5291D1659a35875
10506A86737o986J9485a50122J1428j0135g537k9889j41636B52122d27757f4446
10494A15080a54799k9173A41095a25444K2624J2578A81300l9219b54076A30446
10483D44170B9270L52905K507r1651a45283B06473F6495M521N7813n9275k6072
10472D3482a11695c847l3379B5647Q0631E1629K652d5974B22619O2264g6914a5701
10459b8607A20126P4182p8262i4720K1619B5838b02116N818b6578j33131d696
10447b35508a1346A48582c02650a39773P092A4543J58829c0665A27529a23717
$$ plain form
10436 -247645 65367 99013 46668 -274358 -244736 -99138 -14519 48943 -130083 -121510 -13134
10424 39554 -86851 105594 -109349 66730 -89034 81493 137561 -260917 -14690 -79954 -21623
10412 -212426 24269 193064 113182 -196395 -51739 -153503 150703 -186950 -177499 -196273 -165590
10401 -165590 -329512 23728 225665 -234013 179546 66058 266004 -79624 333481 102834
10390 145113 1685 5521 35738 345932 217689 -115305 -242466 30891 8513 193360 99865
10379 99865 -144488 303183 106298 159307 106745 96921 299577 375363 247186 166833 292865
10368 292865 472531 377334 371579 224130 53629 80159 -27303 98922 112983 236152 166395
10357 166395 306184 137624 187770 139709 285217 428232 196306 603994 301350 445784
$$ packed form
10436b47645F5367L3646D6668b74358K9622i9138a4519D8943a30083Q573a3134
10424C9554h6851A05594a09349F6730h9034H1493N6068b60917a4690o5264b1623
10412b12426B4269J68795p9882a96395e1739j01764A50703a86950R451j8774L0683
10401a65590j63922B3728K01937b34013A79546F6058J99946g9624C33481A02834
10390A45113A685L836L0217L10194j28243a15305j27161C0891H513J84847r3495
10379I9865a44488C03183A06298N3009n2562r824K02656P5786j28177q0353J26032
10368B92865J79666r5197n755j47449E3629K6530b7303I8922J4061J23169o9757
10357A66395J39789A37624N0146m8061J45508J43015A96306M07688C01350J44434
$$ plain form
10347 445784 279994 319917 310852 342270 555027 352137 -105145 3150 -202311 225861 93034
10335 136979 129574 126184 -34718 -341930 -111633 42548 -260405 378753 216675 -34342 188844
10323 162048 -67798 347546 362880 200105 39680 30250 22244 -288984 -100845 42764 121503
10312 121503 -175989 -53005 -78884 -266746 -126536 156876 -35792 -162224 1806 179408
10302 179408 45788 216347 -105780 103008 -165765 59520 100774 -50612 603628 -81177
10291 -233259 -77493 -174513 -18458 9298 -254897 194989 144725 165855 64374 -173766 -244646
10280 -244646 -185020 2434 -208732 -45521 -63660 82595 343236 11274 32067 -358132 163567
10268 107356 80026 60509 321272 86048 -73474 13545 520497 241829 307957 210787 118853
$$ packed form
10347D45784j65790L9923r065L1418K12757k02890a05145C150b02311B25861I3034
10335A36979p405l390c4718l07212a11633D2548b60405C78753j62078c4342A88844
10323A62048f7798C47546J5334j62775C9680r430q006b88984a00845D2764P8739
10312A21503a75989e3005k5879j87862a26536A56876c5792j26432A806J77602
10302A79408D5788J70559a05780A03008a65765E9520M1254e0612F03628h1177
10291b33259g7493r7020a8458I298b54897A94989n0264K1130F4374a73766p0880
10280b44646N9626B434b08732d5521j8139H2595K60641A1274K0793c58132A63567
10268A07356k7330j9517K60763H6048g3474A3545N06952B41829O6128r7170r1934
$$ plain form
10257 118853 30685 357596 389792 -6856 7935 -287600 -54929 173133 183946 -1639 159124
10245 -161128 -405255 59827 81746 252043 -162033 113363 -81762 -30368 -147762 -146465 250730
10233 158919 790 -224995 -467030 -79777 -174973 -3106 -46327 -54613 242382 -185344 296290
10221 -139621 -195118 -39085 63811 123662 -246176 -142368 -228573 -38880 -167611 -259777 78154
10209 -114582 -93267 108527 -254841 50694 -96080 -544564 -145720 64311 267172 71128
10198 150646 -127526 -131710 23819 10754 46399 -36027 98128 -11647 -313241 -50237 167319
10186 -168662 -145670 -241849 -171966 -19474 1395 258960 172065 150761 65300 22515 66736
10175 66736 -58034 -19948 -9082 184632 -21775 -6027 -98719 65818 -152065 43544 175328
$$ packed form
10257A18853C0685L26911L2196f856G935b87600e4929A73133J0813a639A59124
10245a61128k44127E9827K1919J70297a62033A13363h1762c0368j17394J297B50730
10233A58919G90b24995k42035g9777r5196c106m3221q286B42382a85344B96290
10221a39621n5497c9085F3811N9851b46176J03808q6205c8880j28731r2166G8154
10209a14582K1315A08527b54841E0694i6080m48484a45720F4311K02861G1128
10198A50646a27526m184B3819A0754L5645c6027I8128a1647l01594e0237A67319
10186a68662K2992r6179O9883a9474A395K57565q6895k1304F5300B2515M4221
10175F6736e8034a9948i082A84632b1775f027r2692F5818a52065D3544J31784
$$ plain form
10164 175328 -546583 -186752 -47213 -6024 -80896 29948 -172692 188025 -261518 -101676
10153 115027 -232345 -32632 -78093 -329335 -6393 338437 -23527 -105743 -114051 92631 32020
10141 -9804 14577 -118978 144982 -226816 -48892 75322 -224412 -167257 -301359 -173032 -167167
10130 -167167 243497 60914 -187385 -41587 -123371 -10008 47840 -162286 -257222 133471 205183
10119 205183 105015 -152184 -324165 96537 56145 150388 58175 -33263 -80778 -53661 138432
10107 106262 -184760 -163736 137070 -7544 -317211 3972 -315900 -91420 -289872 11978 100805
10096 100805 151745 335690 -150743 -122111 -189273 247145 -186940 242684 -66907 -176474
10086 -176474 89099 34162 -13941 -29872 -207888 101180 -10878 214488 -210361 -235129 -134416
$$ packed form
10164A75328e46583a86752d7213f024p4872B9948a72692A88025b61518a01676
10153A15027b32345c2632m5461k51242f393C38437b3527q2216q308I2631C2020
10141i804A4577a18978A44982b26816d8892G5322b24412N7155j34102J28327N865
10130a67167B43497F0914a87385d1587q1784a0008D7840a62286r4936A33471P1712
10119B05183j00168a52184j71981I6537m0392R4243E8175c3263m7515K7117A38432
10107A06262a84760K1024A37070g544l09667C972c15900i1420j98452A1978Q8827
10096A00805N0940J83945a50743K8632o7162B47145a86940B42684f6907j09567
10086a76474H9099C4162a3941j5931j78016A01180a0878B14488b10361k4768J00713
$$ plain form
10075 -134416 133196 44550 -3675 -364717 -66997 -11471 -225405 103627 2074 -6513 -34900
10064 -34900 -265089 238056 27310 151273 160929 -263744 -7773 -280201 13200 -130668 -200595
10053 -200595 249558 -268985 -212585 -135125 -113160 -265369 59264 128595 -68653 80204 -205314
10041 -126273 90453 164287 -81595 5971 -271282 -75172 -73235 -259464 -94443 -2021 84999 64565
10029 64565 35854 -71996 -340591 -356027 -66754 -128256 -62701 60359 -81222 -187407 -252464
10018 -252464 -254686 86471 85705 88463 -171872 -158752 -151735 -471873 -43228 -362076 -243163 -222227
10006 -222227 -70808 -272634 -59582 -159258 44866 199830 157748 -200433 -58041 -214401 229110
9994 -166934 -94946 -275656 107747 -250140 78592 -152193 -344593 -171919 -364404 50069
$$ packed form
10075a34416A33196D4550c675l61042f6997a1471k13934A03627B074f513k8387
10064c4900k30189B38056B7310J23963R656b63744g773k72428A3200a30668o9927
10053b00595B49558b68985N6400P7460K1965j52209E9264O9331f8653H0204b05314
10041a26273I0453P3834h1595E971b71282g5172J937j86229i4443b021H4999k0434
10029F4565k8711g1996k68595j5436f6754o1502f2701F0359h1222j06185o5057
10018b52464k222H6471p66K758a71872J3120P017l20138d3228l18848J18913K0936
10006b22227g0808k01826e9582r9676D4866J54964m2082b00433e8041j56360B29110
9994a66934P1988j80710A07747b50140G8592a52193j92400a71919j92485E0069
$$ plain form
9983 15763 165571 94393 35811 66634 -80891 53098 -25216 65016 -34676 -236272 -473106
9972 -473106 -28919 104862 364600 -9432 30988 -16121 -293439 -11164 -561614 61699 -480165
9960 73283 142138 -57314 175233 -128421 -267864 268785 61256 222875 8029 -71581 -218377
9949 -218377 -109641 70209 -320297 9743 -84862 125281 -367491 159037 -85503 -72986 -464994
9938 -464994 317238 -108252 55247 -12285 -504336 -223278 183799 -4237 318073 135763
9927 -302851 -29889 28705 -115696 37026 251286 38730 -130666 -174598 211292 -32147 -151952
9916 -151952 33704 -93081 -244963 -206584 -41072 -11867 -67631 244633 -86730 199112 20560
9904 124380 -195452 -86126 61491 389 -187064 313061 -310485 210435 -69426 283612 -140876
$$ packed form
9983A5763J49808p1178C5811L0823h0891E3098b5216F5016c4676k01596k36834
9972d73106b8919A04862K59738i432C0988a6121k77318a1164n50450F1699d80165
9960G3283O8855e7314A75233a28421j39443B68785F1256J61619H029g1581j46796
9949b18377J08736G0209c20297I743h4862A25281c67491A59037h5503J2517l92008
9938d64994C17238a08252E5247a2285m92051b23278A83799d237C18073A35763
9927c02851b9889B8705a15696C7026K14260C8730a30666m3932B11292c2147j19805
9916a51952C3704i3081j51882L8379d1072a1867n5764B44633h6730A99112B0560
9904A24380a95452h6126F1491C89a87064C13061c10485B10435f9426B83612a40876
$$ plain form
9892 76588 -158706 -78075 -15671 -359830 250324 -3499 -172622 -6426 229503 -315857 -81681
9880 27489 -101627 -62711 31872 -155686 -87605 49656 -190363 -185816 -442206 24309 -189750
9868 -110657 -132023 -76147 -105098 -163185 -29231 184876 -184645 -47609 -129856 -179090 -128779
9857 -128779 -44831 50607 -78311 -339791 177281 454370 53808 -62747 236697 -52132 -77704
9846 -77704 -99770 -116023 -13474 -91449 178437 -89500 -310359 175651 -49404 -78988 -102991
9835 -102991 -36784 -121633 17483 -253833 142430 -86264 120081 27789 -141344 123138 -342920
9823 -214313 -335378 73262 -22446 -243314 46849 -106893 -211039 56546 195927 -308692
9812 218838 -139872 -72972 -85615 1553 -387168 135897 -173799 196438 418936 97061 16286
$$ packed form
9892G6588a58706g8075a5671l44159B50324c499j69123f426B29503c15857h1681
9880B7489a01627L8916C1872a55686O8081D9656a90363M547k56390B4309a89750
9868a10657k1366N5876k8951n8087b9231A84876a84645d7609q2247m9234N0311
9857a28779d4831E0607g8311k61480A77281K77089E3808f2747B36697e2132k5572
9846g7704k2066j6253a3474p7975A78437h9500k20859A75651d9404k9584k4003
9835a02991c6784q4849A7483b53833A42430h6264A20081B7789a41344A23138c42920
9823b14313j21065G3262b2446k20868D6849a06893j04146E6546J39381c08692
9812B18838a39872O6900j2643A553c87168A35897a73799A96438K22498I7061A6286
$$ plain form
9800 39616 -42275 119514 -260374 118828 -24187 -118069 -418897 47904 -97575 -59726 -314380
9789 -314380 18620 -128671 -89131 -93092 51681 -185121 -86737 -306487 -90939 -27432 -62864
9778 -62864 -151198 -154480 183597 -69483 -127286 -121882 -122665 -394851 -374829 -58221 87442 137047
9766 137047 14959 -182612 -231344 -16614 24255 95062 226563 -210924 -235324 50757 -75000
9754 -41192 -73762 -38574 -104104 -299927 -14912 -195189 117198 391336 -233076 -165136 61989
9742 39260 7647 57215 -9977 -295021 -240832 -200720 -77191 -26948 -49121 37413 193757 -133673
9729 210606 -313722 -95559 -170595 -370123 142784 42256 80857 -162798 182140 101045 -123898
9717 -142934 -106261 51441 -166577 -6811 49120 37217 -236772 -371022 -37820 -182717 -98418
$$ packed form
9800C9616d2275A19514b60374A18828b4187r3882l00828D7904i7575L7849k54654
9789c14380A8620a28671L9540l961E1681a85121h6737k19750i0939b7432l5432
9778f2864q8334l282A83597f9483n7803N404p83k72186K0022e8221H7442M9605
9766A37047A4959a82612m8732a6614B4255P0807J31501b10924k4400E0757g5000
9754d1192l2570L5188o5530j95823a4912j80277A17198K74138b33076O7940F1989
9742C9260G647M9568i977k85044N4189M0112g7191b6948k2173C7413J56344a33673
9729B10606c13722i5559p5036j99528A42784D2256L8601a62798A82140q1095a23898
9717a42934L6673E1441a66577f811D9120j1903b36772j34250c7820j44897Q4299
$$ plain form
9706 -98418 97387 -173736 -162287 83535 -120549 5738 140045 -144709 26021 -127524 -212335
9695 -212335 -107985 -14273 -103391 -354243 2826 -25260 -138971 -255806 -227867 -43216 -209406
9684 -209406 198281 -49463 -285953 -6829 -191436 154709 -145194 -39817 93675 58126 -269810
9672 -25122 -62343 -89852 -122958 -129668 -255137 -149684 -414252 -6974 8680 -113445 -158798 -194600
9660 -194600 -28900 -120206 -16982 106816 62030 8324 111727 -129471 162265 1725 268023
9649 268023 102312 90650 179613 13505 -226996 -491479 -13329 -261288 226309 -103930
9638 -126049 190808 -40323 6121 -246221 101850 117074 29361 289659 115480 258482 -22496
9626 -163385 -242346 -571808 -446173 125999 133053 18242 -359333 113865 -4123 280016 -224997
$$ packed form
9706i8418I7387a73736J1449H3535a20549E738J34307a44709B6021a27524q4811
9695b12335J04350a4273q9118k50852B826b5260j13711j16835K7939d3216j66190
9684b09406A98281d9463k36490f829j84607A54709a45194c9817I3675l5549b69810
9672b5122l7221k7509l3106o710j25469J05453k64568f974H680a13445m5353l5802
9660a94600b8900r1306a6982A06816m4786H324J03403a29471A62265A725K66298
9649B68023A02312j1662Q8963A3505b26996k64483a3329k47959B26309a03930
9638a26049A90808d0323F121b46221A01850J5224B9361K60298A15480J43002b2496
9626a63385p8961l29462J25635A25999P054A8242c59333A13865d123B80016b24997
$$ plain form
9614 22292 -155201 -249825 112039 135284 -355652 182857 -219820 -398771 -75651 33460 -13582
9602 142849 -445754 -213015 153312 -251580 -55783 26555 66312 207569 82215 -101723
9591 179017 -35226 -47615 -77899 122060 -136823 40781 135497 242784 221558 -68985 -83547
9580 -83547 -166988 -273313 -50563 163528 -96944 198070 -211436 34694 70547 38749 -295046
9568 -160518 -110532 -236921 8808 -652997 -146858 66813 -208258 74942 96958 -177598 -52370
9556 274379 288967 -67879 -61583 -100463 -104938 -99669 -76562 -136885 17577 -60886 -3467 -100022
9544 -100022 -56754 -136353 23161 -164518 4084 102221 -250100 -37238 -123815 -177382 -155118
9533 -155118 -4342 -184833 -22621 241880 -295667 14729 -135548 -6735 57246 -141623 -32949
$$ packed form
9614B2292a55201r4624A12039K3245c55652A82857b19820j78951g5651C3460a3582
9602A42849d45754b13015A53312b51580e5783B6555L9757J41257H2215a01723
9591A79017c5226j2389l0284A22060a36823D0781R4716J07287k1226f8985j4562
9580h3547q3441j06325e0563A63528i6944A98070b11436C4694L5853l1798b95046
9568a60518M9986j26389H808f52997a46858F6813b08258G4942K2016a77598e2370
9556B74379J4588f7879O296l8880m475N269K3107o0323A7577f0886c467r6555
9544a00022M3268p9599B3161a64518D084R8137b50100c7238q6577n3567K2264
9533a55118d342j80491b2621B41880b95667A4729a35548f735E7246a41623c2949
$$ plain form
9521 19327 67077 -312370 -128303 -151666 -102335 18807 -240426 -476971 162322 175817 -54536
9509 -1164 -42770 -9057 152499 -125659 -96218 -103101 -260790 -151867 -96602 16681 -3034 -261200
9497 -261200 -51712 -17730 -98065 174031 51706 51460 108841 -277537 -272344 100954 -216027
9485 212652 103810 -107016 -307913 -87206 152305 -111695 -33009 -484855 -335747 105514
9474 265510 155964 246079 141923 -183544 -18712 161667 21485 -38008 -53413 -139059 -324676
9463 -324676 142055 -17303 120063 -34286 -148760 295203 110864 -107084 225300 -209367
9452 -3197 -359680 -79014 -188189 -131081 84678 -467597 120762 72125 67274 169794 202332
9441 202332 34275 -419106 -36808 286078 -359807 30312 -278076 -57897 -137426 103903 99270
$$ packed form
9521A9327M7750c12370a28303k3363M9331A8807b40426k36545A62322J3495e4536
9509a164m1606i057A52499a25659K9441o883j57689J08923N5265A6681c034k58166
9497b61200e1712a7730q0335A74031E1706k46N7381b77537N193A00954b16027
9485B12652A03810a07016k00897h7206A52305a11695c3009m51846J49108A05514
9474B65510j09546R0115j04156a83544a8712A61667B1485c8008j5405q5646j85617
9463c24676A42055a7303A20063c4286j14474B95203A10864a07084B25300b09367
9452c197l56483g9014j09175N7108H4678d67597A20762m8637m851J02520L2538
9441B02332C4275d19106c6808B86078c59807C0312b78076e7897p9529A03903m633
$$ plain form
9430 99270 73908 21272 169786 -384344 -247182 -104536 -199192 24938 -180062 -208934 -14149
9418 -225161 -241905 183740 41963 75498 -5563 -107303 -46980 -185213 -26926 -7828 -71437
9407 -71437 138650 108211 -28106 -244948 205240 115143 119530 15291 -48670 -153679 182375
9395 -364958 34125 -315531 370537 226038 -194431 -242211 91639 66817 -80155 -166433 -15346
9383 331228 -123988 61431 -323923 -257957 365994 -130064 127110 153957 -214838 -138255
9373 -138255 54511 -281112 152624 170655 -223777 -26376 -225809 240436 -107293 46409
9362 83543 -376958 290350 280653 -125641 81689 -316213 15599 -178879 -337012 -301889 -78142
9350 -282379 -174720 106919 -56254 -43141 134040 -257139 -11012 -23493 166963 -6831 138128
$$ packed form
9430I9270k5362B1272J48514c84344J37162a04536r4656B4938a80062k8872a4149
9418b25161j6744A83740D1963L3535e563j01740d6980j38233b6926g828o3609
9407g1437A38650l0439b8106k16842B05240r0097M387A5291d8670j05009A82375
9395c64958C4125c15531C70537j44499a94431m7780I1639k4822h0155q6278a5346
9383C31228a23988F1431c23923O5966C65994a30064A27110K6847b14838P6583
9373a38255E4511b81112A52624J8031b23777b6376j99433B40436a07293D6409
9362H3543c76958B90350r697a25641H1689c16213A5599a78879j58133L5123g8142
9350b82379J07659A06919e6254J3113A34040b57139a1012j2481A66963f831A38128
$$ plain form
9338 152188 198126 162099 201490 -9317 -144819 -197701 -332961 110483 -508252 101857 164669
9327 164669 -173462 -33299 -175672 -177987 -37407 -116840 147225 -118929 -91754 -115414 -8096
9315 -31627 -34667 324312 -590 -306464 64713 -114883 4615 -135616 -75658 -360928 102135
9303 -311404 -413943 41201 172959 -126142 -12424 -1733 -117494 -160093 126172 269 -70211
9291 118243 -164898 -386207 -4740 -124216 -237437 -145362 -241754 28944 -197957 55920 -30078
9279 -142244 -28671 -402405 46840 -25268 -42163 -299478 -37240 -271268 -174018 376993 23757
9267 -11535 114928 -199687 306650 -86206 -54181 -111057 -250479 36902 -48138 -313457 240495
9255 -286188 168427 -368447 155982 -170957 -78229 -198854 60175 -393389 -248885 -135229
$$ packed form
9338A52188M5938l6027L9391i317j35502n2882j35260A10483e08252A01857O2812
9327A64669a73462c3299j42373k315c7407p9433A47225a18929K7175k3660h096
9315c1627l040C24312e90l05874F4713a14883D615a35616N9958k85270A02135
9303c11404j02539D1201J31758a26142a2424a733j15761m2599A26172B69g0211
9291A18243a64898k21309d740j19476j13221R2075r6392B8944a97957E5920c0078
9279a42244b8671l73734D6840b5268j6895k57315c7240k34028R7250C76993B3757
9267a1535A14928a99687C06650h6206L2025n6876j39422C6902d8138k65319B40495
9255b86188A68427c68447A55982a70957g8229j20625F0175c93389J44504J13656
$$ plain form
9245 -135229 268862 42882 232049 -218901 36965 -62693 -43156 -325362 41467 -45609 -93582
9234 -93582 -81349 -70827 275319 44527 279774 53401 -136292 -415499 132878 4721 184651
9223 184651 -17573 -81796 111354 -52088 -20469 -136225 -208492 32032 -215545 -109796 -151409
9212 -151409 -59508 -55062 201150 -16969 114196 -134541 -92028 26778 -12597 27655 172992
9201 172992 -283329 79189 -74081 20921 202023 -194224 -111356 -56758 370870 -286494 118338
9189 -81052 -159359 -99593 -53981 -321557 12760 -221376 -19217 270795 122476 -14647 -141115
9178 -141115 -141443 -61165 24614 65141 107358 -95392 -69423 -122055 81769 -272966 131006 163030
9166 163030 11695 -260390 195230 45606 -1803 80123 178273 -22293 -135716 -45729 54867
$$ packed form
9245a35229B68862D2882J89167b18901C6965f2693J9537k82206D1467d5609m7973
9234i3582J2233J0522B75319D4527K35247E3401a36292k79207A32878D721J79930
9223A84651a7573o4223A11354e2088b0469j15756p2267C2032b15545J05749m1613
9212a51409e9508M446B01150a6969A14196a34541M2513B6778a2597B7655J45337
9201A72992b83329G9189g4081B0921J81102a94224Q2868N4598C70870b86494A18338
9189h1052p8307N9766M5612k67576A2760b21376a9217B70795A22476a4647j26468
9178a41115l28f1165B4614M0527M2217i5392K5969n2632H1769b72966A31006L2024
9166A63030A1695b60390A95230D5606a803H0123R8150b2293j13423d5729E4867
$$ plain form
9154 -26273 -53257 -246605 -40029 144378 75460 44582 136736 -54980 -401506 -88409 -79830
9143 -79830 127640 -249325 57182 -3079 -332055 -277066 64029 -130144 92315 -196826 -265809
9132 -265809 -555562 -87149 -176254 -63438 47914 254351 -58891 -165671 52403 194610 237849
9121 237849 -244085 341188 -17098 18529 -112986 -197040 -195934 188990 -139972 179518 -433976
9109 -101882 256454 17956 -176513 -323956 -185468 -194282 131450 46835 -117423 -324075
9099 -324075 -72263 -88695 -229588 -504888 -140616 -68850 -69636 267928 -228169 -231672 185003
9087 -121260 -73548 -52981 88865 -54879 -36871 -8608 53426 -32243 -408684 -59079 -116865 -13878
9074 210889 87874 -108857 -3471 -233307 69594 69128 19105 73504 226157 3409 -92909 -154694
$$ packed form
9154b6273k6984j93348d0029A44378o8918l0878R2154e4980l46526h8409Q579
9143g9830A27640b49325E7182c079l28976N4989F4029a30144I2315a96826o8983
9132b65809k89753h7149q9105f3438D7914K06437e8891j06780E2403J42207M3239
9121B37849b44085C41188a7098A8529a12986q4054J106A88990a39972A79518d33976
9109a01882B56454A7956a76513j47443J38488q814A31450D6835a17423k06652
9099c24075g2263j6432j40893k75300a40616f8850p86B67928b28169l503A85003
9087a21260M7712K0567H8865e4879J8008h608E3426c2243l76441e9079n7786a3878
9074B10889H7874a08857c471k29836F9594m66A9105N4399J52653C409i2909o1785
$$ plain form
9062 -154694 -201637 36083 -82172 -469400 -177535 28208 148547 48479 -379877 305180 151047
9050 -31162 -207044 1491 100760 139396 146198 -62794 -102432 21583 -131512 -135728 5616 312420
9038 312420 -60781 -296327 -66307 224910 -347941 10986 164208 -84325 -25831 -118387 -69764
9027 -69764 -53526 134155 -8300 24464 -121197 80803 -202057 -333158 83622 15413 140403
9016 140403 -22881 -58421 116537 -165786 -131894 -23559 -209269 100083 66929 -53722 -30485
9005 -30485 -65197 -190014 70958 74640 -115119 -419023 -154545 65084 -69244 67658 33630
8993 -138928 -367192 -39526 128479 -35208 66297 108791 11950 357457 176196 -142152 -82165
8982 -82165 -198504 -196705 -281257 213741 -87616 -232406 95558 -112414 58631 -172714 -72647
$$ packed form
9062a54694m6943C6083h2172l87228a77535B8208J20339D8479c79877C05180A51047
9050c1162j75882A491R9269L8636O802f2794l9638B1583a31512m216E616L06804
9038C12420f0781k35546f6307B24910c47941A0986J53222h4325b5831r2556M8623
9027f9764J6238A34155h300B4464a21197H0803b02057j31101H3622A5413J24990
9016A40403b2881l5540A16537a65786L3892b3559j85710A00083l3154e3722K3237
9005c0485l4712j24817G0958L682a15119l03904a54545F5084f9244F7658C3630
8993a38928k28264c9526A28479c5208F6297M2494A1950L45507A76196a42152N9987
8982h2165j16339J799q4552B13741h7616j44790I5558a12414E8631a72714g2647
$$ plain form
8970 -126972 278881 -149603 -4547 -56367 -45776 -156701 -14596 174219 17636 93542 -83618
8958 7121 -47091 -16596 133896 245807 139951 12635 116758 223413 192121 -107533 -48788
8946 -209035 127264 -203927 -24106 -73321 179055 -211458 51155 143746 71332 -209376 9459
8934 -95695 -55885 -36976 -8327 -99409 -278878 -254677 -343900 234267 25948 191197 -108109
8922 493786 1569645 383972 160257 133953 56011 266592 -192501 333561 -118113 -31776
8911 -163233 -53160 -196525 22046 -32644 198599 -173164 -67129 -87453 -71609 91557 -189376
8899 -17854 -13474 16374 28406 -1840 265060 -231123 97745 -243975 193534 -18217 -116787
8888 -116787 -249184 -108726 -189264 -1365 -133445 -57485 63042 -247261 131728 -27128 -256949
$$ packed form
8970a26972B78881a49603d547n1820J0591j10925a4596A74219A7636P5906h3618
8958G121d7091a6596A33896J11911j05856A2635J04123J06655l1292a07533d8788
8946b09035A27264b03927b4106m9215A79055b11458E1155R2591G1332b09376I459
8934i5695L9810J8909h327r1082j79469K4201q9223B34267B5948J65249a08109
8922D93786J075859C83972A60257k6304E6011K10581a92501C33561a18113c1776
8911a63233e3160j43365B2046c2644A98599a73164f7129k0324J5844I1557a89376
8899a7854M380A6374J2032a840B65060b31123I7745b43975A93534a8217r8570
8888a16787j32397a08726q0538a365j32080e7485F3042b47261A31728b7128k29821
$$ plain form
8877 -256949 129947 303398 97357 -56435 -459170 -245909 -202338 -74618 -598073 -134288
8866 -107810 67534 192884 140903 352059 159608 -540825 -293345 160836 131189 -134980
8855 302054 2699 -35679 -222752 162497 -302478 -214867 49349 78979 83963 330451 -103789
8843 54614 -82408 162387 204690 -278369 31405 -299820 101690 42356 50537 -146119 -95900
8832 -95900 75552 -458623 474 -253253 -78519 -26071 112101 -111735 49609 -9742 -60815 124301
$$ packed form
8877b56949A29947J73451I7357e6435m02735K13261M3571g4618n23455a34288
8866a07810F7534J25350n1981K11156A59608e40825K47480A60836k9647a34980
8855C02054B699c5679j87073A62497c02478Q7611D9349K9630M984K46488a03789
8843E4614h2408A62387M2303b78369C1405b99820A01690D2356Q181a46119N0219
8832i5900G5552d58623D74b53253g8519b6071A12101a11735D9609i742n1073A24301
$$ [...]
##END NTUPLES=NMR SPECTRUM
##END=
