##TITLE=NES1089_ptc170_9885004_iPXpzVtu0R
##JCAMPDX= 6.0         $$ Bruker NMR JCAMP-DX V2.0
##DATA TYPE= NMR SPECTRUM
##DATA CLASS= NTUPLES
##ORIGIN= BRUKER
##OWNER= Administrator
$$ 1.72 TOPSPIN		Version 2.1
$$ 2016-08-27 18:17:49.492 -0500  Administrator@X
$$ Compression mode = diff/dup
##.OBSERVE FREQUENCY= 400.02188249412
##.OBSERVE NUCLEUS= ^1H
##.ACQUISITION MODE= SIMULTANEOUS (DQD)
##.ACQUISITION SCHEME= undefined
##.AVERAGES= 64
##.DIGITISER RES= 22
##SPECTROMETER/DATA SYSTEM= spect
##.PULSE SEQUENCE= noesygpps1d.comp
##.SOLVENT NAME= COFFEE_meoh
##.SHIFT REFERENCE= INTERNAL, COFFEE_meoh, 1, 14.96056
##AUDIT TRAIL= $$ (NUMBER, WHEN, WHO, WHERE, PROCESS, VERSION, WHAT)
$$ ##TITLE= Audit trail, TOPSPIN		Version 2.1
$$ ##JCAMPDX= 5.01
$$ ##ORIGIN= Bruker BioSpin GmbH
$$ ##OWNER= Administrator
$$ $$ E:\/data/COFFEE/nmr/NES1089_ptc170_9885004_iPXpzVtu0R/22/pdata/1/auditp.txt
$$ ##AUDIT TRAIL=  $$ (NUMBER, WHEN, WHO, WHERE, PROCESS, VERSION, WHAT)
(   1,<2016-08-27 18:17:44.351 -0500>,<Administrator>,<X>,<go>,<TOPSPIN 2.1>,
      <created by zg
	started at 2016-08-27 18:06:14.039 -0500,
	POWCHK enabled, PULCHK disabled,
       configuration hash MD5:
       21 0F 79 D6 B3 7B B4 F6 88 20 88 DB 03 48 BD 9F
       data hash MD5: 64K
       21 36 44 45 EC 96 C3 1A 69 09 FD B5 E0 B2 E3 D6>)
(   2,<2016-08-27 18:17:47.429 -0500>,<Administrator>,<X>,<proc1d>,<TOPSPIN 2.1>,
      <Start of raw data processing
       efp LB = 0.3 FT_mod = 6 PKNL = 1 PHC0 = 0 PHC1 = 0 SI = 128K 
       data hash MD5: 128K
       B0 68 32 FB 75 1C 3F 91 AB F1 14 2E C9 46 DB DA>)
(   3,<2016-08-27 18:17:48.320 -0500>,<Administrator>,<X>,<proc1d>,<TOPSPIN 2.1>,
      <pk PHC0 = -82.79846 PHC1 = 0 
       data hash MD5: 128K
       30 5E D6 DC 7B 4E EF C3 BB 5B 24 71 19 E0 48 8A>)
(   4,<2016-08-27 18:17:48.695 -0500>,<Administrator>,<X>,<proc1d>,<TOPSPIN 2.1>,
      <abs ABSG = 1 
       data hash MD5: 128K
       BB E9 8F 17 42 92 52 54 87 9D FB 98 FE C6 AD 1A>)
(   5,<2016-08-27 18:17:48.804 -0500>,<Administrator>,<X>,<proc1d>,<TOPSPIN 2.1>,
      <abs ABSG = 2 
       data hash MD5: 128K
       3B 47 DF 32 5D C2 13 60 D9 13 26 C1 3B 2B 43 07>)
(   6,<2016-08-27 18:17:48.898 -0500>,<Administrator>,<X>,<proc1d>,<TOPSPIN 2.1>,
      <abs ABSG = 3 
       data hash MD5: 128K
       68 37 71 7E D4 F2 8E BC 18 2E CE 13 AE A9 95 E5>)
(   7,<2016-08-27 18:17:48.992 -0500>,<Administrator>,<X>,<proc1d>,<TOPSPIN 2.1>,
      <abs ABSG = 4 
       data hash MD5: 128K
       8C F6 C3 50 78 A5 CD 27 69 CE F5 07 61 11 E1 09>)
(   8,<2016-08-27 18:17:49.117 -0500>,<Administrator>,<X>,<proc1d>,<TOPSPIN 2.1>,
      <abs ABSG = 5 
       data hash MD5: 128K
       11 7A 29 DC 73 0B 7B C1 7F 7D 8B 35 07 C5 45 BB>)
$$ ##END=
$$ 
$$ $$ hash MD5
$$ $$ B8 E5 B4 ED B6 01 4F 06 E8 85 3B E1 59 9D 42 4F
##$RELAX= 
##$RELAX= 
##$RELAX= 
##$RELAX= 
##$RELAX= 
##$RELAX= 
##$RELAX= 
##$RELAX= 
$$ Bruker specific parameters
$$ --------------------------
##$DU= <E:\>
##$EXPNO= 22
$$ [...]
##$TP07= 0
##$TPNAME0= <>
##$TPNAME1= <>
##$TPNAME2= <>
##$TPNAME3= <>
##$TPNAME4= <>
##$TPNAME5= <>
##$TPNAME6= <>
##$TPNAME7= <>
##$TPOAL= (0..7)
0.5 0.5 0.5 0.5 0.5 0.5 0.5 0.5
##$TPOFFS= (0..7)
0 0 0 0 0 0 0 0
##$TUNHIN= 0
##$TUNHOUT= 0
##$TUNXOUT= 0
##$USERA1= <user>
##$USERA2= <user>
##$USERA3= <user>
##$USERA4= <user>
##$USERA5= <user>
##$V9= 5
##$VALIST= <valist>
##$VCLIST= <CCCCCCCCCCCCCCC>
##$VD= 0
##$VDLIST= <DDDDDDDDDDDDDDD>
##$VPLIST= <PPPPPPPPPPPPPPP>
##$VTLIST= <TTTTTTTTTTTTTTT>
##$WBST= 2048
##$WBSW= 25
##$XGAIN= (0..3)
0 0 0 0
##$XL= 0
##$YL= 0
##$YMAX_a= 5625742
##$YMIN_a= -10667870
##$ZGOPTNS= <>
##$ZL1= 120
##$ZL2= 120
##$ZL3= 120
##$ZL4= 120
##$ABSF1= 14.96056
##$ABSF2= -5.597622
##$ABSG= 5
##$ABSL= 3
##$ALPHA= 0
##$AQORDER= 0
##$ASSFAC= 0
##$ASSFACI= 0
##$ASSFACX= 0
##$ASSWID= 0
##$AUNMP= <proc_prof1d_extract.lims>
##$AXLEFT= 0
##$AXNAME= <>
##$AXNUC= <1H>
##$AXRIGHT= 0
##$AXTYPE= 0
##$AXUNIT= <>
##$AZFE= 0.1
##$AZFW= 0.1
##$BCFW= 0
##$BC_mod= 0
##$BYTORDP= 0
##$COROFFS= 0
##$CY= 15
##$DATMOD= 1
##$DC= 0
##$DFILT= <>
##$DTYPP= 0
##$F1P= 0
##$F2P= 0
##$FCOR= 0.5
##$FTSIZE= 131072
##$FT_mod= 6
##$GAMMA= 0
##$GB= 0
##$INTBC= 1
##$INTSCL= 1
##$ISEN= 128
##$LB= 0.3
##$LEV0= 0
##$LPBIN= 0
##$MAXI= 10000
##$MC2= 0
##$MEAN= 0
##$ME_mod= 0
##$MI= 0
##$NCOEF= 0
##$NC_proc= -2
##$NLEV= 6
##$NOISF1= 0
##$NOISF2= 0
##$NSP= 0
##$NTH_PI= 0
##$NZP= 0
##$OFFSET= 14.96056
##$PC= 1
##$PHC0= -82.79846
##$PHC1= 0
##$PH_mod= 1
##$PKNL= yes
##$PPARMOD= 0
##$PPDIAG= 0
##$PPIPTYP= 0
##$PPMPNUM= 2147483647
##$PPRESOL= 1
##$PSCAL= 4
##$PSIGN= 0
##$PYNMP= <proc.py>
##$REVERSE= no
##$SF= 400.020009814175
##$SI= 131072
##$SIGF1= 0
##$SIGF2= 0
##$SINO= 400
##$SIOLD= 131072
##$SPECTYP= <>
##$SREGLST= <1H.CDCl3>
##$SSB= 0
##$STSI= 131072
##$STSR= 0
##$SW_p= 8223.68421052631
##$SYMM= 0
##$S_DEV= 0
##$TDeff= 65536
##$TDoff= 0
##$TI= <>
##$TILT= no
##$TM1= 0
##$TM2= 0
##$TOPLEV= 0
##$USERP1= <user>
##$USERP2= <user>
##$USERP3= <user>
##$USERP4= <user>
##$USERP5= <user>
##$WDW= 1
##$XDIM= 131072
##$YMAX_p= 382806533
##$YMIN_p= -10331
##$CURPLOT= <Network HP LaserJet P1505>
##$CURPRIN= <$Network HP LaserJet P1505>
##$DFORMAT= <normdp>
##$LAYOUT= <+/1D_H.xwp>
##$LFORMAT= <normlp>
##$PFORMAT= <normpl>
##$SURQMSG= 1
$$ End of Bruker specific parameters
$$ ---------------------------------
##NTUPLES= NMR SPECTRUM
##VAR_NAME=  FREQUENCY,     SPECTRUM/REAL,   SPECTRUM/IMAG
##SYMBOL=    X,             R,               I
##VAR_TYPE=  INDEPENDENT,   DEPENDENT,       DEPENDENT
##VAR_FORM=  AFFN,          ASDF,            ASDF
##VAR_DIM=   131072,        131072,          131072
##UNITS=     HZ,            ARBITRARY UNITS, ARBITRARY UNITS
##FACTOR=    0.0627417313425164, 1,          1
##FIRST=     8223.62146879497, -2457,        -51176
##LAST=      0,             -1023,           -51901
##MIN=       0,             -10331,          0
##MAX=       8223.62146879497, 382806533,    0
$$ Real data points
##PAGE= N=1
##DATA TABLE= (X++(R..R)), XYDATA
$$ [...]
63986B65324J929L400M657N078N447O526P756Q177Q007Q350R494J0468J0479R945
63972C65037R779J0285J1226J2390J3562J4402J4990J6066J8015K0051K1224K2015
63960E49042K3906K7345L1282L4957L9082M4673N1610N9306O8087P8825R1475
63949A099590J04987J18655J32607J46742J60113J71792J81830J90759J98469
63940B505544K04055K06583K05490K00220J89978J74219J53297J28437J00985
63931D068808P1770M1167R614k2168n3447q3762j12774j39894j64088j83982j98325
63920C232919k06614k09465k08226k04055j97369j88228j76935j64058j50121
63911A527848j35534j20796j06391r2535p9269o6933n6288m8018m2052l7500l3298
$$ y = [265324, 267253, 270653, 275310, 280388, 285835, 292361, 300117, 308294, 316301, 324651, 334145, 344613, 355092, 365037, 374816, 385101, 396327, 408717, 422279, 436681, 451671, 467737, 485752, 505803, 527027, 549042, 572948, 600293, 631575, 666532, 705614, 750287, 801897, 861203, 929290, 1008115, 1099590, 1204577, 1323232, 1455839, 1602581, 1762694, 1934486, 2116316, 2307075, 2505544, 2709599, 2916182, 3121672, 3321892, 3511870, 3686089, 3839386, 3967823, 4068808, 4140578, 4181745, 4191359, 4169191, 4115744, 4031982, 3919208, 3779314, 3615226, 3431244, 3232919, 3026305, 2816840, 2608614, 2404559, 2207190, 2018962, 1842027, 1677969, 1527848, 1392314, 1271518, 1165127, 1072592, 993323, 926390, 870102, 822084, 780032, 742532, 709234]
63900G09234k9012k5113k2374k0951k0161j9163j7722j6188j4954j4198j3938
63889D95460j3995j3905j3236j2110j1186j0950j1126j0880r603p417n034l099
63877C72919j725n90N37J551K318K913L425L746L831L934M211M260L566K403J702
63862D09001J866K169J657K96j145k123k759l387m070m678n148n463n594n541
63848C75081n416n388n545n809o005o099o363p102q133q748q521p928p746p960
63834B78318p805o981o239o315o812o761o046n502n627n936n835n389m858m044
63820A94168k784j652j418j932k248j886j345j262j608j868j630p92L78J232J247
63805A76600P04M48P30Q63L15l93m70l3J11l50r28j180j233j421j828k276k448
$$ y = [709234, 680222, 655109, 632735, 611784, 591623, 572460, 554738, 538550, 523596, 509398, 495460, 481465, 467560, 454324, 442214, 431028, 420078, 408952, 398072, 388469, 381052, 376018, 372919, 371194, 370604, 371141, 372692, 375010, 377923, 381348, 385094, 388925, 392859, 397070, 401330, 404896, 407299, 409001, 410867, 413036, 414693, 414989, 413844, 411721, 408962, 405575, 401505, 396827, 391679, 386216, 380622, 375081, 369665, 364277, 358732, 352923, 346918, 340819, 334456, 327354, 319221, 310473, 301952, 294024, 286278, 278318, 270513, 263532, 257293, 250978, 244166, 237405, 231359, 225857, 220230, 214294, 208459, 203070, 198212, 194168, 191384, 189732, 188314, 186382, 184134, 182248, 180903, 179641, 178033, 176165, 174535, 173743, 174121, 175353, 176600, 177304, 177752, 178482, 179345, 179660, 179267, 178797, 178764, 178875, 178525, 177597, 176417, 175184, 173763, 171935, 169659, 167211]
63788A67211k079j300p24q13j254j391j129r16q73o15m0L29R7l81n41l47j48o5
63770A55021Q4L75O56P50N43J7n92q27m86N6K32k2k48n4N28J242J873K149J686
63751A62983L64j280k263k015r11J36N89N94N68P63J288K142K979L197K624J891
63735A73649J732K063K203J887J572J711K146K415K322K028J846K043K564L017
63721B03198L134L250L867M681M631L179J124j73j76M71P45J23j099k118k368
63706B22469k144k269l113m102m382l650k241p20M05Q39O98L87J30j13k30J52
63690B02116J115K172K863L290L735M078L963L383K676K135J905K059K479K829
63676B40798K841K485J786Q08K5R0R62J779K022K199K761L077K327R15q5n74j363
$$ y = [167211, 165132, 163832, 163108, 162295, 161041, 159650, 158521, 157605, 156732, 156117, 156077, 156406, 156503, 156122, 155581, 155234, 155086, 155021, 155105, 155480, 156136, 156886, 157429, 157446, 156854, 156027, 155541, 155597, 155829, 155807, 155559, 155505, 156033, 157275, 159148, 161297, 162983, 163347, 162067, 159804, 157789, 156878, 157014, 157603, 158197, 158765, 159528, 160816, 162958, 165937, 169134, 171758, 173649, 175381, 177444, 179647, 181534, 183106, 184817, 186963, 189378, 191700, 193728, 195574, 197617, 200181, 203198, 206332, 209582, 213449, 218130, 222761, 225940, 227064, 226891, 226715, 227186, 227931, 228054, 226955, 224837, 222469, 220325, 218056, 214943, 210841, 206459, 202809, 200568, 199848, 200253, 201092, 201790, 202177, 202307, 202194, 201964, 202116, 203231, 205403, 208266, 211556, 215291, 219369, 223332, 226715, 229391, 231526, 233431, 235490, 237969, 240798, 243639, 246124, 247910, 248718, 248743, 248833, 249795, 251574, 253596, 255795, 258556, 261633, 263960, 264875, 264790, 264216, 262853]
63659B62853k570l281l100k874l400m295m697m415l844l258k769k505k378k019
63645B17448j319p19o18q97j233j424j145%J746L016L141K799L100M128M979N083
63629B38085M777M691N142O121P337Q290Q737R009R576J0385J1068J1680J2669
63616C47567J4198J5991J7844J9807K1783K3527K5119K6984K9233L1439L3162
63605F06654L4241L4366L2912K9564K4763J9152J2943O303Q7m490o959p985q517
63592G73034q891q960q834r121j0441j2915j6203j9857k3469k6536k8491k9025
63580E70291k8308k6765k4656k2075j9204j6400j3969j1937j0038p841n086k074
63568C81938L71J645K047K435L273M377N620P296R506J1658J3056J3697J4074
$$ y = [262853, 260283, 257002, 253902, 251028, 247628, 243333, 238636, 234221, 230377, 227119, 224350, 221845, 219467, 217448, 216129, 215410, 214792, 213895, 212662, 211238, 210093, 210093, 211839, 214855, 217996, 220795, 223895, 228023, 233002, 238085, 242862, 247553, 252695, 258816, 266153, 274443, 283180, 292189, 301765, 312150, 323218, 334898, 347567, 361765, 377756, 395600, 415407, 437190, 460717, 485836, 512820, 542053, 573492, 606654, 640895, 675261, 708173, 737737, 762500, 781652, 794595, 800898, 800985, 796495, 789536, 781551, 773034, 764143, 755183, 746349, 737228, 726787, 713872, 697669, 677812, 654343, 627807, 599316, 570291, 541983, 515218, 490562, 468487, 449283, 432883, 418914, 406977, 396939, 389098, 384012, 381938, 382309, 383954, 386001, 388436, 391709, 396086, 401706, 409002, 418508, 430166, 443222, 456919, 470993]
63555D70993J4419J4687J5123J6240J8170K0570K3268K6461L0046L3321L5672
63544G18970L7078L7433L5851L1361K4175J5687P303j79o091r741j1060j0872
63532H69915j0147r318q601q424r083j0380j2170j4893j8955k3769k8136l1443
63520F84596l3869l5400l5546l4180l1940k9432k6641k3589k0958j9343j8297
63509C75401j6808j4608j2361j0609r189p771o416n323m399l426k452j736j383
63496B78920j257j181j108j053r91q51o32m76n15o23m13L38J377K145K321K082
63480B78083J879K014K338K411K109K014K776M020M309K724J09j775k206k030
63466B98775k312l147l985m535m882n051m878m276l372k441j736j274p13K94J563
$$ y = [470993, 485412, 500099, 515222, 531462, 549632, 570202, 593470, 619931, 649977, 683298, 718970, 756048, 793481, 829332, 860693, 884868, 900555, 907858, 907679, 901588, 891847, 880787, 869915, 859768, 850450, 841849, 833425, 824342, 813962, 801792, 786899, 767944, 744175, 716039, 684596, 650727, 615327, 579781, 545601, 513661, 484229, 457588, 433999, 413041, 393698, 375401, 358593, 343985, 331624, 321015, 311826, 304055, 297639, 292316, 287917, 284491, 282039, 280303, 278920, 277663, 276482, 275374, 274321, 273330, 272479, 271847, 271371, 270856, 270233, 269820, 270158, 271535, 273680, 276001, 278083, 279962, 281976, 284314, 286725, 288834, 290848, 293624, 297644, 301953, 304677, 304786, 303011, 300805, 298775, 296463, 293316, 289331, 284796, 279914, 274863, 269985, 265709, 262337, 259896, 258160, 256886, 256173, 256467, 258030]
63451B58030K482K710K527K376K421K758L595M924O270P245Q066R166J0493J1723
63437C34786J3004J4866J7315J9549K0867K1439K1814K1843K0576J7435J3331
63426E36825J0320R905J1748J4252J6360J8475K1489K5486K9800L3912L7688M0828
63414H07088M2759M3119M1832L8646L3143K5475J6652P846j80o782j1166j2980
63402A025452j2946j2387j2147j2332j3034j4779j8087k2805k8026l2630l5897
63391H10382l7724l8348l7920l6451l4093l1248k8267k5235k2169j9277j6770
63380D82880j4554j2303r772p009m321k072l95J063K883N286P939J0379J2396
63367D72400J3897J4877J5703J7035J9076K1280K3207K5241K7939L0964L3433
$$ y = [258030, 260512, 263222, 265749, 268125, 270546, 273304, 276899, 281823, 288093, 295338, 303404, 312570, 323063, 334786, 347790, 362656, 379971, 399520, 420387, 441826, 463640, 485483, 506059, 523494, 536825, 547145, 557050, 568798, 583050, 599410, 617885, 639374, 664860, 694660, 728572, 766260, 807088, 849847, 892966, 934798, 973444, 1006587, 1032062, 1048714, 1056560, 1056380, 1049598, 1038432, 1025452, 1012506, 1000119, 987972, 975640, 962606, 947827, 929740, 906935, 878909, 846279, 810382, 772658, 734310, 696390, 659939, 625846, 594598, 566331, 541096, 518927, 499650, 482880, 468326, 456023, 446251, 439242, 434921, 432849, 432454, 433517, 436400, 441686, 449625, 460004, 472400, 486297, 501174, 516877, 533912, 552988, 574268, 597475, 622716, 650655, 681619, 715052]
63356G15052L5169L6799L8533L9614L9154L6910L2913K7081J9687J1715M193k489
63344A034331q183j2268j4024j3721j2751j2540j3514j5246j7332j9961k3600
63333H71191k8136l2524l5502l6676l6644l6038l4804l2631k9674k6465k3271
63322E18826j9981j6531j3217j0519q810q170q445r472j1211j3405j5177j5492
63310C68396j4219j2311j0641r119p361n683m757m508m182l446k719k357k133
63297B84960j819j665j889k159k041j688j635j971k194k003j828k265l141l571
63283B55091l081k254j922j975j629p66k15m22o94k96L57M72K64N75J375J700
63267B46580J186N92N81Q70R98J120J508J912K055K201K683L163L048K375J807
$$ y = [715052, 750221, 787020, 825553, 865167, 904321, 941231, 974144, 1001225, 1020912, 1032627, 1036820, 1034331, 1026148, 1013880, 999856, 986135, 973384, 960844, 947330, 932084, 914752, 894791, 871191, 843055, 810531, 775029, 738353, 701709, 665671, 630867, 598236, 568562, 542097, 518826, 498845, 482314, 469097, 458578, 449768, 441598, 433153, 423681, 412470, 399065, 383888, 368396, 354177, 341866, 331225, 322106, 314745, 309062, 304305, 299797, 295615, 292169, 289450, 287093, 284960, 283141, 281476, 279587, 277428, 275387, 273699, 272064, 270093, 267899, 265896, 264068, 261803, 258662, 255091, 252010, 249756, 247834, 245859, 244230, 243464, 243249, 242827, 242133, 241837, 242194, 242666, 242930, 243505, 244880, 246580, 247766, 248358, 248939, 249809, 250807, 251927, 253435, 255347, 257402, 259603, 262286, 265449, 268497, 270872, 272679]
63252B72679J896K744M100N447O227O413O599P228Q055Q739R542J0845J2305J3252
63238C76071J3762J4641J6304J8272J9859K0744K0844K0230J9387J8962J9015
63227E78091J8981J8614J8466J9011J9779J9911J9343J8871J9048J9512J9498
63216G89125J8667J7218J5411J3154J0069N849O24m968j0207j4810j8974k2836
63204G98322k5979k7719k7801k6663k4908k2755k0168j7235j4163j0943p421l704
63192E68863k27K670N037P089Q984J0864J2816J4686J6160J7227J8225J9335K0310
63179G22039K0908K1276K1604K1741K1457K0850K0128J9228J8038J6710J5305
63168I39284J3292R993N426K25n183j0751j6240k1118k5217k8906l2317l4915
$$ y = [272679, 274575, 277319, 281419, 286866, 293093, 299506, 306105, 313333, 321388, 330127, 339669, 350514, 362819, 376071, 389833, 404474, 420778, 439050, 458909, 479653, 500497, 520727, 540114, 559076, 578091, 597072, 615686, 634152, 653163, 672942, 692853, 712196, 731067, 750115, 769627, 789125, 807792, 825010, 840421, 853575, 863644, 869493, 870117, 865149, 854942, 840132, 821158, 798322, 772343, 744624, 716823, 690160, 665252, 642497, 622329, 605094, 590931, 579988, 572567, 568863, 568636, 571306, 576343, 583432, 592416, 603280, 616096, 630782, 646942, 664169, 682394, 701729, 722039, 742947, 764223, 785827, 807568, 829025, 849875, 870003, 889231, 907269, 923979, 939284, 952576, 962569, 967995, 968220, 963037, 952286, 936046, 914928, 889711, 860805, 828488, 793573]
63156G93573l6153l6147l5329l3799l1471k8692k6164k4246k2566k0483j7849
63145D80674j5188j3121j1634j0069q035o047m913m688m678m443m094l571k412
63132C87781p27L87J46o63n89N29J439J316Q53J144K216L209L575L484L230K821
63116D10151K238J740J704K246L024L454L119K167J217Q78J285K115K863L085
63102D41286K633J757R71N69M18K44N7M1K08L77M57M95M59K69L2L3L92R05J310
63083D52913J491J390J023P27J104K400M051N175N469N460N847O745P630P946
63069E09371P784P901Q944J0708J2429J3689J4716J5757J6769J7956J9957K2921
63057F78902K5986K8328L0396L3231L6822M0061M2330M4115M5903M7412M8320
$$ y = [793573, 757420, 721273, 685944, 652145, 620674, 591982, 565818, 541572, 519006, 498523, 480674, 465486, 452365, 440731, 430662, 422627, 416580, 411667, 406979, 402301, 397858, 393764, 390193, 387781, 387054, 387441, 387587, 386924, 386335, 386864, 388303, 389619, 390472, 391616, 393832, 397041, 400616, 404100, 407330, 410151, 412389, 414129, 415833, 418079, 421103, 424557, 427676, 429843, 431060, 431938, 433223, 435338, 438201, 441286, 443919, 445676, 446647, 447216, 447634, 447878, 447935, 447976, 448184, 448561, 449018, 449513, 449972, 450241, 450273, 450306, 450698, 451603, 452913, 454404, 455794, 456817, 457544, 458648, 461048, 465099, 470274, 475743, 481203, 487050, 493795, 501425, 509371, 517155, 525056, 534000, 544708, 557137, 570826, 585542, 601299, 618068, 636024, 655981, 678902, 704888, 733216, 763612, 796843, 833665, 873726, 916056, 960171, 1006074, 1053486, 1101806]
63046A101806M8888M9291M9093M7985M6492M5368M4746M4513M4928M6173M7561
63035A616844M7969M6888M4475M0830L5806K9393K1723J2836K922p466j7889k8410
63023A845921l8862m8088n4740n8681o0815o1637o0755n7915n3586m8335m2395
63012A260112l6067k9846k3821j7478j0445k990M379J1269J7267K1993K5640K8869
63000A248882L1946L4431L6002L7025L8005L8938L9528L9612L9115L8007L6509
62989A658000L4892L2893K9901K5909K1487J6490R696M01j0320k0751l0363l9652
62977A728583m8621n6453o2544o7000p0026p1570p1589p0098o6967o2273n6831
62966A024611n1761m7384m3169l8849l4936l1892k9348k6621k3629k0933j9017
$$ y = [1101806, 1150694, 1199985, 1249078, 1297063, 1343555, 1388923, 1433669, 1478182, 1523110, 1569283, 1616844, 1664813, 1711701, 1756176, 1797006, 1832812, 1862205, 1883928, 1896764, 1899686, 1892220, 1874331, 1845921, 1807059, 1758971, 1704231, 1645550, 1584735, 1523098, 1462343, 1404428, 1350842, 1302507, 1260112, 1224045, 1194199, 1170378, 1152900, 1142455, 1139465, 1143844, 1155113, 1172380, 1194373, 1220013, 1248882, 1280828, 1315259, 1351261, 1388286, 1426291, 1465229, 1504757, 1544369, 1583484, 1621491, 1658000, 1692892, 1725785, 1755686, 1781595, 1803082, 1819572, 1829268, 1829669, 1819349, 1798598, 1768235, 1728583, 1679962, 1623509, 1560965, 1493965, 1423939, 1352369, 1280780, 1210682, 1143715, 1081442, 1024611, 972850, 925466, 882297, 843448, 808512, 776620, 747272, 720651, 697022, 676089, 657072]
62955F57072j7830j6963j6065j5083j4195j3572j3234j3105j3011j2608j1680
62944D99726j0616j0205j0621j0977j0424r327q673q552q076o877n757n493n692
62931C88436n452m709m231m423m717m295l023j563o83n91r19j280j667k138k354
62916C46391j826o87K34L53kj82j74m87j271k035k379k539k922l386l339k537
62900C23212j447p62o49o98m82o3J45q6m75m98K2O47P16L0r17j402j175o27l46
62881C15145n16p90o98k33O5j65m49Q3J418K351J841L70o72p22m72o18r52r76
62863C14010o84l03K26R65J549J534R85L57nO3O69J580K128J915J410J330J591
62846C29320J435N82l35o04j96M41R23J042P04Q5m17n45l99j78J33N95J014J056
$$ y = [657072, 639242, 622279, 606214, 591131, 576936, 563364, 550130, 537025, 524014, 511406, 499726, 489110, 478905, 468284, 457307, 446883, 437556, 428883, 420331, 412255, 405378, 399621, 394128, 388436, 382984, 378275, 374044, 369621, 364904, 360609, 357586, 356023, 355340, 354749, 353830, 352550, 350883, 348745, 346391, 344565, 343878, 344112, 344465, 344463, 344281, 344107, 343620, 342349, 340314, 337935, 335396, 332474, 329088, 325749, 323212, 321765, 321003, 320354, 319656, 319174, 319111, 319256, 319170, 318695, 318197, 318219, 318866, 319582, 319612, 318695, 317293, 316118, 315491, 315145, 314629, 313839, 313141, 312908, 312973, 312808, 312359, 312442, 313860, 316211, 318052, 318422, 317750, 317028, 316556, 315938, 314986, 314010, 313326, 313023, 313249, 314214, 315763, 317297, 318282, 318639, 318634, 318697, 319366, 320946, 323074, 324989, 326399, 327729, 329320, 330755, 331337, 331002, 330398, 330202, 330643, 331566, 332608, 333312, 333397, 332980, 332435, 332036, 331858, 331991, 332586, 333600, 334656]
62828C34656O62J83N8L53P77J131J588K305K982L095K587J999J847K187K826L553
62812C62789M033L927L402L097L355L826M108M346M852N613O552P806R279J0410
62798D37395J0907J1301J2119J3060J3689J4465J6076J8176J9930K1637K4528
62787F13283K8831L3245L6809M0238M4757N0408N6178O1332O5901P0193P4259
62776A175434P7756Q0007Q0418P8863P5406O9669O1075M9799L6937K3512R824
62765A818700m103j8007l1526m4215n5258o3760o9573p3273p5163p5089p3463
62754A235270p1427o9455o6686o2453n7658n3681n0460m6723m1868l6729l2480
62743F45650k9511k7378k5290k2659j9587j6758j4564j2728j0973r620q897q286
$$ y = [334656, 335318, 335501, 335559, 335912, 336689, 337820, 339408, 341713, 344695, 347790, 350377, 352376, 354223, 356410, 359236, 362789, 366822, 370749, 374151, 377248, 380603, 384429, 388537, 392883, 397735, 403348, 409900, 417706, 426985, 437395, 448302, 459603, 471722, 484782, 498471, 512936, 529012, 547188, 567118, 588755, 613283, 642114, 675359, 712168, 752406, 797163, 847571, 903749, 965081, 1030982, 1101175, 1175434, 1253190, 1333197, 1413615, 1492478, 1567884, 1637553, 1698628, 1748427, 1785364, 1808876, 1818700, 1814597, 1796590, 1765064, 1720849, 1665591, 1601831, 1532258, 1458985, 1383822, 1308733, 1235270, 1163843, 1094388, 1027702, 965249, 907591, 853910, 803450, 756727, 714859, 678130, 645650, 616139, 588761, 563471, 540812, 521225, 504467, 489903, 477175, 466202, 456582, 447685, 439399]
62731D39399p194n887m876l825k015K82J919K426K543L098M113N232O276P193
62717D48684P990Q935J0276J1672J2609J3419J5160J8243K1895K5273K8404L1713
62705F54273L5292L9166M3672M8952N4442N9406O3721O7658P1293P4580P7662
62694A290117Q0457Q2069Q1257P7537P1272O2753N1784L8399K3499Q302o648k1489
62682A839309l6127m9668o0961o9491p5578p9753q2205q2846q1704p9081p5381
62671A066514p0921o5813o0073n3918m8004m3100l9398l6353l3332l0191k7045
62660E58366k3897k0837j8309j6626j5368j3792j1804j0078r097q593q028p230
62648C94707o369n628n142n012n186n427n440m998m041k912k262k324k385j584
$$ y = [439399, 432205, 426318, 421442, 417617, 415602, 415884, 417803, 420229, 422772, 425870, 429983, 435215, 441491, 448684, 456674, 465609, 475885, 487557, 500166, 513585, 528745, 546988, 568883, 594156, 622560, 654273, 689565, 728731, 772403, 821355, 875797, 935203, 998924, 1066582, 1137875, 1212455, 1290117, 1370574, 1452643, 1533900, 1611437, 1682709, 1745462, 1797246, 1835645, 1859144, 1867446, 1860798, 1839309, 1803182, 1753514, 1692553, 1623062, 1547484, 1467731, 1385526, 1302680, 1220976, 1141895, 1066514, 995593, 929780, 869707, 815789, 767785, 724685, 685287, 648934, 615602, 585411, 558366, 534469, 513632, 495323, 478697, 463329, 449537, 437733, 427655, 418558, 409965, 401937, 394707, 388338, 382710, 377568, 372556, 367370, 361943, 356503, 351505, 347464, 344552, 342290, 339966, 337581, 335997]
62634C35997j63P03M91M1K58P99O74k17r17p19J4M36J95l75p23n03L36J593K890
62615C40810L812M213M436N046O199P397Q054Q180Q267Q629R285J0292J1730J3310
62601D49660J4672J6108J8431K1823K5436K8454L1002L3538L5954L7876L9281
62590G52235M0024L9233L6146L1397K6414K1493J5441P470j443r584j6187k1593
62578I21046k6265l0378l3933l6646l7873l7351l5848l4484l3399l1736k9072
62567E54061k6204k4137k2810k1354j9305j7001j4827j2691j0465q495p231o499
62555C63042n610m241k911k336k563k925k862k420j907j357n88L29R91J127R65
62540C36734R88J442K156K743K849K376J672J423K061L194L939L977M080N306
$$ y = [335997, 335834, 336537, 337028, 337069, 337327, 338126, 338800, 338583, 337666, 336947, 336961, 337397, 337592, 337217, 336494, 335991, 336327, 337920, 340810, 344622, 348835, 353271, 358317, 364516, 371913, 379967, 388147, 396414, 405043, 414328, 424620, 436350, 449660, 464332, 480440, 498871, 520694, 546130, 574584, 605586, 639124, 675078, 712954, 752235, 792259, 831492, 867638, 899035, 925449, 946942, 962383, 969853, 968410, 958826, 942639, 921046, 894781, 864403, 830470, 793824, 755951, 718600, 682752, 648268, 614869, 583133, 554061, 527857, 503720, 480910, 459556, 440251, 423250, 408423, 395732, 385267, 376772, 369541, 363042, 357432, 353191, 350280, 347944, 345381, 342456, 339594, 337174, 335267, 333910, 333322, 333651, 334642, 335769, 336734, 337722, 339164, 341320, 344063, 346912, 349288, 350960, 352383, 354444, 357638, 361577, 365554, 369634, 374940]
62526C74940P801J0609J2670J3791J4710J6360J9128K2597K6012K9021L1927L5086
62514F14652L8260M0828M2557M3792M4760M5029M3871M0979L6644L1319K5169
62503A047860J8038R810R78p319j4144j9627k4573k9083l2203l3247l2879l2184
62491H51427l1109k8717k4839k0529j6646j2878q621m132q5L487P091J0891J4588
62478G39928J8032K1195K3589K4422K3554K1689J9367J6270J1901O522R15m450
62466I22934r596j4555j9179k3434k7457l1252l4505l6689l7361l6442l4468l2290
62454E85706l0274k7907k4599k0734j7447j5342j3877j2159r902p444n169l263
62442C97589j796p36J4M99P37R83J614K546L059K610J667J221J449J301k91l032
$$ y = [374940, 382741, 393350, 406020, 419811, 434521, 450881, 470009, 492606, 518618, 547639, 579566, 614652, 652912, 693740, 736297, 780089, 824849, 869878, 913749, 954728, 991372, 1022691, 1047860, 1065898, 1075708, 1076686, 1069367, 1055223, 1035596, 1011023, 981940, 949737, 916490, 883611, 851427, 820318, 791601, 766762, 746233, 729587, 716709, 708088, 703956, 703871, 707358, 714449, 725340, 739928, 757960, 779155, 802744, 827166, 850720, 872409, 891776, 908046, 919947, 926469, 927384, 922934, 913338, 898783, 879604, 856170, 828713, 797461, 762956, 726267, 688906, 652464, 617996, 585706, 555432, 527525, 502926, 482192, 464745, 449403, 435526, 423367, 413465, 406021, 400852, 397589, 395793, 395057, 395071, 395570, 396307, 397290, 398904, 401450, 404509, 407119, 408786, 410007, 411456, 412757, 412466, 409434]
62426D09434n423o296n961n665o110o805o959o533o094n853n482m820m221l948
62412C29264l760l385l003k862k737k262j574j202j370j789k077k007j460m84
62398B99292N51J193J304J005M19k20l64M29J819K870L014K552K113K062K452
62383C20491L201M009M483M615M912N812P100Q175Q727Q916Q992R059R230R805
62369D17527J1086J3014J5133J6973J8484K0004K1891K4285K7204L0715L4835
62358F51151L9379M4037M8517N2649N6337N9461O1576O1774N9182N3733M6215
62347A234011L7540K8268J8857R716Q34q102j6858k4531l0754l6323m1935m6938
62335A123785n0163n1468n1456n0117m7054m2851l8827l5344l1572k7211k3166
$$ y = [409434, 404011, 397715, 391754, 386089, 379979, 373174, 366215, 359682, 353588, 347735, 342253, 337433, 333212, 329264, 325504, 322119, 319116, 316254, 313517, 311255, 309681, 308479, 307109, 305320, 303243, 301236, 299776, 299292, 299843, 301036, 302340, 303345, 303764, 303544, 303180, 303609, 305428, 308298, 311312, 313864, 315977, 318039, 320491, 323692, 327701, 332184, 336799, 341711, 347523, 354623, 362798, 371525, 380441, 389433, 398492, 407722, 417527, 428613, 441627, 456760, 473733, 492217, 512221, 534112, 558397, 585601, 616316, 651151, 690530, 734567, 783084, 835733, 892070, 951531, 1013107, 1074881, 1134063, 1187796, 1234011, 1271551, 1299819, 1318676, 1328392, 1329226, 1321124, 1304266, 1279735, 1248981, 1212658, 1170723, 1123785, 1073622, 1022154, 970698, 920581, 873527, 830676, 791849, 756505, 724933, 697722, 674556]
62324F74556k0096j7568j5256j3795j3556j3708j3404j3063j3451j4233j4623
62313E11803j4780j5293j5704j4965j3181j1629j0877j0083q513o708n631n282
62301C79157m860l871k653j894j881k197k146j526q24m95l70j11J51K07M12J282
62285C58381K567L522M018M597N440O050O164O241O650P126P369P609Q128Q681
62271D42543Q990R388J0478J2273J4217J5979J7844K0184K2941K5843K8962L2753
62259F62395L7374M2206M6357M9710N3030N6879O0731O3434O4143O2464N8104
62248A256827N1023M1743L1035J9479P791k843j1578j8917k6097l3505m0508m6659
62236A227791n2083n6538n9293o0246o0157n9349n7189n3429m9067m4997m0790
$$ y = [674556, 654460, 636892, 621636, 607841, 594285, 580577, 567173, 554110, 540659, 526426, 511803, 497023, 481730, 466026, 451061, 437880, 426251, 415374, 405291, 396778, 390070, 384439, 379157, 374297, 370426, 367773, 365879, 363998, 361801, 359655, 358129, 357305, 356810, 356440, 356329, 356480, 356687, 357099, 358381, 360948, 364470, 368488, 373085, 378525, 384575, 390739, 396980, 403630, 410756, 418125, 425734, 433862, 442543, 451533, 460921, 471399, 483672, 497889, 513868, 531712, 551896, 574837, 600680, 629642, 662395, 699769, 741975, 788332, 838042, 891072, 947951, 1008682, 1072116, 1136259, 1198723, 1256827, 1307850, 1349593, 1380628, 1400107, 1407898, 1405055, 1393477, 1374560, 1348463, 1314958, 1274450, 1227791, 1175708, 1119170, 1059877, 999631, 939474, 880125, 822936, 769507, 720440, 675443, 634653]
62225F34653l5787l0654k6673k3927k1386j8547j5868j3665j1697r920q630p740
62213D10159o703n476m724m789n147n179m826m202l231k084j309j122r74l37N35
62198C60591J151J634K509L874N273O317O970P376P762Q402R319J0113J0457J0599
62184D52347J1012J1664J2054J1900J1328J0405R045P526O552O523P041P520P986
62171E72903Q983J0948J4027J8193K3125K8083L2429L6287M0196M4019M6705M7323
62159I23221M5896M2877L8335L2109K4570J6543Q623J082n629j0996j5280j9536
62147A081815k4416k9348l3329l6109l8071l9254l9232l7845l5479l2471k8845
62136G07416k4760k0766j7232j3927j0545p428n298m334l864l012j480L41J742
$$ y = [634653, 598866, 568212, 541539, 517612, 496226, 477679, 461811, 448146, 436449, 426529, 417899, 410159, 403456, 397980, 393256, 388467, 383320, 378141, 373315, 369113, 365882, 363798, 362489, 361367, 360393, 360056, 360591, 361742, 363376, 365885, 369759, 375032, 381349, 388319, 395695, 403457, 411859, 421178, 431291, 441748, 452347, 463359, 475023, 487077, 498977, 510305, 520710, 529755, 537281, 543833, 550356, 557397, 564917, 572903, 581886, 592834, 606861, 625054, 648179, 676262, 708691, 744978, 785174, 829193, 875898, 923221, 969117, 1011994, 1050329, 1082438, 1107008, 1123551, 1132174, 1133256, 1127627, 1116631, 1101351, 1081815, 1057399, 1028051, 994722, 958613, 920542, 881288, 842056, 804211, 768732, 736261, 707416, 682656, 661890, 644658, 630731, 620186, 612758, 607460, 603126, 599262, 596250, 594770, 595111, 596853]
62123E96853K170J500N5j629l076l986m196l676k597j318k96J4o95k375m552o580
62107E65616q086r099r748r948r464q303o884n710m889m099l023j742n70L55J168
62092D85574J987K719L230L540L814M285N168O488P934R108R994J0891J1859J2620
62078E79211J3277J4563J6845J9240K0500K0682K1132K2658K4569K5839K6504
62067H05020K7294K8554L0174L2216L4718L7118L8671L9288L9190L7815L4026
62056A184084K7620J9853J2074M647k396q478j3121j7018k1504k6976l2499l6991
62044A089295m0201m2467m4034m4905m4982m4130m2248l9513l6369l3184k9965
62033F47297k6540k2887j9320j6324j4246j2987j2029j0830r247p544o125n329
$$ y = [596853, 599023, 600523, 600578, 598949, 595873, 591887, 587691, 584015, 581418, 580100, 579804, 579818, 579123, 576748, 572196, 565616, 557530, 548431, 538683, 528735, 519271, 510968, 504084, 498374, 493485, 489386, 486363, 484621, 484051, 484406, 485574, 487561, 490280, 493510, 497050, 500864, 505149, 510317, 516805, 524739, 533847, 543841, 554732, 566591, 579211, 592488, 607051, 623896, 643136, 663636, 684318, 705450, 728108, 752677, 778516, 805020, 832314, 860868, 891042, 923258, 957976, 995094, 1033765, 1073053, 1112243, 1150058, 1184084, 1211704, 1231557, 1243631, 1248278, 1245882, 1237404, 1224283, 1207265, 1185761, 1158785, 1126286, 1089295, 1049094, 1006627, 962593, 917688, 872706, 828576, 786328, 746815, 710446, 677262, 647297, 620757, 597870, 578550, 562226, 547980, 534993, 522964, 512134, 502887, 495343, 489218, 483889]
62021D83889n301n876o640p233p577p686p464o862o116n561n217m790m079l147
62007D00340k126j040J21J318K495L594M559N367O003O282N840M539K780J172
61993D41244q3j247k513l718m599n165n668o317p139p987q681r125r267q968q114
61978C52653o949o024n607n314m621l609k858k740l065l349l204k535j674j188
61964B99916j223j247p55k0L72M70P92J277J301Q57Q83K000L608M752N313N796
61948C24092O355O803P223P960R063J0319J1804J3798J6099J7975J8962J9422
61936D69875K0017K0961K1890K2346K2169K1514K0571J9399J7989J6461J4965
61925F88157J3317J1014P801M058M00k914n907q391r996j0667j0753j0486r641
$$ y = [483889, 478588, 472712, 466072, 458839, 451262, 443576, 436112, 429250, 423134, 417573, 412356, 407566, 403487, 400340, 398214, 397174, 397295, 398613, 401108, 404702, 409261, 414628, 420631, 426913, 432753, 437292, 440072, 441244, 441161, 439914, 437401, 433683, 429084, 423919, 418251, 411934, 404795, 396808, 388127, 379002, 369735, 360767, 352653, 345704, 339680, 334073, 328759, 324138, 320529, 317671, 314931, 311866, 308517, 305313, 302778, 301104, 299916, 298693, 297446, 296691, 296671, 297043, 297513, 298305, 299582, 300883, 301740, 302623, 304623, 308231, 312983, 318296, 324092, 330447, 337250, 344473, 352433, 361496, 371815, 383619, 397417, 413516, 431491, 450453, 469875, 489892, 510853, 532743, 555089, 577258, 598772, 619343, 638742, 656731, 673192, 688157, 701474, 712488, 720289, 724347, 724747, 721833, 715926, 707535, 697539, 686872, 676119, 665633, 655992]
61912F55992p827m955j323K529N972Q598J0575J2477J4450J5742J5404J3406J0598
61899G51638P547L911o24n428r484j2694j5700j8489k0089k0093j9606j9891k0686
61886F00312k0739j9712j8502j7755j7054j5904j4575j3571j2885j2290j1821
61875D25504j1447j0705r230p403n936m995m166l111j894p04M36J647L081M713
61861C75790O179P052P422P966R324J1655J4791J8318K1469K3539K4784K6363
61849E54652K8934L1801L3869L4863L5057L4356L2463K9585K6147K2111J7267
61838H81105J2034P070K301k769p869j1991j4635j6043j6113j4196j0383n957
61826H02554j919K136O898J1804J5520J7531J8266J7837J5616J1240N346j040
$$ y = [655992, 648165, 643210, 641887, 644416, 650388, 658986, 669561, 682038, 696488, 712230, 727634, 741040, 751638, 759185, 763096, 762472, 757044, 747560, 734866, 719166, 700677, 680588, 660495, 640889, 620998, 600312, 579573, 559861, 541359, 523604, 506550, 490646, 476071, 462500, 449615, 437325, 425504, 414057, 403352, 394122, 386719, 380783, 375788, 371622, 368511, 366617, 365913, 366349, 367996, 371077, 375790, 381969, 389021, 396443, 404409, 413733, 425388, 440179, 458497, 479966, 503505, 528289, 554652, 583586, 615387, 649256, 684119, 719176, 753532, 785995, 815580, 841727, 863838, 881105, 893139, 900209, 902510, 899741, 891872, 879881, 865246, 849203, 833090, 818894, 808511, 802554, 800635, 802771, 809669, 821473, 836993, 854524, 872790, 890627, 906243, 917483, 922829, 921789]
61814I21789p426j3808k0077k5762l0318l3391l4888l4930l3861l2183l0376k8683
61802E96086k7082k5402k3505k1378j9221j7382j5993j4673j2872j0677q928q272
61790C90701q318q151p379o311n277m346l655l419l495l386k844k126j517j020
61776C29457o31n50q59j344j715j850j671j159n63j88Q4N96J169J166N46K45R20
61759C23653J938K206J637J131J248J665J934K019J876J219M2r80j106m19L11
61744C38374N61N60P49J049J024N84J93J91K92R5j65J35J043J853K044J973K338
61727C52893L275M256M655M159K976J860J736K783M108M643M301L879L915M085
61713D03524L795K993K181J763J527P90q36k819l980l711k785k614l686n024n333
$$ y = [921789, 914363, 900555, 880478, 854716, 824398, 791007, 756119, 721189, 687328, 655145, 624769, 596086, 569004, 543602, 520097, 498719, 479498, 462116, 446123, 431450, 418578, 407901, 398973, 390701, 382383, 374232, 366853, 360542, 355265, 350919, 347264, 343845, 340350, 336964, 334120, 331994, 330477, 329457, 328826, 328276, 327417, 326073, 324358, 322508, 320837, 319678, 319115, 318927, 319011, 319607, 320776, 321942, 322488, 322733, 323653, 325591, 327797, 329434, 330565, 331813, 333478, 335412, 337431, 339307, 340526, 340568, 339588, 338482, 338063, 338374, 338935, 339495, 340244, 341293, 342317, 342901, 343094, 343285, 343577, 343672, 343507, 343642, 344685, 346538, 348582, 350555, 352893, 356168, 360424, 365079, 369238, 372214, 374074, 375810, 378593, 382701, 387344, 391645, 395524, 399439, 403524, 407319, 410312, 412493, 414256, 415783, 416573, 415737, 412918, 408938, 405227, 402442, 399828, 396142, 391118, 385785]
61698C85785m452l428l248l768l980l260k057j327j484k120k623k720k448k003
61684C46867j707j759j839j336j87Q90J212P95m0j152k185k240r02P13R19m14
61668C37635j591j240J43J234J599J617J308L32j004j707j312m59R0M47J161K160
61652C40413K689K273J319O23N22P33Q73R39J192J701K217K535K823L295L719
61637C67866L527K548J334N21O9n94j766l107m060m372m142l631l148k931k987
61622C45127l115l150l046k700j972r47rN74R44J347J686J547O63q82k771m596
61606C28700n997o818p125o967o290n282m517m439m789m871m376l637l132l027
61592B57433l218l490l604l465l207k922k478j889j669k250l156l379k669j824
$$ y = [385785, 381333, 377905, 374657, 370889, 366909, 363649, 361592, 360265, 358781, 356661, 354038, 351318, 348870, 346867, 345160, 343401, 341562, 340226, 340039, 340929, 342141, 342936, 342896, 341744, 339559, 337319, 336417, 337130, 338049, 337635, 336044, 334804, 334947, 336181, 337780, 339397, 340705, 341037, 340033, 338326, 337014, 336555, 336645, 337092, 338253, 340413, 343102, 345375, 346694, 347317, 347839, 348572, 349445, 350384, 351576, 353277, 355494, 358029, 360852, 364147, 367866, 371393, 373941, 375275, 375796, 375865, 375271, 373505, 370398, 366338, 361966, 357824, 354193, 351045, 348114, 345127, 342012, 338862, 335816, 333116, 331144, 330197, 330188, 330762, 331706, 333053, 334739, 336286, 336949, 336067, 333296, 328700, 322703, 315885, 308760, 301793, 295503, 290221, 285704, 281265, 276476, 271605, 267229, 263592, 260460, 257433, 254215, 250725, 247121, 243656, 240449, 237527, 235049, 233160, 231491, 229241, 226085, 222706, 220037, 218213]
61578B18213j495j372r30l73l07p93j343j603j595j375r65n48k69K3N36J042J072
61561B07918N81N3j50j76k52k43J25P56J170J052N98L24N02R19J167J082Q18N85
61543B16829M62M34M64M68L79K15K3j38q6M46J384K103K041J453J017P92J70r89
61525B27467j908j910j330r38r08q89p38o20o05o88r91j489j774j584j315j419
61509B08361j529r17K10P02j9j110j371o78J18L88K60J03n7l35n23j91O24J157
61491B05193P35k60o86l9R61J358J103P88P06O93O67P73J059J428J809K058J891
61474B20237J376J129J533J960J486J99q76j116q22m90l16m78j101j652j251O1
61458B19879J080R64L13J68N33O55L29J05L03N64N10K61J53K62M29N48P29J155
$$ y = [218213, 216718, 215346, 214416, 214043, 213736, 212943, 211600, 209997, 208402, 207027, 206062, 205514, 205245, 205268, 205804, 206846, 207918, 208499, 208552, 208402, 208226, 207974, 207731, 207856, 208612, 209782, 210834, 211432, 211756, 212258, 213177, 214344, 215426, 216244, 216829, 217291, 217725, 218189, 218657, 219036, 219251, 219274, 219136, 219050, 219496, 220880, 222983, 225024, 226477, 227494, 228286, 228456, 227467, 225559, 223649, 222319, 221381, 220473, 219584, 218846, 218226, 217621, 216933, 215942, 214453, 212679, 211095, 209780, 208361, 206832, 205915, 206125, 206827, 206808, 205698, 204327, 203649, 203767, 204155, 204415, 204518, 204461, 204126, 203603, 203412, 204036, 205193, 205928, 205668, 204982, 204943, 205904, 207262, 208365, 209153, 209859, 210552, 211219, 211992, 213051, 214479, 216288, 218346, 220237, 221613, 222742, 224275, 226235, 227721, 227920, 227044, 225928, 225106, 224616, 224300, 223822, 222721, 221069, 219818, 219879, 220959, 221923, 222236, 222404, 222937, 223592, 223921, 224026, 224329, 224893, 225403, 225664, 225817, 226079, 226508, 227056, 227785, 228940]
61440B28940J845K523K811K578K097J856K220L150M058M107L026J568P54P20P56
61425B63009M55K22M19P02O27L99N11R29J287J555J938K217J891J036M51O13R63
61408B79224N85n90j668j918j650j710k282k656k261j508j213j519j875j956j949
61393B55054j951j712j181p37n72m04n6J87J79L45R87J592J492R45Q78J596K312
61376B58954K058P18q61j560q83N55J555J570J195J161J331J185R11J245K287
61361B71421L344L943M306M655M755M510M363M662N068N096M920N109N737O264
61347C38153O195N512M431L198K204J947K601L725M670N163N365N344M814L626
61333C96948K252J392J080O15m74j787k688l178l698m347m809n027n188n152m416
$$ y = [228940, 230785, 233308, 236119, 238697, 240794, 242650, 244870, 248020, 252078, 256185, 259211, 260779, 261533, 262253, 263009, 263464, 263686, 264105, 264807, 265434, 265833, 266344, 267273, 268560, 270115, 272053, 274270, 276161, 277197, 277648, 278261, 279224, 279809, 279219, 277551, 275633, 273983, 272273, 269991, 267335, 265074, 263566, 262353, 260834, 258959, 257003, 255054, 253103, 251391, 250210, 249473, 248901, 248497, 248441, 248628, 248807, 249152, 250139, 251731, 253223, 254168, 255046, 256642, 258954, 261012, 261730, 260869, 259309, 258426, 258981, 260536, 262106, 263301, 264462, 265793, 266978, 267889, 269134, 271421, 274765, 278708, 283014, 287669, 292424, 296934, 301297, 305959, 311027, 316123, 321043, 326152, 331889, 338153, 344348, 349860, 354291, 357489, 359693, 361640, 364241, 367966, 372636, 377799, 383164, 388508, 393322, 396948, 399200, 400592, 401672, 402287, 401813, 400026, 397338, 394160, 390462, 386115, 381306, 376279, 371091, 365939, 361523]
61318C61523k999j730j249j138n66M72J133R50N63R75K426M199N443N968O243
61303C82213O713P217P064N710L385J067k87n03k91m76j206j965k328k444k702
61288D01167l189l685m008m046l597k602j521j041j266j535j233m45L45Q82J177
61273C75403J272J272J424J744J823J459J289K134L742M903N015M874N449O504
61259D18307P103P008O708O266N140L377K113K339L665M858N216M932M446L991
61245D85469L628L146K072K39j699k896l408m091n334o528p039p098p333p762
61231D41366p780o971n530l987k734j831j099l95J75M61N61P21R48J140J570K707
61215D19322M330N344M935L560K368J969K132K417K518K174J378O49O14J275K054
$$ y = [361523, 358524, 356794, 355545, 354407, 353841, 354313, 355446, 356396, 356959, 357934, 360360, 364559, 370002, 375970, 382213, 388926, 396143, 403207, 408917, 412302, 413369, 413082, 412579, 412288, 411812, 410606, 408641, 406313, 403869, 401167, 397978, 394293, 390285, 386239, 382642, 380040, 378519, 377478, 376212, 374677, 373444, 372999, 373344, 374226, 375403, 376675, 377947, 379371, 381115, 382938, 384397, 385686, 387820, 391562, 396465, 401480, 406354, 411803, 418307, 425410, 432418, 439126, 445392, 450532, 453909, 456022, 458361, 462026, 466884, 472100, 477032, 481478, 485469, 489097, 492243, 494315, 494554, 492855, 489959, 486551, 482460, 477126, 470598, 463559, 456461, 449128, 441366, 433586, 426615, 421085, 417098, 414364, 412533, 411434, 411039, 411214, 411675, 412236, 412957, 413905, 415045, 416615, 419322, 423652, 428996, 433931, 437491, 439859, 441828, 443960, 446377, 448895, 451069, 452447, 453096, 453710, 454985, 457039]
61200D57039K576L005L627M544N834P564R416J0730J1091J0658R765Q501O931
61187E51281N456M616M540M791M805M389L753L160K573J719M83q27j778k194k154
61172E84613j744j077m96m54j068j964k739l366m052m745n069m908m833n676p486
61157E34936r210r698q935p921p387p106o465n243l639k051j094j359k726m273
61143D57829n295o047o993p804p766o946o117n568m794l447j976r91n21j76L70
61128C93758J235K356L425M112M530N169O253P430Q250Q704R147R971J1419J3430
61114D89189J5475J6835J7233J7111J7171J7723J8479J8809J8264J7007J5649
61103F78945J4512J3229J1416R353P515N702L352P05j244k131k830m319o523q711
$$ y = [457039, 459615, 462620, 466247, 470791, 476625, 484189, 493605, 504335, 515426, 526084, 535849, 544350, 551281, 556737, 561353, 565893, 570684, 575489, 579878, 583631, 586791, 589364, 591083, 591566, 590739, 588961, 586767, 584613, 582869, 581792, 581296, 580842, 579774, 577810, 575071, 571705, 567653, 562908, 557839, 552931, 548098, 542422, 534936, 525726, 516028, 507093, 499172, 491785, 484679, 478214, 472971, 469332, 467281, 466187, 464828, 462102, 457829, 452534, 446487, 439494, 431690, 423924, 416978, 410861, 405293, 400499, 397052, 395076, 394085, 393564, 393388, 393758, 394993, 397349, 400774, 404886, 409416, 414585, 420838, 428268, 436518, 445222, 454369, 464340, 475759, 489189, 504664, 521499, 538732, 555843, 573014, 590737, 609216, 628025, 646289, 663296, 678945, 693457, 706686, 718102, 727455, 734970, 740672, 744024, 744729, 743485, 741354, 738524, 734205, 727682, 718971]
61089G18971j0444j1695j2468j2873j3273j3867j4321j4170j3447j2557j1720
61078E78136j0867r921q889p798o758n958n374m624l410j949p64j22K04O68J538
61063E14112K610L378L677M099N356P311R090J0194J0898J1478J1754J1784J2249
61050F17990J3591J5326J6796J8148J9882K1785K3150K3942K5028K7143L0139
61039H52920L3400L6529L9501M2394M5181M7681M9657N1030N1910N2500N3177
61028A355880N4653N7635O2215O7944P4576Q2141R0274R8239J06113J15436J28216
61017B293322J46004J70362K03262K46041K98555L60445M32964N18852O21475
61008E291282P45704Q98507J084044J292966J492928J628724J635871J466316
$$ y = [718971, 708527, 696832, 684364, 671491, 658218, 644351, 630030, 615860, 602413, 589856, 578136, 567269, 557348, 548459, 540661, 533903, 527945, 522571, 517947, 514537, 512588, 511824, 511702, 511906, 512574, 514112, 516722, 520100, 523777, 527876, 533232, 540543, 549633, 559827, 570725, 582203, 593957, 605741, 617990, 631581, 646907, 663703, 681851, 701733, 723518, 746668, 770610, 795638, 822781, 852920, 886320, 922849, 962350, 1004744, 1049925, 1097606, 1147263, 1198293, 1250203, 1302703, 1355880, 1410533, 1468168, 1530383, 1598327, 1672903, 1755044, 1845318, 1943557, 2049670, 2165106, 2293322, 2439326, 2609688, 2812950, 3058991, 3357546, 3717991, 4150955, 4669807, 5291282, 6036986, 6935493, 8019537, 9312503, 10805431, 12434155, 14070026, 15536342]
61000A5536342J118397O54455J88234j59514l13529k72287r9227J07782K46246
60991A7006899K32125K3809l55120q14387j232311j512143j620524j583580j453626
60982H691142j278655j091657r13057p54087o18532n05497m12550l37010k76038
60973B504059k27289j89289j60458j38324j20534j06051r4624q5511p7611p0354
60963A234014o3605n6978n0099m3340l7474l2749k8998k6465k5610k6043k6456
60952H16197k5938k4751k3639k2773k1675j9826j7190j4287j1800j0035q767p794
60940F07722p328p586q201q516q339q045q012q319q991j0010j1066j1598j1288
60927D90423j0288r045q101p895q337q564p665n706l704k492k025j899j981k145
$$ y = [15536342, 16654739, 17309194, 17497428, 17337914, 17024385, 16752098, 16652871, 16760653, 17006899, 17239024, 17262833, 16907713, 16093326, 14861015, 13348872, 11728348, 10144768, 8691142, 7412487, 6320830, 5407773, 4653686, 4035154, 3529657, 3117107, 2780097, 2504059, 2276770, 2087481, 1927023, 1788699, 1668165, 1562114, 1467490, 1381979, 1304368, 1234014, 1170409, 1113431, 1063332, 1019992, 982518, 949769, 920771, 894306, 868696, 842653, 816197, 790259, 765508, 741869, 719096, 697421, 677595, 660405, 646118, 634318, 624283, 615516, 607722, 600394, 592808, 584607, 576091, 567752, 559707, 551695, 543376, 534385, 524375, 513309, 501711, 490423, 480135, 471090, 462989, 455094, 446757, 438193, 430528, 424822, 421118, 418626, 416601, 414702, 412721, 410576]
60913D10576j860p18P26J329P51l1P6R64J706J988K395L227L820L500K703K403
60897D33555K780L185L226L058K630J589J95n87m26k95j224k950m514n645o701
60882D27876p652q081q127q453r139r385q552p001n582m750m392m189l854l189
60868C35530k205j108j31N58Q94R98J010P38j82j450j931r41O16J274R81J141
60852C35792K438L659L215J147j028k028j762r13j71J91M41J063K126L075L321
60837C50566K761J581nj530k240j852j086q49j068r34j86M80M38q9n30p54r96
60820C43707j286j414j312j186j222j410j631j800j908k020k254k687l288l943
60806C16346m472m651m372l842l528l728m161m233l712l020k714k796k773k406
$$ y = [410576, 408716, 407998, 408724, 410053, 410804, 410773, 410849, 411813, 413519, 415507, 417902, 421129, 424949, 428449, 431152, 433555, 436335, 439520, 442746, 445804, 448434, 450023, 450218, 449631, 449205, 448910, 447686, 444736, 440222, 434577, 427876, 420224, 412143, 404016, 395563, 386424, 377039, 368487, 361486, 355904, 351154, 346762, 342573, 338719, 335530, 333325, 332217, 332086, 332644, 333538, 334536, 335546, 336284, 336102, 334652, 332721, 331780, 332396, 333670, 334651, 335792, 338230, 341889, 345104, 346251, 345223, 343195, 341433, 340520, 340349, 340540, 340981, 342044, 344170, 347245, 350566, 353327, 354908, 354903, 353373, 351133, 349281, 348195, 347346, 346278, 345344, 345158, 345638, 346076, 345987, 345457, 344703, 343707, 342421, 341007, 339695, 338509, 337287, 335877, 334246, 332446, 330538, 328518, 326264, 323577, 320289, 316346, 311874, 307223, 302851, 299009, 295481, 291753, 287592, 283359, 279647, 276627, 273913, 271117, 268344, 265938]
60792B65938k121k448l190l468k679j252j71M6k28l09Q4P32J296J575J521J227
60776B56553R44R74J445K212K999L597L949M140M262M248L885L143K435K295K668
60761B99749K854K293J222K90k96q44j570k334l003l601l981l775k937k014j587
60746B80466j588j482r67l40j44n98j349j826j962k372l542m923n378m575l401
60731B46019k757k577k358k046j766j227j71Q29Q46j79j371k020k070j600o32
60716B26920L97P48K68l68n89n11l58M9Q09J522J867K146K677L086K844K251K126
60699B45884K619L007K795K375K317K510K481K249K264K574K597J996J375J560
60685B78603K358K665J899P79K42K15Km94p86p98j018j495j592j016l72l08p47
$$ y = [265938, 263817, 261369, 258179, 254711, 252032, 250780, 250609, 250655, 250427, 250118, 250202, 250934, 252230, 253805, 255326, 256553, 257497, 258471, 259916, 262128, 265127, 268724, 272673, 276813, 281075, 285323, 289208, 292351, 294786, 297081, 299749, 302603, 304896, 306118, 306408, 306112, 305268, 303698, 301364, 298361, 294760, 290779, 287004, 284067, 282053, 280466, 278878, 277396, 276429, 276089, 275945, 275347, 273998, 272172, 270210, 267838, 264296, 259373, 253995, 249420, 246019, 243262, 240685, 238327, 236281, 234515, 233288, 233117, 233946, 234792, 234613, 233242, 231222, 229152, 227552, 226920, 227317, 228065, 228333, 227965, 227376, 226865, 226507, 226556, 227365, 228887, 230754, 232900, 235577, 238663, 241507, 243758, 245884, 248503, 251510, 254305, 256680, 258997, 261507, 263988, 266237, 268501, 271075, 273672, 275668, 277043, 278603, 280961, 283626, 285525, 286304, 286546, 286761, 286763, 286269, 285483, 284685, 283667, 282172, 280580, 279564, 279192, 278884, 278137]
60668B78137j391k295l432m200m104l554l272l210k723j716q76p85j260j730j768
60653B41821j268n00L8J61L43J126K217K712K215J292O47L65J08k74o73j027j439
60636B47864k074k968l845m116l366j901o36k57o50j189j424j414j422j436j110
60621B20056k33P91J254R86N99O94J131J408J386J194P75L3o23n99O2O90Q79Q47
60603B31330Q29P13M66L87N58N32q0r66j422j142l98L28P14P48O99Q09R35P23
60585B35763K01j39l3J82J27%K92J166K371L579M510M922M870M821N212O016O955
60568B80815P929Q891R491R325Q453P268N818L745R61j907m057n266n901o312
60554C19253o358n599l854j559N12J907K865L921N298O797Q239R683J1185J2511
$$ y = [278137, 276746, 274451, 271019, 266819, 262715, 259161, 255889, 252679, 249956, 248240, 247364, 246579, 245319, 243589, 241821, 240553, 240053, 240091, 240252, 240595, 241721, 243938, 246650, 248865, 250157, 250804, 251169, 251277, 251003, 250330, 249303, 247864, 245790, 242822, 238977, 234861, 231495, 229594, 228958, 228701, 228051, 226862, 225438, 224024, 222602, 221166, 220056, 219823, 220614, 221868, 222854, 223453, 224147, 225278, 226686, 228072, 229266, 230041, 230074, 229451, 228852, 228914, 229604, 230483, 231330, 232159, 232872, 233338, 233725, 234283, 234815, 234735, 233769, 232347, 231205, 230807, 231135, 231849, 232597, 233296, 234105, 235040, 235763, 235964, 235825, 235792, 235974, 236101, 236101, 236393, 237559, 239930, 243509, 248019, 252941, 257811, 262632, 267844, 273860, 280815, 288744, 297635, 307126, 316451, 324904, 332172, 337990, 341735, 342696, 340789, 336732, 331466, 325565, 319253, 312895, 307296, 303442, 301883, 302395, 304302, 307167, 311088, 316386, 323183, 331422, 341105, 352290, 364801]
60540C64801J3318J3556J3481J3111J1824Q904M585K51k810m665o290p946q757
60527D13363q152o963o449o605o286m949l429k770k980l297l242k837k142j105
60513C52157J45J311K353L544N049O745Q543J0651J3222J6034J8782K1591K4809
60500D84936K8359L1664L4313L6458L8275L9301L8625L5632L0290K2882J3822
60489H34557L664p018j7751k7849l6142m1499m3758m3709m2167l9443l5821l1902
60477D71162k8150k4551k1077j8084j5787j3789j1708r922r009q650p803o097
60465B96535m356l517l547l706l435k782k145j952k313k844k956k550k119k056
60451B56257k121j887j443j245j382j436j154q36p95p48j94O92J058N00k22q5
$$ y = [364801, 378119, 391675, 405156, 418267, 430091, 438995, 443580, 443831, 441021, 436356, 430066, 422120, 413363, 405211, 398248, 391799, 385194, 378908, 373959, 370530, 367760, 364780, 361483, 358241, 355404, 353262, 352157, 352302, 353613, 355966, 359510, 364559, 371304, 379847, 390498, 403720, 419754, 438536, 460127, 484936, 513295, 544959, 579272, 615730, 654005, 693306, 731931, 767563, 797853, 820735, 834557, 838221, 831203, 813452, 785603, 749461, 707962, 664204, 620495, 578328, 538885, 503064, 471162, 443012, 418461, 397384, 379300, 363513, 349724, 338016, 328094, 319085, 310435, 302632, 296535, 292179, 288662, 285115, 281409, 277974, 275192, 273047, 271095, 268782, 265938, 262982, 260432, 258313, 256257, 254136, 252249, 250806, 249561, 248179, 246743, 245589, 244753, 243958, 243210, 243016, 243708, 244766, 245266, 245044, 244959]
60435B44959Q01J251N03r34k130k870l448l833l643k865j918j028j3J232K489
60420B28553L482M021L839K778J241P9k34j9J10j62p97j522j822j244J5J125J483
60403B40926J217P85N05O52J485K730L558L484K958K565K154J385O91Q88J908
60388B67891K790K892K424J760J005M67P62J939L059L136K220J209Q88J418K404
60373B96264L120K948K016J194J106J466J645J600J737K090K231J957J562J441
60359C22377J805K800M423O216P448P844P818P834P804P295O078M267K082j95
60345C95896k213l735m892o018p198q066q176p470o379n386m631l969l291k617
60331C21855j896j102n04n09j026j403j344j373j925k401j895o84M5j0K50J613
$$ y = [244959, 245760, 247011, 247514, 246580, 244450, 241580, 238132, 234299, 230656, 227791, 225873, 224845, 224832, 226064, 228553, 232035, 236056, 239895, 242673, 243914, 243993, 243759, 243740, 243850, 243688, 242891, 241369, 239547, 238303, 238318, 239443, 240926, 242143, 242928, 243433, 244085, 245570, 248300, 251858, 255342, 258300, 260865, 263019, 264404, 265095, 265983, 267891, 270681, 273573, 275997, 277757, 278762, 279229, 279991, 281930, 284989, 288125, 290345, 291554, 292442, 293860, 296264, 299384, 302332, 304348, 305542, 306648, 308114, 309759, 311359, 313096, 315186, 317417, 319374, 320936, 322377, 324182, 326982, 331405, 337621, 345069, 352913, 360731, 368565, 376369, 383664, 389742, 394009, 396091, 395896, 393683, 389948, 385056, 379038, 371840, 363774, 355598, 348128, 341749, 336363, 331732, 327763, 324472, 321855, 319959, 318857, 318353, 317844, 316818, 315415, 314071, 312698, 310773, 308372, 306477, 305793, 305838, 305828, 306078, 307691]
60315C07691L343M327M718N565P187Q853R902J0315J0238R652Q658P497O106M159
60301D08211J663r38l302n396p153q376r141r760j0224j0095r204p981o843n626
60287C15835m024k273j035o86r84j320j202n88Q3L15M7l45n60n84m77k49n5k19
60269C01679q97j826k515k584k026j353j250j817k341k224j840j857k082j768
60255B75299r53m05k27L42J420K027J657J173J341J592J201P37J061J692J540
60240B89497P69M66P88Q53M01J31K54P0p13j391j393r71m12M15J309J583J240
60223B92896J274K122K785K283J267J094J912K665K733K544K556K573K300J994
60209C22998K279L438N097O433O778O165N295M890N078N461N613N491N416N599
$$ y = [307691, 311034, 315361, 320079, 325644, 332831, 341684, 351586, 361901, 372139, 381791, 390449, 397946, 404052, 408211, 409874, 408936, 405634, 400238, 393085, 384709, 375568, 365808, 355584, 345489, 336285, 328304, 321461, 315835, 311811, 309538, 308503, 307817, 306833, 305513, 304311, 303723, 303806, 304121, 304168, 303823, 303263, 302679, 302202, 301953, 301898, 301679, 300782, 298956, 296441, 293857, 291831, 290478, 289228, 287411, 285070, 282846, 281006, 279149, 277067, 275299, 274346, 273941, 273714, 274056, 275476, 277503, 279160, 280333, 281674, 283266, 284467, 285204, 286265, 287957, 289497, 290266, 290732, 291520, 292373, 292774, 292905, 293159, 293229, 292516, 291125, 289732, 288761, 288349, 288764, 290073, 291656, 292896, 294170, 296292, 299077, 301360, 302627, 303721, 305633, 308298, 311031, 313575, 316131, 318704, 321004, 322998, 325277, 328715, 333812, 340245, 347023, 353188, 358483, 363373, 368451, 373912, 379525, 385016, 390432, 396031]
60195C96031N645M849L222J837J573J938J830J201R73J321J264J99j213k185k887
60180D15598l759m594n012n134n127m748l998l571l867m232l885l063k434k016
60166C60158j560j356j653j849j289m53j47NR25K262K636J793J037J250J762J692
60150C65213J198Q22N19R5j78m0J96J40j0K40J055K194L239L714L528L349L955
60133C89229N021N307M288K914K320K491K688K574K267J822J286R24R16J054J179
60118D26280J494K085K437J967P68n22j324j346o60J16J58o27j409j491j099p50
60102D26077n05m01r30k295l653m011l536l158l104k832k204j741j617j415j088
60087C93587j191j788j963j029M11J236J215J008R77Q42M11Q0K30N61M01l76j168
$$ y = [396031, 401676, 406525, 409747, 411584, 413157, 415095, 416925, 418126, 419099, 420420, 421684, 421883, 420670, 418485, 415598, 411839, 407245, 402233, 397099, 391972, 387224, 383226, 379655, 375788, 371556, 367671, 364608, 362174, 360158, 358598, 357242, 355589, 353740, 352451, 351998, 351851, 351856, 352781, 355043, 357679, 359472, 360509, 361759, 363521, 365213, 366411, 367233, 367752, 367847, 367669, 367629, 367825, 367965, 367955, 368195, 369250, 371444, 374683, 378397, 381925, 385274, 389229, 394250, 399557, 403845, 406759, 409079, 411570, 414258, 416832, 419099, 420921, 422207, 423131, 424047, 425101, 426280, 427774, 429859, 432296, 434263, 435031, 434509, 433185, 431839, 431179, 431295, 431453, 430826, 429417, 427926, 426827, 426077, 425572, 425171, 424241, 421946, 418293, 414282, 410746, 407588, 404484, 401652, 399448, 397707, 396090, 394675, 393587, 392396, 390608, 388645, 387616, 388027, 389263, 390478, 391486, 392463, 393305, 393716, 393796, 394026, 394587, 394988, 394612, 393444]
60070C93444j428j388j676k452l299l922m449m912m915m211l257k799l058l653
60056C48025m122m218l918l461l152k843j964l88J116J789J869K047K364K457
60042C35601K613L476M724N206M629M094M425M992M806L997L298K741J908J066
60028C87576J024J817K470K216J316M10k80r35j788l067m968p285r348j0514j0651
60013C47993j0026r010p925o981o149n286m450l867l509k990k098j128m63o9K55
59998B84297L81O1l76k03O88J431J205K98l14k48p1l51q88j055n80L32J336K101
59980B88044K317J906J279J011J258J611J538Q49k34j262j850j984j996k083j917
59965B88487j077K33J272J631J548J290O94k87j057r11K4Q89J070P05K09k28n23
$$ y = [393444, 392016, 390628, 388952, 386500, 383201, 379279, 374830, 369918, 365003, 360792, 357535, 354736, 351678, 348025, 343903, 339685, 335767, 332306, 329154, 326311, 324347, 323959, 325075, 326864, 328733, 330780, 333144, 335601, 338214, 341690, 346414, 351620, 356249, 360343, 364768, 369760, 374566, 378563, 381861, 384602, 386510, 387576, 388600, 390417, 392887, 395103, 396419, 396829, 396549, 395614, 393826, 390759, 385791, 378506, 369158, 358644, 347993, 337967, 328957, 321032, 314051, 307902, 302616, 298166, 294299, 290790, 287800, 285702, 284574, 284111, 284042, 284297, 284678, 284739, 284363, 284160, 284848, 286279, 287484, 287782, 287468, 287220, 287149, 286798, 285910, 284855, 284275, 284607, 285943, 288044, 290361, 292267, 293546, 294557, 295815, 297426, 298964, 299813, 299579, 298317, 296467, 294483, 292487, 290404, 288487, 287410, 287643, 288915, 290546, 292094, 293384, 294078, 293791, 292734, 291823, 291847, 292736, 293806, 294511, 294720, 294492, 293969]
59948B93969n29j88L58R74J607J995J609L06j159j704j110k27J20Q2L95J236J986
59931B99720K104J833J798K295L210M450N993P592Q862R749J0442J0630R331N951
59917C83960J301k918n616o951p554p676p270o455n522m674l970l388k725j712
59903C18830m59L76K64m56q73n29K36R70J666K455L098L236K963K769K909L191
59887C40646L415L731M333N029N408N396N351N535N744N662N362N168N078M701
59873D10559L899L076K613K196J166n50k223l129l204k850k368j843j356r53m35
59858D04598N50K090L812N139N721N661N326M905M208K949J187o86k296l373l583
59843D36208k707j276n34j386l436n498o806p445p630p192n908l966j880j21J104
$$ y = [293969, 293440, 293252, 293610, 294584, 296191, 298186, 299795, 300101, 298942, 297238, 296128, 295901, 296021, 296103, 296498, 297734, 299720, 301824, 303657, 305455, 307750, 310960, 315410, 321403, 328995, 337857, 347606, 358048, 368678, 378009, 383960, 385261, 382343, 376727, 369776, 362222, 354546, 347276, 340821, 335299, 330625, 326655, 323267, 320542, 318830, 318371, 318747, 319011, 318555, 317682, 317153, 317389, 318359, 320025, 322480, 325578, 328814, 331777, 334546, 337455, 340646, 344061, 347792, 352125, 357154, 362562, 367958, 373309, 378844, 384588, 390250, 395612, 400780, 405858, 410559, 414458, 417534, 420147, 422343, 423509, 422959, 420736, 417607, 414403, 411553, 409185, 407342, 405986, 405033, 404598, 405148, 407238, 411050, 416189, 421910, 427571, 432897, 437802, 442010, 444959, 446146, 445460, 443164, 439791, 436208, 433501, 432225, 431691, 430305, 426869, 421371, 414565, 407120, 399490, 392298, 386390, 382424, 380544, 380423, 381527]
59828C81527J941K784L854M791M976M398L843L955M413M289L104J183r09k906
59814D21243m781o402p466p786p524p131o904o638n828m325k627j422r44r51j238
59799C49276j803k507k922k781k378k247k431k399j780r18m51n26p07o09k77J18
59783C24658N40R33J063Q17M24J85J67L45P61J285J545J480J644K401L114K840
59767C44202J694P95P30R52Q81Q24J269J938K237K209K306K473K167J370R21J523
59751C68491K816L678L438K609K389L331M674N162M416L209K406K186K382K914
59737D14101L526L654L139K588K478K296J302j73r70o39J20N25N27L65O9k99m29
59720D32180j96P9N3k25n57r34j391j790j998k007j784j271p52p92j548k349k397
$$ y = [381527, 383468, 386252, 390106, 394897, 399873, 404271, 408114, 412069, 416482, 420771, 423875, 425058, 424149, 421243, 416462, 410060, 402594, 394808, 387284, 380153, 373249, 366611, 360783, 356458, 353831, 352409, 351465, 350514, 349276, 347473, 344966, 342044, 339263, 336885, 334638, 332207, 329808, 328028, 327110, 326659, 326133, 325426, 324817, 324540, 324658, 325198, 326131, 327194, 328011, 328435, 328620, 328787, 329132, 329893, 331178, 332723, 334203, 335847, 338248, 341362, 344202, 345896, 346691, 347421, 348373, 349254, 350078, 351347, 353285, 355522, 357731, 360037, 362510, 364677, 366047, 366968, 368491, 371307, 374985, 378423, 381032, 383421, 386752, 391426, 396588, 401004, 404213, 406619, 408805, 411187, 414101, 417627, 421281, 424420, 427008, 429486, 431782, 433084, 432911, 431941, 431302, 431422, 431947, 432474, 432839, 432908, 432609, 432180, 431984, 432063, 432116, 431891, 431334, 430400, 429009, 427219, 425221, 423214, 421430, 420159, 419407, 418615, 417067, 414718, 412321]
59703D12321j718j136j356k290l216l458k916k055j372q72k41N31R06L74r47k409
59687C90146l371l590l257k757k339j951j515j249j477k085k543k555k357k305
59673C56795k480k821l283l655l587l093k641k494k304j750j179j112j344j242
59659C23810p93o81j185j683j526r01m18j65K85J061J688J691J225Q85J010J410
59643C25713J678J620J279O92j00q51j184j007o16k74J62Q74J548J599Q98k5o74
59626C31332j057j372j521j304q88p61j194j998k767l166l001k295j344m99J13
59611C08278N41P10N39L65Q06J950L044L333K957K589K421K080J484J070J045
59596C33212R95O22L58P56J562J898J300J82o84q58m48K5Lo07j279j456j210j094
$$ y = [412321, 410603, 409467, 408111, 405821, 402605, 399147, 396231, 394176, 392804, 391932, 391691, 392222, 393128, 393502, 392555, 390146, 386775, 383185, 379928, 377171, 374832, 372881, 371366, 370117, 368640, 366555, 364012, 361457, 359100, 356795, 354315, 351494, 348211, 344556, 340969, 337876, 335235, 332741, 330437, 328687, 327508, 326396, 325052, 323810, 323017, 322336, 321151, 319468, 317942, 317041, 316623, 316458, 316743, 317804, 319492, 321183, 322408, 323293, 324303, 325713, 327391, 329011, 330290, 330982, 330882, 330031, 328847, 327840, 327224, 326950, 327112, 327986, 329534, 331133, 332031, 332006, 331332, 330275, 328903, 327382, 326078, 325190, 324429, 323235, 321237, 318470, 315304, 312303, 310008, 308664, 308165, 308278, 308819, 309529, 310068, 310433, 311239, 313189, 316233, 319566, 322523, 325112, 327533, 329613, 331097, 332167, 333212, 334207, 334829, 335187, 335943, 337505, 339403, 340703, 340885, 340201, 339343, 338895, 338920, 338923, 338316, 337037, 335581, 334371, 333277]
59578C33277j420j937k238k127j672j111p69q21j041j029o99l35j64j42k11m43
59562C17118q10r87o48J50R42J230R04L97L37R24J721K133K032J685J312J012
59546C29452R88J476K426L585M878O440Q321J0450J2840J5377J7399J7865J6003
59533D47500J1590M866l169j0452j4746j5323j3399j0694q064n669l631j946k48
59520C76615J550K799K844K020J208O73l1j057j898k128k001k137k944m416o055
59505C65042p036o848n907n147m848m422l404k180j422j187j107j093j343j749
59491C17349j859j510j037o93k71M09R62Q52J80l67l33J69R58K079L388M267M266
59474C28809L684L133K715K189J703J695K060K067J372N46K99N78P79N46J07N0
$$ y = [333277, 331857, 329920, 327682, 325555, 323883, 322772, 322003, 321182, 320141, 319112, 318413, 318078, 317914, 317772, 317561, 317118, 316308, 315321, 314673, 314823, 315765, 316995, 317899, 318296, 318633, 319557, 321278, 323411, 325443, 327128, 328440, 329452, 330440, 331916, 334342, 337927, 342805, 349245, 357566, 368016, 380856, 396233, 413632, 431497, 447500, 459090, 463956, 460787, 450335, 435589, 420266, 406867, 396173, 388109, 382440, 378809, 376863, 376615, 378165, 380964, 383808, 385828, 387036, 387709, 387678, 386621, 384723, 382595, 380594, 378457, 375513, 371097, 365042, 358006, 351158, 345251, 340104, 335256, 330834, 327430, 325250, 323828, 322641, 321534, 320441, 319098, 317349, 315490, 313980, 312943, 312250, 311979, 312388, 313350, 314202, 314382, 314015, 313682, 313851, 314809, 316888, 320276, 324543, 328809, 332493, 335626, 338341, 340530, 342233, 343928, 345988, 348055, 349427, 349973, 350272, 350850, 351629, 352175, 352282, 352332]
59458C52332Q32K349L769M247L878L583L855M179M046L910M486N498N865N048
59444D07877L572K170J041Q4p13j421k323l554m692n056m493l637l260l426l508
59429C78661l054k342j818j303k56J351K940M147N167O185P167Q319J0070J2232
59415D27466J3893J4713J5621J7514J9741K0589J8895J4560Q013K33o933j1565
59403E52740j3058j2165r744o210k159J408L711M336K725j618p880j3770j7168
59390D81148j7740j6550j4665j2563j0466q519o683m806k876j097K40Q98R18P87
59376C88026J156K229L550M474M670M233L538L060L020L161L067K716K448K423
59362D31771K555K915L743M910N831O108N951N776N725N732N786N907O120O535
$$ y = [352332, 353164, 355513, 359282, 363529, 367407, 370990, 374845, 379024, 383070, 386980, 391466, 396964, 402829, 407877, 411449, 413619, 414660, 414744, 414031, 412610, 410287, 406733, 402041, 396985, 392492, 388855, 385595, 382169, 378661, 375607, 373265, 371447, 370144, 369888, 371239, 374179, 378326, 383493, 389678, 396845, 405164, 415234, 427466, 441359, 456072, 471693, 489207, 508948, 529537, 548432, 562992, 571005, 571238, 564305, 552740, 539682, 527517, 517773, 511563, 509404, 510812, 514523, 518859, 521584, 519966, 512086, 498316, 481148, 463408, 446858, 432193, 419630, 409164, 400645, 393962, 389156, 386280, 385183, 385423, 386321, 387239, 388026, 389182, 391411, 394961, 399435, 404105, 408338, 411876, 414936, 417956, 421117, 424184, 426900, 429348, 431771, 434326, 437241, 440984, 445894, 451725, 457833, 463784, 469560, 475285, 481017, 486803, 492710, 498830, 505365]
59348E05365P201P808P918P581P279P239P169O840O420O013N393M462L498K587
59334E92773J298o50k835m697o287p930r396j0044r693q855q171p966q244q596
59320E00707q246o663m325k399j538j216m03J329L515N391O625P511Q527R724
59306E18539J0623J0621R376O669K306l442r394j3898j5993j6012j4935j3393
59294D71067j1480r374p692o951o860o520n428m032l127k953l090l030k548j733
59280C96249r09m69m21l29J03N75P95J209K509M479O142P050P654Q243Q383P796
59264D49059P032O652O323N421M021K644J324l41k407m480o230p531q174q067
59250D45246p533o954o187m933l543k769k640k329j293MQ34J187J589K272K940
$$ y = [505365, 512566, 520374, 528292, 535873, 543152, 550391, 557560, 564400, 570820, 576833, 582226, 586688, 590186, 592773, 594071, 593421, 590586, 585889, 579602, 571672, 562276, 552232, 542539, 533684, 525513, 517547, 509303, 500707, 492461, 485798, 481473, 479074, 477536, 476320, 475917, 477246, 480761, 486152, 492777, 500288, 508815, 518539, 529162, 539783, 549159, 555828, 558134, 554692, 545298, 531400, 515407, 499395, 484460, 471067, 459587, 450213, 442521, 435570, 428710, 422190, 416762, 412730, 409603, 406650, 403560, 400530, 397982, 396249, 395340, 394871, 394450, 394121, 394224, 394799, 395594, 396803, 399312, 403791, 409933, 416983, 424637, 432880, 441263, 449059, 456091, 462743, 469066, 474487, 478508, 481152, 482476, 482135, 479728, 475248, 469018, 461487, 453313, 445246, 437713, 430759, 424572, 419639, 416096, 413327, 410687, 408358, 407065, 407069, 407903, 409090, 410679, 412951, 415891]
59235D15891L285L360L434L683M075M427M433L806K513J017L1j44lk95j147k019
59219D46347k549k968l486l717l136j913q51n15p44r57p30j07M78O00K44k65p11
59202D25020j039j013l35O27Q06m22k344l648l744k913j642m01K00j38p94p91
59186D07429j4P25Q64P15P86J066J277J296J130Q34P08J111J922K519K634K758
59170D27760L459M578N444N728N731N908O316O575O337N777N500N733N827M887
59156E05560K881P42o24j071r88r01j328k510l983m888m979m945n403o028o141
59141D65394n811n798o468p323p682p430o965o619o341n906n254m580m077l743
59127C81397l448l088k484j381K28J845K915L483M075M910N694O178O502O854
$$ y = [415891, 419176, 422536, 425970, 429653, 433728, 438155, 442588, 446394, 448907, 449924, 449955, 449811, 449808, 449513, 448366, 446347, 443798, 440830, 437344, 433627, 430491, 428578, 427727, 427212, 426468, 425511, 424781, 424674, 425152, 425752, 425996, 425731, 425020, 423981, 422968, 422633, 423260, 424066, 423644, 421300, 417652, 413908, 410995, 409353, 408952, 409152, 409014, 408220, 407429, 407415, 408140, 409004, 409719, 410505, 411571, 412848, 414144, 415274, 416108, 416816, 417927, 419849, 422368, 425002, 427760, 431219, 435797, 441241, 446969, 452700, 458608, 464924, 471499, 477836, 483613, 489113, 494846, 500673, 505560, 508441, 509183, 508559, 507488, 506500, 505599, 504271, 501761, 497778, 492890, 487911, 482966, 477563, 471535, 465394, 459583, 453785, 447317, 439994, 432312, 424882, 417917, 411298, 404957, 399051, 393797, 389217, 385140, 381397, 377949, 374861, 372377, 370996, 371224, 373069, 375984, 379467, 383542, 388452, 394146, 400324, 406826, 413680]
59113D13680P200P562Q098Q667Q787Q355P936P928P811O850N216L819L104K639
59099E07652J944J181P43O02L29l77j440k548l358l540k876j483j1O76K05r62
59083D96737k097k984l835m555m724m343m074m393n092n852o737p623p777o732
59069D25919n175m163l795l456l126l349l955l978l177k547k759l055k454j389
59055C79541j112j854k539k267j306m86k51m45n60q9R55J780J493K23q70q71k3
59038C71319Q60J432J895K344K566K522K538K789K972K767K475K784L833M926
59024D08022N381N465N981P110Q124Q400Q278Q544R359J0059R917Q721O752M497
59010E14610K460Q87l95j658k768l222k747j664n41L38J041J657K083K200K199
$$ y = [413680, 420880, 428442, 436540, 445207, 453994, 462349, 470285, 478213, 486024, 492874, 498090, 501909, 505013, 507652, 509596, 510777, 511520, 512122, 512451, 512074, 510634, 508086, 504728, 501188, 498312, 496829, 496818, 497494, 497699, 496737, 494640, 491656, 487821, 483266, 478542, 474199, 470125, 465732, 460640, 454788, 448051, 440428, 432651, 425919, 420744, 416581, 412786, 409330, 406204, 402855, 398900, 394922, 391745, 389198, 386439, 383384, 380930, 379541, 378429, 376575, 374036, 371769, 370463, 369977, 369726, 369281, 368721, 368632, 369587, 371367, 372860, 373083, 372213, 371342, 371319, 372179, 373611, 375506, 377850, 380416, 382938, 385476, 388265, 391237, 394004, 396479, 399263, 403096, 408022, 413403, 418868, 424849, 431959, 440083, 448483, 456761, 465305, 474664, 484723, 494640, 503361, 510113, 514610, 517070, 517957, 517562, 515904, 513136, 509914, 507167, 505503, 504962, 505300, 506341, 507998, 510081, 512281, 514480]
58995E14480K498L209L797L634K788J924J312O16j72l92J10J61j362l724n038
58980E23841m643l659l156k926k397j557m21J302L348M676M921N142O190P236
58966E37897P102O237O003O570O974O985P297P819P468N941M320L340K296M05
58952F16654j959m133o292q759j0982j2208j2650j3028j3308j2849j1536r957
58940D98993q457o839n096l788l480m105n015n520n377m834m144l084j362N47
58926D38439J527J105P3n24n12k59J23N39L96p69k195k384q67J190K310K237J848
58909D42277K034K874L795M287M398M546M926N349N789O577P765Q671Q563P630
58895E19481O777O563O833P305Q036R141J0508J1973J3529J5268J7167J8889J9725
$$ y = [514480, 516978, 520187, 523984, 527618, 530406, 532330, 533642, 534258, 534086, 533694, 533804, 533965, 532603, 528879, 523841, 519198, 515539, 512383, 509457, 507060, 505503, 505082, 506384, 509732, 514408, 519329, 524471, 530661, 537897, 544999, 551236, 557239, 563809, 570783, 577768, 585065, 592884, 600352, 606293, 610613, 613953, 616249, 616654, 614695, 610562, 604270, 595511, 584529, 572321, 559671, 546643, 533335, 520486, 508950, 498993, 490536, 483697, 478601, 474813, 471333, 467228, 462213, 456693, 451316, 446482, 442338, 439254, 437892, 438439, 439966, 441071, 441144, 440620, 440108, 439849, 439972, 440511, 440907, 440138, 437943, 435559, 434692, 435882, 438192, 440429, 442277, 444311, 447185, 450980, 455267, 459665, 464211, 469137, 474486, 480275, 486852, 494617, 503288, 511851, 519481, 526258, 532821, 539654, 546959, 554995, 564136, 574644, 586617, 600146, 615414, 632581, 651470, 671195]
58882F71195J8977J6657J3641J0863Q469N972L129K67k176m216o345q990j1857
58869G15586j3878j4205j3251j2264j1696j0727q700o327m800m412m725n562o881
58856E98158q039q325q064q267r102r686r525r167r169r259q990q483p948p064
58842D77070n506l777k922l419m645n503n440m857m533m660m644m010l120k694
58828D17340k837l073l081k802k051o49R97K146K577K688K714K527K209K176K523
58813D23404K837K859K758K583K116J384P76L80o9m31p4J002J723J229L3p38q34
58796D40938r70j691k772l676m124m155m045m070m140l765k594r43M87J287J589
58781D07356J750K020K513L308M455N747O518O075M531K861J728N89j339l627
$$ y = [671195, 690172, 706829, 720470, 731333, 739802, 745774, 748903, 749170, 746994, 742778, 736433, 727443, 715586, 701708, 687503, 674252, 661988, 650292, 639565, 630865, 624538, 619738, 615326, 610601, 605039, 598158, 590119, 581794, 573730, 565463, 556361, 546675, 537150, 527983, 518814, 509555, 500565, 492082, 484134, 477070, 471564, 467787, 464865, 461446, 456801, 451298, 445858, 441001, 436468, 431808, 427164, 423154, 420034, 417340, 414503, 411430, 408349, 405547, 403496, 402847, 403844, 405990, 408567, 411255, 413969, 416496, 418705, 420881, 423404, 426241, 429100, 431858, 434441, 436557, 437941, 438717, 439097, 439028, 438597, 438523, 439525, 441248, 442477, 442510, 441772, 440938, 439968, 438277, 435505, 431829, 427705, 423550, 419505, 415435, 411295, 407530, 404936, 403993, 404480, 405767, 407356, 409106, 411126, 413639, 416947, 421402, 427149, 433667, 439742, 444273, 447134, 448862, 449451, 448112, 444485]
58767D44485n055n416n811o829p508o735m880l288k665k701k878k889k442j404
58753C83984j14R05J520J879J978J825J877K630L724M089L254K136K047L192M526
58738D19452N121N229N714O743P533P422O711O168O102O258O274N879M935L726
58724E03267L011L231L910M269M184M009L780L345L073L543M586N441N842O202
58710E61693O676O915O787O512N910M440K250K25j300k997n357p898j0049j1957
58696E61850j3854j5346j5907j5599j4774j3625j2365j1292j0306q980p394o209
58684D16199n573m851l805l150l352l774l685l269k931k426j491o12k89q2P46
58669C77655K198L854N549P039P738P664P904R162J0459J0313Q578O097L192k09
$$ y = [444485, 439430, 434014, 428203, 421374, 413866, 407131, 402251, 398963, 396298, 393597, 390719, 387830, 385388, 383984, 383870, 384775, 386295, 388174, 390152, 391977, 393854, 396484, 400208, 404297, 407551, 409687, 411734, 414926, 419452, 424573, 429802, 435516, 442259, 449792, 457214, 463925, 470093, 476195, 482453, 488727, 494606, 499541, 503267, 506278, 509509, 513419, 517688, 521872, 525881, 529661, 533006, 536079, 539622, 544208, 549649, 555491, 561693, 568369, 575284, 582071, 588583, 594493, 598933, 601183, 601408, 600108, 597111, 591754, 583856, 573807, 561850, 547996, 532650, 516743, 501144, 486370, 472745, 460380, 449088, 438782, 429802, 422408, 416199, 410626, 405775, 401970, 398820, 395468, 391694, 388009, 384740, 381809, 379383, 377892, 377280, 376991, 376909, 377655, 379853, 383707, 389256, 396295, 404033, 411697, 419601, 428763, 439222, 449535, 458113, 464210, 467402, 467193]
58655D67193l394n307n987o342o592o121m899l810l384l209k844k395j990j480
58641D09439r39p25q60r68r16q95q29l79L47P73P05N79P22R52J116J433J971K223
58623D13749J559K5j472j922j144j4N61P46J395K665L766M226M507M907M906M206
58607D42666L534L512L544K773J443L16n13j218j358p03k55j079k566l245k973
58592D43878k791k911k426j076K76J131J952L014L917M547N364O434P221P586
58578D76116P922Q179P859P130O760O786O444N699N537O298P044P115P212Q289
58564E74390J0325J2731J5106J7042J8147J8781J9832K1332K2164K1612K0146
58553G71608J8138J4965J0234M966O42k326m397n882o884p619q176q348q286q740
$$ y = [467193, 463799, 458492, 452505, 446163, 439571, 433450, 428551, 424741, 421357, 418148, 415304, 412909, 410919, 409439, 408500, 407775, 406915, 405947, 405031, 404136, 403307, 402928, 403275, 404048, 404753, 405332, 406054, 407006, 408122, 409555, 411526, 413749, 415308, 415333, 413861, 411939, 410795, 410781, 411342, 412088, 413483, 416148, 419914, 424140, 428647, 433554, 438460, 442666, 446200, 449712, 453256, 456029, 457472, 457788, 457275, 456057, 454699, 453996, 453741, 452662, 450096, 446851, 443878, 441087, 438176, 435750, 434674, 434950, 436081, 438033, 441047, 444964, 449511, 454875, 461309, 468530, 476116, 484038, 492217, 500076, 507206, 513966, 520752, 527196, 532895, 538432, 544730, 551774, 558889, 566101, 574390, 584715, 597446, 612552, 629594, 647741, 666522, 686354, 707686, 729850, 751462, 771608, 789746, 804711, 814945, 819911, 820553, 818227, 813830, 807948, 801064, 793445, 785269, 776921, 768635, 759895]
58539G59895j0121j1905j3468j4851j6170j7001j7076j6895j6874j6428j4801
58528E94305j2321r999q174o368m351k602j616j345j371j360j289j394j812k287
58514E38016k463k441k614k908k750j934r95m80l54l41l72l94k78j65l89p84o31
58497E17723L70J504J862J388P98P05J118J577J669J498J630K320L078L409L643
58482E44292M420N595O494P049P833R025J0249J1356J2437J3072J2596J1136R359
58469F64913P145L816j97l239m503m967n697o320n928m530k854j376j24J138K913
58454F40190N438P962R313R416R267R245Q583O888M800K648k10l892p099q638
58440F93911q895q853q636p893o761n502l966k220r42m40l9Q61J975L031M463
$$ y = [759895, 749774, 737869, 724401, 709550, 693380, 676379, 659303, 642408, 625534, 609106, 594305, 581984, 571985, 563811, 557443, 553092, 550490, 548874, 547529, 546158, 544798, 543509, 542115, 540303, 538016, 535553, 533112, 530498, 527590, 524840, 522906, 521911, 521431, 521077, 520736, 520364, 519970, 519692, 519527, 519138, 518354, 517723, 518093, 519597, 521459, 522847, 523645, 524350, 525468, 527045, 528714, 530212, 531842, 534162, 537240, 540649, 544292, 548712, 554307, 560801, 567850, 575683, 584708, 594957, 606313, 618750, 631822, 644418, 655554, 664913, 672058, 675874, 675677, 672438, 667935, 662968, 657271, 650951, 645023, 640493, 637639, 636263, 636139, 637277, 640190, 645628, 653590, 662903, 672319, 681586, 690831, 699414, 706302, 711102, 713750, 713540, 709648, 702549, 693911, 685016, 676163, 667527, 659634, 652873, 647371, 643405, 641185, 640243, 639803, 639764, 640625, 642600, 645631, 650094]
58425F50094O346P759Q177Q453R318R971R337P881O729N741L911J277j030k421
58411G31543l343m253n064n565n553m729l190j802j379j731k060k010j664j012
58397F88188o1Q88J664K567L782M925N587N833N715M976L693K531J883J480J197
58382G34848J385J911J920J182O43R37J447J624K032L127M112M146L731L831M426
58367G71302N013N630O360O735O700P177Q614R911J0035R638R843J0384J0377
58354H77719R961R699R151P661N911N126N204N037M249L348K644K305K876M518
58340I55409O212P088P793R344J1255J2280J2393J2581J3180J3771J4303J4919
58328A090528J5138J4462J3354J2437J1343R599P897P185P167P040O954P364P716
$$ y = [650094, 656440, 664199, 672376, 680829, 690147, 700118, 709455, 717336, 724065, 729806, 733717, 734994, 733964, 731543, 728200, 723947, 718883, 713318, 707765, 703036, 699846, 698044, 696665, 694934, 692874, 690864, 689200, 688188, 688127, 689015, 690679, 693246, 697028, 701953, 707540, 713373, 719088, 724064, 727757, 730288, 732171, 733651, 734848, 736233, 738144, 740064, 741246, 741889, 742826, 744273, 745897, 747929, 751056, 755168, 759314, 763045, 766876, 771302, 776315, 781945, 788305, 795040, 801740, 808917, 817531, 827442, 837477, 847115, 856958, 867342, 877719, 887680, 897379, 906530, 914191, 920102, 925228, 930432, 935469, 939718, 943066, 945710, 948015, 950891, 955409, 961621, 968709, 976502, 985846, 997101, 1009381, 1021774, 1034355, 1047535, 1061306, 1075609, 1090528, 1105666, 1120128, 1133482, 1145919, 1157262, 1166861, 1174758, 1181943, 1189110, 1196150, 1203104, 1210468, 1218184]
58315A218184P378P118Q049R706J0786J1243J2002J3203J4257J5163J6232J7028
58303A360349J7098J7094J7743J8389J8104J7464J7573J8104J8094J7890J8547
58292A556449J9890K0946K1671K2627K3606K4204K4992K6389K7434K7392K7577
58281A823177K9489L2291L4245L5627L7817M0388M1561M1025L9937L8778L7376
58270B231711L6381L6529L7163L7596L8968M2479M6881N0185N2775N6164N9854
58259B726686O2366O4371O7705P1977P5189P7049P8795Q0548Q1694Q3101Q5886
58248C555367Q8988R1014R3410R8463J05316J11443J16963J23765J31551J38629
58238D654909J45666J54586J64814J74650J85200J98646K13865K28343K43182
$$ y = [1218184, 1225562, 1232680, 1240729, 1250435, 1261221, 1272464, 1284466, 1297669, 1311926, 1327089, 1343321, 1360349, 1377447, 1394541, 1412284, 1430673, 1448777, 1466241, 1483814, 1501918, 1520012, 1537902, 1556449, 1576339, 1597285, 1618956, 1641583, 1665189, 1689393, 1714385, 1740774, 1768208, 1795600, 1823177, 1852666, 1884957, 1919202, 1954829, 1992646, 2033034, 2074595, 2115620, 2155557, 2194335, 2231711, 2268092, 2304621, 2341784, 2379380, 2418348, 2460827, 2507708, 2557893, 2610668, 2666832, 2726686, 2789052, 2853423, 2921128, 2993105, 3068294, 3145343, 3224138, 3304686, 3386380, 3469481, 3555367, 3644355, 3735369, 3828779, 3927242, 4032558, 4144001, 4260964, 4384729, 4516280, 4654909, 4800575, 4955161, 5119975, 5294625, 5479825, 5678471, 5892336, 6120679, 6363861]
58229F363861K61243K81626L01251L20872L44001L70729L98368M27461M61253
58220I530665M99977N41632N87613O41242P01733P66254Q36929R18615J010909
58211A6035569J110287J219171J344837J490682J657890J854979K096141K391368
58203B9200924K749076L187883L735047M415245N253928O288987P562153R099336
58195G1492579J0918457J3059449J5588416J8566728K2017358K5875305K9874912
58188B07393204L3421949L5597983L5359085L1824499K4553753J3822218Q33842
58181C82806533j2394809k3659750l1418372l5271337l5787928l3959303l0750319
58174A79564715k6924871k3023535j9374974j6136766j3362786j1050759r157186
$$ y = [6363861, 6625104, 6906730, 7207981, 7528853, 7872854, 8243583, 8641951, 9069412, 9530665, 10030642, 10572274, 11159887, 11801129, 12502862, 13269116, 14106045, 15024660, 16035569, 17145856, 18365027, 19709864, 21200546, 22858436, 24713415, 26809556, 29200924, 31950000, 35137883, 38872930, 43288175, 48542103, 54831090, 62393243, 71492579, 82411036, 95470485, 111058901, 129625629, 151642987, 177518292, 207393204, 240815153, 276413136, 311772221, 343596720, 368150473, 381972691, 382806533, 370411724, 346751974, 315333602, 280062265, 244274337, 210315034, 179564715, 152639844, 129616309, 110241335, 94104569, 80741783, 69691024, 60533838]
58167F0533838p614603o360008n345325m525980l857542l307106k855225k483751
58159B4184298k172132j906509j681352j489947j322253j173159j043752r32776
58151A2462418q34714p47167o72239o09473n54648n06425m67036m35358m06171
58142G229187l77424l51818l29945l08279k85382k64203k46483k30213k14227
58133D621213k00272j88902j77939j66567j56663j48756j40700j31632j23324
58124C186458j16485j09512j02011r5846r1534q7126q1840p7451p4958p2893p0056
58113B206746o7118o4611o1892n8846n6204n3743n0557m7194m5081m3925m2357
58102A615218m0793m0691m1264m0232l7717l6071l5721l4649l2199k9933k8254
$$ y = [60533838, 52919235, 46559227, 41213902, 36687922, 32830380, 29523274, 26668049, 24184298, 22012166, 20105657, 18424305, 16934358, 15612105, 14438946, 13395194, 12462418, 11627704, 10880537, 10208298, 9598825, 9044177, 8537752, 8070716, 7635358, 7229187, 6851763, 6499945, 6170000, 5861721, 5576339, 5312136, 5065653, 4835440, 4621213, 4420941, 4232039, 4054100, 3887533, 3730870, 3582114, 3441414, 3309782, 3186458, 3069973, 2960461, 2858450, 2762604, 2671070, 2583944, 2502104, 2424653, 2349695, 2276802, 2206746, 2139628, 2075017, 2013125, 1954279, 1898075, 1844332, 1793775, 1746581, 1701500, 1657575, 1615218, 1574425, 1533734, 1492470, 1452238, 1414521, 1378450, 1342729, 1308080, 1275881, 1245948, 1217694]
58091A217694k5632k1912j9104j8022j7219j5988j5445j5838j5829j5242j5636
58080A021827j7249j8255j7974j7988j9057j9776j9238j8413j7937j7127j6148
58069H22665j6345j7450j7180j4793j2423j1649j1408j0513r656r449q984p898
58057F74917p536q530r422r119q595q736q736q112q074r187r811q634o870o167
58043E57388o104n568m964n132n587n577n587o067o056m810l573l963n596o946
58029D81858p625q306r167r840j0199j0102r154p645o707o601o125m659l441l528
58015C78759l940l299k068j533j600j317q06r69j837k634l021l093k648j658q75
58000C47461q89j152j002r27j554k165j588j45P21M19m27j324k358l268l325k355
$$ y = [1217694, 1192062, 1170150, 1151046, 1133024, 1115805, 1099817, 1084372, 1068534, 1052705, 1037463, 1021827, 1004578, 986323, 968349, 950361, 931304, 911528, 892290, 873877, 855940, 838813, 822665, 806320, 788870, 771690, 756897, 744474, 732825, 721417, 710904, 701248, 691799, 682815, 674917, 667381, 658851, 649429, 640310, 631715, 622979, 614243, 606131, 598057, 588870, 579059, 570425, 563555, 557388, 551284, 545716, 540752, 535620, 530033, 524456, 518869, 512802, 506746, 501936, 498363, 494400, 488804, 481858, 474233, 465927, 456760, 446920, 436721, 426619, 417465, 409820, 403113, 396512, 390387, 385728, 382287, 378759, 374819, 371520, 369452, 367919, 366319, 365002, 364196, 363227, 361390, 358756, 355735, 352642, 349994, 348336, 347461, 346572, 345420, 344418, 343491, 341937, 339772, 338184, 338039, 338760, 339179, 338752, 337428, 335070, 331802, 328477, 326122]
57984C26122j145o03r93j968k920l340l184k805k445k063j714j595j588j384j173
57969B97202j472k082k076j098J14P77P88K21q88j871j698m74M15K28j33K76R51
57952B89180R12K25m00p33r14r35r43j356j963j767m57Q78J314J472K395L829
57936B90737M681M657M422M526M968N437N360M194K227N21m19j254k580l978m879
57921C18620n498o161o548o436o399o856p181o605n402m304l403k488j771j450
57907B48118j168o75m00n66n22J83Q37O39N8J20R15J778K385K759K731K342K257
57890B61791K895L698L982L906L826L488K713K061J854J410L72k20N30J593J350
57875B95249kr56j098j336j978k286k032j935k373k824k837k543k101j586j335
$$ y = [326122, 324977, 324374, 323381, 321413, 318493, 315153, 311969, 309164, 306719, 304656, 302942, 301347, 299759, 298375, 297202, 295730, 293648, 291572, 290474, 290588, 291365, 292153, 292374, 291486, 289615, 287917, 287443, 287858, 288086, 287953, 288229, 289180, 290092, 290317, 289917, 289184, 288270, 287335, 286392, 285036, 283073, 281306, 280849, 281727, 283041, 284513, 286908, 290737, 295418, 300075, 304497, 309023, 313991, 319428, 324788, 328982, 331209, 331730, 331311, 330057, 327477, 323499, 318620, 313122, 306961, 300413, 293977, 287578, 280722, 273541, 266936, 261534, 257230, 253827, 251339, 249568, 248118, 246950, 246275, 245875, 245309, 244787, 244970, 245807, 246446, 246504, 246624, 247539, 249317, 251702, 254461, 257192, 259534, 261791, 264686, 268384, 272366, 276272, 280098, 283586, 286299, 288360, 290214, 291624, 291996, 291776, 292306, 293899, 295249, 295247, 294291, 293193, 291857, 289879, 287593, 285561, 283626, 281253, 278429, 275592, 273049, 270948, 269362, 268027]
57860B68027j474j273j1J721K646K578K412K483K267J769J805K588L206K900J964
57845B93608R95J26o10j009j086j174j345j334j130j011r65o88j65L61R33J701
57829B87207K244J993J278J082J617K046J751J152R61J298J782J868R54j233m179
57814C01821o975r199j0864j1640j0935q963o908n781n550n562n247m337k968
57801B06892j760j336j574j742j389o88M3O74J065J065P67M14Q6j35O9Q77J915
57784B05243K700L291L916M293L995L360L182L671M307M661M656M149L039J756
57770B56219R49O25K81k67q29j426k168k674k449j794j465j511j274n65R1M40
57754B42183Q23J342J569J320R71P38L54l18r46j230j208r94p53q18j270j509
$$ y = [268027, 266553, 265280, 265269, 266990, 269636, 272214, 274626, 277109, 279376, 281145, 282950, 285538, 288744, 291644, 293608, 294603, 294729, 294119, 293110, 292024, 290850, 289505, 288171, 287041, 286030, 285065, 284377, 284212, 284573, 285506, 287207, 289451, 291444, 292722, 293804, 295421, 297467, 299218, 300370, 301331, 302629, 304411, 306279, 307233, 306000, 301821, 294846, 285647, 274783, 263143, 252208, 243245, 236337, 230556, 225006, 219444, 214197, 209860, 206892, 205132, 203796, 202222, 200480, 199091, 198403, 198446, 199120, 200185, 201250, 202017, 202431, 202517, 202382, 202451, 203328, 205243, 207943, 211234, 215150, 219443, 223438, 226798, 229980, 233651, 237958, 242619, 247275, 251424, 254463, 256219, 257168, 257793, 258074, 257807, 256978, 255552, 253384, 250710, 248261, 246467, 245002, 243491, 242217, 241652, 241743, 242183, 243006, 244348, 245917, 247237, 248208, 248946, 249300, 248982, 248036, 246806, 245598, 244604, 243851, 243033, 241763, 240254]
57738B40254j044m51p00j583j954j514j181j524j968j952j764j706j427o70J52
57723B20968O85J170J672J627P81l3K03J444K773L405L085J992P85K52N34J005
57707B42348J220J387J630J462N95l44n60j42K73N19R23J468J621J110K91m06
57691B53395j163k565m659o461o750n443l689k431j448k89O27P43O95J716L853
57676B26131O033P950J0563J4445J8827K2958K7361L2892L9221M4851M8029M7038
57664E46299M0340K7438R695r940k7875m0880m7242m7640m4458l9825l4642k9331
57652C01939k4508k0471j6891j3591j1007r365q082o580n060l908k987k079j444
57639A75966j308j303j003n11l1N76J229J306O11j2K01P41O42%k88l8k2p08j616
$$ y = [240254, 239210, 238759, 238059, 236476, 234522, 233008, 231827, 230303, 228335, 226383, 224619, 222913, 221486, 220816, 220968, 221653, 222823, 224495, 226122, 226903, 226870, 227073, 228517, 231290, 234695, 237780, 239772, 240557, 240809, 241343, 242348, 243568, 244955, 246585, 248047, 248642, 248298, 247738, 247596, 247869, 248388, 249311, 250779, 252400, 253510, 253801, 253395, 252232, 249667, 245008, 238547, 231797, 226354, 222665, 220234, 218786, 218497, 219124, 219867, 220562, 222278, 226131, 232164, 240114, 250677, 265122, 283949, 306907, 334268, 367160, 406381, 451232, 499261, 546299, 586639, 614077, 623772, 613832, 585957, 545077, 497835, 450195, 405737, 365912, 331270, 301939, 277431, 256960, 240069, 226478, 215471, 206106, 198024, 191444, 186384, 182476, 179489, 177410, 175966, 174658, 173355, 172352, 171841, 171810, 172386, 173615, 174921, 175532, 175520, 175721, 176462, 177104, 177104, 176816, 176778, 176756, 176048, 174432]
57620A74432k024j755j170q38j185k091k845k846k227j558j163j014j007r65o42
57605A51102m0M63O37P03Q83R59O29o5r09j705k089j670p32k02n31j157j490j696
57587A43090k048k198j828j338j114p56R1P34K98q08j343r17k59L4k6m38j270
57570A29904k014j940j216q24j106j254o06L39O70L40R9M33R61J003N02K31Q93
57553A26415K064K548J892J034R74J399J275L76n80j028j018p12k06J61P9j60
57537A34513rM54O17L31O7P1K7k12k68J03N35N65K63J07M02J004J385J072J50
57518A41177o99r44p53n63m21j86L1J75O11J466J938J161l54j135o84o4l30j279
57500A39147k100k472k534k349j959j585j439j537j844k268k440k019j305r64
$$ y = [174432, 172408, 170653, 169483, 168645, 167460, 165369, 162524, 159678, 157451, 155893, 154730, 153716, 152709, 151744, 151102, 151062, 151525, 152162, 152865, 153748, 154707, 155336, 155271, 154362, 152657, 150568, 148898, 148166, 147964, 147433, 146276, 144786, 143090, 141042, 138844, 137016, 135678, 134564, 133808, 133899, 134633, 134931, 134123, 132780, 131863, 131604, 131638, 131612, 131174, 129904, 127890, 125950, 124734, 123910, 122804, 121550, 120944, 121283, 121953, 122293, 122392, 122825, 123786, 124789, 125291, 125522, 126415, 128479, 131027, 132919, 133953, 134927, 136326, 137601, 137977, 137397, 136369, 135351, 134639, 134433, 134594, 134673, 134513, 134504, 134958, 135575, 135906, 135973, 136044, 136071, 135859, 135591, 135694, 136229, 136794, 137057, 137164, 137566, 138570, 139955, 141027, 141177, 140478, 139534, 138781, 138218, 137797, 137611, 137642, 137817, 138428, 139894, 141832, 142993, 142639, 141504, 140820, 140756, 140426, 139147, 137047, 134575, 132041, 129692, 127733, 126148, 124709, 123172, 121328, 119060, 116620, 114601, 113296, 112332]
57486A12332j038q41q0O43P82P15J113J897K387K231J689J180Q92P68N44j4p88
57469A24412j376j618j808k146k363k096j450r01p10o89m69L3M95N15J77L6L90
57452A10432Q35R23R14J252J591J180J87k75K70R73R28L82N5j8k20m69m16k47
57434A18277m19p21l90O80J560J360K65p83j109p97l43j30j68j98J9M43P45N88
57416A18879Rm35j53P73J487J282M62l3J88N74N03P4k26k56k75l79l23Q0N84O74
57396A23489J20p15j178r75l58K74P49R39O79K64N45J879L275L396K348J579J864
57379A38174K352K004J111O36O85N27j92j004j394j393j361j523j817j991j920
57364A32894j931k481l284l340k204q27m32q46p99K47J435J847J677J598J631
$$ y = [112332, 111294, 110453, 110373, 111016, 111798, 112513, 113626, 115523, 117910, 120141, 121830, 123010, 123902, 124670, 125214, 125200, 124412, 123036, 121418, 119610, 117464, 115101, 113005, 111555, 110654, 109944, 109255, 108786, 108819, 109314, 109829, 110006, 110042, 110432, 111267, 112190, 113104, 114356, 115947, 117127, 117314, 117039, 117309, 118282, 119210, 119592, 119647, 119629, 119409, 118940, 118524, 118277, 117858, 117137, 116747, 117427, 118987, 120347, 120612, 119829, 118720, 117923, 117580, 117450, 117282, 117084, 117103, 117546, 118291, 118879, 118888, 118453, 118300, 119073, 120560, 121842, 122304, 122271, 122459, 123033, 123536, 123610, 123384, 123128, 122853, 122474, 122151, 122231, 122815, 123489, 123609, 122894, 121716, 120741, 120383, 120657, 121406, 122345, 123024, 123288, 123833, 125712, 128987, 132383, 134731, 136310, 138174, 140526, 142530, 143641, 144277, 144962, 145489, 145297, 144293, 142899, 141506, 140145, 138622, 136805, 134814, 132894, 130963, 128482, 125198, 121858, 119654, 118827, 118395, 117549, 116750, 116997, 118432, 120279, 121956, 123554, 125185]
57349A25185J284N37K7J69O24P86N48L09L45M29K33j18j31L55Q54P88K03l27m55
57330A31645m01m93o70o77n40n55p21n75J75J040J127K23q57j182o82m3J47j78
57312A26783p37j116r02o9P52Q66L79N4K69O16O80N81N41L85n5n12o68o82p88
57293A26377q07m89q5N1J79P82J581J699R07ol59l72n13o45m30j25l30j067j673
57274A24675j679j333j104j008o96qP71J184J040N29k4m56q00j057j108q98n58
57257A17470k58k8J44J91J17J85O16J130J175O86K65L28N17L12n3J12Q15J249
57239A24973J007P81J385K535L217L053K686K763L116L189K867K584K724L201
57225A60081L576L470K928K380K171K214K213K193K476L084L571L658L756M486
$$ y = [125185, 126469, 127006, 127033, 127202, 127826, 128612, 129160, 129469, 129814, 130243, 130476, 130358, 130227, 130582, 131436, 132224, 132427, 132100, 131645, 131244, 130751, 130081, 129404, 128864, 128309, 127588, 127013, 127188, 128228, 129355, 129578, 128721, 127539, 126857, 126814, 126961, 126783, 126046, 124930, 124028, 123959, 124711, 125577, 125956, 126010, 126279, 126895, 127575, 128156, 128697, 129082, 129027, 128515, 127847, 127165, 126377, 125570, 125081, 124996, 125047, 125226, 126008, 127589, 129288, 130195, 130189, 129830, 129458, 128945, 128300, 127870, 127745, 127415, 126348, 124675, 122996, 121663, 120559, 119551, 118855, 118847, 119618, 120802, 121842, 122371, 122347, 121891, 121091, 120034, 118926, 118028, 117470, 117212, 117184, 117328, 117519, 117636, 117821, 118437, 119567, 120742, 121428, 121693, 122021, 122538, 122850, 122797, 122909, 123724, 124973, 125980, 126761, 128146, 130681, 133898, 136951, 139637, 142400, 145516, 148705, 151572, 154156, 156880, 160081, 163657, 167127, 170055, 172435, 174606, 176820, 179033, 181226, 183702, 186786, 190357, 194015, 197771, 202257]
57211B02257N782O833O968O298N494N140N406O070O701O925O714O374O202O308
57197B89472O750P591Q624R326R451R497J0165J1365J2296J2610J2880J3646J4570
57184D28243J5000J4932J4801J4676J4412J4341J4946J5849J5995J5153J4390
57173E92738J4671J5629J6267J6331J6328J6476J6359J5570J4332J3435J3666
57162G61802J5154J7072J8349J8845J9539K1369K4293K7822L1978L7225M3767
57151A037215N1410O0018O9737Q0791R2772J03586J09266J06249R4790P9435O5316
57140A950585N4602M7014M2403M0936M1345M1159L9412L7951L9564M5523N4982
57129B435476O5693P4986Q1109Q4250Q5849Q6885Q7502Q8130Q9666R2250R5001
$$ y = [202257, 208039, 214872, 221840, 228138, 233632, 238772, 244178, 250248, 256949, 263874, 270588, 276962, 283164, 289472, 296222, 303813, 312437, 321763, 331214, 340711, 350876, 362241, 374537, 387147, 400027, 413673, 428243, 443243, 458175, 472976, 487652, 502064, 516405, 531351, 547200, 563195, 578348, 592738, 607409, 623038, 639305, 655636, 671964, 688440, 704799, 720369, 734701, 748136, 761802, 776956, 794028, 812377, 831222, 850761, 872130, 896423, 924245, 956223, 993448, 1037215, 1088625, 1148643, 1218380, 1299171, 1391943, 1495529, 1604795, 1711044, 1805834, 1885269, 1950585, 2005187, 2052201, 2094604, 2135540, 2176885, 2218044, 2257456, 2295407, 2334971, 2380494, 2435476, 2501169, 2576155, 2657264, 2741514, 2827363, 2914248, 3001750, 3089880, 3179546, 3271796, 3366797]
57118C366797R7409R9908J02607J04716J06055J08133J12628J19432J27156J35117
57108D479958J43980J54841J68516J85613K06805K33404K68050L14370L75244
57099F530781M51821N44622O55043P85202R36706J109764J302338J509108J722009
57090A5547394J933073K136705K328708K503887K655351K774882K852214K874718
57082C5606932K829918K707813K497649K182245J741155J167318M85118k48096
57074D8970052r61402j596265k120973k527702k820687l006857l093166l087708
57066B9755292l001064k846992k642628k407113k158471j910843j674112j455059
57058A1659010j257903j084108r32864q02296o90234n94448n13084m44887l88369
$$ y = [3366797, 3464206, 3564114, 3666721, 3771437, 3877492, 3985625, 4098253, 4217685, 4344841, 4479958, 4623938, 4778779, 4947295, 5132908, 5339713, 5573117, 5841167, 6155537, 6530781, 6982602, 7527224, 8182267, 8967469, 9904175, 11013939, 12316277, 13825385, 15547394, 17480467, 19617172, 21945880, 24449767, 27105118, 29880000, 32732214, 35606932, 38436850, 41144663, 43642312, 45824557, 47565712, 48733030, 49218148, 48970052, 48008650, 46412385, 44291412, 41763710, 38943023, 35936166, 32843000, 29755292, 26754228, 23907236, 21264608, 18857495, 16699024, 14788181, 13114069, 11659010, 10401107, 9316999, 8384135, 7581839, 6891605, 6297157, 5784073, 5339186, 4950817]
57049D950817l40953k99821k63652k32685k06873j84813j64829j46229j29120
57040B981842j13582r9499q6566p3937o0444m5835l1660k0578j5081j6961k7010
57029B390689m3993o3991q1728r3199r7254r5137q9162q1643p4137o7052o0065
57018A543328n3118m6860m2101l8949l6649l4219l1318k8546k6774k6017k5215
57007A153562k3462k1302k0158k0416k0696j9451j6782j4092j2254j0896r357
56996I64696p575n810m126k583j451p71o3J118K636M199N950P996R644R820Q228
56981I91908N394J655l125q678j3892j7684j9820k0607k0321j9260j7875j6371
56969H41324j4509j2152r709p664n934m049j712J042L989O723Q846J0369J1609
$$ y = [4950817, 4609864, 4310043, 4046391, 3813706, 3606833, 3422020, 3257191, 3110962, 2981842, 2868260, 2768761, 2682195, 2608258, 2547814, 2501979, 2470319, 2449741, 2434660, 2417699, 2390689, 2346696, 2282705, 2200977, 2107778, 2010524, 1915387, 1826225, 1744582, 1670445, 1603393, 1543328, 1490210, 1443350, 1401249, 1362300, 1325651, 1291432, 1260114, 1231568, 1204794, 1178777, 1153562, 1130100, 1108798, 1088640, 1068224, 1047528, 1028077, 1011295, 997203, 984949, 974053, 964696, 957121, 951311, 947185, 944602, 943151, 942380, 942317, 943435, 946071, 950270, 956220, 964216, 973860, 983680, 991908, 997302, 998957, 995832, 987154, 973262, 955578, 935758, 915151, 894830, 875570, 857695, 841324, 826815, 814663, 804954, 797290, 791356, 787307, 785595, 786637, 790626, 797349, 806195, 816564, 828173]
56956H28173J2346J1540Q315K981l274r394j4745j8774k1020k1451k0456j8553
56944G35688j6279j4074j1938r431o320k939L14L482O682R676J2333J5060J8181
56931G40435K0969K1961K0097J5220P717j550j1057j8974k4113k6398k6569k5581
56919F92157k4095k2204j9765j7090j4933j3484j1954r686p255n790n515n567
56907E34819n147m199l127k333j980j744j098j27L90K10L31J702L718M957N099
56892E31471N106N707O778Q184J0061J2099J3490J3803J3136J1307P816K872k350
56879F39480o724r843j1587j1874j1027r640p833n358k489K8K136M649P948J1390
56865E89256J4382J7275K0687K4613K8570L1935L3719L2660K8065K0154R603k447
$$ y = [828173, 840519, 852059, 860374, 863355, 860081, 850687, 835942, 817168, 796148, 774697, 754241, 735688, 719409, 705335, 693397, 683966, 677646, 674707, 675021, 678503, 685185, 694861, 707194, 722254, 740435, 761404, 783365, 803462, 818682, 826399, 824849, 813792, 794818, 770705, 744307, 717738, 692157, 668062, 645858, 626093, 609003, 594070, 580586, 568632, 558946, 551691, 545901, 540386, 534819, 529672, 525473, 522346, 520013, 518033, 516289, 515191, 515064, 515454, 515664, 515995, 517697, 521415, 526372, 531471, 536577, 542284, 549062, 557246, 567307, 579406, 592896, 606699, 619835, 631142, 638958, 641830, 639480, 632756, 622913, 611326, 599452, 588425, 578785, 570952, 565594, 563105, 563133, 565269, 569918, 577866, 589256, 603638, 620913, 641600, 666213, 694783, 726718, 760437, 793097, 821162, 841316, 850919, 848472]
56853H48472j3878k2223k6486k7559k6577k3823j9721j5488j1784p670k170L919
56841F55012R013J3102J7771K4072L1566L9319M6712N2950N6673N6349N0603L8419
56829A091561K0102j643k2439l8680m9189n4526n5474n2631m6958l9895l2665
56818G17563k5718j8933j2235n827J38N903J1912J8318K4821L0925L6086L9591
56806H22544M0411L7295K9139J5839p88j7343l0751l9911m5233m7115m5679m1635
56794F76773l6199l0046k3382j7045j2291r065n752j289L474P360J0656J4337
56782E77531J8231K1088K1976K0558J6492R669R79q095j6455k3351k7796k9125
56770E81702k8051k6188k4402k2332j9530j6277j3130j0422q402p308p005o888
$$ y = [848472, 834594, 812371, 785885, 758326, 731749, 707926, 688205, 672717, 660933, 653263, 651093, 655012, 664025, 677127, 694898, 718970, 750536, 789855, 836567, 889517, 946190, 1002539, 1053142, 1091561, 1111663, 1110020, 1087581, 1048901, 999712, 945186, 889712, 837081, 790123, 750228, 717563, 691845, 672912, 660677, 654850, 654988, 660891, 672803, 691121, 715942, 746867, 782953, 822544, 862955, 900250, 929389, 945228, 944440, 927097, 896346, 856435, 811202, 764087, 718408, 676773, 640574, 610528, 587146, 570101, 557810, 548745, 542993, 541704, 545178, 552538, 563194, 577531, 595762, 616850, 638826, 659384, 675876, 685545, 686524, 678429, 661974, 638623, 610827, 581702, 553651, 527463, 503061, 480729, 461199, 444922, 431792, 421370, 412968, 405660, 398655, 391767]
56758C91767o405n501m570m068m054m043l509k623k034j832j396o04l28j076j951
56743C47773j897j356j510k336k597j682l04O51R47N82l89j390j577q77q0L43
56727C34301P17J256J539J284R42J047J478J781J779J482Q07j84j085j496j363
56712C44285q75k76J02k3n42j025j196j080o89k0O27P86M01j07m70q02j139j232
56694C36725j044r46j191j548j685j640j605j498j071l48K61K94k55q12p06P8
56678C23009Q53J089R39P11K86m10q51n98k30o72j710k191j726j204j306j479
56662C14510r91j67J34k08n46m36oM58Q07R03O63K01k30m95o72r23j305j605j441
56643C08651p22J09N34N72N73N99M26J75K41O34Q54O17K04o0j78j79K7L17L97
$$ y = [391767, 385362, 379861, 375291, 371223, 367169, 363126, 359617, 356994, 354960, 353128, 351732, 351128, 350800, 349724, 347773, 345876, 344520, 343010, 340674, 338077, 336395, 336091, 336742, 337689, 338271, 337882, 336492, 334915, 334038, 333958, 334301, 335018, 336274, 337813, 339097, 340039, 341086, 342564, 344345, 346124, 347606, 348413, 348229, 347144, 345648, 344285, 343410, 343134, 343236, 343213, 342671, 341646, 340450, 339370, 338681, 338661, 339288, 340074, 340475, 340368, 339898, 339096, 337957, 336725, 335681, 334735, 333544, 331996, 330311, 328671, 327066, 325568, 324497, 324149, 324410, 324704, 324449, 323637, 322931, 323009, 323862, 324951, 325890, 326601, 326887, 326477, 325626, 325028, 324798, 324126, 322416, 320225, 318499, 317295, 315989, 314510, 313519, 313352, 313486, 313278, 312732, 312296, 312290, 312748, 313555, 314458, 315121, 315322, 315092, 314597, 313925, 313002, 311697, 310092, 308651, 307929, 308038, 308572, 309144, 309717, 310316, 310742, 310917, 311158, 311792, 312646, 313263, 313467, 313407, 313229, 313050, 313077, 313394, 313791]
56624C13791L17M29O47L54n97j454j561j209j043j078r39o73o55q74r63q21p19
56607C02952q05r36r71r08q10q59j242j717j559m62P30Q48k7n61O5J080J214M54
56589B96486r6J66N82L31l62o49k94J19J60P6K13M00K66k03p21j062j062o25J4
56570B93739L10J31J07P86J755K177K005K021K751L964N227O346P167P480P216
56555C43182O319M490J661j325l178l507l095k750k550k418k656l366l880l421
56541C23506k105q95o54j377k254k303j309j04L50J10l2J62Q4n32j011p72k49
56524C10615j62m10l65R4N28O14L13m06j397k047j785q97k99m57r82j303j339
56507C00315j317j284j088o81k65j09k68m83l52L48J461K458K694J885N25m10
$$ y = [313791, 314108, 314537, 315184, 315538, 314941, 313487, 311926, 310717, 309674, 308596, 307657, 306984, 306329, 305455, 304492, 303671, 302952, 302147, 301211, 300240, 299332, 298522, 297663, 296421, 294704, 293145, 292683, 293413, 294261, 294234, 293673, 293738, 294818, 296032, 296486, 296390, 296556, 297138, 297469, 297107, 296458, 296164, 296283, 296443, 296519, 296732, 297132, 297398, 297195, 296474, 295412, 294350, 293725, 293739, 294049, 294180, 294287, 295073, 296828, 299005, 301010, 303031, 305782, 309746, 314973, 321319, 328486, 335966, 343182, 349501, 353991, 355652, 354327, 351149, 347642, 344547, 341797, 339247, 336829, 334173, 330807, 326927, 323506, 321401, 320506, 319852, 318475, 316221, 313918, 312609, 312505, 312855, 312965, 312933, 313095, 313179, 312647, 311636, 310864, 310615, 310453, 310043, 309678, 309772, 310300, 310914, 311227, 310821, 309424, 307377, 305592, 304695, 304396, 303939, 302957, 301654, 300315, 298998, 297714, 296626, 295945, 295680, 295571, 295303, 294820, 294468, 294816, 296277, 298735, 301429, 303314, 303839, 303429]
56491C03429m01O2J41k89o25m27O3L42J39m71j111j250p16lL07L03M64P87Q33
56472C01577O04N88Q38P33m4r40j250r08k95J80J70m13j074j191r11r18j174q19
56454B94753L30J111N79o06j086n15L78R85J234J128O78J07l66p95j130r92l00
56437B95493K72J00n15q36p24n83n57m76l85m44n11l38LL57Q60J534J858J433
56419B96541P39M94N80L46k26n70n76o90r63r03m18j9J03M01J037J437J217Q34
56401B99364P83P71K99k90j81O68J391J399J108J172J449J272N37k8J45O70P82
56384C11311L81K5K7J70L00O42J226J560J234M91r4k63j25J73M66N89O44R71J609
56365C21337K019J687P93o0m72l58K33J030J459J102K23m55m04L45J327J910J739
$$ y = [303429, 303028, 303090, 303231, 302942, 302317, 301890, 301953, 302295, 302434, 301963, 300852, 299602, 298886, 298883, 299190, 299493, 299957, 300744, 301577, 302181, 302769, 303607, 304340, 304296, 303356, 302106, 301198, 300903, 301083, 301253, 300840, 299766, 298575, 297664, 296746, 295572, 294753, 295083, 296194, 296773, 296167, 295081, 294566, 294944, 295929, 297163, 298291, 298969, 299076, 298710, 297915, 296785, 295793, 295493, 295765, 295865, 295350, 294514, 293790, 293207, 292650, 292174, 291789, 291345, 290834, 290496, 290499, 290856, 291716, 293250, 295108, 296541, 297280, 297774, 298354, 298700, 298474, 297904, 297328, 296638, 295675, 294772, 294354, 294335, 294438, 294839, 295876, 297313, 298530, 299364, 300147, 300918, 301217, 300927, 300746, 301414, 302805, 304204, 305312, 306484, 307933, 309205, 309742, 309714, 309859, 310529, 311311, 311692, 311717, 311744, 311914, 312214, 312856, 314082, 315642, 316876, 317367, 317273, 317010, 316885, 317058, 317524, 318113, 318757, 319728, 321337, 323356, 325043, 325836, 325776, 325304, 324946, 325179, 326209, 327668, 328770, 328993, 328538, 328134, 328479, 329806, 331716, 333455]
56348C33455J111O63O34O14K36k94m95r7Q42J916K387J748N10j23L93J438K213
56331C47151K598K695K341J589J088J339K028K539K678K433J687O64L5k7k47j079
56315C69512j750j360k58N45P91Q85Q46L85j74j24N78J364K001K661L217L290
56299C82409L023K954L183L322L246L150K985K566K181K342K924L290L272L336
56285D24183L744M210M445M461M287L946L739M028M727N433O031O731P611Q524
56271D96100R383J0096J0464J0473J0557J1129J2130J3363J4853J6487J7844J8890
56259F51769K0305K2586K5374K8286L1670L5776L9951M3711M7890N3513N9985
56248A060816O5731P0293P4530P8895Q2814Q5722Q7492Q7718Q5688Q1254P4869
$$ y = [333455, 334566, 335229, 335863, 336477, 336713, 336419, 335924, 335827, 336669, 338585, 340972, 342720, 343230, 343107, 343500, 344938, 347151, 349749, 352444, 354785, 356374, 357462, 358801, 360829, 363368, 366046, 368479, 370166, 370830, 370865, 370838, 370591, 369512, 367762, 366402, 366144, 366689, 367480, 368365, 369211, 369596, 369422, 369298, 369876, 371240, 373241, 375902, 379119, 382409, 385432, 388386, 391569, 394891, 398137, 401287, 404272, 406838, 409019, 411361, 414285, 417575, 420847, 424183, 427927, 432137, 436582, 441043, 445330, 449276, 453015, 457043, 461770, 467203, 473234, 479965, 487576, 496100, 505483, 515579, 526043, 536516, 547073, 558202, 570332, 583695, 598548, 615035, 632879, 651769, 672074, 694660, 720034, 748320, 779990, 815766, 855717, 899428, 947318, 1000831, 1060816, 1126547, 1196840, 1271370, 1350265, 1433079, 1518801, 1606293, 1694011, 1779699, 1860953, 1935822]
56237A935822O6731N6638M4682L1320J6988K409j1113k2783l3317m3779n3686
56226A989912o1496o6673o9936p1729p1934p1076p0216o9433o7766o4895o1606
56215A243152n8379n4857n0967m7289m3972m0555l7118l4354l2214k9784k6858
56204G86805k4259k2252k0017j7285j5006j3787j2849j1396r876r020q591p965
56192F14502p156o451n700m618l334k168j321r73j132j298j000o23q17j189o87
56177E76035P14J931K460K824L218L116K612K664L485M028L681L227L546M509
56163F18050N659O907P945Q173P715P527Q086R016J0237J2061J4014J5092J5698
56150G46180J7651K1646K6356L0796L5864M2605N0467N8354O5948P2936P8164
$$ y = [1935822, 2002553, 2059191, 2103873, 2135193, 2152181, 2154590, 2143477, 2120694, 2087377, 2043598, 1989912, 1928416, 1861743, 1791807, 1720078, 1648144, 1577068, 1506852, 1437419, 1369653, 1304758, 1243152, 1184773, 1129916, 1078949, 1031660, 987688, 947133, 910015, 875661, 843447, 813663, 786805, 762546, 740294, 720277, 702992, 687986, 674199, 661350, 649954, 640078, 631058, 622467, 614502, 607346, 600895, 595195, 590577, 587243, 585075, 583754, 582781, 581649, 580351, 579351, 578728, 577911, 576722, 576035, 576749, 578680, 581140, 583964, 587182, 590298, 592910, 595574, 599059, 603087, 606768, 609995, 613541, 618050, 623709, 630616, 638561, 646734, 654449, 661976, 670062, 679078, 689315, 701376, 715390, 730482, 746180, 763831, 785477, 811833, 842629, 878493, 921098, 971565, 1029919, 1095867, 1168803, 1246967]
56139A246967Q0609Q0025P6010O7953N6909M6016L7931L2969L0388K9677K9552
56128A815006K7664K2921J6780J0859M947j341o738j0222j3389j8881k7340l7613
56116A782653m8785o0080o9661p5570p7467p6004p1300o3586n4505m5980l8415
56105A101300l1468k5727k1899j9077j5748j2109r566q283o905m624j999K41J924
56092I46060L019L518L658L591L270L168M220O297P831P911P614Q190R159R564
56078A027070R810J0689J1744J2182J2433J3141J3643J3147J2542J3156J4508
56067A164065J5083J4716J4497J4888J5545J6389J7369J7781J7283J6907J7596
56056A342119J8636J8913J8789J9191J9885K0201K0428K0946K1107K0582K0588
$$ y = [1246967, 1327576, 1407601, 1483611, 1551564, 1608473, 1654489, 1692420, 1725389, 1755777, 1785454, 1815006, 1842670, 1865591, 1882371, 1893230, 1898177, 1896836, 1890098, 1879876, 1866487, 1847606, 1820266, 1782653, 1733868, 1673788, 1604127, 1528557, 1451090, 1375086, 1303786, 1240200, 1185695, 1139715, 1101300, 1069832, 1044105, 1022206, 1003129, 987381, 975272, 965706, 957423, 950518, 945894, 943895, 944136, 946060, 949079, 952597, 956255, 959846, 963116, 966284, 970504, 976801, 984632, 992543, 1000157, 1008347, 1017506, 1027070, 1036880, 1047569, 1059313, 1071495, 1083928, 1097069, 1110712, 1123859, 1136401, 1149557, 1164065, 1179148, 1193864, 1208361, 1223249, 1238794, 1255183, 1272552, 1290333, 1307616, 1324523, 1342119, 1360755, 1379668, 1398457, 1417648, 1437533, 1457734, 1478162, 1499108, 1520215, 1540797, 1561385]
56045A561385K1970K3471K3771K3855K5292K7537K9249L0810L3095L5064L5282
56034A870781L4701L5185L6285L6246L5330L5327L6439L7508L8639M0820M3519
56023B280780M5364M6699M8875N1662N3927N6089N9224O2592O4834O6723O9853
56012B906622P3541P6163P8505Q2569Q7840R2172R5590R9768J04523J08410J12171
56001C917874J17909J25321J32373J39118J47242J56470J65240J74289J85636
55992E261472J98732K11600K25038K41459K60300K78967K97594L18434L41397
55983G634993L65032L90966M22199M57872M95109N35137N81840O35083O91751
55974A2209982P52728Q22493R02450R91437J092210J210389J347754J504335J686529
$$ y = [1561385, 1583355, 1606826, 1630597, 1654452, 1679744, 1707281, 1736530, 1767340, 1800435, 1835499, 1870781, 1905482, 1940667, 1976952, 2013198, 2048528, 2083855, 2120294, 2157802, 2196441, 2237261, 2280780, 2326144, 2372843, 2421718, 2473380, 2527307, 2583396, 2642620, 2705212, 2770046, 2836769, 2906622, 2980163, 3056326, 3134831, 3217400, 3305240, 3397412, 3493002, 3592770, 3697293, 3805703, 3917874, 4035783, 4161104, 4293477, 4432595, 4579837, 4736307, 4901547, 5075836, 5261472, 5460204, 5671804, 5896842, 6138301, 6398601, 6677568, 6975162, 7293596, 7634993, 8000025, 8390991, 8813190, 9271062, 9766171, 10301308, 10883148, 11518231, 12209982, 12962710, 13785203, 14687653, 15679090, 16771300, 17981689, 19329443, 20833778, 22520307]
55965B2520307J905335K167858K480000K857097L322839L899755M612157N496116
55957D9261464O591323P922071R500731J1351877J3520767J6061953J9032955
55950A33243141K2469133K6279321L0086569L3144450L4419984L2816480K7497196
55943C39956274J8303888O128968p100707j9040679k7855180l2827393l4300941
55936B43264230l3177027l0431642k6879687k3115895j9518026j6284536j3495795
55929H0361622j1161727r244474p680695o408945n379684m546830l865960l304271
55921B8769036k841928k461230k142777j872847j645009j452319j285337j138944
55913A3928645j013488r07313q14514p31423o58996n97228n42844m93938m51644
$$ y = [22520307, 24425642, 26593500, 29073500, 31930597, 35253436, 39153191, 43765348, 49261464, 55852787, 63774858, 73275589, 84627466, 98148233, 114210186, 133243141, 155712274, 181991595, 212078164, 245222614, 279642598, 312459078, 339956274, 358260162, 364389130, 357288423, 338247744, 310392564, 277565171, 243264230, 210087203, 179655561, 152775874, 129659979, 110141953, 93857417, 80361622, 69199895, 59955421, 52274726, 45865781, 40486097, 35939267, 32073307, 28769036, 25927108, 23465878, 21323101, 19450254, 17805245, 16352926, 15067589, 13928645, 12915157, 12007844, 11193330, 10461907, 9802911, 9205683, 8662839, 8168901, 7717257]
55904G717257m15743l83413l53535l27751l06026k85517k64948k46156k30102
55895D904066k15110k00134j86284j74095j62509j51470j42535j36149j31139
55886C404641j27218j25032j23355j19438j12771j05576r9097r2328q4949p8437
55876B336440p3405o8649o3804o0331n8960n8500n7991n7769n7563n5862n2153
55865A671453m7941m4602m1978l9725l8330l8041l8268l8591l8985l8849l7336
55854A228807l4787l2298k9868k6645k3031k0604j9807j9559j9299j9515k0036
55843I63358j9784j8716j8109j8397j8444j7568j6622j6450j6673j6604j6122
55832G69869j5196j3701j2102j1142j0671r892q813q178q039p779p518q051r291
$$ y = [7717257, 7301514, 6918101, 6564566, 6236815, 5930789, 5645272, 5380324, 5134168, 4904066, 4688956, 4488822, 4302538, 4128443, 3965934, 3814464, 3671929, 3535780, 3404641, 3277423, 3152391, 3029036, 2909598, 2796827, 2691251, 2592154, 2499826, 2414877, 2336440, 2263035, 2194386, 2130582, 2070251, 2011291, 1952791, 1894800, 1837031, 1779468, 1723606, 1671453, 1623512, 1578910, 1536932, 1497207, 1458877, 1420836, 1382568, 1343977, 1304992, 1266143, 1228807, 1194020, 1161722, 1131854, 1105209, 1082178, 1061574, 1041767, 1022208, 1002909, 983394, 963358, 943574, 924858, 906749, 888352, 869908, 852340, 835718, 819268, 802595, 785991, 769869, 754673, 740972, 728870, 717728, 707057, 697165, 688352, 680174, 672135, 664356, 656838, 648787, 639496]
55819F39496j0249j0632j1025j1423j1112j0142r394r028q318p165o221n507m384
55806E24896l028k374k386j975p66N48J693L000M047L912L006K807L492L727L184
55791E43783L243M541N806O048O049O665P154O327L987K72n009j1273j6593j9387
55777E41613j9823j8780j6414j2670q171l694M89M005N926N488K679k191q441
55764D70016j4262j7363j7076j4921j2601j0506q600p303o699o058n030m364m670
55751C40563n502o341p340q402q615p622o401n838n464m562l581l341l662l821
55737B60071l725l643l390k738k053j745j621j391j298j553j883k154k685l375
55723B26817l436k701k152k336k306j207R9K47n35q54j66R02J835K610L042K851
$$ y = [639496, 629247, 618615, 607590, 596167, 585055, 574913, 565519, 556491, 548173, 541008, 534787, 529280, 524896, 521868, 519494, 517108, 515133, 514367, 514915, 516608, 519608, 523655, 527567, 530573, 533380, 536872, 540599, 543783, 547026, 551567, 557373, 563421, 569470, 576135, 583289, 589616, 593603, 593875, 588866, 577593, 561000, 541613, 521790, 503010, 486596, 473926, 465755, 462061, 462550, 466555, 472481, 477969, 480648, 478457, 470016, 455754, 438391, 421315, 406394, 393793, 383287, 374687, 367384, 360685, 354627, 349597, 345233, 340563, 335061, 328720, 321380, 312978, 304363, 296741, 290340, 284502, 279038, 274476, 270895, 267554, 263892, 260071, 256346, 252703, 249313, 246575, 244522, 242777, 241156, 239765, 238467, 236914, 235031, 232877, 230192, 226817, 223381, 220680, 218528, 216192, 213886, 212679, 212778, 213025, 212490, 211636, 211470, 212372, 214207, 216817, 219859, 222710]
55707B22710K216J433L25j187k328k344j829k022k981l599l392l159l592m148
55693A96103l825k476r57k33n05j082j117n46o1n1j4O15J518J913J602J096Q95
55676A92875J063J328J254N79l38o93k49K65J38m15p22o35m26j23M04R36J122
55659A96363J062J185J620K045K074J546O45q2j24L71P21O33M61L88P8m79o34
55642B07873j59Q1o46j677j881j370j221j774k311k451k727l546m422m731m636
55627A74402m701m963m846m005k832j972j537j109n64l94q64j338j122o33q89
55612A42633j869k456k159j793k053k458k354k016j992k104j953j725j666j374
55598A14661m99L95N05o1o88j211j642j433j44J487K227J930J416J047M97j23
$$ y = [222710, 224926, 226359, 226684, 225497, 223169, 220825, 218996, 216974, 213993, 210394, 207002, 203843, 200251, 196103, 192278, 189802, 188845, 188612, 188107, 187025, 185908, 185362, 185301, 185250, 185236, 185851, 187369, 189282, 190884, 191980, 192875, 193938, 195266, 196520, 197099, 196761, 196068, 195819, 196084, 196222, 195807, 195085, 194450, 194024, 193901, 194305, 195241, 196363, 197425, 198610, 200230, 202275, 204349, 205895, 206540, 206458, 206334, 206705, 207426, 208059, 208520, 208908, 208986, 208507, 207873, 207714, 207795, 207149, 205472, 203591, 202221, 201000, 199226, 196915, 194464, 191737, 188191, 183769, 179038, 174402, 169701, 164738, 159892, 155887, 153055, 151083, 149546, 148437, 147873, 147479, 146615, 145277, 144155, 143522, 142633, 140764, 138308, 136149, 134356, 132303, 129845, 127491, 125475, 123483, 121379, 119426, 117701, 116035, 114661, 114162, 114557, 115062, 115001, 114313, 113102, 111460, 110027, 109883, 111370, 113597, 115527, 116943, 117990, 118487, 118364]
55582A18364o8Q11J708J991J961K152K566K972L402M027M862N798O564O718N991
55567A69819M689L260J670m17k776m610n384n238m605l939l735m215m864m839
55553A34816l974k932k314k051j837j633j545j450j081l52N05J091J154Q63O03
55538A19863M73K58m6j26L6l3m42m82L67J456J673Q96l1n81j037j723k423k699
55520A15399k328j427m41J4k49p85j186j650k420l060k965k294j671j237p15k33
55504I2752k44o96j031j022r09p79n00k17j72j44K22N98L74k25l36J88N21J49
55486H8529m89q35q56n96L1P32Q67L98R6M52J037J236R78M62j66n49l33R4j88
55467I0900j276k067j744q47l12j25K60Q16R97O65K22L4J96O30R90P95O9n03n04
$$ y = [118364, 118296, 119107, 120815, 122806, 124767, 126919, 129485, 132457, 135859, 139886, 144748, 150546, 157110, 163828, 169819, 174508, 177768, 179438, 179021, 176245, 171635, 166251, 161013, 156408, 152469, 148734, 144519, 139655, 134816, 130842, 127910, 125596, 123545, 121708, 120075, 118530, 117080, 115999, 115647, 116152, 117243, 118397, 119260, 119863, 120336, 120594, 120548, 120422, 120458, 120425, 119983, 119501, 119868, 121324, 122997, 123893, 123862, 123281, 122244, 120521, 118098, 115399, 113071, 111644, 111203, 111217, 110968, 110183, 108997, 107347, 104927, 101867, 98902, 96608, 94937, 93700, 92985, 92752, 92508, 91812, 90781, 89759, 88850, 88071, 87571, 87354, 87182, 87038, 87260, 87858, 88232, 88007, 87671, 87859, 88380, 88529, 88040, 87205, 86349, 85753, 85784, 86516, 87383, 87781, 87877, 88329, 89366, 90602, 91580, 92042, 91876, 91327, 90994, 91088, 90900, 89624, 87557, 85813, 84966, 84654, 84529, 84789, 85605, 86602, 87267, 87489, 87523, 87719, 88349, 89339, 90134, 90203, 89700, 89196]
55448H9196m71j054j875j904q26N56J298J116K87p83j644j864j236k3J120J574
55432H3467J306Q70P05N68Q2m22k48M76P65J69n75p04m67l97k80L87J292J573
55414H8567J048M15K14K19q1q01j609k006j608m82Q13J658J784J242K16q78j466
55397H7245j360r16m48K01J044J423P83k68n73k9K02o45j802j975r77J95O45M13
55379H3158K1k14k78j41K04M94L20k94p55n80%L61L50L13L68J83l47o99l39N34
55359H2659J256J478J341J095Q19N26K91K61N15Q73Q49J72o68q15j37N46N65K33
55341I1859K10M42K87n34j566k104j710n05P56J110L38p26j160r60o56l67J25
55324H4839N79M49j78n64m07k50n57r38p39K8P83J096R96P37N54N35N20K24m05
$$ y = [89196, 88725, 87671, 85796, 83892, 83066, 83622, 84920, 86036, 86323, 85540, 83896, 82032, 80796, 80773, 81893, 83467, 84773, 85643, 86348, 86916, 86998, 86576, 86328, 86804, 87569, 87738, 87163, 86459, 85992, 85595, 85315, 85702, 86994, 88567, 89615, 90030, 90244, 90463, 90382, 89581, 87972, 85966, 84358, 83876, 84689, 86347, 88131, 89373, 89589, 88711, 87245, 85885, 84969, 84521, 84722, 85766, 87189, 87972, 87704, 87131, 87102, 87304, 86659, 84857, 82882, 81905, 82100, 82745, 83158, 83179, 82965, 82687, 82546, 82750, 83244, 83564, 83270, 82515, 81935, 81935, 82296, 82646, 82959, 83327, 83510, 83163, 82464, 82125, 82659, 83915, 85393, 86734, 87829, 88648, 89174, 89465, 89726, 90241, 91114, 91963, 92135, 91467, 90652, 90515, 91061, 91626, 91859, 92069, 92511, 92798, 92264, 90698, 88594, 86884, 86379, 87135, 88245, 88583, 87857, 86697, 85737, 85081, 84714, 84839, 85418, 85867, 85689, 85125, 84718, 84468, 83911, 82973, 82234, 82262, 83045, 84141, 85137, 85874, 86428, 86963, 87483, 87707, 87302]
55305H7302j042j327j211q59m38r5L3m7j45j23q2j87l85m20j21L77O69M59n3l09
55285H1996l4L96M77K75K62N05N61K16j29j11J1k23p40j040q94n35k23j1J16J44
55265H1019J65L22N48N82L23p7m73q45j065q60j82N85J016J087J028R03O42L65
55247H5083K99L50J97j86m02l05l32q61j514j512o79L88J106J366J167M19o15
55230H3969j131o14L60P29L18J1M18R69P87J9l39J38P22O05r9p18j004j181j245
55211H2714r06k08L78N89O62P80P09K37l65p00p27n65j87L38O39N22M00O76R72
55192H5958N80m41j250j232m85N89J539J747R15k29n41oJ75n43j080l60R21J170
55174H7427J16q99p89J42R88J272R86K87m26p17p09r91j634j827r78L01R36Q21
$$ y = [87302, 86260, 84933, 83722, 82863, 82425, 82330, 82363, 82316, 82171, 82048, 81966, 81779, 81394, 80974, 80853, 81230, 81899, 82358, 82305, 81996, 81962, 82358, 82835, 83110, 83372, 83877, 84438, 84654, 84525, 84414, 84425, 84202, 83462, 82422, 81528, 80993, 80770, 80759, 80875, 81019, 81184, 81506, 82054, 82636, 82959, 82882, 82409, 81564, 80499, 79639, 79457, 80042, 81058, 82145, 83173, 84076, 84718, 85083, 85382, 85732, 85929, 85743, 85341, 85036, 84704, 83843, 82329, 80817, 80138, 80526, 81632, 82998, 84165, 84584, 83969, 82838, 82224, 82584, 83313, 83631, 83642, 84060, 85029, 85816, 85835, 85496, 85634, 86356, 86961, 86862, 86144, 85140, 83959, 82714, 81808, 81600, 81978, 82567, 83229, 84009, 84718, 84955, 84590, 83890, 83163, 82598, 82411, 82749, 83388, 83910, 84310, 84986, 85958, 86538, 86097, 84847, 83615, 83130, 83719, 85258, 87005, 87920, 87691, 87150, 87144, 87319, 86776, 85696, 85336, 86257, 87427, 87543, 86644, 85855, 85997, 86985, 88257, 89243, 89530, 89104, 88387, 87678, 86687, 85053, 83226, 82248, 82549, 83485, 84306]
55156H4306P90J273J707J504Q85L24k35j022j640j432n48R5Q1o0J19K41r2m49
55138H5847k59J22m9o24p55l08l7k15j30O63J495J554J060P28O71M86O5l14m77
55119H9523l93j0M87N53Nn20l56K54O23O79P79P60J09r83j640j429p32Q0R51J514
55099I0254J165J21m31J51J041J110M08k23m41n10n26l54j76l12n56l74J83M64
55081I0994J63k67l37r0K44N85Q12O52J28k38l6N39R64R83O62K15jK85P65O24
55061I7646m41j679k136j782j230p13p5M39K45n76j177j025m61J10P60J421J483
55044I0809O73k53m03K1J30l23p29o64l08N7L79N20K37l85r08j053q89n17K1N69
55024H6984R58J278J588J545Q24j21l87J93Q17P66J51n28r72j021o19j00j8l56
$$ y = [84306, 85096, 86369, 88076, 89580, 90465, 90789, 90554, 89532, 87892, 86460, 85912, 86007, 86088, 86028, 86147, 86388, 86296, 85847, 85588, 85710, 85661, 85037, 84282, 83974, 83937, 83722, 83592, 84255, 85750, 87304, 88364, 89092, 89763, 90249, 90314, 90000, 89523, 89130, 89120, 89607, 90160, 90165, 89645, 89289, 89543, 90166, 90845, 91624, 92384, 92493, 91510, 89870, 88441, 87709, 87789, 88740, 90254, 91419, 91540, 91109, 91260, 92301, 93411, 93819, 93596, 93155, 92645, 92119, 91765, 91589, 91277, 90721, 90347, 90530, 90994, 91157, 90890, 90553, 90463, 90707, 91292, 92104, 92756, 92884, 92646, 92610, 93149, 94113, 95096, 95758, 95973, 95972, 96257, 97022, 97646, 97205, 95526, 93390, 91608, 90378, 89665, 89590, 90029, 90274, 89698, 88521, 87496, 87035, 87145, 87905, 89326, 90809, 91482, 91229, 90826, 90847, 90977, 90654, 89925, 89261, 88953, 89010, 89389, 89909, 90146, 89761, 88853, 87800, 86911, 86394, 86415, 86984, 87942, 89220, 90808, 92353, 93177, 93056, 92669, 92862, 93679, 94445, 94596, 94068, 93096, 92075, 91456, 91356, 91338, 90982]
55006I0982m72JO33Q71P09M23J08k22m48n09m08j5O33Q66K7j317j714p43M19P35
54986I0559O31Q80J241J154R07R83R51K14o41n45L50R28Q26O74O85L99j07n0O82
54967A00721J113O04k63o93p02o51n81m97n95p27k50R53J937J746N82n70j139
54950A00988j259j190j023p74m47l3L35M46L47L15L57J98j14q3M03O51O7r23j400
54931I6861j140o58k59L13J178J824J674R29M88J027K260L255L407L031K844L140
54915A20174L620L915L995M083M359M751M800L920K000l18k228l501m400n021
54901A40149n193m863m191l303k404j928k082k288j781p04K9Ol11n20q12j239
54885A08565j252n23M37R56J062J118J109Q54O29R33J800K771L440L747L870M118
$$ y = [90982, 90510, 90511, 91144, 92015, 92724, 93147, 93255, 93033, 92585, 92076, 91668, 91653, 92286, 93152, 93179, 91862, 90148, 89405, 89824, 90559, 91190, 92070, 93311, 94465, 95372, 96355, 97306, 97520, 96879, 96334, 96684, 97612, 98438, 99112, 99797, 100196, 100089, 100039, 100721, 101834, 102438, 102175, 101482, 100780, 100129, 99548, 99051, 98456, 97729, 97479, 98432, 100369, 102115, 102697, 102127, 100988, 99729, 98539, 97516, 96742, 96295, 96262, 96597, 97043, 97390, 97705, 98062, 98260, 98146, 98063, 98466, 99117, 99184, 98261, 96861, 95721, 95063, 94804, 95117, 96295, 98119, 99793, 100722, 101210, 102237, 104497, 107752, 111159, 114190, 117034, 120174, 123794, 127709, 131704, 135787, 140146, 144897, 149697, 153617, 155617, 155299, 153071, 149570, 145170, 140149, 134956, 130093, 125902, 122599, 120195, 118267, 116185, 113897, 112116, 111412, 111441, 111447, 111136, 110616, 109804, 108565, 107313, 106790, 107227, 108183, 109245, 110363, 111472, 112326, 112955, 113888, 115688, 118459, 121899, 125646, 129516, 133634]
54869A33634M648N094M768L472J779K58j142k620l880m479m473m209l746l022
54855A26082k311k012k034j968j786j871k345k788k762k325j897j788j858j695
54841I6642j150o31o08q84q56n10m97r59j033q8J130J376N48l14l88K52J131J703
54823I4864J388J17j091r65L90J450J150J27l35M3N24M91J9n58j002j106p08O
54805I4804N29N57L88N80J210J655J265J71p90r59m74J05M47O12P82J100J596
54788A03578J978J677M21j210k186k014j151m18k26l98n15k66L70J193J912K272
54772A05017K125J592J099J034J301J435J239J050J259J791K281K571K857L500
54758A30151M677N939O192M638J901l69j325j777k810m199m918m720m339m299
$$ y = [133634, 138282, 143376, 148144, 151616, 153395, 153653, 152511, 149891, 146011, 141532, 137059, 132850, 129104, 126082, 123771, 121759, 119725, 117757, 115971, 114100, 111755, 108967, 106205, 103880, 101983, 100195, 98337, 96642, 95492, 94861, 94253, 93369, 92513, 92003, 91506, 90547, 89514, 89426, 90556, 91932, 92480, 92166, 91778, 92030, 93161, 94864, 96252, 96369, 95278, 94313, 94703, 96153, 97303, 97430, 97095, 97138, 97662, 98153, 98172, 97614, 96612, 95506, 94798, 94804, 95333, 95890, 96278, 96858, 98068, 99723, 100988, 101159, 100369, 99410, 98936, 99041, 99488, 100100, 100882, 101982, 103578, 105556, 107233, 107654, 106444, 104258, 102244, 101093, 100675, 100449, 100051, 99536, 99270, 99640, 100833, 102745, 105017, 107142, 108734, 109833, 110867, 112168, 113603, 114842, 115892, 117151, 118942, 121223, 123794, 126651, 130151, 134828, 140767, 146959, 151597, 153498, 153129, 151804, 150027, 147217, 143018, 138100, 133380, 129041, 124742]
54744A24742m370m152l512k440j153l57o27j478j758j093l13j71l70k06L84R14
54728A04040J073R42P84R11J480K156K308J829J430J822K845L739M054L981L924
54713A37318M041M091L561K120J01j651k650l255m042m911n208m614l581k808
54699A18512k551k514k260j641q98l61q0J10K31J01k86n96n68m48o22r59r24l97
54681A03849L6j48o41p35l56j78o02j111r88l05K79M76N45N83L25j84l82k2K64
54662A00705j59r21j064l37N14P24K69l40o43n52l23k81l94l26n2j18q28j507
54644I4367j201j2R12Q30J94j24J16N25P53P78P72Q57Q91N72r3n43k40O06J267
54625A01227J359J031M03n37j416j559q54mL07P6k94m89k91L64J055J153O73L07
$$ y = [124742, 120372, 116220, 112708, 110268, 109115, 108758, 108131, 106653, 104895, 103802, 103489, 103318, 102948, 102742, 103126, 104040, 105113, 106055, 106839, 107750, 109230, 111386, 113694, 115523, 116953, 118775, 121620, 125359, 129413, 133394, 137318, 141359, 145450, 149011, 151131, 151232, 149581, 146931, 143676, 139634, 134723, 129515, 124901, 121320, 118512, 115961, 113447, 111187, 109546, 108648, 108287, 108207, 108317, 108548, 108649, 108363, 107767, 107199, 106751, 106129, 105170, 104246, 103849, 103885, 103737, 103096, 102361, 102005, 101827, 101225, 100114, 99126, 98821, 99100, 99576, 100121, 100704, 101029, 100845, 100463, 100441, 100705, 100546, 99625, 98561, 98224, 98738, 99462, 99731, 99391, 98748, 98196, 97873, 97592, 97198, 96872, 96820, 96702, 95874, 94367, 93166, 93154, 94066, 94896, 95090, 94966, 95082, 95607, 96360, 97138, 97910, 98767, 99658, 100230, 100137, 99594, 99354, 99960, 101227, 102586, 103617, 104020, 103483, 102067, 100508, 99654, 99650, 99957, 100033, 99739, 99250, 98959, 99323, 100378, 101531, 102204, 102511]
54607A02511M06M96J74j75r2J23n9m57m61qL27J12n73j383j846j494l84P03J030
54588I8950P48M83L99K15j8J13N51O85J80n66r96r64o26j56J83J37j52j31M69
54569I9504J197J401J009N36L94M45K66k25o53o70m48m31o43n91l5N56O34L87
54551A02633M43R66J454J469J038L70l57q12n71L02J110J282J040R99J215J073
54535A13654J68j010j530j085k58K46L28K81J56j81n47n50k69k53o38q58n56k27
54517A06871m88j142j547j518j228n97M68J427J594J178J007J168Q37l21j446
54502A06263j650j101m54J50Q24J269J123O83N88Q91J075R34P84Q24Q28O29M03
54485A14063K70l3p93j789k329j845m56J001J626J253N53K05J99J74K06P42J774
$$ y = [102511, 102917, 103413, 103587, 103412, 103320, 103443, 103384, 102927, 102466, 102458, 102785, 102897, 102324, 100941, 99095, 97601, 97217, 97920, 98950, 99698, 100181, 100580, 100795, 100777, 100890, 101441, 102126, 102306, 101740, 100744, 99780, 99154, 98998, 99181, 99318, 99166, 99035, 99504, 100701, 102102, 103111, 103647, 104041, 104486, 104752, 104527, 103874, 103204, 102756, 102325, 101682, 101091, 101056, 101612, 102246, 102633, 103076, 104042, 105496, 106965, 108003, 108373, 108016, 107204, 106633, 106935, 108045, 109327, 110367, 111366, 112581, 113654, 113822, 112812, 111282, 110197, 109939, 110185, 110513, 110794, 110950, 110769, 110222, 109672, 109403, 109150, 108512, 107654, 107098, 106871, 106383, 105241, 103694, 102176, 100948, 100351, 100819, 102246, 103840, 105018, 106025, 107193, 108030, 107709, 106263, 104613, 103512, 103058, 103208, 104032, 105301, 106424, 107107, 107695, 108586, 109661, 110595, 111379, 112203, 113031, 113660, 114063, 114333, 114300, 113507, 111718, 109389, 107544, 107088, 108089, 109715, 110968, 111521, 111726, 111925, 112099, 112305, 113047, 114821]
54468A14821K582K477J555N27L0J91O45Q01L92j15P5J010J653R82o23j687j300
54451A24016q5P11O99M59M81N37K25l60p99r06p98n93m01m62r05j371j296o77
54433A18475j46j50l94l43P9N66R39J131R41K65n26q68o96m50m25m42k35K02P42
54414A18665J193J240P11M2J2P99J696J934J457O13m03j345j640r48J92Q70Q61
54397A25949O86P03P06M71J47k2M0L61R03J356J297P20m0q27j693k313k021p76
54379A25647M46O88P8n12n47j78K45N96R26J315J691J721J175M29J75N27R04J056
54361A36382J445K159K296J178l71j055r23j038j598j667r10k11k04l20nJ87m36
54344A34909j409j705j181n57k65k03l34p65j199j136o21k19j49q2J34J37k69
$$ y = [114821, 117403, 119880, 121435, 121962, 121992, 122183, 122828, 123629, 124021, 123906, 123981, 124991, 126644, 127626, 127003, 125316, 124016, 123931, 124642, 125341, 125800, 126281, 126818, 127043, 126683, 125884, 124978, 124180, 123587, 123186, 122724, 121819, 120448, 119152, 118475, 118329, 118179, 117785, 117442, 117521, 118087, 119026, 120157, 121098, 121363, 120837, 119969, 119273, 118823, 118398, 117956, 117721, 117923, 118665, 119858, 121098, 121809, 121851, 121863, 122662, 124358, 126292, 127749, 128362, 127959, 126614, 124974, 124026, 124218, 125088, 125949, 126635, 127338, 128044, 128515, 128662, 128640, 128680, 129041, 129944, 131300, 132597, 133317, 133277, 132450, 130757, 128444, 126423, 125647, 126093, 126781, 126859, 126347, 125800, 125622, 125867, 126463, 127389, 128704, 130395, 132116, 133291, 133720, 133895, 134422, 135326, 136382, 137827, 139986, 142282, 143460, 143089, 142034, 141111, 140073, 138475, 136808, 135898, 135687, 135483, 135163, 135158, 135345, 134909, 133500, 131795, 130614, 130057, 129792, 129589, 129255, 128490, 127291, 126155, 125534, 125315, 125166, 125084, 125218, 125355, 125086]
54327A25086o70o18l11k31l81k70L05Q86Q29M2r09j348j060m24Lj7j51J71J042
54308A21974J786J621O47j82k79j39m53r42p65P5O29L68j05o6L39N67N18L74M8
54289A26015n23r25p12j16K35J89M9o7k87m00N0R69J564J212J71p91j226j262
54271A24145j216j162q62j29Q36J597J983K128J958J164n7p46k76P16J085O46
54255A31810K00K25L82K80rl56q10j157r14m7P31P27n6j134k041k376j969j196
54237A22290o90n54l23O0K3n78q75k12P14P59%m47m2O54J048J207J262R95M56
54218A25747K01M50N12k49j316j582r38m89j000j775j554k02J073J184L81k67
54202A20176k26P4J02j9J78P12J094R75N46K62L65P70J220J430J217P18K70L5
$$ y = [125086, 124416, 123798, 123487, 123256, 122875, 122605, 122910, 123796, 124625, 124667, 123758, 122410, 121350, 120926, 120929, 120912, 120761, 120932, 121974, 123760, 125381, 126028, 125846, 125567, 125428, 124975, 124033, 123268, 123343, 123972, 124340, 124235, 124169, 124508, 125075, 125593, 125967, 126015, 125492, 124567, 123855, 123739, 123974, 124163, 124212, 124145, 123858, 123458, 123508, 124477, 126041, 127253, 127424, 126633, 125407, 124145, 122929, 121767, 120905, 120776, 121612, 123209, 125192, 127320, 129278, 130442, 130385, 129639, 129363, 130079, 131164, 131810, 132010, 132235, 132617, 132897, 132888, 132532, 131722, 130565, 129651, 129604, 130335, 131062, 131006, 129872, 127831, 125455, 123486, 122290, 121600, 121046, 120723, 120783, 120806, 120228, 119353, 119141, 119855, 120614, 120614, 120167, 120125, 120779, 121827, 123034, 124296, 125291, 125747, 125948, 126398, 126910, 126661, 125345, 123763, 122825, 122336, 121336, 119561, 118007, 117805, 118878, 120062, 120443, 120176, 119950, 120024, 120126, 120107, 120285, 120997, 122091, 123066, 123612, 123874, 124239, 125009, 126229, 127659, 128876, 129594, 129864, 129899]
54184A29899k11o76j101r73k02P20J294J426J226P37R2l98o28r11j377j525q85
54167A26507K9J96m99j074q76m25l87n30l45j58o30j510j739q98K57Q36P15K84
54149A19753j16k45M3N09O35K80j32k29j67k34m11n79p76r19o44J50Q74Q45J95
54130A18832k70n6N42R71J069R85P41J71p00j461j679j358q49k74N74J589K004
54113A20831J272J1m98J64J145J561J464J366J358J221R38N81L4o58r18k63Q73
54096A30482J486J228P64Q51J484K047J988J230J78n59o74m79o06j265k036k345
54080A33774j947r83J77J103J507J418J063O32K77K42O02R34O83m5m37lP43R51
54062A40691N39J08LJ6M0L72J073J540J173K35m39m68j30L39J050J916K405K197
$$ y = [129899, 129688, 129012, 127911, 126938, 126736, 127456, 128750, 130176, 131402, 132139, 132231, 131833, 131205, 130294, 128917, 127392, 126507, 126536, 126732, 126233, 125159, 124283, 123858, 123471, 122941, 122596, 122438, 121808, 120298, 118559, 117661, 117918, 118754, 119469, 119753, 119637, 119392, 119435, 119944, 120579, 120859, 120727, 120498, 120331, 120097, 119686, 119107, 118331, 117412, 116768, 116918, 117792, 118637, 118832, 118562, 118506, 119048, 120019, 121088, 122073, 122814, 122985, 122285, 120824, 119145, 117787, 116938, 116664, 117238, 118827, 120831, 122103, 122114, 121616, 121780, 122925, 124486, 125950, 127316, 128674, 129895, 130833, 131414, 131448, 130790, 129872, 129609, 130482, 131968, 133196, 133960, 134811, 136295, 138342, 140330, 141560, 141738, 141179, 140505, 140026, 139420, 138155, 136119, 133774, 131827, 130844, 131021, 132124, 133631, 135049, 136112, 136744, 137021, 137263, 137865, 138799, 139482, 139437, 139000, 138997, 139740, 140691, 141230, 141338, 141341, 141357, 141397, 141769, 142842, 144382, 145555, 145790, 145351, 144883, 144753, 145092, 146142, 148058, 150463, 152660]
54044A52660J760J755K172K474K449K420K653L025L329L539L666L654L533L461
54030A92550L503L559L446K965J941N54n50q52n86m12n08n18l19k84o54j208j788
54013B00839k569l553m290m425m166l862l602l421l449l499l096k229j589j587
53999A55502j701j370r61j095j515j492j050q27q91o74m6M45N69P31J054R74J72
53982A47825p93j180r06l24K64N04K7q93j233m21P84J217Q69P15J164J515J150
53965A50284N43N81J343K114K397K423K636L153L912M877N785N914M645K279r5
53950A92791j672k497k890k771j954p13L36Q97J143J355J710K283K945L323L225
53935A97511K898K631K297J764J404J645K124K062J417R86J212J662J906K197
$$ y = [152660, 154420, 156175, 158347, 160821, 163270, 165690, 168343, 171368, 174697, 178236, 181902, 185556, 189089, 192550, 196053, 199612, 203058, 206023, 207964, 208518, 207968, 207116, 206530, 206118, 205610, 205092, 204773, 204489, 203835, 202627, 200839, 198270, 194717, 190427, 186002, 181836, 177974, 174372, 170951, 167502, 164003, 160907, 158678, 157089, 155502, 153801, 152431, 151470, 150375, 148860, 147368, 146318, 145491, 144600, 143926, 143880, 144325, 144894, 145625, 146679, 147653, 147825, 147032, 145852, 144946, 144622, 144886, 145390, 145417, 144524, 143291, 142870, 143654, 144871, 145740, 146455, 147619, 149134, 150284, 150827, 151408, 152751, 154865, 157262, 159685, 162321, 165474, 169386, 174263, 180048, 185962, 190607, 192886, 192791, 191119, 188622, 185732, 182961, 181007, 180294, 180630, 181527, 182670, 184025, 185735, 188018, 190963, 194286, 197511, 200409, 203040, 205337, 207101, 208505, 210150, 212274, 214336, 215753, 216739, 217951, 219613, 221519, 223716]
53921B23716K809L325L165K508K114K443L269M017M175L611K784K385K486K362
53907B65169J435Q0r25j371j591j784j951k308l091l998m415m242l982l931l879
53892B29216l741l915m590n204n039m205l497l352l353k918k128j627j778k231
53878A81638k358j983j546j595k182k767k692j788o01O8p0n58q13q05r13j282
53862A59753j693j987k219k312k021j343o23n8N37J189J463J051L11j10k3K60
53846A52175M29L54J9l51l48Q3L54p5q95j304r52j36P49J348J223L07n83m73M56
53827A52380J015O18k7j42P8J21J69O45J252J295P63M23P39J353J683J599J405
53810A65369J465J951K707L244L179K672K325K534L084L366K924J875Q86O03R84
$$ y = [223716, 226525, 229850, 233015, 235523, 237637, 240080, 243349, 247366, 251541, 255152, 257936, 260321, 262807, 265169, 266604, 266684, 265759, 264388, 262797, 261013, 259062, 256754, 253663, 249665, 245250, 241008, 237026, 233095, 229216, 225475, 221560, 216970, 211766, 206727, 202522, 199025, 195673, 192320, 189402, 187274, 185647, 183869, 181638, 179280, 177297, 175751, 174156, 171974, 169207, 166515, 164727, 164126, 164194, 164124, 163566, 162753, 161948, 161035, 159753, 158060, 156073, 153854, 151542, 149521, 148178, 147555, 147497, 148034, 149223, 150686, 151737, 152048, 151938, 151915, 152175, 152604, 152958, 152977, 152626, 152278, 152361, 152715, 152640, 151745, 150441, 149489, 149353, 150102, 151450, 152673, 152980, 152397, 151924, 152380, 153395, 154013, 153986, 153844, 153922, 154043, 154212, 154857, 156109, 157404, 158167, 158590, 159329, 160682, 162365, 163964, 165369, 166834, 168785, 171492, 174736, 177915, 180587, 182912, 185446, 188530, 191896, 194820, 196695, 197581, 198184, 199168]
53795A99168J395J462J513J926K424K481K130J877J868J762J352P78K7j118k471
53780B16574l349l406l168l337l901m243l887k872j715j192j783l007l623k998
53766A74093j878j417j722j969j713j258q09j05P62R62o1j609k361j825o68K43
53750A58665O77Q47R02Q57P47O19M01J4l93n30k90O5K68M16Q78J689K247J855
53732A69934N60p39j069k54J053K054K460K543K628K709K557K153J808J821K159
53717A92377K570K879L001K868K557K348K362K266J583L84o86j008m54P85K408
53702B16240L983N044N419N318M940M252L197J931P66J3j03L10O80M99M4J14Q67
53685B53514J450J129K66l27n30p76j099j097p62o44j071j733k159k169j741r55
$$ y = [199168, 200563, 202025, 203538, 205464, 207888, 210369, 212499, 214376, 216244, 218006, 219358, 220136, 220163, 219045, 216574, 213225, 209819, 206651, 203314, 199413, 195170, 191283, 188411, 186696, 185504, 183721, 180714, 177091, 174093, 172215, 170798, 169076, 167107, 165394, 164136, 163327, 163222, 163984, 164946, 164885, 163276, 160915, 159090, 158422, 158665, 159342, 160189, 161091, 161948, 162695, 163314, 163715, 163729, 163336, 162806, 162516, 162581, 162849, 163265, 164143, 165832, 168079, 169934, 170494, 169755, 168686, 168432, 169485, 171539, 173999, 176542, 179170, 181879, 184436, 186589, 188397, 190218, 192377, 194947, 197826, 200827, 203695, 206252, 208600, 210962, 213228, 214811, 215195, 214509, 213501, 213047, 213832, 216240, 220223, 225267, 230686, 236004, 240944, 245196, 248393, 250324, 251090, 251103, 251000, 251310, 251990, 252489, 252533, 252647, 253514, 254964, 256093, 256359, 256032, 255502, 254726, 253627, 252530, 251768, 251124, 250053, 248320, 246161, 243992, 242251, 241296]
53669B41296j71J42p5m50p61j098j377j216n43J08K86J86K77O13R72J314J688
53652B41191J905J683J083M89J97L06P38J199J272R39P68J231K035K534K637K717
53636B62924K788K480J903J736K143K381J949J538K048L065L303K435J631J951
53622B94275K997L612L438L142L408M180M874M905M080K827J993K103K817L386
53608C42037L582L742L997M012L651L303L252L070K176P72k63l83O3L34Q4m43
53592C72986q35r57j036j308j653j776j651j571j649j681j600j733k267k865l168
53577C47236l360l675l644k600r08Q8l15j264j443o69J27K76J34M00J062J367
53561C32812P79k96r45q55n95p23r98p63Q7J073J841K431K845K914K708K626K852
$$ y = [241296, 241125, 241267, 241192, 240742, 239981, 238883, 237506, 236290, 235747, 235855, 236141, 236327, 236604, 237217, 238189, 239503, 241191, 243096, 244779, 245862, 246351, 246548, 246854, 247592, 248791, 250063, 251002, 251770, 253001, 255036, 257570, 260207, 262924, 265712, 268192, 270095, 271831, 273974, 276355, 278304, 279842, 281890, 284955, 288258, 290693, 292324, 294275, 297272, 300884, 304322, 307464, 310872, 315052, 319926, 324831, 328911, 331738, 333731, 335834, 338651, 342037, 345619, 349361, 353358, 357370, 361021, 364324, 367576, 370646, 372822, 373594, 373331, 372948, 373011, 373345, 373429, 372986, 372151, 371194, 370158, 368850, 367197, 365421, 363770, 362199, 360550, 358869, 357269, 355536, 353269, 350404, 347236, 343876, 340201, 336557, 333957, 333049, 333137, 332822, 331558, 330115, 329446, 329573, 329849, 329983, 330383, 331445, 332812, 333591, 333295, 332350, 331495, 330900, 330177, 329179, 328416, 328503, 329576, 331417, 333848, 336693, 339607, 342315, 344941, 347793]
53544C47793L118L154L037K964K997L254L937N005O128P100P999Q786R247R472
53530D23991R899J0593J1040J1003J1020J1552J2228J2595J3061J4200J5522J5994
53518E72698J5746J6173J8037K0458K2196K3156K3972K4797K5308K5501K5720
53507H13762K5937K5814K5416K5211K5172K4590K3088K1359K0360K0160K0098
53496A070967J9838J9614J9457J8988J8174J7725J8140J8840J8776J7745J6527
53485A274791J5845J5777J6114J6650J6950J6427J4920J2870J0704Q450O144M075
53473A429717K310M33j922m601p319j0104j2849j4895j5705j5695j5748j6084
53461A317538j6292j6442j7352j9427k1868k3437k3637k2919k1987k1277k0878
$$ y = [347793, 350911, 354065, 357102, 360066, 363063, 366317, 370254, 375259, 381387, 388487, 396486, 405272, 414519, 423991, 433890, 444483, 455523, 466526, 477546, 489098, 501326, 513921, 526982, 541182, 556704, 572698, 588444, 604617, 622654, 643112, 665308, 688464, 712436, 737233, 762541, 788042, 813762, 839699, 865513, 890929, 916140, 941312, 965902, 988990, 1010349, 1030709, 1050869, 1070967, 1090805, 1110419, 1129876, 1148864, 1167038, 1184763, 1202903, 1221743, 1240519, 1258264, 1274791, 1290636, 1306413, 1322527, 1339177, 1356127, 1372554, 1387474, 1400344, 1411048, 1419498, 1425642, 1429717, 1432027, 1432460, 1430538, 1425937, 1418618, 1408514, 1395665, 1380770, 1365065, 1349370, 1333622, 1317538, 1301246, 1284804, 1267452, 1248025, 1226157, 1202720, 1179083, 1156164, 1134177, 1112900, 1092022]
53450A092022k0667k0423k0037j9525j8858j7880j6460j4652j2624j0577q690
53439I11629p051n611m298l098j963o62R48K618L901M745N629P019Q837J0589
53425I33232J1930J2964J4047J5375J6828J8167J9368K0587K1887K3214K4694
53414A132293K6659K9051L1169L2372L2938L3851L5695L8162M0612M2683M4330
53403A519815M5682M7121M9119N1702N4192N5813N6425N6567N6890N7637N8537
53392B109500N9031N8667N7439N5698N3720N1494M8998M6477M4218M2079L9498
53381B666819L6087L2070K7999K4130K0168J5724J0786N652N20m606r772j5184
53369B810393k1410k8943l7329m5094n0902n4640n7052n8666n9492n9546n9084
$$ y = [1092022, 1071355, 1050932, 1030895, 1011370, 992512, 974632, 958172, 943520, 930896, 920319, 911629, 904578, 898967, 894669, 891571, 889608, 888946, 889894, 892512, 896413, 901158, 906787, 913806, 922643, 933232, 945162, 958126, 972173, 987548, 1004376, 1022543, 1041911, 1062498, 1084385, 1107599, 1132293, 1158952, 1188003, 1219172, 1251544, 1284482, 1318333, 1354028, 1392190, 1432802, 1475485, 1519815, 1565497, 1612618, 1661737, 1713439, 1767631, 1823444, 1879869, 1936436, 1993326, 2050963, 2109500, 2168531, 2227198, 2284637, 2340335, 2394055, 2445549, 2494547, 2541024, 2585242, 2627321, 2666819, 2702906, 2734976, 2762975, 2787105, 2807273, 2822997, 2833783, 2839435, 2839955, 2835349, 2825577, 2810393, 2788983, 2760040, 2722711, 2677617, 2626715, 2572075, 2515023, 2456357, 2396865, 2337319, 2278235]
53358B278235n8281n7076n5424n3437n1223m8875m6662m4925m3788m3187m3156
53347A732201m3678m4251m4008m2463l9955l7247l4872l2891l1058k9060k6819
53336A325899k4562k2529k0630j8598j6407j4322j2623j1597j1583j2569j3784
53325A146695j4187j3545j2605j2082j1853j1343j0301q948p562o167m594k769
53313A030739r29N49J714L093M858O368P167Q038J0127J3092J5289J6060J6665
53300A132830J8355K0571K2053K2830K3944K5614K6996K7613K7922K8255K8197
53289A405180K7370K6066K4688K3111K1094J8834J6662J4484J1924Q862N463J817
53277A605555k049n809q887j1049j2781j4840j7448k0153k2485k4465k6304k7843
$$ y = [2278235, 2219954, 2162878, 2107454, 2054017, 2002794, 1953919, 1907257, 1862332, 1818544, 1775357, 1732201, 1688523, 1644272, 1600264, 1557801, 1517846, 1480599, 1445727, 1412836, 1381778, 1352718, 1325899, 1301337, 1278808, 1258178, 1239580, 1223173, 1208851, 1196228, 1184631, 1173048, 1160479, 1146695, 1132508, 1118963, 1106358, 1094276, 1082423, 1071080, 1060779, 1051831, 1044269, 1038102, 1033508, 1030739, 1029810, 1030359, 1032073, 1035166, 1040024, 1046392, 1053559, 1061597, 1071724, 1084816, 1100105, 1116165, 1132830, 1151185, 1171756, 1193809, 1216639, 1240583, 1266197, 1293193, 1320806, 1348728, 1376983, 1405180, 1432550, 1458616, 1483304, 1506415, 1527509, 1546343, 1563005, 1577489, 1589413, 1598275, 1603738, 1605555, 1603506, 1597697, 1588810, 1577761, 1564980, 1550140, 1532692, 1512539, 1490054, 1465589, 1439285, 1411442]
53265A411442k8744k9138k9583l0333l1036l1328l1245l0875l0128k9183k8656
53254A081193k8834k9041k8413k7048k5836k5303k5217k5246k5337k5352k4950
53243G90616k4014k2873k1898k1179k0646k0094j9110j7355j5088j3033j1576
53232E83750j0454r343q315p650p517q032r160j0380j0893j0563j0263j0907j2360
53219D57913j3654j4063j3599j2639j1547j0574r737q829p790o955o645o626o421
53206C28834o045o013o526p133p338p112o625n887m933m097l707l699l798l886
53192B52035l941l794l366k987l063l465l711l707l784l922l547k403j096m01
53178B08848l76o31j036j572j789j207k27N9p88j928k198j324l0O87K75r43j861
$$ y = [1411442, 1382698, 1353560, 1323977, 1293644, 1262608, 1231280, 1200035, 1169160, 1139032, 1109849, 1081193, 1052359, 1023318, 994905, 967857, 942021, 916718, 891501, 866255, 840918, 815566, 790616, 766602, 743729, 721831, 700652, 680006, 659912, 640802, 623447, 608359, 595326, 583750, 573296, 563953, 555638, 547988, 540471, 532439, 523279, 512899, 502006, 491443, 481180, 470273, 457913, 444259, 430196, 416597, 403958, 392411, 381837, 372100, 363271, 355481, 348526, 341881, 335255, 328834, 322789, 316776, 310250, 303117, 295779, 288667, 282042, 276155, 271222, 267125, 263418, 259719, 255921, 252035, 248094, 244300, 240934, 237947, 234884, 231419, 227708, 224001, 220217, 216295, 212748, 210345, 209249, 208848, 208472, 207841, 206805, 205233, 203444, 202237, 202010, 202069, 201281, 199353, 197155, 195831, 195801, 196488, 196763, 195820, 193959]
53161A93959j568m17K58j79q35n41N57J299J109N38K48J61r7n07p60p83p45o38
53143A91059k02O42J477J693J097Q0p84j188j052l87N54J209J232R21P78P44M12
53126A98285o9o5M98Q93O96L88M47O32P10J039J710J835P73n88r18m44m70j215
53108B04137j560j075p35j075j189m03K89l10j623k104j486q96j018j374j424
53093A88154j218p56K24J398J744Q65k21l09M91J103R94O34N10M56J28l51o60
53076A93186q41j212j744j939j443o30k73o92j375j530q59K29J119J501J402R35
53060A85834J95n80j026r49n90m07n89r08j027p91j79P65J710K062J443K24p83
53043A84404j151j120j034q59m32P1K77J47M7K16L90J04p09j603k025j798j177
$$ y = [193959, 192391, 191974, 192232, 192053, 191218, 190677, 191234, 192533, 193642, 194180, 194428, 194589, 194492, 193985, 193225, 192442, 191697, 191059, 190857, 191499, 192976, 194669, 195766, 195846, 195062, 193874, 192822, 192435, 192989, 194198, 195430, 196351, 197129, 197873, 198285, 198216, 198151, 198649, 199542, 200238, 200626, 201073, 201705, 202415, 203454, 205164, 206999, 207772, 207184, 206266, 205822, 205352, 204137, 202577, 201502, 200767, 199692, 198503, 198100, 198389, 198079, 196456, 194352, 192866, 191970, 190952, 189578, 188154, 186936, 186180, 186404, 187802, 189546, 190411, 190190, 189881, 190372, 191475, 192469, 193103, 193613, 194069, 194197, 193846, 193186, 192345, 191133, 189389, 187450, 186007, 185377, 185104, 184412, 183037, 181507, 180648, 180877, 181996, 183497, 184899, 185834, 186029, 185449, 184423, 183474, 182884, 182477, 181888, 180980, 179953, 179162, 178983, 179748, 181458, 183520, 184963, 185187, 184404, 183253, 182133, 181099, 180240, 179808, 179879, 180156, 180303, 180350, 180566, 180956, 181060, 180351, 178748, 176723, 174925, 173748]
53026A73748n82k74j65O7O25J289J632J513J188Q66M91J05M8M13O12J00o61p03
53008A80312N8O15L14l14n18l96m26n86o08o38q91j015n76P1K53P9K40P52Q58
52989A77584K59m10n43k41K46R43J622J603O68l64n53M5O23P26O12P62J462K668
52971A87712L937M593M214K926J206l67j168r13j85q0r03j744j674r86o73j030
52955A94865j391j130l66K69K25n66j525j871j518j291j869k757k876j967q32
52940A75400j70J73O17J130J359J165O64Oo30r62q61n71n23q24j134j061o25k00
52922A72953%R4J90J20k28m90k36K93L40l33j052j143p69n70p22q01l91M90J406
52903A69151J774J332M76p3r6J2J2J69N03M13m20j225j081k31L06J90rM0J1k91
$$ y = [173748, 173166, 172892, 172727, 172794, 173419, 174708, 176340, 177853, 179041, 179907, 180398, 180503, 180551, 180964, 181576, 181676, 181015, 180312, 180370, 180985, 181299, 180985, 180467, 180071, 179645, 179059, 178451, 177813, 176922, 175907, 175331, 175402, 175655, 175734, 175974, 176726, 177584, 177843, 177433, 176890, 176649, 176895, 177838, 179460, 181063, 181731, 181367, 180814, 180859, 181482, 182208, 182820, 183582, 185044, 187712, 191649, 196242, 200456, 203382, 204588, 204221, 203053, 202140, 201955, 201875, 200972, 199228, 197554, 196568, 195895, 194865, 193474, 192344, 191978, 192247, 192472, 191906, 190381, 188510, 186992, 185701, 183832, 181075, 178199, 176232, 175400, 175230, 175403, 176020, 177150, 178509, 179674, 180338, 180344, 179714, 178752, 177891, 177320, 176797, 175973, 174839, 173778, 173153, 172953, 172953, 173047, 173237, 173357, 173129, 172639, 172403, 172696, 173036, 172703, 171651, 170508, 169739, 169169, 168447, 167646, 167255, 167745, 169151, 170925, 172257, 172733, 172660, 172564, 172576, 172588, 172757, 173260, 173673, 173253, 172028, 170947, 170716, 171022, 171212, 171203, 171243, 171254, 170963]
52883A70963n27m28j58J82P49J364J420P47Q9K49J063J698J698J332J067R96Q08
52866A83312K25n48q67l88L48M51j57n93j71P42J262R94K80k65k05M07Q75L54
52848A86056j184k717l242k822k283k136k248k417k649k802k422j294Q1Q41N84
52833A59346k65r08q66k71L64N00q1j050j612j138J41J294J648J341Q30K98r9
52816A59472N1Q45J501J109j15j010r35k85M23J135J692J579P78J86M66J056R82
52799A68930K24m73q04j089j386j230m16N70J124J108P17J60l35n33m25l02m20
52782A65420o52o17j16N31P01J67n02n05J09M45k8p04p20j90O9k68p49r83j078
52763A60330j163j123q95n52K6R83J882J929J069K90L57Q24P61J12l46j02N78
$$ y = [170963, 170436, 170008, 169850, 170032, 170781, 172145, 173565, 174312, 174401, 174650, 175713, 177411, 179109, 180441, 181508, 182504, 183312, 183537, 182989, 182122, 181734, 182082, 182533, 182376, 181783, 181612, 182354, 183616, 184610, 184890, 184625, 184420, 184827, 185702, 186056, 184872, 182155, 178913, 176091, 173808, 171672, 169424, 167007, 164358, 161556, 159134, 157840, 157921, 158762, 159346, 159081, 158173, 157307, 157036, 157400, 157900, 157819, 156769, 155157, 154019, 154160, 155454, 157102, 158443, 159273, 159571, 159472, 159523, 160368, 161869, 162978, 162863, 161853, 160918, 160633, 161056, 162191, 163883, 165462, 166240, 166426, 166892, 167948, 168930, 169154, 168681, 167877, 166788, 165402, 164172, 163756, 164326, 165450, 166558, 167275, 167435, 167100, 166567, 166142, 165840, 165420, 164768, 164151, 164035, 164566, 165267, 165434, 164932, 164427, 164536, 164981, 164953, 164249, 163529, 163339, 163408, 163140, 162391, 161408, 160330, 159167, 158044, 157149, 156597, 156623, 157606, 159488, 161417, 162486, 162776, 163133, 163957, 164718, 164830, 164484, 164382, 164960]
52746A64960J193J470J367J041Q33R27J026P87M64O63J357J749J345O70N04P94
52730A81150Q24K47n36j056j293j452j508j287q35m60l90m85m06o5J95N3k60j64
52712A72272M23Q52N84p0m55n40p37r44n60L80R06L72n31o58J47J022J306J074
52694A74843O55K30m5r6j69o35j398j892j684p93M96J704K109J282k29j279j376
52677A71723j060r62j014q85n68j77L16P71P64K42j87q9J88K26L76J108J940J937
52659A74649J170P38J205J837J703R15L16M27R91J398J229N31l13j018j645k201
52643A81932k292j617o24q2j5K23P27P28j38j027r19O2J017J519J742J677J101
52626A84014K50k42k36k28m24l47K57P22K57r22j826j958j694j408q38L49J749
$$ y = [164960, 166153, 167623, 168990, 170031, 170864, 171791, 172817, 173604, 174068, 174731, 176088, 177837, 179182, 179852, 180356, 181150, 181974, 182221, 181685, 180629, 179336, 177884, 176376, 175089, 174254, 173794, 173404, 172919, 172513, 172448, 172643, 172696, 172436, 172272, 172695, 173547, 174131, 174061, 173606, 173066, 172329, 171385, 170825, 171205, 172111, 172483, 171952, 171294, 171441, 172463, 173769, 174843, 175498, 175728, 175683, 175587, 175418, 174783, 173385, 171493, 169809, 169016, 169512, 171216, 173325, 174607, 174378, 173099, 171723, 170663, 169701, 168687, 167802, 167234, 167057, 167373, 168144, 168908, 169150, 168963, 168874, 169062, 169288, 169664, 170772, 172712, 174649, 175819, 176557, 177762, 179599, 181302, 182217, 182533, 182960, 183951, 185349, 186578, 187109, 186796, 185778, 184133, 181932, 179640, 178023, 177399, 177317, 177302, 177525, 178252, 178980, 178842, 177815, 176896, 176958, 177975, 179494, 181236, 182913, 184014, 184264, 184022, 183786, 183558, 183134, 182787, 183044, 183766, 184023, 183101, 181275, 179317, 177623, 176215, 175377, 175726, 177475]
52609A77475K535K428J927J513J027J52p78r64j82P85J009M73m1j2K66K34j76
52592A87671n54o03l76K4O20J307J700J467P66J50JK26M88N59L94N1l02m65l97
52573A92727l26m69p35p92m67J1J86j78q13j105p43j65j07o43r98n55K52M77j06
52554A85451p80q38k58N33J124J176N86j64k32N69J360J205K51n39n90j07N27
52537A89274J125J486J419J126J076J269J167N42q5k34k59p48j479j613r07r8
52521A93061Q5k10l34k5M31O79O39L99M3k89l40J20J041J989K498K601K761L129
52503B08278L123K101L05j382k496l245l622l110j671l25r9p67j241j019n76n07
52487A93747q65j309j431r38l2N87N37L66P47J356J389R73R90J487J426M00o16
$$ y = [177475, 180010, 182438, 184365, 185878, 186905, 187057, 186279, 185315, 185133, 185918, 186927, 187400, 187359, 187347, 187613, 187847, 187671, 187117, 186514, 186138, 186162, 186782, 188089, 189789, 191256, 192022, 192172, 192173, 192399, 192887, 193446, 193840, 193891, 193589, 193124, 192727, 192401, 191932, 191197, 190405, 189938, 189949, 190135, 189957, 189144, 188039, 187296, 187131, 187024, 186381, 185383, 184828, 185080, 185557, 185451, 184671, 183833, 183575, 184108, 185232, 186408, 186994, 186830, 186598, 187167, 188527, 189732, 189983, 189444, 188854, 188747, 189274, 190399, 191885, 193304, 194430, 195506, 196775, 197942, 198484, 198399, 198165, 197906, 197158, 195679, 194066, 193159, 193061, 193146, 192936, 192602, 192577, 193008, 193687, 194326, 194725, 194768, 194479, 194139, 194259, 195300, 197289, 199787, 202388, 205149, 208278, 211401, 213502, 213807, 212425, 209929, 206684, 203062, 199952, 198281, 197956, 197857, 197090, 195849, 194830, 194254, 193747, 192882, 191573, 190142, 189204, 189172, 189759, 190296, 190662, 191409, 192765, 194154, 195127, 196117, 197604, 199030, 199430, 198814]
52470A98814p37l70j33L21J412K346K073J026O73J469K445K746K520K172J702
52455B18479J084M71j77j068j979k352k072j538r49k08M27L99k46p97r26j041
52439B07507j387j609j509j355j108l07Q38J196L09o63m61N59J143R95Q05Q93
52423B05846Q90O67N17M99M55O31J374K208K145J135L49P00J768K646L152L804
52407B28786M830N798O028N175L549J926Q68J69q00k185l436l982l807l297k841
52392B36781k612k458j957r03K97J038J254J339J404J167O37K92M10P42J103J682
52376B40216K494L011K869K522K726L574M456M846M722M331L864L411L004K678
52362B88724K559K654K635K069J077L49L05N24M28K22O54J893L115L325K388J111
$$ y = [198814, 198077, 197707, 197574, 197895, 199307, 201653, 203726, 204752, 205425, 206894, 209339, 212085, 214605, 216777, 218479, 219563, 220034, 219857, 218789, 216810, 214458, 212386, 210848, 209899, 209691, 210118, 210517, 210271, 209474, 208548, 207507, 206120, 204511, 203002, 201647, 200539, 200232, 201070, 202266, 202575, 201912, 201451, 202010, 203153, 204148, 204953, 205846, 206736, 207403, 207920, 208419, 208874, 209505, 210879, 213087, 215232, 216367, 216716, 217416, 219184, 221830, 224982, 228786, 233616, 239414, 245442, 250617, 254166, 256092, 256960, 257129, 256329, 254144, 250708, 246726, 242919, 239622, 236781, 234169, 231711, 229754, 228851, 229148, 230186, 231440, 232779, 234183, 235350, 235987, 236279, 236689, 237431, 238534, 240216, 242710, 245721, 248590, 251112, 253838, 257412, 261868, 266714, 271436, 275767, 279631, 283042, 286046, 288724, 291283, 293937, 296572, 298641, 299718, 300067, 300372, 300896, 301324, 301546, 302200, 304093, 307208, 310533, 312921, 314032]
52346C14032M79Q31J742K617L340M208N341O445P218P749Q367R350J0800J2542
52332C95061J4066J4906J5192J5506J6086J6648J7169J8143J9715K1088K1489
52321E85069K1177K0813K0239J8833J6840J5282J4468J3595J2184J0915J0474
52310G59889J0360R606Q138O617N263L726K067R44O10L67n74k071l327l846l763
52295G94006l439l222l466m335n392n874n538m913m507m101l214j882m83R99K898
52280G47537N068O874Q134R475J1370J3350J4604J5004J5042J5114J5205J5134
52268H91911J4615J3361J1515R732Q434P254N746M273L551L484L243K407J340
52255I80866L69n74j434j911k140k746l900m947n440n881o923q355r453j0032
$$ y = [314032, 314511, 315342, 317084, 319701, 323041, 327249, 332590, 339035, 346253, 354002, 362369, 371719, 382519, 395061, 409127, 424033, 439225, 454731, 470817, 487465, 504634, 522777, 542492, 563580, 585069, 606246, 627059, 647298, 666131, 682971, 698253, 712721, 726316, 738500, 749415, 759889, 770249, 779855, 787993, 794610, 799873, 803599, 805666, 806610, 807220, 807587, 807013, 804942, 801615, 797769, 794006, 790567, 787345, 783879, 779544, 774152, 768278, 762740, 757827, 753320, 749219, 746005, 744123, 743640, 744639, 747537, 752605, 759479, 767613, 777088, 788458, 801808, 816412, 831416, 846458, 861572, 876777, 891911, 906526, 919887, 931402, 941134, 949568, 956822, 962568, 966841, 970392, 973876, 977119, 979526, 980866, 981235, 980661, 979227, 977316, 975176, 972430, 968530, 963583, 958143, 952262, 945339, 936984, 927531, 917499]
52241I17499j0491j1020j1297j0915r750q010o149m671l774l337l224l286l028
52228H28547j906k25Q52O93L8pP06J623K535L511M221M225L825L772M194M574
52212H61178M807N353O274O924O814O167N343M420L510K942K722K472K118K112
52198I23156K611L022K781K089J538J395J588J937K074J649R42P74J349J741J086
52183I49732k49j292j836k504l706n252o779p890q077p178n891n115m930m701
52169H84332m148l597l201k673j884j107m79J67Q03J204J509K159L004L263K686
52154H82038K068K054K163J672Q91P16J241J689J634J484J639J943K161K485L101
52139I08979L773M167M451N137O414P908R185J0248J1435J2902J4430J5761J6977
$$ y = [917499, 907008, 895988, 884691, 873776, 864026, 856016, 849867, 845196, 841422, 838085, 834861, 831575, 828547, 826641, 826416, 827268, 827961, 827999, 827992, 828698, 830321, 832856, 836367, 840588, 844813, 848638, 852410, 856604, 861178, 865985, 871338, 877612, 884536, 891350, 897517, 902860, 907280, 910790, 913732, 916454, 918926, 921044, 923156, 925767, 928789, 931570, 933659, 935197, 936592, 938180, 940117, 942191, 943840, 944782, 945556, 946905, 948646, 949732, 949483, 948191, 946355, 943851, 940145, 934893, 928114, 920224, 912147, 904969, 899078, 893963, 889033, 884332, 880184, 876587, 873386, 870713, 868829, 867722, 867243, 867410, 868213, 869417, 870926, 873085, 876089, 879352, 882038, 884106, 886160, 888323, 889995, 890886, 891602, 892843, 894532, 896166, 897650, 899289, 901232, 903393, 905878, 908979, 912752, 916919, 921370, 926507, 932921, 940829, 950014, 960262, 971697, 984599, 999029, 1014790, 1031767]
52126A031767J8304J9637K0678K1542K2752K4346K5424K5124K3743K2342K1396
52115A277055K0398J8781J6567J3966J1002P823M850K212n24l631o678r118j1006
52102A341697j2535j3272j2659j1121r836r337r099q623q175q054p913p336o524
52089A217213n913n531n272n315n598n318l773j418P23K522M664P179R193J0368
52075A213724J1509J3185J4681J5061J4579J4151J3995J3637J2899J2033J1023
52064A360477R557P631N477K994L4k875m917o184p681r843j1897j2971j3265j3596
52050A302941j4320j5212j6075j7018j8251j9851k1537k2634k2605k1745k0899
52039A092794k0431j9898j8859j7360j5450j2991j0342q433p607p017n902m846
$$ y = [1031767, 1050071, 1069708, 1090386, 1111928, 1134680, 1159026, 1184450, 1209574, 1233317, 1255659, 1277055, 1297453, 1316234, 1332801, 1346767, 1357769, 1365592, 1370442, 1372654, 1372130, 1368499, 1361821, 1352703, 1341697, 1329162, 1315890, 1303231, 1292110, 1282274, 1272937, 1263838, 1255215, 1247040, 1238986, 1231073, 1223737, 1217213, 1211300, 1205769, 1200497, 1195182, 1189584, 1184266, 1180493, 1179075, 1179798, 1182320, 1186984, 1194163, 1203356, 1213724, 1225233, 1238418, 1253099, 1268160, 1282739, 1296890, 1310885, 1324522, 1337421, 1349454, 1360477, 1370034, 1377665, 1383142, 1386136, 1386170, 1383295, 1378378, 1372194, 1364513, 1354670, 1342773, 1329802, 1316537, 1302941, 1288621, 1273409, 1257334, 1240316, 1222065, 1202214, 1180677, 1158043, 1135438, 1113693, 1092794, 1072363, 1052465, 1033606, 1016246, 1000796, 987805, 977463, 969030, 961423, 954406, 948504, 943658]
52027I43658m884n930p052p998r282j0875j1907j1967j1706j1786j2002j1909
52015H26360j1634j1598j1820j2004j2044j2139j2534j3314j4235j4748j4513
52004F85777j3942j3788j4119j4136j3276j1968j1086j0955j1205j1244j0668
51993E49390r454p972o627n421m148k990k425k511k821l206l926m878n439n473
51979D82099n761o842q129q838r172r723j0200r781q531p409o794n916m054j550
51965C79399O73K176L157L975M795N589O231O665O924O956O552N617M267K507
$$ y = [943658, 938774, 932844, 925792, 917794, 908512, 897637, 885730, 873763, 862057, 850271, 838269, 826360, 814726, 803128, 791308, 779304, 767260, 755121, 742587, 729273, 715038, 700290, 685777, 671835, 658047, 643928, 629792, 616516, 604548, 593462, 582507, 571302, 560058, 549390, 539936, 531964, 525337, 519916, 515768, 512778, 510353, 507842, 505021, 501815, 497889, 493011, 487572, 482099, 476338, 469496, 461367, 452529, 443357, 433634, 423434, 413653, 405122, 397713, 390919, 385003, 380949, 379399, 380072, 382248, 385405, 389380, 394175, 399764, 405995, 412660, 419584, 426540, 433092, 438709, 442976, 445483]
$$ [...]
##END NTUPLES=NMR SPECTRUM
##END=
