##TITLE=NES1089_ptc170_9885004_iPXpzVtu0R
##JCAMPDX= 6.0         $$ Bruker NMR JCAMP-DX V2.0
##DATA TYPE= NMR SPECTRUM
##DATA CLASS= NTUPLES
##ORIGIN= BRUKER
##OWNER= Administrator
$$ 1.72 TOPSPIN		Version 2.1
$$ 2016-08-27 22:12:30.758 -0500  Administrator@X
$$ Compression mode = diff/dup
##.OBSERVE FREQUENCY= 400.02188249412
##.OBSERVE NUCLEUS= ^1H
##.ACQUISITION MODE= SIMULTANEOUS (DQD)
##.ACQUISITION SCHEME= undefined
##.AVERAGES= 8
##.DIGITISER RES= 22
##SPECTROMETER/DATA SYSTEM= spect
##.PULSE SEQUENCE= zg30
##.SOLVENT NAME= COFFEE_meoh
##.SHIFT REFERENCE= INTERNAL, COFFEE_meoh, 1, 14.98509
##AUDIT TRAIL= $$ (NUMBER, WHEN, WHO, WHERE, PROCESS, VERSION, WHAT)
$$ ##TITLE= Audit trail, TOPSPIN		Version 2.1
$$ ##JCAMPDX= 5.01
$$ ##ORIGIN= Bruker BioSpin GmbH
$$ ##OWNER= Administrator
$$ $$ E:\/data/COFFEE/nmr/NES1089_ptc170_9885004_iPXpzVtu0R/10/pdata/1/auditp.txt
$$ ##AUDIT TRAIL=  $$ (NUMBER, WHEN, WHO, WHERE, PROCESS, VERSION, WHAT)
(   1,<2016-08-27 22:12:23.633 -0500>,<Administrator>,<X>,<go>,<TOPSPIN 2.1>,
      <created by zg
	started at 2016-08-27 22:11:17.945 -0500,
	POWCHK enabled, PULCHK disabled,
       configuration hash MD5:
       21 0F 79 D6 B3 7B B4 F6 88 20 88 DB 03 48 BD 9F
       data hash MD5: 64K
       F0 7F 30 1D 31 EF E0 9E 7B 9C 21 FF 65 68 06 19>)
(   2,<2016-08-27 22:12:26.711 -0500>,<Administrator>,<X>,<proc1d>,<TOPSPIN 2.1>,
      <Start of raw data processing
       efp LB = 0 FT_mod = 6 PKNL = 1 PHC0 = 0 PHC1 = 0 SI = 32K 
       data hash MD5: 32K
       B6 E5 49 41 81 A1 55 B6 A4 21 8C 55 54 9D D4 D7>)
(   3,<2016-08-27 22:12:26.992 -0500>,<Administrator>,<X>,<proc1d>,<TOPSPIN 2.1>,
      <pk PHC0 = 94.61426 PHC1 = 0 
       data hash MD5: 32K
       E9 35 7E 80 55 33 CF 67 F0 BB 97 85 74 F7 A6 3C>)
(   4,<2016-08-27 22:12:27.101 -0500>,<Administrator>,<X>,<proc1d>,<TOPSPIN 2.1>,
      <abs ABSG = 1 
       data hash MD5: 32K
       D8 84 F2 D6 58 FD 16 FA EB 0E 64 68 20 CD 92 DA>)
(   5,<2016-08-27 22:12:27.164 -0500>,<Administrator>,<X>,<proc1d>,<TOPSPIN 2.1>,
      <abs ABSG = 2 
       data hash MD5: 32K
       2E 92 1A F6 EB 8E 67 88 20 88 6A EF 48 FB C1 2A>)
(   6,<2016-08-27 22:12:27.226 -0500>,<Administrator>,<X>,<proc1d>,<TOPSPIN 2.1>,
      <abs ABSG = 3 
       data hash MD5: 32K
       51 1B 4D AD 9D 4A AD 73 46 34 DE BB C8 5E 23 AD>)
(   7,<2016-08-27 22:12:27.289 -0500>,<Administrator>,<X>,<proc1d>,<TOPSPIN 2.1>,
      <abs ABSG = 4 
       data hash MD5: 32K
       3D 5D C2 01 1A C3 AA BB 4B 2F CF 13 D4 6E B5 FB>)
(   8,<2016-08-27 22:12:27.351 -0500>,<Administrator>,<X>,<proc1d>,<TOPSPIN 2.1>,
      <abs ABSG = 5 
       data hash MD5: 32K
       61 2B 06 71 DF 7A 0F 7A B1 E4 84 F9 91 72 BA F5>)
$$ ##END=
$$ 
$$ $$ hash MD5
$$ $$ F1 06 1D 6A 85 7E D1 96 E8 99 3B 2D 83 FF 96 72
##$RELAX= 
##$RELAX= 
##$RELAX= 
##$RELAX= 
##$RELAX= 
##$RELAX= 
##$RELAX= 
$$ Bruker specific parameters
$$ --------------------------
##$DU= <E:\>
##$EXPNO= 10
##$NAME= <NES1089_ptc170_9885004_iPXpzVtu0R>
##$PROCNO= 1
$$ [...]
150 150 150 150 150 150 150 150
##$TP07= 0
##$TPNAME0= <>
##$TPNAME1= <>
##$TPNAME2= <>
##$TPNAME3= <>
##$TPNAME4= <>
##$TPNAME5= <>
##$TPNAME6= <>
##$TPNAME7= <>
##$TPOAL= (0..7)
0.5 0.5 0.5 0.5 0.5 0.5 0.5 0.5
##$TPOFFS= (0..7)
0 0 0 0 0 0 0 0
##$TUNHIN= 0
##$TUNHOUT= 0
##$TUNXOUT= 0
##$USERA1= <user>
##$USERA2= <user>
##$USERA3= <user>
##$USERA4= <user>
##$USERA5= <user>
##$V9= 5
##$VALIST= <valist>
##$VCLIST= <CCCCCCCCCCCCCCC>
##$VD= 0
##$VDLIST= <DDDDDDDDDDDDDDD>
##$VPLIST= <PPPPPPPPPPPPPPP>
##$VTLIST= <TTTTTTTTTTTTTTT>
##$WBST= 1024
##$WBSW= 4
##$XGAIN= (0..3)
0 0 0 0
##$XL= 0
##$YL= 0
##$YMAX_a= 570304
##$YMIN_a= -485797
##$ZGOPTNS= <>
##$ZL1= 120
##$ZL2= 120
##$ZL3= 120
##$ZL4= 120
##$ABSF1= 14.98509
##$ABSF2= -5.573092
##$ABSG= 5
##$ABSL= 3
##$ALPHA= 0
##$AQORDER= 0
##$ASSFAC= 0
##$ASSFACI= 0
##$ASSFACX= 0
##$ASSWID= 0
##$AUNMP= <proc_prof1d_extract_pilot.lims>
##$AXLEFT= 0
##$AXNAME= <>
##$AXNUC= <1H>
##$AXRIGHT= 0
##$AXTYPE= 0
##$AXUNIT= <>
##$AZFE= 0.1
##$AZFW= 0.1
##$BCFW= 0
##$BC_mod= 0
##$BYTORDP= 0
##$COROFFS= 0
##$CY= 15
##$DATMOD= 1
##$DC= 0
##$DFILT= <>
##$DTYPP= 0
##$F1P= 0
##$F2P= 0
##$FCOR= 0.5
##$FTSIZE= 32768
##$FT_mod= 6
##$GAMMA= 0
##$GB= 0
##$INTBC= 1
##$INTSCL= 1
##$ISEN= 128
##$LB= 0
##$LEV0= 0
##$LPBIN= 0
##$MAXI= 10000
##$MC2= 0
##$MEAN= 0
##$ME_mod= 0
##$MI= 0
##$NCOEF= 0
##$NC_proc= -8
##$NLEV= 6
##$NOISF1= 0
##$NOISF2= 0
##$NSP= 0
##$NTH_PI= 0
##$NZP= 0
##$OFFSET= 14.98509
##$PC= 1
##$PHC0= 94.61426
##$PHC1= 0
##$PH_mod= 1
##$PKNL= yes
##$PPARMOD= 0
##$PPDIAG= 0
##$PPIPTYP= 0
##$PPMPNUM= 2147483647
##$PPRESOL= 1
##$PSCAL= 4
##$PSIGN= 0
##$PYNMP= <proc.py>
##$REVERSE= no
##$SF= 400.02
##$SI= 32768
##$SIGF1= 0
##$SIGF2= 0
##$SINO= 400
##$SIOLD= 32768
##$SPECTYP= <>
##$SREGLST= <1H.CDCl3>
##$SSB= 0
##$STSI= 32768
##$STSR= 0
##$SW_p= 8223.68421052631
##$SYMM= 0
##$S_DEV= 0
##$TDeff= 65536
##$TDoff= 0
##$TI= <>
##$TILT= no
##$TM1= 0
##$TM2= 0
##$TOPLEV= 0
##$USERP1= <user>
##$USERP2= <user>
##$USERP3= <user>
##$USERP4= <user>
##$USERP5= <user>
##$WDW= 1
##$XDIM= 32768
##$YMAX_p= 444624498
##$YMIN_p= -710248
##$CURPLOT= <Network HP LaserJet P1505>
##$CURPRIN= <$Network HP LaserJet P1505>
##$DFORMAT= <normdp>
##$LAYOUT= <+/1D_H.xwp>
##$LFORMAT= <normlp>
##$PFORMAT= <normpl>
##$SURQMSG= 1
$$ End of Bruker specific parameters
$$ ---------------------------------
##NTUPLES= NMR SPECTRUM
##VAR_NAME=  FREQUENCY,     SPECTRUM/REAL,   SPECTRUM/IMAG
##SYMBOL=    X,             R,               I
##VAR_TYPE=  INDEPENDENT,   DEPENDENT,       DEPENDENT
##VAR_FORM=  AFFN,          ASDF,            ASDF
##VAR_DIM=   32768,         32768,           32768
##UNITS=     HZ,            ARBITRARY UNITS, ARBITRARY UNITS
##FACTOR=    0.250966925370066, 1,           1
##FIRST=     8223.43324360094, -33609,       -58723
##LAST=      0,             -74097,          -160890
##MIN=       0,             -710248,         0
##MAX=       8223.43324360094, 444624498,    0
$$ Real data points
##PAGE= N=1
##DATA TABLE= (X++(R..R)), XYDATA
$$ [...]
19558d12791A11575J95576i3433k13474a37998A06215E861b47875A07237a40227
$$ -412791 111575 307151 -93433 -306907 -137998 106215 5861 -247875 107237 -140227
19547i6883n2760j67341I4029a60888l0628K7176j20845C0116J62641b0546q8443
$$ -96883 -149643 -316984 94029 -160888 -191516 -164340 -285185 30116 192757 -20546 -108989
19536a08989G50J11989g9901I0287h7709A71763a64337B6791d05116b00790A844
$$ -108989 750 112739 -79901 90287 -87709 171763 -164337 26791 -405116 -200790 1844
19524D025P1973e6043n9050J5169q4616f3069p5091A47315f5991q3737k16257
$$ 4025 75998 -56043 -115093 -99924 -184540 -63069 -138160 147315 -65991 -149728 -365985
19513c65985j15037D9409K58420j37495f838A2654i230G6534P6535h0509B57623
$$ -365985 -481022 49409 307829 170334 -6838 12654 -9230 76534 153069 -80509 257623
19501i8932J654B11496J90088a95279A51237b82214M6427A87330f3892A23279
$$ -98932 -97278 211496 401584 -195279 151237 -282214 -235787 187330 -63892 123279
19490a86381k42839I152J14385a59627A1069b52615P9550M26j41690Q6400l0802
$$ -186381 -429220 9152 123537 -159627 11069 -252615 -173065 -172639 -314329 -227929 -258731
19479b58731h8469A23432d9941k1982m0877G2021b83622a32260O3289A90212b41181
$$ -258731 -88469 123432 -49941 -71923 -112800 72021 -283622 -132260 -68971 190212 -241181
19467b75187E5702f2311B17779b22786A05252k4550a51301b1923C8533L7845b52166
$$ -275187 55702 -62311 217779 -222786 105252 80702 -151301 -21923 38533 76378 -252166
19455A00024C2606J36368G7579a7783F6454P7374a2902r2610F3884C0675Q3766
$$ 100024 32606 168974 77579 -17783 66454 143828 -12902 -105512 63884 30675 114441
19444A14441a32564A40267c02389B70425l6551f1983k79239D5271a38338G8151
$$ 114441 -132564 140267 -302389 270425 233874 -61983 -341222 45271 -138338 78151
19433a06618j00411j5555N6839F5793a89360Q6046A12902D8083c0496G0625J0455
$$ -106618 -207029 -222584 -165745 65793 -189360 -103314 112902 48083 -30496 70625 81080
19422H1080k7637K7020C7113a42441O4972D971N9715a23643K2090O680l38168
$$ 81080 53443 80463 37113 -142441 -77469 4971 64686 -123643 -101553 -94873 -433041
19411d33041A11859c6431j19925A17906A6863J06888Q7160E9300d0413A15767
$$ -433041 111859 -36431 -156356 117906 16863 123751 210911 59300 -40413 115767
19400G987b78252j95169C9031e4681l9295j29896O0624n4343k81960a16242k17878
$$ 7987 -278252 -473421 39031 -54681 -93976 -223872 -163248 -217591 -499551 -116242 -334120
19389c34120a47407K2622j00230c7674j34433M5080P446l7025P5969D1217b10894
$$ -334120 -147407 -124785 -225015 -37674 -172107 -127027 -119581 -156606 -80637 41217 -210894
19377a27480N9081A84669A9131K26141a6846o8517d0036N787k5050k50737A62203
$$ -127480 -68399 184669 19131 245272 -16846 -85363 -40036 -34249 -59299 -310036 162203
19365e1426H108c04526f0949j67797J09729e3876B22855f4380o1128F7692q444
$$ -51426 8108 -304526 -60949 -228746 -119017 -53876 222855 -64380 -125508 67692 59248
19354E9248i6267k1762M9363K8583o3130k27790J54293C7836b95121A24461a456
$$ 59248 -96267 -118029 -68666 -40083 -103213 -331003 -176710 37836 -295121 124461 -1456
19342i5676m8442A36553l4005l6193c26789A50608a63875r942B3771e3256B60425
$$ -95676 -144118 136553 102548 66355 -326789 150608 -163875 -173817 23771 -53256 260425
19330H4497c6211B3161Q842K9321a10058A99175K77844A86576n0068a22837A15035
$$ 84497 -36211 23161 32003 61324 -110058 199175 477019 186576 136508 -122837 115035
19318c43114M271O0255g2368l89844a37884J3866A3512Q9110D8207a89125Q7608
$$ -343114 -338843 -278588 -72368 -462212 -137884 -124018 13512 102622 48207 -189125 -101517
19307a01517o7555L226P1520j10073N3586A65706a59157J8522L4922A23121a2839
$$ -101517 -169072 -165846 -94326 -204399 -150813 165706 -159157 -140635 -105713 123121 -12839
19295a49391e4459C15387b16109M6972d4303l70258J26617R9625A7279K9791O8359
$$ -149391 -54459 315387 -216109 -169137 -44303 -414561 -287944 -188319 17279 47070 115429
19284A15429R1258C9468a46419B00079b74219c7456l96563J59363B00575f3310
$$ 115429 206687 39468 -146419 200079 -274219 -37456 -434019 -274656 200575 -63310
19273B1059b47060A88609j9701a07017B0474h0260B7547b07904H0025d17461g7514
$$ 21059 -247060 188609 168908 -107017 20474 -80260 27547 -207904 80025 -417461 -77514
19261i2634J8586L82A06651m327Q3756a09415d9441o812I9297a67214j31587E4257
$$ -92634 -74048 -73666 106651 102324 186080 -109415 -49441 -56253 99297 -167214 -298801 54257
19248g4149n4761o2049A029O4315a92502e7917C6409b82402E0622A5472b12587
$$ -74149 -128910 -190959 1029 65344 -192502 -57917 36409 -282402 50622 15472 -212587
19236a41566A43153c01291a40868k47902e3537A45416e1493F2006B8491J77943
$$ -141566 143153 -301291 -140868 -388770 -53537 145416 -51493 62006 28491 206434
19226B06434a19641c2316j30492A34156g4368j14402A03505f5999A56731A8691
$$ 206434 -119641 -32316 -162808 134156 -74368 -188770 103505 -65999 156731 18691
19215b66992E0081j9865a64073e6673A9168c95229a3861B36440b55635M4035a9041
$$ -266992 50081 30216 -164073 -56673 19168 -395229 -13861 236440 -255635 -211600 -19041
19203b44460g823A11215m127b34507K9168i9651D3967d2639F015K87283d9802
$$ -244460 -7823 111215 107088 -234507 -205339 -99651 43967 -42639 6015 293298 -49802
19191b53928E64512I1865Q4095J04338b45087q4892a51290A15493b04304R8475
$$ -253928 564512 91865 175960 280298 -245087 -329979 -151290 115493 -204304 -105829
19181a05829F7302j6539b2160A06342b25989A89113a06753M4290C3353d5669j27827
$$ -105829 67302 50763 -22160 106342 -225989 189113 -106753 -62463 33353 -45669 -173496
19170a73496a6148o9937A65318a50604I5677a07262k3348p722n1677i3956C4882
$$ -173496 -16148 -86085 165318 -150604 95677 -107262 -130610 -138332 -190009 -93956 34882
19158b69711A15617i6559G1446A7432a25523H7500a36334N0442L010k98943a64578
$$ -269711 115617 -96559 71446 17432 -125523 87500 -136334 -85892 -82882 -381825 -164578
19146a72690M6614B2229a87143f726H0740a05275R904j11935Q2860j11377R6696
$$ -172690 -126076 22229 -187143 -6726 80740 -105275 -95371 -207306 -124446 -235823 -139127
19135a39127L5606I478O5712C7137g4788A42364m2225f3909A49894a49134k1632
$$ -139127 -103521 9478 75190 37137 -74788 142364 100139 -63909 149894 -149134 -170766
19124a70766A65759G5796J52789a331n00562A62364a74958j15566A13540f1884
$$ -170766 165759 75796 228585 -1331 -501893 162364 -174958 -290524 113540 -61884
19113F411d12189a96506A88007a33037B80503C9259b67937a28706k54032B97160
$$ 6411 -412189 -196506 188007 -133037 280503 39259 -267937 -128706 -382738 297160
19102d26016J88536F3827A2885h1849l1962A29669b34204H1471a36540I5876a54636
$$ -426016 -237480 63827 12885 -81849 -113811 129669 -234204 81471 -136540 95876 -154636
19090b19788l1247h4197B86132e67703a6495C6331b03217R5446C3161L6097b45244
$$ -219788 -251035 -84197 286132 -567703 -16495 36331 -203217 -107771 33161 69258 -245244
19078B21451e3495o2089A58236f8850L1496k1822d522B73310A21644a60133P1425
$$ 221451 -53495 -115584 158236 -68850 -37354 -59176 -4522 273310 121644 -160133 -88708
19067h8708I0502R5487a67914j35903h3230i614D6510a31120J6780d8941D6827
$$ -88708 90502 185989 -167914 -303817 -83230 -9614 46510 -131120 -114340 -48941 46827
19055a69919A97134M5643r2082b80101D43329b07166r3091f4424r6133m0675d1153
$$ -169919 197134 242777 150695 -280101 443329 -207166 -300257 -64424 -160557 -201232 -41153
19043B79088g6576A13655f8685E815L28502a53694k3978h3520C7624J32437m0069
$$ 279088 -76576 113655 -68685 5815 334317 -153694 -177672 -83520 37624 170061 129992
19032A29992a5803B02471O0242g9712A37107b3467C01275a58639e2932k60857
$$ 129992 -15803 202471 262713 -79712 137107 -23467 301275 -158639 -52932 -313789
19022c13789a2493D4544a98258g0008A62945b85189j6214g7333M556d175r3767
$$ -313789 -12493 44544 -198258 -70008 162945 -285189 -301403 -77333 -72777 -4175 -97942
19011i7942E3268b54034i2972B60382e5319A51411b10444i5367r6619d6451A32105
$$ -97942 53268 -254034 -92972 260382 -55319 151411 -210444 -95367 -191986 -46451 132105
18999E8688a60120O3989D421a02436B03314J6717a20459j47973R8888o5137A81625
$$ 58688 -160120 -96131 4421 -102436 203314 220031 -120459 -268432 -169544 -234681 181625
18987a88468b3108r2476p6608o0841l2957a09233j7447E5528N9313e5010r0015
$$ -188468 -23108 -115584 -192192 -253033 -285990 -109233 -126680 55528 114841 -55010 -145025
18976a45025B0472e11104a70347o5317B45072D6975o504a43809j36703J13462
$$ -145025 20472 -511104 -170347 -235664 245072 46975 40471 -143809 -280512 -167050
18966a67050l7947P042k9754A76079N2163a22272M5441A65612a49018H8843l9206
$$ -167050 -204997 -197955 -227709 176079 228242 -122272 -76831 165612 -149018 88843 49637
18955D9637B4175c47924a5373G6421A9739Q5567k4090b9164D9045a4091l6842
$$ 49637 24175 -347924 -15373 76421 19739 105306 81216 -29164 49045 -14091 -50933
18944e0933b4482o8215j88752I9105d4396j60881A34889a90784c8000M658E5025
$$ -50933 -24482 -92697 -281449 99105 -44396 -205277 134889 -190784 -38000 -33342 55025
18932B48017B0418a56011b7873j29779B64872r9165a4407l34609a63993A24318
$$ 248017 20418 -156011 -27873 -157652 264872 165707 -14407 -349016 -163993 124318
18921A51680a95315N1053B2726a16628o0705r8654a30796K8231k07084h8942I2847
$$ 151680 -195315 -144262 22726 -116628 -177333 -275987 -130796 -102565 -309649 -88942 92847
18909A42132d3211j11230A07191B9773J86657j00221L4691I705b40909B01971
$$ 142132 -43211 -154441 107191 29773 216430 116209 150900 9705 -240909 201971
18898d6486A40040l0063c524j03794j50051B79270a79196o777F5505h242k67285
$$ -46486 140040 109977 -3524 -107318 -257369 279270 -179196 -185973 65505 -8242 -275527
18887b75527d0214m5385j20046h3891A64790G5730H792c16906F7184R4960a03280
$$ -275527 -40214 -85599 -205645 -83891 164790 75730 8792 -316906 67184 162144 -103280
18875A08894b87746h0304B04999e242j09311j08474A48947J4121i0385j31929
$$ 108894 -287746 -80304 204999 -5242 -114553 -223027 148947 163068 -90385 -222314
18865b22314q1464A37083h1780J8493A49175a15070A13347R7292I6446J15195
$$ -222314 -303778 137083 -81780 -63287 149175 -115070 113347 210639 96446 211641
18855B11641Q4649E8263b20113D3402J25110a41483F3542g0518Q600b2398o4413
$$ 211641 296290 58263 -220113 43402 168512 -141483 63542 -70518 -61918 -22398 -86811
18844h6811p8726J7626C51471a66394L1503F8031e20114a19516r3937J128A09491
$$ -86811 -165537 -147911 351471 -166394 -134891 68031 -520114 -119516 -213453 -212325 109491
18832c09768h4040L8436B84220a18141D737b10056I8559c75929A69112e204F0780
$$ -309768 -84040 -45604 284220 -118141 4737 -210056 98559 -375929 169112 -5204 60780
18820f6078p3865a9270A87934q0055i611j14867B52697I2943i5637A05623a86192
$$ -66078 -139943 -19270 187934 107879 -9611 -124478 252697 92943 -95637 105623 -186192
18808F0692K2503g1572m6551l41352B05379c03790A18789a60880M8885r8711J2706
$$ 60692 83195 -71572 -118123 -459475 205379 -303790 118789 -160880 -111995 -210706 -198000
18797a98000e7137B6792b97332C3944K24629b83794A61621d67393a76893B6848
$$ -198000 -57137 26792 -297332 33944 258573 -283794 161621 -467393 -176893 26848
18786b68549L0339L1347E4751a28299A6356h0905j0388k6048j32277g2812j73965
$$ -268549 -238210 -206863 54751 -128299 16356 -80905 -91293 -117341 -249618 -72812 -246777
18775b46777e600D02089c17445a0556C95086A62797a38275j81342K5377D3083
$$ -246777 -5600 402089 -317445 -10556 395086 162797 -138275 -319617 -294240 43083
18764A1686n532M0329J9111b93170f3003c1487A77426g4957m6031a4356C3468
$$ 11686 6154 46483 65594 -293170 -63003 -31487 177426 -74957 -120988 -14356 33468
18752B0908b1206n8761A42252e5610j84879h7739A7507f6240j80336c6081B75884
$$ 20908 -21206 -79967 142252 -55610 -240489 -87739 17507 -66240 -246576 -36081 275884
18740H2574A4455J86528n7542a82242A02240a57444A48437a30607A10821b2334
$$ 82574 14455 200983 143441 -182242 102240 -157444 148437 -130607 110821 -22334
18729B23228b11664E8525a39029m4735g8453l1315A5999K44843H4370j1189a49451
$$ 223228 -211664 58525 -139029 -183764 -78453 -109768 15999 260842 84370 73181 -149451
18717a72662g4691H7547l7284b49452g1383l42505A68202K1788h0005k11973A33464
$$ -172662 -74691 87547 50263 -249452 -71383 -413888 168202 189990 -80005 -291978 133464
18705a32500c2576j58065a7755k84764a27794C20253a57649d0077j62411l6764
$$ -132500 -32576 -190641 -17755 -302519 -127794 320253 -157649 -40077 -202488 -239252
18695b39252A67423a31378b9958A916b20238F4775J92718a38051O8421j79441
$$ -239252 167423 -131378 -29958 1916 -220238 64775 257493 -138051 -69630 -249071
18685b49071n5985D5946M7283L7754a02375C2545b09129c0491A96257a6893C31152
$$ -249071 -305056 45946 93229 130983 -102375 32545 -209129 -30491 196257 -16893 331152
18673C43285A21799a89390e6737A17346k2067j0282c9966k6113q2206c7109a7460
$$ 343285 121799 -189390 -56737 117346 95279 84997 -39966 -66079 -148285 -37109 -17460
18661G4602d2462I4586b66933D4520i8989L8654K0661l79774C51284a57851c3965
$$ 74602 -42462 94586 -266933 44520 -98989 -60335 -39674 -419448 351284 -157851 -33965
18649H2138f0160a4491k01881N3723A22382P6030O7924B8596c98324a02125k36109
$$ 82138 -60160 -14491 -216372 -162649 122382 198412 266336 28596 -398324 -102125 -338234
18638c38234R8429k3329b0552j03321c8078H0136a62966k42674e5186b3003j09492
$$ -338234 -239805 -263134 -20552 -123873 -38078 80136 -162966 -405640 -55186 -23003 -132495
18627a32495k75459i9615o2083j53993q5827J97625B32909O6316L0786a16513
$$ -132495 -407954 -99615 -161698 -315691 -401518 -203893 232909 299225 330011 -116513
18616g6674J361A66563B6099b51846I0100f2721J9956R632o4857j10870d0566
$$ -76674 -75313 166563 26099 -251846 90100 -62721 -42765 -33133 -97990 -208860 -40566
18604a64354P6580M2365N881n8297j95533j22917J23874b9604j77538E0621c69154
$$ -164354 -87774 -45409 -39528 -97825 -293358 -416275 -292401 -29604 -207142 50621 -369154
18592A81565D7201c22258A14753f8905j49867L7804g3901b2977m703B87118a52138
$$ 181565 47201 -322258 114753 -68905 -218772 -180968 -73901 -22977 -27680 287118 -152138
18580g4553b6900k26519J01263Q768j32102A20039h1166j8351K8125A04785e2335
$$ -74553 -26900 -253419 -152156 -143388 -275490 120039 -81166 -99517 -71392 104785 -52335
18568c07200h5449l5987B03319D6254c275k97258J50230c1266A6180Q6005a57946
$$ -307200 -85449 -121436 203319 46254 -3275 -300533 -150303 -31266 16180 102185 -157946
18556F3157A0975a33024j7634g4641j39214D0749c2266A02545A2859a8789D1016
$$ 63157 10975 -133024 -150658 -74641 -213855 40749 -32266 102545 12859 -18789 41016
18544B16773j07948e999A71067a9331m3560l77680H279a23068j0819D3615L89651
$$ 216773 108825 -5999 171067 -19331 -62891 -440571 8279 -123068 -133887 43615 433266
18533D33266a06040j66627P2191c7468A61877c5001D3268a36295j31186A35534
$$ 433266 -106040 -272667 -200476 -37468 161877 -35001 43268 -136295 -267481 135534
18522A94772g4599B60707a18784L2995k4256A03602J73591A35100D512K74608
$$ 194772 -74599 260707 -118784 -85789 -110045 103602 277193 135100 4512 279120
18512B79120a38564j04122A33524b758j67944l0635l0371N3494A0898a25397B54666
$$ 279120 -138564 -242686 133524 -2758 -170702 -201337 -231708 -178214 10898 -125397 254666
18500D62635a85790A69243b09089O7539p9773j35495A18296c68230b3305n5585
$$ 462635 -185790 169243 -209089 -141550 -221323 -356818 118296 -368230 -23305 -78890
18490g8890k3605B15576b84378c4423A82000f2481h347j32089k2860n2133N9727
$$ -78890 -102495 215576 -284378 -34423 182000 -62481 -8347 -140436 -163296 -215429 -155702
18479a55702F0033c11555B53261n5529D1327J10160P5736I0179a25583A8263J62371
$$ -155702 60033 -311555 253261 197732 41327 151487 227223 90179 -125583 18263 180634
18468A80634G6344l76f1137B00642d7040A05205b70504R0991k1853G2473i9762
$$ 180634 76344 75968 -61137 200642 -47040 105205 -270504 -179513 -201366 72473 -99762
18456a24726J8984K258j80330G7325Q2801D0440k070a4172F2040c08044C1002
$$ -124726 -105742 -103484 -283814 77325 160126 40440 38370 -14172 62040 -308044 31002
18444b53266B1756J4772O2205a04195l9404j03338Q0612j28136a16305d9822j53198
$$ -253266 21756 36528 98733 -104195 -143599 -246937 -166325 -294461 -116305 -49822 -203020
18433b03020J179L2781a17k89962F2841b10538j46863d1508a8116j95500A27606
$$ -203020 -201841 -169060 -117 -290079 62841 -210538 -357401 -41508 -18116 -213616 127606
18421a93870d5028A79706H5131a94349B02494H4375a22904d9556C96077h6153
$$ -193870 -45028 179706 85131 -194349 202494 84375 -122904 -49556 396077 -86153
18410a5745k51950I9624h0399B22146a70753K2122A423a59147E2284a34897A5613
$$ -15745 -267695 99624 -80399 222146 -170753 -148631 1423 -159147 52284 -134897 15613
18398C4224J43651M5447C9975i6941A37579E4990a33844k7277L5086D6166k2242
$$ 34224 177875 223322 39975 -96941 137579 54990 -133844 -161121 -126035 46166 23924
18387B3924b4049m90974a63679A78911L09894a88034r7338c4641I330a42041C15862
$$ 23924 -24049 -515023 -163679 178911 488805 -188034 -285372 -34641 9330 -142041 315862
18375c1512r9E4578K09732a1303D3200a88419d9134B85616C4010A6975O1262A2950
$$ -31512 -31611 54578 264310 -11303 43200 -188419 -49134 285616 34010 16975 78237 12950
18362I6158A6777d0757B38251i0333k28027J26064F6629J56889a31069l47107
$$ 96158 16777 -40757 238251 -90333 -318360 -192296 66629 223518 -131069 -478176
18352d78176A85697L06966q2846f2053B18443E7060K81462h3788A444N8285c11078
$$ -478176 185697 492663 409817 -62053 218443 57060 338522 -83788 1444 59729 -311078
18340c8493B55504e12183J69284B14179d3928j2882k44934A73431f3286j15473
$$ -38493 255504 -512183 -342899 214179 -43928 -56810 -301744 173431 -63286 -178759
18330a78759A84739g2975B49305b05871k14407c755p0722A30961d61396c2909
$$ -178759 184739 -72975 249305 -205871 -420278 -3755 -74477 130961 -461396 -32909
18319a43120A69254H225c02324h7062A78442H7584a09571k36035a14968H9086
$$ -143120 169254 8225 -302324 -87062 178442 87584 -109571 -345606 -114968 89086
18308A48052o2452R1850B8028f4403K8985J4866E9917j7178a32729H2699b62603
$$ 148052 85600 177450 28028 -64403 -35418 -20552 59917 42739 -132729 82699 -262603
18296B5953a37195L9767a0710E05468C6689i6712G1251g8450A17082C2290J36169
$$ 25953 -137195 -97428 -10710 505468 36689 -96712 71251 -78450 117082 32290 168459
18285A68459a10683d9357A63993a17597C5939a11980M0235j03191c66k60780G4857
$$ 168459 -110683 -49357 163993 -117597 35939 -111980 -71745 -174936 -366 -261146 74857
18273b8026j64647G3525a82187I548c4539B98314B7652b8658k32347A8406g3441
$$ -28026 -192673 73525 -182187 9548 -34539 298314 27652 -28658 -261005 18406 -73441
18261a18187k23010E7237Q7592b07798c7906j04104A49180c48937a57339B27708
$$ -118187 -341197 57237 144829 -207798 -37906 -142010 149180 -348937 -157339 227708
18250a89678j31758a36129d3473A0260a61851M6608n1031L6764j3024G084b33418
$$ -189678 -321436 -136129 -43473 10260 -161851 -115243 -166274 -129510 -142534 7084 -233418
18238c8304F0683b45051O3568Q0183j75150j765A50700b21200I19P4112c05256
$$ -38304 60683 -245051 -181483 -101300 -276450 -278215 150700 -221200 919 75031 -305256
18226a38062j81248g8968p0667O8351m989A31362h3990A34777f30j7169k8212
$$ -138062 -319310 -78968 -149635 -81284 -86273 131362 -83990 134777 -630 -17799 -46011
18215d6011m5271A06142b7000r7705j59530B28000a99480c9371r7793f4344A3581
$$ -46011 -91282 106142 -27000 -124705 -284235 228000 -199480 -39371 -137164 -64344 13581
18203a03374j5529j28224P4372A8548H522J64139k5918N6215r3505f8225j64076
$$ -103374 -118903 -247127 -172755 18548 8522 172661 146743 202958 109453 -68225 -232301
18192b32301B82678c24693B06300l7473c17727a0332k30068A46346K09994a15835
$$ -232301 282678 -324693 206300 168827 -317727 -10332 -240400 146346 356340 -115835
18181F22a1431q4987b7238I83c65309a8269O161H4379a56613K0586M0007B16066
$$ 622 -11431 -96418 -27238 983 -365309 -18269 -12108 84379 -156613 -136027 -96020 216066
18168C9991h5317k14704a34243J0108M6041L1486M727C9834f5180E8336b10588
$$ 39991 -85317 -300021 -134243 -124135 -78094 -46608 -41881 39834 -65180 58336 -210588
18156I9074a78439I7557J98148a77287j06188I7793Q218J51242C6741f5725p1833
$$ 99074 -178439 97557 295705 -177287 -283475 97793 106011 257253 36741 -65725 -137558
18145a37558l3528g3188j6593K7732B2050c74129J1126a25226b4465A64257D9034
$$ -137558 -171086 -73188 -89781 -62049 22050 -374129 -363003 -125226 -24465 164257 49034
18133A72952h7246j57297g2875p9179k64113J29200K2419A90109g5021k7980B1445
$$ 172952 -87246 -244543 -72875 -152054 -416167 -286967 -264548 190109 -75021 -103001 21445
18121d0671j78963i1923m7926N8977n0008N1314C20954D9068A731c42807B8645
$$ -40671 -219634 -91923 -139849 -80872 -130880 -79566 320954 49068 1731 -342807 28645
18109a3486B75860A21632a25056N5011r898B30589a70283A61046c18401a01844
$$ -13486 275860 121632 -125056 -70045 -79943 230589 -170283 161046 -318401 -101844
18098a13444H3111L7428A2803Q9774a26047e4475l83B12124e1391G2583O4704
$$ -113444 83111 120539 12803 102577 -126047 -54475 -54858 212124 -51391 72583 137287
18087A37287C5263d863j50713j73043h7191j21904m7110J11036N3561l6176A13730
$$ 137287 35263 -4863 -155576 -328619 -87191 -209095 -256205 -145169 -91608 -127784 113730
18075I7456b4164G268L41759F7350a70734A00131o958e6358k1190B57333q8119
$$ 97456 -24164 7268 349027 67350 -170734 100131 93173 -56358 -77548 257333 169214
18064A69214b21157R7169l3088P0571j78835i9656n0405k1163b3530m6114l9733
$$ 169214 -221157 -123988 -157076 -86505 -265340 -99656 -150061 -171224 -23530 -69644 -109377
18053a09377A85012p314a92915j91564F7294g3766B15081H38b49340p4160J50759
$$ -109377 185012 177698 -192915 -384479 67294 -73766 215081 838 -249340 -323500 -172741
18042a72741d6076B1464M4362J51811G0313J48717L0144q8800a50027H4283k1947
$$ -172741 -46076 21464 65826 217637 70313 219030 249174 160374 -150027 84283 62336
18031F2336J08589b82018e3836k3738D085K5897b23301h0056p7570I3919h530
$$ 62336 170925 -282018 -53836 -77574 4085 29982 -223301 -80056 -157626 93919 -8530
18019A4525J23480o8160B280d52819E0685K02100d44610a64158o1856D25650a28912
$$ 14525 138005 69845 2280 -452819 50685 252785 -444610 -164158 -226014 425650 -128912
18007d5883k17736c977A63377e1141o4311d0034m171B264J82261J16262B0308
$$ -45883 -263619 -3977 163377 -51141 -115452 -40034 -44205 2264 184525 300787 20308
17995d7743j28104B60518a11519B31983B6842d00501B12231l7969J03184a94194
$$ -47743 -175847 260518 -111519 231983 26842 -400501 212231 174262 277446 -194194
17984B46683q011a52445q34g4728b4622A17504M804b63403A1831K818L5423N0120
$$ 246683 238672 -152445 -153279 -74728 -24622 117504 122308 -263403 11831 14649 50072 100192
17972A00192d9759b1194L038k50299a31778o275A24654J58815a27037M4027E7353
$$ 100192 -49759 -21194 -18156 -268455 -131778 -138053 124654 283469 -127037 -83010 57353
17960B46409a0652o5227l8482F402a44603J8649N3566E28i6850D1960b46846A644
$$ 246409 -10652 -75879 -114361 6402 -144603 -125954 -72388 528 -96850 41960 -246846 1644
17947A16320b99332A60320O1871f4675A40467b55062J582f3245B67482F242a96093
$$ 116320 -299332 160320 222191 -64675 140467 -255062 -253480 -63245 267482 6242 -196093
17935a25287F9566f613j05967A19065O8604b91324A04480D768c19720e8866j55956
$$ -125287 69566 -6613 -112580 119065 187669 -291324 104480 4768 -319720 -58866 -214822
17924b14822R6406j72166c0624j2996j21020A60291b6469j26908e30q6023G4983
$$ -214822 -118416 -290582 -30624 -43620 -164640 160291 -26469 -153377 -530 -86553 74983
17912A40540L2889h5655d1401j7256F7909a77490M949f8258E856b36419M4569
$$ 140540 173429 -85655 -41401 -58657 67909 -177490 -172541 -68258 5856 -236419 -191850
17901a91850F8694B0855Q8255B8817K87054D2457a65841A05737K13867j58742
$$ -191850 68694 20855 109110 28817 315871 42457 -165841 105737 319604 160862
17891A60862O2717b98259B27849a515j69375b4918C5418a2518A08153L490D9414
$$ 160862 223579 -298259 227849 -1515 -170890 -24918 35418 -12518 108153 111643 49414
17879a03480j46054O8686B91976a90142b5513k5062B18419b6532A02731a19453
$$ -103480 -249534 -180848 291976 -190142 -25513 -50575 218419 -26532 102731 -119453
17868g2037B80762n0154B3431b78011D37351a62218M4000j40890O0465P4607L1026
$$ -72037 280762 230608 23431 -278011 437351 -162218 -118218 -259108 -198643 -124036 -93010
17857i3010n9404A84661k6664b91948f1238B7270c64306a0594C53386A43908K4912
$$ -93010 -152414 184661 157997 -291948 -61238 27270 -364306 -10594 353386 143908 168820
17846A68820a07878b2156j04791B85864E7101L3036c19072A66643E5750d46008
$$ 168820 -107878 -22156 -126947 285864 57101 90137 -319072 166643 55750 -446008
17835a64113a0828D29510b63223E5621b10052B8217c30521A54517D7471K49216
$$ -164113 -10828 429510 -263223 55621 -210052 28217 -330521 154517 47471 296687
17825B96687A40353R2447H6421a82469A53382N1526c1170A65385F2949L0609a17449
$$ 296687 140353 232800 86421 -182469 153382 204908 -31170 165385 62949 93558 -117449
17813a29666m57757F1199a56866N4690d1924A25998j2750D6382Q1120h5891a721
$$ -129666 -587423 61199 -156866 -102176 -41924 125998 113248 46382 127502 -85891 -1721
17801A2342d13224A63967c40003G1131c18518B65163A5330d4109r298G3962k1826
$$ 12342 -413224 163967 -340003 71131 -318518 265163 15330 -44109 -53407 73962 52136
17790E2136k2882c24267f4154p961H8697A3677c51753c868q1972I529m291f3777
$$ 52136 29254 -324267 -64154 -72115 88697 13677 -351753 -3868 -85840 9529 5238 -63777
17777a03913A20104c8255n4569L7115A42660b91129M7306a5790n3420j1556C2063
$$ -103913 120104 -38255 -92824 -55709 142660 -291129 -243823 -15790 -69210 -80766 32063
17765A42989f9092k05474d2996j42238G3100P2140K58386b71820C5587a41037
$$ 142989 -69092 -274566 -42996 -185234 73100 145240 403626 -271820 35587 -141037
17754A12782R0630q7003j4695C8045A2809a74082F868a7660j14788A59143O9551
$$ 112782 203412 116409 101714 38045 12809 -174082 6868 -17660 -132448 159143 228694
17743B28694k6861b0459p5183A75431J3724B7467c0525n592K967m17894g7732
$$ 228694 201833 -20459 -95642 175431 189155 27467 -30525 -36117 -33150 -451044 -77732
17731A12074b08202j27792j18926a124k13145m1008D0965a86831B8542a78335
$$ 112074 -208202 -335994 -454920 -1124 -214269 -255277 40965 -186831 28542 -178335
17720a76588C66816A10577j2814h5669j04290G5128l5439a5620j53928A40513
$$ -176588 366816 110577 97763 -85669 -189959 75128 39689 -15620 -169548 140513
17709a97363e111j16880j02296A94598d82129a24029A03518K4891d3119E2813
$$ -197363 -5111 -121991 -224287 194598 -482129 -124029 103518 128409 -43119 52813
17698D2769a19745o9051I7965m0248k3433P1304J55004M7585B5601J17665k2353
$$ 42769 -119745 -188796 97965 57717 34284 105588 260592 308177 25601 143266 120913
17687A20913b94014J42406I1344R9222F5671i4068H3179A8118J29021g7983p1636
$$ 120913 -294014 -151608 91344 190566 65671 -94068 83179 18118 147139 -77983 -149619
17676a49619A7420g0973k76483A17642f0369A20675k0420O672b10319A36525m6833
$$ -149619 17420 -70973 -347456 117642 -60369 120675 100255 106927 -210319 136525 89692
17665H9692J3952O9899a7534C0105N9395J53921a31079A22083n9403c11488B15031
$$ 89692 103644 173543 -17534 30105 89500 243421 -131079 122083 62680 -311488 215031
17653e0523j47838P8288h595j16370A20261k5285d2969j70550A1034a59785J8767
$$ -50523 -198361 -120073 -8595 -124965 120261 94976 -42969 -213519 11034 -159785 -141018
17642a41018B8424D497J66870g268j90656C93745C7457a30211A67081p5833K60113
$$ -141018 28424 4497 171367 -7268 -197924 393745 37457 -130211 167081 91248 351361
17631C51361F3133J08176a00067G2710L3186O9971a48708k77423A93197K26022
$$ 351361 63133 171309 -100067 72710 105896 175867 -148708 -426131 193197 419219
17621D19219a39376A50082J74007i2293B0921a4916B82784A10587a73696A3900
$$ 419219 -139376 150082 324089 -92293 20921 -14916 282784 110587 -173696 13900
17610a51067A64334a06880B12714a17900n9942H5357a0303j40934A46345P367
$$ -151067 164334 -106880 212714 -117900 -177842 85357 -10303 -151237 146345 153712
17600A53712c2458C8560j2523M6770a03694e0275E6172b90868G7213J51811b39166
$$ 153712 -32458 38560 26037 72807 -103694 -50275 56172 -290868 77213 229024 -239166
17588b7616A70586C012M7955b47775A28837h1731k16376i6971A61557J30336N8550
$$ -27616 170586 3012 50967 -247775 128837 -81731 -298107 -96971 161557 291893 350443
17577C50443F9494k8193J78119B0020M0555J19631J42675r6505a02015m4497E3577
$$ 350443 69494 41301 219420 20020 60575 180206 322881 226376 -102015 -146512 53577
17565A26666h1434A68382b67518A88223J21462B4012h4681C0350b33660G2561
$$ 126666 -81434 168382 -267518 188223 309685 24012 -84681 30350 -233660 72561
17554A44252d03283h4536J8027D3684q594J66061a18670f9A0527f9360C4124R3328
$$ 144252 -403283 -84536 -66509 43684 35090 201151 -118670 -69 10527 -69360 34124 127452
17542A27452m0592L3275J29460o1116M4823E2842a35791B41002m4788H3739R8747
$$ 127452 86860 120135 249595 188479 233302 52842 -135791 241002 196214 83739 182486
17531A82486a60376E5044M3347e095A17408J8370D5486J8047J7029d4759j32104
$$ 182486 -160376 55044 98391 -5095 117408 135778 45486 63533 80562 -44759 -176863
17520a76863J2113l2600A31307E3774A2752i644j36553e3297A91472g503D4467
$$ -176863 -164750 -197350 131307 53774 12752 -9644 -146197 -53297 191472 -7503 44467
17508B02633a01321B20122a9653j23265P0822L1410b15p4854B36054A8473a7122
$$ 202633 -101321 220122 -19653 -142918 -72096 -40686 -215 -75069 236054 18473 -17122
17496C32659j54442J81402j07018p5003A5362R6057A4286K64040p6098B9158N4849
$$ 332659 178217 359619 252601 177598 15362 111419 14286 278326 202228 29158 84007
17485H4007J19495E877b55330D1704J15255L7357K30884L6046G1643K65867n0541
$$ 84007 203502 5877 -255330 41704 156959 194316 425200 461246 71643 337510 286969
17474B86969i5234A02238G344J36838k8355l1093a67547J6228B80750a85825Q6134
$$ 286969 -95234 102238 7344 144182 115827 84734 -167547 -151319 280750 -185825 -99691
17463i9691B82023J03778I9167C9394J32934F9608A3712f8496G4943f8355C05363
$$ -99691 282023 385801 99167 39394 172328 69608 13712 -68496 74943 -68355 305363
17451B50365j0095E6338K1488P40393A71965g1626D68923C2987a95649A25238
$$ 250365 240270 56338 77826 818219 171965 -71626 468923 32987 -195649 125238
17440A8311L03125Q9777A73946P513A5686a30157A36132c7648E162P6730a22818
$$ 18311 321436 411213 173946 181459 15686 -130157 136132 -37648 5162 81892 -122818
17428D02780A14350B6790f600A86162H9336J49069j07387K88866g1511H9149I333
$$ 402780 114350 26790 -6600 186162 89336 238405 131018 419884 -71511 89149 9333
17416E2983a74181n5808B59637P1750j37767j3284n4361a04330A63621h372l65
$$ 52983 -174181 -229989 259637 331387 193620 180336 125975 -104330 163621 -8372 -8737
17405h737D34532C1639K59768C6082K07076I939b10988A17908J4580J32300K3554
$$ -8737 434532 31639 291407 36082 243158 9939 -210988 117908 132488 264788 288342
17394B88342c5054F4867A0729K6491a0555E9571K84321j29304Q4947E2718L8828
$$ 288342 -35054 64867 10729 37220 -10555 59571 343892 214588 299535 52718 91546
17383I1546e2092J2997A91788C4179J27195G291L67384J0867j49951h4337J0145
$$ 91546 -52092 -39095 191788 34179 161374 7291 374675 385542 235591 -84337 -74192
17372g4192A00150J37534r3545c44593F88146D2974h1803c922D2481a66609K3929
$$ -74192 100150 237684 144139 -344593 688146 42974 -81803 -3922 42481 -166609 -142680
17361a42680e8825A34539F1604a02774G5812L023O1206k2787m9622O4043M3726
$$ -142680 -58825 134539 61604 -102774 75812 78835 140041 117254 67632 131675 175401
17350A75401q5491P7713K09871f3538B61607n3538C0670j3360M04169j67273G4341
$$ 175401 89910 167623 377494 -63538 261607 208069 30670 17310 421479 254206 74341
17338i7243F1720a36792A90374l1881Q6241I740d0435R469o5266A10239D6086
$$ -97243 61720 -136792 190374 158493 244734 9740 -40435 -30966 -96232 110239 46086
17326E26146I6870C6357K66619b53826a4676C97724b99388I4830L21050D1814
$$ 526146 96870 36357 302976 -253826 -14676 397724 -299388 94830 415880 41814
17315i0504H7811J26945a71495H68L30446k6412N3075A07004J59931E2323K02942
$$ -90504 87811 214756 -171495 868 331314 304902 357977 107004 266935 52323 255265
17304B55265a15138A60320J41568b27016h847D30579j61409h8533n3821A01638
$$ 255265 -115138 160320 301888 -227016 -8847 430579 269170 -88533 -142354 101638
17293C22969k214a84848B71348K19884A13987K55987A22192J31868d2895B60485
$$ 322969 320755 -184848 271348 491232 113987 369974 122192 254060 -42895 260485
17282B52011E1496a09305C85800a61660G969J24946K75484m7398B951M4342K9415
$$ 252011 51496 -109305 385800 -161660 7969 132915 408399 361001 2951 47293 76708
17271G6708h8580o9381f2724C24310A05456m7707L8023K5392J89R9477a30914
$$ 76708 -88580 -157961 -62724 324310 105456 57749 95772 121164 121353 220830 -130914
17259A21209d8359A01883J28445n1885M5524J4532l9984R2098C1091O6067K97178
$$ 121209 -48359 101883 230328 178443 223967 238499 198515 290613 31091 97158 394336
17248C94336r5150C1282K11791D7376J25167K0745D0296H545J35214o2074K86238
$$ 394336 299186 31282 243073 47376 172543 193288 40296 8545 143759 81685 367923
17237C67923q0025b0206k45049A59503a89324B61147E9841K05702Q3141J02825
$$ 367923 287898 -20206 -265255 159503 -189324 261147 59841 265543 348684 451509
17227D51509A59617e0555E4031L54822j03061E8233L01180f4467A11562n1670
$$ 451509 159617 -50555 54031 408853 305792 58233 359413 -64467 111562 59892
17217E9892K62435A31421K46435A9807c2356B06086p3660L01979b05711A00168
$$ 59892 322327 131421 377856 19807 -32356 206086 132426 434405 -205711 100168
17206A42347J97311j34107P3311J28069q9197K30439B62879K14513D4085J62444
$$ 142347 339658 205551 278862 406931 317734 548173 262879 477392 44085 206529
17196B06529L8570P2092N9464k4316J07196k19137q013b3439A45787L9665N2121
$$ 206529 245099 317191 376655 352339 459535 240398 232385 -23439 145787 185452 237573
17185B37573d4662C6989M1812J95536m4731K360m9374J49947n5605b8213A76824
$$ 237573 -44662 36989 78801 274337 229606 231966 182592 332539 276934 -28213 176824
17173B55427P805l3540N217o3022P1393E2519J27530G1521K06678j24362k9046
$$ 255427 263232 229692 234909 171887 243280 52519 180049 71521 278199 153837 124791
17162A24791N2915f9143B37057J95952q8123A07343J87647j3861J01160I9035
$$ 124791 177706 -69143 237057 433009 344886 107343 294990 281129 382289 99035
17151C09487J10438j65222D1321N2833K96614E9920J73164o6373L75529k62774
$$ 309487 419925 254703 41321 94154 390768 59920 233084 166711 542240 279466
17141B79466B5764K13167K9886J05622A62369N9253J09099P8229A08777L0512
$$ 279466 25764 238931 268817 374439 162369 221622 330721 408950 108777 139289
17131A39289l4582K32467R9000j61095m8751G5638K2826J4116K73286A01128L17241
$$ 139289 104707 337174 436174 275079 226328 75638 98464 112580 385866 101128 418369
17120D18369A87709B8988O3144M22750B39803K66454k10302a73550A76762A972
$$ 418369 187709 28988 92132 514882 239803 506257 295955 -173550 176762 1972
17109D45282j64521K75609J4829A79886J84595a64234A88739C9842L254K12369
$$ 445282 280761 556370 571199 179886 364481 -164234 188739 39842 43096 255465
17099B55465j24760K07058j21155J45559j6857C1523M38329K224B12937Q6233
$$ 255465 130705 337763 216608 362167 345310 31523 469852 472076 212937 299170
17089B99170F0635L35944j19586L5983q7661M7773J7201J15326m3208j09002n3355
$$ 299170 60635 396579 276993 312976 225315 273088 290289 405615 362407 253405 200050
17078B00050K20936n9416n3040q7197J90014p9429N6789M7127j28091k4002j24179
$$ 200050 420986 361570 308530 221333 411347 331918 388707 435834 307743 283741 159562
17067A59562L42972l3985o0717r0587j08546J86400K28525j93143A42717K68166
$$ 159562 502534 468549 407832 317245 208699 395099 623624 430481 142717 410883
17057D10883f6877A82323K78139D0539L08810A30169K44177a38899E74290A459
$$ 410883 -66877 182323 460462 40539 349349 130169 374346 -138899 574290 1459
17046C91465J41917j68848J79739j95592A47823P2607M39154j25651L04624l40262
$$ 391465 533382 364534 544273 348681 147823 220430 659584 533933 838557 498295
17036D98295H7807K38541L23481n3535j71849j17452j4717M55609l68437K43859
$$ 498295 87807 326348 649829 596294 424445 306993 292276 747885 379448 623307
17026F23307R7838C36890J49763m7169p8127J37907j83935K30901k34549L60209
$$ 623307 721145 336890 486653 439484 361357 499264 315329 546230 311681 671890
17016F71890A09315N31588A87257M44331k22309M2132J82464d6083C59073P18504
$$ 671890 109315 640903 187257 631588 409279 451411 633875 -46083 359073 1077577
17006A077577C81919J24226k19427K34245j30973L00802r8247o0856A76047J92391
$$ 1077577 381919 506145 286718 520963 389990 690792 592545 531689 176047 368438
16996C68438K75952j95747K99408M0306l32237J77768o3708K4067B71881K84134
$$ 368438 644390 448643 748051 788357 456120 633888 570180 594247 271881 556015
16986E56015J7090M13841j67529k64744n8749j62541K26112r8221R9273K05560
$$ 556015 573105 986946 819417 554673 495924 333383 559495 461274 560547 766107
16976G66107l6496j25520L3551j58618J78040K17650j53641k8159K691L88602
$$ 766107 729611 604091 637642 479024 657064 874714 721073 692914 695605 1084207
16966A084207l37120k52682L46260o5887j52065L0456k84403P57282m51178r4741
$$ 1084207 747087 494405 840665 774778 622713 653169 368766 1126048 674870 580129
16956E80129J15008K38899K77224m83262J7971k49550L43206q9276O3516K10989
$$ 580129 695137 934036 1211260 727998 745969 496419 839625 750349 813865 1024854
16946A024854m69157L36611k15203K14825j07796k33696K81421l5070J90231J19964
$$ 1024854 555697 892308 677105 891930 784134 550438 831859 796789 987020 1106984
16936A106984J13756E66152L39116R6578k63790R1727J30422j55082L49380k19629
$$ 1106984 1220740 566152 905268 1001846 738056 829783 960205 805123 1154503 934874
16926I34874J21637j14938q2696M9242k6764M10207l62171K75902R980k22052
$$ 934874 1056511 941573 858877 908119 881355 1291562 929391 1205293 1215273 993221
16916I93221p5513L61367j38534L7648L14771p4799m62365J82376M6864m11186
$$ 993221 917708 1279075 1140541 1178189 1492960 1418161 955796 1138172 1185036 773850
16906G73850N36483j64358q1788J01098J45370j97439J13279J02434N3541J45969
$$ 773850 1310333 1145975 1064187 1165285 1310655 1113216 1226495 1328929 1382470 1528439
16896A528439j54416j75564n1348J88274M0241k866L54472m45497K00512j66953
$$ 1528439 1374023 1198459 1147111 1335385 1375626 1372760 1727232 1281735 1482247 1315294
16886A315294K20404k0193Q7204j25658N3458R2522j08618L4032m2014R9350o9792
$$ 1315294 1535698 1515505 1602709 1477051 1530509 1623031 1514413 1548445 1506431 1605781 1535989
16875A535989J39158O3218L0994K49984j75819K20018m34073K31361L78877l33748
$$ 1535989 1675147 1738365 1769359 2019343 1843524 2063542 1629469 1860830 2239707 1905959
16865A905959r3577L28734k17075q8077L18485J7227J58671J31385n5808k52630
$$ 1905959 1812382 2141116 1924041 1835964 2154449 2171676 2330347 2461732 2405924 2153294
16855B153294O7089L63858K464l23761J93813o0424j16293K15088L22506l11049
$$ 2153294 2220383 2584241 2586705 2262944 2456757 2396333 2280040 2495128 2817634 2506585
16845B506585j17686K81073J49355m9935j94655M25330r0401j0026j24441R9024
$$ 2506585 2388899 2669972 2819327 2769392 2574737 3000067 2909666 2899640 2775199 2874223
16835B874223O64310l30650R116P7017O6044k5423n2150l1667L8375L60641J33157
$$ 2874223 3538533 3207883 3216999 3294016 3360060 3334637 3282487 3250820 3289195 3649836 3782993
16824C782993j79728r3736L64579j52188L22927m60080M62869J69778N4367K23301
$$ 3782993 3603265 3509529 3874108 3721920 4044847 3584767 4047636 4217414 4271781 4495082
16814D495082O2337J28403J92014n914j87434R2418l371L80604M0569L42121J82970
$$ 4495082 4557419 4685822 4877836 4871922 4684488 4776906 4773535 5154139 5194708 5536829 5719799
16803E719799j2252k59152O38493m24987J55295L39849Q9334O3435K64223K88945
$$ 5719799 5707547 5448395 6086888 5661901 5817196 6157045 6246379 6309814 6574037 6862982
16793F862982O8417o5345N17715J76836L165N04906l08983P07275K98212K58787
$$ 6862982 6931399 6866054 7383769 7560605 7563770 8068676 7759693 8466968 8765180 9023967
16783I023967K23045J69474L92581n1299M00532K23136N19883J67631J10085Q08062
$$ 9023967 9247012 9416486 9809067 9757768 10158300 10381436 10901319 11068950 11179035 11987097
16773A1987097L19950M63364O32206k09514N51175O36765M55701K98083M99300
$$ 11987097 12307047 12770411 13402617 13193103 13744278 14381043 14836744 15134827 15634127
16764A5634127N79881O31669O90135O57544P09830R98964R31363K87205J268371
$$ 15634127 16214008 16845677 17535812 18193356 18903186 19902150 20833513 21120718 22389089
16755B2389089P18843J353771J023045J221365J191061J338772R66406K320907
$$ 22389089 23107932 24461703 25484748 26706113 27897174 29235946 30202352 32523259
16747C2523259J239113J625815J960493J985025K299105K248778K374230K776772
$$ 32523259 33762372 35388187 37348680 39333705 41632810 43881588 46255818 49032590
16739D9032590K799598L127241L424818L606446L943990M116476M719929M894900
$$ 49032590 51832188 54959429 58384247 61990693 65934683 70051159 74771088 79665988
16731G9665988N208446N612672O528393O029975O784371P521516P783284P462585
$$ 79665988 84874434 90487106 97015499 103045474 109829845 117351361 125134645 132597230
16723A32597230Q486689P663169P662970P892327O577942O258576N196517M013948
$$ 132597230 141083919 148747088 156410058 164302385 170880327 177138903 182335420 186349368
16715A86349368K575329Q82564r44764j726090l315207m962385n992501p065238
$$ 186349368 188924697 189807261 188862497 187136407 183821200 178858815 172866314 165801076
16707A65801076p167415p704545q376085q182529p502244q278562p259888p089265
$$ 165801076 158633661 150929116 142553031 134370502 126868258 118589696 111329808 104240543
16699A04240543o835731o193885n826786n384715n035666m891498m372140l978619
$$ 104240543 97404812 91210927 85384141 79999426 74963760 70072262 65700122 61721503
16691F1721503l787524l471553k963611k881301k704894k819731k205116k006026
$$ 61721503 57933979 54462426 51498815 48617514 45912620 43092889 40887773 38881747
16683C8881747k477376j722161j889566j222106j706213j447573j304215j556787
$$ 38881747 36404371 34682210 32792644 31570538 29864325 28416752 27112537 25555750
16675B5555750r73860q90569j397150p82969j012498j041590n47761q04809p06428
$$ 25555750 24581890 23691321 22294171 21511202 20498704 19457114 18909353 18104544 17398116
16666A7398116n04487n36256n49631p08095r70012l56808k56701k82064j021902
$$ 17398116 16893629 16357373 15807742 15099647 14129635 13772827 13516126 13234062 12212160
16657A2212160l33100l7289p17790l05112n4723o39287j52278m38494j88740q5324
$$ 12212160 11879060 11841771 11123981 10818869 10764146 10124859 9972581 9534087 9345347 9260023
16647I260023l77597k77242j88736k55207o0030q35239J34134o2824j05941l45759
$$ 9260023 8882426 8605184 8416448 8161241 8101211 7265972 7400106 7337282 7231341 6885582
16637F885582l26972n638m5670k61362m32353J64572l26729M3633l69760K16500
$$ 6885582 6558610 6552972 6507302 6245940 5813587 5978159 5651430 5695063 5325303 5541803
16627E541803m30064M7583m44338K19627k55640Q973k5330k558j16449o3104m65434
$$ 5541803 5111739 5159322 4714984 4934611 4678971 4687944 4662614 4660056 4543607 4480503 4015069
16616D015069n9265J49512l54646P6239J71923k67470L6701m30363L24661l63211
$$ 4015069 3955804 4105316 3750670 3826909 3998832 3731362 3768063 3337700 3662361 3299150
16606C299150O9484K24182m17798J3744k8575L9274m06404N6949J44135j35640
$$ 3299150 3368634 3592816 3175018 3188762 3160187 3199461 2793057 2850006 2994141 2858501
16596B858501l81995M27645L7707m3280o58972K1621J71424j15229K73195k39016
$$ 2858501 2476506 2904151 2941858 2898578 2239606 2261227 2432651 2317422 2590617 2351601
16586B351601K27827j06564m28528j30886j3215J87959L15783l15239o754j31187
$$ 2351601 2579428 2472864 2044336 1913450 1900235 2088194 2403977 2088738 2081984 1950797
16576A950797R2539r4305J88000j88148k4601k35089L8642P6032P7611j37617
$$ 1950797 2043336 1949031 2137031 1948883 1924282 1689193 1727835 1803867 1881478 1743861
16566A743861J21518j54236j69212K34426P5593Q7349p63946P47706k57984m92222
$$ 1743861 1865379 1711143 1541931 1776357 1851950 1939299 1175353 1923059 1665075 1172853
16556A172853M28752q6407Q6900N0021k26102k42503J54937j85697K89121P1588
$$ 1172853 1601605 1515198 1602098 1652119 1426017 1183514 1338451 1152754 1441875 1513463
16546A513463k08823K46093k37970J12607j55123j43783Q9553n13826O62153J56803
$$ 1513463 1304640 1550733 1312763 1425370 1270247 1126464 1216017 702191 1364344 1521147
16536A521147l58490j1886P3501j81866n0198K23118k90092K13505j74519J94350
$$ 1521147 1162657 1150771 1224272 1042406 992208 1215326 925234 1138739 964220 1158570
16526A158570J2695J37459l11219J50245j07426p8799K78907j50451j22882k62614
$$ 1158570 1171265 1308724 997505 1147750 1040324 961525 1240432 1089981 967099 704485
16516G04485O58313m17297j91702N27289k81817m1250l78581M51291n7432k86254
$$ 704485 1362798 945501 753799 1281088 999271 958021 579440 1030731 973299 687045
16506F87045j08081M35653m89267K0544M26387q2157N9301j73123K05390k32553
$$ 687045 578964 1014617 525350 545894 972281 890124 949425 776302 981692 749139
16496G49139j28649m9963J20585J60900k05076j0253R2998k80380K54415k21984
$$ 749139 620490 570527 691112 852012 646936 636683 729681 449301 703716 481732
16486D81732N08365C24548J46702L13418j09447K4981j21483q9651J46505K63664
$$ 481732 990097 324548 471250 784668 675221 700202 578719 489068 635573 899237
16476H99237D03132R9452M3276p6945K76465j56799K03812k6180A72520K54480
$$ 899237 403132 502584 545860 468915 745380 588581 792393 766213 172520 427000
16466D27000R1903q8773K32543B75235N6839J54493R8142k44262K84964p3649
$$ 427000 518903 430130 662673 275235 332074 486567 584709 340447 625411 551762
16456E51762j93799j54536L01811k4321o4476l9281J05552m9790K24755R6713
$$ 551762 357963 203427 505238 480917 416441 377160 482712 432922 657677 754390
16446G54390l25733J2941J8833K01554j58847A89724K19040K55603k26786j61016
$$ 754390 428657 441598 460431 661985 503138 189724 408764 664367 437581 276565
16436B76565J21455M1205P6616A21831M28704k60626J30792j05598m5595A00951
$$ 276565 398020 439225 515841 121831 550535 289909 420701 315103 269508 100951
16425B30498J08284q8038J21701K91300A22296K45978A03031M21005j46503A61506
$$ 230498 338782 250744 372445 663745 122296 368274 103031 524036 377533 161506
16414B64806R5673l7650K75625B62614K5875O0228q0152A14881J54905J2333K85161
$$ 264806 360479 322829 598454 262614 288489 348717 268565 114881 269786 282119 567280
16403E67280j46799j91814J26604k758j29637m7238m5429P8261K45011A72880
$$ 567280 420481 228667 355271 352513 222876 175638 130209 208470 453481 172880
16392d8039D07316J45385A38987b1053A6245L10478K23491A83406J61115K71576
$$ -48039 407316 552701 138987 -21053 16245 326723 550214 183406 344521 616097
16382F16097A50561J87273q6247O8159B3694A388L93908o7752o2493K3727L653
$$ 616097 150561 337834 251587 319746 23694 1388 395296 327544 265051 288778 292431
16371B92431j5003l9062j3094m7289J1253J20093I9894J64866O8007A28415K41864
$$ 292431 277428 238366 225272 177983 189236 309329 99894 264760 332767 128415 370279
16360C70279j83262b16257I0086K8039M3517r754K87805E245L1744d4077A93817
$$ 370279 187017 -216257 90086 118125 161642 151888 439693 5245 36989 -44077 193817
16348I5636h0619B85159j40605J63023A24085C2617K54915H5121f4619B03699
$$ 95636 -80619 285159 144554 307577 124085 32617 287532 85121 -64619 203699
16337d213A27501h943H9107K41303e0524C98982b04609D10677j34814M1209B716
$$ -4213 127501 -8943 89107 330410 -50524 398982 -204609 410677 275863 317072 2716
16325B82034i7021A33711k8534J41974C3261j804J53208K991R3080A40061B0592
$$ 282034 -97021 133711 105177 247151 33261 31457 184665 187656 280736 140061 20592
16313B17216a11094j976B03896c3768C71941l3244A587K07846P6317n7219K44599
$$ 217216 -111094 -113070 203896 -33768 371941 338697 1587 209433 285750 228531 473130
16302D73130a03642A35862I514i588C48274j25348j10010j8458l0937L65810r1407
$$ 473130 -103642 135862 9514 -9588 348274 222926 112916 94458 63521 429331 337924
16291C37924A22378N0915O5642a8218A66694m3836B9295M303J24621i5585A72808
$$ 337924 122378 173293 238935 -18218 166694 122858 29295 33598 158219 -95585 172808
16279b75388d7883I4434b11714B59099c9879C14434e8781a3685m4064A24157K34214
$$ -275388 -47883 94434 -211714 259099 -39879 314434 -58781 -13685 -57749 124157 358371
16268C58371a44097A30937a20186A69665c5224j12359p5764B14779o6291J1536
$$ 358371 -144097 130937 -120186 169665 -35224 -147583 -223347 214779 148488 160024
16258A60024a44837E29320A9103K47000b83147h089A02032M7178c7859D07463
$$ 160024 -144837 529320 19103 266103 -283147 -8089 102032 149210 -37859 407463
16247A02300l51O954e3476b0260C8672j0380J27621F5936J09669c4459A82031
$$ 102300 101949 108903 -53476 -20260 38672 28292 155913 65936 175605 -34459 182031
16235H4452k633k1007j1470g5751b7537A40159c26859H1227M6656J48514g5234
$$ 84452 81819 60812 49342 -75751 -27537 140159 -326859 81227 127883 276397 -75234
16223C27461B5499L5771K467J62335J5498E1763P4100n4540K52425a97406A82608
$$ 327461 25499 61270 63737 226072 241570 51763 125863 71323 323748 -197406 182608
16211b19034F994e4502F8757J9528b6494A72677p4827j8439L0563k6553g3405
$$ -219034 6994 -54502 68757 88285 -26494 172677 97850 79411 109974 83421 -73405
16199f3523I8744B1313r194a53386B03675L4927c7988A61174o1367j7643M2416
$$ -63523 98744 21313 12119 -153386 203675 238602 -37988 161174 99807 82164 124580
16188A24580a2614B4975f4118A82770Q8567c3456A70608B120b8493j58557P7612
$$ 124580 -12614 24975 -64118 182770 271337 -33456 170608 2120 -28493 -187050 -109438
16177a09438l7136B03060G7876B0270M09374b11210H0814L41813I9482G894J71091
$$ -109438 -146574 203060 77876 20270 429644 -211210 80814 422627 99482 7894 178985
16166A78985H8692J22833F9922N3367b23448c6408E9821c7556J6076B57177b8558
$$ 178985 88692 211525 69922 123289 -223448 -36408 59821 -37556 -21480 257177 -28558
16154a19270C88698A08541a98074A82344e05k32413B04611C7934h0197C11437
$$ -119270 388698 108541 -198074 182344 -505 -232918 204611 37934 -80197 311437
16143B60191j4146j01419M4639H3900b09251B09393a54995f4514j7726I974J29126
$$ 260191 246045 144626 189265 83900 -209251 209393 -154995 -64514 -82240 9974 139100
16132A39100J77153b85732B06631B8271b30908N2139j09055B11331C3977h818
$$ 139100 316253 -285732 206631 28271 -230908 -178769 -287824 211331 33977 -8818
16121c41998j8837A04256e8467m0381l01791a73313c1982q5299A35276C5823J08424
$$ -341998 -360835 104256 -58467 -98848 -400639 -173313 -31982 -117281 135276 35823 144247
16110A44247m0024h0757J279A5060f1572B21009g0793n2823B06525P1675E4478
$$ 144247 104223 -80757 -79478 15060 -61572 221009 -70793 -123616 206525 278200 54478
16098C03376a20667E172a1267B0922J616a79216A46038c29493A09353f1857j20639
$$ 303376 -120667 5172 -11267 20922 22538 -179216 146038 -329493 109353 -61857 -182496
16087a82496A61535A6236J98634A6743a20970a8162j94529C7304f7103d093G432
$$ -182496 161535 16236 214870 16743 -120970 -18162 -212691 37304 -67103 -4093 7432
16075h3407C3097q753O2809e0148A22753J21617A11943J39619a00943a2813A75885
$$ -83407 33097 24344 87153 -50148 122753 244370 111943 251562 -100943 -12813 175885
16063h8980j40444Q8047q5502R3565f5506B8773a35694o1845h6400b3788D1861
$$ -88980 -229424 -141377 -226879 -133314 -65506 28773 -135694 -197539 -86400 -23788 41861
16051b16103A10014J55619F0865a85862A36294P1769i375k03727h3944B7350b32820
$$ -216103 110014 265633 60865 -185862 136294 208063 -9375 -213102 -83944 27350 -232820
16039a04660r5347e2100A04240g9898C68523c86546A39082O3796A0936K3059a01238
$$ -104660 -200007 -52100 104240 -79898 368523 -386546 139082 202878 10936 33995 -101238
16027b73942L2204b7064H1966a82763d8573H2164P391h313j49237A6544d7928
$$ -273942 -241738 -27064 81966 -182763 -48573 82164 89555 -8313 -157550 16544 -47928
16015A74300c53182j32039a5024A07901n796b21232g5630p6621C9354K15483j18237
$$ 174300 -353182 -485221 -15024 107901 102105 -221232 -75630 -152251 39354 254837 136600
16004A36600n0061a22334j69804d1360j37648g2251j09501h7397k11798J27606
$$ 136600 86539 -122334 -292138 -41360 -179008 -72251 -181752 -87397 -299195 -171589
15994a71589L3236j34822H4455d14649F3112L58600k07409a08534o5757D4180
$$ -171589 -138353 -273175 84455 -414649 63112 421712 214303 -108534 -174291 44180
15983h1793m4066D8845J26884N2575B0725a8407o6775r1493G2097b79879b2374
$$ -81793 -125859 48845 175729 228304 20725 -18407 -85182 -176675 72097 -279879 -22374
15971c0831G7245R6268b38985g1692A97456A3376L2851n573a68618o5872B15608
$$ -30831 77245 173513 -238985 -71692 197456 13376 46227 40654 -168618 -234490 215608
15959b28478F2520a53783A17829b47897A73023d14309a45326B80011A18761h3315
$$ -228478 62520 -153783 117829 -247897 173023 -414309 -145326 280011 118761 -83315
15948g7152H6872J75449I574M8936a47290j67478H9727N1050n3021J38527a27348
$$ -77152 86872 262321 9574 58510 -147290 -314768 89727 140777 87756 226283 -127348
15936a87577B1315b9492j86183n0550J08393G3318J48142j04170b3360A76965
$$ -187577 21315 -29492 -215675 -266225 -157832 73318 221460 117290 -23360 176965
15925A11614a85477J8389B7991a13552d586j84062l015Q6043A43421E9080j1912
$$ 111614 -185477 -167088 27991 -113552 -4586 -188648 -191663 -105620 143421 59080 47168
15914D7168J45652g6876A35149a18957H744a71910F1286i0906r3359J3287C67154
$$ 47168 192820 -76876 135149 -118957 8744 -171910 61286 -90906 -184265 -170978 367154
15902d1222C86226A02274a83396B23502r9427O0571A066M0844P3250a61471I3459
$$ -41222 386226 102274 -183396 223502 124075 184646 1066 41910 115160 -161471 93459
15890e0633k97486a68342Q1029A11269n4312f1148A76888a65596A8193J0221a47680
$$ -50633 -348119 -168342 -87313 111269 56957 -61148 176888 -165596 18193 28414 -147680
15878a57423k6359f9634K1774j67697a05635E9756j9114b65136j31015A7131m482
$$ -157423 -183782 -69634 -47860 -215557 -105635 59756 40642 -265136 -396151 17131 12649
15867A2649K12031B1628a13156n7204A23502c20378A29947c53791a65951L6666
$$ 12649 224680 21628 -113156 -170360 123502 -320378 129947 -353791 -165951 -129285
15857a29285l8352A64097J62330A54214J52421a62488m84143a65596F72b4782
$$ -129285 -167637 164097 326427 154214 306635 -162488 -646631 -165596 672 -24782
15846b16221G8196i0023D8811b25498d2846f059j10531k69836c9078C04330O2110
$$ -216221 78196 -90023 48811 -225498 -42846 -6059 -116590 -386426 -39078 304330 366440
15835C66440b27541h5453B06117l9415d8125k571E2831f0721A82448p5216N2816
$$ 366440 -227541 -85453 206117 166702 -48125 -50696 52831 -60721 182448 107232 160048
15824A60048a00376A18979j9865c19438k8314a58719a7155j08928C09725d43j42969
$$ 160048 -100376 118979 99114 -319438 -347752 -158719 -17155 -126083 309725 -443 -143412
15813a43412B0385b30638B73353B190M1695a02577r0159A09511b73559a16545
$$ -143412 20385 -230638 273353 2190 43885 -102577 -192736 109511 -273559 -116545
15802F6880O9858b3654j18724e382A34050C6175O0909b58566P2036A82670b2518
$$ 66880 136738 -23654 -142378 -5382 134050 36175 97084 -258566 -186530 182670 -22518
15790h9353b8029B15222c07738d3588A6653a83792h9895k80660A17657h9434H4224
$$ -89353 -28029 215222 -307738 -43588 16653 -183792 -89895 -370555 117657 -89434 84224
15778g0715B11943e2269A19442E4412d1867o2525D0257L6349i674A65704F8649
$$ -70715 211943 -52269 119442 54412 -41867 -104392 40257 76606 -9674 165704 68649
15766b20887E293M19477f5293n7793B52070i3442A69157b02532B40399G6310d4860
$$ -220887 5293 424770 -65293 -123086 252070 -93442 169157 -202532 240399 76310 -44860
15754E0680b09134j6363B63982D1956L5054c4586B3289J20946J76950j9684A2483
$$ 50680 -209134 -225497 263982 41956 77010 -34586 23289 144235 321185 301501 12483
15742c12822a45108d7001B99008J12172A36754j1485a16557d6310J8762k16659
$$ -312822 -145108 -47001 299008 411180 136754 125269 -116557 -46310 -27548 -244207
15732b44207k39174G3566e4919i856j60095d9077q5353j27696B92799b8179k57906
$$ -244207 -483381 73566 -54919 -9856 -169951 -49077 -134430 -262126 292799 -28179 -286085
15721b86085F6459K098b60195B9544K5748j7474N7184a96420G3367B2131c6820
$$ -286085 66459 68557 -260195 29544 55292 37818 95002 -196420 73367 22131 -36820
15709c5910j61933m8304Q1597A3348e896j31885N4395F3728a36003B77834a37082
$$ -35910 -197843 -246147 -164550 13348 -5896 -137781 -83386 63728 -136003 277834 -137082
15697c66153A10983D8633R9307O2508f3415j58395A10178n3232a94284e0046j18111
$$ -366153 110983 48633 147940 210448 -63415 -221810 110178 56946 -194284 -50046 -168157
15686a68157H2352c8114H1826a61869b3949j62486p9658f9246A70810c0111q1622
$$ -168157 82352 -38114 81826 -161869 -23949 -186435 -266093 -69246 170810 -30111 -111733
15675a11733A35826d3712I4296a87948m4519F6492Q131P0746a00055M9697H9364
$$ -111733 135826 -43712 94296 -187948 -232467 66492 74623 145369 -100055 -50358 89364
15663B72089h0827q1722O160g6168A30190a95239C64022I9273J43295a3006j40778
$$ 272089 -80827 -162549 -156389 -76168 130190 -195239 364022 99273 242568 -13006 -153784
15652a53784g5658j0402C8271a63853k32547a73761l4308B10002a23039N4722
$$ -153784 -75658 -86060 38271 -163853 -396400 -173761 -208069 210002 -123039 -68317
15642f8317j15433M6398O1751c4114q775l32989a43966j5397J9326F4557k9355
$$ -68317 -183750 -137352 -75601 -34114 -42889 -375878 -143966 -159363 -140037 64557 35202
15631C5202b59214b1388q7473A33950m1162R526a45285j7673B94486q9216j7125
$$ 35202 -259214 -21388 -108861 133950 92788 102314 -145285 -162958 294486 205270 188145
15620A88145a03742C5262N5130c93140h0942j3780l3493A91749i2255H627R7334
$$ 188145 -103742 35262 90392 -393140 -80942 -94722 -128215 191749 -92255 8627 105961
15609A05961a23625D3349j7573J71448l2691c8063p1793L514b4196j16471c142
$$ 105961 -123625 43349 25776 197224 164533 -38063 -109856 -106342 -24196 -140667 -3142
15597b22799F647b71656j7656B38759c52131f7663q2839f6225B67677o1686a9491
$$ -222799 6647 -271656 -289312 238759 -352131 -67663 -150502 -66225 267677 205991 -19491
15585f1323B8510J30300J78979b64945j1291M4368h3457k3403A8778K7113O3612
$$ -61323 28510 158810 337789 -264945 -276236 -231868 -83457 -106860 18778 45891 109503
15574A09503J74220j02046g8272a0366A2051K19012m5216g8272A00669L8271a40962
$$ 109503 283723 181677 -78272 -10366 12051 231063 185847 -78272 100669 138940 -140962
15562b0674m2069B97269C4439J78738a18548j56916c9247h819j02825j62442J24732
$$ -20674 -62743 297269 34439 213177 -118548 -275464 -39247 -8819 -111644 -274086 -149354
15551a49354d546a437D0163j4347J35479P2959a8583j0231j3222C29768a70479
$$ -149354 -4546 -1437 40163 25816 161295 234254 -18583 -28814 -42036 329768 -170479
15539H6117a84933j0640j93678d7680J8334q6435k05512A54862c05697J34054
$$ 86117 -184933 -195573 -389251 -47680 -29346 -115781 -321293 154862 -305697 -171643
15529a71643G9499b43220N7342B49034b32426C71629i1209B50190c12447i1836
$$ -171643 79499 -243220 -185878 249034 -232426 371629 -91209 250190 -312447 -91836
15518a36993A67952J971a38195I3480a92250A47968b9470A70694k2086k2817K0405
$$ -136993 167952 169923 -138195 93480 -192250 147968 -29470 170694 148608 125791 146196
15507A46196m3854J19462q0600a19346D2735c39824h3165a5738A61280J0111b26704
$$ 146196 102342 221804 141204 -119346 42735 -339824 -83165 -15738 161280 171391 -226704
15495a69436N6618B05671c36238f4033B3744A0697b25596C5905c2554j15250C36392
$$ -169436 -112818 205671 -336238 -64033 23744 10697 -225596 35905 -32554 -147804 336392
15483D89822B29770B8151R8839a52225C5406J77401d68137E1949F086P9970N4511
$$ 489822 229770 28151 126990 -152225 35406 212807 -468137 51949 6086 86056 140567
15472A40567i5554B45720h547k01162A22933A7921f6589H7370K07072D3479a13551
$$ 140567 -95554 245720 -8547 -209709 122933 17921 -66589 87370 294442 43479 -113551
15460A94889g1020j49551b0248A30803b67942p74c5153j48928I7996a68533j32948
$$ 194889 -71020 -220571 -20248 130803 -267942 -268716 -35153 -184081 97996 -168533 -301481
15449c01481I8802a8149m4331j24014A69953j5047J18765q8113h9907J3271B15311
$$ -301481 98802 -18149 -62480 -186494 169953 154906 273671 185558 -89907 -76636 215311
15437D9409K55836j49158B5677a81120A68728A6765a9535q9706C29462A40555
$$ 49409 305245 156087 25677 -181120 168728 16765 -19535 -109241 329462 140555
15426B11111q8981N6598h4151M1532j30733O7625j12335c1035o4477K7999I7414
$$ 211111 122130 178728 -84151 -42619 -173352 -105727 -218062 -31035 -95512 -67513 97414
15414A85783B398J93332P9659B9122M176R0179a3028m5735p0809l12696a49582
$$ 185783 2398 195730 275389 29122 33298 123477 -13028 -58763 -129572 -442268 -149582
15402c6089A01057f151j19605k53130a14627B64314c88865a39602B26462r3477
$$ -36089 101057 -6151 -125756 -378886 -114627 264314 -388865 -139602 226462 132985
15392A32985a1734j21751B66484j27102J02116N980p8197a28072B26504q4727
$$ 132985 -11734 -133485 266484 139382 241498 247478 169281 -128072 226504 141777
15382A41777k100n8970K33623J26536A29869l4815J98665a49166L1984E3836L19528
$$ 141777 139677 80707 314330 440866 129869 95054 293719 -149166 -117182 53836 373364
15371C73364o1571a16301D1903b6795p3343H0319i309B7069a30871H6309E685
$$ 373364 311793 -116301 41903 -26795 -100138 80319 -9309 27069 -130871 86309 5685
15359a92660A30494I584R3045J65193e2830j09540j5253e1626b5781B19498a1933
$$ -192660 130494 9584 102629 267822 -52830 -162370 -177623 -51626 -25781 219498 -11933
15347A61850b57474B90739a74748h200j88793j16389H9885B2921b39227A90211
$$ 161850 -257474 290739 -174748 -8200 -196993 -313382 89885 22921 -239227 190211
15336F2961c00689J37686f5739E2028a0627k6264B40020i0007B90946E3077J00033
$$ 62961 -300689 -163003 -65739 52028 -10627 -36891 240020 -90007 290946 53077 153110
15325A53110J73148b0207A24002l6944p723a83535A77463c14259A51807b2834
$$ 153110 326258 -20207 124002 87058 79335 -183535 177463 -314259 151807 -22834
15314e8659j19546A4924P8949A0906f9572B04020C4534I7K19718m8906E739d2911
$$ -58659 -178205 14924 93873 10906 -69572 204020 34534 97 219815 170909 5739 -42911
15301A2394J9147N6294J820K92364a57259C28012j24261q2160K2346a64762A20836
$$ 12394 31541 87835 89655 382019 -157259 328012 203751 121591 143937 -164762 120836
15289E5401e1699G8263a66639a0265j29212A81233k4562a30853M2972J7333J1328
$$ 55401 -51699 78263 -166639 -10265 -139477 181233 156671 -130853 -87881 -70548 -59220
15278e9220C37975j54554d9816n3158d6684C0990L01005E4202a14127a943m6508
$$ -59220 337975 183421 -49816 -102974 -46684 30990 331995 54202 -114127 -1943 -48451
15267d8451j44811A75296M12335H1019K42674e1934K3710B59927a591G3227a14885
$$ -48451 -193262 175296 587631 81019 323693 -51934 -28224 259927 -1591 73227 -114885
15255A78688h89j12706A66462G7479L68646N91731j97890p0755P5952k99568B69403
$$ 178688 -889 -113595 166462 77479 446125 1037856 839966 769211 845163 545595 269403
15243D24519E9731c28846D78236A7252b12142G9710K31071A47383C7817J23672
$$ 424519 59731 -328846 478236 17252 -212142 79710 310781 147383 37817 161489
15233A61489a20354F2237C196J38519a8294G8686A2387K48327a62801c7111A5454
$$ 161489 -120354 62237 3196 141715 -18294 78686 12387 260714 -162801 -37111 15454
15221A6043a48791m2110A09181b14852f4352B24904M0323b03628a00977c4025
$$ 16043 -148791 -190901 109181 -214852 -64352 224904 265227 -203628 -100977 -34025
15210H5330a08441N3159C03015J23245A04560J55950p1146a77384D6937f8946
$$ 85330 -108441 -55282 303015 426260 104560 260510 189364 -177384 46937 -68946
15199B686Q7522b8242H4251a20334C60355i5894b1224j82559E2723a52935N5850
$$ 2686 90208 -28242 84251 -120334 360355 -95894 -21224 -203783 52723 -152935 -97085
15188i7085L4274C188d8619B30553B171J019g8904j40841e9843b4885B6778J69840
$$ -97085 -62811 3188 -48619 230553 2171 3190 -78904 -219745 -59843 -24885 26778 196618
15176A96618J84764j83672b02238m3283A89884b06481A91946e7142C4299J99059
$$ 196618 381382 197710 -202238 -245521 189884 -206481 191946 -57142 34299 233358
15166B33358b05864A5339a15238a4119k1933B53977H357d9472F0347c04816D4733
$$ 233358 -205864 15339 -115238 -14119 -36052 253977 8357 -49472 60347 -304816 44733
15154a64206D5423e0541m1183l91824I282Q106a10178A58695a79767A51557a7304
$$ -164206 45423 -50541 -91724 -483548 9282 17388 -110178 158695 -179767 151557 -17304
15142I5968R4244H6330q426K20658p8116C9289K06944G0865b5129D0752a76325
$$ 95968 190212 86330 77904 298562 220446 39289 246233 70865 -25129 40752 -176325
15130F7311K91728i6247F14110D3489K47797D1185e4603A24696J0033K01787D9441
$$ 67311 359039 -96247 614110 43489 291286 41185 -54603 124696 134729 336516 49441
15118A54171A4219J03724m4959a19498B12507b32349A35010c53644a09698m6251
$$ 154171 14219 117943 72984 -119498 212507 -232349 135010 -353644 -109698 -155949
15108a55949A43364J66287b54944A28703C4008R5659n3462O9778Q1663c021A25766
$$ -155949 143364 309651 -254944 128703 34008 129667 76205 145983 227646 -3021 125766
15096A0889M70014H4640m1569b11533C46408j24003f0266A27282f5248B71398
$$ 10889 480903 84640 43071 -211533 346408 222405 -60266 127282 -65248 271398
15085a22160L7279C6818M4923L1872D9783c4622I9714b90724f566B06681q7026
$$ -122160 -84881 36818 81741 113613 49783 -34622 99714 -290724 -6566 206681 119655
15074A19655K89993K6014i8754D6452J14349J56183N8147A74052c4696J156A25157
$$ 119655 409648 435662 -98754 46452 160801 316984 375131 174052 -34696 -33540 125157
15062I3972C6371G919a86142A08423A0102M4575J78762I9192J4239J2536K32948
$$ 93972 36371 7919 -186142 108423 10102 54677 233439 99192 113431 125967 358915
15051C58915A40358E3862J70520j09386a24855C23080A06926L78198p7937B01702
$$ 358915 140358 53862 224382 114996 -124855 323080 106926 485124 407187 201702
15040a69714A33244B0362L63857e5883A68071E1920P7575l4654J69807A08864
$$ -169714 133244 20362 384219 -55883 168071 51920 129495 94841 264648 108864
15029b25832A41034a50769D12076j7260c1644D37653i1419B16319a00543A66976
$$ -225832 141034 -150769 412076 394816 -31644 437653 -91419 216319 -100543 166976
15018A58522J04115O8930o2315A19086b6961A42111a16874A98267q4212D1882
$$ 158522 262637 331567 269252 119086 -26961 142111 -116874 198267 114055 41882
15007B5976M6762a73799C70886G6490K67053j50443H6256L5244N8445L4235K0185
$$ 25976 72738 -173799 370886 76490 343543 193100 86256 121500 179945 214180 234365
14996B34365a04183C68216E9129J49504J4629j06923J34584H0690J31399D7765
$$ 234365 -104183 368216 59129 208633 223262 116339 250923 80690 212089 47765
14985A04742J26591k6371o6199K14333C2389i5718E48486a59183C56313D7426
$$ 104742 231333 204962 138763 353096 32389 -95718 548486 -159183 356313 47426
14974B46717Q8358c11p7561D26014l5105j83402Q0621m8170j9377b2675D17615
$$ 246717 335075 -311 -77872 426014 390909 207507 288128 239958 220581 -22675 417615
14962B72199k8498E7160L25801A32145l121J37653G7898K64071C5073b924A51824
$$ 272199 243701 57160 382961 132145 129024 266677 77898 341969 35073 -2924 151824
14950A71711K81195A92657F8134K67861j46693K83266H9196a10531D40684J21719
$$ 171711 452906 192657 68134 335995 189302 472568 89196 -110531 440684 562403
14940E62403b5941J1729R12B05760K78910K3235j55907h9965B20419P1562L2309
$$ 562403 -25941 -14212 -13300 205760 484670 507905 351998 -89965 220419 291981 324290
14929C24290A13314Q0141L2810M6871i4712F9681J58898A10329L42929j73055
$$ 324290 113314 193455 226265 273136 -94712 69681 228579 110329 453258 280203
14919B80203L5432A20824R5811J39498j32479M8450J20780j23077p1880N6426
$$ 280203 315635 120824 216635 356133 223654 272104 392884 269807 197927 254353
14909B54353O3266r5673j07064J31924R4636A34147L52799o8918A66782K32145
$$ 254353 317619 221946 114882 246806 341442 134147 486946 418028 166782 398927
14899C98927A11513J36871R7912a5681D57195R8920k52143j9647e9725I6071O44407
$$ 398927 111513 248384 346296 -15681 457195 556115 303972 284325 -59725 96071 740478
14888G40478A58925E4777R9211J94050q5268F5587J93475N9015A01966K86578
$$ 740478 158925 54777 153988 348038 262770 65587 259062 318077 101966 388544
14878C88544q5092A34185J99880r033C719Q0965J52362L53914A11854P0438L1296
$$ 388544 303452 134185 334065 325032 3719 84684 237046 590960 111854 182292 213588
14867B13588K48271g2988C72216D7071M96624k42643p546J27646j61852K00253
$$ 213588 461859 -72988 372216 47071 543695 301052 293506 421152 259300 459553
14857D59553J962j81255d166D46368o857A44439J38561k0666O7309J38926o8100
$$ 459553 461515 280260 -4166 446368 439511 144439 283000 262334 329643 468569 400469
14846D00469A68968L13008f5188B73749K31012K87k6974R0158k83197J88778B01964
$$ 400469 168968 481976 -65188 273749 504761 505048 478074 568232 285035 473813 201964
14834a901B13300c0774B77663K6816K84839k7478j52330j58478K60791A77175
$$ -1901 213300 -30774 277663 304479 589318 561840 409510 251032 511823 177175
14823E46731k48257J66445A80035J43380K25164A56384J82741L45416C00880j31702
$$ 546731 298474 464919 180035 323415 548579 156384 339125 684541 300880 169178
14813A69178J27809K642K35330j15872f0405C85448H4189J40335K94605j4215
$$ 169178 296987 299629 534959 419087 -60405 385448 84189 224524 519129 504914
14803E04914A27669N18366A54234N30175k94066P6150j61856l1821O3373k5547
$$ 504914 127669 646035 154234 684409 390343 466493 304637 272816 336189 310642
14793C10642J22093p3466J54496k09638l1563K90645k29650J640J01324K2313
$$ 310642 432735 359269 513765 304127 272564 563209 333559 335199 436523 458836
14783D58836M5074k00066K82947B59169J4353K6745N8455R9414j81133L94988
$$ 458836 503910 303844 586791 259169 273522 300267 358722 458136 277003 671991
14773F71991n4850l8961k56577r1786L5193K42893P1157r1407j81203K93562r0731
$$ 671991 617141 578180 321603 229817 265010 507903 579060 487653 306450 600012 509281
14762E09281r4725J54076l7631K7362n6068K16982l35515J97103N3598J01568
$$ 509281 414556 568632 531001 558363 502295 719277 383762 580865 634463 736031
14752G36031k38242q8566q5567L02450J15680l31884J48853j32587n7564n2198
$$ 736031 497789 409223 323656 626106 741786 409902 558755 426168 368604 316406
14742C16406L33989j51923J66226j12666M7753J61544k08600L9595n6031J02255
$$ 316406 650395 498472 664698 552032 599785 761329 552729 592324 536293 638548
14732F38548m3289N4230L8558n0127k56909M27407k57291K29249j79676r6844
$$ 638548 595259 649489 688047 637920 381011 808418 551127 780376 600700 503856
14722E03856q4586J53505L11563k61865P0323k34983K59213B83124L25425O8276
$$ 503856 419270 572775 884338 622473 692796 457813 717026 283124 608549 676825
14712F76825J32299k17458j13173L61112j95868Q6176l3484l37909K80033L16125
$$ 676825 809124 591666 478493 839605 643737 729913 696429 358520 638553 954678
14702I54678k29906p5691K21128l27400J16861M94291C26772O43882J34931D40214
$$ 954678 724772 649081 870209 542809 659670 1153961 326772 970654 1105585 440214
14691I35532k38041K71928k61616l45131L09851N8740n0491J5431l32409L81759
$$ 935532 697491 969419 707803 362672 672523 731263 680772 696203 363794 745553
14681G45553J14595k84195J64109j41405M82719q4778n8989k73547J99523k01766
$$ 745553 860148 575953 740062 598657 1081376 996598 937609 664062 863585 661819
14671F61819J91711j41659M9428L16038m58624L3701p5334J25561J38570N2400
$$ 661819 853530 711871 761299 1077337 618713 652414 577080 702641 841211 893611
14661H93611k27293R0764K34028P210R561K05648l01835j48009J76273k54243
$$ 893611 666318 757082 991110 998320 1007881 1213529 911694 763685 939958 685715
14651F85715M52101l92530l352K32570J08578l23474K62671O6158m818j31457
$$ 685715 1137816 745286 741934 974504 1083082 759608 1022279 1088437 1083619 952162
14641I52162K95434n78110J27203K19418K16711k69689J67284l79491L30042j12170
$$ 952162 1247596 669486 796689 1016107 1232818 963129 1130413 750922 1080964 968794
14631I68794l5723M24494n7592k92430J62496j25864p6354j18956N02596n19955
$$ 968794 933071 1357565 1299973 1007543 1170039 1044175 967821 848865 1351461 831506
14621H31506J22352K37718r5375M5691J55224n593K07834n04337K92802K0273
$$ 831506 953858 1191576 1096201 1141892 1297116 1291523 1499357 995020 1287822 1308095
14611A308095J57665k79141J09387J99551l56142j44202L2304J26772l15468P08246
$$ 1308095 1465760 1186619 1296006 1495557 1139415 995213 1027517 1154289 838821 1547067
14601A547067j05837l04527L8808L94404j02603j72732k55118K43625k45200M12706
$$ 1547067 1441230 1136703 1175511 1569915 1467312 1294580 1039462 1283087 1037887 1450593
14591A450593k92398N68111J03872k56405l0599j03431l6024J64944k51461L0618
$$ 1450593 1158195 1726306 1830178 1573773 1543174 1439743 1403719 1568663 1317202 1347820
14581A347820k26095K36702M15405j1343j12143j13882l0416M32734l99916q9094
$$ 1347820 1121725 1358427 1773832 1762489 1650346 1536464 1506048 1938782 1538866 1449772
14571A449772N30802l51872K80667n6259J52506l90261N44963l77719J46208n1017
$$ 1449772 1980574 1628702 1909369 1853110 2005616 1615355 2160318 1782599 1928807 1877790
14561A877790q24K19467J01269L84334j02203k042N77954Q1518J690K34907J129774
$$ 1877790 1876966 2096433 2197702 2582036 2479833 2477791 3055745 3137263 3138953 3373860 4503634
14550D503634P49178K805588N419308J0904832J5318644o673670A3222665E582090
$$ 4503634 5252812 8058400 13477708 24382540 39701184 33027514 13222665 5582090
14541C148010j200435O242j70007k54704K88431k27367o0848J44570j07795k0474
$$ 3148010 1947575 1953817 1783810 1529106 1817537 1590170 1529322 1673892 1566097 1545623
14531A545623L25542j90399J02942n2799N4284J64381j01980O16652m15474R6696
$$ 1545623 1871165 1680766 1783708 1730909 1785193 1949574 1847594 2464246 2048772 2145468
14521B145468J04778l64542m3662M490J89064k92412L25832j29307K09398N2794
$$ 2145468 2250246 1885704 1842042 1846532 2035596 1743184 2069016 1939709 2149107 2201901
14511B201901O3353n4527J40854j28878j37670M22598j88798J73786k38877N35407
$$ 2201901 2265254 2210727 2351581 2222703 2085033 2507631 2318833 2492619 2253742 2789149
14501B789149r1130j43223k22718L04158j53798L170J57553k3090K5143P0459
$$ 2789149 2698019 2554796 2332078 2636236 2482438 2485608 2643161 2620071 2645214 2715673
14491B715673J35899j95840J69578P68j74392K18330J40626k01063L74003k79102
$$ 2715673 2851572 2655732 2825310 2826078 2651686 2870016 3010642 2809579 3183582 2904480
14481B904480J1687M107M7449L83750m87771L30155m3053p1209L28423m9714L26490
$$ 2904480 2916167 2920274 2967723 3351473 2863702 3193857 3150804 3079595 3408018 3358304 3684794
14470C684794L5958R57J5881m09908K56543j21712r5015K93438J2141O329J98939
$$ 3684794 3720752 3721709 3737590 3327682 3584225 3462513 3367498 3660936 3673077 3679406 3878345
14459C878345K37781J57847m43567K75466n7357k26125K83824J31099l06289L72485
$$ 3878345 4116126 4273973 3830406 4105872 4048515 3822390 4106214 4237313 3931024 4303509
14449D303509j88293R7570N38468l24474m1327K32808M58565j00940r9118k98450
$$ 4303509 4115216 4212786 4751254 4426780 4385453 4618261 5076826 4975886 4876768 4578318
14439D578318L54494o2688K9535K35519o0322L4059L67367o9357j6514J40O7106
$$ 4578318 4932812 4870124 4899659 5135178 5074856 5108915 5476282 5406925 5390411 5390551 5457657
14428E457657L85740J19684j95601K03862j4329K6880M34542j79922R4224L81287
$$ 5457657 5843397 5963081 5767480 5971342 5957013 5983893 6418435 6238513 6332737 6714024
14418F714024J02410j60888J95991n7636N4514L75269j42103N96603k40979k38821
$$ 6714024 6816434 6655546 6851537 6793901 6848415 7223684 7081581 7678184 7437205 7198384
14408G198384M73867L83506l66765K21813K70430J48236L58728m55850M76307
$$ 7198384 7672251 8055757 7688992 7910805 8181235 8329471 8688199 8232349 8708656
14399H708656O7223j16660K13468L95008j60854M23203l8404N16688J85063j12260
$$ 8708656 8775879 8659219 8872687 9267695 9106841 9530044 9491640 10008328 10193391 10081131
14389A0081131m1618K31417J21359J72045L73486M65317Q5640K00276L38642k25194
$$ 10081131 10039513 10270930 10392289 10564334 10937820 11403137 11488777 11689053 12027695 11802501
14379A1802501L44042L18380K45928K90093J87937J14535L07346N23457K49427
$$ 11802501 12146543 12464923 12710851 13000944 13188881 13303416 13610762 14134219 14383646
14370A4383646M47117l0689L49393q1394Q49934N29221M38012L17234J51095N31798
$$ 14383646 14830763 14800074 15149467 15068073 15918007 16447228 16885240 17202474 17353569 17885367
14360A7885367M68646j41559O36930O87330J10570O21936M49367L81796O17737
$$ 17885367 18354013 18212454 18849384 19536714 19647284 20269220 20718587 21100383 21718120
14351B1718120K37489O63863N01752Q49751L50870J027272P19154N27365O87296
$$ 21718120 21955609 22619472 23121224 23970975 24321845 25349117 26068271 26595636 27282932
14342B7282932N54616Q88847P31507R35517Q20415R40308O38293J135867P63329
$$ 27282932 27837548 28726395 29457902 30393419 31213834 32154142 32792435 33928302 34691631
14333C4691631J398062Q65143P93947J349074J400908J418417J594316J084337
$$ 34691631 36089693 36954836 37748783 39097857 40498765 41917182 43511498 44595835
14325D4595835J598438J680802J557600J593751J890794K203866J861037K106759
$$ 44595835 46194273 47875075 49432675 51026426 52917220 55121086 56982123 59088882
14317E9088882K465714K136517K688010K426612K784408K731416L202200L636240
$$ 59088882 61554596 63691113 66379123 68805735 71590143 74321559 77523759 81159999
14309H1159999L567585L557713L997562M298201M410521M703008N162977N131223
$$ 81159999 84727584 88285297 92282859 96581060 100991581 105694589 110857566 115988789
14301A15988789N649816O452110O378701P330240P240859P810931Q469691R159938
$$ 115988789 121638605 128090715 134469416 141799656 149040515 156851446 165321137 174481075
14293A74481075R524542J0132160J0986671J1648628J2029643J2902373J3641483
$$ 174481075 184005617 194137777 205124448 216773076 228802719 241705092 255346575
14286B55346575J3924625J5109990J5362043J5442825J6110551J6045425J6057533
$$ 255346575 269271200 284381190 299743233 315186058 331296609 347342034 363399567
14279C63399567J5787288J5070254J3788800J2740492J1082556Q548100L469270
$$ 363399567 379186855 394257109 408045909 420786401 431868957 440417057 443886327
14272D43886327M46955K91216l11162j019967j991809n012863q441952j0778870
$$ 443886327 444333282 444624498 444313336 443293369 441301560 436288697 427846745 417067875
14264D17067875j2839898j4297073j5721498j6092720j6730146j6347700j5980273
$$ 417067875 404227977 389930904 374209406 358116686 341386540 325038840 309058567
14257C09058567j5666172j4888122j4790455j3916649j3521996j2632847j2203450
$$ 309058567 293392395 278504273 263713818 249797169 236275173 223642326 211438876
14250B11438876j1208330j0467897j0031390r261849r025041q031501p216089
$$ 211438876 200230546 189762649 179731259 170469410 161444369 153412868 146196779
14243A46196779p587742o553510o650322o229271n292146n036472m794058m951649
$$ 146196779 138609037 132055527 125405205 119175934 113883788 108847316 104053258 99101609
14235I9101609m587182l873839l650257l537700l460214l354024k963527k796825
$$ 99101609 94514427 90640588 86990331 83452631 79992417 76638393 73674866 70878041
14227G0878041l119207k869394k257429k272625k287600k055032j845806j806328
$$ 70878041 67758834 64889440 62632011 60359386 58071786 56016754 54170948 52364620
14219E2364620j769871k032505j531833j526920j608582o73802j716318j326886
$$ 52364620 50594749 48562244 47030411 45503491 43894909 43221107 41504789 40177903
14211D0177903j265911j209739j000381j298355o70397q99664j374731n55103
$$ 40177903 38911992 37702253 36701872 35403517 34733120 33833456 32458725 31903622
14203C1903622j121290o32992q04750p71350n48968r61778q58456p47069l89953
$$ 31903622 30782332 30149340 29344590 28573240 28024272 27062494 26204038 25456969 25067016
14194B5067016l65294n86832o26577o68998o38593m9751j243763k21346m04486
$$ 25067016 24701722 24114890 23488313 22819315 22180722 22130971 20887208 20665862 20261376
14185B0261376n99208r34676L44661o82822j51541m07137l16988o51669j47475
$$ 20261376 19662168 18727492 19072153 18389331 18237790 17830653 17513665 16861996 16714521
14176A6714521l78623m43454m30307k64076J18838p75408J06923m94102m64817
$$ 16714521 16335898 15892444 15462137 15198061 15316899 14541491 14648414 14154312 13689495
14167A3689495P3966l97664q5923l05579o0685k44505l49607k00443o01339k65044
$$ 13689495 13763461 13365797 13279874 12974295 12913610 12669105 12319498 12119055 11517716 11252672
14157A1252672J803q8847k93569l77979K60490j55544o38221J57643k12655j24537
$$ 11252672 11254475 11165628 10872059 10494080 10754570 10599026 9960805 10118448 9905793 9781256
14147I781256k65127k59593j19209k7799M4346k43816n40719J99570j71366J33812
$$ 9781256 9516129 9256536 9137327 9109528 9153874 8910058 8369339 8568909 8397543 8531355
14137H531355m3452o22145L64846k12784k11404J9896m48611K17158l31508J93423
$$ 8531355 8487903 7865758 8230604 8017820 7806416 7826312 7377701 7594859 7263351 7456774
14127G456774k32018l15956q4716J4442m07051J39892K60540j66970o22451M78552
$$ 7456774 7224756 6908800 6824084 6838526 6431475 6571367 6831907 6664937 6042486 6521038
14117F521038l70016K62546l32605l25607N3174J39942k91206J75301r5888k88243
$$ 6521038 6151022 6413568 6080963 5755356 5808530 5948472 5657266 5832567 5736679 5448436
14107E448436o6792K75225k22051J77830l20188n0983J54509k60675J93352l35725
$$ 5448436 5381644 5656869 5434818 5612648 5292460 5241477 5395986 5135311 5328663 4992938
14097D992938o3754l6051r6943K38137j81009m52566P8522Q3116p4192j5131J40807
$$ 4992938 4929184 4893133 4796190 5034327 4853318 4400752 4479274 4562390 4488198 4473067 4613874
14086D613874k04797j03078j16192r7695J84102k90817P5858n080k50556L64600
$$ 4613874 4409077 4305999 4189807 4092112 4276214 3985397 4061255 4056175 3805619 4170219
14076D170219l40405o5056k00308Q6267J98702l51908M02303l72100k7107j72734
$$ 4170219 3829814 3764758 3564450 3650717 3849419 3497511 3899814 3527714 3500607 3327873
14066C327873j1010O0473O5022j60569r3301K4168J40104j85203L79515k6392
$$ 3327873 3316863 3377336 3442358 3281789 3188488 3212656 3352760 3167557 3547072 3520680
14056C520680l62769R2949k43077J60609M3252N154q0900Q0915n1381l12817P4514
$$ 3520680 3157911 3250860 3007783 3168392 3211644 3216798 3135898 3216813 3165432 2852615 2927129
14045B927129k2829j58567K4555J27882P3997j62288j80542j10979L13347j73712
$$ 2927129 2904300 2745733 2770288 2898170 2972167 2809879 2629337 2518358 2831705 2657993
14035B657993J15160P9082M1818j85427j00884J41302j50796r3188K5693q6887
$$ 2657993 2773153 2852235 2894053 2708626 2607742 2749044 2598248 2505060 2530753 2443866
14025B443866l09306L77341j29123k49159K42155o9632q7336m07202N57804j17374
$$ 2443866 2134560 2511901 2382778 2133619 2375774 2306142 2218806 1811604 2369408 2252034
14015B252034l81625O5045j19055L05592J66111j87912j88996M7585n10273M45341
$$ 2252034 1870409 1935454 1816399 2121991 2288102 2100190 1911194 1958779 1448506 1893847
14005A893847N2046l6275J12833m4024l37303J59059k75501L04869j16691q4087
$$ 1893847 1945893 1909618 2022451 1978427 1641124 1800183 1524682 1829551 1712860 1628773
13995A628773j29233K75922J75966j15551K84510M73712J474359M409590Q905446
$$ 1628773 1499540 1775462 1951428 1835877 2120387 2594099 4068458 8478048 17383494
13986A7383494J7602744J260465j8041172q894158l452996j308650o84244o75285
$$ 17383494 34986238 36246703 18205531 9311373 5858377 4549727 3865483 3190198
13978C190198k58836k0695j22948m94611L2149j37007J14004m61053M41045m24942
$$ 3190198 2931362 2910667 2787719 2293108 2325257 2188250 2302254 1841201 2282246 1857304
13968A857304J49226K15832m30599J76817j93890L10288l27429J70542o3984k11514
$$ 1857304 2006530 2222362 1791763 1968580 1774690 2084978 1757549 1928091 1864107 1652593
13958A652593p3598J67903O0288j41406j80896L77187j50869j23343K45739k37661
$$ 1652593 1578995 1746898 1807186 1665780 1484884 1862071 1711202 1587859 1833598 1595937
13948A595937n5543J02295k80708j12218l8595K96914m7205O9504L058p1002k69931
$$ 1595937 1540394 1642689 1361981 1249763 1211168 1508082 1460877 1530381 1533439 1462437 1192506
13937A192506J94353j63676j02090R3073K03617j21101Q1569j24125p9802K55909
$$ 1192506 1386859 1223183 1121093 1214166 1417783 1296682 1378251 1254126 1174324 1430233
13927A430233M9793q2514j5124j42719J75050P0780k03184R9260k67697j71168
$$ 1430233 1480026 1397512 1382388 1239669 1414719 1485499 1282315 1381575 1113878 942710
13917I42710K26075j4923K90576m54731L54207k70254p7725L77388k57173N0971
$$ 942710 1168785 1153862 1444438 989707 1343914 1073660 995935 1373323 1116150 1167121
13907A167121o2916q0412L6779M5501n826J45846k55597l7117Q7850J46359J90975
$$ 1167121 1104205 1023793 1060572 1106073 1100247 1246093 990496 953379 1041229 1187588 1378563
13896A378563F72655M05694J2827J27340j34689K30769k47460J54310J90008j97848
$$ 1378563 672655 1078349 1091176 1218516 1083827 1314596 1067136 1221446 1411454 1213606
13886A213606k76232n807M6926R4549J54365k39037k21343K05230M4275O5014
$$ 1213606 937374 931567 978493 1073042 1227407 988370 767027 972257 1016532 1081546
13876A081546l84571K18951J09046p2586J39423j72966O8031j76428M22027j16199
$$ 1081546 696975 915926 1024972 952386 1091809 918843 986874 810446 1232473 1116274
13866A116274k94737o209L70134j87539J2035j86538M03666n23123K02053L8773
$$ 1116274 821537 815328 1185462 997923 1009958 823420 1227086 703963 906016 944789
13856I44789O110P4551k9904k97032R1353N12284l25246j65988P6668j01647J99647
$$ 944789 950899 1025450 995546 698514 789867 1302151 976905 810917 887585 785938 985585
13845I85585k61735j01539O3047K47208l19242N4266k2115l7906L00414l556L96076
$$ 985585 723850 622311 685358 932566 613324 667590 645475 607569 907983 904427 1300503
13834A300503m58339o0981l42664L95339q8503J46899l89965K21873Q006P4086
$$ 1300503 842164 781183 438519 833858 745355 892254 502289 724162 732168 806254
13824H06254j67520L98988C53626L78757j95292O317K13931j45910K49052j25721
$$ 806254 638734 1037722 353626 732383 537091 543408 757339 611429 860481 734760
13814G34760k31038K96886m0794K2488l82285M74735N664l43334K58529j43693
$$ 734760 503722 800608 759814 782302 400017 874752 880416 537082 795611 651918
13804F51918L76313k90276q1066n272J79832j83185j19042J31598J02988k44154
$$ 651918 1028231 737955 656889 651617 831449 648264 529222 660820 763808 519654
13794E19654K62509l86839L17333j33906J38835k7853C39568K15291J53145r5644
$$ 519654 782163 395324 712657 578751 717586 689733 339568 554859 708004 612360
13784F12360J37663j21506l2164J8486k88696O6676K35743j00555J96482k47542
$$ 612360 750023 628517 596353 614839 326143 392819 628562 528007 724489 476947
13774D76947K84663J50504l22780j68024k0167L57025C68715M06375O0221k43696
$$ 476947 761610 912114 589334 421310 401143 758168 368715 775090 835311 591615
13764E91615Q3394j25653o5197N2154p594j36625N3537Q5257B25077L99934J68494
$$ 591615 675009 549356 484159 536313 528719 392094 445631 530888 225077 625011 793505
13753G93505j08718K26177m27637O7798j8203Q6920B90785N82676j57338k23071
$$ 793505 684787 910964 483327 551125 532922 619842 290785 873461 716123 493052
13743D93052N8388o7905m098j37264J60428o2046L96747k62243J41064j64475
$$ 493052 551440 483535 479437 342173 502601 440555 837302 575059 716123 551648
13733E51648p5709R2855B31779K50976O3329j64617K01916k37699L25249A89732
$$ 551648 475939 568794 231779 482755 546084 381467 583383 345684 670933 189732
13722E71484K05640k62974B30760M31070B30657M20067k46432j3417R1410j70406
$$ 571484 777124 514150 230760 661830 230657 650724 404292 390875 482285 311879
13712C11879j3405J31441H9829M86627j70632J98716j40536A81836K59315j35771
$$ 311879 298474 429915 89829 576456 405824 604540 464004 181836 441151 305380
13702C05380P8568J84321N4671q9621l8358k24803K44066k17248K57025k39099
$$ 305380 383948 568269 622940 533319 494961 270158 514224 296976 554001 314902
13692C14902J19000k5168K79012k51029K05654j88073Q3053N2764j55363K81617
$$ 314902 433902 408734 687746 436717 642371 454298 537351 590115 434752 716369
13682G16369k71704J66484Q0559B35645j14966N39229K9026A85203K81791A26746
$$ 716369 444665 611149 691708 235645 120679 659908 688934 185203 466994 126746
13671B03523L73756K3817B82954Q6432J58064l2543O6270B56893J52571K10740
$$ 203523 577279 601096 282954 369386 527450 494907 561177 256893 409464 620204
13661F20204A2397K12925M39074B57710K54719j56630K16964j60731J5429j94429
$$ 620204 12397 225322 664396 257710 512429 355799 572763 412032 427461 233032
13651B33032P2899A47530L89501j59148j82410K68955k14057J09492A74397f5867
$$ 233032 305931 147530 537031 377883 195473 464428 250371 359863 174397 -65867
13640D69837j78869J27255k02360R4622M16599A77739N9016R2453J00302G0081
$$ 469837 290968 418223 215863 310485 727084 177739 236755 329208 429510 70081
13629A65029L97500k1263k18958J34024F3503J9274C6976M43456P0531A55681
$$ 165029 562529 541266 322308 456332 63503 82777 36976 480432 550963 155681
13618A56865K69973F6473K17767C4539K44951B2283O08952C13139m8663K75377
$$ 156865 426838 66473 284240 34539 279490 22283 631235 313139 264476 539853
13608E39853k12990j62195K84807A41381k1302J74552P6911L044E5686j2453J90248
$$ 539853 326863 164668 449475 141381 120079 294631 371542 374586 55686 43233 233481
13597B33481O489l5707K27477f9723C67214A73880M88525B66422H8616M30275
$$ 233481 239970 204263 431740 -69723 367214 173880 662405 266422 88616 518891
13587E18891k46319p2281Q0463r5556J12995q8627J22627M41N660r5016A07199
$$ 518891 272572 200291 280754 185198 298193 209566 332193 332634 338294 243278 107199
13575B47010l6623K9980G3155o685J1416M04055G0111J77246J37645A11887K27030
$$ 247010 210387 240367 73155 66470 77886 481941 70111 247357 385002 111887 338917
13564C38917K11151j53687J3297B2457M63546K8933A58553k2251K31867l4246
$$ 338917 550068 396381 409678 22457 486003 514936 158553 136302 368169 333923
13554C33923b54994g9201A07110h0581B13330L08676A82020K99442B27794K07409
$$ 333923 -254994 -79201 107110 -80581 213330 522006 182020 481462 227794 435203
13544D35203m3270I9032b10753A01477J00421K71128A97217J53761j72377B2318
$$ 435203 391933 99032 -210753 101477 201898 473026 197217 350978 178601 22318
13533A65714h5073A93252J02825l5369o0684J30370j59576L3478k6359j4454F2146
$$ 165714 -85073 193252 296077 260708 200024 330394 170818 204296 177937 163483 62146
13521G7641K96338p9646G9368f1253B92218A43024J58019o3030C7970L15699E283
$$ 77641 373979 294333 79368 -61253 292218 143024 301043 238013 37970 353669 5283
13509a25536A82762J50667j00887r2760L80264p579A10360D3326J96792O7450
$$ -125536 182762 333429 232542 139782 520046 512467 110360 43326 240118 307568
13499C07568m116j25597a31196B7673K81560j41621J87916l5992A20252M37071
$$ 307568 303452 177855 -131196 27673 309233 167612 355528 319536 120252 557323
13489E57323B32987p4330L40464M7758D1225L89508j99492e2838A23989J249Q3784
$$ 557323 232987 158657 499121 546879 41225 430733 231241 -52838 123989 125238 209022
13478B09022N2191j5503H7329J34303M862B3264p154J41705J64651K91268i622
$$ 209022 261213 245710 87329 221632 226494 23264 16110 157815 322466 613734 -9622
13466H5305K05728A18793P5175H6971M43271j78218A55429E5843a8442I8196d3480
$$ 85305 291033 118793 193968 86971 530242 352024 155429 55843 -18442 98196 -43480
13454B87692k2906n9661l6750H2895J88175J01736A15462R1730K37284j74268
$$ 287692 264786 205125 168375 82895 271070 372806 115462 207192 444476 270208
13444B70208J59199I3891R2443J47008A15317c554D71213B4909J8198a08114F3366
$$ 270208 429407 93891 186334 333342 115317 -3554 471213 24909 43107 -108114 63366
13432C67145n053j57210M7158L95774B30522C1970Q3190J62708f3108C79976j09464
$$ 367145 362092 204882 252040 647814 230522 31970 115160 277868 -63108 379976 270512
13421B70512q4950K16278j07033J11617d4501B08061m6551R1590p215j10176g687
$$ 270512 185562 401840 294807 406424 -44501 208061 161510 253100 245885 135709 -7687
13409E83316a15669E3817P6139E5507O1746J42078d7077B28227A07866m3225J99060
$$ 583316 -115669 53817 129956 55507 117253 259331 -47077 228227 107866 64641 263701
13398B63701p0774q6658Q8542J95719q2671j13364j8328B360J00365J05293K70393
$$ 263701 192927 106269 194811 390530 307859 194495 176167 2360 102725 208018 478411
13387D78411D8717Q1289b11368c0934F5014K38192G3182a06264C39081j06421
$$ 478411 48717 130006 -211368 -30934 65014 303206 73182 -106264 339081 232660
13377B32660J87881H577L82105j36472J5110A19171Q2444A2127e5127A18390a04942
$$ 232660 420541 8577 390682 254210 269320 119171 201615 12127 -55127 118390 -104942
13365E69896B81127A05451M08659j34584A67118q2783g166C25914p8080D4717
$$ 569896 281127 105451 514110 379526 167118 84335 -7166 325914 247834 44717
13354C97538c1480I0009K2642J62860c7830B5236L26854j30307n3737K18029J50997
$$ 397538 -31480 90009 112651 275511 -37830 25236 352090 221783 168046 386075 537072
13343E37072p9533F9298J26145J23769Q5316O817J59880D9831L96049r9294H8423
$$ 537072 457539 69298 195443 319212 404528 411345 571225 49831 445880 346586 88423
13331G4905J84867J61170H6109A7755P1413L06620A88432O0805J0600L1690p0697
$$ 74905 259772 420942 86109 17755 89168 395788 188432 249237 259837 291527 220830
13320B20830n0107q1076C0106O6645J97718a7480c701C49604g8951b3126C35918
$$ 220830 170723 89647 30106 96751 294469 -17480 -3701 349604 -78951 -23126 335918
13308A0453M8102J14535M1989F7863M7840R0865J18991c847C27867E3174i8537
$$ 10453 58555 173090 215079 67863 115703 206568 325559 -3847 327867 53174 -98537
13296B01718i4023A48337J1190n3628Q4803J36899B1460k375K46971A25743b20671
$$ 201718 -94023 148337 159527 105899 190702 327601 21460 19085 266056 125743 -220671
13284A01672m6709b49131A91588R5809d3855C90298A67930d8662D59M8694a36788
$$ 101672 54963 -249131 191588 287397 -43855 390298 167930 -48662 459 49153 -136788
13272A37192f2472m149B2405K31072m6542f3694m0450I3898J14910g3722A43947
$$ 137192 -62472 -66621 22405 253477 206935 -63694 -104144 93898 208808 -73722 143947
13260B60814a92612h027J7C37573j27034M0469J3824E8817K29767Q4220A30583
$$ 260814 -192612 -8027 -8010 337573 210539 251008 264832 58817 288584 372804 130583
13248g7635c2679a1506C9812K64619b6634A20931a9560F2803M15490i1831G1119
$$ -77635 -32679 -11506 39812 304431 -26634 120931 -19560 62803 478293 -91831 71119
13236B22499l7229g3659A37895a7916A08617Q1843D2487J46322o7773R359m2451
$$ 222499 185270 -73659 137895 -17916 108617 190460 42487 188809 121036 130395 87944
13225H7944a11979c0081B9106a00845A72973E7298N2555K2762L3384L24200A08387
$$ 87944 -111979 -30081 29106 -100845 172973 57298 109853 132615 165999 490199 108387
13213a06980p6966C99779j84907b24727A22665a4944B19635b7951A74220k3522
$$ -106980 -183946 399779 214872 -224727 122665 -14944 219635 -27951 174220 150698
13203A50698d4993D4074K47003b10043H8812J53382h2721K9204A44537o8362q961
$$ 150698 -44993 44074 291077 -210043 88812 242194 -82721 -53517 144537 76175 67214
13192F7214j2725B1860n996L05330B6797Q9988D9114L97316i000D2828a79807
$$ 67214 54489 21860 15864 321194 26797 116785 49114 446430 -9000 42828 -179807
13180A3208C163a06081a6087G2523h4596k02F5677L6094J76166F0376L5408K31945
$$ 13208 3163 -106081 -16087 72523 -84596 -84798 65677 101771 277937 60376 95784 327729
13168C27729a97357k93953b8164C0457J15084A4380L9169B0063b23062J6449a01403
$$ 327729 -197357 -491310 -28164 30457 145541 14380 53549 20063 -223062 -206613 -101403
13156A3357J61049b5411B35972i8108A38307l5424m7790b54426g653E2913p878
$$ 13357 174406 -25411 235972 -98108 138307 102883 55093 -254426 -7653 52913 45035
13145D5035a11481C1487K47871a9107A67305a65862A11557b9231A86722l9518
$$ 45035 -111481 31487 279358 -19107 167305 -165862 111557 -29231 186722 147204
13135A47204b84914i8359B42706B1653f9590A15353J72679F3046K99523o5291
$$ 147204 -284914 -98359 242706 21653 -69590 115353 288032 63046 362569 297278
13125B97278a92903C6256a46597l6302G3493h5609A64614O1139F6976b7744q7673
$$ 297278 -192903 36256 -146597 -182899 73493 -85609 164614 225753 66976 -27744 -115417
13114a15417A72727n8199j8702g1248B309J65655a90529A2080J13767n4305K1129
$$ -115417 172727 114528 95826 -71248 2309 167964 -190529 12080 125847 71542 92671
13103I2671l7075g5422n4392A64711D4705L3272j0383b10619B27273a03817m3913
$$ 92671 55596 -75422 -129814 164711 44705 77977 67594 -210619 227273 -103817 -147730
13092a47730H771K41440H1712a18460N7627B52074J14047A35209J53886a2156
$$ -147730 8771 250211 81712 -118460 -60833 252074 366121 135209 289095 -12156
13081D63126B09344J10887q8944c8245B16842a28667B23491A08551h8775A21168
$$ 463126 209344 320231 231287 -38245 216842 -128667 223491 108551 -88775 121168
13070B24048d7365A12835A0973L07884n0795B3279J98909c135B97389j29590M4570
$$ 224048 -47365 112835 10973 318857 268062 23279 222188 -3135 297389 167799 212369
13059B12369G9293b24568d876C53096A07851M1822m7986H547N3323J3389J41087
$$ 212369 79293 -224568 -4876 353096 107851 149673 101687 8547 61870 75259 216346
13048B16346D5459c6171A63568C997L30216c9297r7327n2503B6592j0629a09914
$$ 216346 45459 -36171 163568 3997 334213 -39297 -136624 -189127 26592 15963 -109914
13036B0874J08256M2279a9131B45877h6154B0031Q8663K29815a87162A26896M605
$$ 20874 129130 171409 -19131 245877 -86154 20031 108694 338509 -187162 126896 131501
13025A31501O3240B2634a54535A91268g6356L4756A17918a85718C79097C8726
$$ 131501 194741 22634 -154535 191268 -76356 -41600 117918 -185718 379097 38726
13014I0100a16543N1184d649C91147A29990O3307E9043B2318a77186B6322a04371
$$ 90100 -116543 -65359 -4649 391147 129990 193297 59043 22318 -177186 26322 -104371
13002E3913k3925n34M3557K25103c5642C06197b7279A34058K0845K41310l9926
$$ 53913 29988 29454 73011 298114 -35642 306197 -27279 134058 154903 396213 356287
12991C56287A18939J42466n5745a49964G6630c24207B9769C218M000a03242D7512
$$ 356287 118939 261405 205660 -149964 76630 -324207 29769 3218 7218 -103242 47512
12979H4196a25164C0151a06906l1591r6557h4766H9717J48692B5181K6972L17416
$$ 84196 -125164 30151 -106906 -138497 -235054 -84766 89717 238409 25181 52153 369569
12968C69569A41749P3987a14513A90779b6366E9164J14149b03100b826C49031
$$ 369569 141749 215736 -114513 190779 -26366 59164 173313 -203100 -2826 349031
12957a98793I1259J55543j2427H1533b86384a5451B3859d0105F0383J33349b8324
$$ -198793 91259 246802 234375 81533 -286384 -15451 23859 -40105 60383 193732 -28324
12945f6799A02570a69455A98834b0544C16460k300g3559j29069q4274d1056J4099
$$ -66799 102570 -169455 198834 -20544 316460 314160 -73559 -202628 -286902 -41056 -26957
12934b6957D296q02J0905b97087B23380n0174a16928k82418i4525C17701h2408
$$ -26957 4296 3494 14399 -297087 223380 173206 -116928 -399346 -94525 317701 -82408
12922c31865a65144B5307J06558f8828D3962J89737p5708a9663A45136k9514j3391
$$ -331865 -165144 25307 131865 -68828 43962 233699 157991 -19663 145136 115622 102231
12911A02231O9147D9261M2536a12258g376j05374A94162i2737k85632H9747m127
$$ 102231 171378 49261 91797 -112258 -7376 -112750 194162 -92737 -378369 89747 85620
12900H5620a01830A62466M6090h8276j75576a30263f0341k65926B726K34928a91189
$$ 85620 -101830 162466 208556 -88276 -263852 -130263 -60341 -326267 2726 237654 -191189
12888B09424q2767a81549E3787J28205f8286k13494b8852k4394b096l7492j35797
$$ 209424 126657 -181549 53787 181992 -68286 -281780 -28852 -53246 -2096 -39588 -175385
12877a75385H6833L65069i568j60012Q1202l609o9691A1418a41770G8330i4343
$$ -175385 86833 451902 -9568 -169580 -88378 -91987 -161678 11418 -141770 78330 -94343
12865B63224j29353b23907i5597k05118B45451H4173e777A24540C8713J6347K72238
$$ 263224 133871 -223907 -95597 -300715 245451 84173 -5777 124540 38713 55060 327298
12854C27298d54128d4331f136H6652a0921A15105a86913q427f3485B04291a10672
$$ 327298 -454128 -44331 -6136 86652 -10921 115105 -186913 -195340 -63485 204291 -110672
12842E13018A67486L9999a1439E164N5067b18468a5458m7256k40216B17972I4677
$$ 513018 167486 207485 -11439 5164 60231 -218468 -15458 -62714 -302930 217972 94677
12830a08336b1718A74143F2968N5275a33708B5854J76918p14n6797N3016a29935
$$ -108336 -21718 174143 62968 118243 -133708 25854 202772 202058 145261 198277 -129935
12818e1421l29171a31441F6975e3296B02801F0307a28041F6231L60061a9558j32306
$$ -51421 -380592 -131441 66975 -53296 202801 60307 -128041 66231 426292 -19558 -151864
12807a51864k3171b2548A74755k1643e0591o2781N5060m6653K7156j61817g5726
$$ -151864 -175035 -22548 174755 153112 -50591 -113372 -58312 -104965 -77809 -239626 -75726
12795a02375l146b8232n5037G1248A0560b06300A18430a10162B08554c15202d3446
$$ -102375 -105521 -28232 -83269 71248 10560 -206300 118430 -110162 208554 -315202 -43446
12783a57370p2138B0867K8695J32115a1024E08029D3909a81664A26208P2799a79832
$$ -157370 -229508 20867 49562 181677 -11024 508029 43909 -181664 126208 199007 -179832
12771a36122A28823j6379K7465J27471D7697a68049h2976j61432A29712A6616
$$ -136122 128823 112444 139909 267380 47697 -168049 -82976 -244408 129712 16616
12760D2394b63488c4956p894A3174a09471A24855N5461k5216l7251K9317L849
$$ 42394 -263488 -34956 -42850 13174 -109471 124855 180316 155100 117849 147166 151015
12749A51015d8878n7134B39753c18095C3200J08461a88344D4245j936P4547e0995
$$ 151015 -48878 -106012 239753 -318095 33200 141661 -188344 44245 42309 116856 -50995
12737B3406L48461D4289H335L35219j36141m027D0514a42642A97550a4356B23870
$$ 23406 371867 44289 8335 343554 207413 203386 40514 -142642 197550 -14356 223870
12725B61993b90790A75927B9870b3828N561C38237a54500k5555B261K21515A11462
$$ 261993 -290790 175927 29870 -23828 -18267 338237 -154500 -180055 2261 223776 111462
12713A78130K7915N3879A09627a80318C88419j92162o5345K11315A7652J59016
$$ 178130 206045 259924 109627 -180318 388419 196257 130912 342227 17652 176668
12703A76668K8171D1472J24901L4883I7294b4202j0317H4426C9736a708C18717
$$ 176668 204839 41472 166373 201256 97294 -24202 -34519 84426 39736 -1708 318717
12691g2933f100A77141A3446J2700a09048b1213j20414B26503G0742A5086L93708
$$ -72933 -6100 177141 13446 26146 -109048 -21213 -141627 226503 70742 15086 408794
12680D08794A36468A7043d3736A09289k3870J41901K32247f3945j29503B96477
$$ 408794 136468 17043 -43736 109289 85419 227320 459567 -63945 -193448 296477
12669c20086A31057g2202A44765J17989B3888i8716A86591K9910g053B61437l9179
$$ -320086 131057 -72202 144765 262754 23888 -98716 186591 216501 -7053 261437 222258
12658B22258p8284B9020R933b54999A06576C0215K2648j6481a90362D845a88739
$$ 222258 143974 29020 38953 -254999 106576 30215 52863 36382 -190362 4845 -188739
12646B56898b28707p3119f260B74120E7343L1915c00440A45348m8551F863a98115
$$ 256898 -228707 -301826 -6260 274120 57343 89258 -300440 145348 96797 6863 -198115
12634G3038h5187A54107a67295A68615l2411r113J38065j00033A3180P2145O2393
$$ 73038 -85187 154107 -167295 168615 136204 127091 265156 165123 13180 85325 147718
12623A47718E6603K4832K6080b3920A60919K08701j15469F3415a78471C00598
$$ 147718 56603 81435 107515 -23920 160919 369620 254151 63415 -178471 300598
12612a2148B8391b28033B29676b6118B4866J27513P2053H0439i589l6555D0833
$$ -12148 28391 -228033 229676 -26118 24866 152379 224432 80439 -9589 -46144 40833
12600H5524b22512B01547l6210k131G3199L67178a23513c3028j8711B3304j933
$$ 85524 -222512 201547 165337 163206 73199 440377 -123513 -33028 -51739 23304 21371
12589B1371J70194b60643k2813j03169J74897f6869A58150h2354K0338I6721l6850
$$ 21371 191565 -260643 -283456 -386625 -211728 -66869 158150 -82354 -62016 96721 59871
12578E9871J76686i0096H735M3054M3652a18459A0539g3740n589b856A07554b5736
$$ 59871 236557 -90096 8735 51789 95441 -118459 10539 -73740 -79329 -2856 107554 -25736
12565h0232A82230O8239L8142C5632K24594R0526L1927E3410b40396A96961D7097
$$ -80232 182230 250469 288611 35632 260226 350752 382679 53410 -240396 196961 47097
12553A43141J6912c9186j24231D2056M7412i0892H1938h221l11337C3667J50164
$$ 143141 160053 -39186 -163417 42056 89468 -90892 81938 -8221 -319558 33667 183831
12542A83831b94805C39242a02724j16846L7979j54946c1607A55573k0734a39677
$$ 183831 -294805 339242 -102724 -219570 -181591 -336537 -31607 155573 134839 -139677
12531A11170a15330A51764J5671O2380b11300B88403e37072A66347b69480G6248
$$ 111170 -115330 151764 167435 229815 -211300 288403 -537072 166347 -269480 76248
12520D9233f9380A92425E1221a02818B7291a92009Q8600j82157A50126M0846b1821
$$ 49233 -69380 192425 51221 -102818 27291 -192009 -103409 -285566 150126 190972 -21821
12508D5043a35907C94149j30933c489B89838m4576b6146k48B4032h4899b1497
$$ 45043 -135907 394149 263216 -3489 289838 245262 -26146 -26394 24032 -84899 -21497
12496e3997a2106l2172a8966I0513j0731a95231r0689F5012L1519B1907a01278
$$ -53997 -12106 -44278 -18966 90513 79782 -195231 -285920 65012 96531 21907 -101278
12484A97686a12854k79762a14682K9790j16933d2936D6443P0059J10390m5317
$$ 197686 -112854 -392616 -114682 -84892 -201825 -42936 46443 116502 226892 181575
12474A81575b67633R0559M9326b1609j56619F3608a78248K1666O8245p379b8132
$$ 181575 -267633 -177074 -127748 -21609 -178228 63608 -178248 -156582 -88337 -95716 -28132
12462g1712q8153H5548c90356F1589J64176b51709B24958H6663b25132E4551R1062
$$ -71712 -159865 85548 -390356 61589 225765 -251709 224958 86663 -225132 54551 145613
12451A45613a04252d0808B12389N5804c32448J31481A36423E6514a96569b523
$$ 145613 -104252 -40808 212389 268193 -332448 -200967 136423 56514 -196569 -2523
12440A87407B7865a84202N8929C476J68595n3295c9180H2448J21897d11529a18982
$$ 187407 27865 -184202 -125273 3476 172071 118776 -39180 82448 204345 -411529 -118982
12428a24736A65016E8848h2857D314b5135H9988J43578F6992K8217b8569B44581
$$ -124736 165016 58848 -82857 4314 -25135 89988 233566 66992 95209 -28569 244581
12416A7372b201C041N700J81394n026K0296g8120B24417b14773i7870a8367A20914
$$ 17372 -2201 3041 8741 190135 185109 205405 -78120 224417 -214773 -97870 -18367 120914
12403b9236q5430a2999j04539I7002h7343A67448k7171D5742i4004C5283h5729
$$ -29236 -114666 -12999 -117538 97002 -87343 167448 140277 45742 -94004 35283 -85729
12391b41316A2693J36105b40981G8801J03579a3419j02352J6559B20210b14780
$$ -241316 12693 148798 -240981 78801 182380 -13419 -115771 -99212 220210 -214780
12380A48259a19196j34684B00015d3279j16650j14350L1924e2576A09101b06184
$$ 148259 -119196 -253880 200015 -43279 -159929 -274279 -242355 -52576 109101 -206184
12369b4465B17369Q265F7805d5046j4489q796j69646B00973d4152a1607j61774
$$ -24465 217369 225634 67805 -45046 -59535 -68331 -237977 200973 -44152 -11607 -173381
12358a73381M8170A3974c2107l14451A11415l1270M1996e3231b1516I9570i9112
$$ -173381 -125211 13974 -32107 -346558 111415 80145 122141 -53231 -21516 99570 -99112
12346B33543m733a41171k6037e7397j14942A45171a36535A49143C6273J21032
$$ 233543 228810 -141171 -167208 -57397 -172339 145171 -136535 149143 36273 157305
12336A57305a66836b5974j17311G0512a25250J9645m8134d0201H770J17931a83335
$$ 157305 -166836 -25974 -143285 70512 -125250 -105605 -153739 -40201 8770 126701 -183335
12324b29781B17721a92449l0174M8301O2200A08965a5450k8790C64680E7252g2289
$$ -229781 217721 -192449 -222623 -174322 -112122 108965 -15450 -44240 364680 57252 -72289
12312b26979a10564l2390j41404G5370J96358I8487J49931b98655F1600K4593
$$ -226979 -110564 -142954 -284358 75370 271728 98487 248418 -298655 61600 86193
12302H6193C0015K28172k3144a01289l26522A15302f4663a2863j70417K5152B13695
$$ 86193 30015 258187 235043 -101289 -427811 115302 -64663 -12863 -183280 -158128 213695
12290b6701g155G0042k6108a81404b9301m6104B74147j34126n3562a28291H650
$$ -26701 -7155 70042 43934 -181404 -29301 -75405 274147 140021 86459 -128291 8650
12278A14597j9160g9676B52055b41643B96448a15628I3871B8208e8009g396r0879
$$ 114597 95437 -79676 252055 -241643 296448 -115628 93871 28208 -58009 -7396 -98275
12267i8275B12798a21982I2849J17326L9547b34589d6216B0014J63914K6397I7136
$$ -98275 212798 -121982 92849 210175 249722 -234589 -46216 20014 183928 210325 97136
12255B82660F7967J83032G1970K17296q2685B0139J15301J41617d3912C24731
$$ 282660 67967 250999 71970 289266 206581 20139 135440 277057 -43912 324731
12244B67419K2110A22689a5901j19129A14921f9561A41460b7035B07428Q5800
$$ 267419 289529 122689 -15901 -135030 114921 -69561 141460 -27035 207428 293228
12234B93228A09763N4014D1410Q4306h0156C06190p2990a2005F3108O9341J54396
$$ 293228 109763 163777 41410 125716 -80156 306190 233200 -12005 63108 132449 286845
12223B86845i0590C34959J8726I4475P8988K4050B0879K73015q8704l340q1800
$$ 286845 -90590 334959 353685 94475 173463 197513 20879 293894 205190 201850 120050
12212A20050a31543C86428b83590C83389g7816j73274B86073A32165b4400A0951
$$ 120050 -131543 386428 -283590 383389 -77816 -251090 286073 132165 -24400 10951
12201A10168J1996J381A8091J54054a01704B03905K8647i3969r5994B15730K8554
$$ 110168 122164 123545 18091 172145 -101704 203905 232552 -93969 -189963 215730 244284
12190B44284a04039C9395J39022N2751B9753a20098A70223m1671k6341J76773
$$ 244284 -104039 39395 178417 231168 29753 -120098 170223 128552 102211 278984
12180B78984j16626a87263f2392B01012E8534M32947B32383j05227M2754c1941
$$ 278984 162358 -187263 -62392 201012 58534 491481 232383 127156 169910 -31941
12169A17462N4795i6927A42667K3497d7904B56004a4500F7859N6310i3665C6189
$$ 117462 172257 -96927 142667 166164 -47904 256004 -14500 67859 124169 -93665 36189
12157A710P9365P1922a3015Q67q1154K4885l8972r3434A78859q4003a30309C11681
$$ 1710 81075 152997 -13015 -12148 -93302 -68417 -107389 -200823 178859 94856 -130309 311681
12144A25483h0347B5566M2257i8824m9512f2121n1059C79943A4813J95655a20147
$$ 125483 -80347 25566 67823 -98824 -148336 -62121 -113180 379943 14813 210468 -120147
12132a28281e4459A13220b74072H6987a86858b3367B77962I1334j3913N3464l9162
$$ -128281 -54459 113220 -274072 86987 -186858 -23367 277962 91334 77421 130885 91723
12121I1723M0166J1074m3615a354q7703b1450B32176a55597e6928a9870j19717
$$ 91723 131889 142963 99348 -1354 -89057 -21450 232176 -155597 -56928 -19870 -139587
12110a39587m5939b4596o2586a989A07409D2039K5664J4590O8594a98778I4735
$$ -139587 -185526 -24596 -87182 -1989 107409 42039 67703 82293 150887 -198778 94735
12098e5369A52171a4727j8836j79283p7232J04690A22812J3777A3298J78874J3499
$$ -55369 152171 -14727 -33563 -212846 -290078 -185388 122812 136589 13298 192172 205671
12087B05671P6391b13662A38412b48126j4138C66875Q1080D2394J47985l5440
$$ 205671 282062 -213662 138412 -248126 -262264 366875 447955 42394 190379 154939
12077A54939e6212F66235N68571C79828A49878C5604K3044b55829k81596C06892
$$ 154939 -56212 666235 1234806 379828 149878 35604 58648 -255829 -537425 306892
12066H7311N1850F7981N7127j8421a47028A708d0444A54530b41299B13052b6191
$$ 87311 139161 67981 125108 106687 -147028 1708 -40444 154530 -241299 213052 -26191
12054C07345o474b42311k9488F885c0440C1646g9260h197j17517I2536j9191e24375
$$ 307345 300871 -242311 -271799 6885 -30440 31646 -79260 -8197 -125714 92536 73345 -524375
12041g4753j95137A99469b10607i6505J7011R127D70951A05548b14467O7200k62457
$$ -74753 -269890 199469 -210607 -96505 -79494 -70367 470951 105548 -214467 -147267 -409724
12030d09724F3442a40697A9771a24633E1686l423a83264B4211Q5148J44694H1282
$$ -409724 63442 -140697 19771 -124633 51686 48263 -183264 24211 109359 254053 81282
12018D1397h6798O51B86693b23875M0246A95294N2256a96189G2210a05333m8144
$$ 41397 -86798 -86147 286693 -223875 -183629 195294 247550 -196189 72210 -105333 -153477
12007a53477B01694a56650m829C6538J34941e8895J6293D49129a30269B7463J68133
$$ -153477 201694 -156650 -161479 36538 171479 -58895 -42602 449129 -130269 27463 195596
11996A95596a87m8065j19235j6066K8019c2566j45774f0459j580A44477j0209
$$ 195596 -187 -48252 -167487 -183553 -155534 -32566 -178340 -60459 -62039 144477 134268
11985A34268a35619J8602D766b82011d7620j66551B27081G6061d5039I833B347
$$ 134268 -135619 -117017 4766 -282011 -47620 -214171 227081 76061 -45039 9833 2347
11973a74829H2342K8569A0305J6416c7210A47148K08599a750A62636b10487C3979
$$ -174829 82342 110911 10305 26721 -37210 147148 355747 -1750 162636 -210487 33979
11961C02644a37605a7426k23744g3407j73532A49144d56120A85324k2409G3127
$$ 302644 -137605 -17426 -241170 -73407 -246939 149144 -456120 185324 162915 73127
11950c05137A80981g1297E6160a55699k20145c2524A37920d7024D6946J71632
$$ -305137 180981 -71297 56160 -155699 -375844 -32524 137920 -47024 46946 218578
11940B18578n8519b28534A29573a46532B02041a92645B19841j08614l8635P8781
$$ 218578 160059 -228534 129573 -146532 202041 -192645 219841 111227 72592 151373
11930A51373a61598O5854j17067B51998a2490k07135I7971O6712a47920C9051
$$ 151373 -161598 -95744 -212811 251998 -12490 -219625 97971 164683 -147920 39051
11919c5757A53214c23153A51058i7099d1165D0950C681J8623J692K33416e932
$$ -35757 153214 -323153 151058 -97099 -41165 40950 3681 22304 23996 257412 -5932
11907c19098A80164B3979j1328i8418A03039c39347A98781o7153A9499h4283p8017
$$ -319098 180164 23979 12651 -98418 103039 -339347 198781 131628 19499 -84283 -162300
11896a62300B73717a75053r343g0063p1852B0128R1927P0597b12977g6101k39404
$$ -162300 273717 -175053 -184396 -70063 -141915 20128 112055 182652 -212977 -76101 -315505
11885c15505D0609J88871c55416a632A3714M9371c10432f7697A45349L3972a17947
$$ -315505 40609 229480 -355416 -1632 13714 63085 -310432 -67697 145349 179321 -117947
11873B2808R4933a8984C51404a42095L8262d3095o7239C6291d6455F666M5301
$$ 22808 117741 -18984 351404 -142095 -103833 -43095 -110334 36291 -46455 6666 51967
11862E1967Q6295M0949h2A94381R218a17546m809B30872r6894E2366g6043A32136
$$ 51967 138262 179211 -82 194381 203599 -117546 -122355 230872 133978 52366 -76043 132136
11849A21532c9464j29387j73766J31482q0716A59695l7356a10544B72J71161c67431
$$ 121532 -39464 -168851 -342617 -211135 -291851 159695 122339 -110544 272 171433 -367431
11837e1353F5367i8376L6753l2711m7666B6486b02524A84400e9233l8708E6067
$$ -51353 65367 -98376 -61623 -94334 -142000 26486 -202524 184400 -59233 -97941 56067
11825d45036a70459L6521K7727a2404j05883j09029e0891I3916a26711j07173
$$ -445036 -170459 -133938 -106211 -12404 -118287 -227316 -50891 93916 -126711 -233884
11815b33884A5326h3385j71735I8364O2242M1518b51947a18899e3818k32910C03956
$$ -233884 15326 -83385 -255120 98364 160606 202124 -251947 -118899 -53818 -286728 303956
11803a53200C0414a4309j00230a9548g665A51332J87867j62039g3426C8819K64478
$$ -153200 30414 -14309 -114539 -19548 -7665 151332 339199 177160 -73426 38819 303297
11792C03297A36820a49025N6923l3501A92276B7806O0734k4914i3432A40098m6394
$$ 303297 136820 -149025 -92102 -125603 192276 27806 88540 63626 -93432 140098 93704
11781I3704J43059a69875M4275A0620i4204B7753a0276k53884A35957a77974O5441
$$ 93704 236763 -169875 -125600 10620 -94204 27753 -10276 -264160 135957 -177974 -112533
11770a12533r1808R6278A83601G5143O1687G253e3541j40462b5641a825B50108
$$ -112533 -204341 -108063 183601 75143 136830 7253 -53541 -194003 -25641 -1825 250108
11758A20035a31138B6631g6503p8740b7498a704A5183K41108c40816A21740R8618
$$ 120035 -131138 26631 -76503 -155243 -27498 -1704 15183 256291 -340816 121740 220358
11747B20358b58563E9513h2704B6065c94469a57127q4951N584A62745b74405A28626
$$ 220358 -258563 59513 -82704 26065 -394469 -157127 -242078 -236494 162745 -274405 128626
11735A499K90086j26396J39179c81947r8339E4057g0240A14639C6212i4582c8144
$$ 1499 291585 165189 304368 -381947 -480286 54057 -70240 114639 36212 -94582 -38144
11723F7633a1656m4196n4017A71504C2609J88028H8459P6653J8258B6190i5131
$$ 67633 -11656 -55852 -109869 171504 32609 220637 88459 165112 183370 26190 -95131
11711a96518D8628J40475k0070o8823d79142d0659E30177G2712a60305B24780
$$ -196518 48628 189103 169033 100210 -479142 -40659 530177 72712 -160305 224780
11700E6086e9723N532C25432a2382q4239q0421E775N0199L06868d9867n4846G3596
$$ 56086 -59723 -54191 325432 -12382 -96621 -177042 5775 55974 362842 -49867 -104713 73596
11687D64681n2620d5652j83880B08379B4484e7784G5796a76699A9152J60926p5444
$$ 464681 412061 -45652 -229532 208379 24484 -57784 75796 -176699 19152 180078 104634
11676A04634J92015A26962J70675c723m5736A29139C9483a04651C07569a70000
$$ 104634 296649 126962 297637 -3723 -49459 129139 39483 -104651 307569 -170000
11665I0537J81399d10359A48235j4931a15572B87877j20678o1278d84928G384
$$ 90537 271936 -410359 148235 133304 -115572 287877 167199 105921 -484928 7384
11654B35419n9226C2851b95821G310J49952J38339a00267A7765M10379G0049a71967
$$ 235419 176193 32851 -295821 7310 157262 295601 -100267 17765 428144 70049 -171967
11642c2933A8083c17917C37028a14502L872L5649j11819j06729A28037N3807m6895
$$ -32933 18083 -317917 337028 -114502 -110630 -74981 -186800 -293529 128037 181844 134949
11631A34949a0176L901A53163P9711K3158b16908J08445k79651H9429b56809b1851
$$ 134949 -10176 -6275 153163 232874 256032 -216908 -108463 -388114 89429 -256809 -21851
11619A52232l7682B1701a31712L008A90098c1071C29416h9759o7189A69314B133
$$ 152232 114550 21701 -131712 -128704 190098 -31071 329416 -89759 -156948 169314 2133
11607B14904a99240E5970j3300g8727B17881C7737a41854A8419J34932p3115C8919
$$ 214904 -199240 55970 42670 -78727 217881 37737 -141854 18419 153351 80236 38919
11595a48393D66344A37778m102n3561a8755E7123K08213J08793b22691M2655Q3834
$$ -148393 466344 137778 133676 80115 -18755 57123 265336 374129 -222691 -180036 -96202
11584i6202R951b7020m7352j18417l305i7969A60810K89334k22458p8672K3466
$$ -96202 -86251 -27020 -74372 -192789 -196094 -97969 160810 450144 227686 149014 172480
11573A72480B3607L22711a01893A03400j5663J62895G2205l5040J72297k6954
$$ 172480 23607 346318 -101893 103400 87737 250632 72205 37165 209462 182508
11563A82508H4504B1305e0727k08662a03776o1407j31209B28885E8800b6701B01596
$$ 182508 84504 21305 -50727 -259389 -103776 -165183 -296392 228885 58800 -26701 201596
11551H0111m362a9989C77730b28137I1852c05258H2718P6872M4582b32402A68355
$$ 80111 75749 -19989 377730 -228137 91852 -305258 82718 159590 204172 -232402 168355
11539a56880C31278j49169J6138F7864c8996A58355J16A2801b31400c6413A41665
$$ -156880 331278 182109 198247 67864 -38996 158355 158471 12801 -231400 -36413 141665
11527C49916A17480M5236P7496j14656b45997b5901q6808A66401K32248a34422
$$ 349916 117480 162716 240212 125556 -245997 -25901 -112709 166401 398649 -134422
11516f7755k42389g9805B85795e3195B24287a06141A98709a02983G527q60L81820
$$ -67755 -310144 -79805 285795 -53195 224287 -106141 198709 -102983 7527 6667 388487
11505C88487A48243K11756g498D65086b07875F5455J28238J41946i0145J4739
$$ 388487 148243 359999 -7498 465086 -207875 65455 193693 335639 -90145 -75406
11495g5406h022j39550C47999a52450C27853j17815K79416A30790E5370q159J65289
$$ -75406 -8022 -147572 347999 -152450 327853 210038 489454 130790 55370 47211 212500
11484B12500J19876A9495a38173C9799b6996A94490L7971r1758K07028d4165B13184
$$ 212500 332376 19495 -138173 39799 -26996 194490 232461 140703 347731 -44165 213184
11472B55280p6858E8716K27886R173H7556A9114L44248D058i8678F4363h2728
$$ 255280 178422 58716 286602 295775 87556 19114 363362 4058 -98678 64363 -82728
11460C60074j67548a59029C10131g8050A10355h4969H6343a20175F1316C357b37538
$$ 360074 192526 -159029 310131 -78050 110355 -84969 86343 -120175 61316 3357 -237538
11448b0701A40929P2242a03841j01656R9285m8961K8158A77531a47427B07150
$$ -20701 140929 213171 -103841 -205497 -106212 -155173 -127015 177531 -147427 207150
11437C56101a30190E7988A492N4532g2510J0835o4346a1579A60757a46288I6537
$$ 356101 -130190 57988 1492 56024 -72510 -61675 -126021 -11579 160757 -146288 96537
11425d6252F9236k1867K25757a20224L9728i584j37455a4393D7686a9173C71399
$$ -46252 69236 47369 273126 -120224 -80496 -9584 -147039 -14393 47686 -19173 371399
11413a76239B79839A32006N3873K7354O1802o7849q2442K9888a26354A73789a03708
$$ -176239 279839 132006 185879 213233 275035 207186 124744 154632 -126354 173789 -103708
11401C0901K7526a41048E7359j3525J04913n3630c02058L0312A231e1135A19774
$$ 30901 58427 -141048 57359 43834 148747 95117 -302058 -271746 1231 -51135 119774
11389a07020j99526A60405c2720D49459A12418J35966a65558C14525j23008c4915
$$ -107020 -306546 160405 -32720 449459 112418 248384 -165558 314525 191517 -34915
11378a18758o3541a2164l1687I6883a25524J7080k25707A32112b59895a22607
$$ -118758 -182299 -12164 -43851 96883 -125524 -108444 -334151 132112 -259895 -122607
11367a01009K6552j40080A6209J99982a96805B61476p2474j3106B1289a39438
$$ -101009 -74457 -214537 16209 216191 -196805 261476 189002 175896 21289 -139438
11356A80157a10835C1341g1810k9263F2635a20835j77b9578p9794A18368P9886
$$ 180157 -110835 31341 -71810 -101073 62635 -120835 -121012 -29578 -109372 118368 198254
11345A98254c9509j2486C6517K3500B1478a22084B7076J74074M1242I5124a11646
$$ 198254 -39509 -51995 36517 60017 21478 -122084 27076 201150 242392 95124 -111646
11333a38087K9633E7543d96306a8774l46817A42906N2139n6264K35828A9511J64503
$$ -138087 -108454 57543 -496306 -18774 -365591 142906 195045 138781 374609 19511 184014
11322A84014b8461A90024o9954d98894a12688P238L4446j48679b8774F9544J01435
$$ 184014 -28461 190024 120070 -498894 -112688 -105450 -71004 -219683 -28774 69544 170979
11311A70979D2640a1911j50709A31390a88918B34451a2220l0187k8058k66278
$$ 170979 42640 -11911 -162620 131390 -188918 234451 -12220 -42407 -70465 -336743
11301c36743n8143J56026c2723j49706a4498A49056P6828G3922d03070b9622E8503
$$ -336743 -394886 -238860 -32723 -182429 -14498 149056 225884 73922 -403070 -29622 58503
11289G5495h6070j84845K3670j65779c5699I0166g1269o0126m8618h308k03441
$$ 75495 -86070 -270915 -247245 -413024 -35699 90166 -71269 -131395 -180013 -8308 -211749
11278b11749B33301a20482H7370D261d5274n6011j97032C27564D7036J85197a61256
$$ -211749 233301 -120482 87370 4261 -45274 -101285 -298317 327564 47036 232233 -161256
11266a47832C13686a34653B37769J42822a21988L5693B00014d89641h6316G3584
$$ -147832 313686 -134653 237769 380591 -121988 -86295 200014 -489641 -86316 73584
11255b32242A97034d63690f8100n0813E220K79304b18924G753M5065N7318J4110
$$ -232242 197034 -463690 -68100 -118913 5220 284524 -218924 7753 52818 110136 124246
11244A24246b4461k50026e6917E3588e24227e3578B47929o0409C4317a1179j25370
$$ 124246 -24461 -274487 -56917 53588 -524227 -53578 247929 187520 34317 -11179 -136549
11233a36549A36876a55526A58590a00456j04496a01666K5624k68063c3385p6802
$$ -136549 136876 -155526 158590 -100456 -204952 -101666 -76042 -344105 -33385 -110187
11223a10187C6249e5628n5113D9604L00089p1015H7278R1443g2939J8104A7510
$$ -110187 36249 -55628 -110741 49604 349693 278678 87278 178721 -72939 -54835 17510
11211B07981I0992a88814B72267c78138E702J09613h3257r6071b7740F0705e02604
$$ 207981 90992 -188814 272267 -378138 5702 115315 -83257 -179328 -27740 60705 -502604
11199b92686J37110N1468C50885A6560a24678K0103A83625a46846L9400A7087
$$ -292686 -155576 -104108 350885 16560 -124678 -104575 183625 -146846 -107446 17087
11188A95939a87251Q1632j24899G9052b8243B63673h7351j31853h3979C10583
$$ 195939 -187251 -105619 -230518 79052 -28243 263673 -87351 -219204 -83979 310583
11177b02759G0793q049J2991a63550K784j7082Q3668A59478D8680b52413r150
$$ -202759 70793 62744 75735 -163550 -160766 -177848 -94180 159478 48680 -252413 -261563
11166b61563H265i3382G17R5275g0159k9626A64343M3929g4502B55057d36055
$$ -261563 8265 -93382 717 95992 -70159 -99785 164343 208272 -74502 255057 -436055
11154b159k02452B53302b59891R5696A30764j6845c62008a27892p6574M6213j17211
$$ -2159 -204611 253302 -259891 -164195 130764 113919 -362008 -127892 -204466 -158253 -275464
11143b75464C2381A2641J17546a57336j99801D2520K0932b3227o1153k37339G1791
$$ -275464 32381 12641 130187 -157336 -357137 42520 63452 -23227 -84380 -321719 71791
11131A9861L17924j50126b082m1034B16248H5825d1896G6905R2277k5504J7733
$$ 19861 337785 187659 -2082 -43116 216248 85825 -41896 76905 169182 143678 161411
11120A61411E9029P3089D628J66109J26670b04343c5596k1616a7167C64113f167
$$ 161411 59029 132118 4628 170737 297407 -204343 -35596 -57212 -17167 364113 -6167
11108A29214a9038j6211j67789A38464K35823A08806a5177A67259e4380E343J00113
$$ 129214 -19038 -35249 -203038 138464 374287 108806 -15177 167259 -54380 5343 105456
11097A05456J12141J59706A00850a1596C53943b04584D59737m1904a1268A67902
$$ 105456 217597 377303 100850 -11596 353943 -204584 459737 417833 -11268 167902
11086A38808C4938M72745B52859f0445J635F3185P1052J84180A29417d7602A69092
$$ 138808 34938 507683 252859 -60445 -58810 63185 134237 318417 129417 -47602 169092
11074C70664j33776J5845p3067n2527L48874O2667A12317K63932j24566p5663
$$ 370664 236888 252733 179666 127139 476013 538680 112317 376249 251683 176020
11064A76020L13718j69560p5606L37353q5673o7984N867K29537k1823C00184L37462
$$ 176020 489738 320178 244572 581925 496252 428268 434135 663672 641849 300184 637646
11053F37646k59813J32126J32350B06026M99704j99900J02285j09066J96393K28513
$$ 637646 377833 509959 642309 206026 705730 505830 608115 499049 695442 923955
11043I23955l37584j53082R1076L29153j47484j92473K34020A14538L57508J07604
$$ 923955 586371 433289 524365 853518 706034 513561 747581 114538 472046 579650
11033E79650M22840C53064M88653l46168K78609k20253N6219K78812j80883l7560
$$ 579650 1002490 353064 841717 495549 774158 553905 610124 888936 708053 670493
11023F70493j71171l9877K46396B06140M87008B43637N73542k27767Q8888j81303
$$ 670493 499322 459445 705841 206140 693148 243637 817179 589412 678300 496997
11013D96997r7267M46629C98884j44835J89665n7576J16751R8702K645R2754O2845
$$ 496997 399730 846359 398884 254049 443714 386138 502889 601591 604236 696990 759835
11002G59835Q7553l74615R344K24678j68777J5350J62434j79819p7040L25439
$$ 759835 847388 472773 482117 706795 538018 553368 715802 535983 458943 784382
10992G84382l30537K88448n0700k918O2207M8539q6370K26795J2481k37283N18250
$$ 784382 453845 742293 691593 688675 750882 799421 713051 939846 952327 715044 1233294
10981A233294k10630L95500K0698K50256O6677K55809L19983J64230j77885N73986
$$ 1233294 1022664 1418164 1438862 1689118 1755795 2011604 2331587 2495817 2317932 2891918
10971B891918m84251l99006K75478P3824m84648m14090J41047k91737L83545o0272
$$ 2891918 2407667 2008661 2284139 2357963 1873315 1459225 1600272 1308535 1692080 1631808
10961A631808p5429L7472k85887Q0485J23512l77159j81105j78366Q0728j90032
$$ 1631808 1556379 1593851 1307964 1388449 1511961 1134802 953697 775331 856059 666027
10951F66027j3574j00701j56595A64600L19789k33461m6177J28481j46396J82579
$$ 666027 652453 551752 395157 164600 484389 250928 204751 333232 186836 369415
10941C69415a17331b1792C54639b408j81249I1845J82047q2644N3734i1468n0721
$$ 369415 -117331 -21792 354639 -2408 -183657 91845 273892 191248 244982 -91468 -142189
10930a42189E6281c8919A48011c7806G0744J78658c13106D5787j8200N0929K321
$$ -142189 56281 -38919 148011 -37806 70744 249402 -313106 45787 27587 78516 80837
10919H0837a62179p1312A08767a04862A5053k824J05932h2593F4707N0164L09742
$$ 80837 -162179 -233491 108767 -104862 15053 12229 118161 -82593 64707 114871 424613
10908D24613b86528a20820c6690j29735G4140b98374e8759j25248F8581b0636
$$ 424613 -286528 -120820 -36690 -166425 74140 -298374 -58759 -184007 68581 -20636
10897A68074d6459m7215D3301K12111C0799g7094o8007N7863j48920M4151q3919
$$ 168074 -46459 -93674 43301 255412 30799 -77094 -145101 -87238 -236158 -192007 -275926
10886b75926J02893G3504M1908d4203q1367j28824B15365a50332P0420J7404a8641
$$ -275926 -173033 73504 115412 -44203 -125570 -254394 215365 -150332 -79912 -62508 -18641
10874a12591L0203F7981a82834B19295a56796A57779J61617e028D0236b92093
$$ -112591 -82388 67981 -182834 219295 -156796 157779 319396 -5028 40236 -292093
10863E7300K6545K9645B4942K56122a76774k8836m3900I7492L9340b6460q6768
$$ 57300 83845 113490 24942 281064 -176774 -205610 -249510 97492 136832 -26460 -113228
10852a13228k84474A03738J13931a75876A91805b8638H2997M8648a71698G4647
$$ -113228 -397702 103738 217669 -175876 191805 -28638 82997 131645 -171698 74647
10841b3071H8817i3483B46439c05660a2174j33384a090B14342L4109b18028c9978
$$ -23071 88817 -93483 246439 -305660 -12174 -145558 -1090 214342 248451 -218028 -39978
10829a49340A39744L02985j04405b21872l5805C21228c8040A21697J76822I0065
$$ -149340 139744 442729 338324 -221872 -257677 321228 -38040 121697 298519 90065
10818a62789A56358b5628B66883h1290q9889d300j16831e6264n1484j18722C8556
$$ -162789 156358 -25628 266883 -81290 -171179 -4300 -121131 -56264 -107748 -226470 38556
10806c1787k75351c305A22503a02435A01449c41301a42546A97983Q474d4096m7376
$$ -31787 -307138 -3305 122503 -102435 101449 -341301 -142546 197983 206457 -44096 -91472
10795i1472E4450a3879r5601K6914m905j11214H3558b35532L3045B00923e1356
$$ -91472 54450 -13879 -109480 -82566 -87471 -198685 83558 -235532 -202487 200923 -51356
10783a21049e0516A31315E0181a17891k30110A27640i0676J4191A4202b15579
$$ -121049 -50516 131315 50181 -117891 -348001 127640 -90676 -76485 14202 -215579
10772b78458J20304K0752D84521a04689M9680j49196i2523D80571a44947e9695
$$ -278458 -158154 -137402 484521 -104689 -55009 -204205 -92523 480571 -144947 -59695
10761a4383j53827B05831c26131P8282d0339C11217c13106a42288N8228b2524
$$ -14383 -168210 205831 -326131 -247849 -40339 311217 -313106 -142288 -84060 -22524
10750g9562p8888m1214r978o5895j21906a35561A49369F0954N5678E0592a19398
$$ -79562 -158450 -199664 -209642 -275537 -397443 -135561 149369 60954 116632 50592 -119398
10738d085o8314j4785n3923N4797j00355d3226j97172F9822j535J5450l7244M8488
$$ -4085 -72399 -87184 -141107 -86310 -186665 -43226 -240398 69822 68287 83737 46493 94981
10726I4981a33714d8574K2903l8631p3573A14747b87152e6392k09526H235K47418
$$ 94981 -133714 -48574 -25671 -64302 -137875 114747 -287152 -56392 -265918 8235 255653
10715B55653J63482d28097b07537H7116h1324A45771f4093K1224l3041G0183O402
$$ 255653 419135 -428097 -207537 87116 -81324 145771 -64093 -42869 -75910 70183 76585
10704G6585b2933j73660j5581C2271d33151J84141D6982d2035a3665j71342B89212
$$ 76585 -22933 -196593 -212174 32271 -433151 -249010 46982 -42035 -13665 -185007 289212
10692a0409o0808r9662C069l85J31649a82509D8062b18853F9760b39619A16340
$$ -10409 -71217 -170879 3069 2684 134333 -182509 48062 -218853 69760 -239619 116340
10680A87147m7865n3498a94072G0237a28396A51575K5551A443b38828J08728B93149
$$ 187147 139282 85784 -194072 70237 -128396 151575 177126 1443 -238828 -130100 293149
10668d2958j06046D8825L7155d2049k99491f3230J5157l1077l17724f5897j96
$$ -42958 -149004 48825 85980 -42049 -341540 -63230 -48073 -79150 -396874 -65897 -66093
10657f6093k3796K1166j35360q17B32255A2000a75641D3293b5369o9928j00194
$$ -66093 -89889 -68723 -204083 -204900 232255 12000 -175641 43293 -25369 -95297 -195491
10646a95491L3319E3796J49737C1875a87382b6345l03146i4404j05073G4317a97667
$$ -195491 -162172 53796 203533 31875 -187382 -26345 -329491 -94404 -199477 74317 -197667
10634c36072R2233C95878D0849N24888A91853j152a28178b0951A26734B8940a03726
$$ -336072 -243839 395878 40849 565737 191853 190701 -128178 -20951 126734 28940 -103726
10622A31912M3747b50484B13257b14192j42673J30996l00402g0836B23594a69974
$$ 131912 175659 -250484 213257 -214192 -356865 -225869 -526271 -70836 223594 -169974
10611i9351d5034j82k1762k30022N6176C13094d8003k36816a06091D9524c25884
$$ -99351 -45034 -45216 -66978 -297000 -240824 313094 -48003 -284819 -106091 49524 -325884
10599b82811J22950C3473I357a33471A34626C6429a0533o6736a5967o1345J1210
$$ -282811 -159861 33473 9357 -133471 134626 36429 -10533 -77269 -15967 -77312 -66102
10588f6102B8085b75214J13576j17650A4904a0191j85247g7828A87272a57829
$$ -66102 28085 -275214 -161638 -279288 14904 -10191 -195438 -77828 187272 -157829
10577B1598K27587h9688D67456A05695N6305E1885J04968G6029b22366C3161J1686
$$ 21598 249185 -89688 467456 105695 162000 51885 156853 76029 -222366 33161 44847
10566D4847c19314C9385f9036H1375a3241A40174c07599A577b54252A10556a6795
$$ 44847 -319314 39385 -69036 81375 -13241 140174 -307599 1577 -254252 110556 -16795
10554G0397d5877o1536C8859R5789D4963J91091d2617r1729B49736l8264c08604
$$ 70397 -45877 -107413 38859 134648 44963 236054 -42617 -134346 249736 211472 -308604
10542B20014k6747a91298j57838E0294b2742k16599q225E6462d7790A27753l5746
$$ 220014 193267 -191298 -349136 50294 -22742 -239341 -247566 56462 -47790 127753 92007
10531I2007e8989o405A62207a0019j20178H3842c12895Q4664i0923M4701n1774
$$ 92007 -58989 -65394 162207 -10019 -130197 83842 -312895 -228231 -90923 -46222 -97996
10520i7996k79243e4580m1201j52613E6749J2493b93398b5097q9283A10627j9225
$$ -97996 -377239 -54580 -95781 -248394 56749 69242 -293398 -25097 -114380 110627 91402
10509I1402d7588p03l11959A62870o4484h2740J6368F1080j4685M3664h4410E6532
$$ 91402 -47588 -48291 -360250 162870 98386 -82740 -66372 61080 46395 90059 -84410 56532
10496b979E8409j1301c95806E9922a81446B64966E1056a57729E3567K74733a89387
$$ -2979 58409 47108 -395806 59922 -181446 264966 51056 -157729 53567 328300 -189387
10484B67046J49679A83802L35802B28380k4713a12423g108j38536B356b08639
$$ 267046 416725 183802 519604 228380 203667 -112423 -7108 -145644 2356 -208639
10473a91102e6336j85106B64090f4764j95762i3124j39734B72363A21665C7555
$$ -191102 -56336 -241442 264090 -64764 -260526 -93124 -232858 272363 121665 37555
10462C74651a30229C2291J96624n5238g3652k51146J9749a24597j88081H8037
$$ 374651 -130229 32291 228915 173677 -73652 -324798 -305049 -124597 -312678 88037
10451a78888j26811a1114k46141A51748E6966f884I0130a63760j12879M5574F7793
$$ -178888 -305699 -11114 -257255 151748 56966 -6884 90130 -163760 -276639 -231065 67793
10439i1939j03099j20707J41807o311B15748a08902J7804F9385a76133A11768
$$ -91939 -195038 -315745 -173938 -180249 215748 -108902 -91098 69385 -176133 111768
10428b6563j37894m2111E9096K6907K1435l1927a26152k46139O4357P4755G518
$$ -26563 -164457 -206568 59096 86003 107438 75511 -126152 -372291 -307934 -233179 7518
10416c72414J26433D6249b4858j43000L9541L8141B51460A1433c5030A25182l0454
$$ -372414 -245981 46249 -24858 -167858 -128317 -90176 251460 11433 -35030 125182 94728
10405I4728a2436A05808c7546B23950a17536C20861c93750A24360l0381j045M7337
$$ 94728 -12436 105808 -37546 223950 -117536 320861 -393750 124360 93979 92934 140271
10394A40271g1953B7345R48K35955l665n7712p870b3290C75457p2778i8851A48730
$$ 140271 -71953 27345 28293 264248 260583 202871 195001 -23290 375457 302679 -98851 148730
10381A3866K24517H7359m2760N34992k38794r3226o4748e78D40609A1220K38549
$$ 13866 238383 87359 44599 579591 340797 247571 182823 -578 440609 11220 249769
10370B49769K92695A65124R2986J97996B13193K03059j42911h8314E02428B49612
$$ 249769 542464 165124 258110 456106 213193 416252 273341 -88314 502428 249612
10359a04856A32886C9492K85181G1132K81950K32290k37845K98173k64639K4856
$$ -104856 132886 39492 324673 71132 353082 585372 347527 645700 381061 405917
10349D05917A99727K488K87115k32793K08087B06791k932I9693M13228B33151
$$ 405917 199727 202215 489330 256537 464624 206791 203859 99693 512921 233151
10338A14935K49333G0779J5758d0897A44627J06320J31764j71412r5645b15614
$$ 114935 364268 70779 86537 -40897 144627 250947 382711 211299 115654 -215614
10327I6937A2518K94108h5339F4416M70750j35374j21631q4369a12711B83984
$$ 96937 12518 306626 -85339 64416 535166 399792 278161 193792 -112711 283984
10316I2209K48634A48363e2631j5761j12776C0995a0035r8695M54M8569A71903
$$ 92209 340843 148363 -52631 -68392 -181168 30995 -10035 -108730 -108276 -59707 171903
10304a14530L9798A40126k6383j2281b1701G2650a99328B19353A02102m2346N6802
$$ -114530 -74732 140126 113743 101462 -21701 72650 -199328 219353 102102 59756 116558
10293A16558d5299A00609k3622B6870i9630o9017k05061a28251a0608I3016i3643
$$ 116558 -45299 100609 76987 26870 -99630 -168647 -373708 -128251 -10608 93016 -93643
10281F7456a32064A67800G9137J84066a75934A28269g910D2831b36005G2354A5398
$$ 67456 -132064 167800 79137 263203 -175934 128269 -7910 42831 -236005 72354 15398
10269B6640K41997g9378k7439K7923j1813A02935J89318L15017B75084J5051A41090
$$ 26640 268637 -79378 -106817 -78894 -90707 102935 292253 607270 275084 290135 141090
10257A08314J53101i3433A03326a47707D76910a45988H2922J0328g417k53028
$$ 108314 261415 -93433 103326 -147707 476910 -145988 82922 93250 -7417 -260445
10247b60445j28138I089J65963e00001J89274a52196A21010c4954j97002A71578
$$ -260445 -388583 9089 175052 -500001 -310727 -152196 121010 -34954 -231956 171578
10236b14954C79190p7286l8297D6093J00441f0498k26K6819p3542j70184A50537
$$ -214954 379190 301904 263607 46093 146534 -60498 -60724 -33905 -107447 -277631 150537
10224b59494B9830a33137O3776G8439b57500C5834a07328A4503c5340B23729f4505
$$ -259494 29830 -133137 -69361 78439 -257500 35834 -107328 14503 -35340 223729 -64505
10212a61933j57299a05160A88450a58219d9972k70354a22433j0593A20917l1366
$$ -161933 -319232 -105160 188450 -158219 -49972 -320326 -122433 -133026 120917 89551
10202H9551b52882O1729p9432A64396A8522c35322a29413A51948o2222e2218b835
$$ 89551 -252882 -191153 -270585 164396 18522 -335322 -129413 151948 89726 -52218 -2835
10190d4604j23893P018j90693h792C1471c08354K7525e3846I5815q537c70184
$$ -44604 -168497 -161479 -352172 -8792 31471 -308354 -280829 -53846 95815 87278 -370184
10178d9620A75102a28561k07678J10880A26477Q5129a9251C7547a9706j27647
$$ -49620 175102 -128561 -336239 -225359 126477 211606 -19251 37547 -19706 -147353
10168a47353j09482R2893H1020f1453j31031P3698p5491g0068l9035A92849c9411
$$ -147353 -256835 -163942 81020 -61453 -192484 -118786 -194277 -70068 -109103 192849 -39411
10156a91290A17314Q5887A9583p822b09541M4429l0858A7251a67212j5286F6423
$$ -191290 117314 203201 19583 11761 -209541 -165112 -195970 17251 -167212 -182498 66423
10144H7293m2880a10350J5143j19706a4648j81472k2953b9732n3084D9094B0139
$$ 87293 44413 -110350 -95207 -214913 -14648 -196120 -219073 -29732 -82816 49094 20139
10132B22005A5403d89531K13869J34883N2408K9656E9629k8856d8176A98687b15916
$$ 222005 15403 -489531 -275662 -140779 -88371 -58715 59629 30773 -48176 198687 -215916
10120C06399b67551A57711n3151c43548M4754L6733E1963b54527A03672a26400
$$ 306399 -267551 157711 104560 -343548 -298794 -262061 51963 -254527 103672 -126400
10109a00096M6271j15172b4039j23127N7491A67417B8645M427K2196K80087d33333
$$ -100096 -53825 -168997 -24039 -147166 -89675 167417 28645 33072 55268 335355 -433333
10097F3270b11372E9196Q6420d20559b5156l75455L3867G0259M9028N1920a68945
$$ 63270 -211372 59196 145616 -420559 -25156 -400611 -366744 70259 119287 171207 -168945
10085a03168A88788l7445f2352A83563a11144n40m5826k2621Q0571C71431g8501
$$ -103168 188788 151343 -62352 183563 -111144 -111684 -157510 -180131 -99560 371431 -78501
10073A11091a88178M3413n7491O3959E11075B34747n6076B2872a19944E6931a74010
$$ 111091 -188178 -144765 -202256 -138297 511075 234747 178671 22872 -119944 56931 -174010
10061F1567B3671a15587I8978b164j41248p3413A34538j1601h404p4849I8910
$$ 61567 23671 -115587 98978 -2164 -143412 -216825 134538 122937 -8404 -83253 98910
10049D4062L27079c53552D6088a72845O860A18181b38517F0138e62642b37434
$$ 44062 371141 -353552 46088 -172845 -165985 118181 -238517 60138 -562642 -237434
10038A40243a56461k12926a11048m9352b7756n6688A24847a45688D1309J98764
$$ 140243 -156461 -369387 -111048 -160400 -27756 -84444 124847 -145688 41309 240073
10028B40073F1441a12123A33533a46433B4069K18118b16277A045f9326A62175
$$ 240073 61441 -112123 133533 -146433 24069 242187 -216277 1045 -69326 162175
10017g0136j46675A13976e4893A33847R3285l3233F5303a32987q4809j2992P4237
$$ -70136 -216811 113976 -54893 133847 227132 193899 65303 -132987 -217796 -230788 -156551
10006a56551k9204j13225e4185j0793B9278b00472B01557q9281a67780F0130k2650
$$ -156551 -185755 -298980 -54185 -64978 29278 -200472 201557 112276 -167780 60130 37480
9995C7480a74262A20727a8306k90573A30522k221a14065M7515o3811j1935l11179
$$ 37480 -174262 120727 -18306 -308879 130522 128301 -114065 -66550 -130361 -142296 -453475
9984d53475a2503A77273p0404c9856j00158j62873A67083G5619b97927J14496
$$ -453475 -12503 177273 106869 -39856 -140014 -302887 167083 75619 -297927 -183431
9974a83431q2452C03062A14151a5373A62212a92211j17750B9263h218A25253b95121
$$ -183431 -265883 303062 114151 -15373 162212 -192211 -309961 29263 -8218 125253 -295121
9962H9538K3512a55117A85933m0715g9528j62058R8415J63D4826e7554b6341B04794
$$ 89538 113050 -155117 185933 145218 -79528 -241586 -143171 -143008 44826 -57554 -26341 204794
9949A10923R764c32643a19496A11286M2849a56744l22804a65513D9976b19345
$$ 110923 120687 -332643 -119496 111286 154135 -156744 -479548 -165513 49976 -219345
9938A11987R2519I1073b46579G2302b57687J10851B86766b57304J22444K1679
$$ 111987 204506 91073 -246579 72302 -257687 -146836 286766 -257304 -134860 -113181
9928a13181A13981a12280I8882a21326e7451r6087b1783p3652A22936c92102A44996
$$ -113181 113981 -112280 98882 -121326 -57451 -153538 -21783 -95435 122936 -392102 144996
9916c48576a67633p8544B3638b82658o1541P1293N7365b0994j17311j00516f2140
$$ -348576 -167633 -246177 23638 -282658 -344199 -272906 -215541 -20994 -138305 -238821 -62140
9904I9408g7919o1528B01291a1396B13500b71121J2541A12582K91401c692G014
$$ 99408 -77919 -139447 201291 -11396 213500 -271121 -258580 112582 403983 -3692 7014
9892c8018p1393C8558b0694m9607J7947A75700b28921N5898b7128k33229J05563
$$ -38018 -109411 38558 -20694 -70301 -52354 175700 -228921 -173023 -27128 -260357 -154794
9881a54794b742k757j51206b149B59671D1274f8643m8520j07190g6208j6104c4243
$$ -154794 -2742 -5499 -156705 -2149 259671 41274 -68643 -117163 -224353 -76208 -92312 -34243
9868b70409J18520C40K10801p2696K6109c16005C55768h0620a0821H042J0802
$$ -270409 -151889 340 211141 138445 164554 -316005 355768 -80620 -10821 8042 18844
9857A8844b56677O1845O0075B32908k952a89304A16911a32515e4504K5888n9075
$$ 18844 -256677 -194832 -134757 232908 229956 -189304 116911 -132515 -54504 -28616 -87691
9846h7691j12928A6358K4854b07623Q4403k21562I7727e0105p9800k1246o4902
$$ -87691 -200619 16358 41212 -207623 -123220 -344782 97727 -50105 -129905 -151151 -216053
9835b16053e6702B2881a27766O114B72634e5296I0578O8122a39260B15712d6495
$$ -216053 -56702 22881 -127766 -121652 272634 -55296 90578 158700 -139260 215712 -46495
9823b83550k9392J23032D6485b0434A80716e3379l90692A00967f4767F6194o272
$$ -283550 -312942 -189910 46485 -20434 180716 -53379 -444071 100967 -64767 66194 59922
9812E9922i6795a3550n7680j164C9168a3060m46569B30824f30134G5379c24326
$$ 59922 -96795 -13550 -71230 -72394 39168 -13060 -459629 230824 -630134 75379 -324326
9800a19743G8995C2220b831I2611c44270A4169O952b74684R0382j81931b5168
$$ -119743 78995 32220 -2831 92611 -344270 14169 21121 -274684 -184302 -366233 -25168
9788a07481A80010a83355B52533c11506a23332n5815G6741b96788f7640j0461
$$ -107481 180010 -183355 252533 -311506 -123332 -179147 76741 -296788 -67640 -78101
9778g8101r0559b8999C8190M5744f5179j75713N011R1392A19619a18495m1436
$$ -78101 -168660 -28999 38190 83934 -65179 -240892 -235881 -144489 119619 -118495 -159931
9767a59931P8652c5669A50307b59768A89376i7849j59571E5925b70377f2121A41806
$$ -159931 -81279 -35669 150307 -259768 189376 -97849 -257420 55925 -270377 -62121 141806
9755I3966c64167a72758A95744h3444O746k87548A63492l1641h1896j40114i6915
$$ 93966 -364167 -172758 195744 -83444 -76698 -364246 163492 131851 -81896 -222010 -96915
9743A52396a36420j15736f5148j356j23523L1374o5899g7076k1701j45529j09665
$$ 152396 -136420 -252156 -65148 -66504 -190027 -158653 -224552 -77076 -98777 -244306 -353971
9732c53971J67613C1024P3222i6738j34202Q2436A84163a31754L7855m611q0714
$$ -353971 -186358 31024 104246 -96738 -230940 -148504 184163 -131754 -93899 -98510 -179224
9721a79224C89494c3056A70492c85667J85358c3499A07815a94998A732b61588
$$ -179224 389494 -33056 170492 -385667 -200309 -33499 107815 -194998 1732 -261588
9710a7314k0447H6775b03998c0715A65731c0184j86106c2026R359r337A19a30007
$$ -17314 -37761 86775 -203998 -30715 165731 -30184 -216290 -32026 -22667 -32004 119 -130007
9697a89972R1005E8195h9275F0667a72524n0608E9235b71413b9484k02091j60342
$$ -189972 -98967 58195 -89275 60667 -172524 -223132 59235 -271413 -29484 -231575 -391917
9686c91917i4176k8112o3434g2711j48916B8761a59836j22965F3083a47118j3143
$$ -391917 -94176 -122288 -185722 -72711 -221627 28761 -159836 -282801 63083 -147118 -160261
9675a60261e550A56258B8317g1593I571b47663R9837a290k20646a25l53908B49144
$$ -160261 -5550 156258 28317 -71593 9571 -247663 -147826 -1290 -221936 -125 -354033 249144
9662A84591c4658B3691K9245d00718J08193A1913a32295F1300a26580L9517a7344
$$ 184591 -34658 23691 52936 -400718 -292525 11913 -132295 61300 -126580 -87063 -17344
9650A00129a11348A63582c2265J6097n9696J8947j26922I4552e1119B80757f4447
$$ 100129 -111348 163582 -32265 -16168 -75864 -56917 -183839 94552 -51119 280757 -64447
9638b16258g6214q6326f2376H6827a29639c2550m16034f1553j1249A03910J65097
$$ -216258 -76214 -162540 -62376 86827 -129639 -32550 -448584 -61553 -72802 103910 269007
9627B69007e4236H8017a2908C04094a98908D2937M702e9532k47119J14348j26398
$$ 269007 -54236 88017 -12908 304094 -198908 42937 47639 -59532 -306651 -192303 -318701
9616c18701N7160i5925d5030a942l5776k30443k42967H2553i0063b4912B61849
$$ -318701 -261541 -95925 -45030 -1942 -37718 -268161 -511128 82553 -90063 -24912 261849
9604A04870J30026P80f7053g960A45421J19964a5840A30741D2882b66979A72145
$$ 104870 234896 235676 -67053 -7960 145421 265385 -15840 130741 42882 -266979 172145
9592I6193b17618k3680A73508k1023c32462I6619l6529a5325B13388b34582B48687
$$ 96193 -217618 -241298 173508 152485 -332462 96619 60090 -15325 213388 -234582 248687
9580A19257e6667j5795A68890P2975c54579F6248h2787j78755g9754b7418C3045
$$ 119257 -56667 -72462 168890 241865 -354579 66248 -82787 -261542 -79754 -27418 33045
9568g5622E4000a15977e3465a0906r962A80959i7955m2803A23240g0930k95262
$$ -75622 54000 -115977 -53465 -10906 -20868 180959 -97955 -140758 123240 -70930 -366192
9557c66192i8245k06149B05536j5200f1133k18907i0525m01528B10300G7447K38605
$$ -366192 -98245 -304394 205536 190336 -61133 -280040 -90525 -492053 210300 77447 316052
9546C16052A00727c4000C60541b774j76534d9674k82923a37o7413A5076b17819
$$ 316052 100727 -34000 360541 -2774 -179308 -49674 -332597 -137 -67550 15076 -217819
9534H0459a82542H8515b40656H1026b15222b9597D4J03332D2142g5301K3594j80489
$$ 80459 -182542 88515 -240656 81026 -215222 -29597 44 103376 42142 -75301 -51707 -232196
9522b32196c6332j5766A19026i123k18491a7094r4530b2324E0015i001n5863D8849
$$ -232196 -36332 -52098 119026 -9123 -227614 -17094 -111624 -22324 50015 -9001 -64864 48849
9509a04533k52524J18698i5852p6664A7256K46220c4669k46432g0571A94327b4806
$$ -104533 -357057 -238359 -95852 -172516 17256 263476 -34669 -281101 -70571 194327 -24806
9497g3285b2070A95257i9182l42238i8315C87790f946A88644n1302a41572G7057
$$ -73285 -22070 195257 -99182 -441420 -98315 387790 -6946 188644 137342 -141572 77057
9485E9618L998a80595L5190d6802p5119m3768a424F4675g4779a5563j4093j75498
$$ 59618 63616 -180595 -145405 -46802 -121921 -165689 -1424 64675 -74779 -15563 -29656 -205154
9473b05154c7362j03852k88207b02570O9498A401b43850D0463f6520k54903a47992
$$ -205154 -37362 -141214 -429421 -202570 -133072 1401 -243850 40463 -66520 -321423 -147992
9461E1922b61132i2283b0232n9948j80387n5079J38310C5176b06743e5713j29812
$$ 51922 -261132 -92283 -20232 -80180 -260567 -315646 -177336 35176 -206743 -55713 -185525
9450a85525k6415h0884A97321f5325j2601q5839B1370b08339H4426b44022Q7036
$$ -185525 -211940 -80884 197321 -65325 -77926 -163765 21370 -208339 84426 -244022 -156986
9439a56986d9769l77472C100O9236a07348a4782A36988a88108A30122b30435j06902
$$ -156986 -49769 -427241 3100 72336 -107348 -14782 136988 -188108 130122 -230435 -337337
9428c37337J33029N0690K0551B76088a19448M0481A22961m043a56439j73599J45361
$$ -337337 -204308 -153618 -133067 276088 -119448 -78967 122961 118918 -156439 -330038 -184677
9417a84677B07263f7754C4597c32717G212a2893l2147B73762a5627j76130k7588
$$ -184677 207263 -67754 34597 -332717 7212 -12893 -45040 273762 -15627 -191757 -219345
9406b19345c9418r5209A77098h9077j09594h9592k0479p8405H4461c5702B96148
$$ -219345 -39418 -134627 177098 -89077 -198671 -89592 -110071 -188476 84461 -35702 296148
9394a59030f9811H3844L241l857a44382E6291K68722E8073b6335G2987a4119k20578
$$ -159030 -69811 83844 87085 83228 -144382 56291 325013 58073 -26335 72987 -14119 -234697
9382b34697A797J14708J3915Q3926i626j62622B46289L02235a96549a774j55139
$$ -234697 1797 116505 130420 214346 -9626 -172248 246289 548524 -196549 -1774 -156913
9371a56913m8960P9840k0409C0932e3657r7713l7911A49613F8269d6821k35311
$$ -156913 -205873 -126033 -146442 30932 -53657 -151370 -189281 149613 68269 -46821 -282132
9360b82132h6044E1713d2624D1237e2895d996B88440a14558j10297K8751A70667
$$ -282132 -86044 51713 -42624 41237 -52895 -4996 288440 -114558 -224855 -196104 170667
9348a62472M0914j21695a15171B34913D2329a38816j5290B78776j20240K9652
$$ -162472 -121558 -243253 -115171 234913 42329 -138816 -154106 278776 158536 188188
9338A88188H740a38246q9129b2267A96136l3575B4835J63912c41344c6188A40003
$$ 188188 8740 -138246 -227375 -22267 196136 162561 24835 188747 -341344 -36188 140003
9326A23839c838B39172D0072a59022K4321l45903a65667C7447b48702p3623P5718
$$ 123839 -3838 239172 40072 -159022 -134701 -480604 -165667 37447 -248702 -322325 -246607
9315b46607Q2492a5913l14158J52493M177g3248A37707b4691k53922c4777n0522
$$ -246607 -164115 -15913 -330071 -177578 -173401 -73248 137707 -24691 -278613 -34777 -85299
9304h5299A99313C4073a80005A33373E2409L1509D687L16940j55486b48258d1610
$$ -85299 199313 34073 -180005 133373 52409 83918 4687 321627 166141 -248258 -41610
9292B05566D1744J4110a42547o6125i3030G2491j1606i8647D8646a15918A51056
$$ 205566 41744 55854 -142547 -208672 -93030 72491 60885 -98647 48646 -115918 151056
9280A2526b35437I8801c4833j17700D5691J11928F706b54980A91188c48541A53330
$$ 12526 -235437 98801 -34833 -152533 45691 157619 6706 -254980 191188 -348541 153330
9268F7192g2672k04158D8102L1726a93656A11293J51708b1143A8956a20042A48923
$$ 67192 -72672 -276830 48102 79828 -193656 111293 263001 -21143 18956 -120042 148923
9256a1193n1481j10414n8262O6559B071K2232c5760n8889G475a15791C40162b64758
$$ -11193 -62674 -173088 -231350 -164791 2071 24303 -35760 -94649 7475 -115791 340162 -264758
9243f2417k77921b690k85973A28412C9420i3261D271b19652f5934F947J20625
$$ -62417 -340338 -2690 -288663 128412 39420 -93261 4271 -219652 -65934 6947 127572
9232A27572c2886q2330B51661d20263a47838I3315a1357E7290K881B6268c31792
$$ 127572 -32886 -115216 251661 -420263 -147838 93315 -11357 57290 60171 26268 -331792
9220G9884A0587L068J41688h822l07316E0162a06278L4531B03101c9145j99849
$$ 79884 10587 13655 155343 -8822 -316138 50162 -106278 -71747 203101 -39145 -238994
9209b38994n8700J44154B51714a63345j97647b6415B97761b6406j89079A14438
$$ -238994 -297694 -153540 251714 -163345 -360992 -26415 297761 -26406 -215485 114438
9198a8818A38441B4211R516J36803b36048j66856J50756c5111B5618a83708a2286
$$ -18818 138441 24211 33727 170530 -236048 -402904 -252148 -35111 25618 -183708 -12286
9186B6963d1693o6961I0953b04958j38890I1013e1752F6518g412j5605k40613
$$ 26963 -41693 -108654 90953 -204958 -343848 91013 -51752 66518 -7412 -23017 -263630
9175b63630A27033b64427B27249i8942n3800N3334l5946j42748a31924D9559c49688
$$ -263630 127033 -264427 227249 -98942 -152742 -99408 -135354 -278102 -131924 49559 -349688
9163f9947l11242b5945q1265A20802K91166b25171j62605F6763a12449L7448B954
$$ -69947 -381189 -25945 -107210 120802 411968 -225171 -387776 66763 -112449 -75001 2954
9151b3271j33347a8309F3490J5835P1892i2786B51878b85444P226c9823n4430
$$ -23271 -156618 -18309 63490 79325 151217 -92786 251878 -285444 -278218 -39823 -94253
9140i4253I4167L420e4074k6712k530a1696A00559b12047c4615B40685C2900b87814
$$ -94253 94167 97587 -54074 -80786 -83316 -11696 100559 -212047 -34615 240685 32900 -287814
9127b4610p3099L5990b3152j89089i9702A71967d08790A40931F7604c0801j48935
$$ -24610 -97709 -61719 -23152 -212241 -99702 171967 -408790 140931 67604 -30801 -179736
9116a79736K1146n3487M560k0993g6233j70064a14863a4934p2784c4729k04033
$$ -179736 -158590 -212077 -207517 -228510 -76233 -246297 -114863 -14934 -87718 -34729 -238762
9105b38762B76733c183k296m85419a34483A49803d51949A76501P4068b36228A51192
$$ -238762 276733 -3183 -5479 -490898 -134483 149803 -451949 176501 250569 -236228 151192
9093e5299A24642B7444b97517A6966b13688O7810j04048A10581R9336a16507o1764
$$ -55299 124642 27444 -297517 16966 -213688 -145878 -249926 110581 209917 -116507 -178271
9082a78271M1100j08041C5519h5521E1089k910N0577A2689b1337k7951A12318
$$ -178271 -137171 -245212 35519 -85521 51089 48179 98756 12689 -21337 -49288 112318
9070G9737c31237I3176R2011a26089B5449c94121a44006A55670d16011C4051a33054
$$ 79737 -331237 93176 185187 -126089 25449 -394121 -144006 155670 -416011 34051 -133054
9058a54104c0656A49494m3310a38246A17920d3447A52557R5957I9443d2055H2048
$$ -154104 -30656 149494 106184 -138246 117920 -43447 152557 248514 99443 -42055 82048
9046a26536B70015j25699c6975C53138l6000a03927j42243J1598o9283Q6439F1482
$$ -126536 270015 144316 -36975 353138 317138 -103927 -246170 -234572 -303855 -217416 61482
9034b42239J06582Q687C8423d445l30583a14154k1070L6212l02159B3517b26894
$$ -242239 -135657 -126970 38423 -4445 -335028 -114154 -135224 -99012 -401171 23517 -226894
9022g2483j69024C06838A34591a76964L6536b2140m3901A63500a34493j37386
$$ -72483 -241507 306838 134591 -176964 -140428 -22140 -66041 163500 -134493 -271879
9012b71879A39211a10291n99957A85556c7308G3292a72890r5713E538O1260a19421
$$ -271879 139211 -110291 -710248 185556 -37308 73292 -172890 -268603 5538 66798 -119421
9000A54191b05079E8131a67056e7656A00887a00817m17534A09321O4797a93094
$$ 154191 -205079 58131 -167056 -57656 100887 -100817 -518351 109321 174118 -193094
8989F7313d5049o6904B32300L5372j25292N0133b19504m416A11585h0843H1006
$$ 67313 -45049 -111953 232300 267672 142380 192513 -219504 -223920 111585 -80843 81006
8977b5196j89194j6442g2228q7438c6945j84868K8592K8561C38833j14981h9842
$$ -25196 -214390 -230832 -72228 -159666 -36945 -221813 -193221 -164660 338833 223852 -89842
8965h7518Q500j40099A4656R2283b3955A4154a2777d516G1587c35783J29590A6397
$$ -87518 -79018 -219117 14656 106939 -23955 14154 -12777 -4516 71587 -335783 -206193 16397
8952c69116a64338A79213J1161g2156I2715J13741a26138K9788E56308k72089
$$ -369116 -164338 179213 190374 -72156 92715 206456 -126138 -96350 556308 284219
8942B84219i4203n8257j19252F5070c05839d9582E4381f6940A48468i5695B6794
$$ 284219 -94203 -152460 -271712 65070 -305839 -49582 54381 -66940 148468 -95695 26794
8930e4967o7273F0982J3909B0506J35088J58116K63581O54259R89158F19279I1422
$$ -54967 -122240 60982 74891 20506 155594 313710 577291 1231550 2220708 619279 91422
8918A07638Q2236e7444D3290J25474a80900h0473j58266A35955c6166E03592i868
$$ 107638 189874 -57444 43290 168764 -180900 -80473 -238739 135955 -36166 503592 -9868
8906d3111j93091A97944K4417p4772b15427A64106a99024I8358c25926C1755a03992
$$ -43111 -236202 197944 222361 147589 -215427 164106 -199024 98358 -325926 31755 -103992
8894D1712a8856F7984d6636m9972j44350A77290b54721n0931O9505J05802d3453
$$ 41712 -18856 67984 -46636 -96608 -240958 177290 -254721 -305652 -236147 -130345 -43453
8882b01303k02467l9923i7433C0951i3991b6018l3709o4208d7669A19143b38534
$$ -201303 -403770 -443693 -97433 30951 -93991 -26018 -59727 -123935 -47669 119143 -238534
8870c63275k25587d0363C5837A0000a14329B40240a87800j82180P2383D0701b17035
$$ -363275 -588862 -40363 35837 10000 -114329 240240 -187800 -369980 -297597 40701 -217035
8858a50811A45071m5170A4672J91935a3441j77840A26003d649E7592a28559A88842
$$ -150811 145071 99901 14672 206607 -13441 -191281 126003 -4649 57592 -128559 188842
8846A7937Q623a17465q9067A68541L4423B6118J6756a06985I877J635E659g8007
$$ 17937 26560 -117465 -206532 168541 202964 26118 42874 -106985 9877 11512 5659 -78007
$$ [...]
##END NTUPLES=NMR SPECTRUM
##END=
