##TITLE=NES1089_ptc170_9885004_iPXpzVtu0R
##JCAMPDX= 6.0         $$ Bruker NMR JCAMP-DX V2.0
##DATA TYPE= NMR SPECTRUM
##DATA CLASS= NTUPLES
##ORIGIN= BRUKER
##OWNER= Administrator
$$ 1.72 TOPSPIN		Version 2.1
$$ 2016-08-27 22:25:34.461 -0500  Administrator@X
$$ Compression mode = diff/dup
##.OBSERVE FREQUENCY= 400.02188249412
##.OBSERVE NUCLEUS= ^1H
##.ACQUISITION MODE= SIMULTANEOUS (DQD)
##.ACQUISITION SCHEME= undefined
##.AVERAGES= 64
##.DIGITISER RES= 22
##SPECTROMETER/DATA SYSTEM= spect
##.PULSE SEQUENCE= noesygpps1d.comp
##.SOLVENT NAME= COFFEE_meoh
##.SHIFT REFERENCE= INTERNAL, COFFEE_meoh, 1, 14.96037
##AUDIT TRAIL= $$ (NUMBER, WHEN, WHO, WHERE, PROCESS, VERSION, WHAT)
$$ ##TITLE= Audit trail, TOPSPIN		Version 2.1
$$ ##JCAMPDX= 5.01
$$ ##ORIGIN= Bruker BioSpin GmbH
$$ ##OWNER= Administrator
$$ $$ E:\/data/COFFEE/nmr/NES1089_ptc170_9885004_iPXpzVtu0R/12/pdata/1/auditp.txt
$$ ##AUDIT TRAIL=  $$ (NUMBER, WHEN, WHO, WHERE, PROCESS, VERSION, WHAT)
(   1,<2016-08-27 22:25:29.273 -0500>,<Administrator>,<X>,<go>,<TOPSPIN 2.1>,
      <created by zg
	started at 2016-08-27 22:13:59.195 -0500,
	POWCHK enabled, PULCHK disabled,
       configuration hash MD5:
       21 0F 79 D6 B3 7B B4 F6 88 20 88 DB 03 48 BD 9F
       data hash MD5: 64K
       11 48 8B FB 03 C9 30 DF EB 30 DE 93 5E 15 16 AA>)
(   2,<2016-08-27 22:25:32.398 -0500>,<Administrator>,<X>,<proc1d>,<TOPSPIN 2.1>,
      <Start of raw data processing
       efp LB = 0.3 FT_mod = 6 PKNL = 1 PHC0 = 0 PHC1 = 0 SI = 128K 
       data hash MD5: 128K
       71 B8 51 AF 63 7D FB 63 50 63 29 61 E9 23 9E DF>)
(   3,<2016-08-27 22:25:33.289 -0500>,<Administrator>,<X>,<proc1d>,<TOPSPIN 2.1>,
      <pk PHC0 = -83.10059 PHC1 = 0 
       data hash MD5: 128K
       C7 F1 50 93 52 08 A3 83 44 1E 42 84 57 B1 68 61>)
(   4,<2016-08-27 22:25:33.664 -0500>,<Administrator>,<X>,<proc1d>,<TOPSPIN 2.1>,
      <abs ABSG = 1 
       data hash MD5: 128K
       70 3D 90 4D 72 2A 66 84 91 CE 79 78 AA CD 96 16>)
(   5,<2016-08-27 22:25:33.773 -0500>,<Administrator>,<X>,<proc1d>,<TOPSPIN 2.1>,
      <abs ABSG = 2 
       data hash MD5: 128K
       F0 D6 81 1E 43 48 6D E6 32 94 16 53 14 3B ED 86>)
(   6,<2016-08-27 22:25:33.867 -0500>,<Administrator>,<X>,<proc1d>,<TOPSPIN 2.1>,
      <abs ABSG = 3 
       data hash MD5: 128K
       69 3F 04 5D 70 AE B3 B5 08 61 FA 4A 79 AA 20 CE>)
(   7,<2016-08-27 22:25:33.945 -0500>,<Administrator>,<X>,<proc1d>,<TOPSPIN 2.1>,
      <abs ABSG = 4 
       data hash MD5: 128K
       29 74 AA E7 87 9D 52 89 61 A0 AC B7 C4 DA 69 0B>)
(   8,<2016-08-27 22:25:34.070 -0500>,<Administrator>,<X>,<proc1d>,<TOPSPIN 2.1>,
      <abs ABSG = 5 
       data hash MD5: 128K
       7D C7 EE 2C 02 60 CA DB B1 76 BA AA E7 F8 DA 90>)
$$ ##END=
$$ 
$$ $$ hash MD5
$$ $$ AC D3 7D 95 BE 3A 90 1B 6B 5D 3D 12 4B 2B 80 11
##$RELAX= 
##$RELAX= 
##$RELAX= 
##$RELAX= 
##$RELAX= 
##$RELAX= 
##$RELAX= 
##$RELAX= 
$$ Bruker specific parameters
$$ --------------------------
##$DU= <E:\>
##$EXPNO= 12
$$ [...]
##$TP07= 0
##$TPNAME0= <>
##$TPNAME1= <>
##$TPNAME2= <>
##$TPNAME3= <>
##$TPNAME4= <>
##$TPNAME5= <>
##$TPNAME6= <>
##$TPNAME7= <>
##$TPOAL= (0..7)
0.5 0.5 0.5 0.5 0.5 0.5 0.5 0.5
##$TPOFFS= (0..7)
0 0 0 0 0 0 0 0
##$TUNHIN= 0
##$TUNHOUT= 0
##$TUNXOUT= 0
##$USERA1= <user>
##$USERA2= <user>
##$USERA3= <user>
##$USERA4= <user>
##$USERA5= <user>
##$V9= 5
##$VALIST= <valist>
##$VCLIST= <CCCCCCCCCCCCCCC>
##$VD= 0
##$VDLIST= <DDDDDDDDDDDDDDD>
##$VPLIST= <PPPPPPPPPPPPPPP>
##$VTLIST= <TTTTTTTTTTTTTTT>
##$WBST= 1024
##$WBSW= 4
##$XGAIN= (0..3)
0 0 0 0
##$XL= 0
##$YL= 0
##$YMAX_a= 5586361
##$YMIN_a= -10450318
##$ZGOPTNS= <>
##$ZL1= 120
##$ZL2= 120
##$ZL3= 120
##$ZL4= 120
##$ABSF1= 14.96037
##$ABSF2= -5.597812
##$ABSG= 5
##$ABSL= 3
##$ALPHA= 0
##$AQORDER= 0
##$ASSFAC= 0
##$ASSFACI= 0
##$ASSFACX= 0
##$ASSWID= 0
##$AUNMP= <proc_prof1d_extract.lims>
##$AXLEFT= 0
##$AXNAME= <>
##$AXNUC= <1H>
##$AXRIGHT= 0
##$AXTYPE= 0
##$AXUNIT= <>
##$AZFE= 0.1
##$AZFW= 0.1
##$BCFW= 0
##$BC_mod= 0
##$BYTORDP= 0
##$COROFFS= 0
##$CY= 15
##$DATMOD= 1
##$DC= 0
##$DFILT= <>
##$DTYPP= 0
##$F1P= 0
##$F2P= 0
##$FCOR= 0.5
##$FTSIZE= 131072
##$FT_mod= 6
##$GAMMA= 0
##$GB= 0
##$INTBC= 1
##$INTSCL= 1
##$ISEN= 128
##$LB= 0.3
##$LEV0= 0
##$LPBIN= 0
##$MAXI= 10000
##$MC2= 0
##$MEAN= 0
##$ME_mod= 0
##$MI= 0
##$NCOEF= 0
##$NC_proc= -2
##$NLEV= 6
##$NOISF1= 0
##$NOISF2= 0
##$NSP= 0
##$NTH_PI= 0
##$NZP= 0
##$OFFSET= 14.96037
##$PC= 1
##$PHC0= -83.10059
##$PHC1= 0
##$PH_mod= 1
##$PKNL= yes
##$PPARMOD= 0
##$PPDIAG= 0
##$PPIPTYP= 0
##$PPMPNUM= 2147483647
##$PPRESOL= 1
##$PSCAL= 4
##$PSIGN= 0
##$PYNMP= <proc.py>
##$REVERSE= no
##$SF= 400.020009890642
##$SI= 131072
##$SIGF1= 0
##$SIGF2= 0
##$SINO= 400
##$SIOLD= 131072
##$SPECTYP= <>
##$SREGLST= <1H.CDCl3>
##$SSB= 0
##$STSI= 131072
##$STSR= 0
##$SW_p= 8223.68421052631
##$SYMM= 0
##$S_DEV= 0
##$TDeff= 65536
##$TDoff= 0
##$TI= <>
##$TILT= no
##$TM1= 0
##$TM2= 0
##$TOPLEV= 0
##$USERP1= <user>
##$USERP2= <user>
##$USERP3= <user>
##$USERP4= <user>
##$USERP5= <user>
##$WDW= 1
##$XDIM= 131072
##$YMAX_p= 361046590
##$YMIN_p= -11217
##$CURPLOT= <Network HP LaserJet P1505>
##$CURPRIN= <$Network HP LaserJet P1505>
##$DFORMAT= <normdp>
##$LAYOUT= <+/1D_H.xwp>
##$LFORMAT= <normlp>
##$PFORMAT= <normpl>
##$SURQMSG= 1
$$ End of Bruker specific parameters
$$ ---------------------------------
##NTUPLES= NMR SPECTRUM
##VAR_NAME=  FREQUENCY,     SPECTRUM/REAL,   SPECTRUM/IMAG
##SYMBOL=    X,             R,               I
##VAR_TYPE=  INDEPENDENT,   DEPENDENT,       DEPENDENT
##VAR_FORM=  AFFN,          ASDF,            ASDF
##VAR_DIM=   131072,        131072,          131072
##UNITS=     HZ,            ARBITRARY UNITS, ARBITRARY UNITS
##FACTOR=    0.0627417313425164, 1,          1
##FIRST=     8223.62146879497, 1363,         -47905
##LAST=      0,             2347,            -48811
##MIN=       0,             -11217,          0
##MAX=       8223.62146879497, 361046590,    0
$$ Real data points
##PAGE= N=1
##DATA TABLE= (X++(R..R)), XYDATA
$$ [...]
64012B72237k773l275l880m661n285n214m343l172k321j968j858j673j306q02
63998B29706k53J70K12j53m66j51P85J659J915J786J911K508L194L595L753L940
63982B54111M288M795N464O300P234Q211R244J0222J0760J0511R772R461J0241
63969C60614J1740J3014J3724J4476J5862J7633J9193K0615K2577K5482K9078
63958E64008L3061L7547M2816M9036N6319O4740P4161Q4394R5638J08281J21981
63947A331982J35431J47386J57649J66671J74558J80897J85252J87270J86319
63938B853415J81521J72184J58015J39118J16173R0533O3614L6089P923k0867
63928C797718m9778p8007j04583j28341j48289j64198j76449j85166j89901j90310
$$ y = [272237, 269464, 266189, 262309, 257648, 252363, 247149, 242806, 239634, 237313, 235345, 233487, 231814, 230508, 229706, 229453, 229623, 229835, 229682, 229216, 229065, 229850, 231509, 233424, 235210, 237121, 239629, 242823, 246418, 250171, 254111, 258399, 263194, 268658, 274958, 282192, 290403, 299647, 309869, 320629, 331140, 340912, 350373, 360614, 372354, 385368, 399092, 413568, 429430, 447063, 466256, 486871, 509448, 534930, 564008, 597069, 634616, 677432, 726468, 782787, 847527, 921688, 1006082, 1101720, 1210001, 1331982, 1467413, 1614799, 1772448, 1939119, 2113677, 2294574, 2479826, 2667096, 2853415, 3034936, 3207120, 3365135, 3504253, 3620426, 3710959, 3774573, 3810662, 3818585, 3797718, 3747940, 3669933, 3565350, 3437009, 3288720, 3124522, 2948073, 2762907, 2573006, 2382696]
63918B382696j86729j79980j70904j60355j49089j37333j24720j11092r7089q3696
63908I81709p1455o0511n1118m3509l7408l2247k7876k4551k2200k0272j8496
63897E72066j7220j6672j6396j5808j4972j4317j3894j3425j2945j2785j2848
63886D10784j2487j1269r502p728o063m391k945k189k132k083j327J22J560K392
63872C52742K750L224M052M833N040M595L702K452R71k22n73k72k01r11k108l288
63856C76786m294m986m937m114l384l665m701n417n322m971m997n399n877o279
63842C08443o451o241n884n959o648p401p658p495p295p122o835o506o280o004
63828B14664n421m647m076l860l757l537l249l022k817k470j965j547j539j919
$$ y = [2382696, 2195967, 2015987, 1845083, 1684728, 1535639, 1398306, 1273586, 1162494, 1065405, 981709, 910254, 849743, 798625, 755116, 717708, 685461, 657585, 633034, 610834, 590562, 572066, 554846, 538174, 521778, 505970, 490998, 476681, 462787, 449362, 436417, 423632, 410784, 398297, 387028, 377526, 369798, 363735, 359344, 356399, 354210, 352078, 349995, 348668, 348790, 350350, 352742, 355492, 358716, 362768, 367601, 372641, 377236, 380938, 383390, 384361, 384139, 383566, 383294, 383093, 382182, 380074, 376786, 372492, 367506, 362569, 358455, 355071, 351406, 346705, 341288, 335966, 330995, 325998, 320599, 314722, 308443, 301992, 295751, 289867, 283908, 277260, 269859, 262201, 254706, 247411, 240289, 233454, 226948, 220668, 214664, 209243, 204596, 200520, 196660, 192903, 189366, 186117, 183095, 180278, 177808, 175843, 174296, 172757, 170838]
63814A70838k219j954j130j22Q18J562J748J002k98j088p61J16N77L53j78o61
63798A68603r37q93p15r43j702k170j549l69L5o28j214p86J88P08N43Q0n47j415
63780A56289k185k277j667r35n33m16m38n90p54n97QO97R61O26r8q30j181r50
63762A45130l72K5M5J04N74J056P88k20j013q37J5P99J261J513J361N59m43p15
63744A49630n2P90J219J546K117K449J915Q96M36Q25J301J277J161J630K592L311
63728A73043L313K836K435K452K892L547M156M517M594M577M661M665L962K196
63714B23846K6j266j198p50j209k622l861m099l595l053k724k425k005j515j111
63699A92439r80j194j507j464q81o6N93J052J531K133K710L044L058K839K543
$$ y = [170838, 168619, 166665, 165535, 165413, 166231, 167793, 169541, 170543, 170245, 169157, 168396, 168512, 169089, 169442, 169264, 168603, 167666, 166773, 166058, 165115, 163413, 161243, 159694, 159325, 159360, 158732, 157518, 156732, 156920, 157628, 158171, 158251, 157704, 156289, 154104, 151827, 150160, 149225, 148692, 148276, 147838, 147248, 146494, 145897, 145905, 146602, 147563, 148189, 148091, 147261, 146080, 145130, 144758, 144783, 144828, 144932, 145506, 146562, 147350, 147130, 146117, 145280, 145295, 146094, 147355, 148868, 150229, 150788, 150345, 149630, 149578, 150368, 151587, 153133, 155250, 157699, 159614, 160510, 160946, 161771, 163072, 164349, 165510, 167140, 169732, 173043, 176356, 179192, 181627, 184079, 186971, 190518, 194674, 199191, 203785, 208362, 213023, 217688, 221650, 223846, 223872, 222606, 221408, 220658, 219449, 216827, 212966, 208867, 205272, 202219, 199495, 197070, 195065, 193550, 192439, 191459, 190265, 188758, 187294, 186413, 186347, 186940, 187992, 189523, 191656, 194366, 197410, 200468, 203307, 205850]
63684B05850K275K127K273K824L473L516K591J216K82Q5K46M77R03J561K069K112
63668B33880J880J787J966K248K418K338J937J255L38r11k520m109n083n296n152
63653B26976m957m572l878l110k463j772r52l51k68m48n24n83p80p47kJ185K030
63636B04784K333K671L401M136M413M353M320M380M468M756N435O337P098P678
63622B70563Q372R398J0699J2126J3541J4773J5674J6380J7381J9107K1473K3871
63610D53358K5762K7207K8727L0544L2091L2418L1003K8053K4052J9296J3967
63599G46478Q425L203j270m802p291q634q930q737q885r881j1561j3466j5505
63586F59144j7983k0932k3719k5538k6117k5781k4943k3714k1970j9586j6710
$$ y = [205850, 208125, 210252, 212525, 215349, 218822, 222338, 224929, 226145, 226427, 226512, 226758, 227235, 228138, 229699, 231768, 233880, 235760, 237547, 239513, 241761, 244179, 246517, 248454, 249709, 250047, 249136, 246616, 242507, 237424, 232128, 226976, 222019, 217447, 213569, 210459, 207996, 206224, 205272, 204921, 204653, 204205, 203681, 203098, 202318, 201571, 201569, 202754, 204784, 207117, 209788, 213189, 217325, 221738, 226091, 230411, 234791, 239259, 244015, 249450, 255787, 262885, 270563, 278935, 288333, 299032, 311158, 324699, 339472, 355146, 371526, 388907, 408014, 429487, 453358, 479120, 506327, 535054, 565598, 597689, 630107, 661110, 689163, 713215, 732511, 746478, 754903, 758106, 756836, 752034, 744743, 736109, 727179, 718442, 709557, 699676, 688115, 674649, 659144, 641161, 620229, 596510, 570972, 544855, 519074, 494131, 470417, 448447, 428861, 412151]
63575D12151j3825j1415r443p383n028k944j734j075K9K014M291O093P262Q077
63561C87070Q727R330J0102J1202J2539J3951J5412J6875J8145J9153K0194K1641
63549E64341K3635K6237K9511L3027L5542L5773L3450K9261K3810J7267J0088
63538H61942L311k241o587r901j1711j1429r563p696p039p573q773j0658j3660
63525G58422j7775k2379k6831l0717l3504l4525l3732l2118l0837k9914k8254
63514D37836k5126k1217j7943j5920j4570j3104j1364r549p657n682m112l579
63502B88013l916m150l687l060l069l570l635k842j757j012n46m4L57L05j8%N69
63485B57938J228J522J616J925K510L065L399L596L706L593L183K674K288J908
$$ y = [412151, 398326, 386911, 377468, 370085, 365057, 362113, 360379, 359304, 359333, 361347, 365638, 371731, 378993, 387070, 395797, 405127, 415229, 426431, 438970, 452921, 468333, 485208, 503353, 522506, 542700, 564341, 587976, 614213, 643724, 676751, 712293, 748066, 781516, 810777, 834587, 851854, 861942, 865253, 863012, 856425, 846524, 834813, 823384, 813821, 806125, 799086, 791513, 782740, 772082, 758422, 740647, 718268, 691437, 660720, 627216, 592691, 558959, 526841, 496004, 466090, 437836, 412710, 391493, 373550, 357630, 343060, 329956, 318592, 309043, 301386, 295704, 291592, 288013, 284097, 279947, 276260, 273200, 270131, 266561, 262926, 260084, 258327, 257315, 256769, 256725, 257082, 257387, 257369, 257369, 257938, 259166, 260688, 262304, 264229, 266739, 269804, 273203, 276799, 280505, 284098, 287281, 289955, 292243, 294151]
63471B94151J157j34j685l059m086m831n297n369n077m635m141l487k672k054
63457B48781j963k227k308j893j064K6J289K485L210L361L338L668M465N489O481
63442B73138P344Q125R030J0301J1936J3662J5358J7262J9405K1069K1280J9870
63430D47780J7671J5614J3977J2658J1794J1737J2646J4407J6877J9985K3637
63419F18783K7663L1846L5861L9243M1461M2051M0738L7599L3014K7253K0163
63408I95675J1773L198l643p663r561j0765j1870j2622j3071j3893j5618j8276
63396H93664k1867k6364l1071l4711l6547l6951l6497l5119l2610k9452k6494
63385E45981k4013k1621j8996j6244j3694j1624j0096q745o926m389j595Q60K935
$$ y = [294151, 295308, 295174, 293489, 290430, 286344, 281513, 276216, 270847, 265770, 261135, 256994, 253507, 250835, 248781, 246818, 244591, 242283, 240390, 239326, 239352, 240641, 243126, 246336, 249697, 253035, 256703, 261168, 266657, 273138, 280482, 288607, 297637, 307938, 319874, 333536, 348894, 366156, 385561, 406630, 427910, 447780, 465451, 481065, 495042, 507700, 519494, 531231, 543877, 558284, 575161, 595146, 618783, 646446, 678292, 714153, 753396, 794857, 836908, 877646, 915245, 948259, 975512, 995675, 1007448, 1010646, 1007003, 999340, 989779, 979014, 967144, 954522, 941451, 927558, 911940, 893664, 871797, 845433, 814362, 779651, 743104, 706153, 669656, 634537, 601927, 572475, 545981, 521968, 500347, 481351, 465107, 451413, 439789, 429693, 420948, 414022, 409633, 408038, 408898, 411833]
63372D11833M893O737Q322R764J1221J2561J3749J5285J7649K0456K2893K4754
63360E80117K6480K8285L0086L2122L4696L7200L8350L7652L5707L2822K8325
63349I41842K1813J4210O876L79n204r533j2358j4076j5129j5320j4616j4121
63337H84763j5178j7816k1052k4503k8502l2619l5388l5945l4940l3348l1236
63326E74236k8317k4986k1975j9391j6856j4339j2244j0772r805r330r486j0149
63314C86586j0903j1486j1888j1905j1113r503p806o808o495o221n589m777l983
63301B78109l140k311j872j900j812j153m54n71j391j962j969k096k704l083k635
63286B49056j922j776j992j893j651j944k555k465j466n79n79j017j101p17r8
$$ y = [411833, 416726, 423463, 431785, 441549, 452770, 465331, 479080, 494365, 512014, 532470, 555363, 580117, 606597, 634882, 664968, 697090, 731786, 768986, 807336, 844988, 880695, 913517, 941842, 963655, 977865, 984741, 985120, 979916, 970383, 958025, 943949, 928820, 913500, 898884, 884763, 869585, 851769, 830717, 806214, 777712, 745093, 709705, 673760, 638820, 605472, 574236, 545919, 520933, 498958, 479567, 462711, 448372, 436128, 425356, 415551, 406221, 396735, 386586, 375683, 364197, 352309, 340404, 329291, 319788, 311982, 305174, 298679, 292458, 286869, 282092, 278109, 274969, 272658, 270786, 268886, 267074, 265921, 265467, 264896, 263505, 261543, 259574, 257478, 254774, 251691, 249056, 247134, 245358, 243366, 241473, 239822, 237878, 235323, 232858, 231392, 230813, 230234, 229217, 228116, 227399, 227301]
63271B27301P73J840K470K071R97K78M81J170J502J152O33P48J650K577K785K549
63255B50977K777L691M509M584M223M157M688N753P164Q469R060Q977R170J0405
63241C38604J2258J3740J4591J5295J6034J6436J6400J6523J7417J8940K0291
63230E16529K0743K0214J9334J8845J8847J8778J8299J7902J8258J9180J9746
63219G26675J9411J8468J7402J6199J4478J1954Q582M482j32m966r726j4123j7966
63206G90738k1297k4247k6541k7350k6118k3462k0795j8904j7228j4683j0952
63195E59161o737k994r9K258M545O874R023J0935J2868J4949J6778J7914J8549
63182F64024J9299K0244K0769K0502K0036K0178K0850K1109K0342J8924J7547
$$ y = [227301, 228074, 229914, 232384, 234455, 235452, 235730, 236211, 237381, 238883, 240035, 240668, 241416, 243066, 245643, 248428, 250977, 253754, 257445, 261954, 266538, 270761, 274918, 279606, 285359, 292523, 300992, 310052, 319029, 328199, 338604, 350862, 364602, 379193, 394488, 410522, 426958, 443358, 459881, 477298, 496238, 516529, 537272, 557486, 576820, 595665, 614512, 633290, 651589, 669491, 687749, 706929, 726675, 746086, 764554, 781956, 798155, 812633, 824587, 833169, 837651, 837519, 832553, 822827, 808704, 790738, 769441, 745194, 718653, 691303, 665185, 641723, 620928, 602024, 584796, 570113, 559161, 552424, 549430, 549331, 551589, 556134, 563008, 572031, 582966, 595834, 610783, 627561, 645475, 664024, 683323, 703567, 724336, 744838, 764874, 785052, 805902, 827011, 847353, 866277, 883824]
63171H83824J6256J4478J1830Q460M559k2n363j0968j6104k0575k4757k8798l2198
63158H00622l4328l5102l4913l4152l2973l1364k9220k6538k3660k1107j9044
63147D78221j7101j4969j2873j1210r955q690p145n480m116l457l535l793l505
63134C72392k576j646j129o94kN62N18K52N64J432K058K102K094K461K887K902
63118C84177K580K308K280K490K832L034K798K192J619J312J158J119J336J719
63104D12954J812J353O72L08M43Q57J115Q35R7l96k3Q42J143N08l15n57l58k22
63086D21068j30K13P15J044J234J638K411L463M650N712O229O139O053O594P576
63071D74609Q316Q623Q995R812J0875J1818J2644J3724J5387J7573J9833K1760
$$ y = [883824, 900080, 914558, 926388, 934848, 939407, 939385, 934022, 923054, 906950, 886375, 861618, 832820, 800622, 766294, 731192, 696279, 662127, 629154, 597790, 568570, 542032, 518372, 497265, 478221, 461120, 446151, 433278, 422068, 412113, 403423, 396278, 390798, 386682, 383225, 379690, 375897, 372392, 369816, 368170, 367041, 366347, 366345, 366907, 367425, 367677, 368241, 369673, 371731, 373833, 375927, 378388, 381275, 384177, 386757, 389065, 391345, 393835, 396667, 399701, 402499, 404691, 406310, 407622, 408780, 409899, 411235, 412954, 414766, 416119, 416791, 417099, 417542, 418399, 419514, 420349, 420446, 420050, 420027, 420869, 422012, 422520, 422205, 421648, 421290, 421068, 420938, 421151, 421866, 422910, 424144, 425782, 428193, 431656, 436306, 442018, 448247, 454386, 460439, 467033, 474609, 482925, 491548, 500543, 510355, 521230, 533048, 545692, 559416, 574803, 592376, 612209, 633969]
63059F33969K3526K5720K8482L1182L3302L5273L7853M0927M3507M4964M5596
63048A024301M5981M6313M6580M6850M7026M6698M5656M4417M3847M4265M5122
63037A527056M5578M5233M4188M2393L9281L4225K7349J9500J1256K325p771j8684
63025A811929k9296l8664m6453n2558n6778n9033n9547n8584n6172n2271m7063
63014A255510m0985l4531k8015k1482j4843q211j907L954R683J5530K1125K5834
63002A181662K9556L2758L5691L7961L9122L9305L9068L8766L8404L7879L7107
62991A587279L5942L4193L1784K8756K5027K0179J3717N644l319j2350k1285l0504
62979A715063l9994m8953n6443o2169o6310o8926o9937o9411o7511o4358o0321
$$ y = [633969, 657495, 683215, 711697, 742879, 776181, 811454, 849307, 890234, 933741, 978705, 1024301, 1070282, 1116595, 1163175, 1210025, 1257051, 1303749, 1349405, 1393822, 1437669, 1481934, 1527056, 1572634, 1617867, 1662055, 1704448, 1743729, 1777954, 1805303, 1824803, 1836059, 1838384, 1830613, 1811929, 1782633, 1743969, 1697516, 1644958, 1588180, 1529147, 1469600, 1411016, 1354844, 1302573, 1255510, 1214525, 1179994, 1151979, 1130497, 1115654, 1107443, 1105536, 1109490, 1119173, 1134703, 1155828, 1181662, 1211218, 1243976, 1279667, 1317628, 1356750, 1396055, 1435123, 1473889, 1512293, 1550172, 1587279, 1623221, 1657414, 1689198, 1717954, 1742981, 1763160, 1776877, 1782521, 1779202, 1766852, 1745567, 1715063, 1675069, 1626116, 1569673, 1507504, 1441194, 1372268, 1302331, 1232920, 1165409, 1101051, 1040730]
62968A040730n6140n2262m8266m3565l8506l4167l0984k8301k5442k2575k0251
62957F40271j8622j7431j6387j5258j3960j2827j2384j2606j2729j2120j1031
62946D84916j0182r865r825r741r505r124q683q285p862p167o107m964m136l794
62932C75676l901m276m562m382l732l011k519k216k019j996k051j879j480j324
62918C36328j719k327k637k571k310j866j240p22n65o06o10o80r78j319j506j756
62902C12916k289k790k856k702k720k602j675j01J083J238P66L65K74M22P06Q55
62886C00890N30r6l51P4O65P28J96m49p02l28N12J237J289P23P9l60p13r34p70
62867C02220l95l76p35q21m43l13q09j139n34M73R24R98J509K257K203J262O15
$$ y = [1040730, 984590, 932328, 884062, 840497, 801991, 767824, 736840, 708539, 683097, 660522, 640271, 621649, 604218, 587831, 572573, 558613, 545786, 533402, 520796, 508067, 495947, 484916, 474734, 464869, 455044, 445303, 435798, 426674, 417991, 409706, 401844, 394677, 388570, 383606, 379470, 375676, 371775, 367499, 362937, 358555, 354823, 351812, 349293, 347077, 345058, 343062, 341011, 339132, 337652, 336328, 334609, 332282, 329645, 327074, 324764, 322898, 321658, 320936, 320371, 319765, 319155, 318475, 317497, 316178, 314672, 312916, 310627, 307837, 304981, 302279, 299559, 296957, 295282, 295181, 296264, 297502, 298268, 298633, 298907, 299329, 300035, 300890, 301420, 301324, 300973, 301047, 301712, 302440, 302636, 302187, 301485, 301157, 301669, 302906, 304195, 304918, 304997, 304637, 303924, 302990, 302220, 301825, 301449, 300714, 299893, 299450, 299137, 298328, 297189, 296655, 297128, 298052, 299050, 300559, 302816, 305019, 306281, 306896]
62850C06896R56J578J641J311J098Q93M25p2l07n22r52j191q67m27m82o51o4J209
62832C10472K130K166J829J610J286O84L03N76J096J259J227J591K302K678K379
62817C33588J831J616J910K596L468M134M172L575K862K613L067M128N469O557
62803C81586P003P047P379Q258R195R711J0113J1069J2703J4598J6532J8716K1279
62790E35189K3945K6438K8910L1828L5558M0097M5063N0016N4887N9972O5290
62779I97193P0123P3642P5806P7165P7733P6637P3076O7032N8869M8802L7177
62768A733255K4706J1896j410j5327k9038m1298n1592o0177o7082p1844p4300
62757A357789p4933p4220p2261o9313o6003o2662n8981n4681n0067m5534m1043
$$ y = [306896, 307852, 309430, 311071, 312382, 313480, 314373, 314798, 314726, 314419, 313897, 312945, 311754, 310887, 310460, 309978, 309327, 309263, 310472, 312602, 314768, 316597, 318207, 319493, 320177, 320480, 321056, 322152, 323411, 324638, 326229, 328531, 331209, 333588, 335419, 337035, 338945, 341541, 345009, 349143, 353315, 356890, 359752, 362365, 365432, 369560, 375029, 381586, 388589, 395636, 403015, 411273, 420468, 430179, 440292, 451361, 464064, 478662, 495194, 513910, 535189, 559134, 585572, 614482, 646310, 681868, 721965, 767028, 817044, 871931, 931903, 997193, 1067316, 1140958, 1216764, 1293929, 1371662, 1448299, 1521375, 1588407, 1647276, 1696078, 1733255, 1757961, 1769857, 1768447, 1753120, 1724082, 1682784, 1631192, 1571015, 1503933, 1432089, 1357789, 1282856, 1208636, 1136375, 1067062, 1001059, 938397, 879416, 824735, 774668, 729134, 688091]
62746F88091l6632l2844k9982k7383k4235k0855j8246j6493j4638j2266j0155
62735D44362q962q140o840n169l850l080k468j813j178m83L64J088J495K184L927
62720D11437O346Q038Q279P959Q465J0226J2714J5272J7470J9178K0871K3531
62708E69786K7658L2534L6960M0590M4075M8051N2533N7222O1911O6430P0561
62697A108311P4107P6873P8590P9018P7927P4813O8897N9914M8710L6504K3646
62686A807310R685n434k0789l5221m8002n8688o7020p3253p7983q1266q2414q1087
62674A185838p7993p4035o9277o3461n7177n1636m7368m3776m0103l6234l2477
62663E92301k9093k6163k3602k1124j8534j6070j4150j2748j1425j0023q898q307
$$ y = [688091, 651459, 618615, 588633, 561250, 537015, 516160, 497914, 481421, 466783, 454517, 444362, 435400, 427260, 420420, 415251, 411401, 408321, 405853, 404040, 402862, 402379, 402743, 403831, 405326, 407510, 411437, 417783, 425821, 434100, 442059, 450524, 460750, 473464, 488736, 506206, 525384, 546255, 569786, 597444, 629978, 666938, 707528, 751603, 799654, 852187, 909409, 971320, 1037750, 1108311, 1182418, 1259291, 1337881, 1416899, 1494826, 1569639, 1638536, 1698450, 1747160, 1783664, 1807310, 1816995, 1811561, 1790772, 1755551, 1707549, 1648861, 1581841, 1508588, 1430605, 1349339, 1266925, 1185838, 1107845, 1033810, 964533, 901072, 843895, 792259, 744891, 701115, 661012, 624778, 592301, 563208, 537045, 513443, 492319, 473785, 457715, 443565, 430817, 419392, 409369, 400471, 392164]
62651C92164p994p629p297p185p040o370n114l862l298l578m211m407l686k247
62637C18246q13k7M1j94l32l16l28m39m60k27N8Rl65n04m9N86P02L04J19O71J749
62616C18431K871L821M554N038N406N993O844P539P788P994Q857J0549J2651J4738
62602D23074J6728J8675K0651K2836K5391K8164L0749L2969L5068L7205L8907
62591G30417L9282L7841L4924L1182K6723K1052J4006O355q74p489j4064k0748
62579H98607k6736l1157l4001l5791l6766l6855l6158l4886l3010l0484k7759
62568E35004k5495k3734k1864j9512j7009j4846j3107j1624j0308r058p715o330
62556C54402n271m787m703m688m548m069k910j098O12J334R81K49k72n68p30n38
$$ y = [392164, 384170, 376541, 369244, 362059, 355019, 348649, 343535, 339673, 336375, 332797, 328586, 324179, 320493, 318246, 317433, 317406, 317447, 317253, 316921, 316605, 316277, 315838, 315378, 315151, 315209, 315218, 314853, 314349, 314300, 314886, 315588, 315892, 316011, 316682, 318431, 321302, 325123, 329677, 334715, 340121, 346114, 352958, 360497, 368285, 376279, 385136, 395685, 408336, 423074, 439802, 458477, 479128, 501964, 527355, 555519, 586268, 619237, 654305, 691510, 730417, 769699, 807540, 842464, 873646, 900369, 921421, 935427, 941782, 940908, 933419, 919355, 898607, 871871, 840714, 806713, 770922, 734156, 697301, 661143, 626257, 593247, 562763, 535004, 509509, 485775, 463911, 444399, 427390, 412544, 399437, 387813, 377505, 368447, 360732, 354402, 349131, 344344, 339641, 334953, 330405, 326336, 323426, 322328, 322940, 324274, 325255, 325504, 325232, 324664, 323934, 323396]
62540C23396J70J020J399J231J097J502K288K976L512M246N230N967O147O364
62526C66545P627J0222J3391J6223J8532K0706K3087K5718K8607L1795L5151L8291
62514F35895M0797M2478M3365M3510M2867M1375L9047L5815L1296K4995J6948
62503A038388Q074l54p581j3635j8938k3893k8621l2666l5062l5179l3519l1220
62491G85794k8697k5428k1144j6530j2312q361m257k16L300O499R939J3441J6201
62478G18229J8015J9513K1021K1904K1422J9554J6625J2733Q030L061j763o722
62466H71622j2204j7817k2663k6356k9221l1539l3193l4062l4171l3282l1014
62455E66100k7670k4436k2265k0859j9202j6858j4205j1640r192o980n330m193
$$ y = [323396, 323566, 324586, 325985, 327216, 328313, 329815, 332103, 335079, 338591, 342837, 348067, 354034, 360181, 366545, 374172, 384394, 397785, 414008, 432540, 453246, 476333, 502051, 530658, 562453, 597604, 635895, 676692, 719170, 762535, 806045, 848912, 890287, 929334, 965149, 996445, 1021440, 1038388, 1046462, 1046108, 1038527, 1024892, 1005954, 982061, 953440, 920774, 885712, 850533, 817014, 785794, 757097, 731669, 710525, 693995, 681683, 673322, 669065, 668849, 672149, 678648, 688587, 702028, 718229, 736244, 755757, 776778, 798682, 820104, 839658, 856283, 869016, 877046, 880107, 878344, 871622, 859418, 841601, 818938, 792582, 763361, 731822, 698629, 664567, 630396, 597114, 566100, 538430, 513994, 491729, 470870, 451668, 434810, 420605, 408965, 399773, 392793, 387463, 383270]
62443C83270k982j439j81J39n6K94J433K448K557K136K079K498K561J493n66k744
62427C92940m272n145n928o893p498p031n766m858m972n517n549m961m273l724
62413C16553l239k989l184l403k939j949j498k160l179l401k600j440m97K16Q33
62398B85124J222J078M00k67k14O18J434J553J332J596K294K543K131K020K898
62383C05762M023M270L736L466L985M898N824O763P597P999Q066Q405R357J0641
62369C94792J1972J3505J5439J7603J9749K1932K4346K7075L0169L3706L7521
62358F47809M1184M4546M8056N2208N6695O0297O1598N9765N4891M7802L9460
62347A214311L0434K0901J1134J680o963j4655k1473k7483l2837l7789m2394m6270
$$ y = [383270, 380288, 378849, 378668, 378807, 378751, 379045, 380478, 382926, 385483, 387619, 389698, 392196, 394757, 396250, 395684, 392940, 388668, 383523, 377595, 370702, 363204, 356173, 350407, 345549, 340577, 335060, 329511, 324550, 320277, 316553, 313314, 310325, 307141, 303738, 300799, 298850, 297352, 295192, 292013, 288612, 286012, 284572, 284075, 284291, 285124, 286346, 287424, 287824, 287557, 287343, 287961, 289395, 290948, 292280, 293876, 296170, 298713, 300844, 302864, 305762, 309785, 314055, 317791, 321257, 325242, 330140, 335964, 342727, 350324, 358323, 366389, 374794, 384151, 394792, 406764, 420269, 435708, 453311, 473060, 494992, 519338, 546413, 576582, 610288, 647809, 688993, 733539, 781595, 833803, 890498, 950795, 1012393, 1072158, 1127049, 1174851, 1214311, 1244745, 1265646, 1276780, 1278460, 1271497, 1256842, 1235369, 1207886, 1175049, 1137260, 1094866, 1048596]
62335A048596m8845m9788m9072m6861m3495l9500l5343l1224k7248k3595k0386
62324F33239j7583j5253j3793j3469j3859j4108j3873j3605j3800j4293j4557
62313D75046j4419j4091j3667j3002j2130j1353j0752r862q215o064m247l315
62301C53929l068k962k754k573k529k504k255j677r66m86m20m46mJ073K334L233
62285C37925L652L760L661L470L535M151N065N743O140O792Q040R476J0465J0917
62271D22792J1307J2064J3232J4584J5959J7425J9232K1552K4260K7077K9987
62260F29471L3324L7320M1739M6053M9902N3236N6101N8287N9190N8021N4362
62249A177006M8582M1460L3370K4101J3657K892o935j5190k2258k8988l5908m2807
$$ y = [1048596, 999751, 949963, 900891, 854030, 810535, 771035, 735692, 704468, 677220, 653625, 633239, 615656, 600403, 586610, 573141, 559282, 545174, 531301, 517696, 503896, 489603, 475046, 460627, 446536, 432869, 419867, 407737, 396384, 385632, 375770, 367555, 361491, 357244, 353929, 350861, 347899, 345145, 342572, 340043, 337539, 335284, 333607, 332641, 332155, 331735, 331289, 331285, 332358, 334692, 337925, 341577, 345337, 348998, 352468, 356003, 360154, 365219, 370962, 377102, 383894, 391934, 401410, 411875, 422792, 434099, 446163, 459395, 473979, 489938, 507363, 526595, 548147, 572407, 599484, 629471, 662795, 700115, 741854, 787907, 837809, 891045, 947146, 1005433, 1064623, 1122644, 1177006, 1225588, 1267048, 1300418, 1324519, 1338176, 1341068, 1334133, 1318943, 1296685, 1267697, 1231789, 1188982]
62237A188982m8908n3448n6299n7901n8553n7975n5785n2214m8054m3909l9783
62226F16153l5415l0794k6296k2410j9404j7150j5302j3649j2163j0754r232p701
62214C95883o620o217o095n744n204m742m199l252k199j755j961j992j313l58
62200C44232L27R69J986L046L499L469L715M535N532O507P827R573J1068J1586
62186D17871J1150J0278R379Q767Q819R520J0144R949R062Q224P766P420P099
62173E35448P268Q451J0790J4147J8188K2275K5840K9008L2428L6311M0126M3299
62161H23579M5532M6189M4205L9331L2845K6240J9598J2124L958l586r632j4595
62149A065788j9212k3572k7488l1154l4777l7903l9625l9413l7518l4654l1451
$$ y = [1188982, 1140074, 1086626, 1030327, 972426, 913873, 855898, 800113, 747899, 699845, 655936, 616153, 580738, 549944, 523648, 501238, 481834, 464684, 449382, 435733, 423570, 412816, 403584, 395883, 389263, 383046, 376951, 371207, 366003, 361261, 357062, 353810, 351611, 349856, 347895, 345903, 344590, 344232, 344559, 345528, 347514, 350560, 354059, 357528, 361243, 365778, 371310, 377817, 385644, 395217, 406285, 417871, 429021, 439299, 448678, 457445, 466264, 475784, 485928, 495877, 504939, 513163, 520929, 528349, 535448, 542716, 551167, 561957, 576104, 594292, 616567, 642407, 671415, 703843, 740154, 780280, 823579, 869111, 915300, 959505, 998836, 1031681, 1057921, 1077519, 1089643, 1093601, 1090015, 1080383, 1065788, 1046576, 1023004, 995516, 964362, 929585, 891682, 852057, 812644, 775126, 740472, 709021]
62138G09021k8075k4399k0565j7141j4378j1713q593n598l833l278k667j253K75
62125E67803J035J094Q03q9j743l342l893l550l211l139k948k668k840l548m288
62110E35476m907n808p109q270q784q630p965o955o006n443m903l687j925o05
62096D54479k08m6O19J551K153K532L212M210N102N785O552P500Q415R301J0471
62081E21628J2002J3495J4565J5346J6325J7752J9348K0625K1380K1885K2547
62070G16898K3539K4730K5941K7140K8528L0436L2947L5485L7067L7146L6034
62059A055891L4120L1159K6755K1209J5204Q815J719n627j1970j6757k0876k5391
62047A114251l0227l4602l8242m1443m4215m5988m6110m4360m1119l7404l4307
$$ y = [709021, 680946, 656547, 635982, 618841, 604463, 592750, 584157, 578559, 574726, 571448, 568781, 567528, 567803, 568838, 569932, 570735, 570646, 568903, 565561, 561668, 558118, 554907, 551768, 548820, 546152, 543312, 539764, 535476, 530569, 524761, 517652, 509382, 500598, 491968, 484003, 477048, 471042, 465599, 460696, 457009, 455084, 454479, 454271, 454225, 454844, 456395, 458548, 461080, 464292, 468502, 473604, 479389, 485941, 493441, 501856, 511157, 521628, 533630, 547125, 561690, 577036, 593361, 611113, 630461, 651086, 672466, 694351, 716898, 740437, 765167, 791108, 818248, 846776, 877212, 910159, 945644, 982711, 1019857, 1055891, 1090011, 1121170, 1147925, 1169134, 1184338, 1193153, 1194872, 1189245, 1177275, 1160518, 1139642, 1114251, 1084024, 1049422, 1011180, 969737, 925522, 879534, 833424, 789064, 747945, 710541, 676234]
62036F76234l2044k9756k6678k3215k0347j8265j6208j3637j0923q757p331o435
62024D62638n931n884o228o594o553o049n499n332n467n391m786l840k932k285
62010C89867j951j894j927j840j597j147q0J989M521O177O240N410M735M215L120
61995D15838J378j67q87j199k000l635n562o949p493p668q051q542q590q164p876
61980C40433p981p878p029n762m685l888l323l286l736l744k647j351j281k279
61966B81563k765k064j182r83r06j44R63J631J936K499L348L952M123M124M087
61951C00182L963L983M543N674P057Q474R880J1137J2164J3256J4741J6415J7761
61938D29230J8734J9765K0898K1526K1258K0578K0163J9891J9086J7633J6158
$$ y = [676234, 644190, 614434, 587756, 564541, 544194, 525929, 509721, 496084, 485161, 476404, 469073, 462638, 456707, 450823, 444595, 438001, 431448, 425399, 419900, 414568, 409101, 403710, 398924, 395084, 392152, 389867, 387916, 386022, 384095, 382255, 380658, 379511, 379431, 381420, 385941, 392118, 398358, 403768, 408503, 412718, 415838, 417216, 417049, 416162, 414963, 412963, 409328, 403766, 396817, 389324, 381656, 373605, 365063, 356473, 348309, 340433, 332452, 324574, 317545, 311783, 307098, 303210, 299887, 296601, 292865, 289121, 286474, 285123, 283842, 281563, 278798, 276734, 275552, 274569, 273663, 273519, 274482, 276113, 278049, 280548, 283896, 287848, 291971, 296095, 300182, 304145, 308128, 312671, 318345, 325402, 333876, 343756, 354893, 367057, 380313, 395054, 411469, 429230, 447964, 467729, 488627, 510153, 531411, 551989, 572152, 592043, 611129, 628762, 644920]
61927F44920J4983J3439J0722P061L519P02j788m516p326r530j0651j0707r986
61914F40842q829p401n465k605J088M800P738R833J1423J2556J3084J3160J2979
61901G03203J2098R700N705J114l012o499r803j3138j6162j8418j9870k0934k1956
61888F02028k2640k2259k0576j8332j6557j5556j4911j4204j3377j2537j1850
61877D19229j1500j1330j0732r327p573o163n065l792k384j324n59M71J849L062
61863C54862M008N201O758Q113R100J0390J2369J4444J6105J7858K0372K3312
61851E02892K5835K7875L0078L2639L4822L5620L4609L2280K9672K7324K4524
61840H38170K0113J4112P873K374k694p750j2191j5200j6762j6989j5317j1450
$$ y = [644920, 659903, 673342, 684064, 691125, 694644, 695346, 693558, 689042, 681716, 672186, 661535, 650828, 640842, 632013, 624612, 619147, 616542, 617630, 622430, 630168, 640001, 651424, 663980, 677064, 690224, 703203, 715301, 725001, 730706, 731820, 728808, 722309, 712506, 699368, 683206, 664788, 644918, 623984, 602028, 579388, 557129, 536553, 518221, 501664, 486108, 471197, 456993, 443616, 431079, 419229, 407729, 396399, 385667, 376340, 368767, 362604, 357539, 353747, 351363, 350039, 349480, 349951, 351800, 354862, 358870, 364071, 370829, 378942, 388042, 398432, 410801, 425245, 441350, 459208, 479580, 502892, 528727, 556602, 586680, 619319, 654141, 689761, 724370, 756650, 786322, 813646, 838170, 858283, 872395, 880268, 882642, 879948, 872198, 860007, 844807, 828045, 811056, 795739, 784289]
61828G84289o502j964K069O452J1072J4668J6493J6996J6656J5163J1970O960
61816H94322M52o718j3245j8295k2376k6456l0329l2848l3700l3756l3498l2292
61804F11261k9741k6611k3898k1798k0135j8956j8035j6635j4492j2434j1301
61793C97225j0799j0040q738p195n589l998k823k423k619l065l766m656n062m381
61779C22071l081k256k270k495k356j913j388p68j01L69N40O08P04P10N97O07
61763C09578R17J324J438J145P45P15J222J890K079J536O75R6QK35N25O28L48
61746C25104j43k47L76J214J362N68n39j221j269q78l03K63P76J382K125K673
61730C31243K643K224K058K408K888L087L074L078L112L194L529M102M429M152
$$ y = [784289, 777787, 775823, 777892, 784344, 795416, 810084, 826577, 843573, 860229, 875392, 887362, 894322, 894774, 888056, 874811, 856516, 834140, 807684, 777355, 744507, 710807, 677051, 643553, 611261, 581520, 554909, 531011, 509213, 489078, 470122, 452087, 435452, 420960, 408526, 397225, 386426, 376386, 367648, 360453, 354864, 350866, 348043, 345620, 343001, 339936, 336170, 331514, 326452, 322071, 318990, 316734, 314464, 311969, 309613, 307700, 306312, 305544, 305443, 305812, 306352, 306960, 307664, 308374, 308971, 309578, 310495, 311819, 313257, 314402, 315147, 315862, 317084, 318974, 321053, 322589, 323264, 323360, 323368, 323603, 324128, 324756, 325104, 324961, 324714, 325090, 326304, 327666, 328234, 327695, 326474, 325205, 324327, 324024, 324287, 325063, 326445, 328570, 331243, 333886, 336110, 338168, 340576, 343464, 346551, 349625, 352703, 355815, 359009, 362538, 366640, 371069, 375221]
61716C75221L617L377L387L157K592K017J468O04n75j563k193k970m169n130n035
61701C73805m059l080k590k468k661l251l852l723k828k084k232k863l032k397
61687C32685j404o07k40k80n26p16q36j160j738k115j828j058m21k69m79p32p13
61670C17563k50M17O50R6p78j160p96r5M58O16L29j74l16K89J266J858J818J581
61652C23372J598J908K284K436K170J684J517J840K116J983K024K827L694L323
61638C54776J716K30l50o19j105j329r31o60j297k409l081l259l459l646l378
61623C31199k769k394k368k332k154j974j646q75J10O95O56K74k64j024j948k855
61607C10331l792m851n739o123o225o480o626n968m586l505l370l669l576l047
$$ y = [375221, 378838, 382215, 385602, 388759, 391351, 393368, 394836, 395440, 394865, 393302, 391109, 388139, 383970, 378840, 373805, 369746, 366666, 364076, 361608, 358947, 355696, 351844, 348121, 345293, 343209, 340977, 338114, 335082, 332685, 331281, 330674, 330434, 330154, 329628, 328912, 328076, 326916, 325178, 323063, 321235, 320177, 319756, 319487, 319008, 318276, 317563, 317313, 317730, 318380, 318476, 317698, 316538, 315742, 315647, 316105, 316721, 317050, 316876, 316560, 316849, 318115, 319973, 321791, 323372, 324970, 326878, 329162, 331598, 333768, 335452, 336969, 338809, 340925, 342908, 344932, 347759, 351453, 354776, 356492, 356722, 356372, 355753, 354648, 353319, 352388, 351728, 350431, 348022, 344941, 341682, 338223, 334577, 331199, 328430, 326036, 323668, 321336, 319182, 317208, 315562, 314687, 314797, 315492, 316148, 316422, 316158, 315134, 313186, 310331, 306539, 301688, 295949, 289826, 283601, 277121, 270495, 264527, 259941, 256436, 253066, 249397, 245821, 242774]
61593B42774k602k520k702l032l424l655l560l286l126l144l143k963k616k204
61579B00797j803j381q25j00N39P01K85l29n97l49J5r5q36j665j841j237m23M1
61561A90897J47J82K77M68Q36J302J527J387J255J397J474J144P87R16J164O91
61545B05851l59p99n2R66J100L99k22l02j07R7L69P19R12P96M74R4l42q37j235
61526B07522j304r67m29j6J49J54j8n52j387j916j649j023j005j768k322j765
61510A91704m62M61N16K66M39J123J831K075J685Q01k26j023j408j532j693j966
61494A92591k079j726j051n53m72m73j23N22J020J105R07O84O14P91J197J740
61478A94694K457L399M183M042K803J460J120J551J541O10l83n12J44Q80J180
$$ y = [242774, 240172, 237652, 234950, 231918, 228494, 224839, 221279, 217993, 214867, 211723, 208580, 205617, 203001, 200797, 198994, 197613, 196788, 196688, 197227, 197928, 198213, 197884, 197287, 196938, 196953, 196858, 196022, 194357, 192516, 191279, 190856, 190897, 191044, 191226, 191503, 191971, 192807, 194109, 195636, 197023, 198278, 199675, 201149, 202293, 203080, 203996, 205160, 205851, 205492, 204693, 204641, 205607, 206707, 207106, 206884, 206582, 206475, 206572, 206941, 207660, 208572, 209368, 209842, 209936, 209594, 208757, 207522, 206218, 205251, 204822, 204806, 204955, 205109, 205091, 204539, 203152, 201236, 199587, 198564, 197559, 195791, 193469, 191704, 191242, 191703, 192219, 192485, 192924, 194047, 195878, 197953, 199638, 200439, 200213, 199190, 197782, 196250, 194557, 192591, 190512, 188786, 187735, 187182, 186710, 186237, 186114, 186636, 187656, 188761, 189668, 190352, 190966, 191757, 192954, 194694, 197151, 200550, 204733, 208775, 211578, 213038, 214158, 215709, 217250, 217860, 217477, 216965, 217109, 217989, 219169]
61463B19169Q24j44j156j374o66J61M10L16L72N12N21O73J212J614J214L09j97
61446B23770j14j08m11l19O83J933K239J290L2k86P42K410L620L835L304K502
61430B45122J639Q79N32O93R16P31K73J7N5J75M60J125J844J944J425J096J413
61413B60339J878J954J874J998J924J026m79j743k479l116l746l739k756j492
61399B51443r11j131j541j723j665j330n87L39R53J077R91Q15L08n38j176j179
61383B44145q46o30l64L38J135J181L65l68k42L56N27R2k50J43J171K165K512
61366B51430K174J702J744K402L181L559L438L088K894L162L921M756N210N350
61352B98011N630O130O354N967N225M463L641K787K371K632K984K775K413K957
$$ y = [219169, 219993, 219849, 218693, 217319, 216653, 216814, 217224, 217540, 217912, 218424, 218945, 219618, 220830, 222444, 223658, 223967, 223770, 223656, 223548, 223137, 222818, 223501, 225434, 227673, 228963, 228995, 228709, 229451, 231861, 235481, 239316, 242620, 245122, 246761, 247640, 248172, 248865, 249781, 250512, 250785, 250802, 250857, 251032, 251492, 252617, 254461, 256405, 257830, 258926, 260339, 262217, 264171, 266045, 268043, 269967, 270993, 270514, 268771, 266292, 263176, 259430, 255691, 252935, 251443, 250532, 249401, 247860, 246137, 244472, 243142, 242555, 242894, 243847, 244924, 245915, 246730, 247038, 246500, 245324, 244145, 243299, 242669, 242305, 242643, 243778, 244959, 245324, 244956, 244714, 245070, 245597, 245689, 245439, 245582, 246753, 248918, 251430, 253604, 255306, 257050, 259452, 262633, 266192, 269630, 272718, 275612, 278774, 282695, 287451, 292661, 298011, 303641, 309771, 316125, 322092, 327317, 331780, 335421, 338208, 340579, 343211, 346195, 348970, 351383, 354340]
61338C54340M547N968O009M720L066J741P08l35j422k313k838l125l495m075m656
61323C58840m916m700m108l457l099l053k735j553J82J372J482J271J764K886
61309C40176L766M034M157M593N260N897O341O350N627M190K441Q13m29j141j390
61294C90685j489j666j819j899k181k707k894k357j791k107k969l216k651k219
61280C58720k211j667r2J413J656J034P59J077J304J154J004J076J296J769K599
61265C70891L360L545L514M091N322O358O704O703O648O259N369M463M027L870
61251D41124L558L127K921L036L299L548L569L000J714J46j164k253l607n373
61237D56645p014p849p732p109o544o232n906n205m139l103k355j704q12K55J083
$$ y = [354340, 358887, 364855, 370864, 375584, 378650, 380391, 381099, 380764, 379342, 377029, 374191, 371066, 367571, 363496, 358840, 353924, 349224, 345116, 341659, 338560, 335507, 332772, 331219, 331401, 332773, 334255, 335526, 337290, 340176, 343942, 347976, 352133, 356726, 361986, 367883, 374224, 380574, 386201, 390391, 392832, 393645, 393216, 392075, 390685, 389196, 387530, 385711, 383812, 381631, 378924, 376030, 373673, 371882, 369775, 366806, 363590, 360939, 358720, 356509, 354842, 354750, 356163, 357819, 358853, 359612, 360689, 361993, 363147, 364151, 365227, 366523, 368292, 370891, 374251, 377796, 381310, 385401, 390723, 397081, 403785, 410488, 417136, 423395, 428764, 433227, 437254, 441124, 444682, 447809, 450730, 453766, 457065, 460613, 464182, 467182, 468896, 469042, 467878, 465625, 462018, 456645, 449631, 441782, 434050, 426941, 420397, 414165, 408259, 403054, 398915, 395812, 393457, 391753, 390941, 391196, 392279]
61222C92279J383J247R18O33O88J352K491L561M175M447M541M177L055J602P28
61207D27277P00Q87P88P82J432K518L412M035M804N765O544P126P961R049R703
61192D92783R463Q668P764O619N040L480K578K355K388K491K622K461J728Q19
61178E51259L63K69n3o04p80o04r87k306l537l500k462j705j893k646l546m602
61162E22666n668o190n999n752o155p038p622p501o943o312n588m553l210j911
61148D42224j225j600l003m798o199o843o886o550n899n077m447m178l899l145
61134C78475k079j426j526j788j306Q4J692K835L473L900M158M131M162N023P062
61119D06870R636J1755J3114J4109J4976J5454J5460J5463J5898J6507J6785J6766
$$ y = [392279, 393662, 394909, 395827, 396460, 397148, 398500, 400991, 404552, 408727, 413174, 417715, 421892, 424947, 426549, 427277, 427977, 428864, 429652, 430434, 431866, 434384, 437796, 441831, 446635, 452400, 458944, 466070, 474031, 483080, 492783, 502246, 510914, 518678, 525297, 530337, 533817, 536395, 538750, 541138, 543629, 546251, 548712, 550440, 551259, 551622, 551891, 551838, 551234, 550454, 549850, 548863, 546557, 543020, 539520, 537058, 535353, 533460, 530814, 527268, 522666, 516998, 510808, 504809, 499057, 492902, 485864, 478242, 470741, 463798, 457486, 451898, 447345, 444135, 442224, 440999, 439399, 436396, 431598, 425399, 418556, 411670, 405120, 399221, 394144, 389697, 385519, 381620, 378475, 376396, 374970, 373444, 371656, 370350, 370434, 372126, 374961, 378434, 382334, 386492, 390623, 394785, 399808, 406870, 416506, 428261, 441375, 455484, 470460, 485914, 501374, 516837, 532735, 549242, 566027, 582793]
61107E82793J6915J7334J7520J6971J5545J3303J0362P104M134J798l7j641l067
61094F99034m237n202o178p420r005j0612j1598j1618j1160j1104j1785j2734
61082E86381j3273j3088j2202j0879r586q643p866o941o066n670n507m730l119
61069D78811j470m37K79J182K084K611K983L600M364N062O000P423Q756R270R275
61054E39793R733J0819J1804J2340J2957J4097J5522J6963J8682K0982K3634K6164
61042G33490K8351L0321L2376L4832L7666M0381M2577M4476M6352M7729M7995
61031A166546M7782M8811N2046N6819O2092O7736P4116Q1174Q8651R6848J06674
61020A949295J19357J36493J59961J91186K30660K78375L34455L99295M73963
$$ y = [582793, 599708, 617042, 634562, 651533, 667078, 680381, 690743, 697847, 701981, 703779, 703742, 702101, 699034, 694797, 689595, 683417, 675997, 666992, 656380, 644782, 633164, 622004, 610900, 599115, 586381, 573108, 560020, 547818, 536939, 527353, 518710, 510844, 503903, 497837, 492167, 486660, 481930, 478811, 477341, 476904, 477183, 478365, 480449, 483060, 486043, 489643, 494007, 499069, 505069, 512492, 521248, 530518, 539793, 549526, 560345, 572149, 584489, 597446, 611543, 627065, 644028, 662710, 683692, 707326, 733490, 761841, 792162, 824538, 859370, 897036, 937417, 979994, 1024470, 1070822, 1118551, 1166546, 1214328, 1263139, 1315185, 1372004, 1434096, 1501832, 1575948, 1657122, 1745773, 1842621, 1949295, 2068652, 2205145, 2365106, 2556292, 2786952, 3065327, 3399782, 3799077, 4273040]
61011D273040N61306O66739P97213R57136J140510J321706J453818J483077J374949
61002A4029494J133428P99682M35849J09688j16488k02267j51801k3736Q9698
60993A6103547J05861j3226k55244n74589r11660j205099j403045j477757j435215
60984H933573j309026j141309r65357q00460o55727n34279m34980l54301k88987
60975B449147k37076j96790j65619j41035j21356j05585r2959q2881p4775o7776
60965A163295o1071n4564m8675m3390l8173l2971k8615k5857k4560k4094k3960
60954G57365k3768k3095k1873k0448j9018j7349j5354j3367j1596r768p819o324
60942E67586n724n588n301n067n584o918q376r350r716r552r076q764q949r233
$$ y = [4273040, 4834346, 5501085, 6298298, 7255434, 8395944, 9717650, 11171468, 12654545, 14029494, 15162922, 15962604, 16398453, 16508141, 16391653, 16189386, 16037585, 16013849, 16103547, 16209408, 16196182, 15940938, 15366349, 14454689, 13249590, 11846545, 10368788, 8933573, 7624547, 6483238, 5517881, 4717421, 4061694, 3527415, 3092435, 2738134, 2449147, 2212071, 2015281, 1849662, 1708627, 1587271, 1481686, 1388727, 1305846, 1231071, 1163295, 1102224, 1047660, 998985, 955595, 917422, 884451, 855836, 829979, 805419, 781325, 757365, 733597, 710502, 688629, 668181, 649163, 631814, 616460, 603093, 591497, 581729, 573910, 567586, 561862, 556274, 550973, 545906, 540322, 533404, 525028, 515678, 505962, 496410, 487334, 478570, 469621, 460388]
60928D60388q882p857o932o731p025p118o527n237l652k427k004k150k168j669
60914C90009q31k7N68R26J090J252J558J850J848J671J723K028K126J812J555
60899D09158J871K603L151L212K927K486J977J474R90K89r11k515m079n297o227
60884D11109o996p543p763p783p797p767p520p059o552n978n130m110l469l497
60870C22145l587k787r91Q24J676J460P14k2l77j70L27N48L82N16J420K439K474
60853C26991J398J11p40j278j585j255j92Q24R90N46M38J123K178K956L151K743
60837C38399J840P35j64o65r87j434j884j748p12N94R92P0j277j968k010k116
60821C27665k330j957r30l06r87k590m015m640m455l604k475j799j989k535k668
$$ y = [460388, 451506, 443649, 436717, 429986, 422961, 415843, 409316, 404079, 400427, 398000, 395996, 393846, 391678, 390009, 389178, 389151, 389719, 390645, 391735, 392987, 394545, 396395, 398243, 399914, 401637, 403665, 405791, 407603, 409158, 411029, 413632, 416783, 419995, 422922, 425408, 427385, 428859, 429849, 430138, 429227, 426712, 422633, 417336, 411109, 404113, 396570, 388807, 381024, 373227, 365460, 357940, 350881, 344329, 338351, 333221, 329111, 325642, 322145, 318558, 315771, 314780, 315604, 317280, 318740, 319454, 319432, 319055, 318885, 319212, 319760, 320142, 320658, 322078, 324517, 326991, 328389, 328500, 327760, 326482, 324897, 323642, 323450, 324274, 325264, 325810, 326248, 327371, 329549, 332505, 335656, 338399, 340239, 340974, 340810, 340145, 339158, 337724, 335840, 334092, 333380, 333974, 334966, 335036, 333759, 331791, 329781, 327665, 325335, 323378, 322448, 322142, 321155, 318565, 314550, 309910, 305455, 301851, 299376, 297577, 295588, 293053, 290385]
60806B90385k441k579l361m242m601m333l679k927k337k060k039k196k586l078
60792B47926l199k667j858j278q13n3R02J526J659J508J080L59j14K68J023R81
60776B47250L0m78M98K386L986M888N278N096M303L434L070L047K863K520K226
60761B90397J683N17q47j597j753k053k651k867k371j779j699j894j832j523j301
60746B68430j137p31j32J72k34j317k669l778m270m076l464k893k765l152l696
60731B34288l900l632l141k519j499j15Q97Q90K42j15J2o5p07j338j263m90M90
60714B18035J266J590J371R21P47R06R37O98O30R19J079Q14P04J365K384K970
60698B37336L173L671M443M658L929K845K094J746J623J686J758J485R68Q74J472
$$ y = [290385, 287944, 285365, 282004, 277762, 273161, 268828, 265149, 262222, 259885, 257825, 255786, 253590, 251004, 247926, 244727, 242060, 240202, 238924, 238111, 238058, 238960, 240486, 242145, 243653, 244733, 245092, 244978, 245246, 246269, 247250, 247280, 246802, 247300, 249686, 253672, 258560, 263838, 268934, 273237, 276671, 279741, 282788, 285651, 288171, 290397, 292080, 292597, 291750, 290153, 288400, 286347, 283696, 280829, 278458, 276679, 274980, 273086, 271254, 269731, 268430, 267293, 266562, 266430, 266602, 266368, 265051, 262382, 258604, 254334, 250258, 246794, 243901, 241136, 237984, 234288, 230388, 226756, 223615, 221096, 219597, 219482, 220379, 221269, 221511, 221396, 221408, 221343, 220636, 219298, 218035, 217545, 218035, 219301, 220891, 222262, 223183, 223930, 224836, 225773, 226471, 227101, 228020, 229099, 229913, 230617, 231982, 234366, 237336, 240509, 244180, 248623, 253281, 257210, 260055, 262149, 263895, 265518, 267204, 268962, 270447, 271415, 272289, 273761]
60683B73761K004J594M26n57r51j288k070k977l319k912k280j958j933j785j351
60668B54404r89j149j763k341k581k656k858l145l192k723j708m43N45Q71P07
60653B30979O11Q59J160J225J223J369J385Q52rm70k69Nk52q84j310j390j549
60636B33535k073k689k945k746k365k011j658j233p79l32J48N87O83K77k90m57
60620B15652j51J79K97N43J156J684J496O98K5j53j36k22l02k62k85m51m18P5
60602B19425P60J163J214J128R84Q08Q42J218J488J049%r02j213j240j402j593
60586B23729j473r86l09M50J216J833K256K636L045L320L386L496L880M426N023
60571B55928N898P209Q504R096Q874Q261P390N927L742J334o99k172l185l848
$$ y = [273761, 275765, 277359, 277785, 277228, 276277, 274989, 272919, 269942, 266623, 263711, 261431, 259473, 257540, 255755, 254404, 253415, 252266, 250503, 248162, 245581, 242925, 240067, 236922, 233730, 231007, 229299, 228856, 229401, 230272, 230979, 231590, 232449, 233609, 234834, 236057, 237426, 238811, 239663, 239654, 239184, 238915, 238920, 238668, 237784, 236474, 235084, 233535, 231462, 228773, 225828, 223082, 220717, 218706, 217048, 215815, 215036, 214704, 214852, 215439, 216122, 216399, 216109, 215652, 215501, 215680, 215977, 216520, 217676, 219360, 220856, 221554, 221579, 221426, 221290, 221068, 220766, 220504, 220219, 219768, 219350, 219425, 220185, 221348, 222562, 223690, 224674, 225482, 226324, 227542, 229030, 230079, 230079, 229177, 227964, 226724, 225322, 223729, 222256, 221270, 220961, 221411, 222627, 224460, 226716, 229352, 232397, 235717, 239103, 242599, 246479, 250905, 255928, 261826, 269035, 277539, 286635, 295509, 303770, 311160, 317087, 320829, 322163, 321464, 319292, 316107, 312259]
60557C12259m363m883n073m204k118J97J565J989K617M326O735Q709R551R491
60543C36798R257R338R671R928R914R561Q648O888M400J774n57k715m903o830
60529D01172p995q269p848o842n482m490m503n079n017l877k529j910j830j484
60515C34017n63P13K264M093N777O732P078P706R329J1888J4949J8222K1519K4584
60501D68308K7318K9940L2641L5139L6708L6662L4724L1073K6065J9860J2245
60490G90683L056p220j7375k6140l2842l7378l9802m0159l8722l6091l2934k9641
60478D55435k6351k3239k0526j8180j5854j3392j1245r983r426q684p230n505
60466B85820m250l583l136k716k407k212k080k137k457k712k545k158k043k183
$$ y = [312259, 307896, 303013, 297940, 293736, 291618, 291815, 293380, 295369, 297986, 302312, 309047, 317756, 327307, 336798, 346055, 355393, 365064, 374992, 384906, 394467, 403115, 410003, 414403, 416177, 415620, 412905, 408002, 401172, 393177, 384908, 377060, 370218, 364736, 360246, 355743, 350664, 345647, 341770, 339241, 337331, 335501, 334017, 333454, 334167, 336431, 340524, 346301, 353033, 360111, 367817, 377146, 389034, 403983, 422205, 443724, 468308, 495626, 525566, 558207, 593346, 630054, 666716, 701440, 732513, 758578, 778438, 790683, 793739, 786519, 769144, 743004, 710162, 672784, 632982, 592823, 554101, 518010, 485076, 455435, 429084, 405845, 385319, 367139, 351285, 337893, 326648, 316665, 307239, 298555, 291325, 285820, 281570, 277987, 274851, 272135, 269728, 267516, 265436, 263299, 260842, 258130, 255585, 253427, 251384, 249201]
60452B49201k137j784j474j314j077q60j110j758k029j479o08p6J09J86J42L3
60436B33965K31O73N60n51j893k530k657k990l351k983j935r10J4J306K690L243
60420B22882K961K805K866J949l35k384k662j771j281j358r64M6O04J78m38l61
60404B22737L80J309K177K832L131L216L458L829L911L581L140K657J839P95K48
60389B59240N80J213J380J091Q33P88Q09Q94J137J420J642J989K555K937K702
60374B81210K100J753J752J684J478J527J904K117J939J812K080K338K145J907
60360C07746K373L474M387M717M964N669O657P406P704P577O857N250K807P0k311
60345C75347l997n143o162p120p453o590m968l849l878m270l939l020k546k850
$$ y = [249201, 247064, 245280, 243806, 242492, 241415, 240555, 239445, 237687, 235658, 234179, 233571, 233495, 233604, 233790, 233932, 233965, 234196, 234869, 235429, 234878, 232985, 230455, 227798, 224808, 221457, 218474, 216539, 215629, 215643, 216949, 219639, 222882, 225843, 228648, 231514, 233463, 233128, 230744, 228082, 226311, 225030, 223672, 222708, 222754, 223358, 223536, 223098, 222737, 223117, 224426, 226603, 229435, 232566, 235782, 239240, 243069, 246980, 250561, 253701, 256358, 258197, 258992, 259240, 259820, 261033, 262413, 263504, 264337, 265125, 265934, 266828, 267965, 269385, 271027, 273016, 275571, 278508, 281210, 283310, 285063, 286815, 288499, 289977, 291504, 293408, 295525, 297464, 299276, 301356, 303694, 305839, 307746, 310119, 313593, 317980, 322697, 327661, 333330, 339987, 347393, 355097, 362674, 369531, 374781, 377588, 377658, 375347, 371350, 366207, 360045, 352925, 345472, 338882, 333914, 330065, 326187, 321917, 317978, 314958, 312412, 309562]
60331C09562l118k620j667r77p48p64r86j471j931j884j195k00P07J399K007K790
60315B98904L975N546P202Q568R373R495R000Q239P585P011O149M827L294J769
60301C90937J31j794l937o125q180r712j0270r964r500r228q620p187n454m387
60287B96710m113l843k981j701n09K05K68r9k07M21J309J458N86o16j443j798
60271B83647j845j602j166q18p30q77j284j924k354k108j473j257j598j739j225
60256B61647n80l40j60M86J239J295O02p6j38L88J265K245K896K684J532L1r57
60239B74059q89J28J349J863J306J50q25j164q29N1J189K125K433J979R68q5m92
60222B83316M3J002J583J770K199K891L051K456K090K652L292K956K235K576L991
$$ y = [309562, 306444, 303824, 302157, 301180, 300432, 299668, 298682, 297211, 295280, 293396, 292201, 292001, 292708, 294107, 296114, 298904, 302879, 308425, 315627, 324195, 333568, 343063, 352063, 360302, 367887, 374898, 381047, 385874, 389168, 390937, 391068, 389274, 385337, 379212, 371032, 361320, 351050, 341086, 331586, 322358, 313738, 306551, 301097, 296710, 292597, 288754, 285773, 284072, 283563, 283768, 284036, 283937, 283730, 284151, 285460, 286918, 287504, 286888, 285445, 283647, 281802, 280200, 279034, 278216, 277486, 276609, 275325, 273401, 271047, 268939, 267466, 266209, 264611, 262872, 261647, 261067, 260727, 260567, 261053, 262292, 263587, 264189, 264113, 263975, 264363, 265628, 267873, 270769, 273453, 274985, 275016, 274059, 273170, 273298, 274647, 276510, 277816, 277966, 277141, 275977, 275148, 275199, 276388, 278513, 280946, 282925, 283893, 283808, 283316, 283359, 284361, 285944, 287714, 289913, 292804, 295855, 298311, 300401, 303053, 306345, 309301, 311536, 314112, 318103]
60207C18103M986M819M352M426M698M653M629N021N347N030M427M247M406M348
60193C83492M056L864L517K421Q15k10j64J77j56j137k053k542k782k951k993
60178C83354k918k943l258l830m516n127n408n137m411l627l059k518j694p18
60164C34190j25k11n89n57J88J248J851J529O12M7M37J265J376M09o92q76l21
60147C39781k9k54j31R64K301K574J554M59N98J997L532M252M203L952L657L099
60131C72509K460K447L321M275M217K995J471N07K72M77Q29J168J430J591J555
60116D01524J251Q92Q98J246J274N39m15p57n54n50q93j053r45j198j975k474
60100C96810k206j922k469l403l579k824k063j926k094k092j964j846j504p30
$$ y = [318103, 323089, 327908, 332260, 336686, 341384, 346037, 350666, 355687, 361034, 366064, 370491, 374738, 379144, 383492, 387548, 391412, 394929, 397350, 398165, 397955, 397791, 397968, 397812, 396675, 394622, 392080, 389298, 386347, 383354, 380436, 377493, 374235, 370405, 365889, 360762, 355354, 350217, 345806, 342179, 339120, 336602, 334908, 334190, 334065, 333854, 333265, 332708, 332896, 334144, 335995, 337524, 338136, 338183, 338620, 339885, 341261, 341670, 340978, 340102, 339781, 339752, 339498, 339367, 340331, 342632, 345206, 346760, 347219, 347817, 349814, 353346, 357598, 361801, 365753, 369410, 372509, 374969, 377416, 380737, 385012, 389229, 392224, 393695, 394202, 394474, 394951, 395780, 396948, 398378, 399969, 401524, 402775, 403667, 404565, 405811, 407085, 407624, 407209, 406452, 405898, 405348, 404455, 403402, 402457, 401259, 399284, 396810, 394604, 392682, 390213, 386810, 383231, 380407, 378344, 376418, 374324, 372232, 370268, 368422, 366918, 366188]
60086C66188J31M68J41l57m66j24L19N69O07M64Q0m26o17k31K46L5q96j784k204
60067C62143k655l622m635m872m383l986m078m237m004l483k963k412j684r25
60053C14204m57l75m47m11k28J7L88J104K135K944K999K609K754L873N155N470
60037C41734M728L865L643L946M197L987L235K182J366J288J921K607K563J414
60023C82676n32k432l529l914m489n863p531q544q742q746q863q724q048p069
60009B95650o052m959l863l157k971k853k374j714j247r56o39l87l97m93l17J20
59993B63391M51M69L31K37K76N24J065J793K404K612K371J928J695J881K194K048
59977B85670J222J67n11o62o03o91j056j578j939j866j423r49n83j62L07M40j2
$$ y = [366188, 366319, 366787, 366928, 366571, 366105, 365981, 366300, 366869, 367476, 367940, 368020, 367594, 366977, 366746, 366992, 367027, 366131, 364347, 362143, 359488, 355866, 351231, 346359, 341976, 337990, 333912, 329675, 325671, 322188, 319225, 316813, 315129, 314204, 313747, 313372, 312925, 312514, 312286, 312303, 312691, 313795, 315930, 318874, 321873, 324482, 327236, 331109, 336264, 341734, 346462, 350327, 353970, 357916, 362113, 366100, 369335, 371517, 372883, 374171, 376092, 378699, 381262, 382676, 382144, 379712, 376183, 372269, 367780, 361917, 354386, 345842, 337100, 328354, 319491, 310767, 302719, 295650, 289598, 284639, 280776, 277619, 274648, 271795, 269421, 267707, 266460, 265504, 264865, 264478, 264081, 263588, 263271, 263391, 263842, 264311, 264642, 264879, 265155, 265679, 266744, 268537, 270941, 273553, 275924, 277852, 279547, 281428, 283622, 285670, 286892, 287059, 286548, 285886, 285283, 284592, 283536, 281958, 280019, 278153, 276730, 275781, 275198, 275036, 275343, 275783, 275771]
59960B75771p19j200j334j145m60P15J744J903J277N89J91j34m62m68o2L02K59
59943B76767K7L8L57P08P78M00k83p50n75K6N06Q75J627K752L523L705M210N922
59925C00613Q382J0280J0895J0352Q837O387L356L54k348m762o681p744q026p895
59911C22000p284n878m053k871k766k934k436j365m33R5N68J276K115K741K750
59896C01525K009J058P96J443K137K082J673J882K820L684M074M540N531O529
59882C41783O700O086N587N776O151N765M445L092K637K873K642J256o15j705
59868C92473j536p67l27n45j001r98k17Q94J571J760K314L815N521O120N319L961
59852D18357K688J305k87j477j715j347j052r30p13n78j079k346l924n445o919
$$ y = [275771, 275052, 273852, 272518, 271373, 270913, 271628, 273372, 275275, 276552, 277141, 277332, 277198, 276736, 276268, 276206, 276508, 276767, 276794, 276832, 277189, 277897, 278675, 279075, 278792, 278042, 277467, 277493, 277999, 278874, 280501, 283253, 286776, 290481, 294691, 300613, 308995, 319275, 330170, 340522, 349359, 355746, 359102, 359456, 357108, 352346, 345665, 337921, 329895, 322000, 314716, 308838, 304785, 301914, 299148, 296214, 293778, 292413, 291980, 292075, 292643, 293919, 296034, 298775, 301525, 303534, 304592, 305388, 306831, 308968, 311050, 312723, 314605, 317425, 321109, 325183, 329723, 335254, 341783, 348483, 354569, 360156, 365932, 372083, 377848, 382293, 385385, 388022, 390895, 393537, 394793, 394178, 392473, 390937, 390170, 389843, 389298, 388297, 387299, 387082, 387976, 389547, 391307, 393621, 397436, 402957, 409077, 414396, 418357, 421045, 422350, 422063, 420586, 418871, 417524, 416472, 415542, 414829, 414251, 413172, 410826, 406902, 401457, 394538]
59837C94538q239q820q104o220l955k087q19K22J516L119M535N160M921M397M186
59822C84350M171L608K110K95q52j235j799l225m945n788n388m423l683l431l602
59807C56163m049m438m406l965l468l072k625k162j999k188k348k294k346k684
59793C14119k840k306j337o14l11J8O74J319J409P65l09j355k067k284j836o42
59777C02403R09J989K171K048K494L379L715L079K140J593J313J006R14J322J933
59762C32408K341K600K786K551J749J014R72J289J275R87R54J213J491K000L033
59747C58663M033M122L438K896K751K500K173K450L267L579K953K242K177K328
59733C99572K135J908K010J964J321O40O61J087J228J241J649K022J367k39j556
$$ y = [394538, 386299, 377479, 369375, 363155, 359200, 357113, 356294, 356516, 358032, 361151, 365686, 370846, 375767, 380164, 384350, 388521, 392129, 394239, 394534, 393682, 392447, 390648, 387423, 382478, 376690, 371302, 366879, 363196, 359765, 356163, 352114, 347676, 343270, 339305, 335837, 332765, 330140, 327978, 325979, 323791, 321443, 319149, 316803, 314119, 311279, 308973, 307636, 307022, 306711, 306729, 307403, 308722, 310131, 310896, 310587, 309232, 307165, 304881, 303045, 302403, 303312, 305301, 307472, 309520, 312014, 315393, 319108, 322187, 324327, 325920, 327233, 328239, 329153, 330475, 332408, 334749, 337349, 340135, 342686, 344435, 345449, 346421, 347710, 348985, 349972, 350926, 352139, 353630, 355630, 358663, 362696, 366818, 370256, 373152, 375903, 378403, 380576, 383026, 386293, 389872, 392825, 395067, 397244, 399572, 401707, 403615, 405625, 407589, 408910, 409550, 410211, 411298, 412526, 413767, 415416, 417438, 418805, 418566, 417010]
59718D17010j834j598j581j761j816j772j789j805j803j973k249k117j328n10
59704C93074n59j563k687l134k913k543k325k118j754j306q78l55L04O71K20q71
59688C71263j716j801j618j837k184j801o60J29l57j711k797l147l246l547l820
59673C41150l688l345l243l269k844j994j657k473l653l769k562j252r78j522
59659C04901j895j591q09R5Q50J176J001O86O77R89J319J521J600J404P94R8j38
59642C12678O3L4n91j270j235n52l1j05k47K77J311J910J507O07O3m5m12j405
59624C12557k515k977k634j932j362j121j173j304j260r71o39m54l31m8M58J048
59608B95342J531J786J810J752J755J741J528J131P44M29J80K33Q77J818K232
$$ y = [417010, 415176, 413578, 411997, 410236, 408420, 406648, 404859, 403054, 401251, 399278, 397029, 394912, 393584, 393074, 392515, 390952, 388265, 385131, 382218, 379675, 377350, 375232, 373478, 372172, 371294, 370939, 371243, 371914, 372134, 371263, 369547, 367746, 366128, 364291, 362107, 360306, 359646, 359775, 359418, 357707, 354910, 351763, 348517, 344970, 341150, 337462, 334117, 330874, 327605, 324761, 322767, 321110, 318637, 314984, 311215, 308653, 307401, 306423, 304901, 303006, 301415, 300606, 300701, 301551, 302727, 303728, 304414, 305091, 306080, 307399, 308920, 310520, 311924, 312718, 312816, 312678, 312741, 312775, 312184, 310914, 309679, 309127, 309096, 308991, 308744, 309021, 310332, 312242, 313749, 314356, 314419, 314374, 313962, 312557, 310042, 307065, 304431, 302499, 301137, 300016, 298843, 297539, 296279, 295308, 294669, 294215, 293884, 293836, 294294, 295342, 296873, 298659, 300469, 302221, 303976, 305717, 307245, 308376, 309120, 309549, 309729, 309962, 310839, 312657, 314889]
59593C14889J809J243J335J936K214J628L10j265k490k836k328j698j571j754
59579C11422j733j577j692j908j611q01k26k68l81l5L56J3j025j817j618p30j00
59562B96269k07n40k93N44J130R21M24M48R39J204J052J037J530K189K557K649
59546C11853K705K869L316M315N788P269Q620J0349J2743J4948J5422J3341R232
59533D22770M330l75m477p911j0574j2068j1871r904o874l850j488J93J323J780
59519C61004J484Q17M08M38M48o1j033k046k855l466l809l740l420l284l539m002
59503C33344m444m764m738m110l133k506k478k475j976j249p63l64L37J114J380
59488C03175J094P57O33N93O13P89R77J018J175J768K530L021L395L940M074K984
$$ y = [314889, 316698, 317941, 319276, 321212, 323426, 325054, 325364, 324099, 321609, 318773, 316445, 314747, 313176, 311422, 309689, 308112, 306420, 304512, 302901, 302100, 301874, 301606, 301225, 301190, 301546, 301559, 300534, 298717, 297099, 296369, 296269, 296062, 295522, 295229, 295773, 296903, 297824, 298248, 298696, 299635, 300839, 301891, 302928, 304458, 306647, 309204, 311853, 314558, 317427, 320743, 325058, 330846, 338115, 346735, 357084, 369827, 384775, 400197, 413538, 422770, 427100, 426725, 422248, 414337, 403763, 391695, 379824, 369920, 363046, 359196, 357708, 357901, 359224, 361004, 362488, 363305, 363713, 364151, 364599, 364538, 363505, 361459, 358604, 355138, 351329, 347589, 344169, 340885, 337346, 333344, 328900, 324136, 319398, 315288, 312155, 309649, 307171, 304696, 302720, 301471, 300708, 300344, 300681, 301795, 303175, 304269, 305026, 305659, 306252, 306865, 307654, 308631, 309649, 310824, 312592, 315122, 318143, 321538, 325478, 329552, 332536]
59472C32536J129K0K23P37P13N79R10J337J423J626K347K823K080N59k78K93J748
59455C50805L353M679N290M880L929L492M070N106N692N383M325K974J731N73
59441D06282q72k602l939m303m027l897m139m392m472m495m348l674k473j215
59427C57434k85L00P41J366K515M068N337N974O700Q375J0645J2425J3632J5340
59413D44567J7919K0049K0104J7757J3674Q416K441l277p536r760j0062q682n889
59400D99721k368Q41K861L210J623j887o714j1655j5482j7540j7913j7087j5455
59387D02155j3098j0130p086m642k927j426J98J592K269K429K741L396L812L441
59373C82724K617K242K696L355L413K979K879L389L786L535L257L807M770M925
$$ y = [332536, 333665, 333685, 333908, 334645, 335358, 335937, 336847, 338184, 339607, 341233, 343580, 346403, 348483, 349042, 348764, 349057, 350805, 354158, 358837, 364127, 369007, 372936, 376428, 380498, 385604, 391296, 396679, 401004, 403978, 405709, 406282, 405410, 402808, 398869, 394566, 390539, 386642, 382503, 378111, 373639, 369144, 364796, 361122, 358649, 357434, 357149, 357449, 358190, 359556, 362071, 366139, 371476, 377450, 384150, 392525, 403170, 415595, 429227, 444567, 462486, 482535, 502639, 520396, 534070, 542486, 544927, 541650, 534114, 524354, 514292, 505610, 499721, 497353, 498194, 501055, 504265, 505888, 504001, 497287, 485632, 470150, 452610, 434697, 417610, 402155, 389057, 378927, 371841, 367199, 364272, 362846, 363044, 364636, 366905, 369334, 372075, 375471, 379283, 382724, 385341, 387583, 390279, 393634, 397047, 400026, 402905, 406294, 410080, 413615, 416872, 420679, 425449, 430374]
59359D30374M182L879M787N805N447L906K725K869L989N359O597P380P366O687
59345E01352O040N961O320O634O528N837M673L483K728K355J922J197K38j110
59331E54158l171n663p596q394q624r108r708r635q682p488o552n725m759l765
59317D55288k832j650O7K072L866N298O628Q061R529J0742J1173J0092P040K408
59303E27782k623o936j0143j2501j4269j5313j5286j4062j2024r815p847o169
59291D00794m833m101m051m172l771k782j812j316j093p49k76P4K38L61N50Q25
59275C73886J156J439J635K068L260N138O837P661P998Q624R359R135P502N308
59261D51006L584K330Q71j045k956m324m984n095n021n148n535n802n611n143
$$ y = [430374, 434556, 438435, 443222, 449027, 454474, 458380, 461105, 463974, 467963, 473322, 479919, 487299, 494665, 501352, 507392, 513353, 519673, 526307, 532835, 538672, 543345, 546828, 549556, 551911, 553833, 555030, 555268, 554158, 550987, 545324, 537728, 529334, 520710, 511602, 501894, 492259, 483577, 476089, 469537, 463812, 459053, 455288, 452456, 450806, 450873, 452945, 456811, 462109, 468737, 476798, 486327, 497069, 508242, 518334, 525374, 527782, 525159, 518223, 508080, 495579, 481310, 465997, 450711, 436649, 424625, 414810, 406963, 400794, 395961, 391860, 387809, 383637, 379866, 377084, 375272, 373956, 372863, 372114, 371838, 371912, 372150, 372511, 373061, 373886, 375042, 376481, 378116, 380184, 383444, 388582, 395419, 403080, 411078, 419702, 429061, 438196, 445698, 451006, 454590, 456920, 457791, 456746, 453790, 449466, 444482, 439387, 434366, 429218, 423683, 417881, 412270, 407127]
59247D07127m806m538l883k763j755j352j212n17J032K800L900M087L900L985
59233D06005M435M809M675L993L033K085J237L47p63j918k536k222j445j197j864
59218D18674k741k974k606k286k200j889j122l24O9J58K20J37l65j127j630j620
59202C98374j322j038q49p46q23j127j493j618j356q37l79k47m28o51o78n74o05
59185C83603q72j165j193q47k03O31J532K345K930L236L331L376L574L965M260
59170D08503M071L474L137L650M793N754O093O170O515P043P157O485N282M131
59156D82258L403K955K233P33j462l592m877n274n379n631n909n990o016o232
59142D41220o487o420o103o062o576p282p642p499o960o058m898l900l517l679
$$ y = [407127, 402321, 397783, 393900, 391137, 389382, 388030, 386818, 386301, 387333, 390133, 394033, 398120, 402020, 406005, 410440, 415249, 419924, 423917, 426950, 429035, 430272, 430619, 429856, 427938, 425402, 423180, 421735, 420538, 418674, 415933, 412959, 410353, 408067, 405867, 403978, 402856, 402532, 402601, 402759, 402979, 403116, 402751, 401624, 399994, 398374, 397052, 396014, 395165, 394419, 393596, 392469, 390976, 389358, 388002, 387165, 386786, 386539, 386111, 385460, 384782, 384208, 383603, 382731, 381566, 380373, 379526, 379323, 379954, 381486, 383831, 386761, 389997, 393328, 396704, 400278, 404243, 408503, 412574, 416048, 419185, 422835, 427628, 433382, 439475, 445645, 452160, 459203, 466360, 472845, 478127, 482258, 485661, 488616, 490849, 491582, 490120, 486528, 481651, 476377, 470998, 465367, 459458, 453468, 447452, 441220, 434733, 428313, 422210, 416148, 409572, 402290, 394648, 387149, 380189, 374131, 369233, 365333, 361816, 358137]
59128C58137l804l409k435j060M53J745K590L270M262N423N960N587N177N803
59114C87699P316Q530Q690Q167P676P390P074O610O050N424M828M497M511M479
59100D78941L801K321O30l69l04K77M31j37q05r44p97j016j584j847j612j458
59084D75528j767k109k071k086k820m086n009n203n145n369n804o051o013o001
59070D15994o313o829p022o498n502m657m116l400k249j233j049j506j769j498
59056C62353j171j204j313r18R7J260J928J761R81K23k2J27J47k71q77j131p00
59039C61270K14R56J056Q44J112K025K806K804K417K420K867L309L744M503N374
59024C97721N730N646O005P269Q815R759R848R288Q342P358O628N936M736L029
$$ y = [358137, 354333, 350924, 348489, 347429, 347882, 349627, 352217, 355487, 359749, 365172, 371132, 376719, 381896, 387699, 395015, 403545, 412235, 420402, 428078, 435468, 442542, 449152, 455202, 460626, 465454, 469951, 474462, 478941, 482742, 485063, 485693, 485324, 485020, 485297, 485728, 485591, 484786, 483842, 483045, 482029, 480445, 478598, 476986, 475528, 473761, 471652, 469581, 467495, 464675, 460589, 455580, 450377, 445232, 439863, 434059, 428008, 421995, 415994, 409681, 402852, 395830, 389332, 383830, 379173, 375057, 371657, 369408, 368175, 367126, 365620, 363851, 362353, 361182, 359978, 358665, 357747, 357844, 359104, 361032, 362793, 363774, 363997, 363975, 364102, 364249, 363978, 363101, 361970, 361270, 361484, 362440, 363496, 364340, 365452, 367477, 370283, 373087, 375504, 377924, 380791, 384100, 387844, 392347, 397721, 403451, 409097, 415102, 422371, 431186, 440945, 450793, 460081, 468423, 475781, 482409, 488345, 493081, 496110]
59010D96110J450L19p54j941k721k728k403k121j420J77K121L500M302N103N799
58995E04793N690M686L495K549J590N23k01l96o15j344k258k740k833l171m078
58980E05690n058n229m177k413r98m80l03N53K365M395N786O384O566O692O894
58965E26667P142P321P370P415P586P645P075N698L920K270Q79m10j729l229n137
58950E80483p415r489j0671j0892j0667j0364r867r060q279p886p635o963n899
58937D65396n218n411n887n580m173k348r55l40m23r24j370j316p68j46L11P42
58921D31590J195J393J274J270J692K178K220J953J976K506L187L608L659L483
58907D63184L395L689M307M897N415O243P311P749P027N977N722N954N461M202
$$ y = [496110, 497560, 497879, 497125, 495184, 492463, 489735, 487332, 485211, 483791, 483968, 486089, 489589, 493891, 498994, 504793, 510483, 515169, 518664, 521213, 522803, 523326, 523125, 522729, 522114, 520770, 518512, 515772, 512939, 509768, 505690, 500632, 495403, 491226, 488813, 487815, 487335, 487032, 487585, 489950, 494345, 500131, 506515, 513081, 519773, 526667, 533809, 541130, 548500, 555915, 563501, 571146, 578221, 583919, 587839, 590109, 590988, 590578, 588849, 585620, 580483, 573068, 563579, 552908, 542016, 531349, 520985, 511118, 502058, 493779, 485893, 478258, 471295, 465396, 460178, 454767, 448880, 443300, 439127, 436779, 435824, 435484, 435061, 434137, 432767, 431451, 430683, 430537, 430848, 431590, 432785, 434178, 435452, 436722, 438414, 440592, 442812, 444765, 446741, 449247, 452434, 456042, 459701, 463184, 466579, 470268, 474575, 479472, 484887, 491130, 498441, 506190, 513217, 519194, 524916, 530870, 536331, 540533]
58893E40533L621M605O415Q077R694J1609J3327J4303J5058J6303J7394J6904
58881F77843J4654J1983R928Q072N604K633n5k028l501m956o828r249j1729j3351
58867F79020j3639j3054j2357j1683j0650r250q080p625p678p713p587p598p932
58854E54174q401q723q923r313j0113j1100j1614j1006r294p365o238o062o063
58841D39959n603m927m571m452m119l756m136n370o399o193n011l930l396k915
58827C75181k067j144n51p2P56J813K405K117J406J088J500K291K999L458L636
58812C94816L398K717J989J762K144K687K876K533J768Q06p2o85j112j553j968
58797D12106k205k413k980l843m342m051l412l101l041k567j452k92K79L23M52
$$ y = [540533, 544154, 548759, 555174, 563251, 572945, 584554, 597881, 612184, 627242, 643545, 660939, 677843, 692497, 704480, 714408, 722480, 728084, 730717, 730662, 728634, 725133, 720177, 713349, 704100, 692371, 679020, 665381, 652327, 639970, 628287, 617637, 608387, 600307, 592682, 585004, 577291, 569704, 562106, 554174, 545773, 537050, 528127, 518814, 508701, 497601, 485987, 474981, 465687, 458322, 452084, 446022, 439959, 434356, 429429, 424858, 420406, 416287, 412531, 408395, 403025, 396626, 390433, 385422, 381492, 378096, 375181, 373114, 371970, 371419, 371347, 372103, 373916, 376321, 378438, 379844, 380932, 382432, 384723, 387722, 391180, 394816, 398214, 400931, 402920, 404682, 406826, 409513, 412389, 414922, 416690, 417496, 417424, 416739, 415627, 414074, 412106, 409901, 407488, 404508, 400665, 396323, 392272, 388860, 385759, 382718, 380151, 378699, 378407, 378686, 379009, 379461]
58782C79461J158K451L930N126N839O211O363O140N347M078K571Q02j391l836
58768D24250n943p230p648p437o950o608o634o667o024m574l104k515k774k959
58754C47183k194m59J496K839L334L420L593L817L763L535L644M182M524M260
58740C86937L908M173M855N143M834M534M640M865M920M999N268N471N450N505
58726D55502N787N760M901L570K639K385K446K668L276M141M626M461M261M765
58712E11188N896O865O989O223N043M000L182K075J99k082l893n018o223q075
58698E26369j0048j1290j1862j2542j3583j4340j4159j3083j1657j0337r252q229
58686C85987p093n982n254m895m383l490k780k770k986k575j633j057j119j135
$$ y = [379461, 380619, 383070, 387000, 392126, 397965, 404176, 410539, 416679, 422026, 426104, 428675, 429477, 428086, 424250, 418307, 411077, 403429, 395992, 389042, 382434, 375800, 369133, 363109, 358535, 355431, 352916, 350142, 347183, 344989, 344530, 346026, 348865, 352199, 355619, 359212, 363029, 366792, 370327, 373971, 378153, 382677, 386937, 390845, 395018, 399873, 405016, 409850, 414384, 419024, 423889, 428809, 433808, 439076, 444547, 449997, 455502, 461289, 467049, 471950, 475520, 478159, 480544, 482990, 485658, 488934, 493075, 497701, 502162, 506423, 511188, 517084, 523949, 530938, 537161, 542204, 546204, 549386, 551461, 551660, 549578, 545685, 540667, 534444, 526369, 516321, 505031, 493169, 480627, 467044, 452704, 438545, 425462, 413805, 403468, 394216, 385987, 378894, 372912, 367658, 362763, 358380, 354890, 352110, 349340, 346354, 343779, 342146, 341089, 339970, 338835]
58672C38835o35Q8Q55K061L779N293O185P118Q746J0414J0806R630P785O008M158
58657D21126J801j008l683n426n792n267m982n442n815n089l546k458k429k886
58643C69104l086k846k278j611j364j887k580k362j070L08J046J413J786J957
58629C56530J856K012K564K600J433j07o14j3N18L24j5K46J152K419L832N002
58613C79739N360M766L696K678J906J478J501J759J804J527J239J001M15o82j812
58598D06375k434k574k470k067j273m47p6j35j10L15R67J544K022K708L925N551
58582D11821O856P111O438N705N376N003M115L177L027L719M524M954N178N539
58568D82543O243P476R253J1115J2522J3595J4859J6306J7408J8143J9112K0289
$$ y = [338835, 338200, 338288, 339143, 341204, 344983, 350276, 356461, 363579, 372325, 382739, 393545, 403175, 410960, 416968, 421126, 422927, 421919, 418236, 412810, 407018, 401751, 396769, 391327, 385512, 380423, 376877, 374419, 371990, 369104, 366018, 363172, 360894, 359283, 357919, 356032, 353452, 351090, 350020, 350328, 351374, 352787, 354573, 356530, 358386, 360398, 362962, 365562, 366995, 366888, 366274, 366261, 366779, 367103, 367088, 367334, 368486, 370905, 374737, 379739, 385099, 389865, 393561, 396239, 398145, 399623, 401124, 402883, 404687, 406214, 407453, 408454, 408869, 408187, 406375, 403941, 401367, 398897, 396830, 395557, 395110, 395034, 394899, 394789, 395104, 396071, 397615, 399637, 402345, 406270, 411821, 418677, 425788, 432226, 437931, 443307, 448310, 452425, 455602, 458629, 462348, 466872, 471826, 477004, 482543, 488786, 496262, 505515, 516630, 529152, 542747, 557606, 573912, 591320, 609463, 628575, 648864]
58556F48864K0504J8893J6191J3670J1328Q105L773m52l359m999o067o759o887
58543G12805o708o958q044r661j1275j2703j4034j5257j6203j6728j6761j6152
58531E62321j4734j2665j0534q906p798o851n930n257m847m259l143j844j039
58518D74514r30j094j173j247j447j480r47K3P13N72j52o48m85p3j28p47j312
58501D63959j244o29RL16L12J49j06m87r94j459j525r02L27J770L087M136M768
58484D71487M858M652M709N290O030O519O901P632Q785R995J0859J1092J0441
58471E69250Q813O489L928J450p05k232l008l349l593l569k877j613l76M62J075
58456E70145J795K707L724M697N449N912O210O342N941M652K617K46k323m984
$$ y = [648864, 669368, 688261, 704452, 718122, 729450, 737555, 741328, 740876, 737517, 732518, 726451, 719692, 712805, 706097, 699139, 691095, 681434, 670159, 657456, 643422, 628165, 611962, 595234, 578473, 562321, 547587, 534922, 524388, 515482, 507684, 500833, 494903, 489646, 484799, 480540, 477397, 475553, 474514, 473584, 472490, 471317, 470070, 468623, 467143, 466196, 466219, 466932, 467504, 467352, 466704, 466219, 466146, 466018, 465271, 463959, 462715, 462086, 462095, 462411, 462723, 462872, 462766, 462279, 461285, 459826, 458301, 457399, 457726, 459496, 462583, 466719, 471487, 476345, 480997, 485706, 490996, 497026, 503545, 510446, 518078, 526863, 536858, 547717, 558809, 569250, 578063, 584552, 588480, 589930, 589225, 586993, 583985, 580636, 577043, 573474, 570597, 568984, 568608, 569070, 570145, 571940, 574647, 578371, 583068, 588517, 594429, 600639, 606981, 612922, 617574, 620191, 620437, 618114, 613130]
58442F13130p211q398q671q635q351p326n578l966l080k521j610k86J138K507
58428E51142L738M611N173N888O949P872Q128P847P436O923O128N133M030K562
58414F33560N85j393k784l751m859n944o088m908l244k293k384k844k846k152
58400E88655j127j93O25J587K738L781M454M805M902M628L960L293L143L629M382
58385F33262M855M616L557K014N37n32j153j308j013n79l95l22J18Q77J364J560
58369F47458K338M079N766O209N667N303N545N970O548P768R412J0351R957Q946
58355G41317Q360Q340Q270P612O156M030J925R55J630L094L968L882L798M650
58341H07987O191P486Q215Q930R982J0899J1236J1471J2317J3382J3483J2362
$$ y = [613130, 605919, 597521, 588850, 580215, 571864, 564538, 558960, 554994, 551914, 549393, 547783, 547497, 548635, 551142, 554880, 559491, 564664, 570552, 577501, 585373, 593501, 601348, 608784, 615707, 621835, 626968, 630998, 633560, 634145, 632752, 629968, 626217, 621358, 615414, 609326, 604418, 601174, 598881, 596497, 593653, 590807, 588655, 587528, 587335, 587960, 589547, 592285, 596066, 600520, 605325, 610227, 614855, 618815, 622108, 625251, 628880, 633262, 638117, 642733, 646290, 648304, 648841, 648309, 647156, 645848, 644835, 644256, 643861, 643539, 643657, 644534, 645898, 647458, 649796, 653875, 659641, 665850, 671517, 676820, 682365, 688335, 694883, 702651, 712063, 722414, 732371, 741317, 749677, 758017, 766287, 773899, 780055, 784085, 786010, 786965, 788595, 791689, 795657, 799539, 803337, 807987, 814178, 821664, 829879, 838809, 848791, 859690, 870926, 882397, 894714, 908096, 921579, 933941]
58329I33941J1163J0777J0644R860Q755Q416R016R532R062P708O127M849M113
58316A043963L957M279N014O181P594Q801R555J0081J0625J1157J1762J2834J4351
58303A160154J5547J5876J5915J6542J7671J8465J8558J8197J7540J6596J5708
58292A346769J5332J5417J5642J6066J6906J7938J8850J9883K1348K2853K3834
58281A550838K4486K5240K5719K5389K4916K5607K7541K9536L1011L2597L4747
58270A857627L7015L9052M1189M3579M5740M7374M8763N0167N1635N3559N6370
58259B372070N9543O1929O3341O4713O6471O7948O8765O9647P1326P3650P6258
58248C115661P9193Q2440Q5837Q9821R5225J01940J08800J15168J21568J28417
$$ y = [933941, 945104, 955881, 966525, 976385, 985140, 993556, 1002572, 1012104, 1021166, 1028874, 1035001, 1039850, 1043963, 1047920, 1052199, 1057213, 1063394, 1070988, 1079789, 1089344, 1099425, 1110050, 1121207, 1132969, 1145803, 1160154, 1175701, 1191577, 1207492, 1224034, 1241705, 1260170, 1278728, 1296925, 1314465, 1331061, 1346769, 1362101, 1377518, 1393160, 1409226, 1426132, 1444070, 1462920, 1482803, 1504151, 1527004, 1550838, 1575324, 1600564, 1626283, 1651672, 1676588, 1702195, 1729736, 1759272, 1790283, 1822880, 1857627, 1894642, 1933694, 1974883, 2018462, 2064202, 2111576, 2160339, 2210506, 2262141, 2315700, 2372070, 2431613, 2493542, 2556883, 2621596, 2688067, 2756015, 2824780, 2894427, 2965753, 3039403, 3115661, 3194854, 3277294, 3363131, 3452952, 3548177, 3650117, 3758917, 3874085, 3995653, 4124070]
58238D124070J35393J42562J50781J60352J70434J80535J91481K04219K18708
58229E678535K34630K52133K71306K91967L14509L39888L68292L99083M32536
58220H582879M70201N13037N60737O13521O72979P40294Q15341Q98489R91822
58211A4859300J097899J219294J360473J528601J731645J977963K279318K652730
58203B8707223L118643L699896M423417N318435O408359P705875R220975J0976470
58195G9579293J3015921J5395937J8164029K1321358K4763099K8195636L1061420
58188B31496693L2546665L1750966K8007664K1202096J1889481J148602r704561
58181C48337606j9382333k6831058l1418433l3071436l2252045k9735605k6319847
$$ y = [4124070, 4259463, 4402025, 4552806, 4713158, 4883592, 5064127, 5255608, 5459827, 5678535, 5913165, 6165298, 6436604, 6728571, 7043080, 7382968, 7751260, 8150343, 8582879, 9053080, 9566117, 10126854, 10740375, 11413354, 12153648, 12968989, 13867478, 14859300, 15957199, 17176493, 18536966, 20065567, 21797212, 23775175, 26054493, 28707223, 31825866, 35525762, 39949179, 45267614, 51675973, 59381848, 68602823, 79579293, 92595214, 107991151, 126155180, 147476538, 172239637, 200435273, 231496693, 264043358, 295794324, 323801988, 345004084, 356893565, 358042167, 348337606, 328955273, 302124215, 270705782, 237634346, 205382301, 175646696, 149326849]
58174A49326849k2632525j9085087j5904324j3177318j0899281r023424p493978
58167E1110912o254710n250214m432740l766514l222956k775867k403615k091536
58159B0912760j828833j605592j414382j251122j111856r91002q84315p90846
58151A1034812p10185o40132n78655n25668m81070m42932m09273l79749l54091
58142F513057l30699l08353k87584k68858k50975k32881k15705k01178j89141
58133D227683j78094j67356j57173j47418j37721j28446j20401j13709j07808
58124B969557j02263r6967r1921q7295q3274p9549p5508p1297o7882o5638o3645
58113B084318o0856n7406n4198n1765m9931m8142m5871m3103m0531l8752l7336
$$ y = [149326849, 126694324, 107609237, 91704913, 78527595, 67628314, 58604890, 51110912, 44856202, 39605988, 35173248, 31406734, 28183778, 25407911, 23004296, 20912760, 19083927, 17478335, 16063953, 14812831, 13700975, 12709973, 11825658, 11034812, 10324627, 9684495, 9105840, 8580172, 8099102, 7656170, 7246897, 6867148, 6513057, 6182358, 5874005, 5586421, 5317563, 5066588, 4833707, 4618002, 4416824, 4227683, 4049589, 3882233, 3725060, 3577642, 3439921, 3311475, 3191074, 3077365, 2969557, 2867294, 2770327, 2678406, 2591111, 2507837, 2428288, 2352780, 2281483, 2213601, 2147963, 2084318, 2023462, 1966056, 1911858, 1860093, 1810162, 1762020, 1716149, 1673046, 1632515, 1593763, 1556427]
58102A556427l5462l3274l1639l0602k9268k7348k5672k4806k4356k3955k3860
58091A246185k4076k3947k3133k2011k0805j9330j8003j7860j8974j9985j9839
58080A018222j9018j8435j8161j7992j8149j8632j8797j8339j7794j7393j6490
58069H19022j4873j3514j3090j2771j1583r985r009q660q364q204q513q895q856
58056F82705q819r361j0002r947r526r622j0116j0113r421q623p906o985n978
58043E66286n247m603l682k970l285m406n279n495n492n479n258n103n544o273
58029D98170o410n982n959o597o937o370n549n227n166m850m477m494m747m761
58015D20644m482m203m009l756l339k725j928j170q21r93j388j596j406q59k78
$$ y = [1556427, 1520965, 1487691, 1456052, 1425450, 1396182, 1368834, 1343162, 1318356, 1294000, 1270045, 1246185, 1222109, 1198162, 1175029, 1153018, 1132213, 1112883, 1094880, 1077020, 1058046, 1038061, 1018222, 999204, 980769, 962608, 944616, 926467, 907835, 889038, 870699, 852905, 835512, 819022, 804149, 790635, 777545, 764774, 753191, 743206, 734197, 725537, 717173, 708969, 700456, 691561, 682705, 673886, 664525, 654523, 644576, 635050, 625428, 615312, 605199, 595778, 587155, 579249, 572264, 566286, 561039, 556436, 552754, 549784, 546499, 542093, 536814, 531319, 525827, 520348, 515090, 509987, 504443, 498170, 491760, 485778, 479819, 473222, 466285, 459915, 454366, 449139, 443973, 439123, 434646, 430152, 425405, 420644, 416162, 411959, 407950, 404194, 400855, 398130, 396202, 395032, 394211, 393218, 391830, 390234, 388828, 387969, 387691]
58000C87691j05l50m68j27J73j78q88j283j572k573m177n180m949m241l883l597
57984C54293k793j774j337j605k003k143k132k163k315k675l234l735l900l761
57970C18723l483l051k369j572r47o12m56l18j13J31K84K33l2m88j176j990k494
57953C00270k287j518p26k12R0K00P6J7N13J526K365K572K470K577K846K876K602
57936C16257K414K668L282L719L385K232R96M68M75oj526l425m691n132n264n356
57920C10496n204m766m512m858n518n666m830l447k410k058j927j531j017p21
57906B62031m93M5P68J242J431J602J611J053J75j62L49J091J563K006K620K964
57890B79896K696K286K316K560K464K053J727J511J177Q52P67N94k34j537k448
$$ y = [387691, 387586, 387236, 386768, 386641, 386814, 386636, 385748, 384465, 382893, 380320, 376143, 370963, 366014, 361773, 357890, 354293, 351500, 349726, 348389, 346784, 344781, 342638, 340506, 338343, 336028, 333353, 330119, 326384, 322484, 318723, 315240, 312189, 309820, 308248, 307301, 306689, 306233, 305915, 305802, 305933, 306217, 306450, 306418, 305930, 304754, 302764, 300270, 297983, 296465, 295739, 295527, 295617, 295817, 295893, 295910, 296423, 297949, 300314, 302886, 305356, 307933, 310779, 313655, 316257, 318671, 321339, 324621, 328340, 331725, 333957, 334953, 335421, 335896, 335890, 334364, 330939, 326248, 321116, 315852, 310496, 305292, 300526, 296014, 291156, 285638, 279972, 275142, 271695, 269285, 267227, 265300, 263769, 262752, 262031, 261538, 261583, 262351, 263593, 265024, 266626, 268237, 269290, 269465, 269303, 269652, 270743, 272306, 274312, 276932, 279896, 282592, 284878, 287194, 289754, 292218, 294271, 295998, 297509, 298686, 299538, 300305, 300899, 300665, 299128, 296680]
57875B96680k490k126k103k633l336l675l422k829k331k003j609j190j160j482
57861B64291j367l47Q72J341J244J484K225K771K830K882L143L106K428J497P47
57846B89147Q9n45p72m10l8k46p75r48o56l30j70J1K96N50Q46J473K408L149L264
57827B96343K925K665K755K956K814K133J120N4j087k529m244n811o839p363p634
57812B78258p709p488p042o602o172n493m453l370k661k379k227j993j764j709
57798B17196j867k164k464k527k124j386q65r39j282j186m13O13J453K124K739
57783B06908L198L481L931M802N728O081N722M987M058K839J504O23N01P15N52
57768B55630k20j214j876j988j774j664j870k189k240j904j373q78n55m50m73
$$ y = [296680, 294190, 292064, 289961, 287328, 283992, 280317, 276895, 274066, 271735, 269732, 268123, 266933, 265773, 264291, 262924, 262577, 263449, 264790, 266034, 267518, 269743, 272514, 275344, 278226, 281369, 284475, 286903, 288400, 289147, 289236, 288691, 287919, 287509, 287471, 287225, 286450, 285502, 284846, 284516, 284346, 284357, 284653, 285203, 286049, 287522, 289930, 293079, 296343, 299268, 301933, 304688, 307644, 310458, 312591, 313711, 313765, 312678, 310149, 305905, 300094, 293255, 285892, 278258, 270549, 263061, 256019, 249417, 243245, 237752, 233299, 229929, 227268, 224889, 222662, 220669, 218905, 217196, 215329, 213165, 210701, 208174, 206050, 204664, 203799, 202860, 201578, 200392, 199979, 200592, 202045, 204169, 206908, 210106, 213587, 217518, 222320, 228048, 234129, 239851, 244838, 248896, 251735, 253239, 253862, 254363, 255078, 255630, 255410, 254196, 252320, 250332, 248558, 246894, 245024, 242835, 240595, 238691, 237318, 236440, 235885, 235435, 234962]
57753B34962l19K51J030J533J579J443J378J313J127R46Q62O19j33j276k221k485
57737B40609k159j756j625j585j227n45q2k91q77j068n02M04R07N37o93k203k968
57720B24876k257m76J050J450J138J047J382J597J289O42L9k63r6N37J260J554
57704B34769J358J143J263J526J571J445J473J656J560Q31l52j469k171k548k952
57689B39103l699m805n860o175n252l362j430j92M95J342K692M217N581P052R284
57674B38991J2597J6726K1167K5636L0181L4807L8873M0845L8923L2222K1355
57663E52323P932o322j9833l1063l8671m2084m1751l8743l4194k9070k4158k0001
57651B34365j6687j3820j0929q050n798m714m557m507m031l257k485j657o29L54
$$ y = [234962, 234643, 234894, 235924, 237457, 239036, 240479, 241857, 243170, 244297, 245243, 246105, 246724, 246591, 245315, 243094, 240609, 238450, 236694, 235069, 233484, 232257, 231712, 231630, 231339, 230462, 229394, 228892, 229296, 230203, 230740, 230047, 227844, 224876, 222619, 222143, 223193, 224643, 225781, 226828, 228210, 229807, 231096, 231738, 231777, 231514, 231418, 231955, 233215, 234769, 236127, 237270, 238533, 240059, 241630, 243075, 244548, 246204, 247764, 248595, 248243, 246774, 244603, 242055, 239103, 235404, 230599, 224739, 218564, 213312, 209950, 208520, 208328, 208823, 210165, 212857, 217074, 222655, 229707, 238991, 251588, 268314, 289481, 315117, 345298, 380105, 418978, 459823, 498746, 530968, 552323, 560255, 553933, 534100, 503037, 464366, 422282, 380531, 341788, 307594, 278524, 254366, 234365, 217678, 203858, 192929, 184879, 179081, 174367, 169810, 165303, 161272, 158015, 155530, 153873, 153244, 153598]
57637A53598Q39P47M63L33L57L59K39J2k76n33o86p46p94q99j107j418j685j653
57619A47150j238o85l51l87p21j210j657j820j663j436j332j246j049r10r63q88
57603A29594l21M08N56j2n79n67k23k8pj5l01j156k229k758k431j601p14J2L71
57584A17999K09j74j49M49R62O68l78j512k219k392k036j223l84j10m61q37p38
57567A07674m83p05j381j774j397n89O3M47P65R29O50J21O3Q67J959K333J624
57550A11166M13m44o02l62k05l02m49m01k16j66k96k72K19J023J642J728J342
57533A13818P54K35n0j13j79m28o61m53K18P79P52M24M28P59P51J26l67J39J400
57514A18332K261K028J149M43J47k7k96o25r25j038o76J98J005J024K12p43j301
$$ y = [153598, 154437, 155184, 155647, 155980, 156337, 156696, 156935, 156947, 156671, 156138, 155452, 154706, 153912, 153013, 151906, 150488, 148803, 147150, 145912, 145227, 144876, 144489, 143768, 142558, 140901, 139081, 137418, 135982, 134650, 133404, 132355, 131445, 130482, 129594, 129273, 129681, 130237, 130225, 129646, 129079, 128856, 128828, 128821, 128806, 128505, 127349, 125120, 122362, 119931, 118330, 117616, 117628, 117999, 118208, 118034, 117885, 118334, 119296, 119964, 119586, 118074, 115855, 113463, 111427, 110204, 109820, 109710, 109249, 108412, 107674, 107191, 106486, 105105, 103331, 101934, 101345, 101408, 101855, 102620, 103549, 104199, 104320, 104383, 105250, 107209, 109542, 111166, 111579, 111135, 110533, 110171, 109966, 109664, 109215, 108814, 108598, 108432, 108136, 107864, 108083, 109106, 110748, 112476, 113818, 114572, 114807, 114757, 114644, 114465, 114037, 113376, 112923, 113141, 113920, 114672, 115096, 115524, 116283, 117034, 117160, 116793, 116932, 118332, 120593, 122621, 123770, 124213, 124360, 124333, 124037, 123412, 122487, 121449, 120773, 120971, 121976, 123000, 123212, 122469, 121168]
57497A21168j565j828k042k028j908j955k170k261k012j390m53N97J337J444J059
57482A05993N75Q1o41j498j879j350l60J49k50j096j689j836j819j872j953j963
57466H8592j915j802j467q02J9O05P21N12L91P24J524K327K491J826Q67L22L01
57449I5236L47K13J22K25K78J39J68O93J395J712J643J527J239K95j123k000j716
57432A00393r03o15j034j420j216n96n7J68J96K68N35R56J341J602J851K155K291
57415A05915J930J027q3r07j108o91m4L48L59K48K29K18Q3q2j76k74m05m18k84
57396A05885k24k54lO35J014N09m67q99m29M39J239J908K278K062J545J463J895
57379A18596K063J569J055J121J348J081N43L81N10L17l24j002j549k054k234
$$ y = [121168, 119603, 117775, 115733, 113705, 111797, 109842, 107672, 105411, 103399, 102009, 101556, 102153, 103490, 104934, 105993, 106568, 106649, 106008, 104510, 102631, 101281, 100921, 101070, 100820, 99724, 98035, 96199, 94380, 92508, 90555, 88592, 86677, 84875, 83408, 82606, 82625, 83230, 83951, 84463, 84854, 85578, 87102, 89429, 91920, 93746, 94613, 94935, 95236, 95583, 95796, 95918, 96143, 96421, 96560, 96728, 97421, 98816, 100528, 102171, 103698, 104937, 105232, 104109, 102109, 100393, 99490, 98875, 97841, 96421, 95205, 94609, 94552, 94720, 94916, 95184, 95719, 96675, 98016, 99618, 101469, 103624, 105915, 107845, 108872, 108789, 107882, 106774, 106083, 106039, 106387, 106746, 106994, 107223, 107441, 107524, 107442, 107266, 106992, 106587, 106169, 105885, 105661, 105407, 105404, 106039, 107053, 107562, 107095, 106196, 105767, 106206, 107445, 109353, 111631, 113693, 115238, 116701, 118596, 120659, 122228, 123283, 124404, 125752, 126833, 127376, 127757, 128267, 128584, 128260, 127258, 125709, 123655, 121421]
57364A21421j605m01M92O34M49L93L64J71QJ40N05R05J231J366J220J033J190
57347A29516J562J486P01j39k46L04P92Q41P70R84J360J363P18j63n27j68K87
57330A39441K17j38o5N27R96Q91L94k02p56r39m35K77J63r17j739j321k68K24
57312A36350N9K5L13L38p5l06O9P48J216J249P67j22q50p49Q7R07J286J527J892
57293A44731K129K019J805J714J620J473J583K070K496K504K401K648L099L288
57279A75580L183L108L048K590J567L52n45q95q30p06q24j008o20O74K232K928
57263A89834K315J028J5l06j52O0J46K65O81J295J535J037K13j85lK61L59O62
57245A99060J426K244K602K630K801L155L300L086K784K634K671K936L404L660
$$ y = [121421, 119816, 119415, 119907, 120541, 120990, 121383, 121747, 121918, 121926, 122066, 122571, 123476, 124707, 126073, 127293, 128326, 129516, 131078, 132564, 133265, 133126, 132880, 133184, 133976, 134817, 135587, 136571, 137931, 139294, 140012, 139849, 139322, 139154, 139441, 139658, 139520, 139455, 139982, 140978, 141869, 142263, 142061, 141305, 140366, 139931, 140208, 140371, 139454, 137715, 136394, 136126, 136350, 136409, 136434, 136747, 137085, 137010, 136704, 136773, 137521, 138737, 139986, 140753, 140631, 139781, 139032, 139119, 140026, 141312, 142839, 144731, 146860, 148879, 150684, 152398, 154018, 155491, 157074, 159144, 161640, 164144, 166545, 169193, 172292, 175580, 178763, 181871, 184919, 187509, 189076, 189428, 188883, 187988, 187158, 186452, 185628, 184620, 184000, 184674, 186906, 189834, 192149, 193177, 193192, 192886, 192734, 192794, 192940, 193205, 193886, 195181, 196716, 197753, 197966, 197781, 197778, 198039, 198398, 199060, 200486, 202730, 205332, 207962, 210763, 213918, 217218, 220304, 223088, 225722, 228393, 231329, 234733, 238393]
57231B38393L213K339K010K691L680M132M236M739N558N800N173M502M573N087
57217B96126N324N269N445N894O051N611M998M842N292N997O458O421O076N944
57203C75748O341O961P195O873O441O418O942P842Q864R671R964R838R779J0156
57189D89033J0784J1221J1312J1256J1266J1386J1681J2344J3520J5063J6562
57178F25428J7588J7995J7992J7940J8052J8286J8521J8805J9320K0092K0820
57167H30839K1133K1046K0976K1192K1432K1313K0978K1009K1616K2362K2781
57156A066677K2965K3292K3868K4545K5232K5915K6532K7135K7988K9273L0827
57145A354249L2437L4144L6004L7764L9222M0653M2490M4700M6949M9206N1706
$$ y = [238393, 241606, 243945, 245955, 248646, 252326, 256458, 260694, 265433, 270991, 276791, 281964, 286466, 291039, 296126, 301450, 306719, 312164, 318058, 324109, 329720, 334718, 339560, 344852, 350849, 357307, 363728, 369804, 375748, 382089, 389050, 396245, 403118, 409559, 415977, 422919, 430761, 439625, 449296, 459260, 469098, 478877, 489033, 499817, 511038, 522350, 533606, 544872, 556258, 567939, 580283, 593803, 608866, 625428, 643016, 661011, 679003, 696943, 714995, 733281, 751802, 770607, 789927, 810019, 830839, 851972, 873018, 893994, 915186, 936618, 957931, 978909, 999918, 1021534, 1043896, 1066677, 1089642, 1112934, 1136802, 1161347, 1186579, 1212494, 1239026, 1266161, 1294149, 1323422, 1354249, 1386686, 1420830, 1456834, 1494598, 1533820, 1574473, 1616963, 1661663, 1708612, 1757818, 1809524]
57134A809524N4362N6689N8303N9135N9249N8811N8088N7161N5910N4913N5924
57123B438069O0546O8342P7174Q5554R4004J03968J16244J30677J46519J62568
57113C483665J77649J91494K04901K18984K34902K54445K79862L12569L52785
57104E711256M01022M59465N31503O20736P31136Q67555J035289J239169J483011
57095A3080142J768556K093800K452461K835495L232809L633686M026641M399021
57087C7522611M734822N011200N197089N254537N139653M804947M212301L358253
57079G5235413K293576J114745p1615j184449k180247l042276l764052m339175
57071F4061920m758949n015645n108730n049523m860476m570490m210303l809436
$$ y = [1809524, 1863886, 1920575, 1978878, 2038013, 2097262, 2156073, 2214161, 2271322, 2327232, 2382145, 2438069, 2498615, 2566957, 2644131, 2729685, 2823689, 2927657, 3043901, 3174578, 3321097, 3483665, 3661314, 3852808, 4057709, 4276693, 4511595, 4766040, 5045902, 5358471, 5711256, 6112278, 6571743, 7103246, 7723982, 8455118, 9322673, 10357962, 11597131, 13080142, 14848698, 16942498, 19394959, 22230454, 25463263, 29096949, 33123590, 37522611, 42257433, 47268633, 52465722, 57720259, 62859912, 67664859, 71877160, 75235413, 77528989, 78643734, 78572119, 77387670, 75207423, 72165147, 68401095, 64061920, 59302971, 54287326, 49178596, 44129073, 39268597, 34698107, 30487804, 26678368]
57063B6678368l393733k983706k594666k237493j918497j639265j398123j192179
57055I320706j017906q70840p46407o41317n53273m79480m16545l62007l14996
57046C917935k75054k41105k11856j86431j64022j43551j24035j04930q5818o6402
57036B314731m7490l1682k2410k1936l0220m5230o3868q2603r7942j07161j09190
57025A654999j04952r6679q6679p6513o7115n9146n2908m8100m4025m0153l6395
57014I42334l3021l0382k8657k7679k7059k6584k6199k5645k4473k2729k1175
57003F48731k0395j9942j8951j7377j5947j4908j3594j1520r249p620o477m820
56991D87931k146Q42L168M814O727R495J2371J3797J2820R749N556J009l520p784
$$ y = [26678368, 23284635, 20300929, 17706263, 15468770, 13550273, 11911008, 10512885, 9320706, 8302800, 7431960, 6685553, 6044236, 5490963, 5011483, 4594938, 4232931, 3917935, 3642881, 3401776, 3189920, 3003489, 2839467, 2695916, 2571881, 2466951, 2381133, 2314731, 2267241, 2235559, 2213149, 2191213, 2160993, 2115763, 2051895, 1969292, 1871350, 1764189, 1654999, 1550047, 1453368, 1366689, 1290176, 1223061, 1163915, 1111007, 1062907, 1018882, 978729, 942334, 909313, 878931, 850274, 822595, 795536, 768952, 742753, 717108, 692635, 669906, 648731, 628336, 608394, 589443, 572066, 556119, 541211, 527617, 516097, 506848, 499228, 492751, 487931, 485785, 486627, 489795, 494609, 501336, 510831, 523202, 536999, 549819, 559568, 565124, 566133, 562613, 554829]
56977E54829j1561j4648j6727j7451j6783j5109j2870j0332p814n783m329k927
56965D18495j084J050L180N567Q564J1678J3876J4749J4641J3490J0455N112j615
56952E18158q246j3930j8366k1127k1792k0677j8706j6538j4238j1754r192o505
56940C37087l437n5L138N957R072J3253J8123K2143K3980K3429K0826J6101R005
56927D98622J47q870j6532k2265k6143k8249k8655k7644k5541k2526j8978j5722
56915B57644j3412j1802j0080q007o138m912m025l010k006j470j357j067k90M76
56901A90544N64J63L03J678L724N235N775N988O549P433Q456R890J1904J3769
56887B71975J4438J3759J2395J0551P487K669l161q367j1626j2607j1847j0264
$$ y = [554829, 543268, 528620, 511893, 494442, 477659, 462550, 449680, 439348, 431534, 425751, 421422, 418495, 417411, 418461, 421641, 427208, 435772, 447450, 461326, 476075, 490716, 504206, 514661, 519773, 518158, 509912, 495982, 477616, 456489, 434697, 414020, 395314, 378776, 364538, 352784, 343592, 337087, 333650, 333595, 336733, 342690, 351762, 365015, 383138, 405281, 429261, 452690, 473516, 489617, 498622, 498769, 489899, 473367, 451102, 424959, 396710, 368055, 340411, 314870, 292344, 273366, 257644, 244232, 232430, 222350, 214343, 208205, 203293, 199268, 196258, 194252, 192782, 191425, 190358, 190068, 190544, 191108, 191271, 191574, 193252, 196976, 202211, 207986, 213974, 220523, 227956, 236412, 246302, 258206, 271975, 286413, 300172, 312567, 323118, 330605, 333274, 330113, 321746, 310120, 297513, 285666, 275402]
56875B75402q564o831m781k371R8K465M886P539J0526J4077J8379K3022K7151
56862C60998L0372L2894L4448L3629K8982K0513R713j600j1971k0198k5441k7636
56850D64703k7382k5311k1762j7036j1521n561M95O138J1054J5673K0946K7349
56838D37785L4445M1511M8187N4004N7612N6992N0631L8387K1439J843j7756l4617
56826G90463m6767n3603n5670n3886m9122m2297l4417k6360j8678j1594m949J631
56814C94751Q265J4523K0061K5423L1438L7551M1454M1044L6150K7775J6315J807
56802F96557j4241k8654l8809m4286m6088m5035m1574l6434l0601k4732j9044
56791C27059j3596q440l582Q57M697Q047J1308J4637J7742K0219K1651K1157J7628
$$ y = [275402, 266838, 260007, 255226, 252855, 252953, 255418, 260304, 267843, 278369, 292446, 310825, 333847, 360998, 391370, 424264, 458712, 492341, 521323, 541836, 551549, 549949, 537978, 517780, 492339, 464703, 437321, 412010, 390248, 373212, 361691, 356130, 356625, 362763, 373817, 389490, 410436, 437785, 472230, 513741, 561928, 615932, 673544, 730536, 781167, 819554, 840993, 842836, 825080, 790463, 743696, 690093, 634423, 580537, 531415, 489118, 454701, 428341, 409663, 398069, 393120, 394751, 403016, 417539, 437600, 463023, 494461, 532012, 573466, 614510, 650660, 678435, 694750, 696557, 682316, 653662, 614853, 570567, 524479, 479444, 437870, 401436, 370835, 346103, 327059, 313463, 305023, 301441, 302298, 306995, 315042, 326350, 340987, 358729, 378948, 400599, 421756, 439384]
56778D39384J0845K001p264j5866k2956k7437k8753k7730k5863k3832k1376j8412
56766B32741j5497j3183j1584j0587r965r288q225o928n765m806m055l769m023
56753A25066m131l326j836o10o5J48K09m5l90k35L79O37J63m38n63l88k58q0K38
56734A14475M13L67M77P78O21k35q47k09J251K112J712P05J2j13Ok6l22n87l67
56715A20223L19Q73Q64N43L53K83K19M62J301K332K780K372J448M25l00l42K24
56698A34379N97J58n98p46l06r6l38l65J49O56O47L24K9k15k53L59J619K725L005
56679A41730K602J895Q53m08j125p41R5K00o29j563k012k158k169j708o05N46
56663A34803R10L44n12q85n05K54O86L96l18q22q67p19n62j99M30P91K67r48j892
$$ y = [439384, 450229, 452230, 444966, 429100, 406144, 378707, 349954, 322224, 296361, 272529, 251153, 232741, 217244, 204061, 192477, 181890, 171925, 162637, 154412, 147484, 141719, 136913, 132858, 129089, 125066, 120935, 117609, 115773, 115163, 115098, 115246, 115455, 115410, 115020, 114785, 115164, 115801, 115964, 115526, 114963, 114575, 114317, 114237, 114475, 114888, 115255, 115732, 116510, 117131, 116896, 116049, 115840, 117091, 119203, 120915, 121620, 121632, 121519, 121525, 121499, 121177, 120590, 120223, 120542, 121415, 122279, 122822, 123175, 123458, 123677, 124139, 125440, 127772, 130552, 132924, 134372, 134797, 134497, 134155, 134379, 134976, 135134, 134536, 133790, 133484, 133388, 133050, 132685, 132834, 133490, 134137, 134461, 134490, 134275, 134022, 134381, 136000, 138725, 141730, 144332, 146227, 147080, 146672, 145547, 144806, 144901, 145101, 144472, 142909, 140897, 138739, 136570, 134862, 134257, 134803, 135713, 136057, 135545, 134660, 134155, 134409, 135095, 135491, 135173, 134351, 133484, 132765, 132203, 132004, 132434, 133225, 133492, 132544, 130652]
56644A30652j859j060j76L98O28N13Q5l28l12M9K42R9P5M96R60R64P42Q69J217
56625A34254J071L26k54k75l80j139j901j612m29M16L08k9K76J031J405J014J25
56608A34207r10j833k292j992j135k74L07P89J280J466J072L61j18j73k8J25L27
56591A31179N67O86O45O45P60P70N17K17J48K64M17O83J080J163M64o54j201p12
56573A37638K17Q10J023J286J760K264K702L077L236L080K993L683N355P277Q329
56558A84730P907O296M257K322N10j242k625l166k913k477k250j940j227m92m36
56543A87254j092j735j802j496j368j572j789j613r84k58J16M2j18l2J50O2l02
56526A73463n50m29n1L58O59O48J07q56j692j919j562j021o13m22m70p97j300
$$ y = [130652, 128793, 127733, 127557, 127955, 128583, 129096, 129181, 128853, 128541, 128590, 128832, 128931, 129006, 129502, 130462, 131426, 132168, 133037, 134254, 135325, 135651, 135397, 135122, 134742, 133603, 131702, 130090, 129661, 130077, 130385, 130356, 130632, 131663, 133068, 134082, 134207, 133297, 131464, 129172, 127180, 126045, 125771, 126078, 126867, 128147, 129613, 130685, 131046, 130928, 130755, 130727, 130852, 131179, 131746, 132432, 133077, 133722, 134482, 135252, 135769, 135986, 136134, 136398, 136815, 137498, 138578, 139741, 140205, 139551, 138350, 137638, 137855, 138665, 139688, 140974, 142734, 144998, 147700, 150777, 154013, 157093, 160086, 163769, 169124, 176401, 184730, 192637, 198933, 203190, 205512, 206022, 204780, 202155, 198989, 196076, 193599, 191349, 189409, 188182, 187690, 187254, 186162, 184427, 182625, 181129, 179761, 178189, 176400, 174787, 173803, 173545, 173661, 173703, 173585, 173553, 173703, 173765, 173463, 172913, 172484, 172433, 172791, 173450, 174098, 174205, 173349, 171657, 169738, 168176, 167155, 166542, 166120, 165650, 164853, 163553]
56509A63553j606j315m54L98O15K02k71m36n49r71j516j692j347q04l90j91j72
56492A53054k28j64M0P5k79o42l72O02J640K129K020J642J297J072P82J84n21
56475A62331o47P6Q77P98L3m04j96nj64j06N20J130J118O86K00n35j595k214j639
56456A60264k76Q17J206J123O52j85p81l94Q00J840K186K040J614R02K48K21P12
56439A72989Q95L82k71m75l45k33j29K1l2m17p25m74J81O27N13J07K0O47J679
56420A74960K210J642M95j22K11R14J397J656J730J329M46k87l80j46p9n3L03
56403A86226P92Q84N49K23J32J89L69O58P78O25P16J480K193J588k78j697j335
56386A94092J68J232J351J229J307J194O22N3o3j9l29q47r83n47P5N33Q16R62
$$ y = [163553, 161947, 160632, 160178, 160576, 161191, 161393, 161122, 160686, 160137, 159166, 157650, 155958, 154611, 153807, 153417, 153226, 153054, 152826, 152662, 152702, 152777, 152498, 151856, 151484, 152086, 153726, 155855, 157875, 159517, 160814, 161886, 162668, 162852, 162331, 161684, 161760, 162637, 163435, 163468, 163064, 162868, 162863, 162699, 162593, 163113, 164243, 165361, 166047, 166247, 165712, 164117, 161903, 160264, 159988, 160805, 162011, 163134, 163786, 163601, 162820, 162426, 163226, 165066, 167252, 169292, 170906, 171808, 172056, 172277, 172989, 173884, 174266, 173995, 173520, 173175, 172942, 172813, 172834, 172802, 172385, 171660, 171186, 171367, 171994, 172507, 172614, 172634, 173281, 174960, 177170, 178812, 179307, 179185, 179396, 180310, 181707, 183363, 185093, 186422, 186868, 186581, 186201, 186055, 185976, 185923, 186226, 187018, 187902, 188451, 188674, 188806, 188995, 189364, 190022, 190800, 191425, 192141, 193621, 195814, 197402, 197124, 195427, 194092, 194260, 195492, 196843, 198072, 199379, 200573, 201195, 201248, 201185, 201166, 200837, 199990, 199007, 198460, 198535, 199068, 199884, 200846]
56368B00846Q98P39P68J034J225J207J223J397J407J068P91J065J660J952J821
56353B19101J676J717J776J792J781J379K19j159j536n64O96J163R84P88M90k75
56337B30028j026q19K90J150J018M64M28J068J867K430K761K995L221L412L333
56322B52620K679J473K21m90m55O8O05P86N86L66M88Q98J247J422J670K069K300
56305B68553K132J873K002K512K975L164L309L599L794L484K664J824J449J561
56291C04895J821K000K202K589L024L216L192L396M152N181N858N926N742N745
56277C58939N964O195O462P048Q021R044R741J0069J0221J0336J0574J1298J2849
56264D76761J4995J6956J8174J9009K0397K2825K5906K9011L2163L5953M0606
$$ y = [200846, 201744, 202483, 203251, 204285, 205510, 206717, 207940, 209337, 210744, 211812, 212603, 213668, 215328, 217280, 219101, 220777, 222494, 224270, 226062, 227843, 229222, 229441, 228282, 226746, 226182, 226878, 228041, 229025, 229813, 230303, 230028, 229002, 228183, 228473, 229623, 230641, 231105, 231533, 232601, 234468, 236898, 239659, 242654, 245875, 249287, 252620, 255299, 256772, 256993, 256503, 256048, 256116, 256721, 257507, 258093, 258459, 258947, 259845, 261092, 262514, 264184, 266253, 268553, 270685, 272558, 274560, 277072, 280047, 283211, 286520, 290119, 293913, 297397, 300061, 301885, 303334, 304895, 306716, 308716, 310918, 313507, 316531, 319747, 322939, 326335, 330487, 335668, 341526, 347452, 353194, 358939, 364903, 371098, 377560, 384608, 392629, 401673, 411414, 421483, 431704, 442040, 452614, 463912, 476761, 491756, 508712, 526886, 545895, 566292, 589117, 615023, 644034, 676197, 712150, 752756]
56253G52756M5545N0114N4522N9600O5682P2064P7738Q2257Q5701Q8164Q9567
56242A523710Q9705Q8060Q3822P6574O6878N5772M3755L0685J6632K294j1556
56231B066331k4521l6288m6372n4442o0664o5395o8790p0910p1972p2240p1774
56220A422963p0528o8534o5870o2616n8993n5340n1848m8462m5153m1990l8910
56209H14719l5719l2543k9875k7894k6083k3874k1380j9014j6756j4337j2024
56198E55220j0513r902r353q059o216m697m021l961m015l903l522k777j699o63
56184D81919k04m38q33p00P9R56J353J197Q35N92N44O54J006J782K914L849L999
56167D99504L548L457M341N638O346O365O566P565R009J0190J0805J1032J1325
$$ y = [752756, 798301, 848415, 902937, 962537, 1028219, 1100283, 1178021, 1260278, 1345979, 1434143, 1523710, 1613415, 1701475, 1785297, 1861871, 1928749, 1984521, 2028276, 2058961, 2075593, 2077887, 2066331, 2041810, 2005522, 1959150, 1904708, 1844044, 1778649, 1709859, 1638949, 1566977, 1494737, 1422963, 1352435, 1283901, 1218031, 1155415, 1096422, 1041082, 989234, 940772, 895619, 853629, 814719, 779000, 746457, 716582, 688688, 662605, 638731, 617351, 598337, 581581, 567244, 555220, 544707, 534805, 525452, 517393, 511177, 506480, 502459, 498498, 494483, 490580, 487058, 484281, 482582, 481919, 481715, 481277, 480444, 479744, 479823, 480779, 482132, 483329, 484164, 484756, 485300, 485954, 486960, 488742, 491656, 495505, 499504, 503052, 506509, 510850, 516488, 522834, 529199, 535765, 543330, 552339, 562529, 573334, 584366, 595691]
56154E95691J2321J4434J7398K0560K3818K7734L2668L8372M4643N1694N9440
56143I38773O6921P2929P6670P7572P5004O8952O0578N1607M3327L6528L1800
56132A600661K9199K7851K6466K4171K0541J5342Q887K328l159p511j1723j6873
56120A716180k3608l2171m2168n2368o1331o8244p2725p4103p1599o5418n7129
56109A095316m8745m1548l5680l0484k5298k0088j5420j1719q921o825n287l885
56097H41416k034J51J742K224K244K575K993K963K874L559M936O103O618O828
56083H85192P073P351P710Q257Q790R002Q917Q724Q511Q668R902J2126J3915J4125
56069A018263J3450J3385J4093J4618J4739J5192J6182J7092J7692J8313J8821
$$ y = [595691, 608012, 622446, 639844, 660404, 684222, 711956, 744624, 782996, 827639, 879333, 938773, 1005694, 1078623, 1155293, 1232865, 1307869, 1376821, 1437399, 1489006, 1532333, 1568861, 1600661, 1629860, 1657711, 1684177, 1708348, 1728889, 1744231, 1753118, 1755446, 1752287, 1744776, 1733053, 1716180, 1692572, 1660401, 1618233, 1565865, 1504534, 1436290, 1363565, 1289462, 1217863, 1152445, 1095316, 1046571, 1005023, 969343, 938859, 913561, 893473, 878053, 866334, 857413, 850588, 845301, 841416, 839382, 839533, 841275, 843499, 845743, 848318, 851311, 854274, 857148, 860707, 865643, 871746, 878364, 885192, 892265, 899616, 907326, 915583, 924373, 933375, 942292, 951016, 959527, 968195, 978097, 990223, 1004138, 1018263, 1031713, 1045098, 1059191, 1073809, 1088548, 1103740, 1119922, 1137014, 1154706, 1173019, 1191840]
56058A191840J8676J8156J8176J8775J8999J8575J8339J8765J9278J9356J9200
56047A398135J8993J8746J9000K0383K2167K2733K1878K1222K1811K2801K3309
56036A631178K3981K5782K8460L1277L4256L7628M0918M3457M5135M5980M5921
56025B033973M5567M6203M8204N0374N1629N2393N3595N5360N7520O0382O3922
56014B619122O7191O9546P1743P4867P8834Q2914Q6839R0667R4221R7589J01482
56003C535015J06383J12012J18189J25257J33026J40439J47115J54146J62593
55994D734175J72279J82877J94841K08308K22356K36572K52198K70517K91204
55985F765327L13468L37614L64311L93503M25310M60802N00648N44287N91838
$$ y = [1191840, 1210516, 1228672, 1246848, 1265623, 1284622, 1303197, 1321536, 1340301, 1359579, 1378935, 1398135, 1417128, 1435874, 1454874, 1475257, 1497424, 1520157, 1542035, 1563257, 1585068, 1607869, 1631178, 1655159, 1680941, 1709401, 1740678, 1774934, 1812562, 1853480, 1896937, 1942072, 1988052, 2033973, 2079540, 2125743, 2173947, 2224321, 2275950, 2328343, 2381938, 2437298, 2494818, 2555200, 2619122, 2686313, 2755859, 2827602, 2902469, 2981303, 3064217, 3151056, 3241723, 3335944, 3433533, 3535015, 3641398, 3753410, 3871599, 3996856, 4129882, 4270321, 4417436, 4571582, 4734175, 4906454, 5089331, 5284172, 5492480, 5714836, 5951408, 6203606, 6474123, 6765327, 7078795, 7416409, 7780720, 8174223, 8599533, 9060335, 9560983, 10105270, 10697108]
55976A0697108O45412P07186P77643Q57334R48798J055054J177848J319474J485028
55967A9670885J681077J914000K192413K530478K947475L466403M115161M925141
55959D3443033N922502P120374Q523757J0143607J2005957J4152842J6643032
55952A17955104J9545371K2890315K6551465L0091654L2690069L3280198L0912137
55945C13916313K5168732J6387569N573976n889337j6552561k5155207l0856763
55938B82592722l3416983l3209479l1011448k7685492k3941624k0259355j6912779
55931I6155562j4020194j1594549r594620p962652o638591n563918m688327l973861
55923C2118850l390169k909466k508920k173705j893402j657445j456420j284800
$$ y = [10697108, 11342520, 12049706, 12827349, 13684683, 14633481, 15688535, 16866383, 18185857, 19670885, 21351962, 23265962, 25458375, 27988853, 30936328, 34402731, 38517892, 43443033, 49365535, 56485909, 65009666, 75153273, 87159230, 101312072, 117955104, 137500475, 160390790, 186942255, 217033909, 249723978, 283004176, 313916313, 339085045, 355472614, 361046590, 355157253, 338604692, 313449485, 282592722, 249175739, 215966260, 184954812, 157269320, 133327696, 113068341, 96155562, 82135368, 70540819, 60946199, 52983547, 46344956, 40781038, 36092711, 32118850, 28728681, 25819215, 23310295, 21136590, 19243188, 17585743, 16129323, 14844523]
55915A4844523j138951j014100r05506q10720p28316o56001n91869n35872m88056
55906G975132m46712m09865l77206l48867l23703l00425k79270k60855k44424
55897D983805k28654k13277j98547j84115j69875j57061j47058j39691j33777
55888C411750j28742j24586j20887j16925j12403j07290j01529r5445q9766q4562
55878B329615p9007p2833o7207o3357o1097n9467n7972n6449n4555n2251n0054
55867A655366m7967m5048m0826l6387l3031l0704k8755k7502k7810k9563l1683
55856A276090l3310l4026l3369l1261k8646k6762k5816k5226k4774k4709k4896
55845I63295k4843k4433k3846k2935k1518k0111j9487j9446j8931j7455j5641
$$ y = [14844523, 13705572, 12691472, 11785966, 10975246, 10246930, 9590929, 8999060, 8463188, 7975132, 7528420, 7118555, 6741349, 6392482, 6068779, 5768354, 5489084, 5228229, 4983805, 4755151, 4541874, 4343327, 4159212, 3989337, 3832276, 3685218, 3545527, 3411750, 3283008, 3158422, 3037535, 2920610, 2808207, 2700917, 2599388, 2503943, 2414177, 2329615, 2250608, 2177775, 2110568, 2047211, 1986114, 1926647, 1868675, 1812226, 1757671, 1705420, 1655366, 1607399, 1562351, 1521525, 1485138, 1452107, 1421403, 1392648, 1365146, 1337336, 1307773, 1276090, 1242780, 1208754, 1175385, 1144124, 1115478, 1088716, 1062900, 1037674, 1012900, 988191, 963295, 938452, 914019, 890173, 867238, 845720, 825609, 806122, 786676, 767745, 750290, 734649]
55834G34649j4242j3258j2309j1299j0335r445q594p847p336p138p231p521q043
55821F10051r100j0847j2615j3179j2148j0650j0078j0433j0502r504p891o567
55809D86537n916n706n433m616l086j221L07J107J351J527K006K760L372L407
55795D76396K924K491K648L475M775O306P718Q608Q905Q897Q540P126M019m33
55781E52395n147r243j2380j4263j4375j2288q080k441L438Q241J1081J1699J0037
55768E18674N865q46r190j7326k3364k6339k6356k4103k0319j5763j1468q443
55756C41022o895o016n050m276m437n421o340o810p272p840p865p065o195n902
55742B53638n672m797l765l602m224m467l786k978k979l638m065l726k949k510
$$ y = [734649, 720407, 707149, 694840, 683541, 673206, 663761, 655167, 647320, 639984, 632846, 625615, 618094, 610051, 600951, 590104, 577489, 564310, 552162, 541512, 531434, 521001, 510499, 500995, 493104, 486537, 480621, 474915, 469482, 464866, 461780, 460559, 460866, 461973, 463324, 464851, 466857, 469617, 472989, 476396, 479320, 481811, 484459, 487934, 492709, 499015, 506733, 515341, 524246, 533143, 541683, 548809, 552828, 552395, 547248, 538005, 525625, 511362, 496987, 484699, 476619, 474178, 477616, 485857, 496938, 508637, 518674, 524539, 523693, 514503, 497177, 473813, 447474, 421118, 397015, 376696, 360933, 349465, 341022, 334127, 328111, 323061, 318785, 314348, 308927, 302587, 295777, 288505, 280665, 272800, 265735, 259540, 253638, 247966, 243169, 239404, 235802, 231578, 227111, 223325, 220347, 217368, 213730, 209665, 205939, 202990, 200480]
55728B00480k826l426l364k294r69m20q42j634k208k296j711m77Q46J574J729
55713A82162J975K643L281L315K760K057J454Q14j06j291k348k871k972l253m010
55698A83610m692m537l595k695k442k638k793k723k503k113j453o41q0r4m84n82
55682A49545J9Q97J289J111R86J175J139N08j42j08K95K20l75o73k09N95J160
55665A57432J352J268R78O73N86O69O87O34O63O52L94J67M89J246J651J276N04
55648A71321j49n84q24p56m75l25l41j96Q2j14j099k377l366m100m740n039m806
55631A42112m410m219l961l337k812k976l413l167k162j303j116j167j004p94
55617A06271p38o19l93n85j499k489k674k068j454j306j366j236q92n49m10o16
$$ y = [200480, 197654, 194228, 190864, 188570, 187601, 187181, 186339, 184705, 182497, 180201, 178490, 178013, 178859, 180433, 182162, 184137, 186780, 190061, 193376, 196136, 198193, 199647, 200461, 200355, 199064, 196716, 193845, 190873, 187620, 183610, 178918, 174381, 170786, 168091, 165649, 163011, 160218, 157495, 154992, 152879, 151426, 150785, 150705, 150611, 150127, 149545, 149564, 150461, 151750, 152861, 153847, 155022, 156161, 156669, 156527, 156419, 156714, 156934, 156559, 155886, 155677, 156272, 157432, 158784, 160052, 161030, 161703, 162289, 162958, 163645, 164279, 164942, 165594, 165988, 166155, 166644, 167890, 169541, 170817, 171321, 171172, 170588, 169764, 169008, 168533, 168208, 167867, 167671, 167753, 167639, 166540, 164163, 160797, 156697, 151957, 146918, 142112, 137702, 133483, 129522, 126185, 123373, 120397, 116984, 113817, 111655, 110352, 109236, 108069, 107065, 106271, 105533, 104914, 104521, 103936, 102437, 99948, 97274, 95206, 93752, 92446, 91080, 89844, 88952, 88403, 87993, 87377]
55601H7377j114j553j544j161q55q38p96l60L76J006J255J134P36J57l77m67K03
55584H3179J463K583K860K378J971K200K611K458J991K286L788N657O871P258
55570A29554P006N878L792J664N96L37m40k194l896m593m635m784m936m565l854
55555A14930l477l545l543l272l142l453l921m079l671k699j429m13j26m36p53
55540G6971p38n07j65M62J395K172K218J512O47L04O59J247J406Q74Qo12o85k92
55522H6876K39M76O2q96j824k253k257k170k078j919j794j805j744j402j048j105
55506F5358j408j339p09J8M70P61R62P62m0j110j944k334k213j498l99M66O62
55489E6465M66L95M57K93j11k91P9P75J301J387J112P19L56ml55m88k54M0j40
$$ y = [87377, 86263, 84710, 83166, 82005, 81150, 80312, 79516, 79156, 79532, 80538, 81793, 82927, 83663, 83820, 83443, 82976, 83179, 84642, 87225, 90085, 92463, 94434, 96634, 99245, 101703, 103694, 105980, 109768, 115425, 122296, 129554, 136560, 142438, 146230, 147894, 148490, 148827, 148387, 146193, 142297, 137704, 133069, 128285, 123349, 118784, 114930, 111453, 107908, 104365, 101093, 97951, 94498, 90577, 86498, 82827, 80128, 78699, 78286, 78160, 77724, 76971, 76233, 75726, 75561, 76023, 77418, 79590, 81808, 83320, 83967, 84271, 84930, 86177, 87583, 88457, 88465, 87853, 87168, 86876, 87115, 87591, 87653, 86757, 84933, 82680, 80423, 78253, 76175, 74256, 72462, 70657, 68913, 67511, 66463, 65358, 63950, 62611, 61902, 61920, 62390, 63151, 64113, 64875, 64835, 63725, 61781, 59447, 57234, 55736, 55337, 55803, 56465, 56931, 57326, 57783, 58076, 57965, 57674, 57753, 58528, 59829, 61216, 62328, 63047, 63403, 63399, 63044, 62556, 62302, 62342, 62202]
55470F2202p18q96j71Q06R36M3r78j328j088p23l66P5M26L52j32n52n08j32M1
55451E7289l44j014j302q51p2L09Q8k75l23j25N2K66P01J114J006L64j52K2O66
55432E7419J133J146R51P97O08K37j87l92l01k08m90j105j467j026o9M60P4o09
55414E6971o95j53L71N98P71Q69M80l49r06p93m88n14o47n23m09o71r46n97K50
55395E2619Q72R75Q59O60K30k31k60O4J17l02o51n02q5K48M85N91L29j83l35J66
55375E5666P59P56J69n36j083j315r90j41O47Q64O46K95l01j221j819j347j33
55358E0916O25L19m76r37q64m71R3P03J105J191J121J073J085J192J390J376P90
55341F0231j23n74k36K54J62l82p34p22p20q61q19m35m6M1m1k0J03J98K89L99
$$ y = [62202, 61484, 60588, 60417, 61223, 62159, 62202, 61224, 59896, 58808, 58085, 57719, 57794, 58220, 58572, 58440, 57888, 57380, 57248, 57289, 56945, 55931, 54629, 53778, 53706, 54015, 54103, 53828, 53505, 53380, 53432, 53698, 54399, 55513, 56519, 56883, 56731, 56753, 57419, 58552, 59698, 60649, 61446, 62054, 62291, 62104, 61712, 61411, 61203, 60713, 59608, 58141, 57115, 57046, 57506, 57580, 56971, 56276, 56123, 56494, 57092, 57863, 58732, 59212, 58863, 57957, 57164, 56676, 56162, 55515, 54992, 54583, 53912, 52966, 52369, 52619, 53491, 54466, 55325, 55985, 56215, 55984, 55724, 55788, 55905, 55603, 54952, 54450, 54365, 54613, 55098, 55689, 56018, 55835, 55500, 55666, 56425, 57181, 57350, 56814, 55731, 54416, 53426, 53285, 53932, 54796, 55442, 55737, 55436, 54215, 52396, 51049, 50916, 51541, 51860, 51384, 50447, 49583, 49112, 49205, 49908, 51013, 52204, 53325, 54398, 55483, 56675, 58065, 59441, 60231, 60108, 59534, 59298, 59552, 59714, 59332, 58598, 57876, 57156, 56295, 55476, 55041, 54995, 55036, 54995, 54975, 55078, 55276, 55565, 55964]
55321E5964L31n5m44l47K48Q13Q87M85j46q30j348j384q21J6O47Q53O82K62j45
55302E5668j60K40M39j94j332j836j072K84J073R33M60K49K11n4n87r81r17n13
55284E1911j12J34L04M48M69L79M39Q30J328J470J063L31l39o76o62n57p11j084
55266E4965j160n93K00N18L24K04M31O01M15J80K36L38J30k17k71l2J84L36O00
55247E7389P86L94n71j308j062j4R26J068N29q9l47k77j69k17m06o09p02o08l62
55228E4351q3K12O59J262J694J654J255P80J47q66j898k121j317k79J47l4l19
55211E5244m38l32J24Q10J173R29N74O36P58K95n21q39n30k82l68k69K58O47M63
55192E8332J17J01K22J07o3R3M62O93P67P58M54j85o00l11K47L10n1j71Lj07n16
$$ y = [55964, 56295, 56240, 55796, 55449, 55697, 56510, 57397, 57882, 57736, 56906, 55558, 54174, 53353, 53369, 54016, 54869, 55551, 55813, 55668, 55508, 55748, 56187, 55993, 54661, 52825, 51753, 52037, 53110, 54043, 54503, 54752, 54963, 54909, 54322, 53341, 52424, 51911, 51799, 51933, 52237, 52685, 53154, 53533, 53972, 54802, 56130, 57600, 58663, 58994, 58655, 57979, 57317, 56760, 56049, 54965, 53805, 53212, 53412, 53930, 54254, 54458, 54889, 55490, 55905, 56085, 56321, 56659, 56789, 56572, 56301, 56269, 56453, 56789, 57389, 58175, 58569, 57998, 56690, 55628, 55614, 56540, 57608, 58137, 58048, 57701, 57424, 57255, 57038, 56632, 56023, 55321, 54713, 54351, 54268, 54480, 55139, 56401, 58095, 59749, 61004, 61784, 61931, 61065, 59167, 57046, 55729, 55450, 55597, 55563, 55244, 54806, 54474, 54598, 55408, 56581, 57510, 58084, 58720, 59478, 59773, 59252, 58413, 57883, 57601, 57233, 56964, 57222, 57869, 58332, 58449, 58550, 58772, 58879, 58816, 58909, 59371, 60064, 60831, 61589, 62043, 61858, 61258, 60947, 61194, 61504, 61453, 61282, 61285, 61178, 60662]
55171F0662m52L31R69P85L50N48J143J159M31j36J29Q39J174Q15Nq63j453j495
55153F4941r42m5P92J194R47J77o25r87r08p15n11j49L10M76K37QJ64M64L93j63
55133F5058q67j385j514j089j10J018J714J715J184M59j12k19J13L38j01j046
55117F5156j654j299j76R26J329Q88N9m60l80j00j24l59l00J19M02K78J06K64
55099F4675N41M72J0m38m72RP96J422J430Q20J21j41P8M72P61Q10N71J19l49o70
55079G1037p98o78l00J25L12K94M13P77J028Q07K29l00m66k06K82N72L61j60n25
55060G2804o23o87p11m25Ljm84p20l21J02r3n93p95q04r97j091n61L31Q31Q47
55040F6012Q75R54O23n8l80J5P27J304J615J468O56m13r26p52o62j129j658j574
$$ y = [60662, 60210, 60541, 61510, 62295, 62645, 63193, 64336, 65495, 65926, 65790, 65919, 66758, 67932, 68747, 68752, 67889, 66436, 64941, 63999, 63954, 64746, 65940, 66887, 67064, 66439, 65452, 64544, 63829, 63318, 63169, 63479, 63955, 64192, 64200, 64364, 64828, 65221, 65058, 64191, 62806, 61292, 60203, 60093, 61111, 62825, 64540, 65724, 66183, 66071, 65852, 65965, 66303, 66202, 65156, 63502, 62203, 62027, 62953, 64282, 65170, 65229, 64769, 64389, 64289, 64165, 63806, 63506, 63625, 64027, 64305, 64411, 64675, 65216, 65688, 65698, 65260, 64788, 64797, 65593, 67015, 68445, 69265, 69386, 69245, 69323, 69795, 70556, 71366, 71937, 72056, 71707, 71037, 70239, 69561, 69261, 69386, 69698, 69992, 70405, 71182, 72210, 73017, 73246, 72946, 72480, 72274, 72556, 73128, 73489, 73329, 72804, 72181, 71494, 70783, 70358, 70361, 70360, 69876, 69156, 68835, 68937, 68844, 68251, 67456, 66652, 65655, 64564, 64003, 64334, 65165, 66012, 66887, 67841, 68464, 68406, 68026, 68041, 68768, 70072, 71687, 73155, 73811, 73398, 72472, 71720, 71058, 69929, 68271, 66697]
55022F6697q69P9R94J577J492R06M96N27M39k23j020j235q10j59M69R25Q69J66
55004G1320o79j038r03o78n42m39m72p68j087j031n48R1O47R25P32K15k9L73J021
54985F7110J262R81M34l30j239j672j018L49J323J429J244J379J658J541Q47j36
54969G5162q80q25J00J160J466J093R30J280J334L94j013j841j781j240m71M47
54953G5315J019O35m24j007m52N86J001M95l18q22r27q47q00r55j306j538j245
54936F8410m61K45L66P6J0N01J284J923K194K011J304K65m91m14L48J116J488
54919H0175J705K174K957L890M872N771O232N884M680K903R80n60j245j161j146
54904A18111j982l408m390m413l967l589l031j869n43r1q92k149k739k219j044
$$ y = [66697, 65828, 65907, 66901, 68478, 69970, 70876, 71372, 71899, 72338, 72115, 71095, 69860, 69050, 68891, 69360, 70285, 71154, 71320, 70641, 69603, 68700, 68022, 67480, 67041, 66569, 65801, 64714, 63683, 63135, 63226, 63873, 64798, 65530, 65745, 65716, 66089, 67110, 68372, 69353, 69787, 69457, 68218, 66546, 65528, 65877, 67200, 68629, 69873, 71252, 72910, 74451, 75298, 75162, 74282, 73457, 73557, 74717, 76183, 77276, 78206, 79486, 80820, 81214, 80201, 78360, 76579, 75339, 74868, 75315, 76334, 76969, 76545, 75538, 75086, 75672, 76673, 77168, 76850, 76028, 75101, 74254, 73454, 72499, 71193, 69655, 68410, 67949, 68194, 68560, 68636, 68646, 69147, 70431, 72354, 74548, 76559, 77863, 78128, 77637, 77223, 77571, 78687, 80175, 81880, 84054, 87011, 90901, 95773, 101544, 107776, 113660, 118340, 121243, 122223, 121663, 120418, 119257, 118111, 116129, 112721, 108331, 103918, 99951, 96362, 93331, 91462, 90919, 90828, 89936, 87787, 85048, 82829, 81785]
54889H1785q6Q5k69l02L89J092Q60r9n39K06J410K070K129K185K476K822L226
54872I9440L842M521M896M832M359L356J787O9j297k354l351l980l707k826k387
54857A07200k826l418l371k839k451k367k344k319k332k178j658j008o42o05o54
54842G6188p90j198j733j880j383n93l2K13M83J005J534J624J249R26J036J182
54826G7831O00p71k037k335j666o30L51J139J515J188K15r12j663j773j254l26
54810F9472O41J226J161N45j54l88j11J16j67n69l07O53J447J471J039O38K07
54793G6920l94p39l92K16L05o2k8P69J665J879J373N80j61o36o11m3P22J229J304
54774H3896J102Q60P41P46P77Q50J156J770K400K725K869L258L953M468M331L551
$$ y = [81785, 81699, 81784, 81515, 81213, 81602, 82694, 83554, 83455, 82916, 83122, 84532, 86602, 88731, 90916, 93392, 96214, 99440, 103282, 107803, 112699, 117531, 121890, 125246, 127033, 127102, 125805, 123451, 120100, 116120, 112413, 109587, 107200, 104374, 100956, 97585, 94746, 92295, 89928, 87584, 85265, 82933, 80755, 79097, 78089, 77447, 76842, 76188, 75398, 74200, 72467, 70587, 69204, 68611, 68579, 68792, 69275, 70280, 71814, 73438, 74687, 75613, 76649, 77831, 78431, 77660, 75623, 73288, 71622, 70992, 71343, 72482, 73997, 75185, 75400, 74488, 72825, 71052, 69798, 69472, 70113, 71339, 72500, 73045, 72891, 72503, 72392, 72508, 72341, 71772, 71465, 72118, 73565, 75036, 76075, 76713, 76920, 76526, 75787, 75395, 75611, 75916, 75854, 75826, 76595, 78260, 80139, 81512, 82092, 81931, 81295, 80684, 80641, 81363, 82592, 83896, 84998, 85858, 86599, 87345, 88122, 88972, 90128, 91898, 94298, 97023, 99892, 103150, 107103, 111571, 115902, 119453]
54758A19453K531J735J483J712J876J326o2j835l514m857n608n464m542l523k969
54743I7742k679k077j087k86j56n03p25m61J10N51O10L93J97K33M84P22O52K07
54725I3927k89l07M04J586K734L445L513L027K483K485L052L417K943J981J365
54710A25766J187O78o71k400l700m275m328m100l707l297l032k966l067l135k768
54695H6185j686k26P50P15po87r28p81m34r1K6j65m36m70j38M37R51R78K60p93
54675H3460j278p83J1N3q37j790j895j031K35J202J462J058L84k06o27q23n24
54658G8071L74J315J450N94n38j143j036m91J97P63R77Q76P48O09R0q41j441j013
54640G9561K2N33J19n33p81q01q82o56L22J610K212J769Q79J62l65q27r63m79
$$ y = [119453, 121984, 123719, 125202, 126914, 128790, 130116, 130054, 128219, 124705, 119848, 114240, 108776, 104234, 100711, 97742, 95063, 92986, 91899, 91613, 91457, 90954, 90229, 89768, 89878, 90429, 91039, 91432, 91629, 91862, 92346, 93068, 93720, 93927, 93638, 93331, 93735, 95321, 98055, 101500, 105013, 108040, 110523, 113008, 116060, 119477, 122420, 124401, 125766, 126953, 127631, 126960, 124560, 120860, 116585, 112257, 108157, 104450, 101153, 98121, 95155, 92088, 88953, 86185, 84499, 84273, 85023, 85738, 85731, 85044, 84116, 83335, 82901, 82810, 82836, 82671, 82235, 81765, 81627, 82064, 83015, 83993, 84253, 83460, 82182, 81399, 81410, 81463, 80626, 78836, 76941, 75910, 76145, 77347, 78809, 79867, 80251, 80045, 79418, 78595, 78071, 78445, 79760, 81210, 81804, 81266, 80123, 79087, 78596, 78793, 79556, 80533, 81409, 82157, 82766, 82856, 82015, 80574, 79561, 79583, 80116, 80235, 79702, 78921, 78120, 77238, 76582, 76904, 78514, 80726, 82495, 83374, 83536, 83171, 82344, 81381, 80902]
54622H0902L17P27M67j4j56k1j74q56j474j227j49Q24R44M41q2n31j090j371p02
54603G6775O78J548J199L73K01P58J269J271Q97K42o97j461j383n75j9l08p87
54586G9981m73N45J211R21K33J8L42N63L36M3J21L76K59l03p83p69m62l31m90
54567H1338o26l85L08J218J977K297K164J687R27mp62j017q55o49n04k39J20L21
54549H7316M71R75J740K030J534Q92P29P55M14j52m87o29p92o72JO05L35m79q35
54530I3751o68q32j484j732j210p12p68o73K33J318J572J048N22K30j35m43k19
54513H9798M51Q44N66K7k04n4J59J83M9q5k13n30j045j273p54K06P95Q23Q95J286
54493I1924J394P93P3o5R0j11m25j30O33R17M33k5J77P13J016J073J050P76J56
$$ y = [80902, 81219, 81946, 82413, 82399, 82243, 82222, 82048, 81192, 79718, 78491, 78342, 79166, 80110, 80551, 80469, 79938, 78848, 77477, 76775, 77453, 79001, 80200, 80573, 80774, 81532, 82801, 84072, 84969, 85211, 84514, 83053, 81670, 81095, 81076, 80768, 79981, 79508, 80053, 81264, 82185, 82418, 82436, 82778, 83341, 83677, 83720, 83841, 84217, 84476, 84173, 83390, 82621, 82159, 81828, 81338, 80712, 80327, 80635, 81853, 83830, 86127, 88291, 89978, 90905, 90901, 90139, 89122, 88267, 87618, 87114, 86875, 86995, 87316, 87787, 88762, 90502, 92532, 94066, 94958, 95687, 96442, 96856, 96704, 96217, 95588, 94796, 94124, 94125, 94730, 95065, 94586, 93751, 93083, 92251, 90767, 89035, 87825, 87113, 86345, 85672, 85905, 87223, 88795, 89843, 90365, 90595, 90460, 90017, 89798, 90249, 91093, 91659, 91686, 91482, 91428, 91587, 91770, 91819, 91734, 91521, 90991, 89946, 88673, 87919, 88125, 88920, 89743, 90638, 91924, 93318, 94111, 94184, 94119, 94209, 94098, 93673, 93543, 94176, 95093, 95526, 95501, 95678, 96391, 97407, 98480, 99530, 100306, 100462]
54474A00462k79J09J193K133K345J981J456Q48P2o21p12q1O66Q69N83L48K82j
54456A11653n73q96o44k56k64n43p17q79j200j232m05Q91J498Q49m59j544k027
54439A03252j864j090p5N32M70J80J12J12j60n52n92j82K27J44m48j088j187n68
54421I7223K88O92M75J33J41L84M76L40K01J88K79M93Q75J201J065L15o86j382
54403A02701j423q22J29R95J392J297J106J218J557J680J308O40j5n47q84p78
54387A09554j55N07N87J09k71j42J88K48L9j42j20J11N26R25R61O00L36N84J121
54368A15566J384J186P98M89L66M60P28R64R69O77L1r35j727j561m16N66L09q52
54350A19002j688j706j479j450j274n64L84R56Q93L78k35o43q16j053j494j734
$$ y = [100462, 100183, 100292, 101485, 103618, 105963, 107944, 109400, 110248, 110320, 109699, 108987, 108906, 109572, 110441, 111024, 111372, 111654, 111653, 111080, 110184, 109540, 109284, 109020, 108477, 107760, 106881, 105681, 104449, 104044, 104935, 106433, 107282, 106823, 105279, 103252, 101388, 100298, 100223, 100755, 101225, 101405, 101517, 101629, 101469, 100917, 100325, 100143, 100370, 100514, 100066, 98978, 97791, 97223, 97511, 98203, 98678, 98811, 98952, 99336, 99812, 100152, 100353, 100541, 100820, 101313, 102188, 103389, 104454, 104769, 104083, 102701, 101278, 100456, 100585, 101580, 102972, 104269, 105375, 106593, 108150, 109830, 111138, 111778, 111763, 111216, 110332, 109554, 109399, 109906, 110493, 110602, 110331, 110189, 110377, 110625, 110664, 110522, 110402, 110513, 111039, 111964, 112925, 113525, 113861, 114445, 115566, 116950, 118136, 118934, 119423, 119789, 120249, 120977, 121941, 122910, 123587, 123618, 122683, 120956, 119395, 118979, 119545, 119854, 119002, 117314, 115608, 114129, 112679, 111405, 110841, 111225, 112181, 113074, 113452, 113217, 112574, 111758, 110705, 109211, 107477]
54334A07477j351p10o01j046j151l36R23J783J942J543P90j6m35l22n4m1l09o89
54316A07397r94q86r9R36J289O67j13k45K7l1n07r24j062j098j042p51l83l40
54298A01841o70r21o89o8M56M53J2k46J46P46O40k24p74k34P99J374J516J731
54280A05888J714P40q32j673j314p22p44r13n37rj52p21o19M58J477J393M20l81
54262A03473l92Q8N34Q53J191J447J354J001Q23R67J021O44J05j26r0j67m41p08
54244A11577r60j296j459j101n35n12j068j337q07j33j49o70q93n86k09n3L6J18
54226I9963pl11l95L7Q02J433J530R57np51q81o00k88J02Q38J661J868J234L23
54207A07510k94o10p64o01l6N87Q95R46Q69M50m72j439j788j459q85k97L02O05
$$ y = [107477, 106126, 105416, 104815, 103769, 102618, 102282, 103205, 104988, 106930, 108473, 109263, 109247, 108812, 108490, 108436, 108395, 108086, 107397, 106403, 105517, 105418, 106354, 107643, 108310, 108197, 107952, 107979, 107948, 107441, 106517, 105455, 104357, 103315, 102564, 102181, 101841, 101171, 100250, 99561, 99493, 99949, 100402, 100414, 100168, 100314, 101060, 101700, 101476, 100702, 100468, 101267, 102641, 104157, 105888, 107602, 108342, 107510, 105837, 104523, 103801, 103057, 102144, 101607, 101598, 101446, 100725, 100106, 100564, 102041, 103434, 103854, 103473, 103081, 103169, 103703, 104556, 105747, 107194, 108548, 109549, 110372, 111339, 112360, 113004, 113109, 112983, 112893, 112726, 112285, 111577, 110617, 109321, 107862, 106761, 106226, 105714, 104646, 103309, 102502, 102369, 102220, 101550, 100657, 100071, 99862, 99809, 99845, 99963, 99956, 99645, 99250, 99287, 100089, 101522, 103052, 104009, 104004, 103253, 102372, 101772, 101484, 101586, 102424, 104085, 105953, 107187, 107510, 107216, 106606, 105842, 105241, 105205, 105792, 106687, 107633, 108502, 108952, 108480, 107041, 105253, 103794, 102909, 102612, 102914, 103519]
54189A03519J60q37j492j190k30P05J212J223Q80N88Q16J517K095K146J892J663
54173A14667J360P39j17r73j729k243k157j376m46m5k64p10j048j124p75n3N82
54156A04288P08M17N5k90o23o87l78k30p99j704j976j350m97N0M80J007J331J125
54138A00927N18j68p34r75o78j9M85O34O87P55N70J12j08K35Q04J158J324J437
54120A06964J310P76R7l93o33n48J07J140J688J217K91k49m38q20j245j001k2
54103A08241Q48R69O03L73N46J018J531J750J437P65J68j15j05J90P56J242J148
54086A21365L73o79j590k193k346j895r92j12L53L74J05k94o51q24q01n91j19
54069A09483O01J340J947K566L215L395K644J322L08j0P0K63N55P31M31k02n19
$$ y = [103519, 103679, 102842, 101350, 100160, 99930, 100635, 101847, 103070, 103950, 104538, 105354, 106871, 108966, 111112, 113004, 114667, 116027, 116766, 116649, 115676, 113947, 111704, 109547, 108171, 107725, 107680, 107416, 106706, 105658, 104534, 103759, 103706, 104288, 104996, 105413, 105468, 105178, 104555, 103868, 103490, 103260, 102461, 100757, 98781, 97431, 96934, 96984, 97464, 98471, 99802, 100927, 101445, 101277, 100543, 99568, 98890, 98871, 99356, 99990, 100677, 101432, 102002, 102114, 102006, 102241, 103045, 104203, 105527, 106964, 108274, 109050, 109147, 108754, 108121, 107573, 107680, 108820, 110508, 111725, 112016, 111767, 111329, 110509, 109264, 108263, 108241, 109089, 110058, 110661, 111034, 111580, 112598, 114129, 115879, 117316, 118081, 118249, 118134, 118029, 118219, 118975, 120217, 121365, 121738, 121059, 119469, 117276, 114930, 113035, 112043, 111931, 112284, 112658, 112763, 112469, 111818, 110994, 110193, 109602, 109483, 110084, 111424, 113371, 115937, 119152, 122547, 125191, 126513, 126821, 126811, 126881, 127144, 127699, 128430, 128861, 128659, 128140]
54052A28140k72Q7K49N19J087J478J339J175J647K427K555J875J414K136L699
54037A49555M805M621L684L281L953M814M571L063J382N09L65M08M56N66N22P5
54021A86630n58r78j252j731k333k541k255k095k673l766m465m095k919j931j903
54006A51135k599l096k873k285j830j434q32l15l95r36j257j141j082j321j363
53991A28376p84m5P4m55r49r43n58o0M62Q74R66P77O47O74N01q8o10m11L74Q56
53971A29678N04k08m32O1Q13J385J727J930K046K217K706L588M593N329N517M963
53955A66417L581J664j11j236j860k435k919k731j582n3R50J170J104J269J675
53940A64903K100K496K903L138K916K283J641J272J052P15K58J8M27J649L254
$$ y = [128140, 127868, 127955, 128204, 128723, 129810, 131288, 132627, 133802, 135449, 137876, 140431, 142306, 143720, 145856, 149555, 154360, 158981, 162665, 165946, 169899, 174713, 179284, 182347, 183729, 184238, 184603, 185011, 185467, 186033, 186555, 186630, 186072, 185094, 183842, 182111, 179778, 177237, 174982, 172887, 170214, 166448, 161983, 157888, 154969, 153038, 151135, 148536, 145440, 142567, 140282, 138452, 137018, 136186, 135871, 135476, 134540, 133283, 132142, 131060, 129739, 128376, 127592, 127547, 127621, 127166, 126217, 125274, 124716, 124656, 125118, 125992, 126958, 127735, 128382, 129056, 129557, 129469, 128859, 128448, 128822, 129678, 130182, 129974, 129542, 129603, 130416, 131801, 133528, 135458, 137504, 139721, 142427, 146015, 150608, 155937, 161454, 166417, 169998, 171662, 171551, 170315, 168455, 166020, 163101, 160370, 158788, 158735, 159685, 160855, 161959, 163228, 164903, 167003, 169499, 172402, 175540, 178456, 180739, 182380, 183652, 184704, 185419, 185677, 185695, 186122, 187771, 191025]
53925A91025M325M212L325K711K824L091L011L007L624M351M160L150K634L326
53911B38776M285M210L125K026J286L11j170k377k418j546r19j291k342l340m013
53896B34603m590n176n523n465n241n166n208n135m890m592m229l728l230k969
53882A69461k893k715k383k101j906j603j222j084j258j388j271j171j327j526
53868A45613j506j390j304j021m32o8n20j480k004j673r68m48j15K59O34P46M05
53851A34728l87j367j978j720o78N23J297J444J032L18k31k58j1j21p15j207j075
53834A29594m23L63J071J493J362Q72P66J340J813J335L06j23K92O62M31J47L62
53817A41663O52L66j85j05Q20J884K485K746L074L557L958M035L749L352L239
$$ y = [191025, 195350, 199562, 202887, 205598, 208422, 211513, 214524, 217531, 221155, 225506, 229666, 232816, 235450, 238776, 243061, 247271, 250396, 252422, 253708, 254019, 252849, 250472, 248054, 246508, 245589, 244298, 241956, 238616, 234603, 230013, 224837, 219314, 213849, 208608, 203442, 198234, 193099, 188209, 183617, 179388, 175660, 172430, 169461, 166568, 163853, 161470, 159369, 157463, 155860, 154638, 153554, 152296, 150908, 149637, 148466, 147139, 145613, 144107, 142717, 141413, 140392, 139960, 139892, 139372, 137892, 135888, 134215, 133247, 132799, 132684, 132943, 133577, 134323, 134728, 134341, 132974, 130996, 129276, 128598, 129121, 130418, 131862, 132894, 133212, 132981, 132723, 132712, 132591, 131876, 130669, 129594, 129171, 129534, 130605, 132098, 133460, 134332, 135098, 136438, 138251, 139586, 139892, 139769, 140061, 140723, 141154, 141301, 141663, 142315, 142681, 142496, 142391, 143211, 145095, 147580, 150326, 153400, 156957, 160915, 164950, 168699, 172051, 175290]
53802A75290L500L680L320K625K277K518K794K417J298J5o03l9J370K439K165
53787B05066Q38l17o91q70j516k354k735k610k397k294k331k711l418l839l459
53772A74362k665k205k064j702j168j079j458j616j300j106j397j737j736j648
53758A51481j650j344n67Q7J59J26N49R97P06j19o11n72n62p81p56k56L08N17
53740A47712L91Q2k71l08L05J174J380O41k60m44J23R63J774K418K682K518K265
53723A63145K207K178J978J833K072K552K900L154L553L790L162J634K00k23J24
53708A94259L46J94K74J035K126L032L802M710N504N552M689L477K508J903J573
53693B34984J479J430J081M65J27M04Q04N91k83j262j967k352k243j421k58L68
$$ y = [175290, 178790, 182470, 185790, 188415, 190692, 193210, 196004, 198421, 199719, 199734, 199131, 199092, 200462, 202901, 205066, 205904, 205587, 204896, 204026, 202510, 200156, 197421, 194811, 192414, 190120, 187789, 185078, 181660, 177821, 174362, 171697, 169492, 167428, 165726, 164558, 163479, 162021, 160405, 159105, 157999, 156602, 154865, 153129, 151481, 149831, 148487, 147920, 148007, 148166, 148292, 148841, 149838, 150544, 150425, 149814, 149242, 148680, 147899, 147143, 146887, 147195, 147712, 148103, 148185, 147914, 147606, 147911, 149085, 150465, 151106, 150846, 150402, 150525, 151488, 153262, 155680, 158362, 160880, 163145, 165352, 167530, 169508, 171341, 173413, 175965, 178865, 182019, 185572, 189362, 192524, 194158, 194358, 194135, 194259, 194605, 194799, 195073, 196108, 198234, 201266, 205068, 209778, 215282, 220834, 225523, 229000, 231508, 233411, 234984, 236463, 237893, 238974, 239439, 239566, 239970, 240774, 241365, 241082, 239820, 237853, 235501, 233258, 231837, 231579, 231947]
53677B31947Q0m89n32n3K84M8n29r66j078j047j081j101q32k42K60K56j36l82
53659B24407j97J10M5m52r24q01M0J107J735J729J434J212J121J236J747K439
53643B35988K535J612L88j0O10J531K256K784K990K612K009J983K545K787K284
53628B64904J860K302L170L529L271K955K833K791K860L040K899K180J566K042
53614C02202L540M954N456N164M482L581K687K237K418K897L201L035K308J272
53600C49434N93P64J373J486P80j60p55j003j089j072j226j941k942l219k337
53585C38686j244j156k006k685k543j950j499j397j667k250k695k371j295l70
53571C13558m00j136j615j287m65J94L42Q7j98j42L50R88J314J152P50M92N30
$$ y = [231947, 232027, 231538, 231006, 230953, 231237, 231285, 230756, 229790, 228712, 227665, 226584, 225483, 224651, 224409, 224669, 224925, 224789, 224407, 224210, 224320, 224365, 223913, 222989, 222188, 222228, 223335, 225070, 226799, 228233, 229445, 230566, 231802, 233549, 235988, 238523, 240135, 240523, 240513, 241123, 242654, 244910, 247694, 250684, 253296, 255305, 257288, 259833, 262620, 264904, 266764, 269066, 272236, 275765, 279036, 281991, 284824, 287615, 290475, 293515, 296414, 298594, 300160, 302202, 305742, 310696, 316152, 321316, 325798, 329379, 332066, 334303, 336721, 339618, 342819, 345854, 348162, 349434, 350027, 350791, 352164, 353650, 354430, 354270, 353515, 352512, 351423, 350351, 349125, 347184, 344242, 341023, 338686, 337442, 336286, 334280, 331595, 329052, 327102, 325603, 324206, 322539, 320289, 317594, 315223, 313928, 313558, 313158, 312022, 310407, 309120, 308655, 308849, 309191, 309278, 309080, 308938, 309288, 310276, 311590, 312742, 313492, 313984, 314514]
53554C14514P69J066J330J482J495J437J380J316J306J608K463L653M565M801
53540C43185M625M613N041N760O452O854O855O727P057Q197R775J1115J2005J2718
53526D50979J3331J3560J3395J3413J4086J5161J6084J6807J7726J8967K0226
53515F23735K1320K2446K3677K4610K4821K4564K4613K5366K6326K6618K5925
53504H94021K4728K3685K2987K2389K1648K0764J9910J9302J9082J9140J9080
53493A126736J8575J7649J6593J5686J5190J5367J6137J6827J6757J6070J5537
53482A307124J5464J5331J4593J3298J1588R262O327L509J477j30k272n225q377
53469A381969j1189j3659j5736j6979j7146j6683j6269j6254j6662j7412j8298
$$ y = [314514, 315283, 316349, 317679, 319161, 320656, 322093, 323473, 324789, 326095, 327703, 330166, 333819, 338384, 343185, 347810, 352423, 357464, 363224, 369676, 376530, 383385, 390112, 397169, 405366, 415141, 426256, 438261, 450979, 464310, 477870, 491265, 504678, 518764, 533925, 550009, 566816, 584542, 603509, 623735, 645055, 667501, 691178, 715788, 740609, 765173, 789786, 815152, 841478, 868096, 894021, 918749, 942434, 965421, 987810, 1009458, 1030222, 1050132, 1069434, 1088516, 1107656, 1126736, 1145311, 1162960, 1179553, 1195239, 1210429, 1225796, 1241933, 1258760, 1275517, 1291587, 1307124, 1322588, 1337919, 1352512, 1365810, 1377398, 1386660, 1392987, 1396496, 1397973, 1397843, 1395571, 1390346, 1381969, 1370780, 1357121, 1341385, 1324406, 1307260, 1290577, 1274308, 1258054, 1241392, 1223980, 1205682]
53458A205682j9053j9655k0263k0781k0891k0689k0731k1123k1124k0226j9113
53447I82033j8785j8962j8233j5854j2556r471o965m979l740l420l414k749j190
53434H61715N81J960L064M256N515O635P717R065J0688J2247J3500J4534J5551
53421I67028J6675J8064J9867K1940K3778K5033K5970K7237K9188L1658L4277
53410A240715L6741L8769M0165M1061M1951M3292M5176M7392M9641N1658N3295
53399A729856N4618N5792N6785N7394N7579N7522N7250N6523N5275N3867N2562
53388B345023N1108M9175M6914M4611M2057L8861L5287L1996K8948K5297K0623
53377B759900J5537J0704N879M72n497j1686j8208k5371l2795l9602m5412n0433
$$ y = [1205682, 1186629, 1166974, 1146711, 1125930, 1105039, 1084350, 1063619, 1042496, 1021372, 1001146, 982033, 963248, 944286, 926053, 910199, 897643, 888172, 881207, 876228, 872488, 869068, 865654, 862905, 861715, 862296, 864256, 867320, 871576, 877091, 883726, 891443, 900508, 911196, 923443, 936943, 951477, 967028, 983703, 1001767, 1021634, 1043574, 1067352, 1092385, 1118355, 1145592, 1174780, 1206438, 1240715, 1277456, 1316225, 1356390, 1397451, 1439402, 1482694, 1527870, 1575262, 1624903, 1676561, 1729856, 1784474, 1840266, 1897051, 1954445, 2012024, 2069546, 2126796, 2183319, 2238594, 2292461, 2345023, 2396131, 2445306, 2492220, 2536831, 2578888, 2617749, 2653036, 2685032, 2713980, 2739277, 2759900, 2775437, 2786141, 2792020, 2792492, 2786995, 2775309, 2757101, 2731730, 2698935, 2659333, 2613921, 2563488]
53365B563488n4548n7131n8015n7926n7580n6918n5704n4284n3134n2024n0334
53354A955890m8048m5784m3982m2664m2021m2398m3466m4039m3254m1489l9674
53343A479071l8043l6090l3587l0913k8388k5899k3363k1062j9187j7473j5662
53332A189404j4082j3361j3617j4289j4723j4617j3926j2738j1339j0125r246
53321A047341q539p859p315o988o624n754m090j767P53K894M319N219O157P455
53307A025202Q876J0062J1100J2428J4237J6319J8433K0565K2718K4677K6177
53296A210794K7129K7649K7970K8349K8828K8981K8142K6137K3656K1622K0251
53285A499508J8945J7032J4377J1212P722L992J58l589p120j0309j2955j4950
$$ y = [2563488, 2508940, 2451809, 2393794, 2335868, 2278288, 2221370, 2165666, 2111382, 2058248, 2006224, 1955890, 1907842, 1862058, 1818076, 1775412, 1733391, 1690993, 1647527, 1603488, 1560234, 1518745, 1479071, 1441028, 1404938, 1371351, 1340438, 1312050, 1286151, 1262788, 1241726, 1222539, 1205066, 1189404, 1175322, 1161961, 1148344, 1134055, 1119332, 1104715, 1090789, 1078051, 1066712, 1056587, 1047341, 1038802, 1030943, 1023628, 1016640, 1010016, 1004262, 1000172, 998405, 999158, 1002052, 1006371, 1011590, 1017747, 1025202, 1034078, 1044140, 1055240, 1067668, 1081905, 1098224, 1116657, 1137222, 1159940, 1184617, 1210794, 1237923, 1265572, 1293542, 1321891, 1350719, 1379700, 1407842, 1433979, 1457635, 1479257, 1499508, 1518453, 1535485, 1549862, 1561074, 1568796, 1572788, 1572946, 1569357, 1562237, 1551928, 1538973, 1524023]
53273A524023j6514j8073j9842k1698k3491k5223k6796k7872k8258k8375k8932
53262A258949l0106l1267l1673l1182l0176k9054k8078k7488k7392k7469k7174
53251I37890k6324k5278k4464k4049k4092k4675k5506k5735k4684k2731k0964
53240F69388j9935j9118j7800j5991j4171j2502j0861r397q504q229q213q309
53228E16358q731r456r964r928r780j0215j1333j2573j3331j3302j2543j1483
53216C83719j0697j0219r394p830o251n724o190o540o193n782o005o581o857o837
53202B82619o941p109o878o169n408m858m346l697l034k580k406k497k770l001
53188B20925k998k860k880l117l261k963k244j469j007r58j233j753k413k844
$$ y = [1524023, 1507509, 1489436, 1469594, 1447896, 1424405, 1399182, 1372386, 1344514, 1316256, 1287881, 1258949, 1228843, 1197576, 1165903, 1134721, 1104545, 1075491, 1047413, 1019925, 992533, 965064, 937890, 911566, 886288, 861824, 837775, 813683, 789008, 763502, 737767, 713083, 690352, 669388, 649453, 630335, 612535, 596544, 582373, 569871, 559010, 549613, 541109, 532880, 524667, 516358, 507627, 498171, 488207, 478279, 468499, 458284, 446951, 434378, 421047, 407745, 395202, 383719, 373022, 362803, 353409, 345579, 339328, 333604, 327414, 320874, 314681, 308899, 302894, 296313, 289456, 282619, 275678, 268569, 261691, 255522, 250114, 245256, 240910, 237213, 234179, 231599, 229193, 226696, 223926, 220925, 217927, 215067, 212187, 209070, 205809, 202846, 200602, 199133, 198126, 197168, 195935, 194182, 191769, 188925]
53174A88925k552j554n95l03l83k26k6m44j165r61M23J513R89n49j603j793j728
53157A77968j559r10m9J81l55r43j161j124o83M23J498J379K62k63M57J167Q08
53140A77096K00N08J161Q25l01p27L8Q99R11L71m9k04j80O1M02M91K85J92M76
53121A82455Q82J045Q77M94J42K16Q51J469J229R2j035j365r98m91k19m04j250
53104A83990k548l481l285k070p13J8M5j65j66J03L67M35M72O95R21P36J40l04
53086A75190j86K11K86j11n71o79m28q0J50J36j98p60j150r03m9P17O99n3q71
53067A71350j305j432j398j158q26q05j129j172m87M54Q45O83O80J173J713J771
53051A68957J301N60j70n80n26k89k80m22l14M9J80j36n14o14o04p47r36q91n67
$$ y = [188925, 186373, 184819, 184224, 183921, 183538, 183312, 183286, 182842, 181677, 180716, 181139, 182652, 183641, 183092, 181489, 179696, 177968, 176409, 175499, 175450, 175631, 175276, 174333, 173172, 172048, 171365, 171788, 173286, 174665, 174927, 174664, 175121, 176288, 177096, 177296, 177804, 178965, 179790, 179489, 178762, 178800, 179699, 180610, 180981, 180932, 180728, 180548, 180609, 181011, 181502, 181787, 181979, 182455, 183337, 184382, 185259, 185753, 185895, 186111, 186962, 188431, 189660, 189752, 188717, 187352, 186354, 185863, 185644, 185240, 183990, 181442, 177961, 174676, 172606, 171893, 171911, 171956, 171791, 171625, 171728, 172095, 172530, 173002, 173697, 174618, 175354, 175494, 175190, 175004, 175215, 175501, 175390, 174819, 174140, 173712, 173632, 173782, 173918, 173720, 172960, 171810, 170907, 170858, 171575, 172274, 172221, 171350, 170045, 168613, 167215, 166057, 165231, 164426, 163297, 162125, 161638, 162092, 162937, 163620, 164300, 165473, 167186, 168957, 170258, 170818, 170648, 170068, 169542, 169253, 168973, 168551, 168237, 168286, 168466, 168330, 167816, 167202, 166598, 165851, 164915, 164024, 163457]
53032A63457j02L56O13N05J30k71o86j223j658j552q88j27M93J053J346R11ql78
53014A61971K52J004R45L49Oj17n36j100j189q48o15m08L21J229J108l41j782
52997A60249j869q34J80O37P52O38K26j73p4M23P03N11K62L56O69Q69Q96Q81Q85
52978A66187R19J068J354J612J693J684J774J907J783J262N89J11q1j56j92r1
52962A81423J77L89K94r3n72j053j559j999k132j866j410j024p80o28n75n79m64
52945A67549j37R4k39j114j876j919j395r78j044j282j189o88n9N09J012J302
52929A58546J033J27q43j087m91J79J73k58j63Q36J911K000J059j5o09q73j033
52912A60492q43j51N02M28k21o09k66M83J088J334J204O44k72j237j867j883j171
$$ y = [163457, 163355, 163711, 164324, 164829, 164959, 164688, 164002, 162779, 161121, 159569, 158681, 158554, 159047, 160100, 161446, 162357, 162349, 161971, 162223, 163227, 164172, 164521, 164527, 164410, 163874, 162774, 161585, 160737, 160122, 159714, 160035, 161264, 162372, 162031, 160249, 158380, 157546, 157726, 158363, 159115, 159753, 159979, 159806, 159732, 160155, 160858, 161369, 161631, 161987, 162656, 163525, 164421, 165302, 166187, 167106, 168174, 169528, 171140, 172833, 174517, 176291, 178198, 179981, 181243, 181832, 181943, 181862, 181706, 181514, 181423, 181600, 181989, 182283, 182190, 181618, 180565, 179006, 177007, 174875, 173009, 171599, 170575, 169795, 169167, 168592, 168013, 167549, 167412, 167506, 167267, 166153, 164277, 162358, 160963, 159985, 158941, 157659, 156470, 155782, 155723, 156232, 157244, 158546, 159579, 159706, 158863, 157776, 157285, 157464, 157637, 157379, 157216, 158052, 159963, 161963, 163022, 163007, 162398, 161525, 160492, 159649, 159498, 160000, 160428, 160207, 159598, 159332, 159815, 160903, 162237, 163441, 164085, 163813, 162576, 160709, 158826, 157655]
52895A57655RQ77P35j68q21o78k28p6rN01J209J212J42j305k099j775n85R28K220
52876A57744K884K759K018J132O06N35M69o5q38j087n42J49L62M33J049K030K389
52859A72027J600K32p96j063o60O7N15Q4j169k416k887k632k171j762j348r74
52843A56647p55n46j05L68K98n14j435j623r67k71m09j361k136j789m51P67R62
52826A46680L61j18mL07K49j51l99j61M29J018J371J455J367J224J093R68P99
52809A56488N21Q5m71r44j074q19m34k12j85k37m13q54j384j455p72K15P14M80
52791A49249M6J8L97P30P64P14Q62J079R38L17l24m25q4K3m39r16o74J89P95N51
52771A53810k88j112j628j835j711j231o02j94k22m88m86J58J159J619J016Jk49
$$ y = [157655, 157664, 158541, 159276, 159108, 158287, 157609, 157381, 157305, 157296, 157797, 159006, 160218, 160360, 159055, 156956, 155181, 154596, 155524, 157744, 160628, 163387, 165405, 166537, 167143, 167678, 168147, 168082, 167244, 166157, 165615, 165764, 166126, 166559, 167608, 169638, 172027, 173627, 173859, 173063, 172000, 171340, 171407, 171922, 172006, 170837, 168421, 165534, 162902, 160731, 158969, 157621, 156647, 155892, 155346, 155241, 155609, 155907, 155393, 153958, 152335, 151368, 151097, 150688, 149327, 147191, 145402, 144951, 145718, 146680, 147041, 146923, 146919, 147226, 147475, 147324, 146925, 146764, 147193, 148211, 149582, 151037, 152404, 153628, 154721, 155689, 156488, 157009, 157094, 156623, 155679, 154605, 153786, 153352, 153140, 152955, 152718, 152305, 151451, 150067, 148612, 147840, 148055, 148769, 149249, 149295, 149313, 149710, 150440, 151204, 151918, 152780, 153859, 154797, 155114, 154790, 154365, 154281, 154304, 153865, 152949, 152275, 152464, 153259, 153810, 153522, 152410, 150782, 148947, 147236, 146005, 145403, 145209, 144987, 144499, 144013, 144171, 145330, 146949, 147965, 147966, 147717]
52754A47717M49J073R00M99P30J368J531J087P83J014J376J501J578J752J737
52739A65095J402J233J661K297K315J440J86p46j047r04q10j143j705j854j297
52724A66123n69m18r02j381j344q28j32M59O52K65m25q03o19l20l97o80o15j31
52706A57935K47K11J26M40R55J062N94ll40m89o13n89k88R6K92L65M96N25J84
52687A61206l36m68r1K44L2n49j005j222j483j876k076j753r87j62M47Q57J183
52670A51961J339J150P23M92P08J084J226J212J333J433J068M12K69Q92J440J144
52654A67886M34K56O20P04L00J54O62J080N61o13j458j571j348j148r16o44o28
52637A64331r88j327j164n18J64N65P18P84Q20Q17P91P69P05N47L74L69N77P56
$$ y = [147717, 148166, 149239, 150139, 150638, 151368, 152736, 154267, 155354, 156137, 157151, 158527, 160028, 161606, 163358, 165095, 166497, 167730, 169391, 171688, 174003, 175443, 175629, 174883, 173836, 172932, 172122, 170979, 169274, 167420, 166123, 165554, 165136, 164234, 162853, 161509, 160681, 160549, 161008, 161660, 161925, 161500, 160697, 160078, 159758, 159361, 158681, 158066, 157935, 158182, 158393, 158519, 158959, 159914, 160976, 161570, 161567, 161227, 160738, 160125, 159536, 159248, 159344, 159636, 160001, 160497, 161022, 161206, 160870, 160402, 160311, 160555, 160587, 160038, 159033, 157811, 156328, 154452, 152376, 150623, 149636, 149474, 149921, 150778, 151961, 153300, 154450, 155173, 155665, 156373, 157457, 158683, 159895, 161228, 162661, 163729, 164141, 164410, 165302, 166742, 167886, 168320, 168576, 169196, 169900, 170200, 170354, 171016, 172096, 172657, 172044, 170586, 169015, 167667, 166519, 165603, 164959, 164331, 163343, 162016, 160852, 160334, 160498, 161063, 161781, 162565, 163385, 164202, 164993, 165762, 166467, 167014, 167388, 167757, 168334, 169090]
52619A69090O35K97J63N41J266J849J868J222K15n47o12k27j77p37j109l89J030
52602A74378J730J040j10m41J73Q97J160J070Q26L89k03p33j051j093o89J92J048
52585A78583J193O52K11L68P00N51J8k16J63P04P85L08k90o18p88j139j575j507
52567A78103p13R7P2o30j046p63l70l74m49j24L92N77L73R5j05j84K6N21Q54O94
52547A77046L67L59N08L53RN7N64R28P23K02j25N0P62J690K121J541L00p57j306
52528A85392j688k059k073j555q45k65J99M72K75k19k20O79J772K046J414O37
52512A83962K69K41L61O43J117J633K004K095J775R97n3j039j726k056k021j605
52496A86597q80o8N53Q28Q07N61Kr44j887k087j324l96k50p75r96m20M37R74J265
$$ y = [169090, 169725, 170022, 170185, 170726, 171992, 173841, 175709, 176931, 177146, 176599, 175987, 175760, 175583, 174846, 173737, 173348, 174378, 176108, 177148, 177038, 176597, 176770, 177667, 178827, 179897, 180723, 181112, 180909, 180176, 179125, 178032, 177343, 177535, 178583, 179776, 180428, 180639, 181007, 181707, 182258, 182276, 182060, 182223, 182927, 183712, 184020, 183730, 183112, 182324, 181185, 179610, 178103, 177390, 177487, 177559, 176929, 175883, 175120, 174750, 174376, 173927, 173803, 174195, 174772, 175145, 175240, 175135, 174951, 174977, 175498, 176352, 177046, 177413, 177772, 178280, 178633, 178642, 178699, 179263, 180191, 180914, 181116, 180991, 181041, 181803, 183493, 185614, 187155, 187455, 186698, 185392, 183704, 181645, 179572, 178017, 177172, 176907, 177106, 177578, 177853, 177634, 177414, 178093, 179865, 181911, 183325, 183962, 184231, 184472, 184833, 185476, 186593, 188226, 190230, 192325, 194100, 195097, 195044, 194005, 192279, 190223, 188202, 186597, 185717, 185649, 186202, 187030, 187837, 188398, 188400, 187456, 185569, 183482, 182158, 181762, 181512, 180737, 179741, 179321, 179758, 180732, 181997]
52477A81997J572J696J369Q53O29O24L27l99r65p11L51J457J814J397R65J151
52461A94127J688J866J602J531J935K262J921J073J65p84j923k891l066k371j420
52446A95715q65r34j528k299k653k052n71R66J630J247N65M07P30P72K73kN80
52429A91981J310R85k90j126p77J4M35O78J069J179O47N4K7J43j26j10J145L070
52411B00308M036L652L295M050N305N742M869L140J289j5n17p48j581l085m263
52396B25477m224l128j801q98o63r32j091m96P48J831K227K177J958J368L45m27
52380B22471j79R32K053K642K843K959L060L040K847K569K501K984L982M914N088
52365B64706M310L035J969J515J479J276O23n8j72K19N07L82K28M34Q55J154J385
$$ y = [181997, 183569, 185265, 186634, 187487, 188116, 188740, 189067, 188668, 187703, 186992, 187343, 188800, 190614, 192011, 192976, 194127, 195815, 197681, 199283, 200814, 202749, 205011, 206932, 208005, 208170, 207386, 205463, 202572, 199506, 197135, 195715, 194850, 193916, 192388, 190089, 187436, 185384, 184813, 185779, 187409, 188656, 189221, 189628, 190358, 191130, 191403, 191401, 191981, 193291, 194276, 193986, 192860, 192083, 192097, 192532, 193210, 194279, 195458, 196105, 196159, 196186, 196329, 196203, 196093, 197238, 200308, 204344, 207996, 211291, 215341, 220646, 226388, 231257, 234397, 235686, 235671, 235154, 234406, 232825, 229740, 225477, 221253, 218125, 216324, 215426, 214763, 213831, 212740, 212244, 212992, 214823, 217050, 219227, 221185, 222553, 222898, 222471, 222292, 223224, 225277, 227919, 230762, 233721, 236781, 239821, 242668, 245237, 247738, 250722, 254704, 259618, 264706, 269016, 272051, 274020, 275535, 277014, 278290, 278913, 278855, 278683, 278902, 279409, 279791, 280019, 280453, 281308, 282462, 283847]
52348B83847J878K751L849M955N871O429O609O666O938P575Q458R373J0263J1344
52334C76806J2786J4215J4907J4750J4715J5716J7341J8372J8460J8502J9233
52323E55803K0254K0754K0500J9709J8529J7154J5935J4996J3985J2604J0996
52312G41219R405P868O483N470M684L664K443J666J480J055k24j715k498k776
52298G78224l347m191m599m466m434m755m999m944m812m561l825k769k037j640
52284G22845o60J426L963O141Q104J0325J2505J3862J4289J4380J4499J4463J4216
52271H50358J4127J4339J4312J3328J1308Q887O809N423M599L999L339K519J580
52258I54927N72m33j279j794k033k328k954l760m377m791n460o702q200r351r951
$$ y = [283847, 285725, 288476, 292325, 297280, 303151, 309580, 316189, 322855, 329793, 337368, 345826, 355199, 365462, 376806, 389592, 403807, 418714, 433464, 448179, 463895, 481236, 499608, 518068, 536570, 555803, 576057, 596811, 617311, 637020, 655549, 672703, 688638, 703634, 717619, 730223, 741219, 750624, 758492, 764975, 770445, 775129, 778793, 781236, 782902, 784382, 785437, 785213, 783498, 781000, 778224, 774877, 770686, 766087, 761621, 757187, 752432, 747433, 742489, 737677, 733116, 729291, 726522, 724485, 722845, 722185, 723611, 727574, 733715, 741819, 752144, 764649, 778511, 792800, 807180, 821679, 836142, 850358, 864485, 878824, 893136, 906464, 917772, 926659, 933468, 938891, 943490, 947489, 950828, 953347, 954927, 955499, 955066, 953787, 951993, 949960, 947632, 944678, 940918, 936541, 931750, 926290, 919588, 911388, 902037, 892086]
52243H92086j0207j0236r957r468r012q506p536o100m861m308m063l409k280j255
52229H00888p36n55l05L10J410K809L985M449M238L786L418L235L346L843M531
52214H38652N030N199N233N258N168M862M463M180M103M183M218L953L353K736
52200I00591K420K340K199J935J692J439J002M82K98O50J207J443J109L99k08
52185I18998k78P7R6r37k884m887o258o853o744o069n337n234n768o047n306l848
52169H52721k578j913j583j280r98p16k39N26J434K286K940L218K971K370J912
52154H61071J932K199K165J589P52J72J10M86J054J627K159K725L429M283N171
52139H90924O029O976Q089R086R512R456R723J1002J2971J4633J5516J6175J7368
$$ y = [892086, 881879, 871643, 861686, 852218, 843206, 834700, 827164, 821064, 816203, 811895, 807832, 804423, 802143, 800888, 800152, 799597, 799292, 799602, 801012, 803821, 807806, 812255, 816493, 820279, 823697, 826932, 830278, 834121, 838652, 843682, 848881, 854114, 859372, 864540, 869402, 873865, 878045, 882148, 886331, 890549, 894502, 897855, 900591, 903011, 905351, 907550, 909485, 911177, 912616, 913618, 914100, 914398, 915048, 916255, 917698, 918807, 919206, 918998, 918720, 918797, 918893, 917956, 915072, 910185, 903927, 897074, 890330, 884261, 878924, 873690, 867922, 861875, 856569, 852721, 850143, 848230, 846647, 845367, 844369, 843653, 843414, 843940, 845374, 847660, 850600, 853818, 856789, 859159, 861071, 863003, 865202, 867367, 868956, 869708, 869880, 869990, 870476, 871530, 873157, 875316, 878041, 881470, 885753, 890924, 896953, 903929, 912018, 921104, 930616, 940072, 949795, 960797, 973768, 988401, 1003917, 1020092, 1037460]
52126A037460J9138K0985K2621K4108K5207K5187K3634K1256J9425J8704J8206
52115A275931J6685J4058J1382R412P734N500K500q01l961o761r023j0632j1765
52102A300259j2653j3193j3120j2540j1863j1220j0339r058p640o465n681n223
52090A181264m918m508l876l233k790k278j188M41J978L150M533O721R276J1080
52076A195652J1663J1754J2366J3659J4889J5372J5159J4695J4052J2850J0918
52065A343029Q629O370M057J465j175l452n428p519r763j1719j3164j4300j5221
52052A281809j5718j5905j6423j7560j8657j8876j8359j8112j8771j9891k0531
52041A083006k0250j9459j8896j8772j8460j7081j4443j1272q543o772n911n592
$$ y = [1037460, 1056598, 1077583, 1100204, 1124312, 1149519, 1174706, 1198340, 1219596, 1239021, 1257725, 1275931, 1292616, 1306674, 1318056, 1327468, 1335202, 1340702, 1343202, 1342401, 1338440, 1331679, 1322656, 1312024, 1300259, 1287606, 1274413, 1261293, 1248753, 1236890, 1225670, 1215331, 1206273, 1198633, 1192168, 1186487, 1181264, 1176346, 1171838, 1167962, 1164729, 1161939, 1159661, 1158473, 1158914, 1160892, 1164042, 1168575, 1175296, 1184572, 1195652, 1207315, 1219069, 1231435, 1245094, 1259983, 1275355, 1290514, 1305209, 1319261, 1332111, 1343029, 1351658, 1358028, 1362085, 1363550, 1362375, 1358923, 1353495, 1345976, 1336213, 1324494, 1311330, 1297030, 1281809, 1266091, 1250186, 1233763, 1216203, 1197546, 1178670, 1160311, 1142199, 1123428, 1103537, 1083006, 1062756, 1043297, 1024401, 1005629, 987169, 970088, 955645, 944373, 935830, 929058, 923147, 917555]
52029I17555n355m977m733n147o295p637q608r109r364r642j0281j1503j2924
52016H11980j3655j3327j2686j2751j3631j4601j5141j5332j5383j5268j4975
52005F55230j4653j4396j4107j3635j2937j2072j1230j0715j0635j0651j0201
51994E19998r021p378n848m912m609m465l921k977k214k050k288k639l293m533
51980D59850o056p219p863q379q943r229q971q384p780p164o328n124l512j619
51966C63279J56J352J937K364L002L744M296M655N025N420N552N133M117K680
51952D12712J063n81k197l707m837n118m217k263J40K305L952N357O956Q874J0892
51937D29331J2808J4590J6168J7374J8198J8795J9049J8275J5752J1414N863k08
$$ y = [917555, 912200, 907223, 902490, 897343, 891048, 883411, 874803, 865694, 856330, 846688, 836407, 824904, 811980, 798325, 784998, 772312, 759561, 745930, 731329, 716188, 700856, 685473, 670205, 655230, 640577, 626181, 612074, 598439, 585502, 573430, 562200, 551485, 540850, 530199, 519998, 510977, 503599, 497751, 492839, 488230, 483765, 479844, 476867, 474653, 472603, 470315, 467676, 464383, 459850, 453794, 446575, 438712, 430333, 421390, 412161, 403190, 394806, 387026, 379862, 373534, 368410, 364898, 363279, 363435, 364787, 366724, 369088, 372090, 375834, 380130, 384785, 389810, 395230, 400782, 405915, 410032, 412712, 413775, 413194, 410997, 407290, 402453, 397335, 393118, 390855, 390995, 393300, 397252, 402609, 409565, 418439, 429331, 442139, 456729, 472897, 490271, 508469, 527264, 546313, 564588, 580340, 591754, 597617, 597409]
$$ [...]
##END NTUPLES=NMR SPECTRUM
##END=
