##TITLE=NES1090_ptc150_9886874_9Uv5KqM2iO
##JCAMPDX= 6.0         $$ Bruker NMR JCAMP-DX V2.0
##DATA TYPE= NMR SPECTRUM
##DATA CLASS= NTUPLES
##ORIGIN= BRUKER
##OWNER= Administrator
$$ 1.72 TOPSPIN		Version 2.1
$$ 2016-08-28 20:23:36.586 -0500  Administrator@X
$$ Compression mode = diff/dup
##.OBSERVE FREQUENCY= 400.02188249412
##.OBSERVE NUCLEUS= ^1H
##.ACQUISITION MODE= SIMULTANEOUS (DQD)
##.ACQUISITION SCHEME= undefined
##.AVERAGES= 8
##.DIGITISER RES= 22
##SPECTROMETER/DATA SYSTEM= spect
##.PULSE SEQUENCE= zg30
##.SOLVENT NAME= COFFEE_meoh
##.SHIFT REFERENCE= INTERNAL, COFFEE_meoh, 1, 14.98509
##AUDIT TRAIL= $$ (NUMBER, WHEN, WHO, WHERE, PROCESS, VERSION, WHAT)
$$ ##TITLE= Audit trail, TOPSPIN		Version 2.1
$$ ##JCAMPDX= 5.01
$$ ##ORIGIN= Bruker BioSpin GmbH
$$ ##OWNER= Administrator
$$ $$ E:\/data/COFFEE/nmr/NES1090_ptc150_9886874_9Uv5KqM2iO/10/pdata/1/auditp.txt
$$ ##AUDIT TRAIL=  $$ (NUMBER, WHEN, WHO, WHERE, PROCESS, VERSION, WHAT)
(   1,<2016-08-28 20:23:29.554 -0500>,<Administrator>,<X>,<go>,<TOPSPIN 2.1>,
      <created by zg
	started at 2016-08-28 20:22:23.929 -0500,
	POWCHK enabled, PULCHK disabled,
       configuration hash MD5:
       21 0F 79 D6 B3 7B B4 F6 88 20 88 DB 03 48 BD 9F
       data hash MD5: 64K
       A4 6B 03 98 99 C0 A8 53 16 C4 96 47 FD B6 81 21>)
(   2,<2016-08-28 20:23:32.633 -0500>,<Administrator>,<X>,<proc1d>,<TOPSPIN 2.1>,
      <Start of raw data processing
       efp LB = 0 FT_mod = 6 PKNL = 1 PHC0 = 0 PHC1 = 0 SI = 32K 
       data hash MD5: 32K
       0F FD 05 DB 49 8A C7 F6 C2 C0 8A 89 43 90 D2 F6>)
(   3,<2016-08-28 20:23:32.898 -0500>,<Administrator>,<X>,<proc1d>,<TOPSPIN 2.1>,
      <pk PHC0 = 89.75281 PHC1 = 0 
       data hash MD5: 32K
       38 33 40 C8 AB 65 16 DF FD B1 85 47 EE 50 A2 BB>)
(   4,<2016-08-28 20:23:33.008 -0500>,<Administrator>,<X>,<proc1d>,<TOPSPIN 2.1>,
      <abs ABSG = 1 
       data hash MD5: 32K
       78 B8 B7 2C 87 3A C4 1E A6 BE 05 1B EF 81 0E E7>)
(   5,<2016-08-28 20:23:33.070 -0500>,<Administrator>,<X>,<proc1d>,<TOPSPIN 2.1>,
      <abs ABSG = 2 
       data hash MD5: 32K
       9C 6F 8A 2A 6F 79 AF 9E DF 91 33 63 22 1F 4C 28>)
(   6,<2016-08-28 20:23:33.117 -0500>,<Administrator>,<X>,<proc1d>,<TOPSPIN 2.1>,
      <abs ABSG = 3 
       data hash MD5: 32K
       E2 88 EF 25 6B AD 9E E2 C8 2E B0 7D 83 D7 03 23>)
(   7,<2016-08-28 20:23:33.179 -0500>,<Administrator>,<X>,<proc1d>,<TOPSPIN 2.1>,
      <abs ABSG = 4 
       data hash MD5: 32K
       F2 EC 60 B3 A3 D3 CD 55 E1 97 30 EA BA 0F 64 16>)
(   8,<2016-08-28 20:23:33.226 -0500>,<Administrator>,<X>,<proc1d>,<TOPSPIN 2.1>,
      <abs ABSG = 5 
       data hash MD5: 32K
       C6 52 A0 D9 7F A6 9A 94 94 73 34 23 40 50 CA 59>)
$$ ##END=
$$ 
$$ $$ hash MD5
$$ $$ AA BC F9 28 37 BD 00 5B 4A 49 DC 5A 6E BC 27 0C
##$RELAX= 
##$RELAX= 
##$RELAX= 
##$RELAX= 
##$RELAX= 
##$RELAX= 
##$RELAX= 
$$ Bruker specific parameters
$$ --------------------------
##$DU= <E:\>
##$EXPNO= 10
##$NAME= <NES1090_ptc150_9886874_9Uv5KqM2iO>
##$PROCNO= 1
$$ [...]
150 150 150 150 150 150 150 150
##$TP07= 0
##$TPNAME0= <>
##$TPNAME1= <>
##$TPNAME2= <>
##$TPNAME3= <>
##$TPNAME4= <>
##$TPNAME5= <>
##$TPNAME6= <>
##$TPNAME7= <>
##$TPOAL= (0..7)
0.5 0.5 0.5 0.5 0.5 0.5 0.5 0.5
##$TPOFFS= (0..7)
0 0 0 0 0 0 0 0
##$TUNHIN= 0
##$TUNHOUT= 0
##$TUNXOUT= 0
##$USERA1= <user>
##$USERA2= <user>
##$USERA3= <user>
##$USERA4= <user>
##$USERA5= <user>
##$V9= 5
##$VALIST= <valist>
##$VCLIST= <CCCCCCCCCCCCCCC>
##$VD= 0
##$VDLIST= <DDDDDDDDDDDDDDD>
##$VPLIST= <PPPPPPPPPPPPPPP>
##$VTLIST= <TTTTTTTTTTTTTTT>
##$WBST= 2048
##$WBSW= 25
##$XGAIN= (0..3)
0 0 0 0
##$XL= 0
##$YL= 0
##$YMAX_a= 601671
##$YMIN_a= -522629
##$ZGOPTNS= <>
##$ZL1= 120
##$ZL2= 120
##$ZL3= 120
##$ZL4= 120
##$ABSF1= 14.98509
##$ABSF2= -5.573092
##$ABSG= 5
##$ABSL= 3
##$ALPHA= 0
##$AQORDER= 0
##$ASSFAC= 0
##$ASSFACI= 0
##$ASSFACX= 0
##$ASSWID= 0
##$AUNMP= <proc_prof1d_extract_pilot.lims>
##$AXLEFT= 0
##$AXNAME= <>
##$AXNUC= <1H>
##$AXRIGHT= 0
##$AXTYPE= 0
##$AXUNIT= <>
##$AZFE= 0.1
##$AZFW= 0.1
##$BCFW= 0
##$BC_mod= 0
##$BYTORDP= 0
##$COROFFS= 0
##$CY= 15
##$DATMOD= 1
##$DC= 0
##$DFILT= <>
##$DTYPP= 0
##$F1P= 0
##$F2P= 0
##$FCOR= 0.5
##$FTSIZE= 32768
##$FT_mod= 6
##$GAMMA= 0
##$GB= 0
##$INTBC= 1
##$INTSCL= 1
##$ISEN= 128
##$LB= 0
##$LEV0= 0
##$LPBIN= 0
##$MAXI= 10000
##$MC2= 0
##$MEAN= 0
##$ME_mod= 0
##$MI= 0
##$NCOEF= 0
##$NC_proc= -8
##$NLEV= 6
##$NOISF1= 0
##$NOISF2= 0
##$NSP= 0
##$NTH_PI= 0
##$NZP= 0
##$OFFSET= 14.98509
##$PC= 1
##$PHC0= 89.75281
##$PHC1= 0
##$PH_mod= 1
##$PKNL= yes
##$PPARMOD= 0
##$PPDIAG= 0
##$PPIPTYP= 0
##$PPMPNUM= 2147483647
##$PPRESOL= 1
##$PSCAL= 4
##$PSIGN= 0
##$PYNMP= <proc.py>
##$REVERSE= no
##$SF= 400.02
##$SI= 32768
##$SIGF1= 0
##$SIGF2= 0
##$SINO= 400
##$SIOLD= 32768
##$SPECTYP= <>
##$SREGLST= <1H.CDCl3>
##$SSB= 0
##$STSI= 32768
##$STSR= 0
##$SW_p= 8223.68421052631
##$SYMM= 0
##$S_DEV= 0
##$TDeff= 65536
##$TDoff= 0
##$TI= <>
##$TILT= no
##$TM1= 0
##$TM2= 0
##$TOPLEV= 0
##$USERP1= <user>
##$USERP2= <user>
##$USERP3= <user>
##$USERP4= <user>
##$USERP5= <user>
##$WDW= 1
##$XDIM= 32768
##$YMAX_p= 449330800
##$YMIN_p= -820848
##$CURPLOT= <Network HP LaserJet P1505>
##$CURPRIN= <$Network HP LaserJet P1505>
##$DFORMAT= <normdp>
##$LAYOUT= <+/1D_H.xwp>
##$LFORMAT= <normlp>
##$PFORMAT= <normpl>
##$SURQMSG= 1
$$ End of Bruker specific parameters
$$ ---------------------------------
##NTUPLES= NMR SPECTRUM
##VAR_NAME=  FREQUENCY,     SPECTRUM/REAL,   SPECTRUM/IMAG
##SYMBOL=    X,             R,               I
##VAR_TYPE=  INDEPENDENT,   DEPENDENT,       DEPENDENT
##VAR_FORM=  AFFN,          ASDF,            ASDF
##VAR_DIM=   32768,         32768,           32768
##UNITS=     HZ,            ARBITRARY UNITS, ARBITRARY UNITS
##FACTOR=    0.250966925370066, 1,           1
##FIRST=     8223.43324360094, 72388,        118763
##LAST=      0,             20259,           -138990
##MIN=       0,             -820848,         0
##MAX=       8223.43324360094, 449330800,    0
$$ Real data points
##PAGE= N=1
##DATA TABLE= (X++(R..R)), XYDATA
$$ [...]
$$ plain form
19558 -299648 -119847 -76267 554487 292875 36678 -75958 1380 -237176 -57659 -338634 -163395
19546 -363696 65423 -136936 44245 85115 -139649 -122745 172883 16462 82448 45369 262267
19535 262267 -140859 135915 -95652 246089 -100896 -297396 226349 -269396 82235 -5677
19524 -119541 -26988 -73418 36466 -50912 110108 38577 346007 -4517 -204865 -311638 120452
19512 -124250 -61568 169592 -266347 319815 -122955 26117 -188250 -202785 38454 -244738
19501 -68903 -68714 -126968 25999 -44762 124105 -129815 112869 3943 -27979 -165320 156049
19489 -20232 74055 49169 -154311 -132250 -217089 -195634 265150 -196597 -253645 -113253 -189227
19478 -189227 -205333 67593 -54069 -184764 -114884 37396 38948 20960 -130204 16461 -291011
$$ packed form
19558b99648a19847M3580E54487k61612C6678g5958A380b37176e7659k80975a63395
19546c63696F5423a36936D4245M0870a39649J6904A72883A6462O5986l7079K16898
19535B62267a40859A35915i5652B46089a00896j96500B26349b69396H2235e677
19524a19541b6988m6430C6466e0912A10108C8577L07430d517k00348j06773A20452
19512a24250f1568A69592b66347C19815a22955B6117a88250j4535C8454b44738
19501f8903J89n8254B5999d4762A24105a29815A12869C943b7979j37341A56049
19489b0232G4055k4886a54311K2061q4839K1455B65150a96597n7048a13253p5974
19478a89227j6106F7593e4069j30695O9880C7396J552j7988a30204A6461b91011
$$ plain form
19466 -111321 -216721 139102 232139 -123610 -72623 -218922 -317844 -142491 187139 -62065
19455 -254962 -42883 -69765 -216128 -140586 -222768 -81265 -137436 295580 -220241 -125266 99754
19443 102352 -264540 -19542 -18013 95303 97837 -21346 -57022 -364373 -614399 -195437 153084
19431 128244 -174597 -16109 -79217 -154470 282951 -82570 -367127 -144457 33935 185953
19421 185953 52807 -140558 -406734 -8807 -131826 -216617 -177249 -113137 102121 -141977 -53003
19409 -254309 -139649 -123872 -189834 -186992 -129545 -158653 -434967 -78169 -32980 -123231 -172300
19398 -172300 -93703 -338647 -22563 10158 17621 -14778 -117258 -3248 -202615 147965 -126361
19386 116223 -57893 -44577 -275898 -206614 -316946 -142907 -107474 -193192 -154576 -96077 122774
$$ packed form
19466a11321j05400A39102R3037a23610N0987j46299r8922a42491A87139f2065
19455b54962d2883k6882j46363P5542q2182h1265n6171B95580b20241R4975I9754
19443A02352b64540a9542J529I5303K534b1346l5676l07351k50026a95437A53084
19431A28244a74597a6109o3108p5253B82951h2570k84557a44457C3935J52018
19421A85953E2807a40558k66176h807j23019q4791L9368O4112A02121a41977e3003
19409b54309J14660J5777o5962K842N7447k9108k76314g8169c2980r0251m9069
19398a72300P8597k44944b2563A0158P463a4778j02480c248j99367A47965a26361
19386A16223e7893J3316k31321O9284j10332a42907L5433q5718L8616N8499A22774
$$ plain form
19374 -151176 27036 295862 -367608 95895 72767 -349896 55397 -143765 -232762 -374124
19364 -374124 31875 -19748 -96522 -53262 19390 248038 -97674 -77273 144555 -108252 220260
19352 171692 -188550 273460 30540 27608 -8440 -371422 129283 -6500 -135005 -142483 -19766
19340 69709 -130691 -3194 123964 -109192 251742 49876 -236436 24014 110428 -90224 -169292
19329 -169292 204131 133339 -296589 244277 -73472 -350888 103593 -197239 -104007 -299667
19319 -299667 -153249 -37841 -531838 26645 -107694 -20667 -234612 135194 -8990 -75441 76467
19307 -552 -26806 152808 -108779 -213170 160481 -66035 133709 -307487 292623 217944 71192
19295 268663 109547 -142759 -57633 24824 -95134 -209797 156506 38570 22908 57215 -97090
$$ packed form
19374a51176B7036K68826c67608I5895k3128c49896E5397a43765q8997j41362
19364c74124C1875a9748p6774M3260A9390K28648i7674K0401A44555a08252B20260
19352A71692a88550B73460C0540k932h440l62982A29283f500j28505p478a9766
19340F9709a30691c194A23964a09192B51742D9876b36436B4014Q6414i0224p9068
19329a69292B04131p0792b96589B44277g3472k77416A03593a97239R3232j95660
19319b99667J46418c7841m93997B6645a07694b0667k13945A35194h990o6451G6467
19307e52k6254A52808a08779j04391A60481f6035A33709c07487B92623p4679G1192
19295B68663A09547a42759e7633B4824i5134j14663A56506C8570j5662L4307i7090
$$ plain form
19283 -129914 26909 36445 -194182 81741 -36453 -224382 -287586 17710 133142 60337 -7235
19271 -156049 -114092 92061 101089 -74326 -320345 -99689 13899 319558 190280 59626 310144
19260 310144 -30887 -311047 96433 52156 -17402 -203847 -354141 222545 53127 -88684 -385468
19249 -385468 -40947 -188736 -176767 -422937 -326804 -129999 -67724 107369 109450 -55826 -284173
19238 -284173 -12948 -90854 85507 -71312 64322 335862 -292893 -213009 118055 -349677 8022
19226 -49969 -31748 -229252 -139939 -79421 -116982 -201910 -114772 -105814 43420 119825 -17675 169188
19213 -266587 -358410 -256960 14592 39558 -20920 158180 -1408 26338 134690 47790 -374412
19201 125115 -34590 91833 -174607 242704 91226 -187256 -216734 168000 -139339 -110991
$$ packed form
19283a29914B6909R536a94182H1741c6453j87929o3204A7710J15432F0337g235
19271a56049M1957I2061R028g4326k46019i9689A3899L05659j29278E9626K50518
19260C10144c0887k80160I6433m4277a7402j86445j50294B22545E3127h8684k96784
19249c85468d0947j47789J1969k46170R6133a29999O2275A07369K081e5826k28347
19238b84173a2948p7906H5507g1312F4322K71540b92893P9884A18055c49677H022
19226d9969J8221j97504Q9313O0518l7561q4928Q7138Q958D3420P6405a7675A69188
19213b66587r1823J01450A4592K4966b0920A58180a408B6338J08352D7790c74412
19201A25115c4590I1833a74607B42704I1226a87256k9478A68000a39339K8348
$$ plain form
19191 -110991 8677 -208650 -259181 -181720 -260077 82272 -50483 -60862 43950 9496 -126679
19179 -48887 179193 62698 175315 -16673 -274536 -156419 -99344 -258743 -8325 -130962 154281
19167 244977 -108620 18593 -53071 -283696 -59306 -69229 -7673 38699 -194299 52441 -266148
19155 -218330 51358 -481177 19864 -18212 71958 -101904 -145339 -163541 -105310 151873 -246904
19143 -107708 32628 176637 -155587 -137929 142120 79468 -144250 187996 48169 -133426
19132 -263616 -40603 -134597 -1503 -192421 -35894 -15151 44738 -316544 46533 -123834 152043
19120 -19437 -95553 -151940 214778 78567 168827 -19382 -71984 -279456 226947 114546 -272927
19108 -271614 -9030 -115471 -335540 -210683 98695 -41398 112571 -111574 7776 177248 213250
$$ packed form
19191a10991H677b08650n0531P7461p8357H2272e0483j0379D3950I496a26679
19179d8887A79193F2698J12617a6673k57863J18117N7075j59399h325j22637A54281
19167B44977a08620A8593e3071k30625e9306r923g673C8699a94299E2441b66148
19155b18330E1358d81177A9864a8212G1958a01904m3435j8202N8231A51873b46904
19143a07708C2628J44009a55587J7658A42120o2652a44250A87996D8169a33426
19132b63616d0603r3994a503j90918c5894a5151D4738c16544D6533a23834A52043
19120a9437p6116n6387B14778G8567R0260a9382n2602k07472B26947j12401b72927
19108b71614i030j06441k20069J24857I8695d1398A12571a11574G776J69472L6002
$$ plain form
19097 213250 -177934 148137 30070 -223130 26372 -78647 25213 -231214 -131452 54634 -115742
19085 227144 -408713 35878 150814 109839 -54836 -197214 169153 -125647 165425 34138
19074 23723 -286084 47116 98694 137573 -255405 -180797 -222649 -251503 106214 -68012 46817
19062 -113486 460321 110498 402126 99238 -206110 417614 -101759 -129143 40342 -43795
19051 -219139 -28127 -251597 -228854 -406255 -64955 20846 -5494 -113977 -232426 -91267 -373206
19040 -373206 -13010 93849 -31100 -320666 -38538 -107428 -98564 -84377 -98175 2402 16249 141628
19028 141628 -131929 99858 -345518 409791 74929 59031 155330 274136 -82889 -145012 28232
19016 178306 -80068 -20428 105849 28017 -112385 -121194 -150527 -167689 -64973 -12594 -100360
$$ packed form
19097B13250a77934A48137C0070b23130B6372g8647B5213b31214R9762E4634a15742
19085B27144d08713C5878J14936m0975e4836j42378A69153a25647A65425C4138
19074B3723b86084D7116N1578L8879b55405P4608m1852k8854A06214f8012D6817
19062a13486D60321A10498K91628I9238b06110D17614a01759k7384D0342d3795
19051b19139b8127k23470K2743j77401f4955B0846e494j08483j18449i1267k81939
19040c73206a3010I3849c1100k89566c8538o8890Q864J4187j3798B402J3847J25379
19028A41628a31929I9858c45518D09791G4929j5898R6299J18806h2889o2123B8232
19016A78306h0068b0428A05849B8017a12385q809k9333j7162f4973a2594q7766
$$ plain form
19005 -100360 -23922 -12935 7418 2229 21142 -123091 -23350 -165209 127262 -264948 -186050
18994 -186050 -22427 -42532 -56157 41090 -301109 91340 -147167 -2612 27510 -190398 130564
18982 -70121 10982 305908 192618 216046 -342918 57564 21501 -33425 -60519 -48011 -108992
18971 -108992 116130 21448 92558 23563 25823 -110100 -191566 209288 123007 29249 168052
18960 168052 -107447 54027 -15985 88038 -216110 -7871 176420 -39717 52900 111378 -52761
18948 -115438 50234 -55032 -39138 -155202 181946 59394 -12693 -128426 164982 -282490
18937 -13515 -317380 -96539 -57626 -43837 -44391 255597 -285804 -80240 -86132 103373 80442
18926 80442 191734 -326448 -28101 -127374 -212486 67525 -213793 52846 -181636 -106671 124735
$$ packed form
19005a00360b3922J0987G418B229J8913a23091b3350j41859A27262b64948P8898
18994a86050b2427k0105j3625D1090c01109I1340a47167b612B7510a90398A30564
18982g0121A0982K94926j13290K3428c42918E7564B1501c3425k7094J2508o0981
18971a08992A16130B1448P1110B3563K260a10100q1466B09288q6281B9249J38803
18960A68052a07447E4027a5985H8038b16110g871A76420c9717E2900N8478e2761
18948a15438E0234e5032J5894j16064A81946E9394a2693j15733A64982b82490
18937a3515l03865i6539L8913J3789n54B55597b85804h0240n892A03373k2931
18926H0442J11292c26448b8101r9273q5112F7525b13793E2846a81636P4965A24735
$$ plain form
18914 73329 77905 -41852 146656 170922 -186729 87187 -95818 -434252 -98044 -85808 114759
18902 5479 -171700 -365599 -59158 -54265 6626 186688 168348 -165007 181494 122004 -106217
18890 138175 -279103 -166182 182234 374131 41149 -125311 135510 149004 -418951 -25018
18879 -89930 -45173 121297 12482 -19607 -4088 101567 -71097 -289400 -115959 -232761 33015
18867 -205733 -247012 -89890 14270 298761 -157198 -164557 65692 221774 -43067 211876 -179668
18855 4457 -218932 453805 -151906 378451 -207631 -7231 -50715 -66525 4123 -95031 42272
18843 -379400 -89394 -45507 49008 -113629 97370 -2724 -64969 127121 5067 -30461 -200093
18832 -200093 -64562 34586 -304764 -360305 -185032 -141323 -28585 -193914 81105 19235 152146
$$ packed form
18914G3329M576d1852A46656K4266a86729H7187i5818l38434i8044J2236A14759
18902E479a71700j93899e9158M893F626J80062j8340a65007A81494n9490a06217
18890A38175b79103J12921A82234J91897D1149a25311A35510J3494d18951b5018
18879h9930M4757A21297A2482a9607d088A01567g1097k18303a15959j16802C3015
18867b05733m1279h9890A4270K84491a57198p359F5692J56082d3067B11876a79668
18855D457b18932D53805a51906C78451b07631g231m3484j5810D123i5031D2272
18843c79400h9394M3887D9008a13629I7370b724o2245A27121E067c0461j69632
18832b00093f4562C4586c04764n5541J75273M3709b8585j65329H1105A9235J32911
$$ plain form
18821 152146 376484 -84200 -68387 250131 -269267 89636 -166722 -12730 417422 232726
18811 232726 251306 -144926 104210 -4363 34340 -9864 -161818 -89474 -88233 -7940 -66513 48184
18798 -114184 -106762 -71603 38071 -115792 82272 -86521 -23770 -241290 -28588 14690 -374103
18786 112977 -143912 129572 272781 18723 -135310 -56885 135564 -113976 -200560 21383
18775 -142912 5344 -174356 -209430 161642 -344862 -171169 -5430 -130976 -63152 138223 -209482
18763 43257 -51095 -198884 40550 7320 143112 -133934 205978 20509 -145573 -7672 41242
18751 -160973 -146127 126750 -28693 -40193 -108334 78105 -81548 120682 -51392 -207850 63565
18739 266612 -152177 -154859 -28293 -61588 74401 -10125 -166630 121216 -61433 -376323 -276617
$$ packed form
18821A52146K24338h4200J5813B50131b69267H9636a66722a2730D17422j84696
18811B32726J8580a44926A04210d363C4340i864j51954P2344J241g940n8573D8184
18798a14184P422L5159C8071a15792H2272h6521b3770k17520b8588A4690c74103
18786A12977a43912A29572J43209A8723a35310e6885A35564a13976q6584B1383
18775a42912E344a74356l5074A61642c44862a71169e430j25546f3152A38223b09482
18763D3257e1095j47789D0550G320J35792a33934B05978B0509a45573g672D1242
18751a60973J4846A26750b8693j1500o8141G8105h1548A20682e1392j56458F3565
18739B66612a52177k682b8293l3295G4401a0125j56505A21216f1433l14890R9706
$$ plain form
18728 -276617 -58081 -80639 -6345 -354200 105135 29378 -226167 -98105 -196936 132081 112739
18717 112739 -133022 -138825 -217826 -68644 -129226 -199323 73004 -156721 -39057 -127487 59929
18705 -118217 70721 126171 -253265 -340817 27911 36285 70298 -243765 112467 236104 6638
18693 184095 111230 56927 160611 -25839 -199346 -235954 -89289 -118789 -115309 -62201 -79014
18682 -79014 -259820 -230835 147238 -47980 -45827 7918 -10301 124980 -20819 90218 -195028
18670 -186752 166808 7108 -314035 406566 137628 217509 -122984 -41396 -317857 2903 -166988
18658 88613 246779 -180903 -7027 73457 -68308 -74348 -9728 -169624 -208752 -149908 84813 -73564
18645 -504698 171066 -324050 -58302 -104409 -358373 33237 26543 187670 -134328 -83511 42430
$$ packed form
18728b76617e8081k2558f345l47855A05135B9378b26167i8105r8831A32081j9342
18717A12739a33022n803p9001f8644o0582p0097G3004a56721c9057q8430E9929
18705a18217G0721N5450b53265q7552B7911Q374L4013b43765A12467J23637F638
18693A84095p2865n4303J03684b5839j73507l6608h9289k9500L480N3108j6813
18682g9014j80806K8985A47238d7980K153G918a0301A24980b0819I0218a95028
18670a86752A66808G108c14035D06566A37628P9881a22984d1396k76461B903a66988
18658H8613J58166a80903g027G3457f8308o040i728j59896l9128N8844H4813g3564
18645e04698A71066c24050e8302m6107k53964C3237o694J61127a34328N0817D2430
$$ plain form
18633 -3398 -18987 -131568 -64829 -234071 -94250 2588 -55592 -89777 -209188 -202305 148989
18621 -256447 -38983 55513 183110 27254 13387 417263 -508846 -169799 60162 -57581 -42613
18610 -42613 -71550 16871 -51326 297493 -82477 -179873 145836 -88672 101645 17977 -547924
18598 -72868 -342624 -207122 -67505 -59023 71003 -115219 187731 64454 394 -167738 24575
18586 170195 79551 -67196 -317134 -31472 -261435 -192618 -99110 -100964 57337 87368 -140642
18574 59748 21551 25116 17094 36954 -245973 -223764 -176779 144482 -74169 -56826 -85381 35450
18561 6427 7878 9647 -8503 205851 -250480 -138297 96673 236635 -110383 140224 -128367
18549 -212081 176740 -115891 -50704 30663 -253135 -292956 45036 66049 90968 -6239 -68392
$$ packed form
18633c398j5589j12581f4829j69242i4250B588e5592l4185j19411O883A48989
18621b56447c8983E5513J27597B7254A3387M03876e08846a69799F0162e7581J4968
18610d2613k8937A6871e1326B97493h2477r7396A45836h8672A01645A7977e47924
18598g2868k69756J35502f7505Q482G1003a15219A87731F4454C94a67738B4575
18586A70195G9551f7196k49938c1472k29963O8817R3508j854E7337L0031a40642
18574E9748B1551L565q022J9860b45973K2209M6985A44482g4169J7343k8555C5450
18561F427J451J769h503B05851b50480J12183I6673J39962a10383A40224a28367
18549b12081A76740a15891e0704C0663b53135l9821D5036K1013K4919f239o2153
$$ plain form
18538 -68392 -72889 37861 34628 -373715 -153289 22086 -277391 -433937 -233757 230998 -196906
18526 -385449 295259 -171011 -45985 -71748 -125479 153142 -119458 -42274 -291579 -17501
18515 -19137 -2091 -175907 24128 168094 80548 284614 184459 -18490 89596 -158842 278052
18503 -153895 7531 -353497 -124542 53613 240445 -18784 -26758 -123097 -62545 355064 55282
18491 -158538 116514 -62052 198343 42551 -74892 -65743 -25330 -26412 28063 -164812 50435
18479 67876 60424 -173591 -51703 -40754 222489 344280 133032 -211553 29859 -13792 125648
18467 -292892 -215115 10673 201141 -164363 131037 105668 -361643 -90486 139575 88020
18457 88020 193918 -109794 -51668 -265130 -5248 76769 -227206 -36886 -8900 -84804 11840
$$ packed form
18538f8392m497C7861l233c73715a53289B2086b77391j56546K00180B30998a96906
18526c85449B95259a71011d5985k5763n3731A53142a19458d2274k49305a7501
18515a9137b091j73816B4128J43966H0548K04066j00155a8490H9596a58842B78052
18503a53895G531c53497a24542E3613J86832a8784p974r6339O0552C55064E5282
18491a58538A16514f2052A98343D2551g4892R149b5330j082B8063a64812E0435
18479F7876p452a73591e1703J0949B22489J21791A33032b11553B9859a3792A25648
18467b92892P7777A0673J90468a64363A31037k5369c61643i0486A39575n1555
18457H8020J05898a09794e1668k13462e248G6769b27206c6886h900p5904A1840
$$ plain form
18445 -253849 27127 -128794 -117549 -87371 58769 -349791 -36939 15535 -68202 -74188 114846
18433 -155373 -251531 95224 -86661 -74176 48857 -126691 -116622 -103725 -390771 -173967 -54283
18421 -43648 212292 38620 -68924 72136 -104544 231509 41212 -374114 -198074 -233157 51945
18409 79730 -91270 91177 -43205 22551 34352 -40346 13906 -56754 -91423 -289446 -45690
18397 251673 75400 -216774 98238 300337 7975 91461 -353778 145495 -202622 161492
18386 35464 -538005 -171347 -76811 78831 -48959 -38046 127604 -48280 -280718 40101 -105430
18374 -27460 -82193 117547 151496 184894 282514 -368289 -47143 -134174 -159634 144476 517846
18363 517846 -111333 -99532 -235833 -173790 151734 43819 193823 -128508 -166865 -570529
$$ packed form
18445b53849B7127a28794J1245L0178E8769c49791c6939A5535f8202n986A14846
18433a55373r6158I5224h6661J2485D8857a26691J0069J2897k87046a73967e4283
18421d3648B12292C8620f8924G2136a04544B31509D1212c74114J76040l5083E1945
18409G9730i1270I1177d3205B2551J1801d0346A3906e6754l4669j98023d5690
18397B51673G5400b16774I8238K02099G975Q3486c53778A45495b02622A61492
18386C5464e38005a71347g6811G8831d8959J0913A27604d8280k32438D0101a05430
18374b7460n4733A17547L3949L3398R7620c68289d7143q7031k5460A44476L73370
18363E17846a11333J1801j36301O2043A51734D3819J50004a28508l8357m03664
$$ plain form
18353 -570529 -71219 -147733 -129036 -130838 176690 -47657 121435 225953 -19564 25921 112179
18342 112179 -73236 -172712 78612 -634730 -25497 34591 170143 79479 -155878 -123972 -61614
18330 63586 -29991 -85215 186047 -125428 -149022 -9957 348668 -32133 22884 43211 -164944
18318 -113026 -175838 -61182 -48559 -178338 -194434 219987 -72212 -62564 -338815 42195 116190
18307 116190 7027 -225961 -79549 58621 -212060 -310034 -21055 138805 92808 152009 -227218
18295 11188 -14483 -121979 -289978 27334 101037 82281 -218213 -62446 43979 -309312 -264372
18284 -264372 -5202 -38757 -105468 -79026 155765 42380 -172242 117801 73003 -314302 -256923
18273 -256923 -290345 -159555 -164755 8145 -49063 -112392 196579 -86105 -158487 251332 203470
$$ packed form
18353e70529g1219p6514J8697j802A76690d7657A21435J04518a9564B5921Q6258
18342A12179g3236r9476G8612f34730b5497C4591J35552G9479a55878L1906f1614
18330F3586b9991n5224A86047a25428k3594i957C48668c2133B2884K0327a64944
18318a13026o2812f1182J2623j29779j6096B19987g2212R648k76251D2195P3995
18307A16190G027b25961g9549E8621b12060r7974b1055A38805m5997N9201b27218
18295A1188a4483j07496j67999B7334P3703j8756b18213f2446D3979c09312M4940
18284b64372e202l3555o6711K6442A55765D2380a72242A17801m4798c14302N7379
18273b56923l3422J30790n200H145d9063o3329A96579h6105p2382B51332m7862
$$ plain form
18262 203470 67008 -21717 -158632 -115419 179647 -306496 -244508 281463 -127294 -67876
18252 -67876 -373021 112705 156310 -296676 119973 -483990 -26607 29447 -322083 94075
18241 -34310 -160 -31258 59350 -65603 -233276 85969 120783 -265287 -44956 182146 -29417
18229 15210 -237084 -161503 219114 154160 -104398 -246944 6209 -16982 253520 -176676 49390
18217 -211926 145601 -195974 -145742 80979 -272871 139525 -2010 -149538 -47263 191781
18206 32264 -218609 82732 277513 -24822 -110325 65514 -132226 -91964 154797 13762 181510
18195 181510 210118 94292 -302163 -68168 -338063 -123690 66822 -62719 -301388 -69181 276140
18183 -78238 -180181 -52642 -122604 51368 -401720 1788 18277 -195724 110476 80348 237378
$$ packed form
18262B03470F7008b1717j36915M3213A79647c06496O1988B81463a27294N9418
18252f7876l05145A12705M3605b96676A19973d83990b6607B9447c22083I4075
18241c4310a60l1098E9350f5603j67673H5969L4814b65287d4956A82146b9417
18229A5210b37084P5581B19114o4954a04398j42546F209a6982B53520a76676D9390
18217b11926A45601a95974N0232H0979b72871A39525b010j47528d7263A91781
18206C2264b18609H2732J94781b4822q5503F5514a32226M0262A54797A3762J67748
18195A81510K8608I4292c02163f8168k69895a23690F6822f2719k38669f9181B76140
18183g8238j01943e2642o9962E1368d01720A788J6489a95724A10476l0128J57030
$$ plain form
18172 237378 -201117 143371 -317839 -66771 146702 118304 -74547 -163143 176769 -129658
18161 109242 -107873 -216113 148762 228424 89180 233990 -282255 251040 165553 -65779
18150 -112038 -347742 95238 -28375 38325 303118 -98928 -133834 -169654 35088 308211 -27163
18138 -299697 -55274 222450 -124744 22897 -21481 67342 103588 53969 -148247 -402498 -182332
18126 -221607 184628 380985 216699 72495 -160013 222078 -108332 113355 298625 -62441
18115 -141458 -104960 -123225 37675 51846 14276 179100 219133 209511 -32447 -53157 -15694
18103 36423 -182420 55341 -35216 -55406 -162912 -176310 -200940 139425 21288 7057 -20617
18091 289576 -399646 130028 -74034 13287 185578 -69333 -19079 -21951 -569 101442 -107799
$$ packed form
18172B37378b01117A43371c17839f6771A46702k8398g4547q8596A76769a29658
18161A09242a07873j08240A48762P9662H9180J44810b82255B51040q5487f5779
18150a12038k35704I5238b8375C8325K64793i8928l4906l5820C5088K73123b7163
18138b99697e5274B22450a24744B2897b1481F7342L6246m9619a48247k54251a82332
18126b21607A84628J96357j64286G2495a60013B22078a08332A13355J85270f2441
18115a41458L6498j8265C7675J4171A4276J64824M0033r622c2447k0710a5694
18103C6423a82420E5341c5216k0190j07506j3398k4630A39425B1288G057b0617
18091B89576c99646A30028g4034A3287J72291f9333a9079k872e69A01442a07799
$$ plain form
18079 -161231 -127373 121024 -44518 -122009 -45924 -67615 15887 -25196 -322794 -27625 -165187
18068 -165187 229246 200226 -191935 114972 221548 -61741 -5863 82835 -15003 -52126 -167660
18057 -167660 -181476 -117604 -187116 -25364 100002 -63027 -59789 -223285 -138742 -229767 173465
18045 197339 250581 207035 52233 -176960 97192 4181 -250349 3705 28146 -180441 334737
18033 -148221 299414 -335565 -338918 -151742 165541 38653 -17961 -98204 11959 -44963 114545
18021 -84644 -90396 2340 142053 -42431 986 -40268 -14166 8610 -166851 142812 112074 -4361
18008 -82343 105896 -193532 -23314 -1237 -125882 418882 -8213 -13009 -4100 -155238 -56092
17996 239833 -93314 27713 248587 -310905 28289 -76615 152059 149311 -738 197645 75874
$$ packed form
18079a61231L3858A21024d4518p7491d5924k1691A5887b5196k97598b7625j37562
18068a65187B29246k9020a91935A14972J06576f1741e863H2835a5003l7123j15534
18057a67660j3816O3872o9512b5364A00002f3027L238j63496Q4543r1025A73465
18045A97339N3242m3546E2233a76960I7192D181b50349C705K4441a80441C34737
18033a48221B99414c35565l353a51742A65541C8653a7961q0243A1959d4963A14545
18021h4644n752B340J39713d2431I86d0268a4166H610a66851A42812l0738d361
18008h2343A05896a93532b3314a237j24645D18882h213m796d100j51138e6092
17996B39833i3314B7713K20874c10905B8289g6615A52059k748g38A97645G5874
$$ plain form
17984 -31454 -96498 122672 24387 93500 -188076 -285350 -246540 -44716 -15878 79914 -79105
17972 -61587 -40785 134599 -51211 -44566 -68892 15099 -67451 -73000 274890 -361617 -250250
17961 -250250 -404593 188382 -97899 -21267 166551 59249 -85703 -9640 142311 327240 204697
17950 204697 -111167 15614 -81734 -66888 -155904 12622 119723 187839 -55357 -401007 376950
17938 26870 -265086 -837 130554 42952 124737 32145 5818 115931 110383 -44289 -150683 -138312
17926 -138312 48940 -18713 -365448 -24063 -168558 28633 -247609 -86050 260072 263197 -131654
17914 356329 6902 41383 162620 12713 -73146 -29351 137688 -270267 -349236 -34423 -191042
17903 -191042 256779 121861 -24016 44621 101184 -89967 68771 119508 -6252 -778 -419595
$$ packed form
17984c1454o5044A22672B4387O9113a88076r7274L8810d4716a5878G9914g9105
17972f1587K0802A34599e1211O645k4326A5099f7451n549B74890c61617J11367
17961b50250j54343A88382i7899b1267A66551E9249h5703i640A42311J84929j22543
17950B04697a11167A5614h1734J4846q9016A2622J07101O8116e5357l45650C76950
17938B6870b65086h37A30554D2952Q1785C2145E818J10113n548d4289j06394J2371
17926a38312D8940a8713l46735b4063j44495B8633b47609h6050B60072L125a31654
17914C56329F902L4481J21237A2713g3146b9351A37688b70267p8969c4423j56619
17903a91042B56779A21861b4016D4621N6563h9967F8771N0737f252g78m18817
$$ plain form
17892 -419595 75048 -33298 -56556 -272357 29423 -136321 98618 -222295 -98714 -3667 -103679
17881 -103679 -92173 -163696 -131499 52686 -203245 208294 -287544 -209627 -129703 163119 -86292
17869 -110227 32358 89909 151190 244877 200511 -5934 -147192 74447 110610 -136042 77124
17857 -57593 232818 76751 -3234 -40099 8442 -24237 179904 -52738 306079 318591 -230850
17845 -88764 180550 187090 -4537 -159586 393797 -26564 -103122 -90744 -118505 259181 135780
17834 135780 121765 15840 -41591 -174616 -29228 -18 160548 186523 -56288 -315927 590 -136792
17821 68527 386771 19438 159758 212020 268954 -26954 193364 -280960 -220563 -160965 -139906
17810 -139906 -74662 -265258 67799 37696 -31066 -178671 -77105 233590 164036 -17375 55418
$$ packed form
17892d19595G5048c3298k3258k15801B9423a36321I8618b22295i8714c667j00012
17881a03679J1506p1523L2197E2686b03245B08294b87544P7917P9924A63119h6292
17869a10227C2358N7551O1281R3687m4366e934j41258G4447L6163a36042G7124
17857e7593B32818G6751c234l6865H442b4237A79904e2738C06079J2512b30850
17845h8764A80550O540d537j55049C93797b6564p6558J2378k7761B59181j23401
17834A35780j4015A5840d1591j33025b9228a8A60548K5975e6288k59639E90a36792
17821F8527L18244A9438J40320N2262N6934b6954A93364b80960O0397N9598K1059
17810a39906O5244j90596F7799l0103c1066j47605g7105B33590o9554a7375E5418
$$ plain form
17798 4403 -67317 24565 63633 277590 201156 -129989 2766 -155588 260876 -93379 200741
17786 -6776 -163148 39030 -69843 -105582 38699 261138 -145085 139774 -41949 -16078 -74518
17775 -74518 -59816 -78662 -262009 399444 97634 58978 -65078 149016 -40168 327250 -251747
17763 284559 -26702 145345 -35661 -432065 -199968 -84739 278885 -124759 -195860 -297266
17753 -297266 44228 112661 -316532 32962 41751 146954 134159 125661 47697 -105574 24364
17741 150016 -104202 -296242 52303 278677 -83391 -202317 -73366 210080 233767 66999
17730 215399 187508 -149554 100428 -166962 -3941 -17558 150127 296162 -74250 -132583 205073
17718 -5534 422062 -155295 -130005 32626 -168507 -46474 213166 -144991 -357624 146082
$$ packed form
17798D403f7317B4565L9068K13957p6434a29989B766a55588B60876i3379B00741
17786f776j56372C9030f9843l5739C8699K22439a45085A39774d1949a6078n8440
17775g4518J4702j8846j83347C99444I7634l8656f5078A49016d0168C27250b51747
17763B84559b6702A45345c5661l96404a99968h4739B78885a24759p1101j01406
17753b97266D4228O8433c16532C2962Q789J05203j2795q498D7697a05574B4364
17741A50016a04202j92040E2303K26374h3391j18926g3366B10080K3687F6999
17730B15399k7891a49554A00428a66962c941j3617A50127J46035g4250n8333B05073
17718e534D22062a55295K5290C2626a68507d6474B13166a44991k12633A46082
$$ plain form
17707 39591 237050 167771 9604 -77637 2811 -29769 -182925 227744 52435 49911 34825 54174
17695 54174 8218 -85906 -91729 -188193 -60884 -71241 143570 94444 264520 235622 -134580
17683 93342 -64895 56420 -130740 -186251 58587 -27687 -7618 235392 -17171 272415 78021
17671 164617 -17360 -347093 -58817 -229551 -118800 -71228 -139725 -42889 2423 -17113 286310
17659 -163172 -146165 -119742 132110 265172 -61484 88276 -155931 66427 24513 -58436 -80562
17648 -80562 98479 397134 -118235 173028 -125630 466951 70247 32390 15783 -209473
17637 67835 428456 -34669 134054 215886 -52270 131066 130716 -161049 135792 -17106 -6775
17625 71459 431167 377267 -140492 -136259 147658 -8884 208054 156447 79153 -446488 -332732
$$ packed form
17707C9591J97459o9279I604g7637B811b9769j53156B27744E2435k524j5086J9349
17695E4174H218h5906n823r6464f0884j0357A43570m9126J70076k8898a34580
17683I3342f4895E6420a30740n5511E8587b7687g618B35392a7171B72415G8021
17671A64617a7360l29733e8817j70734J10751M7572o8497d2889B423a7113B86310
17659a63172J7007K6423A32110J33062f1484H8276a55931F6427B4513e8436k2126
17648h0562I8479K98655a18235A73028a25630D66951G0247C2390A5783b09473
17637F7835L60621c4669A34054Q1832e2270A31066l50a61049A35792a7106f775
17625G1459L59708n3900a40492M233A47658h884B08054n1607p7294d46488J13756
$$ plain form
17614 -332732 -15171 -37387 310342 -307164 -2586 301612 -173304 171033 -195019 60192
17603 -54605 -148894 95135 -98310 -217102 83953 392125 -96405 -56748 -264975 72513 -146387
17591 -21805 87328 44494 -101826 -134370 222481 120100 73798 -163266 280099 -183588
17580 188527 -275040 -30841 -71146 120922 -75283 138941 325777 27248 158839 -129124
17569 -230295 150397 80531 -80889 -81676 172615 1294 73002 93978 75114 -94190 242891
17557 219442 57103 129753 33618 349721 -46870 -91542 -119942 363097 38120 224736 -221
17545 92594 42145 96375 -59688 136637 -265373 65639 -66385 251029 -48113 -56224 130531
17533 160828 143085 71446 -7163 242395 -287301 124906 99966 -14218 -94370 -24688 22024
$$ packed form
17614c32732a5171k2216C10342c07164b586C01612a73304A71033a95019F0192
17603e4605r4289I5135i8310j18792H3953L08172i6405L9657k08227G2513a46387
17591b1805H7328m2834a01826l2544B22481j02381m6302a63266B80099a83588
17580A88527b75040c0841m0305A20922g5283A38941J86836B7248J31591a29124
17569b30295A50397o9866h0889p87A72615A294P1708K0976j8864i4190B42891
17557B19442E7103P2650C3618L16103d6870m4672k8400C63097C8120J86616b21
17545I2594D2145N4230e9688A36637b65373F5639f6385B51029d8113q111A30531
17533A60828j7743G1446g163B42395b87301A24906k4940a4218q0152b4688B2024
$$ plain form
17521 -47489 -145627 164896 290279 183832 106127 -29036 30387 58052 72078 177266 213411
17510 213411 74368 207512 29816 186302 162527 -93881 380483 163414 164393 98248 109537
17499 109537 -64227 278725 198089 255637 123761 320021 -15005 -78284 75119 -110340 108369
17487 -176689 104399 -126596 5316 75246 -97006 -37319 198773 51647 9758 343781 376160
17476 376160 54489 -70112 7047 126288 93145 -92444 -131083 312606 -107409 281548 -59373
17464 276278 104581 18747 202234 -278277 -82280 -24469 49564 110446 -17477 96837 256713
17453 256713 434926 536602 204513 193140 -44712 446787 422119 248603 457307 35010
17442 -92352 -69926 61350 91800 257780 50919 324264 315976 461737 169909 137048 170605
$$ packed form
17521d7489r8138A64896J25383j06447p7705b9036C0387K7665J4026J05188L6145
17510B13411G4368J33144B9816J56486k3775i3881C80483A63414R79o6145J1289
17499A09537f4227B78725q0636N7548A23761J96260a5005o3279G5119a10340A08369
17487a76689A04399a26596E316O9930i7006c7319A98773E1647I758L34023L2379
17476C76160E4489g0112G047J19241l3143i2444l8639C12606a07409B81548e9373
17464B76278A04581A8747J83487b78277h2280b4469D9564O0882a7477I6837J59876
17453B56713J78213J01676B04513j1373d4712D46787k4668j73516K08704C5010
17442i2352K2426F1350L0450J65980E0919K73345q288J45761A69909l2861L3557
$$ plain form
17431 170605 258261 312175 103646 96577 289215 245802 102910 114128 72835 312712 202634
17420 202634 111956 311674 165542 478981 231493 516218 86801 302186 322453 114046
17409 5917 -307811 155691 107285 70882 276538 -14639 118657 28035 58905 340818 -100873
17397 211132 43891 181930 141538 98978 200424 104201 208890 208555 73807 178778 -16521
17385 108712 313076 -28433 94454 42622 385055 -523010 -102910 225978 195131 -110801
17374 182628 37422 103136 155468 342292 259555 245219 394319 367671 4498 -117262 -179058
17363 -179058 -56670 42419 44437 224760 -30785 230918 120297 63726 92499 206642 -169902
17351 239684 239103 364808 5358 116972 9551 373934 288016 -39044 132365 -82380 242188
$$ packed form
17431A70605Q7656N3914A03646p069J92638m3413A02910J1218m1293K39877j10078
17420B02634r0678J99718j46132L13439B31493K84725H6801K15385K0267A14046
17409E917c07811A55691m8406l6403K05656a4639A18657B8035L0870K81913a00873
17397B11132D3891J38039m0392m2560J01446r6223J04689l35G3807J04971a6521
17385A08712K04364b8433I4454D2622L42433e23010a02910B25978l0847a10801
17374A82628C7422O5714N2332J86824q2737j4336J49100k6648D498a17262o1796
17363a79058e6670D2419K018J80323c0785B30918j10621n6571K8773J14143a69902
17351B39684n81J25705E358J11614I551L64383q5918c9044A32365h2380B42188
$$ plain form
17339 35849 -30984 -83405 -25353 -157161 223753 256231 46280 80000 59502 243360 7732
17327 -99319 194004 -145854 224765 -61552 281775 75837 -21885 351623 100340 75726
17317 75726 50106 214173 89661 109096 229695 149560 -40759 69637 81590 -361258 207816
17305 76597 9781 311777 338762 277269 74261 233058 302699 266886 117423 175793 339988
17294 339988 240029 192613 -1031 377367 96114 237867 325292 28006 439089 470271 280197
17283 280197 271728 381252 -127696 320058 126442 65243 -160587 271824 60259 287752
17273 287752 125455 101935 252589 62293 103256 569482 22121 26705 87100 195285 -46706
17261 157052 79468 35760 95362 -24178 268260 167831 216098 352055 182920 294430
$$ packed form
17339C5849c0984n2421b5353j31808B23753L2478D6280L3720k0498J83858G732
17327i9319A94004a45854B24765f1552B81775G5837b1885C51623A00340k4614
17317G5726k5620J64067H9661J9435J20599q0135d0759F9637J1953c61258B07816
17305G6597I781L01996K6985o1493G4261J58797O9641l5813A17423N8370J64195
17294C39988r9959m7416a031C77367I6114J41753Q7425B8006M11083L1182j90074
17283B80197q469J09524a27696C20058A26442o1199a60587B71824F0259K27493
17273B87752A25455k3520J50654F2293M0963M66226B2121M584O0395J08185d6706
17261A57052p7584C5760N9602b4178B68260j00429M8267J35957j69135J11510
$$ plain form
17251 294430 202361 176197 105279 119263 114610 -11382 322877 160499 213234 213307 -148651 309227
17238 230897 1807 243015 418176 292687 -128539 69823 182423 126319 494994 325078
17228 325078 -147540 -170239 -72580 187018 268750 -74518 208289 152869 209352 147912 204710
17217 204710 -10528 153810 362448 83043 97090 221379 260021 144645 315796 83773
17206 143878 301049 267986 68085 -72858 323367 357439 204071 214462 465631 198765
17195 30121 466802 291403 -78275 -92655 147224 258369 4123 335770 281561 286328 -118838
17183 15001 251284 45891 245475 386401 247339 586532 1836 43147 371078 682305
17173 682305 89737 -157446 148403 4542 446987 352571 137762 -1144 291689 50627 174900
$$ packed form
17251B94430r2069k6164p0918J3984m653a1382C22877A60499N2735P3a48651C09227
17238B30897A807K41208J75161j25489a28539F9823J12600n6104L68675j69916
17228C25078a47540k2699g2580A87018Q1732g4518B08289n5420N6483o1440N6798
17217B04710a0528A53810K08638H3043J4047J24289L8642j15376J71151H3773
17206A43878J57171l3063F8085g2858C23367L4072j53368J0391K51169A98765
17195C0121M36681j75399g8275j4380A47224J11145D123L31647n4209M767a18838
17183A5001K36283D5891J99584J40926j39062L39193A836M1311L27931L11227
17173F82305H9737a57446A48403D542M42445r4416A37762a144B91689E0627J24273
$$ plain form
17162 174900 275189 345420 565060 157527 132719 484581 334159 129485 475881 506763
17152 506763 62955 349993 273727 173890 231379 367638 396614 283428 102312 7798 -29705
17140 373666 272801 222297 278124 86736 439595 608475 345213 328135 297710 216892 326435
17129 326435 -646 450566 279881 546217 283084 231822 194347 157568 263336 379657 252226
17118 252226 -81234 261707 220293 410942 384886 420150 474211 387190 302518 177075 156961
17107 156961 544155 -187067 668970 134349 156880 368691 -37650 91359 445594 185975
17096 286263 84853 83415 197506 425580 -184999 276267 520084 397008 193841 457199
17086 457199 412145 411845 202434 299901 465471 353170 383388 162717 205176 447745 328493
$$ packed form
17162A74900J00289P0231K19640A57527k4808L51862j50422A29485L46396L0882
17152E06763F2955K87038p6266r9837N7489J36259K8976j13186A02312G798b9705
17140C73666j00865n0504N5827H6736L52859J68880k63262j7078l0425q0818J09543
17129C26435f46D50566j70685K66336k63133n1262l7475l6779J05768J16321j27431
17118B52226h1234B61707m1414J90649k6056L5264N4061q7021q4672j25443k0114
17107A56961L87194a87067F68970A34349K2531K11811c7650I1359L54235A85975
17096B86263H4853j438J14091K28074a84999B76267K43817j23076A93841K63358
17086D57199m5054l00B02434R7467J65570j12301L0218A62717M2459K42569j19252
$$ plain form
17075 328493 297847 651543 138520 493955 65930 109171 321342 110061 439966 313700
17065 313700 530331 403982 462235 500667 142203 355942 154240 626622 533156 236051
17054 431761 574977 56035 522443 207374 171552 720810 449545 556641 241322 555696
17044 555696 213742 490321 504552 363889 394794 402304 630627 535755 301811 225634 357696
17033 357696 554303 499788 486315 357592 440368 1158951 606291 373659 256952 559968
17023 559968 454671 443431 392636 485624 518526 685587 553311 346503 745799 579942
17013 579942 534719 513877 725549 603418 376228 735578 511117 717716 596793 367409
17003 367409 731065 452357 459309 439802 872921 900333 687445 904815 769047 693463
$$ packed form
17075C28493l0646L53696A38520L55435F5930M3241K12171A10061L29905j26266
17065C13700K16631j26349N8253L8432A42203K13739A54240M72382r3466B36051
17054D31761J43216E6035M66408B07374l5822N49258k71265J07096B41322L14374
17044E55696B13742K76579J4231j40663L0905P510K28323r4872k33944p6177J32062
17033C57696J96607n4515j3473j28723Q2776P18583n52660k32632j16707L03016
17023E59968j05297j1240n0795R2988L2902J67061j32276k06808L99296j65857
17013E79942m5223k0842K11672j22131k27190L59350k24461K06599j20923k29384
17003C67409L63656k78708O952j9507M33119K7412k12888K17370j35768p5584
$$ plain form
16993 693463 514049 389914 651622 539484 821901 651605 699409 1081126 474737 706027
16983 706027 678811 662754 765841 549400 704682 799852 519172 623080 701864 658680
16973 658680 655940 802079 436786 831684 592368 1017471 668562 833206 793228 463721
16963 463721 1070961 1102723 934763 838208 766888 847590 888710 833543 644972 854347 1147460
16952 1147460 781940 1161384 935481 1093940 730760 977238 1023904 932478 637550 1185387
16942 1185387 979407 1279475 1029775 1178131 967273 979550 1023984 1156010 1076038 723014
16932 723014 1210235 1067018 674678 1083045 1361026 1231693 1101096 1220266 1043147 1230766
16922 1230766 1153488 1346406 1230922 1239158 1046396 1395717 1131379 1341281 1246900 1511198
$$ packed form
16993F93463j79414j24135K61708j12138K82417j70296M7804L81717D74737K31290
16983G06027k7216j6057J03087k16441J55282R5170k80680J03908P8784m3184
16973F58680k740J46139l65293L94898k39316M25103l48909J64644l9978l29507
16963D63721O07240L1762j67960r6555p1320Q0702M1120n5167j88571K09375K93113
16952A147460l65520L79444k25903J58459l63180K46478M6666r1426k94928N47837
16942A185387k05980L00068k49700J48356k10858J2277M4434J32026p9972l53024
16932G23014M87221j43217l92340M08367K77981j29333j30597J19170j77119J87619
16922A230766p7278J92918j15484Q236j92762L49321k64338K09902r4381K64298
$$ plain form
16912 1511198 1248635 1362087 1414829 1517249 1320378 1163777 1275951 1478920 1332861 1260010
16902 1260010 1477642 1408882 1731045 1424707 1370219 1402427 1396252 1521108 1606501 1526913 1617381
16891 1617381 1858395 1706528 1595434 1760896 1577780 1699926 1626303 1709455 1796607 2091152
16881 2091152 2155922 1988458 1752036 1786244 2086785 1741871 2080144 2171085 2093535 2389399
16871 2389399 1907075 2132457 2297704 2267388 1989142 2563475 2397298 1996492 2583473 2530942
16861 2530942 2599784 2401339 2553763 2316267 2551582 2705345 2433818 2652998 2468880 2953808
16851 2953808 2916504 2848728 3313441 2756748 3085156 3157681 3053839 3413018 3180514 3346073
16841 3346073 3182149 3309526 3460137 3271583 3505415 3318705 3605971 3499760 3765401
$$ packed form
16912A511198k62563J13452N2742J02420j96871j56601J12174K02969j46059p2851
16902A260010K17632o8760L22163l06338n4488L2208o175J24856Q5393p9588R0468
16891A617381K41014j51867j11094J65462j83116J22146p3623Q3152Q7152K94545
16881B091152O4770j67464k36422L4208L00541l44914L38273R0941p7550K95864
16871B389399m82324K25382J65247l0316k78246N74333j66177m00806N86981n2531
16861B530942O8842j98445J52424k37496K35315J53763k71527K19180j84118M84928
16851B953808l7304o7776M64713n56693L28408P2525j03842L59179k32504J65559
16841C346073j63924J27377J50611j88554K33832j86710K87266j06211K65641
$$ plain form
16832 3765401 3729385 3670598 4011040 4264124 4604971 3853952 4306528 4121459 4436130 4355737
16822 4355737 4663309 4862863 5064713 5059704 5034019 4987818 5441983 5379654 5230676 5719552
16812 5719552 5683143 5753463 5803779 5992298 6276857 6381521 6413602 6756460 6809811 6716835
16802 6716835 7075059 7431781 7151174 7524776 8256093 8062376 8304119 8698186 8685386 8622096
16792 8622096 9321393 9564262 9769309 10033701 10212191 10496515 11173223 11442682 11430347 11973800
16782 11973800 12460742 12746311 12669159 13518453 13992719 14355285 14713401 15333348 16232204
16773 16232204 16716091 17115886 17623174 18473255 19102518 19700394 20584516 21133482 22066528
16764 22066528 22646181 23947294 24968295 26093891 26921288 27915376 29269414 30846425
$$ packed form
16832C765401l6016n8787L40442K53084L40847p51019M52576j85069L14671q0393
16822D355737L07572J99554K01850n009k5685m6201M54165o2329j48978M88876
16812E719552l6409P0320N0316J88519K84559J04664L2081L42858N3351r2976
16802F716835L58224L56722k80607L73602P31317j93717K41743L94067j2800o3290
16792H622096O99297K42869K05047K64392J78490K84324O76708K69459j2335N43453
16782A1973800M86942K85569p7152Q49294M74266L62566L58116O19947Q98856
16773A6232204M83887L99795N07288Q50081O29263N97876Q84122N48966R33046
16764B2066528N79653J301113J021001J125596Q27397R94088J354038J577011
$$ plain form
16756 30846425 31899334 33649645 35615399 36799189 38684915 40605703 42861876 44862514
16748 44862514 47215204 49548993 52482067 55419246 58219299 62209417 65480890 69057977
16740 69057977 73421483 77782621 82428483 87479601 92895309 98493383 104560357 110988010
16732 110988010 117386391 124216944 131190838 138367477 145785738 152861828 159632725 166368742
16724 166368742 172205405 177662144 181881902 184760116 186825387 187623190 187380913 185259271
16716 185259271 182273963 178209334 173227442 167346933 161002570 154137288 146853735 140146892
16708 140146892 132528547 125429574 118191775 111866412 105248141 98593327 92891823 87414340
16700 87414340 82422152 77545485 72872596 68684707 64703558 61102960 58120019 54478429
$$ packed form
16756C0846425J052909J750311J965754J183790J885726J920788K256173K000638
16748D4862514K352690K333789K933074K937179K800053L990118L271473L577087
16740F9057977M363506M361138M645862N051118N415708N598074O066974O427653
16732A10988010O398381O830553O973894P176639P418261P076090O770897O736017
16724A66368742N836663N456739M219758K878214K065271P97803k42277k121642
16716A85259271k985308m064629m981892n880509o344363o865282p283553o706843
16708A40146892p618345p098973p237799o325363o618271o654814n701504n477483
16700H7414340m992188m876667m672889m187889l981149l600598k982941l641590
$$ plain form
16692 54478429 51957100 49210786 46277920 44259001 42012949 39703290 38016914 35739151
16684 35739151 34162172 32853133 31094486 29882641 28475153 27451080 26117944 24888501
16676 24888501 23817958 23000429 22159835 21007140 20313197 19631459 19241575 18277654 17654680
16667 17654680 16935862 16660602 15296609 15110240 14751451 14333908 13839930 13454789 12888244
16658 12888244 12257995 11862751 11764607 11620853 11516563 10554755 10278691 9795990 9852117 9532428
16648 9532428 9464266 8982889 8700402 8256851 8684093 8193831 8537363 7606325 7627828 7363949
16638 7363949 7428686 6836831 6879723 6745316 6456661 6315689 6441141 6212563 5941292 5667228
16628 5667228 5888119 5243736 5583638 5122343 5438684 4915330 4711149 4756004 4448852 4492895
$$ packed form
16692E4478429k521329k746314k932866k018919k246052k309659j686376k277763
16684C5739151j576979j309039j758647j211845j407488j024073j333136j229443
16676B4888501j070543q17529q40594j152695o93943o81738l89884r63921o22974
16667A7654680p18818k75260j363993j86369l58789m17543m93978l85141n66545
16658A2888244o30249l95244r8144j43754j04290r61808k76064m82701N6127l19689
16648I532428o8162m81377k82487m43551M27242m90262L43532r31038K1503k63879
16638G363949O4737n91855M2892j34407k88655j40972J25452k28578k71271k74064
16628E667228K20891o44383L39902m61295L16341n23354k04181M4855l07152M4043
$$ plain form
16618 4492895 4583369 4448748 4358419 4307464 4236167 4081193 3860675 3855270 3960540 3780082
16608 3780082 3914155 3859950 3356053 3209650 3708569 3383241 3672825 2890628 3387159 3141873
16598 3141873 3212250 2873496 2860260 2846956 2573675 3081534 2698740 2384176 2604488 2376400
16588 2376400 2742512 2622971 2666702 2406416 2198114 2239288 2381965 2199756 2082906 2342561
16578 2342561 2255491 2285276 1783013 1828490 1839081 1838022 1595706 2060745 1931081 2173692
16568 2173692 1688574 1783521 1852106 1772059 1748406 1465649 1774127 1500014 1956347 1683357
16558 1683357 1803170 1405418 1418806 1644368 1316736 1426112 1486015 1867568 1608854 1612296
16548 1612296 1307043 1388090 1766433 1272145 1488172 1395040 1445073 1291907 1314709 1660510
$$ packed form
16618D492895R0474j34621r0329n0955p1297j54974k20518n405J05270j80458
16608C780082J34073n4205n03897j46403M98919l25328K89584p82197M96531k45286
16598C141873P0377l38754j3236j3304k73281N07859l82794l14564K20312k28088
16588B376400L66112j19541M3731k60286k08302M1174J42677j82209j16850K59655
16578B342561q7070K9785n02263M5477J0591j059k42316M65039j29664K42611
16568B173692m85118R4947O8585q0047k3653k82757L08478k74113M56333k72990
16558A683357J19813l97752J3388K25562l27632J09376N9903L81553k58714L442
16548A612296l05253Q1047L78343m94288K16027r3132N0033j53166K2802L45801
$$ plain form
16538 1660510 1121139 1406960 1009451 1239115 1213721 1205540 1198169 1374750 998800 1032859
16528 1032859 1130618 765599 1183046 1170487 1208471 791357 997604 679614 1038434 981141
16518 981141 1227273 977801 1069934 1126359 952391 855698 742298 1023304 878319 813717
16508 813717 1238650 680556 791227 827639 917231 770393 741433 859313 681432 478363
16498 478363 972579 695374 896569 1151179 833498 962272 1003006 746430 520417 690005
16488 690005 886008 940192 525438 887827 694390 607861 1037622 482480 523701 590619
16478 590619 518120 834848 480954 751043 720828 610896 567086 554258 313852 599166
16468 599166 457233 870832 720690 487608 745328 565196 664013 751672 779102 807843
$$ packed form
16538A660510n39371K85821l97509K29664k5394q181p371J76581l75950L4059
16528A032859R7759l65019M17447j2559L7984m17114K06247l17990L58820n7293
16518I81141K46132k49472R2133N6425j73968r6693j13400K81006j44985o4602
16508H13717M24933n58094J10671L6412Q9592j46838k8960J17880j77881k03069
16498D78363M94216k77205K01195K54610l17681J28774M0734k56576k26013J69588
16488F90005J96003N4184m14754L62389j93437q6529M29761D82480M1221O6918
16478E90619p2499L16728l53894K70089l0215j09932m3810j2828k40406K85314
16468E99166j41933M13599j50142k33082K57720j80132R8817Q7659K7430K8741
$$ plain form
16458 807843 249860 770374 571821 896668 704590 560330 378580 779690 423264 457053
16448 457053 325260 549058 582928 331579 116263 571615 574571 577721 730542 472494
16438 472494 89715 500079 410570 610157 535741 443501 551435 597120 643654 302782 376656
16427 376656 608907 615114 443895 418191 206124 630731 481347 273187 403004 465098
16417 465098 713554 318711 274107 787383 257837 307926 121253 424629 456991 434439
16407 434439 244720 236064 476025 113470 626471 367759 325171 527204 414691 197684
16396 432534 521661 513169 639389 289652 471678 301650 194340 530462 220309 375756
16386 375756 77297 443940 427611 176883 27852 90706 237169 320299 71262 274561 191712
$$ packed form
16458H07843B49860N20514j98553L24847j92078j44260j81750M01110l56426L3789
16448D57053j31793K23798L3870k51349A16263M55352K956L150J52821k58048
16438D72494H9715M10364q9509J99587p4416r2240J07934M5685M6534C02782P3874
16427C76656K32251O207j71219k5704B06124M24607j49384k08160J29817O2094
16417D65098K48456C18711m4604N13276B57837N0089A21253L03376L2362k2552
16407D34439j89719q656K39961A13470N13001k58712m2588K02033j12513A97684
16396D32534Q9127q492J26220B89652J82026j70028j07310L36122B20309J55447
16386C75756G7297L66643j6329A76883B7852O2854J46463Q3130G1262K03299q2849
$$ plain form
16375 191712 207308 267311 361783 357120 353351 16871 603233 510275 121437 261081 544663
16364 544663 249656 546680 200649 226970 543400 315542 559125 169694 533977 659497
16354 659497 359228 174218 73661 213771 145705 231202 723285 120663 342683 261747
16344 261747 184888 201384 359803 130080 90490 348076 269698 165582 -9198 743989 475720
16333 475720 94116 392546 18130 98525 454000 -7413 215151 494032 -99441 139906 269827
16322 269827 295627 521048 327919 142143 127793 422018 468113 473823 108076 -38882 21015
16310 -28634 537947 387233 245949 203389 -102432 44830 145702 -128873 385522 -21353
16299 393881 395445 176765 305959 167140 269756 241798 82401 130987 74692 362652 243430
$$ packed form
16375A91712J5596O0003R4472m663l769A6871N86362r2958A21437J39644K83582
16364E44663B49656K97024B00649K6321L16430k27858K43583A69694L64283J25520
16354F59497l00269A74218G3661J40110o8066Q5497M92083A20663K22020q0936
16344B61747p6859J6496J58419A30080l9590K57586p8378j04116i198G43989k68269
16333D75720I4116K98430A8130Q0395L55475g413B15151K78881i9441A39906J29921
16322B69827K5800K25421j93129A42143j4350K94225M6095N710A08076c8882B1015
16310b8634E37947j50714j41284m2560a02432D4830J00872a28873C85522b1353
16299C93881J564A76765J29194j38819J02616k7958H2401M8586n6295K87960j19222
$$ plain form
16288 243430 -159040 -170851 408088 101383 435076 257183 50002 215179 248749 351740
16278 351740 245087 226631 194901 128133 463063 419057 365261 425967 -89350 38795 342778
16267 342778 292119 152764 350102 240434 40859 71041 210490 359851 84914 296271
16257 296271 381717 223535 136129 418242 151011 17809 96792 -19919 457112 270295
16247 270295 356690 -126506 -78790 240483 -49960 -82783 25795 -295360 -84616 153746 -71122
16235 220233 152831 413676 68142 235686 268037 111112 -448337 240936 304034 268118
16225 268118 347822 342393 -118636 205 227006 -241575 -165033 382236 284289 262651 83495
16213 366481 176562 52471 106081 121944 126176 104294 -79416 287595 52142 269206 83126
$$ packed form
16288B43430a59040j1811D08088A01383L33693j77893E0002J65177L3570J02991
16278C51740j06653j8456l1730o6768L34930m4006n3796O0706h9350C8795L03983
16267C42778n0659j39355J97338j09668D0859L0182J39449J49361H4914K11357
16257B96271Q5446j58182q7406K82113A51011A7809P8983a9919D57112j86817
16247B70295Q6395a26506M7716B40483d9960l2823B5795b95360h4616A53746g1122
16235B20233o7402K60845F8142J67544L2351A11112d48337B40936O3098l5916
16225B68118P9704n429a18636B05K26801b41575P6542C82236r7947k1638H3495
16213C66481A76562E2471N3610J5863M232k1882g9416B87595E2142K17064H3126
$$ plain form
16201 51834 245215 226961 175575 -167005 1496 100682 227778 109609 -52166 144046 116607
16190 116607 -99074 66592 401603 47446 -13493 56311 -28024 439762 246467 154455 -136785
16178 48765 194018 97422 64309 -92681 13195 -65676 98298 201337 -15981 51954 91206
16167 91206 4334 160028 249655 60872 -83746 207925 269587 86265 19014 -30734 116306
16155 124157 54006 -54264 2415 102435 -231808 43156 181436 77580 -144528 -78434 372064
16143 216397 -31693 237806 176810 235564 -101226 -120813 84536 -69833 111549 34884 140664
16132 140664 21043 116778 -37590 -90148 23224 7751 255197 248593 -93885 194888 116321
16121 116321 -51138 231246 80392 -222065 19944 115503 350218 -91524 -131415 -32238 -183368
$$ packed form
16201E1834J93381j8254n1386a67005A496R9186J27096A09609e2166A44046k7439
16190A16607i9074F6592L35011D7446a3493E6311b8024D39762j93295r2012a36785
16178D8765J45253r6596l3113i2681A3195f5676I8298J03039a5981E1954L9252
16167I1206D334J55694Q9627F0872h3746B07925O1662H6265A9014c0734A16306
16155A24157E4006e4264B415J00020b31808D3156J38280G7580a44528O6094C72064
16143B16397c1693B37806o0996N8754a01226j9587H4536f9833A11549C4884J05780
16132A40664B1043R5735c7590n2558B3224G751K47446o604i3885A94888p8567
16121A16321e1138B31246H0392b22065A9944R5559K34715i1524l9891c2238j51130
$$ plain form
16110 -183368 -94414 -304971 -230686 56116 297832 36839 238519 -109810 -129035 122159
16099 -253842 77582 -77081 -90251 100239 160574 131681 -63519 283595 198564 -104218 -181954
16088 -181954 -231685 -20726 -92248 -92080 157824 -188630 -198497 -76591 151220 44994 -50443
16076 363449 27850 97550 63070 368702 -165265 -113796 -83426 -121796 51804 -80998 -105616
16065 -105616 -76089 114212 -161956 110512 -126744 -29242 42940 116603 -65434 134137
16054 122156 235092 -25216 -42678 62141 269698 72773 226185 396811 -502230 49524
16043 -137879 61191 237677 180517 182683 -135439 404704 -48823 -206765 -74188 67702 -153758
16031 169245 -14718 -312046 48444 21921 -154573 -294724 -102616 350999 -162018 -25754
$$ packed form
16110a83368Q8954k10557P4285E6116K41716C6839K01680a09810j9225A22159
16099b53842G7582g7081j3170A00239O0335k8893f3519B83595q5031a04218p7736
16088a81954m9731b0726p1522J68A57824a88630r867g6591A51220D4994e0443
16076C63449B7850O9700l4480L05632a65265N1469L0370l8370E1804h0998k4618
16065a05616K9527A14212a61956A10512a26744b9242D2940P3663f5434A34137
16054A22156J12936b5216j7462F2141K07557G2773J53412J70626e02230D9524
16043a37879F1191J76486n7160K166a35439D04704d8823j57942g4188F7702a53758
16031A69245a4718k97328D8444B1921a54573j40151a02616C50999a62018b5754
$$ plain form
16020 -17950 -18104 308331 -59822 27146 -270966 -76158 -12072 -58986 -206544 -42099 -179684
16009 -179684 -365753 -174421 14617 -201046 19314 354620 119653 254547 100188 32085
15998 16289 -203718 -57734 -13130 -29835 -47563 -82067 -64501 224133 111940 329868 35650
15986 51932 -19652 331865 571704 452883 116547 -165204 -19689 -8293 13770 -148928 -64294
15974 -289831 -111094 4190 3932 -284277 -50457 -32838 -4093 209109 -20403 -62636 263051
15962 75223 58546 -58809 -31655 85263 28787 -33870 112814 47754 -180501 117287 -106820
15950 -155432 -209490 -124469 -206711 -28092 110727 -143200 -54752 -155315 -23113 336205 -370981
15938 167210 -50111 176087 -211701 161988 -87393 141657 2009 -76159 -31920 -34888 199882
$$ packed form
16020a7950j54C08331e9822B7146b70966g6158a2072m6914j47558d2099j37585
16009a79684j86069a74421A4617b01046A9314L35306A19653J34894A00188C2085
15998A6289b03718e7734a3130j6705j7728l4504J7566B24133A11940K17928C5650
15986E1932a9652C31865K39839j18821A16547a65204a9689h293A3770a48928f4294
15974b89831a11094D190k58b84277e0457J7619d093B09109b0403m2233B63051
15962G5223j6677e8809K7154H5263B8787c3870A12814D7754a80501A17287a06820
15950a55432n4058Q5021q2242b8092A10727a43200e4752j00563b3113C36205c70981
15938A67210e0111A76087b11701A61988h7393A41657B009g6159c1920k968A99882
$$ plain form
15926 -142246 52901 -90629 -110271 -7833 267919 -279690 14779 144783 -112291 69720 -243582
15914 -99066 -109918 7159 -25608 4494 96576 31410 -66896 -27898 -261802 33798 -65868 -30230
15901 -195934 184900 94571 99294 48063 -37898 -163436 10279 240105 243175 -156427 -284772
15890 -284772 144625 -267556 -191920 19303 -202585 51576 126160 -29424 135226 -160095
15879 18362 187707 -331985 122829 -59902 -235992 -209252 -19030 -16732 -95550 -33664 -169652
15868 -169652 14195 -256160 -58995 -8133 47857 -353608 -29076 -213277 -107146 -23724 161337
15856 159534 -325099 -80547 101555 113976 13786 -158477 -85778 15995 -42768 74083 -377229
15844 150956 261254 420 -463225 -312181 232119 -308002 179680 -51949 -53265 -70104 -156805
$$ packed form
15926a42246E2901i0629j9642g833B67919b79690A4779J30004a12291F9720b43582
15914i9066j0852G159b5608D494R2082C1410f6896b7898k33904C3798f5868c0230
15901a95934A84900r0329M723D8063c7898j25538A0279K29826L070a56427j28345
15890b84772A44625b67556P5636A9303b02585E1576P4584b9424A35226a60095
15879A8362J69345c31985A22829e9902j76090K6740a9030K298p8818c3664j35988
15868a69652A4195b56160e8995h133D7857c53608b9076j84201J06131b3724A61337
15856A59534c25099h0547A01555J2421A3786a58477P2699A5995d2768G4083c77229
15844A50956J10298D20d63225J51044B32119c08002A79680e1949j316j6839q6701
$$ plain form
15833 -156805 -89621 -131104 2403 -125223 69638 -5602 54863 -123369 -325606 299511 -377147
15821 -8250 -58952 -459771 -21108 -299281 -13645 -175566 -99075 128219 -60891 145123 -301258
15809 467335 -77575 260132 -61441 152049 -23389 170560 -193631 -175327 386729 28715
15798 -379517 -405408 -178959 -322598 438551 -99606 -170462 -202091 142576 303196 -47080
15787 34288 -83894 -6740 -71544 -9534 213774 260164 -215145 -189071 -221537 -69247 -475200
15776 -475200 -92733 -157303 -212043 89413 29126 236024 87939 -234476 -337835 -178650 -248631
15765 -248631 151289 -38494 -329565 23286 111011 27825 165198 353447 -34564 -80745 238010
15753 -247337 87184 -156163 19817 73463 122281 225272 124701 -48524 106323 195020 129582
$$ packed form
15833a56805O7184m1483B403a25223F9638e602E4863a23369k02237B99511c77147
15821h250n0702m00819b1108k78173a3645j61921P6491A28219f0891A45123c01258
15809D67335g7575B60132f1441A52049b3389A70560a93631J8304C86729B8715
15798c79517k5891a78959j43639D38551i9606p0856l1629A42576J60620d7080
15787C4288h3894f740o4804i534B13774M6390b15145K6074l2466f9247m05953
15776d75200i2733o4570n4740H9413B9126K06898H7939b34476j03359J59185o9981
15765b48631A51289c8494k91071B3286Q7725B7825J37373J88249c4564m6181B38010
15753b47337H7184a56163A9817N3646M8818J02991j00571d8524A06323Q8697o5438
$$ plain form
15742 129582 -134897 -54191 -339482 -164940 -86054 -506108 -91641 -179135 -44724 -21768 -123983
15731 -123983 -108069 -209035 32271 186457 -44959 -278334 27107 15161 -135760 -271949
15721 -271949 -140617 40580 -243272 141110 83701 22319 235048 -130217 32712 -79745
15710 -15310 -107464 -236585 -268070 39455 -101037 -120700 -156322 -31678 206984 -123318 -111851
15699 -111851 261860 140309 -216035 195441 -143574 102201 -57526 196495 -277848 324549
15688 66262 -169568 33303 -18205 -56537 -171637 -333291 -139362 -117680 242133 179464 -270631
15676 -96576 -295072 -87382 133002 -111840 385619 -74772 -20184 220850 331606 -234198
15665 -178643 216027 -252991 -7865 121050 74006 366578 8559 35985 -38899 -48628 -303045
$$ packed form
15742A29582a34897e4191k85291a64940P8886m20054i1641q7494d4724b1768j02215
15731a23983J5914j00966C2271J54186d4959k33375B7107j1946a35760j36189
15721b71949J31332D0580b43272A41110n7409B2319K12729a30217C2712g9745
15710a5310r2154j29121l1485C9455a01037j9663l5622c1678B06984a23318J1467
15699a11851B61860j21551b16035A95441a43574A02201e7526A96495b77848C24549
15688F6262a69568C3303a8205l8332j15100j61654a39362K1682B42133o2669b70631
15676i6576j98496h7382A33002a11840C85619g4772b0184B20850J10756b34198
15665a78643B16027b52991g865A21050m7044K92572H559K7426c8899r729k54417
$$ plain form
15654 -303045 -115725 -69293 38224 -65479 -186256 54077 -48686 260704 44503 159353 -60256
15642 -1350 -86414 -161929 -66888 -165241 -220926 -204788 -17116 -104022 10018 -136570 31352 74803
15630 74803 141346 -398350 157195 -135673 390713 -82855 -289044 35764 -74506 38258 -8700
15618 397474 -29835 85493 -221907 180845 -220650 -253316 144843 -202063 -80509 192046
15607 -362641 -112179 -11238 3038 -102974 434608 -345090 -158762 -70089 108501 151434
15597 151434 17113 105911 -22209 -3980 206937 -180567 291543 23128 208622 -156091 89948
15585 41134 -259565 46714 131654 -107964 33315 108990 156957 219744 -204324 -307151 -143432
15573 -112962 88427 -167627 -107436 -107135 -476746 -338817 -138944 -125801 -350748 25665 -136837
$$ packed form
15654c03045a15725M6432C8224f5479j20777E4077d8686B60704D4503J14850f0256
15642a350q5064p5515f6888r8353n5685J6138a7116q6906A0018a36570C1352M3451
15630G4803O6543c98350A57195a35673C90713h2855k06189C5764g4506C8258h700
15618C97474b9835H5493b21907A80845b20650l2666A44843b02063h0509A92046
15607c62641a12179a1238C038a02974D34608c45090a58762g0089A08501M2933
15597A51434A7113Q8798b2209c980B06937a80567B91543B3128J85494a56091H9948
15585D1134b59565D6714Q4940a07964C3315P5675M7967O2787b04324j02827a43432
15573a12962H8427a67627O0191L01l69611J37929a38944J3143k24947B5665a36837
$$ plain form
15561 22497 -364274 59876 82477 -100730 -209384 -269371 443019 18742 -106154 11034 -163782
15549 -1029 51433 -84081 -157029 -73698 45649 200512 22434 191310 -146896 62683 -296047
15537 205143 -104948 160801 -257661 109281 -179014 131162 268493 -180899 33765 -526485
15526 33823 40696 55840 -136885 -38570 149395 13669 176150 11767 48415 -114613 88782
15514 -72080 52338 76147 -23359 33198 -160094 -212245 -59938 -162256 -172432 -36112 -104061
15503 -104061 162931 92011 133242 -34088 -71339 -68649 117794 -62184 -21661 150890 59665
15491 319101 -168221 -191866 -108637 364594 -97779 -198040 -421922 -16599 -127229 -144848
15481 -144848 -207484 162230 -12107 43411 161935 11025 -236288 101084 -68805 -253550
$$ packed form
15561B2497c64274E9876K2601a00730j08654n9987D43019A8742a06154A1034a63782
15549a029E1433h4081p2948g3698D5649J54863B2434J68876a46896F2683b96047
15537B05143a04948A60801b57661A09281a79014A31162J37331a80899C3765e26485
15526C3823O873J5144a36885c8570A49395A3669J62481A1767L6648a14613H8782
15514g2080E2338K3809b3359C3198a60094n2151e9938j02318j0176c6112o7949
15503a04061A62931p0920M1231c4088l7251K690A17794f2184b1661A50890E9665
15491C19101a68221k3645Q3229C64594i7779j00261k23882a6599j10630j7619
15481a44848o2636A62230a2107D3411J18524A1025b36288A01084f8805j84745
$$ plain form
15471 -253550 -118779 93302 -109012 231339 170529 -221887 39359 -108363 -76638 187472
15460 74265 -33854 138059 50245 39584 164841 125958 -122456 220594 31940 -9031 37732
15448 -118892 109519 225959 -59103 79460 6381 -14207 136504 -125200 7556 -66507 146235
15436 -142501 60678 145623 149726 -79386 -104738 -205622 162390 218452 -97012 -37153 104981
15424 107203 248767 -68268 18931 288192 -81264 -417907 -66855 -165045 -117180 87463 119211
15413 119211 -195110 -126755 223667 172517 -216429 -199685 84140 57835 124711 90874 -124595
15401 12507 69620 67639 -33196 -364743 23856 -105521 -21314 208251 -134354 -61039 -178974
15390 -178974 -313727 259069 -34862 -8197 -16355 -341432 141919 -37889 -24940 -39565 -185325
$$ packed form
15471b53550a18779I3302a09012B31339o0810b21887C9359a08363L1725A87472
15460G4265c3854A38059E0245j0661J25257l8883a22456B20594C1940i031C7732
15448a18892A09519J16440e9103G9460F381a4207A36504a25200G556f6507A46235
15436a42501F0678Q4945M103g9386k5352j00884A62390N6062i7012c7153A04981
15424A07203J41564f8268A8931K69261h1264l36643f6855r8190M7865H7463L1748
15413A19211a95110O8355B23667n1150b16429J6744H4140k6305O6876l3837a24595
15401A2507N7113j981c3196l31547B3856a05521b1314B08251a34354f1039j17935
15390a78974j34753B59069c4862h197q158l25077A41919c7889J2949j4625j45760
$$ plain form
15379 -185325 76578 125248 23098 18778 -290825 54907 -197994 -470786 51866 -101956 -186445
15368 -186445 374463 6099 282052 -75069 133150 4804 -12495 208259 -28287 -239982 -82013
15356 119662 185860 -58791 -300923 -75916 234859 -184927 -84996 -93163 108999 38851 355145
15345 355145 -259370 234857 371582 -330498 -196389 -246888 -60517 41804 162787 -47725
15334 -452478 331690 162620 -177004 -440051 32256 -155078 82465 317976 -3117 206077
15323 197258 -78838 302806 209344 400397 -136512 -294359 -438301 189151 290214 -32882
15312 -315699 544081 298823 -52054 274233 120405 -133500 333323 17468 174156 -13397
15301 -340148 15892 -73177 -79304 324601 36404 -51952 -296322 103129 156265 37615 -79669
$$ packed form
15379a85325G6578M8670B3098m320b90825E4907a97994k72792E1866a01956q4489
15368a86445C74463F099K75953g5069A33150D804a2495B08259b8287k11695h2013
15356A19662O6198e8791k42132g5916B34859a84927h4996q167A08999C8851L16294
15345C55145b59370B34857J36725c30498J34109n0499f0517D1804J20983d7725
15334d52478C31690A62620a77004k63047C2256a55078H2465K35511c117B06077
15323A97258g8838C02806r3462J91053a36512j57847j43942A89151J01063c2882
15312c15699E44081k45258e2054B74233A20405a33500C33323A7468J56688a3397
15301c40148A5892g3177o127C24601C6404e1952k44370A03129N3136C7615g9669
$$ plain form
15289 -157802 107982 125350 -227337 21630 600594 182927 -86286 380534 89417 -211807
15278 122152 15353 36448 268852 85386 131930 -81034 -94746 -77534 -217565 258022 92476
15266 -317189 65735 -57254 21639 112355 63918 210440 53198 -39637 -174573 -120389 91937
15254 166983 20947 173449 899015 919192 615290 930842 789832 293916 16182 384224
15244 384224 -237397 -93073 154298 98616 -57402 214623 55703 -237435 5554 -76176 -122150
15233 -122150 339189 143476 -105864 -38638 -23197 179770 275146 -21784 115101 104807
15223 104807 190510 -267788 38151 75179 288829 3601 289677 46633 274161 135761 26195
15211 -220037 162539 -35828 75541 -23605 259632 180493 297742 -125919 -95101 92444 -8509
$$ packed form
15289a57802A07982J7368b27337B1630N78964A82927h6286C80534H9417b11807
15278A22152A5353K1095K32404H5386M6544h1034j3712J7212j40031B58022I2476
15266c17189F5735e7254B1639R0716m8437J46522E3198c9637j34936N4184I1937
15254A66983B0947J52502P25566K0177l03902L15552j41010B93916A6182L68042
15244C84224b37397i3073A54298n5682e7402B14623E5703b37435E554g6176m5974
15233a22150C39189A43476a05864c8638J5441A79770R5376b1784A15101j0294
15223A04807Q5703b67788C8151L7028K13650C601K86076D6633K27528A35761B6195
15211b20037A62539c5828G5541b3605B59632p9139J17249a25919L0818I2444h509
$$ plain form
15199 20787 -113508 -174355 148006 -13386 28187 -58055 36001 62486 102403 4054 -128976
15187 64094 74424 262020 49367 -32949 -268621 -299673 375103 309967 336234 132076 7866
15175 225733 100525 206876 73948 -107014 -101845 121487 211475 177152 40247 140495 262421
15164 262421 243697 216626 261641 -131047 142580 172310 154297 -503 -47235 100228 -88471
15152 315847 58946 296145 -164786 -90335 -247844 -21918 115813 210280 -24788 -240130
15142 -240130 115064 76829 -120455 -16946 134655 244865 -45315 57579 176075 -30331
15131 400172 57746 -170712 210849 154388 67578 161081 175835 16264 275590 -104766 255241
15119 206499 36082 149585 107698 192200 -10935 -41783 124911 435603 24108 41627 169441
$$ packed form
15199B0787a13508o0847A48006a3386B8187e8055C6001K6485L9917D054a28976
15187F4094J0330J87596D9367c2949k35672l1052C75103o5136K6267A32076G866
15175B25733A00525J06351G3948a07014N169A21487Q9988l4323D0247J00248J21926
15164B62421j8724k7071M5015a31047A42580K9730j8013e03m6732A00228h8471
15152C15847E8946K37199a64786P4451j57509b1918A15813R4467b4788k15342
15142b40130A15064l8235a20455a6946A34655J10210d5315E7579J18496c0331
15131D00172E7746a70712B10849n6461F7578R3503J4754A6264K59326a04766B55241
15119B06499C6082J13503m1887Q4502a0935l0848A24911L10692B4108J7519J27814
$$ plain form
15108 169441 -6488 151738 247996 413342 226005 81887 -183173 35383 -88874 -47904 -131731
15097 -131731 54104 265702 133185 -278889 166305 -174633 481456 -47774 232757 180620
15087 180620 104811 179420 142376 328613 -55663 382263 -22951 24376 99338 26049 245715
15076 245715 283242 68647 122184 206895 217158 302820 287106 -231942 208060 252606 111542
15064 61007 14520 206938 248466 192448 41928 207185 335816 -22514 300250 250160 98742
15052 309152 97595 -156332 311249 122016 127956 193314 87257 378865 236403 -50533 249426
15040 155720 321028 32518 401821 136943 61799 89654 -115927 -5504 336634 1990 386178
15029 386178 205005 426287 426921 -39727 252909 -70660 275093 226279 206109 266939 473867
$$ packed form
15108A69441f488A51738R6258J65346j87337H1887a83173C5383h8874M0970q3827
15097a31731E4104K11598j32517b78889A66305a74633D81456d7774B32757n2137
15087A80620p5809P4609l7044J86237e5663C82263b2951B4376P4962B6049K19666
15076B45715L7527F8647N3537Q4711J0263Q5662j5714b31942B08060M4546A11542
15064F1007A4520J92418M1528n6018D1928J65257J28631b2514C00250n0090I8742
15052C09152I7595a56332C11249A22016N940O5358H7257K91608j42462e0533B49426
15040A55720J65308C2518L69303A36943F1799K7855a15927e504C36634A990L84188
15029C86178j81173K21282O34c9727B52909g0660B75093m8814k0170O0830K06928
$$ plain form
15018 473867 91607 362387 249559 338818 207003 30818 164573 250708 -49334 396333
15007 187133 90813 318056 37927 54171 376712 179768 66053 285037 155894 371411
14997 371411 200679 -194750 341139 136819 -166029 104137 268100 254935 491213 262164
14987 262164 318682 543292 288048 144412 571391 122743 347297 44836 199105 506908
14977 506908 476457 290342 212374 -161955 -135472 -30063 236113 1880 330872 -75309 173679
14965 104145 279584 289579 568289 -142983 449968 117626 161724 144544 335639 212076
14955 212076 95782 350573 522927 493897 190122 240935 104896 298136 172309 218027
14945 218027 531182 159112 292326 190567 192925 -50881 435813 209648 212384 562473
$$ packed form
15018D73867I1607K70780j12828Q9259j31815C0818J33755Q6135d9334C96333
15007A87133I0813K27243C7927J6244L22541A79768F6053K18984j29143K15517
14997C71411j70732a94750C41139A36819a66029A04137J63963j3165K36278k29049
14987B62164N6518K24610k55244j43636M26979A22743K24554D4836J54269L07803
14977E06908l0451j86115p7968a61955K6483c0063B36113A880L28992g5309A73679
14965A04145J75439R995K78710a42983D49968A17626M4098j7180J91095j23563
14955B12076I5782K54791J72354k9030A90122N0813A04896J93240j25827M5718
14945B18027L13155A59112J33214j01759K358e0881D35813B09648K736L50089
$$ plain form
14935 562473 -39408 292320 407477 493764 395255 126952 144457 154956 141091 294543 207869
14924 207869 405640 242851 410957 200227 47424 264815 276230 254719 330547 243107
14914 243107 518896 199011 379310 282624 203860 259230 475721 206340 299648 356332
14904 356332 13811 339131 -9051 400031 324515 265919 799173 137669 359889 479610
14894 479610 535439 432796 128142 236978 227042 299663 364271 402152 164896 143582 79975
14883 79975 287928 190712 534545 351028 302707 303810 260771 291034 558499 70601 179937
14872 179937 415535 640454 186306 418934 341699 448976 256487 322179 215988 420331
14862 420331 210626 442292 393668 183179 305741 285875 606899 582066 497922 202298
$$ packed form
14935E62473c9408B92320J15157Q6287r8509A26952J7505J0499j3865J53452q6674
14924B07869J97771j62789J68106B00227D7424K17391J1415k1511P5828q7440
14914B43107K75789A99011J80299r6686p8764N5370K16491B06340R3308N6684
14904C56332A3811L25320i051D00031p5516n8596N33254A37669K22220J19721
14894D79610N5829j02643A28142J08836r936P2621O4608L7881A64896k1314o3607
14883G9975K07953r7216L43833j83517m8321J103m3039L0263K67465G0601J09336
14872A79937K35598K24919A86306K32628p7235J07277j92489O5692j06191K04343
14862D20331k09705K31666m8624A83179J22562j9866L21024k4833q4144B02298
$$ plain form
14851 644130 312133 384930 330288 252421 337353 210788 302574 464053 183604 489359
14841 489359 180023 725110 589427 207585 178380 560624 515057 397969 343076 272483
14831 272483 542239 490434 437948 405528 302770 555013 233328 871208 780079 656944
14821 656944 369028 202796 446590 491689 478116 627205 599438 711421 339551 486475
14811 486475 351615 634204 654323 312584 518106 532371 482267 411332 77522 543160
14801 543160 299408 383733 473373 359801 549579 764493 588066 485985 600766 386773
14791 386773 523596 164646 712622 543386 313027 386338 640954 557144 482937 495618
14781 495618 432446 508340 758958 614918 390668 821976 570197 486218 390597 495420
$$ packed form
14851F44130C12133P2797n4642p7867Q4932j26565R1786J61479A83604L05755
14841D89359A80023N45087j35683B07585k9205L82244m5567j17088n4893p0593
14831B72483K69756n1805n2486l2420j02758K52243B33328O37880r1129j23135
14821F56944k87916j66232K43794M5099j3573J49089k7767J11983C39551J46924
14811D86475j34860K82589K0119C12584K05522J4265n0104p0935G7522M65638
14801E43160k43752Q4325Q9640j13572J89778K14914j76427j02081J14781k13993
14791C86773J36823A64646N47976j69236k30359P3311K54616q3810p4207J2681
14781D95618o3172P5894K50618j44040k24250M31308k51779q3979r5621J04823
$$ plain form
14771 495420 722641 616860 429905 702312 350795 585349 355525 755899 429426 443768
14761 443768 492631 659460 547282 415897 432969 650457 560304 732025 690510 502143
14751 502143 601340 624688 905471 616372 399989 586087 593913 893686 682450 644782
14741 644782 718956 639120 703551 775307 691778 896989 752389 718071 407968 698506 831940
14730 831940 449306 434156 754194 579227 722378 769738 1091422 923155 576071 801270
14720 801270 995048 837430 648106 767838 756608 445073 913032 809910 804684 843318
14710 843318 550076 758417 660815 687446 1093430 697606 755030 964126 469702 691102
14700 691102 978037 910607 786685 649177 810082 762230 858398 955616 689491 824899
$$ packed form
14771D95420K27221j05781j86955K72407C50795K34554k29824M00374l26473J4342
14761D43768M8863J66829j12178j31385J7072K17488r0153J71721m1515j88367
14751E02143R9197K3348K80783k89099k16383J86098P826K99773k11236l7668
14741F44782P4174p9836O4431P1756q3529K05211j44600l4318l10103K90538J33434
14730H31940l82634j5150L20038j74967J43151M7360L21684j68267l47084K25199
14720H01270J93778j57618j89324J19732j1230l11535M67959j03122n226L8634
14710H43318k93242K08341r7602K6631M05984l95824N7424K09096D69702K21400
14700F91102K86935o7430j23922j37508J60905m7852R6168R7218k66125J35408
$$ plain form
14690 824899 856589 927971 703974 483906 890865 944132 895229 1383393 1319714 800377
14680 800377 1219140 880789 609284 903799 628065 886768 611385 878478 1056000 1156993
14670 1156993 1014021 1119081 693905 1090737 1127376 973352 1093299 1066735 1208596 949752
14660 949752 1166219 971276 1062800 1072480 966346 990186 780228 875553 1153912 1285352
14650 1285352 1003637 905005 1162194 1030749 1065639 1074611 963679 1306254 1179301 1293842
14640 1293842 1259345 1357876 1259769 1312215 1056303 1026736 1333980 1362294 1240561 1490220
14630 1490220 1154299 1521900 1247756 1083400 1476605 1186326 1340298 1128041 1015744
14621 1015744 1539543 1452745 1159893 1187388 1167311 1374846 1432886 1754833 1147749 1416596
$$ packed form
14690H24899L1690P1382k23997k20068M06959N3267m8903M88164o3679n19337
14680H00377M18763l38351k71505K94515k75734K58703k75383K67093J77522J00993
14670A156993j42972J05060m25176L96832L6639j54024J19947k6564J41861k58844
14660I49752K16467j94943R1524R680j06134K3840k09958R5325K78359J31440
14650A285352k81715r8632K57189j31445L4890Q972j10932L42575j26953J14541
14640A293842l4497R8531r8107N2446k55912k9567L07244K8314j21733K49659
14630A490220l35921L67601k74144j64356L93205k90279J53972k12257j12297
14621A015744N23799q6798k92852K7495k0077K07535N8040L21947o07084K68847
$$ plain form
14611 1416596 1566444 1410371 1780542 1570920 1460827 1364772 1302569 2024807 1571332 1566382
14601 1566382 1179774 1477856 1646365 1428289 1790951 1461199 1494745 2004421 1806204 1626186
14591 1626186 1487528 2194761 1615511 1781022 1411810 1725153 1454444 1524225 1517933 1888671
14581 1888671 1621831 1905520 1797437 1839978 1778303 2153633 1860703 2095032 2341814 2137607
14571 2137607 2233490 2110475 2373977 2215743 2318786 2142495 2043970 2578437 2769460 2459643
14561 2459643 2456762 2543852 2853428 2564968 3056342 3095043 3286848 3168581 3912109 4686534
14551 4686534 5235518 6626772 9868236 15982657 25423433 36066627 28776216 14902157
14543 14902157 8169387 5063576 3603987 3015423 2453676 2343725 2438366 1992966 2221057
$$ packed form
14611A416596J49848j56073L70171k09622j10093r6055o2203P22238m53475m950
14601A566382l86608K98082J68509k18076L62662l29752L3546N09676j98217j80018
14591A626186j38658P07233n79250J65511l69212L13343k70709O9781o292L70738
14581A888671k66840K83689j08083M2541o1675L75330k92930K34329K46782k04207
14571B137607R5883j23015K63502j58234J03043j76291r8525N34467J91023l09817
14561B459643k881Q7090L09576k88460M91374L8701J91805j18267P43528P74425
14551D686534N48984J391254L241464O114421R440776J0643194p290411j3874059
14543A4902157o732770l105811j459589n88564n61747j09951R4641m45400K28091
$$ plain form
14534 2221057 1833482 2154974 2035587 1980198 2113174 2044333 2057940 1857649 2041054 2172499
14524 2172499 2060906 2403880 2068074 2363620 2212266 2130822 2312673 2136143 2290952 2515892
14514 2515892 2558318 2681235 2448348 2886873 2582141 2715046 3020316 2671352 3107080 2624634
14504 2624634 3079378 2867908 2759901 2868423 3351134 2818653 2735137 3039588 3027464 3004405
14494 3004405 3256493 3079617 3106176 3240497 3191056 3315412 3495468 3267676 3570549 3277788
14484 3277788 3692163 3372518 3644165 3746154 3732927 3644983 3789591 3660224 4011465 3830115
14474 3830115 3826881 4381874 4131903 4246235 4005132 4249651 4149337 4573572 4416539 4348350
14464 4348350 4486503 4642688 4245462 4625032 4356176 4557407 4924131 4675538 4880574
$$ packed form
14534B221057l87575L21492j19387n5389J32976o8841J3607k00291J83405J31445
14524B172499j11593L42974l35806K95546j51354q1444J81851j76530J54809K24940
14514B515892M2426J22917k32887M38525l04732J32905L05270l48964M35728m82446
14504B624634M54744k11470j08007J08522M82711n32481q3516L04451j2124k3059
14494C004405K52088j76876K6559J34321m9441J24356J80056k27792L02873k92761
14484C277788M14375l19645K71647J01989j3227q7944J44608j29367L51241j81350
14474C830115l234N54993k49971J14332k41103K44519j00314M24235j57033o8189
14464D348350J38153J56185l97226L79570k68856K01231L66724k48593K05036
$$ plain form
14455 4880574 4891922 4922368 5135888 4967145 5082412 5056751 5081252 5463181 5390686 5675863
14445 5675863 5580154 5421991 5769238 5277380 5868310 5915987 5786848 6171336 6307619 6118516
14435 6118516 6134444 6483813 6145762 6787988 6629136 6369998 6696489 6823722 6598731 6839303
14425 6839303 7399326 7201371 7655095 7213956 7555685 7522248 7414727 7937700 8421800 8181146
14415 8181146 8273706 8402934 8527671 8651672 8752554 8576860 8973404 9007924 9289776 9216443
14405 9216443 9439339 9788687 9800646 9900829 9953583 10238530 10191037 10631089 10576096 10942133
14395 10942133 10962945 11297200 11479223 11819547 11830368 11953980 12064983 12541904 12688090 13135308
14385 13135308 13096449 13345705 13792853 13988393 14436607 14274441 14318030 14715037 15247202 15266828
$$ packed form
14455D880574J1348L0446K13520j68743J15267k5661K4501L81929p2495K85177
14445E675863r5709j58163L47247m91858N90930M7677j29139L84488J36283j89103
14435F118516J5928L49369l38051O42226j58852k59138L26491J27233k24991K40572
14425F839303N60023j97955M53724m41139L41729l3437j07521N22973M84100k40654
14415H181146R2560J29228J24737J24001J00882j75694L96544L4520K81852p3333
14405I216443K22896L49348J1959J00183N2754K84947m7493M40052n4993L66037
14395A0942133K0812L34255J82023L40324J0821J23612J11003M76921J46186M47218
14385A3135308l8859K49256M47148J95540M48214j62166M3589L97007N32165J9626
$$ plain form
14375 15266828 15913141 16257441 16467954 16487944 17055591 17379650 17888531 17995483 18535248
14366 18535248 18684149 19597892 19568400 20271056 20527412 20840265 21651636 21270590 22582721
14357 22582721 22916933 23684322 24012532 24242818 25213787 25919062 26511094 27256734 27637156
14348 27637156 28722843 29173376 29928334 30741546 31527145 32304884 33222622 34033705 35032840
14339 35032840 36025672 36920540 38543492 39604184 40827131 41795253 42980075 44483749
14331 44483749 45693232 47281361 49207151 50366665 51959430 53595239 55616290 57163933
14323 57163933 59066806 61414347 63629830 66098136 68493647 70743598 73717656 76524381
14315 76524381 79546521 82551550 85816579 89391699 92798813 96943735 101227021 105316102
$$ packed form
14375A5266828O46313L44300K10513J9990N67647L24059N08881J06952N39765
14366A8535248J48901R13743k9492P02656K56356L12853Q11371l81046J312131
14357B2582721L34212P67389L28210K30286R70969P05275N92032P45640L80422
14348B7637156J085687M50533P54958Q13212P85599P77739R17738Q11083R99135
14339C5032840R92832Q94868J622952J060692J222947R68122J184822J503674
14331D4483749J209483J588129J925790J159514J592765J635809K021051J547643
14323E7163933J902873K347541K215483K468306K395511K249951K974058K806725
14315G6524381L022140L005029L265029L575120L407114M144922M283286M089081
$$ plain form
14307 105316102 109936075 114848226 119906989 125435663 131010745 137674622 144106488 150577523
14299 150577523 158080347 165811013 174416712 182798383 192065190 201754237 212062568 223005878
14291 223005878 233883973 246235315 258605151 271716554 285098514 298733448 313147601
14284 313147601 327504087 342180244 357072712 371071719 385105018 398244705 410930366
14277 410930366 422228468 432088000 440193453 446038054 449330800 449158521 446348934 442799806
14269 442799806 438249921 432558575 424756837 415470275 405000166 394192407 382038075
14262 382038075 368867997 354769103 340000821 324962931 310062772 295518575 281058099
14255 281058099 266820596 253681889 241001180 228793150 217196192 206478381 196074981
$$ packed form
14307A05316102M619973M912151N058763N528674N575082O663877O431866O471035
14299A50577523P502824P730666Q605699Q381671R266807R689047J0308331J0943310
14291B23005878J0878095J2351342J2369836J3111403J3381960J3634934J4414153
14284C13147601J4356486J4676157J4892468J3999007J4033299J3139687J2685661
14277D10930366J1298102R859532Q105453N844601L292746j72279k809587l549128
14269D42799806m549885n691346p801738r286562j0470109j0807759j2154332
14262C82038075j3170078j4098894j4768282j5037890j4900159j4544197j4460476
14255B81058099j4237503j3138707j2680709j2208030j1596958j0717811j0403400
$$ plain form
14248 196074981 186434769 177152430 168513105 160728716 152896355 145588355 139136785 132337182
14240 132337182 126558054 120962380 115971760 110839999 106192575 101376907 97269632 93646788
14232 93646788 89766221 86363064 82816841 79452508 76522121 73905986 70862019 68374448
14224 68374448 66028983 63572673 61257649 59249318 57618884 55434137 53359848 52117727
14216 52117727 50357120 48748571 47410148 46077341 44344417 43136932 41923492 40647778
14208 40647778 39733282 39063561 37712157 36450425 35363250 34500859 33248328 32842153 32087987
14199 32087987 31314742 30359898 29299687 28745665 28097213 27624030 26728657 25906211 25611726
14190 25611726 24632869 24159718 23648046 23005684 22790920 21994589 21510244 21262551 20849127
$$ packed form
14248A96074981r640212r282339q639325p784389p832361p308000o451570o799603
14240A32337182n779128n595674m990620n131761m647424m815668m107275l622844
14232I3646788l880567l403157l546223l364333k930387k616135l043967k487571
14224F8374448k345465k456310k315024k008331j630434k184747k074289j242121
14216E2117727j760607j608549j338423j332807j732924j207485j213440j275714
14208D0647778r14496o69721j351404j261732j087175q62391j252531m06175p54166
14199C2087987p73245r54844j060211n54022o48452m73183q95373q22446k94485
14190B5611726r78857m73151n11672o42362k14764p96331m84345k47693m13424
$$ plain form
14181 20849127 20201581 19819735 19209688 19151367 18678059 18263571 17778467 17496069 16898416
14172 16898416 16795277 16561690 16234790 15947118 15618905 15362548 15229406 14921313 14351915
14163 14351915 14250870 13974846 13599916 13638092 13080465 13128704 12640200 12455343 12617870 12117872
14153 12117872 11997687 11633282 11240865 11459489 11347267 11051545 10835839 10552476 10345469
14144 10345469 10032867 10025402 9888889 9923589 9490821 9439038 9378095 9239111 9147160 9099951
14134 9099951 8880275 8942582 8485853 8592532 8150958 8245400 7953691 7999341 7642388 7938139
14124 7938139 7521601 7817488 7614994 7495233 7328283 7219741 7063282 7033549 7052685 6772515
14114 6772515 6755977 6570097 6378110 6589457 6412242 6212739 6069739 5887619 5868941 6062806
$$ packed form
14181B0849127o47546l81846o10047n8321m73308m14488m85104k82398n97653
14172A6898416j03139k33587l26900k87672l28213k56357j33142l08093n69398
14163A4351915j01045k76024l74930L8176n57627M8239m88504j84857J62527m99998
14153A2117872j20185l64405l92417K18624j12222k95722k15706k83363k07007
14144A0345469l12602p465j36513L4700m32768n1783o0943j38984r1951m7209
14134I099951k19676O2307m56729J06679m41574R4442k91709M5650l56953K95751
14124G938139m16538K95887k02494j19761j66950j08542j56459k9733J9136k80170
14114F772515j6538j85880j91987K11347j77215j99503j43000j82120j8678J93865
$$ plain form
14104 6062806 5985962 6093785 5697731 5524151 5839514 5761419 5591699 5524572 5268774 5379419
14094 5379419 5378398 5107283 5039978 5251187 4900901 4963251 4821283 4849501 4975835 4712107
14084 4712107 4807572 4504843 4505435 4363195 4554815 4385505 4225938 4431706 4386689 4251572
14074 4251572 4305015 4200140 4238076 3928381 4143016 3544842 4130431 3819572 3974377 3857992
14064 3857992 4001242 3655325 3632010 3433093 3800218 3322720 3752477 3828836 3869318 3384351
14054 3384351 3571185 3495099 3471930 3443725 3502845 3424690 3352538 3340363 3091004 3123960 3057398
14043 3057398 3078651 3193428 3412537 3197252 3163978 3370059 2977720 2709155 3092884 2989917
14033 2989917 3142806 2780258 2603245 2836238 2951691 2581168 2610336 2624905 2995634 2783814
$$ packed form
14104F062806p6844J07823l96054j73580L15363p8095j69720o7127k55798J10645
14094E379419j021k71115o7305K11209l50286O2350j41968K8218J26334k63728
14084D712107R5465l02729N92j42240J91620j69310j59567K05768m5017j35117
14074D251572N3443j04875L7936l09695K14635n98174N85589l10859J54805j16385
14064C857992J43250l45917k3315j98917L67125m77498M29757P6359M0482m84967
14054C384351J86834p6086k3169k8205N9120p8155p2152j2175k49359L2956o6562
14043C057398K1253J14777K19109k15285l3274K06081l92339k68565L83729j02967
14033B989917J52889l62548j77013K32993J15453l70523K9168J4569L70729k11820
$$ plain form
14023 2783814 2354473 2578344 2767628 2411384 2325874 2493392 2130062 2698835 2491581 2145282
14013 2145282 2196471 2243685 2391382 2407997 2394089 1955243 2308576 2223747 2227594 1905823 2540732
14002 2540732 2459695 2048329 2174920 2169933 2115905 2206428 1928713 2212605 2427172 2104510
13992 2104510 2513233 2913142 3556432 5028816 8976851 18995292 33034088 30969785
13984 30969785 18789006 11538465 7814675 5780345 4798620 3913997 3636699 3019443
13976 3019443 3012558 2999415 2632152 2425265 2472221 2250867 2417473 2486574 2552151 2415324
13966 2415324 1970759 2216524 2013857 1829994 2105772 2391150 2070302 2044907 2195930 1822347
13956 1822347 1928143 1863375 2016453 2039533 1666015 1911963 2056162 1666395 1782497 1813999
$$ packed form
14023B783814m29341K23871J89284l56244q5510J67518l63330N68773k07254l46299
14013B145282N1189M7214J47697J6615j3908m38846L53333q4829L847l21771O34909
14002B540732q1037m11366J26591m987n4028R0523k77715K83892K14567l22662
13992B104510M08723L99909O43290J472384L948035J0018441J4038796k064303
13984C0969785j2180779p250541l723790k034330r81725q84623k77298o17256
13976C019443o885j3143l67263k06887M6956k21354J66606O9101O5577j36827
13966B415324m44565K45765k02667j83863K75778K85378l20848k5395J51023l73583
13956A822347J05796o4768J53078K3080l73518K45948J44199l89767J16102L1502
$$ plain form
13946 1813999 1849027 1826535 1818589 1664922 1404359 1713927 1820616 1544516 1756466 1740698
13936 1740698 1551358 1847569 1398311 1349520 1841021 1283002 1222383 1385256 1627587 1646104
13926 1646104 1335844 1293225 1562840 1721308 1095887 1222115 1287433 1379188 1342017 1642729
13916 1642729 1228889 1570956 1514623 990614 1299160 1422795 1413764 1071602 1470783 1296252
13906 1296252 1223695 1428954 1699055 1240597 1450216 1360350 1079858 1223966 769506 1185768
13896 1185768 1360100 1344682 1402976 1311469 1223417 1298564 1311613 1086283 991795 1483638 1292782
13885 1292782 1278905 1150189 1267787 1182793 1333145 1504422 949398 1184912 1319329 1201414
13875 1201414 1173275 1041541 1108955 1117326 987345 1282292 816690 853460 955825 1314036
$$ packed form
13946A813999L5028k2492p946j53667k60563L09568J06689k76100K11950j5768
13936A740698j89340K96211m49258m8791M91501n58019o0619J62873K42331J8517
13926A646104l10260m2619K69615J58468o25421J26228O5318R1755l7171L00712
13916A642729m13840L42067n6333n24009L08546J23635r031l42162L99181j74531
13906A296252p2557K05259K70101m58458K09619q9866k80492J44108m54460M16262
13896A185768J74332j5418N8294r1507q8052P5147J3049k25330r4488M91843j90856
13885A292782j3877j28716J17598q4994J50352J71277n55024K35514J34417j17915
13875A201414k8139j31734O7414Q371j29981K94947m65602L6770J02365L58211
$$ plain form
13865 1314036 799176 722712 1011151 1367888 1097663 760772 996034 822175 1190954 1127764
13855 1127764 1049004 1108005 814956 1062824 910193 859201 693045 977509 1227627 936113
13845 936113 1147071 970818 680053 1176632 757802 897901 667297 885669 912723 969160
13835 969160 1042485 995523 540205 776678 1120389 808350 825493 868521 861104 998503 845241
13824 845241 828281 1101406 635220 604331 913371 605551 563314 739786 532966 935092
13814 935092 540028 506292 694512 1179283 705502 603882 659924 505587 669547 1086690
13804 1086690 599650 830249 700494 719083 1118624 922498 570160 611641 740134 846302
13794 846302 619610 592287 700130 458233 380498 795991 785468 538623 700810 523837
$$ packed form
13865A314036n14860p6464K88439L56737k70225l36891K35262j73859L68779o3190
13855A127764p8760N9001k93049K47868j52631n0992j66156K84464K50118k91514
13845I36113K10958j76253k90765M96579m18830J40099k30604K18372K7054N6437
13835I69160P3325m6962m55318K36473L43711l12039J7143M3028p417J37399j53262
13824H45241j6960K73125m66186l0889L09040l07820m2237J76472k06820M02126
13814I35092l95064l3736J88220M84771m73781j01620N6042j54337J63960M17143
13804A086690m87040K30599j29755J8589L99541j96126l52338M1481J28493J06168
13794H46302k26692k7323J07843k41897p7735M15493j0523k46845J62187j76973
$$ plain form
13784 523837 745444 757728 452943 319183 669210 622860 956500 641368 757883 606608
13774 606608 654916 317420 717133 620630 623557 892794 554995 804661 593831 500096
13764 500096 423019 837599 723924 646725 620537 660519 900805 299073 849791 530308
13754 530308 706565 228446 502871 784743 626853 592919 648648 855017 648470 540764
13744 540764 459174 583772 481504 472525 634264 587987 1128228 755367 572015 475218
13734 475218 322804 560153 507279 701495 757100 468548 443014 660182 931644 613224
13724 613224 586661 830726 687195 539603 285861 814947 219232 446038 431586 544814
13714 544814 516099 212038 502193 767177 295710 631572 728187 544050 879697 836117
$$ packed form
13784E23837K21607J2284l04785j33760L50027m6350L33640l15132J16515j51275
13774F06608M8308C17420L99713r6503K927K69237l37799K49666k10830r3735
13764E00096p7077M14580j13675p7199k6188L9982K40286B99073N50718l19483
13754E30308J76257B28446K74425K81872j57890l3934N5729K06369k06547j07706
13744E40764q1590J24598j02268q979J61739m6277N40241l72861j83352r6797
13734D75218j52414K37349n2874J94216N5605k88552k5534K17168K71462l18420
13724F13224k6563K44065j43531j47592k53742N29086B19232K26806j4452J13228
13714E44814k8715B12038K90155K64984B95710L35862R6615j84137L35647m3580
$$ plain form
13704 836117 345630 349391 517265 325516 286826 263296 957953 549916 534160 561806 491718
13693 491718 507835 439898 594626 556902 357225 636437 354803 384351 281678 400724
13683 400724 551158 353312 378584 725391 445685 571202 417066 371428 260467 175992
13673 175992 611359 497667 254211 468452 248496 537535 66264 419870 425946 842818
13663 842818 381935 81074 554054 361512 460134 174790 354223 380551 382181 359376 288877
13652 288877 560434 163709 220677 515917 313397 535956 395988 331409 371387 90224
13641 215676 272758 355084 441094 511141 479936 503709 344636 416280 677843 402864 474922
13630 474922 289874 163986 299944 3139 388416 442990 384559 272172 383611 87014
$$ packed form
13704H36117C45630L761J67874j91749l8690k3530O94657m08037j5756K7646p0088
13693D91718J6117o7937J54728l7724j99677K79212k81634K9548j02673J19046
13683D00724J50434j97846K5272L46807k79706J25517j54136m5638j10961q4475
13673A75992M35367j13692k43456K14241k19956K89039F6264L53606O076M16872
13663H42818C81935H1074M72980j92542R8622A74790J79433K6328J630k2805p0499
13652B88877K71557A63709N6968K95240k02520K22559j39968o4579L9978I0224
13641B15676N7082Q2326Q6010P0047l1205K3773j59073P1644K61563k74979P2058
13630D74922j85048j25888J35958C139L85277N4574n8431j12387J11439H7014
$$ plain form
13619 552255 526666 -35968 322060 379135 295087 383232 608443 337502 407418 71086 308000
13608 308000 215603 262916 504385 514508 345867 469579 -138724 177186 122198 213572
13598 213572 218611 141290 291191 29705 210111 125749 513959 155917 109080 305230 13092
13586 456352 346069 293163 397045 273388 284879 253104 437730 168611 314115 392508
13576 392508 334985 195493 296300 360912 431388 576513 559620 632767 149837 646910
13566 646910 317750 231747 136783 344484 79056 60287 565275 539281 366396 6747 552875
13555 552875 325178 110451 110594 228551 357390 386900 543972 336971 83772 488712
13545 488712 40824 440798 499269 260889 351314 296315 58014 95478 119936 530705 302657
$$ packed form
13619E52255k5589c5968C22060N7075q4048Q8145K25211k70941O9916G1086K36914
13608C08000r2397M7313K41469J0123j68641J23712a38724A77186n4988R1374
13598B13572N039p7321J49901B9705J80406q4362L88210A55917m6837J96150A3092
13586D56352j10283n2906J03882j23657J1491l1775J84626A68611J45504P8393
13576C92508n7523j39492J00807O4612P0476J45125j6893P3147A49837M97073
13566F46910C17750q6003r4964K07701G9056j8769N04988k5994j72885F747N46128
13555E52875k27697A10451J43J17957J28839K9510J57072k07001H3772M04940
13545D88712D0824L99974N8471k38380R0425n4999E8014L7464K4458M10769k28048
$$ plain form
13534 302657 255600 138406 246047 651666 -62821 429609 171748 95069 185707 305121
13524 305121 290281 297538 298815 336137 257202 164353 494889 112208 53019 293192 357892
13513 357892 -58680 135833 128690 -109296 334279 535169 -50849 430782 432157 -7498 212758
13501 -21718 415172 -101295 88515 7506 378875 -52776 74656 573925 333033 201128 249492
13490 249492 315624 38651 226436 198512 377928 371528 75734 299215 257648 111546 232383
13479 232383 358805 297003 169807 297667 197509 93370 288515 185594 559113 262189
13468 525393 389286 127282 100982 218325 517121 349429 260929 369994 24173 71111
13458 71111 142212 -174083 287302 47788 177703 -49234 313792 435453 92566 39220 539304
$$ packed form
13534C02657m7057j17194J07641M05619f2821D29609A71748p6679R0638J19414
13524C05121j4840P257J277L7322p8935r2849L30536A12208E3019K40173O4700
13513C57892e8680A35833p143a09296C34279K00890e0849D30782J375g498B12758
13501b1718D15172a01295H8515G506L71369e2776G4656M99269k40892j31905M8364
13490B49492O6132C8651J87785k7924J79416o400G5734K23481m1567A11546J20837
13479B32383J26422o1802j27196J27860j00158I3370J95145j02921L73519B62189
13468E25393j36107A27282k6300J17343K98796j67692q8500J09065B4173M6938
13458G1111P1101a74083B87302D7788J29915d9234C13792J21661I2566C9220N00084
$$ plain form
13447 539304 272943 156342 -32983 315931 341024 30409 259473 109351 -138829 234398
13436 -158599 460604 222400 -24673 107473 -175796 284927 421091 223406 327428 234457
13426 234457 243603 401552 410205 381764 54232 297264 38434 215674 -96960 298887 93361
13414 337561 270383 317737 552580 118765 -1348 343852 135746 360633 106775 170930
13404 170930 42718 354876 662823 128430 318005 270440 70638 48389 225663 578777
13394 578777 229468 62428 411923 -8378 -16791 -69973 -54630 322881 72993 346625 492668
13383 492668 275652 -87042 83971 77411 109771 101018 364925 -16184 23636 101146 339592
13372 339592 418312 320187 318565 71088 49206 311307 148342 -7306 42264 507642 126221
$$ packed form
13447E39304k66361j16601c2983C15931K5093C0409K29064A09351a38829B34398
13436a58599D60604B22400b4673A07473a75796B84927J36164j97685J04022r2971
13426B34457R146J57949Q653k8441E4232K43032C8434J77240i6960B98887I3361
13414C37561o7178M7354K34843A18765a348C43852A35746K24887A06775O4155
13404A70930D2718L12158L07947A28430J89575m7565G0638k2249J77274L53114
13394E78777B29468F2428L49495h378q413n3182J5343C22881G2993K73632J46043
13383D92668k17016h7042H3971o560L2360q753K63907a6184B3636P7510K38446
13372C39592P8720r8125j622G1088k1882K62101A48342g306D2264M65378A26221
$$ plain form
13360 200804 245698 153240 374804 115020 274868 419191 92335 109076 277735 525616
13350 525616 287111 337945 43330 185108 234643 339771 279138 363845 76023 331516 147491
13338 362274 114019 58289 369905 217852 200911 434859 -76379 267113 291589 -51735
13327 163865 247011 -141346 370154 272251 141324 85807 565209 275030 -64293 153796
13316 227471 171671 175483 7693 189397 -57347 233774 232331 215303 51351 79125 102708 42222
13303 33945 285601 229744 296984 -232896 35223 123108 301338 214636 -98175 227285 23513
13291 14627 144976 140538 195577 -54416 -126206 -29767 156488 298384 227105 -250700 260415
13279 222872 67779 165913 -132471 -226385 78398 40788 20882 79234 83837 87600 -447727
$$ packed form
13360B00804M4894r2458K21564A15020J59848J44323I2335J6741J68659K47881
13350E25616k38505N0834D3330J41778M9535J05128o0633Q4707G6023K55493A47491
13338C62274A14019n5730L11616j52053j6941K33948g6379B67113K4476e1735
13327A63865Q3146a41346C70154r7903j30927n5517M79402B75030f4293A53796
13316B27471n5800L812G693J81704e7347B33774j443j7028E1351K7774K3583D2222
13303C3945K51656n5857O7240b32896C5223Q7885J78230q6702i8175B27285B3513
13291A4627J30349m438N5039e4416p1790b9767A56488J41896p1279b50700B60415
13279B22872F7779R8134a32471r3914G8398l7610j9906N8352M603L763d47727
$$ plain form
13267 38515 136619 44324 151813 -1290 31945 177237 74378 337706 -10727 -145375 160874
13255 276251 1286 -72496 38517 270036 518473 -241249 -26558 -35935 22337 201228 228684
13244 228684 100758 76366 134972 240226 -28041 359248 232796 132871 37804 -22002 -7634
13232 309141 110932 174328 69475 -106706 -110420 76078 202472 4148 -82140 547011 14921
13220 -183113 -95280 144564 -12148 -102823 -49760 118912 14320 -141085 37764 173387 1984
13208 233342 32682 534053 201476 -162737 97528 151922 -133285 286373 9189 188947
13198 188947 -25575 -88932 398079 -45690 161335 185628 201320 51751 -66524 -31759 60006
13186 53319 103164 -316697 310522 137385 191895 115802 -28357 -114248 289784 65305 113438
$$ packed form
13267C8515R8104D4324J07489a290C1945J45292G4378K63328a0727j34648A60874
13255B76251A286g2496C8517K31519K48437b41249b6558r377B2337J78891K7456
13244B28684A00758k4392N8606J05254b8041C59248j26452r9925C7804b2002g634
13232C09141A10932O3396F9475a06706l714G6078J26394D148h2140E47011A4921
13220a83113Q7833A44564a2148r0675d9760A18912A4320a41085C7764J35623A984
13208B33342C2682N01371B01476a62737I7528N4394a33285B86373I189J79758
13198A88947b5575o3357C98079d5690A61335K4293J5692E1751f6524c1759F0006
13186E3319M9845c16697C10522A37385N4510p6093b8357q5891B89784F5305M8133
$$ plain form
13175 113438 -56277 -214577 216311 -277964 179513 234118 148270 243504 34888 267336
13165 267336 14402 150012 111140 4030 4837 -119237 -271426 29534 131099 291886 -269200
13153 130759 319787 54903 152102 -83898 -128 184167 -312836 153435 351031 -86577 -182905
13142 -182905 140952 106043 308739 -202932 118408 212382 -24568 223859 -77064 74330
13131 67243 89637 233189 320001 298652 -53442 243955 170140 169585 79757 526650 -149427
13119 -12257 -170039 191994 -61736 -55697 184478 -16480 39925 23949 298128 9624 -10521
13107 333007 318845 -222022 -73499 -26232 -541 165176 158972 -177586 253503 266620 198832
13096 198832 -45292 106292 230855 105056 79111 89901 223467 131850 -82675 -85113 40446
$$ packed form
13175A13438e6277j58300B16311b77964A79513N4605q5848R5234C4888K32448
13165B67336A4402J35610l8872D030Q07a19237j52189B9534J01565J60787b69200
13153A30759J89028E4903R7199h3898a28A84167c12836A53435J97596h6577r6328
13142a82905A40952l4909K02696b02932A18408R3974b4568B23859g7064G4330
13131F7243K2394J43552Q6812k1349e3442B43955p3815n55G9757M46893a49427
13119a2257j57782A91994f1736O039A84478a6480C9925j5976K74179I624a0521
13107C33007j4162b22022g3499b6232e41A65176o204a77586B53503J3117o7788
13096A98832d5292A06292J24563A05056k5945J0790J33566r1617h2675k438D0446
$$ plain form
13084 77666 -161005 -74747 -82587 3349 -196961 61882 269619 288180 469009 164691 130849
13073 130849 258258 414867 11168 -3698 106814 170689 54290 -135610 165479 -11824 89191
13061 -138065 165025 177605 -72786 124711 10753 73354 217401 311049 46594 -29139 -93494
13050 -93494 316727 99476 268277 63459 136044 60670 -99557 -91879 -108543 276900 198779
13039 198779 278516 286743 105293 41976 3236 535304 -58572 126815 245683 122470 222137
13028 222137 221898 168275 -60237 273637 241015 -44521 -282923 -7943 -9953 -175235 -73751 330320
13015 -329429 -49369 419988 50788 -34230 -100162 -275054 215368 -117793 375081 114716
13004 12071 134307 260102 -7418 -25940 55048 -145164 -159142 236851 284132 -36207 -355925
$$ packed form
13084G7666a61005g4747p840C349a96961F1882K07737J8561J80829A64691l3842
13073A30849J27409J56609A1168c698A06814O3875E4290a35610A65479a1824H9191
13061a38065A65025J2580g2786A24711A0753O2601J44047R3648D6594b9139o4355
13050i3494C16727I9476J68801F3459P2585F0670i9557P678j6664B76900p8121
13039A98779P9737Q227A05293D1976C236N32068e8572A26815J18868A22470R9667
13028B22137k39n3623f0237B73637l2622d4521k38402g943k010j65282g3751C30320
13015c29429d9369D19988E0788c4230o5932j74892B15368a17793C75081A14716
13004A2071J22236J25795g418j8522E5048a45164j3978B36851M7281c6207l19718
$$ plain form
12993 -355925 -352903 160685 303353 112243 -43357 -96984 325545 43341 -19250 -71580 -41708
12982 -41708 21253 52269 -105553 -197835 43028 23411 46126 -216118 -300108 232268 224021
12971 224021 274831 133692 115635 120765 80175 -17001 -140963 -94256 45830 75966 -233692
12959 -208957 121147 -42196 79577 284668 -42178 -25322 286101 24645 -27297 413632 -74745
12947 -24752 -16529 -77403 186527 -14019 39192 44679 -222324 85018 -86071 69498 86971 -143966
12934 371928 -155818 -19500 159319 118850 199974 28466 -200724 -42829 22622 252208 188282
12923 188282 -105936 127619 121208 259707 -86514 105466 -304530 160669 -301817 -116105
12912 -209292 187107 -110519 26457 204837 41464 -342 241836 -27455 134271 -47178 72843
$$ packed form
12993c55925L022A60685J42668A12243d3357n3627C25545D3341a9250n2330K9872
12982d1708B1253L1016a05553r2282D3028j9617K2715b16118q3990B32268q247
12971B24021N0810A33692j8057N130m0590a7001j23962M6707D5830L0136b33692
12959b08957A21147d2196G9577K05091d2178J6856B86101B4645b7297D13632g4745
12947b4752Q223o0874A86527a4019C9192N487b22324H5018h6071F9498J7473a43966
12934C71928a55818a9500A59319m0469Q1124B8466b00724d2829B2622K29586o3926
12923A88282a05936A27619o411J38499h6514A05466c04530A60669c01817a16105
12912b09292A87107a10519B6457J78380D1464c42B41836b7455A34271d7178G2843
$$ plain form
12900 49261 -209880 -180823 -40223 182570 17737 142552 -9246 70997 120968 -58861 18892
12888 272433 -498388 -118288 -59964 96804 -32870 -51782 -130970 97961 95107 27867 -168496
12876 -20122 -116723 120163 -38476 117051 -253996 27902 -435341 11556 -120993 -48604 278175
12864 12354 -261066 -370044 -29613 306858 -71476 -170243 -33984 -281525 209539 504285
12854 504285 -114669 14705 87974 148787 134198 83851 131689 -99591 299849 228669 114579
12843 114579 469007 -153688 -131070 152134 198141 288557 45563 115633 -51979 -42273 -299272
12832 -299272 203108 65595 45336 331849 56311 -97793 -128996 -2744 111077 -25687 -18431
12821 -18431 -107409 -47370 -27284 -118128 9345 -116134 -408378 -83513 89480 336730 29690
$$ packed form
12900D9261b09880K9057d0223A82570A7737J24815i246G0997M9971e8861A8892
12888B72433d98388a18288N8324I6804c2870j8912p9188I7961k854B7867a68496
12876b0122r6601A20163c8476A17051b53996B7902d35341A1556a20993d8604B78175
12864A2354b61066j08978b9613C06858g1476r8767c3984k47541B09539K94746
12854E04285a14669A4705P3269O0813j4589n0347M7838i9591B99849p1180j14090
12843A14579L54428a53688K2618A52134M6007R0416D5563P0070e1979R706k56999
12832b99272B03108F5595k0259K86513E6311i7793l1203b744A11077b5687P256
12821a8431q8978d7370K0086r0844I345a16134k92244h3513H9480K47250B9690
$$ plain form
12809 8699 133161 -95526 -62822 -2161 -59004 12365 72719 219817 273180 268474 -65142 271883
12796 -535 -29284 -9667 -294855 -80668 -15081 -24862 -309762 -72265 358502 256852 157803 178741
12784 178741 75004 28681 261707 -130157 -67725 -177496 5653 178110 -171092 -20103 -395681
12773 -395681 -216554 26199 356166 -142760 -125432 -146556 187818 -95212 -234628 -90771
12762 117066 -122824 114141 -549185 -31599 100300 232099 -39738 -80687 -179324 290521
12751 59986 381088 -116702 -60588 -343532 245013 109478 -133295 -184121 -251850 -5905 13226
12739 215399 24984 19047 398921 -45974 89373 236166 418144 -21714 122401 18831 50796
12728 50796 -103246 119111 -39358 429807 -202348 19013 -72535 149975 102740 31516 -112630
$$ packed form
12809H699J24462i5526L2704b161n6843A2365O0354J47098N3363m706f5142B71883
12796e35k8749i667k85188h0668a5081r781k84900g2265C58502j01650r9049K0938
12784A78741G5004B8681K33026a30157O2432j09771E653J72457a71092b0103l75578
12773c95681J79127B6199L29967a42760J7328k1124A87818i5212j39416i0771
12762A17066a22824A14141e49185c1599A00300J31799c9738m0949r8637B90521
12751E9986L21102a16702N6114k82944B45013A09478a33295n0826o7729e905A3226
12739B15399B4984n937L79874d5974H9373J46793J81978b1714A22401A8831L1965
12728E0796a03246A19111c9358D29807b02348A9013g2535A49975m7235C1516a12630
$$ plain form
12716 212723 193725 -146360 211419 -100416 30157 321675 63730 316999 215018 89664
12705 -33647 107760 -23573 338125 203586 162985 144440 -83942 116550 -198541 63625 95515
12694 95515 -7617 168020 102853 -150229 -41403 -162737 69211 372693 87765 -21624 -36137
12683 -36137 -237190 184759 -51935 140983 157103 -18913 -58645 121720 22222 360976 -81519
12671 220338 -90710 106068 102588 123457 108880 160870 152894 319491 287043 -130513 64173
12659 -155873 118521 208852 31861 -254051 187893 234416 -125963 -34004 -64890 113753
12648 -332086 8354 8101 -111252 -67197 -191061 139805 -152000 -274590 49372 -115110 322903
12636 97801 72289 210192 284312 28608 132159 142284 -21610 211668 204170 133453 297229
$$ packed form
12716B12723j8998a46360B11419a00416C0157K91518F3730K53269j01981H9664
12705c3647A07760b3573C38125j34539m0601j8545h3942A16550a98541F3625L1890
12694I5515g617A68020o5167a50229d1403j21334F9211L03482H7765b1624j4513
12683c6137k01053A84759e1935A40983J6120a8913l9732A21720B2222L38754h1519
12671B20338i0710A06068l480K0869j4577N1990p976J66597l2448a30513F4173
12659a55873A18521R0331C1861b54051A87893M6523a25963c4004l0886A13753
12648c32086H354k53a11252M4055j23864A39805a52000j22590D9372a15110C22903
12636I7801k5512J37903P4120B8608J03551J0125b1610B11668p498p0717J63776
$$ plain form
12625 297229 520839 110405 -107385 221846 228971 400487 147844 -10650 11459 111584
12615 111584 -14264 -308467 -116839 64368 53384 165139 -63573 6595 154468 15673 -21676
12603 -252569 -86472 -9400 80184 219003 184865 173071 -11503 -11452 -42595 -282776 64405 6158
12590 279188 135783 29294 98100 170091 82408 -68047 97247 -297262 -26493 -60936 -75572
12579 -75572 42994 35225 -102885 -11097 307849 25915 -62083 95314 -110306 218653 -29613
12567 205326 46093 -294475 -254638 -252206 241355 263984 -253903 -86601 189056 201831 -172174
12555 31536 305863 344065 427823 -52040 237789 -5424 -34765 -40894 -60228 127918 110852
12544 110852 -181938 -72989 88654 76756 78258 -137189 41335 -128171 -269777 -103078 146084
$$ packed form
12625B97229K23610A10405a07385B21846P125J71516A47844a0650A1459J00125
12615A11584a4264k94203a16839F4368j0984J11755f3573F595J47873A5673b1676
12603b52569h6472i400H0184J38819l4138j1794a1503N1l1143k40181F4405F158
12590B79188A35783B9294O8806P1991H2408f8047I7247b97262b6493l4443j4636
12579g5572D2994p769a02885a1097C07849B5915f2083I5314a10306B18653b9613
12567B05326D6093b94475L9837K432B41355K2629b53903h6601A89056J2775a72174
12555C1536K74327L8202Q3758e2040B37789e424k9341o129j9334A27918j7066
12544A10852a81938g2989H8654j1898J502a37189D1335a28171j41606a03078A46084
$$ plain form
12532 58862 -157652 101821 167171 -67116 -154011 -161753 2269 170558 -213923 -79899 154124
12520 -87121 -160275 305551 71783 -108706 260070 -110950 -157110 370118 103847 426010
12510 426010 36640 -144592 -59187 -216225 -332956 -355597 24033 118069 81992 -101965 300957
12498 68436 -66882 -354464 -68754 47205 -220830 60847 87719 -88639 -220125 -66055 94878
12486 -165513 -72878 138285 -8266 273555 11104 -181878 193184 18290 322888 -388988
12475 135884 128066 256808 160807 -312271 -106644 -39940 -183914 107522 -271623 -265843 122677
12463 -5228 196 -116070 -75992 -316758 97314 301566 -151698 91297 -313230 -69473 131714
12451 -149061 -111806 250136 451911 359079 67312 2617 103300 -40838 20891 -142014 30712
$$ packed form
12532E8862a57652A01821O5350f7116q6895p742B269J68289b13923g9899A54124
12520h7121p3154C05551G1783a08706B60070a10950m6160C70118A03847L22163
12510D26010C6640a44592e9187j57038j16731k2641B4033R4036l6077a01965C00957
12498F8436f6882k87582f8754D7205b20830F0847K6872h8639j31486f6055I4878
12486a65513g2878A38285h266B73555A1104a81878A93184A8290L04598c88988
12475A35884p818J28742r6001c12271a06644c9940j43974A07522b71623N780A22677
12463e228A96a16070M0078k40766I7314K04252a51698I1297c13230f9473A31714
12451a49061L7255B50136K01775r2832F7312B617J00683d0838B0891a42014C0712
$$ plain form
12439 -282898 76729 -188550 -244400 -239498 1313 105228 948 -201884 168336 -80500 -91129
12428 -91129 -21103 -147976 -248765 232186 276339 -175665 -259235 -405035 -6503 -218647 187435
12416 -84661 89571 25641 -68958 -141111 -157864 16042 -129269 238556 164040 10538 -50384
12404 -11600 35189 220070 -290732 92891 59465 -186583 141057 306502 -42911 -35385 93574
12392 61696 102377 -148459 33974 -143585 -236413 -18202 295715 271049 191321 -189972 -251919
12381 -251919 27130 138792 -116577 -152525 -54184 -152537 -259954 182886 -193011 -50230
12370 -198037 340114 63231 -120328 -93424 -275582 103665 133159 -212050 -137920 253702
12359 -155365 -234474 160330 -193566 -164446 285947 212351 -200108 -340968 72710 6024 30190
$$ packed form
12439b82898G6729a88550n5850M902A313J03915I48b01884A68336h0500j0629
12428i1129b1103j26873j00789B32186M4153a75665q3570j45800f503k12144A87435
12416h4661H9571B5641f8958p2153j6753A6042a29269B38556p4516A0538e0384
12404a1600C5189J84881b90732I2891l3426a86583A41057J65445d2911P526I3574
12392F1696M0681a48459C3974a43585r2828a8202B95715k4666p9728a89972o1947
12381b51919B7130J11662a16577l5948e4184r8353j07417A82886a93011e0230
12370a98037C40114F3231a20328K6904j82158A03665K9494b12050P4130B53702
12359a55365p9109A60330a93566K9120B85947p3596b00108j40860G2710F024K4166
$$ plain form
12348 30190 -71416 127576 182022 177704 -83376 -53085 212337 -306048 -238565 -63510 -323471
12337 -323471 541336 200039 -278648 -325562 -178106 -129750 54593 164411 264494 38127
12326 -266373 395728 -46996 -30809 223040 191866 186695 -108194 -196693 -92549 10589 -177671
12314 -329863 215511 16526 -76238 320368 51016 -2766 258761 103111 201918 20062 78191
12303 78191 -209017 173506 119698 -241523 -3919 -34837 270994 127621 12445 158880 11019
12291 56238 -146739 -227824 117076 96894 75884 139574 -22526 79426 116965 -126437 -205482
12280 -205482 241789 -75269 -22182 -112595 83054 81097 119188 219535 164165 -21540 -182252
12269 -182252 150235 107658 237315 -56142 205950 137223 31978 194082 66986 -8027 295455
$$ packed form
12348C0190g1416A27576N4446m318h3376L0291B12337c06048O7483f3510k59961
12337c23471E41336B00039b78648m6914J47456M8356E4593J09818J00083C8127
12326b66373C95728d6996J6187B23040l1174n171a08194q8499i2549A0589a77671
12314c29863B15511A6526g6238C20368E1016b766B58761A03111R8807B0062N8129
12303G8191b09017A73506n3808b41523c919l0918B70994A27621A2445J46435A1019
12291E6238a46739q1085A17076k0182k1010O3690b2526G9426L7539a26437p9045
12280b05482B41789g5269b2182r0413H3054j957L8091J00347n5370b1540j60712
12269a82252A50235m2577J29657e6142B05950o8727C1978J62104F6986h027B95455
$$ plain form
12257 367730 -60030 65054 115239 -56913 -20880 -431483 118047 121518 256314 6255 -218262
12245 -31327 120338 278933 82704 65897 49010 103852 -8732 -82772 20826 7044 171590
12234 171590 327665 195977 -246120 172541 136936 154762 222036 -222120 159386 235602
12224 235602 412807 173000 132527 133752 -8336 267389 302769 216720 299432 390296 -89575
12212 349388 398540 169718 88334 30350 354621 -219605 110112 121944 34071 34174 84418
12201 84418 355420 497272 76362 -44917 416039 138388 20501 -336775 148537 -164352
12190 -197608 333044 160049 162969 219962 -27374 70689 379661 122528 -20124 -87263 61782
12178 130830 149687 -97849 -326463 -102462 30011 79587 179500 67789 -255079 241821 282794
$$ packed form
12257C67730f0030F5054N0185e6913b0880m10603A18047L471J34796F255b18262
12245c1327A20338J58595H2704j6807j6887N4842h732p4040B0826G044J64546
12234A71590J56075j31688b46120A72541l5605J7826O7274b22120A59386P6216
12224B35602J77205A73000m0473J225h336B67389L5380q6049Q2712R0864h9575
12212C49388M9152A69718q1384C0350L24271b19605A10112J1832C4071J03N0244
12201H4418K71002J41852G6362d4917D16039A38388B0501c36775A48537a64352
12190a97608C33044A60049K920N6993b7374G0689L08972A22528b0124o7139F1782
12178A30830J8857i7849k28614a02462C0011M9576R9913F7789b55079B41821M0973
$$ plain form
12167 282794 156287 182050 168266 242872 74542 -11523 -27921 -207137 90211 83769 -6430
12155 106319 13071 177742 73801 -197198 -42285 44288 238605 43280 -7480 137694 -74116
12143 -202448 -25164 -75001 -148900 97582 96053 -381203 103637 -71610 167080 263405 68792
12131 178374 386037 -318180 -106716 -8432 -138729 89102 175403 -107466 -102334 11767 297476
12120 297476 -165608 -177811 -116335 99732 -13371 102456 -118634 11312 179445 -187703
12109 -2666 80077 35554 -119055 157826 -358220 -312776 259240 -139200 -172288 -150335 -56796
12097 -258960 68552 -218656 -331088 124085 -96620 -358437 -127945 35995 73912 248200
12087 248200 -223745 146996 174835 22408 8335 60773 -62150 -114150 -274295 -44693 107163
$$ packed form
12167B82794j26507K5763j3784P4606G4542a1523j6398j79216I0211o442f430
12155A06319A3071J64671G3801a97198d2285D4288J94317D3280g480A37694g4116
12143b02448b5164m9837p3899I7582j529c81203A03637g1610A67080R6325F8792
12131A78374K07663c18180a06716h432j30297H9102Q6301a07466N132A1767K85709
12120B97476a65608j2203O1476I9732a3371A02456a18634A1312J68133a87703
12109b666H0077C5554a19055A57826c58220M5444B59240a39200l3088K1953e6796
12097b58960F8552b18656j12432A24085i6620k61817a27945C5995L7917J74288
12087B48200b23745A46996K7839B2408H335N2438f2150n2000j60145d4693A07163
$$ plain form
12075 -52628 354999 224979 1376495 538793 325886 252016 161452 -287072 89809 -367833
12064 -100505 -163893 -112022 -14587 -124407 148194 -45089 -266837 290712 12511 -30008 -93946
12053 -93946 101726 -64812 -398556 380447 -85356 -153287 -181346 96617 -73571 95783 -173258
12041 -70079 163226 166382 -21801 354239 61321 594 -192434 205758 -143745 178361 -79336
12029 59393 127410 189015 -192803 240186 -263122 -92870 -81049 342663 238798 82840 6013
12017 212675 -51061 9230 -113956 175824 -127114 -150542 263981 42706 -172938 -276056
12007 -276056 169104 -231230 184905 -207278 -285136 -876 -258384 -117612 242201 -141141
11996 160810 171619 -97261 23168 86763 36957 -75851 -24034 31179 11633 -20121 -187407
$$ packed form
12075e2628C54999j30020J151516E38793k12907p3870r0564b87072H9809c67833
12064a00505o3388N1871a4587j09820A48194d5089k21748B90712A2511c0008o3938
12053i3946A01726f4812l33744C80447h5356o7931k8059I6617g3571I5783a73258
12041g0079A63226L156b1801C54239F1321E94a92434B05758a43745A78361g9336
12029E9393O8017O1605a92803B40186b63122i2870J1821C42663j03865H2840F013
12017B12675e1061I230a13956A75824a27114k3428B63981D2706a72938j03118
12007b76056A69104b31230A84905b07278p7858h76k57508a17612B42201a41141
11996A60810J0809i7261B3168O3595C6957g5851b4034C1179A1633b0121j67286
$$ plain form
11985 -187407 -136466 -47248 19049 63774 -261134 -150285 62975 70522 -46918 258386 -86250
11973 33137 28939 -85121 132330 127 -88882 -273349 -8943 -46110 -179643 24648 -226938 124843
11960 -132179 -131217 120665 -89126 217936 -810 -33579 -119750 202069 53451 -139606 -73230
11949 -73230 -33124 110466 295886 129960 88675 -28780 -6977 -253995 196647 -264127 -199817
11938 -199817 -106620 94919 -30776 221829 -128019 37656 46372 -259884 186922 169307 -434153
11926 -29296 -177888 83358 -426478 69201 94752 -69914 -48543 -56683 439893 201632 -184007
11914 -227619 9063 20920 89677 -135079 -195383 19619 109782 -204195 288216 60459 172899
11903 172899 104247 -143150 -163818 -234727 182237 -110241 -121741 -102327 82155 8706 -267604
$$ packed form
11985a87407N0941d7248A9049M4725b61134J10849F2975P547d6918B58386h6250
11973C3137m198h5121A32330A27h8882j84467h943l7167j33533B4648b26938A24843
11960a32179R62A20665h9126B17936h10l2769q6171B02069E3451a39606O6376
11949g3230c3124A10466J85420A29960m1285b8780f977k47018A96647b64127O4310
11938a99817R3197I4919c0776B21829a28019C7656Q716b59884A86922j7615d34153
11926b9296j48592H3358d26478F9201K5551f9914K1371q140D39893B01632a84007
11914b27619I063J1857O8757a35079o0304A9619R0163b04195B88216F0459J12440
11903A72899o8652a43150k0668p0909A82237a10241j1500J9414H2155H706b67604
$$ plain form
11891 -185156 101207 -173702 -188958 287922 -192671 46558 -132511 -339205 62841 -100876
11880 202173 -336449 86015 -130104 -42291 355013 87364 -195839 -104169 -38832 -224456
11870 -224456 329664 185943 128996 -294881 -75019 -34550 286567 -221366 313582 173695
11860 173695 134991 -84567 -314208 -247833 -158282 -53913 -387925 -375268 97909 -145903 -166451
11849 -166451 56616 -87025 55393 -36573 -7288 86500 -87946 1271 -53687 -272280 16193 41228
11837 41228 112122 -185225 -394603 -109385 -32941 -65499 -347570 -39985 214516 -187145
11826 89848 -192129 83115 -120776 -25441 112353 -163431 -178335 -311383 -8290 70851 -113376
11814 -69559 779 -142953 -122868 265041 86630 84342 -147965 -169279 163723 157567 -349596
$$ packed form
11891a85156A01207a73702j5256B87922a92671D6558a32511k06694F2841a00876
11880B02173c36449H6015a30104d2291C55013H7364a95839R1670c8832j85624
11870b24456C29664j43721n6947b94881g5019c4550B86567b21366C13582j39887
11860A73695l8704h4567k29641O6375Q9551e3913l34012J2657I7909a45903k0548
11849a66451E6616h7025E5393c6573g288H6500h7946A271e3687k18593A6193K5035
11837D1228P0894a85225k09378a09385c2941l2558k82071c9985B14516a87145
11826H9848a92129H3115a20776b5441A12353a63431j4904j33048h290G0851a13376
11814f9559G79a42953K0085B65041H6630k288a47965k1314A63723o156c49596
$$ plain form
11802 -79432 -203266 138739 -175 -24638 -115750 151381 3487 -218609 102334 701 -154177
11790 313398 -219378 4562 238019 -223658 368499 -483197 -36761 -58377 176677 100847
11780 100847 68644 114175 -149132 160318 -74950 -279454 30092 92759 398654 -122841
11769 161265 -283327 -262143 -289587 -227941 98514 16698 -29187 125184 -83352 3619 -145429
11757 -258185 45980 187351 121322 122141 -118710 -49071 126336 -502107 -122271 -4704 -148495
11746 -148495 50871 185900 107338 -26508 1149 49540 -78285 -14364 51442 39213 -36849
11734 -2282 195545 276942 69776 -131987 -26214 170990 -208818 -198584 -32629 65576 -102218
11722 82522 41645 -153912 159277 305756 201154 -16808 -156074 276776 135497 115872
$$ packed form
11802g9432j23834A38739a75k4463r1112A51381C487b18609A02334G01a54177
11790C13398b19378D562K33457b23658C68499d83197c6761k1616A76677p5830
11780A00847l2203M5531a49132A60318g4950k04504C0092O2667L05895a22841
11769A61265b83327K1184k7444O1646I8514A6698b9187A25184h3352C619a45429
11757b58185D5980J41371o6029Q19a18710d9071A26336e02107a22271d704j43791
11746a48495E0871J35029p8562b6508A149M8391g8285a4364E1442j2229c6849
11734b282A95545Q1397F9776a31987b6214A70990b08818J0234c2629F5576a02218
11722H2522m0877a53912A59277J46479j04602a6808j39266B76776A35497j9625
$$ plain form
11712 115872 -140045 48514 133368 -124908 5539 199271 218401 116083 95880 295933 285384
11701 285384 234470 285814 16657 278453 -109472 85348 57769 -149992 82341 90022 -99498
11689 95068 41493 190385 -43185 -13260 110481 -133330 332949 60672 -74336 203594 89305
11677 199839 323649 162862 185044 -234559 -62641 491336 133164 5486 365692 -125846
11666 5614 251748 222373 -87225 -358974 -45760 32632 -153805 48916 -158770 170929 -23007
11654 -28713 -6789 -36160 33969 248786 -26631 -41329 167774 27322 -130760 -40057 21212
11642 -296609 211944 -16224 274987 -193854 -318524 149992 -198116 144267 -42613 -317845
11632 -317845 6912 106191 -109790 323508 54644 85710 -10033 57278 47454 -78531 -52015
$$ packed form
11712A15872a40045D8514Q4854a24908E539J93732J9130j02318k0203K00053j0549
11701B85384n0914N1344A6657K61796a09472H5348k7579a49992H2341P681i9498
11689I5068D1493J48892d3185a3260A10481a33330C32949F0672g4336B03594H9305
11677A99839J23810j60787K2182b34559f2641D91336A33164E486L60206a25846
11666E614K46134k9375h7225k71749d5760C2632a53805D8916a58770A70929b3007
11654b8713f789k9371C3969K14817b6631j4698A67774B7322a30760d0057B1212
11642b96609B11944a6224B74987a93854j24670A49992a98116A44267d2613k75232
11632c17845F912R9279a09790C23508E4644L1066a0033E7278r824g8531K6516
$$ plain form
11621 -52015 127411 -27043 -124491 68489 183534 -226441 191431 -42939 -128520 196691 -100596
11609 -259695 -94074 139513 -177614 5726 -78763 52387 130328 -149812 -180702 -290185 118351
11597 -232703 302427 66822 348774 -178328 160421 57080 255593 196287 111355 94377
11587 94377 364719 150668 200755 291546 240755 -141172 -44912 -206457 -130070 211923 -65060
11575 -143826 210531 -199848 311429 9800 -49402 100630 -265835 -149007 83650 -42992
11564 132797 28746 65473 275150 -5150 193463 213084 -106099 234418 -148272 266917
11553 -79342 127070 -20238 -9817 97154 152317 -24513 -175194 -80017 -145166 27474 -75636
11541 -93377 -35758 24209 279962 135865 78077 -273784 72696 -132876 -91543 75534 185358
$$ packed form
11621e2015A27411b7043r7448F8489J15045b26441A91431d2939q5581A96691a00596
11609b59695i4074A39513a77614E726g8763E2387P7941a49812l0890j09483A18351
11597b32703C02427F6822K81952a78328A60421E7080J98513n9306q4932j6978
11587I4377K70342A50668N0087R0791n0791a41172d4912j61545P6387B11923f5060
11575a43826B10531a99848C11429I800d9402A00630b65835J16828H3650d2992
11564A32797B8746L6727K09677e150A93463J9621a06099B34418a48272B66917
11553g9342A27070b0238i817I7154N5163b4513j50681h0017o5149B7474g5636
11541i3377c5758B4209K55753A35865n7788b73784G2696a32876M1333G5534J09824
$$ plain form
11530 185358 186061 -167130 -130171 214629 -369709 305284 41833 -5013 220231 386191 -125118
11518 152393 193658 -138036 85518 243046 269883 71959 222514 -85981 22540 229606 22605
11506 203066 112724 187217 -19006 -182263 -265210 165449 228143 271067 10515 270828 511612
11495 511612 187283 141659 -264025 79596 119606 -87138 10002 240148 156812 -119718 285838
11483 -73915 7336 311488 82568 3847 249387 224921 -121827 36054 271925 228654 190553
11472 190553 -382666 -38344 252314 -62587 195670 -50580 -181847 -49034 309883 -192400
11461 282676 210343 -64202 -44511 -120647 239762 124347 206882 90353 136595 214609 246633
11450 246633 254421 185798 136062 406258 -219426 224328 -40497 -195173 -17772 135173 340140
$$ packed form
11530A85358P03a67130L6959B14629c69709C05284D1833e013B20231J65960a25118
11518A52393M1265a38036H5518J57528K6837G1959J50555h5981B2540K07066B2605
11506B03066r0342P4493a9006j63257q2947A65449O2694M2924A0515K60313K40784
11495E11612A87283m5624b64025G9596M0010h7138A0002K30146q3336a19718B85838
11483g3915G336L04152H2568C847K45540k4466a21827C6054K35871m3271l8101
11472A90553c82666c8344B52314f2587A95670e0580j31267d9034C09883a92400
11461B82676p2333f4202J9691p6136B39762j15415Q2535I0353M6242P8014L2024
11450B46633P788o8623m9736K70196b19426B24328d0497j54676a7772A35173K04967
$$ plain form
11439 340140 22108 35197 -245623 -43209 70626 -300884 233997 194775 376116 -19506 -201406
11428 -201406 -13397 125601 60776 -138667 -214236 53641 70313 85497 200469 1669 -261484
11416 80177 -43083 318920 -55289 32107 257459 -248090 -244670 -65739 89887 -7261 60648
11404 -31446 -182252 136445 21740 -138539 50370 3144 -51494 295219 -52739 11156 115503
11393 115503 117455 130903 53827 101787 92148 296919 111596 123937 76492 239787 40071
11381 211257 37363 47308 237951 -167060 35593 -8788 -88413 104707 -131723 212427 -143721
11369 -87203 -34098 -100654 228709 100818 333669 228374 -111798 33592 -117399 -296219
11359 -296219 -273376 186296 -149725 -25454 -180373 195978 134365 -22322 -230 -197196 64111
$$ packed form
11439C40140B2108J3089b45623d3209G0626c00884B33997l9222J81341a9506j81900
11428b01406a3397A25601F0776a38667p5569E3641J6672J5184J14972A669b61484
11416H0177d3083C18920e5289C2107K25352b48090L420f5739H9887g261F0648
11404c1446j50806A36445B1740a38539E0370C144e1494B95219e2739A1156J04347
11393A15503J952J3448E3827M7960r639K04771A11596J2341m7445J63295D0071
11381B11257C7363R945J90643a67060C5593h788p9625A04707a31723B12427a43721
11369h7203c4098o6556B28709A00818K32851j05295a11798C3592a17399j78820
11359b96219K2843A86296a49725b5454j54919A95978o1613b2322b30j96966F4111
$$ plain form
11347 -103425 3140 272239 1265 177843 -208652 56039 -65342 67622 41202 -263485 137008
11335 -203866 -3073 175349 69656 114 -138073 -87269 257878 -185107 -269611 -161343 135076
11323 -86108 -308261 206834 -34101 -22609 -9278 -40750 -16305 163340 100500 31474 61984
11312 61984 588924 -74547 3656 34906 -141001 -92500 97115 93251 54459 -142538 -51948
11300 189076 -55995 573127 -34587 347587 -260602 27945 -302519 210507 -90726 -20657
11289 -98437 -73907 168162 -566348 9871 -119738 90428 -155910 100685 -181351 25776 79455
11278 79455 254202 -31674 -61506 43412 -63329 -189237 34476 -243576 -186565 -369887 -325952
11267 -325952 112952 41669 -26713 -319008 -231650 -26535 168357 126926 -60855 44668 9401
$$ packed form
11347a03425C140K69099A265J76578b08652E6039f5342F7622k6420b63485A37008
11335b03866c073A75349F9656A14a38073N0804B57878a85107q4504J08268A35076
11323h6108k22153B06834c4101J1492i278l1472a6305A63340o2840C1474L0510
11312F1984N26940g4547C656L1250a41001M8501I7115l864l8792a42538e1948
11300A89076e5995E73127c4587C47587b60602B7945c02519B10507i0726b0657
11289i8437K4530A68162e66348I871a19738I0428a55910A00685a81351B5776N3679
11278G9455J74747c1674k9832D3412f3329j25908C4476b43576N7011j83322M3935
11267c25952A12952D1669b6713k92295Q7358b6535A68357m1431f0855D4668I401
$$ plain form
11255 252609 -173989 58028 -255849 -128145 311122 -161751 -75727 -217606 161168 -378496
11244 -4138 20157 -115090 -386975 -10189 121243 42476 -139651 -303058 -327870 83391 -242848
11232 -238291 -88626 -71937 -85137 -111192 224618 -95531 90857 -216196 -181329 138810 -128076
11220 -116544 -175718 -75123 322559 -55371 -25410 -148202 -117947 -42428 -60557 159181 82181
11209 82181 -128407 43105 -176868 -143339 439652 271689 1699 -128963 -207218 193947 -116571
11197 147125 -249762 -68177 12002 -62376 417645 -401465 -309902 437804 -13574 -301996
11187 -301996 111444 -183917 270182 51826 -172510 105907 44441 -8022 -4167 -95880 -155765
11176 -155765 -25963 23283 -170059 158845 37278 164942 -103754 291241 -158072 -181761
$$ packed form
11255B52609a73989E8028b55849J27704C11122a61751g5727j41879A61168c78496
11244d138B0157a15090k71885a0189A21243D2476a39651j63407k4812H3391b42848
11232b38291h8626J6689j3200k6055B24618i5531I0857b16196L4867A38810a28076
11220a16544n9174g5123C22559e5371b5410j22792L0255d2428j8129A59181p7000
11209H2181a28407D3105a76868L3529D39652j67963A699a28963p8255A93947a16571
11197A47125b49762f8177A2002f2376D17645d01465R1563D37804a3574k88422
11187c01996A11444a83917B70182E1826a72510A05907D4441h022L855r1713n9885
11176a55765b5963B3283a70059A58845C7278J27664a03754B91241a58072k3689
$$ plain form
11166 -181761 -73293 101062 94846 -107958 4466 104802 -188102 -83274 -352639 -38223 -500217
11155 -500217 19940 72005 -109864 -81389 141787 273674 14938 -97981 91232 218562 -85601
11143 20762 -57466 -33728 32859 -114629 46180 -455867 117937 211697 -2886 94802 169586
11132 169586 329636 -68425 94440 -12591 -55019 -402590 -103996 148907 -20809 -299548
11122 -299548 93250 194130 -117676 292264 -111999 121527 161426 -264209 55967 -459069
11111 -106494 -68715 -99024 -193265 132564 366427 -205603 163899 194899 117906 -10398 428758
11099 327055 -42023 74493 41538 70524 115490 -134031 442138 -154776 183259 176759 76395
11087 177113 235599 57340 139436 231077 154550 78083 60879 366425 424918 353969 435309
$$ packed form
11166a81761g3293A01062o216a07958D466J00336a88102h3274k69365c8223m61994
11155e00217A9940N2065a09864K8475A41787J31887A4938i7981I1232J27330h5601
11143B0762e7466K3738C2859a14629D6180d55867A17937R3760b886I4802P4784
11132A69586J60050f8425I4440a2591m2428l47571a03996A48907b0809k78739
11122b99548I3250J00880a17676B92264a11999A21527L9899b64209E5967d59069
11111a06494L7779l0309r4241A32564K33863b05603A63899L1000p6993a0398D28758
11099C27055d2023G4493l2955K8986M4966a34031D42138a54776A83259o500G6395
11087A77113N8486E7340Q2096R1641p6527p6467j7204L05546N8493p0949Q1340
$$ plain form
11076 435309 186964 398576 364055 157913 280973 49100 68182 495894 501050 186314
11065 421884 275014 355650 349465 286373 360833 294236 665202 385596 726765 931902 646668
11054 646668 591478 512646 633979 784240 546437 655398 646405 771943 766496 268478 717671
11043 717671 672776 790995 872317 750963 788810 690193 581343 528456 329667 760875
11033 760875 605375 384969 774846 381543 837412 495462 1030694 651259 630164 596390
11023 596390 442977 725910 451994 776884 563617 435128 743978 601140 718451 790644
11013 790644 675639 411228 731597 499095 447301 671899 568152 622750 623904 224942
11002 579105 613733 430327 598319 666815 707711 903089 242308 797424 496285 623925
$$ packed form
11076D35309A86964K11612l4521A57913J23060D9100J9082M27712N156A86314
11065D21884j46870Q0636o185o3092P4460o6597L70966k79606L41169K05137k85234
11054F46668n5190p8832J21333J50261k37803J08961q993J25538n447B68478M49193
11043G17671m4895J18219Q1322j21354L7847r8617j08850n2887j98789M31208
11033G60875j55500k20406L89877C81543M55869l41950N35232l79435k1095l3774
11023E96390j53413K82933k73916L24890k13267j28489L08850j42838J17311P2193
11013G90644j15005k64411L20369k32502n1794K24598j03747N4598J154B24942
11002E79105L4628j83406J67992O8496M0896J95378B42308N55116l01139J27640
$$ plain form
10992 623925 525686 528935 790777 840295 661862 756332 1166327 1196329 766745 1319110 1206962
10981 1206962 1082557 1639674 1025898 1646967 1803874 2067994 2315921 2558691 2579993 2652349
10971 2652349 2657134 2166439 2314698 1922873 1808957 1541234 1787799 1389395 1610566 1511779
10961 1511779 1494660 1704831 1619136 1486065 1369279 1284803 1192602 902118 1164565 871636
10951 871636 754680 818881 565434 61614 408130 283074 328515 -34352 133559 156017
10941 156017 108843 81057 164562 -76994 -103814 152315 261414 -40419 313067 228836 171289
10930 171289 -84004 -194503 -33992 -120959 245047 97390 199490 -23593 362367 118786
10919 -31782 77497 218701 -51766 83760 -66275 -9285 242216 -348222 -15992 -93815 -80989
$$ packed form
10992F23925r8239L249K61842M9518j78433R4470M09995L0002m29584N52365j12148
10981A206962j24405N57117o13776O21069J56907K64120K47927K42770K1302P2356
10971B652349M785m90695J48259l91825j13916k67723K46565l98404K21171r8787
10961A511779j7119K10171q5695j33071j16786q4476r2201k90484K62447k92929
10951H71636j16956O4201k53447F1614L46516j25056M5441c4352A33559K2458
10941A56017m7174k7786Q3505g6994k6820A52315J09099d0419C13067q4231n7547
10930A71289h4004j10499c3992q6967B45047I7390J02100b3593C62367A18786
10919c1782G7497J41204e1766H3760f6275i285B42216c48222a5992p7823J2826
$$ plain form
10908 -80989 101477 338774 -96906 -231855 117167 59931 50761 -280388 148980 -36556 -100320
10897 -100320 104649 -3498 404974 -29983 -182652 -85596 247089 -82582 -225354 -103768
10886 151786 121218 -380174 421546 -87293 -155944 -28196 236046 176627 -193920 8357 34020
10875 34020 -134981 -120913 28038 52460 133244 52454 -71231 -78196 -242001 268456 -10430
10863 -83108 -86849 -179567 -176888 56005 -81849 105010 193610 -211896 -221509 98576 -86562 -271367
10851 -271367 305558 -49533 -79824 -1230 -224679 382147 72938 -14607 -153864 20780 -39315
10839 -48575 12772 -404939 241385 -74331 -75965 99832 -341790 159932 97853 -100751 92156
10827 92567 -1376 61482 184837 -9082 -204008 -237559 -130921 56393 -260689 -167011 137990
$$ packed form
10908h0989A01477K37297i6906j34949A17167n7236r170b80388A48980c6556o3764
10897a00320A04649c498D04974b9983j52669h5596B47089h2582j42772a03768
10886A51786l0568c80174D21546h7293o8651b8196B36046n9419a93920H357K5663
10875C4020a34981J4068B8038K4422Q0784E2454g1231o965j63805B68456a0430
10863h3108l741r2718K679E6005h1849A05010Q8600b11896r613I8576h6562j84805
10851b71367C05558d9533l0291a230k23449C82147G2938a4607j39257B0780c9315
10839d8575A2772d04939B41385g4331j634I9832c41790A59932o2079a00751I2156
10827I2567a376F1482J23355i082j94926l3551J06638E6393b60689R3678A37990
$$ plain form
10815 231769 -172909 -246732 -118828 95560 11638 95536 -99205 -186421 265043 -113378 203106
10803 29033 -37831 132687 52353 -197462 -181280 -44076 -199122 188126 -21604 124597 -132327
10791 -330027 -77746 -124314 -419026 177905 100563 -177964 -152344 -528905 55133 -148931
10780 -204257 -128242 -424470 -256791 282053 163918 -190189 7365 55512 35304 -416904
10769 -146206 -183158 -254924 -3425 -305575 62323 -134328 -166644 -238703 211909 -153101 -22776
10757 -30798 -315111 113308 -251404 -376646 45097 188901 -65699 -190951 -132008 3976 43553
10746 43553 93584 117822 8908 -5150 -224474 -247619 -105292 -182829 -207873 -210215 -44727 351193
10733 246068 -256634 -33850 31980 136668 -81495 -29814 17983 35607 -176232 -226622 -341201
$$ packed form
10815B31769a72909p3823a18828I5560A1638Q3898i9205q7216B65043a13378B03106
10803B9033c7831A32687E2353a97462J6182d4076j55046A88126b1604A24597a32327
10791c30027g7746m6568k94712A77905p7342a77964K5620l76561E5133a48931
10780b04257P6015k96228J67679B82053j18135a90189G365M8147k0208d16904
10769a46206l6952p1766c425l02150F2323a34328l2316p2059B11909a53101b2776
10757c0798k84313A13308b51404j25242D5097J43804f5699j25252N8943C976L9577
10746D3553N0031K4238H908e150k19324k3145a05292p7537k5044k342d4727C51193
10733B46068b56634c3850C1980J04688h1495b9814A7983J7624a76232n0390j14579
$$ plain form
10722 -341201 146850 -11224 -36285 309835 30830 -65253 -71443 -114223 -23755 334924 -423142
10710 164972 -262232 -306374 103656 218273 -415104 -114451 16638 119491 180119 45961
10699 67595 -189860 -56284 -88700 1802 -389975 79277 -278094 27437 -238220 120935 148644
10688 148644 23364 260180 -168833 -207933 11238 -154966 -326754 -164112 -221765 -400016
10678 -400016 -107470 -225116 -152427 -301365 -155702 -300402 103458 389000 91090 -48649
10667 -168730 125855 -158116 -202574 108203 64979 62844 -38068 64392 82125 -157731 -86533
10656 -86533 -39120 90449 -281607 13735 114025 -274884 1608 -31676 -55264 41389 -246712
10644 -429905 190174 -251434 65154 -438126 -16933 -157808 -58780 35961 -62012 -445729
$$ packed form
10722c41201A46850a1224k5061C09835C0830f5253o190m2780b3755C34924d23142
10710A64972b62232m4142A03656J14617d15104a14451A6638J02853O0628D5961
10699F7595a89860e6284l2416A802c89975G9277b78094B7437b38220A20935K7709
10688A48644B3364K36816a68833l9100A1238a54966j71788J62642n7653j78251
10678d00016a07470j17646P2689j48938J45663j44700A03458K85542I1090d8649
10667a68730A25855a58116m4458A08203m3224k135c8068F4392J7733a57731P1198
10656h6533c9120I0449b81607A3735J00290b74884A608c1676k3588D1389b46712
10644d29905A90174b51434F5154d38126a6933j40875e8780C5961f2012l83717
$$ plain form
10634 -445729 177736 -166553 205506 3179 -58455 -45734 92354 42064 -266429 -157451 -42497
10622 291706 -55363 45329 -77560 -79290 -166527 -30032 217212 61473 76217 45370 14191
10610 14105 158811 -130692 -275435 -54984 224765 9904 -263496 98847 153696 91315 -251632
10598 -173874 282610 325588 -51358 122800 -5699 -138512 -68345 8303 -122389 15144 122118
10587 122118 -73173 -214371 9628 -397859 182545 -176917 -131344 56541 -331823 -181274
10577 -181274 -18390 -141936 -418736 -295486 -165456 253071 287609 -576325 -227605 106
10566 -20966 -147290 279246 -35358 126877 -1679 -101910 200227 -73049 -395613 -140190
10555 63481 -196308 82672 -30790 -175518 102498 88034 250773 -32947 -317312 27834 -84209
$$ packed form
10634d45729A77736a66553B05506C179e8455J2721I2354D2064b66429J08978d2497
10622B91706e5363D5329g7560j730q7237c0032B17212F1473J4744l0847A4191
10610A4105J44706a30692j44743e4984B24765I904b63496I8847N4849o2381b51632
10598a73874B82610M2978e1358A22800e699j32813f8345H303a22389A5144J06974
10587A22118g3173j41198I628c97859A82545a76917M5573E6541c31823J50549
10577a81274a8390j23546k76800J23250J30030B53071L4538e76325b27605A06
10566b0966j26324B79246c5358A26877a679j00231B00227g3049l22564a40190
10555F3481a96308H2672c0790j44728A02498j4464J62739c2947k84365B7834h4209
$$ plain form
10543 136153 -279807 241608 44097 109377 -25972 88699 -212560 301694 -234802 -519384
10533 -519384 26566 -5146 -3082 16456 -66341 351322 -172702 -227305 233915 -295339 41851
10521 -83198 -108311 4438 -43136 -10305 -342319 141736 -102246 -144484 -34834 -133595 -2471
10509 -43039 28390 -129828 -69053 42376 -222773 261913 149370 -11365 -87479 -174575 67745
10497 -297322 -299225 -44494 170896 -115729 -83833 148178 -26269 -74943 -67711 268346 44034
10485 218399 309749 288897 235250 548655 -167834 -142633 34576 79701 213679 -178606 332737
10473 202794 -5362 -159020 -44645 65621 -64260 -308195 -38909 81237 122397 -170855 -135425
10462 -135425 57047 111479 317287 21602 114457 -47017 -221263 -240575 -33206 19629 156902
$$ packed form
10543A36153b79807B41608D4097O5280b5972H8699b12560C01694b34802k84582
10533e19384B6566e146K064A6456f6341C51322a72702n4603B33915b95339D1851
10521h3198k5113D438d3136a0305l32014A41736a02246m2238c4834r8761b471
10509d3039B8390a29828O0775D2376b22773B61913j12543a1365p6114q7096F7745
10497b97322j903d4494A70896a15729L1896A48178b6269m8674P232B68346D4034
10485B18399R1350k0852n3647L13405a67834K5201C4576M5125J33978a78606C32737
10473B02794e362j53658d4645F5621f4260k43935c8909H1237M1160a70855L5430
10462a35425E7047N4432K05808B1602R2855d7017j74246j9312c3206A9629J37273
$$ plain form
10451 156902 7151 -301739 -151172 -296911 161711 -138444 36003 247747 82291 43264
10441 43264 57477 -150513 293618 -116275 -125834 -288665 14755 -1223 421538 145876 22768
10429 -222643 -23927 -300302 232995 130107 139430 200888 91946 -35071 -79427 22651 85831
10418 85831 -123676 -209464 -47133 -124234 50745 -76995 -50511 -253519 106265 20291 -67958
10406 -179524 355 8060 -165099 -25804 23688 -143470 -134673 126946 179563 -264414 218937
10394 83005 384274 36515 -219161 265409 -261712 4263 -17035 71605 249917 61024 163999
10383 163999 158011 84929 113028 73295 326885 74644 -184387 45245 301609 200082 202246
10372 202246 223303 298072 97110 243176 660118 634946 195602 322371 414342 154683
$$ packed form
10451A56902G151c01739J50567j45739A61711a38444C6003K11744H2291l9027
10441D3264J4213a50513B93618a16275r559j62831A4755a223D21538A45876B2768
10429b22643b3927k76375B32995j02888R323O1458I1946c5071m4356B2651O3180
10418H5831a23676q5788d7133p7101E0745g6995K6484k03008A06265B0291f7958
10406a79524C55P705a65099b5804B3688a43470Q797A26946N2617b64414B18937
10394H3005L01269C6515b19161B65409b61712D263a7035G1605J78312F1024J02975
10383A63999n988p3082K8099l9733K53590G4644a84387D5245K56364j01527K164
10372B02246K1057P4769I7110J46066M16942k5172A95602J26769R1971A54683
$$ plain form
10361 206458 158198 44237 404603 382181 153073 162414 144234 554238 423704 555095 412480
10350 412480 571643 456244 206073 513238 7229 127772 237323 93927 72448 153903
10340 153903 419671 153349 109578 147330 -51849 191559 -166450 -88216 343396 257958
10330 257958 -457483 -5374 -27224 49823 184222 316384 54690 470401 282238 313732 304102
10319 304102 118793 26869 43516 -54502 -165791 -109300 212292 -30495 -96047 164588 -110896
10307 -37781 246480 104736 3984 9027 177492 -247479 -95681 -75929 23486 -22217 -140071
10296 -140071 496855 -230931 -85506 -318308 -322185 -357283 -193358 -115623 113802 -52472 85879
10284 -57645 48376 38769 -114722 49052 29403 120621 -149361 24350 -115606 -265822 56293
$$ packed form
10361B06458m8260D4237L60366k2422A53073R341j8180M10004j30534J31391j42615
10350D12480J59163j15399B06073L07165G229J20543J09551I3927k1479Q1455
10340A53903K65768A53349m3771L7752e1849A91559a66450P8234C43396q5438
10330B57958d57483e374k1850D9823J34399J32162E4690M15711j88163L1494r630
10319C04102A18793B6869J6647e4502j11289N6491B12292c0495o5552A64588a10896
10307c7781B46480A04736C984N043J68465b47479i5681J9752B3486b2217j17854
10296a40071D96855b30931h5506k32802l877l5098J63925P7735A13802e2472H5879
10284e7645D8376r607a14722D9052j9649R1218a49361B4350a15606j50216E6293
$$ plain form
10272 -172147 -48003 -169600 -36686 9620 57829 43419 -52055 326240 154236 282587 533543
10261 533543 38158 356487 44660 348410 249620 93211 180253 174429 -204236 -55884 -170365
10250 -170365 -319452 -181840 -144387 -47841 150086 345501 -192738 12410 -130138 -57682
10239 -24042 -24676 -7729 129124 -166695 -105033 341913 -82493 175848 -189225 -75845 -30992
10227 13827 -34988 38952 208753 -356147 -55547 -66841 199512 -42945 -120633 194227 210127
10216 210127 -499119 84130 -74912 -173562 -5689 -121624 -373439 -220293 29527 -208007 25579
10204 21658 -76135 -215204 -141624 38715 89103 -185510 105788 -137172 115681 88954 -245213
10192 -65243 39726 262313 -43962 13489 -213874 -31319 -173915 -271999 -145181 29013 51031
$$ packed form
10272a72147d8003j21597c6686I620M8209j4410e2055C26240A54236J28351K50956
10261E33543C8158L18329D4660L03750r8790I3211Q7042n824b04236e5884j14481
10250a70365j49087J37612L7453d7841A50086J95415a92738A2410a30138e7682
10239b4042o34g729A29124a66695O1662C41913h2493A75848a89225g5845c0992
10227A3827c4988C8952J69801c56147e5547j1294A99512d2945p7688A94227J5900
10216B10127d99119H4130g4912r8650e689j15935k51815J53146B9527b08007B5579
10204B1658g6135j39069P3580C8715N0388a85510A05788a37172A15681k6727b45213
10192f5243C9726K22587d3962A3489b13874c1319j42596r8084J26818B9013K2018
$$ plain form
10181 51031 -101226 -234195 118877 -213514 313283 87643 -140752 -113517 21197 -284849
10170 149789 -170815 121937 -61262 -3876 58640 171963 -74495 51128 -391497 -103033 -24932
10158 -119938 -530 -29251 -105765 -88797 75486 -238292 -19726 -176177 -188002 -132565 -279296
10147 -279296 -296775 -70783 234990 77636 -165422 -113296 -17382 82708 -110167 414 299928
10136 299928 129576 188071 4346 -101966 -426139 -174621 -30446 131213 -196646 -388071
10126 -388071 -75634 -95267 -158218 4459 -71422 -53993 28055 -161910 -178816 287033 -46539
10114 -366484 -28402 54404 82309 233580 -82281 -52585 -156853 -133958 12582 150339 -163784
10102 -358128 -69817 22885 -349689 -185829 -77939 -199056 114033 322802 95184 189086
$$ packed form
10181E1031a01226j32969A18877b13514C13283H7643a40752K7235B1197b84849
10170A49789a70815A21937f1262c876E8640J13323g4495E1128c91497a03033b4932
10158a19938e30k8721p6514J6968G5486b38292a9726j56451j1825N5437j46731
10147b79296j7479g0783B34990G7636a65422N2126a7382H2708a10167D14K99514
10136B99928A29576N8495D346a01966l24173a74621c0446A31213a96646j91425
10126c88071g5634j9633o2951D459g1422J7429B8055a61910j6906B87033d6539
10114c66484b8402E4404K7905J51271h2281K9696j04268K2895A2582J37757a63784
10102c58128f9817B2885c49689J63860g7939j21117A14033K08769I5184R3902
$$ plain form
10092 189086 133521 -106833 -74649 -47680 -227578 -177099 150778 -21872 8092 -117843 -220379
10081 -220379 -84544 -164741 1042 131386 27269 -22617 -270245 124609 -26670 390251 -39502
10069 -173831 -53757 -172283 95239 -236595 431875 -6764 374166 -176027 65926 -31311 -149234
10058 -149234 -94160 103655 -355789 86815 -65194 79165 -170638 146876 -118351 348894
10047 -206095 -203613 -6354 91210 20539 -189816 308809 -250426 -23367 398427 -261954 -183034
10036 -183034 25063 -145480 266003 -49671 42701 129284 -57821 181515 186550 -177173 102219
10024 141864 288970 27657 -228078 -8156 -226737 136394 36330 -193355 203985 -106978
10013 -35618 -19477 -304390 -392669 -385114 479325 -100261 -79851 -90042 72542 14644 -61605
$$ packed form
10092A89086n5565a06833L2184K6969j79898N0479A50778b1872H092a17843j02536
10081b20379h4544q0197A042J30344B7269b2617k47628A24609b6670C90251c9502
10069a73831e3757j18526I5239b36595D31875f764C74166a76027F5926c1311j17923
10058a49234N5074A03655c55789H6815f5194G9165a70638A46876a18351C48894
10047b06095K482f354I1210B0539a89816C08809b50426b3367C98427b61954P8920
10036a83034B5063a45480B66003d9671D2701Q6583e7821A81515N035a77173A02219
10024A41864J47106B7657b28078h156k18581A36394C6330a93355B03985a06978
10013c5618J6141k84913q8279P555D79325a00261K0410j0191G2542A4644f1605
$$ plain form
10001 80855 -116486 14250 68041 -9102 -125048 -78432 274957 121274 -55317 -143780 -86524
9990 -86524 -83446 200860 -227919 7544 -85936 -56655 -177484 82502 97448 -256929 -701 -364817
9978 -364817 -203536 -19835 -125352 2773 -26959 56745 -410 -273379 -102558 -317354 -178803
9967 -178803 -284095 -27798 -212989 153079 -294256 -83938 -20576 221781 -118042 -282127
9957 -282127 -68992 49550 -136034 -89504 -250971 176086 -201102 -232108 -179993 -98918 206718
9945 61731 -220296 82309 -89540 -56443 -377294 -28788 132437 -103632 -342106 -364390 -154744
9933 -295196 44190 17625 256641 -179041 -382092 -163447 49861 366624 -127182 -45554
9922 -230610 -335058 -30177 -77933 -421652 51077 -181011 -152049 382244 -350687 -82277 -176758
$$ packed form
10001H0855a16486A4250N3791i102j15946M6616B74957A21274e5317q8463N7256
9990h6524L078B00860b27919G544h5936K9281j20829H2502J4946b56929g01l64116
9978c64817J61281a9835j05517B773b6959E6745d10k72969a02558k14796J38551
9967a78803j05292b7798j85191A53079b94256h3938b0576B21781a18042j64085
9957b82127f8992D9550a36034M6530j61467A76086b01102l1006N2115Q1075B06718
9945F1731b20296H2309h9540L3097l20851b8788A32437a03632k38474k2284a54744
9933b95196D4190A7625K39016a79041k03051a63447D9861L16763a27182d5554
9922b30610j04448c0177m7756l43719E1077a81011K8962C82244c50687h2277r4481
$$ plain form
9911 -176758 95932 -85187 69536 136790 53692 -267513 165429 -138666 -92888 -255812 105341
9899 -136239 -305368 -100313 -132587 60100 -292507 -168462 -252227 -344978 -63286 -27433 26681
9887 -365616 206711 272016 83364 -188864 -137433 42715 54705 -225739 -2688 -80442 34733
9875 17068 -93897 -116658 48333 -139317 -146170 -142916 183581 -171064 -228346 175890 -265739
9863 -4581 96185 11393 112177 41022 -329533 -73647 113235 -295819 -100031 -231136 29140
9851 -197489 -93258 -194052 -96188 -130983 -152735 -150624 -222097 -263062 -29503 -196442 95215
9839 103851 74675 -106442 -35765 -202929 34049 -133069 -117730 -426119 -90540 -116495 -24085
9827 -91274 -164592 -141988 70153 -414152 219401 -228379 111468 20522 43593 62360 -60841
$$ packed form
9911a76758I5932h5187F9536O7254E3692b67513A65429a38666M5778j62924A05341
9899a36239j69129a00313l2274F0100b92507J24045q3765r2751f3286b7433B6681
9887c65616B06711O5305H3364a88864N1431D2715J1990b25739b688p7754C4733
9875A7068i3897k2761D8333a39317o853L254A83581a71064n7282A75890b65739
9863d581I6185A1393J00784D1022c29533g3647A13235b95819a00031j31105B9140
9851a97489i3258j00794i6188l4795k1752K111p1473m0965b9503j66939I5215
9839A03851k9176a06442c5765j67164C4049a33069J5339l08389i0540k5955b4085
9827i1274p3318K2604G0153d14152B19401b28379A11468B0522K3071J8767f0841
$$ plain form
9815 155273 -187176 -124684 -26275 -110736 -210787 113371 98902 -163746 -134313 -34931 -45067
9804 -45067 14599 104525 271889 125765 92632 202592 -264939 -84151 -207355 -316145 33375
9792 -68100 215156 -256086 -108767 58095 -143635 275148 232859 271180 -348156 249219
9781 78439 -68378 -41188 -292127 -239182 266586 -136892 -264674 -62611 -170579 -112181 14966
9769 39119 7991 -218243 -20223 78607 106931 -205908 80919 247092 -39581 -173336 10678
9757 -114808 -178150 -222189 84049 -13836 139659 -481849 100755 -268428 -76304 -97091 130349
9745 -339406 238506 129864 -450885 -149216 -169842 -505136 110404 -202428 57009 -40188
9734 -61959 -229483 -81078 -99376 112890 -307009 -310585 -90423 -302530 -55631 -154561 133340
$$ packed form
9815A55273a87176O2492b6275q4461j00051A13371j4469a63746K9433c4931j0136
9804d5067A4599Q9926J67364A25765l3133J09960b64939h4151j23204j08790C3375
9792f8100B15156b56086a08767E8095a43635B75148m2289L8321c48156B49219
9781G8439f8378K7190k50939N2945B66586a36892j27782f2611j07968N8398A4966
9769C9119G991b18243b0223G8607K8324b05908H0919J66173c9581j33755A0678
9757a14808o3342m4039H4049a3836A39659d81849A00755b68428g6304k0787A30349
9745c39406B38506j08642d50885a49216k0626l35294A10404b02428E7009d0188
9734f1959j67524h1078j8298A12890c07009l576i0423k12107e5631r8930A33340
$$ plain form
9722 -19728 -73904 -41481 -234092 338918 24652 21595 56873 57914 -52723 -264317 19331 102856
9710 102856 -86234 -45747 -205211 -116173 -94991 104250 43906 -74 120705 -194237 -295995
9699 -295995 -85873 -16859 4492 148164 23586 -273706 -106944 -63847 -221103 -242756 19993
9687 -218660 -259897 -293442 173071 179852 -293431 85351 -251595 195990 -113540 -182434 422857
9675 97084 -191114 49813 15475 -124879 -172179 42270 -295303 58965 -227397 -78016 70333
9663 118472 -3954 63398 -409843 -347223 -244929 350975 -212059 -62961 -91424 140353 -193209
9651 59916 128199 -77296 -93842 -188425 114207 2732 41958 -2866 -105506 -53414 158825 -16301
9638 -53863 59788 -276274 299088 -278815 -190233 -90301 32756 30370 -238263 269871 -114349
$$ packed form
9722a9728n4176L2423j92611C38918B4652l057L5278J041e2723k11594A9331Q3525
9710A02856h6234M0487j59464Q9038K1182A04250D3906g4A20705a94237j01758
9699b95995h5873a6859D492J43672B3586b73706a06944M3097j57256k1653A9993
9687b18660m1237l3545A73071O781b93431H5351b51595A95990a13540o8894D22857
9675I7084a91114D9813A5475a24879m7300D2270b95303E8965b27397g8016G0333
9663A18472c954F3398d09843O2620J02294C50975b12059f2961k8463A40353a93209
9651E9916O8283g7296j6546r4583A14207B732L9226b866j02640N2092A58825a6301
9638e3863E9788b76274B99088b78815Q8582i0301C2756k386b38263B69871a14349
$$ plain form
9626 51166 -82751 -397521 -134759 222497 12839 -77484 -260178 -149544 98517 134039 40753
9614 -150278 116552 -156825 -86617 34176 -86081 -1509 -226336 36410 -247352 -103782 -266880
9603 -266880 31944 10189 -93528 -177385 -33128 -141643 -146677 2301 -138314 47800 -126654
9591 -89094 -202773 -111117 -37417 -390207 27080 -244530 30852 -398475 -70053 -106097 -343971
9580 -343971 29352 120683 -193801 -20421 -303505 -74936 148670 -78805 196359 -98047 71028
9568 -33886 79627 -35183 44977 146657 -264420 60836 3667 -93691 29794 71625 -151170
9556 -271651 -129260 -396296 -78203 45436 -91125 94206 168582 -396579 -92967 -295509 -42244
9544 -68876 -107396 -6416 -171905 -204058 -16431 -128035 -132016 91719 -278931 -116163 149123
$$ packed form
9626E1166h2751l14770a34759B22497A2839g7484j82694J10634I8517L5522D0753
9614a50278A16552a56825P0208C4176h6081a509k24827C6410b47352a03782j63098
9603b66880C1944A0189i3528q3857c3128j08515n034B301a38314D7800a26654
9591h9094j13679R1656c7417l52790B7080b44530C0852c98475g0053l6044k37874
9580c43971B9352R1331a93801b0421k83084g4936A48670g8805A96359i8047G1028
9568c3886G9627c5183D4977J01680b64420F0836C667i3691B9794M1831a51170
9556b71651a29260k67036g8203D5436i1125I4206P4376c96579i2967k02542d2244
9544f8876l8520f416j65489l2153a6431j11604l981I1719b78931a16163A49123
$$ plain form
9532 -224799 -140182 -1223 -242332 69706 -135648 -450322 -86182 -157221 -9849 -81613 129456
9520 248192 -103367 -7538 15487 42190 69326 -218321 -160719 -109069 -30460 -114844 -32253
9508 -87480 -14609 -42501 -107908 138436 -241550 44554 -454835 -36103 55460 -168171 -51757
9496 -207380 -206349 -36857 -2973 -38835 -168171 -59930 228922 -307974 148318 -42380 -212935
9485 -212935 73762 58022 -275947 -44363 -73559 -236303 6107 171455 50885 -159371 -73487
9473 -197681 102023 -383630 69808 -125726 -248751 -150383 274009 -244520 -62553 93251
9462 -306060 -250829 -282086 112963 -74890 -167427 49163 -58215 -195682 25005 44563 93932
9451 93932 -206834 -195055 -56437 -299959 -343861 -268705 -194824 -214750 -75870 114272 -87684
$$ packed form
9532b24799Q4617a223k41109F9706a35648l14674h6182p1039i849p1764A29456
9520B48192a03367g538A5487K6703K7136b18321N7602N1650c0460q4384c2253
9508h7480a4609k7892o5407A38436b41550D4554d54835c6103E5460a68171e1757
9496b07380J031c6857b973l5862j29336e9930B28922c07974A48318d2380j70555
9485b12935G3762j5740b75947d4363k9196j62744F107J65348E0885a59371g3487
9473a97681A02023c83630F9808a25726j23025R8368B74009b44520f2553I3251
9462c06060N5231l1257A12963g4890r2537D9163e8215j37467B5005J9558M9369
9451I3932b06834J1779e6437k43522m3902P5156P3881j9926g5870A14272h7684
$$ plain form
9439 -367093 -245272 9055 12692 48090 43722 -220293 229776 -147212 15839 26983 87472
9428 87472 294559 -112103 118939 -319892 -340144 -4624 266319 15681 368674 109909 -152277
9416 -192844 -318602 -27019 -287448 -141927 -3068 -185661 130426 -138047 98221 -145587
9405 61888 -195540 94568 -89857 26237 -94417 -90754 207697 -76236 241742 -139977 -81019
9394 -81019 -108753 103856 -147094 -29922 -111482 -100820 92167 24135 -160310 120 -146996
9382 -341602 -165395 74496 213696 -12934 -110950 185801 -24799 -14772 -49674 -295086 -125467
9370 -31058 196705 45527 377745 -27242 18101 160189 749 60269 -252564 48437 -210660
9358 135450 -349872 147060 -70306 69723 14042 -203867 -85822 -76886 -134135 -299394 -104582
$$ packed form
9439c67093J21821I055L637L5398m368b20293B29776a47212A5839J1144O0489
9428H7472K07087a12103A18939c19892k0252d624B66319A5681L52993A09909a52277
9416a92844j25758b7019k60429a41927c068j82593A30426a38047I8221a45587
9405F1888a95540I4568h9857B6237i4417L663B07697g6236B41742a39977N8958
9394h1019k7734A03856a47094b9922q1560J0662I2167B4135a60310A20a46996
9382c41602a65395G4496J39200a2934r8016A85801b4799J0027l4902k45412a25467
9370c1058A96705D5527L32218b7242A8101J42088G49N9520b52564D8437b10660
9358A35450c49872A47060g0306F9723A4042b03867h5822Q936n7249j65259a04582
$$ plain form
9346 196860 42878 -229063 -126518 -254637 -82858 255687 159845 256976 46976 204390 -159039
9334 182792 -68758 -4521 58665 -4886 213862 34305 -44652 -34774 -97546 -163575 -84719 135954
9321 -284804 -237293 -79981 -61273 173621 -49500 -43967 -71168 16875 -379286 166440 -151841
9309 -247561 -234442 -15609 -153077 145898 178666 -97016 -441863 12246 -246011 195862 101488
9298 101488 -138756 230621 -328944 47 217359 39595 -204911 -84330 -28464 224946 71178
9286 7342 -155236 198838 29142 -204715 35937 90276 55750 41517 -235602 -240803 -217992
9275 -217992 132298 161658 -172519 -124648 163393 -118866 -73607 -10211 -128562 -355918
9265 -355918 -144853 -129519 -35864 -226163 63325 64236 106459 -94253 -99258 -57464 81995 -6474
$$ packed form
9346A96860D2878b29063J02545j28119h2858B55687r5842R7131D6976J57414a59039
9334A82792f8758d521E8665d886B13862C4305d4652R878o2772o6029P8856A35954
9321b84804M7511g9981J8708A73621d9500N533k7201A6875c79286A66440a51841
9309b47561J3119a5609j37468A45898L2768i7016l44847A2246b46011A95862r4374
9298A01488a38756B30621c28944D7K17312C9595b04911h4330b8464B24946G1178
9286G342a55236A98838B9142b04715C5937N4339l4526j4233b35602n201K2811
9275b17992A32298K9360a72519M7871A63393a18866M5259a0211j18351k27356
9265c55918a44853J5334c5864j90299F3325R11M2223i4253n005M1794H1995f474
$$ plain form
9252 139060 -87343 -236047 220597 -246875 -277145 -323797 53526 -24876 -329247 -278140 -311734
9241 -311734 -286261 -47067 -326159 892 -112600 -147583 -175803 6746 -112387 -14740 -211689
9230 -211689 -407128 82985 26557 178390 -214203 -85571 49920 117076 124462 -168822 -125286
9219 -125286 1954 59999 -113566 223854 -93120 -173177 236321 31359 -251584 -122803 -171608
9208 -171608 -71368 -215038 -97096 -169208 -246871 -291530 -3052 135978 -2206 -365198 -347640
9197 -347640 343697 -236354 -62764 263584 -72064 -16430 -20064 -109812 -56797 55777 125025
9186 125025 -66534 -331586 -236967 38528 -262918 157038 -198188 21204 16990 -185645 -81283
9174 -117509 102236 -85744 23249 165286 -90379 -62877 40742 326356 141175 -233719 -63758
$$ packed form
9252A39060h7343j48704B20597b46875l0270m6652E3526b4876l04371N1107l3594
9241c11734K5473d7067k79092H92a12600l4983k8220F746a12387a4740j96949
9230b11689j95439H2985B6557J51833b14203h5571D9920O7156P386a68822M3536
9219a25286A954N8045a13566B23854i3120q0057B36321C1359b51584a22803m8805
9208a71608g1368j43670i7096p2112p7663m4659c052A35978b206l62992J7558
9197c47640C43697b36354f2764B63584g2064a6430l634q9748N3015E5777O9248
9186A25025f6534k65052R4619C8528b62918A57038a98188B1204m214a85645h1283
9174a17509A02236h5744B3249J42037i0379K7502D0742K85614A41175b33719f3758
$$ plain form
9162 -43843 106431 73598 -41401 184360 -193460 -69283 59514 -39895 -393537 -165967 -279659
9151 -279659 -223187 -191402 -327907 68578 3318 19484 282889 -286266 -58540 -177033 -283673
9140 -283673 -309832 -226546 -204775 -284374 -16548 277388 -40738 -14296 -283896 -38445 188759
9128 238436 -156889 36116 1561 -312603 17682 -234169 -57369 -65184 -52036 -22813 248545
9116 65624 -49150 106005 -186593 -156434 -375232 -56805 162441 26646 -186417 114079 -98320
9104 -238272 118171 208218 -98497 9291 -54898 -242563 -65845 195713 -110304 101932 225195
9093 225195 -100549 -168179 -176975 -268436 -6146 -134781 -315509 -18970 -222941 -337610 -23800
9081 -46501 -93613 9898 173192 177757 -196516 84373 -181531 -158359 148402 240862 -338762
$$ packed form
9162d3843A06431l2833d1401A84360a93460f9283E9514c9895l53642a65967j13692
9151b79659N6472L1785j36505F8578C318J6166K63405b86266e8540j18493j06640
9140b83673k6159Q3286K1771p9599a6548B77388d0738a4296k69600c8445A88759
9128B38436a56889C6116A561c12603A7682b34169e7369p815J3148b2813B48545
9116F5624d9150A06005a86593L0159k18798e6805A62441B6646a86417A14079i8320
9104b38272A18171R0047i8497I291e4898j87665f5845A95713a10304A01932J23263
9093B25195a00549o7630q796r1461f146j28635j80728a8970k03971j14669b3800
9081d6501m7112I898J63294M565a96516H4373a81531K3172A48402R2460c38762
$$ plain form
9069 -204466 -79552 -189509 148368 15656 -14160 -183572 -175598 -97553 -4863 -266646 241131
9057 -202549 -275902 -295745 -217756 -31726 -460691 10500 -231305 -113523 -110895 125917 195927
9046 195927 100461 -328315 68454 -210243 245313 125141 38981 76075 226347 267083 -2083
9034 -79853 -120333 -228507 -227958 228693 -84585 -176739 -337431 -446536 53458 -254378 160226
9022 -92012 -96283 -61633 -312404 297413 312954 154188 -130478 -160871 72503 61178 111459
9011 111459 -253037 -179575 171746 14617 -162374 256892 -173538 106353 -180139 -208343
9001 -208343 -12741 240641 -2037 65264 -84703 352375 -54793 45644 309878 -164264 138392
8989 -32805 11094 -120764 -130131 -48221 113849 91747 184393 -259506 62655 120370 333465
$$ packed form
9069b04466g9552j09957A48368A5656a4160j69412P974P8045d863k61783B41131
9057b02549p3353j9843P7989c1726m28965A0500b31305a13523K628A25917P0010
9046A95927r5466c28315F8454b10243B45313j20172C8981L7094J50272M0736b083
9034g9853m0480j08174N49B28693h4585r2154j60692j09105E3458b54378A60226
9022i2012m271L4650k50771B97413J5541A54188a30478l0393G2503j1325N0281
9011A11459b53037P3462A71746A4617a62374B56892a73538A06353a80139k8204
9001b08343a2741B40641b037F5264h4703C52375e4793D5644K64234a64264A38392
8989c2805A1094a20764r367d8221A13849k2102R2646b59506F2655N7715K13095
$$ plain form
8978 333465 31130 -58820 -20063 -36895 -201943 -529143 -73856 134916 -213491 147742 -85950
8966 256001 -108564 -14887 -518908 -223363 -4688 61750 29104 -15795 -103784 104543 -199377
8954 -207550 345565 170544 -277639 -296149 -97756 -334643 9620 -65555 254869 -237434 -191051
8943 -191051 149651 -222576 -281856 62151 -156871 -119126 -116306 -137405 -141053 -208363 92800
8931 -57587 63850 -217411 -265290 23475 -196052 -222614 156234 288155 434168 797508 115107
8919 54909 -34260 145287 49865 77379 -8698 -19433 67490 -108326 192994 161485 370641
8908 370641 -123426 227142 -37332 -28881 61729 -13151 -123406 -147583 -216189 139394 8135
8896 48605 -206966 202008 -157030 17955 -155175 -95919 19553 186348 -119713 36696 -79051
$$ packed form
8978C33465C1130e8820b0063j6832j65048l27200g3856A34916b13491A47742h5950
8966B56001a08564a4887n04021b23363d688F1750B9104a5795q7989A04543a99377
8954b07550C45565A70544b77639j8510i7756k36887I620f5555B54869b37434M6383
8943a91051A49651b22576n9280F2151a56871L7745K820k1099l648o7310I2800
8931e7587F3850b17411m7879B3475a96052k6562A56234J31921J46013L63340A15107
8919E4909c4260A45287D9865K7514h698j0735F7490a08326A92994l1509K09156
8908C70641a23426B27142c7332Q451F1729a3151j10255k4177o8606A39394H135
8896D8605b06966B02008a57030A7955a55175N9256A9553J66795a19713C6696g9051
$$ plain form
8884 199066 -261356 160438 -102071 13904 16710 -132985 -80286 -47309 -7356 -101379 -157650
8873 -157650 4297 -127790 -142219 -187027 -28612 211453 13931 -214909 -81503 -112646 -157204
8862 -157204 95062 195336 -28572 -247464 -340202 -237884 -50945 247249 -178325 -260209 -176744
8851 -176744 -63069 -468914 163376 -155461 -12197 -182185 119402 21787 14897 33654 97827
$$ packed form
8884A99066b61356A60438a02071A3904K806a32985N2699L2977g356r4023n6271
8873a57650D297a27790j4429m4808b8612B11453A3931b14909h1503l1143m4558
8862a57204I5062J00274b8572k18892r2738J02318e0945B47249a78325q1884Q3465
8851a76744f3069m05845A63376a55461a2197j69988A19402B1787o890J8757O4173
$$ [...]
##END NTUPLES=NMR SPECTRUM
##END=
