##TITLE=NES1090_ptc150_9886874_9Uv5KqM2iO
##JCAMPDX= 6.0         $$ Bruker NMR JCAMP-DX V2.0
##DATA TYPE= NMR SPECTRUM
##DATA CLASS= NTUPLES
##ORIGIN= BRUKER
##OWNER= Administrator
$$ 1.72 TOPSPIN		Version 2.1
$$ 2016-08-28 20:36:39.445 -0500  Administrator@X
$$ Compression mode = diff/dup
##.OBSERVE FREQUENCY= 400.02188249412
##.OBSERVE NUCLEUS= ^1H
##.ACQUISITION MODE= SIMULTANEOUS (DQD)
##.ACQUISITION SCHEME= undefined
##.AVERAGES= 64
##.DIGITISER RES= 22
##SPECTROMETER/DATA SYSTEM= spect
##.PULSE SEQUENCE= noesygpps1d.comp
##.SOLVENT NAME= COFFEE_meoh
##.SHIFT REFERENCE= INTERNAL, COFFEE_meoh, 1, 14.96021
##AUDIT TRAIL= $$ (NUMBER, WHEN, WHO, WHERE, PROCESS, VERSION, WHAT)
$$ ##TITLE= Audit trail, TOPSPIN		Version 2.1
$$ ##JCAMPDX= 5.01
$$ ##ORIGIN= Bruker BioSpin GmbH
$$ ##OWNER= Administrator
$$ $$ E:\/data/COFFEE/nmr/NES1090_ptc150_9886874_9Uv5KqM2iO/12/pdata/1/auditp.txt
$$ ##AUDIT TRAIL=  $$ (NUMBER, WHEN, WHO, WHERE, PROCESS, VERSION, WHAT)
(   1,<2016-08-28 20:36:34.304 -0500>,<Administrator>,<X>,<go>,<TOPSPIN 2.1>,
      <created by zg
	started at 2016-08-28 20:25:04.179 -0500,
	POWCHK enabled, PULCHK disabled,
       configuration hash MD5:
       21 0F 79 D6 B3 7B B4 F6 88 20 88 DB 03 48 BD 9F
       data hash MD5: 64K
       76 20 6E BE 4E 92 89 70 F4 98 A8 16 D7 56 24 A7>)
(   2,<2016-08-28 20:36:37.398 -0500>,<Administrator>,<X>,<proc1d>,<TOPSPIN 2.1>,
      <Start of raw data processing
       efp LB = 0.3 FT_mod = 6 PKNL = 1 PHC0 = 0 PHC1 = 0 SI = 128K 
       data hash MD5: 128K
       03 C0 C3 0D 06 6B 74 FF 57 66 3B 80 EB 04 AB BC>)
(   3,<2016-08-28 20:36:38.273 -0500>,<Administrator>,<X>,<proc1d>,<TOPSPIN 2.1>,
      <pk PHC0 = -85.72083 PHC1 = 0 
       data hash MD5: 128K
       73 A1 C6 E0 8A 6C 14 5F 77 F1 AB 2B 99 2A E2 B0>)
(   4,<2016-08-28 20:36:38.648 -0500>,<Administrator>,<X>,<proc1d>,<TOPSPIN 2.1>,
      <abs ABSG = 1 
       data hash MD5: 128K
       50 E7 15 BD DE 5C C9 6B C1 38 5E E1 DE 00 5E 04>)
(   5,<2016-08-28 20:36:38.742 -0500>,<Administrator>,<X>,<proc1d>,<TOPSPIN 2.1>,
      <abs ABSG = 2 
       data hash MD5: 128K
       87 42 E7 16 FB 3E 21 6A 04 60 C9 56 A7 A4 3E EB>)
(   6,<2016-08-28 20:36:38.820 -0500>,<Administrator>,<X>,<proc1d>,<TOPSPIN 2.1>,
      <abs ABSG = 3 
       data hash MD5: 128K
       2B 71 75 0E 24 39 17 EB B1 46 C9 55 90 18 28 D0>)
(   7,<2016-08-28 20:36:38.914 -0500>,<Administrator>,<X>,<proc1d>,<TOPSPIN 2.1>,
      <abs ABSG = 4 
       data hash MD5: 128K
       A1 60 38 FD 4E 61 3B F1 AB 10 38 8B A1 F5 7D 4E>)
(   8,<2016-08-28 20:36:38.992 -0500>,<Administrator>,<X>,<proc1d>,<TOPSPIN 2.1>,
      <abs ABSG = 5 
       data hash MD5: 128K
       CB D9 8E C9 7A 47 31 99 01 80 E5 ED 89 FA AD 9C>)
$$ ##END=
$$ 
$$ $$ hash MD5
$$ $$ 3C 02 89 3E 8D 1C 95 8E 1D A4 5F FA 9B DE 66 DD
##$RELAX= 
##$RELAX= 
##$RELAX= 
##$RELAX= 
##$RELAX= 
##$RELAX= 
##$RELAX= 
##$RELAX= 
$$ Bruker specific parameters
$$ --------------------------
##$DU= <E:\>
##$EXPNO= 12
$$ [...]
##$TP07= 0
##$TPNAME0= <>
##$TPNAME1= <>
##$TPNAME2= <>
##$TPNAME3= <>
##$TPNAME4= <>
##$TPNAME5= <>
##$TPNAME6= <>
##$TPNAME7= <>
##$TPOAL= (0..7)
0.5 0.5 0.5 0.5 0.5 0.5 0.5 0.5
##$TPOFFS= (0..7)
0 0 0 0 0 0 0 0
##$TUNHIN= 0
##$TUNHOUT= 0
##$TUNXOUT= 0
##$USERA1= <user>
##$USERA2= <user>
##$USERA3= <user>
##$USERA4= <user>
##$USERA5= <user>
##$V9= 5
##$VALIST= <valist>
##$VCLIST= <CCCCCCCCCCCCCCC>
##$VD= 0
##$VDLIST= <DDDDDDDDDDDDDDD>
##$VPLIST= <PPPPPPPPPPPPPPP>
##$VTLIST= <TTTTTTTTTTTTTTT>
##$WBST= 2048
##$WBSW= 25
##$XGAIN= (0..3)
0 0 0 0
##$XL= 0
##$YL= 0
##$YMAX_a= 5961319
##$YMIN_a= -10325133
##$ZGOPTNS= <>
##$ZL1= 120
##$ZL2= 120
##$ZL3= 120
##$ZL4= 120
##$ABSF1= 14.96021
##$ABSF2= -5.597972
##$ABSG= 5
##$ABSL= 3
##$ALPHA= 0
##$AQORDER= 0
##$ASSFAC= 0
##$ASSFACI= 0
##$ASSFACX= 0
##$ASSWID= 0
##$AUNMP= <proc_prof1d_extract.lims>
##$AXLEFT= 0
##$AXNAME= <>
##$AXNUC= <1H>
##$AXRIGHT= 0
##$AXTYPE= 0
##$AXUNIT= <>
##$AZFE= 0.1
##$AZFW= 0.1
##$BCFW= 0
##$BC_mod= 0
##$BYTORDP= 0
##$COROFFS= 0
##$CY= 15
##$DATMOD= 1
##$DC= 0
##$DFILT= <>
##$DTYPP= 0
##$F1P= 0
##$F2P= 0
##$FCOR= 0.5
##$FTSIZE= 131072
##$FT_mod= 6
##$GAMMA= 0
##$GB= 0
##$INTBC= 1
##$INTSCL= 1
##$ISEN= 128
##$LB= 0.3
##$LEV0= 0
##$LPBIN= 0
##$MAXI= 10000
##$MC2= 0
##$MEAN= 0
##$ME_mod= 0
##$MI= 0
##$NCOEF= 0
##$NC_proc= -2
##$NLEV= 6
##$NOISF1= 0
##$NOISF2= 0
##$NSP= 0
##$NTH_PI= 0
##$NZP= 0
##$OFFSET= 14.96021
##$PC= 1
##$PHC0= -85.72083
##$PHC1= 0
##$PH_mod= 1
##$PKNL= yes
##$PPARMOD= 0
##$PPDIAG= 0
##$PPIPTYP= 0
##$PPMPNUM= 2147483647
##$PPRESOL= 1
##$PSCAL= 4
##$PSIGN= 0
##$PYNMP= <proc.py>
##$REVERSE= no
##$SF= 400.020009954854
##$SI= 131072
##$SIGF1= 0
##$SIGF2= 0
##$SINO= 400
##$SIOLD= 131072
##$SPECTYP= <>
##$SREGLST= <1H.CDCl3>
##$SSB= 0
##$STSI= 131072
##$STSR= 0
##$SW_p= 8223.68421052631
##$SYMM= 0
##$S_DEV= 0
##$TDeff= 65536
##$TDoff= 0
##$TI= <>
##$TILT= no
##$TM1= 0
##$TM2= 0
##$TOPLEV= 0
##$USERP1= <user>
##$USERP2= <user>
##$USERP3= <user>
##$USERP4= <user>
##$USERP5= <user>
##$WDW= 1
##$XDIM= 131072
##$YMAX_p= 340563451
##$YMIN_p= -13169
##$CURPLOT= <Network HP LaserJet P1505>
##$CURPRIN= <$Network HP LaserJet P1505>
##$DFORMAT= <normdp>
##$LAYOUT= <+/1D_H.xwp>
##$LFORMAT= <normlp>
##$PFORMAT= <normpl>
##$SURQMSG= 1
$$ End of Bruker specific parameters
$$ ---------------------------------
##NTUPLES= NMR SPECTRUM
##VAR_NAME=  FREQUENCY,     SPECTRUM/REAL,   SPECTRUM/IMAG
##SYMBOL=    X,             R,               I
##VAR_TYPE=  INDEPENDENT,   DEPENDENT,       DEPENDENT
##VAR_FORM=  AFFN,          ASDF,            ASDF
##VAR_DIM=   131072,        131072,          131072
##UNITS=     HZ,            ARBITRARY UNITS, ARBITRARY UNITS
##FACTOR=    0.0627417313425164, 1,          1
##FIRST=     8223.62146879497, 3188,         -49839
##LAST=      0,             4706,            -49340
##MIN=       0,             -13169,          0
##MAX=       8223.62146879497, 340563451,    0
$$ Real data points
##PAGE= N=1
##DATA TABLE= (X++(R..R)), XYDATA
$$ [...]
61873D26000o468o663p378p310o099m629l794l472k942j884n75P21K058L448M711
61858C85724N957P869J0969J4743J8029K0411K2674K5542K8494L0389L1064L1529
61846F33394L2407L2917L1863K9222K6058K2908J9065J3711P265J015m305q915
61834H36605j3023j6138j7593j7315j5634j2672q426l287J996O911J1367J5237
61822G68028J8007J9063J8115J5265J0917N627n6n759j1269j6477k1407k6139
61810G73915l0395l3456l4827l4824l4067l2604l0135k7052k4423k2739k1413
61799D47980j9847j8267j6965j5460j3202j0704q967q069p154n905n037n141n764
61786C07498o043n706n045m336l738l451l526l668l517l103k713k481k321k152
$$ plain form
61873 426000 419532 412869 405491 398181 392082 387453 383659 380187 377245 375361 374786 375507 377565 381013 385724
61858 385724 391681 399550 410519 425262 443291 463702 486376 511918 540412 570801 601865 633394
61846 633394 665801 698718 730581 759803 785861 808769 827834 841545 848810 849825 845520 836605
61834 836605 823582 807444 789851 772536 756902 744230 735804 732517 734513 741424 752791 768028
61822 768028 786035 805098 823213 838478 849395 855022 854966 849207 837938 821461 800054 773915
61810 773915 743520 710064 675237 640413 606346 573742 543607 516555 492132 469393 447980
61799 447980 428133 409866 392901 377441 364239 353535 344568 336499 329345 323440 318403 313262 307498
61786 307498 301455 295749 290704 286368 282630 279179 275653 271985 268468 265365 262652 260171 257850 255698
61772B55698j987j801j554j311j223j279j258q95j72O25J152J323J295J140P27
61757B50480N8m80m66PM62O48P33R20J202J508J744J645J027K32m2M19J079J392
61739B62568J357J137O06l16j201j461r70rJ112K086K551K465K314K469K648K470
61723B79826K204K326K646K688K722L493M837N570N090M162L700L535L070K415
61709C28284K007J591M59j421l217m189m273l769l048k588k775l489m173m387
61695B95012m105l541l002k732k655k388j820j402j523j876k018k156k625k894
61681B60275k113o67k2p40j651j608j046r67j207p92L28J079P95J4m47m17j09
61664B50705M60J306K066K196J568O76K81P48J678K275K176J800J723J951K077
$$ plain form
61772 255698 253711 251910 250356 249045 247822 246543 245285 244390 244218 244843 245995 247318 248613 249753 250480
61757 250480 250538 250058 249592 249599 250061 250709 251442 252362 253564 255072 256816 258461 259488 259720 259678 260097 261176 262568
61739 262568 263925 265062 265668 265352 264151 262690 261720 261711 262823 264909 267460 269925 272239 274708 277356 279826
61723 279826 282030 284356 287002 289690 292412 295905 300742 306312 311402 315564 319264 322799 325869 328284
61709 328284 330291 331882 332341 330920 327703 323514 319241 315472 312424 309836 307061 303572 299399 295012
61695 295012 290907 287366 284364 281632 278977 276589 274769 273367 271844 269968 267950 265794 263169 260275
61681 260275 258162 257495 257473 256733 255082 253474 252428 251461 250254 249462 249790 250869 251664 251678 251231 250814 250705
61664 250705 251165 252471 254537 256733 258301 258977 259258 260006 261684 263959 266135 267935 269658 271609 273686
61649B73686J988J967K214K619L025L378L606L688L773L962L999L520K596J691
61635C15712J052M66l59j457k627l500l687l232k819l082l791m206m137m002l914
61620B76417l405k267q44O39K280L667L787K417P95J42R9n32j968l428m495n426
61604B67878o123o001n033m063l703l683l572l472l565l637l486l345l412l415
61590B11368l102k759k778l000l005k805k723k757k556k009j363p79k00K71K81
61575A82084k90j087j662j932k053k039j742j206q43j070j810k398k144j005L75
61560A61178J241J297P16q6n95l61O12J738K355K365K137J855J293L62m37n11
61544A75159qK23l52j243j485p90K24Q83J161J350J438J208P82N40N28M09R9m2
$$ plain form
61649 273686 275674 277641 279855 282474 285499 288877 292483 296171 299944 303906 307905 311425 314021 315712
61635 315712 316764 317230 316871 315414 312787 309287 305600 302368 299549 296467 292676 288470 284333 280331 276417
61620 276417 273012 270745 269901 270540 272820 276487 280274 282691 283486 283628 283727 283195 281227 277799 273304 267878
61604 267878 261755 255754 250721 246658 242955 239272 235700 232228 228663 225026 221540 218195 214783 211368
61590 211368 208266 205507 202729 199729 196724 193919 191196 188439 185883 183874 182511 181732 181532 181803 182084
61575 182084 181794 180707 179045 177113 175060 173021 171279 170073 169230 168160 166350 163952 161808 160803 161178
61560 161178 162419 163716 164432 164346 163751 163390 164002 165740 168095 170460 172597 174452 175745 176107 175670 175159
61544 175159 175151 175374 175022 173779 172294 171504 171728 172611 173772 175122 176560 177768 178550 179090 179618 180027 180126 180084
61526A80084Q1r1j005k122k412j659p16l28k39J99Q60Q21m00k048k862k422j462
61509A64279q23n52k63j4k85j105j742j522n76M88J285J737J695J008q7r90j245
61492A61288q59k24J79M3n13r72r05l68L05R60J642K275K613K502J986J250O20
61475A71822M38O87Q74O44K83K40L94L11L8k7O0j40m75k34O03J004L06p19r74
61456A75135n39k82m23m05nL80N79Q95J366J504J059M49J08l5j41J6O72J617K529
61437A84479L451M510N340N326M407L258K548K293K049J565J018O89N83N03L50
61422B22369K03Ln31j392j922j324L25J922K392J731R00P87J354J775J288Rj184
61405B28705j627j622j909k612l081k867k331k022j857j353m44L22L57m49j683
$$ plain form
61526 180084 180165 180074 179069 176947 174535 172876 172160 171832 171593 171792 172652 173473 173073 171025 168163 165741 164279
61509 164279 163456 162904 162641 162627 162342 161237 159495 157973 157397 157885 159170 160907 162602 163610 163523 162533 161288
61492 161288 160429 160205 160384 160427 159914 158942 158037 157669 157974 158934 160576 162851 165464 167966 169952 171202 171822
61475 171822 172260 172947 173821 174465 174748 174988 175382 175693 175731 175704 175764 175624 175149 174915 175518 176522 176828 176109 175135
61456 175135 174596 174314 173891 173486 173481 173861 174440 175335 176701 178205 179264 179713 179821 179786 179645 179661 180333 181950 184479
61437 184479 187930 192440 197780 203106 207513 210771 213319 215612 217661 219226 220244 220933 221516 222019 222369
61422 222369 222572 222575 222044 220652 218730 217406 217731 219653 222045 223776 224676 225463 226817 228592 229880 229889 228705
61405 228705 227078 225456 223547 220935 217854 214987 212656 210634 208777 207424 206980 207302 207659 207210 205527
61390B05527k672k808j993p66J25L41J44J3K03O54J132J448J536J377R55M07J07
61373B05730L43R13J328J386J330J355J381J349J330J235Q74N40R42K175L281
61358B25492L380K796K496K755L170L612M321N099N315M785L984L277K694K462
61344B75638K957L909M481M402M291M517M613M313M249M927N712N669M884M086
61330C38648L431K554J466M42p16k256l530l567k655k243k944l737l512k541j739
61315C17101j296p98k04J66L38P41J618K826M071M989N234M796M103L400K380
61300C49465Q16p44j467j236o28j24J43p2j031k384l286l369l186l348l720l762
61284C22067l364k892k580k256j672q58r7L80N50M99K62r1k30K38J162J805J773
$$ plain form
61390 205527 202855 200047 198054 197288 197413 197754 197898 197911 198114 198768 199900 201348 202884 204261 205216 205623 205730
61373 205730 206073 206986 208314 209700 211030 212385 213766 215115 216445 217680 218554 219094 220036 222211 225492
61358 225492 228872 231668 234164 236919 240089 243701 248022 253121 258436 263221 267205 270482 273176 275638
61344 275638 278595 282504 286985 291387 295678 300195 304808 309121 313370 318297 324009 329678 334562 338648
61330 338648 342079 344633 346099 346541 345825 343569 340039 336472 333817 331574 328630 324893 321381 318840 317101
61315 317101 315805 315007 314803 314969 315307 316048 317666 320492 324563 329552 334786 339582 343685 347085 349465
61300 349465 350281 349537 348070 346834 346206 346082 346225 346153 345122 342738 339452 336083 332897 329549 325829 322067
61284 322067 318703 315811 313231 310975 309303 308445 308348 308728 309278 309777 310039 309948 309718 309956 311118 312923 314696
61267C14696J657K265L404M192M446M891N829O488O173N205M175L029J732J158
61253C69340K161M042N058M577L700L577M036M262L964L363K577J689R12K34p72
61238D12720k249l594m191m281m524m927m932m390l776l348k794j932j245j334
61224C65203k050k524k014n91R06J629J509J322J760K629L182L160L042L192L292
61209C83647K860K011J313J070J075J022Q97R42J381K233L314M430N507O461O987
61194D25150O766N968N255N041M912M117K587J200Q83J636K539K694J993R95K40
61179D71976j78l65l65k93m63r96j419j055N8J054J163N01k76q08j171j449j582
61162D64332j677k156l315m743n420m651l002k017k620l970m365l274j842j340
$$ plain form
61267 314696 316353 318618 322022 326214 330660 335551 341380 347868 354041 359246 363421 366450 368182 369340
61253 369340 371501 375543 380601 385178 388878 392455 396491 400753 404717 408080 410657 412346 413258 413492 412720
61238 412720 410471 406877 402686 398405 393881 388954 384022 379632 375856 372508 369714 367782 366537 365203
61224 365203 363153 360629 358615 358024 358930 360559 362068 363390 365150 367779 370961 374121 377163 380355 383647
61209 383647 386507 388518 389831 390901 391976 392998 393895 394837 396218 398451 401765 406195 411702 418163 425150
61194 425150 431916 437884 443139 448180 453092 457209 459796 460996 461879 463515 466054 468748 470741 471736 471976
61179 471976 471798 471433 471068 470775 470312 469316 467897 466842 466900 467954 469117 469618 469342 468534 467363 465914 464332
61162 464332 462655 460499 457184 452441 447021 442370 439368 437351 434731 430761 426396 423122 421280 419940
61148D19940j784k570l669n409p430q730q792q018p028o129n445m977m419l438
61134C42102k312j770k033k440k288j550n59N49J703K622L120L459M019M759N339
61119C54720N668O084O985Q424R991J1136J1742J2291J3210J4142J4358J3899
61107D82650J3618J3915J4126J3540J2356J1050R440P233M959L427K439J079p14
61094E89118j889j876j569k201l844n583o751p461q104q837r528r935r909r601
61080E02030r375r392r373q908p946o832n919n217m441l445k535k187k404k580
61066D21476k191j357n13K23R78J729K421L295M586N912O603O633O721P409Q562
61051D72487R786J0894J1824J2682J3971J6193J9101K1867K4108K6180K8256K9893
$$ plain form
61148 419940 418156 415586 411917 406508 399078 390348 381556 373538 366510 360381 354936 349959 345540 342102
61134 342102 339790 338020 335987 333547 331259 329709 329150 329699 331402 334024 337144 340603 344622 349381 354720
61119 354720 360388 366472 373457 381881 391872 403008 414750 427041 440251 454393 468751 482650
61107 482650 496268 510183 524309 537849 550205 561255 570695 577928 582887 586314 588753 589832 589118
61094 589118 587229 585353 583784 581583 577739 572156 565405 557944 549840 541003 531475 521540 511631 502030
61080 502030 492655 483263 473890 464982 457036 450204 444285 439068 434627 431182 428647 426460 424056 421476
61066 421476 419285 417928 417415 417638 418616 420345 422766 426061 430647 436559 443162 449795 456516 463925 472487
61051 472487 482273 493167 504991 517673 531644 547837 566938 588805 612913 639093 667349 697242
61039F97242L0815L1451L2295L3382L4827L7256M1098M6003N1412N7152O2988
61028A155921O8301P2900P7680Q3893R2359J04031J20592J43639J73866K11865
61018B305047K59214L18196L91636M84033O01353P47286R18887J104080J277282
61009H407014J392366J386684J211342Q75051M60989R1036j38035j94560j05735
61000A3386152O9304K54127L59931L06913O5835l14063p24414j055281j246353
60991A1102151j297507j244753j131175r91988q51308p22371o09377n11815m28474
60982C313383l58233k99308k49896k09311j77421j53175j34574j19792j07528
60973A504145r6689q6656p7601o9769o2610n5293m7728m0346l3318k6889k1996
$$ plain form
61039 697242 728057 759508 791803 825185 860012 897268 938366 984369 1035781 1092933 1155921
61028 1155921 1224222 1297122 1374802 1458695 1551054 1655085 1775677 1919316 2093182 2305047
61018 2305047 2564261 2882457 3274093 3758126 4359479 5106765 6025652 7129732 8407014
61009 8407014 9799380 11186064 12397406 13272457 13733446 13824482 13686447 13491887 13386152
61000 13386152 13455456 13709583 14069514 14376427 14442262 14128199 13403785 12348504 11102151
60991 11102151 9804644 8559891 7428716 6436728 5585420 4863049 4253672 3741857 3313383
60982 3313383 2955150 2655842 2405946 2196635 2019214 1866039 1731465 1611673 1504145
60973 1504145 1407456 1320800 1243199 1173430 1110820 1055527 1007799 967453 934135 907246 885250
60962H85250j9390j8263j6818j4316j1508r104o921m700k646p30J466L738N005
60949G91063M737L839L393L146K075m3k403m385o175q172j0373j2508j4433j6175
60935G33586j7690j8758j9191j9148j9084j9234j9315j9006j8502j8217j8080
60924E27361j7673j6945j6203j5368j3996j2176j0737j0193j0075r694r038q462
60912C76801q008p507o968o371n421m038k766k161j997j636r65l88n8L11Q62J340
60896C31030J539J546J457J237R71Q86R24O66j05r08j040n39l43j274k946l981
60880C29120l480k008r21q37j192j202q06m91n60q20r09o97n16r05j965l040l378
60863C05393l073k904l164l240k569j545j043j392k183k869l217l346l521l779
$$ plain form
60962 885250 865860 847597 830779 816463 804955 795851 788930 784230 781584 780854 782320 786058 791063
60949 791063 795800 799639 803032 806178 808253 808210 805807 801422 795247 787075 776702 764194 749761 733586
60935 733586 715896 697138 677947 658799 639715 620481 601166 582160 563658 545441 527361
60924 527361 509688 492743 476540 461172 447176 435000 424263 414070 403995 394301 385263 376801
60912 376801 368793 361286 354318 347947 342526 338488 335722 333561 331564 329928 328963 328575 328517 328828 329690 331030
60896 331030 332569 334115 335572 336809 337780 338666 339590 340256 340151 339243 338203 337664 337321 336047 333101 329120
60880 329120 325640 323632 322711 321874 320682 319480 318674 318183 317623 316803 315894 315197 314681 313776 311811 308771 305393
60863 305393 302320 299416 296252 293012 290443 288898 287855 286463 284280 281411 278194 274848 271327 267548
60849B67548l783l242k507k219k376k296j707j151j003q31k26L67L46j10m63p34
60833B45613j215j650j566j106p28l11N31J443J631J150R20J294J568J180O07
60818B49361O03J184J817K111J931J296N17O2m4l32j099j861j960j423q42n76
60802B50745m53j81K05L89J75k50n46p08j110j884k552k604k184j802j648j647
60786B33945j934k627l285l314k895k749k965k902k377k045k215k163j164M24
60772B01734J709K313K358J882J029L87M81J100J681K077K406K461J944J119N93
60757B25274M68L46J63L56J059J714J800J473J180R89P34O22J143K248L031K519
60741B45119P92j052k057k297k461k885l341l639l852l994l902l594l348l240
$$ plain form
60849 267548 263765 260523 258016 255797 253421 251125 249418 248267 247264 246433 246207 246574 246920 246810 246347 245613
60833 245613 244398 242748 241182 240076 239348 239037 239568 241011 242642 243792 244712 246006 247574 248754 249361
60818 249361 249964 251148 252965 255076 257007 258303 258820 258882 258838 258506 257407 255546 253586 252163 251321 250745
60802 250745 250292 250111 250316 250705 250880 250630 250084 249376 248266 246382 243830 241226 239042 237240 235592 233945
60786 233945 232011 229384 226099 222785 219890 217141 214176 211274 208897 206852 204637 202474 201310 201734
60772 201734 203443 205756 208114 209996 211025 211412 211893 212993 214674 216751 219157 221618 223562 224681 225274
60757 225274 225742 226088 226251 226607 227666 229380 231180 232653 233833 234822 235556 236178 237321 239569 242600 245119
60741 245119 245911 244859 242802 240505 238044 235159 231818 228179 224327 220333 216431 212837 209489 206249
60727B06249k996k507k184k440l063l341k776j556m14n5n21j065r62l68m4k57
60711A81700m95l96l31p07j212j262q34m34l56m64m85k47K54Q07J168J426J854
60694A79986K258J988R16o0O3J259K682L647L968L645K852K048J675J782K246
60679B10955K993L684L677K875K163K357K989K957K096J264R82Q46L78k98q64
60664B39054j265j603k034k809l903m626m201k800j404o13k39o4j68l79j91M01
60648B13156P12M51K93R02J944K606K592K037Q47j091l281m788n044m199k810
60633B04327j551j060j539k490l090k912k146j224m34K23Q89J546J837J398M57
60618A94231k40k18K72P11Q66P11J79o02j112q88j18N51P85Q40J119J634J968
$$ plain form
60727 206249 203253 200746 198562 196122 193059 189718 186942 185386 184972 184917 184396 183331 182369 182001 181957 181700
60711 181700 181205 180809 180478 179771 178559 177297 176463 176029 175673 175209 174724 174477 174731 175538 176706 178132 179986
60694 179986 182244 184232 185148 185088 185151 186410 189092 192739 196707 200352 203204 205252 206927 208709 210955
60679 210955 213948 217632 221309 224184 226347 228704 231693 234650 236746 238010 238992 239838 240216 239918 239054
60664 239054 237789 236186 234152 231343 227440 222814 218613 215813 214409 213796 213557 213493 213325 212946 212755 213156
60648 213156 213868 214319 214612 215514 217458 220064 222656 224693 225540 224449 221168 216380 211336 207137 204327
60633 204327 202776 201716 200177 197687 194597 191685 189539 188315 187881 188104 188993 190539 192376 193774 194231
60618 194231 193991 193773 194045 194756 195622 196333 196512 195910 194798 193910 193792 194343 195128 195968 197087 198721 200689
60601B00689J696Q39j34p84j056j058p51j94J32k61j067j469j194p49m52J3P78
60584A94978J258R98M34K51M44O19Q67J596K768L946M911N709O301O695P189P865
60568B46829Q113P316N756M110K315o7k528l796l580l073l234l493k819j391l24
60553B50134j11r7O15K297M558O722Q178Q777Q884Q973R100Q885P881N958L488
60538C34242J234k99j436k890m648n760n521m376l319k755k456k229k062j855
60524B95870j542j388j603j846j640j143q62o99o0J065J987K523L406N045O728
60509C05841P778Q853J1084J4283J7120J9015K0841K3466K6506K8966L0376L0659
60497E44788K9474K6479K1972J6520J0034J950p509j6799k4128k8726l0948l1498
$$ plain form
60601 200689 202385 203224 203090 202306 201250 200192 199441 199247 199379 199118 198051 196582 195388 194639 194187 194200 194978
60584 194978 196236 197234 197668 197919 198363 198982 199849 201445 204213 208159 213070 218779 225080 231775 238964 246829
60568 246829 254942 262258 268014 272124 274439 274372 271844 268048 264468 261395 258161 254668 251849 250458 250134
60553 250134 250023 249926 250541 252838 257396 264118 272296 281073 289957 298930 308030 316915 324796 330754 334242
60538 334242 335476 335177 333741 330851 326203 320443 314922 310546 307227 304472 302016 299787 297725 295870
60524 295870 294328 292940 291337 289491 287851 286708 285846 285147 285087 286152 288139 290662 294068 299113 305841
60509 305841 313619 322472 333556 347839 364959 383974 404815 428281 454787 483753 514129 544788
60497 544788 574262 600741 622713 639233 649267 651217 643708 626909 602781 574055 543107 511609
60485E11609l0894k9401k7075k3959k0427j7236j4949j3389j1959j0506r501r275
60473B93038r398r093q105o862n786m840l853l035k783l061l337l194k712k144
60459B24835j548j017r12j469k277k609k250j599r71l43J59R9n35r82n96J92L95
60442B08572k04q44r07n79l34k90m37r64j918k764k876k342j855j762j701j267
60426A87528n71J79J212K719M077M254L145J872J319J012L4j359j978j463q22
60411B01158r14j307j183o51l81l49P5J054K033K591K799K676K032J060M62O44
60395B11799J272J858K277K477K250J661J210J139J046O16L33P97J681K047J560
60380B34023Q05M09M39P08J106J483J612J479J324J347J554J880K135J985J391
$$ plain form
60485 511609 480715 451314 424239 400280 379853 362617 347668 334279 322320 311814 302313 293038
60473 293038 283640 274547 266442 259580 253794 248954 245101 242066 239283 236222 232885 229691 226979 224835
60459 224835 223287 222270 221358 219889 217612 215003 212753 211154 210183 209840 209999 210098 209563 208581 207985 208177 208572
60442 208572 208368 207524 206617 206038 205704 205414 204977 204013 202095 199331 196455 194113 192258 190496 188795 187528
60426 187528 186957 187136 188348 191067 195144 199398 202543 204415 205734 206746 206780 205421 203443 201980 201158
60411 201158 200244 198937 197754 197103 196722 196373 196448 197502 199535 202126 204925 207601 209633 210693 211155 211799
60395 211799 213071 214929 217206 219683 221933 223594 224804 225943 226989 227605 227938 228735 230416 232463 234023
60380 234023 234828 235237 235676 236384 237490 238973 240585 242064 243388 244735 246289 248169 250304 252289 253680
60365B53680R73J397K423L135L208L308L989M827N126M947M901N218N579N654
60351C08365N313M387K740O57j250k585l498m381n362o080n967m953l806l433
60337B80147l758l758k879j842j548j792j717j208r20j126j389j441j546j790
60323B53433j764j258o42j98K85R72J589K013K718M111N852P308Q390R444J0567
60308C02820J1442J1637J0814Q910O459M259K399L2l376p077r929j1730j2902
60295C13758j3232j2090r786p674o618o200n669m842l760k281n99M56L38l93p39
60280B40669m82j90k67n29o71o34n07l38j82j30k62o37j215j717j768j358r67
60263B28815j001j351j650j808j941j957j582p97K7M77M09o7o82j046q05K9J011
$$ plain form
60365 253680 254653 256050 258473 261608 264816 268124 272113 276940 282066 287013 291914 297132 302711 308365
60351 308365 313678 318065 320805 321462 320212 317627 314129 309748 304386 298306 292339 287386 283580 280147
60337 280147 276389 272631 269752 267910 266362 264570 262853 261645 260725 259599 258210 256769 255223 253433
60323 253433 251669 250411 249769 249571 249856 250828 252417 254430 257148 261259 267111 274419 282809 292253 302820
60308 302820 314262 325899 336713 345623 352082 356341 358740 358772 355396 348319 338390 326660 313758
60295 313758 300526 288436 278650 270976 264358 258158 252489 247647 243887 241606 241007 241463 241801 241408 240669
60280 240669 240187 239997 239730 239201 238530 237896 237389 237051 236869 236739 236477 235840 234625 232908 231140 229782 228815
60263 228815 227814 226463 224813 223005 221064 219107 217525 216728 216755 217232 217641 217574 216892 215846 215041 215070 216081
60246B16081J621J714J567J487J466J326J077Q56N78k5p73r33j47Q38J001M52
60230B28186K51P97J220O96l52q87n84J56J061K083K805K557J348K12K40J483
60214B41272K942L581L215K449J879J532J198J051J485K347K922K868K710L052
60200B74503L754M289M521M586M364L714L004K777K965L000K682K325K094J722
60186C20300J020J49o92j405j758j494q46n16r03j705k462l064l549l740l425
60171B95910k731k027j614j547j685j804j829j909k085j978j184J8P72O24N4j54
60155B76831J80O18P06M47K70O18J379J790J212M9n20J38J410K288K476K370K262
60138B94524K013J443O88J51J75P48J490K056K468K895L122K716J715P66L49L34
$$ plain form
60246 216081 217702 219416 220983 222470 223936 225262 226339 227195 227773 227748 226975 226042 225895 226733 227734 228186
60230 228186 228437 229234 230454 231150 230798 229911 229327 229483 230544 232627 235432 237989 239337 239549 239789 241272
60214 241272 244214 247795 251010 253459 255338 256870 258068 259119 260604 262951 265873 268741 271451 274503
60200 274503 278257 282546 287067 291653 296017 299731 302735 305512 308477 311477 314159 316484 318578 320300
60186 320300 321320 321469 320777 319372 317614 316120 315274 314758 313855 312150 309688 306624 303075 299335 295910
60171 295910 293179 291152 289538 287991 286306 284502 282673 280764 278679 276701 275517 275535 276307 276931 276985 276831
60155 276831 277011 277629 278335 278782 279052 279670 281049 282839 284051 284100 283580 283718 285128 287416 289892 292262 294524
60138 294524 296537 297980 298668 298819 298994 299742 301232 303288 305756 308651 311773 314489 316204 316970 317319 317653
60122C17653M58P09R57O97k73j278j492r97n68n04l71P5M03J99k29k43K61P85
60104C16242Q71N20j6o25j326k027k438k314j736j070p02q07j227j529j291n90
60088B99935j7J6j77l3L30L00j70l31J94O82K84o61j003k58Q44J277P23l93j417
60069C00125j890j757j390j288j624k158k541k597k374k054j811j700j731j952
60055B73258k300k454k103j370o25N7P89J296J064K84q1M48J270J739K005K231
60039B75508J889P91Q4R43K678L496K906K085J794J498P68J93K68M76K48j19k31
60022B95275l53p20q45m02o7o11j675k426k930l884n271o323o632o477o045n160
60006B45454l835k470j438r72j244k033k484j905p49q8k29n36n30l63k04Q1M33
$$ plain form
60122 317653 318111 318820 319777 320474 320201 318923 317431 316434 315866 315362 314991 315066 315469 315668 315439 315196 315457 316242
60104 316242 317113 317633 317617 316992 315666 313639 311201 308887 307151 306081 305379 304572 303345 301816 300525 299935
60088 299935 299918 299934 299757 299724 300054 300354 300184 299853 300047 300729 301013 300352 299349 299091 299935 301212 301935 301542 300125
60069 300125 298235 296478 295088 293800 292176 290018 287477 284880 282506 280452 278641 276941 275210 273258
60055 273258 270958 268504 266401 265031 264406 264463 265252 266548 267612 267896 267815 268263 269533 271272 273277 275508
60039 275508 277397 278188 278272 279215 281893 285389 288295 290380 292174 293672 294440 294633 294901 295377 295625 295506 295275
60022 295275 294922 294202 293357 292955 292888 292277 290602 288176 285246 281362 276091 269768 263136 256659 250614 245454
60006 245454 241619 239149 237711 236739 235495 233462 230978 229073 228324 228236 228007 227471 226941 226578 226374 226455 226888
59989B26888N25L39K28K78K43K07N71J220J460J009M19J81J94L07O43R99P44j39
59971B36316p24m58n8l22q14o16J59O58O05L50j27j020j704j192K94J340J260
59954B33947R13J109J357Q60n3m57k31ro4j66l47q43j268q31L48R90K56j016j395
59935B33100p00j0J5j16K19P00O83L44M81J396K611L657M544N353N971O434P032
59918B71714P725P883O944N033K647J30k173l681m041l652l187k875k645k639
59904B77183k957l130k564j469o11k06K12Q16J208J294J585K265K796K883L034
59889B82339L591L896L244K141J694K039K316K110K034K628L439L585K793J563
59875C19412N69J75K91M86K96l58j100j428j132l68M89J135J589K173L142M328
$$ plain form
59989 226888 227413 227752 227980 228258 228501 228708 229279 230499 231959 232968 233387 233568 233762 234069 234712 235711 236455 236316
59971 236316 235592 235134 235076 234754 233940 233324 233483 234141 234746 235096 234969 233949 232245 231053 231347 232687 233947
59954 233947 234860 235969 237326 238186 238133 237676 237445 237436 237372 237206 236859 236016 234748 233917 234265 235255 235511 234495 233100
59935 233100 232400 232390 232405 232289 232508 233208 233891 234235 234716 236112 238723 242380 246924 252277 258248 264682 271714
59918 271714 279439 287322 294266 299299 301946 302076 299903 296222 292181 288529 285342 282467 279822 277183
59904 277183 274226 271096 268532 267063 266452 266246 266458 267274 268482 269776 271361 273626 276422 279305 282339
59889 282339 285930 289826 293070 295211 296905 298944 301260 303370 305404 308032 311471 315056 317849 319412
59875 319412 319981 320156 320447 320933 321229 320871 319771 318343 317211 316843 317332 318467 320056 322229 325371 329699
59859C29699N197N218M200K453P28k34k51K43P87J348K018K477K077M69j978m408
59843C50043o098o938p336p530p174n870m081k913k816l069k806k053j266m84
59829B89609M66J259J387J059J007J411J650J276O09K48M31J073J980K724K681
59814C08870J498m90k466l705m084m164m552n059m793l440k027j758k422k696
59800B68712j964r81o48q82j080r48n29R7P06R35P45N38N72N60J91l45o22n53
59782B64504m00m22o30p41l99L61Q78O01p8k62J92N64M60L26M80N13J10k56j5
59763B65786O60J247J609J782J601J120R57J551K464K980L011K880K677K512K853
59748B95690L838M632M371L418K822K839K883K758K851L141L032K406J888J862
$$ plain form
59859 329699 334896 340114 344314 346767 347495 347261 347010 347253 348040 349388 351406 353883 355960 356429 354451 350043
59843 350043 343945 337007 329671 322141 314967 309097 305016 302103 299287 296218 293412 291359 290093 289609
59829 289609 290075 291334 292721 293780 294787 296198 297848 299124 299733 299981 300412 301485 303465 306189 308870
59814 308870 310368 309878 307412 303707 299623 295459 290907 285848 281055 277615 275588 273830 271408 268712
59800 268712 266748 265767 265119 264237 263157 262209 261680 261777 262483 263418 264163 264701 265273 265833 266024 265679 265057 264504
59782 264504 264104 263682 263052 262311 261912 262273 263151 263752 263674 263412 263604 264168 264628 264954 265434 265947 266057 265801 265786
59763 265786 266446 267693 269302 271084 272685 273805 274762 276313 278777 281757 284768 287648 290325 292837 295690
59748 295690 299528 304160 308531 311949 314771 317610 320493 323251 326102 329243 332275 334681 336569 338431
59734C38431J928J620J016M14pm0M36J022J063M93j70o82j300k021k421k445k539
59717C34798k785k676k161j992k575l238l269k969k911k839k152j045k93j55k82
59702C03456m92q29j050q26m52n64j083j153l67N79P71J47o41j045j000p16m01
59685B94334j59N2L44P04Q96O56j04j113j806j710j000m80q36j920k956l307k941
59668B78654k296j921k106k590k752k354j858j740j776j468r96r76j351j264l08
59653B52898Q13J283J225J202J185P90K18J38O52J112J122R75Q65M02n90j371
59637B62919j141k61J94l9j45M23J091J043L12n35j291k029k473k184j351p46
59621B53787p51r80j000r48j148j508j642j328o07L43J191J553J402J196J297
$$ plain form
59734 338431 340359 341979 342995 343409 343402 343362 343798 344820 345883 346376 346206 345524 344224 342203 339782 337337 334798
59717 334798 332013 329337 327176 325184 322609 319371 316102 313133 310222 307383 305231 304186 303893 303738 303456
59702 303456 302964 302135 301085 300259 299807 299243 298160 297007 296640 297219 297990 298137 297496 296451 295451 294735 294334
59685 294334 294175 294227 294571 295275 296171 296827 296723 295610 293804 292094 291094 290614 289778 287858 284902 281595 278654
59668 278654 276358 274437 272331 269741 266989 264635 262777 261037 259261 257793 256797 255821 254470 253206 252898
59653 252898 253711 254994 256219 257421 258606 259396 259614 259752 260404 261516 262638 263613 264478 264880 264290 262919
59637 262919 261778 261517 261711 261672 261527 261950 263041 264084 264396 263861 262570 260541 258068 255884 254533 253787
59621 253787 253036 252056 251056 250108 248960 247452 245810 244482 243875 244218 245409 246962 248364 249560 250857
59606B50857J428J028Q2p33p16J78J378K166K213J794J454J382J227O87K5k50
59590B64200j00O6Lj21j79l16o26r52j194j483j848j964j573r68p17r61j322j460
59572B48485j388j225q85j84Q04J625J736R92j24q52r12p27q10j038r04l42J06
59555B44357R3j8L37J158J914K217K182K224K655L443M205M623M953N955Q082
59540B88380J1029J4176J7042J8840J8089J3601O092j946q189j1943j3575j3341
59528C38255j1408q503n754l809k519j529q07n33o96r37p82j49M24K73n39j220
59512B99767j229q97q70j224j613j909k293k788l156l246l106k873k805l149l684
59497B64925l593k367o73J97k43j283j947j843j119j28O77R98R35P78N35J39n0
$$ plain form
59606 250857 252285 253313 253395 252662 251946 252124 253502 255668 257881 259675 261129 262511 263738 264425 264450 264200
59590 264200 264100 264166 264169 264048 263869 263553 262927 261975 260781 259298 257450 255486 253913 252945 252228 251267 249945 248485
59572 248485 247097 245872 244987 244803 245607 247232 248968 249960 249836 248984 248072 247345 246535 245497 244593 244251 244357
59555 244357 244450 244432 244769 245927 247841 250058 252240 254464 257119 260562 264767 269390 274343 280298 288380
59540 288380 299409 313585 330627 349467 367556 381157 387249 385303 377114 365171 351596 338255
59528 338255 326847 318344 312590 308781 306262 304733 303926 303393 302697 301760 300978 300829 301253 301526 300987 299767
59512 299767 298538 297641 296771 295547 293934 292025 289732 286944 283788 280542 277436 274563 271758 268609 264925
59497 264925 261332 258965 258292 258489 258246 256963 255016 253173 252054 251926 252603 253601 254536 255314 255849 255988 255938
59480B55938M42J374J947J949K060K716L347L192K351J503R88O85M98M44M57N35
59464B80426Q41J279J296N90j93j43P18J478J641J684K151K841L274L541M106
59449C05530M955N475N300M783M344L696K251K29j247j520j305j724k746l318
59435C24703k949k349k315k702k932k911k893k822k441j828j210m17Q98K519L754
59420C04105M441N312P061R403J1463J2975J4629J7032J9467K0008J7030J0674
59408D53600K864l948q055r024p616n235k895m26K937O918R538Q560L548l763
59394D47003j0877j5959j8271j8110j6550j4786j3225j1350q732n947m160l756
59382C05280l806l109j594k97P3J3L77J109J406J021O58R26J497J672J299P63
$$ plain form
59480 255938 256380 257754 259701 261650 263710 266426 269773 272965 275316 276819 277807 278492 278990 279434 279891 280426
59464 280426 281267 282546 283842 284432 284239 284096 284814 286292 287933 289617 291768 294609 297883 301424 305530
59449 305530 310485 315960 321260 326043 330387 334083 336334 336563 335316 333796 332491 330767 328021 324703
59435 324703 321754 319405 317090 314388 311456 308545 305652 302830 300389 298561 297351 296934 297832 300351 304105
59420 304105 308546 313858 320919 330322 341785 354760 369389 386421 405888 425896 442926 453600
59408 453600 456464 452516 444461 435437 427821 422586 419691 419265 422202 429120 438658 447218 450766 447003
59394 447003 436126 420167 401896 383786 367236 352450 339225 327875 319143 313196 309036 305280
59382 305280 301474 298365 296771 296474 296547 296560 296937 298046 299452 300473 301131 302057 303554 305226 306525 307288
59366C07288L96K88M86R55J528K118K833L502L517K589J490J455K798M568N695
59351C41506O072O323O855P426P601P362P181P446P989Q281Q078P626P270P015
59337D44031O582N629L995K025N57J01lj018l181n228n925n451m796m442m305
59322D28571m420m733m563l220j095P58K065L494N274O579O564N187K697q81n170
59307D37107q985j1232j1944j1851j1235r802p576n267l561k505j786j312j239
59294C48812j513j647j102J26J412K044J806J068L75O1R6K11K39L30O72R80O80
59277C54650k26q53m51N93J239J095P01O51J095K057L557N164O036N767M861M027
59261C89963L324K318Q47p57k080k977l527l853l990l925l791l915m438m974m967
$$ plain form
59366 307288 307684 307972 308458 309413 310941 313059 315892 319394 322911 325500 326990 328445 331243 335811 341506
59351 341506 347578 353901 360756 368182 375783 383145 390326 397772 405761 414042 422120 429746 437016 444031
59337 444031 450613 456242 460237 462262 462819 462920 462917 461899 458718 453490 447565 442114 437318 432876 428571
59322 428571 424151 419418 414855 411635 410540 411298 413363 416857 422131 428710 435274 440461 443158 442277 437107
59307 437107 428122 416890 404946 393095 381860 372058 364482 359215 355654 353149 351363 350051 348812
59294 348812 347299 345652 344550 344676 346088 348132 349938 351006 351381 351442 351538 351749 351988 352318 352990 353970 354650
59277 354650 354424 353571 353120 353713 354952 356047 356748 357399 358494 360551 364108 369272 375308 381075 385936 389963
59261 389963 393287 395605 396452 395695 393615 390638 387111 383258 379268 375343 371552 367637 363199 358225 353258
59246C53258m413l876l671l406k550j251k39%k32k32L24J001J174Q67Q25J513
59230C39092K386K520J825J113R81J178J188R50O43J65p63k055l179l626l331
59215C39087k730k390k519k734k504j806j132q58q44p76n71l48j60M7L52Q58J580
59198C22552K269K538K359K247K696L495L816L103J769Q35Q57J364J572J432J513
59183C54417J925K033J497R48J033J301Q45k36r19o29K46J247K294L085K990K047
59167C74124J304J615K597L340L641L905M168M004L270K413J899J768J819J897
59153D11764J952J983K009J991J775J190K01r98j993k340j932j201q12j093j863
59138D10633k661l031k754k127j838k276l048l471l339k819j964q93j43q5j80
$$ plain form
59246 353258 348845 344969 341298 337892 335342 334091 333852 333852 333620 333388 333712 334713 335887 336754 337579 339092
59230 339092 341478 343998 345823 346936 347917 349095 350283 351233 351876 352041 351278 349223 346044 342418 339087
59215 339087 336357 333967 331448 328714 326210 324404 323272 322414 321570 320794 320223 319875 319715 319762 320114 320972 322552
59198 322552 324821 327359 329718 331965 334661 338156 341972 345075 346844 347679 348536 349900 351472 352904 354417
59183 354417 356342 358375 359872 360820 361853 363154 363999 363763 362844 362215 362461 363708 366002 369087 372077 374124
59167 374124 375428 377043 379640 382980 386621 390526 394694 398698 401968 404381 406280 408048 409867 411764
59153 411764 413716 415699 417708 419699 421474 422664 422865 421867 419874 417534 415602 414401 413589 412496 410633
59138 410633 407972 404941 402187 400060 398222 395946 392898 389427 386088 383269 381305 380412 380269 380184 380004
59123C80004L57J237J448R35Q96K000L416M138M314M601M994N121N043N008M891
59108D28403M663M843N724O587O575N946N621N702N471M646L759L176K548J470
59094D95134Q4j138j791j700j086o05p27j161j258r01n15l56l41n67j296k343
59078D79433l042l102l035l468m391n227n537n406n302n611o198o532o219n346
59064D11017m236l201k588k668l143l249k745k328k599l056k837k059j545j481
59050C73282j269o53j8N36J394K469K952K540K030K169K558K479K284K986M625
59035D00364N932N855M845M304M992O276O881O191M813L923M090M853N342N196
59021D73857M778M640M952N488N965O204N987N081L666K460K068K211K022J198
$$ plain form
59123 380004 380361 381598 383046 383981 384877 386877 390293 394431 398745 403346 408340 413461 418504 423512 428403
59108 428403 433066 437909 443633 450220 456795 462741 468362 474064 479535 484181 487940 491116 493664 495134
59094 495134 495218 494080 492289 490589 489503 488898 488171 487010 485752 484851 484336 483980 483639 483072 481776 479433
59078 479433 476391 473289 470254 466786 462395 457168 451631 446225 440923 435312 429114 422582 416363 411017
59064 411017 406781 403580 400992 398324 395181 391932 389187 386859 384260 381204 378367 376308 374763 373282
59050 373282 372013 371360 371342 371878 373272 375741 378693 381233 383263 385432 387990 390469 392753 395739 400364
59035 400364 406296 412151 416996 421300 426292 432568 439449 445640 450453 454376 458466 463319 468661 473857
59021 473857 478635 483275 488227 493715 499680 505884 511871 516952 520618 523078 525146 527357 529379 530577
59007E30577L37J9L6j39n02o07k67L26J005J781K615L378L975M275M090L409K526
58990E56834J697Q96R8n54j084j826k815l527l702l904m627n294m988l931l218
58975E20055l135k811j684l08O99J605K812L915M262M054M066M549N092N539O252
58960E54962P274P810P093N510M397M594N569O069N324L419Q29j879m019n093
58946F01859n240n023m744m405m227m489m794m415l654l852n379o626n999m180
58932E34832l198l662m188l434j556M84J996K698K647K362K443K931L488M140
58918E41983N204O476P319P624Q026R044J0561J2165J3372J3592J2627J1102R691
58905F68786Q081N606K736P37k42j428l403n138n601n242n045n105n008m817m733
$$ plain form
59007 530577 530914 530933 530969 530830 530328 529721 529454 529780 530785 532566 535181 538559 542534 546809 550899 554308 556834
58990 556834 558531 559427 559525 558971 557887 556061 553246 549719 546017 542113 537486 532192 527204 523273 520055
58975 520055 516920 514109 512425 512117 512816 514421 517233 521148 525410 529464 533530 538079 543171 548710 554962
58960 554962 562236 570046 577139 582649 587046 591640 597209 603278 608602 612021 612850 610971 606952 601859
58946 601859 596619 591596 586852 582447 578220 573731 568937 564522 560868 557016 551637 545011 539012 534832
58932 534832 531634 527972 523784 520350 518794 519278 521274 523972 526619 528981 531424 534355 537843 541983
58918 541983 547187 553663 560982 568606 576632 585676 596237 608402 621774 635366 647993 659095 668786
58905 668786 676867 682473 685209 685946 685704 684276 680873 675735 670134 664892 659847 654742 649734 644917 640184
58890F40184m265k675m6K786N117O764P914Q980J0346J1783J2568J2368J1614
58877G23438J0724R629Q366P463P166O863N845M029J548j761n785r701j2759j5058
58863G40007j6889j7935j7890j7332j7048j6871j6093j4772j3701j3231j2914
58852E65331j2386j1764j1219j0733j0452j0578j0795j0342q907p155o114o164
58840D48722o701o795o108n158m526m115l560l063l070l171k382p62K64k48j480
58825C97847k076j732q95L03J774K930L427L876M731N126M025K042P58N49M93
58810D23178J82J49L93R0q28j251n65L38M93J36j13m87j458k583k903k286j540
58793D10945j335j580j845j911j914k091k418k461j826p33J32M93P78J459K413
$$ plain form
58890 640184 635919 633244 633198 635984 641101 647865 655779 664759 675105 686888 699456 711824 723438
58877 723438 734162 743791 752157 759620 766786 773649 779494 783523 785071 783310 777525 767824 755065 740007
58863 740007 723118 705183 687293 669961 652913 636042 619949 605177 591476 578245 565331
58852 565331 552945 541181 529962 519229 508777 498199 487404 477062 468155 461000 454886 448722
58840 448722 442021 435226 429118 423960 419434 415319 411759 408696 405626 402455 400073 399311 399575 399327 397847
58825 397847 395771 394039 393144 393447 395221 398151 401578 405454 410185 415311 419336 421378 422136 422685 423178
58810 423178 423360 423509 423902 423992 423164 421913 421348 421686 422179 422315 422202 421715 420257 417674 414771 412485 410945
58793 410945 409610 408030 406185 404274 402360 400269 397851 395390 393564 392831 392963 393456 394234 395693 398106
58778C98106L207L655L855L862L566K841J727N39l59j006j876l132m131m195l658
58763D03001l545m216n058n544n882o353o625o201n081l707k515j782j485j116
58749C43891j00J389K467K663K470K513K709K784L093M153N607O410O093N283
58735C91425M810M814M939M998N085N173N009M505M044M152M848N520N468M540
58721D59330L081J542K67m59n66l71k88k23L49J573K702K757J654L76m0M41R56
58704D73081P34k07j374k492l631m783n735o342o646o724o692o836p345p865p860
58689C99283p448p331p646p555o383m612l199k412j927j667j806k159k327k178
58675C40633j779r98J45J090J357J402K039L222M189M644M957N194M971M331L892
$$ plain form
58778 398106 401313 404968 408823 412685 416251 419092 420819 421358 420999 419993 418117 414985 410854 406659 403001
58763 403001 399456 395240 390182 384638 378756 372403 365778 359577 354496 350789 348274 346492 345007 343891
58749 343891 343791 345180 347647 350310 352780 355293 358002 360786 363879 368032 373639 380049 386142 391425
58735 391425 396235 401049 405988 410986 416071 421244 426253 430758 434802 438954 443802 449322 454790 459330
58721 459330 462411 463953 464220 463761 463195 462824 462536 462313 462662 464235 466937 469694 471348 471724 471684 472125 473081
58704 473081 473815 473608 472234 469742 466111 461328 455593 449251 442605 435881 429189 422353 415008 407143 399283
58689 399283 391835 384504 376858 369303 362920 358308 355109 352697 350770 349103 347297 345138 342811 340633
58675 340633 338854 337856 338001 339091 340448 341850 343889 347111 351300 355944 360901 366095 371066 375397 379289
58660C79289L810L441K321P71p49k187l405l901l534k966k852k998k762j967j021
58645C61290m10l90q49j247r94j54M93L46l31p41l41Q12K212L260L708L834L897
58628C74395L674K949K216K160K513K253J077q4k98L48J204J832K015J699J305
58613C99258J465K088K311J714Q32J92l85j014j199p34l15m48n07K53J302J519
58597D06332Q01J1l59m97m71j52K15K75L61J134K391L225L447L895N044O139O235
58580D38026N440M614M230M002L435K425J445J233K017L110L630L626M017N233
58566D86483O511O961O904P557R536J2205J4524J6060J6925J7103J6338J4721
58554F31828J2910J1494J0322Q830O923N086L621K163K36k032m046n377o050o339
$$ plain form
58660 379289 383099 386540 388861 389632 388883 386696 383291 379390 375856 372890 370038 367040 364278 362311 361290
58645 361290 360880 360490 359641 358394 357400 357246 357739 358085 357754 357013 356672 357484 359696 362956 366664 370498 374395
58628 374395 378069 381018 383234 385394 387907 390160 391237 391153 390855 391203 392407 394239 396254 397953 399258
58613 399258 400723 402811 405122 406836 407668 407860 407475 406461 405262 404528 404213 403765 403258 403511 404813 406332
58597 406332 407133 407144 406785 406288 405817 405665 405880 406155 406516 407650 410041 413266 416713 420608 425652 431791 438026
58580 438026 443466 448080 452310 456312 459747 462172 463617 464850 466867 469977 473607 477233 481250 486483
58566 486483 492994 499955 506859 514416 523952 536157 550681 566741 583666 600769 617107 631828
58554 631828 644738 656232 666554 675384 682307 687393 691014 693177 693413 691381 687335 681958 675908 669569
58540F69569o521o737o930p027p192p704q514r237r661r983j0272j0138r214p787
58526E52652o527n801n508n393n174m548l433k208j433j274j363j149l94N52R35
58511E09934L60n85q44k13M18L58N5K64Q52J132R90Q70Q11L76l83p36k74M68P83
58492E14636O87P38J162J618J722J486J223J148J264J595K376L726N277O463P313
58477E52434Q499J0377J2328J3440J3461J2760J1619J0101Q462P120O211N537
58465F72349M937M307L399K040N56m51p76p87q54r26p22j28O51J212J262R47O62
58448F87678M31k34j564l021m017m744n659o436o221m937l565k901k702k287j380
58433F38441j30J211K253K627K508K628L448M628N641O416P069P390P236P012
$$ plain form
58540 669569 663048 656311 649381 642354 635162 627458 618944 609707 600046 590063 579791 569653 560439 552652
58526 552652 546125 540324 534816 529423 524249 519701 516268 514060 512627 511353 509990 508841 508447 508999 509934
58511 509934 510294 509709 508865 508652 509070 509428 509483 509747 510599 511731 512721 513591 514402 514778 514395 513659 513385 513853 514636
58492 514636 515323 516061 517223 518841 520563 522049 523272 524420 525684 527279 529655 533381 538658 545121 552434
58477 552434 560933 571310 583638 597078 610539 623299 634918 645019 653481 660601 666812 672349
58465 672349 677286 681593 684992 687032 687588 687137 686361 685574 684720 683794 683072 682944 683595 684807 686069 687016 687678
58448 687678 688109 687875 686311 683290 679273 674529 668870 662434 656213 651276 647711 644810 642108 639821 638441
58433 638441 638311 639522 641775 644402 646910 649538 652986 657614 663255 669671 676740 684130 691366 698378
58419F98378P149P234O443M826L469L064K994K327J233O75R27J154O11l73r89
58404G39122r77o20p5O74J420J926K503L699N320O363O319N943O338P593Q847
58389G94395R378R164Q587Q096Q102Q671R244R005P667N711L834K464J722J527
58375H87567J484R59l74k067l183l155k277j229k82P65J951K874L317L662M305
58360H94317N062N625O297P479Q678Q950Q333P921Q280Q724Q499P817P215O651
58346I99848N953N465N527N876O233O970Q418J0012J0952J1371J2009J2983J3740
58333A115357J4033J4208J4513J4880J5293J5776J6045J5804J5251J4755J4229
58322A280144J3458J2812J2792J3063J2862J2304J2318J3136J3831J3774J3560
$$ plain form
58419 698378 705527 712761 719204 724030 727499 730563 733557 735884 737117 737792 738719 739873 740484 740111 739122
58404 739122 738145 737525 737450 738124 739544 741470 743973 747672 752992 759355 765674 771617 777955 785548 794395
58389 794395 803773 812937 821524 829620 837722 846393 855637 864642 872309 878020 881854 884318 886040 887567
58375 887567 889051 890010 889636 887569 884386 881231 878954 877725 877443 878208 880159 883033 886350 890012 894317
58360 894317 899379 905004 911301 918780 927458 936408 944741 952662 960942 969666 978165 985982 993197 999848
58346 999848 1005801 1011266 1016793 1022669 1028902 1035872 1044290 1054302 1065254 1076625 1088634 1101617 1115357
58333 1115357 1129390 1143598 1158111 1172991 1188284 1204060 1220105 1235909 1251160 1265915 1280144
58322 1280144 1293602 1306414 1319206 1332269 1345131 1357435 1369753 1382889 1396720 1410494 1424054
58311A424054J3988J4787J5166J5087J5259J5987J6775J7164J7422J8144J9389
58300A603222K0637K1513K2249K3153K3947K4082K3626K3330K3718K4557K5457
58289A859491K6444K7709K9183L0660L2048L3222L4047L4699L5490L6220L6424
58278B215637L6428L7390L9740M2477M4541M6146M7935M9705N0933N1962N3542
58267B716436N5589N7367N8687O0039O1811O4117O7109P0721P4397P7748Q1071
58256C445092Q4596Q7820R0420R3112R6661J00644J04276J07868J12245J17262
58246D439996J22208J27361J33775J41653J50129J58589J67201J76338J86311
58237E803561J97385K09345K21544K34109K48237K64424K81501K98654L17170
$$ plain form
58311 1424054 1438042 1452829 1467995 1483082 1498341 1514328 1531103 1548267 1565689 1583833 1603222
58300 1603222 1623859 1645372 1667621 1690774 1714721 1738803 1762429 1785759 1809477 1834034 1859491
58289 1859491 1885935 1913644 1942827 1973487 2005535 2038757 2072804 2107503 2142993 2179213 2215637
58278 2215637 2252065 2289455 2329195 2371672 2416213 2462359 2510294 2559999 2610932 2662894 2716436
58267 2716436 2772025 2829392 2888079 2948118 3009929 3074046 3141155 3211876 3286273 3364021 3445092
58256 3445092 3529688 3617508 3707928 3801040 3897701 3998345 4102621 4210489 4322734 4439996
58246 4439996 4562204 4689565 4823340 4964993 5115122 5273711 5440912 5617250 5803561
58237 5803561 6000946 6210291 6431835 6665944 6914181 7178605 7460106 7758760 8075930
58228H075930L38707L63068L89460M18732M52252M89651N29933N73872O22878
58219A2254483O76296P32371P91376Q55629R27383J009251J105562J220416J355400
58210B0928167J512172J696113J914575K173477K479741K845593L286845L819912
58202D0656595M466048N255536O220226P381818Q747942J0304685J1995246J3719589
58194A08747685J5398930J7066196J8868572K0930702K3169751K5195804K6341179
58187B55718819K5794322K2837948J7177572R216520N1877q883721j6334952k1584892
58179B83993493k4515177k5440556k4877951k3358725k1321139j9079151j6838940
58172A28561854j4726690j2809353j1112176r636371q370661p294665o381791
$$ plain form
58228 8075930 8414637 8777705 9167165 9585897 10038149 10527800 11057733 11631605 12254483
58219 12254483 12930779 13663150 14454526 15310155 16237538 17246789 18352351 19572767 20928167
58210 20928167 22440339 24136452 26051027 28224504 30704245 33549838 36836683 40656595
58202 40656595 45122643 50378179 56598405 63980223 72728165 83032850 95028096 108747685
58194 108747685 124146615 141212811 160081383 181012085 204181836 229377640 255718819
58187 255718819 281513141 304351089 321528661 330745181 330797058 321913337 305578385 283993493
58179 283993493 259478316 234037760 209159809 185801084 164479945 145400794 128561854
58172 128561854 113835164 101025811 89913635 80277264 71906603 64611938 58230147
58165E8230147n605350m942617m374047l882340l453901l079096k750282k460990
58157B7681524k206912j984956j790696j618654j465364j329959j211186j105928
58149A4967869j011179r25493q47806p76623p11095o51405n97389n48087n03069
58140H395723m62719m26702l93588l62577l34255l09124k86579k65928k47179
58131E307072k30312k14814k00471j87586j76058j65243j55106j46315j38812
58122C692355j31503j24015j17460j12629j08512j03552r7608r1695q6440q1764
58112B637177p7577p3858p0340o6889o4016o2266o1168n9512n6684n3392n0880
58101A940595m9710m9246m8300m6314m3926m2172m1247m0397l8988l7220l5580
$$ plain form
58165 58230147 52624797 47682180 43308133 39425793 35971892 32892796 30142514 27681524
58157 27681524 25474612 23489656 21698960 20080306 18614942 17284983 16073797 14967869
58149 14967869 13956690 13031197 12183391 11406768 10695673 10044268 9446879 8898792 8395723
58140 8395723 7933004 7506302 7112714 6750137 6415882 6106758 5820179 5554251 5307072
58131 5307072 5076760 4861946 4661475 4473889 4297831 4132588 3977482 3831167 3692355
58122 3692355 3560852 3436837 3319377 3206748 3098236 2994684 2897076 2805381 2718941 2637177
58112 2637177 2559600 2485742 2415402 2348513 2284497 2222231 2161063 2101551 2044867 1991475 1940595
58101 1940595 1890885 1841639 1793339 1747025 1703099 1660927 1619680 1579283 1540295 1503075 1467495
58090A467495l4035l2121k9634k6943k4641k3026k1993k1361k1248k1881k2981
58079A187631k3772k3839k3627k3742k4067k4087k3657k2891k1650j9962j8649
58068I37688j8575j9229j9072j7488j5583j4591j4375j3964j3027j2088j1673
58057G68023j1779j2167j2628j3028j3236j3059j2281j1016r890r517r700r623
58045F30099q847p757o853o124n392m844m899n712o973q029q249p581o794o747
58031E35298p353p829p888q044q524q703q072p101o519o206n563m590l973m150
58017D40783m890n707o179o042n439m941m904m950m504l660k954k460j761p25
58003C81667L27J212J914K083J247k60j393j750k034k841l739m169m498n322o253
$$ plain form
58090 1467495 1433460 1401339 1371705 1344762 1320121 1297095 1275102 1253741 1232493 1210612 1187631
58079 1187631 1163859 1140020 1116393 1092651 1068584 1044497 1020840 997949 976299 956337 937688
58068 937688 919113 899884 880812 863324 847741 833150 818775 804811 791784 779696 768023
58057 768023 756244 744077 731449 718421 705185 692126 679845 668829 658939 649422 639722 630099
58045 630099 621252 613495 606642 600518 595126 590282 585383 579671 572698 564669 556420 548839 542045 535298
58031 535298 527945 520116 512228 504184 495660 486957 478885 471784 465265 459059 453496 448906 444933 440783
58017 440783 435893 430186 424007 417965 412526 407585 402681 397731 393227 389567 386613 384153 382392 381667
58003 381667 381994 383206 385120 387203 388450 388190 386797 385047 383013 380172 376433 372264 367766 362444 356191
57988C56191o377n671m939m543m129l601l386l478l235k461j849j877k092k028
57974C06525j987k275k328j669j038j526k814l409k636j356o06m66n46o27n34
57959B82708r5L63J80n53q28j30O67M62n91j494j836k043k361k469k121j555j124
57942B67180q84o53j38Q98K307L496M060M338M893N612N794N158M208L440K723
57927C12432J679K94j120k386l542m591n314n450n020m421m145m307m610m717
57913B64782m483l802k588j124m6L91O88J324J874J591O25l7L6J56m26j472k164
57896B55325k101j445m02Q81K042K546K189J293M04j52m54q34j547k470l176l354
57880B48745l154l013l217l662m017m024l695l228k798k466k279k283k418k486
$$ plain form
57988 356191 349814 344143 339204 334661 330532 326931 323545 320067 316832 314371 312522 310645 308553 306525
57974 306525 304538 302263 299935 298266 297228 295702 292888 289479 286843 285487 284881 284415 283869 283242 282708
57959 282708 282613 282976 283156 282603 281775 281645 282312 282774 282183 280689 278853 276810 274449 271980 269859 268304 267180
57942 267180 266296 265643 265505 266403 268710 272206 276266 280604 285497 291109 296903 302061 306269 309709 312432
57927 312432 314111 314405 313285 310899 307357 302766 297452 292002 286982 282561 278416 274109 269499 264782
57913 264782 260299 256497 253909 252785 252739 253130 253818 255142 257016 258607 259232 259195 259231 259387 258961 257489 255325
57896 255325 253224 251779 251377 252258 254300 256846 259035 260328 260732 260580 260126 259292 257745 255275 252099 248745
57880 248745 245591 242578 239361 235699 231682 227658 223963 220735 217937 215471 213192 210909 208491 206005
57866B06005k340j997j446n23P80K095L039L756M667N720O331O239N930N903N873
57851B50032N222M074L338L504L857L253J500m57j714k423l395m864o057o095
57837B49775n065l951l556l724l767l385k942k774k591j838m97P46J260J099P43
57822B19533M34%p43j701k584l101l076k596j982j487j099p65o52q77j127r24
57806A97253k34N54J174J682K077K263K398K782L206K954J704M5j239j959k331
57791B12329k402k082j478p27K59J586K975L977M466M686M870N026M919M209K810
57776B45423J235K84R9n5q85k204l264l618l385l021l068l773m680m981m571m202
57760B05334m304m282l537k500j964j861j588j131r26q42k85P37J541J794J832
$$ plain form
57866 206005 203665 201668 200222 199699 200479 202574 205613 209369 214036 219756 226087 232326 238256 244159 250032
57851 250032 255254 259328 262666 266170 270027 273280 274780 274323 272609 270186 266791 261927 255870 249775
57837 249775 244710 240759 237203 233479 229712 226327 223385 220611 218020 216182 215685 216431 217691 218790 219533
57822 219533 219967 219967 219224 217523 214939 211838 208762 206166 204184 202697 201598 200833 200181 199304 198177 197253
57806 197253 197019 197573 198747 200429 202506 204769 207167 209949 213155 216109 217813 217858 216619 214660 212329
57791 212329 209927 207845 206367 205640 205899 207485 210460 214437 218903 223589 228459 233485 238404 242613 245423
57776 245423 246658 246942 247041 246986 246101 243897 240633 237015 233630 230609 227541 223768 219088 214107 209536 205334
57760 205334 201030 196748 193211 190711 188747 186886 185298 184167 183241 182399 182114 182851 184392 186186 188018
57745A88018J935K006K031K155K241K002J545J126N33n06j448j440p50n68j187
57730A97693j531q96l9J52N1M84J259J491R25N7p60j497j925j696r86m93o12j075
57712A90602j433j555j645j863k106k073j719j484j754k130j733l96J034J857
57698A73602K390L225M097M155L115J538M0j199k202k910l319l563l713l629l088
57683A68539k019o28P08J740K565L448M542N933P786J0106J2441J4386J6397J9568
57669B65512K4241K9194L2296L1665K6220J6094L101r689j9617k5773k8591k8695
57657C15958k6682k3595k0701j8518j6554j4179j1466q971o922n031l173j959
57645A58207k120l263l849k817r03L35L90N3j8L6N1K52N97N91J68n2J64K03l24
$$ plain form
57745 188018 189953 191959 193990 196145 198386 200388 201933 203059 203592 203086 201638 200198 199448 198880 197693
57730 197693 196162 195266 195227 195379 195430 195914 197173 198664 199589 199646 198886 197389 195464 193768 192782 192289 191677 190602
57712 190602 189169 187614 185969 184106 182000 179927 178208 176724 174970 172840 171107 170711 171745 173602
57698 173602 175992 179217 183314 187469 190584 192122 192162 190963 188761 185851 182532 178969 175256 171627 168539
57683 168539 166520 165892 166600 168340 170905 174353 178895 184828 192614 202720 215161 229547 245944 265512
57669 265512 289753 318947 351243 382908 409128 425222 428323 418634 399017 373244 344653 315958
57657 315958 289276 265681 244980 226462 209908 195729 184263 175292 168370 163339 160166 158207
57645 158207 156087 152824 148975 146158 145255 145590 145980 146033 146015 146051 146102 146354 146951 147542 147710 147658 147822 148025 147701
57626A47701q46q22o26p68r71p97n55o57p39k99K06mp42j135r85q15p41l21M61
57607A36545J029J047P17J63o62j490j842j742j641j606j302p73n60q94j381j637
57591A23971j643j498j266j159j337j580j585j458j386j095l38L17Q9p66j199
57576A08067q44l77l39n41p53j076j399j336q97m80r8N97J396J618J226R26R06
57559A06596N85q9k41N57J540J983K143K308J972P98m44q06l86J15L90L91Rl74
57541A17047J46J634K711K289J094M39L30%l94j01O91J038P88N55M28Q4j38L68
57523A29009J193J597K183M019O048N651K440o39j154k66l48j208q54R10K003
57508A50584J198k91q02l03K08L22M38R18J618J993J431r4j596j832p76K04kq54
$$ plain form
57626 147701 146855 146033 145407 144639 143668 142871 142316 141659 140920 140621 140827 140823 140081 138946 137961 137146 136405 136084 136545
57607 136545 137574 138621 139338 139501 138839 137349 135507 133765 132124 130518 129216 128443 127883 126989 125608 123971
57591 123971 122328 120830 119564 118405 117068 115488 113903 112445 111059 109964 109626 109943 110032 109266 108067
57576 108067 107223 106846 106507 105966 105213 104137 102738 101402 100505 100025 99927 100524 101920 103538 104764 105690 106596
57559 106596 107181 107092 106851 107408 108948 110931 113074 115382 117354 118152 117708 116902 116516 116631 117021 117412 117421 117047
57541 117047 117193 118827 121538 123827 124921 125360 125690 125690 125296 125195 125886 126924 127712 128267 128695 128779 128641 129009
57523 129009 130202 131799 133982 138001 144049 149700 152140 151501 150347 150081 149733 148525 147671 148581 150584
57508 150584 151782 151491 150689 150386 150594 150916 151354 152272 153890 155883 157314 157220 155624 153792 153016 153220 153218 152364
57490A52364r84l7R75J062M21j0K68R74J658K170K543K734K719K529K064J132
57474A72582q9q65o37K32Q65Q82N55O9o16j158r33r0K91l19r88o11M94J198J277
57455A72139J397J627J258K69k64K66J074J299J342K019L016L247K450J448Q90
57440A93477N56J11k23l6O11J258J475J188P38O50J097J619J680J371J197J269
57424B08038J231R88R17J200J488J500J533J976K676L131L091K718K287K019J951
57409B36744J802J243N03K95Q32J374J164N01K68P25J374J905K499L120L319K959
57393B60627K553K501K502K178J893K367L618M792N144M762M261M001L848L545
57379C08592L122K883L017L330L352K720J425j60j366j554o20P21J523J600J760
$$ plain form
57490 152364 151380 151343 152318 153380 153801 153791 154059 155033 156691 158861 161404 164138 166857 169386 171450 172582
57474 172582 172493 171628 170991 171223 172088 172970 173525 173594 172978 171820 170887 170797 171088 170769 169781 169170 169664 170862 172139
57455 172139 173536 175163 176421 176690 176426 176692 177766 179065 180407 182426 185442 188689 191139 192587 193477
57440 193477 194033 194144 193921 193885 194496 195754 197229 198417 199155 199805 200902 202521 204201 205572 206769 208038
57424 208038 209269 210257 211174 212374 213862 215362 216895 218871 221547 224678 227769 230487 232774 234793 236744
57409 236744 238546 239789 240292 240587 241419 242793 243957 244458 244726 245451 246825 248730 251229 254349 257668 260627
57393 260627 263180 265681 268183 270361 272254 274621 278239 283031 288175 292937 297198 301199 305047 308592
57379 308592 311714 314597 317614 320944 324296 327016 328441 328281 326915 325361 324741 325462 326985 328585 330345
57364C30345K765M294N287N266M853M817N010M714L812L042L005L465L916M342
57350C88933M905N250M848L994L685M299N031M985M260L574L197K864K427K078
57336D44330K023K335L003L805M265M125L693L406L224K936K707K862L250L469
57322D89433L561L868M238M115L559L484M535O201P363P393O537N585N301N796
57308E60969O378O267N531M903M796N054N620O689P929Q415P739O574N696N091
57294F47651M522M334M919N904O581O900P275P699P782P566P493P650P713P715
57280G41704Q089Q840R275Q941Q266P917P951P977P895Q000Q406Q821Q909Q651
57266H59642Q238P855P705Q010Q678R142Q969Q585Q871R823J0299R543Q419Q276
$$ plain form
57364 330345 333110 337404 342691 347957 352810 357627 362637 367351 371163 374205 377210 380675 384591 388933
57350 388933 393838 399088 403936 407930 411615 415914 420945 425930 430190 433764 436961 439825 442252 444330
57336 444330 446353 448688 451691 455496 459761 463886 467579 470985 474209 477145 479852 482714 485964 489433
57322 489433 492994 496862 501100 505215 508774 512258 516793 522994 530357 537750 544287 549872 555173 560969
57308 560969 567347 573614 579145 584048 588844 593898 599518 606207 614136 622551 630290 636864 642560 647651
57294 647651 652173 656507 661426 667330 673911 680811 688086 695785 703567 711133 718626 726276 733989 741704
57280 741704 749793 758633 767908 776849 785115 793032 800983 808960 816855 824855 833261 842082 850991 859642
57266 859642 867880 875735 883440 891450 900128 909270 918239 926824 935695 945518 955817 965360 973779 982055
57252I82055R114R822R984J0195J0519J0139Q956Q242Q812R681R599R003R115
57239A105236R840R967R206Q521Q502Q669Q656Q876R603J0313J0462J0202R949
57226A228002R821R774R847R875R545Q917Q519Q695R263R857J0204J0043R319
57213A351681Q555Q389Q748Q971Q799Q496Q087P357O753P189Q599R632R440Q834
57199A469530R000R843J0375J0167R576R015Q775R152R959J0329R722Q835Q751
57186A593029R510J0286J0657J0861J1026J1068J1279J2026J2861J2846J1936
57175A717385J1161J1197J1565J1609J1459J1483J1410J0704R528Q736Q897R743
57163A844877J0541J0776J0459R857R126Q331P870Q380R851J1131J1039R889R197
$$ plain form
57252 982055 991169 1000991 1010975 1021170 1031689 1041828 1050784 1059026 1067838 1077519 1087118 1096121 1105236
57239 1105236 1115076 1125043 1134249 1142770 1151272 1159941 1168597 1177473 1187076 1197389 1207851 1218053 1228002
57226 1228002 1237823 1247597 1257444 1267319 1276864 1285781 1294300 1302995 1312258 1322115 1332319 1342362 1351681
57213 1351681 1360236 1368625 1377373 1386344 1395143 1403639 1411726 1419083 1425836 1433025 1441624 1451256 1460696 1469530
57199 1469530 1478530 1488373 1498748 1508915 1518491 1527506 1536281 1545433 1555392 1565721 1575443 1584278 1593029
57186 1593029 1602539 1612825 1623482 1634343 1645369 1656437 1667716 1679742 1692603 1705449 1717385
57175 1717385 1728546 1739743 1751308 1762917 1774376 1785859 1797269 1807973 1817501 1826237 1835134 1844877
57163 1844877 1855418 1866194 1876653 1886510 1895636 1903967 1911837 1920217 1930068 1941199 1952238 1962127 1971324
57150A971324R754J0757J1157J1038J1124J1506J1629J1267J0792J0543J0489
57139B091380J0521J0641J0866J1212J1749J2368J2718J2787J3257J4766J6925
57128B229190J8773K0187K2091K5115K8726L2078L5041L7946M0865M3889M7634
57117B581535N2719N8871O5255P1694P8863Q7318R6996J07863J20366J35050J52294
57106C608824J72790J97679K27818K63482L05360L55383M16057M89344N76773
57097F613510O80219Q01477R40963J097329J268041J449176J634323J814459J979622
57088A8279119K120520K228544K295309K313330K277091K182657K025825J801261
57080C5523656J504969J139595P19006K67832j84874o13625j000678j335133j610423
$$ plain form
57150 1971324 1981078 1991835 2002992 2014030 2025154 2036660 2048289 2059556 2070348 2080891 2091380
57139 2091380 2101901 2112542 2123408 2134620 2146369 2158737 2171455 2184242 2197499 2212265 2229190
57128 2229190 2247963 2268150 2290241 2315356 2344082 2376160 2411201 2449147 2490012 2533901 2581535
57117 2581535 2634254 2693125 2758380 2830074 2908937 2996255 3093251 3201114 3321480 3456530 3608824
57106 3608824 3781614 3979293 4207111 4470593 4775953 5131336 5547393 6036737 6613510
57097 6613510 7293729 8095206 9036169 10133498 11401539 12850715 14485038 16299497 18279119
57088 18279119 20399639 22628183 24923492 27236822 29513913 31696570 33722395 35523656
57080 35523656 37028625 38168220 38887226 39155058 38970184 38356559 37355881 36020748 34410325
57071C4410325j823091j972467k059971k088831k064918j997233j896455j772903
57063A8734456j636038j494848j357045j227342j107245r96891q96584q06635
57055I211828p26709o56036n93822n39026m90177m45927m05681l69335l36546
57046D648569l06596k78825k52863k28422k04947j81696j58619j37588j22520
57037B776493j17041j21119j30076j37521j39411j35497j27674j17834j07157
57028A643163r6349q5966p6572o8722o2548n7382n2264m6984m2253l8647l5842
57017I79634l3269l1000k9404k8205k6692k4829k3411k2859k2508k1479j9783
57006F96195j8095j6780j5750j5006j4746j4874j4938j4564j3680j2357j0816
$$ plain form
57071 34410325 32587234 30614767 28554796 26465965 24401047 22403814 20507359 18734456
57063 18734456 17098418 15603570 14246525 13019183 11911938 10915047 10018463 9211828
57055 9211828 8485119 7829083 7235261 6696235 6206058 5760131 5354450 4985115 4648569
57046 4648569 4341973 4063148 3810285 3581863 3376916 3195220 3036601 2899013 2776493
57037 2776493 2659452 2538333 2408257 2270736 2131325 1995828 1868154 1750320 1643163
57028 1643163 1546814 1460848 1384276 1315554 1253006 1195624 1143360 1096376 1054123 1015476 979634
57017 979634 946365 915365 885961 857756 831064 806235 782824 759965 737457 715978 696195
57006 696195 678100 661320 645570 630564 615818 600944 586006 571442 557762 545405 534589
56995E34589r532q832q349p354n711l969k495j062M93J873K853L626M126L596
56981E03852J421j888n124p529r066r846j0038j0063j0237j0233r457p898o074
56968D07820m242k308m96P34J535K730M659O612P800Q365Q853R109Q282N845K157
56953D67455j947n788r054j1644j3412j4098j3603j2237j0557q837o995n031l169
56940C51083j453M04K556M772O888R179J1831J4253J5395J4718J2440Q946M395
56927D55407r01o132j0380j3325j5310j6705j7403j7170j6269j5393j4831j4095
56915B97493j2614j0588q748p415o273n026l845l058k719k626k423j753o53K00
56901B29952J41n10p53k95J01l6J00J550M052O331P617Q218Q746R428J0155J0566
$$ plain form
56995 534589 525057 516225 507876 500522 494811 490842 488347 487285 487778 489651 492504 496130 500256 503852
56981 503852 505273 503385 498261 490732 481666 471820 461782 451719 441482 431249 421792 413894 407820
56968 407820 403578 401270 400774 401508 403043 405773 410432 417044 424844 433209 442062 451171 459453 465298 467455
56953 467455 465508 459720 450666 439022 425610 411512 397909 385672 375115 366278 359283 354252 351083
56940 351083 349630 350034 352590 357362 364250 373429 385260 399513 414908 429626 442066 451012 455407
56927 455407 454506 448374 437994 424669 409359 392654 375251 358081 341812 326419 311588 297493
56915 297493 284879 274291 265543 258128 251855 246829 242984 239926 237207 234581 232158 230405 229752 229952
56901 229952 230093 229583 228830 228535 228636 228600 228700 230250 234302 240633 248250 256468 265214 274642 284797 295363
56885B95363J0126Q570O251L660P63k601n792p606p551o295m699l019j274L08
56871B86204J625L028M796O716Q585J0788J3819J7423K0715K3084K4468K4778
56859D46029K3508K0110J4547P447j02o866j1934j5043j6427j6357j5004j2712
56847D17196j0020p197l949J11M715R027J2566J5856J9932K5243L1170L6534M0285
56834E91469M1598L9698L4015K4652J2554q02j3826k5026l3176l7623l8472l6445
56822E58616l2512k7633k2642j8074j3961r888n442o15M297R125J3961J8805K3250
56809D97287K6640K8364K7803K4260J7440Q043k400j2425k1104k7724l1588l2535
56797E02061l1338k9151k6603k3678k0321j6797j3398j0181p031l809m21L049
$$ plain form
56885 295363 305489 314059 320310 323970 324733 322132 316340 308734 301183 294888 290189 287170 285896 286204
56871 286204 287829 290857 295653 302369 310954 321742 335561 352984 373699 396783 421251 446029
56859 446029 469537 489647 504194 511641 511539 504673 492739 477696 461269 444912 429908 417196
56847 417196 407176 399979 396030 396141 400856 409883 422449 438305 458237 483480 514650 551184 591469
56834 591469 633067 672765 706780 731432 743986 743184 729358 704332 671156 633533 595061 558616
56822 558616 526104 498471 475829 457755 443794 433906 428464 427849 432146 441271 455232 474037 497287
56809 497287 523927 552291 580094 604354 621794 629837 627437 615012 593908 566184 534596 502061
56797 502061 470723 441572 414969 391291 370970 354173 340775 330594 323563 319754 319333 322382
56785C22382O308R059J1274J2998J3933J3324J0442N197j560q265j3462j6673
56773C64957j8422j9357j9519j8764j7462j6223j5041j3387j1264r485q604q145
56761A89284p388o489o112o144n601m057k466k048k701l198k882k404k533k860
56747A32401k395j124j84l44j069j394j166r15r35j080j261j512j669j455r02
56732A14996k72M07J221J904K011J610J223R90M34n83j321j038l4O79O65M58P05
56715A24055J241J290M03r12j594j052K51J270J406R96Q20J308K094K318J452
56700A35346l1j007r09k98j7q3M8M65P12O37N39M21j12r39j142j41J378K124J557
56681A38548K29q80j112n66j1j11n65m22O09J709K014J511N95n02j357j242j21
$$ plain form
56785 322382 328690 337749 349023 362021 375954 389278 399720 404917 403357 395092 381630 364957
56773 364957 346535 327178 307659 288895 271433 255210 240169 226782 215518 206033 197429 189284
56761 189284 181896 175407 169295 163151 157550 153493 151027 148979 146278 143080 140198 137794 135261 132401
56747 132401 130006 128882 128698 128354 127285 125891 124725 123810 122875 121795 120534 119022 117353 115898 114996
56732 114996 114724 115131 116352 118256 120267 121877 123100 124090 124524 123941 122620 121582 121548 122227 122892 123350 124055
56715 124055 125296 126586 126989 126077 124483 123431 123682 124952 126358 127354 128174 129482 131576 133894 135346
56700 135346 135315 134308 133399 133101 133084 133001 133049 133514 134226 134863 135402 135823 135711 134772 133630 133489 134867 136991 138548
56681 138548 138777 137897 136785 136219 136208 136097 135532 135110 135719 137428 139442 140953 141548 141046 139689 138447 138326
56664A38326P97M60n10o51K68J032Q07J03k43j40M2K03M56P62R95J107J062Q23
56646A45699M80J61j76n60p54n46k26k90p32j094j212j303j312q29R0O63L17n73
56628A37803j217j275q73o6J079K132K410J620K36q12q47n3O12L25p20j542j459
56611A37353p30r2jl58p26o65j27L96L42k78q92r98n48J99Q60J098R50Q84J147
56592A37814J234O22j89k14M79O90j71j246j591j422j382j373r85m84l67l32K95
56575A31378J357J987J925J827K139K531K645K690K903L011K652K032J782K336
56561A63195L626N207O499P030O622N274L054K58k341l823l845k926j957j557
56547A84316j833k457k930k916k455j846j365j131j129j191j106q37n81m34k54
$$ plain form
56664 138326 139123 139583 139073 138422 138690 139722 140529 140632 140389 140249 140291 140494 140950 141712 142707 143814 144876 145699
56646 145699 146179 146340 146164 145604 144850 144304 144078 143788 143056 141962 140750 139447 138135 137306 137396 138059 138376 137803
56628 137803 136586 135311 134438 134372 135451 137583 139993 141613 141849 141037 140190 140137 140749 141074 140354 138812 137353
56611 137353 136623 136531 136530 136172 135446 134781 134654 135050 135392 135114 134222 133224 132676 132875 133735 134833 135783 136667 137814
56592 137814 139048 139670 139481 139267 139746 140436 140265 139019 137428 136006 134624 133251 132266 131782 131415 131083 131378
56575 131378 132735 134722 136647 138474 140613 143144 145789 148479 151382 154393 157045 159077 160859 163195
56561 163195 166821 172028 178527 185557 192179 197453 200507 200765 198424 194601 190756 187830 185873 184316
56547 184316 182483 180026 177096 174180 171725 169879 168514 167383 166254 165063 163957 163120 162539 162105 161851
56532A61851O3L64N24O76Q85Q98N62J99J36J07l27r20r66l38L19M57J84j91n00
56513A63983n27p3N19N05k51r28q33l44k47n62o52l07or2k87j97O5J28l6k7M09
56492A60240R36R89N31J81L73O90M62j72l70J29N45K66j57J53R98J314P20pj40
56473A67681M1j03m83m47J89Q01P76L23J84O80J361J640J585J711K091K068J198
56456A81296J5n27k89p3m71j094j190o49nL45M91O21O73N32L64M40P17P37J41
56437A82074p35j007j88J103J665J018q2n40j18N22P23M03j61p06r93p91o5Q86
56419A83008J601J704J099J34m53j63N98Q30J46p25r22n42k73k45O7Q33J492J529
56401A89718J088N39j7m59l50N06J470J625R05J46M7M57Q06Q28O81O18P83J149
$$ plain form
56532 161851 161914 162278 162802 163478 164363 165261 165823 166022 166158 166265 165938 165018 164052 163714 164033 164490 164674 164483 163983
56513 163983 163456 163383 163902 164407 164156 163228 162395 162051 161804 161242 160590 160283 160277 160185 159898 159701 159766 159894 159858 159831 160240
56492 160240 161176 162165 162696 162877 163250 163940 164402 164230 163860 163989 164534 164800 164643 164796 165794 167108 167828 167821 167681
56473 167681 167722 167619 167136 166689 166878 167679 168455 168778 168962 169642 171003 172643 174228 175939 178030 180098 181296
56456 181296 181311 180784 180495 180422 179951 178857 177667 177018 177013 177358 177849 178470 179143 179675 180039 180479 181196 181933 182074
56437 182074 181339 180332 180144 181247 182912 183930 183848 183308 183190 183712 184435 184838 184677 183971 182978 182187 182122 183008
56419 183008 184609 186313 187412 187546 187093 186930 187528 188358 188504 187779 186857 186315 186042 185797 185864 186697 188189 189718
56401 189718 190806 191345 191328 190869 190519 191025 192495 194120 195025 195171 195218 195675 196481 197309 197990 198608 199391 200540
56383B00540J565J870K012K011J814J357P64K41j73n65q31o91j13N55J034J422
56367B12812J834J992J573Q31M66Q36J541J941J777J214N47P8M0L88P53R18J143
56350B30684J728K297K123J246O65J077J826J722O33l83n20r4K52N29J125J959
56334B46869K462K312J763J267J069J189J518J882K186K490K823L006K816K282
56320B75934J656J148P91N33K90Jk98m60m08k01J49O97J354J855K167K598L226
56303B91032L583L250K521J978J656J248R88J528K819L854L809L018K411K472
56289C26167K998L548L741L445L052L266M260N233N247M396L744M109N278O445
56275C84929P061P153P038O965P027P354Q193R609J1169J2233J2707J3248J4478
$$ plain form
56383 200540 202105 203975 205987 207998 209812 211169 211933 212174 212001 211436 210605 209914 209801 210356 211390 212812
56367 212812 214646 216638 218211 219042 219508 220344 221885 223826 225603 226817 227364 227442 227482 227870 228623 229541 230684
56350 230684 232412 234709 236832 238078 238743 239820 241646 243368 244001 243618 243098 243004 243256 243785 244910 246869
56334 246869 249331 251643 253406 254673 255742 256931 258449 260331 262517 265007 267830 270836 273652 275934
56320 275934 277590 278738 279529 280062 280352 280353 280055 279595 279187 278986 279135 279832 281186 283041 285208 287806 291032
56303 291032 294615 297865 300386 302364 304020 305268 306256 307784 310603 314457 318266 321284 323695 326167
56289 326167 329165 332713 336454 339899 342951 346217 350477 355710 360957 365353 369097 373206 378484 384929
56275 384929 391990 399143 406181 413146 420173 427527 435720 445329 456498 468731 481438 494686 509164
56262E09164J6243J7862J9041K0166K1845K4334K7490L1038L4895L9235M4189
56251H05502M9469N4604N9620O5094P1215P7162Q1881Q5219Q7639Q9017Q8483
56240A614905Q5588Q0790P4421O5908N4733M1716K8465J5639K612j0999k4240
56229B029538l5730m5124n3077n9964o5347o8763p0453p1007p0685o9392o7171
56218A352825o4312o1074n7620n4218n1167m8435m5628m2470l9152l6065l3404
56207H19280l1174k9329k7641k5561k2704j9446j6691j4853j3392j1618r658q161
56195E89052p272o443n379m555m461m738m575l769k878k330j948j426q00k19L78
56180E38637J039J590J870K012K169K216K063K016K418L133L720M056M367M663
$$ plain form
56262 509164 525407 543269 562310 582476 604321 628655 656145 687183 722078 761313 805502
56251 805502 854971 909575 969195 1034289 1105504 1182666 1264547 1349766 1437405 1526422 1614905
56240 1614905 1700493 1781283 1855704 1921612 1976345 2018061 2046526 2062165 2064777 2053778 2029538
56229 2029538 1993808 1948684 1895607 1835643 1770296 1701533 1631080 1560073 1489388 1419996 1352825
56218 1352825 1288513 1227439 1169819 1115601 1064434 1015999 970371 927901 888749 852684 819280
56207 819280 788106 758777 731136 705575 682871 663425 646734 631881 618489 606871 597213 589052
56195 589052 581780 575337 569958 565403 560942 556204 551629 547860 544982 542652 540704 539278 538478 538259 538637
56180 538637 539676 541266 543136 545148 547317 549533 551596 553612 556030 559163 562883 566939 571306 575969
56166E75969M641M264M033M483N584O814P676Q095Q426R200J0661J2521J4237
56153F76604J5606J7010J9151K2598K7506L3560M0240M7198N4250O0917O6177
56142A080817O8940O8586O4970N8365M9843M1376L4807L0673K8434K7474K7169
56131A581454K6210K3076J7567J1237N881K210R1r04j876m755j1016k0312l0851
56118A598012m0766m8670n3461n4632n2863m9534m5489m0776l5525l0414k6049
56107A119833k2360j8919j5509j2214r201o640m638l086j751n96J63N09R38K046
56093A028575L741N119N367M819M810O194Q233R433R406R243R846J0661J0694
56080A126141J0253J0670J2368J4153J4738J4314J4088J4691J5626J6165J6236
$$ plain form
56166 575969 580610 584874 588907 593390 598974 605788 613464 621559 629985 639185 649846 662367 676604
56153 676604 692210 709220 728371 750969 778475 812035 852275 899473 953723 1014640 1080817
56142 1080817 1149757 1218343 1283313 1341678 1391521 1432897 1467704 1498377 1526811 1554285 1581454
56131 1581454 1607664 1630740 1648307 1659544 1665425 1667635 1667726 1666822 1664946 1660191 1649175 1628863 1598012
56118 1598012 1557246 1508576 1455115 1400483 1347620 1298086 1252597 1211821 1176296 1145882 1119833
56107 1119833 1097473 1078554 1063045 1050831 1041630 1034990 1030352 1027266 1025515 1024919 1025082 1025591 1026529 1028575
56093 1028575 1032316 1037435 1042802 1047621 1052431 1058625 1066858 1076291 1085697 1094940 1104786 1115447 1126141
56080 1126141 1136394 1147064 1159432 1173585 1188323 1202637 1216725 1231416 1247042 1263207 1279443
56069A279443J6271J6572J7080J7622J8095J8402J8481J8499J8892J9992K1670
56058A481019K3415K4720K5329K5292K5066K5375K6590K8216K9326K9585K9562
56047A773495K9953L0778L1507L1741L1554L1344L1440L1779L2024L2096L2486
56036B120197L3740L5762L8091M0723M4050M7901N1323N3627N5117N6480N7922
56025B634933N9324O0810O2671O4942O7450P0169P3194P6560Q0187Q3879Q7352
56014C421471R0570R3999R8075J02423J06250J09604J13498J18570J24356J30256
56004D509072J36431J43265J50655J58492J67129J76732J86734J96641K06896
55995F032047K18292K30896K44235K58159K72966K89030L06861L27070L49800
$$ plain form
56069 1279443 1295714 1312286 1329366 1346988 1365083 1383485 1401966 1420465 1439357 1459349 1481019
56058 1481019 1504434 1529154 1554483 1579775 1604841 1630216 1656806 1685022 1714348 1743933 1773495
56047 1773495 1803448 1834226 1865733 1897474 1929028 1960372 1991812 2023591 2055615 2087711 2120197
56036 2120197 2153937 2189699 2227790 2268513 2312563 2360464 2411787 2465414 2520531 2577011 2634933
56025 2634933 2694257 2755067 2817738 2882680 2950130 3020299 3093493 3170053 3250240 3334119 3421471
56014 3421471 3512041 3606040 3704115 3806538 3912788 4022392 4135890 4254460 4378816 4509072
56004 4509072 4645503 4788768 4939423 5097915 5265044 5441776 5628510 5825151 6032047
55995 6032047 6250339 6481235 6725470 6983629 7256595 7545625 7852486 8179556 8529356
55986H529356L74655M01509M30863M63064M98104N36610N80049O29207O83541
55977A3126958P42831Q08498Q82352R65315J058571J164865J287252J427549J587598
55968B3051789J771346J984463K233076K524728K869995L281908L775144M368030
55960D5860479N085031N956235P015636Q300992R852618J1708544J3898558J6435631
55952A24113724J9293107K2361370K5396387K7978860K9500157K9213818K6416850
55945C04274273K0767010J2589292K932876o734571j5040172k1121280k4746326
55938B72921102k6174921k5919744k4541798k2525452k0229677j7893666j5665619
55931A19970225j3628741j1818983j0241104q883486p726468o745037n912008
$$ plain form
55986 8529356 8904011 9305520 9736383 10199447 10697551 11234161 11814210 12443417 13126958
55977 13126958 13869789 14678287 15560639 16525954 17584525 18749390 20036642 21464191 23051789
55968 23051789 24823135 26807598 29040674 31565402 34435397 37717305 41492449 45860479
55960 45860479 50945510 56901745 63917381 72218373 82070991 93779535 107678093 124113724
55952 124113724 143406831 165768201 191164588 219143448 248643605 277857423 304274273
55945 304274273 325041283 337630575 340563451 333828880 318788708 297667428 272921102
55938 272921102 246746181 220826437 196284639 173759187 153529510 135635844 119970225
55931 119970225 106341484 94522501 84281397 75397911 67671443 60926406 55014398
55924E5014398n202452m595564m073689l621902l228498k884453k582371k316549
55916B6508920k083011j877941j696602j534807j390446j262248j147891j044854
55908A4471120r52278q70175p97217p30908o69728o13503n61864n13920m69530
55899H291997m29452l94000l62671l35280l12248k93445k77700k63659k50357
55890E373185k36894k22599k07855j93863j81329j69974j59493j50036j41469
55881C709673j33073j24479j16225j08866j02227r6053r0913q7651q6186q5322
55871B678678q3732q0793p6668p1969o7304o2882n8617n4647n1606n0133n0198
55860A970129n1041n1742n1779n1157n0105m8676m6700m4243m1916m0393l9613
$$ plain form
55924 55014398 49811946 45216382 41142693 37520791 34292293 31407840 28825469 26508920
55916 26508920 24425909 22547968 20851366 19316559 17926113 16663865 15515974 14471120
55908 14471120 13518842 12648667 11851450 11120542 10450814 9837311 9275447 8761527 8291997
55899 8291997 7862545 7468545 7105874 6770594 6458346 6164901 5887201 5623542 5373185
55890 5373185 5136291 4913692 4705837 4511974 4330645 4160671 4001178 3851142 3709673
55881 3709673 3576600 3452121 3335896 3227030 3124803 3028750 2937837 2850186 2764000 2678678
55871 2678678 2594946 2514153 2437485 2365516 2298212 2235330 2176713 2122066 2070460 2020327 1970129
55860 1970129 1919088 1867346 1815567 1764410 1714305 1665629 1618929 1574686 1532770 1492377 1452764
55849A452764l8826l7554l6108l4945l3872l2301l0157k8103k6771k6052k5257
55838A102818k3883k2025k0206j8889j8170j7802j7449j6926j6263j5570j4875
55827I00760j4139j3431j3024j3198j3900j4739j5378j5851j6325j6623j6260
55816G37892j5087j3711j2878j2583j2078j0916r635r101r366r554q894p510o141
55803F00438n340n103n006m581l716k852k624l113l622l337k076k32J819M050
55789E64705O565R177J1128J1293Q940M506o35n343r356j2638j4539j4193j1541
55776E48069p453k828J925O467R919J0902Q154J385q053j7414k3959k6477k5624
55763D75013k2951j9738j6491j3170r830p071n585n226m997m334l855m398n726
$$ plain form
55849 1452764 1413938 1376384 1340276 1305331 1271459 1239158 1209001 1180898 1154127 1128075 1102818
55838 1102818 1078935 1056910 1036704 1017815 999645 981843 964394 947468 931205 915635 900760
55827 900760 886621 873190 860166 846968 833068 818329 802951 787100 770775 754152 737892
55816 737892 722805 709094 696216 683633 671555 660639 651004 641903 632537 622983 614089 606579 600438
55803 600438 595098 589995 584989 580408 576692 573840 571216 568103 564481 561144 559068 558836 560655 564705
55789 564705 571270 580447 591575 602868 611808 616314 615679 610336 600980 588342 573803 559610 548069
55776 548069 540616 537788 539713 546180 556099 567001 575155 576540 568487 551073 527114 500637 475013
55763 475013 452062 432324 415833 402663 392833 385762 380177 374951 369954 365620 361765 357367 351641
55750C51641o908p609q115q361p865o728n808n631n858n988n862n319m118k594
55736B64877j737k115l183l940l887l097j952j067j015j712k507l029l464l885
55722B28287m013l865l868l917l177j393L44Q89M73J35L13P95J404J833J272o25
55706B14887k709l396k701k155k676l550l797l461l118k917k701k511k395k125
55692A74675j578j082j014j290j635k017k474k723k430j759j222r56n70J89R55
55677A55069J141O78L9l96o47p53n33J1L32j10j000j398r03l8N54Q13Q80O33O1
55658A54433k88J73J252K160K337J794Q07l03j191j707k064k482k754k479j652
55643A48036o54K16Q70J141P79k17j471k476k876k652k207k141k696l575m399
$$ plain form
55750 351641 344733 337124 329009 320648 312783 306055 300247 294616 288758 282770 276908 271589 267471 264877
55736 264877 263140 261025 257842 253902 250015 246918 244966 243899 242884 241172 238665 235636 232172 228287
55722 228287 224274 220409 216541 212624 209447 208054 208398 209287 209760 209895 210208 211003 212407 214240 215512 214887
55706 214887 212178 208782 206081 203926 201250 197700 193903 190442 187324 184407 181706 179195 176800 174675
55692 174675 173097 172015 171001 169711 168076 166059 163585 160862 158432 156673 155451 154495 153925 154114 155069
55677 155069 156210 156888 156927 156531 155884 155131 154598 154609 154941 154831 153831 152433 151530 151492 152046 152859 153739 154372 154433
55658 154433 154145 154318 155570 157730 160067 161861 162668 162365 161174 159467 157403 154921 152167 149688 148036
55643 148036 147382 147598 148468 149609 150388 150171 148700 146224 143348 140696 138489 136348 133652 130077 125678
55628A25678m966m957l904j933q4O90O00N10O42N01r9o91q89q34p86q67j205j822
55610A05584k296k108j450j048j143j248j069j003j382j865j979j798j659j572
55596H3964j361j083r06p41l94L5K03k5l93n29k95J40N96J145J923K579K444J540
55578H8842R71J617K893L556L549L853M579M517L087J428O94L15r29k769l762
55563A12441l432k809k788l075l127l127l513m088m208l544k400j409j055j251
55549G2615j385j057o99r67j567j430k27J015J295R51R45J369J488J023M35n2
55533G3752p58j645j930j155j9M75K63K5J08L56P32J303J657J171k9j090j593
55516G1623j918k224j970r97k71p17j814k258j745j132j038j164j130j077j146
$$ plain form
55628 125678 120712 115755 111851 109918 109834 110524 111124 111634 112276 112777 112678 111987 111098 110264 109478 108611 107406 105584
55610 105584 103288 101180 99730 98682 97539 96291 95222 94219 92837 90972 88993 87195 85536 83964
55596 83964 82603 81520 80614 79873 79479 79514 79717 79692 79299 78770 78475 78615 79211 80356 82279 84858 87302 88842
55578 88842 89813 91430 94323 97879 101428 105281 109860 114377 117464 118892 119586 119901 118972 116203 112441
55563 112441 109009 106200 103412 100337 97210 94083 90570 86482 82274 78730 76330 74921 73866 72615
55549 72615 71230 70173 69474 68507 66940 65510 65283 66298 67593 68544 69489 70858 72346 73369 73804 73752
55533 73752 72994 71349 69419 68264 68245 68720 68983 69008 69116 69472 70204 71507 73164 74335 74306 73216 71623
55516 71623 69705 67481 65511 64514 64243 63526 61712 59454 57709 56577 55539 54375 53245 52168 51022
55501E1022j108q23n64n50n66l52J9L88O86P21K17o31j037n29M03Q77O43J19k83
55482D8652n06n76m03J9M65N73K00l26l63L25J078R87O8o80n84j02J1k15k29J0
55462D8404j9n22j082j227q97k47N65J251J479J234Q48N13L5p22j434j642j326
55445D5211q68m59M6O87J092Q90K60k52l82l43l46l11j63o2j14j13J27M19M96
55426D5815M41M68M37J28j76M4O61Q64K02p24r78l68L94M89k42j179j475q68R0
55407D4023O81P47N40J20o10j400j706j346n91L24J259J774J406M43j95p1L42
55390D5740N42O01O44M67K5l51o48j295k204k450j530k96J62r0k85k35k52k38
55372C8307J22N59N37J67qMk00n01m05q1j68o22o97k48K3j39NR24J898K034J543
$$ plain form
55501 51022 49914 49091 48527 47977 47411 47059 47078 47466 48152 48873 49090 48459 47422 46893 47296 48173 48816 48935 48652
55482 48652 48146 47570 47167 47186 47651 48224 48424 48098 47735 48060 49138 50125 50193 49513 48929 48827 48838 48623 48394 48404
55462 48404 48385 47863 46781 45554 44657 44410 44975 46226 47705 48939 49787 50300 50335 49613 48179 46537 45211
55445 45211 44343 43884 43930 44617 45709 46599 46859 46607 46225 45882 45536 45225 45062 45000 44886 44773 44900 45319 45815
55426 45815 46256 46724 47161 47289 47113 47157 47818 48682 48884 48160 47182 46814 47208 47697 47455 46276 44801 43933 44023
55407 44023 44704 45451 45991 46111 45501 44101 42395 41049 40458 40782 42041 43815 45221 45664 45469 45398 45740
55390 45740 46282 46883 47527 47994 48019 47668 47020 45725 43521 41071 39541 39245 39407 39317 39032 38797 38545 38307
55372 38307 38429 38988 39525 39692 39684 39688 39488 38987 38582 38501 38333 37711 37014 36766 36789 36650 36655 37579 39477 41511 43054
55351D3054J249J304J084K38q05j419j454j232j008o39J10R70J218O19o7L4P98
55334D4054J374J337R04K29p42j670j926j528j141j043q22k80J49K66M93R84J160
55317D1798O84J51Q2Op02j578j638q46j05Mk30l53k78j31j13m53j019j170m96
55298C3613N33J183J450J721J740R02m30r35m1J169J294K87p59j054p45l33l3
55281C9562K22M72O26N81M05K85K45J7n99j314j610j342q54m45r7K78O37R34J109
55262C9112R18J75p30j009m54K06K15k78n95m05J61R98J962K438J760K16r46q30
55244D2914O9O04L43k13n87q53j108j032l93L41M26j39n90m25l3o4n24r37j004
55225C6795p31r0Q30J485J286M70n4J17L76J37k97l23o5n9k46k7P15J337J361
$$ plain form
55351 43054 44303 45607 46691 46929 46124 44705 43251 42019 41011 40372 40482 41452 42670 43289 43222 43256 44054
55334 44054 45428 46765 47669 47898 47156 45486 43560 42032 40891 39848 39026 38746 38895 39161 39654 40638 41798
55317 41798 42482 42633 42715 42721 42019 40441 38803 37957 37852 37856 37626 37273 36995 36864 36751 36298 35279 34109 33613
55298 33613 34146 35329 36779 38500 40240 41142 40712 39777 39736 40905 42199 42486 41727 40673 39928 39595 39562
55281 39562 39784 40256 40882 41463 41868 42153 42398 42415 41816 40502 38892 37550 36696 36251 36154 36432 37069 38003 39112
55262 39112 40030 40205 39475 38466 38012 38218 38433 38155 37560 37155 37316 38314 40276 42714 44474 44690 43744 42914
55244 42914 42983 43587 43930 43717 43130 42277 41169 40137 39744 40085 40511 40372 39782 39357 39324 39260 38736 37799 36795
55225 36795 36064 35974 36804 38289 39575 40045 39991 40108 40484 40621 40324 40001 39936 39877 39631 39604 40319 41656 43017
55206D3017J017P01L83j04o25r23r60q06m69p6O7r5j56J50M41K15l30m88k4N43
55186D1478O94N00L56M64P40R45Q40M13K8J14N89Q96O60Q1l72m48k10Q6J33j39
55166D7848l98k70J48M68O74J054J446J216K58n62n14K2K16k7k07k06l68p32r76
55147D9090j084j293j388p80M69J414J375P21J90j2m0J42N53Q02M68k45p53q59
55129D8770q13p53m98O1P10J120J094O10o2l96m3O84J099Q65K96j36k19qL03K93
55109E2977m42j690k499k055o39O36R96O28J10l19o22n35J78J138J519J036L31
55092E0748R2J68l2m47l60M97J353J280L51m76n03JK87L3l57l09K64Q68R98O46
55072E5102K46J70M25P29P53L31l74r01r31o74o71j111j543j399o08M03J148J364
$$ plain form
55206 43017 44034 44735 45118 45014 44389 43466 42506 41700 41231 41155 41222 41127 40971 41121 41562 41777 41447 40959 40935 41478
55186 41478 42172 42672 43028 43492 44232 45177 46017 46430 46458 46572 47161 48057 48717 48798 48426 47978 47768 47854 47987 47848
55166 47848 47450 47180 47328 47796 48470 49524 50970 52186 52444 51882 51368 51390 51606 51579 51372 51166 50798 50066 49090
55147 49090 48006 46713 45325 44545 45014 46428 47803 48524 48714 48702 48662 48804 49357 50159 50627 50382 49629 48770
55129 48770 47957 47204 46706 46767 47477 48597 49691 50301 50239 49843 49800 50484 51583 52448 52744 52608 52389 52381 52684 52977
55109 52977 52535 50845 48346 46291 45652 46288 47284 47912 48022 47703 47081 46546 46724 47862 49381 50417 50748
55092 50748 50840 51008 50976 50529 50169 50666 52019 53299 53650 53174 52671 52672 52959 52992 52635 52326 52590 53458 54456 55102
55072 55102 55348 55518 55943 56672 57425 57756 57382 56481 55550 54876 54205 53094 51551 50152 49544 49947 51095 52459
55054E2459R91J65p35j203r51k01M63N86K19k73o28p81n93R9J031J453Q99j74
55036E2826r23j065r06o66l45j79n35j188j357p29J24N63O53P36Q17P89Q39J082
55018E0536J134O45r0n12n96o83p97o99m34k02J52Q05J287R45J01j31N87J269
55000E3317J032K93m4j7l74j209j685j152M2J026J295R92N33J72j70o26j005q26
54982E1594P5J167J717J569J165Q39N06Q3k29l01l99q19j296j226m62M37Q57P93
54964E6070O28N02K62m8r9K26N56N21K84K67M90N57K53k07n97j024j575j903j464
54945E3699k38J037J455P70l91j124j056n32p0K29N75R72J062O16q3n05m28j11
54927E5877N7p%M12J138J646J553J154J116J621K128K161J957K026K340K396K054
$$ plain form
55054 52459 53450 53615 52880 51677 50726 50525 50988 51574 51793 51520 50892 50111 49518 49617 50648 52101 53000 52826
55036 52826 51903 50838 49932 49266 48921 48742 48207 47019 45662 44933 45057 45620 46273 47009 47826 48615 49454 50536
55018 50536 51670 52315 52225 51713 51117 50434 49637 48938 48504 48302 48454 49259 50546 51491 51592 51461 52048 53317
55000 53317 54349 54642 54598 54581 54207 52998 51313 50161 50203 51229 52524 53516 54049 54221 54051 53425 52420 51594
54982 51594 51669 52836 54553 56122 57287 58126 58632 58715 58486 58185 57786 56967 55671 54445 53983 54420 55277 56070
54964 56070 56698 57200 57462 57414 57315 57541 58097 58618 58902 59169 59659 60216 60469 60262 59665 58641 57066 55163 53699
54945 53699 53461 54498 55953 56723 56332 55208 54152 53620 53550 53779 54354 55326 56388 57004 56921 56416 55988 55877
54927 55877 55934 55927 55927 56339 57477 59123 60676 61830 62946 64567 66695 68856 70813 72839 75179 77575 79629
54910G9629J781J967K322K247J521M43o15j470k089k489k709k740k498k046j705
54895G1549j755k030k082j761j361j084p14m5O18P77M65K54M92Q96J025Q40N63
54878F6647K18l08q71j027n10M80J529K382K983L323L457L554L746L886L569K523
54862I5581R49n71j560k024k391k989l632l791l224k352j857j912k096k066j993
54847F4072k060j929j222l74k92j018j456q48Q3J37o41j059m84M21Q74J002J258
54830E6464J491J220N09j05m56r40j762k433k243j104K70J006Q43K61j79l66m32
54813E2044k17N24J404J535O61l72o45k40J76L63M95M61ro20o51J5O93Q87Q21
54794E7325Q02O61K30j65j97j26l56o12k44P37J472J291N05q3j35M8J00L6J1n7
$$ plain form
54910 79629 81410 83377 85699 87946 89467 89910 89295 87825 85736 83247 80538 77798 75300 73254 71549
54895 71549 69794 67764 65682 63921 62560 61476 60762 60717 61335 62112 62577 62831 63323 64219 65244 66084 66647
54878 66647 66865 66557 65686 64659 64149 64629 66158 68540 71523 74846 78303 81857 85603 89489 93058 95581
54862 95581 96530 95959 94399 92375 89984 86995 83363 79572 76348 73996 72139 70227 68131 66065 64072
54847 64072 62012 60083 58861 58487 58195 57177 55721 54873 54956 55093 54452 53393 52909 53330 54204 55206 56464
54830 56464 57955 59175 59684 59579 59123 58183 56421 53988 51745 50641 50911 51917 52760 53021 52842 52476 52044
54813 52044 51827 52351 53755 55290 55951 55579 54934 54694 54870 55233 55728 56189 56180 55560 54909 54924 55617 56504 57325
54794 57325 58127 58788 59018 58853 58656 58530 58174 57562 57318 58055 59527 60818 61323 61240 61105 61153 61253 61289 61300 61243
54774F1243l50p63q66m20L16R45J403J834K127J966J415J082J467K331K950K919
54758G9599K521K298K456K764K875K587J801M78j148k467k944k732k484k499k390
54743H0715j843j266j226j552j576j162q70j082j482j578j310q72l37L13R58J358
54727F7188J245M74o12j115l82J058J893J567Q82P95J256J694K062K691L459L830
54711H7985L638L199K639J707L42j047k019k500k619k488k249k067j990j931j905
54696G8695j993k109k006j625j211j020j072j178j098p04j43J58j44r54j831k344
54680E9421k204j277J82J433J776J275O39M17N46O46L97l63j520k512k652j837
54664E4367o51K88Q14R79P58K61j13k8M13R07J245J241O43n00j565j824j135J4
$$ plain form
54774 61243 60893 60130 59264 58844 59160 60105 61508 63342 65469 67435 68850 69932 71399 73730 76680 79599
54758 79599 82120 84418 86874 89638 92513 95100 96901 97379 96231 93764 90820 88088 85604 83105 80715
54743 80715 78872 77606 76380 74828 73252 72090 71220 70138 68656 67078 65768 64896 64559 64872 65830 67188
54727 67188 68433 68907 68295 67180 66798 67856 69749 71316 72198 72993 74249 75943 78005 80696 84155 87985
54711 87985 91623 94822 97461 99168 99510 98463 96444 93944 91325 88837 86588 84521 82531 80600 78695
54696 78695 76702 74593 72587 70962 69751 68731 67659 66481 65383 64679 64536 64694 64550 63596 61765 59421
54680 59421 57217 55940 56122 57555 59331 60606 61245 61662 62208 62854 63251 62888 61368 58856 56204 54367
54664 54367 53716 54004 54818 55797 56555 56816 56703 56675 57088 57995 59240 60481 61124 60624 59059 57235 56100 56114
54646E6114J054J647J640J117N03K93N48Q37O78n1j046j760j718r20Q3O97Q27
54629F0543P58O63M79K38J05Q8L8k8O8K51J73k39n46l96n2m2m37q32q56m78J27
54608E9625O65Q04M74N8l7Q1j4l15k87L24J000J089O12J43K4J44L63P31J128J143
54588F7755N53k76p39o65l84k31k71m76q16j076q61n9Q93J426J430J154O95j0
54570F8042o98q11k89J14k42r19q99M2R73R62J38o00o06M4Q24J181Q57J01m67
54551F7747m48l8L00L92L27Q0m24q76o74L23J388J625R16J7k35L34J223J755J572
54532G5304Q29K2m06l80j40M6R7L9j79o24j168j448j177m81K17O33Q33R60R70
54513G3947P82N31M55N11L61j89r19j469j730j769j481o69M50J120Q13j3l12L21
$$ plain form
54646 56114 57168 58815 60455 61572 62075 62368 62916 63753 64431 64380 63334 61574 59856 58936 59019 59716 60543
54629 60543 61301 61964 62443 62681 62786 62874 62912 62884 62952 63203 63376 63137 62591 62195 62143 62101 61664 60832 59976 59498 59625
54608 59625 60290 61094 61568 61626 61589 61670 61656 61341 61054 61378 62378 63467 64079 64222 64246 64390 64753 65484 66612 67755
54588 67755 68308 68032 67293 66628 66244 66013 65742 65266 64450 63374 62513 62454 63347 64773 66203 67357 68052 68042
54570 68042 67344 66533 66244 66358 66116 65197 64298 64340 65313 66275 66413 65813 65207 65251 66075 67256 68113 68214 67747
54551 67747 67299 67261 67561 67953 68280 68360 67936 67060 66386 66709 68097 69722 70638 70655 70420 70754 71977 73732 75304
54532 75304 76133 76155 75749 75369 75229 75275 75372 75411 75232 74608 73440 71992 70815 70334 70551 71184 72017 72977 73947
54513 73947 74729 75260 75715 76226 76587 76398 75479 74010 72280 70511 69030 68361 68811 69931 70744 70731 70419 70740
54495G0740J167J339Q17J79l24q37j134o10P36J878J820P52k22l54J71O99P71
54478G7588L92QJ26P76J397J467J070O18K56p6j79K82J253K201K608K286J329
54461I3402J68n14l71J15J91k15n94p47r57j177r17j44L33j37j177j909j947j459
54443H1944p28q7P5k30m24q4M29N25K95K90O06P82N70K57J68K59L31K93J51m8
54423H5374j43N3M96R00R45N12j74n98l86J69M03J53j8K22M13J07k54m2M51M33
54403H9016j4k3N80Q59K19o30o85k7N13N96O21Q41R17M35m94j268j358p51O0N25
54383H9932M58K1n75j080j105m15O34J356J523J482J428J019P1q63j006l11N20
54366I3089Q08M88J7q2L47R17J159J104J236J723K147K148J853J382M62r09j926
$$ plain form
54495 70740 71907 73246 74063 74242 73918 73081 71947 71337 72073 73951 75771 76523 76301 75947 76118 76817 77588
54478 77588 77980 77988 78114 78890 80287 81754 82824 83442 83698 83622 83443 83725 84978 87179 89787 92073 93402
54461 93402 93570 93056 92685 92800 92991 92776 92182 91435 90478 89301 88384 88240 88573 88436 87259 85350 83403 81944
54443 81944 81216 81129 81204 80974 80550 80466 80895 81420 81715 82005 82611 83393 83963 84220 84388 84647 84978 85271 85422 85374
54423 85374 85231 85284 85780 86680 87625 88137 87963 87365 86979 87148 87551 87704 87686 87908 88321 88428 88174 88132 88583 89016
54403 89016 89002 88979 89559 90418 90637 90007 89322 89295 89808 90404 91025 91866 92783 93218 92724 91456 90098 89347 89407 89932
54383 89932 90390 90411 89836 88756 87651 87236 87870 89226 90749 92231 93659 94678 94749 93886 92880 92569 93089
54366 93089 93897 94385 94402 94320 94667 95584 96743 97847 99083 100806 102953 105101 106954 108336 108798 107889 105963
54349A05963j838j096q31j290j611j265q21r14j268j266r66q50r77j039j068j346
54333H7517j706j555q07k09l77r05q29J47J293J710J302P45O27Q30Q11L73j09
54316H8858k83l51p20j270j418r17k10K10L85N20M51o2p06q36l73Q2R5r2j49k36
54296H2978o31j086j060m70K06N56N80M45K60K05M60Q89J059P87M37L63L60On77
54277H5767p43j97O12J118J355J595J627R61k61j129r81j14P76J447J896J766
54261I5495O88q26j605j125j81J13m25j069j169q13n80q31j262j126j27J001J188
54244H7346L07o71q68l25M59J189J620J304J18j359k380k717k430j512k12O45
54228H0514M25m65j066r52l54M89J343J647J068K28Q8O23R03M89j43n46q30j017
$$ plain form
54349 105963 104125 103029 102198 100908 99297 98032 97211 96297 95029 93763 92797 91947 90970 89931 88863 87517
54333 87517 85811 84256 83449 83240 82863 81958 81129 81276 82569 84279 85581 86326 86953 87783 88594 88967 88858
54316 88858 88575 88224 87504 86234 84816 83899 83689 83899 84284 84804 85255 85193 84487 83651 83278 83360 83455 83363 83214 82978
54296 82978 82347 81261 80201 79731 79937 80493 81073 81518 81778 81983 82443 83332 84391 85178 85615 85978 86338 86344 85767
54277 85767 85024 84827 85439 86557 87912 89507 91134 92095 91834 90705 89724 89610 90386 91833 93729 95495
54261 95495 96183 95357 93752 92627 92446 92559 92134 91065 89896 89083 88503 87672 86410 85284 85157 86158 87346
54244 87346 87653 86982 86114 85789 86248 87437 89057 90361 90479 89120 86740 84023 81593 80081 79869 80514
54228 80514 80939 80474 79408 78456 78102 78591 79934 81581 82649 82877 82965 83588 84491 84980 84837 84291 83461 82444
54210H2444q81o16q38j495j687j002k00k6r9L05R99J233Q16K10j53o8N60J454
54192H0956J874J442P22M39M54J24o59j427j877k004j719j049m65l14j31O96J722
54175G8784J826Q83R3L75J199J457R17K61M3J91L47L54K86K54J98m1m16o25n57
54156H5829n35q21j038o16K76Q16N85O5j20N6K39K31Pm19p97o69Q2Q89J061N73
54136H5694J4j73r7p0j47j33J01M34O40O16M08Q4k72m31r4O73J290J218N46j50
54116I0151m61l87o3M27Q65R31N61O9k37l52l93k52K82J091J596J240J75p23p60
54097I3760k62j61p11j085n56M55R92Q86P73R53J000N81m0n22q76j083p95J19
54079I3428J073J326Q62M44P27J653K606K988K628J770P71j79r41j281j086o53
$$ plain form
54210 82444 81563 80947 80109 78614 76927 75925 75725 75699 75600 75905 76904 78137 78953 79163 79010 78942 79502 80956
54192 80956 82830 84272 84994 85433 85887 86011 85352 83925 82048 80044 78325 77276 76811 76497 76366 77062 78784
54175 78784 80610 81493 81586 81961 83160 84617 85534 85795 85838 86029 86376 86730 87016 87270 87468 87427 87011 86386 85829
54156 85829 85294 84473 83435 82819 83095 83911 84496 84561 84441 84497 84736 84967 84974 84555 83758 83089 83171 84060 85121 85694
54136 85694 85708 85535 85438 85368 85221 85088 85189 85623 86263 86879 87287 87371 87099 86668 86574 87247 88537 89755 90301 90151
54116 90151 89690 89303 89240 89667 90532 91463 92024 92093 91856 91504 91111 90859 91141 92232 93828 95068 95243 94520 93760
54097 93760 93498 93337 92626 91541 90985 91440 92432 93318 94091 95044 96044 96625 96585 96063 95187 94104 93309 93428
54079 93428 94501 95827 96689 97133 97860 99513 102119 105107 107735 109505 110276 110097 109156 107875 106789 106136
54063A06136m51n33n05j38K77L44K2l88n35k08N23J230J490J391J465J977K581
54046A14678K829K703K449K213K109K401L240M257M725M254L217K432K392K814
54032A56713K986K606K038J644J226N02k06l60j32k64r17j420j306r48q36r17
54016A60409j032j437k343l405m188m728n156n136m318l057k061j506j025m23
54002A20594J20M97P55Q16N97K86J33M7j55l41l63n49j239k006k079j514j144
53985A14455j289j327q16k64k68n39m00J46M37J34l77n17j26N03R88J173J171
53968A13084J084P88K13l34m05m4K20J16n7j9P8M4R7M91J068J542J999K615L131
53949A25711L097K519J844J373J169J517K833M958O952P899P705O960O164N334
$$ plain form
54063 106136 105685 105152 104647 104509 104786 105130 105152 104764 104229 104021 104544 105774 107264 108655 110120 112097 114678
54046 114678 117507 120210 122659 124872 126981 129382 132622 136879 141604 145858 149075 151507 153899 156713
54032 156713 159699 162305 164343 165987 167213 167715 167509 167149 167017 166753 165836 164416 163110 162162 161326 160409
54016 160409 159377 157940 155597 152192 148004 143276 138120 132984 128666 125609 123548 122042 121017 120594
54002 120594 120714 121211 121966 122782 123379 123665 123798 123845 123690 123349 122986 122437 121198 119192 117113 115599 114455
53985 114455 113166 111839 111023 110759 110491 109952 109552 109698 110135 110269 109892 109375 109249 109752 110740 111913 113084
53968 113084 114168 114956 115169 114835 114430 114386 114606 114722 114665 114646 114724 114768 114865 115356 116424 117966 119965 122580 125711
53949 125711 128808 131327 133171 134544 135713 137230 140063 145021 151973 159872 167577 174537 180701 186035
53935A86035M145K383L06j348j973j673j073n13J73J034J674J824J908K525L562
53920A98989M248M122L508L040K959L060K989K516J672P72J53j41l20n78r44j353
53904B24692j626j530j162j146k001l366m318m553m627m962n265n228n137n242
53890A74529n128m361l312k629k273j847j567j961k760l033k485j743j304j080
53876A39046j052j458k006j950j334j163j790k115j253l9J52n78r95o48k94m92
53860A22031r05j058r00n13j2J61l28j004j034m96l44r07j320q07K27R16J109
53843A14816J191J239R91M63pk03k46l75p36j227j401q30K89J172J286Q71M24
53826A17717O5k41k70J03M66L71J94P99K217L235K718J072j48k9Q10J352J707
$$ plain form
53935 186035 190180 192563 192869 191521 189548 187875 186802 186289 186462 187496 189170 190994 192902 195427 198989
53920 198989 203237 207359 210867 213907 216866 219926 222915 225431 227103 227875 228028 227887 227567 226989 226045 224692
53904 224692 223066 221536 220374 219228 217227 213861 209543 204990 200363 195401 190136 184908 179771 174529
53890 174529 169401 165040 161728 159099 156826 154979 153412 151451 148691 145658 143173 141430 140126 139046
53876 139046 137994 136536 134530 132580 131246 130083 128293 126178 124925 124886 125038 124460 123465 122817 122523 122031
53860 122031 121126 120068 119168 118655 118643 118804 118476 117472 116438 115942 115598 114691 113371 112564 112791 113707 114816
53843 114816 116007 117246 118237 118700 118693 118490 118244 117869 117133 115906 114505 113675 113964 115136 116422 117293 117717
53826 117717 117782 117541 117271 117374 117840 118211 118405 119204 121421 124656 127374 128446 128298 128269 129079 130431 132138
53809A32138K778M545N648N150L932L464L708L381K144J180J314J736J388N98
53795A73104L79P33P42J20m43m04j5L07N26O89O45L12j93q13j598k431l068l512
53777A65080l945m251m078l445k848k610k530k360k160j955j528q77m89p35j257
53762A30012j394j020n75l75l90n45q12r49o15J16O77O31J59k73n08p03q91q29
53744A21716l58K88P04P91Q91J366K071K373J779N49m81o76j23O64J358J939K366
53727A37217K462K233J969J888J847J640J462J712K392K984L063K787K586K498
53713A68740K109J116k20j258j536j042m6J146K243K999L438L953M854N784N917
53698A98197M916L411K287J759J479J186Q13J72q00j546j344l52L52J04n60p51
$$ plain form
53809 132138 134916 139461 145109 150259 154191 157655 161363 164744 166888 168068 169382 171118 172506 173104
53795 173104 173483 174216 174958 175078 174635 174231 174216 174523 175049 175738 176383 176695 176502 175689 174091 171660 168592 165080
53777 165080 161135 156884 152806 149361 146513 143903 141373 139013 136853 134898 133370 132493 132004 131269 130012
53762 130012 128618 127598 127023 126648 126258 125713 124901 123952 123337 123453 124130 124761 124920 124647 124139 123436 122545 121716
53744 121716 121358 121646 122350 123141 124032 125398 127469 129842 131621 132170 131689 131013 130890 131554 132912 134851 137217
53727 137217 139679 141912 143881 145769 147616 149256 150718 152430 154822 157806 160869 163656 166242 168740
53713 168740 170849 171965 171745 170487 168951 167909 167863 169009 171252 174251 177689 181642 186496 192280 198197
53698 198197 203113 206524 208811 210570 212049 213235 214048 214220 213420 211874 210530 210178 210530 210634 210074 209323
53682B09323m08j32k47n30o60n32j99J45K21o2m38o52p71r44j109j207j421j811
53664A98566j986j529o61l5j7m19q64j051q62m75k34r2M19J353J922J543R11J105
53646A97594J946K213J500P81Q68J340J452J277J296J557J860K277K870L270L174
53631B25275K916K991L308L468L449L432L232K565J751J487J947K664L231L649
53617B65365L951M047L959L853L740L585L596L957M253L780K555J514J427J996
53603C11578K299J820Q17p9l79m3N10P60N86L00J21j21o76j402j830j667j139
53586C11455q29j134j776k015j453n33J3j4l17p51j373j905j801j087n88q98j548
53569B93446j638j005k90LL3K22O85J192J458J412J224J056P90J93n47p93j73
$$ plain form
53682 209323 208915 208783 208536 208006 207346 206814 206615 206760 206981 206919 206481 205829 205058 204114 203005 201798 200377 198566
53664 198566 196580 195051 194390 194355 194338 193919 193055 192004 191142 190667 190433 190341 190760 192113 194035 195578 196489 197594
53646 197594 199540 201753 203253 204034 204902 206242 207694 208971 210267 211824 213684 215961 218831 222101 225275
53631 225275 228191 231182 234490 237958 241407 244839 248071 250636 252387 253874 255821 258485 261716 265365
53617 265365 269316 273363 277322 281175 284915 288500 292096 296053 300306 304086 306641 308155 309582 311578
53603 311578 313877 315697 316514 316435 316056 316013 316523 317283 317869 318169 318290 318169 317493 316091 314261 312594 311455
53586 311455 310626 309492 307716 305701 304248 303715 303728 303714 303397 302646 301273 299368 297567 296480 295892 294994 293446
53569 293446 291808 290803 290513 290516 290549 290771 291456 292648 294106 295518 296742 297798 298588 298781 298234 297441 297268
53552B97268Q85J640J878J958K214K688L324M016M440M318L873L749M295N282
53538C41828O316P266Q161Q969R668J0241J0554J0462J0222J0485J1593J3073
53526D58838J4070J4173J3661J3151J3273J4493J6816J9556K1675K2550K2480
53515F44736K2344K2786K3743K4689K5301K5666K5841K5566K4735K3903K3795
53504I13105K4288K4495K3954K3210K2839K2587K1938K1024K0337J9846J9186
53493A156809J8458J8077J7947J7633J7295J7557J8300J8534J7801J6857J6422
53482A351690J6102J5117J3446J1455R063O095L001L15k230n136p964r820j0880
53469A390254j2235j4126j5465j5490j4905j4825j5419j6341j7655j9587k1721
$$ plain form
53552 297268 298153 299793 301671 303629 305843 308531 311855 315871 320311 324629 328502 332251 336546 341828
53538 341828 348144 355410 363571 372540 382208 392449 403003 413465 423687 434172 445765 458838
53526 458838 472908 487081 500742 513893 527166 541659 558475 578031 599706 622256 644736
53515 644736 667080 689866 713609 738298 763599 789265 815106 840672 865407 889310 913105
53504 913105 937393 961888 985842 1009052 1031891 1054478 1076416 1097440 1117777 1137623 1156809
53493 1156809 1175267 1193344 1211291 1228924 1246219 1263776 1282076 1300610 1318411 1335268 1351690
53482 1351690 1367792 1382909 1396355 1407810 1416873 1422968 1425969 1426284 1424054 1418918 1410954 1401134 1390254
53469 1390254 1378019 1363893 1348428 1332938 1318033 1303208 1287789 1271448 1253793 1234206 1212485
53458A212485k3276k3928k3837k3187k2232k1485k1201k0908k0070j8924j7989
53447I75448j6982j5085j2325r888q725q468q024o804n069l343j886o06P60K309
53433H81312L796M925N697O345P045P970R467J1686J4123J6012J7193J8158J9237
53420A022966K0318K1476K3172K5441K7497K8698K9561L1237L4102L7337L9891
53409A341696M1507M2735M4261M6293M8526N0589N2429N4108N5392N5978N6116
53398A889630N6518N7449N8374N8771N8822N8871N8603N7379N5121N2391M9703
53387B511632M7196M4868M2607M0032L6802L3000K8878K4354J9273J4019R232
53376B851893M873J65n462j1978j9398k7938l7080m5143n0551n3309n4756n6027
$$ plain form
53458 1212485 1189209 1165281 1141444 1118257 1096025 1074540 1053339 1032431 1012361 993437 975448
53447 975448 958466 943381 931056 921168 912443 903975 895951 889147 884078 880735 878849 878243 879003 881312
53433 881312 885108 890033 895730 902075 909120 917090 926557 938243 952366 968378 985571 1003729 1022966
53420 1022966 1043284 1064760 1087932 1113373 1140870 1169568 1199129 1230366 1264468 1301805 1341696
53409 1341696 1383203 1425938 1470199 1516492 1565018 1615607 1668036 1722144 1777536 1833514 1889630
53398 1889630 1946148 2003597 2061971 2120742 2179564 2238435 2297038 2354417 2409538 2461929 2511632
53387 2511632 2558828 2603696 2646303 2686335 2723137 2756137 2785015 2809369 2828642 2842661 2851893
53376 2851893 2856766 2856931 2851469 2839491 2820093 2792155 2755075 2709932 2659381 2606072 2551316 2495289
53364B495289n7280n8266n8906n9160n8766n7442n5241n2489m9556m6811m4728
53353A896644m3782m4102m5222m6230m6312m5257m3510m1749m0374l9214l7672
53342A423220l5217l1937k8522k5667k3423k1325j9059j6791j4990j4057j4151
53331A178081j5021j5955j6174j5468j4266j3079j1990j0828r614q613q057p833
53319A031183p403o095l745j078Q69J810K514L862N874P834R205J0156J1303J3090
53305A079379J5402J7649J9292K0335K1290K2608K4284K6008K7480K8534K9240
53294A331501K9824L0228K9798K7902K4986K2460K1171K0474J9189J7031J4507
53283A589071J1766Q317L944p12m683p473r313j0897j2898j5488j8303k0911k3220
$$ plain form
53364 2495289 2438009 2379743 2320837 2261677 2202911 2145469 2090228 2037739 1988183 1941372 1896644
53353 1896644 1852862 1808760 1763538 1717308 1670996 1625739 1582229 1540480 1500106 1460892 1423220
53342 1423220 1388003 1356066 1327544 1301877 1278454 1257129 1238070 1221279 1206289 1192232 1178081
53331 1178081 1163060 1147105 1130931 1115463 1101197 1088118 1076128 1065300 1055686 1047073 1039016 1031183
53319 1031183 1023780 1017685 1013940 1012862 1013731 1015541 1018055 1021917 1027791 1035625 1044830 1054986 1066289 1079379
53305 1079379 1094781 1112430 1131722 1152057 1173347 1195955 1220239 1246247 1273727 1302261 1331501
53294 1331501 1361325 1391553 1421351 1449253 1474239 1496699 1517870 1538344 1557533 1574564 1589071
53283 1589071 1600837 1609154 1613098 1612386 1607703 1600230 1590917 1580020 1567122 1551634 1533331 1512420 1489200
53270A489200k5270k6951k8223k9323l0321l0797l0458k9890l0003l0889l1779
53259A165296l2056l1700l0818k9521k8279k7676k7577k7306k6775k6699k7289
53248H49600k7638k6940k5609k4547k3892k3186k2298k1356k0142j8361j6314
53237E99317j4530j2866j0808q586p178p046p618q215q853r797j0909j1846j2525
53224D68540j3045j3373j3466j3467j3426j3068j2142j0909r942r469r132q481
53212C28620p525o710o392o488o664o751o817o838o690o479o551o895o858n936
53198B35026m616l881l984m262m224m151m339m399l766k589j613j277j375j525
53184A89025j580j576j519j340r92n51k85m45r51j440j717j902k004j701q89j64
$$ plain form
53270 1489200 1463930 1436979 1408756 1379433 1349112 1318315 1287857 1257967 1227964 1197075 1165296
53259 1165296 1133240 1101540 1070722 1041201 1012922 985246 957669 930363 903588 876889 849600
53248 849600 821962 795022 769413 744866 720974 697788 675490 654134 633992 615631 599317
53237 599317 584787 571921 561113 552527 545349 538303 530685 522470 513617 503820 492911 481065 468540
53224 468540 455495 442122 428656 415189 401763 388695 376553 365644 355702 346233 337101 328620
53212 328620 321095 314385 307993 301505 294841 288090 281273 274435 267745 261266 254715 247820 240962 235026
53198 235026 230410 226529 222545 218283 214059 209908 205569 201170 197404 194815 193202 191925 190550 189025
53184 189025 187445 185869 184350 183010 182018 181467 181182 180737 179786 178346 176629 174727 172723 171022 170133 169969
53168A69969k01q10j137q11l39k35l11k18j77o43j443j863j628j261j267j381
53152A56244r91m6Q72J281J239J055Q98P80O49L34l44j148j394p05L40P35K39
53135A60038l89l81J78O96R10R55Q99O23J92q7p2K8Pk4J22L32L31R4j04j16j33
53114A64099l49n85n13k13j26m21p44q06r21j509k246k320j560p45n10n01q3N22
53096A50469N32j30o28m46j37m84j328j739j158K5R96J191O08k39o43l59O5j22
53078A46473q59j280q60j15J39q7p8M80J042R65K71n34j107j408j423j133o91
53061A39795l92l87m98l77J57Q79J211P52j39n53k3Q62J182P61J41l94j071j847
53043A40059k023j120K78J080R05K66k73n91p39o92n93p56j138j128k61R96J562
$$ plain form
53168 169969 169768 168958 167821 167010 166671 166436 166125 165907 165730 165087 163644 161781 160153 158892 157625 156244
53152 156244 155253 155207 156079 157360 158599 159654 160552 161332 161981 162315 161971 160823 159429 158724 159064 159799 160038
53135 160038 159649 159268 159446 160142 161052 162007 162906 163529 163721 163634 163562 163590 163597 163573 163695 164027 164358 164452 164348 164232 164099
53114 164099 163750 163165 162652 162439 162313 161892 161148 160342 159421 157912 155666 153346 151786 151041 150531 150030 149947 150469
53096 150469 151001 150871 150243 149797 149660 149176 147848 146109 144951 144976 145972 147163 147771 147532 146889 146530 146595 146473
53078 146473 145614 144334 143474 143359 143498 143411 143333 143813 144855 145820 146091 145557 144450 143042 141619 140486 139795
53061 139795 139403 139016 138518 138141 138298 139177 140388 141140 141001 140448 140425 141287 142469 143230 143371 142977 141906 140059
53043 140059 138036 136916 137194 138274 139179 139445 139172 138581 137842 137150 136557 135801 134663 133535 133274 134270 135832
53026A35832R57j70p94o07j16J92L89O97R02O13n6m65k63J76L08J24M0K26M47
53007A38432L98j4o28j089j030m37J98L63R7k06l41l61k17K44Q24J019O15m5n14
52988A37308o96o96n29j42M36J043J350J008J27n26k66N72J027Q31O63R14J035
52971A43459N41p2n6M78Q94J006J031R50P51R26J801K617K248Q02n34j209j777
52954A53856k507k716k050j371j573k258k391j723q34j75J33m8o43j069q57m12
52938A33362m63r38j061m81L13P10N48K3m58m68j02j58j076j969j582j68O71J67
52920A26870o21m86K81P09P79J241K109K426J593J62q45r93o02k16j21k29l00
52903A31757k74k60k21M3M43M88qm77k42N10R26N77j25o21q01p69m86K5M25M07
$$ plain form
53026 135832 136789 136619 135825 135218 135102 135294 135683 136380 137282 137895 137839 137374 137111 137287 137595 137719 137759 137985 138432
53007 138432 138830 138816 138188 137099 136069 135632 135830 136193 136290 136084 135743 135382 135165 135409 136233 137252 137867 137822 137308
52988 137308 136612 135916 135387 135245 135681 136724 138074 139082 139209 138683 138417 138989 140016 140847 141510 142424 143459
52971 143459 144000 143928 143872 144350 145244 146250 147281 148231 148982 149908 151709 154326 156574 157376 156842 155633 153856
52954 153856 151349 148633 146583 145212 143639 141381 138990 137267 136433 136258 136391 136343 135700 134631 133774 133362
52938 133362 132899 131961 130900 130419 130732 131442 131990 132013 131555 131087 130985 130827 129751 127782 126200 126032 126703 126870
52920 126870 126249 125763 126044 126753 127532 128773 130882 133308 134901 135063 134218 133225 132623 132407 132286 132057 131757
52903 131757 131483 131223 131002 131045 131488 131976 131968 131491 131249 131759 132685 133262 133137 132516 131715 130946 130460 130485 130910 131317
52883A31317J89K98Q97J578J886J774J433R16J75n32p07k17L37K13n97j301j198
52866A36461l70N30R43P69K91r0j31J06L82M78K58l27j087j551j448j084r06p35
52848A32489n6J007J584J201L63k90p86j354j708j457q66n08m70m68m78o21o55
52831A26927k77J98J64l49p41p53o56n39k34R5Km26o05m25m05o64n92N3N73M03
52811A21749Q2M59J464K289K423J939J062J01n25p03q79j422k037k270k211k146
52795A19375j863r92J69R07J039R49Q11M23j61n16m75k55M9N62J100J180O88P6
52777A23066l50p38j113j072m33K19J87m58j009r91n40j7L32M59M37M14M47M67
52759A19307M17L89N07Q02J195J483J350O17m07r84n35Q36K351L055K483J109
$$ plain form
52883 131317 131506 131804 132701 134279 136165 137939 139372 140288 140463 139931 139224 139007 139344 139557 138960 137659 136461
52866 136461 136091 136621 137564 138333 138624 138534 138403 138509 138891 139369 139627 139300 138213 136662 135214 134130 133224 132489
52848 132489 132433 133440 135024 136225 136588 136298 135512 134158 132450 130993 130127 129619 129149 128681 128203 127582 126927
52831 126927 126650 126848 127012 126663 125922 125169 124513 123974 123740 123835 123837 123411 122806 122381 121976 121312 120720 120773 121346 121749
52811 121749 121831 122290 123754 126043 128466 130405 131467 131568 131043 130340 129461 128039 126002 123732 121521 119375
52795 119375 117512 116520 116689 117596 118635 119584 120395 120818 120657 120141 119666 119411 119460 120022 121122 122302 122990 123066
52777 123066 122716 121978 120865 119793 119360 119579 119766 119308 118299 117308 116768 116751 117083 117542 117979 118393 118840 119307
52759 119307 119724 120113 120620 121422 122617 124100 125450 126067 125660 124676 124141 124977 127328 130383 132866 133975
52743A33975O2P1P22J066Q69P55J086J390J205Q70J000J521J848J746J408Q74
52727A50468Pr76j549j628j708k067k332k104j612j305j164q72m77l49n20n51
52711A31261k36J00J39J12L70P50P48K53k61l05J35P23J062Q86K41m17n93l62
52693A34606k97o53r88q39m49m13p94j068q76m05n3kk16n19n65j34M60N31j79
52674A27147j069j242m37P76J619J783J491J103P66M74K90L29N27O42O11O21P57
52657A36188Q06O54N55O95P54L29m17r39j040r48p71m01J22O14J072J435J204
52640A39912K7j327j533m67M52J70n86n25L54R70Q24M30K70J88k1k00j44J12M94
52621A39400R34J185R91N54L56M43L28k54q56q91l84J26K70J93K90P33J306J603
$$ plain form
52743 133975 134037 134108 134830 135896 136765 137520 138606 139996 141201 142071 143071 144592 146440 148186 149594 150468
52727 150468 150475 149499 147950 146322 144614 142547 140215 138111 136499 135194 134030 133158 132681 132332 131812 131261
52711 131261 131025 131125 131264 131376 131746 132496 133244 133497 133236 132931 133066 133789 134851 135737 135978 135561 134968 134606
52693 134606 134309 133656 132668 131829 131380 130967 130173 129105 128229 127824 127771 127769 127553 127034 126469 126335 126795 127326 127147
52674 127147 126078 124836 124399 125175 126794 128577 130068 131171 131937 132411 132701 133030 133557 134199 134810 135431 136188
52657 136188 136994 137648 138203 138898 139652 139981 139564 138625 137585 136637 135866 135465 135587 136201 137273 138708 139912
52640 139912 139939 138612 137079 136612 137064 137234 136648 136123 136477 137447 138271 138701 138971 139159 139138 138938 138794 138906 139400
52621 139400 140334 141519 142510 143064 143420 143863 144191 143937 143081 142190 141806 141932 142202 142395 142685 143418 144724 146327
52603A46327J440J039Q21R99J349J315M57r14j702j071L11P39m84j985j936l34
52587A46371J149J344P23K71J64K5j66o8L86Q18Q34L63l18p37n89j02J36j86p76
52568A49642j099q83j80P20J329J222N20j26k67j91m31r78j302j025l30L73Q80
52551A47874J167J136O10k89r80q98k17K18m8m27q3Q37J378J054M22J20J2m19
52533A51467j188j731j520n14P74J487J049j13q67o06O5J92l94j157j656j730
52517A43558j199p2J017J264O81J40K79Q24J160J138J144J575K454L322L469K536
52501A63290J031o5l09j61k56o24q63p70m66j14J89K64n4o21r89q39l63j35n83
52482A57562j503k133j830p93M1Rm80m43M55J438J614J050N83O54Q39O76M48P73
$$ plain form
52603 146327 147767 148806 149627 150626 151975 153290 153747 152833 151131 150060 150371 151110 150626 148641 146705 146371
52587 146371 147520 148864 149587 149858 150022 150047 149881 149813 150199 151017 151851 152214 151896 151159 150570 150468 150604 150418 149642
52568 149642 148543 147660 147480 148200 149529 150751 151271 151145 150878 150687 150256 149278 147976 146951 146621 146994 147874
52551 147874 149041 150177 150787 150498 149518 148620 148403 148621 148573 148146 148063 148900 150278 151332 151754 151874 151886 151467
52533 151467 150279 148548 147028 146514 147288 148775 149824 149711 148844 148238 148303 148495 148101 146944 145288 143558
52517 143558 142359 142287 143304 144568 145249 145389 145668 146492 147652 148790 149934 151509 153963 157285 160754 163290
52501 163290 164321 164256 163947 163786 163530 162906 162043 161273 160807 160693 160882 161146 161092 160471 159482 158643 158280 158145 157562
52482 157562 156059 153926 152096 151303 151344 151353 150873 150430 150885 152323 153937 154987 155570 156224 157063 157739 158187 158960
52464A58960J550J937J435O27N11J353K486L080K836J922O36o91j604j693j010
52449A72335k41k44j238k506l030k476j420o91o83j203j760j863j311l95K83L53
52433A53910k2l96m39k8P56J577K016J894J398P75K20J4L90J072J339R29N03P65
52415A66673J528K098K296K496K823L087L373L970M555M238K709P34q19j894k790
52400A95077l379l367k913k370j652m93P88J444J257P90N47M26K06J45O70J669
52384A88845K515K710K330J785J410J309J460J813K317K899L488L954M122L884
52370B24841L370K926K851L133L497L598L259K574J916J655J733J616R48J94K55
52355B58366J400K790L359K972K500K832M032N410O293O629O943P704Q790R662
$$ plain form
52464 158960 160510 162447 163882 164509 165020 166373 168859 171939 174775 176697 177333 176642 175038 173345 172335
52449 172335 172094 171850 170612 168106 165076 162600 161180 160489 159806 158603 156843 154980 153669 153274 153557 153910
52433 153910 153888 153492 153053 153025 153781 155358 157374 159268 160666 161441 161661 161675 162065 163137 164476 165405 165908 166673
52415 166673 168201 170299 172595 175091 177914 181001 184374 188344 192899 197137 199846 200580 199761 197867 195077
52400 195077 191698 188331 185418 183048 181396 180903 181691 183135 184392 185182 185729 186155 186361 186506 187176 188845
52384 188845 191360 194070 196400 198185 199595 200904 202364 204177 206494 209393 212881 216835 220957 224841
52370 224841 228211 231137 233988 237121 240618 244216 247475 250049 251965 253620 255353 256969 257917 258111 258366
52355 258366 259766 262556 265915 268887 271387 274219 278251 283661 289954 296583 303526 311230 320020 329682
52341C29682J0125J0630J1696J3155J4267J4646J4744J5251J6224J7085J7505
52330D85010J7839J8598J9691K0553K0838K0673K0235J9536J8718J8129J7736
52319F97556J6880J4969J2321R864Q129O872N606M126K497R50j91q42j381k204
52305G75152l107l609l893m730o268p467p275n933m604l998l844l539k768j545
52291G12572j26J102J932K612L603N094O915Q793J0457J1717J2685J3759J5054
52278H06169J5984J5872J4913J4070J3991J4372J4424J3563J1563Q565N222K514
52266I51222R90K85m33j592k935m024m755n383o114o856p407p788q205q678q883
52251H79444q590q051p749p833q004p911p456o737o003n542n397n198m501l341
$$ plain form
52341 329682 339807 350437 362133 375288 389555 404201 418945 434196 450420 467505 485010
52330 485010 502849 521447 541138 561691 582529 603202 623437 642973 661691 679820 697556
52319 697556 714436 729405 741726 751590 759719 766591 772197 776323 778820 779770 779579 778737 777356 775152
52305 775152 772045 768436 764543 759813 753545 746078 738803 732870 728266 724268 720424 716885 714117 712572
52291 712572 712446 713548 715480 718092 721695 726789 733704 742497 752954 764671 777356 791115 806169
52278 806169 822153 838025 852938 867008 880999 895371 909795 923358 934921 943486 948708 951222
52266 951222 952212 952497 952064 950472 947537 943513 938758 933375 927261 920405 912998 905210 897005 888327 879444
52251 879444 870854 862803 855054 847221 839217 831306 823850 817113 811110 805568 800171 794973 790472 787131
52237G87131k167j293o61j19L52P83J254J695J900J856J868K225K929L786M567
52222H06106N006M947M570M272M195M158M144M571N688P026P686P188N832M367
52208H79756L453L315L661L926L789L391K990K618K134J566J108Q61P02M17j88
52193I13499j106k007k386k061j408r64q82r48j035j242j638k150k728l358l872
52178H85714m000l706l376l411l767l985l713l061k485k304k421k435k018j211
52164H43821l63J64K78J92K24N61J193K032K929L578L642L147K589K450K656K791
52148H71884K795L094L977N206O347P278Q128Q936R582R969J0136J0317J0848
52135I68497J1905J3195J4238J4906J5494J6157J6694J7024J7436J8124J8822
$$ plain form
52237 787131 784964 783671 783010 782891 783243 784026 785280 786975 788875 790731 792599 794824 797753 801539 806106
52222 806106 811112 816059 820629 824901 829096 833254 837398 841969 847657 854683 862369 869557 875389 879756
52208 879756 883209 886524 890185 894111 897900 901291 904281 906899 909033 910599 911707 912568 913270 913687 913499
52193 913499 912393 910386 908000 905939 904531 903567 902685 901737 900702 899460 897822 895672 892944 889586 885714
52178 885714 881714 878008 874632 871221 867454 863469 859756 856695 854210 851906 849485 847050 845032 843821
52164 843821 843458 843622 843900 844092 844316 844877 846070 848102 851031 854609 858251 861398 863987 866437 869093 871884
52148 871884 874679 877773 881750 886956 893303 900581 908709 917645 927227 937196 947332 957649 968497
52135 968497 980402 993597 1007835 1022741 1038235 1054392 1071086 1088110 1105546 1123670 1142492
52124A142492J9227J9370J9258J8579J7302J6049J5236J4219J2178R526P397N849
52112A316682L794R06j646l061m379p020j0548j3127j3891j3689j3537j3442j3057
52099A213985j2509j2026j1312r861p621m968k305J7J717K860L956N417P054Q350
52085A182754R067R390R643J0126J1002J2062J2748J2791J2702J3201J4225J4846
52073A324557J4229J2367R904P579N931N039M320K861K13l212o674r694j2097
52060A355323j3806j4934j5843j6848j7974j9192k0588k1980k2743k2480k1688
52049A147247k1213k1154k0841j9882j8699j7846j7298j6679j5788j4665j3441
52038I49741j2317j1377j0340q803o935n461m701m120l269k650l048m295n358
$$ plain form
52124 1142492 1161719 1181089 1200347 1218926 1236228 1252277 1267513 1281732 1293910 1303436 1310833 1316682
52112 1316682 1320476 1321382 1319736 1316675 1312296 1305276 1294728 1281601 1267710 1254021 1240484 1227042 1213985
52099 1213985 1201476 1189450 1178138 1168277 1160656 1155688 1153383 1153400 1155117 1157977 1161933 1167350 1174404 1182754
52085 1182754 1191821 1201211 1210854 1220980 1231982 1244044 1256792 1269583 1282285 1295486 1309711 1324557
52073 1324557 1338786 1351153 1361057 1368636 1374567 1379606 1383926 1386787 1387000 1383788 1377114 1367420 1355323
52060 1355323 1341517 1326583 1310740 1293892 1275918 1256726 1236138 1214158 1191415 1168935 1147247
52049 1147247 1126034 1104880 1084039 1064157 1045458 1027612 1010314 993635 977847 963182 949741
52038 949741 937424 926047 915707 906904 899969 894508 889807 885687 882418 879768 876720 872425 867067
52025H67067n656n606n871o643p818r288j0785j1831j2217j2313j2646j3356j4279
52012G38758j5341j6597j7914j8898j9185j8795j8111j7504j6885j5804j4140
52001E49584j2541j1840j2003j2141j1655j0894j0426j0057r181p829o756o364
51989D27897o086n161l632k214j362r32p60j116k310m096n720o562o604o287o130
51974C68925o404o882o960o297n311m697m401l578j854r9N97L66L27J032J931
51959C26695K425K690L116L515L416K804K030J232K88p43j461j502r36l04k18
51944C43047p40j066k47J667L604M801N674O934Q351R103R028Q707Q388P655O333
51929D21239M958L997L184K035O43m62r53q94n98n64j367l237n879q782j1535
$$ plain form
52025 867067 861411 855805 849934 843291 835473 826185 815400 803569 791352 779039 766393 753037 738758
52012 738758 723417 706820 688906 670008 650823 632028 613917 596413 579528 563724 549584
52001 549584 537043 525203 513200 501059 489404 478510 468084 458027 448846 441017 434261 427897
51989 427897 421811 416650 413018 410804 409442 408510 407750 406634 404324 400228 394508 387946 381342 375055 368925
51974 368925 362521 355639 348679 342382 337071 332374 327973 324395 322541 322442 323039 323405 323732 324764 326695
51959 326695 329120 331810 334926 338441 341857 344661 346691 347923 348211 347468 346007 344505 343569 343265 343047
51944 343047 342307 341241 340994 342661 346265 351066 356740 363674 372025 381128 390156 398863 407251 414906 421239
51929 421239 426197 430194 433378 435413 436056 435594 434641 433747 433149 432585 431218 427981 422102 413320 401785
51914D01785j3716j4943j5230j4972j4293j2870j0710q621p329o524n398l858
51902B73321k488j499n02P34K005L232M536N559N520M229K441Q70n28j894k939
51887B92597l532m200n197n666m633k560q85j40N37J845L243L790L420K852K637
51872B84108K780K980K915K448J846J562J635J452M25j272k836l625l662l449
51858B87307l410l480l202k304j073OQ57J612K048J725Q37K12K13J79n69j632
51842B79326k091j791j404j372j504j636k011k716l312l341k925k537k287j808
51828B48591p77N61J512J486N31o93j468j556j285j145j388j899k344k480k345
51813B35301k151j904j379m31P57J808K380K239J376K22n32n36j25P6k83j129
$$ plain form
51914 401785 388069 373126 357896 342924 328631 315761 305051 296430 289101 282577 277179 273321
51902 273321 270833 269334 268832 269566 271571 274803 279339 284898 290418 294647 297088 297958 297430 295536 292597
51887 292597 289065 284865 279668 274002 269369 266809 265924 265784 266321 268166 271409 275199 278619 281471 284108
51872 284108 286888 289868 292783 295231 297077 298639 300274 301726 302151 300879 298043 294418 290756 287307
51858 287307 283897 280417 277215 274911 273838 273844 274701 276313 278361 280086 280923 281135 281348 281527 280958 279326
51842 279326 277235 275444 274040 272668 271164 269528 267517 264801 261489 258148 255223 252686 250399 248591
51828 248591 247814 248375 249887 251373 251904 251211 249743 248187 246902 245757 244369 242470 240126 237646 235301
51813 235301 233150 231246 229867 229436 230193 232001 234381 236620 237996 238218 237686 237150 237025 237101 236818 235689
51797B35689k032k358j702m74L00mj008k021k750l077k687j624o93n33n16M36
51781B14946K153L207K766J511N24O6j24p2L10Q42J267J561J733J689J558J777
51765B35714K591L793N145O552P585P449N929L852K169R43k89j634k941m318n793
51750B66747o734o454n335m536m477m340l325j785o31o6N97J944L680M948N205
51735B45438M681M021L602L360L193L244L648M187M342L701K149q6k455m292n248
51720B73485n434n101m381l520l000l106l482l500l052k687k869l325l227k052
51706B24749j94J344J983K112K376K657K274J134J8m74n46n38k41M60R49N72m15
51689B38220j190j449j468j390j135q46p80q36q13r08j267j336n18O90J173Q86
$$ plain form
51797 235689 233657 231299 229597 229123 229423 229419 228411 226390 223640 220563 217876 216252 215559 215026 214510 214946
51781 214946 217099 220306 223072 224583 225107 225173 225049 224977 225287 226129 227396 228957 230690 232379 233937 235714
51765 235714 238305 242098 247243 253795 261380 268829 274758 278610 280779 281722 281433 279799 276858 272540 266747
51750 266747 260013 253559 248224 243688 239211 234871 231546 229761 229130 229064 229661 231605 235285 240233 245438
51735 245438 250119 254140 257742 261102 264295 267539 271187 275374 279716 283417 285566 285480 283025 278733 273485
51720 273485 268051 262950 258569 255049 252049 248943 245461 241961 238909 236222 233353 230028 226801 224749
51706 224749 224555 225899 227882 229994 232370 235027 237301 238435 238453 237979 237433 236895 236654 237114 238063 238635 238220
51689 238220 237030 235581 234113 232723 231588 230742 229962 229126 228313 227405 226138 224802 224284 224974 226147 227033
51673B27033R85K081L396M011M073M114M005L341K279J307N35j63o42o93m27O9
51657B55304J100K814M579N518N353M257K229n50l049m132l974l862m296m317
51643B56974l194j871j812k898l577l009k091j994k539k681k101j486j323j200
51629B25198n84L35R45J063J030J212J761K670L733M476M524L951L007J703P9
51614B55103j326j912j882k055k711l269l292l107l057k820k015j032n05k69M50
51599B26301J922L612M912N522N157L526R66j436k745k933k629k367k352k568
51585B34888k817k847k690k614k477j499Q06L685N744O472O563O703O813O761
51571B63491P053Q069R109R081P949O685N911N454N334O162Q234J1015J4006J7400
$$ plain form
51673 227033 228018 230099 233495 237506 241579 245693 249698 253039 255318 256625 257160 256997 256355 255662 255235 255304
51657 255304 256404 259218 263797 269315 274668 278925 281154 280604 277555 273423 269449 265587 261291 256974
51643 256974 253780 251909 250097 247199 243622 240613 238522 236528 233989 231308 229207 227721 226398 225198
51629 225198 224614 224949 225894 226957 227987 229199 230960 233630 237363 241839 246363 250314 253321 255024 255103
51614 255103 253777 251865 249983 247928 245217 241948 238656 235549 232492 229672 227657 226625 226120 225851 226301
51599 226301 228223 231835 236747 242269 247426 250952 251918 250482 247737 244804 242175 239808 237456 234888
51585 234888 232071 229224 226534 223920 221443 219944 220750 224435 230179 236651 243214 249917 256730 263491
51571 263491 270544 278613 287722 296803 304752 311437 317348 322802 328136 334298 342532 353547 367553 384953
51557C84953K1196K4315K5447K4358K1788J8391J4520J0652P093L458p98n398
51545E49975r488j2703j5196j6843j7368j7231j7356j7786j7577j6265j4523j3045
51533C64594j1693j0230q917p930o851n378l817k440r74P04K098K863L296L541
51519C18866L078J724L44l94j162k826m826n881n898n851o052n870n153m585m452
51504B71062m201l544k940k654k286j714j564k188k965l186k986k784k410j465
51490B34175j58Q25J058N24o07j885k592k349j634j245j386j630j691j764k089
51475B17552k482k418j564k49O96P24J41l49n53q00j100r29j63M28J14p47j120
51458B07181n20O50J704K169J849J023M58O84J227J118K47l88N0J242K312K958
$$ plain form
51557 384953 406149 430464 455911 480269 502057 520448 534968 545620 552713 556171 555373 549975
51545 549975 540487 527784 512588 495745 478377 461146 443790 426004 408427 392162 377639 364594
51533 364594 352901 342671 333754 325824 318973 313595 309778 307338 306364 307068 309166 312029 315325 318866
51519 318866 321944 323668 324012 323618 322456 319630 314804 308923 303025 297174 291122 285252 280099 275514 271062
51504 271062 266861 263317 260377 257723 255437 253723 252159 249971 247006 243820 240834 238050 235640 234175
51490 234175 234017 234842 235900 236424 235817 233932 231340 228991 227357 226112 224726 223096 221405 219641 217552
51475 217552 215070 212652 211088 210839 211535 212259 212400 212051 211498 210698 209598 208669 208506 208934 209048 208301 207181
51458 207181 206661 207311 209015 211184 213033 214056 214514 215198 216425 217543 217790 217402 217452 218694 221006 223964
51442B23964L447L828L809L390K999K787K341J403M71K40O26Q75N03l84j597k972
51426B45730l827l141q37J608K625K337K215L086M285M805M492L710K552R95n37
51411B70098j423j631j774k354l207l838l987l773l435l130k910k727k364j573
51397B31972l72Q11J553J914K331K998L688M248M808N366N646N759O532Q532J1156
51382B96942J3398J5377J8196K2237K6365K9177L0336L0248K9079K6690K3290
51371E61335J9534J6056J3104J0418P254K824k919r050j4438j8589k1660k3964
51359E39905k5738k7057k7566k6666k4359k1675j9740j8553j7202j5211j3141
51348C02997j1666j0678r559q100o721n832n301m646l650k554j734j361j498k234
$$ plain form
51442 223964 227411 231239 235048 238438 241437 244224 246565 247968 248439 248679 249305 250180 250683 250299 248702 245730
51426 245730 241903 238762 237925 239533 242158 244495 246710 249796 254081 258886 263378 267088 269640 270635 270098
51411 270098 268675 267044 265270 262916 259709 255871 251884 248111 244676 241546 238636 235909 233545 231972
51397 231972 231600 232411 233964 235878 238209 241207 244895 249143 253951 259317 264963 270722 277254 285786 296942
51382 296942 310340 325717 343913 366150 392515 421692 452028 482276 511355 538045 561335
51371 561335 580869 596925 610029 620447 627701 630525 627606 618556 604118 585529 563869 539905
51359 539905 514167 487110 459544 432878 408519 386844 367104 348551 331349 316138 302997
51348 302997 291331 280653 271094 262994 256273 250441 245140 240494 236844 234290 232556 231195 229697 227463
51334B27463l373m165l842k514j212q14j202j648j630j062p9R79J608J540J098
51319B11147Q21Q09P34M16J21K34Q21J533J814J325K52q66j728k485l278l777
51303B07893l526k568j430n14J82P41J078J051O93K37l5N1M06P32Q10P06O26P13
51285B07846J012J483J939K112J938J655J505J483J487J525J579J466J052N13
51271B28595K12L90J033J852K310J990J092K61k16o50j209j481j183p89q30j006
51255B30371p28k26k88r63j410j156p08o95j106j700k459l232l443k744j601p40
51239B07172l29n3K34L56J47m26j249j901j817j011l19m08p86l44J061K274K258
51222B04859J323O19P15J117J125P28N06Q17J310J394J040Q37J169J650J605J003
$$ plain form
51334 227463 224090 219925 216083 213569 212357 211543 210341 208693 207063 206001 205922 206901 208509 210049 211147
51319 211147 211968 212777 213511 213927 214048 214282 215103 216636 218450 219775 220027 219161 217433 214948 211670 207893
51303 207893 204367 201799 200369 199855 200037 200778 201856 202907 203600 203837 203802 203853 204259 204991 205801 206507 207133 207846
51285 207846 208858 210341 212280 214392 216330 217985 219490 220973 222460 223985 225564 227030 228082 228595
51271 228595 228807 229197 230230 232082 234392 236382 237474 237735 237519 236869 235660 234179 232996 232207 231377 230371
51255 230371 229643 229417 229129 228166 226756 225600 224892 224197 223091 221391 218932 215700 212257 209513 207912 207172
51239 207172 206843 206790 207024 207380 207527 207101 205852 203951 202134 201123 200804 200396 199610 199266 200327 202601 204859
51222 204859 206182 206801 207516 208633 209758 210486 210992 211809 213119 214513 215553 216390 217559 219209 220814 221817
51206B21817M80M23M65P3o37j053q96n43m22m35k36J38K40j56p25j015r91q71
51188B15656o27k0Q54J429J368J076J219J765J980J398M92M4J41J66k46p07o92
51171B25296l03q2j85k19J30O89J144J496J891K215K204J882J608J632J808J828
51155B43034J515Q50p3r53j377j260j104j545k547l319l199k441j870j805j738
51140B22168j117j70L35pq25j438j415p86P8P21R34R10R25R45P87O29R47J841
51122B25462K745L059K794K411K207K143K092J994J812J589J439J417J403J292
51108B53859J098Q11L61j28k89OL96M87M09N60R95J420J618J511J021K43k95q2
51090B64001P12J406J653J632J444R04P3n76q22j043j488j709j181k07M34N88
$$ plain form
51206 221817 222297 222720 223185 223258 222621 221568 220672 220129 219707 219272 219036 219174 219414 219258 218533 217518 216527 215656
51188 215656 215029 215009 215863 217292 218660 219736 220955 222720 224700 226098 226590 226634 226775 226941 226695 225988 225296
51171 225296 224993 224911 224726 224507 224637 225326 226470 227966 229857 232072 234276 236158 237766 239398 241206 243034
51155 243034 244549 245399 245326 244373 242996 241736 240632 239087 236540 233221 230022 227581 225711 223906 222168
51140 222168 221051 220881 221216 221209 220384 218946 217531 216745 216823 217544 218478 219388 220313 221258 222045 222674 223621 225462
51122 225462 228207 231266 234060 236471 238678 240821 242913 244907 246719 248308 249747 251164 252567 253859
51108 253859 254957 255768 256129 256001 255712 255718 256114 256601 257010 257570 258565 259985 261603 263114 264135 264378 264083 264001
51090 264001 264713 266119 267772 269404 270848 271752 271825 271249 270427 269384 267896 266187 265006 264799 265233 265821
51074B65821Q93J789K891L555L742L991M755O074P810R887J2196J4375J5848J6101
51060C69728J4954J2649R789P197N712N898P771J0672J3459J5067J5080J3902
51048E01878J2275J0559Q430N255Q54m008p874r546r029p537o532o849q625j1594
51034D67657j4998j7581j8352j7445j5771j3827j1433q658o239m694l616k383
51022C32660j021J35J219K490L565L714K935K098J943K467L291M134M764M881
51008C69275M328L329K461K435L608N488P006P606P803Q250Q698Q490P749P188
50994D53714O937O434N562M988N107N450N461N248N070M781M205L644L518L872
50980E23991M565N661P279R356J1823J4697J7814K0813K3625K6579K9815L3007
$$ plain form
51074 265821 266714 268503 271394 274949 278691 282682 287437 293511 301321 311208 323404 337779 353627 369728
51060 369728 384682 397331 407120 414317 420029 425927 433698 444370 457829 472896 487976 501878
51048 501878 514153 524712 533142 538397 539251 535243 527369 517823 508794 501257 494725 487876 479251 467657
51034 467657 452659 435078 416726 399281 383510 369683 358250 349592 343353 338659 335043 332660
51022 332660 331639 331774 332993 335483 339048 342762 345697 347795 349738 352205 355496 359630 364394 369275
51008 369275 373603 376932 379393 381828 385436 390924 397930 405536 413339 421589 430287 438777 446526 453714
50994 453714 460651 467085 472647 477635 482742 488192 493653 498901 503971 508752 512957 516601 520119 523991
50980 523991 528556 534217 541496 550852 562675 577372 595186 615999 639624 666203 696018 729025
50968G29025L5946L8936M2267M5777M9277N2873N6502N9550O1466O2324O2325
50957A296268O1141N8396N4490N0263M5997M1367L6261L1042K6025K1212J6704
50946A739166J2918J0208Q488P284O060M555K998J799R76R8j086k379l744n680
50932A781661q615j2341j6576k1588k7565l3760l9091m3471m7700n2045n5749
50921A423160n8015n8741n8159n6512n4285n2036m9576m6030m1189l6207l2386
50910H80024k9686k7055k3902k0626j7835j5736j4291j3387j2697j1780j0563
50899F82466r435q698q174p600p073o774o384n304l524j897j193j217j141n67
50885F13485J83P54J221J757K235K469K602K941L582M405N300O234P225Q363R734
$$ plain form
50968 729025 764971 803907 846174 891951 941228 994101 1050603 1110153 1171619 1233943 1296268
50957 1296268 1357409 1415805 1470295 1520558 1566555 1607922 1644183 1675225 1701250 1722462 1739166
50946 1739166 1752084 1762292 1770780 1778064 1784124 1788679 1791677 1793476 1794452 1794550 1793464 1791085 1787341 1781661
50932 1781661 1773046 1760705 1744129 1722541 1694976 1661216 1622125 1578654 1530954 1478909 1423160
50921 1423160 1365145 1306404 1248245 1191733 1137448 1085412 1035836 989806 948617 912410 880024
50910 880024 850338 823283 799381 778755 760920 745184 730893 717506 704809 693029 682466
50899 682466 673031 664333 656159 648559 641486 634712 628328 623024 619500 617603 616410 615193 614052 613485
50885 613485 613668 614422 615643 617400 619635 622104 624706 627647 631229 635634 640934 647168 654393 662756 672490
50870F72490J1258J2756J4282J6073J8067J9844K1249K2745K4875K7670L0925
50859H92234L4673L8981M3567M8163N3054N8760O5294P2302P9755Q7933R6667
50848A571383J05168J12786J19546J25711J31154J35369J37903J38506J36893
50839B714419J32419J24245J12131R7140Q1128O5294M9516L3483J7981M548n801
50828C426503j2863j6590j6954j4424r776l347M748J3487K0808K4938K5326K1995
50816C463851J4687L277j1439k7934m4955o1994p8845r5051j09747j22069j31629
50805B798152j38436j42248j42355j38457j31481j22851j13107j01967q9745p7730
50795A599775o6873n6926m7318l8173k9918k2548j5986j0774p614o418o356o650
$$ plain form
50870 672490 683748 696504 710786 726859 744926 764770 786019 808764 833639 861309 892234
50859 892234 926907 965888 1009455 1057618 1110672 1169432 1234726 1307028 1386783 1474716 1571383
50848 1571383 1676551 1789337 1908883 2034594 2165748 2301117 2439020 2577526 2714419
50839 2714419 2846838 2971083 3083214 3180354 3261482 3326776 3376292 3409775 3427756 3432304 3426503
50828 3426503 3413640 3397050 3380096 3365672 3355896 3352549 3357297 3370784 3391592 3416530 3441856 3463851
50816 3463851 3478538 3481815 3470376 3442442 3397487 3335493 3256648 3161597 3051850 2929781 2798152
50805 2798152 2659716 2517468 2375113 2236656 2105175 1982324 1869217 1767250 1677505 1599775
50795 1599775 1532902 1475976 1428658 1390485 1360567 1338019 1322033 1311259 1303645 1297227 1290871 1284221
50783A284221o951p185p515q290r582j0954j2031j2971j3968j4693j4837j4926
50771A150318j5866j7821k0097k2135k3924k5410k6190k5991k4997k3536k1822
50760I02529k0029j8236j6184j3615j0913q894p709o508m513j972L75K413M659
50747H01403P320J0012J2441J4906J7854K1300K5023K9033L3434L7853M1548M4329
50735A096456M6974N0356N4357N8116O1209O3969O6615O8672O9643O9765O9592
50724A775724O9163O8003O5621O1565N5241M6415L5763K4323J2500L29j1243k0298
50712B183106k5568k7478k7066k4494j9416j2361m845K006Q131J3657J7955J9975
50700B103602J9141J5503R241M45j0628k3324l6637m9370o0313o8592p3876p6262
$$ plain form
50783 1284221 1277270 1270085 1262570 1254280 1244698 1233744 1221713 1208742 1194774 1180081 1165244 1150318
50771 1150318 1134452 1116631 1096534 1074399 1050475 1025065 998875 972884 947887 924351 902529
50760 902529 882500 864264 848080 834465 823552 814658 806949 800441 795928 793956 794331 796744 801403
50747 801403 808723 818735 831176 846082 863936 885236 910259 939292 972726 1010579 1052127 1096456
50735 1096456 1143430 1193786 1248143 1306259 1367468 1431437 1498052 1566724 1636367 1706132 1775724
50724 1775724 1844887 1912890 1978511 2040076 2095317 2141732 2177495 2201818 2214318 2214647 2203404 2183106
50712 2183106 2157538 2130060 2102994 2078500 2059084 2046723 2041878 2043884 2052015 2065672 2083627 2103602
50700 2103602 2122743 2138246 2147487 2147932 2137304 2113980 2077343 2027973 1967660 1899068 1825192 1748930
50688A748930p5956p3236o8557o2467n5406m7721l9862l2158k4402j5965o671
50677A246529K693J0979J7794K3778K9700L5440L9871M1731M0683L7559L3591
50666A560348K9450K5186K0970J7382J4838J3146J1949J1268J1147J1139J0669
50655A737492R814R165Q973R055R545J1049J3846J7423K1098K4658K8259L2035
50643A932412L6041M0072M3339M4837M4422M3029M1429L9343L6377L3277L1344
50632B365922L0664K9850K7535K3321J6841O835p860k6294m4944n9571o7604o8970
50620B225725o5178n7948m8559l7953k6959j6331o715J378P728J2473J5810J7536
50608B021007J7006J3566O949k551j4003k5977l7171m7038n5549o2399o7002o9284
$$ plain form
50688 1748930 1672974 1599738 1531181 1468714 1413308 1365587 1325725 1293567 1269165 1253200 1246529
50677 1246529 1249222 1260201 1277995 1301773 1331473 1366913 1406784 1448515 1489198 1526757 1560348
50666 1560348 1589798 1614984 1635954 1653336 1668174 1681320 1693269 1704537 1715684 1726823 1737492
50655 1737492 1747306 1756471 1765444 1774499 1784044 1795093 1808939 1826362 1847460 1872118 1900377 1932412
50643 1932412 1968453 2008525 2051864 2096701 2141123 2184152 2225581 2264924 2301301 2334578 2365922
50632 2365922 2396586 2426436 2453971 2477292 2494133 2500968 2493108 2466814 2421870 2362299 2294695 2225725
50620 2225725 2160547 2102599 2054040 2016087 1989128 1972797 1966082 1967460 1975188 1987661 2003471 2021007
50608 2021007 2038013 2051579 2058528 2055977 2041974 2015997 1978826 1931788 1876239 1813840 1746838 1677554
50596A677554o9895o9314o7337o3861n9570n5347n1364m7402m3685m0633l7927
50585A071219l4704l0779k6995k4137k1997j9761j6941j3677j0429p635n427l549
50573H55188j642L13K029L394M648O083P780R727J1953J4455J7148J9922K2688
50560I73686K5385K8123L1168L4558L7801M0252M1728M2489M2671M2056M0452
50549A380369L8034L5288L2838L1286L0894L1443L2599L4491L7618M2238M8050
50538A775148N4351O0387O5803P1103P7392Q5174R3678J01896J09953J18513J26966
50527B740364J33448J36960J38483J39227J38601J34816J27020J15857J02199
50518C906975Q6219O7838M7294K5010J444k2628m6017o7637q6961j03821j17815
$$ plain form
50596 1677554 1607659 1538345 1471008 1407147 1347577 1292230 1240866 1193464 1149779 1109146 1071219
50585 1071219 1036515 1005736 978741 954604 932607 912846 895905 882228 871799 864164 858737 855188
50573 855188 853546 853859 855888 859282 863930 870013 877793 887520 899473 913928 931076 950998 973686
50560 973686 999071 1027194 1058362 1092920 1130721 1170973 1212701 1255190 1297861 1339917 1380369
50549 1380369 1418403 1453691 1486529 1517815 1548709 1580152 1612751 1647242 1684860 1727098 1775148
50538 1775148 1829499 1889886 1955689 2026792 2104184 2189358 2283036 2384932 2494885 2613398 2740364
50527 2740364 2873812 3010772 3149255 3288482 3427083 3561899 3688919 3804776 3906975
50518 3906975 3993194 4061032 4108326 4133336 4134780 4112152 4066135 3998498 3911537 3807716 3689901
50507C689901j28073j33595j33790j28731j18967j05203q8182o8761m7820k6079
50497B710700m248J6611L5154N0235O1087O6847O6264N8227M2589K0480o021l4436
50485C083489o2387q7858j09144j24796j34141j37850j37525j34469j29171j21995
50475A904153j13712j05005r5973q6691p7750o9712o2413n5449m9020m3600l9005
50464A105823l4626l0403k6787k3750k0738j7709j5340j3861j2556j0862r196
50453H89995q082p066n309k838l90J716L770N761P100P458P252O973O508N464
50439I18312M007K919K893L986N758P815J0106J2684J5295J7376J8645J9502K0613
50426A059911K2116K3546K4549K5391K6649K8623L1221L4233L7543M1191M5391
$$ plain form
50507 3689901 3561828 3428233 3294443 3165712 3046745 2941542 2853360 2784599 2736779 2710700
50497 2710700 2706452 2723063 2758217 2808452 2869539 2936386 3002650 3060877 3103466 3123946 3117925 3083489
50485 3083489 3021102 2933244 2824100 2699304 2565163 2427313 2289788 2155319 2026148 1904153
50475 1904153 1790441 1685436 1589463 1502772 1425022 1355310 1292897 1237448 1188428 1144828 1105823
50464 1105823 1071197 1040794 1014007 990257 969519 951810 936470 922609 910053 899191 889995
50453 889995 881913 874847 869538 866700 866310 868026 871796 877557 884657 892115 899367 906340 912848 918312
50439 918312 922319 925238 928131 932117 937875 945690 955796 968480 983775 1001151 1019796 1039298 1059911
50426 1059911 1082027 1105573 1130122 1155513 1182162 1210785 1242006 1276239 1313782 1354973 1400364
50415A400364N0346N5893O1340O5921O9351P1815P3463P4090P3354P1076O7316
50404B134329O2262N6145M9125M1152L1947K1115Q334o378k2349l8220n2541o4493
50392B220428p3978q0948q4963q5540q2723p7013o8909n8807m7351l5477k3915
50381A500804j2770j759R071J8943K6597L1019L1984K9941K5295J7933P596n217
50369A679437j8991l1968m3168n2485n9884o4822o6686o5695o3012n9790n6350
50358A096586n2536m8598m5186m2444l9588l5789l1158k6512k2372j8587j4881
50347G18935j1313q007m838j583J692M519O236O307M632J709j485l888m828m408
50333G03680l514l097l238l154k360j428j131j187o55N09J232R00K97L81Q61P78
$$ plain form
50415 1400364 1450710 1506603 1567943 1633864 1703215 1775030 1848493 1922583 1995937 2067013 2134329
50404 2134329 2196591 2252736 2301861 2343013 2374960 2396075 2404409 2398031 2375682 2337462 2284921 2220428
50392 2220428 2146450 2065502 1980539 1894999 1812276 1735263 1666354 1607547 1560196 1524719 1500804
50381 1500804 1488034 1486275 1495346 1514289 1540886 1571905 1603889 1633830 1659125 1677058 1684654 1679437
50369 1679437 1660446 1628478 1585310 1532825 1472941 1408119 1341433 1275738 1212726 1152936 1096586
50358 1096586 1044050 995452 950266 907822 868234 832445 801287 774775 752403 733816 718935
50347 718935 707622 699615 694777 693194 694886 699405 705641 711948 716580 718289 716804 712916 708088 703680
50333 703680 700166 697069 693831 690677 688317 686889 685758 684571 683916 684425 685657 686557 686854 687235 688096 688874
50317F88874R5k59K15J045J785K722M238O079P692Q956J0044J0860J1064J0661
50303G64071J0088R760R725R855R983R818R044P757O580O056O025N846N201M361
50289H74170L622K877J957J153J007J655K772M226O463J0059J4991K0494K5331
50276I70777K7956K6630K0062Q523n571j8455k6925k9889k8488k4863k0711j6684
50264H82362j2735q764m848r93L152P940J3033J7326K0084K1986K4587K8557L2871
50251A024558L5907L6887L5946L3476K9967K6081K2233J8241J4053J0572Q886
50240A296807Q649Q067N707J570l794j0378j8337k7079l5397m2229m6925m9086
50228A087575m8708m6355m2824l8707l4373l0027k5705k1520j8167j6671j7292
$$ plain form
50317 688874 688969 688710 688925 689970 691755 694477 698715 704794 712486 721442 731486 742346 753410 764071
50303 764071 774159 783919 793644 803499 813482 823300 832344 840101 846681 852737 858762 864608 869809 874170
50289 874170 877792 880669 882626 883779 884786 886441 889213 893439 899902 909961 924952 945446 970777
50276 970777 998733 1025363 1045425 1053948 1048377 1029922 1002997 973108 944620 919757 899046 882362
50264 882362 869627 860863 856015 855022 858174 866114 879147 896473 916557 938543 963130 991687 1024558
50251 1024558 1060465 1097352 1133298 1166774 1196741 1222822 1245055 1263296 1277349 1287921 1296807
50240 1296807 1305456 1313523 1319230 1320800 1317006 1306628 1288291 1261212 1225815 1183586 1136661 1087575
50228 1087575 1038867 992512 949688 910981 876608 846581 820876 799356 781189 764518 747226
50217G47226j9067k0677k1359k0855j9197j6993j5228j4127j2798j0658q552p572
50205E60143p399o942o171o024o611o885o307n614n564n909o113o216o386o360
50191D71642n931n463n357n460n433n233m979m654m342m223m109l551k675k239
50177D07993k489k594j832o49J26M96R96J694K314K977L931M838N215N394O142
50162D34552P418Q385Q758R181J0061J0882J1080J0931J1085J1625J2089J2151
50150E58198J1926J1730J1759J1979J2270J2790J4151J6885K0811K5279L0000
50139G37778L5251M1214M7593N3961O0061O5508O9479P0969O9378O4923N8842
50128A374957N2985M8735M6244M4932M4414M4280M3161L9115L1266K0390P629
$$ plain form
50217 747226 728159 707482 686123 665268 646071 629078 613850 599723 586925 576267 567715 560143
50205 560143 552744 545802 539631 533607 526996 520111 513804 508190 502626 496717 490604 484388 478002 471642
50191 471642 465711 460248 454891 449431 443998 438765 433786 429132 424790 420567 416458 412907 410232 407993
50177 407993 405504 402910 401078 400429 400555 401051 402047 403741 406055 409032 412963 417801 423016 428410 434552
50162 434552 441970 450355 459113 468294 478355 489237 500317 511248 522333 533958 546047 558198
50150 558198 570124 581854 593613 605592 617862 630652 644803 661688 682499 707778 737778
50139 737778 773029 814243 861836 915797 975858 1041366 1110845 1181814 1251192 1316115 1374957
50128 1374957 1427942 1476677 1522921 1567853 1612267 1656547 1699708 1738823 1770089 1790479 1798108
50117A798108o473k1192l4929m6209n4884o1520o6053o7972o7455o5337o2008
50106A244076n7311n1528m5445l9312l2644k5501j9138j4854j2675j1698j1251
50095I22719j1145j1077j0506r185p464n990n151m888m865m918n289o215p392
50082H28634q162q312q365q891r891j1024j2062j2851j3102j2670j1811j0818
50070G00675r611q054o474n362m596l519j870j93R45J755K921M612O214P036P066
50055F91545O834O699O492N873M872L872L191K881K837K859K502J312o57k719
50041G38393m242n199n862o259o264o074o063o186n897m857l378k038j011m6J105
50026F76122K408L764N316P401J0118J3109J5940J8695K1933K5986L0499L4734
$$ plain form
50117 1798108 1791635 1770443 1735514 1689305 1634421 1572901 1506848 1438876 1371421 1306084 1244076
50106 1244076 1186765 1135237 1089792 1050480 1017836 992335 973197 958343 945668 933970 922719
50095 922719 911574 900497 889991 880806 873342 867352 862201 857313 852448 847530 842241 836026 828634
50082 828634 820472 812160 803795 794904 785013 773989 761927 749076 735974 723304 711493 700675
50070 700675 691064 683010 676536 671174 666578 663059 661189 660996 661941 663696 666617 671229 677443 684479 691545
50055 691545 698379 705078 711570 717443 722315 726187 729378 732259 735096 737955 740457 741769 741112 738393
50041 738393 734151 728952 723090 716831 710567 704493 698430 692244 686347 681490 678112 676074 675063 675017 676122
50026 676122 678530 682294 687610 695011 705129 718238 734178 752873 774806 800792 831291 866025
50014H66025L7980L9494L8552L5115L0259K5456K1371J7807J4712J2658J2135
50003A151564J2771J3491J3084J0593N514j977j1097k0879l0374l8562m4498m7855
49991A011775m9084m8872m7592m5303m2069l8112l3905l0165k7406k5381k3404
49980F00482k1379k0056j9835j9788j8526j5892j3188j1603j0958j0229q909p499
49968D22620o699o516o346n819n210m865m504l560k126j074r99j463j550r23Q5
49953C71051J137K210L292M132M465M346M217M605N597O561O681N894M972M547
49939D33707M390L928L046J909L76j742m000n598o433p216q415r554r833r071
49925C85494p740o379n286m496l783k765j311K13J251J613J579J512J513J468
$$ plain form
50014 866025 904005 943499 982051 1017166 1047425 1072881 1094252 1112059 1126771 1139429 1151564
50003 1151564 1164335 1177826 1190910 1201503 1207017 1205040 1193943 1173064 1142690 1104128 1059630 1011775
49991 1011775 962691 913819 866227 820924 778855 740743 706838 676673 649267 623886 600482
49980 600482 579103 559047 539212 519424 500898 485006 471818 460215 449257 439028 430119 422620
49968 422620 415921 409405 403059 397240 392030 387165 382661 379101 376975 375901 374902 373439 371889 370966 371051
49953 371051 372188 374398 377690 381822 386287 390633 394850 399455 405052 411613 418294 424188 429160 433707
49939 433707 438097 442025 445071 446980 447356 445614 441614 436016 429583 422367 413952 404398 394565 385494
49925 385494 377754 371375 366089 361593 357810 355045 353734 353947 355198 356811 358390 359902 361415 362883
49911C62883J296J111J040J034R54Q73J087J678K370K926L518M357N219N730N964
49896D02040O250O416N817M337K858K302K511K481J627L23p66j530k370l579n108
49881D23609o861q823j0687j1574j0699q332n769m123l394k985k712k844l263
49868C41543l230k184m32J147J885J720J084O44R05J845K873L383L413L658M711
49853C62965O276P360P371O813O599O810O708N929N001M388L715K483J020k9p50
49838D32659j671k663l053k882l155m545o488p841p951o889n181l579k615k071
49824C72075j333l11N02R74J579K439K977K987L245M329N505N712N202N166N859
49809D16907O169N225L623K637K758L420L818L550K633J293j81j505k503l282
$$ plain form
49911 362883 364179 365290 366330 367364 368318 369191 370278 371956 374326 377252 380770 385127 390346 396076 402040
49896 402040 408290 414706 420523 424860 427718 430020 432531 435012 436639 436962 436196 434666 432296 428717 423609
49881 423609 416748 407925 397238 385664 374965 366633 360864 356741 353347 350362 347650 344806 341543
49868 341543 338313 336129 335697 336844 338729 340449 341533 342177 343082 344927 347800 351183 354596 358254 362965
49853 362965 369241 376601 383972 390785 397384 404194 410902 416831 421832 426220 429935 432418 433438 433409 432659
49838 432659 430988 428325 425272 422390 419235 414690 408202 400361 392410 385521 380340 376761 374146 372075
49824 372075 370742 370431 370933 371907 373486 375925 378902 381889 385134 389463 394968 400680 405882 411048 416907
49809 416907 423076 428301 431924 434561 437319 440739 444557 448107 450740 452033 451852 450347 447844 444562
49795D44562m261n805p749r489j0593j1090j1003j0083q334o440n163m547m173
49782C45832l943l981l929l178j948j282j630k072j486rJ329K048K575L253L794
49767C35373L951M113M788N890O932P676Q132Q096P225N694M278L538L161K397
$$ plain form
49795 444562 440301 434496 426747 417258 406665 395575 384572 374489 366155 359715 354552 350005 345832
49782 345832 341889 337908 333979 330801 328853 327571 325941 323869 322383 322374 323703 325751 328326 331579 335373
49767 335373 339324 343437 348225 354115 361047 368723 376855 384951 392176 397870 402148 405686 408847 411244
$$ [...]
##END NTUPLES=NMR SPECTRUM
##END=
