##TITLE=NES1091_ptc150_9886786_xp99UfWG80
##JCAMPDX= 6.0         $$ Bruker NMR JCAMP-DX V2.0
##DATA TYPE= NMR SPECTRUM
##DATA CLASS= NTUPLES
##ORIGIN= BRUKER
##OWNER= Administrator
$$ 1.72 TOPSPIN		Version 2.1
$$ 2016-08-28 19:51:17.211 -0500  Administrator@X
$$ Compression mode = diff/dup
##.OBSERVE FREQUENCY= 400.02188249412
##.OBSERVE NUCLEUS= ^1H
##.ACQUISITION MODE= SIMULTANEOUS (DQD)
##.ACQUISITION SCHEME= undefined
##.AVERAGES= 8
##.DIGITISER RES= 22
##SPECTROMETER/DATA SYSTEM= spect
##.PULSE SEQUENCE= zg30
##.SOLVENT NAME= COFFEE_meoh
##.SHIFT REFERENCE= INTERNAL, COFFEE_meoh, 1, 14.98509
##AUDIT TRAIL= $$ (NUMBER, WHEN, WHO, WHERE, PROCESS, VERSION, WHAT)
$$ ##TITLE= Audit trail, TOPSPIN		Version 2.1
$$ ##JCAMPDX= 5.01
$$ ##ORIGIN= Bruker BioSpin GmbH
$$ ##OWNER= Administrator
$$ $$ E:\/data/COFFEE/nmr/NES1091_ptc150_9886786_xp99UfWG80/10/pdata/1/auditp.txt
$$ ##AUDIT TRAIL=  $$ (NUMBER, WHEN, WHO, WHERE, PROCESS, VERSION, WHAT)
(   1,<2016-08-28 19:51:10.101 -0500>,<Administrator>,<X>,<go>,<TOPSPIN 2.1>,
      <created by zg
	started at 2016-08-28 19:50:04.492 -0500,
	POWCHK enabled, PULCHK disabled,
       configuration hash MD5:
       21 0F 79 D6 B3 7B B4 F6 88 20 88 DB 03 48 BD 9F
       data hash MD5: 64K
       A0 60 85 BA C7 C3 BD 92 39 12 20 6D 13 11 D6 C3>)
(   2,<2016-08-28 19:51:13.211 -0500>,<Administrator>,<X>,<proc1d>,<TOPSPIN 2.1>,
      <Start of raw data processing
       efp LB = 0 FT_mod = 6 PKNL = 1 PHC0 = 0 PHC1 = 0 SI = 32K 
       data hash MD5: 32K
       CD 29 1D 1C BC 8C 7F 5E A3 DB 81 D4 49 55 59 18>)
(   3,<2016-08-28 19:51:13.492 -0500>,<Administrator>,<X>,<proc1d>,<TOPSPIN 2.1>,
      <pk PHC0 = 89.34631 PHC1 = 0 
       data hash MD5: 32K
       06 75 AE 9D 3F 59 21 DD 10 0B 12 8D F4 CE 90 8E>)
(   4,<2016-08-28 19:51:13.586 -0500>,<Administrator>,<X>,<proc1d>,<TOPSPIN 2.1>,
      <abs ABSG = 1 
       data hash MD5: 32K
       8C 9C 93 32 1A 0B C9 CC FA 08 BD 69 00 5D 59 8E>)
(   5,<2016-08-28 19:51:13.664 -0500>,<Administrator>,<X>,<proc1d>,<TOPSPIN 2.1>,
      <abs ABSG = 2 
       data hash MD5: 32K
       C3 7A E1 86 02 CB FF B6 77 1B BD 3E 76 72 57 2F>)
(   6,<2016-08-28 19:51:13.711 -0500>,<Administrator>,<X>,<proc1d>,<TOPSPIN 2.1>,
      <abs ABSG = 3 
       data hash MD5: 32K
       6F 7B 46 B4 15 4A 4C 02 F9 97 9D 01 D3 7D AD FF>)
(   7,<2016-08-28 19:51:13.758 -0500>,<Administrator>,<X>,<proc1d>,<TOPSPIN 2.1>,
      <abs ABSG = 4 
       data hash MD5: 32K
       48 24 20 92 22 5A 78 60 88 1C D1 11 74 14 B7 FF>)
(   8,<2016-08-28 19:51:13.820 -0500>,<Administrator>,<X>,<proc1d>,<TOPSPIN 2.1>,
      <abs ABSG = 5 
       data hash MD5: 32K
       B1 F9 1A 1E 07 F3 22 E2 E2 16 AE 19 F2 A3 94 A1>)
$$ ##END=
$$ 
$$ $$ hash MD5
$$ $$ BF 5B 76 11 A8 50 89 A4 83 FB C1 16 E2 5C 3C 67
##$RELAX= 
##$RELAX= 
##$RELAX= 
##$RELAX= 
##$RELAX= 
##$RELAX= 
##$RELAX= 
$$ Bruker specific parameters
$$ --------------------------
##$DU= <E:\>
##$EXPNO= 10
##$NAME= <NES1091_ptc150_9886786_xp99UfWG80>
##$PROCNO= 1
$$ [...]
150 150 150 150 150 150 150 150
##$TP07= 0
##$TPNAME0= <>
##$TPNAME1= <>
##$TPNAME2= <>
##$TPNAME3= <>
##$TPNAME4= <>
##$TPNAME5= <>
##$TPNAME6= <>
##$TPNAME7= <>
##$TPOAL= (0..7)
0.5 0.5 0.5 0.5 0.5 0.5 0.5 0.5
##$TPOFFS= (0..7)
0 0 0 0 0 0 0 0
##$TUNHIN= 0
##$TUNHOUT= 0
##$TUNXOUT= 0
##$USERA1= <user>
##$USERA2= <user>
##$USERA3= <user>
##$USERA4= <user>
##$USERA5= <user>
##$V9= 5
##$VALIST= <valist>
##$VCLIST= <CCCCCCCCCCCCCCC>
##$VD= 0
##$VDLIST= <DDDDDDDDDDDDDDD>
##$VPLIST= <PPPPPPPPPPPPPPP>
##$VTLIST= <TTTTTTTTTTTTTTT>
##$WBST= 2048
##$WBSW= 25
##$XGAIN= (0..3)
0 0 0 0
##$XL= 0
##$YL= 0
##$YMAX_a= 589041
##$YMIN_a= -513886
##$ZGOPTNS= <>
##$ZL1= 120
##$ZL2= 120
##$ZL3= 120
##$ZL4= 120
##$ABSF1= 14.98509
##$ABSF2= -5.573092
##$ABSG= 5
##$ABSL= 3
##$ALPHA= 0
##$AQORDER= 0
##$ASSFAC= 0
##$ASSFACI= 0
##$ASSFACX= 0
##$ASSWID= 0
##$AUNMP= <proc_prof1d_extract_pilot.lims>
##$AXLEFT= 0
##$AXNAME= <>
##$AXNUC= <1H>
##$AXRIGHT= 0
##$AXTYPE= 0
##$AXUNIT= <>
##$AZFE= 0.1
##$AZFW= 0.1
##$BCFW= 0
##$BC_mod= 0
##$BYTORDP= 0
##$COROFFS= 0
##$CY= 15
##$DATMOD= 1
##$DC= 0
##$DFILT= <>
##$DTYPP= 0
##$F1P= 0
##$F2P= 0
##$FCOR= 0.5
##$FTSIZE= 32768
##$FT_mod= 6
##$GAMMA= 0
##$GB= 0
##$INTBC= 1
##$INTSCL= 1
##$ISEN= 128
##$LB= 0
##$LEV0= 0
##$LPBIN= 0
##$MAXI= 10000
##$MC2= 0
##$MEAN= 0
##$ME_mod= 0
##$MI= 0
##$NCOEF= 0
##$NC_proc= -8
##$NLEV= 6
##$NOISF1= 0
##$NOISF2= 0
##$NSP= 0
##$NTH_PI= 0
##$NZP= 0
##$OFFSET= 14.98509
##$PC= 1
##$PHC0= 89.34631
##$PHC1= 0
##$PH_mod= 1
##$PKNL= yes
##$PPARMOD= 0
##$PPDIAG= 0
##$PPIPTYP= 0
##$PPMPNUM= 2147483647
##$PPRESOL= 1
##$PSCAL= 4
##$PSIGN= 0
##$PYNMP= <proc.py>
##$REVERSE= no
##$SF= 400.02
##$SI= 32768
##$SIGF1= 0
##$SIGF2= 0
##$SINO= 400
##$SIOLD= 32768
##$SPECTYP= <>
##$SREGLST= <1H.CDCl3>
##$SSB= 0
##$STSI= 32768
##$STSR= 0
##$SW_p= 8223.68421052631
##$SYMM= 0
##$S_DEV= 0
##$TDeff= 65536
##$TDoff= 0
##$TI= <>
##$TILT= no
##$TM1= 0
##$TM2= 0
##$TOPLEV= 0
##$USERP1= <user>
##$USERP2= <user>
##$USERP3= <user>
##$USERP4= <user>
##$USERP5= <user>
##$WDW= 1
##$XDIM= 32768
##$YMAX_p= 443408643
##$YMIN_p= -763579
##$CURPLOT= <Network HP LaserJet P1505>
##$CURPRIN= <$Network HP LaserJet P1505>
##$DFORMAT= <normdp>
##$LAYOUT= <+/1D_H.xwp>
##$LFORMAT= <normlp>
##$PFORMAT= <normpl>
##$SURQMSG= 1
$$ End of Bruker specific parameters
$$ ---------------------------------
##NTUPLES= NMR SPECTRUM
##VAR_NAME=  FREQUENCY,     SPECTRUM/REAL,   SPECTRUM/IMAG
##SYMBOL=    X,             R,               I
##VAR_TYPE=  INDEPENDENT,   DEPENDENT,       DEPENDENT
##VAR_FORM=  AFFN,          ASDF,            ASDF
##VAR_DIM=   32768,         32768,           32768
##UNITS=     HZ,            ARBITRARY UNITS, ARBITRARY UNITS
##FACTOR=    0.250966925370066, 1,           1
##FIRST=     8223.43324360094, -27584,       -256277
##LAST=      0,             -272457,         -1552
##MIN=       0,             -763579,         0
##MAX=       8223.43324360094, 443408643,    0
$$ Real data points
##PAGE= N=1
##DATA TABLE= (X++(R..R)), XYDATA
$$ [...]
19585A07628b82066f7806j69193Q9559A0377b11862b1818A34169a06979F4215
19574E9063a53448A42441E2836a01068n2051A90864e4469D0020C80J16056b19120
19562B6901c89774a21458q1904j07835I0764L3989K21317A2936b42102A35435
19551B939d5400j86153K9459g2368j33016k53395d0609J0509r0450E8118L4794
19540I2912b7802l04398a42469H2439a3519l23240Q7802B9622Q3091b28822e7132
19528b81639N5461A13370h7537B93914L0559r7253a89114j93383J54303k0649
19518b48843D1231Q1522l1251b0111E854e8382o5363j34829a13104D2083c06553
19506A21177E0799a80816B7009L51160b61176e3355k0593I7273d41576A14889
$$ plain form
19585 107628 -282066 -67806 -236999 -147440 10377 -211862 -21818 134169 -106979 64215
19574 59063 -153448 142441 52836 -101068 -153119 190864 -54469 40020 380 116436 -219120
19562 26901 -389774 -121458 -203362 -311197 90764 124753 346070 12936 -242102 135435
19551 2939 -45400 -231553 -202094 -72368 -205384 -458779 -40609 -30100 -120550 58118 92912
19540 92912 -27802 -332200 -142469 82439 -13519 -336759 -248957 29622 112713 -228822 -57132
19528 -281639 -226178 113370 -87537 293914 324473 227220 -189114 -382497 -228194 -248843
19518 -248843 41231 122753 91502 -20111 5854 -58382 -123745 -258574 -113104 42083 -306553
19506 121177 50799 -180816 27009 378169 -261176 -53355 -73948 97273 -441576 114889
19495a31369A19612g9050j86696J19922e3719A42297J2036C5667d7484j0170A91549
19483D23g9749A6171Q1967h4834a3801r3249k22119b2485C7927e8002n930E5519
19470D941L39596i0158k42781k4320a15805B92052a6761j44191g760O4k56022
19459b63718b5251j39983h1734B02956c95647c6797j79570q1698B74850e4032
19448B55430c5834r5013d5514h393k71315e5636l30822J23018a24011C15085a05742
19436C2507J48615c36088A16544I770i4372m6070A56884J8294a94458b0654k25066
19425b45720A25493f1291b8290D5813a91397A87942C0313c85464O6340B7589c77073
19413a19295a773B71227B7092Q5243a8288l06647A46526a53265l993j77560A51684
$$ plain form
19495 -131369 119612 -79050 -265746 -145824 -53719 142297 154333 35667 -47484 -57654 191549
19483 423 -79749 16171 98138 -84834 -13801 -107050 -329169 -22485 37927 -58002 -63932 55519
19470 4941 344537 -90158 -332939 -357259 -115805 292052 -16761 -160952 -7760 -7696 -263718
19459 -263718 -25251 -165234 -81734 202956 -395647 -36797 -216367 -298065 274850 -54032
19448 255430 -35834 -130847 -45514 -8393 -279708 -55636 -386458 -263440 -124011 315085 -105742
19436 32507 181122 -336088 116544 9770 -94372 -140442 156884 175178 -194458 -20654 -245720
19425 -245720 125493 -61291 -28290 45813 -191397 187942 30313 -385464 -319124 27589 -377073
19413 -119295 -1773 271227 27092 112335 -18288 -324935 146526 -153265 -157258 -334818 151684
19401a07775L2432B1303b79659J26365j50412H0037L0724g4935a0237A40568a2328
19389a11827B7778a19292N279o5094A24852Q6864a02711j60424B69884j31267
19379A38617J379D8167R1485c02752D1135J69924a61373f234D293K21941j02452
19368A23782b65585B62248f0332n6626E6655b63650H7931J84225G2205g6736n34953
19357f11689C09590j45525f3309k29857l6408H6342g9553r5161j54380A09962
19346b29953D3379a93A8604a5612A49741g3421n5917q5082c6914j87365n8230
19335b82509O116Q7691A56468b06217Q0719A77539b19694r3039A12873b1457j45065
19324a66522A921a58694f6004A88403e5135B81090I5621c0422B41303A08204a19868
$$ plain form
19401 -107775 -75343 21303 -279659 -153294 -303706 80037 110761 -74935 -10237 140568 -12328
19389 -111827 27778 -119292 -114013 -179107 124852 211716 -102711 -263135 269884 138617
19379 138617 139996 48167 139652 -302752 41135 211059 -161373 -6234 4293 226234 123782
19368 123782 -265585 262248 -60332 -116958 56655 -263650 87931 272156 72205 -76736 -611689
19357 -611689 309590 164065 -63309 -293166 -329574 86342 -79553 -174714 -329094 109962
19346 -229953 43379 -193 18604 -15612 149741 -73421 -129338 -214420 -36914 -224279 -282509
19335 -282509 -276393 -188702 156468 -206217 -125498 177539 -219694 -312733 112873 -21457 -166522
19324 -166522 1921 -158694 -66004 188403 -55135 281090 95621 -30422 241303 108204 -119868
19312E0067J3875l1271b0810C9550a51928j9824o3312C2353N4254J66556j13584
19301A39579L5203N4201D2255b24933i6056p2965K0239j08832L9164b3084B07586
19289a73484j0647M0628j80499a6942G895J49557h5812B2855b32821q8948A18213
19277A93100c99665a40552B59443a56381e5199p8451r826j45204e126G3778L61725
19266D35503i009k73432J33489M3321B43241F7853M87b94779M439A26756D7804
19254A86508a64525K4883d7247j23929A1533J71581b08997l298q2258B8605J19685
19243A48290o6582g190k85226j50746a79566L3232L6390j14028A4403P9393I9
19231A01394b01279A07386A2863b57407E2742d85081b0145j52871K6959A79150
$$ plain form
19312 50067 63942 32671 -20810 39550 -151928 -171752 -235064 32353 86607 253163 139579
19301 139579 174782 228983 42255 -224933 -96056 -169021 -148782 -257614 -218450 -23084 207586
19289 -173484 -184131 -143503 -324002 -16942 7895 157452 -85812 22855 -232821 -321769 118213
19277 193100 -399665 -140552 259443 -156381 -55199 -133650 -143476 -288680 -5126 73778 435503
19266 435503 -9009 -282441 -148952 -105631 243241 67853 68340 -294779 -290340 126756 47804
19254 186508 -164525 -139642 -47247 -171176 11533 183114 -208997 -212295 -294553 28605 148290
19243 148290 81708 -7190 -292416 -443162 -179566 -146334 -109944 -223972 14403 93796 99
19231 101394 -201279 107386 12863 -257407 52742 -485081 -20145 -173016 -146057 179150
19220b1464k89219A04573a52425A48818g4134j24670B17281A2749J63225b35303
19209A6566a21744E7101M9624b05177a5143l7675A33923a09096d3750l4122a2563
19197d2878k683A68443a26813M8144F3705c54457K5436A42406a24752r5277K6768
19186a93261I3590h7829C7717L06549a33522l67817a41811A03202J2598b48466
19175a42710q0105B48233c54615D1198A5574a42286L4304c466A43792a86202e1564
19163B82280A21677a8843j08579G7408b9090a3509A8002b74733J8949P3287I197
19151a7041k24095a8586j06478c0992r617o6682p7272M0854e9090f981k22755
19140b29736B29046h445P47j11080D8867a47996N1555j48993I2710N7773C4385
$$ plain form
19220 -21464 -310683 104573 -152425 148818 -74134 -198804 217281 12749 175974 -235303
19209 16566 -121744 57101 106725 -205177 -15143 -52818 133923 -109096 -43750 -77872 -12563
19197 -42878 -45561 168443 -126813 -78669 63705 -354457 -329021 142406 -124752 -220029 -193261
19186 -193261 93590 -87829 37717 344266 -133522 -501339 -141811 103202 115800 -248466
19175 -142710 -222815 248233 -354615 41198 15574 -142286 -107982 -3466 143792 -186202 -51564
19163 282280 121677 -18843 -127422 77408 -29090 -13509 18002 -274733 -255784 -182497 9197
19151 -17041 -241136 -18586 -125064 -30992 -40609 -107291 -184563 -143709 -59090 -6981 -229736
19140 -229736 229046 -8445 -7698 -118778 48867 -147996 -96441 -245434 92710 150483 34385
19128b3660A30431a54835A61804b01679B11567e9171p1601k08090c0457F5857
19117H0431J23658B7087a81138C34701a79817j54195d2855A5172e4935k37921
19107b92856J13520k3924c5407n6605C7740b58162k6708A44167L4727D0388b99779
19095a81332B1955a54362k0411J2177C4323b46320A0909N2708b56292A21963b1198
19083h855A60615e0056F7713h9890D7032c4491m8139c9008B84826a70743j79066
19072c49809A60176D3430J78816G8626a29676p2944f5409l10483A36352a69880
19061i1925F2648i4282G4130a07903G1450l3394L1935b5665r6577F80a19979A85370
19048a61986A43961a05898j16743G1911J45791H7362b62589h3559A5639e34959
$$ plain form
19128 -23660 130431 -154835 161804 -201679 211567 -59171 -130772 -338862 -30457 65857
19117 80431 204089 27087 -181138 334701 -179817 -334012 -42855 15172 -54935 -292856
19107 -292856 -179336 -203260 -35407 -92012 37740 -258162 -284870 144167 178894 40388 -299779
19095 -181332 21955 -154362 -174773 -162596 34323 -246320 10909 63617 -256292 121963 -21198
19083 -8855 160615 -50056 67713 -89890 47032 -34491 -82630 -39008 284826 -170743 -349809
19072 -349809 160176 43430 222246 78626 -129676 -202620 -65409 -375892 136352 -169880
19061 -91925 62648 -94282 74130 -107903 71450 38056 69991 -25665 -122242 680 -119979 185370
19048 -161986 143961 -105898 -222641 71911 217702 87362 -262589 -83559 15639 -534959
19037f7664j6264B3139f7753H1395J4605a73590D43808A27862R8224F7455R8963
19026A66418b64560a07058B03045C0672J20900a1077B0735b5177l2976j94869
19016b53022J11617B9096d5327E065J33065a0952B06528d09650G435P836P962
19005B3233i0080A93850d7677F189b01011f4910j23400j3083N9302E5769L02644
18994C58413a72309E3771K24763E6480J43866b36289d9542k4953L400m4923j54712
18983b70730a17633A02408g7724F2087f7626D5373c13333P8496n988A55654b88591
18971g0695F9922c2200h582A99612b31816P2390b8802j50703A6668b53903N7918
18960a95985D6508a25132c812j72380B57735o2647d30520L5205f0424D3576b12332
$$ plain form
19037 -67664 -83928 23139 -67753 81395 96000 -173590 443808 127862 226086 67455 166418
19026 166418 -264560 -107058 203045 30672 151572 -11077 20735 -25177 -58153 -253022
19016 -253022 -141405 29096 -45327 5065 138130 -10952 206528 -409650 7435 15271 23233
19005 23233 -90080 193850 -47677 6189 -201011 -64910 -188310 -201393 -142091 55769 358413
18994 358413 -172309 53771 278534 56480 200346 -236289 -49542 -74495 -71095 -116018 -270730
18983 -270730 -117633 102408 -77724 62087 -67626 45373 -313333 -234837 -240825 155654 -288591
18971 -70695 69922 -32200 -8582 199612 -231816 -159426 -28802 -179505 16668 -253903 -195985
18960 -195985 46508 -125132 -3812 -176192 257735 195088 -430520 -395315 -60424 43576 -212332
18948f2901k1248G1149g2299D6851i9716C36331e3891q1400j21710A28244B0889
18936F9652N4908b69491A1462a83471G4510b24668b1151B90908A38197a79299
18925i7019m6440c5259A51809A9460b94553J13636G388N7635a35029A2960c11790
18913A190J80344b6763k3281A6709a14508r59B6973O1409h1326j81422A65433
18901D7589a92013N3181O1004B4285a55768P4013k09103a04956M6360A06840a93456
18889B79604F1836h0135p4402j69386P5939P879B36955c8681H698M5043J09550
18878A63291K09527a22591d7968H7684a83116C1291N2532b14319O8352j4214j25127
18867b85308O9631P6912D7154k2135k69J62545c30731a57665g4404B0515e8671
$$ plain form
18948 -62901 -84149 71149 -72299 46851 -99716 336331 -53891 -135291 -257001 128244 20889
18936 69652 124560 -269491 11462 -183471 74510 -224668 -21151 290908 138197 -179299
18925 -97019 -143459 -35259 151809 19460 -294553 -180917 7388 65023 -135029 12960 -311790
18913 1190 181534 -26763 -50044 16709 -114508 -115467 26973 88382 -81326 -262748 165433
18901 47589 -192013 -138832 -77828 24285 -155768 -81755 -290858 -104956 -58596 106840 -193456
18889 279604 61836 -80135 -154537 -323923 -247984 -240105 236955 -38681 8698 53741 163291
18878 163291 372818 -122591 -47968 87684 -183116 31291 83823 -214319 -145967 -160181 -285308
18867 -285308 -215677 -138765 47154 25019 24750 187295 -330731 -157665 -74404 20515 -58671
18855h4698B20252K0862L6683b4368B25189a49518c474F3172K4008C3627i6890
18843A64677D7547f2993j22218M8411A63364K85784a14246A93279q6996a01477
18832F2133b05751j85825h2189A64515a56670j45689a05435j27010i3321A62247
18821d69555A92391I2493D5021i7761h117k0290B59518b1861A47852a01536B1962
18809A48606l340F0910b4311l5216a885j55024e7832A46848b04989O472c2515
18797f3550C3986h8676H7313P9938j0647b93295B0804b95515K6355E8387A0336
18785g585j07657l4097M5625a8276j95602H3528O0909i8879k20364A16739b24421
18773f0964B82642j25510b69650Q9673a0248A40373n5029b36849B72340b14336
$$ plain form
18855 -84698 220252 241114 277797 -24368 225189 -149518 -3474 63172 87180 33627 -96890
18843 164677 47547 -62993 -185211 -136800 163364 449148 -114246 193279 106283 -101477
18832 62133 -205751 -391576 -82189 164515 -156670 -302359 -105435 -232445 -93321 162247
18821 -469555 192391 92493 45021 -97761 -8117 -28407 259518 -21861 147852 -101536 21962
18809 148606 145266 60910 -24311 -59527 -1885 -156909 -57832 146848 -204989 -198517 -32515
18797 -63550 33986 -88676 87313 167251 156604 -293295 20804 -295515 -269160 58387 10336
18785 -7585 -115242 -149339 -103714 -18276 -213878 83528 144437 -98879 -319243 116739 -224421
18773 -60964 282642 157132 -269650 -179977 -10248 140373 85344 -236849 272340 -214336
18762A26986J6723a58616c2337n9315a1194r2806r7124o2692J26184K1994b0949
18750a21390A33866o5076a73313d9627j79690h0495j59413b2192k39027J05436
18740a55783D4731a49089m101l05002H7685J89549a12729j93329A84686e1020
18729i2173L2341B7026c2034O513a0659C04963F6901C0540c18m0876A61640C1469
18716b23203O3618p2522h462C3933A0506b09318j23517C72558j19702a81381f7110
18704a32757G9434j6752a46049j44133E937J1730f1717j94258d6608A08877K6415
18693A35292b94063A17291a75676J5345j4828F9540B5821R5147b91143Q5522J7028
18682a88593M842D7848b54156G1416j7840i4294b8645k961p8542c5448n0578r3893
$$ plain form
18762 126986 143709 -158616 -32337 -91652 -11194 -104000 -201124 -263816 -137632 -115638 -20949
18750 -121390 133866 68790 -173313 -49627 -229317 -80495 -239908 -22192 -261219 -155783
18740 -155783 44731 -149089 -153190 -458192 87685 277234 -112729 -306058 184686 -51020
18729 -92173 -59832 27026 -32034 -25521 -10659 304963 66901 30540 -318 -41194 161640 31469
18716 -223203 -159585 -232107 -8462 33933 10506 -209318 -332835 372558 252856 -181381 -67110
18704 -132757 79434 62682 -146049 -290182 5937 17667 -61717 -255975 -46608 108877 135292
18693 135292 -294063 117291 -175676 -160331 -175159 69540 25821 120968 -291143 -205621 -188593
18682 -188593 -183751 47848 -254156 71416 53576 -94294 -28645 -31606 -110148 -35448 -86026 -179919
18670a79919B9155j0052K71548a5666A2208Q7549B2509f4116G9279R2700c34106
18658C9563M8851A6161J13250C0371J12540i1172b7903F8645a38731K6653a7606
18646a44776H3917d0978H7883A6130J221P0591c60072B0686Q7126d8933m24811
18635d73744e2347j88772B29164a42844C8107J3676h3499A03124a54529b6141
18624b80990J36576E7060K81329b27694f9539a9703j23866O8408E342Q1441C4308
18612C075a58841n9507d2494k2891q6865i015A28762a38278A87006G4032o605
18601F7427D543b15052A00330b33936f1617A26438c2276j03864K8097c5633d458
18589A7475a03792A45303a27379B2979J90244c8695G072N8979f0958C0680a13279
$$ plain form
18670 -179919 29155 19103 290651 -15666 12208 99757 22509 -64116 79279 171979 -334106
18658 39563 88414 16161 129411 30371 142911 -91172 -27903 68645 -138731 -112078 -17606
18646 -144776 83917 -40978 87883 16130 17351 87942 -360072 20686 107812 -48933 -473744
18635 -473744 -52347 -241119 229164 -142844 38107 51783 -83499 103124 -154529 -26141
18624 -280990 -144414 57060 338389 -227694 -69539 -19703 -143569 -75161 5342 86783 34308
18612 3075 -158841 -218348 -42494 -65385 -152250 -9015 128762 -138278 187006 74032 67427
18601 67427 4543 -215052 100330 -233936 -61617 126438 -32276 -136140 -108043 -35633 -4458
18589 17475 -103792 145303 -127379 22979 213223 -38695 7072 66051 -60958 30680 -113279
18577a47355B08917b26420E1017a05905p1973B13615F8581e4945B95726c28488
18566F315O4492b34899J08458C14966f666l00808A90211e6180j65052g0234B60800
18554B9249b53427H0522c43657A75802f5943j29272A21128a07907k24101Q5473
18544b46535f779B7933b1859p6766M7978k1263A14900f2457A5412a6779E7220
18532a47504C02878c25142f678B3758e7991j87192K1236D5272a43956k72364A18237
18520a25817I8544d3846j40971O7815n5907j21466a20184L6465B03790a30167
18509C1649a79571c0721J1780A26953g6401q0302l39228F4162J41879A8994K59919
18498B78913r0945b0818k3129r8563j89792J45686K3891A08115d1463o5170j34399
$$ plain form
18577 -147355 208917 -226420 51017 -105905 -177878 213615 68581 -54945 295726 -328488
18566 6315 70807 -234899 -126441 314966 -6666 -307474 190211 -56180 -221232 -70234 260800
18554 29249 -253427 80522 -343657 175802 -65943 -195215 121128 -107907 -332008 -246535
18544 -246535 -6779 27933 -21859 -98625 -50647 -71910 114900 -62457 15412 -16779 57220
18532 -147504 302878 -325142 -6678 23758 -57991 -245183 -223947 45272 -143956 -416320 118237
18520 -125817 98544 -43846 -184817 -117002 -172909 -294375 -120184 -83719 203790 -130167
18509 31649 -179571 -30721 -18941 126953 -76401 -156703 -495931 64162 206041 18994 278913
18498 278913 187968 -20818 -43947 -142510 -332302 -186616 -162725 108115 -41463 -106633 -241032
18487b41032R733l2814H5315a25981l1960L3763j5701N7650I4169C0187J22847
18476A53034E8992a35701E4420b71957B6947A2299a095A34588a7807k05806R2457
18465a31156D6144d5352n5068C6775b14826B15559e185m2445A00269C2011L38505
18454C70516i5392I1043J36934a03682k30128a38409j45726B11563A0023c28269
18443a28602A1557K01436p3998a07708M8516B9402Q8302a64462f0389j64660f3176
18431d7632j103k113o1182G5890P1436d2662F2708c5997q2858J3669k3444I5014
18418d37946G6730d2761J3799q2690A56595L54036H8910f8297j63610A71449e293
18406a2943C4447L1128a08463B84548a5101I7828m3558b61545M2645j0354d9414
$$ plain form
18487 -241032 -231299 -264113 85315 -125981 -157941 -124178 -139879 -82229 94169 30187 153034
18476 153034 58992 -135701 54420 -271957 26947 12299 -1095 134588 -17807 -223613 -131156
18465 -131156 46144 -45352 -100420 36775 -214826 215559 -5185 -47630 100269 32011 370516
18454 370516 -95392 91043 227977 -103682 -333810 -138409 -284135 211563 10023 -328269
18443 -128602 11557 212993 138995 -107708 -59192 29402 117704 -164462 -60389 -225049 -63176
18431 -47632 -48735 -50848 -112030 75890 147326 -42662 62708 -35997 -118855 -105186 -128630 95014
18418 -437946 76730 -42761 -28962 -111652 156595 510631 88910 -68297 -231907 171449 -5293
18406 -12943 34447 65575 -108463 284548 -15101 97828 54270 -261545 -218900 -229254 -49414
18394H3020b50099a00558A47861p17i3056j67043n2534L8791b7398j0273a0648
18382e1842j08747k1007e3058j22694C5228a7136A90838n9979C634a02316B8299
18370E9362b23178I1071j1717A5755K75431l540E4437b0936j34937A25952P8380
18359B04332O7004E9295L695p061m857J6200g4118A29014b90881O6524A50412
18347a56433e2352b4689k38344B3120G717c4084l17183J54512l4181i0458d0068
18335b14667A52268c08672f4165n2669N6750F3611b62755A23474F1106b90721
18324d58B18977a08359m8936A39474a64525A03695Q7331b9540j41385P1602G0182
18312d590B1086d4028B01950c40733A78696k2267g5934b9667j52042N8176B44022
$$ plain form
18394 83020 -250099 -100558 147861 147144 -93056 -260099 -312633 -273842 -27398 -37671 -10648
18382 -51842 -160589 -181596 -53058 -175752 35228 -17136 190838 130859 3634 -102316 28299
18370 59362 -223178 91071 79354 15755 291186 287646 54437 -20936 -155873 125952 204332
18359 204332 271336 59295 62990 55929 51072 67272 -74118 129014 -290881 -224357 150412
18347 -156433 -52352 -24689 -263033 23120 7717 -34084 -351267 -196755 -230936 -90458 -40068
18335 -214667 152268 -308672 -64165 -116834 -60084 63611 -262755 123474 61106 -290721
18324 -458 218977 -108359 -157295 139474 -164525 103695 191026 -29540 -170925 -99323 70182
18312 -4590 21086 -44028 201950 -340733 178696 156429 -75934 -29667 -181709 -123533 244022
18300b62291N9481g3237p9938L321A92108J58088h5837A68512J8456k328a20157
18288f2052B66455c1541k17614h1899B0724J00741D8309k1851J13415J26262I825
18276c3741F9363a62681c123F5706c15261b5293j7009k24206A70826a84423A1528
18264B406b65635i0215a3729A98717b570l53336b7615j44359P2415A50735F1693
18252I2169c39516Q3894J12310f0561l5127A29082N5870l6101k9945N8855F2894
18240A42251A1236b44808l1039G1429d0404j08624A49343b86576B53782i1183
18229A63112o7699J11594a25638G7947a50601j5955j91645P5364m674C28099H5947
18217a32929j24821M0548I9564M590c3788C7689b17960L2696A05650a54974j5205
$$ plain form
18300 -262291 -202810 -73237 -153175 -149854 192108 350196 -85837 168512 186968 184640 -120157
18288 -62052 266455 -31541 -249155 -81899 20724 121465 48309 26458 139873 266135 9825
18276 -33741 69363 -162681 -3123 65706 -315261 -25293 -42302 -266508 170826 -184423 11528
18264 2406 -265635 -90215 -13729 198717 -2570 -355906 -27615 -171974 -99559 150735 61693
18252 92169 -339516 -255622 -143312 -60561 -95688 129082 184952 148851 118906 177761 62894
18240 142251 11236 -244808 -275847 71429 -40404 -149028 149343 -286576 253782 -91183
18229 163112 95413 207007 -125638 77947 -150601 -166556 -358201 -282837 -287511 328099 85947
18217 -132929 -257750 -217202 99564 104154 -33788 37689 -217960 -185264 105650 -154974 -170179
18206a70179M1384o228A37606E6759b18517i8652q1952D1459J60033r3345b24808
18194e0151A13479g7148r4306j4162B6903a94165g5264F0904c18616A05256d08100
18182A60184b40877D8354b16793A25712m8986d4823A26055b2987E2195b69628
18171h8020B1774a16202A59812b54753K6812k3011A3020a19095c4658j09910j83545
18160c28113e147k43045R0500L7224j17435J07962I4446c88508J65134g93m748
18149e541H7887b15398Q8942d0543k05826J10740B18237D169a71895A59403c89606
18137D01855e2276a245A8676K33190E0692N7970f0592l55890J46404A95404a06150
18125f0334G9641C9195R6335C6572J3250R147L7055i3227l01963B1458a13524
$$ plain form
18206 -170179 -128795 -135023 137606 56759 -218517 -98652 -180604 41459 201492 108147 -224808
18194 -50151 113479 -77148 -171454 -185616 26903 -194165 -75264 60904 -318616 105256 -408100
18182 160184 -240877 48354 -216793 125712 76726 -44823 126055 -22987 52195 -269628
18171 -88020 21774 -116202 159812 -254753 -227941 -250952 13020 -119095 -34658 -144568 -328113
18160 -328113 -5147 -248192 -157692 -120468 -237903 -129941 94446 -388508 -223374 -793 -5541
18149 -5541 87887 -215398 -126456 -40543 -246369 -135629 218237 4169 -171895 159403 -389606
18137 401855 -52276 -1245 18676 251866 50692 108662 -60592 -416482 -270078 195404 -106150
18125 -60334 79641 39195 135530 36572 49822 58969 96024 -93227 -395190 21458 -113524
18113C65962b20489a02150O017k03733a42909j58546J25611N5147f0122k62134
18103c22256F5119h5319A31721Q237L28646b0450j44113B98384b70576a29618
18092B1142a40170b6005A75288g5995B13619a60173A08796a95067A12246a41732
18081a68557e874B48708a18543A30836a75631A45385d7301A71416a26325A74042
18070d99256B83783I2110J1124j4150a95357B28791a05321j03172A34850b93q7714
18059h8007l71979G6881L1760f6237b6645B56629D1294a07830I175Q156J6589
18048C3920f8768j50034i8413C37729i2593L5085A15333b27345a05172M5527B04619
18036b35313e8019E4719f6337j65977d6421C01320b43845d3714o253p635p4615
$$ plain form
18113 365962 -220489 -102150 -96133 -299866 -142909 -301455 -175844 -120697 -60122 -322256
18103 -322256 65119 -85319 131721 139958 468604 -20450 -164563 298384 -270576 -129618
18092 21142 -140170 -26005 175288 -75995 213619 -160173 108796 -195067 112246 -141732
18081 -168557 -5874 248708 -118543 130836 -175631 145385 -47301 171416 -126325 174042
18070 -499256 283783 92110 103234 89084 -195357 228791 -105321 -208493 134850 -293 -88007
18059 -88007 -459986 76881 108641 -66237 -26645 256629 41294 -107830 9175 17331 33920
18048 33920 -68768 -218802 -98413 337729 -92593 -57508 115333 -227345 -105172 -59645 204619
18036 -235313 -58019 54719 -66337 -232314 -46421 301320 -243845 -43714 -49967 -57602 -132217
18025a32217A45602b55113H2777a1523k52424g4967K7379j08675q3346A75292
18014H113R2202e717p7405K7730G4878c52188C32848q0760r3693J91876B9019
18002b78000A62837J85180g3087B21583f4767k42994J53777O5137B08211Q5961
17992B94172b697r1550D88514B27809A4486K09586r3766g181r5605D9465b07060
17980g2171B77681b0178A98019a39516A93194a70159P141A64664a27540B2145
17969c7466k86467C1280A1420J65508k7965a45513j2027p6020q5877F3584g001
17957A02704a12526l4201D3554a68693C86690A92811a03299c9799j61154G616
17946a24323d547j04728A03926C7259M13h4768k17494a19183e2029l8001k32687
$$ plain form
18025 -132217 145602 -255113 82777 -11523 -263947 -74967 -47588 -156263 -239609 175292
18014 8113 100315 -5717 -83122 -55392 74878 -352188 332848 252088 158395 350271 29019
18002 -278000 162837 348017 -73087 221583 -64767 -307761 -153984 -88847 208211 294172
17992 294172 -2697 -94247 488514 227809 14486 224072 130306 -7181 -102786 49465 -207060
17980 -72171 277681 -20178 198019 -139516 193194 -170159 -163018 164664 -127540 22145
17969 -37466 -323933 31280 11420 176928 148963 -145513 -157540 -233560 -319437 63584 -7001
17957 102704 -112526 -146727 43554 -168693 386690 192811 -103299 -39799 -200953 7616
17946 -124323 -4547 -109275 103926 37259 37672 -84768 -302262 -119183 -52029 -90030 -322717
17935c22717a0384I8978a92101h897k02102A38720a67620A57750a27502K3031
17925a04471A0087a17760B29526A08799f8936e834k82556B21063a27176A64054
17914D0869a59154j78836A28490d59131i7278j37568I0959a85821D666R4685J33367
17903B32718d3840A44991a39415F647M2684K3779O6494a56445l9524l6348K4771
17892b07546i6745k84138m0779e0358k778j58318Q8107q0768C16550c4752a0854
17880c72791a21916F741b47711g24j5145P202q3705n3469l9147D4865O2141e8101
17867A22616a4225p7989C69928A2617g7360A84313b64523A471h1444k8474k3873
17856a33791G3445a0487A48461k0124b16206a07780m7922A16950a51780E6138
$$ plain form
17935 -322717 -10384 98978 -192101 -8897 -210999 138720 -167620 157750 -127502 -104471
17925 -104471 10087 -117760 229526 108799 -68936 -5834 -288390 221063 -127176 164054
17914 40869 -159154 -337990 128490 -459131 -97278 -234846 90959 -185821 4666 99351 232718
17903 232718 -43840 144991 -139415 6647 49331 73110 139604 -156445 -195969 -232317 -207546
17892 -207546 -96745 -380883 -421662 -50358 -53136 -211454 -123347 -204115 316550 -34752 -10854
17880 -372791 -121916 6741 -247711 -724 -15869 -8667 -92372 -145841 -184988 44865 107006 -58101
17867 122616 -14225 -92214 369928 12617 -77360 184313 -264523 1471 -81444 -109918 -133791
17856 -133791 73445 -10487 148461 128337 -216206 -107780 -155702 116950 -151780 56138
17845b71869E3070Q3310o1664a02314M5493D7764b36399C8014J77211G437g1134
17833A73030b45270C08784j19388a84682A5063K59171a06925B84609b6314B8139
17822h8082A7522R1147M8759c32043d6087D9350i2920l65792a36969A85564b13149
17810B81213i0210b1401A21437c41644h6095K5251C9727b69463a08864r9478r522
17799b17864j00350J32706B87518A37382E3115b01845h9000D0717J79418C4258
17788b3930j34031A2279d3511B5751e4197b80A81389Q2731A2692K484d6311n2621
17776i8932J4700E3493a36845H0126a62953C1214a02536F1081a58573A75949a72307
17764A51087e2721q6234B85064b86069B08210P6078b32308C32622q3649r8519
$$ plain form
17845 -271869 53070 136380 74716 -102314 -56821 47764 -236399 38014 215225 7437 -71134
17833 173030 -245270 308784 189396 -184682 15063 274234 -106925 284609 -26314 28139
17822 -88082 17522 108669 157428 -332043 -46087 49350 -92920 -458712 -136969 185564 -213149
17810 281213 -90210 -21401 121437 -341644 -86095 -60844 39727 -269463 -108864 -208342 -217864
17799 -217864 -318214 -185508 287518 137382 53115 -201845 -89000 40717 220135 34258
17788 -23930 -157961 12279 -43511 25751 -54197 -280 181389 264120 12692 15176 -46311 -98932
17776 -98932 -84232 53493 -136845 80126 -162953 31214 -102536 61081 -158573 175949 -172307
17764 151087 -52721 -138955 285064 -286069 208210 284288 -232308 332622 248973 150454
17754A50454D1928g6801j0854j39456B74616C4579J71112i4066k6249k20063A89481
17742D32276b33896r519D9514f4728K1612A15005c3356p8968B19864a93877c1475
17730B85819f3387h026l107A63363a03438B60087e5604J5324A92439A2626f1340
17718D7204j4532a51378K7076c9299K292B19573c24492B951M8239M8043K10403
17707C09636b20670H7307a57958C5020e4793B94443a6564q8057k5584A27561e1316
17695F4793J22053f8956B986a34136l7775K534j21883C6300a81069f3972E9155
17683C32985a83639D9630J7772a33037G7149b36838a17148A0282R0822b45308
17672A2156N0822i8123c6216k59128E9677J37013a49876A50444b19415f762k7269
$$ plain form
17754 150454 41928 -76801 -87655 -227111 274616 34579 205691 -94066 -120315 -340378 189481
17742 432276 -233896 -243415 49514 -64728 -43116 115005 -33356 -112324 219864 -193877 -31475
17730 285819 -63387 -8026 -11133 163363 -103438 260087 -55604 -40280 192439 12626 -61340
17718 47204 32672 -151378 -124302 -39299 -37007 219573 -324492 2951 51190 99233 309636
17707 309636 -220670 87307 -157958 35020 -54793 294443 -16564 -104621 -130205 127561 -51316
17695 64793 186846 -68956 2986 -134136 -171911 -169377 -291260 36300 -181069 -63972 59155
17683 332985 -183639 49630 67402 -133037 77149 -236838 -117148 10282 101104 -245308
17672 12156 62978 -98123 -36216 -295344 59677 196690 -149876 150444 -219415 -6762 -34031
17661c4031a2423A89489J9908a05305C51536B7850J39631B7795b32111R8986A0178
17649B12368g5916j43267I1210a09152B24752b39403h5440C11405A33953e025
17638a10007j12214H9132J3780M4151a96297B6195f0461j07319a6217H8714J86594
17627B75308b62845B2282M1176M7409E3497d8543C78496f4506A41054c7626l0542
17616f8168E9131B2179c02464B11251e2453B68491I553J681e4271A28968c33573
17604A46537J21434A16184Q3738D691L04036a99552A1069b71951B96430a40285
17593C30812c4492l4095D8156P3623a43571F2006A002Q5800a6967p7474j47356
17582b41797B27489g2154I903b34413J04584c0039j2281d48n4705A16593l6377
$$ plain form
17661 -34031 -12423 189489 209397 -105305 351536 27850 167481 27795 -232111 -133125 10178
17649 212368 -75916 -219183 91210 -109152 224752 -239403 -85440 311405 133953 -5025
17638 -110007 -222221 89132 102912 147063 -196297 26195 -60461 -167780 -16217 88714 275308
17627 275308 -262845 22282 63458 110867 53497 -48543 378496 -64506 141054 -37626 -68168
17616 -68168 59131 22179 -302464 211251 -52453 268491 9553 11234 -54271 128968 -333573
17604 146537 267971 116184 199922 4691 308727 -199552 11069 -271951 296430 -140285
17593 330812 -34492 -68587 48156 121779 -143571 62006 1002 86802 -16967 -94441 -241797
17582 -241797 227489 -72154 9903 -234413 -129829 -30039 -42320 -448 -55153 116593 80216
17571H0216Q5753J73224n6200C7959e846F576J93823O5649m2388M1445a72649
17559A80963D41J64586C1192H513a60413B37014P5768k249H6844l679J75388j27802
17547A30751F4064a27247o3283B37139c96808G2513j2960K89998a8119K03A73988
17535b92261a27315C35851A22090e5602l1208K5534B41190H4723a80632A24207
17524A79720q3379a35824B12793i794A76942m8406b32203J03172I7409L3805J26815
17513B58029A07978B8175a41214E1853Q8039n6860a34472a8894j33342F7833J71780
17502B39613j00555p591c77144J08133B97518l9140r5588a3390C9539K30296C0422
17490A64878b44356A72682p6448a39443A59040D8007L9318a7904j55047B76777
$$ plain form
17571 80216 165969 339193 282993 37959 -5846 6576 200399 266048 223660 265105 -172649
17559 180963 441 165027 31192 8513 -160413 237014 312782 310533 86844 83165 258553 130751
17547 130751 64064 -127247 -190530 237139 -396808 72513 59553 349551 -18119 -17916 173988
17535 -292261 -127315 335851 122090 -55602 -86810 -61276 241190 84723 -180632 124207
17524 179720 96341 -135824 212793 -9794 176942 128536 -232203 -129031 97409 131214 258029
17513 258029 107978 28175 -141214 51853 139892 83032 -134472 -18894 -152236 67833 239613
17502 239613 139058 131467 -377144 -269011 297518 258378 162790 -13390 39539 269835 30422
17490 164878 -244356 172682 96234 -139443 159040 48007 87325 -17904 -172951 276777
17479H0553J98945A35509J50219j39952B2419M07020j00157N5662I2593M08368
17469E00961a3769j45077r6278a15381B38538E8291a45736D4975L34346A44285
17458A06211C7455J64875d20758A58929F8653K8418k1059L03581o8990P9459A47730
17446B21729J81393j2069H3898B2330b02923I8301J07863a2814C56316j35799
17436B20517o2666E4791K02415q8414J94679j66721N5072E356J27206K16454L7978
17425C86994J84285j61261h5325F42083B54735e7303D57136e2192A74220J02692
17415B76912J0917A05103L67790G9067i5740B06525N1863K55366e1619K2116B50564
17403a64857A32028l713J21103d6145B74199D2730j6235a52978A27271O2578e0170
$$ plain form
17479 80553 279498 135509 285728 145776 22419 429439 329282 384944 92593 500961
17469 500961 -13769 -158846 -255124 -115381 238538 58291 -145736 44975 379321 144285
17458 106211 37455 202330 -420758 158929 68653 97071 76012 379593 310603 390062 147730
17446 221729 403122 391053 83898 22330 -202923 98301 206164 -12814 356316 220517
17436 220517 157851 54791 257206 168792 363471 196750 251822 5356 132562 349016 386994
17425 386994 571279 410018 -85325 642083 254735 -57303 457136 -52192 174220 276912
17415 276912 287829 105103 472893 79067 -95740 206525 258388 513754 -51619 -29503 250564
17403 -164857 132028 128315 249418 -46145 274199 42730 26495 -152978 127271 189849 -50170
17391H3038g6252G0159J28121N540M7239c436C55953c35575D8364K62778A20299
17379C23731G6536L81066j63390H3459d7670F8402Q8822O588P197p0481a85779
17367i269q1423r437M9517B72731a8708C53617a83421j7269G0127R2628j2034
17356A50721J33725j09625J62a01940M9477B24667b26127A27540e5215A04980
17345E30932A9225J95515b5518j5037j24252I4147C2926b30556f5077A42825O2683
17334B05508J06821b23275A97334k5675J09361A5782L27525j5383b60975C15311
17323C4729J11171c9175k9941A4992L87709d5483A40967K58211j95058L23547
17313E27667A56564D5776J89560l6741E129K88063F3275h9395A30155c29088A88286
$$ plain form
17391 83038 -76252 70159 198280 203820 251059 -3436 355953 -335575 48364 311142 120299
17379 323731 76536 457602 294212 83459 -47670 68402 157224 163812 171009 100528 -185779
17367 -9269 -90692 -100129 -50612 272731 -18708 353617 -183421 -200690 70127 162755 150721
17356 150721 284446 174821 174983 -101940 -52463 224667 -226127 127540 -55215 104980
17345 530932 19225 214740 -25518 -40555 -164807 94147 32926 -230556 -65077 142825 205508
17334 205508 312329 -223275 197334 171659 281020 15782 343307 327924 -260975 315311
17323 34729 145900 -39175 -69116 14992 402701 -45483 140967 399178 204120 527667
17313 527667 156564 45776 235336 198595 5129 293192 63275 -89395 130155 -329088 188286
17301G447R3956K2800D6007J73762j07804L8280J0511k6433c8643j00065D03397
17289F0906c4078j02111G8844e9296F6996A5242J06272J34417A23592B9160J41007
17278A70167o2986J85941a25A93363n5937a06281B36650L58755c89338G8991J70571
17267B49562C1050K54686N8250A21418b0367B66753A14062j8048L23990B2495
17256C32778C3241K68045i5486A35274J65429a03358A37584M28908j48059L5026
17246D53459j69390H4353J40998j8307J7925N9945b31409B27612n1357c32758
17235C50347d6075B75904M9618r7727q5079j0277J5165f1220D51388E2664k5192
17224B7472I564J9451a59976A39623n4755J87219P292I3174J8776l8329J13206
$$ plain form
17301 7447 101403 124203 46007 219769 111965 150245 160756 134323 -38643 -138708 403397
17289 60906 -34078 -136189 78844 -59296 66996 15242 121514 255931 123592 29160 170167
17278 170167 107181 293122 -125 193363 137426 -106281 236650 595405 -389338 78991 249562
17267 249562 31050 285736 343986 121418 -20367 266753 114062 96014 420004 22495
17256 332778 33241 301286 -95486 135274 300703 -103358 137584 566492 418433 453459
17246 453459 284069 84353 225351 207044 224969 284914 -231409 227612 176255 -332758
17235 350347 -46075 275904 325522 227795 142716 132439 147604 -61220 451388 52664 27472
17224 27472 9564 29015 -159976 139623 84868 272087 279379 93174 111950 73621 186827
17213A86827J32792d2065C02579L4684G276J13002P1076K27110g1475A23881g3420
17201H6908L47498f278A49020E422f4596D11912I8432J4051J49827l4192A2122
17189B76332M8696D2741O8698N79851A88656K18034A85896K02790j64622J4272
17179B38336J30386a64802C81468a33734E98000j99602o4632a13039B03947K98198
17169E02145A18540L02983C3774K0525J5754J55516k5825j9165B7546a75614E133
17157B25200L50945C6719L66100J24987A91922n8057J8295p409m023n3709e8795
17145A62909R4519J29289a08869B09852L6666K17523i790C48547j39114K02938
17135D12371r3931J53903p2246D1554M8572J87727M1011n4649I4302J3215m262
$$ plain form
17213 186827 319619 -42065 302579 337263 7276 120278 191354 418464 -71475 123881 -73420
17201 86908 434406 -6278 149020 5422 -64596 411912 98432 112483 262310 228118 12122
17189 276332 325028 42741 111439 691290 188656 406690 185896 388686 224064 238336
17179 238336 368722 -164802 381468 -133734 598000 398398 333766 -113039 203947 502145
17169 502145 118540 421523 33774 54299 70053 225569 199744 180579 27546 -175614 5133
17157 225200 576145 36719 402819 527806 191922 133865 152160 144751 140728 87019 -58795
17145 162909 257428 386717 -108869 209852 246518 464041 -9790 348547 209433 412371
17135 412371 318440 472343 400097 41554 90126 277853 318864 264215 94302 107517 103255
17124A03255M4102K40835A93218K73379C9557M25071j18334m2629A49441J63155
17114C12596N326k126R3938O7244A47583N7454J53642J16527j90147K27938k27825
17103B85172J54063H788K47420M2875M6543O9966r6831j02054J48882O6951m4171
17092C88369J592F1351K66056q8771J9362j25948K60363N8724o1234l5421E6279
17080D48380j64757n3401L9651L44505k54926M2230l139j35268p9240L31336k2440
17069D92931J45131j37579p5042J53406n8748N9708j76870A02827L36321m9208
17059C89940K3278L1131A96026M6396J20190P3780J42377j52724L08244k4581
17049G09708B91300Q7576L6079K63781C27765j2648J54660N7881R5640n7620J69569
$$ plain form
17124 103255 147357 388192 193218 466597 39557 464628 346294 303665 149441 312596
17114 312596 317922 315796 409734 476978 147583 205037 358679 475206 285059 512997 285172
17103 285172 439235 8788 256208 299083 345626 415592 318761 216707 365589 432540 388369
17092 388369 389961 61351 327407 238636 257998 132050 392413 451137 389903 354482 56279
17080 448380 283623 230222 269873 614378 359452 401682 398543 263275 184035 515371 492931
17069 492931 638062 500483 425441 578847 520099 579807 402937 102827 439148 389940
17059 389940 413218 444349 196026 242422 362612 436392 578769 426045 734289 709708
17049 709708 291300 378876 414955 678736 327765 315117 469777 527658 623298 565678 735247
17038G35247k37690J04569k67069K61348B25132K87332J6406K00805B48527L17177
17028E65704n5468j17451J06526J19139j60615j5373J77234o9171J25803k59587
17018D16741L99351l06471j05491Q2426k05671L70618l5215r0015j37959O19653
17008A007967A88616L46303q6536K52127J85099C38343J1902o7506P5296J63340
16998E21375K57727C75132L29213k45832o2346J91797M1029K68022j38375l52119
16988D06521j73842K86589L69567j37702M9039k22704P9487j01664j9635N37884
16978A073540m21678j8448P7220q8524j07388J25908K07812j51035K40585j64006
16968G73986P130L7463r066j75847K46506L4972N17k35643j21190M48892k39507
$$ plain form
17038 735247 497557 602126 335057 596405 225132 512464 528870 729675 248527 565704
17028 565704 510236 392785 499311 618450 457835 442462 619696 550525 676328 416741
17018 416741 816092 509621 404130 486556 280885 651503 616288 526273 388314 1007967
17008 1007967 188616 534919 448383 700510 885609 338343 350245 282739 358035 521375
16998 521375 779102 375132 704345 458513 396167 587964 628993 897015 758640 406521
16988 406521 232679 519268 888835 751133 800172 577468 656955 555291 535656 1073540
16978 1073540 651862 633414 710634 622110 514722 640630 848442 697407 937992 773986
16968 773986 781116 818579 809513 633666 880172 915144 915661 680018 558828 1007720 768213
16957G68213j2188j63293M72304m27990K52006m8733k31172K11282j8191L95228
16947A197466n18945Q7835Q0713N11829m83374J31918O3018M2500k58326k08845
16937F45789j12913K86015K89032r2171l17814K47386J3389R482J81641O2626
16927A212462j52803j21333K70715k1039o3653j82766J1474L12205j24951L95861
16917A536172j67449k80353J30565L38769l60470M4727K3131K83267j67016J27935
16907A509278j11584K28524k07586n4268N3058J74823k51567K91187N286l56720
16897A280431L54341K392j72937M8898K07847k08643K76093j56771J81336k28756
16887A584231q5952K29278j13015j5337J4808K41102m1846p4839j07808L13307
$$ plain form
16957 768213 756025 592732 1065036 637046 889052 840319 609147 820429 802238 1197466
16947 1197466 678521 766356 847069 1358898 875524 1007442 1070460 1112960 854634 645789
16937 645789 532876 818891 1107923 1015752 697938 945324 958713 968195 1149836 1212462
16927 1212462 1059659 938326 1209041 1188002 1124349 941583 953057 1265262 1140311 1536172
16917 1536172 1368723 1088370 1218935 1557704 1197234 1241961 1265092 1548359 1381343 1509278
16907 1509278 1397694 1626218 1418632 1364364 1417422 1592245 1340678 1631865 1637151 1280431
16897 1280431 1634772 1637164 1464227 1513125 1720972 1512329 1788422 1631651 1812987 1584231
16887 1584231 1498279 1727557 1614542 1599205 1614013 1855115 1813269 1738430 1630622 1943929
16877A943929j00494L396L93852l36226K85731K6228j00291r8810Q6354J01562
16867B205231k4129O905Q9905N03746n06168L73649o03032L49381L90979l82542
16857B403925L69786m55251j61801N41614J96307o3909n3571j56975K34842l305
16847B851662J66926k4605R378R5604K00313l23682J89632K53081J1494Q1172
16837C510975P3242r1664P7293P1896M8021R8951j79139K83501J96975R3968q2352
16826D101667J39378j42617L37149P3285L14629l30633l463K71008j14579J65333
16816D811157L45993J96044R5317j25872P9485M04594j11579M10136k07264M93929
16806F391940n8734K31547Q3178K23685K53925j71332K81141L2105M49744R9557
$$ plain form
16877 1943929 1843435 1846831 2240683 1904457 2190188 2216416 2116125 2017315 2103669 2205231
16867 2205231 2181102 2188007 2277912 2781658 2275490 2649139 2046107 2395488 2786467 2403925
16857 2403925 2773711 2318460 2156659 2698273 2894580 2830671 2777100 2620125 2854967 2851662
16847 2851662 3018588 2993983 3003361 3098965 3299278 2975596 3165228 3418309 3429803 3510975
16837 3510975 3584217 3492553 3569846 3641742 3689763 3788714 3609575 3893076 4090051 4184019 4101667
16826 4101667 4241045 4098428 4435577 4508862 4823491 4492858 4489395 4760403 4645824 4811157
16816 4811157 5157150 5353194 5448511 5322639 5402124 5806718 5695139 6105275 5898011 6391940
16806 6391940 6333206 6564753 6647931 6871616 7125541 6954209 7235350 7267455 7717199 7816756
16796G816756L00640J60289J45830J66871M06773L5717L34901J31141J77087O36053
16786A0312058L60667M1285J26148Q29322J58500R8913O16497L52306P5424R97790
16776A3968910J20077K25432N20666Q39775N15598M63994N08920J030950L14751
16767A8509073P38809O83876P26139J069670O51935J114141R72004R62333J138179
16758B6566159J072061J371423J147121J537445J598553J285545J836004J727469
16750C8141780J857667J975962K254127K335212K409648K926255K987330L199790
16742E8087771L354113L366051L804122M512316M468298M496497M992677N599074
16734I2680919N474535O779855O047463P257705O970188P223579P751621P378093
$$ plain form
16796 7816756 8117396 8277685 8423515 8590386 8997159 9032876 9367777 9498918 9676005 10312058
16786 10312058 10672725 10714010 10840158 11669480 11827980 11926893 12543390 12895696 12971120 13968910
16776 13968910 14088987 14314419 14835085 15674860 16190458 16654452 17163372 18194322 18509073
16767 18509073 19247882 19931758 20657897 21727567 22379502 23493643 24465647 25427980 26566159
16758 26566159 27638220 29009643 30156764 31694209 33292762 34578307 36414311 38141780
16750 38141780 39999447 41975409 44229536 46564748 48974396 51900651 54887981 58087771
16742 58087771 61441884 64807935 68612057 73124373 77592671 82089168 87081845 92680919
16734 92680919 98155454 104935309 110982772 118240477 125210665 132434244 140185865 147563958
16726A47563958P424867P226508P061435O304825M745648M553983K991888J859628
16718A89732740J81587r86663k253876l721558m842717n581046o588067p061791
16710A58878609p404983p961636p691893p458236p798340p114091o821062o643006
16702I9985362o158760n533899n689204m905964m582759m629420l843316m032086
16694F0609954l297174l223048k992016k900091k542747k607425k172474k354888
16686C8520091j961707j620623j243727j960870j181425j849114j189768j009144
16678B6503713j169023r62192j414270o30768j342080p85378l90092o77940j178318
16669A7953652n36441p80126k71500n81240n59632l03758o60616n22994n87501
$$ plain form
16726 147563958 154988825 162215333 169276768 175581593 180327241 184881224 187873112 189732740
16718 189732740 189914327 188927664 186673788 182952230 178109513 172528467 165940400 158878609
16710 158878609 151473626 143511990 135820097 128361861 120563521 113449430 106628368 99985362
16702 99985362 93826602 88292703 82603499 77697535 73114776 68485356 64642040 60609954
16694 60609954 57312780 54089732 51097716 48197625 45654878 43047453 40874979 38520091
16686 38520091 36558384 34937761 33694034 31733164 30551739 28702625 27512857 26503713
16678 26503713 25334690 24372498 22958228 22327460 20985380 20200002 19809910 19131970 17953652
16669 17953652 17417211 16637085 16365585 15784345 15224713 14920955 14260339 13737345 13149844
16660A3149844m22001m51364l63790m08950j67774n23917l01270m1579m03278
16651A0065921q08906l0770J13495l72886j22122m99755k88529j50112o4986l26865
16641G514485k12451m67402K05286N7505n51596k7721m10186J86220k50348l0834
16631F012958j32539l03877O5422k2212m32164O250k03873l5699n2308j63564
16621D738394r4646j04081j99124K80181m18597L4650O2080l30606j58905j79893
16611C629453l619K0625M3631n61966L00695J65255j22214k70961p4009K73346
16601C400236n50805K75449J9371r2220J02275k68886k71672j0064R9002j24040
16591B578646M2021K34887J6664l98921J59299l63475K53350j85769j71346L43491
$$ plain form
16660 13149844 12727843 12276479 11912689 11503739 11335965 10812048 10510778 10469199 10065921
16651 10065921 9257015 9226245 9339740 8966854 8844732 8344977 8056448 7906336 7841350 7514485
16641 7514485 7302034 6834632 7039918 7097423 6545827 6518106 6107920 6294140 6043792 6012958
16631 6012958 5880419 5576542 5641964 5619752 5187588 5193838 4989965 4954266 4901958 4738394
16621 4738394 4643748 4539667 4340543 4620724 4202127 4236777 4298857 3968251 3809346 3629453
16611 3629453 3625834 3646459 3690090 3128124 3428819 3594074 3471860 3200899 3126890 3400236
16601 3400236 2849431 3124880 3144251 3052031 3154306 2885420 2613748 2603684 2702686 2578646
16591 2578646 2620667 2855554 2872218 2473297 2632596 2269121 2522471 2336702 2165356 2508847
16581B508847k64037n5659j04930r8971k4399R0569j58614J14715j98307J87912
16571A997126o6099j97085r3821p476J53311q619j20446L40626l85111k24418
16561A387988K22395J83122k15531j36029J76019j35308J22931q6111K4188j29737
16551A413927M0418R0786m14046K12534J40206j303J1439M6207m01162J20326
16541A259332M77554k74472k41663R9332J31577l4870j32162N9154m5112J37737
16531A436407K07512o49568J87510J01066j02784p2098N4410k56207K90309Q427
16521A204984N2856m06340L76356k57117j98847L97432k92233L04131j01107r6233
16511I83882k05190M3934J6838k12545J58736L6032K02565l9031l10537K89919
$$ plain form
16581 2508847 2244810 2189151 2084221 1985250 1960851 2051420 1892806 2007521 1809214 1997126
16571 1997126 1931027 1733942 1640121 1632645 1785956 1777337 1656891 1997517 1612406 1387988
16561 1387988 1610383 1793505 1577974 1441945 1617964 1482656 1605587 1519476 1543664 1413927
16551 1413927 1454345 1545131 1131085 1343619 1483825 1482522 1493961 1540168 1139006 1259332
16541 1259332 1736886 1462414 1220751 1320083 1451660 1416790 1284628 1343782 1298670 1436407
16531 1436407 1643919 994351 1181861 1282927 1180143 1108045 1162455 906248 1196557 1204984
16521 1204984 1257840 851500 1227856 970739 771892 1169324 877091 1181222 1080115 983882
16511 983882 778692 822626 839464 626919 785655 821687 1024252 985221 674684 964603
16501I64603R0822l71250M8214j49584J98816K2817K42320k11841j43410J35282
16491H26789j69762J06477J23351q9592l3206J63683j40610j19790L6005p4808
16481F28537L60727J60694l72253j32388J61603p3495l33453K35195J28940J0434
16471G74541J05802l29427K57862j88664L3K4237Q6107J20852j8512k56158j48055
16460D28618K94973k7724l15459K90740k0877A93341L10631N8187K00953k4619
16450G38493l16299L77288C92673q0059q6534K42253L6726O0675j29480O2566
16440D98820P5391K38470l72914J86569J6024k02593K99982B31338L05182B06486
16429D40781L1226k7506q9940j42646N22712l28094K25339k84770J80509B10277
$$ plain form
16501 964603 1055425 684175 732389 582805 781621 804438 1046758 834917 691507 826789
16491 826789 657027 763504 886855 797263 764057 927740 787130 667340 703345 628537
16481 628537 989264 1149958 777705 645317 806920 733425 399972 635167 764107 774541
16471 774541 880343 550916 808778 620114 620147 644384 730491 851343 832831 576673 428618
16460 428618 723591 695867 380408 671148 650271 193341 503972 562159 763112 738493
16450 738493 422194 799482 392673 312614 226080 468333 505059 565734 436254 498820
16440 498820 574211 812681 439767 626336 642360 439767 739749 231338 536520 206486
16429 440781 472007 444501 354561 211915 734627 406533 631872 347102 527611 210277
16418F67970j44786A40893M64304k3763k84280O068L40182P8529C60698n9992
16408C00706K82924j26743P8401j06746J27879B24650K14472J03713j65378j46584
16398B30873K39212L1419B42223l1508J23316R9402k14725K90444j10198j05775
16388B93179I8071L50719j15031m2695j10100n9135K57781P632j04457j34661
16378A48124Q0472J59331D2389N30592k09566j4994J92722B55950J10124L30787
16368F96861k09840k34046K03303H4479K64243K66312k73767A55470m8914L51783
16358D58339k06220M677P8615J11922g632B24327L88973I8342J02028K81888k14540
16347B67718K05371I6577N96991d1926B09258J61820k1205l6012J20710B07840
$$ plain form
16418 667970 523184 140893 605197 581434 297154 303222 643404 721933 360698 300706
16408 300706 583630 456887 535288 428542 556421 224650 439122 542835 377457 230873
16398 230873 470085 501504 242223 210715 334031 433433 218708 509152 398954 293179
16388 293179 98071 448790 333759 291064 180964 121829 379610 387242 282785 148124
16378 148124 228596 387927 42389 572981 363415 348421 541143 255950 366074 696861
16368 696861 487021 252975 456278 84479 348722 615034 341267 155470 106556 458339
16358 458339 252119 256796 335411 447333 -7632 224327 613300 98342 200370 482258 267718
16347 267718 473089 96577 693568 -41926 209258 371078 349873 313861 434571 207840
16336B60314F1277K16772J52357K1585j14667j64581K3284P4766J81773a03808
16325D58121m6609A60981J48011j09247J31722j03120C4214R1805M0901Q0321
16315B47241J06854G2315L38564o939j71813d9762B70562K49195a22103D28856
16304D11620j71694F5861K71769A08959O5017c4280A21078D5123L74313b5142
16293C02934a02709D66903A97195J22994j59625K7093F408N4842J73784o8434
16283A66600M9943J11293r0927L005a44241a3469B57234N2700a0002B3757K23052
16272B46809n7744N7234J25117A75801j6503M4521q875q3638K26157a28761B05522
16260c6172C99633A30633K36036j06749A0865R2069J67345A0138K48982c5145
$$ plain form
16336 260314 61277 278049 430406 451991 337324 172743 196027 270793 452566 -103808
16325 458121 411512 160981 308992 199745 331467 228347 34214 126019 166920 247241
16315 247241 354095 72315 410879 403940 232127 -49762 270562 519757 -122103 428856
16304 411620 239926 65861 337630 108959 173976 -34280 121078 45123 419436 -25142
16293 302934 -102709 466903 197195 320189 160564 187657 6408 61250 235034 166600
16283 166600 216543 327836 236909 239914 -144241 -13469 257234 309934 -10002 23757 246809
16272 246809 189065 246299 371416 175801 159298 203819 194944 111306 337463 -128761 205522
16260 -36172 399633 130633 366669 259920 10865 102934 270279 10138 259120 -35145
16249G5529g9923A86181h2719B52156j06787Q5819p053P0301c857G007J56808
16238A63815J97758j24265b1842p3659A58323O7496a64531A6057L00663A17628
16227g3802A38962c9932C11177j396j28292c5626B81587K5163A29929m5447K56511
16216C40993C641K51990O7705j12943I2314M32950A25417J75368k7927e8202q5020
16205a43222A8042d7188B12005a18979g182A68914F7171J62139l0401B3284d4311
16193h1354C61639f5508B06688m574o2126l3374c96833B68764q6200C0416L24573
16182C54989J25850a57157I0146m2652L37670j60610H7184K35509b95111B34275
16171C1986Q7249h207j86660o5513j09396B08061K23436k14924B8151a2403A08037
$$ plain form
16249 75529 -79923 186181 -82719 252156 145369 231188 224135 294436 -3857 7007 163815
16238 163815 361573 237308 -21842 -95501 158323 225819 -164531 16057 316720 117628
16227 -73802 138962 -39932 311177 309781 181489 -35626 281587 306750 129929 84482 340993
16216 340993 3641 255631 323336 210393 92314 525264 125417 300785 272858 -58202 -143222
16205 -143222 18042 -47188 212005 -118979 -7182 168914 67171 229310 198909 23284 -44311
16193 -81354 361639 -65508 206688 202114 139988 106614 -396833 268764 182564 30416 354989
16182 354989 480839 -157157 90146 47494 385164 224554 87184 322693 -295111 234275
16171 31986 119235 -8207 -194867 -260380 -369776 208061 431497 216573 28151 -12403 108037
16159B66025C7998Q341c0616k6686K2413j78940A02895J5333c020j08204o9683
16148a80907G897J74663a56103B73783j11945J47821a40786A55349k882a610A81832
16136B57265I2628P0132o8245a45458k60814A49471a34271A09725a12007d2181
16125g8364l54576a26337a4470B04614q1880E5520k1122K4842M9676J33758a34983
16113A97498p7831a5345r8335d0685I3019K44173j56783p8693b74366B29212I2443
16101B33753J23531a62748d9272H1077d7671k8536A21257e5300h475C25210A32666
16089C4820E258P7882c12767D745a10784b7436A82548k8776f0703k01578F8630
16077b27055C92787c831k63127N0086A4417b12528k3308a0853q4023j81119H7570
$$ plain form
16159 266025 37998 46339 -30616 -57302 -34889 -213829 102895 118228 -3020 -111224 -180907
16148 -180907 7897 182560 -156103 273783 161838 309659 -140786 155349 152467 -1610 181832
16136 257265 92628 162760 94515 -145458 -406272 149471 -134271 109725 -112007 -42181
16125 -78364 -432940 -126337 -14470 204614 122734 55520 34398 59240 108916 242674 -134983
16113 197498 119667 -15345 -113680 -40685 93019 337192 180409 101716 -274366 229212 92443
16101 233753 357284 -162748 -49272 81077 -47671 -76207 121257 -55300 -8475 325210 132666
16089 34820 5258 83140 -312767 4745 -110784 -27436 182548 153772 -60703 -262281 68630
16077 -227055 392787 -3831 -266958 -216872 14417 -212528 -235836 -10853 -94876 -275995 87570
16065e9846j56711K8558q0626j13132a70467A67449g7031k2231A14941e8822A97529
16053a0207j39084o270A16873J72649a60336m007R738H016J93320a08604A77653
16041D5419c6028A23940f2279q8179E7813e7140E768Q485g7973B39659h1926r494
16029i1420j33228A95688e2551J4116A32899K8612b06139N1196e3599J3956I8294
16017C0222j581f2424F1555L00029m6153B2745J06408l8283g6232k7306l13545
16006d17083b735j07884b8991p7889C1712A142a48302B00813a39177A3172Q8105
15995A01277a14526D1886c35584a16955I8917C2802K5321C94a42738A28693F2466
15983A56769O4817a4199m0323D09421F1618b6907k23073A09616a58201f5677b1406
$$ plain form
16065 -59846 -216557 -187999 -268625 -381757 -170467 167449 -77031 -99262 114941 -58822 197529
16053 -10207 -149291 -155561 116873 289522 -160336 -164343 -154605 8016 201336 -108604 177653
16041 45419 -36028 123940 -62279 -150458 57813 -57140 5768 14253 -77973 239659 -81926 -91420
16029 -91420 -224648 195688 -52551 -38435 132899 161511 -206139 -154943 -53599 -39643 98294
16017 30222 28641 -62424 61555 361584 315431 22745 129153 90870 -76232 -103538 -417083
16006 -417083 -2735 -110619 -28991 -106880 31712 1142 -148302 200813 -139177 13172 101277
15995 101277 -114526 41886 -335584 -116955 98917 32802 58123 394 -142738 128693 62466
15983 156769 221586 -14199 -54522 409421 61618 -26907 -249980 109616 -158201 -65677 -21406
15971a38458j0766A16033B0316c69823a10131D2816Q8126h0578G92K10388o2581
15960A48599e6194b0228A53879f7172C6310J87815b66245B5561e1663J0105C4511
15948a01319l10163a20702I4246L9389K0888b47779j93705J81671a08302j35605
15938b43907b4701k21586J19992b8509r2585k9493e5760F8562a23218A19445h2849
15926b58502A7914c73108B25404A08035b82861G7730O8381m5077A1395b43840
15915h9217G9155J15245h6885J9677c2507j27658D590J26193b34467C9918K3543
15904F3461n296M749b1651k96505e3180A13220a42821B43686a37109D8074e3156
15892e31808c2671J5624j04746k10695d4158j97605j67850a56281G7299K6465
$$ plain form
15971 -138458 -149224 116033 20316 -369823 -110131 42816 130942 -80578 792 211180 148599
15960 148599 -56194 -20228 153879 -67172 36310 224125 -266245 25561 -51663 -41558 34511
15948 -101319 -411482 -120702 94246 133635 154523 -247779 -441484 -259813 -108302 -243907
15938 -243907 -24701 -246287 -126295 -28509 -121094 -150587 -55760 68562 -123218 119445 -82849
15926 -258502 17914 -373108 225404 108035 -282861 77730 146111 101034 11395 -243840
15915 -89217 79155 194400 -86885 -67208 -32507 -160165 4590 130783 -234467 39918 63461
15904 63461 58165 62914 -21651 -318156 -53180 113220 -142821 243686 -137109 48074 -53156
15892 -531808 -32671 -17047 -121793 -332488 -44158 -241763 -409613 -156281 77299 103764
15882A03764c05371D4181d78136c8918N85b296l80492a00179l9016B36K10944
15871B11180G7751O6032h68k16429A44030i0847j7202L6088m25639D3846b7638
15859I1081Q9604j731a29099d6222j16702A28816g5444A75284b53636C18897f2078
15847F4777a23119I9596J05968a82165A17968J4847n9081b73250N3997B55858
15836B18404a39992b9598C97222A11337J69888e9503A65116d9080n6931j11592
15826b17603A06995a2717j05550A38606A8803b8099j08421r5773A79586C4744
15815a08922j8674B61240b83630C2102a81250h1229A81959r0146a86027f9374
15804i2137n5371H4635k2327O3017B2897f0356r4145m9601A52617M0342b19491
$$ plain form
15882 103764 -305371 44181 -478136 -38918 -38333 -2296 -382788 -100179 -139195 236 211180
15871 211180 77751 143783 -868 -217297 144030 -90847 -108049 -71961 -497600 43846 -27638
15859 91081 180685 178954 -129099 -46222 -162924 128816 -75444 175284 -253636 318897 -62078
15847 64777 -123119 99596 205564 -182165 117968 132815 73734 -273250 -219253 255858
15836 218404 -139992 -29598 397222 111337 281225 -59503 165116 -49080 -106011 -217603
15826 -217603 106995 -12717 -118267 138606 18803 -28099 -136520 -232293 179586 34744
15815 -108922 -127596 261240 -283630 32102 -181250 -81229 181959 91813 -186027 -69374
15804 -92137 -147508 84635 62308 125325 22897 -60356 -154501 -204102 152617 192959 -219491
15792a79945M7811N0719H9109d08668B44563I1973k1065J68416c03607a32827
15781e447a144l8693J2154k86260c9455j5292C25010a09877j01608j21943n110
15770c38538a20066k19217B87367b82730c6673a3332j09793A04739h0782B57713
15759A9220J7405J57416C9295L02608c0870j2655E4220K66057a0713r4289j63796
15748b68798D0733h4435D4632J82369J56801G6162d24482J94703O1766D3281a18039
15736A0405a68075l7313d0192r7274A7300a978k02147A0388h8101I3720b97393
15724c9533J5429m0388F7196a72738l7427K4094F7118a02110B28189b48334A54609
15712A83458f7164j0325B713b1684C7526b59218D0090L8021a41601L5193K2652
$$ plain form
15792 -179945 -132134 -81415 89109 -408668 244563 91973 70908 239324 -303607 -132827
15781 -5447 -1144 -39837 -27683 -313943 -39455 -54747 325010 -109877 -211485 -333428 -338538
15770 -338538 -120066 -339283 287367 -282730 -36673 -13332 -123125 104739 -80782 257713
15759 19220 36625 194041 39295 341903 -30870 -43525 54220 320277 -10713 -105002 -268798
15748 -268798 40733 -84435 44632 227001 383802 76162 -424482 -229779 -168013 43281 -118039
15736 10405 -168075 -205388 -40192 -137466 17300 -1978 -204125 10388 -88101 93720 -297393
15724 -39533 -24104 -64492 67196 -172738 -210165 -186071 67118 -102110 228189 -248334 154609
15712 183458 -67164 -77489 2713 -21684 37526 -259218 40090 78111 -141601 -106408 -83756
15701h3756A86279a50069E67875g6209A84928G4895a26366C94916c13830J27894
15691a85936b5234j16392O5916m1876M6730C7038a47228d2100F1547e3666C1217
15679d4887C1386a03931f610l5412C6255a96334B8941R0529O4368a61960G7410
15667a08999j07556A14514l0892J16750a21378J2258o0034h2018j10409c0524
15656a25318a3633A60791c51596A5508e6336m9394m6902D7822J5733g012I9199
15644a81995o8073q8639A80156P9902A23515a32910C5751b24623l3173A29543
15633b01675L2913e0896A7202J72559K02554g7929A02384c76876B99651F9237
15622b45380J20656J6381A57157E5742g4844F2110c40888Q292d9596A38321c90039
$$ plain form
15701 -83756 186279 -150069 567875 -76209 184928 74895 -126366 394916 -313830 -185936
15691 -185936 -25234 -141626 -75710 -117586 -70856 37038 -147228 -42100 61547 -53666 31217
15679 -44887 31386 -103931 -6610 -42022 36255 -196334 28941 119470 183838 -161960 77410
15667 -108999 -216555 114514 83622 200372 -121378 -109120 -169154 -82018 -192427 -30524
15656 -125318 -13633 160791 -351596 15508 -56336 -105730 -152632 47822 63555 -7012 99199
15644 -181995 -250068 -338707 180156 260058 123515 -132910 35751 -224623 -257796 129543
15633 -201675 -168762 -50896 17202 189761 392315 -77929 102384 -376876 299651 69237
15622 -245380 -124724 -108343 157157 55742 -74844 62110 -340888 -332596 -49596 138321 -390039
15610A09481J5579e8481B7048a75775f2400k4627b5667C47935A05821n1562c51630
15598A48031a84615A62254d58866C3883a9008j52q6197m6004B80210D5529a11844
15586b39299h0443j4592J1538H6620c22641f1582A9206g874j10369A79409q8586
15575I0823c95283a41310C16721A08998b9378j78406E4053N3496J02278a16957
15564A78528g3188D1572g5248o2042m515K5175A41129P2192a56007N8823o0875
15553a58059h201j14486E1813K57005A37029a61643j00198a28090N9207A9978
15542d7065A6354b78515B7010J14959b1147k03726n1030G6177a57413p0398Q7658
15531a40153L1386G8991L9253a42349A59647a56015a0208l2808A08552g6033F2667
$$ plain form
15610 109481 125060 -58481 27048 -175775 -62400 -87027 -25667 347935 105821 54259 -351630
15598 148031 -184615 162254 -458866 33883 -19008 -19160 -105357 -151361 280210 45529 -111844
15586 -239299 -80443 -95035 -83497 86620 -322641 -61582 19206 -7874 -118243 179409 90823
15575 90823 -395283 -141310 316721 108998 -29378 -207784 54053 107549 209827 -116957
15564 178528 -73188 41572 -75248 -137290 -141805 -116630 141129 213321 -156007 -97184 -158059
15553 -158059 -8201 -122687 51813 308818 137029 -161643 -261841 -128090 -68883 19978
15542 -47065 16354 -278515 27010 141969 -21147 -224873 -275903 76177 -157413 -227811 -140153
15531 -140153 -108767 78991 118244 -142349 159647 -156015 -10208 -43016 108552 -76033 62667
15519a64855E4604J77529a66412C9793K18132c48727B15642m9895b7894k71415
15509b99309i7465b8587A79823c0328B2649b02890B00928o4656a21880N3834E4586
15497A56781e1117e550j9060k3329k51878a28507M395j52667B8986J29967b72682
15485G1235a22253A41755F1358I812O7788J38239h9439p7739M8523B61572a36400
15473A94936i6339A31793D7835a60097B43197d89848e9949c711A89844F9863a10466
15461a5218B16013m9812e6622C41744a66043C2156J52422a27851P451I5560a75050
15449B05211m1678b43807I4552m5002a33367m0010e6483j91396N9244A48394D8194
15437a25480b3060I8579I806g1404C2876b47693A05589K23734B8029a29055A4327
$$ plain form
15519 -164855 54604 232133 -166412 39793 257925 -348727 215642 165747 -27894 -299309
15509 -299309 -97465 -28587 179823 -30328 22649 -202890 200928 136272 -121880 -68046 54586
15497 156781 -51117 -5550 -24610 -47939 -299817 -128507 -124112 -276779 28986 158953 -272682
15485 71235 -122253 141755 61358 9812 77600 215839 -89439 -167178 -118655 261572 -136400
15473 194936 -96339 131793 47835 -160097 243197 -489848 -59949 -3711 189844 69863 -110466
15461 -15218 216013 166201 -56622 341744 -166043 32156 184578 -127851 -120400 95560 -175050
15449 205211 163533 -243807 94552 49550 -133367 -173377 -56483 -247879 -188635 148394 48194
15437 -125480 -23060 98579 9806 -71404 32876 -247693 105589 329323 28029 -129055 14327
15425C2125c05752b0648B83491d9328j05119p6333K9548h5334m9227G2431a50836
15413i3230A00361k8682d7382m3932a4775g109A71907Q205b29358i0399j59037
15402b49436B69334B5231a26275k878j12755C77037b73555a22874j35231h5431
15391b63512j82953i5636B95541g3743k53843c6367l4009A65406M2653a09058
15380E32872A54660B4084a98770A21423P9324m0148m0221c0564Q209A04625a51231
15368A22316m7812a34387o4766E1299j5841N0360J25075H5069m0544K7703a16653
15356e4905l38796B15029k8889C6231A5050L7960i5166A729a45039F1505J69087
15345B30592c7725p8664c9351k0555A47845J28176a1687A63024b59945c9964l71414
$$ plain form
15425 32125 -305752 -20648 283491 -49328 -154447 -230780 -201232 -85334 -134561 72431 -150836
15413 -93230 100361 71679 -47382 -91314 -14775 -7109 171907 180112 -229358 -90399 -249436
15402 -249436 269334 25231 -126275 -129153 -241908 377037 -273555 -122874 -258105 -85431
15391 -263512 -446465 -95636 295541 -73743 -327586 -36367 -70376 165406 208059 -109058
15380 532872 154660 24084 -198770 121423 200747 160599 120378 -30564 -22355 104625 -151231
15368 122316 74504 -134387 -199153 51299 35458 85818 210893 85069 44525 72228 -116653
15356 -54905 -393701 215029 186140 36231 15050 53010 -95166 1729 -145039 61505 230592
15345 230592 -37725 -116389 -39351 -59906 147845 276021 -11687 163024 -259945 -39964 -411378
15334d11378a55974g0808c3823m4292D9661b29376A26032j1325P9117a17227F2352
15322e00q8122C7686G95M27233A34399K06770a65406A41173L2985F7769C3424
15310B86901A34290e2663h60A98680D4766M0941G021K8847P5798b4300C2967J82900
15298B15867j7665b56918g1592k0978j14581d2132C46169b23343l5767B0970J76062
15287A97032a20773H0979a67669E0085E253e6593k31558A19593b94978A99238
15276a14944C2473a72828b75k27943G468L78076B9842L9177R4157L9489m7392
15265A55273E4688J89824a44323f699r8514C87309C209K68999F2390N4847J73851
15254B91088C4099L24742k3198L00989N04894k12935k30151K41534k97607I9956
$$ plain form
15334 -411378 -155974 -70808 -33823 -78115 49661 -229376 126032 114707 193824 -117227 62352
15322 -500 -88622 37686 795 428028 134399 341169 -165406 141173 174158 67769 33424
15310 286901 134290 -52663 -860 198680 44766 85707 7021 35868 111666 -24300 32967 215867
15298 215867 198202 -256918 -71592 -92570 -207151 -42132 346169 -223343 -259110 20970 197032
15287 197032 -120773 80979 -167669 50085 5253 -56593 -288151 119593 -294978 199238
15276 -114944 32473 -172828 -275 -228218 7468 385544 29842 69019 163176 202665 155273
15265 155273 54688 244512 -144323 -6699 -105213 387309 3209 272208 62390 117237 291088
15254 291088 34099 358841 335643 636632 1141526 928591 698440 939974 642367 99956
15243A64377f9067B78693E4196J73952c0954k9490A51208o6615a54450A32538
15232H2591m395J97266C5414J68354J98537o4818b18639A93618M7973G36K30280
15221B31016b994P68B19833J29066o8534r1578a08790A15280Q3649a4397H6133
15209h7126A11321J65166A3676b02268e8327C24382G4107O1898K83709n7556A12542
15197A28683b7998D4395i1066B6670b16674I0344c8245A63560D7495a5685C3288
15185g0697A21895b11911A26843M8042a72796Q3164A79748a971j44509A21349
15174A56413o7710b0493r5562I2582j0919e014k62133b1445H4048K54911D5914
15162e518l2026G826J53198a26011J0694A31824N2851a31859B91672A6178O0915
$$ plain form
15243 164377 -69067 278693 54196 228148 -30954 -60444 151208 84593 -154450 132538
15232 82591 78196 275462 35414 203768 402305 337487 -218639 193618 241591 736 231016
15221 231016 -2994 -2226 219833 348899 280365 188787 -108790 115280 198929 -14397 86133
15209 -87126 111321 276487 13676 -202268 -58327 324382 74107 136005 419714 362158 112542
15197 128683 -27998 44395 -91066 26670 -216674 90344 -38245 163560 47495 -15685 33288
15185 -70697 121895 -211911 126843 174885 -172796 -89632 179748 -1971 -146480 121349
15174 156413 88703 -20493 -116055 92582 81663 -5014 -267147 -21445 84048 338959 45914
15162 -5518 -37544 7826 161024 -126011 -115317 131824 184675 -131859 291672 16178 77093
15151G7093l316c90521e6011I1400J8814J7116J56149Q7177G7427K51617d6261
15139C15424H8893J43180f7439C02599o2533a8759A06781J25306a33701b0797
15128f1160K6809m9608A81237a6149B35774f517B948N37863H0431A6090M6393
15117F2483K03929a1694A69734a75386C65095G5188a25071D4263A0384b29967
15106E8860A7019M5477J26329k5424a79677I8328M2725g4765i249j27942d7956
15094h6195B7448R5078K04545b955I0199B5489q743O2593A3771J76883e038l6678
15082d1716j781B18829o5835J15773A33206g6564b7469A74879J13189j0859a4499
15070B95726p8530J298M4596A8418K30627c08366C5293e0532a1477A11703b49585
$$ plain form
15151 77093 73777 -390521 -56011 91400 110214 127330 283479 370656 77427 329044 -46261
15139 315424 88893 232073 -67439 302599 240066 -18759 106781 232087 -133701 -20797
15128 -61160 -34351 -83959 181237 -16149 235774 -6517 2948 540811 80431 16090 62483
15117 62483 266412 -11694 169734 -175386 365095 75188 -125071 44263 10384 -229967
15106 58860 17019 62496 188825 163401 -179677 98328 141053 -74765 -9249 -137191 -47956
15094 -86195 27448 122526 327071 -2955 90199 25489 16746 79339 13771 190654 -5038 -41716
15082 -41716 -43497 218829 152994 268767 133206 -76564 -27469 174879 288068 277209 -14499
15070 295726 217196 218494 263090 18418 249045 -308366 35293 -50532 -11477 111703 -249585
15058F0352P5059j0157a60466b1296B16555L24628j17775h7861r2448g6286C27784
15046f6973B66308B6216J7652O9153L4990J61298a42152I8013J0439l0236K6556
15035A04772K8039L11220A01434N6430d7994A6586L23946I7006a87785G3316M9304
15024A22620B6885K73670k6639M7392G0953e823D57340A76565Q0943k4752L6473
15013B69229k0796J20985A06969K17845A8817O4947J75880D7705K70241K6808
15003C44754a4027B44892L9438C8309J89139N9219a40014N6178C28152A56173
14992D30177B8866K30030J3276j06000J91825B7430f1303C39710q4505R6306A61842
14980G1110N8238f0753B1792P2251l4031L70464C6439j3082J56547M2913M5971
$$ plain form
15058 60352 135411 125254 -160466 -21296 216555 541183 423408 -87861 -180309 -76286 327784
15046 -66973 266308 26216 43868 113021 148011 309309 -142152 98013 108452 78216 104772
15035 104772 132811 444031 101434 157864 -47994 16586 340532 97006 -187785 73316 122620
15024 122620 26885 300555 273916 321308 70953 -5823 457340 176565 257508 232756 269229
15013 269229 248433 369418 106969 324814 18817 83764 259644 47705 317946 344754
15003 344754 -14027 244892 284330 38309 227448 286667 -140014 -83836 328152 156173
14992 430177 28866 258896 272172 166172 357997 27430 -61303 339710 255205 351511 161842
14980 71110 129348 -60753 21792 94043 60012 430476 36439 23357 179904 222817 268788
14969B68788c07916B72515L01218A44470J63965K5650B9591K36865j03343d0016
14958C0444K12860o8183O670q2736F889J88654n8535l0157R2318J09497j48148
14947A60518K99288A74205g1568B56396j2317J81840j48762K22800k31348A16531
14936B07890H8703M7979Q0167K96011A43061K1743a10176B52009L91403B07836
14925I1147Q9071J27236j38439J52384p8608A5062i536D30477I1206K91097k3695
14914C58608A22609k0474K32923f4424A2529N2783J74200J66922L3587j78788
14904B61233K07256j89664O9680p0252P4556j39197J46024A55846L33361J46531
14894F35738k87168J15633j25920h8656E75730k18885K58485B83602P2143G8290
$$ plain form
14969 268788 -307916 272515 573733 144470 308435 334085 29591 266456 163113 -40016
14958 30444 243304 175121 181791 99055 6889 195543 137008 106851 199169 308666 160518
14947 160518 459806 174205 -71568 256396 244079 425919 277157 499957 268609 116531
14936 207890 88703 136682 216849 512860 143061 164804 -110176 252009 643412 207836
14925 91147 180218 307454 169015 321399 242791 15062 -9536 430477 91206 382303 358608
14914 358608 122609 102135 335058 -64424 12529 65312 239512 406434 440021 261233
14904 261233 468489 278825 348505 278253 352809 213612 359636 155846 489207 635738
14894 635738 348570 464203 338283 -88656 575730 356845 615330 283602 355745 78290
14883C77800l6191R112j02578o0582K18636j99349L03550H1786K71109j51593
14873B01302L13418j90702N0593q6446m4742j9272J67426O5775j3374j70852H5130
14861D8262K54803A20119L58374l6878B14032K72280j5708K598k22316i5841C32628
14849B34463K10407j74042L47546A07183N48647C0574M60449m7273j10024J661
14839C35387J08508k16662n8569M00112k28022M56007A34034M15952j19550j02884
14829C27552J31062L05604k19866K8031j19020J49891B70715N40758A72713L97945
14819E70658j42034p6343L39879l10499J08023L1009B40361K06435B23229N57093
14809G80322B73218L38502K00024k80122B48752k4510L5435J10665O9075Q5246
$$ plain form
14883 377800 341609 350721 248143 187561 406197 206848 510398 81786 352895 201302
14873 201302 514720 324018 374611 288165 243423 224151 391577 457352 443978 273126 85130
14861 48262 303065 120119 478493 441615 214032 486312 470604 473202 250886 -95841 332628
14849 234463 444870 270828 618374 107183 655830 30574 491023 443750 333726 335387
14839 335387 443895 227233 168664 568776 340754 796761 134034 549986 430436 327552
14829 327552 458614 764218 544352 572383 453363 603254 270715 811473 172713 570658
14819 570658 428624 352281 692160 381661 489684 520693 240361 446796 223229 780322
14809 780322 273218 611720 811744 531622 248752 224242 259677 370342 439417 524663
14799E24663k1266j81665j25061I1103M03332K9847o0897A88595J27446K32045
14789E48086B49602K27852p9430M0213Q1363Q3759p6350l1192J45374j53124R8697
14778E86764j56428K23419j38202j8821Q9587j57253J18512O8641j40830j00798
14768C74591J39108p6861L09141C39053J00794J33421K20846C69729j15068O01051
14758H55712D10235B00743J93756K08337k05612L12837P9389l83912K01378j23744
14748D83172j29393L51931p8985J66743k80282L70745j01742k47572L11567k8536
14738H17648k11345O7476k61704M885M3823L36769k71640k2283j54621M19877
14728G68885k98454L5990J57290j39507R3629K0700m2811J00034K58423j83628
$$ plain form
14799 524663 503397 321732 196671 91103 494435 524282 463385 188595 316041 548086
14789 548086 249602 477454 398024 438237 519600 603359 527009 495817 641191 488067 586764
14778 586764 430336 653755 515553 496732 586319 429066 547578 616219 475389 374591
14768 374591 513699 436838 745979 339053 439847 573268 794114 369729 254661 855712
14758 855712 410235 200743 394499 602836 397224 710061 789450 405538 606916 483172
14748 483172 353779 705710 626725 793468 513186 883931 782189 534617 846184 817648
14738 817648 606303 673779 412075 416960 460783 797552 525912 503629 349008 768885
14728 768885 470431 506421 663711 524204 617833 638533 595722 695756 954179 770551
14718G70551J64620p2022j56045L3703J62884Q5465m36466R0537M66553k49001
14708H60779j07880K28173B50088N90545j51223J93134l76463J49127j6584J31618
14698G70242J27294k78105J95295L66874n41100n3546M93637m05395R1144M4005
14688H10345M1309j27916K87669k90642K62427l33465J4224K3232K58239j08479
14678H36943K60148j58019k17039q4709L65127l50385q8994M29956m87633J01441
14668F06836K7648K18249o9045l5647J66053J85684m47758L13379N3855R1101
14658A110355k23596O8415M3656L58983j63869R900k57695q0302M72393m09894
14648I28346J98823M75238o70971N21041k51023j73777M5652N87897m58000Q3773
$$ plain form
14718 770551 935171 863149 707104 740807 903691 989156 552690 643227 1109780 860779
14708 860779 752899 981072 250088 840633 689410 882544 506081 655208 638624 770242
14698 770242 897536 619431 814726 1181600 640500 586954 1080591 675196 766340 810345
14688 810345 851654 723738 1011407 720765 983192 649727 663951 687183 945422 836943
14678 836943 1097091 939072 722033 637324 1002451 652066 563072 993028 505395 606836
14668 606836 634484 852733 783688 748041 914094 1099778 652020 965399 1019254 1110355
14658 1110355 886759 955174 998830 1357813 1193944 1203844 946149 865847 1338240 928346
14648 928346 1127169 1602407 931436 1452477 1201454 1027677 1073329 1661226 1203226 1286999
14638A286999j59754R9561j28384J08332K9918q1573l5063J20710p1597n2845
14628A116304J50817j74484J32956j11308L42675k60326L8291k29026N597K44872
14618A256368J92241J3502l9863N7141k85945j10795K22704j51602L07868j81048
14608A280571R2396L26957k8076k57194K47984k46887J03884k0325j30154J63674
14598A532830J13403j38033n599K79198j80336L7656P0666J21914j61797J94479
14588A864381O5843j20720k4344m020r7708k29371N00271k54659J24165n703M1067
14577A859202r6679K38310p4761N7428k94896L31765P8499M6775m32337K69699
14567A983005J02830L53352j66556L11826l80407J67802K42418j6962q6270M66949
$$ plain form
14638 1286999 1127245 1226806 1098422 1206754 1236672 1155099 1120036 1240746 1169149 1116304
14628 1116304 1267121 1092637 1225593 1114285 1456960 1196634 1234925 1005899 1011496 1256368
14618 1256368 1448609 1462111 1422248 1479389 1193444 1082649 1305353 1153751 1461619 1280571
14608 1280571 1372967 1699924 1671848 1414654 1662638 1415751 1519635 1499310 1369156 1532830
14598 1532830 1646233 1508200 1502601 1781799 1601463 1639119 1709785 1831699 1669902 1864381
14588 1864381 1930224 1809504 1785160 1781140 1683432 1454061 1954332 1699673 1823838 1818135 1859202
14577 1859202 1762523 2000833 1926072 1983500 1688604 2020369 2098868 2145643 1713306 1983005
14567 1983005 2085835 2439187 2272631 2584457 2204050 2371852 2614270 2597308 2511038 2977987
14557B977987k92975L92860J68684k50504Q03713P34915O36787J565473L368246
14548A0105186N714222J0005401R067938o503817j3436517p281307l135448r19978
14540C615680r62293j34347m71532L847K31794n23083O8259l9354J36118O4491
14530A989580J49387P9938k9574j52511K30096m381l57774K64898O2080J99514
14520B431253Q2101k93726J01078J25762R6034j94832L33451k1550m3339J83501
14510B799733j75571O2707j52032J61110j4387K39823l98999M33460k47081M07180
14500C115943j16034j8969L1712K77411j48280k14595L28817o57587N21276n6461
14490C063233j65573M33473J25592k87208K74921J73335j79354N4125p0157J92322
$$ plain form
14557 2977987 2685012 3077872 3246556 2996052 3799765 4534680 5171467 6736940 10105186
14548 10105186 15819408 25824809 34892747 28388930 14952413 7671106 4535658 3615680
14540 3615680 2653387 2519040 2047508 2051355 2283149 1760066 1828325 1788971 1925089 1989580
14530 1989580 2138967 2218905 2189331 2036820 2266916 2262535 1904761 2169659 2231739 2431253
14520 2431253 2513354 2219628 2320706 2446468 2542502 2347670 2681121 2659571 2616232 2799733
14510 2799733 2624162 2686869 2534837 2695947 2681560 2921383 2522384 2955844 2708763 3115943
14500 3115943 2999909 2980940 3012652 3290063 3141783 2927188 3256005 2598418 3119694 3063233
14490 3063233 2897660 3331133 3456725 3169517 3444438 3617773 3438419 3492544 3422387 3614709
14480C614709r8241k61394M98963l2042k8803L5387j49616K55783L0575L3859
14470C899180J66267o6556L13727l87110J61960J93907K86574k59113K28054m2092
14460D494798k9759l080M43423k86718k83376N48319K92831k77908K51126J35373
14450E285029k29940L3305N2689N5590J23877m2479K52498K13133n5058M8360
14440E737004n0537J75014o0421K29695K12995J02019m53455K58226J03262J18822
14430F372624N7016Q4852O8069k7051M91511k28585L66405k21667J55961J66432
14420G285567R5071M58052l10977K12853K64587L7121K97901J29746k09351J96849
14410H457419m7095K06964L53598l4708K95337O6891r080K57154K68551l42106
$$ plain form
14480 3614709 3516468 3255074 3754037 3721995 3693192 3728579 3578963 3834746 3865321 3899180
14470 3899180 4065447 3998891 4312618 3925508 4087468 4281375 4567949 4308836 4536890 4494798
14460 4494798 4465039 4461959 4905382 4618664 4335288 4883607 5176438 4898530 5149656 5285029
14450 5285029 5055089 5088394 5141083 5196673 5320550 5278071 5530569 5743702 5688644 5737004
14440 5737004 5686467 5861481 5801060 6030755 6243750 6345769 5892314 6150540 6253802 6372624
14430 6372624 6429640 6514492 6582561 6555510 7047021 6818436 7184841 6963174 7119135 7285567
14420 7285567 7380638 7838690 7527713 7740566 8005153 8042274 8340175 8469921 8260570 8457419
14410 8457419 8410324 8617288 8970886 8936178 9231515 9298406 9289326 9546480 9815031 9472925
14400I472925O18448J59805J41378j48749M76041L5772K35020J81068M17986k8589
14390A1561105K68920O70316J23509M4442r859M32734r6585N43796l04547N09787
14380A3743618P23948p7668M94719J89904L65259J26185M03478k4890N18984O15327
14370A7078864L4914J96570O21539L45342L94820K45395J45777R03110K94027
14361B0260358M79901L84141L35816N42060R60185M71860N36157L67033N67129
14352B4904640N89003N85625N45075R13452N00474R60481O85500J044326L03849
14343C1032425J322688J085855M77883J073665R98458R80215J083259J116511
14335C9170959J053967J028735J484062J259113J215269J684145J470624J354577
$$ plain form
14400 9472925 10091373 10251178 10392556 10243807 10719848 10755620 10990640 11171708 11589694 11561105
14390 11561105 11830025 12500341 12623850 12668292 12658433 13091167 12994582 13538378 13233831 13743618
14380 13743618 14467566 14389898 14884617 15074521 15439780 15565965 15969443 15944553 16463537 17078864
14370 17078864 17113778 17310348 17931887 18277229 18672049 18917444 19063221 19966331 20260358
14361 20260358 20740259 21124400 21460216 22002276 22962461 23434321 23970478 24337511 24904640
14352 24904640 25493643 26079268 26624343 27537795 28038269 28998750 29684250 30728576 31032425
14343 31032425 32355113 33440968 33918851 34992516 35990974 36971189 38054448 39170959
14335 39170959 40224926 41253661 42737723 43996836 45212105 46896250 48366874 49721451
14327D9721451J611174K001104J509227K061545K048931K063562K429897J956035
14319F5402926K517574K339185K775228K895498L070928K532819L883293L395819
14311H8813270L705787L667768M285169M344624M425208M942000M868226N446064
14303A24498116O046398N516516O869320O723051P278012P878954Q294452Q582271
14295A81687090Q880638R848032J0084647J0693084J1262803J1646519J2249042
14288B56351855J2842429J3188131J3468219J3764480J4259673J4256766J4573832
14281C52705385J3853461J4123036J3296961J2368833J1652701R962798Q011078
14274D35974253N680057J754333j436709j779352k745839l450312n534363p384364
$$ plain form
14327 49721451 51332625 53333729 54842956 56904501 58953432 61016994 63446891 65402926
14319 65402926 67920500 70259685 73034913 75930411 79001339 81534158 85417451 88813270
14311 88813270 92519057 96186825 100471994 104816618 109241826 114183826 119052052 124498116
14303 124498116 130544514 136061030 142930350 149653401 156931413 164810367 173104819 181687090
14295 181687090 190567728 200415760 210500407 221193491 232456294 244102813 256351855
14288 256351855 269194284 282382415 295850634 309615114 323874787 338131553 352705385
14281 352705385 366558846 380681882 393978843 406347676 418000377 427963175 435974253
14274 435974253 441654310 443408643 441971934 440192582 437446743 433996431 428462068 421077704
14266D21077704q339323j0366235j2114814j3598012j4835518j5262275j5245809
14259C31315718j5556145j5181375j4180753j4101757j3496474j3117384j2338918
14252B33342912j1962655j1485923j0153267j0432013r414933q725508q316090
14245A62852523p946131p419920o964201o692231o160418n791703n297740n184500
14237A11395679m666379m647140m097759m047216l978419l472440l475874l210172
14229G9800280k917979l308860k586206k758225k598842k166373k511149j795046
14221E9157600j936324k109968j635481j823947j796662j459104j788098q71830
14213D5736186j587877j310288j255260j394693j036889j096989p79665q45256
$$ plain form
14266 421077704 412738381 402372146 390257332 376659320 361823802 346561527 331315718
14259 331315718 315759573 300578198 286397445 272295688 258799214 245681830 233342912
14252 233342912 221380257 209894334 199741067 189309054 179894121 171168613 162852523
14245 162852523 154906392 147486472 140522271 133830040 127669622 121877919 116580179 111395679
14237 111395679 106729300 102082160 97984401 93937185 89958766 86486326 83010452 79800280
14229 79800280 76882301 73573441 70987235 68229010 65630168 63463795 60952646 59157600
14221 59157600 57221276 55111308 53475827 51651880 49855218 48396114 46608016 45736186
14213 45736186 44148309 42838021 41582761 40188068 39151179 38054190 37274525 36429269
14205C6429269j396198j218440r78066p73329o22977o88987p09691j292481n62319
14196B8186781q16367o06516n18865q77184m10630q21705n21069l95367m70345
14187B2748733l79455o53875m08391o19074l62983n22578l93317m09074Q9305
14178A9089291p65426l80766p22895Q6571n53585O5290n04256l01666l41046k17379
14168A5454133n00070l05839J30038j004011K23745l34051j34930m29728L0457
14159A3129744m81086K31473m66828m01749l07604k06112L8447N8997m06025k25876
14149A0963381k23767l9006l6696l39493j01289l22352K4729l74110k20618J63335
14139I494114R9465m38711k32846k50778J81536k62305j58862j49317n0569m5563
$$ plain form
14205 36429269 35033071 33814631 32836565 32063236 31440259 30751272 30041581 28749100 28186781
14196 28186781 27370414 26763898 26245033 25367849 24957219 24135514 23614445 23219078 22748733
14187 22748733 22369278 21715403 21307012 20687938 20324955 19802377 19409060 18999986 19089291
14178 19089291 18323865 17943099 17220204 17306775 16753190 16818480 16314224 16012558 15671512 15454133
14168 15454133 14954063 14648224 14778262 13774251 13997996 13663945 13529015 13099287 13129744
14159 13129744 12648658 12880131 12413303 12011554 11703950 11497838 11536285 11595282 11189257 10963381
14149 10963381 10739614 10700608 10663912 10324419 10223130 9900778 9925507 9551397 9330779 9494114
14139 9494114 9593579 9154868 8922022 8671244 8852780 8590475 8431613 8282296 8231727 8186164
14129H186164j01472j68833k55108J02135l13874J8417j59076j38126L52471n25914
14119F996784J39195k95294L15399n31764r3413L72733n29341M2413n9747l06611
14109F050354L16777n5994m53983J31942n2111q9020q5101k68908m3057M15891
14099E866790l81699n9130J17397K024k36765k57449m8408K8650o8217j98448
14089D764745j4972K59571m03900j30304J70862L4902J59711k31350j23674Q9130
14079D574721k08383j70928P1585k98432J64358j20158J82483J147K0760j70243
14069D046910m49172J93849L52274l2213n70085L02094L5423j34427j8786K9202
14059C755069k83527j2124k38j15430J78655j70106K33600m33503J78830o5224
$$ plain form
14129 8186164 8084692 7915859 7660751 7762886 7449012 7467429 7308353 7170227 7522698 6996784
14119 6996784 7135979 6840685 7156084 6624320 6530907 6903640 6374299 6416712 6356965 6050354
14109 6050354 6367131 6311137 5857154 5989096 5936985 5847965 5762864 5493956 5450899 5866790
14099 5866790 5485091 5425961 5543358 5545382 5308617 5051168 5002760 5031410 4963193 4764745
14089 4764745 4749773 5009344 4605444 4475140 4646002 4680904 4840615 4609265 4485591 4574721
14079 4574721 4366338 4195410 4266995 3968563 4132921 4012763 4195246 4196393 4217153 4046910
14069 4046910 3597738 3791587 4143861 4111648 3541563 3843657 3879080 3744653 3725867 3755069
14059 3755069 3471542 3459418 3459180 3343750 3522405 3352299 3585899 3152396 3331226 3266002
14049C266002k27293L22296j69649m64428L56726m704J31501q9513k24537J88350
14039C084751M5909l45399K30889l21497L5647l6584p1960L0224K12449m7387
14029B817042k854j56084J70287l18142N57733m14642j62540P3903o2919L5324
14019B537108J4184l07020M73663m11695K29574k193l28510K00342L390l48236
14009B060607J78345l02538J14333K30748M2057J8651k98539q5602N30355m85608
13999B002809J18345N7882P4535j05538L53100k87632k2234L22272J02112J063006
13989C678657J932834M596510Q684897J2148413j115140j1155591p657988l179248
13981G933344j971595j525849o10756l31777l39758j10865j63510j19413k69249
$$ plain form
14049 3266002 3038709 3361005 3191356 2726928 3083654 3078950 3210451 3120938 2896401 3084751
14039 3084751 3130660 2785261 3016150 2694653 2730300 2693716 2621756 2651980 2864429 2817042
14029 2817042 2814188 2658104 2828391 2510249 3067982 2653340 2490800 2564703 2501784 2537108
14019 2537108 2551292 2244272 2717935 2306240 2535814 2533621 2205111 2405453 2408843 2060607
14009 2060607 2238952 1936414 2050747 2281495 2323552 2342203 2043664 1958062 2488417 2002809
13999 2002809 2121154 2179036 2253571 2148033 2501133 2213501 2191267 2513539 2615651 3678657
13989 3678657 5611491 10208001 18892898 31041311 29926171 18770580 11112592 7933344
13981 7933344 5961749 4435900 3825144 3493367 3153609 3042744 2879234 2759821 2490572
13972B490572j07482m6722K5737K121j54288M45272m81794J57587l79901M57015
13962B408117k21593n0533l11379M76989m80168k82909M1733O8236k49649L53374
13952A752218J8736O9189q5640Q3692r6005J7563N3909j86024K3728j05935M21376
13941A966807o7569l22722J22600k15313K04588k15681J57428m5931O2178J14243
13931A760628k78693L316j2052l7004j80465L18493N0754j87705K10114j87349
13921A460037k43750J39715N4430N1821k75823J31490j86800J56034L01231j32946
13911A455439N2509j59496P7317k24514M9698J91276l10759M74820m27429J53082
13901A331943j25639o9030P0978J27247j80835J94054j88583R747k53563K94455
$$ plain form
13972 2490572 2383090 2336368 2362105 2364226 2209938 2655210 2173416 2331003 1951102 2408117
13962 2408117 2186524 2135991 1824612 2301601 1821433 1538524 1580257 1648493 1398844 1752218
13952 1752218 1770954 1840143 1754503 1838195 1742190 1759753 1813662 1627638 1651366 1545431 1966807
13941 1966807 1899238 1576516 1699116 1483803 1688391 1472710 1630138 1584207 1646385 1760628
13931 1760628 1481935 1485251 1473199 1436195 1255730 1574223 1624977 1437272 1647386 1460037
13921 1460037 1216287 1356002 1410432 1462253 1186430 1317920 1131120 1287154 1588385 1455439
13911 1455439 1507948 1348452 1425769 1201255 1250953 1442229 1131470 1606290 1178861 1331943
13901 1331943 1206304 1137274 1208252 1335499 1154664 1348718 1160135 1169882 916319 1210774
13891A210774l14890N1827q8977L26039J42746j15207K11615p6168l24081K55963
13881A279641k69359p5297K04630J52004p9703k89105K33773o8806K72342l97227
13871I62893l47193K36227j91067L30713N53924o00381K00956m97606N26061l89890
13861G84637K14145J3337k2981r9635J77977l96338L75292j53645J73468k65901
13851H00356N50889m30032R9052l212R4561r8090o3174p0130J29752K868j46757
13840H66083l7783L966J62556p8563j3536k58723K03475R7692k08889R9129q0058
13829G55349J35661p0806j58988K51442j38936M8293J10389q7779K08194k10131
13819H42688K00989E10883K75311K1655J09376o9215l4650j39922p0150J70632
$$ plain form
13891 1210774 895884 947711 858734 1184773 1327519 1212312 1423927 1347759 1023678 1279641
13881 1279641 1010282 934985 1139615 1291619 1211916 922811 1156584 1087778 1360120 962893
13871 962893 615700 851927 660860 991573 1545497 945116 1146072 648466 1174527 784637
13861 784637 998782 1012119 989138 889503 1067480 671142 1046434 892789 1066257 800356
13851 800356 1351245 921213 1020265 1017053 1111614 1013524 950350 880220 1009972 1012840 866083
13840 866083 828300 832266 994822 916259 902723 644000 847475 945167 736278 835407 755349
13829 755349 891010 820204 661216 912658 773722 822015 932404 844625 1052819 842688
13819 842688 1043677 510883 786194 807849 917225 848010 813360 673438 603288 773920
13809G73920K6364J6267p1035J20672J95143l35740j17712K58244j00118j03412
13799F62593J29584r2081K46273l06859J67260l5091L04586l02168J44581p8031
13789H40647l09319K29286P6357k30843m94J51795L9901k95672J13379J84078
13779G99115B65260L41913J10763k13159J13902K21509o1974C86290M23467C71312
13768D87131K56957j34546J43040m9876O0305q5203K00532l9553l25218K49561
13758G63130k80937M18793o1406k27422L59445k16072j42059O784K54748k53267
13748F21737O7689J0137k10032J48368O2048k87782K08649k14604k1644K17281
13738F01847p1315j79103P4143j93548M38886C25553L16243L1053o4182k21927
$$ plain form
13809 773920 800284 816551 745516 866188 1061331 725591 607879 866123 766005 662593
13799 662593 792177 700096 946369 639510 806770 771679 1076265 774097 918678 840647
13789 840647 531328 760614 836971 606128 605634 757429 797330 501658 615037 799115
13779 799115 265260 607173 717936 504777 618679 840188 778214 386290 809757 371312
13768 487131 744088 609542 752582 702706 763011 677808 878340 838787 513569 763130
13758 763130 482193 900986 839580 612158 971603 755531 613472 620256 875004 621737
13748 621737 689426 699563 489531 637899 699947 412165 620814 406210 384566 601847
13738 601847 530532 351429 425572 232024 670910 325553 641796 672849 608667 386740
13728C86740J74182Q0499q9241j22599J67354A85855M11113k68847K30715B23081
13717D40607J41641R8185k25270L50562C66412K31143m3174j75215L6939L5594
13707D51699A53231J24140p3422J78600J66783k3752j23719A97617L31481J42425
13697F71523k7211q4757j20334j85946M68454j21616r3428Q2506j68307O9182
13687D90066R6972k71565O4837j458L84177l69589A29995M71645j74803J92852
13677F19689k14809J9591q5882n1687L12691J941j00914j58292m5147p4122K27194
13666D50253j18044K65005j61367j246N8465K03111o4349j03445B7235J45299
13656A72534K8565K7490J98844N8327j7028P8463A97784N9557N83180k93299J32897
$$ plain form
13728 386740 560922 641421 552180 429581 596935 185855 596968 328121 558836 223081
13717 440607 582248 680433 455163 805725 366412 597555 554381 379166 416105 451699
13707 451699 153231 277371 203949 382549 549332 525580 401861 197617 529098 671523
13697 671523 644312 559555 439221 253275 721729 600113 506685 589191 420884 490066
13687 490066 587038 315473 380310 378852 763029 393440 129995 601640 426837 619689
13677 619689 404880 424471 338589 286902 599593 601534 500620 342328 297181 223059 450253
13666 450253 332209 597214 435847 434601 493066 696177 631828 528383 27235 172534
13656 172534 201099 228589 427433 485760 468732 547195 197784 257341 840521 547222 680119
13645F80119C12614j14558K34667m6449R2005j33424J63266G5896K85664J65884
13635E27444A80467K46951A22450J48055K42942A8065K02296L09723o5371p5992
13625C88721N1168k06317J71411j56822J58407N495J81094k31472j75171L20691
13615E07205A17597O0660J14139K07919j55702R6911P390j89284J80436m3648
13605C96418J19488A90436K20989o985j37940J02051n8541j08375q7420K27267
13595C41482a5363D27650a25017C56650A12208K82645J35537j08496j94847q7523
13585A39524L08799o7894A55290K49224J12227A1649J03923k5241N21764H3615
13574A52881L62418K1515k43181Q7625l5823J95499B30173P8162O0127N0931j06593
$$ plain form
13645 680119 312614 198056 432723 386274 478279 344855 508121 75896 361560 527444
13635 527444 180467 427418 122450 270505 513447 18065 220361 530084 464713 388721
13625 388721 439889 233572 404983 248161 406568 412063 593157 361685 186514 507205
13615 507205 117597 178257 292396 500315 344613 441524 448914 259630 440066 396418
13605 396418 515906 190436 411425 404440 266500 368551 310010 201635 114215 341482
13595 341482 -15363 427650 -125017 356650 112208 394853 530390 421894 227047 139524
13585 139524 448323 380429 155290 404514 516741 11649 115572 90331 612095 83615
13574 152881 515299 536814 293633 381258 345435 540934 230173 308335 368462 419393 312800
13563C12800J38310B06902Q612K14868H3710k5953M72872A61300n8139L68580
13553D71741p650J17312B15036k0521J87183N1238j40683J99749o6338j10362
13543C15302P9600A14624J68531j4943J7464p796J15328j54455Q11N7196m2768
13532B53992k2694o1124K29551j27091k4492K10552M73364C28562J13678j38519
13522C03721K17486j54576J70593j92550I7045k4441f5700C13821D2290K37412
13512B79702j39445J70537F1550R1127a02227E24473K7693A4583M12510A74011
13501I9077J44609k469K62042j58613O3874A58261K26202A71836K05029A76647
13490A64287Q4612E3642K24846A20592K72019O794j46602b9396B62364j19473
$$ plain form
13563 312800 451110 206902 215514 430382 83710 57757 530629 161300 103161 471741
13553 471741 464091 581403 215036 194515 381698 432936 292253 492002 425664 315302
13543 315302 394902 114624 283155 268212 285676 277880 393208 238753 239564 296760 253992
13532 253992 231298 170174 399725 272634 248142 458694 932058 328562 442240 303721
13522 303721 521207 366631 537224 344674 97045 72604 -65700 313821 42290 279702
13512 279702 140257 310794 61550 152677 -102227 524473 552166 14583 427093 174011
13501 99077 243686 241217 503259 344646 408520 158261 384463 171836 376865 176647
13490 164287 248899 53642 278488 120592 392611 399405 252803 -29396 262364 142891
13480A42891J60370p405m1444R3918J4660J87830F5110K09862J30241l2192A67505
13468a78674B27832J5301J32563K55383k30035H3656L41005A16190J62287j05647
13458A72830L6679f6582b3555m8788B96805K06486A50223J9201f9660B69108D0063
13446D35770N5724j49617n4690a22588C34102p9384j25019h6909i075A33432L05305
13435D38737A78758J04203K59744c0122A70524J66041J94269j54063G4266K05525
13425B79791n062p7423o5139a75214A26356q440J06487R9560F4893J98915j08836
13414A54972J17375R0067J5167A09325K39436J50386A2964N25938k65410h9296
13403B5266K81897a41058B74545K2714a04920A07862a9117A53825o155C5883K70527
$$ plain form
13480 142891 303261 295856 254412 348330 362990 550820 65110 274972 405213 373021 167505
13468 -178674 227832 243133 375696 631079 401044 83656 424661 116190 278477 172830
13458 172830 209509 -66582 -23555 -72343 296805 503291 150223 169424 -69660 269108 40063
13446 435770 491494 341877 287187 -122588 334102 254718 129699 -86909 -9075 133432 438737
13435 438737 178758 282961 542705 -30122 170524 336565 530834 376771 74266 279791
13425 279791 274729 197306 132167 -175214 126356 117916 224403 323963 64893 263808 154972
13414 154972 272347 362414 377581 109325 348761 499147 12964 538902 273492 -89296
13403 25266 307163 -141058 274545 297259 -104920 107862 -19117 153825 147670 35883 306410
13392C06410k4948N6844h9676C76702q5317J32575E7700K37924A37091K45733
13382C82824O8393a77293C95525A62669Q6536J81162a53379D0978J27915P4645
13372B43538n9402R4067J24833A16284K28123A71051p6378L47980E528P8063J56585
13361B40176d2910B81384j00203b2043B37209H2170a97008A83997o7529p60J56993
13350B72701j10031K02164H781K20842K67588C0986J81033K31320k02568i470
13339B79676m4612O162a04500B94953J5492A09946R9678F2056J04069F6094L48071
13328D14165k03925N261a76231C19645o6984g3028A90080R9023Q1545j36572k037
13317B32039a01126D90055A80283h030D84504A32423J76595C6510J90207p1562
$$ plain form
13392 306410 281462 338306 -89676 376702 291385 423960 57700 295624 137091 382824
13382 382824 451217 -177293 395525 162669 249205 430367 -153379 40978 168893 243538
13372 243538 184136 278203 403036 116284 344407 171051 94673 442653 5528 83591 240176
13361 240176 -42910 281384 181181 -22043 237209 82170 -197008 183997 116468 115708 272701
13350 272701 162670 364834 8781 229623 497211 30986 212019 443339 240771 -9470
13339 279676 235064 241226 -104500 294953 310445 109946 209624 62056 166125 66094 414165
13328 414165 210240 215501 -176231 319645 252661 -73028 190080 289103 370648 234076 232039
13317 232039 -101126 490055 180283 -8030 484504 132423 309018 36510 226717 155155
13307A55155J19188Q5494j21010J52493c25001B79382j14560J08957r6208J55774
13297C33345q2886Q4669p9531l6205M9668N6786C9902J46919A6445L29342c6172
13285c0521k7740B74969a63056E60878a0998A86360k2837L1387F5189J29597K9232
13274B24018l5760C5228Q9156O21398a9099E44680a24146E00924A89178K03021
13264C92199b73956J16291f8599C30241A00597B3982J13603b7954k32958a21895
13253b44334j11993A31682J99389A62777N2385K19408f9779c2061m0452A6405
13242h482C16249a54101B60113a2577B34818A5844R5269J4839a72037B30273L384
13231B33657E2006L06476G7620K95070A33008a26590D6019N6062J86441j29162
$$ plain form
13307 155155 274343 359837 238827 391320 -325001 279382 164822 273779 177571 333345
13297 333345 250459 335128 255597 219392 269060 325846 39902 186821 16445 345787 -36172
13285 -30521 -58261 274969 -163056 560878 -10998 186360 163523 194910 65189 194786 224018
13274 224018 188258 35228 124384 745782 -19099 544680 -124146 500924 189178 392199
13264 392199 -273956 -157665 -68599 330241 100597 23982 137585 -27954 -260912 -121895
13253 -244334 -356327 131682 331071 162777 215162 434570 -69779 -32061 -72513 16405
13242 -8482 316249 -154101 260113 -12577 234818 15844 111113 125952 -172037 230273 233657
13231 233657 52006 358482 77620 372690 133008 -126590 46019 102081 288522 159360
13221A59360f0250m3006B28024h4487A58754j2256N7486J7726L9462J08859H1556
13209a68833B52408R3736a33929A33103M7422h609B54464J50257m1645b78258
13198B71174m892b7472A61117q676a79530A64872r12a99054A29951J71643I3815
13186B96392H8730M02680b55838B30771b34131D22655B3310Q7355A8394d7863
13175a67309m1723C32961g0991B28705a65647d318r8220B0188c311G3726n106
13164F8620P3848d5036A34713o5676J57701i1892H2345J07611a40606o7957E12516
13152B247J16752i2886R047B61787K47969A24192K4779a37825C28405B1443R7077
13141A18520l9682a299F6809M2936K12583A1815L65142F1507e8930q8934B04858
$$ plain form
13221 159360 -60250 -103256 228024 -84487 158754 146498 203984 221710 261172 370031 81556
13209 -168833 252408 346144 -133929 133103 180525 -8609 254464 404721 363076 -278258
13198 271174 266282 -27472 161117 152441 -179530 164872 163960 -199054 129951 301594 93815
13186 296392 88730 491410 -255838 230771 -234131 422655 23310 110665 18394 -47863
13175 -167309 -209032 332961 -70991 228705 -165647 -4318 -102538 20188 -3311 73726 68620
13164 68620 142468 -45036 134713 69037 226738 -91892 82345 189956 -140606 -208563 512516
13152 2247 118999 -92886 -83839 261787 509756 124192 148971 -137825 328405 21443 118520
13141 118520 78838 -1299 66809 109745 322328 11815 376957 61507 -58930 -147864 204858
13129b82379G7031Q6054I565R7639a88900F0752J73613a39691C27186E2069K47576
13118B99645j05603L7595i6772A98555E5637a4523F04071B57457G2801a320A51799
13106a54009G854J20911e7731m5910A88562a17421L3250c6491B37732d8892j32455
13095a81347B56941K4385a25378C62307A52570G4079c0749C10083A11556m4695
13085F6861J65272J8021b65444A09044a20534A25511A2288J15590a9332B4230
13074D3546a1694E3196i744o8025B01898k4683P3543G794K0710e0452E05405B489
13061B72830c5526C7024J45026C8854K5448F694R8454P3141Q3167D8492B0919
13049B01695q3617M4248G7177Q779m0474K61707P1141A04404J11178H0452d5409
$$ plain form
13129 -282379 77031 163085 9565 107204 -188900 60752 234365 -139691 327186 52069 299645
13118 299645 194042 231637 -96772 198555 55637 -14523 604071 257457 72801 -1320 151799
13106 -154009 7854 128765 -57731 -103641 188562 -117421 -84171 -36491 237732 -48892 -181347
13095 -181347 256941 281326 -125378 362307 152570 74079 -30749 310083 111556 66861
13085 66861 232133 250154 -265444 109044 -120534 125511 12288 127878 -19332 24230
13074 43546 -11694 53196 -9744 -77769 201898 177215 250758 7794 28504 -50452 505405 2489
13061 272830 -35526 37024 182050 38854 64302 6694 105148 178289 261456 48492 20919
13049 201695 118078 162326 77177 85956 45482 307189 378330 104404 215582 80452 -45409
13037a45158E8516c59740A37506a86438D73040f9080p7654A26322F1346f7406
13026f0135k7140b892l3353I9302K37071g4697H2923Q1917i2746H8060K71667
13015C59727j28668I6790b0780A40411J53684k0341o3140c6119H8859b13531A27191
13003B2489J02502b6340E1769a76883e2859A07541o232F427k45L37311a32930
12991B54235h9785A56076g3444C50050a26243F4534a22119A02250J23689H2817
12980e56972a04819C9619d2744j55200d7330A27821d0358A06230e0461j1360A36205
12968a93627E4172b10939C96247A30386b1962B77798A18621K2161A7397f6873
12957f5494E1071J41583i6288C66423D3778J05478F022K18323A3013a93827R216
$$ plain form
13037 -145158 58516 -359740 137506 -186438 473040 -69080 -146734 126322 61346 -67406
13026 -60135 -87275 -2892 -36245 99302 336373 -74697 82923 164840 -92746 88060 359727
13015 359727 231059 96790 -20780 140411 294095 273754 210614 -36119 88859 -213531 127191
13003 22489 124991 -26340 51769 -176883 -52859 107541 101309 6427 6182 343493 -132930
12991 254235 -89785 156076 -73444 350050 -126243 64534 -122119 102250 225939 82817
12980 -556972 -104819 39619 -42744 -197944 -47330 127821 -40358 106230 -50461 -61821 136205
12968 -193627 54172 -210939 396247 130386 -21962 277798 118621 140782 17397 -66873
12957 -65494 51071 192654 -96288 366423 43778 149256 6022 224345 13013 -193827 -184611
12946a84611D0259o331K0777J7649K49018j26420E0320a45389c7193A6429b43280
12934a00521G0286M04640c59211B62541E2416h6207B17367a19594j7194B21757
12923A36403a39097e9767I1444l6133a7195B45790a19876C85567h2529k313A14082
12911A92674E7670N4477a15074l3497D64131B7167K29588a2610B46700a12117
12900B93727E7727L7430c15242A62384B6072J14185K14268a88134e4404B25386
12889e0656A74291k0387b11855F9503i3923C44164b12551b1683k1291r2442e5384
12877a07836A14362c9680A84397b987B91144F8690M37712F3698J34494a95804
12866A38439h800B03151b9977O244B47147A15503k5767C2362M088a58987j8566
$$ plain form
12946 -184611 40259 33928 54705 72354 321372 194952 50320 -145389 -37193 16429 -243280
12934 -100521 70286 474926 -359211 262541 52416 -86207 217367 -119594 -136788 221757
12923 136403 -139097 -59767 91444 55311 -17195 245790 -119876 385567 -82529 -84842 114082
12911 192674 57670 112147 -115074 -148571 464131 27167 256755 -12610 246700 -112117
12900 293727 57727 95157 -315242 162384 26072 140257 354525 -188134 -54404 225386
12889 -50656 174291 153904 -211855 69503 -93923 344164 -212551 -21683 -42974 -135416 -55384
12877 -107836 114362 -39680 184397 -2987 291144 68690 506402 63698 198192 -195804
12866 138439 -8800 203151 -29977 -23733 247147 115503 89736 32362 36450 -158987 -177553
12855a77553r6265A8551J18405J8325f3144n0677g09j33466A88795K9431c10029
12843b31063f8559k3349H1197O0985c04404a14872B19496A05313b13566C24879
12832A35396d5060J7471k08843D3898e5239A83059F7201a75424O0471a6338A3557
12820h2343j70250a14736A531K92474l5912F0833J4613q888Q8893a31020n5167
12809a86187l4642O0094C17577a8410E9849a01595A58300B0242O8860f8549b5343
12797C8727J50878m5214D8265a09049A33471e1353B807R8863J96578A13078N0204
12786A63282j1731a15246A93926p3131c01223B01066L52700a92646G4256a22429
12775C12933J9442E4114i7373l8906e1918A27276k2087N3830j9610Q2556I5122
$$ plain form
12855 -177553 -273818 18551 136956 155281 -63144 -113821 -709 -134175 188795 218226 -310029
12843 -231063 -68559 -91908 81197 142182 -304404 -114872 219496 105313 -213566 324879
12832 135396 -45060 -27589 -236432 43898 -55239 183059 67201 -175424 -114953 -16338 13557
12820 -82343 -252593 -114736 1531 294005 258093 60833 75446 66558 155451 -131020 -186187
12809 -186187 -220829 -160735 317577 -18410 59849 -101595 158300 20242 89102 -68549 -25343
12797 38727 189605 144391 48265 -109049 133471 -51353 2807 101670 298248 113078 163282
12786 163282 151551 -115246 193926 120795 -301223 201066 553766 -192646 74256 -122429
12775 312933 332375 54114 -97373 -136279 -51918 127276 105189 159019 139409 221965 95122
12763a70118A1570J59567i5414c6603B03591a42610k7987j56022H9832M0265n6116
12752G3981B5305J47435d127C5263r776J362L7101J50708K56824e7555G100Q8764
12740I5864O3902a99286h9701A47490o6030b65627g018A72269b76410C48800A61663
12728F7407a1530j71416C65391A29630a1844p712D643a44868N6662A09659c13536
12716c08303A06883J28748C6986M1346M0322m617D3722q941K63285R9221A76054
12704A73186J99209A32997a21366E4158M7035K02260a07756B08212H0023b0965
12693f0668j1296A97024h2624l1837A7569K21762j6685a61308P6848C65820A62861
12681a22298B70826N8997B9463K01571J21308b5856A34622n708a68963A42107
$$ plain form
12763 -170118 11570 171137 -95414 -36603 203591 -142610 -170597 -326619 89832 130097 73981
12752 73981 25305 172740 -4127 35263 25487 26849 63950 214658 471482 -57555 7100 95864
12740 95864 159766 -199286 -89701 147490 81460 -265627 -7018 172269 -276410 348800 161663
12728 67407 -11530 -182946 365391 129630 -11844 -19556 4643 -144868 -88206 109659 -313536
12716 -308303 106883 235631 36986 78332 118654 114037 43722 34781 298066 397287 176054
12704 173186 372395 132997 -121366 54158 101193 303453 -107756 208212 80023 -20965
12693 -60668 -71964 197024 -82624 -114461 17569 239331 222646 -161308 -84460 365820 162861
12681 -122298 270826 329823 29463 231034 352342 -25856 134622 128914 -168963 142107
12670C620a34463A34497d2278B16287a00431h843o8578A99883B2675J18913j7601
12659A23987Q7705A2448K04754l8858E2282O4159J61367f0097A68031c8635G0163
12647C26213c51942i9723E9860Q9987n7541b34904H9983K77887q8586b0433h847
12635D7197k173J02202r752P4460k5281e1036B01203L92850a08704C8065d8223
12623e9227b381G0499a16765A98091f3405P656J8187B21909a25117e6260j2535
12612f8795q5463C2258a25130H6658J77223b3620A49124b22153B22498K29544
12602D52042a27836A47980D0461J64423a55927B74863h2613a9211r1806I5680
12591f7235C08024a80645A64698a12327A96948r5586C3376J36623l9044o5288
$$ plain form
12670 3620 -134463 134497 -42278 216287 -100431 -8843 -77421 199883 22675 141588 123987
12659 123987 211692 12448 217202 178344 52282 116441 277808 -60097 168031 -38635 70163
12647 326213 -351942 -99723 59860 149847 92306 -234904 89983 367870 279284 -20433 -8847
12635 47197 45024 147226 137474 211934 186653 -51036 201203 594053 -108704 38065 -48223
12623 -59227 -2381 70499 -116765 198091 -63405 -55749 -37562 221909 -125117 -56260 -68795
12612 -68795 -154258 32258 -125130 86658 263881 -23620 149124 -222153 222498 452042
12602 452042 -127836 147980 40461 204884 -155927 274863 -82613 -19211 -111017 95680
12591 -67235 308024 -180645 164698 -112327 196948 101362 33376 169999 130955 65667
12581F5667f4155l8406B83126E4331c5744k36166i3371k5679a7207j17804l7795
12570a72806A62394q1143J13292b19982A97870l0134L0805c0491I8268Q2212b6624
12558f144H5123b08293C0338a91400f7869B4057b4854q9537F3210J07815h396
12546a19520B08937D1050L9803L1108a7859r1995a9204A65950a10097A06567b51618
12534B35521E079i2367B10580F6332b7392p6908C14932n0618a73194B36088n0694
12523A85394J44229j61885d2001C35267a06210A25659K46112B5765M5063a76192
12512a36832A88366L3447h8938E6903a34272I6522a00766I5261c4291F7636a87796
12500a04670C6606Q5602i9175A89262G4954M7393J06732b97585F4546K5256I462
$$ plain form
12581 65667 -64155 -102561 283126 54331 -35744 -271910 -93371 -119050 -17207 -135011 -172806
12570 -172806 162394 81251 194543 -219982 197870 167736 198541 -30491 98268 180480 -26624
12558 -6144 85123 -208293 30338 -191400 -67869 24057 -24854 -114391 63210 171025 -8396
12546 -119520 208937 41050 80853 111961 -17859 -109854 -19204 165950 -110097 106567 -251618
12534 235521 5079 -92367 210580 66332 -27392 -104300 314932 264314 -173194 236088 185394
12523 185394 329623 167738 -42001 335267 -106210 125659 371771 25765 70828 -176192
12512 -136832 188366 221813 -88938 56903 -134272 96522 -100766 95261 -34291 67636 -187796
12500 -104670 36606 122208 -99175 189262 74954 122347 229079 -297585 64546 89802 9462
12488a09600b9546k4219A02404N1965G4935K21440a72003P8561c4091j09298g810
12476a69437h0447A06421K32205a11601e631k45294b9702q8529k11512L4923l5425
12465c30245a45498B88304m4596i4386j79110B20136a19645H1710a37767k2230
12455a59997H6682J2853i670D25745F4193D80J27097E2543a96361H3877P7139
12444A61016j6181F620J7952i0940E23863B10325a18294B50300q5604J38134a68325
12432a08062j40518A86061c71168c9937B03952K41549a2005k6988a6964P247G6437
12420A94374B1860a60192B3712C754a93521F5667J8860b89895p1010e8813l7255
12409i6068B32312j01260O2389D3762b7149A60276M1362E0243k4096O5809l168
$$ plain form
12488 -109600 -29546 -53765 102404 154369 74935 296375 -172003 -93442 -34091 -143389 -7810
12476 -169437 -80447 106421 338626 -111601 -5631 -250925 -29702 -118231 -329743 -294820 -330245
12465 -330245 -145498 288304 243708 -94386 -273496 220136 -119645 81710 -137767 -159997
12455 -159997 86682 99535 -9670 425745 64193 480 127577 52543 -196361 83877 161016
12444 161016 144835 6620 24572 -90940 523863 210325 -118294 250300 164696 302830 -168325
12432 -108062 -248580 186061 -371168 -39937 203952 445501 -12005 -38993 -16964 -9717 76437
12420 194374 21860 -160192 23712 3754 -193521 65667 84527 -289895 -360905 -58813 -96068
12409 -96068 232312 131052 193441 43762 -27149 160276 201638 50243 26147 91956 88788
12398H8788l6710a80169f0576k54619B66682a52946q433d6520C13183b47999D3348
12386C34812J11084b85548A02894g2539m5414D4975M6654c9288j27957D03402
12375A45114L2926k3702a58740A26388a95390A32903e2814H0544Q7391b40911
12364a569G4191a1182B16196A0867K1985Q8834g1549a3224k4572D9262B173a7755
12351D8643k4037c62035H252K27845k3588b20039A21638c92776B57371L83529
12341F40900H5918a64242k6159A5829a22696J0671A7052f0169A5563h9766A04488
12329B36425k7139h3273D4140j8284a49891G1389C2488J58902k6357k9718a62718
12317A82505l4987d2790l20962G6196J28467F9895J4508b42547B6310R8902m5840
$$ plain form
12398 88788 52078 -180169 -60576 -315195 266682 -152946 -161379 -46520 313183 -247999 43348
12386 334812 445896 -285548 102894 -72539 -117953 44975 91629 -39288 -167245 403402
12375 145114 178040 154338 -158740 126388 -195390 132903 -52814 80544 167935 -240911
12364 -1569 74191 -11182 216196 10867 32852 121686 -71549 -13224 -37796 49262 2173 -17755
12351 48643 24606 -362035 8252 236097 212509 -220039 121638 -392776 257371 640900
12341 640900 85918 -164242 -190401 15829 -122696 -112025 17052 -60169 15563 -89766 104488
12329 236425 209286 -83273 44140 25856 -149891 71389 32488 191390 165033 135315 -162718
12317 182505 147518 -42790 -363752 76196 204663 69895 84403 -242547 26310 125212 79372
12306G9372b80962N6809A1798i3343J0552L4720I5768C6064b31965a01641k17816
12295c19457A72257b71240H4891J19719a84436A22168a47682A81752O2693a82617
12284B58492e3862B84941F216b44328c9985C40024A35584N7993p2584K4247P9242
12273B24482o9297D4843J57282L4799j15976b11635R2699C36843A36116b7480
12262C30402a80373B71680n2089J02807p6203a994o4438A17564a02214B54150
12251C02074l4031m1205a65380B45261G5593J21756J72114b1800G786f775j40112
12240a46887B91555i4359A55354a48965E2730M13084H1227L508J315R0296J28215
12229C04561K4499O5408r4232J41421F9743J51360J66706I2377P6007K89070l8997
$$ plain form
12306 79372 -280962 -224153 11798 -93343 -82791 -48071 95768 36064 -231965 -101641 -319457
12295 -319457 172257 -271240 84891 204610 -184436 122168 -147682 181752 244445 -182617
12284 258492 -53862 284941 6216 -244328 -39985 340024 135584 193577 120993 145240 224482
12273 224482 155185 44843 202125 236924 120948 -211635 -118936 336843 136116 -27480
12262 330402 -180373 271680 219591 322398 246195 -1994 -66432 117564 -102214 254150
12251 302074 268043 226838 -165380 245261 75593 197349 369463 -21800 7786 -6775 -146887
12240 -146887 291555 -94359 155354 -148965 52730 465814 81227 84735 86050 176346 304561
12229 304561 329060 394468 300236 441657 69743 221103 387809 92377 168384 457454 418457
12218D18457C7710c01108C46520a24765B01898F7799N8791C1734J25618h540G9076
12206b07057A48789H911J54134K3422H1770O0912O1925B3617P278a46496B66607
12194h4738A26722J0544J40893a561D85326b9337A71796a30338A84176b0248A9767
12182I5481D2060f8634F2549K50699D7471L18459f9307n3106D11279B03603A0166
12170b3099E5082K05320J86446B09528a00190j0240f682j39498F0473a36360B02300
12158G9160O7172J18867B3088J77295Q7363A0050d04655d5009D1582J83728J55198
12147C80508d8835B62085f1763L230F0638a79576b7328G8314h5299A00345g8835
12135b62661P3207n8294B44690Q7930h1736d463m2742j14262A52737b4035A12635
$$ plain form
12218 418457 37710 -301108 346520 -124765 201898 67799 126590 31734 157352 -8540 79076
12206 -207057 148789 8911 163045 186467 81770 142682 204607 23617 30895 -146496 266607
12194 -84738 126722 137266 278159 -1561 485326 -29337 171796 -130338 184176 -20248 19767
12182 95481 42060 -68634 62549 313248 47471 365930 -69307 -122413 411279 203603 10166
12170 -23099 55082 260402 446848 209528 -100190 -110430 -6682 -146180 60473 -136360 202300
12158 79160 146332 265199 23088 200383 287746 10050 -404655 -45009 41582 225310 380508
12147 380508 -48835 262085 -61763 -58533 60638 -179576 -27328 78314 -85299 100345 -78835
12135 -262661 -189454 -247748 244690 332620 -81736 -4463 -47205 -161467 152737 -24035 112635
12123B67312A6366i3133j49714f5766B44964J44943a85576E7913a14905C12736
12112a81921r6042J35071E028a90019j07402h4661F1579J21748a92685N8040C2465
12100B909e2023D2800G873e9089B77611a17785N5046k4259I581L06384b91891
12088B42934g4604l5389j60858F1772k2189Q5467e6417j77240B04309a06443B73066
12076B07621o7604d7978F4309h9233C07925n7321l1133k5874o2127l9696J35287
12065B27061O50927M93237n93216l59894r6733J5790r8871e4532r3253d2654a8370
12053d6652k51149e4107l5753l9799j0404O9260a4j3918j68999g9674k4051M6554
12041e7171r6422A62947E9859i2120j97662d3289B49541P8622f6974n1385a1967
$$ plain form
12123 267312 16366 -93133 -242847 -65766 244964 389907 -185576 57913 -114905 312736
12112 -181921 -277963 -142892 5028 -190019 -297421 -84661 61579 183327 -192685 -134645 32465
12100 2909 -52023 42800 7873 -59089 277611 -117785 -62739 -86998 9581 315965 -291891
12088 242934 -74604 -109993 -270851 61772 39583 125050 -56417 -233657 204309 -106443 273066
12076 207621 140017 -47978 64309 -89233 307925 250604 219471 193597 131470 91774 227061
12065 227061 877988 1371225 778009 418115 321382 337172 238301 -54532 -147785 -42654 -18370
12053 -46652 -297801 -54107 -89860 -129659 -140063 -70803 -14 -13932 -182931 -79674 -103725 -57171
12041 -57171 -153593 162947 59859 -92120 -289782 -43289 249541 328163 -66974 -118359 -11967
12029A12827E700N1638h8187B72589b5007B4753g5553L7585C03835a16319k8199
12018a44518C9155a48071H8978m0956J5605K9236J88005k3383p9128a40746B28743
12006i5420p9890j17342E6624a75015h0398C07418c8240H9951g2017F333a15046
11994a77677A19727f8001p1983j34016I8551J32641C5514K06a38364C17564a09514
11982a05603c9748k7927j1875I5030b27867e9628A02684c7430k34131f1421A976
11970f239A41063b47528P4933g6632j46215b5077k35419H1580f6159j6370K6048
11959e6481E1929R1043J82655a40039k23292A128J29904A5714J44335a89006Q6833
11948a02173A91754G3108g2264b4475n6213b8630C3551h11A55295B6047b79382
$$ plain form
12029 112827 5700 57338 -88187 272589 -25007 24753 -75553 -37968 303835 -116319 -144518
12018 -144518 39155 -148071 88978 48022 63627 92863 280868 257485 178357 -140746 228743
12006 -95420 -175310 -292652 56624 -175015 -80398 307418 -38240 89951 -72017 6333 -115046
11994 -177677 119727 -68001 -139984 -274000 98551 231192 35514 35720 -138364 317564 -109514
11982 -105603 -39748 -67675 -79550 95030 -227867 -59628 102684 -37430 -271561 -61421 1976
11970 -6239 141063 -247528 -172595 -76632 -222847 -25077 -260496 81580 -66159 -82529 -56481
11959 -56481 51929 142972 325627 -140039 -363331 1128 131032 15714 160049 -189006 -102173
11948 -102173 191754 73108 -72264 -24475 -80688 -28630 33551 -811 155295 26047 -279382
11936D25174b10877C2015R6138C4254B5a71487B18945B0635i439I1272i4842A7843
11923A47402b025k20474o0011d7500j3334C06353f7546r3752l4905G5737b48709
11911B52044A04308J00251b09847j04910A51004b43119C18962b37716L7345J2426
11901a87945i3406k32590B8590a3384j32387A06424J43786f6689K8574A12433
11890B55537A933R7968B5521a13498k36730J63060M7277H362a80206B3575K39983
11879B63558H1753b27090j53491a03373A89992b03382k73185a02850A46826D0713
11868A9371K14586J02481a58538q896p4579g0034A22641L0391a7319j17840b7024
11856a48465j4965N8538G0847N4285b29320B77735b15119A23553a74569b9294
$$ plain form
11936 425174 -210877 32015 128153 34254 25 -171487 218945 20635 -9439 91272 -94842 17843
11923 147402 -2025 -222499 -282510 -47500 -60834 306353 -67546 -161298 -196203 75737 -248709
11911 252044 104308 204559 -209847 -314757 151004 -243119 318962 -237716 -200371 -187945
11901 -187945 -93406 -325996 28590 -13384 -145771 106424 250210 -66689 -38115 112433
11890 255537 1933 99901 25521 -113498 -350228 -187168 -139891 8362 -180206 23575 263558
11879 263558 81753 -227090 -380581 -103373 189992 -203382 -476567 -102850 146826 40713
11868 19371 233957 336438 -158538 -167434 -242013 -70034 122641 153032 -17319 -135159 -27024
11856 -148465 -163430 -104892 70847 125132 -229320 277735 -215119 123553 -174569 -29294
11845A076K28530F70L55164D1929e4490k71901J3181R0138L9296f7893K0310k89258
11833c36841g9420H7043b50521D9437A3429e69338g5378k87213A02567n002a48494
11821A09643A5205R2758O9635a1339B7097b78446A25694J29782L7161i6398G7856
11809C5296b16385Q0564L1715A00775j359m0996a57777E6215a16296B0044R3115
11798A13159a82054A16685C087N1305e1078r0076c0023B2774N31J20609b18906
11786A84611a68289M8362b2590C5110a00649A67580E9349a97299G5265a33166
11775a27092A08567a3131k1507k78288B19471H0154c4144j65200g5318A85125
11764b9440q1672r4991B6348J44189G4424g0820L1806j59168D9379E503c15533
$$ plain form
11845 1076 229606 670 355834 41929 -54490 -326391 -313210 -223072 -183776 -67893 -47583 -336841
11833 -336841 -79420 87043 -250521 49437 13429 -569338 -75378 -362591 102567 97565 -148494
11821 109643 15205 107963 177598 -11339 27097 -278446 125694 255476 292637 -96398 77856
11809 35296 -216385 -135821 -104106 100775 99416 58420 -157777 56215 -116296 20044 113159
11798 113159 -182054 116685 3087 54392 -51078 -141154 -30023 22774 23305 143914 -218906
11786 184611 -168289 -119927 -22590 35110 -100649 167580 59349 -197299 75265 -133166
11775 -127092 108567 -13131 -34638 -312926 219471 80154 -34144 -199344 -75318 185125
11764 -29440 -111112 -206103 26348 170537 74424 -70820 -39014 -198182 49379 5503 -315533
11752A06001J49690a68896B22683o0439b20231E142A62a35977A66702D4310J17882
11741A62192B5568R9112a006C70371j65290g8655j9065d2926o4468n0533O5611
11730i2316F0484b020m0079k0264k61940b4479j15518l7918I1959K39059H1920
11718b54321e5450E0880c12895F3786j8678J49136a01501E5585a08067J3054B8338
11706b86210a6212A03564a63240F6250K90132b98990J46245R408L8364A32568
11695C09552i289I0824Q3766M3829C2693b65654e6558B5580K04355b78466A83427
11683B7037M7105g8710G7878f3017A44705b85389a35361N7533B13061F7891a5274
11671a96431B15732j01734b23329c7208D7820M8198K26538A47002R7386m9084
$$ plain form
11752 106001 255691 -168896 222683 162244 -220231 5142 162 -135977 166702 44310 162192
11741 162192 25568 124680 -1006 370371 205081 -78655 -97720 -42926 -107394 -157927 -92316
11730 -92316 60484 -2020 -42099 -62363 -324303 -24479 -139997 -177915 91959 331018 81920
11718 -254321 -55450 50880 -312895 63786 45108 194244 -101501 55585 -108067 -95013 28338
11706 -286210 -16212 103564 -163240 66250 356382 -298990 -152745 -143337 -104973 132568
11695 309552 -9289 90824 174590 218419 32693 -265654 -56558 25580 229935 -278466 183427
11683 27037 74142 -78710 77878 -63017 144705 -285389 -135361 -77828 213061 67891 -15274
11671 -196431 215732 113998 -223329 -37208 47820 96018 322556 147002 244388 195304
11661A95304e1115a0809H2171l2336e0182l0536D8653b9128j47262B63389b4394
11649F6488b03416I6493a8797j72184h817k451j00530L7004a1249B17509b89728
11637A06671R4393E0515d0775l28825A27855J65934a36740n9171B69996M6447
11627C16443b30137D9020e8356l1145A68826F6728h3759j81347b1704k3496k0031
11616f5231k94984a42274C35264F1082Q1057m0473a66165P8668B06158a12972
11605I4102K08365a04941K7381a5236E6276J22333d149C6504L88544b50403a6699
11593F3531B4015h0213A93485B5355K03547p5329J14625a1645C49101H711K0435
11582B9146P2065c76710a0511D59883q9951a9120A45937N0484D369J15500J40537
$$ plain form
11661 195304 -51115 -10809 82171 49835 -50182 -80718 48653 -29128 -176390 263389 -24394
11649 66488 -203416 96493 -18797 -190981 -8817 -11268 -111798 -74794 -11249 217509 -289728
11637 106671 201064 50515 -40775 -369600 127855 293789 -136740 -195911 269996 316443
11627 316443 -230137 49020 -58356 -89501 168826 66728 -83759 -265106 -21704 -45200 -65231
11616 -65231 -360215 -142274 335264 61082 142139 101666 -166165 -87497 206158 -112972
11605 94102 302467 -104941 -77560 -15236 56276 178609 -4149 36504 425048 -250403 -16699
11593 63531 24015 -80213 193485 25355 228902 153573 268198 -11645 349101 8711 29146
11582 29146 101211 -376710 -10511 459883 369932 -19120 145937 196421 4369 119869 260406
11571B60406j1685H2780j2773c4338C16070a54049B4835J47953c1203I4104L97725
11560D91829A5815f0904j5853j42936M4754e7991P483C11078G1682i1432B60497
11548E9424J01996i9104B17072L5028j14070m2885J2976k1924J29044a8164C35258
11536C55983j67995p8829P4825J048K5436J01458j35884K35374c1143A77041Q6940
11525B63981a15956o993B8026K03694o7055e84r6615A53483R9042a51675L4170
11514a17505A27089e1730j1594r1582C30745a22404E4408K8604J07540D0625K23121
11503B63746G1861J62103a41873A9818J4718M1609J20866n772q367a17179C6618
11491D9733A6357L23721F3165M7125M163b36809C85483j81913K31584k05147H4674
$$ plain form
11571 260406 248721 82780 70007 -34338 316070 -154049 24835 172788 -31203 94104 491829
11560 491829 15815 -60904 -76757 -219693 -174939 -57991 -50508 311078 71682 -91432 260497
11548 59424 161420 -99104 217072 252100 138030 95145 108121 86197 215241 -18164 335258
11536 355983 187988 109159 183984 185032 210468 311926 176042 411416 -31143 177041 263981
11525 263981 -115956 -122949 28026 231720 164665 -584 -97199 153483 252525 -151675 -117505
11514 -117505 127089 -51730 -63324 -154906 330745 -122404 54408 83012 190552 40625 263746
11503 263746 71861 233964 -141873 19818 34536 76145 197011 191239 182872 -117179 36618
11491 49733 16357 340078 63165 110290 114453 -236809 385483 203570 435154 230007 84674
11479A69771J49102G029g7764j37276R6897B10444c5098F6325B1352O722M27367
11468D55441a18774l1228o7095A41896b641B76524j07047c60191A62595a94455
11457d3135A46450L32184k02372B6499b4212o1762B18246N2430h5214E6930K6518
11446H3448P0543L2574q5J23876A50145J60251a57945j9966N6543H0458M9742
11435A30200n1749L962M4265K5841f7443A34469o1058a80081A82550H6844b23394
11423b26993A84471f3637j31984N9174c1507n2643B6356a01838B50250a24326
11412a0499A82504h1392b7349A10797F746M66936d3209A66531a68091F999b68358
11400i8162C2153a93589B85727B888J04341L6013b58880A4661d1645C08280b78285
$$ plain form
11479 169771 318873 7029 -77764 -215040 -118143 210444 -35098 66325 21352 28074 455441
11468 455441 -118774 -150002 -217097 141896 -2641 276524 169477 -360191 162595 -194455
11457 -43135 146450 478634 276262 26499 -24212 -85974 218246 270676 -85214 56930 83448
11446 83448 153991 186565 186480 310356 150145 310396 -157945 -177911 -121368 80458 130200
11435 130200 78451 82413 126678 152519 -67443 134469 73411 -180081 182550 86844 -223394
11423 -226993 184471 -63637 -195621 -136447 -31507 -84150 26356 -101838 250250 -124326
11412 -10499 182504 -81392 -27349 110797 6746 473682 -43209 166531 -168091 6999 -268358
11400 -98162 32153 -193589 285727 2888 107229 143242 -258880 14661 -41645 308280 -278285
11388A11875k5025d2334A01161f930D4888a77354C38651n2792g5077a5349k07
11377a5556o1232A59453J2072b51122D23981d7738j88419K1110f5115E0596K14923
11366B65519F7943a86714A33804a87637F655j224J94509a44423A47696b7001k3496
11355e0497j02988G3919a85414A9724N9162L8650Q105c8588m1002B58163F5119
11343a59677E6205K70146a045A91229E6754J02824a14349C283c7453A87927a65019
11331a37449A04474O3133c6951A00041a0657k53243A2721K43604A05780a17025
11320C09143b31279E343L0561J96853a34526B0617d3355B7182d3659A17328D9632
11308h0843G5789L3385a89850l0798i1267j27238A30568a7790k97341R4873G0651
$$ plain form
11388 111875 86850 -42334 101161 -6930 44888 -177354 338651 285859 -75077 -15349 -15556
11377 -15556 -76788 159453 171525 -251122 423981 -47738 -236157 -215047 -65115 50596 265519
11366 265519 67943 -186714 133804 -187637 6655 5431 199940 -144423 147696 -27001 -50497
11355 -50497 -153485 73919 -185414 19724 78886 117536 125641 -38588 -79590 258163 65119
11343 -159677 56205 326351 -1045 191229 56754 159578 -114349 3283 -37453 187927 -165019
11331 -137449 104474 167607 -36951 100041 -10657 -263900 12721 256325 105780 -117025
11320 309143 -231279 5343 35904 232757 -134526 20617 -43355 27182 -43659 117328 49632
11308 -80843 75789 109174 -189850 -220648 -91267 -218505 130568 -17790 -315131 -220258 70651
11296E2197K674a29588m4943q6176H7939a23464J3621F9392b18196h0352k30652
11285c11004j07950B39154m5762o5886E9725b06491m4954C7034g9232b8232l3984
11274f2216l62693F0259K90318a13536n5617J9304J108R580B41747D0706J14703
11263A55409P3584p5468J8017h8346k56006A71316b60753B05287a36555j63236
11253b99791C07857d5432l1269b6399j59787O9621j40699J10185N2559A21781
11242b0912B83152f4833j65709J08737L3259A18610r877a93432L9970H7488b45144
11230H8390k8593g0204A26407Q4452a5281j19291m3504r62B78681r6041a40122
11218d46466h0225I8381f0803a3591j81699A49532A6746K5379F540e1211B80272
$$ plain form
11296 52197 54871 -129588 -174531 -260707 87939 -123464 -109843 69392 -218196 -80352 -311004
11285 -311004 -418954 239154 193392 127506 59725 -206491 -251445 37034 -79232 -28232 -62216
11274 -62216 -424909 60259 350577 -113536 -169153 -149849 -148741 -139161 241747 40706 155409
11263 155409 228993 153525 171542 -88346 -344352 171316 -260753 205287 -136555 -299791
11253 -299791 307857 -45432 -76701 -26399 -186186 -116565 -257264 -147079 -94520 121781
11242 -20912 283152 -64833 -230542 -121805 -88546 118610 108733 -193432 -153462 87488 -245144
11230 88390 59797 -70204 126407 210859 -15281 -134572 -178076 -179038 278681 182640 -140122
11218 -446466 -80225 98381 -60803 -13591 -195290 149532 16746 42125 6540 -51211 280272
11206c48575k61019h1394L0803k32351N2329M6081J7282C7557M2730C8246N0649
11195H8895O8211A9177K9267j510a05766m6329k10449j2138a8636k06252Q0633
11184a44255A80423i5585L8940C0241d5873H137J45700g2225o5165A54001b19575
11172A98332a29862j77542d3822F4519A2256Q2946C2356a5659l3542A697K20990
11161B22687I0627a10745B0698L4536f8587C9497b55613h3841m7413a2179j28245
11150a40424c6103o9346D5186R640J23782a21366j96070h1504A45282a43632A51589
11138D1322j3771b4576k4542D3468g8020A56482E6918J69026a07555B01033a0634
11126B205J86267b64269A88543F3979K9556k978L8754C5842h8726E6322K88215
$$ plain form
11206 -348575 -609594 -81394 -50591 -282942 -230613 -184532 -167250 37557 80287 38246 88895
11195 88895 157106 19177 48444 46934 -105766 -152095 -362544 -374682 -18636 -224888 -144255
11184 -144255 180423 -95585 -56645 30241 -45873 8137 153837 -72225 -137390 154001 -219575
11172 198332 -129862 -307404 -43822 64519 12256 95202 32356 -15659 -49201 1697 222687
11161 222687 90627 -110745 20698 55234 -68587 39497 -255613 -83841 -131254 -12179 -140424
11150 -140424 -36103 -105449 45186 54826 178608 -121366 -317436 -81504 145282 -143632 151589
11138 41322 27551 -24576 -49118 43468 -78020 156482 56918 225944 -107555 201033 -10634
11126 2205 188472 -264269 188543 63979 93535 90557 129311 35842 -88726 56322 344537
11115C44537a47786p8333C10194G4531J50799p6519a38234A48049i2062b6615
11104a41287B6045N8193L82683A92580R5503j38060J5259J34603J72750G9599
11093A61011k0408J487J07156a95727B39436j16771c9053C1651K28759a11951
11082C82748j67550K8270J29222A68182K20396Q154K2606o8217A74737G5655L83672
11071D59327j00440j18149J40182K6155N0952J4103K00379B94998K99524k54655
11061C39867L11804j95253N4846L08412k41945R3179j10347K55510k090l33885
11051D80098L19820l6705j55677J03349l48734O05731l05465R7640j19221j69801
11041D71035J63302j66012N31403j72488L0757J7766l85165K84363k92094p9854
$$ plain form
11115 344537 -147786 -226119 310194 74531 225330 148811 -138234 148049 -92062 -26615
11104 -141287 26045 84238 466921 192580 288083 150023 165282 299885 472635 79599
11093 161011 140603 142090 249246 -195727 239436 122665 -39053 31651 260410 -111951
11082 382748 215198 243468 372690 168182 388578 396732 419338 351121 174737 75655 459327
11071 459327 358887 240738 380920 407075 458027 472130 672509 294998 594522 339867
11061 339867 651671 456418 511264 819676 577731 670910 560563 816073 813983 480098
11051 480098 799918 763213 607536 710885 362151 967882 662417 760057 640836 471035
11041 471035 634337 468325 999728 827240 857997 875763 490598 774961 482867 403013
11031D03013L5751J83810J42017r6735p8809N0451L41542m86791J25530l08495
11021C11284Q1807J21824K33866K51612k07839J58489l21499r5562m1328J01741
11011E94395j64284N0355K8418J07205j98571J87928L1934R729Q968j27662K61518
11000G89933j56044M11319l07454j29113l4900O5993K2296J40241k79495O5590
10990E88366L01535l23071N14805l20300K23364J31426L7069L1370p8843J65303
10980A271024o2469Q1650M77820n4160K38039M8327L76603K77796j5645l57303
10970B281682L53340k47763l44615k71421k93197K44373l41788n1012O2711N05283
10960A897593l08926m41562o0407J79977j01304K80615m90262j46001K04674l544
$$ plain form
11031 403013 438764 622574 764591 667856 589047 639498 981040 494249 619779 311284
11021 311284 393091 514915 748781 1000393 792554 951043 629544 533982 492654 594395
11011 594395 430111 480466 508884 616089 417518 605446 637380 647109 656077 528415 789933
11000 789933 633889 1045208 737754 608641 573741 639734 662030 802271 522776 588366
10990 588366 889901 566830 1081635 761335 984699 1116125 1153194 1184564 1105721 1271024
10980 1271024 1208555 1290205 1768025 1713865 1951904 2000231 2376834 2654630 2638985 2281682
10970 2281682 2635022 2387259 2042644 1771223 1478026 1722399 1380611 1329599 1392310 1897593
10960 1897593 1588667 1147105 1086698 1266675 1165371 1445986 955724 809723 1014397 1010853
10950A010853D33633P3916j24215p8061K11740A18377P2406J68798A76908n9094
10940A17814a1520j78627B37611E4136h8065C0204L62593A37238A6510Q4707J07649
10929B08866c5768A30694a84952A4470O3230Q460A664L62470F4967J09637o9796
10918A04808e2371A59330f4927C5851E117a17944C1208O4232J07264a73239e609
10906d3990C92044a27405B02265e0311k72130A75091a16394A89212h9782k6062
10896a15844b6851E7197a00837A63882L9455b00348G1639c3735B23389n0595K76714
10885D49508d875G6548A8225a16310A74965A4509J8968d91650B5603a55818f8505
10873d3593j04182j24170R5499B1493a06564A36696a16632j95988R0311e0579
$$ plain form
10950 1010853 433633 507549 383334 305273 517013 118377 190783 359581 176908 117814
10940 117814 -11520 -190147 237611 54136 -88065 30204 392797 137238 16510 101217 208866
10929 208866 -35768 130694 -184952 14470 77700 86160 1664 364134 64967 174604 104808
10918 104808 -52371 159330 -64927 35851 5117 -117944 31208 95440 202704 -173239 -5609
10906 -43990 392044 -127405 202265 -50311 -322441 175091 -116394 189212 -89782 -115844
10896 -115844 -26851 57197 -100837 163882 203337 -200348 71639 -33735 223389 172794 449508
10885 449508 -4875 76548 18225 -116310 174965 14509 33477 -491650 25603 -155818 -68505
10873 -43593 -147775 -271945 -176446 21493 -106564 136696 -116632 -312620 -222309 -50579
10862F5019e0956J5326A20a44026H0503A5278a05440B71230c8893j08926p3786
10851b21605N0883e9155A94473g6884C4400h4075j03892O5877K2895A16664J15107
10840B31771e4776A77802a60087B03523b34229M095H6354a57005A22136L3025
10830A55161J5030j2210E1743L56335g3746H7875J65825o4103h6023h136B32168
10818A1069a22325j03619e6955j57091A36350b0568B82386A4948h1962j54949
10808b36911K315A32896b10110C23171L0172a471E8753e4367H3694b96765A30457
10796B88467I0685h7874G8400g9077H4839L26881b60538F23J57704l2635a90739
10784A28544e7707A57026c03338a28520H4653g2664k19634a10786A23952q387
$$ plain form
10862 65019 -50956 -35630 120 -144026 80503 15278 -105440 271230 -38893 -147819 -221605
10851 -221605 -170722 -59155 194473 -76884 34400 -84075 -187967 -122090 -99195 116664 231771
10840 231771 -54776 177802 -160087 203523 -234229 -230134 86354 -157005 122136 155161
10830 155161 170191 157981 51743 408078 -73746 87875 253700 189597 -86023 -8136 232168
10818 11069 -122325 -225944 -56955 -214046 136350 -20568 282386 14948 -81962 -236911
10808 -236911 -234596 132896 -210110 323171 353343 -1471 58753 -54367 83694 -296765 130457
10796 288467 90685 -87874 78400 -79077 84839 411720 -260538 623 158327 125692 -190739
10784 128544 -57707 157026 -303338 -128520 84653 -72664 -292298 -110786 123952 115565
10774A15565g8431j00955K0006P3058k48935I6153d0975J6564l41823h2477B9035
10762a13112D9582b1855A4169b17470k3015B67047f6084j56205o200A5861J22607
10751A38468b54890B51962a23933r3208I7427a97717A25113n6456d3934p8305
10741a22239C06522C6447f3017D4851f5160j26962A49048k1879a78831m6381o7646
10730b92858A46874a01260c7507l3825D6410f8827A01009J78703c4319j73023
10720b07342A7228J25846d2431A73775m5884m6490a5417A74828e9766k19656A64073
10708a30322l23922J50907i9652F1941i3865n0438f5639B00834a68988k2569N9753
10697a31804j13817g2970C4150b02567r8585B53365a87160b4025n9093d144D28335
$$ plain form
10774 115565 -78431 -179386 -159380 -86322 -335257 96153 -40975 -24411 -366234 -82477 29035
10762 -113112 49582 -21855 14169 -217470 -240485 267047 -66084 -222289 -228489 15861 138468
10751 138468 -254890 251962 -123933 -217141 97427 -197717 125113 68657 -43934 -122239
10741 -122239 306522 36447 -63017 44851 -65160 -192122 149048 127169 -178831 -225212 -292858
10730 -292858 146874 -101260 -37507 -71332 46410 -68827 101009 279712 -34319 -207342
10720 -207342 17228 143074 -42431 173775 127891 81401 -15417 174828 -59766 -279422 164073
10708 -130322 -454244 -303337 -99652 61941 -93865 -144303 -65639 200834 -168988 -191557 -131804
10697 -131804 -245621 -72970 34150 -202567 -301152 253365 -187160 -24025 -83118 -4144 428335
10685A15651f5293B9313Q2206c123j74104D8536b17563L9556d5979o8766A79281
10673f9376l4762B06791F7048M5739a91302A565K4801a9298B07968a9698B3597
10661a60383N1433e1925B4796R89a90920Q1299L6717p2892A5554Q4820i5325A71992
10648A25523a78548K3946J1979f0871A57495a1970I6520k0135b88697O8350D3238
10636A35797h036A90254a23762k36409B91046a11476p8027k7536g8993j72263
10626b51256j450a03622L2667j81961j16226a38357B16763c94272A44567b15869
10615A26838K04683a91137B72952b77794e9386B84253a94532A7861a42506K9429
10605a13077E8157a44152g342k86871C7203J31957a52111j393q7250a2783E2939
$$ plain form
10685 115651 -65293 29313 111519 -3123 -177227 48536 -217563 -178007 -45979 -114745 179281
10673 -69376 -104138 206791 67048 112787 -191302 1565 26366 -19298 207968 -19698 23597
10661 -160383 -108950 -51925 24796 25785 -190920 -109621 -72904 -145796 15554 100374 -95325 171992
10648 125523 -178548 -154602 -142623 -60871 157495 -11970 96520 76385 -288697 -220347 43238
10636 135797 -8036 190254 -123762 -360171 291046 -111476 -189503 -217039 -78993 -251256
10626 -251256 -252706 -103622 -70955 -252916 -369142 -138357 216763 -394272 144567 -215869
10615 126838 331521 -191137 272952 -277794 -59386 284253 -194532 17861 -142506 -113077
10605 -113077 58157 -144152 -7342 -294213 37203 169160 -152111 -153504 -240754 -12783 52939
10593C06406b57118p0623B07584b01189f9689k2965A83244a8545l1648G5069i6815
10581B3756a09903K8292k37234b585A07209J96764b48212j15118a48721j59227
10571c07948M3026R1775a8929D9105K6614d3530A6155K78941C4781J39990L18369
10560D93140G5347g2538A18848d08733K04113O3422A04084K1057a03060A97798
10549f2335a4852o9313j03147L1485I4185d9946m8678o415M1979n3403k48431
10538c64894a06823H8262r512M9910C5103K8229e7187j48918h1007C41427a37984
10526d04482a3809k14953M48I8558a09057j62676C5705c15660R4965b2090l80917
10515d03007A0163P105b2224A04063J09675g1460j94044L7969g2162j5900f473
$$ plain form
10593 306406 -257118 -327741 207584 -201189 -69689 -92654 183244 -18545 -50193 75069 -96815
10581 23756 -109903 -81611 -318845 -2585 107209 303973 -248212 -363330 -148721 -307948
10571 -307948 -264922 -173147 -18929 49105 75719 -43530 16155 295096 34781 174771 493140
10560 493140 75347 -72538 118848 -408733 -204620 -141198 104084 125141 -103060 197798
10549 -62335 -14852 -84165 -187312 -155827 94185 -49946 -98624 -105039 -63060 -116463 -364894
10538 -364894 -106823 88262 78750 128660 35103 63332 -57187 -206105 -81007 341427 -137984
10526 -404482 -13809 -228762 -228314 98558 -109057 -271733 35705 -315660 -220695 -22090 -403007
10515 -403007 10163 17268 -22224 104063 213738 -71460 -265504 -227535 -72162 -88062 -6473
10503H4389c10B19491Q0611e1833j15276B24759q2585j6882J11444b28972h8365
10491b25683A20860N9193c8251A71937C2126K1097K82053A27974J5952L19680
10481D63606Q9234C7250J40618k8901b2314C88971E004J23851A4313a0297D6291
10469a15666n385A69230b8281F2385h2076A0844e1384k07523Q1644B88458b13576
10457b07941A44501K5749a26724c5338k38210H4922C7343D560c47814C70404j65257
10446B05147c40967B05278r3202b85614B05680f7735r5041d5947j56356i6364
10435d9319l1745I0998a9901A37049a32242C51325o3964a92031A25745b08923
10424d9586l35192A06385f4539j1392j65471B53707b31376L1818J0684A80562
$$ plain form
10503 84389 -310 219491 300102 -51833 -167109 224759 142174 125292 236736 -228972 -88365
10491 -225683 120860 180053 -38251 171937 32126 53223 335276 127974 143926 463606
10481 463606 552840 37250 177868 148967 -22314 388971 5004 128855 14313 -10297 46291
10469 -115666 -121051 169230 -28281 62385 -82076 10844 -51384 -258907 -177263 288458 -213576
10457 -207941 144501 170250 -126724 -35338 -273548 84922 37343 4560 -347814 370404 205147
10446 205147 -340967 205278 112076 -285614 205680 -67735 -162776 -45947 -202303 -96364
10435 -49319 -81064 90998 -19901 137049 -132242 351325 287361 -192031 125745 -208923
10424 -49586 -384778 106385 -64539 -75931 -241402 253707 -231376 -199558 -188874 180562
10413H5963c0207A23365a03722B43180a00188A00455e4545B3164G995a58450I4433
10401a03155D34587a43604N199l86q43A62711e5834F0408M81419A71600C217L67546
10389C70763j82527N1315r5892d6973f652o1096a4133D4409A3431L1282J47465
10378A92178N3217O2363J98997A87076K6966o2201c5082A91372J959K04488j35965
10367B61854J34280R9313P7068B28690J68541j05751M120q1473N8041A21048J52900
10356B73948H5651J26278J73316A63072J90793J78514k23173L92875C07221L56023
10346F63244k22899j23226O4345J53224b44254B7028J42884c2045B74397N2903
10336C27300j14742r7037b1134j9562C3637J87631b03675J00964B00121l7889
$$ plain form
10413 85963 -30207 123365 -103722 243180 -100188 100455 -54545 23164 7995 -158450 94433
10401 -103155 434587 -143604 -138405 -138791 -139634 162711 -55834 60408 541827 171600 3217 370763
10389 370763 188236 239551 143659 -46973 -6652 -67748 -14133 44409 13431 44713 192178
10378 192178 245395 307758 506755 187076 214042 151841 -35082 191372 193331 397819 261854
10367 261854 396134 495447 572515 228690 397231 291480 295600 214127 272168 121048 273948
10356 273948 85651 211929 385245 163072 353865 532379 309206 702081 307221 663244
10346 663244 440345 317119 381464 534688 -244254 27028 169912 -32045 274397 327300
10336 327300 212558 115521 -21134 -40696 33637 221268 -203675 -102711 200121 162232
10326A62232f9332k99605C33812J16033r5266j08788A14709n4138J2723h6541
10315A0194L51031a28432A67117a47180k053B87635G2128a2442l17154a52355
10304b08053A53130N9041l837K9783e1214r7749J8005a9508G5253K30737a36194
10292A00316M434a07237J3855I4092j855J3380l476m4491a78160d4009B85986
10280b30933j27114G1861K259a3160A82087e4161j03422A00817f9475L4359j4899
10269e0015B54148H5491K492l9570f9466B11026E6202O8996K23365m7240D7589
10257C24830p8396j9685J8706I2075i5457m7362b1578B51737k8367n2073b20850
10245G5946N813b6927A6795a77917A85199b04541A56822b8510B5737K04012B5897
$$ plain form
10326 162232 -69332 -368937 333812 449845 354579 245791 114709 60571 73294 -86541
10315 10194 361225 -128432 167117 -147180 -149233 287635 72128 -12442 -329596 -152355
10304 -208053 153130 212171 208334 238117 -51214 -148963 -130958 -19508 75253 305990 -136194
10292 100316 104750 -107237 -93382 94092 92237 105617 102141 57650 -178160 -44009 285986
10280 -230933 -358047 71861 74120 -13160 182087 -54161 -157583 100817 -69475 -35116 -50015
10269 -50015 254148 85491 87983 48413 -69466 211026 56202 125198 348563 301323 47589
10257 324830 246434 226749 245455 92075 -95457 -142819 -21578 251737 223370 171297 -220850
10245 75946 81759 -26927 16795 -177917 185199 -204541 156822 -28510 25737 229749 25897
10233D2639H384J0533K21278C3325g6655H6353h6411n5297A92612c30216J44801
10222a85415e3787A32525b05941H3186a53336A35027D0600L51646a43953F6517
10211e2369C6682P9408b10321i6207j13271Q9400j10019E0506h030l1255F860
10199C61702a51855A19121a48916H1891a74563B33939I6161f2896j21977J8926
10189a65947a0643j11371F7962c3767B00805a90488G4021a3985p2817m46412A51991
10177a10433k34007h7757c9773j39391J5932l1860l4499c0572k18162M8693R7994
10166a02047j65514j107A71530d6945A60469b17027d3896j99729L5545g487A44489
10154a73139B24089b5470F3114P0452O4098R6738b12844h8020A05783c31419a19372
$$ plain form
10233 42639 8384 18917 240195 33325 -76655 86353 -86411 -141708 192612 -330216 -185415
10222 -185415 -53787 132525 -205941 83186 -153336 135027 40600 392246 -143953 66517
10211 -52369 36682 116090 -210321 -96207 -209478 -120078 -230097 50506 -8030 -39285 6860
10199 361702 -151855 119121 -148916 81891 -174563 233939 96161 -62896 -184873 -165947
10189 -165947 -10643 -122014 67962 -33767 200805 -190488 74021 -13985 -86802 -533214 151991
10177 -110433 -344440 -87757 -39773 -179164 -163232 -195092 -229591 -30572 -248734 -200041 -102047
10166 -102047 -267561 -268668 171530 -46945 160469 -217027 -43896 -243625 -208080 -7487 144489
10154 -173139 224089 -25470 63114 133566 197664 294402 -212844 -88020 105783 -331419 -119372
10142a18589k1953c5942P257j49155Q8402E9755a66295A98072I5823D3319K0161
10131F3480c6912m9390K2308C018a10126A14730b01743D6595e6256I1996a8073
10119a1388k42772A32765b86087D9924J25900G2178a40002f2045j84728a11260
10108A89852a48683d4856k00685J16465e5441l9616j15202B62539C251c1751l5370
10097f7121H5416i6431j57579A94479a49997e9815A35125c14280I0438J35669
10087B26107c2483j63151a3899m2082F3593J54720a53167f9310I475b39249A6597
10075b6927n4990A5029a70586F6877a04497F6033G461b15067J3076j0697C83012
10063A60386d3759J4888E3117b48698c3462j15385E7070a164B20033b4905m9599
$$ plain form
10142 -118589 -140542 -35942 -28685 -177840 -89438 59755 -166295 198072 95823 43319 63480
10131 63480 -36912 -86302 -63994 3018 -110126 114730 -201743 46595 -56256 91996 -18073
10119 -11388 -254160 132765 -286087 49924 175824 72178 -140002 -62045 -246773 -111260
10108 189852 -148683 -44856 -245541 -129076 -55441 -95057 -210259 262539 3251 -31751 -67121
10097 -67121 85416 -96431 -254010 194479 -149997 -59815 135125 -314280 90438 226107
10087 226107 -32483 -195634 -13899 -55981 63593 218313 -153167 -69310 9475 -239249 16597
10075 -26927 -81917 15029 -170586 66877 -104497 66033 7461 -215067 -201991 -212688 383012
10063 160386 -43759 -28871 53117 -248698 -33462 -148847 57070 -1164 220033 -24905 -74504
10052g4504j16792A00840l8945A5555b0721r9903E2214b60318i1241n02591a12435
10040A07702c2138r5294p0464M9937m01543i7209n2249H5571a59982A95371J0779
10029B06150j8405a07786j62181e4204B140e4118p1693J4800o9184g229A88673
10017C7678K0085b90514h6291o6994B53073H5677i4963B69997A02668a53215H9488
10005C1797a6818D2484b12088B02206J5599a09836j6814A26066b07725f9842F5762
9993A45368e1049k97264J54567h2152j42580C13856a9392l17215I7615c50027
9982C864d05075a20231k15638c0364p0668F7691i8320A80666d6640I6683L317
9971A00000m6077c79802M1660R9019b1807E0099a03492j09359d6922n3449j49644
$$ plain form
10052 -74504 -191296 100840 61895 15555 -20721 -120624 52214 -260318 -91241 -593832 -112435
10040 107702 -32138 -127432 -197896 -147959 -549502 -97209 -149458 85571 -159982 195371 206150
10029 206150 187745 -107786 -269967 -54204 2140 -54118 -125811 -111011 -180195 -7229 188673
10017 37678 57763 -290514 -86291 -153285 253073 85677 -94963 269997 102668 -153215 89488
10005 31797 -16818 42484 -212088 202206 217805 -109836 -126650 126066 -207725 -69842 65762
9993 145368 -51049 -348313 -193746 -82152 -224732 313856 -19392 -336607 97615 -350027
9982 3864 -405075 -120231 -335869 -30364 -101032 67691 -98320 180666 -46640 96683 100000
9971 100000 53923 -379802 -338142 -239123 -21807 50099 -103492 -212851 -46922 -100371 -250015
9960b50015Q836k56366a58905B5092h8911j93560o9017A57211J7860a55014k4811
9949a79825e2992G1819a76393f1642A06546a74113k723O5725k18109H9895h7218
9937D4730b67238E4371A7974b97197a5378F0619B8718R7047b19193J01755j01188
9926b18626D2376Q2635j1803b95113N5735g7447o9372N9114m4174k9648O926A78969
9913b58505A4318c8628j97102A34272C8955I945b8741B62750B2006N0464b15049
9901A66839f1282o9787j59398a02089A47302Q2309c48728B48920c41491A22438
9890e923A65632a61286p0194a3723r0255I360b27859k8691B1069b27953B7817
9878A7100J57759h3788K8430G2421a08213b5437A70284a74106A29428m4050b11551
$$ plain form
9960 -250015 -241179 -497545 -158905 25092 -88911 -282471 -351488 157211 175071 -155014 -179825
9949 -179825 -52992 71819 -176393 -61642 106546 -174113 -176836 -111111 -329220 89895 -87218
9937 44730 -267238 54371 17974 -297197 -15378 60619 28718 125765 -219193 -117438 -218626
9926 -218626 42376 125011 113208 -295113 -239378 -77447 -146819 -87705 -131879 -161527 -154601 178969
9913 -258505 14318 -38628 -235730 134272 38955 9945 -28741 262750 22006 72470 -215049
9901 166839 -61282 -131069 -290467 -102089 147302 229611 -348728 248920 -341491 122438
9890 -5923 165632 -161286 -231480 -13723 -103978 9360 -227859 -256550 21069 -227953 27817
9878 17100 174859 -83788 -55358 72421 -108213 -25437 170284 -174106 129428 85378 -211551
9866a26158A64646B0892a34137F4844a42144A22405b91962A85933J24566E379
9855B1495a57343O8828a6439B63019b11827B24109d88318J86033i4530A52927
9844a8447A3000L0774a75982A84580a85699m7032B65191C3943a56841I2600Q4243
9833A76843a03562Q916d6284j16047P7077n735b6450j96684d5657A17694a66825
9821a94608j01700a08812a2263B02257O1249A01996P6200g0750l8954J849A07013
9809h4000K8243B03099b29276D6111j7067O3494g3463k52090c2990B3372a64564
9797g5249B0267J27221b2882j19943f937k49600k16917i0337A06542J28935J3306
9786B48783E2018g4030B45308G3731c58449a48709I2848J54492a22807A00081
$$ plain form
9866 -126158 164646 20892 -134137 64844 -142144 122405 -291962 185933 310499 5379
9855 21495 -157343 -88515 -16439 263019 -211827 224109 -488318 -302285 -94530 152927
9844 -18447 13000 43774 -175982 184580 -185699 -232731 265191 33943 -156841 92600 176843
9833 176843 -103562 -94646 -46284 -162331 -85254 -90989 -26450 -223134 -45657 117694 -166825
9821 -194608 -296308 -108812 -12263 202257 263506 101996 178196 -70750 -109704 -107855 107013
9809 -84000 -55757 203099 -229276 46111 29044 92538 -73463 -325553 -32990 23372 -164564
9797 -75249 20267 147488 -22882 -142825 -6937 -256537 -473454 -90337 106542 235477 248783
9786 248783 52018 -74030 245308 73731 -358449 -148709 92848 247340 -122807 100081
9775a11035N2166k89588a41857o7554l0560R3127o7835H4021J9994C5172J5506
9764E0678c09158M5491f4122l06471E4561a66009d9146H6198j2724P2891a34865
9752i6069G0799i06j68833L6188j83523E9388a64084L3400D8739a41494E9650
9740a2273B80305b7750m7693j88840h4153B05821b92516B8573b14257c1407E639
9728c30640i4759j9654k67247h9351B52579d9754G0219J00031a92681E69047c5758
9716a50341i61p8255l63946A2562a75091j4501b247j34372D57342A42696b77959
9704E2546b54260k14115k09379b3202k60667D9759B1774a97723N641j04667A59279
9692A0629a19821B66827P3126D3180a00130q6735p536j84480a7778k1581I164
$$ plain form
9775 -111035 -58869 -348457 -141857 -209411 -239971 -146844 -214679 84021 104015 35172 50678
9764 50678 -309158 -263667 -64122 -370593 54561 -166009 -49146 86198 73474 146365 -134865
9752 -96069 70799 -906 -169739 -133551 -317074 59388 -164084 -130684 48739 -141494 59650
9740 -12273 280305 -27750 -75443 -264283 -84153 205821 -292516 28573 -214257 -31407 5639
9728 -330640 -94759 -114413 -381660 -89351 252579 -49754 70219 170250 -192681 569047 -35758
9716 -150341 -961 -79216 -443162 12562 -175091 -189592 -2247 -136619 457342 142696 -277959
9704 52546 -254260 -468375 -677754 -23202 -283869 49759 21774 -197723 -192082 -296749 159279
9692 10629 -119821 266827 339953 43180 -100130 -186865 -194401 -378881 -17778 -39359 9164
9680a58675j72047h8895A12524c99263a56552N1612O785B02170J75282a71167
9669i7941A03687J12799A01188a25605A72819h1481a6297F5312h4354j11352E2060
9657b7326j28901L813C1787a12060e2519j16862P5180j43911I3316l0283a57258
9645B38616h2826a0208q4987K8710m43485A9854b68595a3841A39361c31626a21653
9633c56470g9241A80680G6748g096A87901a32326F8432a25749j42415A7313d0078
9621B39228f0842o7832K4909A38904C885K76601B7776K31790b18123C1647J98273
9610B29920C8480g5329I6400a13946n2792B61224H6856i5051n8218B8525g0927
9598a63154j27434g8477C8179b68236C0665J4212a06B50677E3297d9137A15961
$$ plain form
9680 -158675 -330722 -88895 112524 -399263 -156552 -104940 -98155 202170 377452 -171167
9669 -97941 103687 216486 101188 -125605 172819 -81481 -16297 65312 -84354 -195706 52060
9657 -27326 -156227 -152414 31787 -112060 -52519 -169381 -94201 -238112 93316 63033 -157258
9645 238616 -82826 -10208 -95195 -66485 -509970 19854 -268595 -13841 139361 -331626 -121653
9633 -356470 -79241 180680 76748 -7096 187901 -132326 68432 -125749 -268164 17313 -40078
9621 239228 -60842 -128674 -103765 138904 3885 280486 27776 259566 -218123 31647 229920
9610 229920 38480 -75329 96400 -113946 -166738 261224 86856 -95051 -153269 28525 -70927
9598 -163154 -290588 -78477 38179 -268236 30665 44877 -106 250677 53297 -49137 115961
9586a15896j44742N645D62149a45184e1202E9775k6596b76225R3751B04741d3337
9574b6662j6586F5037d1366k72584A51176F9158j4767J7229f3106C33948j29625
9563B04323G864L6802K01187c45409D5344Q5922B0004d27171E5607b12745j62991
9552c75736O0968a8788B56481E3472d4051J5346k26010H2675a15666B25876L3497
9541B59373i5382K5977p2803j73182G294J34253f0022A5321f2468G6364e7484
9529a93247O2187k92071K05592A89788a00819j52201p2662a03796K7510B428R1820
9518I4248J2830c47985a27071b0199q1117N754A98726b16066C3091a89829d2821
9506f0784k13165j66631c6755j77626E514O878P6688J09334B0409a31157J234
$$ plain form
9586 -115896 -260638 -254993 462149 -145184 -51202 59775 33179 -276225 -182474 204741 -43337
9574 -26662 -43248 65037 -41366 -313950 151176 69158 54391 71620 -63106 333948 204323
9563 204323 7864 44666 245853 -345409 45344 131266 20004 -427171 55607 -212745 -375736
9552 -375736 -314768 -18788 256481 53472 -44051 -28705 -254715 82675 -115666 225876 259373
9541 259373 -95382 -69405 -142208 -315390 7294 141547 -60022 15321 -62468 76364 -57484
9529 -193247 -131060 -423131 -217539 189788 -100819 -253020 -325682 -103796 -76286 2428 94248
9518 94248 107078 -347985 -127071 -20199 -101316 -95562 198726 -216066 33091 -189829 -42821
9506 -60784 -273949 -440580 -36755 -214381 5514 12392 89080 198414 20409 -131157 -129923
9495a29923p7388d4210k29738J00095A63565a56880g6363o140l03536C44542a61758
9483a83498I6454a74474b2419A90064b2463l88151d2113A3376K30972A21917g7435
9471a23888D5600d7621A60353A2553J26960a10454o4456B6131M1908b05570B376
9459f0789C52b43853C01499i2715C4767J8679N4573b32543r4859B39721J160q2105
9447A58776j637f388p2303A82295j0662F4297C1461i2637j8511j50839E6596c2229
9434C4091c01922e4666h878r5144j15278C06463a96285k1988l8997k32064d7815
9422b30197O7725r3357j02417A4129a97148j4968C1336a3310A42896b93310a03179
9410B0407b54500A6287M23541b55967a10926D2052a69603O2426K4424D4268N336
$$ plain form
9495 -129923 -207311 -44210 -273948 -173853 163565 -156880 -76363 -82503 -386039 344542 -161758
9483 -183498 96454 -174474 -22419 190064 -22463 -410614 -42113 13376 244348 121917 -77435
9471 -123888 45600 -47621 160353 12553 139513 -110454 -174910 26131 68039 -205570 2376
9459 -60789 352 -243853 301499 -92715 34767 53446 108019 -232543 -327402 239721 240881 158776
9447 158776 157139 -6388 -78691 182295 171633 64297 31461 -92637 -111148 -261987 56596 -32229
9434 34091 -301922 -54666 -8878 -104022 -219300 306463 -196285 -218273 -257270 -489334 -47815
9422 -230197 -162472 -255829 -358246 14129 -197148 -212116 31336 -13310 142896 -293310 -103179
9410 20407 -254500 16287 439828 -255967 -110926 42052 -169603 -107177 -82753 44268 49604
9399D9604R4007a5272o3467A24474a46294h803j32232f7211A8419a74537F3535
9387a39514A25646b16276E9300M0765a37813f2649j0292r5724B31074m9188F2993
9375c02229f2713B9373a62568j36717A32463M3857a2D3439Q0516k7752d6037B06344
9362d34949G3194J03217p7156D1333e41903B5786a05412K6614l024A08988B2073
9350A5144c38972A08151a71333d7505k5771G6361f9734j05506M5251d9059j3971
9339f3030k07649a12309n8239B65585e2184j61513A3274a28973k7345k13832J3609
9328c56541J01819c5140j22806j36281J8184A35436b4249E2122b77527Q2798e0574
9316B83033b8221j95556I7615e4886j35004K6250B1872J01673B3886a52281a3455
$$ plain form
9399 49604 143611 -15272 -78739 124474 -146294 -8803 -141035 -67211 18419 -174537 63535
9387 -139514 125646 -216276 59300 100065 -137813 -62649 -72941 -168665 231074 181886 62993
9375 -302229 -62713 29373 -162568 -299285 132463 176320 -12 43439 123955 96203 -46037 206344
9362 -434949 73194 176411 99255 41333 -541903 25786 -105412 -78798 -81822 108988 22073
9350 15144 -338972 108151 -171333 -47505 -73276 76361 -69734 -175240 -129989 -49059 -63030
9339 -63030 -270679 -112309 -170548 265585 -52184 -213697 13274 -128973 -156318 -370150 -356541
9328 -356541 -254722 -35140 -157946 -294227 -276043 135436 -24249 52122 -277527 -194729 -50574
9316 283033 -28221 -223777 97615 -54886 -189890 -163640 21872 123545 23886 -152281 -13455
9304b67909A35980O1124D201c22114B24849d09278b3266B8670b87128c6937k2236
9293e9173q7346A19173b89541H7264J56633g6115k29179J45649A77967m2889a78744
9281a61055g349E8329b9168k53818I7423d4189o7961C3058c37413J13234J01234
9270a22945G1078C2498a77648B57858i0812a7270j1782q3390k89999C4220N9229
9259I3449J4415c93785C20977a17597c6854j90614j08288a5546A12937a33753
9248a07261E8852a93077P6523J7477A23248R198j8066a1729k844A65342b43912
9236F5089K0323L4477a23753B51850m7463d90159b04835j8730o2367B9249r977
9225A9272c88411i1541H1483a29996r3382I9601J747a04955B61379E910a50174
$$ plain form
9304 -267909 135980 197104 4201 -322114 224849 -409278 -23266 28670 -287128 -36937 -59173
9293 -59173 -146519 119173 -289541 87264 243897 -76115 -305294 -159645 177967 135078 -178744
9281 -161055 -7349 58329 -29168 -282986 97423 -44189 -112150 33058 -337413 -224179 -122945
9270 -122945 71078 32498 -177648 257858 -90812 -17270 -29052 -112442 -402441 34220 93449
9259 93449 107864 -393785 320977 -117597 -36854 -227468 -335756 -15546 112937 -133753
9248 -107261 58852 -193077 -116554 -99077 123248 132446 114380 -11729 -14573 165342 -243912
9236 65089 85412 119889 -123753 251850 204387 -490159 -204835 -223565 -285932 29249 19272
9225 19272 -388411 -91541 81483 -129996 -223378 99601 101348 -104955 261379 5910 -150174
9213a51662B28032J3440g6047H3958K83060j54788f5323D4189a60313B18911a02241
9201c694j63902M5477A33122b82567A47968e844j25191O1429L1714j10573a6412
9189a33594A0892J83965a3087k86834L5081J16898D3870a18987e6752F6857a92934
9177a34298d3762n8661A71313l5238i4438B8490a4152j9071j09247L5527a2505
9165b34582M2385i5770F2633J5477a57326e6915k2296k35914g3679C3741b17049
9153D2164J76094d5879A89029B7851a97412a3524j60092A4302c4561q3252e3937
9141b05213R3652l5631F0871J23918a80572F0237e7851j89312a9816r1854f926
9129A37820N6824a12100g121j27020m2499j59025i5131j6084K0218k60854d2419
$$ plain form
9213 -151662 228032 241472 -76047 83958 367018 212230 -65323 44189 -160313 218911 -102241
9201 -3694 -167596 -122119 133122 -282567 147968 -5844 -131035 -69606 -37892 -148465 -16412
9189 -133594 10892 194857 -13087 -299921 -264840 -147942 43870 -118987 -56752 66857 -192934
9177 -134298 -43762 -102423 171313 136075 -94438 28490 -14152 -33223 -142470 -106943 -12505
9165 -234582 -192197 -95770 62633 78110 -157326 -56915 -79211 -315125 -73679 33741 -217049
9153 42164 218258 -45879 189029 27851 -197412 -13524 -173616 14302 -34561 -117813 -53937
9141 -205213 -111561 -147192 60871 184789 -180572 60237 -57851 -247163 -19816 -111670 -6926
9129 137820 194644 -112100 -7121 -134141 -176640 -335665 -95131 -111215 -90997 -351851 -42419
9117A2036L3080f0249A28870d09114J50132J04407A82868a80743B68499B7092
9106a46928B0598a47531g2622j43424k1515C2453b95672a05794L359k3805A48
9094H8418a3931j5193E2714d0904B58900B3804c71027J45410a6500j66313j3805
9083a96618k20133c2084l43632A43758C3242a45349G8127b33653j02084H2224
9072e6367j83799A05783K63653F5756b82642J32630g0310k4577j53310E6055i1416
9060d91328c2518o8012A08878g3141J3187C8605i4766a750j52499A38594a8409
9048B05957a51332E0472J8027b93491h0151A61817c31287b3643p4183A65640a64621
9036A47857h6730j47999q1546A19024J71217m9520d4846l45432A53663c00937
$$ plain form
9117 12036 45116 -60249 128870 -409114 -258982 -154575 182868 -180743 268499 27092
9106 -146928 20598 -147531 -72622 -216046 -237561 32453 -295672 -105794 -102435 -126240 148
9094 88418 -13931 -29124 52714 -40904 258900 23804 -371027 -225617 -16500 -182813 -196618
9083 -196618 -416751 -32084 -375716 143758 33242 -145349 78127 -233653 -335737 82224
9072 -56367 -240166 105783 369436 65756 -282642 -150012 -70310 -94887 -248197 56055 -91416
9060 -491328 -32518 -100530 108878 -73141 -59954 38605 -94766 -1750 -154249 138594 -18409
9048 205957 -151332 50472 68499 -293491 -80151 161817 -331287 -23643 -97826 165640 -164621
9036 147857 -86730 -234729 -316275 119024 290241 240721 -44846 -390278 153663 -300937
9025B09411e7143j69534Q0280j30962l5633C5556M084j2462B865J72652c827k35705
9013b39532a04433H64e1054G0333M2410m8672a03436n7624j13536B16330I0719
9001c4956o0583A13184k2978a6749k8420k035N069j91097a4699E9564J0745M4190
8989A14499c312r5909l67165d5801A65214g2693j0069C81195G0127e9372B5288
8977H5874b81115O3286p8268b5369F3539m41L19804a46323d9842A24336b30572
8965a25521j46183A19288c30632Q3386b5578j729a987k38931G9307c19798a14603
8953a99308A74833c44154B40751d26268E6248a38606A61646c09544a44282r2418
8943b36700r0812g7743K8431A07014b36633K1296b613j40685D7069J53988a68491
$$ plain form
9025 209411 -57143 -226677 -146397 -277359 -312992 35556 39640 27178 2865 175517 -3827 -239532
9013 -239532 -104433 864 -51054 70333 112743 64071 -103436 -161060 -274596 216330 90719
9001 -34956 -95539 113184 90206 -16749 -45169 -47204 -42135 -233232 -14699 59564 70309 114499
8989 114499 -3312 -99221 -466386 -45801 165214 -72693 -82762 381195 70127 -59372 25288
8977 85874 -281115 -217829 -296097 -25369 63539 63098 382902 -146323 -49842 124336 -230572
8965 -125521 -271704 119288 -330632 -247246 -25578 -27307 -1987 -240918 79307 -319798 -114603
8953 -199308 174833 -344154 240751 -426268 56248 -138606 161646 -309544 -144282 -236700
8943 -236700 -327512 -77743 -49312 107014 -236633 -215337 -2613 -143298 47069 201057 -168491
8931b81879c3447B3806b63891f1051j03025k7202f9007A40217O99947k15063G7724
8919A69020g9452E2233L0345K56615D2403J9464J82950n8882L3322a57477A32657
8907A61284l0411j4620d06741g4733F1171a53871j69096b6413m540r3901N5626
8896f9228M548J2202l09318e8648J8284j77799F6941J58741f4999j18092d588
8884c24242A70790f5080c385j80546H5647c07325A42386B5165a41952N5134A47651
8872H5404b0424H1826d185j7068B2604c7262a2462I0324l0500a57791B45117N8061
8860C03178n5344p7181a41449r865A02006d8808a1415l18964a03163L969I9646
$$ plain form
8931 -281879 -33447 23806 -263891 -61051 -164076 -191278 -69007 140217 840164 625101 77724
8919 169020 -79452 52233 82578 339193 42403 61867 244817 185935 219257 -157477 132657
8907 161284 130873 116253 -406741 -74733 61171 -153871 -322967 -26413 -30953 -124854 -69228
8896 -69228 -64680 -52478 -361796 -58648 -40364 -218163 66941 225682 -64999 -183091 -4588
8884 -324242 170790 -65080 -3385 -183931 85647 -307325 142386 25165 -141952 -86818 147651
8872 85404 -20424 81826 -4185 -21253 22604 -37262 -12462 90324 59824 -157791 245117 303178
8860 303178 247834 170653 -141449 -151314 102006 -48808 -11415 -330379 -103163 -99194 99646
$$ [...]
##END NTUPLES=NMR SPECTRUM
##END=
