##TITLE=NES1091_ptc150_9886786_xp99UfWG80
##JCAMPDX= 6.0         $$ Bruker NMR JCAMP-DX V2.0
##DATA TYPE= NMR SPECTRUM
##DATA CLASS= NTUPLES
##ORIGIN= BRUKER
##OWNER= Administrator
$$ 1.72 TOPSPIN		Version 2.1
$$ 2016-08-28 20:04:21.648 -0500  Administrator@X
$$ Compression mode = diff/dup
##.OBSERVE FREQUENCY= 400.02188249412
##.OBSERVE NUCLEUS= ^1H
##.ACQUISITION MODE= SIMULTANEOUS (DQD)
##.ACQUISITION SCHEME= undefined
##.AVERAGES= 64
##.DIGITISER RES= 22
##SPECTROMETER/DATA SYSTEM= spect
##.PULSE SEQUENCE= noesygpps1d.comp
##.SOLVENT NAME= COFFEE_meoh
##.SHIFT REFERENCE= INTERNAL, COFFEE_meoh, 1, 14.96035
##AUDIT TRAIL= $$ (NUMBER, WHEN, WHO, WHERE, PROCESS, VERSION, WHAT)
$$ ##TITLE= Audit trail, TOPSPIN		Version 2.1
$$ ##JCAMPDX= 5.01
$$ ##ORIGIN= Bruker BioSpin GmbH
$$ ##OWNER= Administrator
$$ $$ E:\/data/COFFEE/nmr/NES1091_ptc150_9886786_xp99UfWG80/12/pdata/1/auditp.txt
$$ ##AUDIT TRAIL=  $$ (NUMBER, WHEN, WHO, WHERE, PROCESS, VERSION, WHAT)
(   1,<2016-08-28 20:04:16.523 -0500>,<Administrator>,<X>,<go>,<TOPSPIN 2.1>,
      <created by zg
	started at 2016-08-28 19:52:46.601 -0500,
	POWCHK enabled, PULCHK disabled,
       configuration hash MD5:
       21 0F 79 D6 B3 7B B4 F6 88 20 88 DB 03 48 BD 9F
       data hash MD5: 64K
       C0 B0 6A EA 98 19 FC 13 A9 C7 26 AD 9E 96 E9 3F>)
(   2,<2016-08-28 20:04:19.617 -0500>,<Administrator>,<X>,<proc1d>,<TOPSPIN 2.1>,
      <Start of raw data processing
       efp LB = 0.3 FT_mod = 6 PKNL = 1 PHC0 = 0 PHC1 = 0 SI = 128K 
       data hash MD5: 128K
       8A D3 2F 26 DE D8 ED 4D A9 B8 EA D8 2D C0 5B 6A>)
(   3,<2016-08-28 20:04:20.492 -0500>,<Administrator>,<X>,<proc1d>,<TOPSPIN 2.1>,
      <pk PHC0 = -87.06665 PHC1 = 0 
       data hash MD5: 128K
       F4 B4 31 0C 9B 74 5C 4D 2D ED 1A F4 41 D8 A2 98>)
(   4,<2016-08-28 20:04:20.851 -0500>,<Administrator>,<X>,<proc1d>,<TOPSPIN 2.1>,
      <abs ABSG = 1 
       data hash MD5: 128K
       62 23 63 DD C0 A2 67 5A 95 F4 FB D6 38 F0 DC 54>)
(   5,<2016-08-28 20:04:20.945 -0500>,<Administrator>,<X>,<proc1d>,<TOPSPIN 2.1>,
      <abs ABSG = 2 
       data hash MD5: 128K
       1B CA 11 BF DC C6 90 38 0C 0C D3 25 87 9D FE 03>)
(   6,<2016-08-28 20:04:21.023 -0500>,<Administrator>,<X>,<proc1d>,<TOPSPIN 2.1>,
      <abs ABSG = 3 
       data hash MD5: 128K
       D7 72 75 BF CC B3 75 13 7D EC CB CF 81 EE D4 DC>)
(   7,<2016-08-28 20:04:21.117 -0500>,<Administrator>,<X>,<proc1d>,<TOPSPIN 2.1>,
      <abs ABSG = 4 
       data hash MD5: 128K
       EF B4 9F 46 9D 96 3F 7C DE 93 17 54 5E 71 E7 48>)
(   8,<2016-08-28 20:04:21.226 -0500>,<Administrator>,<X>,<proc1d>,<TOPSPIN 2.1>,
      <abs ABSG = 5 
       data hash MD5: 128K
       9A 3B 96 4A 84 42 6A E5 38 64 AA 8B 51 FB 2E 17>)
$$ ##END=
$$ 
$$ $$ hash MD5
$$ $$ 17 8A DF 4E 6D D0 78 3B E2 69 0D 82 7D 3E 48 5C
##$RELAX= 
##$RELAX= 
##$RELAX= 
##$RELAX= 
##$RELAX= 
##$RELAX= 
##$RELAX= 
##$RELAX= 
$$ Bruker specific parameters
$$ --------------------------
##$DU= <E:\>
##$EXPNO= 12
$$ [...]
##$TP07= 0
##$TPNAME0= <>
##$TPNAME1= <>
##$TPNAME2= <>
##$TPNAME3= <>
##$TPNAME4= <>
##$TPNAME5= <>
##$TPNAME6= <>
##$TPNAME7= <>
##$TPOAL= (0..7)
0.5 0.5 0.5 0.5 0.5 0.5 0.5 0.5
##$TPOFFS= (0..7)
0 0 0 0 0 0 0 0
##$TUNHIN= 0
##$TUNHOUT= 0
##$TUNXOUT= 0
##$USERA1= <user>
##$USERA2= <user>
##$USERA3= <user>
##$USERA4= <user>
##$USERA5= <user>
##$V9= 5
##$VALIST= <valist>
##$VCLIST= <CCCCCCCCCCCCCCC>
##$VD= 0
##$VDLIST= <DDDDDDDDDDDDDDD>
##$VPLIST= <PPPPPPPPPPPPPPP>
##$VTLIST= <TTTTTTTTTTTTTTT>
##$WBST= 2048
##$WBSW= 25
##$XGAIN= (0..3)
0 0 0 0
##$XL= 0
##$YL= 0
##$YMAX_a= 6098937
##$YMIN_a= -10946201
##$ZGOPTNS= <>
##$ZL1= 120
##$ZL2= 120
##$ZL3= 120
##$ZL4= 120
##$ABSF1= 14.96035
##$ABSF2= -5.597832
##$ABSG= 5
##$ABSL= 3
##$ALPHA= 0
##$AQORDER= 0
##$ASSFAC= 0
##$ASSFACI= 0
##$ASSFACX= 0
##$ASSWID= 0
##$AUNMP= <proc_prof1d_extract.lims>
##$AXLEFT= 0
##$AXNAME= <>
##$AXNUC= <1H>
##$AXRIGHT= 0
##$AXTYPE= 0
##$AXUNIT= <>
##$AZFE= 0.1
##$AZFW= 0.1
##$BCFW= 0
##$BC_mod= 0
##$BYTORDP= 0
##$COROFFS= 0
##$CY= 15
##$DATMOD= 1
##$DC= 0
##$DFILT= <>
##$DTYPP= 0
##$F1P= 0
##$F2P= 0
##$FCOR= 0.5
##$FTSIZE= 131072
##$FT_mod= 6
##$GAMMA= 0
##$GB= 0
##$INTBC= 1
##$INTSCL= 1
##$ISEN= 128
##$LB= 0.3
##$LEV0= 0
##$LPBIN= 0
##$MAXI= 10000
##$MC2= 0
##$MEAN= 0
##$ME_mod= 0
##$MI= 0
##$NCOEF= 0
##$NC_proc= -2
##$NLEV= 6
##$NOISF1= 0
##$NOISF2= 0
##$NSP= 0
##$NTH_PI= 0
##$NZP= 0
##$OFFSET= 14.96035
##$PC= 1
##$PHC0= -87.06665
##$PHC1= 0
##$PH_mod= 1
##$PKNL= yes
##$PPARMOD= 0
##$PPDIAG= 0
##$PPIPTYP= 0
##$PPMPNUM= 2147483647
##$PPRESOL= 1
##$PSCAL= 4
##$PSIGN= 0
##$PYNMP= <proc.py>
##$REVERSE= no
##$SF= 400.020009898485
##$SI= 131072
##$SIGF1= 0
##$SIGF2= 0
##$SINO= 400
##$SIOLD= 131072
##$SPECTYP= <>
##$SREGLST= <1H.CDCl3>
##$SSB= 0
##$STSI= 131072
##$STSR= 0
##$SW_p= 8223.68421052631
##$SYMM= 0
##$S_DEV= 0
##$TDeff= 65536
##$TDoff= 0
##$TI= <>
##$TILT= no
##$TM1= 0
##$TM2= 0
##$TOPLEV= 0
##$USERP1= <user>
##$USERP2= <user>
##$USERP3= <user>
##$USERP4= <user>
##$USERP5= <user>
##$WDW= 1
##$XDIM= 131072
##$YMAX_p= 334028952
##$YMIN_p= -11531
##$CURPLOT= <Network HP LaserJet P1505>
##$CURPRIN= <$Network HP LaserJet P1505>
##$DFORMAT= <normdp>
##$LAYOUT= <+/1D_H.xwp>
##$LFORMAT= <normlp>
##$PFORMAT= <normpl>
##$SURQMSG= 1
$$ End of Bruker specific parameters
$$ ---------------------------------
##NTUPLES= NMR SPECTRUM
##VAR_NAME=  FREQUENCY,     SPECTRUM/REAL,   SPECTRUM/IMAG
##SYMBOL=    X,             R,               I
##VAR_TYPE=  INDEPENDENT,   DEPENDENT,       DEPENDENT
##VAR_FORM=  AFFN,          ASDF,            ASDF
##VAR_DIM=   131072,        131072,          131072
##UNITS=     HZ,            ARBITRARY UNITS, ARBITRARY UNITS
##FACTOR=    0.0627417313425164, 1,          1
##FIRST=     8223.62146879497, -863,         -50023
##LAST=      0,             228,             -51026
##MIN=       0,             -11531,          0
##MAX=       8223.62146879497, 334028952,    0
$$ Real data points
##PAGE= N=1
##DATA TABLE= (X++(R..R)), XYDATA
$$ [...]
68023 157331 157571 157921 157893 157457 156799 155854 154319 152126 149756 147894 146820 146281 145933 145757 145984 146705 147642
68006 147642 148208 147819 146345 144363 142775 141983 141522 140613 138910 136501 133379 129370 124628 119797 115455
67991 115455 111691 108406 105700 103604 101708 99519 97179 95319 94176 93261 92065 90737 89828 89655 90099
67976 90099 90765 91121 90806 90077 89692 89961 90196 89565 88236 87137 86649 86183 85148 83674 82130 80462 78500
67959 78500 76548 75160 74482 74183 73946 73662 73172 72178 70546 68548 66732 65553 65030 64729 64181 63409 62852
67942 62852 62715 62625 62146 61373 60858 61070 62170 64052 66311 68310 69630 70414 71007 71420 71455 71241 71205 71551
67924 71551 72079 72540 72802 72704 72202 71713 71928 73087 74717 76149 76959 76867 75739 73899 72014 70386 68716
67907 68716 66882 65476 65043 65138 64786 63815 63091 63386 64541 65953 67342 68669 69641 69838 69326 68764 68789 69471
67889 69471 70452 71436 72353 73109 73467 73324 72974 72839 72907 72675 71793 70564 69647 69327 69271 68961 68211 67258 66525
67870 66525 66285 66471 66774 67030 67390 67975 68474 68405 67805 67294 67332 67676 67771 67416 66711 65554 63679 61261 59093
67851 59093 57925 57813 58256 58800 59276 59621 59755 59670 59404 58881 57962 56749 55736 55503 56302 57934 60050 62505
67833 62505 65389 68711 72079 74889 76913 78582 80463 82564 84417 85893 87510 89715 92125 93829
67819 93829 94375 94125 93671 93189 92509 91509 90205 88538 86354 83652 80722 77931 75396 72939 70366 67700
67803 67700 65139 62825 60761 58929 57410 56320 55703 55509 55666 56123 56832 57610 58036 57642 56384 54828
67787 54828 53662 53078 52865 52961 53506 54317 54882 55074 55448 56409 57463 57832 57538 57314 57525 57756 57585 57265 57408
67768 57408 58333 59842 61432 62585 63091 63216 63354 63518 63453 63237 63358 64021 64734 64860 64332 63557 62808 62036
67750 62036 61188 60437 60043 60165 60840 62047 63692 65432 66567 66353 64640 62123 59744 57961 56752 56025
67734 56025 55598 54961 53725 52289 51500 51523 51687 51597 51700 52343 52997 52976 52457 52124 52163 52223 52120 51946 51631 51060
67714 51060 50539 50568 51126 51682 51881 51752 51396 51006 51112 52112 53489 54228 54198 54441 55716 57390 58274 58111
67696 58111 57705 57800 58349 58750 58422 57187 55444 53912 52961 52233 51166 49805 48807 48597 48897 49200 49556 50554
67678 50554 52490 54744 56231 56514 56254 56426 57277 58294 59008 59406 59570 59390 58923 58709 59354 60828 62398
67661 62398 63268 63218 62663 62184 61963 61672 60931 59818 58813 58290 58291 58725 59505 60398 61050 61327 61448 61611 61727
67642 61727 61668 61615 61881 62549 63479 64512 65390 65626 64833 63304 61980 61625 62116 62732 63081 63558 64767 66641
67624 66641 68407 69455 69933 70282 70461 70022 68832 67305 65897 64790 64132 64144 64744 65431 65783 65827 65689 65247
67606 65247 64419 63508 62861 62457 62229 62516 63617 65016 65718 65511 65331 66129 67715 69052 69353 68539 66880
67589 66880 64712 62533 60978 60385 60451 60461 59914 58893 57859 57174 56881 56879 57131 57598 58033 58021 57333 56213 55299
67570 55299 55193 56075 57639 59300 60471 60776 60245 59363 58737 58551 58450 58108 57696 57515 57343 56614 55294 54148
67552 54148 53959 54793 56159 57511 58411 58659 58644 59171 60434 61434 61038 59475 58162 57997 58428 58438 57860 57289
67534 57289 57027 56681 55770 54403 53246 52938 53601 54809 55936 56501 56272 55273 53901 52899 52881 53800 55044
67517 55044 56089 56836 57307 57360 56873 56045 55309 55016 55315 56134 57118 57743 57763 57489 57475 57917 58563 59157 59769 60593
67497 60593 61626 62684 63611 64304 64548 64087 62991 61806 61148 61147 61474 61911 62636 63781 64933 65393 64899 63862
67479 63862 62844 62032 61288 60528 59864 59464 59428 59789 60507 61435 62350 63131 63925 65032 66457 67571 67500 66022
67461 66022 63992 62635 62455 62989 63549 63928 64315 64816 65298 65635 65927 66426 67291 68412 69470 70153 70301 69909
67443 69909 69175 68606 68842 70130 72026 73799 75026 75631 75537 74700 73507 72673 72532 72696 72575 72033 71317 70579
67425 70579 69729 68695 67598 66655 65979 65494 65025 64579 64489 65052 65990 66508 66103 65119 64390 64443 65184 66148 66839
67406 66839 67014 66892 67068 67996 69539 71105 72139 72398 71963 71248 70819 70860 70844 70107 68765 67748 67788 68658
67388 68658 69597 70212 70681 71241 71866 72503 73293 74348 75485 76384 76879 76901 76250 74823 73141 72242 72705 73999
67370 73999 75130 75735 76159 76577 76632 76067 75228 74641 74433 74463 74741 75386 76296 77207 77993 78660 79173 79505 79810
67351 79810 80339 81231 82450 83752 84657 84715 84051 83332 82947 82514 81601 80550 80090 80352 80884 81512 82437 83479
67333 83479 84006 83886 83835 84461 85485 86289 86790 87272 87766 88096 88331 88691 89134 89449 89628 89812 90039 90365 91011
67314 91011 91968 92727 92947 93220 94442 96360 97546 97121 95937 95552 96456 97789 98581 98666 98521 98673 99394 100538
67296 100538 101557 101923 101664 101326 101297 101394 101279 101035 101057 101428 101754 101694 101397 101215 101161 100919 100322 99515 98586 97397
67276 97397 96034 95160 95522 97122 99183 100952 102232 103082 103423 103232 102876 102926 103657 104932 106450 107881 108844
67259 108844 109063 108635 108002 107624 107776 108517 109563 110225 109869 108666 107634 107721 108930 110506 111814 112778 113546
67242 113546 114029 113940 113190 112200 111776 112542 114347 116300 117566 118121 118581 119328 120051 120250 119959 119743 120030 120636
67224 120636 121013 120810 120132 119334 118746 118605 119029 119876 120675 120961 120779 120683 121170 122224 123533 124891 126206 127278
67206 127278 127901 128211 128625 129354 130144 130607 130680 130727 131230 132343 133615 134286 134133 133938 134733 136496 138016 138253
67188 138253 137461 136669 136426 136502 136649 137033 137811 138729 139445 140028 140844 141957 142933 143356 143455 143963 145268 146861
67170 146861 147848 147952 147700 147597 147484 146976 146250 146000 146692 148154 149898 151563 152974 154041 154797 155472 156411
67153 156411 157824 159501 160893 161647 162069 162774 163789 164406 164115 163316 162755 162621 162618 162608 162598 162355 161751 161400 162170
67134 162170 163975 165744 166772 167405 168169 169031 169969 171486 173859 176392 178182 179303 180465 181784 182639
67119 182639 182716 182457 182360 182502 182877 183645 184805 186047 187133 188060 188773 189133 189392 190273 192227 194815 197073
67102 197073 198331 198557 198218 197997 198378 199240 200009 200404 200818 201766 203236 204840 206392 207934 209352 210366
67086 210366 210866 210998 210912 210727 210741 211304 212411 213739 215169 216987 219326 221721 223547 224758 225794 226838
67070 226838 227621 228116 228937 230591 232603 233935 234329 234682 235868 237618 238981 239586 239958 240700 241882 243324
67054 243324 245043 247164 249679 252430 255180 257591 259403 260751 262094 263666 265272 266764 268324 270002
67040 270002 271343 271920 272122 272917 274880 277770 281022 284212 287019 289266 291216 293496 296455 299784 302950
67025 302950 305774 308371 310748 312773 314454 315984 317541 319257 321328 323920 326906 329868 332490 334890
67011 334890 337566 340990 345183 349629 353725 357416 361259 365702 370448 374808 378593 382265 386182 390071
66997 390071 393447 396206 398566 400701 402856 405578 409315 413777 418136 421966 425612 429504 433609 437801
66983 437801 442312 447320 452386 456869 460841 465072 470069 475578 481136 486619 492090 497583 503340 509867
66969 509867 517337 525183 532697 539831 547061 554635 562453 570533 579016 587661 595884 603541 611283 619871
66955 619871 629473 639845 650783 662023 673049 683587 694185 705674 717934 729737 740094 749423
66943 749423 759057 769858 781756 794456 808008 822497 837635 853058 868859 885411 902761 920549
66931 920549 938538 956835 975469 994156 1012806 1032001 1052510 1074428 1097112 1119987 1143039
66920 1143039 1166478 1190287 1214388 1239059 1264910 1292373 1321226 1350596 1379544 1407926 1436653
66909 1436653 1466873 1498765 1531398 1563910 1596482 1629937 1664694 1700517 1737157 1774704 1813177
66898 1813177 1852107 1890821 1929109 1967476 2006733 2047308 2088914 2130852 2172595 2213952 2254735
66887 2254735 2294617 2333493 2371696 2409547 2446845 2483145 2518291 2552248 2584496 2614210 2641200
66876 2641200 2666177 2689818 2711997 2732186 2750107 2765492 2777667 2786151 2791634 2795537 2798298 2798578
66864 2798578 2794613 2786047 2774074 2759978 2744027 2725824 2705210 2682417 2657506 2630090 2599897 2567434
66852 2567434 2533806 2499744 2464998 2428853 2391151 2352540 2313699 2274542 2234374 2192619 2149257
66841 2149257 2104722 2059726 2015161 1971751 1929582 1888144 1847046 1806460 1766661 1727366 1687984
66830 1687984 1648460 1609430 1571439 1534440 1498351 1463604 1430641 1399070 1367892 1336617 1305650
66819 1305650 1275483 1246016 1216969 1188588 1161455 1135707 1110819 1086197 1061740 1037793 1014707
66808 1014707 992476 970746 949187 927937 907549 888349 869962 851691 833291 815138 797655
66797 797655 780871 764570 748587 732816 717214 701991 687603 674296 661781 649604 637755
66786 637755 626634 616353 606353 595838 584499 572727 561276 550738 541236 532458 523993 515695
66774 515695 507661 499899 492142 484113 475869 467735 459960 452561 445463 438638 432037 425506 418867 412083
66760 412083 405384 399177 393713 388694 383336 377037 369972 362920 356526 350927 346015 341735 337976 334437
66746 334437 330799 326893 322615 317959 313285 309253 306180 303645 301014 298139 295193 292022 288230 283874
66732 283874 279536 275569 271738 267803 264005 260646 257521 254189 250632 247287 244442 241966 239630 237462
66718 237462 235623 234029 232183 229539 226124 222753 220354 219059 218165 217062 215841 214817 213798 212257
66704 212257 210037 207498 204957 202376 199634 196832 194163 191659 189193 186690 184302 182394 181284 180893
66690 180893 180705 180157 179056 177548 175832 174029 172221 170395 168390 166129 163940 162485 162225 162924 163655
66675 163655 163461 162193 160661 159689 159089 157934 155883 153633 151807 150095 148064 146305 145828 146502 146965 146201
66659 146201 144492 142657 141075 139741 138596 137393 135781 133943 132682 132381 132325 131616 130417 129584 129300 128824
66643 128824 127667 126291 125409 125100 125030 125115 125469 125821 125490 124118 122158 120415 119255 118465 117800 117331 117207
66626 117207 117332 117519 117696 117730 117215 115860 114102 112942 112999 113859 114423 113807 111946 109595 107734 106791 106406
66609 106406 106084 105898 106167 106597 106350 105093 103505 102526 102485 103137 104021 104497 103947 102434 100907 100324 100771 101695
66591 101695 102604 103152 102962 102010 100990 100641 100787 100542 99438 97874 96466 95480 94973 94956 95207 95326 95227 95299
66573 95299 95888 96840 97658 97919 97427 96181 94386 92435 90772 89746 89463 89669 89839 89543 88687 87396 85910
66556 85910 84714 84365 84828 85261 84926 84099 83613 83694 83873 83964 84372 85236 85901 85597 84329 82802 81720 81325
66538 81325 81332 81157 80483 79728 79668 80494 81559 82098 81858 80922 79405 77589 75988 74948 74372 73995 73692 73412
66520 73412 73160 73172 73742 74666 75228 75012 74364 73812 73383 72835 72239 71936 72140 72852 73908 74889 75313 75223 75245 75654
66500 75654 75791 74915 73374 72363 72639 73968 75702 77316 78415 78755 78416 77672 76642 75377 74160 73345
66484 73345 72915 72595 72364 72431 72755 72996 73032 73075 73203 73139 72659 71872 71023 70307 69954 70104 70454 70441 69999 69796 70459
66463 70459 71731 72695 72693 71887 71044 70898 71570 72477 72884 72623 72148 71898 71880 71947 72154 72568 72919 72744 71906 70782
66443 70782 69925 69561 69391 68876 67815 66641 65978 65943 66027 65764 65327 65330 66178 67635 68969 69501 69196 68720 68720 69070
66423 69070 69062 68332 67242 66191 65029 63468 61799 60727 60578 61076 61855 62792 63775 64481 64616 64215 63538 62823
66405 62823 62258 62081 62442 63190 63998 64741 65605 66728 67858 68525 68496 67908 66992 65898 64803 63939 63343 62791
66387 62791 62149 61636 61535 61799 62232 62901 64035 65460 66552 66833 66401 65646 64798 63944 63256 62953 63046 63274
66369 63274 63344 63193 63046 63111 63211 62868 61937 61016 60942 61926 63444 64821 65611 65536 64702 63857 63796 64180 63588 61226
66349 61226 58148 56250 56325 57642 59135 60256 60789 60605 59909 59224 58810 58482 58227 58615 60109 62142 63368
66332 63368 63002 61709 60969 61615 63132 64347 64625 64192 63540 62922 62523 62650 63419 64407 64973 64820 64028 62712
66314 62712 61017 59355 58219 57721 57589 57677 58101 58842 59538 59896 60074 60468 61236 62139 62764 62826 62397 61874 61611
66295 61611 61603 61656 61757 62020 62331 62435 62420 62713 63446 64133 64196 63524 62423 61295 60596 60680 61344 61807 61507 60752
66275 60752 60252 60229 60374 60481 60612 60718 60638 60557 60999 62175 63642 64730 65109 64847 64247 63730 63587 63657 63469
66256 63469 62807 61938 61215 60810 60903 61689 62885 63586 63064 61551 59917 58742 58057 57771 57795 57776 57261 56296 55479
66237 55479 55264 55542 56085 56974 58244 59390 59737 59247 58648 58688 59477 60576 61518 62150 62605 63088 63637 64023
66219 64023 63873 62962 61434 59770 58504 57866 57677 57613 57557 57603 57808 58117 58555 59242 60079 60616 60503 60032 60003
66200 60003 60949 62572 63992 64567 64449 64307 64461 64443 63612 62124 60899 60538 60716 60888 61170 62007 63241 64129
66182 64129 64280 64033 63788 63445 62723 61673 60569 59574 58740 58198 58098 58461 59185 60127 61128 62140 63272
66165 63272 64488 65315 65316 64897 65063 66078 66893 66367 64681 62969 61872 61155 60593 60422 60707 60946 60765 60612
66147 60612 61240 62619 63773 63776 62699 61486 60953 61067 61179 60838 60175 59531 59049 58762 58771 59045 59212 58924 58422
66128 58422 58397 59235 60577 61631 61743 60821 59521 58906 59519 60719 61266 60654 59572 59050 59475 60467 61325 61504
66110 61504 61097 61023 62297 64820 67267 68472 68519 68130 67478 66301 64901 64142 64269 64441 63826 62762 62310
66093 62310 62909 63907 64451 64424 64372 64733 65481 66407 67449 68583 69671 70613 71503 72360 72804 72401 71293 70170
66075 70170 69535 69400 69737 70679 71992 72830 72527 71355 70009 68702 67353 66438 66767 68311 69968 70825 71105
66058 71105 71491 72020 72152 71633 70743 69828 69078 68728 69016 69783 70390 70220 69179 67693 66355 65601 65558 66109
66040 66109 67130 68655 70714 73039 75075 76338 76739 76593 76394 76550 77146 77907 78419 78473 78157 77703 77305
66023 77305 77086 77074 77181 77343 77722 78615 80013 81375 82070 82063 81971 82394 83335 84324 84942 85054 84699 84060 83549 83699
66003 83699 84784 86623 88800 91005 93093 95018 96817 98606 100498 102561 104862 107389 109876 111951
65989 111951 113646 115491 117794 120044 121485 122174 122911 124112 125300 125941 126173 126214 125564 123508 120258 116869
65973 116869 113981 111262 108265 105228 102648 100491 98363 96253 94633 93838 93707 93844 93936 93780 93275 92544
65957 92544 91919 91657 91732 91921 92061 92210 92641 93592 94957 96280 97225 97970 98911 100046 100968 101521 102153 103431
65939 103431 105473 108023 110789 113389 115187 115704 115228 114669 114689 115236 116013 117037 118491 120233 121815 122945
65923 122945 123717 124391 125187 126368 128266 131002 134170 136995 138939 140174 141457 143540 146680 150586 154681
65908 154681 158372 161328 163668 165835 168082 170137 171514 172060 171972 171299 169909 168109 166923 167249 168838
65893 168838 170462 171125 170754 169729 168151 165878 162978 159724 156187 152185 147722 143264 139436 136570 134596
65878 134596 133174 131740 129594 126288 122059 117722 114054 111365 109644 108837 108791 109083 109213 109007 108655 108294
65862 108294 107790 106982 106006 105234 104955 105184 105692 106143 106240 105884 105244 104670 104485 104782 105407 106152 107020 108135 109332
65843 109332 110029 109770 108834 108050 107992 108608 109581 110667 111609 112154 112428 113004 114309 116110 117846 119229 120314
65826 120314 121279 122475 124470 127599 131573 135870 140311 144858 149071 152424 155096 157782 160549 162617
65812 162617 163554 164072 165069 166346 166943 166506 165611 164783 163810 162255 160146 157858 155602 153357 151179 149289
65796 149289 147870 146922 146305 145801 145166 144318 143512 143182 143506 144255 145230 146758 149468 153499 158162 162576 166583
65779 166583 170863 176264 183135 191164 199586 207585 214739 221118 226807 231440 234436 235611 235200 233302
65765 233302 229704 224333 217474 209483 200716 191906 184037 177413 171303 165090 159448 155691 154071 153492
65751 153492 153098 153494 155988 161059 168013 175932 184472 193741 203786 214420 225419 236674 248088
65738 248088 259349 269884 279098 286642 292408 296318 298168 297649 294456 288504 280189 270432 260213 249911
65724 249911 239225 227824 216028 204673 194292 184569 174735 164517 154553 145806 138701 132986 128330
65711 128330 124661 121835 119350 116745 114153 112115 110847 109987 109077 108022 106983 106057 105269 104726 104548 104670
65695 104670 104852 104942 105031 105285 105682 106093 106609 107559 108977 110250 110699 110535 110869 112542 115270 118167 120779
65678 120779 123228 125644 128009 130559 133809 138022 143000 148563 154926 162366 170799 179932 189729 200478
65664 200478 212372 225142 238231 251309 264533 278117 291641 304076 314695 323734 331847 339109
65652 339109 344981 349086 351524 352441 351868 350166 348184 346663 345801 345522 345742 346119 345965 344824 342831 340133
65636 340133 336241 330454 322717 313590 303378 291840 278834 264886 250909 237544 224860 212507
65624 212507 200106 187700 175935 165624 156986 149385 142034 134949 129089 125380 123559 122160 119831
65611 119831 116580 113531 111513 110228 108862 107082 105157 103436 102149 101558 101889 103089 104877 107000 109205
65596 109205 111063 112172 112566 112662 112718 112619 112266 111913 111947 112459 113147 113670 114024 114576 115679 117266 118953 120600
65578 120600 122558 125299 129041 133968 140507 148953 158945 169751 181054 193009 205492 217818 229449
65565 229449 240623 251940 263506 274757 284873 293087 298701 301278 300970 298485 294521 289195 282018
65552 282018 272412 260294 246298 231592 217450 204759 193654 183615 174082 165045 156903 149829
65540 149829 143665 138535 134990 133124 131935 130224 128031 126492 126238 126553 126366 125453 124242 122934 121412
65525 121412 119799 118464 117414 116115 114091 111514 108995 106901 105008 102860 100431 98293 97057 96706
65511 96706 96691 96597 96460 96420 96362 96114 95730 95418 95328 95564 96202 97093 97805 98042 98026 98305 99227 100709 102346 103588
65491 103588 104060 104010 104311 105697 107995 110397 112438 114368 116503 118609 120158 120941 121247 121541 122179 123249
65475 123249 124395 124859 124009 122006 119759 118063 116894 115686 114101 112205 109985 107194 103916 100901 98911
65460 98911 97922 97360 96990 97070 97579 97892 97548 96971 96970 97673 98352 98350 97896 97810 98466 99270 99285 98317 97125 96482 96421
65439 96421 96683 97508 99297 101627 103370 104022 104306 105150 106572 108008 109194 110217 111026 111501 111770 111985 111958
65422 111958 111526 111018 110802 110559 109661 108264 107334 107468 108209 108736 108738 108474 108428 109119 110793 112953 114519 114798
65404 114798 114176 113607 113664 114217 114863 115377 115885 116722 118070 119691 121224 122733 124611 126780 128413 128806 128323
65387 128323 128039 128550 129502 130274 130708 130942 130838 129985 128304 126390 125043 124548 124604 124912 125541 126558 127627
65370 127627 128337 128864 129906 131830 134072 135559 135730 135165 135218 136883 139856 142818 144783 146011 147390 149271
65354 149271 151384 153749 156941 161264 166168 170787 174732 178109 181068 183635 185770 187322 188074 188022 187419
65339 187419 186397 184766 182374 179428 176245 172880 169228 165334 161386 157570 154115 151198 148574 145528
65325 145528 141588 137239 133633 131549 130793 130555 130159 129452 128554 127368 125508 122910 120299 118590 117762 116847
65309 116847 115196 113232 111636 110340 108892 107415 106511 106337 106412 106296 106009 105774 105833 106459 107670 108924 109659
65292 109659 110207 111654 114572 118238 121284 122777 122612 121305 119716 118616 118155 117833 117137 116049 114885
65277 114885 113982 113682 114282 115640 116977 117420 116743 115506 114554 114483 115320 116485 117173 117026 116408 115913 115736 115689
65259 115689 115647 115684 115773 115727 115561 115683 116492 117844 119124 119880 120231 120611 121260 122065 122751 123018 122634 121693 120691
65240 120691 119940 118897 116591 113055 109836 108590 109384 110874 111911 112397 112687 112897 113056 113336 113791 114178
65224 114178 114343 114492 114826 115123 114936 114072 112713 111238 110035 109280 108724 107910 106693 105435 104618 104500 105149
65207 105149 106413 107743 108449 108388 108105 108061 108057 107690 106989 106260 105628 105168 105121 105464 105539 104762 103645 103430 104580
65188 104580 106229 107396 108201 109477 111448 113326 114315 114678 115483 117270 119260 120214 120000 119798 120555 121734
65172 121734 122121 121508 120847 120791 120816 120053 118485 116951 116316 116862 118227 119578 120072 119485 118408 117646 117520 117812
65154 117812 118221 118641 119124 119742 120453 121040 121304 121435 122045 123674 126345 129669 133242 136840 140414 144132
65138 144132 148280 152903 157592 161765 165110 167662 169605 171253 173079 175471 178394 181464 184306 186698
65124 186698 188431 189385 189783 190096 190506 190664 190174 189202 188395 188141 188115 187640 186404 184701 182967 181279 179417
65107 179417 177304 175091 172793 170101 166767 162988 159205 155642 152201 148657 144732 140191 135256 130851
65093 130851 127944 126531 125660 124616 123665 123399 123759 124142 124198 124023 123709 123214 122654 122216 121681 120521 118725
65076 118725 117155 116710 117358 118267 118740 118665 118164 117218 115815 114183 112694 111602 111023 111076 111827 113076 114430
65059 114430 115745 117294 119261 121089 121785 121067 119893 119518 120254 121536 122948 124467 125667 125485 123364
65044 123364 120233 117817 117070 117556 118145 117912 116592 114662 113018 112191 111840 111236 110127 108830 107624 106528
65028 106528 105637 105171 105092 105114 105203 105632 106399 107053 107369 107738 108542 109462 109820 109408 108577 107722 107116 107193 108445 110813
65008 110813 113413 115130 115491 114992 114652 115250 116921 119359 122193 125042 127375 128768 129415 130053 131167 132522
64992 132522 133641 134480 135371 136541 138027 139823 141718 143112 143433 142792 141942 141605 142050 143245 145009 146914
64976 146914 148360 148998 148973 148703 148543 148647 148917 148961 148231 146429 143799 141016 138711 136968 135267 133036 130342
64959 130342 127876 126158 125009 123947 122810 121719 120678 119623 118708 118119 117708 117271 117098 117644 118621 118988
64943 118988 118104 116424 114787 113477 112397 111716 111765 112417 113119 113621 114295 115614 117519 119405 120562 120673
64927 120673 120018 119250 118866 118817 118708 118330 117828 117395 116997 116553 116195 116132 116259 116178 115730 115300 115307 115520 115280 114500
64907 114500 114039 114802 116763 119193 121633 124201 127041 129957 132618 134796 136406 137738 139703 143319 148648
64892 148648 154533 159703 163942 167948 172291 176793 180923 184510 187982 191874 196130 200032 203003 205330
64878 205330 207786 210590 213148 214766 215215 214523 212730 210054 206884 203341 199294 195006 191277 188562 186400
64863 186400 184138 181780 179652 177669 175593 173711 172476 171619 170339 168420 166445 164801 163080 160722
64849 160722 157726 154427 150949 147211 143270 139441 136177 133814 132221 130747 128832 126634 124721 123239
64835 123239 121889 120697 120137 120290 120528 120408 120367 121037 122231 123156 123386 123149 122876 122897 123480 124650 126026 127236
64817 127236 128489 130312 132752 135237 137301 139031 140685 142241 143582 144862 146465 148697 151627 155090
64803 155090 158732 162265 165809 169794 174291 178565 181558 182820 182743 181973 180844 179431 177790 175903 173573
64788 173573 170710 167687 165093 163027 160928 158306 155456 153209 152052 151738 151748 151870 152267 153151 154492 155940
64772 155940 156998 157476 157793 158685 160543 163199 166404 170166 174450 178828 182796 186365 190011 194093 198593
64757 198593 203369 208292 213060 217247 220779 224106 227668 231378 234887 238244 241932 246216 250698 254642
64743 254642 257565 259442 260483 260876 260623 259463 256987 252993 247755 241881 235847 229758 223539 217285 211359
64728 211359 206195 202065 198976 196771 195266 194290 193590 192814 191719 190424 189358 188925 189273 190381 192219
64713 192219 194693 197570 200617 203844 207473 211556 215645 218898 220605 220730 219946 219045 218218 216921 214520
64698 214520 211018 207119 203614 200719 197935 194478 189959 184729 179598 175119 171250 167706 164513 162033
64684 162033 160484 159603 158821 157733 156444 155576 155826 157316 159394 161213 162521 163761 165452 167741 170521
64669 170521 173718 177294 181136 185105 189055 192681 195484 197124 197768 197947 198081 198240 198311 198151 197539 196186
64653 196186 194002 191279 188461 185781 183278 181121 179616 178737 177922 176656 175250 174743 175947 178710 182101
64638 182101 185146 187419 189266 191558 194985 199465 204439 209744 215763 222583 229532 235958 242008 248061
64624 248061 253764 258291 261343 263120 263388 261463 257333 252023 246462 240614 234105 227182 220530 214583
64610 214583 209510 205445 202171 198967 195414 192156 190152 189277 188289 186221 183247 180155 177596 176001 175559
64595 175559 175841 175897 175137 173943 173078 172767 172705 172750 173143 174097 175600 177740 180876 185203 190257 195174 199492
64578 199492 203630 208522 214857 222680 231543 240762 249571 257365 264070 270134 275889 280976 284585 286263
64564 286263 286153 284449 280987 275648 268962 261924 255192 248626 241657 233908 225420 216550 207855 199947
64550 199947 193150 187228 181656 176307 171747 168731 167535 167877 169291 171338 173532 175501 177269 179123
64536 179123 181040 182504 183087 183009 182792 182433 181197 178440 174474 170529 167740 166216 165158 163870 162419
64521 162419 161176 160020 158477 156590 155082 154469 154487 154718 155346 156810 158912 160842 162076 162813 163438 163957
64505 163957 164127 163970 163966 164731 166538 169104 171959 175007 178567 182796 187353 191804 196075 200261 204304 208213
64489 208213 212293 216653 220673 223566 225350 226709 227896 228450 228153 227580 227364 227425 227308 226900 226375 225724 224783
64472 224783 223547 222075 220216 217773 214918 212153 209882 208209 207076 206415 206245 206746 208130 210267 212533
64457 212533 214272 215375 216259 217331 218629 219883 220757 221062 220884 220579 220551 221058 222238 224191 226905 230172
64441 230172 233728 237538 241920 247340 253944 261259 268551 275709 283674 293727 306410 321443 338566
64428 338566 357940 379683 403596 429712 458741 491646 529082 571517 619389 672545 729754
64417 729754 789398 850689 913715 978251 1042906 1105532 1164122 1217248 1263989 1303664 1335505
64406 1335505 1358503 1371670 1374498 1367100 1350035 1324202 1290755 1250742 1204680 1152700 1095170 1033076
64394 1033076 967860 901128 834559 769792 708246 650971 598541 550922 507625 468342 433401
64383 433401 403269 377649 355498 336025 319233 305278 293732 283918 275699 269355 264694 260685
64371 260685 256252 251224 246295 242124 238617 235124 231193 227008 223048 219440 215763 211557 206913 202447
64357 202447 198660 195434 192303 189211 186763 185557 185401 185461 185153 184639 184423 184822 185966 187950 190612 193292
64341 193292 195161 195804 195339 194094 192316 190093 187313 183823 179855 176169 173449 171584 169830 167700 165498
64326 165498 163996 163789 164883 166628 168072 168640 168616 168854 170039 172257 175017 177507 179088 179915 180877 182582
64310 182582 184564 185951 186621 187109 187528 187386 186463 185082 183307 180678 177091 173296 170025 167163 164266
64295 164266 161356 158709 156304 154072 152303 151212 150407 149357 148197 147500 147496 148053 149185 150918 152819 154359
64279 154359 155699 157483 159844 162264 164504 167030 170270 173989 177602 180761 183467 185985 188742 191901
64265 191901 194975 197285 198848 200320 201961 203318 204093 204652 205291 205666 205465 205093 205042 205000 204279 202840 201122
64248 201122 198993 195699 191015 185777 181006 176949 173279 169868 166957 164734 163057 161584 160058 158486
64234 158486 157103 156101 155379 154676 153936 153353 153027 152787 152485 152331 152727 153802 155268 156763 158105 159131
64218 159131 159458 158769 157389 156240 155882 155742 154727 152576 150204 148578 147719 147024 146193 145386 144801 144544 144812
64201 144812 145700 146841 147624 147821 147700 147549 147467 147660 148555 150467 153420 157312 161979 167076 172289 177738
64185 177738 183815 190478 197117 203291 209176 215071 220837 226129 230689 234019 235171 233548 229783 225274
64171 225274 220820 216159 210838 205056 199495 194648 190472 186441 181919 176681 171189 166164 161920 158315
64157 158315 155272 152946 151339 150148 149138 148414 148209 148654 149863 151888 154402 156744 158612 160522 163245
64142 163245 166841 170524 173412 175248 176399 177369 178332 179043 179175 178793 178366 178234 178147 177523 176144 174429 172944
64125 172944 171738 170368 168667 167308 167283 168753 170807 172609 174426 177032 180368 183512 186066 188847 192890
64110 192890 198276 204313 210401 216274 221761 226836 231690 236389 240626 244135 247064 249607 251644 253212
64096 253212 254990 257680 261196 265119 269628 275102 280837 285156 287017 286768 285099 282071 277572 271913
64082 271913 265371 257753 249124 240526 233231 227446 222358 217245 212010 206763 201528 196482 192015 188530
64068 188530 186379 185882 186969 188898 190808 192524 194372 196237 197448 197787 198020 199024 200767 202618 204419
64053 204419 206717 209933 213798 217776 221739 225913 230333 234711 238907 243275 248288 254003 260113 266425
64039 266425 272941 279431 285310 290064 293563 295788 296598 296033 294551 292631 290278 287243 283557 279458 274980
64024 274980 270120 265388 261690 259557 258828 259144 260338 262168 264139 265832 267140 267916 267715 266188 263532
64009 263532 260264 256696 252928 249133 245582 242484 240038 238432 237456 236304 234267 231634 229448 228255
63995 228255 227539 226654 225913 226317 228343 231361 234316 236702 238782 241042 243630 246383 249298 252791 257248
63980 257248 262421 267592 272573 278223 285567 294493 303718 312132 319805 327599 336183 345697 355977 366672
63966 366672 377287 387634 398296 410304 424256 440032 457428 476796 498934 524620 554453
63955 554453 588986 628700 673871 724626 781331 844996 917245 999571 1092280 1194226 1303816
63944 1303816 1420197 1543186 1672175 1805668 1941916 2079283 2215573 2347500 2471485
63935 2471485 2584764 2685257 2770644 2838394 2886875 2915870 2925713 2916244 2886886 2837509 2769029
63924 2769029 2683309 2582704 2469614 2346340 2215386 2079843 1943222 1808647 1678225 1553271
63914 1553271 1434977 1324629 1223104 1130406 1046030 969815 902167 843212 791973 746777 706467
63903 706467 670810 639712 612591 588785 568096 550441 535288 521955 510261 500364 492071 484817
63891 484817 478291 472526 467375 462462 457837 454213 452259 452005 453187 455810 460037 465722 472372 479626
63877 479626 487672 497154 508594 521751 535615 549268 562672 576413 590798 605586 620447 635159
63865 635159 649234 661876 672534 681126 687574 691582 693123 692776 691195 688473 684260 678199 669983 659283
63851 659283 646020 630591 613602 595450 576332 556441 536000 515312 494903 475329 456696
63840 456696 438682 421185 404500 388643 373022 357297 342122 328462 316370 305033 293928
63829 293928 283358 273880 265662 258503 252043 245884 239769 233766 228082 222758 217763 213230 209290 205737
63815 205737 202267 199008 196441 194814 193923 193459 193245 193073 192687 192012 191153 190102 188694 186881 184871 182945
63799 182945 181310 180089 179222 178399 177342 176178 175340 175109 175362 175684 175555 174603 172969 171297 170103 169275
63783 169275 168448 167636 167081 166713 166223 165605 165058 164448 163436 162176 161293 161030 160957 160741 160635 160979 161622 162169
63765 162169 162408 162259 161681 160900 160368 160250 160280 160379 160983 162389 164148 165547 166424 167084 167632 167887 167837 167729 167736
63746 167736 167905 168414 169487 170936 172065 172244 171497 170506 170079 170644 172127 174268 176918 179922 182803 184928
63730 184928 186151 187083 188523 190756 193533 196528 199582 202618 205657 208978 213075 218253 224207 229968
63716 229968 234466 237326 239075 240419 241420 241633 240905 239593 237955 235852 233223 230387 227592 224641 221319
63701 221319 217917 214977 212750 211235 210514 210708 211754 213508 215917 218826 221787 224393 226669 228858 231003
63686 231003 233020 234969 236913 238645 239920 240833 241662 242473 243196 243891 244600 245165 245648 246681 248774 251416
63670 251416 253577 255128 257018 259821 262826 264982 266163 266941 267495 267423 266500 265031 263331 261278 258510
63655 258510 254850 250439 245682 241172 237465 234745 232786 231350 230496 230287 230400 230376 230312 230884 232453 234513
63639 234513 236381 238185 240649 243998 247689 251237 254748 258483 262480 266926 272300 278711 285521 292087
63625 292087 298532 305355 312719 320714 329878 340706 352824 365344 377973 391171 405427 421075
63613 421075 438646 458530 480233 502845 526404 551921 579789 608987 638205 666887 694577
63602 694577 720066 742053 760123 774214 783521 786962 784794 778999 771804 764252 756261 747534 738030
63589 738030 727742 716313 702954 686937 668229 647516 625506 602482 578769 555267 533080
63578 533080 512724 494103 477113 461865 448355 436476 426439 418740 413526 410307 408518 408074 409162
63565 409162 411720 415401 419938 425328 431741 439390 448424 458796 470256 482666 496327 511850 529657
63552 529657 549683 571614 595364 621289 650015 682056 717375 755037 793242 829865 863039
63541 863039 891174 912651 926106 931377 929898 923758 914505 903169 891098 879911 870366 861779 852871
63528 852871 842850 831403 818021 801836 782049 758292 730758 700291 668189 635604 603130
63517 603130 571151 540379 511697 485511 461524 439268 418667 400087 383925 370150 358187
63506 358187 347331 337295 328196 320016 312479 305625 300067 296223 293538 290969 288124 285452 283374 281800
63492 281800 280593 279941 279944 280196 280171 279863 279741 280102 280715 281181 281548 282445 284501 287636 291098 294327 297550 301309
63474 301309 305533 309457 312390 314160 314881 314803 314525 314764 315422 315182 312643 307883 302509 298091 294863 292086
63458 292086 289265 286695 284895 283946 283492 283227 283200 283727 285164 287710 291233 295307 299639 304565 310932 319306
63442 319306 329371 340296 351687 364110 378723 396469 417503 441249 466914 493847 521277
63431 521277 547832 571722 591684 607577 619882 628954 635156 639627 644368 651381 661874 676317
63419 676317 694854 717460 743785 773170 804896 838409 873186 908205 941572 970897 994254
63408 994254 1010779 1020457 1023801 1021944 1016486 1008664 998801 987001 974090 961117 947902 932759 913890
63395 913890 890609 863223 832425 799209 764789 730101 695638 662030 630355 601451 575305
63384 575305 551580 530404 512093 496396 482658 470685 460854 453382 448036 444652 443375 444164 446534
63371 446534 450137 455310 462628 472074 483026 495083 508580 524233 542450 563237 586601 612678
63359 612678 641291 671687 703104 735560 769646 805394 841645 876685 909181 938264 963084
63348 963084 982780 996815 1005016 1007466 1004763 998268 989590 979663 968603 956435 943447 929618 914109
63335 914109 895678 873488 847508 818428 787447 755814 724267 693010 662449 633685 607932
63324 607932 585612 566387 549965 536383 525420 516168 507389 497992 487023 473633 457586 439683
63312 439683 421287 403354 386192 370038 355404 342617 331453 321532 312872 305693 299851 294839
63300 294839 290348 286480 283378 280960 279066 277535 275981 273779 270574 266702 262931 259867 257645 255987
63286 255987 254352 252188 249339 246242 243625 242027 241537 241754 241894 241267 239938 238742 238410 238905 239904 241549
63270 241549 244153 247292 249915 251510 252579 253703 254693 255089 255115 255601 257127 259688 263035 266905 270991
63255 270991 275121 279545 284625 290229 295783 301051 306434 312328 318606 325036 331876 339639 348516 358500
63241 358500 369888 383098 397897 413349 428813 444685 461847 480604 500332 519995 538796
63230 538796 556592 573960 591680 609883 627831 644790 660939 677144 694040 711719 730050
63219 730050 748718 766986 784056 799716 814098 826680 836170 841633 843109 840808 834399 823655
63207 823655 809182 791780 771488 748147 722672 696879 672077 648682 627237 608866 594315
63196 594315 583300 575242 570010 567487 567087 568486 572408 579853 590593 603178 616549 631059 647662
63183 647662 666546 686892 707752 728740 749879 771017 791652 811345 830155 848426 866215
63172 866215 883134 898769 912882 924993 934069 939013 939421 935584 927789 915827 899144 877305 850457
63159 850457 819625 786498 752614 718705 684977 651863 620146 590401 562744 537167 513710
63148 513710 492210 472353 454196 438224 424532 412346 400820 390128 381261 374792 370202 366417
63136 366417 362608 358463 354155 350246 347336 345554 344539 343974 343895 344440 345609 347498 350343 353989 357585
63121 357585 360285 362168 364087 366657 369786 373152 376568 379748 382280 384210 386374 389704 394269 399247
63107 399247 403711 407149 409396 410514 410821 410820 410960 411542 412807 414889 417678 420847 424032 426884 429075 430490
63091 430490 431355 431965 432255 431933 431022 429999 429307 428960 428773 428764 429192 430360 432459 435475 439128 443135 447623
63074 447623 453076 459717 467192 475096 483603 493244 504202 516195 529046 542997 558354 575117 593262
63061 593262 613236 635853 661520 689696 719307 749782 781582 815626 852282 891128 931646
63050 931646 973858 1018065 1064100 1111050 1157752 1203574 1248759 1293988 1339535 1384884 1429401
63039 1429401 1473272 1517406 1562294 1607314 1651323 1693446 1732895 1768453 1798754 1822926 1840251
63028 1840251 1849287 1848109 1835826 1813349 1782353 1743973 1699026 1649076 1596444 1543022 1489606 1436659
63016 1436659 1385396 1337729 1295242 1258514 1227567 1202677 1184480 1173319 1168815 1170281 1177366 1190022
63004 1190022 1207999 1230654 1257210 1286864 1318685 1351845 1386132 1421838 1458894 1496390 1533227
62993 1533227 1568931 1603543 1637011 1669108 1699665 1728257 1753666 1774157 1788403 1795776 1795777 1787738
62981 1787738 1771274 1746475 1713349 1671586 1621373 1564165 1502145 1437060 1370012 1302186 1235158
62970 1235158 1170380 1108795 1051057 997653 948611 903469 861863 823962 790034 759843 732783
62959 732783 708498 687006 668184 651392 635714 620478 605514 591019 577158 563756 550370
62948 550370 536736 523049 509731 497030 484975 473639 463174 453555 444517 435817 427498 419835
62936 419835 413044 407067 401591 396305 391119 386070 381054 375904 370864 366666 363817 361938 360226 358483
62922 358483 357272 357002 357294 357377 356805 355621 354191 353064 352612 352545 352086 350923 349670 348992 348562 347414 345187
62905 345187 342507 340166 338391 336944 335460 333554 331061 328430 326558 325980 326458 327506 328997 330978 333165
62890 333165 335011 336161 336539 336182 335304 334445 334060 333937 333468 332583 331974 332080 332268 331570 330014 328652 328304
62873 328304 328914 330247 332366 334876 336378 335697 333471 331589 330958 330728 329965 329060 328776 328761 328105 326993 326644
62856 326644 327552 328776 329287 329213 329320 329853 330488 331037 331637 332366 333113 333812 334530 335333 336178 336876 337145 336890 336510
62837 336510 336624 337335 338047 338161 337756 337372 337424 338032 339139 340517 341914 343495 345788 348786 351458 352798
62821 352798 353279 354541 357520 361460 365025 367841 370495 373427 376472 379477 382812 386977 391938 397116
62807 397116 402056 406937 412392 418944 426658 435286 444536 454239 464426 475439 487846 502073 518011
62794 518011 535086 552748 570948 590222 611400 635273 662469 693488 728599 767659 810264
62783 810264 856349 906473 961221 1020422 1083367 1149732 1219752 1293183 1368472 1443139 1514673
62772 1514673 1580865 1639788 1689984 1730527 1760511 1778668 1783813 1775529 1754154 1720497 1676050 1623132
62760 1623132 1564111 1500532 1433469 1364499 1295480 1227407 1160321 1094658 1031892 973404 919302
62749 919302 868898 821868 778385 738515 702129 669354 640443 615138 592542 571784 552571
62738 552571 535081 519478 505651 493337 482494 473506 466799 462170 458694 455498 452516 450355 449584
62725 449584 450311 452267 455061 458464 462657 468148 475325 484109 494080 504785 515926 527603 540535
62712 540535 555791 574048 595359 619778 647767 679650 715041 753413 795072 841008 891824
62701 891824 947325 1007142 1071179 1139290 1210919 1285213 1361091 1437023 1511120 1581693 1647448
62690 1647448 1706898 1757954 1798395 1826606 1841670 1843029 1830455 1804299 1765433 1715009 1654545
62679 1654545 1586247 1512840 1436810 1359858 1283135 1207821 1135184 1066116 1000843 939298 881610
62668 881610 828083 778790 733523 692181 654912 621736 592269 565987 542512 521428 502137
62657 502137 484324 468334 454566 442637 431686 421485 412575 405113 398253 391110 383781 376905 370643
62644 370643 364771 359462 355148 351580 347823 343469 339317 336457 335140 334878 335188 335671 335655 334515 332462
62629 332462 330445 329097 328222 327542 327418 328293 329716 330609 330548 330340 331100 333122 335876 338803 341805 345128
62613 345128 349071 353791 359239 365331 372223 380231 389364 399218 409623 421169 434711 450441 467864
62600 467864 486727 507517 530901 556972 585290 615481 647541 681546 717136 753234 788333
62589 788333 821189 851217 878112 901187 919332 931542 937189 935829 927246 911885 890901 865535
62577 865535 836604 804743 770835 736025 701483 668292 637198 608183 580559 553827 528281
62566 528281 504535 482748 462750 444709 429080 415879 404490 394337 385364 377687 371157 365513
62554 365513 360760 357021 354097 351393 348379 345049 341854 339221 337219 335813 335342 336376 338929 342127
62540 342127 344956 347189 349254 351373 353349 355179 357344 360303 364043 368341 373148 378581 384880 392591
62526 392591 402385 414374 427963 442733 459172 478024 499232 522207 547143 575245 607365 642973
62514 642973 680896 720585 762057 804859 847716 889218 928318 964095 995559 1021975 1042943
62503 1042943 1057849 1065606 1065386 1057429 1042695 1021921 995626 965045 932319 899377 867037 835625
62491 835625 806074 779714 757085 737595 720585 706287 695452 688396 684834 684499 687476 693810 703094
62478 703094 714627 727876 742572 758341 774372 789583 803060 814264 822851 828430 830572 828930
62466 828930 823219 813158 798655 780086 758237 733860 707360 679030 649526 619926 591233 563893
62454 563893 537878 513199 490165 469088 449939 432526 417013 403991 393847 386168 379964 374462
62442 374462 369631 365941 363765 363001 363175 363827 364788 366081 367527 368581 368657 367623 365853 363796 361559 358960
62426 358960 355901 352546 349082 345386 341114 336211 331234 326914 323360 319889 315772 311066 306611 303278
62412 303278 301261 300036 298950 297841 297077 296928 297056 296893 296374 295953 295855 295803 295608 295538 295781 296044 296125 296443 297375
62393 297375 298405 298721 298553 299088 300970 303573 306004 308131 310283 312573 315052 318100 322046 326594 331142
62378 331142 335584 340482 346479 353810 362270 371353 380590 390041 400429 412483 426255 441311 457525
62365 457525 475335 495227 517352 541827 569188 600275 635630 675088 717973 763700 812124
62354 812124 863293 916863 971825 1026644 1079432 1127984 1169993 1203587 1227767 1242481 1248464 1246908
62342 1246908 1238867 1224677 1204130 1177248 1144653 1107133 1065310 1020034 972762 925177 878586
62331 878586 833954 792228 754188 720070 689711 662935 639464 618617 599599 582070 566058
62320 566058 551288 537061 522848 508644 494557 480454 466222 452172 438868 426578 415056
62309 415056 403900 393095 383170 374707 367630 361156 354661 348467 343542 340425 338704 337507 336279 335049
62295 335049 334104 333444 332572 330967 328906 327505 327668 329123 330839 332264 333773 336000 339148 343044 347503
62280 347503 352508 358159 364452 370981 377073 382511 387940 394208 401458 409288 417579 426616 436568 447554
62266 447554 460207 475376 493148 512879 534460 558830 586938 618922 654746 694999 740299
62255 740299 790285 843763 899503 956384 1013061 1068058 1119997 1167244 1207595 1238983 1260481
62244 1260481 1272315 1275154 1269808 1257247 1238135 1212341 1179455 1139825 1094685 1045421 993267 939658
62232 939658 886239 834328 784740 738173 695252 656140 620627 588678 560384 535301 512464
62221 512464 491342 472273 455622 441056 428086 416904 407980 400988 394751 388334 381788 375694 370330
62208 370330 365478 360830 356303 351974 347947 344419 341780 340383 340115 340388 340772 341548 343377 346415 350076
62193 350076 353758 357632 362522 369114 377388 386697 396270 405652 414810 423995 433646 444297 456233 469025
62179 469025 481564 492831 502569 511041 518439 525007 531717 540221 551830 566698 584244 604160 626905
62166 626905 653330 684051 719085 757950 799977 844381 889957 934967 977603 1016468 1050371
62155 1050371 1077917 1097935 1110367 1116200 1116330 1110905 1099912 1083820 1063225 1038270 1008946 975847
62143 975847 940234 903477 866674 830592 795620 761896 729870 700639 675351 654257 636643
62132 636643 621684 609097 599055 591812 587466 585758 585958 587199 589022 591378 594004 596056 596624 595593
62118 595593 593834 592476 592058 592395 593103 593934 594468 593789 590948 585776 578894 570896 561969 552484 543420 535729
62102 535729 529615 524859 521509 519729 519197 519342 520137 522070 525325 529527 534403 540058 546434 553119 560084
62087 560084 568099 577898 589197 600976 612564 624111 636188 649324 663907 680133 697910 716944
62075 716944 736947 757711 779077 800952 823244 845714 868113 890574 913634 937657 962450
62064 962450 987708 1013603 1040568 1068581 1096990 1124940 1151564 1175750 1196123 1211479 1221145 1225043
62052 1225043 1223649 1217805 1208093 1194255 1175517 1151558 1122845 1089984 1053278 1013226 971036 928123
62040 928123 885344 843174 802442 764223 728932 696071 665204 636795 611715 590110 571141
62029 571141 553824 537833 523440 510921 500192 490972 483069 476371 470492 464665 458251 451419 445030
62016 445030 439633 434790 429653 424052 418600 413791 409515 405683 402888 402021 403394 406615 411193 416852
62002 416852 423284 429992 436526 442641 448122 452746 456529 459684 462159 463480 463350 462165 460564 458550
61988 458550 455381 450353 443409 435040 425867 416431 407102 398080 389564 381907 375362 369660 364175 358620
61974 358620 353350 348770 344743 340871 337133 333907 331385 329297 327273 325229 323330 321732 320420 319192
61960 319192 317824 316406 315513 315813 317425 319806 322333 324844 327573 330776 334596 339151 344578 350998 358512
61945 358512 367199 377120 388453 401668 417302 435362 455008 475070 494882 514585 534723 555687
61933 555687 577410 599305 620488 640225 658259 674646 689351 702152 712870 721484 727993 732293
61921 732293 734178 733310 729317 722292 713283 703925 695372 687827 681318 676606 674926 676993 682633 691341
61907 691341 702721 716273 731164 746539 761829 776524 789796 800659 808439 812807 813430 809909
61895 809909 802190 790720 776057 758512 738475 716933 695275 674397 654204 634127 614045 594547
61883 594547 576401 559926 544853 530615 516779 503363 490833 479641 469703 460460 451596 443603
61871 443603 437412 433477 431415 430593 430837 432368 435235 439158 443983 449959 457377 466121 475881 486753
61857 486753 499375 514413 532070 552144 574389 598779 625593 655197 687494 721510 755835
61846 755835 789651 823021 855933 887360 915746 940203 960667 976846 987667 992089 990164 983017
61834 983017 972044 958418 943203 927559 912784 900191 890877 885451 884029 886503 892651 901959 913565
61821 913565 926511 939856 952375 962444 968450 969207 963935 952223 934347 911279 883966 852784
61809 852784 818121 781186 743640 706526 670205 635317 602984 573801 547267 522683 500107
61798 500107 479989 462262 446434 432314 420052 409554 400404 392405 385731 380383 375825 371306 366369
61785 366369 361063 355929 351760 349038 347504 346467 345551 344893 344651 344709 344958 345432 345966 346104 345631 344868 344140
61768 344140 343299 342184 341241 341056 341396 341327 340387 339110 338213 337782 337554 337514 337801 338323 338901 339547 340180 340317 339646
61749 339646 338834 339093 340753 342783 344021 344429 344738 345241 345509 345213 344697 344627 345382 346924 348988 351188 353108
61732 353108 354497 355393 356012 356609 357481 358958 361200 364021 367027 369943 372783 375753 379105 383078 387804
61717 387804 393108 398459 403287 407399 410959 414017 416297 417579 418094 418216 417817 416293 413284 409093 404308
61702 404308 399353 394561 390297 386548 382633 377771 371995 366152 361027 356737 352996 349555 346229 342777
61688 342777 339075 335322 331926 329253 327495 326624 326283 325795 324511 322282 319622 317338 315866 314913 313856
61673 313856 312491 311234 310508 310224 310083 310096 310352 310562 310375 310106 310504 311628 312546 312443 311577 310783 310518 310811
61655 310811 311790 313598 315914 318078 319745 321153 322749 324801 327238 329642 331559 333168 335461 339349
61641 339349 344650 350320 355542 360086 363727 366039 367026 367383 367715 367780 366811 364375 360610 355922 350838 346012
61625 346012 341968 338728 335936 333440 331606 330950 331502 332649 333678 334392 335073 335839 336357 336391 336341 336737 337232
61608 337232 336624 334072 329968 325365 320893 316513 312036 307482 302944 298436 293905 289267 284433 279457
61594 279457 274625 270334 266848 264158 261957 259792 257436 255058 252847 250524 247691 244686 242533 241697
61580 241697 241356 240340 238444 236308 234327 232335 230243 228254 226345 224085 221253 218251 215723 214045
61566 214045 213244 213072 212980 212418 211346 210214 209331 208574 207817 207236 206947 206738 206434 206206 206221 206314 206379 206769 207822
61547 207822 209182 210109 210370 210372 210434 210435 210220 209897 209605 209374 209404 210031 211213 212386 213169 213968 215488 217761 220004
61528 220004 221386 221666 221077 219940 218530 217105 215758 214298 212411 210003 207337 204867 203013 202052 202012
61513 202012 202551 203016 202838 201900 200501 198967 197457 196123 195214 194892 195059 195493 196020 196449 196519 196071 195201 194012
61495 194012 192386 190243 187969 186235 185298 184766 184112 183244 182495 182274 182886 184420 186582 188709 190184 190920
61479 190920 191439 192465 194353 196746 198785 199845 200095 200202 200508 200778 200764 200611 200474 200122 199336 198501 198318
61462 198318 198932 199693 199912 199555 199097 198908 198961 199030 198991 198909 198918 199125 199646 200623 202008 203363 204159 204419 204801 205817
61442 205817 207177 208211 208793 209489 210812 212671 214602 216273 217690 219132 221028 223649 226844 230151 233165
61427 233165 235656 237390 238185 238251 238247 238803 240038 241595 243020 244156 245354 247301 250358 253971 256986 258687
61411 258687 259311 259479 259382 258730 257290 255190 252797 250454 248285 246103 243621 240844 238192 236137 234837
61396 234837 234112 233605 232939 231980 231097 230883 231404 231956 231799 230960 230094 229694 229742 229986 230234 230395 230481 230584 230757
61377 230757 230955 231170 231479 231860 232216 232687 233704 235428 237398 239015 240164 241102 242025 243222 245327 248766
61361 248766 253015 257002 260326 263543 267184 271147 275290 279978 285522 291442 296873 301618 306388 311904
61347 311904 317954 323441 327374 329859 332078 335140 339071 343171 347198 351666 356889 362351 367346 371827
61333 371827 376127 380133 383212 384914 385350 384871 383673 381742 379040 375735 372328 369385 367003 364772 362467
61318 362467 360508 359463 359272 359371 359465 359810 360756 362418 364826 368037 371949 376281 380903 385992 391695 397773
61302 397773 403657 408797 412871 415778 417486 417936 417150 415426 413271 411032 408735 406417 404387 402901 401702
61287 401702 400249 398328 396125 393745 391031 387979 384965 382364 380196 378326 376857 376133 376462 377962 380555
61272 380555 383980 387884 391928 395774 399091 401838 404568 408093 412692 417917 423343 429191 435890 443233
61258 443233 450338 456451 461533 466061 470507 474998 479265 482859 485612 487933 490506 493620 496953 500059
61244 500059 502839 505396 507545 508686 508242 506070 502431 497692 492230 486544 481207 476560 472552 468961
61230 468961 465673 462596 459459 456006 452454 449490 447689 447116 447502 448542 449877 451136 452304 453880 456342
61215 456342 459569 463131 466971 471296 475741 479259 481224 482345 484028 486933 490471 493661 496173 498515
61201 498515 501528 505811 511424 517918 524745 531811 539644 548925 559770 571477 582979 593575 603262
61188 603262 612394 621058 628866 635371 640626 645255 649963 655058 660393 665626 670421 674475 677518 679440
61174 679440 680480 681172 681871 682288 681710 679886 677467 675214 672871 669338 664110 658064 652415 647236 641529
61159 641529 634539 626425 617598 608118 598133 588424 579991 573156 567414 562064 556666 550977 544821 538160
61145 538160 530995 523080 513982 503679 492979 483041 474437 466830 459671 453034 447603 443826 441287 439058
61131 439058 436625 434399 433326 434114 436799 440896 445925 451822 458876 467229 476535 486281 496463 507782
61117 507782 521105 536826 554705 574131 594412 615016 635775 656829 678326 700151 721989
61106 721989 743482 764312 784307 803533 822097 839692 855465 868508 878345 884925 888417 889206
61094 889206 887879 884862 880094 873283 864381 853650 841405 827929 813505 798261 782107 765147
61082 765147 748040 731604 715996 700664 685151 669698 655005 641625 629693 618999 609265 600429
61070 600429 592648 585880 579719 573943 569108 566126 565204 565587 566443 567627 569529 572519 576696 581882 587832
61055 587832 594746 603527 614977 628625 642925 656841 670714 685351 700987 717659 736041 757081
61043 757081 781059 807644 836753 868703 903575 941031 980859 1023246 1068362 1116051 1166049
61032 1166049 1218277 1272892 1330263 1390897 1455248 1523708 1597043 1676633 1763990 1860175 1966084
61021 1966084 2083252 2214123 2361901 2530859 2727013 2958257 3233901 3564249 3960192
61012 3960192 4432557 4991923 5649672 6419245 7316050 8355722 9549582 10893182 12347191
61003 12347191 13822253 15187001 16305531 17085685 17509357 17631916 17559873 17420284 17325556
60994 17325556 17335223 17427973 17503934 17423195 17062032 16357447 15322086 14031301 12595174 11127970
60984 11127970 9723533 8442126 7310373 6330533 5492047 4780001 4179274 3675700 3255794
60975 3255794 2906332 2614714 2369950 2163141 1986957 1835010 1702003 1584215 1479308
60966 1479308 1385534 1301263 1225149 1156332 1094360 1039027 990249 947679 910182 875882 843121
60955 843121 811423 781290 753077 726407 700847 676748 654944 635697 618448 602687 588537
60944 588537 576170 565075 554438 544013 534120 524870 515927 507037 498313 489916 481904 474512 468064
60931 468064 462329 456367 449397 441603 433793 426531 419855 413606 407606 401615 395467 389321 383622 378794
60917 378794 374985 371974 369288 366634 364340 363118 363201 363931 364428 364445 364325 364347 364448 364501 364568 364926 365930 367662
60899 367662 369553 370659 370605 369980 369484 368992 367923 366234 364436 362729 360770 358290 355388 352094 348260
60884 348260 344140 340550 338070 336384 334727 332783 330906 329602 328984 328637 327988 326928 326043 325975 326651 327534
60868 327534 328610 330527 333651 337560 341744 346238 351066 355561 358997 361647 364555 368263 372358 376344
60854 376344 380355 384676 388979 392439 394495 395324 395689 396467 398179 400633 402941 404125 403933 403140 402918 403788
60838 403788 405210 406158 405965 404473 401660 397606 392876 388468 384992 382152 379316 376450 374148 372825 372243
60823 372243 371888 371514 371251 371376 372044 373108 374102 374570 374517 374479 375102 376733 379463 383446 388957 396048 404227
60806 404227 412754 421372 430653 441358 453577 466696 480211 494197 508877 524184 540084 557019
60794 557019 575560 595638 616466 637170 657236 676415 694587 711841 728345 743910 757825
60783 757825 769233 777679 783250 786256 786790 784583 779407 771639 762156 751470 739256 725155 709817
60770 709817 694555 679910 665141 649352 632661 615954 599872 584458 569568 555154 541193
60759 541193 527675 514692 502265 490083 477675 464902 452178 440159 429324 419757 411129 402875
60747 402875 394585 386288 378315 370970 364448 358911 354331 350249 346012 341385 336658 332033 327134 321464
60733 321464 315194 309159 304050 299933 296614 294076 292338 291168 290309 289844 289907 290107 289718 288681 288024 288927
60717 288927 291494 294681 297257 298600 298736 298023 296854 295444 293794 291979 290353 289221 288362 287150 285231
60702 285231 282862 280525 278364 276049 273074 269268 265191 261857 259775 258330 256469 253932 251350 249224
60688 249224 247411 245804 244869 245043 246025 247110 247903 248332 248278 247687 246830 246015 245267 244715 244998 246608 249009
60671 249009 251063 252357 253404 254503 255105 254624 253240 251577 250070 249073 249098 250377 252400 254369 255964
60656 255964 257326 258534 259625 261028 263321 266468 269760 272781 276044 280329 285569 290759 294938 297962
60642 297962 300286 302270 303926 305203 306200 307019 307565 307620 307010 305637 303461 300586 297259 293631 289667 285517
60626 285517 281829 279341 278116 277454 276559 275070 272939 270224 267203 264398 262251 260913 260340 260286 260098 259081
60610 259081 257400 256208 256349 257247 257636 257186 256722 256869 257222 257057 256230 254983 253398 251615 250251 250004 250807
60593 250807 251822 252338 252388 252365 252343 252004 251153 250125 249615 250105 251457 253062 254438 255689 257378 259952 263243
60576 263243 266561 269326 271760 274929 279978 287218 295950 305165 314253 323022 331226 338339 343839 347600
60562 347600 349900 350998 350788 348976 345647 341508 337407 333656 329978 326070 322043 318375 315681 314587
60548 314587 315475 318223 322359 327582 333863 340921 347993 354479 360531 366560 372286 376792 379495 380572
60534 380572 380338 378794 376130 373220 371089 369975 369306 368533 367625 366779 366024 365276 364507 363680 362674 361471
60518 361471 360337 359634 359455 359547 359639 359831 360671 362812 366560 371719 377875 384876 393035 402956 415261 430410
60502 430410 448571 469547 492843 517909 544320 571771 599936 628318 655999 681436 702580
60491 702580 717401 724401 722795 712538 694492 670376 642177 611413 579093 546317 514552 485094
60479 485094 458450 434517 413218 394728 379073 365783 354051 343183 332965 323729 315995 309846
60467 309846 304657 299598 294423 289548 285354 281723 278365 275294 272749 270797 269323 268244 267461 266644 265370
60452 265370 263524 261319 258941 256455 254134 252518 251886 251816 251541 250770 249986 249962 250984 252513 253511 253213 251678
60435 251678 249585 247502 245471 243322 241090 238935 236850 234775 232950 231842 231711 232465 233939 236080 238800
60420 238800 241898 245134 248178 250489 251592 251591 251081 250435 249561 248534 248002 248473 249536 250331 250632 250906 251406
60403 251406 251887 252330 253317 255296 257929 260469 262492 263961 264910 265438 265777 266071 266331 266859 268300 270805
60387 270805 273468 275237 276215 277374 279086 280734 281922 283243 285390 288055 290323 291810 292904 294037
60373 294037 295239 296338 297245 298036 298928 300077 301216 301735 301457 301104 301572 302902 304488 306135 308303 311177
60357 311177 314166 316700 319114 322307 326712 332024 337822 344064 350844 357879 364437 369818 373831 376702
60343 376702 378486 378798 377322 374393 370710 366573 361825 356518 351089 345711 340105 334382 329515 326331
60329 326331 324388 322521 320334 318386 316968 315500 313388 310778 308118 305582 303427 302410 303124 305108
60315 305108 307232 308985 310867 313553 317172 321563 326714 332746 339766 348015 357754 368681 379766 390087
60301 390087 399647 408881 417505 424446 428995 431317 431503 428743 422187 412381 401084 389656 378300 367050
60287 367050 356696 348163 341417 335635 330331 325718 321977 318764 315630 312599 310071 308349 307372 306746
60273 306746 305965 304745 303195 301527 299708 297626 295474 293572 291836 289943 288061 286815 286298 285699 284363
60258 284363 282748 281772 281563 281460 280978 280154 279116 278036 277458 277899 279020 279847 280030 280286 281334 282978 284618
60241 284618 286139 287822 289739 291671 293353 294430 294568 294038 293891 294976 296983 298870 300026 300541 300651
60226 300651 300614 300974 302160 303704 304605 304674 304888 306113 308061 309887 311307 312595 313912 315278 317023 319622
60210 319622 323052 326707 330042 333008 335871 338917 342385 346343 350499 354341 357662 360863 364626 369255
60196 369255 374340 379019 382620 385104 386968 388734 390591 392411 393871 394594 394470 393945 393639 393458 392445
60181 392445 389895 386343 383024 380486 378232 375593 372408 368846 365183 361942 359724 358530 357592 356165
60167 356165 354235 352265 350643 349688 349758 350816 352079 352633 352356 351884 351736 351884 352088 352221 352276 352442 353173 354727
60149 354727 356607 357949 358604 359357 360881 362976 365114 367245 369551 371830 373808 375913 379056 383557 388766
60134 388766 393823 398309 402057 404901 406941 408641 410238 411350 411549 411110 410696 410478 410075 409375 408878 409022
60118 409022 409616 410224 410733 411199 411429 411220 410890 411068 411862 412630 412749 412230 411379 410184 408472 406490 404891
60101 404891 404059 403783 403651 403481 403217 402733 402008 401323 400889 400351 398994 396604 393867 391793 390852 390797 391097 391331
60083 391331 391297 391137 391438 392916 395703 399002 401664 403143 403808 404347 405048 405690 405919 405467 404044 401332 397339
60066 397339 392699 388356 384772 381532 377873 373572 369161 365260 361897 358621 355136 351612 348388 345590
60052 345590 343118 340887 338950 337469 336650 336677 337588 339217 341341 343862 346818 350194 353786 357322 360649
60037 360649 363815 366945 370031 372837 375071 376702 378095 379714 381576 383022 383129 381480 378543 375275
60023 375275 372235 369084 365000 359562 353174 346629 340398 334431 328545 322807 317518 312934 309072 305710
60009 305710 302585 299665 297279 295889 295626 296116 296809 297436 298116 299109 300549 302299 303873 304518 303691 301657
59993 301657 299498 298335 298509 299621 301214 303148 305335 307477 309288 310808 312257 313697 315057 316337
59979 316337 317555 318597 319499 320797 323049 325811 327589 327248 325261 323165 321943 321386 320925 320503 320420 320774
59963 320774 321366 321973 322466 322809 323158 323817 324934 326338 327787 329209 330499 331255 331072 330063 328813 327758
59947 327758 326840 325835 324744 323655 322494 321275 320501 320805 321946 322524 321201 318201 315162 313372 312525
59932 312525 311458 309641 307465 305313 303105 300852 299007 297907 297300 296848 296833 297914 300315 303628 307338
59917 307338 311156 314849 318133 320845 323018 324737 326157 327666 329809 332830 336426 340059 343459 346783
59903 346783 350360 354275 358162 361404 363605 364884 365652 366229 366678 366866 366526 365461 363874 362373 361428 360994
59887 360994 360980 361841 364194 367875 371914 375606 379173 383178 387692 392361 396953 401382 405334 408275 409893
59872 409893 410372 410165 409567 408477 406583 403887 400965 398496 396594 394944 393608 393235 394220 396096 398174
59857 398174 400528 403888 408650 414355 420046 424845 428253 430219 431023 430949 430159 428931 427775 426993 426310 425210
59841 425210 423428 420765 416663 410529 402518 393612 384884 377009 370385 365214 361359 358502 356579 355740
59827 355740 355893 356711 358041 359785 361340 361819 361095 360039 359308 358444 356679 354145 351652 349580 347705 345968
59811 345968 344714 344115 343955 344118 344726 345621 346159 345883 345092 344405 344010 343550 342567 340804 338274 335297 332378
59794 332378 329715 326911 323441 319433 315649 312575 309889 307049 304159 301823 300225 298894 297563 296744
59780 296744 296957 297630 297425 295808 293784 292792 293192 294139 294640 294357 293564 292832 292777 293683 295171 296493 297326 298159
59762 298159 299750 302353 305576 308816 311669 314011 315977 317978 320528 323878 327710 331290 334028 335948
59748 335948 337578 339436 341698 344313 347262 350549 354032 357356 360197 362567 364870 367547 370489 373009
59734 373009 374619 375838 377803 380926 384249 386396 386879 386194 384940 383354 381694 380481 380150 380611 381274
59719 381274 381384 380431 378487 376190 374217 372780 371779 371292 371513 372268 373075 373749 374516 375414 376071 376295 376465
59702 376465 377002 377811 378601 379445 380595 382027 383550 385161 386844 388213 388882 389105 389481 390003 389919 388691 386715
59685 386715 384918 383956 383869 384206 384334 383889 382985 381789 379993 377186 373734 370637 368330 366199 363648 361000
59669 361000 358818 356865 354429 351380 348186 345100 342109 339545 337875 336733 335033 332398 329835 328570
59655 328570 328812 330051 331947 334229 336228 337368 338039 339204 341067 342758 343431 343168 342594 342158 342106 342705
59639 342705 344016 345549 346528 346511 345651 344453 343429 342869 342745 342821 342896 342903 342812 342567 342189 341757 341204 340304 338976
59620 338976 337447 335974 334561 333093 331650 330460 329598 328871 328037 327045 326134 325710 326016 326813 327519 327783 327864
59603 327864 328358 329583 331289 332870 333797 334005 333980 334342 335232 336220 336812 336881 336572 336115 335891 336228 336838 336807 335587
59584 335587 333762 332299 331306 330093 328357 326539 324965 323336 321408 319507 317994 316676 315244 313903
59570 313903 313011 312346 311345 310008 309070 309166 310191 311559 312806 313824 314722 315630 316552 317348 317894 318254 318711
59553 318711 319734 321828 325116 328963 332399 335155 338011 341749 346129 350356 354356 358948 364873 372359
59539 372359 381726 393580 407852 423080 437140 448397 455783 458323 455568 448625 439988 431899 425078
59526 425078 419213 414297 411040 410098 411315 413810 416618 419164 421346 423361 425389 427285 428520 428513 427111
59511 427111 424734 421991 419145 415938 411849 406491 399869 392452 384960 377911 371370 365274 359960 356036
59497 356036 353568 351715 349509 346859 344413 342563 341036 339566 338434 338060 338354 338922 339746 341244 343637
59482 343637 346558 349435 352041 354621 357631 361480 366353 372131 378422 384701 390379 394868 397808 399358
59468 399358 400145 400820 401687 402748 403930 405207 406602 408234 410306 412989 416339 420352 425053 430519 436844
59453 436844 444028 451837 459915 468270 477520 488220 499846 510840 519882 526764 531767 534602 534492 531134
59439 531134 525053 517055 507785 497801 487568 477275 467020 457207 448337 440303 432436 424583 417735
59426 417735 413193 411301 411319 412355 414114 416888 421200 427496 435961 446557 459255 474089 490875 509024
59412 509024 527752 546288 563643 578319 588498 592685 590384 582594 571780 560844 551626 544426
59400 544426 539098 536036 535533 536455 536350 533003 525454 513644 497938 479402 459941 441480 425062
59387 425062 410917 399064 389415 381492 374578 368288 362768 358350 355201 353256 352251 351752 351357 350959
59373 350959 350721 350817 351244 351892 352669 353594 354916 357039 360072 363393 365961 367314 368156 369672 372304 375486
59357 375486 378626 382069 386769 393166 400675 408336 415715 423116 431157 440331 450794 462317 474425
59344 474425 486733 499153 511752 524463 537031 549123 560349 570288 578678 585545 590986 594862
59332 594862 596850 596786 594740 590785 584903 577247 568378 559108 550087 541458 532862 523839 514380 505110 496860
59317 496860 490089 484768 480708 477817 476169 476006 477653 481222 486402 492689 499718 507105 514024 519252
59303 519252 521743 520961 516744 509254 499199 487756 475968 464332 453092 442746 434011 427316 422439
59290 422439 418637 415235 412231 410290 409911 410684 411632 412249 412848 413932 415718 418356 421993 426327 430640
59275 430640 434729 439347 445249 452201 459537 467262 475849 485112 494185 502675 511008 519398 527224 533820
59261 533820 539243 543673 546575 547177 545539 542495 538536 533300 526332 517856 508565 498962 489255 479731
59247 479731 470862 462938 455823 449276 443462 438934 436019 434429 433657 433601 434507 436367 438734 441261 444102
59232 444102 447550 451489 455417 458856 461511 463135 463557 462852 461280 459021 456111 452574 448424 443573 437949
59217 437949 431649 424803 417392 409497 401723 394950 389535 385122 381396 378575 376809 375479 373744 371708
59203 371708 370467 370765 372055 373144 373490 373514 373774 374261 374654 375084 376281 378752 381882 384196 384729 383991 383353
59186 383353 383639 384669 385997 387547 389447 391741 394484 397700 401041 403950 406509 409652 414016 418940
59172 418940 423212 426643 430244 434946 440732 447095 453744 460634 467744 475063 482512 489798 496642 503170
59158 503170 509661 515820 520734 523708 524740 524022 521473 517106 511422 505061 498262 491022 483528 476095
59144 476095 468843 461725 454770 448137 442012 436574 431796 427247 422509 417924 414441 412421 411062 409382
59130 409382 407335 405532 404366 403993 404742 406788 409671 412868 416675 421776 428052 434602 440941 447351 454003
59115 454003 460567 466936 473506 480400 487155 493688 500815 509158 517935 525558 531183 535224 538596 542012
59101 542012 545765 549629 552963 555293 556684 557219 556424 553859 550181 546930 545044 544035 542853 541082 538995
59086 538995 536776 534217 531092 527483 523612 519567 515273 510664 505747 500532 494941 488811 482000 474528
59072 474528 466645 458780 451371 444675 438672 433067 427464 421642 415867 410847 407160 404632 402453 400027
59058 400027 397511 395398 393800 392454 391229 390270 389658 389292 389106 389095 389106 388959 388781 388913 389435 390146 391031 392238
59040 392238 393435 393808 393082 392147 392143 393178 394445 395415 396385 397876 400025 402737 406052 410138 415064 420724
59024 420724 426871 433177 439378 445453 451699 458617 466620 475564 484471 492063 497855 502576 507208 511794
59010 511794 515510 517822 519057 519793 520174 520111 519871 520072 521079 522608 524023 524997 525912 527631 530831 535418
58994 535418 540530 545081 548395 550491 551883 553112 554396 555648 556640 557012 556276 554130 550803 546860 542674
58979 542674 538410 534533 531819 530536 530053 529677 529606 530617 533061 536652 541085 546244 551878 557632 563535
58964 563535 569908 576655 583121 588876 594252 599778 605408 610507 614379 616562 616905 615621 613057 609189
58950 609189 603555 595915 586685 576450 565377 553543 541617 530610 520867 511838 503066 494973 488321
58937 488321 483120 478514 473775 469015 464807 461402 458626 456339 454564 453135 451693 450279 449571 450060 451188
58922 451188 451797 451388 450426 449405 448254 446955 446146 446461 447588 448631 449391 450701 453342 457017 460715 463859
58906 463859 466883 470850 476633 484316 493157 502146 510748 519101 527514 536009 544469 553006 561796 570632
58892 570632 579072 587261 596241 607095 619900 633864 648466 664028 680977 698882 716497 732644
58880 732644 746759 758605 767749 773555 775728 774756 771599 766746 759684 749574 736452 721384 705472
58867 705472 689186 672904 657448 643504 630887 619050 608066 598335 589508 580608 571414 562865
58855 562865 555717 549448 542961 535765 527991 519827 511607 504054 497701 492207 486818 481361 476260 471730
58841 471730 467532 463454 459513 455669 451870 448327 445282 442510 439592 436653 434276 432591 431060 429323
58827 429323 427724 426773 426584 426984 427666 428050 427638 426862 427013 428867 431842 434921 437801 440554 442737 443812
58811 443812 444210 445067 446855 448986 450845 452458 453936 454963 455191 454709 453824 452818 452171 452509 453867 455329
58795 455329 455796 454928 453057 450550 447710 445039 443049 441774 440887 440281 440212 440843 441985 443388 445047 447157
58779 447157 449948 453585 457983 462656 466981 470601 473345 474729 473924 470507 465099 458984 453117 447608
58765 447608 442118 436533 431185 426526 422688 419447 416590 414219 412597 411810 411714 412160 413062 414252 415521
58750 415521 416909 418706 421036 423620 426175 428946 432512 437050 442023 446718 450905 454785 458487 461928
58736 461928 465264 469089 473848 479196 484310 488812 492979 496934 500207 502479 504371 506842 509992 513131
58722 513131 515962 518917 522098 524677 525898 526222 526876 528579 531300 534976 539707 545200 550680 555588 560000
58707 560000 564199 568213 571945 575344 578120 579500 578586 574991 569103 561822 553977 545741 536540 525780
58693 525780 513769 501709 490662 480783 471672 463139 455381 448668 443217 439193 436443 434241 431676
58680 431676 428378 424678 420988 417331 413633 410258 408014 407590 409065 411890 415288 418731 422225 426183
58666 426183 430998 436698 443067 450042 457727 465825 473225 478592 481521 482794 483301 482992 481241 477965 473848
58651 473848 469530 465142 460762 456773 453424 450457 447568 444959 443009 441661 440574 439679 439051 438351 437027
58636 437027 435257 434102 434376 435717 437129 438202 439438 441479 444356 447422 449827 451109 451594 452195 453567
58621 453567 455440 457036 458156 459522 461883 465068 468263 471125 474226 478300 483319 488595 493614 498381
58607 498381 502836 506284 507824 507448 506405 506219 507407 509279 510859 511706 511806 511075 509342 506755 503843
58592 503843 501133 498929 497497 497126 497816 499210 501114 503935 508198 513668 519355 524520 529386 534677 540689
58577 540689 547040 553150 558750 563985 569212 574673 580252 585680 591097 597188 604546 613024 622051 631482
58563 631482 641724 653043 665218 678082 691976 707277 723710 740411 756476 771080 783315
58552 783315 792514 798862 803242 806231 807511 806437 802923 797544 791058 784134 777334 770950 764788 758340
58538 758340 751195 743155 734064 723828 712635 700879 688757 676181 663284 650846 640009 631468
58526 631468 625014 619877 615524 612071 609850 608701 608014 607545 607720 608769 609942 610234 609751 609576 610174 610698
58510 610698 610300 609411 609102 609625 610332 610849 611499 612472 613217 612992 611704 609974 608563 607834 607593 607318 606596 605369
58492 605369 603850 602442 601815 602609 604708 607132 609111 611011 613683 617179 620860 624646 629269 635129 641715
58477 641715 648536 655854 663996 672571 680963 689073 696902 703808 708973 712420 714759 715994 715408 712800
58463 712800 709128 705560 702461 699763 697878 697582 698993 701230 703333 705303 708026 712317 718216 725097
58449 725097 732105 738306 742746 744793 744567 742763 740036 736680 732908 729048 725307 721654 718245 715781
58435 715781 715040 716040 717916 719723 721152 722519 724273 726761 730305 735239 741734 749598 758335 767356
58421 767356 776148 784408 792190 799846 807535 814743 820552 824485 826805 827878 827710 826402 824592 822842
58407 822842 820901 818205 814968 812039 809746 807647 805514 803748 802550 801489 800406 800107 801537 804637
58393 804637 808512 812486 816514 820808 825434 830130 834256 837215 839124 840761 842658 844728 846975 849862
58379 849862 853479 856962 859512 861591 864421 868551 873633 879260 885265 891297 896937 902307 908036 914579
58365 914579 922037 930497 939970 950073 960371 971020 982557 995102 1008276 1021764 1035292 1048166
58353 1048166 1059563 1069449 1078555 1087338 1095512 1102739 1109200 1115286 1121198 1127078 1133209 1139988 1148003 1157942
58339 1157942 1169876 1182742 1195268 1207517 1220860 1236295 1253438 1271277 1289181 1306855 1324014
58328 1324014 1340586 1356810 1372742 1387982 1402151 1415333 1427875 1440094 1452261 1464439 1476307
58317 1476307 1487654 1499085 1511600 1525368 1539649 1554089 1569302 1585802 1603203 1620972 1639307
58306 1639307 1658648 1678934 1700012 1722258 1746047 1770924 1795994 1820952 1846228 1872316 1899452
58295 1899452 1927661 1956579 1985428 2013685 2041672 2070145 2099537 2130035 2162062 2196104 2232167
58284 2232167 2269881 2309067 2349752 2391716 2434460 2477642 2521248 2565442 2610582 2657273 2706034
58273 2706034 2756931 2809750 2864427 2921009 2979344 3039165 3100538 3164013 3230300 3299863 3372738
58262 3372738 3448648 3527467 3609617 3695803 3786264 3880561 3978219 4079252 4183823 4291680 4402294
58251 4402294 4515486 4631741 4751999 4877203 5007925 5144384 5286917 5436250 5593098
58242 5593098 5757716 5930361 6112082 6304525 6508983 6726102 6956413 7200508 7458780
58233 7458780 7731748 8020770 8327755 8654176 9001108 9370265 9764201 10185445 10636405
58224 10636405 11120186 11640503 12200700 12804058 13455378 14161109 14927705 15761297 16669565
58215 16669565 17662641 18751674 19948051 21265037 22719176 24329893 26120168 28119785
58207 28119785 30367931 32912905 35812047 39134322 42962899 47395734 52547297 58553065
58199 58553065 65571903 73782590 83378011 94560524 107535349 122499867 139632133
58192 139632133 159072808 180874815 204895324 230638036 257095974 282672393 305265116
58185 305265116 322570279 332568256 334028952 326821287 311901793 291023169 266311092
58178 266311092 239854899 213403146 188207811 165018743 144182171 125771234 109695956
58171 109695956 95779339 83806296 73551508 64792331 57316401 50929384 45460147
58164 45460147 40760656 36704039 33184149 30114805 27426336 25061313 22972040 21119244
58156 21119244 19470638 17999651 16684505 15506694 14449354 13497155 12637332 11859422
58148 11859422 11153633 10510263 9920693 9377864 8875592 8408537 7973104 7567334 7189486
58139 7189486 6837483 6509700 6205068 5921929 5657739 5410282 5178351 4960989 4757049
58130 4757049 4565796 4386870 4219169 4060677 3909924 3766794 3631455 3503368 3381869
58121 3381869 3266837 3158048 3054629 2955785 2861488 2771809 2686144 2603810 2524913 2450034 2379382
58110 2379382 2312741 2249780 2189806 2131625 2074301 2017946 1963322 1910863 1860401 1811612 1764353
58099 1764353 1718746 1675204 1634168 1595605 1559017 1524093 1491018 1459947 1430606 1402668 1376141
58088 1376141 1351059 1327120 1303915 1281310 1259361 1238068 1217283 1196571 1175198 1152792 1130094
58077 1130094 1108441 1088229 1068449 1048095 1027421 1007368 988270 969772 951670 934216 917634
58066 917634 901831 886580 871772 857516 844150 831976 820859 810277 799838 789459 778996
58055 778996 768166 757031 746126 735834 725983 716260 706654 697253 688083 679412 671750 665163 659026
58042 659026 652814 646710 640951 635033 628200 620456 612546 605067 598062 591314 584538 577375 569640 561573
58028 561573 553506 545355 536719 527431 517782 508353 499835 492742 486966 481755 476457 471137 466224 461763
58014 461763 457395 452940 448627 444764 441449 438508 435532 432155 428476 425046 422215 419746 417308 415060
58000 415060 413364 412132 410841 409130 407097 405110 403531 402454 401491 400073 398135 396261 394920 393892
57986 393892 392755 391515 390344 389046 387293 385081 382520 379512 376224 373498 372078 371587 370983 369884 368694
57971 368694 367558 366077 364195 362505 361412 360727 360445 361110 362851 364636 365279 364900 364707 365387 366383 366842
57955 366842 366715 366628 366975 367587 368152 368570 368774 368633 368358 368713 370266 372477 374167 375031 376109 378419 381709
57938 381709 385042 388103 391214 394468 397635 400802 404284 407836 410649 412228 412709 412201 410516 407701 404196
57923 404196 400101 394832 387936 379898 371789 364382 357833 351843 345861 339480 332993 327366 323368 320889
57909 320889 319264 317995 316956 316218 315934 316238 316987 317764 318294 318628 318812 318708 318374 318316 319052 320652 322853
57892 322853 325337 327589 328868 328735 327490 325808 324142 322762 321990 321876 321781 320800 318657 315812 312741 309476
57876 309476 305871 301898 297613 293087 288523 284244 280557 277708 275788 274488 273141 271469 270145 270145 271501
57861 271501 273202 274439 275452 276938 279102 281670 284480 287591 290958 294370 297652 300623 302987 304581
57847 304581 305668 306635 307417 307574 306984 306070 305245 304458 303480 302355 301302 300336 299352 298469 298074 298534 300072
57830 300072 302792 306477 310364 313500 315553 317111 319079 321949 325707 330074 334542 338371 340959 342243
57816 342243 342499 341759 339650 335844 330468 324065 317295 310672 304334 298043 291623 285482 280449 276992 274775
57801 274775 273158 271901 271086 270496 269520 267774 265561 263545 262105 261190 260678 260610 261077 262080 263594 265606
57785 265606 267975 270410 272803 275467 278782 282643 286539 290259 294181 298636 303267 307357 310678 313627
57771 313627 316458 318745 319796 319406 317917 315646 312537 308493 303848 299266 295143 291289 287306 283133
57757 283133 279036 275231 271824 269107 267465 266768 266142 264682 262332 259881 258211 257724 258256 259224 259911 259979
57741 259979 259727 259681 259928 260074 259797 259222 258775 258848 259516 260348 260631 260092 259334 259168 259589 259831 259515 259186 259489
57722 259489 260230 260697 260667 260623 260994 261552 261697 261163 260249 259426 258928 258842 259359 260539 261813 262181 261266 259865 259067
57703 259067 259077 259368 259712 260346 261189 261722 261859 262231 263272 264574 265567 266300 267048 267556 267303 266265 264896 263531
57685 263531 262310 261630 262099 263945 266845 270468 274945 280767 288439 298303 310622 325746 344053 365535
57671 365535 389499 415130 442481 472322 504477 536454 564059 583302 591669 588356 574241 551737
57659 551737 524021 493946 463605 434546 407912 384387 364353 347972 334822 323755 313741
57648 313741 304764 297366 291452 286247 281468 277754 275688 275010 275070 275542 276338 277312 278428 279864 281599 283214
57632 283214 284388 285279 286174 287135 288246 289720 291383 292440 292245 290973 289144 286867 284135 281503 279774
57617 279774 279075 278910 279036 279636 280622 281457 281886 282243 282769 283122 282976 282663 282811 283504 284262 284749 285171 285909 287000
57598 287000 288092 288822 289173 289401 289623 289606 289107 288283 287463 286622 285410 283799 282274 281239 280607 280203 280212 280813
57580 280813 281643 282121 282265 282730 283964 285643 287130 288225 289270 290602 292095 293228 293566 293184 292588 292282
57564 292282 292506 293348 294841 296816 298913 300992 303290 305892 308322 310133 311708 313855 316645 319275 321237
57549 321237 322873 324463 325425 325075 323784 322751 322833 324140 326484 329500 332434 334509 335694 336645 337857
57534 337857 339416 341570 344749 348719 352365 354791 356209 357323 358343 359163 360080 361587 363615 365648 367596
57519 367596 369914 372742 375535 377788 379682 381710 383991 386329 388657 391024 393279 395176 396841 398780
57505 398780 401243 403821 405849 407122 408000 408881 409823 410763 411822 413132 414529 415792 417130 419097 421838
57490 421838 424785 427301 429354 431324 433396 435546 437995 441198 445353 450203 455372 460561 465373 469384
57476 469384 472636 475778 479337 482909 485371 485980 485176 484310 484691 486802 490189 493905 497120 499587 501688
57461 501688 504033 506910 510060 513045 515794 518691 522100 526006 530130 534221 538090 541597 544815 548067
57447 548067 551555 555024 558096 560877 563967 567837 572424 577380 582431 587394 592074 596384 600492 604723
57433 604723 609291 614176 619155 623937 628343 632446 636503 640764 645387 650471 656014 661845 667723 673534
57419 673534 679308 685108 690998 697070 703324 709538 715423 720906 726065 730910 735546 740593 746977 754941
57405 754941 763432 770842 776452 781040 786015 792096 798868 805541 811922 818515 825775 833558 841412 849144
57391 849144 856877 864749 872828 881220 889953 898871 907919 917380 927460 937739 947523 956676 965594 974329
57377 974329 982400 989679 996878 1004799 1013622 1023241 1033698 1044775 1055615 1065474 1074613 1083840 1093339
57364 1093339 1102553 1111138 1119475 1128317 1138403 1150259 1163653 1177219 1189369 1199895 1210166 1221505
57352 1221505 1233873 1246416 1258759 1271247 1284203 1297470 1310620 1323315 1335469 1347264 1358989
57341 1358989 1370848 1383025 1395881 1409696 1424144 1438398 1452046 1465583 1479734 1494614 1509824
57330 1509824 1525055 1540188 1555114 1570001 1585560 1602419 1620181 1637601 1653857 1669257 1684618
57319 1684618 1700338 1716262 1732114 1747817 1763622 1780085 1797698 1816356 1835413 1854407 1873511
57308 1873511 1893132 1913341 1933872 1954456 1974914 1995170 2015435 2036147 2057407 2078699 2099509
57297 2099509 2120046 2140915 2162264 2183812 2205633 2228225 2251597 2274896 2297360 2319260 2341502
57286 2341502 2364623 2388606 2413383 2438889 2464635 2489827 2514200 2538457 2563627 2590062 2617168
57275 2617168 2644035 2670204 2695814 2721166 2746309 2771238 2796373 2822439 2849708 2877576 2905100
57264 2905100 2931729 2957324 2981832 3005468 3028962 3053021 3077478 3101594 3125285 3149395 3174413
57253 3174413 3199533 3223546 3246337 3268910 3292118 3315985 3340210 3364660 3389172 3413381 3437112
57242 3437112 3460678 3484480 3508504 3532501 3556539 3580995 3605977 3631012 3655405 3678803 3701345
57231 3701345 3723459 3745545 3767656 3789329 3809924 3829387 3848509 3868082 3887851 3906757 3924312
57220 3924312 3941274 3958642 3976469 3994159 4011661 4029676 4048682 4068348 4088097 4107717 4127168
57209 4127168 4146223 4164695 4182713 4200443 4217692 4234125 4249761 4264953 4279929 4294503 4308183
57198 4308183 4320443 4331143 4340888 4350744 4361321 4372231 4382709 4392590 4402329 4412178 4421785 4430759 4439311
57185 4439311 4448142 4457739 4467891 4477858 4487019 4495354 4503272 4511045 4518610 4525872 4532863 4539544 4545840 4552082
57171 4552082 4558948 4566633 4574452 4581761 4588921 4596715 4605023 4612848 4619587 4625656 4631706 4637909 4644134 4650216
57157 4650216 4655724 4660022 4662933 4664927 4666317 4666697 4665647 4663566 4661281 4659015 4656259 4652554 4647971 4642805
57143 4642805 4637165 4630956 4624081 4616709 4609489 4603385 4599033 4596356 4594996 4594963 4596517 4599485 4603040 4606165
57129 4606165 4608129 4608608 4607750 4606284 4605275 4605631 4607983 4613068 4621975 4635793 4655099 4679895 4710003 4745500
57115 4745500 4786954 4835474 4892573 4959958 5039395 5132791 5242482 5371566 5524071 5704843
57105 5704843 5919417 6174229 6476993 6836671 7262951 7766051 8357332 9049915 9858222
57096 9858222 10796716 11879052 13118065 14525617 16111338 17880539 19832278 21958243
57088 21958243 24242587 26662606 29189969 31791975 34431815 37066467 39641644 42085902
57080 42085902 44308792 46207016 47677365 48630644 49001667 48755234 47890411 46443113 44484143
57071 44484143 42110963 39435173 36569783 33619238 30673223 27804181 25067724 22504318
57063 22504318 20140726 17991025 16058112 14336188 12813517 11474595 10301714 9276431
57055 9276431 8380974 7599129 6916435 6319952 5798072 5340514 4938439 4584436 4272236
57046 4272236 3996334 3752007 3535632 3344644 3176741 3029206 2899268 2785091 2686048 2601947
57036 2601947 2532309 2476310 2432540 2397936 2367002 2332867 2289788 2234986 2168547 2092249 2008823
57025 2008823 1921909 1835779 1754190 1679020 1609936 1545631 1485552 1430394 1381032 1337306 1298131
57014 1298131 1262475 1229808 1199666 1171394 1144572 1119307 1095737 1073436 1051653 1030145 1009437
57003 1009437 990196 972560 956156 940630 926029 912695 900884 890525 881342 873220 866386 861220
56991 861220 857909 856302 856051 856778 858156 859999 862334 865251 868504 871224 872142 870223 865154 857304 847287
56976 847287 835648 822874 809563 796408 783954 772414 761821 752372 744533 738741 735033 733057
56964 733057 732484 733324 735835 740145 746034 752965 760213 766965 772383 775647 775995 772885 766254 756600 744664
56949 744664 731062 716403 701724 688432 677504 668866 661762 655736 650996 647946 646726 647383 650195
56936 650195 655523 663402 673549 685685 699472 713969 727384 737655 743258 743413 737792 726484 710306
56923 710306 690767 669481 647678 626344 606468 588754 573180 559170 546236 534255 523240
56912 523240 513225 504425 497136 491276 486287 481771 477949 475210 473352 471634 469617 467666 466543 466688
56898 466688 467998 470120 472782 475842 479195 482798 486864 491906 498390 506325 515273 524731 534271 543266
56884 543266 550800 556089 558888 559358 557675 554003 548673 542177 535129 528435 523282 520538 520178 521606 524551
56869 524551 529375 536575 546352 558699 573500 590416 609011 629099 650649 673118 695066 714528
56857 714528 729527 738275 739567 733486 721528 705684 687552 668482 650101 634007 621092 611647
56845 611647 606131 605281 609413 618097 630738 647179 667641 692443 721919 756176 794457 834712
56833 834712 873832 908181 934078 948477 949828 938428 915946 884816 848096 809276 771428 736410
56821 736410 705058 678024 656080 639699 628815 623169 622634 627063 636061 649101 665812 685970
56809 685970 709123 734086 758712 780252 796172 804694 804673 795411 777091 751347 720968 688813
56797 688813 657040 627103 599923 575874 554990 537457 523681 513839 507721 505172 506239 510652
56785 510652 517625 526596 537681 550784 564469 576389 584752 588801 587954 581344 568679 551089 530637
56772 530637 509149 487688 466860 447200 429211 413195 399084 386493 375137 365190 356978 350268
56760 350268 344184 338016 331829 326057 320786 315775 311022 306892 303671 301268 299404 297873 296498 294999
56746 294999 293100 290763 288260 285926 283881 282035 280359 278962 277838 276765 275625 274612 273825 272905 271510
56731 271510 270021 269148 268813 268087 266522 264902 264273 264726 265633 266601 267586 268371 268633 268480 268336 268344 268345 268361 268596
56712 268596 268997 269334 269711 270472 271555 272486 273088 273638 274214 274460 274288 274233 274717 275363 275508 275077 274508 274011 273348
56693 273348 272307 271033 269840 268877 268043 267153 266278 265833 266138 266889 267391 267411 267458 267998 268741 268985 268354 266933
56675 266933 264941 262702 260726 259378 258552 257976 257732 258108 259021 259990 260641 260892 260712 260127 259507 259402 259925
56658 259925 260652 261253 261868 262654 263373 263740 263960 264504 265476 266581 267739 269342 271693 274364 276413 277289 277395
56641 277395 277657 278553 279688 280302 280076 279351 278634 278116 277653 277063 276325 275521 274692 273835 273032 272510 272429 272588 272555
56622 272555 272240 272121 272600 273224 272956 271334 269021 267025 265664 264596 263620 262969 262803 262809 262487 261673 260641
56605 260641 259786 259280 258933 258350 257369 256369 255949 256239 256737 256945 256944 257146 257663 258258 258775 259261 259618 259500 258707
56586 258707 257428 256005 254629 253411 252518 252076 252063 252398 252980 253549 253755 253544 253356 253706 254716 256132 257618
56569 257618 258892 259871 260908 262641 265302 268458 271778 275735 281001 287298 293459 298654 302968 306668
56555 306668 309511 311088 311448 311053 310393 309852 309635 309565 309157 308076 306283 303681 300062 295606 291013 286824
56539 286824 282982 279381 276402 274412 273086 271825 270646 270076 270218 270485 270283 269502 268311 266953 265849
56524 265849 265468 265831 266395 266568 266167 265332 264228 262926 261418 259719 258102 257126 257098 257580 257787 257470 257064
56507 257064 256897 256733 256280 255724 255434 255427 255484 255581 255880 256353 256741 256877 256820 256623 256183 255378 254249 253052 252159 251898
56487 251898 252352 253240 254015 254177 253651 252927 252678 253082 253577 253492 252864 252409 252684 253533 254426 255055 255450 255787 256284
56468 256284 257124 258282 259511 260642 261771 263010 264272 265510 266959 268770 270474 271227 270732 269615 268741
56453 268741 268369 268181 267918 267678 267612 267675 267811 268135 268653 268918 268352 267055 265986 266029 266990 267812 267694 266698 265283
56434 265283 263771 262465 261850 262174 262988 263587 263848 264176 264605 264524 263589 262492 262292 263156 264230 264804 265128 265855
56416 265855 267019 267914 267933 267260 266694 266923 268020 269490 270765 271688 272538 273592 274729 275551 275816 275661 275424
56399 275424 275376 275589 275970 276387 276831 277419 278206 279037 279680 280030 280123 280080 280225 281052 282746 284717 286022 286347 286348
56380 286348 286908 288276 289986 291336 291837 291510 290981 291016 291753 292605 293071 293346 293902 294818 295834 296751 297421 297623
56362 297623 297414 297387 298058 299152 299987 300470 301181 302519 304287 306114 307758 308921 309409 309681 310687 312827
56346 312827 315463 317679 319122 319882 320068 319897 319796 320001 320361 320930 322356 325133 328691 331839 334035 335685
56330 335685 337219 338494 339310 339989 341084 342743 344647 346453 348104 349747 351489 353220 354619 355436 355794
56315 355794 356148 356892 358081 359482 360727 361399 361258 360645 360509 361697 364173 367132 369954 372792 376075 379773
56299 379773 383468 386983 390460 393872 396936 399686 402610 405895 408958 411212 413035 415417 418723 422378
56285 422378 425800 429157 433063 437893 443505 449276 454413 458673 462895 468365 475475 483452 491565 500009
56271 500009 509192 518725 527893 536885 546873 558819 572740 588165 604841 622810 642235 663497
56259 663497 687222 713924 743630 776059 811206 849664 892332 939790 991990 1048539 1109267
56248 1109267 1174374 1244017 1317845 1394934 1474103 1554161 1633900 1711824 1785954 1854069 1914353
56237 1914353 1965700 2007209 2037553 2055261 2059618 2050918 2029915 1997579 1955491 1905786 1850226 1789640
56225 1789640 1724682 1656688 1587337 1517793 1448736 1381057 1315861 1253816 1195003 1139507 1087777
56214 1087777 1040312 997326 958694 923866 891828 861568 832777 805857 781281 759220 739804
56203 739804 723221 709288 697300 686575 676984 668689 661534 655012 648754 642817 637429 632722 628804
56190 628804 625853 623865 622322 620496 618294 616557 616167 616980 618040 618847 619891 621827 624600 627708 630888
56175 630888 634200 637746 641731 646447 651745 656806 661001 664799 669284 674895 681181 687695 694531 701941
56161 701941 710053 719044 729069 739956 751512 764277 779338 797177 817265 839135 863350 891006
56149 891006 922817 959194 1000846 1048655 1103032 1163860 1230946 1303984 1381893 1462522 1543066
56138 1543066 1620628 1692488 1756358 1810906 1856302 1894266 1927392 1957891 1986458 2012125 2033185
56127 2033185 2048299 2056896 2059000 2055050 2045892 2032522 2015464 1994152 1966855 1931369 1886184 1831312
56115 1831312 1768220 1699177 1626847 1554274 1484627 1420479 1363336 1313881 1272424 1238789 1211997
56104 1211997 1190517 1173044 1158967 1148116 1140291 1135141 1132334 1131640 1132848 1135717 1140038 1145692 1152613
56091 1152613 1160696 1169748 1179466 1189480 1199504 1209522 1219740 1230297 1241081 1251994 1263304 1275434
56079 1275434 1288389 1301667 1314887 1328212 1341974 1356133 1370411 1384784 1399587 1415185 1431795
56068 1431795 1449510 1468214 1487565 1507317 1527640 1548922 1571320 1594703 1618864 1643521 1668289
56057 1668289 1693084 1718483 1745241 1773420 1802396 1831717 1861512 1891954 1922891 1954317 1986761
56046 1986761 2020707 2055826 2091271 2126716 2162753 2200181 2239204 2279504 2320954 2363981 2409148
56035 2409148 2456490 2505493 2555759 2607473 2661076 2716630 2773739 2832133 2892098 2954224 3018797
56024 3018797 3085583 3154271 3225092 3298825 3376088 3456775 3540430 3627078 3717338 3811726 3910260
56013 3910260 4012871 4119793 4231331 4347587 4468674 4594975 4726941 4864855 5008859
56004 5008859 5159038 5315490 5478773 5650324 5831819 6023977 6226571 6439765 6664636
55995 6664636 6902142 7152522 7416342 7695319 7991424 8305932 8640081 8995927 9375755
55986 9375755 9781420 10215177 10680431 11180672 11718492 12296719 12919862 13593327 14322162
55977 14322162 15112084 15971134 16908925 17935118 19060572 20299802 21670874 23193843
55969 23193843 24891731 26793450 28934777 31357811 34112639 37260628 40875574 45043741
55961 45043741 49867034 55468066 61991879 69603929 78487510 88838380 100852745 114713663
55953 114713663 130583691 148597332 168833707 191252631 215581788 241149967 266708660
55946 266708660 290370010 309811728 322768052 327618220 323798165 311879239 293349281
55939 293349281 270230101 244657242 218519886 193240053 169722509 148432916 129523762
55932 129523762 112950701 98561495 86155570 75515305 66419406 58652979 52018223
55925 52018223 46340030 41465527 37263382 33624470 30459906 27696139 25271579 23135719
55917 23135719 21247367 19571587 18078475 16743826 15548406 14475454 13509493 12636991
55909 12636991 11846555 11128191 10473343 9875252 9327962 8825121 8360833 7931197 7533623
55900 7533623 7164979 6821867 6502324 6205565 5930075 5673504 5434356 5212150 5005683
55891 5005683 4812630 4631081 4459995 4297709 4141409 3988763 3839247 3693595 3553008
55882 3553008 3419075 3293155 3175149 3063709 2958068 2858777 2766242 2679514 2597132 2518328
55872 2518328 2442765 2369753 2298465 2228621 2160569 2094962 2032563 1973918 1918987 1867359 1818749
55861 1818749 1772783 1728461 1684648 1641212 1598947 1558296 1518909 1480641 1444110 1409903 1377920
55850 1377920 1347770 1319113 1291239 1263091 1234258 1205450 1177599 1150984 1125577 1101622 1079264
55839 1079264 1058024 1037169 1016433 996090 976570 958225 941067 924480 907584 890221 873256
55828 873256 857670 843662 830848 818873 807396 795839 783593 770479 756823 743203 730156
55817 730156 717856 705948 693942 681844 670139 659181 648966 639564 631297 624291 618202 612554
55805 612554 607102 601853 597078 593300 590776 588943 586882 584454 582480 581605 581497 581392 580998 580629 580831 582092
55789 582092 584623 588296 593013 598970 605970 612516 616319 615852 610920 601831 589077 574105 559335 546578
55775 546578 535976 526989 519744 514798 512121 510992 510385 508843 504512 496207 484354 470400 455603
55762 455603 440910 427456 416259 407425 400261 394084 388514 383298 378412 374121 370325 366070 360366
55749 360366 353313 345843 338564 331540 324982 319244 314081 308712 302837 297014 291885 287556 283898 280814
55735 280814 278007 274994 271637 268271 265123 262053 259041 256432 254371 252374 249845 246701 243188 239370
55721 239370 235251 231184 227736 225113 223062 221428 220599 221200 223332 226232 228747 230187 230677 230705 230542 230175
55705 230175 229593 228824 227761 226179 223987 221303 218302 215144 211986 208873 205683 202418 199490 197432 196228
55690 196228 195160 193450 191009 188505 186789 186221 186491 187030 187620 188507 189923 191661 193286 194587 195663
55675 195663 196664 197597 198227 198013 196376 193385 190076 187728 186766 186612 186555 186453 186492 186648 186655 186431 186303 186701
55657 186701 187660 188715 189387 189692 190001 190462 190920 191438 192355 193572 194215 193543 191937 190465 189623 189020 188199
55640 188199 187165 186034 184711 183111 181340 179473 177465 175325 173072 170445 167115 163310 159824 157098
55626 157098 154674 151863 148717 145946 144024 142754 141728 140877 140365 140120 139721 138904 137979 137445 137170 136327
55610 136327 134372 131762 129374 127489 125816 124258 123042 122102 121027 119759 118732 118124 117482 116457 115424
55595 115424 114948 114966 114915 114466 113720 112836 111856 110827 109827 108920 108295 108336 109310 111037 113008 114760 116044 116933
55577 116933 117978 119967 123209 127160 131103 134981 139185 143676 147747 150702 152305 152515 151238 148645
55563 148645 145392 142168 139068 135651 131602 127188 123055 119739 117343 115590 114087 112579 111027 109473
55549 109473 107884 106196 104539 103316 102847 102850 102490 101177 99266 97782 97464 98224 99505 100848 102069 103152
55533 103152 104192 105291 106350 107096 107425 107580 107811 107995 107829 107285 106643 106121 105682 105247 104831 104455 104111 103905
55515 103905 104026 104350 104256 103139 101162 99220 97983 97199 96175 94762 93414 92306 90957 89053 87193
55500 87193 86311 86573 87325 87927 88078 87426 85670 83291 81528 81195 81898 82756 83439 84061 84514 84557 84383 84475 84875
55481 84875 85081 84717 83935 83050 82169 81315 80628 80254 80167 80107 79616 78289 76281 74537 74123 75189 76845 78081
55463 78081 78506 78172 77111 75423 73586 72275 71731 71532 71057 70194 69523 69742 70886 72209 72938 73011 72932 73001
55445 73001 72989 72591 71901 71283 70940 70760 70495 70027 69543 69481 70144 71336 72526 73364 73864 74071 73924 73588 73614
55426 73614 74392 75560 76295 76233 75867 75993 76920 78260 79339 79695 79365 78827 78638 78990 79562 79896 79898 79885 80070
55407 80070 80164 79656 78485 77176 76227 75603 75000 74387 74000 73941 74123 74545 75224 75873 76065 75838 75707 75894 75967
55388 75967 75567 75089 75130 75529 75518 74771 73790 73202 73140 73403 73780 74028 73952 73762 74023 74961 76088 76832 77222 77629
55368 77629 78025 78050 77691 77361 77242 76998 76337 75466 74732 74152 73603 73266 73451 74050 74542 74608 74475 74514 74702 74658
55348 74658 74089 73078 71949 71016 70435 70198 70201 70298 70370 70373 70403 70652 71260 72124 72913 73335 73417 73472 73692 73863 73603
55327 73603 72961 72561 72916 73727 74203 74087 73954 74279 74620 74178 73002 72084 72198 73056 73778 73815 73204 72232 71233
55308 71233 70545 70286 70162 69773 69081 68392 67884 67490 67306 67791 69260 71266 72798 73216 72842 72520 72732 73341
55290 73341 74112 75100 76328 77363 77630 77072 76155 75197 74094 72864 72016 72046 72791 73695 74507 75328 76057 76263
55272 76263 75692 74583 73397 72560 72481 73426 75094 76621 77339 77415 77468 77686 77627 76902 75774 74947 74825 75093 75047
55253 75047 74323 73270 72580 72619 73238 74115 74956 75299 74569 72699 70552 69305 69417 70448 71836 73436 75196
55236 75196 76678 77303 76955 76074 75191 74556 74215 74144 74167 73864 72860 71274 69785 69093 69275 69735 69829 69489 69205
55217 69205 69442 70183 71028 71617 71895 72047 72270 72646 73134 73628 73932 73788 73053 71945 71019 70779 71282 72176 73025
55198 73025 73562 73741 73784 74113 75002 76184 77023 77147 76753 76233 75742 75334 75253 75734 76614 77434 77915 78101 78043 77662
55178 77662 76975 76205 75537 74933 74276 73512 72566 71362 70066 69190 69250 70376 72241 74241 75703 76206 75963
55161 75963 75728 76184 77379 78793 79748 79723 78662 77232 76504 77010 78182 78943 78706 77569 75881 74081 72760
55144 72760 72295 72371 72369 72251 72611 73747 75206 76449 77443 78299 78798 78732 78397 78293 78458 78490 78105 77372 76494 75594
55124 75594 74661 73490 71879 70132 69175 69733 71458 73211 74180 74452 74591 75055 76071 77626 79406 80969
55108 80969 82098 82820 83010 82313 80675 78817 77896 78624 80704 83071 84677 85130 84699 83830 82823 81927 81444
55091 81444 81482 81797 82129 82566 83294 84146 84724 84918 84898 84698 84233 83789 83975 85000 86355 87461 88237 88764 88770
55072 88770 87898 86355 84909 84248 84545 85542 86796 87886 88605 88997 89110 88788 87875 86514 85069 83758 82533
55055 82533 81325 80233 79453 79094 79039 78977 78673 78239 78029 78186 78444 78450 78144 77741 77550 77915 79033 80542 81553
55036 81553 81479 80701 80078 79940 79967 79987 80274 80902 81306 80881 79827 79028 79116 79851 80444 80383 79964 79959 80722 81701 82051
55015 82051 81670 81253 81274 81350 80837 79768 78776 78296 78249 78432 78828 79434 80038 80293 79878 78641 76822 75146 74387
54996 74387 74698 75513 76186 76559 76859 77289 77870 78547 79271 80080 81133 82512 83908 84726 84696 84191 83813 83838 84280
54977 84280 85227 86705 88367 89727 90709 91590 92384 92727 92507 92140 92008 91967 91735 91415 91331 91562 92007 92648 93341
54958 93341 93570 92937 91836 91080 90836 90461 89510 88384 87757 87877 88745 90490 92926 95058 95686 94629 92913
54941 92913 91669 91229 91343 91814 92548 93191 93171 92205 90646 89231 88497 88412 88554 88625 88744 89224 90138 91292 92598
54922 92598 94275 96498 98988 101175 102881 104655 107258 110800 114558 117733 120289 122909 126154 129840
54908 129840 133193 135434 136109 135055 132344 128294 123498 118720 114682 111723 109592 107666 105557 103382
54894 103382 101424 99707 98123 96788 95902 95327 94656 93774 93072 92947 93408 94275 95432 96640 97436 97656 97896
54877 97896 99000 101119 103665 106184 108799 111671 114501 116990 119438 122423 125965 129392 132040 133744
54863 133744 134600 134580 133575 131586 128702 125048 120926 116842 113206 109998 106893 103679 100492 97684 95576
54848 95576 94258 93504 92865 91969 90777 89525 88407 87445 86650 86248 86553 87550 88643 89098 88878 88877 90001 92021
54830 92021 93632 93816 92827 91681 90952 90397 89581 88465 87372 86691 86672 87215 87773 87675 86705 85312 84205 83867
54812 83867 84366 85417 86509 87160 87217 86932 86766 87108 88040 89176 89868 89812 89445 89511 90275 91330 92109 92350 92200
54793 92200 92145 92735 93947 94955 95031 94622 94832 95745 96113 95139 93737 93278 93652 93542 92393 91076 90542 90742
54775 90742 91239 92127 93760 95974 98176 100061 101824 103747 105900 108244 110730 113263 115738 118212 120890
54760 120890 123849 126849 129510 131667 133472 135124 136535 137366 137302 136232 134207 131432 128326 125310 122427
54745 122427 119393 116108 112934 110281 108212 106667 105753 105358 104711 102935 100137 97511 96172 96159 96740 97327
54729 97327 97811 98234 98544 98778 99301 100649 103012 105917 108569 110595 112331 114298 116629 119173 121899 124877
54713 124877 127994 131014 133852 136421 138310 139014 138438 136823 134229 130618 126472 122721 119876 117670 115795
54698 115795 114416 113573 112567 110572 107667 104771 102631 101288 100443 99931 99647 99354 98730 97603 96125 94715
54682 94715 93705 92968 92017 90598 89073 88098 88044 88771 89804 90675 91298 92052 93230 94364 94512 93439 92078
54665 92078 91479 91694 92074 92303 92520 92641 92246 91205 89910 88822 88197 88223 88893 89674 89823 89213 88435 87952
54647 87952 87654 87466 87778 88826 90052 90710 90874 91248 92048 92633 92406 91626 91031 90926 90922 90489 89587 88786 88830
54628 88830 89973 91600 92602 92322 91171 90195 90024 90371 90562 90307 89816 89377 89092 89004 89177 89604 90184 90867
54610 90867 91648 92422 93046 93536 93965 94104 93524 92247 90988 90494 90808 91451 92103 92775 93482 94118 94646 95117
54592 95117 95509 95713 95598 94920 93426 91399 89840 89601 90454 91480 92240 92920 93390 92958 91433 89739 88992
54575 88992 89372 90326 91436 92553 93463 94040 94590 95455 96322 96445 95624 94548 94092 94527 95496 96448 97053 97420
54557 97420 97972 98914 99847 100116 99579 98813 98545 99044 100008 100863 101166 100920 100510 100214 99937 99612 99649 100521 102022
54538 102022 103380 104216 104943 106079 107558 108916 109804 110106 109870 109419 109238 109475 109686 109391 108692 108137 108095 108479
54520 108479 108939 109102 108756 108011 107185 106394 105437 104285 103433 103425 104171 105066 105637 105788 105554 105084 104802 105141 106031
54501 106031 106918 107347 107199 106464 105237 103972 103266 103198 103310 103393 103819 104776 105706 105969 105760 105880 106729 107985
54483 107985 109131 109898 110202 110087 109803 109653 109730 110008 110603 111668 113039 114306 115226 115865 116303 116505 116474 116281
54465 116281 115948 115560 115418 115770 116450 117127 117870 118971 120171 120600 119748 118082 116442 115219 114445 114249 114730
54448 114730 115565 116210 116421 116279 115824 115009 113916 112740 111656 110926 110950 111791 112806 113178 112810 112307 112122 112178
54430 112178 112348 112784 113511 114116 114173 113771 113351 113206 113375 113863 114653 115584 116404 116969 117244 117191 116776 116112 115409
54411 115409 114834 114477 114479 115001 116039 117320 118448 119100 119115 118549 117791 117552 118406 120150 121815 122622 122924 123796
54393 123796 125614 127481 128358 128443 128906 130411 132412 133936 134565 134437 133725 132477 130797 128859 126756 124489
54377 124489 122078 119666 117629 116624 117243 119416 122236 124578 125898 126408 126642 126967 127408 127762 127850 127666
54361 127666 127237 126456 125282 124108 123599 124006 124860 125543 125908 126121 126177 125974 125717 125757 125928 125474 123932 121897
54343 121897 120619 120814 122037 123321 124277 125337 126934 128761 130177 131205 132635 134974 137681 139745 140750
54328 140750 141003 140826 140210 139154 137909 136665 135283 133498 131284 128920 126861 125520 124963 124733 124232 123468
54312 123468 123179 123949 125272 125841 124839 122744 120729 119475 118774 118187 117698 117572 117874 118418 119095 119840 120314
54295 120314 120059 119115 118137 117608 117239 116495 115460 114731 114549 114553 114443 114444 114919 115790 116498 116411 115235 113362 111836
54276 111836 111603 112586 113791 114513 115068 116087 117487 118578 118955 118749 118146 117268 116590 116855 118259 120058 121330
54259 121330 121917 122358 123117 124188 125326 126295 126915 127139 127176 127359 127794 128298 128690 128969 129100 128825 127891 126428
54241 126428 124950 123892 123224 122512 121451 120295 119644 119716 119938 119517 118372 117202 116533 116087 115344 114437 114015
54224 114015 114291 114725 114743 114379 114020 113856 113880 114191 114933 115942 116727 116907 116580 116166 115928 115643 114889 113675 112673
54205 112673 112575 113276 114009 114309 114455 114843 115357 115733 116138 116900 117804 118227 117954 117414 117020 116746 116494 116443 116781
54186 116781 117321 117615 117312 116280 114640 112908 111805 111612 111826 111705 111108 110580 110673 111456 112646 113894 114821
54169 114821 115058 114525 113654 113068 112922 112749 112175 111624 111934 113164 114228 114102 113139 112679 113417 114737 115696 116080
54151 116080 116195 116165 115978 115892 116187 116572 116365 115379 114251 113696 113723 113781 113504 113094 112955 113134 113277 113147 113050 113541
54131 113541 114745 116263 117768 119280 120668 121331 120901 119956 119466 119589 119611 119043 118198 117536 117127 117047 117703 119223
54113 119223 120953 122109 122657 123027 123229 122893 122095 121438 121163 120805 119962 118958 118405 118520 119160 120188 121395
54096 121395 122352 122813 123111 123710 124418 124530 123836 123057 123052 123890 124906 125421 125221 124571 124061 124267 125174 125985 125887
54077 125887 125125 124949 126255 128497 130266 130881 130989 131563 132669 133569 133799 133677 133671 133700 133372 132691 132155 132153 132583
54058 132583 133091 133451 133571 133344 132718 131922 131483 131964 133599 136071 138695 140989 143097 145509 148383 151349
54042 151349 153980 156171 158029 159778 161911 165047 169245 173781 177985 182027 186406 190907 194696 197434
54028 197434 199649 201878 203982 205547 206491 207045 207516 208355 210022 212448 214947 216978 218685 220361 221775
54013 221775 222560 222945 223545 224396 224690 223488 220405 215682 209973 204055 198400 192985 187726 182891 178802
53998 178802 175330 172161 169387 167227 165284 162829 159946 157607 156272 155096 153070 150398 148127 146792
53984 146792 146108 145755 145730 145859 145650 144839 143744 142846 142287 141851 141226 140196 138830 137603 137116 137542 138458 139270
53966 139270 139669 139653 139341 138942 138805 139323 140709 142862 145416 147934 150103 151739 152723 153116 153397 154258 155977
53949 155977 158127 160192 162264 164772 167690 170471 172800 174931 177124 179196 180929 182599 184730 187425
53935 187425 190251 192723 194754 196701 199048 201969 205090 207848 210126 212293 214542 216557 218085 219512
53921 219512 221466 224081 227074 230414 234366 238906 243597 248171 252797 257570 262088 265778 268374 269863
53907 269863 270204 269395 267694 265572 263447 261530 259742 257749 255277 252445 249538 246399 242449 237526 232297
53892 232297 227467 222953 218376 214067 210885 209019 207629 205830 203524 200985 198189 194992 191711 189023
53878 189023 187328 186428 185784 184867 183414 181595 179958 179037 178976 179530 180281 180852 181201 181839 183503 186388 189936
53861 189936 193670 197938 203436 210174 217409 224445 230871 235930 238372 237377 233370 227545 220863 213833
53847 213833 207012 201144 196664 193334 190579 188158 186475 186205 187476 189412 190649 190441 189097 187275 185128
53832 185128 182434 179358 176606 174736 173594 172515 170921 168685 166118 163757 162012 160908 160185 159627 159221
53817 159221 159030 159108 159585 160679 162544 165137 168180 171189 173684 175584 177372 179634 182436 185423 188457
53802 188457 191728 195158 198195 200540 202675 205205 207906 209938 210936 211407 211976 212743 213534 214360 215253 215891
53786 215891 215786 214879 213691 212795 212182 211171 208991 205569 201758 198677 196753 195503 194262 192900 191720
53771 191720 190845 189959 188551 186243 182958 179068 175363 172620 171011 170025 169047 167863 166603 165384 164231
53756 164231 163230 162500 161979 161369 160394 159062 157613 156292 155259 154678 154762 155637 157123 158682 159713 160036
53740 160036 160082 160508 161579 162972 164224 165238 166218 167243 168119 168696 169145 169840 171046 172797 174932 177157
53724 177157 179130 180644 181750 182722 183914 185587 187712 189920 191871 193711 195911 198505 200756 201902
53710 201902 202117 202362 203362 205070 207141 209534 212482 216138 220419 225047 229546 233460 236734 239723 242650
53695 242650 245129 246439 246249 245039 243853 243600 244384 245450 245956 245843 245766 246115 246477 246260 245496 244695 244092
53678 244092 243445 242492 241311 240214 239578 239657 240269 240685 240211 238949 237720 237174 237164 237063 236461 235480 234579 234157
53660 234157 234234 234452 234446 234157 233717 233234 232896 233091 233967 234912 234938 233764 232221 231492 232153 234014 236509 239028
53642 239028 241143 242767 244034 244950 245383 245452 245585 246031 246638 247338 248586 250977 254543 258668 262566 265658
53626 265658 267685 268822 269654 270845 272767 275449 278680 282009 284900 287187 289322 292012 295647 300180
53612 300180 305307 310585 315552 320006 324114 328050 331682 334800 337473 339924 342180 344086 345502 346306
53598 346306 346388 346003 345896 346646 347946 348895 348913 348033 346455 344385 342365 341183 341131 341604 341611 340606 338806 336987
53580 336987 335989 336114 336877 337552 337907 338208 338604 338999 339527 340577 342134 343544 344216 344196 343763 342808 341055 338687
53562 338687 336380 334765 334090 334273 334949 335544 335558 334844 333587 332116 330869 330314 330715 332046 334232 337292
53546 337292 341120 345318 349509 353695 358171 363151 368582 374152 379483 384603 390372 397999 407785 418604
53532 418604 429007 438673 448473 459417 471938 485927 500866 515918 530445 544576 558977 574108
53520 574108 590101 607247 626007 646389 667774 689593 711809 734657 758309 782973 808783
53509 808783 835264 861303 886120 910024 933878 958019 982087 1005681 1028749 1051436 1073913
53498 1073913 1096307 1118480 1139955 1160433 1180286 1200169 1220187 1239811 1258631 1276807 1294745
53487 1294745 1312790 1331282 1350368 1369502 1387555 1403815 1418537 1432241 1444856 1455976 1465538
53476 1465538 1473581 1479499 1482289 1481626 1478098 1472259 1464066 1453491 1441036 1427220 1412110 1395911 1379559
53463 1379559 1363940 1348704 1332555 1314734 1295564 1275472 1254287 1231845 1208709 1185722 1163175
53452 1163175 1140930 1119126 1098245 1078546 1059907 1042259 1025796 1010680 996846 984262 973108
53441 973108 963551 955520 948905 943852 940675 939442 939801 941259 943561 946742 950889 956046 962427 970496
53427 970496 980629 992676 1006145 1020808 1036870 1054505 1073577 1094035 1116204 1140274 1165709
53416 1165709 1191675 1218032 1245440 1274459 1305057 1337218 1371493 1408452 1447818 1488737 1530912
53405 1530912 1574987 1621688 1670961 1722217 1775119 1829687 1885762 1942757 2000057 2057337 2114391
53394 2114391 2170906 2226676 2281892 2336953 2391958 2446406 2499292 2549426 2595979 2638970 2679034
53383 2679034 2716416 2750383 2780033 2805457 2827500 2846396 2861362 2871668 2877373 2878529 2874354 2863814
53371 2863814 2846627 2823022 2792850 2755766 2712215 2663540 2611059 2555661 2498379 2440570 2383164
53360 2383164 2326191 2269388 2212959 2157469 2103370 2050986 2000693 1952682 1906596 1861604 1816831
53349 1816831 1771723 1726284 1681075 1636761 1593503 1551047 1509549 1469992 1433480 1400288 1369836
53338 1369836 1341436 1314877 1290486 1268896 1250500 1234820 1220561 1206600 1192782 1179432 1166338
53327 1166338 1152780 1138580 1124559 1111680 1100122 1089482 1079586 1070716 1063194 1057170 1052859 1050567
53315 1050567 1050215 1051087 1052434 1054322 1057546 1062606 1069072 1076215 1084001 1093141 1104310 1117758 1133601 1151953
53301 1151953 1172605 1194974 1218607 1243416 1269212 1295453 1321819 1348674 1376467 1404839 1432832
53290 1432832 1459855 1485921 1510867 1533908 1554241 1571811 1587217 1600919 1612695 1621689 1626949 1628051
53278 1628051 1625394 1619893 1612339 1603011 1591749 1578202 1562124 1543598 1522973 1500467 1475950 1449423
53266 1449423 1421530 1393216 1364815 1335892 1306067 1275583 1244863 1213956 1182859 1152055 1122213
53255 1122213 1093390 1065018 1036819 1009297 983018 957642 932045 905451 878208 851347 825574
53244 825574 800862 776917 753726 731495 710298 690038 670741 652685 636224 621646 609133
53233 609133 598645 589743 581711 573920 565959 557441 547997 537614 526722 515702 504411 492380 479381
53220 479381 465632 451641 438137 426011 415862 407462 399961 392743 385806 379202 372499 365187 357460
53207 357460 350122 343645 337613 331238 324160 316604 308960 301505 294391 287665 281280 275277 269946 265557
53193 265557 261903 258334 254450 250582 247384 245018 242959 240640 238094 235861 234329 233255 231957 229954
53179 229954 227465 225293 224180 224229 224872 225334 225148 224390 223484 222761 222157 221428 220692 220526 221323 222655 223575 223613
53161 223613 223217 223122 223490 223878 223854 223362 222464 221025 218924 216470 214382 213208 212830 212657 212247 211648 211081 210505
53143 210505 209671 208593 207745 207664 208390 209390 210088 210377 210511 210577 210348 209803 209536 210208 211621 212742 212848 212248
53125 212248 211601 210921 209750 208131 206813 206412 206795 207419 207869 207913 207403 206363 204964 203274 201322 199540
53109 199540 198690 198993 199618 199497 198522 197538 197258 197609 198070 198173 197639 196478 195154 194273 193851 193175 191694 189824
53091 189824 188550 188347 188784 189136 189114 188962 189074 189649 190595 191660 192684 193748 195019 196427 197603 198168 198096
53074 198096 197777 197668 197863 197988 197616 196829 196238 196281 196611 196381 195178 193451 191935 190902 190205 189882 190335 191796
53056 191796 193828 195588 196563 196998 197547 198554 199654 200126 199654 198680 197917 197589 197320 196719 195812 194812 193761
53039 193761 192628 191576 190732 189798 188285 186282 184569 183704 183280 182509 181372 180640 180701 180960 180793 180662 181612
53022 181612 183746 185884 186946 187104 187209 187549 187814 187962 188341 188856 188736 187473 185582 184068 183451 183638 184423
53005 184423 185660 187057 188171 188607 188058 186395 184040 181983 180975 180754 180504 179974 179689 180026 180609 180788
52989 180788 180350 179570 178891 178710 179191 180131 181232 182504 184103 185824 187228 188361 189759 191502 192840 193112
52973 193112 192588 191968 191545 191395 191922 193507 195814 198143 200325 202654 205051 207010 208355 209376 210114 210191
52957 210191 209522 208526 207391 205753 203444 201010 199050 197516 196091 194838 193956 193280 192556 191975 191865 191982
52941 191982 191672 190673 189324 188031 186955 186164 185627 185065 184235 183437 183280 183900 184789 185440 185719 185597 185038 184329
52923 184329 183979 184005 183801 183072 182401 182423 182917 183324 183784 184821 186175 186853 186569 186247 186621 187008 186152 183942
52905 183942 181560 180036 179299 178746 178120 177557 177190 177100 177399 178018 178461 178143 177064 175930 175542 176137 177302
52888 177302 178351 178727 178269 177314 176509 176319 176621 176883 176760 176455 176369 176523 176521 176133 175713 175899 176980 178701 180598
52869 180598 182293 183483 183993 184033 184202 184877 185684 185879 185292 184568 184322 184356 184003 183057 181994 181306 180948 180533
52851 180533 179803 178748 177490 176243 175260 174625 174175 173734 173324 173012 172715 172371 172145 172158 172038 171159 169451 167661
52833 167661 166644 166528 166779 166863 166648 166346 166330 166933 168144 169452 170180 170034 169221 168175 167308 166972 167309 168054
52815 168054 168711 169053 169336 169886 170679 171449 172079 172724 173592 174822 176483 178434 180097 180637 179641 177639 175723
52798 175723 174611 174156 173739 172881 171368 169142 166483 164183 163013 162871 162794 162041 160867 160048 160047 160955 162857
52781 162857 165655 168633 170747 171503 171202 170410 169593 169272 169901 171308 172619 173058 172556 171443 169917 168156
52765 168156 166630 165817 165708 165950 166400 167206 168303 169155 169174 168311 167160 166459 166448 166693 166666 166425 166512 167177 168013
52746 168013 168501 168667 168936 169582 170601 171958 173674 175676 177764 179686 181145 181955 182351 182960 184204 185847
52730 185847 187306 188203 188459 188130 187502 187049 186896 186523 185487 184288 183914 184524 185148 184878 183854 182819 182119
52713 182119 181488 180589 179468 178481 177911 177613 177059 175862 174251 172775 171627 170566 169566 169154 169906 171802
52697 171802 174243 176485 177961 178437 178132 177666 177669 178406 179715 181269 182892 184632 186440 187829 188228 187805
52681 187805 187494 187741 187674 186188 183608 181460 180627 180619 180768 181167 181966 182590 182367 181458 180496 179679 178825 178005 177498
52662 177498 177360 177518 178102 179212 180601 182054 183799 185996 188120 189521 190351 191255 192202 192386 191335 189522
52646 189522 187792 186734 186613 187256 187825 187323 185640 183672 182229 181303 180542 179934 179711 180000 180884 182453 184551
52629 184551 186798 189030 191270 193084 193580 192496 190812 189760 189509 189372 188985 188661 188673 188862 189032 189267 189725
52612 189725 190465 191556 193026 194645 196013 196978 197693 198219 198347 197974 197423 197200 197505 198091 198551 198675 198530
52595 198530 198253 197848 197309 196928 197215 198311 199654 200496 200657 200523 200456 200550 200964 201969 203501 204933 205636 205648
52577 205648 205638 206263 207638 209250 210283 210162 209024 207583 206406 205401 204194 202876 202122 202491 203743 204942
52561 204942 205188 204262 202706 201368 200814 201017 201482 201610 201059 199933 198705 197895 197778 198315 199276 200278 200878
52544 200878 200899 200667 200646 200788 200642 200243 200373 201537 203079 203893 203767 203351 202934 202139 200987 200307 200534 200849
52526 200849 200228 198920 198048 198018 198172 197974 197683 197656 197767 197908 198467 199791 201513 202912 203735 204339 205108 206049
52508 206049 206888 207379 207577 207942 208992 210709 212447 213603 214166 214461 214596 214430 213893 213019 211773 210140 208374
52491 208374 206927 206112 205919 206069 206120 205711 204899 204179 204037 204578 205665 207155 208796 210097 210595 210215 209268
52474 209268 208306 208005 208724 209895 210296 209409 208164 207825 208484 209318 210023 211100 212738 214400 215791 217436
52458 217436 219789 222331 224098 224741 224607 224025 222990 221455 219628 217948 216842 216334 215859 214738 212924
52443 212924 211029 209524 208301 207105 206028 205315 205068 205320 206050 206851 206988 206168 204940 204008 203461 203046 202822
52426 202822 203054 203696 204502 205519 207002 208899 210880 212849 215034 217562 220294 223149 226288 229950 234250
52411 234250 239120 244294 249514 254932 261028 267802 274317 279426 282721 284318 283996 281311 276573 271031
52397 271031 265836 261301 257277 253679 250385 247129 243953 241445 240123 239788 239846 240148 241128 243116 245748
52382 245748 248179 249803 250749 251638 252842 254098 255000 255750 257142 259801 263722 268502 273640 278542 282662
52367 282662 285969 289027 292333 295696 298474 300319 301461 302339 303128 303656 303715 303496 303616 304598 306331 308253
52351 308253 310033 311820 313903 316529 320090 324955 330831 336675 341671 346077 350833 356559 363358 371297
52337 371297 380508 390863 402037 414008 427103 441428 456610 472267 488426 505285 522834 541019
52325 541019 560046 580194 601317 622819 644092 664826 684812 703751 721451 738059 753834
52314 753834 768723 782338 794350 804672 813251 820021 825284 829840 834310 838427 841352 842691 842811
52301 842811 842172 840785 838610 836067 833741 831722 829553 826789 823310 819172 814455 809353 804254 799620
52287 799620 795858 793259 791959 791924 793076 795413 798965 803710 809676 817062 826108 836778 848677 861322
52273 861322 874515 888421 903273 918911 934578 949278 962451 974213 984899 994496 1002677 1009297
52261 1009297 1014645 1019147 1022922 1025697 1027147 1027264 1026386 1024892 1023025 1021041 1019287 1017819 1015958 1012622
52247 1012622 1007257 1000267 992433 984167 975462 966278 956704 946967 937495 928841 921316 914839 909293 904783
52233 904783 901303 898466 895910 893746 892235 891293 890787 891093 892720 895440 898431 901362 904697 908768 913169
52218 913169 917387 921514 925929 930671 935525 940445 945530 950862 956649 963121 969945 976113 980975 985042
52204 985042 989227 993577 997463 1000800 1004253 1008099 1011688 1014364 1016300 1018026 1019618 1020820 1021625 1022216 1022531
52189 1022531 1022316 1021506 1020219 1018509 1016447 1014315 1012354 1010399 1008073 1005309 1002325 999154 995528 991241
52175 991241 986326 980856 974942 968987 963627 959248 955793 953075 950992 949418 948276 947885 948900 951581
52161 951581 955380 959497 963594 967743 971995 976298 980604 984612 987593 988914 988726 987780 986668 985587 984673
52146 984673 984096 983821 983817 984542 986681 990193 994136 997761 1001428 1006070 1012103 1019261 1027368 1036789 1048066
52131 1048066 1061303 1075993 1091381 1107108 1123578 1141615 1161696 1183647 1207015 1231425 1256497
52120 1256497 1281804 1307177 1332707 1358130 1382403 1404255 1423049 1438867 1451970 1462524 1470668
52109 1470668 1476404 1479404 1479257 1475946 1469907 1461719 1451959 1441176 1429714 1417658 1405320 1393626 1383560
52096 1383560 1375198 1367712 1360398 1353362 1347189 1342303 1338704 1335930 1333202 1329940 1326367 1323304 1321366 1320641
52082 1320641 1321198 1323366 1327292 1332678 1339300 1347471 1357606 1369565 1382761 1396701 1411094 1425582 1439750
52069 1439750 1453377 1466393 1478668 1490037 1500453 1509814 1517716 1523569 1526913 1527356 1524368 1517609 1507576
52056 1507576 1495604 1482970 1470087 1456657 1442408 1427425 1411850 1395534 1378204 1359861 1340881
52045 1340881 1321704 1302514 1283229 1263692 1243845 1223920 1204525 1186338 1169587 1154076 1139918
52034 1139918 1127919 1118803 1112199 1106891 1102007 1097497 1093448 1089600 1085680 1081669 1077411 1072448 1066552 1059989
52020 1059989 1052907 1044935 1035863 1026231 1016556 1006262 994173 980034 964915 949989 935452 920763
52008 920763 905455 889468 872993 856192 838917 820777 801796 782906 765285 749074 733260
51997 733260 717047 700889 685821 672152 659335 646867 634853 623615 613239 603679 595043 587550
51985 587550 581246 575887 571077 566427 561634 556547 551119 545183 538246 529778 519889 509586 500007 491462
51971 491462 483543 476064 469403 463791 458898 454537 451320 450058 450814 453053 456431 460817 465712 470406
51957 470406 474749 479129 483604 487686 491107 494068 496417 497258 495921 492910 489417 486223 483558 481692
51943 481692 481040 481708 483395 485838 489123 493591 499585 507208 516096 525466 534552 542882 550034 555359 558214
51928 558214 558379 556065 551630 545390 537521 527948 516525 503539 489842 476288 463218 450659 438705
51915 438705 427381 416452 405759 395592 386380 378243 371266 365917 362619 361033 360387 360530 362022 365105
51901 365105 369208 373763 378968 385423 393339 402395 411935 420929 428171 433014 435831 437362 437761 436703
51887 436703 434358 431795 430271 430429 432272 435546 439885 444730 449409 453404 456463 458451 459199 458600 456841
51872 456841 454458 452134 450457 449797 450198 451179 451787 451112 448864 445332 440755 434961 427716 419281 410476
51857 410476 402266 395394 390319 387288 386287 386876 388174 389221 389625 389790 390308 391106 391403 390571 388762 386492
51841 386492 383933 380895 377364 373588 369700 365687 361888 359069 357675 357228 356862 356360 356249 356866 357766 358317
51825 358317 358515 358831 359324 359288 357941 355251 352001 349090 346804 344702 342174 339215 336648 335470 336014 337806
51809 337806 340147 342588 344878 346812 348338 349556 350445 350698 349972 348217 345652 342596 339391 336300 333362
51794 333362 330486 327767 325421 323303 320881 317952 315071 312929 311612 310866 310787 311656 313233 314840 316197
51779 316197 317631 319399 321301 323016 324311 324844 324315 323053 321939 321497 321565 322104 323732 326996 331568 336763
51763 336763 342437 348776 355510 362040 368288 374595 380665 385237 387150 386312 383290 378354 371439 362965
51749 362965 354195 346532 340543 335844 331879 328620 326429 325476 325620 326801 329167 332743 337417 343503 351875
51734 351875 362928 375499 387362 396921 404204 410270 416110 422212 428652 435109 440795 444619 445599 443295
51720 443295 438061 430877 422807 414599 406881 400453 395868 392639 389301 384623 378599 372147 366129 360943
51706 360943 356808 353962 352534 352411 353243 354445 355369 355745 355894 356181 356324 355735 354663 354410 355946 358577
51690 358577 360556 360954 360360 359681 358886 357286 354562 351021 347029 342790 338604 334818 331476 328431 325922
51675 325922 324666 325195 327422 330939 335375 340289 345152 349770 354446 359354 364021 367741 370274 371690
51661 371690 371728 369875 366160 361503 357197 354304 353560 355400 359738 365756 372159 377810 382305 385908 388788
51646 388788 390360 389704 386733 382509 378067 373316 367508 360471 352824 345197 337866 331108 325292 320453
51632 320453 316252 312412 308861 305499 302383 300046 298996 298806 298438 297626 297218 297823 298903 299694 300381 301661
51616 301661 303625 305784 307877 310020 312207 314246 316019 317297 317491 316188 313825 311330 309224 307637
51602 307637 307017 308020 310618 314052 317919 322693 328831 335889 342915 349306 354848 359229 362029 363136
51588 363136 362872 361733 360216 358793 357852 357653 358416 360407 363873 369027 376109 385225 396058 407985 420658
51573 420658 434203 448606 463181 477055 490112 503035 516376 529961 543370 556669 570395
51562 570395 585049 600971 618715 639198 663320 691526 723683 758923 795313 829933 859900
51551 859900 883531 900377 910220 912551 907196 894925 876881 853586 825059 791913 755883 719083
51539 719083 682985 648257 615300 584632 556795 531994 509913 489945 471719 455394 441289
51528 441289 429301 418873 409523 401154 393799 387351 381658 376678 372341 368340 364248 359783 355041 350543
51514 350543 346996 344700 343173 341640 339976 338771 338296 337847 336508 334240 331722 329342 326959 324588 322651
51499 322651 321306 320160 318986 318247 318433 319263 320106 321015 322637 325065 327427 328919 329748 330691 332025 333370
51483 333370 334404 335267 336255 337481 338886 340304 341423 341974 342021 341850 341439 340277 337868 334243 329808 324905
51467 324905 319729 314592 309939 306005 302571 299182 295660 292368 289818 287984 286234 284205 282538 282267
51453 282267 283493 285248 286897 289133 293075 298756 305108 311322 317614 324599 332427 340814 349574 358751
51439 358751 368251 377427 385107 390247 392806 393918 394981 396522 398032 398658 397720 394720 389493 382566 375063
51424 375063 367958 361515 355480 349631 344093 339350 336013 334301 333690 333282 332631 331996 331812 332191 332992 334004
51408 334004 334960 335674 336314 337190 338142 338515 338018 337237 337042 337736 339078 340795 342698 344632 346854 350260 355622
51391 355622 362611 370086 377500 385586 395560 408049 423019 440425 460607 484167 511697 543564
51379 543564 579770 620038 664133 711969 763139 816186 868395 916502 957846 991037 1015732
51368 1015732 1031913 1039446 1038197 1028318 1010262 984590 951923 913117 869498 822803 774758 726602
51356 726602 679130 633258 590367 551819 518195 489186 464152 442501 423657 407165 392986
51345 392986 381310 371894 363881 356452 349370 342729 336565 331005 326429 323100 320771 318926 317203 315392
51331 315392 313412 311629 310768 310943 311093 310005 307793 305708 304525 303789 302746 301412 300413 300222 300740 301351
51315 301351 301255 300091 298351 296825 295635 294209 292231 289999 287711 285122 282304 280074 279031 278687 278236
51300 278236 277864 278446 280114 281989 283406 284583 285731 286274 285562 283978 282749 282791 284158 286436 289194 292066
51284 292066 294911 298023 301885 306597 311778 317039 322137 326555 329399 330144 329234 327569 325663 323644 321820
51269 321820 320598 319904 319301 318796 318926 319822 320670 320458 318895 316323 313197 310022 307344 305274 303247 300703
51253 300703 297805 295106 292835 290956 289561 288572 287353 285360 283027 281241 280100 279082 278411 279155 281608
51238 281608 284504 286405 287138 287313 287155 286547 285664 284765 283676 282263 281110 280912 281392 281637 281493 281780 283069
51221 283069 285070 287524 290851 295321 300034 303470 304965 305188 305145 305127 304767 303885 302981 302795 303496 304529 305350
51204 305350 306093 307175 308355 308633 307328 305016 303101 302519 303059 303883 304441 304784 305115 305311 305015 304187 303376
51187 303376 303266 303946 304811 305292 305576 306406 308223 310676 313004 314690 315650 316039 316204 316619 317409 317832 316742
51170 316742 313885 310429 307839 306445 305534 304686 304425 305424 307544 309836 311242 311197 309944 308483 307906 308489
51154 308489 309537 310244 310485 310643 310978 311441 311921 312381 312767 312964 312831 312289 311529 311040 311113 311306 310869 309811
51136 309811 309077 309354 310195 310664 310404 309624 308511 307351 306944 308088 310607 313467 315863 317730 319292 320807
51120 320807 322794 325749 329238 331870 332602 331823 330826 330496 330819 331403 332028 332695 333412 334086 334668 335454 337032
51103 337032 339640 342600 344792 345797 346264 347046 348342 349864 351430 353052 354691 356326 358158 360385 362829
51088 362829 365008 366661 368026 369556 371393 373083 373873 373409 372121 370721 369399 367858 366147 364980 364951
51073 364951 365828 366981 368225 369846 372054 374920 378763 384035 390740 398432 406934 416719 428210 440914
51059 440914 453475 464575 473605 480610 485945 490250 494659 500596 508925 519212 530113 540655 551009
51046 551009 561838 573122 583886 592994 599863 604469 607091 608262 608627 608452 607192 603736 597083 586844
51032 586844 573184 556594 537820 517909 498103 479529 462920 448608 436694 427112 419591 413818
51020 413818 409752 407683 407784 409669 412563 415881 419447 423240 427266 431753 437128 443443 449999 455929
51006 455929 461136 466359 472226 478618 485135 491882 499456 508265 518192 528942 540408 552652 565745
50993 565745 579733 594551 609929 625550 641469 658085 675481 692922 709291 724031 737460
50982 737460 750181 762306 773261 782204 788694 793171 796920 801459 807837 816437 827364 840975 858043
50969 858043 879470 905778 936855 972209 1011435 1054328 1100635 1149971 1202025 1256537 1312863
50958 1312863 1369869 1426517 1482262 1536550 1588220 1635939 1679133 1717978 1752516 1782387 1807628
50947 1807628 1829131 1847954 1864542 1879004 1891818 1903693 1914780 1924391 1931557 1935599 1936143 1932969
50935 1932969 1926149 1916241 1904080 1890167 1874294 1855764 1833898 1808187 1778099 1743078 1702903 1657948
50923 1657948 1608988 1556943 1502885 1447948 1392899 1338011 1283643 1230750 1180459 1133382 1089751
50912 1089751 1049936 1014204 982041 952487 925291 901117 880423 862748 847394 834115 822670
50901 822670 812170 801552 790557 779818 770137 761954 755319 749944 745291 740872 736458 732031 727809
50888 727809 724418 722603 722509 723556 725216 727519 730575 734140 738070 742764 748594 755208 761955 768746 775996
50873 775996 783979 792858 803068 815029 828582 843324 859427 877422 897278 918431 940822 965231
50861 965231 992423 1022596 1055917 1093006 1134541 1180841 1232199 1289247 1352680 1422877 1500038
50850 1500038 1584396 1676090 1775000 1880806 1992935 2110368 2231901 2356713 2484237 2613197
50840 2613197 2741129 2865158 2982937 3092657 3192550 3280840 3356009 3416859 3462676 3493764
50830 3493764 3511706 3518717 3516876 3508226 3495355 3481254 3468540 3459119 3454517 3455925 3463500 3475799 3490157
50817 3490157 3503583 3513179 3515971 3508858 3489124 3454999 3405688 3341034 3261449 3168123 3062873 2947541
50805 2947541 2823779 2693642 2560138 2426811 2296791 2172468 2055778 1948349 1851319 1765382
50795 1765382 1690988 1628140 1576017 1533275 1498814 1471977 1451999 1437724 1427946 1421561 1417271 1413626
50783 1413626 1409749 1405629 1401415 1396687 1390652 1382784 1372974 1361377 1348410 1334686 1320581 1305938 1290297
50770 1290297 1273249 1254408 1233365 1210050 1185035 1159295 1133736 1108936 1085040 1061786 1038925
50759 1038925 1016781 996084 977202 960044 944905 932772 924296 918928 915685 914426 915765 920037
50747 920037 927041 936655 948945 963619 980043 998112 1018679 1042926 1071556 1104655 1141995 1183358
50735 1183358 1228795 1278615 1332904 1391035 1451947 1514898 1579769 1646676 1715560 1786026 1857192
50724 1857192 1927627 1995763 2060334 2120285 2174417 2221587 2261118 2292447 2314370 2325327 2324843 2314373
50712 2314373 2296556 2273961 2248776 2223247 2199818 2180671 2167150 2159512 2157154 2159257 2165233 2174465
50700 2174465 2185628 2196507 2204540 2207316 2202679 2188859 2164830 2130416 2086036 2032616 1971869 1906274
50688 1906274 1838448 1770578 1704442 1641648 1583629 1531592 1486665 1449888 1421902 1402794 1392389
50677 1392389 1390536 1397019 1411341 1432755 1460343 1492996 1529509 1568820 1609908 1651397 1691588 1729109
50665 1729109 1763303 1793831 1820231 1842183 1859983 1874437 1886381 1896565 1905804 1914790 1923678 1932110
50653 1932110 1939703 1946449 1952720 1959101 1966262 1974877 1985640 1999301 2016458 2037269 2061584 2089541
50641 2089541 2121695 2158267 2198428 2240657 2283762 2327192 2370397 2412299 2451722 2488282 2522694
50630 2522694 2556071 2588688 2619139 2644470 2660992 2664994 2653140 2623229 2575481 2513385 2442975
50619 2442975 2370912 2302714 2242002 2190593 2149027 2117248 2094993 2081650 2075913 2075832 2079312 2084504
50607 2084504 2089685 2092821 2091278 2082164 2063339 2034328 1996167 1950297 1897767 1839451 1776555 1710537
50595 1710537 1642768 1574702 1508167 1445014 1386399 1332596 1283426 1238613 1197976 1161673 1130134
50584 1130134 1103417 1080837 1061752 1046439 1035425 1028034 1022526 1017930 1014883 1014145 1015078 1016307 1017361
50571 1017361 1018835 1021246 1024616 1029112 1035252 1043304 1053165 1065026 1079595 1097253 1117486 1139589 1163780
50558 1163780 1191217 1222906 1258716 1297390 1337397 1377884 1418910 1460823 1503455 1546041 1587765
50547 1587765 1628105 1666696 1703317 1738219 1772219 1806238 1841010 1877417 1916831 1960743 2010084
50536 2010084 2065091 2125725 2191988 2263983 2342017 2426631 2518268 2616814 2721602 2831821 2946705
50525 2946705 3065330 3186437 3308422 3429260 3546411 3657052 3758512 3848383 3924309 3984080
50515 3984080 4026082 4049423 4053507 4037774 4002134 3947456 3875432 3788189 3688395 3579621 3466165
50504 3466165 3352343 3241976 3138406 3044642 2963357 2896873 2847184 2815684 2802590 2806568 2825065
50493 2825065 2855005 2893134 2935629 2977526 3012891 3035991 3042490 3029657 2995799 2940201 2863867
50482 2863867 2769934 2662812 2546829 2425691 2302761 2181153 2063356 1951031 1845187 1746378
50472 1746378 1654765 1570324 1493055 1422840 1359252 1301857 1250631 1205590 1166016 1130621 1098721
50461 1098721 1070755 1047314 1028046 1011950 998384 987238 978314 971130 965410 961289 958835 957735
50449 957735 957620 958514 960722 964391 969296 975006 981190 987782 994902 1002571 1010524 1018472 1026540 1035293 1045174
50434 1045174 1056066 1067603 1079888 1093627 1109301 1126399 1143806 1160989 1178458 1196910 1216363
50423 1216363 1236569 1257931 1281400 1307586 1336677 1369310 1406682 1449362 1496609 1547484 1602225
50412 1602225 1661825 1726487 1795114 1866189 1938482 2010773 2081499 2148946 2211519 2267825 2316913
50401 2316913 2358440 2392144 2416950 2430987 2432696 2421613 2397995 2362201 2314875 2257440 2192018
50390 2192018 2120880 2046178 1970063 1894906 1823456 1758710 1703174 1657958 1622827 1597365 1581783
50379 1581783 1576281 1579938 1590675 1606157 1624356 1643341 1661020 1675193 1683583 1683882 1674256 1654012
50367 1654012 1623677 1584481 1537958 1485879 1430099 1372318 1314193 1257513 1203661 1152826 1104319
50356 1104319 1057925 1014452 974667 938350 904951 874620 847783 823999 802248 782355 765231
50345 765231 751496 740715 732310 726308 722499 719599 716279 712751 710433 710144 711455 713775 717035 720990
50331 720990 724757 727724 730456 734088 739086 745049 751417 757852 764109 770099 776051 782222 788502 794680
50317 794680 801046 808307 816921 826845 837906 850038 863049 876508 889889 902525 913353 921105
50305 921105 925023 925272 922666 918232 913051 908123 904069 901092 899255 898649 899292 901144 904277 908648 913622
50290 913622 918135 921613 924437 927328 930602 934243 938239 942356 945940 948609 951031 954496 959758 966789
50276 966789 975501 985802 996530 1005024 1008491 1005730 997246 984021 966869 946915 925963 905947
50264 905947 888213 873425 861767 852949 846337 841587 839110 839533 842677 847415 852607 857889 863469 869545
50250 869545 876111 883040 890024 896582 902412 907625 912420 916674 920116 922743 924753 926170 926842 926767 926132
50235 926132 925109 923953 923244 923564 924903 926813 929306 933245 939706 949261 962007 977925 996945 1018878
50221 1018878 1043414 1069895 1096988 1123048 1147112 1169295 1190002 1209211 1226870 1243560 1260082
50210 1260082 1276491 1291942 1305324 1315576 1321472 1321675 1315136 1301173 1279311 1249660 1213620 1173749
50198 1173749 1132544 1091473 1051281 1012912 977793 947228 921647 900396 882203 865897 850663
50187 850663 835647 819567 801101 779716 755910 730715 705255 680729 658218 638088 619793
50176 619793 602698 587028 573698 563207 555022 548193 542318 537668 534461 532381 530927 530031 530063 531333
50162 531333 533835 537406 541872 546995 552587 558785 565923 574011 582612 591359 600234 609055 617117 623828
50148 623828 629438 634551 639047 642093 643234 642868 641552 639499 637076 635246 634924 636149 638396 641591 646393
50133 646393 653425 662525 672819 683300 693309 702707 711839 721326 731731 743226 755482 767906
50121 767906 780130 792303 804939 818582 833728 850970 870919 893883 919795 948575 980542
50110 980542 1016456 1057192 1103327 1154905 1211516 1272583 1337422 1404985 1473759 1542201 1609213
50099 1609213 1674080 1736236 1795475 1852264 1907283 1960594 2011547 2059352 2103060 2140797 2169648
50088 2169648 2186809 2190609 2180291 2155517 2116847 2066394 2007201 1941737 1871398 1797404 1721584
50077 1721584 1646019 1572281 1501389 1434278 1371972 1315252 1264338 1218896 1178274 1141759 1108735
50066 1108735 1078705 1051154 1025494 1001248 978377 957355 938779 922925 909693 898866 890184
50055 890184 883209 877470 872902 869916 868851 869551 871603 874598 877927 880841 883225 885967 889846 894246
50041 894246 897660 899332 899562 898529 895919 891977 887821 884105 880271 875806 871417 867983 864982 861047
50027 861047 855792 850020 844315 838458 832350 826510 821323 816505 811651 806802 802245 798193 794811 792051
50013 792051 789239 785372 780144 774212 768189 761850 754737 747197 740347 735148 731883 730451 730902 733678
49999 733678 739452 748656 761066 775963 792752 811332 831919 854757 880059 907940 938207 970391
49987 970391 1004129 1039383 1076189 1114208 1152477 1189429 1223285 1252796 1277716 1298405 1315106
49976 1315106 1328012 1337994 1346671 1355388 1364324 1372636 1378969 1381423 1377492 1364775 1342046 1309604 1268726
49963 1268726 1220994 1168110 1112079 1055311 1000286 948868 901925 859734 822652 791156 765372
49952 765372 745007 729719 719141 712461 708537 706695 706961 709244 712679 716164 719182 721713 723622 724562
49938 724562 724258 722481 718874 713090 704937 694095 680056 662810 643444 623625 604593 586933 571028
49925 571028 557096 544935 534237 525234 518498 514043 511132 509084 507771 507190 507088 507345 508283 510163
49911 510163 512649 515146 517552 520314 523796 527860 532071 536150 540259 544965 550912 558423 567454 577896
49897 577896 589714 602538 615264 626418 635096 641436 646115 649489 651419 651758 650643 648138 643940
49884 643940 637749 629807 620630 610220 597993 583602 567491 550484 533302 516774 502021 489861
49872 489861 480168 472252 465660 460207 455609 451748 449154 448434 449207 450357 451509 453470 456836 460961 464992
49857 464992 469388 475603 484330 494719 505310 515313 524951 535029 546237 558506 570864 582057
49845 582057 591319 598385 603034 605129 605152 604157 602845 600909 597547 592417 585824 578157 569517 560001 550090
49830 550090 540641 532557 526446 522392 519874 518024 516238 514689 514196 515522 518801 523577 529299 535760
49816 535760 543224 552198 562933 574923 586991 598058 607864 616808 625180 632841 639608 645552 650656
49803 650656 654457 656395 656422 654968 652288 648131 642163 634438 625277 614807 602901 589607 575502 561522
49789 561522 548445 536482 525278 514312 503441 493146 484146 476709 470444 464822 459751 455441 451893
49776 451893 448939 446801 446199 447650 450859 455048 459641 464407 469255 474284 479901 486425 493595 500925
49762 500925 508532 517130 526961 537108 546147 553228 558287 561493 562932 562768 561333 558855 555145 549646
49748 549646 541920 532245 521791 511952 503344 495589 488142 481130 475216 470813 467719 465437 463575 461971
49734 461971 460656 459837 459701 460140 460696 460913 460798 460934 462062 464474 467853 471774 476297 481898 488862 497001
49718 497001 505991 515636 525601 535177 543706 551125 557776 563610 567887 569764 569104 566675 563636 560805
49704 560805 558237 555383 551668 546946 541499 535723 529848 523838 517473 510640 503612 496863 490604 484716
49690 484716 479264 474811 471979 470861 471074 472185 473833 475739 478047 481521 486914 494088 502185 510639
49676 510639 519626 529495 540261 551742 563554 574585 583049 587793 589461 590005 591099 593291 596359
49663 596359 599835 603144 605872 608207 610790 613757 616096 616157 612792 605910 596165 584319 570863 556128
49649 556128 540751 525947 513023 502470 493706 485911 478888 472924 468135 464442 462019 461174 461679 462698
49635 462698 463609 464420 465112 465093 463804 461519 458918 455990 451978 446518 440281 434280 428996 424426 420581
49620 420581 417492 414890 412315 409600 407083 405269 404340 403999 403826 403805 404388 405864 407830 409537 410695 411605
49604 411605 412548 413496 414453 415543 416599 417165 417218 417373 417986 418589 418733 418940 420051 421882 423286 423550 423087
49587 423087 422708 422877 423796 425514 427623 429317 430162 430538 431078 431967 433033 434240 435795 437939 440842 444570
49571 444570 449003 453973 459567 466033 473290 480880 488553 496527 504837 512802 519551 524843 528883 531478
49557 531478 531965 530101 526571 522330 517710 512467 506576 500664 495597 491854 489448 488278 488300 489327 490962
49542 490962 492932 495298 498142 501202 504132 506984 510107 513548 516955 520141 523450 527455 532575 539055
49528 539055 547009 556269 566441 577195 588300 599304 609538 618623 626618 633560 639219 643625 647530
49515 647530 652013 657817 665232 674211 684252 694549 704760 715396 726949 738691 748765 755355
49503 755355 757430 754562 746713 734352 718437 700170 680894 662041 644641 628913 614659 602015
49491 602015 591369 582626 575126 568452 562791 558349 554880 552026 549689 547814 546200 544888 544379 545053
49477 545053 546606 548376 550087 551865 553719 555435 557000 558768 561038 563664 566213 568504 570861 573809
49463 573809 577481 581378 584787 587438 589617 591755 594039 596336 598206 598906 597692 594302 589137 583012
49449 583012 576850 571377 566653 561893 556263 550016 544468 540642 538351 536841 535855 535702 536685 538990 542822
49434 542822 548142 554432 561304 569200 579106 591652 607033 625683 648347 675365 706474 741704
49422 741704 782081 828904 882045 938522 992212 1035060 1059728 1062448 1044238 1009837 965709 918451
49410 918451 873657 834878 803221 778222 759293 746359 739361 737549 739459 743548 748867 755153 762323
49397 762323 769953 777458 784715 792155 799995 807584 813862 818413 821767 824582 826723 827210 824988 819694
49383 819694 811844 802414 792298 782076 772124 762721 753979 745823 738181 731128 724838 719538 715576 713253
49369 713253 712352 712038 711575 711056 711019 711331 710959 709102 706196 703368 701014 698347 694395 689112 683372 678059
49353 678059 673357 668914 664533 660622 657902 656638 656256 655882 655276 655017 655715 657200 658700 659666 660159 660497
49337 660497 660807 660997 660902 660330 659188 657727 656458 655557 654541 652820 650501 648328 646836 645923 645284 644926
49321 644926 645080 645931 647622 650281 653744 657401 660600 663163 665320 667316 669316 671514 673914 676012 677134
49306 677134 677251 677154 677667 678913 680502 682185 684037 686215 688839 692128 696363 701690 708098 715608 724289
49291 724289 734036 744470 755128 765682 775942 785780 795106 803849 811883 819107 825708 832209 839026
49278 839026 845919 852119 857153 861472 866096 871659 877928 884061 889053 891918 891893 888826 883310 876251 868409
49263 868409 860496 853521 848558 846104 845997 848136 853091 861859 875188 893226 915640 941806 970893
49250 970893 1001821 1033008 1062082 1086125 1102602 1110272 1109245 1100461 1085361 1065878 1044133 1021783
49238 1021783 999698 978347 958278 940081 924136 910771 900606 894361 892128 893026 895787 899572
49226 899572 904015 908625 912612 915465 917462 919317 921401 923487 925134 926098 926445 926625 927503 930013 934526
49211 934526 940678 947924 956157 965647 976492 988344 1000655 1013115 1025833 1039188 1053464 1068584
49199 1068584 1084166 1099774 1115084 1129928 1144368 1158719 1173263 1187863 1201980 1215160 1227356
49188 1227356 1238907 1250457 1262793 1276323 1290552 1304526 1318027 1331931 1347131 1363617 1381123
49177 1381123 1400199 1421905 1446610 1473891 1503681 1536785 1573967 1614862 1657816 1700074 1737809
49166 1737809 1766679 1783323 1786708 1778171 1760574 1737603 1713237 1690908 1672672 1659232 1650698 1647135
49154 1647135 1648315 1653288 1660537 1668813 1677819 1687920 1699083 1710305 1720353 1729052 1737582 1747465 1759403
49141 1759403 1773025 1787421 1801852 1816241 1831168 1847279 1864673 1883012 1902063 1921842 1942200
49130 1942200 1962679 1982824 2002317 2020770 2037853 2053778 2069199 2084342 2098657 2111637 2123595
49119 2123595 2135294 2147198 2159537 2172875 2188082 2205875 2226704 2250973 2279096 2311662 2350023
49108 2350023 2396453 2452949 2519425 2593081 2669478 2744346 2815095 2881451 2944562 3004633 3058703
49097 3058703 3100739 3124220 3125264 3104326 3065697 3015185 2957356 2894276 2826509 2754859 2680904
49086 2680904 2606543 2533995 2466267 2406588 2356831 2316735 2284858 2259882 2240844 2226665 2216104
49075 2216104 2208150 2202218 2197929 2194804 2192138 2189233 2185881 2182485 2179428 2176407 2172728 2168223 2163515 2159322
49061 2159322 2155872 2153015 2150566 2148456 2146856 2146171 2146574 2147603 2148643 2149756 2151478 2153755 2155740 2156863
49047 2156863 2157482 2158241 2159374 2161017 2163495 2166737 2169862 2172026 2173506 2175494 2179093 2184863 2192883 2202640
49033 2202640 2213079 2223411 2233729 2244355 2254717 2263464 2269578 2272883 2273538 2271711 2267838 2262722 2257189
49020 2257189 2251935 2247637 2244799 2243416 2243200 2244175 2246705 2250971 2256803 2264017 2272402 2281332 2289964 2298087
49006 2298087 2306337 2315278 2324612 2333530 2341468 2348270 2353958 2358728 2362918 2366559 2369077 2369770 2368512 2365734
48992 2365734 2361888 2357230 2352091 2346918 2341919 2336837 2331233 2324929 2318233 2311844 2306540 2302761 2300405 2299078
48978 2299078 2298597 2299133 2300875 2303736 2307477 2311956 2317004 2322149 2326779 2330795 2334847 2339651 2345085 2350228
48964 2350228 2354277 2357201 2359440 2361323 2363024 2364892 2367491 2371332 2376735 2383892 2392838 2403396 2415462
48951 2415462 2429450 2446250 2466594 2490481 2517297 2546409 2577561 2610784 2646129 2683673 2723693
48940 2723693 2766527 2812058 2859482 2907866 2956938 3007074 3058587 3111409 3165561 3221500 3279673
48929 3279673 3339873 3401266 3462831 3523622 3582955 3640766 3697691 3754489 3811390 3868095 3924106
48918 3924106 3978779 4031379 4081500 4129266 4174737 4217408 4256779 4293158 4327282 4359370 4389315
48907 4389315 4417745 4445907 4474207 4501613 4526875 4549731 4570480 4589140 4605624 4620223 4633124
48896 4633124 4643802 4651525 4656226 4658157 4656924 4651753 4642776 4631199 4617914 4602625 4584690 4564128
48884 4564128 4541184 4515351 4485597 4451557 4413887 4373346 4330029 4283765 4234872 4184081 4131743
48873 4131743 4077412 4020331 3960225 3897602 3833406 3768497 3703536 3639356 3577249 3518521 3463590
48862 3463590 3411763 3362279 3315521 3272793 3234930 3201627 3172305 3147023 3125982 3108513 3093402
48851 3093402 3080287 3069994 3063182 3059165 3056531 3054605 3053827 3054853 3057862 3062831 3070076 3080146 3093191
48838 3093191 3108655 3125606 3143324 3161478 3179880 3198313 3216742 3235460 3254722 3274252 3293397
48827 3293397 3311904 3330343 3349600 3370058 3391372 3412936 3434422 3455883 3477475 3499240 3521178
48816 3521178 3543394 3565936 3588520 3610746 3632792 3655526 3679551 3704357 3728882 3752783 3776588
48805 3776588 3800614 3824435 3847662 3870627 3893885 3917502 3941346 3965732 3991094 4017046 4042349
48794 4042349 4066003 4088059 4109223 4129805 4149140 4165943 4179288 4189329 4197038 4203104 4207117 4207838
48782 4207838 4204060 4195049 4180425 4160058 4134113 4102935 4066848 4026196 3981610 3933997 3884131 3832330
48770 3832330 3778568 3722908 3665818 3608114 3550521 3493337 3436635 3380784 3326452 3274037 3223401
48759 3223401 3174499 3128013 3085008 3045966 3010542 2978244 2949016 2923072 2900464 2881119 2865155
48748 2865155 2852855 2844208 2838538 2834790 2832271 2831029 2831330 2832865 2834812 2836716 2838961 2842167 2846448 2851536
48734 2851536 2857336 2863846 2870601 2876652 2881210 2884132 2885761 2886546 2886812 2886609 2885692 2883770 2880792 2876936 2872474
48719 2872474 2867835 2863698 2860619 2858603 2857274 2856485 2856441 2857170 2858198 2858971 2859359 2859553 2859588 2859199 2858159 2856595
$$ [...]
##END NTUPLES=NMR SPECTRUM
##END=
