##TITLE=NES1092_ptc170_9886698_P7uslTn7Oq
##JCAMPDX= 6.0         $$ Bruker NMR JCAMP-DX V2.0
##DATA TYPE= NMR SPECTRUM
##DATA CLASS= NTUPLES
##ORIGIN= BRUKER
##OWNER= Administrator
$$ 1.72 TOPSPIN		Version 2.1
$$ 2016-08-28 22:13:34.039 -0500  Administrator@X
$$ Compression mode = diff/dup
##.OBSERVE FREQUENCY= 400.02188249412
##.OBSERVE NUCLEUS= ^1H
##.ACQUISITION MODE= SIMULTANEOUS (DQD)
##.ACQUISITION SCHEME= undefined
##.AVERAGES= 64
##.DIGITISER RES= 22
##SPECTROMETER/DATA SYSTEM= spect
##.PULSE SEQUENCE= noesygpps1d.comp
##.SOLVENT NAME= COFFEE_meoh
##.SHIFT REFERENCE= INTERNAL, COFFEE_meoh, 1, 14.96054
##AUDIT TRAIL= $$ (NUMBER, WHEN, WHO, WHERE, PROCESS, VERSION, WHAT)
$$ ##TITLE= Audit trail, TOPSPIN		Version 2.1
$$ ##JCAMPDX= 5.01
$$ ##ORIGIN= Bruker BioSpin GmbH
$$ ##OWNER= Administrator
$$ $$ E:\/data/COFFEE/nmr/NES1092_ptc170_9886698_P7uslTn7Oq/12/pdata/1/auditp.txt
$$ ##AUDIT TRAIL=  $$ (NUMBER, WHEN, WHO, WHERE, PROCESS, VERSION, WHAT)
(   1,<2016-08-28 22:13:28.851 -0500>,<Administrator>,<X>,<go>,<TOPSPIN 2.1>,
      <created by zg
	started at 2016-08-28 22:01:58.773 -0500,
	POWCHK enabled, PULCHK disabled,
       configuration hash MD5:
       21 0F 79 D6 B3 7B B4 F6 88 20 88 DB 03 48 BD 9F
       data hash MD5: 64K
       CE D3 48 CB 12 98 B4 88 7A A7 2C 2E B4 D5 BA 87>)
(   2,<2016-08-28 22:13:32.023 -0500>,<Administrator>,<X>,<proc1d>,<TOPSPIN 2.1>,
      <Start of raw data processing
       efp LB = 0.3 FT_mod = 6 PKNL = 1 PHC0 = 0 PHC1 = 0 SI = 128K 
       data hash MD5: 128K
       71 7A BE 34 43 0C 34 E0 EF AB 9B EC C3 85 89 DE>)
(   3,<2016-08-28 22:13:32.898 -0500>,<Administrator>,<X>,<proc1d>,<TOPSPIN 2.1>,
      <pk PHC0 = -84.55078 PHC1 = 0 
       data hash MD5: 128K
       CB BC 29 1F 3D 46 81 52 4B E5 CD E1 5D FA AF 6F>)
(   4,<2016-08-28 22:13:33.258 -0500>,<Administrator>,<X>,<proc1d>,<TOPSPIN 2.1>,
      <abs ABSG = 1 
       data hash MD5: 128K
       9D DF 8F 09 1F 96 E1 E1 94 43 7E A7 1D 03 B5 13>)
(   5,<2016-08-28 22:13:33.367 -0500>,<Administrator>,<X>,<proc1d>,<TOPSPIN 2.1>,
      <abs ABSG = 2 
       data hash MD5: 128K
       52 C1 E6 0B D8 48 A7 E2 73 79 94 E3 E2 A0 BE FE>)
(   6,<2016-08-28 22:13:33.445 -0500>,<Administrator>,<X>,<proc1d>,<TOPSPIN 2.1>,
      <abs ABSG = 3 
       data hash MD5: 128K
       1E 1C 41 2E 4E E2 D5 09 AF 44 53 38 93 06 05 07>)
(   7,<2016-08-28 22:13:33.523 -0500>,<Administrator>,<X>,<proc1d>,<TOPSPIN 2.1>,
      <abs ABSG = 4 
       data hash MD5: 128K
       9D 9A C3 DE 1F 31 DA C2 57 5D 63 3D F8 90 61 B0>)
(   8,<2016-08-28 22:13:33.633 -0500>,<Administrator>,<X>,<proc1d>,<TOPSPIN 2.1>,
      <abs ABSG = 5 
       data hash MD5: 128K
       2C C3 DC B8 88 57 44 EC FE 32 6A 31 5E 43 1B 46>)
$$ ##END=
$$ 
$$ $$ hash MD5
$$ $$ 08 C4 EC 8F 30 0B F3 46 7B E7 B0 A4 50 BC 2B 3F
##$RELAX= 
##$RELAX= 
##$RELAX= 
##$RELAX= 
##$RELAX= 
##$RELAX= 
##$RELAX= 
##$RELAX= 
$$ Bruker specific parameters
$$ --------------------------
##$DU= <E:\>
##$EXPNO= 12
$$ [...]
##$TP07= 0
##$TPNAME0= <>
##$TPNAME1= <>
##$TPNAME2= <>
##$TPNAME3= <>
##$TPNAME4= <>
##$TPNAME5= <>
##$TPNAME6= <>
##$TPNAME7= <>
##$TPOAL= (0..7)
0.5 0.5 0.5 0.5 0.5 0.5 0.5 0.5
##$TPOFFS= (0..7)
0 0 0 0 0 0 0 0
##$TUNHIN= 0
##$TUNHOUT= 0
##$TUNXOUT= 0
##$USERA1= <user>
##$USERA2= <user>
##$USERA3= <user>
##$USERA4= <user>
##$USERA5= <user>
##$V9= 5
##$VALIST= <valist>
##$VCLIST= <CCCCCCCCCCCCCCC>
##$VD= 0
##$VDLIST= <DDDDDDDDDDDDDDD>
##$VPLIST= <PPPPPPPPPPPPPPP>
##$VTLIST= <TTTTTTTTTTTTTTT>
##$WBST= 2048
##$WBSW= 25
##$XGAIN= (0..3)
0 0 0 0
##$XL= 0
##$YL= 0
##$YMAX_a= 5743198
##$YMIN_a= -10352918
##$ZGOPTNS= <>
##$ZL1= 120
##$ZL2= 120
##$ZL3= 120
##$ZL4= 120
##$ABSF1= 14.96054
##$ABSF2= -5.597642
##$ABSG= 5
##$ABSL= 3
##$ALPHA= 0
##$AQORDER= 0
##$ASSFAC= 0
##$ASSFACI= 0
##$ASSFACX= 0
##$ASSWID= 0
##$AUNMP= <proc_prof1d_extract.lims>
##$AXLEFT= 0
##$AXNAME= <>
##$AXNUC= <1H>
##$AXRIGHT= 0
##$AXTYPE= 0
##$AXUNIT= <>
##$AZFE= 0.1
##$AZFW= 0.1
##$BCFW= 0
##$BC_mod= 0
##$BYTORDP= 0
##$COROFFS= 0
##$CY= 15
##$DATMOD= 1
##$DC= 0
##$DFILT= <>
##$DTYPP= 0
##$F1P= 0
##$F2P= 0
##$FCOR= 0.5
##$FTSIZE= 131072
##$FT_mod= 6
##$GAMMA= 0
##$GB= 0
##$INTBC= 1
##$INTSCL= 1
##$ISEN= 128
##$LB= 0.3
##$LEV0= 0
##$LPBIN= 0
##$MAXI= 10000
##$MC2= 0
##$MEAN= 0
##$ME_mod= 0
##$MI= 0
##$NCOEF= 0
##$NC_proc= -2
##$NLEV= 6
##$NOISF1= 0
##$NOISF2= 0
##$NSP= 0
##$NTH_PI= 0
##$NZP= 0
##$OFFSET= 14.96054
##$PC= 1
##$PHC0= -84.55078
##$PHC1= 0
##$PH_mod= 1
##$PKNL= yes
##$PPARMOD= 0
##$PPDIAG= 0
##$PPIPTYP= 0
##$PPMPNUM= 2147483647
##$PPRESOL= 1
##$PSCAL= 4
##$PSIGN= 0
##$PYNMP= <proc.py>
##$REVERSE= no
##$SF= 400.020009820057
##$SI= 131072
##$SIGF1= 0
##$SIGF2= 0
##$SINO= 400
##$SIOLD= 131072
##$SPECTYP= <>
##$SREGLST= <1H.CDCl3>
##$SSB= 0
##$STSI= 131072
##$STSR= 0
##$SW_p= 8223.68421052631
##$SYMM= 0
##$S_DEV= 0
##$TDeff= 65536
##$TDoff= 0
##$TI= <>
##$TILT= no
##$TM1= 0
##$TM2= 0
##$TOPLEV= 0
##$USERP1= <user>
##$USERP2= <user>
##$USERP3= <user>
##$USERP4= <user>
##$USERP5= <user>
##$WDW= 1
##$XDIM= 131072
##$YMAX_p= 378796071
##$YMIN_p= -10548
##$CURPLOT= <Network HP LaserJet P1505>
##$CURPRIN= <$Network HP LaserJet P1505>
##$DFORMAT= <normdp>
##$LAYOUT= <+/1D_H.xwp>
##$LFORMAT= <normlp>
##$PFORMAT= <normpl>
##$SURQMSG= 1
$$ End of Bruker specific parameters
$$ ---------------------------------
##NTUPLES= NMR SPECTRUM
##VAR_NAME=  FREQUENCY,     SPECTRUM/REAL,   SPECTRUM/IMAG
##SYMBOL=    X,             R,               I
##VAR_TYPE=  INDEPENDENT,   DEPENDENT,       DEPENDENT
##VAR_FORM=  AFFN,          ASDF,            ASDF
##VAR_DIM=   131072,        131072,          131072
##UNITS=     HZ,            ARBITRARY UNITS, ARBITRARY UNITS
##FACTOR=    0.0627417313425164, 1,          1
##FIRST=     8223.62146879497, 1007,         -50976
##LAST=      0,             3612,            -51157
##MIN=       0,             -10548,          0
##MAX=       8223.62146879497, 378796071,    0
$$ Real data points
##PAGE= N=1
##DATA TABLE= (X++(R..R)), XYDATA
$$ [...]
64036B45938P238P388P156O616N857M762L375J908L84j263k732l611m064m566
64022B74386m978m667l615k655k230j750o12P50J371R20j77j477k816m035m814
64007B43601m937m533l993l615l289k675j847j457j849k272j700l61L05m95j785
63992B09098k135j376m74RM68J370K512L367L772L964M168M395M617M928N487
63977B44170O212O755O884O855P172P919Q665R072R335R801J0444J1025J1523
63964C55832J2124J2856J3599J4369J5397J6915J9033K1736K4846K8130L1653
63953E66490L5922M1514M8630N7246O7403P8946R1107J02906J14046J24953J35789
63942A464952J45905J54512J61465J66884J70295J70648J67099J59382J47476
$$ y = [245938, 253176, 260564, 267720, 274336, 280193, 284955, 288330, 290238, 290622, 289359, 286627, 283016, 278952, 274386, 269408, 264741, 261126, 258471, 256241, 254491, 253879, 254629, 256000, 256920, 256743, 255266, 252450, 248415, 243601, 238664, 234131, 230138, 226523, 223234, 220559, 218712, 217255, 215406, 213134, 211434, 211073, 211378, 210883, 209098, 206963, 205587, 205113, 205122, 205590, 206960, 209472, 212839, 216611, 220575, 224743, 229138, 233755, 238683, 244170, 250382, 257137, 264021, 270876, 278048, 285967, 294632, 303704, 313039, 322840, 333284, 344309, 355832, 367956, 380812, 394411, 408780, 424177, 441092, 460125, 481861, 506707, 534837, 566490, 602412, 643926, 692556, 749802, 817205, 896151, 987258, 1090164, 1204210, 1329163, 1464952, 1610857, 1765369, 1926834, 2093718, 2264013, 2434661, 2601760, 2761142, 2908618]
63933B908618J31501J12098R0577O8187M5294K1460l647k9539n5071p9194j01341
63922C108943j21066j37495j49577j56958j60358j60860j58996j54827j48635
63913A760171j40980j32048j21601j09806r7680q6283p5788o5885n6824m9433
63903H23843m4051l9985l6299l2751k9664k7172k4959k2753k0612j8725j7082
63892E09790j5605j4399j3691j3467j3337j2854j1863j0547r176p946o904n919
63880C74082m754l301j762m42N72J397K133K883L855N068O039O157N541N062N285
63865D07815N763N629M566K908J175j18n45k02J05l84j557k720l598m506n612
63850D08719o568p023p059o959o854o723o523o262o084o267o967q046r293j0572
$$ y = [2908618, 3040119, 3152217, 3242794, 3310981, 3356275, 3377735, 3374088, 3344549, 3289478, 3210284, 3108943, 2987877, 2850382, 2700805, 2543847, 2383489, 2222629, 2063633, 1908806, 1760171, 1619191, 1487143, 1365542, 1255736, 1158056, 1071773, 995985, 930100, 873276, 823843, 779792, 739807, 703508, 670757, 641093, 613921, 588962, 566209, 545597, 526872, 509790, 494185, 479786, 466095, 452628, 439291, 426437, 414574, 404027, 394851, 386905, 380001, 374082, 369328, 366027, 364265, 363823, 364395, 365792, 367925, 370808, 374663, 379731, 385770, 391927, 397468, 402530, 407815, 413578, 419207, 423773, 426681, 427856, 427738, 427193, 426991, 427096, 426712, 425155, 422435, 418837, 414331, 408719, 402151, 395128, 388069, 381110, 374256, 367533, 361010, 354748, 348664, 342397, 335430, 327384, 318091, 307519]
63836C07519j1463j1244r724p906p059p290p611p346o726o114n494m948m840n194
63822B04560n463n256m746m166l480k818k567k722k780k589k572k751k384j105
63808A59161L00R59J026R91O95q8o83l60K77mj154j836j463r97j351k045k040
63791A51388j203k57K77M82N87N91L80l4m78q01j053j359j575j377q62o35r98
63774A43073j441j400j094j065j291j386j407j554j408l94J073J920J894J687
63760A37207J521P90n16j254p06L14P02N69O28P80M26k39l90J50P68J121J469
63743A43340J858J881J486J293J717K347K536K217J736J274P89L73K46M54R01
63728A64448J590K555L455L617K718J370P18J340K759M063M787M998M780M110
$$ y = [307519, 296056, 284812, 275088, 267182, 260123, 252833, 245222, 237876, 231150, 225036, 219542, 214594, 209754, 204560, 199097, 193841, 189095, 184929, 181449, 178631, 176064, 173342, 170562, 167973, 165401, 162650, 160266, 159161, 159461, 160420, 161446, 162437, 163132, 163044, 162361, 162001, 162278, 162274, 161120, 159284, 157821, 156824, 155473, 153428, 151388, 150185, 149928, 150205, 150687, 151274, 151865, 152245, 152211, 151733, 150932, 149879, 148520, 146945, 145568, 144706, 144071, 143073, 141632, 140232, 139138, 138073, 136782, 135396, 133989, 132435, 131027, 130633, 131706, 133626, 135520, 137207, 138728, 139518, 139002, 137748, 137042, 137356, 138058, 138627, 139255, 140035, 140461, 140222, 139832, 139982, 140750, 141871, 143340, 145198, 147079, 148565, 149858, 151575, 153922, 156458, 158675, 160411, 161685, 162474, 162847, 163093, 163547, 164448, 166038, 168593, 172048, 175665, 178383, 179753, 180471, 181811, 184570, 188633, 193420, 198418, 203198, 207308]
63714B07308L188K469K163J964J418L58j044k375l080k844k051j575j849k430
63700B01620k690k563k307j867j035q1L15p0o30n95J59J142J871K210K234K024
63684A99737J722J606J842K191K195J738J242J032Q52L14l57n31r2M22O53Q51
63668B15417J280J758K110K546L115L288K642J628J010P30M1j281k541l111l199
63653B25433l398l865m290m393m114l476k524j474p24n95j004j384j098o6J059
63638A94087J575J456J235J264J423J559J852K581L695M772N401N527N492N727
63624B37646O327O971P336P499P802Q385R097R784J0577J1770J3559J5820J8069
63611C70642J9805K1044K2407K4454K7040K9546L1559L3040L3924L3955L2844
$$ y = [207308, 210496, 212965, 215128, 217092, 218510, 218868, 217824, 215449, 212369, 209525, 207474, 205899, 204050, 201620, 198930, 196367, 194060, 192193, 191158, 191077, 191392, 191322, 190692, 190097, 190256, 191398, 193269, 195479, 197713, 199737, 201459, 203065, 204907, 207098, 209293, 211031, 212273, 213305, 214157, 214471, 214114, 213583, 213491, 213913, 214566, 215417, 216697, 218455, 220565, 223111, 226226, 229514, 232156, 233784, 234794, 235524, 235565, 234284, 231743, 228632, 225433, 222035, 218170, 213880, 209487, 205373, 201897, 199373, 197899, 197175, 196580, 195576, 194192, 193094, 193028, 194087, 195662, 197118, 198353, 199617, 201040, 202599, 204451, 207032, 210727, 215499, 220900, 226427, 231919, 237646, 243973, 250944, 258280, 265779, 273581, 281966, 291063, 300847, 311424, 323194, 336753, 352573, 370642, 390447, 411491, 433898, 458352, 485392, 514938, 546497, 579537, 613461, 647416, 680260]
63600F80260L0267K5792J9389J2102N607Q13k687n470p194p212n952m967n540
63587G35208p741j0880j4364j7886k1145k3820k5677k6516k6188k4894k3337k2210
63575D90550k1471k0366j8272j5386j2437r923p836o004m385k939j475J66J849
63562C72071L236M141M680N139N841P002Q605J0356J1926J3240J4457J5714J7122
63549D93530J8923K1376K4465K7909L1523L5226L8478M0062L8889L4951K9154
63538H34486K2246J4414O100j365o485q902r507r252q366o889n476n113o208q431
63524H01252j1454j5320j9986k4872k9181l2404l4262l4559l3422l1544k9694
63513E04554k8051k6307k4334k2283k0106j7508j4581j2030j0454r713r204q532
$$ y = [680260, 710527, 736319, 755708, 767810, 773417, 774230, 771543, 766073, 758879, 751667, 745715, 740748, 735208, 727467, 716587, 702223, 684337, 663192, 639372, 613695, 587179, 560991, 536097, 512760, 490550, 469079, 448713, 430441, 415055, 402618, 392695, 384859, 378855, 374470, 371531, 370056, 370222, 372071, 375307, 379448, 384128, 389267, 395108, 402110, 410715, 421071, 432997, 446237, 460694, 476408, 493530, 512453, 533829, 558294, 586203, 617726, 652952, 691430, 731492, 770381, 805332, 834486, 856732, 871146, 877246, 875881, 869396, 860494, 850987, 841735, 833369, 826480, 821004, 815891, 809683, 801252, 789798, 774478, 754492, 729620, 700439, 668035, 633773, 599214, 565792, 534248, 504554, 476503, 450196, 425862, 403579, 383473, 365965, 351384, 339354, 328900, 319187, 309983, 301451]
63501C01451p615o445n134m029l404l098k757k355k148k187k282k408k705l000
63487B51884k763j819p64l50n77o94l7J304K602L106K683J979J893K713L822M357
63471B69339M016L109K022R48m7j002k124l464m547m671l817k917k930l798m552
63456B45565m348l211j780o11J96P78J127J096P41N50J080K333L693M556M904
63441B56669N222N992P343Q996J0507J1753J3278J5869J9526K3034K4859K4378
63429D27426K2057J8687J4899J1382Q912P870Q008Q977J0877J3967J7972K2076
63417E93110K5716K9096L2771L6844M0783M3822M5205M4137M0007L3072K4626
63406I89189J6115Q217J092m714q324r548r277q597q100q307j0058j3840j9038
$$ y = [301451, 293836, 287391, 282257, 278228, 274824, 271726, 268969, 266614, 264466, 262279, 259997, 257589, 254884, 251884, 249121, 247302, 246538, 246188, 245611, 244917, 244880, 246184, 248786, 251892, 254575, 256554, 258447, 261160, 264982, 269339, 273355, 276464, 278486, 279434, 279387, 278385, 276261, 272797, 268250, 263579, 259762, 256845, 253915, 250117, 245565, 241217, 238006, 236226, 235615, 235811, 236589, 237716, 238812, 239553, 240103, 241183, 243516, 247209, 251765, 256669, 261891, 267883, 275226, 284222, 294729, 306482, 319760, 335629, 355155, 378189, 403048, 427426, 449483, 468170, 483069, 494451, 503363, 511233, 519241, 528218, 539095, 553062, 571034, 593110, 618826, 647922, 680693, 717537, 758320, 802142, 847347, 891484, 931491, 964563, 989189, 1005304, 1013521, 1014613, 1009899, 1001575, 992027, 982750, 974153, 966053, 957746, 947688, 933848, 914810]
63393I14810k4399k9043l2628l4953l6051l6399l6377l5618l3615l0745k7960
63382E57022k5542k2994k0157j7518j5222j2761r967p437n506l631j389O99K072
63369D17669L163M691O454P795Q895J0557J2885J5109J6806J8449K0573K3221
63357E66267K6336K9944L3634L6547L8331L9585M0861M1538M0217L6013K9239
63346I58512K0981J2465M680j740o518r558j0920j0968j0370r825r848j0911j3482
63333I02498j7661k2769k7585l1156l3359l4693l5489l5427l3897l0880k7273
63322E72309k4123k1613j9073j6006j2923j0944j0755j2011j3729j5049j5673
63311D00410j5719j5372j4690j3688j2408j0945r471q273p576p249o809n915m726
$$ y = [914810, 890411, 861368, 828740, 793787, 757736, 721337, 684960, 649342, 615727, 584982, 557022, 531480, 508486, 488329, 470811, 455589, 442828, 432861, 425424, 419918, 416287, 414898, 415597, 417669, 420832, 425523, 431977, 439772, 448667, 459224, 472109, 487218, 504024, 522473, 543046, 566267, 592603, 622547, 656181, 692728, 731059, 770644, 811505, 853043, 893260, 929273, 958512, 979493, 991958, 996638, 994898, 988380, 978822, 967902, 956934, 946564, 936739, 926891, 915980, 902498, 884837, 862068, 834483, 803327, 769968, 735275, 699786, 664359, 630462, 599582, 572309, 548186, 526573, 507500, 491494, 478571, 467627, 456872, 444861, 431132, 416083, 400410, 384691, 369319, 354629, 340941, 328533, 317588, 308117, 299844, 292268, 285019, 278210, 272295, 267569]
63298B67569l686l034k671k402k158j989j975k146k422k631k663k521k298k135
63284B32838k194k451k570k218j605j291j392j354p74jM16N21O73Q04N38l8l40
63267B19562n0N25R22R56O96L96N31J391K596L355L347L023K947L222L658M063
63251B51140M211L922L364L014L092L404L853M746O326Q299J0161J1697J2894
63238C30123J3627J3798J3675J3764J4394J5579J7113J8588J9466J9533J9204
63227E08864J9096J9331J9474J9163J8535J8021J7888J8148J8716J9471K0130
63216G16837K0209J9313J7465J4977J1975Q294L976m43m559q725j3523j8592k2637
63203G44567k4741k5221k4947k4318k3225k1625j9635j7302j4668j1909r099o010
$$ y = [267569, 263883, 260849, 258178, 255776, 253618, 251629, 249654, 247508, 245086, 242455, 239792, 237271, 234973, 232838, 230644, 228193, 225623, 223405, 221800, 220509, 219117, 217763, 216989, 216988, 217404, 217925, 218598, 219402, 219940, 219902, 219562, 219512, 220037, 220959, 221915, 222611, 223007, 223538, 224929, 227525, 230880, 234227, 237250, 240197, 243419, 247077, 251140, 255351, 259273, 262637, 265651, 268743, 272147, 276000, 280746, 287072, 295371, 305532, 317229, 330123, 343750, 357548, 371223, 384987, 399381, 414960, 432073, 450661, 470127, 489660, 508864, 527960, 547291, 566765, 585928, 604463, 622484, 640372, 658520, 677236, 696707, 716837, 737046, 756359, 773824, 788801, 800776, 809070, 813046, 812603, 808044, 799319, 785796, 767204, 744567, 719826, 694605, 669658, 645340, 622115, 600490, 580855, 563553, 548885, 536976, 527877, 521867]
63191E21867k475J170M357O839Q723J0156J1427J3106J5559J8295K0323K1181
63179F50528K1210K0795K0004J9146J9036K0112K1579K2058K1021J9123J7124
63168H71736J4989J2196Q523M179o07n715j0888j5689j9880k3647k7237l0503
63156G77457l2938l4152l4213l3488l2233l0421k8012k5328k3023k1477k0294
63145D61878j8666j6292j3750j1789j0511r507q510p548o553n309l907k857k460
63132C44219k299j703o31K01J74m36p20j61Q33J541J830K085K388K323J778J425
63116C52847J880K742L004K325J359R13J240K101K999L332K865K158K021K472
63102C84258K725K366J874J709J560J044N66P82J484J754J161J78o25j176j536
$$ y = [521867, 519392, 520562, 524919, 531758, 540481, 550637, 562064, 575170, 590729, 609024, 629347, 650528, 671738, 692533, 712537, 731683, 750719, 770831, 792410, 814468, 835489, 854612, 871736, 886725, 898921, 907444, 911623, 911016, 905301, 894413, 878724, 858844, 835197, 807960, 777457, 744519, 710367, 676154, 642666, 610433, 580012, 552000, 526672, 503649, 482172, 461878, 443212, 426920, 413170, 401381, 390870, 381363, 372853, 365305, 358752, 353443, 349536, 346679, 344219, 341920, 340217, 339586, 339787, 339961, 339525, 338805, 338644, 339477, 341018, 342848, 344933, 347321, 349644, 351422, 352847, 354727, 357469, 360473, 362798, 364157, 365070, 366310, 368411, 371410, 374742, 377607, 379765, 381786, 384258, 386983, 389349, 391223, 392932, 394492, 395536, 396102, 396884, 398368, 400122, 401283, 401461, 400836, 399660, 398124]
63087C98124j531j076n42l63m18j72N95J508K152K570L001L367L459L548M251
63072D18473N681P171Q120Q661R100R300R172R388J0682J2644J4087J4707J5434
63059E52620J7025J9180K1426K3961K7030L0182L2844L5138L7531M0022M2295
63048H79254M4222M5691M6291M5835M4931M4361M4187M3972M3734M3977M4969
63037A371424M6471M8046M9151M9136M7712M5242M2019L7568L1300K3521J4912
63026A806502N279o042j8380k9556l8004m4288m9816n4777n8098n9031n7889n5304
63014A340596n1537m6707m1180l5367k9282k2650j5464q223j513M518J0055J5143
63002A118389J9632K3609K7367L0830L3474L5110L6257L7355L8044L7823L7019
$$ y = [398124, 396593, 395517, 394975, 394612, 394194, 394022, 394617, 396125, 398277, 400847, 403848, 407215, 410674, 414222, 418473, 424154, 431325, 439445, 448106, 457206, 466506, 475678, 485066, 495748, 508392, 522479, 537186, 552620, 569645, 588825, 610251, 634212, 661242, 691424, 724268, 759406, 796937, 836959, 879254, 923476, 969167, 1015458, 1061293, 1106224, 1150585, 1194772, 1238744, 1282478, 1326455, 1371424, 1417895, 1465941, 1515092, 1564228, 1611940, 1657182, 1699201, 1736769, 1768069, 1791590, 1806502, 1811781, 1805739, 1787359, 1757803, 1719799, 1675511, 1625695, 1570918, 1512820, 1453789, 1395900, 1340596, 1289059, 1242352, 1201172, 1165805, 1136523, 1113873, 1098409, 1090186, 1088673, 1093191, 1103246, 1118389, 1138021, 1161630, 1188997, 1219827, 1253301, 1288411, 1324668, 1362023, 1400067, 1437890, 1474909]
62991A474909L6367L5939L5243L4170L2964L1239K7980K2763J6230R069J192p687
62979A750378j7284k7014l6532m5535n3487n9878o4555o7438o8329o7362o5248
62968A177716o2629n9420n5276n0480m5855m1890l8341l4759l1159k8029k5800
62957G04078k4274k2654k0356j7783j5961j5337j5287j5003j4365j3709j3125
62946E16224j2506j2007j1894j1997j1799j1104j0213r437q790q265p992p862
62934C92358p340o079m618l971m441n165n143m369l539k927k207j385j092j581
62920C38501k144k084j685j542j429p97p5l87j849l175l254k325j296o06l15n46
62904C14992j317k259k967l377l501l210k532j789j144n00J6K6l21k61M64J082
$$ y = [1474909, 1511276, 1547215, 1582458, 1616628, 1649592, 1680831, 1708811, 1731574, 1747804, 1756873, 1758065, 1750378, 1733094, 1706080, 1669548, 1624013, 1570526, 1510648, 1446093, 1378655, 1310326, 1242964, 1177716, 1115087, 1055667, 1000391, 949911, 904056, 862166, 823825, 789066, 757907, 729878, 704078, 679804, 657150, 636794, 619011, 603050, 587713, 572426, 557423, 543058, 529349, 516224, 503718, 491711, 479817, 467820, 456021, 444917, 434704, 425267, 416477, 408212, 400220, 392358, 385018, 378939, 374321, 370350, 365909, 360744, 355601, 351232, 347693, 344766, 342559, 341174, 340082, 338501, 336357, 334273, 332588, 331046, 329617, 328820, 328745, 328358, 326509, 323334, 320080, 317755, 316459, 315853, 315538, 314992, 313675, 311416, 308449, 305072, 301571, 298361, 295829, 294040, 292896, 292396, 292412, 292438, 292117, 291856, 292320, 293402]
62888B93402Q97K99l6k64q16j261p65M98J420J432J006O69L99J80K87O23N21l15
62870B98176j159j081j42P04P48J92l11m46m38n75p92q04n35r4M97J236J755J569
62852B98500Q50M05M96L43o86j932k230j540q73p54o89k27K77L08k1k07L5O25
62834B92680J230J391Q89J41j80Q3M67O32O89P79Q71J046J492J988K031J658J563
62817C09450K081K625K567K156K019K204K360K581L308M441N180M969M219L860
62803C54020M372N413O357P046P881R147J0479J1304J1659J2130J2981J3917J4815
62790D81521J6118J8106K0407K2640K5182K8643L2923L7417M1948M6799N1947
62779H23651N7053O2167O7665P3171P7279P8907P8447P6964P4542P0033O2493
$$ y = [293402, 294299, 294598, 294562, 294298, 293482, 292221, 291456, 291954, 293374, 294806, 295812, 296481, 296880, 297060, 297347, 297970, 298491, 298176, 297017, 295936, 295794, 296498, 297246, 297438, 297127, 296681, 296243, 295668, 294876, 294072, 293537, 293443, 293940, 295176, 296931, 298500, 299350, 299755, 300251, 300594, 299908, 297976, 295746, 294206, 293333, 292579, 291890, 291663, 291940, 292248, 292227, 292020, 292055, 292680, 293910, 295301, 296190, 296331, 296151, 296234, 296701, 297333, 298022, 298801, 299672, 300718, 302210, 304198, 306229, 307887, 309450, 311531, 314156, 316723, 318879, 320898, 323102, 325462, 328043, 331351, 335792, 340972, 345941, 350160, 354020, 358392, 363805, 370162, 377208, 385089, 394236, 404715, 416019, 427678, 439808, 452789, 466706, 481521, 497639, 515745, 536152, 558792, 583974, 612617, 645540, 682957, 724905, 771704, 823651, 880704, 942871, 1010536, 1083707, 1160986, 1239893, 1318340, 1395304, 1469846, 1539879, 1602372]
62768A602372N2272M0508K7929J4508K03j4384k8151m0144m9912n7423o2851o6470
62756A418457o8530o9193o8655o7311o5550o3379o0463n6725n2656m8823m5294
62745G51878m1752l8039l4253l0515k6969k3949k1724k0055j8339j6273j4104
62734D65906j2209j0740r687q901p957o469m682l309k545j770n35O60J178J371
62720D00311K126L455M478M831N264O459Q076R462J0777J2688J5262J7923K0371
62707E21483K2958K6045K9544L3260L7227M1521M6013N0589N5425O0753O6417
62696I91235P1776P6099P9008Q0551Q0829P9610P6403P0943O3263N3345M1040
62685A764102K6738J1697k832j6681l0386m3865n5997o5645p2484p6715p8622
$$ y = [1602372, 1654644, 1695152, 1723081, 1737589, 1737792, 1723408, 1695257, 1655113, 1605201, 1547778, 1484927, 1418457, 1349927, 1280734, 1212079, 1144768, 1079218, 1015839, 955376, 898651, 845995, 797172, 751878, 710126, 672087, 637834, 607319, 580350, 556401, 534677, 514622, 496283, 480010, 465906, 453697, 442957, 433270, 424369, 416412, 409943, 405261, 401952, 399407, 397637, 397102, 397762, 398940, 400311, 402437, 405892, 410370, 415201, 420465, 426924, 435000, 444462, 455239, 467927, 483189, 501112, 521483, 544441, 570486, 600030, 633290, 670517, 712038, 758051, 808640, 864065, 924818, 991235, 1063011, 1139110, 1218118, 1298669, 1379498, 1459108, 1535511, 1606454, 1669717, 1723062, 1764102, 1790840, 1802537, 1799705, 1783024, 1752638, 1708773, 1652776, 1587131, 1514647, 1437932, 1359310]
62674A359310p8638p7322p4802p0772o5459o0130n6052n3164n0377m6944m2989
62663F82661l8857l4721l0898k7945k5988k4305k1939j8719j5419j2936j1416
62652D19518j0292r166q348q266q585q471p761p204p253p301o614n474m593l870
62638C16320k641r91J30K50m0q9Mj24m35p19j004j245j107m88M4j18p78j188r38
62619C04843k66M47J047J521J857K075K239K505L105M123N192N758N858O295P691
62604C54290R619J1152J2086J3083J4624J6456J8307K0544K3599K7001K9666L1282
62592E81709L2837L5418L8700M1103M1301L9118L4960K9079K1808J3978O478n48
62580I15941p487j4325k0430k5269k8859l1371l2783l3133l2784l2182l1534l0853
$$ y = [1359310, 1280672, 1203350, 1128548, 1057776, 992317, 932187, 876135, 822971, 772594, 725650, 682661, 643804, 609083, 578185, 550240, 524252, 499947, 478008, 459289, 443870, 430934, 419518, 409226, 400060, 391712, 383446, 374861, 366390, 358629, 351425, 344172, 336871, 330257, 324783, 320190, 316320, 313679, 312688, 312818, 313068, 313028, 312939, 312943, 312819, 312384, 311665, 310661, 309416, 308309, 307821, 307865, 307747, 306969, 305781, 304843, 304577, 305024, 306071, 307592, 309449, 311524, 313763, 316268, 319373, 323496, 328688, 334446, 340304, 346599, 354290, 363909, 375061, 387147, 400230, 414854, 431310, 449617, 470161, 493760, 520761, 550427, 581709, 614546, 649964, 688664, 729767, 771068, 810186, 845146, 874225, 896033, 910011, 916489, 915941, 908454, 894129, 873699, 848430, 819571, 788200, 755417, 722284, 689500, 657318, 625784, 594931]
62568E94931l0013k8659k6479k3745k1266j9542j8205j6539j4300j1868r838q597
62556C65880q058p588o563n110l979l497l160k568k126k320k714k415j377m68
62542C13937j99o4N63J450J819J394P43N59Q86J212J282J474K260L460M526N399
62526C40701O532P994R235J0099J1325J3510J6100J8214K0042K2579K6030K9463
62514E31824L2145L4455L7214M0611M4065M6674M7602M6441M3442L9131L3660
62503I77264K6930J9290J1497L880l803j1475j8360k3827k7961l0876l2135l1531
62491H58893k9835k8022k6042k3171j9394j5552j2145q821n223j582J838N268
62479F96212Q912J2450J5486J8121K0494K2022K1755J9504J6071J2288Q380M325
$$ y = [594931, 564918, 536259, 509780, 486035, 464769, 445227, 427022, 410483, 396183, 384315, 374477, 365880, 357822, 350234, 343671, 338561, 334582, 331085, 327925, 325357, 323231, 320911, 318197, 315782, 314405, 313937, 313738, 313674, 314237, 315687, 317506, 318900, 319643, 320202, 321088, 322300, 323582, 325056, 327316, 330776, 335302, 340701, 347233, 355227, 364462, 374561, 385886, 399396, 415496, 433710, 453752, 476331, 502361, 531824, 563969, 598424, 635638, 676249, 720314, 766988, 814590, 861031, 904473, 943604, 977264, 1004194, 1023484, 1034981, 1038861, 1035058, 1023583, 1005223, 981396, 953435, 922559, 890424, 858893, 829058, 801036, 774994, 751823, 732429, 716877, 704732, 695911, 690688, 689106, 690944, 696212, 705124, 717574, 733060, 751181, 771675, 793697, 815452, 834956, 851027, 863315, 871695, 876020]
62467H76020L34l518p716j2756j8300k3286k6989k9551l1450l2818l3444l3166
62455F23360l2008l0218k8249k6415k4418k1643j8217j5272j3609j2493j0572
62444C90246p804n571m763m662m108k975j856q88K67J536K367K580K582K578K162
62429C71691J018l86j307j746k502m078n801o406n541m415m590o154p525p224
62415C15034n475l695k779k421k021j584j469j714j955j974j940k154k602k852
62401B80399k433j385k82L15M16L60K91J18l8J75Q64J701K323K619K502J850Q93
62384B90688L18N62J273J794K040K443L139L758M082M478N387O637P609Q024Q326
62369C50558R145J0487J1694J2323J2837J4131J6414J9015K1385K3819K6861L0462
$$ y = [876020, 876354, 872836, 865120, 852364, 834064, 810778, 783789, 754238, 722788, 689970, 656526, 623360, 591352, 561134, 532885, 506470, 482052, 460409, 442192, 426920, 413311, 400818, 390246, 382442, 376871, 372108, 367446, 363338, 360363, 358507, 357619, 357886, 359422, 361789, 364369, 366951, 369529, 371691, 372709, 372323, 371016, 369270, 366768, 362690, 356889, 350483, 344942, 340527, 335937, 329783, 322258, 315034, 309559, 305864, 303085, 300664, 298643, 297059, 295590, 293876, 291921, 289947, 288007, 285853, 283251, 280399, 277966, 276581, 276299, 276614, 277030, 277390, 277681, 277799, 277761, 277936, 278800, 280501, 282824, 285443, 287945, 289795, 290688, 291006, 291568, 292841, 294635, 296675, 299118, 302257, 306015, 310097, 314575, 319962, 326599, 334208, 342232, 350558, 359703, 370190, 381884, 394207, 407044, 421175, 437589, 456604, 477989, 501808, 528669, 559131]
62357E59131L4297L8581M3803M9682N5090N9168O1881O3237O2601N9227N3085
62346A139783M4842L5320K5351J5749O970j104q722j5882k2612k9243l5822m1588
62334A113042m5656m8050m9412m9787m8489m5323m1237l7355l3908l0463k6832
62323F56530k3308k0202j7637j5676j4388j3798j3923j4704j5752j6350j6032
62312D74760j5087j4245j3894j3804j3495j2690j1388r800q261p085o343n832
62300C42836n274m548l697k776j798q61k89l54p92q51n5J123J679J187K32k60
62284C25502J38J261K684L923M538M400L883L597L872M515N063N243N228N467
62270C79314O155P009P657Q164Q893R973J1253J2776J4901J7760K0963K4073K7157
$$ y = [559131, 593428, 632009, 675812, 725494, 780584, 839752, 901633, 964870, 1027471, 1086698, 1139783, 1184625, 1219945, 1245296, 1261045, 1268015, 1266911, 1258189, 1242307, 1219695, 1190452, 1154630, 1113042, 1067386, 1019336, 969924, 920137, 871648, 826325, 785088, 747733, 713825, 683362, 656530, 633222, 613020, 595383, 579707, 565319, 551521, 537598, 522894, 507142, 490792, 474760, 459673, 445428, 431534, 417730, 404235, 391545, 380157, 370357, 362096, 355011, 348668, 342836, 337562, 333014, 329317, 326541, 324743, 323882, 323593, 323239, 322447, 321596, 321541, 322664, 324343, 325530, 325762, 325502, 325640, 326901, 329585, 333508, 338046, 342446, 346329, 349926, 353798, 358313, 363376, 368619, 373847, 379314, 385469, 392478, 400135, 408299, 417192, 427165, 438418, 451194, 466095, 483855, 504818, 528891, 556048]
62257E56048L0685L5050M0340M6292N2284N7574O1701O4475O5478O3953N9398
62246A133278N2098M2879L2673K2379J2743L980m289j2460k0545k8423l6049m3142
62234A155122m9083n3479n6451n8057n7942n6035n3009m9504m5365m0386l5292
62223F00519l1087k7670k4122k0176j6456j3317j0592q457p446p247o571m770
62211D22608k676j313o27j69j19p21j384j362r45r91j491j611j099p13j038j673
62195D04676j917j675j287q89l27M61J353K209L004L815M736N714O523P002P298
62180D40696P663Q071Q211P870P156O306N461M726M336M660N990Q298J1237J4568
62166E45249J8477K3273K8720L4024L8633M2674M6310M8941M9430M7018M1800
$$ y = [556048, 586733, 621783, 662123, 708415, 760699, 818273, 879974, 944449, 1009927, 1073880, 1133278, 1185376, 1228255, 1260928, 1283307, 1296050, 1300030, 1295741, 1283281, 1262736, 1234313, 1198264, 1155122, 1106039, 1052560, 996109, 938052, 880110, 824075, 771066, 721562, 676197, 635811, 600519, 569432, 541762, 517640, 497464, 481008, 467691, 457099, 448642, 441196, 433949, 427378, 422608, 419932, 418619, 417992, 417823, 417704, 416983, 415599, 414237, 413292, 412301, 410810, 409199, 408100, 407387, 406349, 404676, 402759, 401084, 399797, 398908, 398581, 399042, 400395, 402604, 405608, 409423, 414159, 419873, 426396, 433398, 440696, 448359, 456430, 464641, 472511, 479667, 485973, 491434, 496160, 500496, 505156, 511146, 519444, 530681, 545249, 563726, 586999, 615719, 649743, 688376, 731050, 777360, 826301, 875731, 922749, 964549]
62155I64549L4494K6175J8032J0869M713r09o333j1661j7026k2493k7711l2119
62143I40580l5535l8114l9717l9904l8656l6621l4294l1451k7745k3530j9567
62132E75446j6142j2971r808o769m010j617K54J430K068K440K295R43j600m013
62118E27946m794l880k559j792j316o66l12j118l027n092o678p860q594q351p025
62103D64882n496m707m569m369l826l107k037k40J949L498L925L911M352N293
62089D59459O202O820P326P856Q386Q985R769J0613J1240J1627J2078J2854J3916
62076E87131J5103J6371J7751J9129K0205K0695K0619K0357K0375K0901K1871
62065H00508K3140K4640K6431K8731L1713L5026L7586L8284L6918L4030K9829
$$ y = [964549, 999043, 1025218, 1043250, 1054119, 1058832, 1057923, 1051590, 1039929, 1022903, 1000410, 972699, 940580, 905045, 866931, 827214, 787310, 748654, 712033, 677739, 646288, 618543, 595013, 575446, 559304, 546333, 536525, 529756, 525746, 524129, 524383, 525813, 527881, 530321, 532616, 533559, 531959, 527946, 523152, 519272, 516713, 514921, 513605, 512939, 512627, 511509, 508482, 503390, 496712, 488852, 480258, 471907, 464882, 459386, 454679, 450110, 445741, 441915, 438808, 436771, 436531, 438480, 441978, 445903, 449814, 454166, 459459, 465661, 472481, 479807, 487663, 496049, 505034, 514803, 525416, 536656, 548283, 560361, 573215, 587131, 602234, 618605, 636356, 655485, 675690, 696385, 717004, 737361, 757736, 778637, 800508, 823648, 848288, 874719, 903450, 935163, 970189, 1007775, 1046059, 1082977, 1117007, 1146836]
62054A146836K3954J6562Q995K639k490p415j2703j8001k2967k7792l2645l7211
62042A037762m1029m3815m5323m5438m4588m3464m2022l9400l5300l0818k7294
62031E99271k4790k2466k0010j7782j5765j3410j0688q432p236o742o396o229
62019D39325o385o464o040n524n759o867q001q290p609o428n290m486l878k983
62005C55321j457M17K040L197M191N284O350P158P663P819P445O429M916L131
61991D19904J252l56j147r64n66j103k941n248o863p402p329p194p098o928o711
61976C59306o489o131n562n054m863m695l970k714j683j350j234o29L43R21P14
61961C16910K6o62j059r36k31O35J057J017J178J989L099L883M191M339M616N099
$$ y = [1146836, 1170790, 1187352, 1196347, 1198986, 1196496, 1189081, 1176378, 1158377, 1135410, 1107618, 1074973, 1037762, 996733, 952918, 907595, 862157, 817569, 774105, 732083, 692683, 657383, 626565, 599271, 574481, 552015, 532005, 514223, 498458, 485048, 474360, 465928, 458692, 451950, 445554, 439325, 432940, 426476, 420436, 414912, 409153, 402286, 394285, 385995, 378386, 371958, 366668, 362182, 358304, 355321, 353864, 354281, 356321, 359518, 363709, 368993, 375343, 382501, 390164, 397983, 405428, 411857, 416773, 419904, 421156, 420800, 419653, 418689, 418123, 417020, 414079, 408831, 401968, 394566, 387237, 380043, 372945, 366017, 359306, 352817, 346686, 341124, 336070, 331207, 326512, 322542, 319828, 318145, 316795, 315561, 314932, 315275, 316196, 316910, 316936, 316274, 315215, 314279, 314048, 314683, 315740, 316757, 317935, 319924, 323023, 326906, 331097, 335436, 340052, 345151]
61945C45151N787O605P433Q273R295J0631J2222J3946J5643J6979J7603J7548
61933D87116J7321J7317J7446J7398J6967J5970J4253J2063J0084Q714P527N796
61921F47972L324M43k518n392p920r871j1257j2056j1843j0198p420m322j314
61908E67628J744M797P357R280J1181J3543J5818J6907J6316J4366J1439P621
61896F97997L179j179m825p732j0264j2702j5109j7425j9341k0287j9979j8907
61884E53426j7927j7269j6432j5112j3772j2955j2476j1780j0792r855r038q109
61872C97909p145o491o048n216l774k201r24K18J440K510L258M098N483P191Q670
61857C98978R868J1187J2867J4868J7178J9644K1784K3352K4934K7351L0430L3066
$$ y = [345151, 350938, 357543, 364976, 373249, 382544, 393175, 405397, 419343, 434986, 451965, 469568, 487116, 504437, 521754, 539200, 556598, 573565, 589535, 603788, 615851, 625935, 634649, 642176, 647972, 651296, 651739, 649221, 643829, 635909, 626038, 614781, 602725, 590882, 580684, 573264, 568942, 567628, 569372, 574169, 581526, 590806, 601987, 615530, 631348, 648255, 664571, 678937, 690376, 697997, 701176, 699997, 695172, 687440, 677176, 664474, 649365, 631940, 612599, 592312, 572333, 553426, 535499, 518230, 501798, 486686, 472914, 459959, 447483, 435703, 424911, 415056, 406018, 397909, 390764, 384273, 378225, 373009, 369235, 367034, 366110, 366328, 367768, 370278, 373536, 377634, 383117, 390308, 398978, 408846, 420033, 432900, 447768, 464946, 484590, 506374, 529726, 554660, 582011, 612441, 645507]
61845F45507L4475L4769L4202L2578K9734K6007K1822J7161J1845O005jn873j1199
61832H77032j5270j7477j7862j6988j5246j2573q843m310M41M883Q761J1902J4020
61819H08470J4845J4396J2844J0121O017P60m891j0450j6133k2046k7316l0743
61807G55874l2198l2624l2678l2081l0457k8113k5654k3420k1615k0442j9598
61796D56994j8161j5567j2473j0128r028q650q348p973p596p125o433n638n040
61783C34834m799m731m462l814l030k557k566k886l282l598l627l147k247j389
61769B88699r40q65r81j197j358j150m71L06P42Q83J073J372J470J226R21R19
61753B90649J197J438J541J794K460L171L124K053P56K79P19J242J208P61K39
$$ y = [645507, 679982, 714751, 748953, 781531, 811265, 837272, 859094, 876255, 888100, 894105, 894104, 888231, 877032, 861762, 844285, 826423, 809435, 794189, 781616, 772773, 768463, 768904, 773787, 782548, 794450, 808470, 823315, 837711, 850555, 860676, 866693, 867453, 862562, 852112, 835979, 813933, 786617, 755874, 723676, 691052, 658374, 626293, 595836, 567723, 542069, 518649, 497034, 476592, 456994, 438833, 423266, 410793, 400665, 391637, 382987, 374639, 366666, 359070, 351945, 345512, 339874, 334834, 330035, 325304, 320842, 317028, 313998, 311441, 308875, 305989, 302707, 299109, 295482, 292335, 290088, 288699, 287759, 286894, 285913, 284716, 283358, 282208, 281737, 282043, 282785, 283668, 284741, 286113, 287583, 288809, 289730, 290649, 291846, 293284, 294825, 296619, 299079, 302250, 305374, 307427, 308183, 308462, 309181, 310423, 311631, 312392, 312631]
61738C12631k92o92n08M41J599K210K135J773J445J192J064J174J572K205K939
61723C30888L430L342K804K415K533K896L167L378L579L517L147K902K929K577
61709C73504J349n3o10n55r76k002k519k013j479j967l125l883l958l854l838
61694C44021l749l644l878m408m584l838k343q80k03m92j287j883j957j720j476
61679C07679j231q96o56q52j448j905j685q25R0N33N14M06L66J97j81m23k31J19
61661B99571J28k07m65m62l30L5R07K001K443J942J352J589K377K706K246J622
61645C17455J366J249Q73L96L81J103K257L257L724L684L336K767J963J013K4
61630C44848j135k609l965m344l584k699k732l455l826l485l047k932k741k023
$$ y = [312631, 312339, 311647, 311139, 311580, 313179, 315389, 317524, 319297, 320742, 321934, 322998, 324172, 325744, 327949, 330888, 334318, 337660, 340464, 342879, 345412, 348308, 351475, 354853, 358432, 361949, 365096, 367998, 370927, 373504, 374853, 374800, 374190, 373635, 372659, 370657, 368138, 366125, 364646, 362679, 359554, 355671, 351713, 347859, 344021, 340272, 336628, 332750, 328342, 323758, 319920, 317577, 316697, 316494, 316002, 314715, 312832, 310875, 309155, 307679, 306448, 305552, 304896, 304044, 302596, 300691, 299006, 298181, 298271, 298804, 299318, 299724, 300090, 300287, 300106, 299683, 299452, 299571, 299699, 299492, 299027, 298565, 298235, 298270, 299177, 301178, 303621, 305563, 306915, 308504, 310881, 313587, 315833, 317455, 318821, 320070, 320943, 321339, 321720, 322823, 325080, 328337, 332061, 335745, 339081, 341848, 343811, 344824, 344848, 343713, 341104, 337139, 332795, 329211, 326512, 323780, 320325, 316499, 313014, 309967, 307035, 304294, 302271]
61616C02271r43R3R32J397J161L33k55l7M27J24j091k514l765n077o334o676n559
61599B74487l705k488k574l559m658n279n084m058k742j987k195k936l439l377
61585B26406k994k601k206j689j166r52j157j465j426j013o96r03j492j898j843
61570B02905j613j632j890k008j780j386j046p40m17k55m28p62r21q94r76j148
61554A85009r10Q0J396K255K334J906J308P38M48O57J081J055L75k90k12M24P49
61537A98403K98m74p97l88L65Q37P02J65k43j90K17O40Q33O51J3r27j706j964
61519A96435j863j839k031k201k129j806j340r08p43q03o21R6Q33P70o4p30o74
61502A80382m25p00j354j711j567j251r44n16KL00J87j61m16l44J07P07J065J032
$$ y = [302271, 301328, 301421, 302353, 303750, 304911, 305244, 304989, 304952, 305379, 305503, 304412, 301898, 298133, 293056, 286722, 280046, 274487, 270782, 268294, 265720, 262161, 257503, 252224, 247140, 243082, 240340, 238353, 236158, 233222, 229783, 226406, 223412, 220811, 218605, 216916, 215750, 214798, 213641, 212176, 210750, 209737, 209041, 208138, 206646, 204748, 202905, 201292, 199660, 197770, 195762, 193982, 192596, 191550, 190810, 190393, 190138, 189710, 188948, 188027, 187133, 186157, 185009, 184099, 184179, 185575, 187830, 190164, 192070, 193378, 194116, 194564, 195221, 196302, 197357, 197732, 197442, 197230, 197654, 198403, 198701, 198227, 197430, 197042, 197407, 198244, 198946, 199111, 198868, 198678, 198895, 199535, 200368, 201019, 201032, 200105, 198399, 196435, 194572, 192733, 190702, 188501, 186372, 184566, 183226, 182318, 181575, 180772, 180151, 180247, 181080, 181850, 181786, 181056, 180382, 179957, 179257, 177903, 176192, 174625, 173374, 172430, 171914, 171916, 172216, 172403, 172242, 171826, 171482, 171589, 172296, 173361, 174393]
61484A74393R21J073J360J402J169R79R99J069J100J228J541J896K078J927J310
61469A94445K78p45j236j116p77m85j17M11P96O78J58l03l88j47J65L30K79J48
61451A92374J40K97M37L99K62K10K46J74j35n33o46j68Q31J873K451K551K719
61434B03482L438M501N113M766L805K976K529K033J130J41l30j76J68L48L99M52
61418B34775N21O88J130J785K259K316K181K170K244K183J881J297L25r11j893
61403B52951k221k095k000k082k194k362k699k921k497j398l57k25j146k393k902
61388B23459k172q18k6k14n83l27K01J41m45o72k50J66J37J4Q8P0j52o1N63R62
61368B20081M46m33n46K87J207J620J761K017K375K725L146L664M108M358M449
$$ y = [174393, 175314, 176387, 177747, 179149, 180318, 181297, 182296, 183365, 184465, 185693, 187234, 189130, 191208, 193135, 194445, 194723, 193978, 192742, 191626, 190849, 190364, 190247, 190658, 191454, 192132, 192290, 191987, 191599, 191452, 191617, 191947, 192226, 192374, 192514, 192811, 193248, 193647, 193909, 194119, 194365, 194539, 194404, 193871, 193225, 193057, 193888, 195761, 198212, 200763, 203482, 206920, 211421, 216534, 221300, 225105, 228081, 230610, 232643, 233773, 233914, 233584, 233408, 233576, 233924, 234323, 234775, 235296, 235984, 237114, 238899, 241158, 243474, 245655, 247825, 250069, 252252, 254133, 255430, 255755, 254844, 252951, 250730, 248635, 246635, 244553, 242359, 239997, 237298, 234377, 231880, 230482, 230125, 229900, 228754, 226361, 223459, 221287, 220469, 220443, 220229, 219646, 219319, 219520, 219661, 219216, 218544, 218294, 218460, 218597, 218611, 218699, 218769, 218617, 218556, 219119, 220081, 220527, 220094, 219548, 219835, 221042, 222662, 224423, 226440, 228815, 231540, 234686, 238350, 242458, 246816, 251265]
61353B51265M404M283M436N209O256O600N752M390L576L472L360K902K859M134
61339C12898O338P833P417N641M171L998M675N171M978M133K695Q00r96j966j928
61324C65858j385r17p58j040j917l167m028l883l027k197j513m03J240K518K636
61309C48017K088K069K908L879M506N156O043O445N581L753J942O13m10j187j515
61294C89888j489j504j677j891k324l268m346m698m132l426l238l267k974k515
61280C49139k508l152l949m130l182j255P33J804J919J871K093K212J970J845
61266C45410K216K652K705K847L763N072N699N427N118N337N550N045L995L226
61252D04062L190L614L968M100M395N216O247O591N787M446L507L033K253P30
$$ y = [251265, 255669, 259952, 264388, 269597, 275853, 282453, 288205, 292595, 296171, 299643, 303003, 305905, 308764, 312898, 319236, 327069, 334486, 340127, 344298, 348296, 352971, 358142, 363120, 367253, 369948, 370748, 369752, 367786, 365858, 364473, 363556, 362798, 361758, 359841, 356674, 352646, 348763, 345736, 343539, 342026, 341623, 342863, 345381, 348017, 350105, 352174, 355082, 358961, 363467, 368623, 374666, 381111, 386692, 390445, 392387, 393000, 392590, 391403, 389888, 388399, 386895, 385218, 383327, 381003, 377735, 373389, 368691, 364559, 361133, 357895, 354628, 351654, 349139, 346631, 343479, 339530, 335400, 332218, 330963, 331696, 333500, 335419, 337290, 339383, 341595, 343565, 345410, 347626, 350278, 352983, 355830, 359593, 364665, 370364, 375791, 380909, 386246, 391796, 396841, 400836, 404062, 407252, 410866, 414834, 418934, 423329, 428545, 434792, 441383, 447170, 451616, 455123, 458156, 460409, 461139]
61238D61139j051k421l334m203n184n957o128n673m960m359l875l272k537j991
61224D06194j828j775j461q97l53J14P15J600K698L780M521M618M157L674L595
61209D29352L659L217K069P03k32m93k82O8M21R75K020L536N159O556P617Q266
61193D72611Q460Q486Q723Q896Q101O009L624K230K024K267K470K732L110L386
61179E43129L398L093K298J026j23m47l6L46K41j59n15p15p96r97j784l208m468
61162E40283m701m193m067m888o233p542q542q846q097o667n444m638l608k096
61148D60721q49p22j819l788o120p903q246p409o721o889p159o727n989n640n370
61133C79370m450k971j554l32Q03J412J101O07J119K598L843M329M807N923P241
$$ y = [461139, 460088, 457667, 454333, 450130, 444946, 438989, 432861, 427188, 422228, 417869, 413994, 410722, 408185, 406194, 404366, 402591, 401130, 400233, 399880, 399994, 400709, 402309, 405007, 408787, 413308, 417926, 422083, 425757, 429352, 433011, 436228, 438297, 439000, 438768, 438275, 437993, 438061, 438482, 439457, 441477, 445013, 450172, 456728, 464345, 472611, 481071, 489557, 498280, 507176, 515277, 521286, 524910, 527140, 529164, 531431, 533901, 536633, 539743, 543129, 546527, 549620, 551918, 552944, 552821, 552374, 552338, 552684, 552925, 552766, 552251, 551536, 550740, 549743, 547959, 544751, 540283, 535582, 531389, 527322, 522434, 516201, 508659, 500117, 491271, 483174, 476507, 471063, 466425, 462817, 460721, 459872, 459150, 457331, 453543, 447423, 439520, 431274, 423865, 417144, 410255, 403096, 396369, 390380, 384740, 379370, 374920, 371949, 370395, 370063, 370866, 372278, 373379, 373986, 375105, 377703, 381546, 385875, 390682, 396605, 403846]
61118D03846Q166Q919R968J1183J2191J3149J4470J6092J7505J8423J8911J9012
61106E71835J8676J8083J7549J7056J6215J4772J2859J0631Q034N178K679J086
61094G14653J55r45k603m424o026p592r354j0937j1782j2009j2314j3066j3968
61081F09788j4512j4485j3968j3272j2773j2465j1839j0599r342q892r019q540
61069D70082o868m798l527l332l520l244k195p91K23O64J286K772M569N512N529
61054D62362N745O725P744Q164Q518R483J0655J1260J1455J2128J3759J6140J8861
61041F02999K1515K3796K5909K8415L1295L3735L5268L6374L7420L7917L7665
61030I52308L7786L9526M2700M6374N0513N5752O1964O8259P4126P9658Q5171
$$ y = [403846, 412012, 420931, 430899, 442082, 454273, 467422, 481892, 497984, 515489, 533912, 552823, 571835, 590511, 608594, 626143, 643199, 659414, 674186, 687045, 697676, 705710, 710888, 713567, 714653, 714808, 713863, 711260, 706836, 700810, 693218, 683864, 672927, 661145, 649136, 636822, 623756, 609788, 595276, 580791, 566823, 553551, 540778, 528313, 516474, 505875, 496533, 487641, 478622, 470082, 463214, 458416, 454889, 451557, 448037, 444793, 442598, 441807, 442030, 442694, 443980, 446752, 451321, 456833, 462362, 468107, 474832, 482576, 490740, 499258, 508741, 519396, 530656, 542111, 554239, 567998, 584138, 602999, 624514, 648310, 674219, 702634, 733929, 767664, 802932, 839306, 876726, 914643, 952308, 990094, 1029620, 1072320, 1118694, 1169207, 1224959, 1286923, 1355182, 1429308, 1508966, 1594137]
61019A594137R1830J02056J17911J39615J67238K03191K51037L12397L87696M79654
61009C846762N92980P31131Q98108J101938J341976J577782J714713J645498J331492
61000A4782380Q50054L55019j5698j99455j97679m1538K07608M37474N06809L24293
60990A7009267q3623n86881j035780j337898j475384j477300j388519j252727
60982H371155j103364r58786q24928p03035n94308m99347m17446l47901k90545
60973B631495k44556k08107j79467j57294j39746j24676j11038r9090q8928p9755
60963A198838p0892o2510n4889m7722m0702l4368k9744k7268k6242k5320k3583
60952G55598k1179j8919j7113j5237j2834j0205p753n241k398J63J454J473J236
$$ y = [1594137, 1685967, 1788023, 1905934, 2045549, 2212787, 2415978, 2667015, 2979412, 3367108, 3846762, 4439742, 5170873, 6068981, 7170919, 8512895, 10090677, 11805390, 13450888, 14782380, 15632434, 15987453, 15971755, 15772300, 15574621, 15533083, 15740691, 16178165, 16684974, 17009267, 16925644, 16338763, 15302983, 13965085, 12489701, 11012401, 9623882, 8371155, 7267791, 6309005, 5484077, 4781042, 4186734, 3687387, 3269941, 2922040, 2631495, 2386939, 2178832, 1999365, 1842071, 1702325, 1577649, 1466611, 1367521, 1278593, 1198838, 1127946, 1065436, 1010547, 962825, 922123, 887755, 858011, 830743, 804501, 779181, 755598, 734419, 715500, 698387, 683150, 670316, 660111, 652358, 647117, 644719, 644882, 646336, 647809, 649045]
60939F49045J516K191K832L254L370L155K936L177L864M479M727M882N236N654
60925G00318N836N789N937O811Q582J0679J2086J2327J1938J1568J0979R514P334
60912H19698N367L944K365P3k449m401n763p071q528r876j1117j2674j4640j6177
60898G38751j6173j4545j2636j1965j2636j3318j2890j1675j0800j0786j1210
60887F00117j1486j1426j1171j0972j1049j1300j1270j0685r836r104q392p500
60875D75926o715o393o176n414m292l653l666l543k791j882j370j114q79j009
60861D27029j873l153m272n147n887o173n635m700m344m920n785o098n720n139
60847C58183m845m819m602l865k902k375k513k884l080l231l530l689l395k956
$$ y = [649045, 650561, 652752, 655584, 658838, 662208, 665363, 668299, 671476, 675340, 679819, 684546, 689428, 694664, 700318, 706154, 711943, 717880, 724691, 733273, 743952, 756038, 768365, 780303, 791871, 802850, 812364, 819698, 825065, 829009, 831374, 831447, 828998, 824597, 818834, 811763, 803235, 793359, 782242, 769568, 754928, 738751, 722578, 708033, 695397, 683432, 670796, 657478, 644588, 632913, 622113, 611327, 600117, 588631, 577205, 566034, 555062, 544013, 532713, 521443, 510758, 500922, 491818, 483426, 475926, 469211, 462818, 456642, 451228, 446936, 443283, 439617, 436074, 433283, 431401, 430031, 428917, 428038, 427029, 425156, 422003, 417731, 412584, 406697, 400524, 394889, 390189, 385845, 380925, 375140, 369042, 363322, 358183, 353338, 348519, 343917, 340052, 337150, 334775, 332262, 329378, 326298, 323067, 319537, 315848, 312453, 309497]
60833C09497k953l370l631l435l065k764k384j766j037l76J75N50O43O40R86J754
60817B89464K423K465J963J344P97K76j09p3M49J147J589J508R74M08K69N60P62
60800C06216N48K62L88P29O72J27l86o46j054j770k271k169j872j902k024j807
60784B93041j628k235l462m316m341m060l875l475k718k175k190k135j355l66
60770B54710k22r61j566j316n05K71P78J023J007Q31O86N77L82J62P8pl83q65
60752B54680q00J83J695L043L864M201M258M209M055L585K667J568P19J76l58
60737B87745j016j628k128k654l179l457l497l630l954m125l916l641l696m064
60723B43160m441m581m261l328k064j158r54j012p31j17M06O00M12l17j544k643
$$ y = [309497, 306544, 303174, 299543, 296108, 293043, 290279, 287895, 286129, 285092, 284716, 284891, 285441, 286084, 286724, 287710, 289464, 291887, 294352, 296315, 297659, 298456, 298732, 298623, 298550, 298999, 300146, 301735, 303243, 304217, 304625, 304894, 305454, 306216, 306764, 307026, 307414, 308143, 308815, 308942, 308556, 307910, 306856, 305086, 302815, 300646, 298774, 296872, 294848, 293041, 291413, 289178, 285716, 281400, 277059, 272999, 269124, 265649, 262931, 260756, 258566, 256431, 255076, 254710, 254488, 253527, 251961, 250645, 250140, 250411, 251189, 252212, 253219, 254050, 254736, 255313, 255695, 255857, 255935, 255928, 255545, 254680, 253880, 254063, 255758, 258801, 262665, 266866, 271124, 275333, 279388, 282973, 285640, 287208, 287927, 288103, 287745, 286729, 285101, 282973, 280319, 277140, 273683, 270186, 266556, 262602, 258477, 254561, 250920, 247224, 243160, 238719, 234138, 229877, 226549, 224485, 223327, 222373, 221361, 220630, 220513, 220919, 221519, 221931, 221614, 220070, 217427]
60707B17427k880k282j594j362j468j544j367q56o9O28P97M50J10K27P66J374
60691B08357J672J424P42K32M78J257J740J672J879L074M602N065M151L086L011
60676B42442L582L611K739J838J839K682L553L775L270K442J817J623J541J052
60662B77806P3r24j504j710j762j691j583j777k362k759k369j435o72k21L14Q44
60646B58268P25j17q21q10o26j005j782k378k826l455l970l770l086k826l166
60631B28355l222k370j215p34r94j290j183q96p52p11n67k73N5L37O12Q99J073
60614B17124R66N82J49j38k32j07L33R74J366J117L99k39m74l89j71M1P6j08k16
60595B21053P5N62O50J95k83l24j05n3k30m43o24p62o92l05J70M61O76J063J554
$$ y = [217427, 214547, 212265, 210671, 209309, 207841, 206297, 204930, 204074, 204005, 204633, 205430, 205880, 205990, 206217, 206983, 208357, 210029, 211453, 212195, 212427, 212905, 214162, 215902, 217574, 219453, 222527, 227129, 232194, 236345, 239431, 242442, 246024, 249635, 252374, 254212, 256051, 258733, 262286, 266061, 269331, 271773, 273590, 275213, 276754, 277806, 277879, 276955, 275451, 273741, 271979, 270288, 268705, 266928, 264566, 261807, 259438, 258003, 257331, 257110, 257424, 258268, 258993, 258876, 258055, 257245, 256619, 255614, 253832, 251454, 248628, 245173, 241203, 237433, 234347, 231521, 228355, 225133, 222763, 221548, 220814, 219820, 218530, 217347, 216451, 215699, 214988, 214421, 214148, 214203, 214540, 215152, 216051, 217124, 218090, 218672, 218821, 218683, 218451, 218344, 218677, 219651, 221017, 222134, 222533, 222294, 221820, 221431, 221260, 221301, 221377, 221269, 221053, 221128, 221690, 222340, 222535, 222252, 221928, 221823, 221770, 221540, 221097, 220473, 219711, 219019, 218714, 218884, 219345, 220021, 221084, 222638]
60576B22638J908K262K998M120N200O035O892P856Q423Q194P599P437P774P749
60562C07085O520M097J173j502l437m419m592m430m358m366m088l293k093p20
60548B81577P39K286L802N097O156P208Q431R631J0412J0622J0426R847Q480O011
60534C80725K858p8k335m125n534o053n266l640k113j160p47r44j915l262m145
60519C42266m204l832l384k718j849j279j212r23L24K115L406M015M837O534Q732
60504C52828J0756J2560J4695J7699K1732K6410L0741L3674L5047L5751L6496
60493F28389L6635L4522K9039K0478J0071q81j1364k0582k7984l3331l6560l7639
60481E90793l6654l4127l0939k7860k5136k2621k0162j7670j5027j2307j0039
$$ y = [222638, 224546, 226808, 229806, 233926, 239126, 245161, 252053, 259909, 268332, 276526, 284125, 291562, 299336, 307085, 313605, 317702, 318875, 317373, 313936, 309517, 304925, 300495, 296137, 291771, 287683, 284390, 282297, 281577, 282316, 284602, 288404, 293501, 299657, 306865, 315296, 324927, 335339, 345961, 356387, 366234, 374714, 380725, 383583, 383505, 381170, 377045, 371511, 365458, 360192, 356552, 354439, 353279, 352532, 351588, 349673, 346411, 342266, 338062, 334230, 330846, 328128, 326279, 325000, 323788, 322865, 323189, 325304, 328710, 332725, 337562, 344096, 352828, 363584, 376144, 390839, 408538, 430270, 456680, 487421, 521095, 556142, 591893, 628389, 665024, 699546, 728585, 749063, 759134, 758253, 746889, 726307, 698323, 664992, 628432, 590793, 554139, 520012, 489073, 461213, 436077, 413456, 393294, 375624, 360597, 348290, 338251]
60470C38251q897q844q967q408p239o130n418m908m447m103l838l435k856k336
60456B58425j962j598j357j672k631l599l919l687l386l031k261j187m93m89n85
60441B26568j13O87R99O24K75N84J208J221J61j579l239m199m104k945j231K00
60425B15117Q58J080J605K738M019M726M485L407J858K85q56j277j153j073j480
60410B34339k143k366j823r40l47j60p0J08L42P44J497K383K842K642K115J613
60394B40776J159Q21Q63J256J510J375J281J612J973J790J255R78R51O66J71K12
60378B58649J089K112K455K084J554J306J442J808K042J812J238Q33R00J234J531
60363B82089J734J861J855J803J961K305K386J961J520J906L454N716P853R137
$$ y = [338251, 329354, 320510, 311543, 303135, 295896, 289766, 284348, 279440, 274993, 270890, 267052, 263617, 260761, 258425, 256463, 254865, 253508, 251836, 249205, 245606, 241687, 238000, 234614, 231583, 229322, 228135, 227642, 227153, 226568, 226455, 227142, 228141, 228765, 229040, 229624, 230832, 232053, 232214, 230635, 227396, 223197, 219093, 216148, 214917, 215117, 215975, 217055, 218660, 221398, 225417, 230143, 234628, 238035, 239893, 240178, 239322, 238045, 236892, 235819, 234339, 232196, 229830, 228007, 227067, 226720, 226560, 226490, 226598, 226940, 227684, 229181, 231564, 234406, 237048, 239163, 240776, 241935, 242756, 243619, 244875, 246385, 247760, 249041, 250653, 252626, 254416, 255671, 256649, 257600, 258266, 258437, 258649, 259738, 261850, 264305, 266389, 267943, 269249, 270691, 272499, 274541, 276353, 277591, 278424, 279324, 280558, 282089, 283823, 285684, 287539, 289342, 291303, 293608, 295994, 297955, 299475, 301381, 304835, 310551, 318404, 327541]
60349C27541R282Q490P196N696M030K148K4k278m369n618n827n671n920o350o061
60334C22313m919l825l394l206k800k563k949l525l542l074k715k511k019j241
60320B80030o52l47qL15K09j55J36J518L260M449N187O221P739R196J0292J1433
60304C38823J2984J4399J4532J2745R386N276J032k967o345q897j0835j2425j3497
60291C54211j3688j3104j2103j0535p898m543j866q41r51j127j111j233j369j068
60277B82774n09l73p88j166j180j168j409j636j523j180r48j012j362j797j993
60262B64730j880j835k097k210j593n28J13N1k80o63j231j607r68O13J886K029
60246B54530J664J649J703J123J76k59l0K68L93O02Q67Q71P82J107J672J614O85
$$ y = [327541, 336823, 345313, 352509, 358205, 362235, 364383, 364407, 362129, 357760, 352142, 346315, 340644, 334724, 328374, 322313, 317394, 313569, 310175, 306969, 304169, 301606, 298657, 295132, 291590, 288516, 285801, 283290, 281271, 280030, 279378, 279031, 279023, 279338, 279547, 279392, 279528, 281046, 284306, 288755, 293942, 300163, 307902, 317098, 327390, 338823, 351807, 366206, 380738, 393483, 402869, 408145, 409177, 406210, 399865, 390968, 380133, 367708, 354211, 340523, 327419, 315316, 304781, 296883, 292340, 290474, 289633, 288682, 287555, 286444, 285211, 283842, 282774, 282265, 281892, 281104, 279938, 278758, 277590, 276181, 274545, 273022, 271842, 270894, 269882, 268520, 266723, 264730, 262850, 261015, 258918, 256708, 255115, 254587, 254700, 254751, 254471, 253808, 252577, 250970, 250002, 250615, 252501, 254530, 256194, 257843, 259546, 260669, 260845, 260586, 260556, 260824, 261217, 261819, 262686, 263557, 264339, 265446, 267118, 268732, 269417]
60229B69417k16j91N91J389J870K113K019J391M29l15m63k0P80J544J823J533
60213B83694J243J637K643L480L630L414L378L475L243K733K633L395M540N202
60199C28340N183N010N068N055M469L384K443K200K657L376L868L847L279K284
60185C80463J054j72j154j846k477l276m070m413m170l732l465l276k946k663
60171C43857k779l184l369l152k849k613k092j084j35On67j003p92l66l72p94
60155C18712j048p40kP64J165J005N03K39N28R08O93K6j79N49J585K119K203K416
60137C31446K884L263L514L953M547M761M294L490K821K320J759J089N26L75Q63
60122C71905J856K685K652J857J102Q52O87Q7p28j129r44m82O0P12J282J347P61
$$ y = [269417, 269201, 269010, 269601, 270990, 272860, 274973, 276992, 278383, 278812, 278497, 278034, 278014, 278794, 280338, 282161, 283694, 284937, 286574, 289217, 292697, 296327, 299741, 303119, 306594, 309837, 312570, 315203, 318598, 323138, 328340, 333523, 338533, 343601, 348656, 353125, 356509, 358952, 361152, 363809, 367185, 371053, 374900, 378179, 380463, 381517, 381345, 380191, 378345, 375868, 372592, 368522, 364109, 359939, 356207, 352742, 349466, 346520, 343857, 341078, 337894, 334525, 331373, 328524, 325911, 323819, 322735, 322600, 322606, 322039, 321036, 320244, 319878, 319506, 318712, 317664, 316924, 316922, 317686, 318851, 319856, 320359, 320598, 321126, 322034, 322727, 322753, 322574, 323123, 324708, 326827, 329030, 331446, 334330, 337593, 341107, 345060, 349607, 354368, 358662, 362152, 364973, 367293, 369052, 370141, 370667, 371042, 371905, 373761, 376446, 379098, 380955, 382057, 382909, 383596, 383683, 382955, 381826, 380882, 380400, 380460, 381172, 382454, 383801, 384562]
60105C84562j46r35j405j545j452j342j457j827k207k321k067j617j326j440j787
60090C61688j919j735j681k030k319j903r60k90j71o7L84P45O08M21R01J885K448
60073C56005K070J091K0r91j858k373k588k939l540l819l344k650k627l257l690
60058C25510l521l242l260l238k799k237j953j706j096m01k38n21n48j7P06J343
60042C02782K023K757L260L525L910M450M658M343M009M072M129L524K232P66
60028C50440m21j034r08l66k48j027k143k760k897l114l406l224k587k292k721
60013C21292l173k871k141k083l304n317p088p844p437o234m799l559k680k152
59999B60610j854j527r46j77L89L96k1k18L85J618K537K335J325O65J025J837
$$ y = [384562, 384416, 383481, 382076, 380531, 379079, 377737, 376280, 374453, 372246, 369925, 367858, 366241, 364915, 363475, 361688, 359769, 358034, 356353, 354323, 352004, 350101, 349141, 348851, 348680, 348613, 348997, 349742, 350350, 350771, 351672, 353557, 356005, 358075, 359166, 359186, 358195, 356337, 353964, 351376, 348437, 344897, 341078, 337734, 335084, 332457, 329200, 325510, 321989, 318747, 315487, 312249, 309450, 307213, 305260, 303554, 302458, 302057, 301819, 301298, 300750, 300733, 301439, 302782, 304805, 307562, 310822, 314347, 318257, 322707, 327365, 331708, 335717, 339789, 343918, 347442, 349674, 350440, 350019, 348985, 348077, 347711, 347463, 346436, 344293, 341533, 338636, 335522, 332116, 328892, 326305, 324013, 321292, 318119, 315248, 313107, 311024, 307720, 302403, 295315, 287471, 280034, 273800, 269001, 265442, 262762, 260610, 258756, 257229, 256283, 256106, 256495, 256891, 256870, 256652, 257037, 258655, 261192, 263527, 264852, 265517, 266542, 268379]
59983B68379K116J729J410J668K148K211J681Q90J45n98j538k551l073k605j347
59968B70665j11N26O50N76L35q1l91l72l01n18p42m08L50P02K22n14p20l89j85
59949B69294n30j071j056j38J151J869J580P14m8m26m24p0L47K04o92j497j271
59932B67936k78L53K44J54O38J208J246R78J061J659K490L382M314N192N978O827
59916C03382P770Q532Q844Q659P827O033L389P12j213k354l074l454l366k967
59902C38720k572k239j840j390j007o99n52p97j336j524q58L28J278J701J775
59887C28988J615J330J345K004K918L407L487L763M318M520M065L487L305L302
59873C71854L007K367J515M40p27j484j588j524j841k303k279j721j133o60J36
$$ y = [268379, 270495, 272224, 273634, 275302, 277450, 279661, 281342, 282232, 282377, 281779, 280241, 277690, 274617, 272012, 270665, 270554, 271080, 271730, 272306, 272641, 272560, 272169, 271797, 271496, 270978, 270236, 269828, 270178, 270880, 271102, 270588, 269868, 269479, 269294, 268764, 267693, 266637, 266499, 267650, 269519, 271099, 271813, 271765, 271339, 270915, 270845, 271192, 271396, 270704, 269207, 267936, 267658, 268011, 268255, 268409, 269047, 270255, 271501, 272479, 273540, 275199, 277689, 281071, 285385, 290577, 296555, 303382, 311152, 319684, 328528, 337187, 345014, 351047, 354436, 355148, 353935, 351581, 348507, 345053, 341687, 338720, 336148, 333909, 332069, 330679, 329672, 328973, 328421, 327624, 326288, 324764, 323906, 324234, 325512, 327213, 328988, 330603, 331933, 333278, 335282, 338200, 341607, 345094, 348857, 353175, 357695, 361760, 365247, 368552, 371854, 374861, 377228, 378743, 379183, 378456, 376972, 375384, 373860, 372019, 369716, 367437, 365716, 364583, 363923, 364059]
59858C64059J513L186M882O636Q218Q784P612N011K071l15j843k466k226j451
59844D03671o91k83l19j007k599m797o673p517p485p116o637o113n872o091o094
59829C34377m861k403PJ182J195Q68O91N93M91M74N09M28K66L10P97J627K392
59812C38943K619K095J100J86m10r63j769k642l116l021k600k112j616j216j225
59797C24253j902l059m087m444m127l579l129k700k111j542j319j391j305p92
59783B88766n4O08J048J127O99J3k51L01J204J592J145L26j93j13M05R65J316
59766B98904J534J828K111K074J737J543J731J953J809J494J557K144K834L149
59752C26402K990K594K279K185K210K247K418K843L179K969K399K232K720L166
$$ y = [364059, 365572, 368758, 373640, 380276, 388494, 397278, 404890, 409901, 411972, 411657, 409814, 407348, 405122, 403671, 402980, 402697, 402378, 401371, 398772, 393975, 387302, 379785, 372300, 365184, 358547, 352434, 346562, 340471, 334377, 329516, 327113, 327120, 328302, 329497, 330365, 331056, 331649, 332140, 332614, 333123, 333551, 333817, 334127, 334924, 336551, 338943, 341562, 343657, 344757, 344943, 344533, 343570, 341801, 339159, 336043, 333022, 330422, 328310, 326694, 325478, 324253, 322351, 319292, 315205, 310761, 306634, 303055, 299926, 297226, 295115, 293573, 292254, 290863, 289558, 288766, 288712, 289320, 290368, 291495, 292194, 292207, 291956, 292257, 293461, 295053, 296198, 296524, 296331, 296218, 296623, 297588, 298904, 300438, 302266, 304377, 306451, 308188, 309731, 311462, 313415, 315224, 316718, 318275, 320419, 323253, 326402, 329392, 331986, 334265, 336450, 338660, 340907, 343325, 346168, 349347, 352316, 354715, 356947, 359667, 362833]
59738C62833K955K357J882J443Q20L58M25N29n2r94j217m32M93Q19P66P65O38
59721C74388pj018j758j753j163p11j056j948k298j522m46k71r08j282j067j022
59705C56158j490j782j507j422k204l158l101j979p55l9L92Q67J366J769K043
59690C45158K070J698R82J67n17r39j094j190j427j588j241n78n14j497k693k897
59674C33900k065j307j545k613l684m019l433k383j663j628j813j606j164j179
59660C03798j845k566k779k525k113j563p31L30J290J783J664J207R51J159J394
59645B99454J041J88l49r1M80O28L87L69P30R19N39m5k75j93j77j54K82R29R00
59626C05562k33j764k762l131l232k897j754k75M37O6n40o15l52k11j71m0O0J42
$$ y = [362833, 365788, 368145, 370027, 371470, 372290, 372648, 373073, 373602, 373550, 372556, 371339, 370907, 371400, 372219, 372985, 373750, 374388, 374381, 373363, 371605, 369852, 368689, 367978, 366922, 364974, 362676, 361154, 360708, 360437, 359529, 358247, 357180, 356158, 354668, 352886, 351379, 349957, 347753, 344595, 341494, 339515, 338760, 338721, 339113, 339980, 341346, 343115, 345158, 347228, 348926, 349908, 350075, 349558, 348619, 347525, 346335, 344908, 343320, 342079, 341501, 340987, 339490, 336797, 333900, 331835, 330528, 328983, 326370, 322686, 318667, 315234, 312851, 311188, 309560, 307747, 306141, 304977, 303798, 301953, 299387, 296608, 294083, 291970, 290407, 289676, 290006, 291296, 293079, 294743, 295950, 296901, 298060, 299454, 300495, 300683, 300334, 300243, 300723, 301351, 301738, 302107, 302837, 303756, 304295, 304250, 303975, 303782, 303605, 303451, 303733, 304662, 305562, 305329, 303565, 300803, 297672, 294440, 291543, 289789, 289514, 289951, 290017, 289477, 288862, 288510, 288299, 288128, 288088, 288148, 288290]
59608B88290O53J756K806L130K896K570K006Q65l89q56m97k27n79j047r27j58
59592C00292Q47J680J987J575P82K84K89K93j53q00j143j122j033r98r51r92j301
59575B99536j735j896j685j435j356j154n05K84N44J71j73m7J06k76q24o93M3
59558B88905L45k49r31q50l16o0L6N75J431J894J888K095K784L349L336L177L607
59541C11016M800O456Q327J0352J2633J5301J7981J9202J7087J1230L507l398
59529D34494q103j0806j1976j1623r838p316m948l145j809p47J76J045J767J943
59515C69114J292J68o30q28j052j956l264m186m595n098n875o219n633m661m108
59500C22469l930l567l006k677k555k165j465j012j101j379j446j332j137p62
$$ y = [288290, 288943, 290699, 293505, 296635, 299531, 302101, 304107, 304972, 304583, 303727, 303230, 303003, 302424, 301377, 300450, 300292, 301139, 302819, 304806, 306381, 307163, 307447, 307736, 308029, 307876, 307076, 305933, 304811, 303778, 302780, 301829, 300837, 299536, 297801, 295905, 294220, 292785, 291429, 290275, 289770, 290054, 290598, 290769, 290596, 290549, 290655, 290379, 289555, 288862, 288905, 289250, 289001, 288070, 287220, 286904, 286844, 286880, 287455, 288886, 290780, 292668, 294763, 297547, 300896, 304232, 307409, 311016, 315816, 322272, 330599, 340951, 353584, 368885, 386866, 406068, 423155, 434385, 437892, 434494, 426391, 415585, 403609, 391986, 382148, 374832, 369884, 366739, 364930, 364183, 364359, 365404, 367171, 369114, 370406, 370574, 369944, 369116, 368064, 366108, 362844, 358658, 354063, 348965, 343090, 336871, 331238, 326577, 322469, 318539, 314972, 311966, 309289, 306734, 304569, 303104, 302092, 300991, 299612, 298166, 296834, 295697, 294935]
59486B94935j52N45J208J709J752J240Q44J506L108M343M304L650L690M712N788
59471C33182N956N061L557J968O10m12j045j127n48L57Q75O28O3M5R88K526L897
59454C56581M593M727M793N050N276N328N630O619P924Q624Q244O896M634J503
59440D36422j716l821m598n047n804o225n691m826m610m952n129n096n302n542
59426C68063n117m006k864j861m58J514L425M756N751O874Q281R956J1848J3762
59412D19924J5641J7972K0989K3202K1767J5200N354l900r794j2043j1771j0000
59400D92541p154l357J205N775Q700Q019L003m775j2192j6760j8226j8064j7602
59387D21113j6910j5414j3075j0530q349o585n001l378j653m6R47J029N50K15
$$ y = [294935, 294783, 295328, 296536, 298245, 299997, 301237, 302081, 303587, 306695, 311038, 315342, 318992, 322682, 327394, 333182, 339138, 344199, 347756, 349724, 350334, 349922, 348877, 347750, 347202, 347559, 348434, 349062, 349125, 349170, 350158, 352684, 356581, 361174, 365901, 370694, 375744, 381020, 386348, 391978, 398597, 406521, 415145, 423389, 430285, 434919, 436422, 434706, 430885, 426287, 421240, 415436, 409211, 403520, 398694, 394084, 389132, 384003, 378907, 373605, 368063, 362946, 358940, 356076, 354215, 353757, 355271, 358696, 363452, 369203, 376077, 384358, 394314, 406162, 419924, 435565, 453537, 474526, 497728, 519495, 534695, 540049, 536149, 526355, 514312, 502541, 492541, 485387, 482030, 483235, 489010, 497710, 505729, 508732, 503957, 491765, 475005, 456779, 438715, 421113, 404203, 388789, 375714, 365184, 356835, 350250, 345249, 341871, 340218, 340172, 341119, 342148, 342698, 342913]
59373C42913L46P14J033J192J099O58R4j46R3N72J077J584J919J834J561J816
59357C58359K910M256N149N608O095O707P174P473P869Q430Q917R214R507J0010
59343D57678J0743J1584J2253J2282J1392R936Q655P818O916N379L314J287m33
59330E58804k121m083o189q010r239r859j0012r844r473r028q656q494q517q371
59316D46908p512n747l595j894r35j19J378L806O768R647J1777J2366J0691O686
59302D90225J265m075q041j0149j0719j0367r465q129o613n382m644m053l167
59289D06686k004q83L5P19R75O92K90L97J049J613J577J056M41N5J94R94K067
59272D15953K692K688K617K962L536M048M671N559O239O104N216M010K457K91
$$ y = [342913, 343259, 343973, 345006, 346198, 347297, 347955, 348049, 347903, 347996, 348568, 349645, 351229, 353148, 354982, 356543, 358359, 361269, 365525, 370674, 376282, 382377, 389084, 396258, 403731, 411600, 420030, 428947, 438161, 447668, 457678, 468421, 480005, 492258, 504540, 515932, 525868, 534523, 542341, 549257, 554636, 557950, 559237, 558804, 556683, 552600, 546411, 538401, 529162, 519303, 509291, 499447, 489974, 480946, 472290, 463796, 455279, 446908, 439396, 433649, 430054, 428160, 427225, 427106, 428484, 432290, 439058, 448705, 460482, 472848, 483539, 490225, 491490, 487415, 479374, 469225, 458506, 448139, 438674, 430545, 423932, 418550, 413906, 409853, 406686, 404682, 403799, 403834, 404553, 405528, 406220, 406510, 406907, 407956, 409569, 411146, 412202, 412643, 412698, 412892, 413886, 415953, 418645, 421333, 423950, 426912, 430448, 434496, 439167, 444726, 450965, 457069, 462285, 466295, 468752, 469043]
59258D69043j996l256l059k465k921m662o563p456p249o748o596o600o178n231
59244C98063m294l786l468k840j823p92j03J50J20J89P36J628K203K106J858K109
59228C92056K593K510J753J011O13P5r31j936k447k673l027l334l179k665k260
59213C78159k132k173k495l211l843l575k281q09p7j70m48l19K31O60M35k26l79
59196C57347N82J900K177J169K46P69K399L621L627L081L034L595L960L497K468
59181C93472J637J344J214Q14L30K87O79Q87N67J24Q1L65O98J268K423L885M912
59164D14987N194N070M817M433M118M246M593M343L246K135J718J478N04j091
59150D59791k351k845k944k948k763k481k406k429k197j973k471l535m028l474
$$ y = [469043, 467047, 463791, 460732, 458267, 455346, 450684, 444121, 436665, 429416, 422668, 416072, 409472, 403294, 398063, 393769, 389983, 386515, 383675, 381852, 381060, 380957, 381107, 381227, 381416, 382152, 383780, 385983, 388089, 389947, 392056, 394649, 397159, 398912, 399923, 400536, 400611, 399680, 397744, 395297, 392624, 389597, 386263, 383084, 380419, 378159, 376027, 373854, 371359, 368148, 364305, 360730, 358449, 357640, 357563, 357393, 356945, 356626, 356857, 357517, 357952, 357726, 357347, 357929, 359829, 362006, 363175, 363421, 364190, 366589, 370210, 373837, 376918, 379952, 383547, 387507, 391004, 393472, 395109, 396453, 397667, 398481, 398811, 399098, 399777, 400664, 401231, 401355, 401436, 401801, 402499, 403767, 406190, 410075, 414987, 420181, 425251, 430068, 434501, 438619, 442865, 447458, 451801, 455047, 457182, 458900, 460378, 460882, 459791, 457440, 454595, 451651, 448703, 445940, 443459, 441053, 438624, 436427, 434454, 431983, 428448, 424420, 420946]
59136D20946k845l080l627l411k522j901j795j628j206r10p57k83M61Q01N48L07
59120C99098M09M12J19K69J577L636N395O290O431O119N708N635O002O341O148
59105D59589N438M496L535K885K955L464L299J803k22j512j899k066k232k063
59091D77470j685j655j894j697r62m06l67l34j15m29j791l548m689n044n110n212
59075D42532n469o073o904p266o680n655n059m970m683l753k455j352q66j055
59061C80292j507j609j309j244j763k249j973j163n47j77L80R88J004M39J03M53
59045C70118J097J576J918K110J832J071L71R2l9k00R7J298K888L763L379K219
59029C93590J280J260K079K995L424L685M541N995P112P270P019P257Q079Q871
$$ y = [420946, 418101, 415021, 411394, 407983, 405461, 403560, 401765, 400137, 398931, 398021, 397264, 396981, 397442, 398243, 398791, 399098, 399507, 399919, 400038, 400307, 401884, 405520, 410915, 417205, 423636, 429755, 435463, 441098, 447100, 453441, 459589, 465027, 469523, 473058, 475943, 478898, 482362, 485661, 487464, 487242, 485730, 483831, 481765, 479533, 477470, 475785, 474130, 472236, 470539, 469577, 469171, 468804, 468470, 468355, 467926, 466135, 462587, 457898, 452854, 447744, 442532, 437063, 430990, 424086, 416820, 410140, 404485, 399426, 394456, 389773, 386020, 383565, 382213, 381347, 380292, 378785, 377176, 375867, 374623, 372860, 370611, 368638, 367475, 366928, 366751, 367131, 368119, 369123, 369562, 369665, 370118, 371215, 372791, 374709, 376819, 378651, 379722, 380093, 380185, 380146, 379946, 380043, 381341, 384229, 387992, 391371, 393590, 394870, 396130, 398209, 401204, 404628, 408313, 412854, 418849, 425961, 433231, 440250, 447507, 455586, 464457]
59015D64457R150Q777P699O077M449L272K369J294O3q64j216j098o79j22K75L27
58999E04230L51R28K151L433M114M067L680L387L255K965K302J577J271J179M27
58984E39317j336l217m013l624k998k932l377l778l570k457o66J135K544L853
58970E14881N319O371O283N449N127N784O571O664O344O293O494O460O026N272
58956E99338M014K050j85j830k625l221m352n994p583q810r902j1085j2025j2055
58942E25735j0957r346q130p700p721p598p023o128n346n052n191n294m964m244
58928D31041l412k601j855j271q29k95L76P22L57m13r73j318j831k298j918n44
58912D12938Q47J376J375J727K580L279L395L254L407M058N031O075O990P646
$$ y = [464457, 473607, 482384, 490083, 496160, 500609, 503881, 506250, 507544, 507607, 506743, 505527, 504429, 503750, 503628, 503903, 504230, 504581, 505509, 507660, 511093, 515207, 519274, 522954, 526341, 529596, 532561, 534863, 536440, 537711, 538890, 539317, 537981, 534764, 530751, 527127, 524129, 521197, 517820, 514042, 510472, 508015, 507349, 508484, 511028, 514881, 520200, 526571, 532854, 538303, 543430, 549214, 555785, 562449, 568793, 575086, 581580, 588040, 594066, 599338, 603352, 605402, 605217, 603387, 600762, 597541, 593189, 587195, 579612, 570802, 560900, 549815, 537790, 525735, 514778, 505432, 497302, 489602, 481881, 474283, 467260, 461132, 455786, 450734, 445543, 440249, 435285, 431041, 427629, 425028, 423173, 421902, 421073, 420778, 421154, 421876, 422233, 421820, 420847, 419529, 417698, 415400, 413482, 412938, 413785, 415161, 416536, 418263, 420843, 424122, 427517, 430771, 434178, 438236, 443267, 449342, 456332, 463978]
58898D63978P945P874P556P205O911O594O339O531P368Q485R467J0627J2534J4806
58884E84220J6181J6034J5082J4138J2894J0703Q019O033N023L922J759j172l935
58871F88901o179q264j0339j1886j2338j1808j0972j0280r677r050q630q587q552
58858E62339q020p085o315n960n806n816o310p322q320q820q857q613q109p484
58844D59502p049o709n908m609l746m097n141n683n301m504l773l203k929l089
58830C93761l382l321k958k742k612j966p59J32Ln99m77P96K434L360L278K758
58814C87706K429K277J874J214R90J752L071L914L751K989K316J998J835J512
58800D19628Q86R4o04j171j835k660l281l354l103l112l601m180m242l428j879
$$ y = [463978, 471923, 479797, 487353, 494558, 501469, 508063, 514402, 520933, 528301, 536786, 546253, 556880, 569414, 584220, 600401, 616435, 631517, 645655, 658549, 669252, 677271, 683304, 688327, 692249, 694008, 692836, 688901, 682722, 674458, 664119, 652233, 639895, 628087, 617115, 606835, 597158, 588108, 579478, 570891, 562339, 554319, 547234, 540919, 534959, 529153, 523337, 517027, 509705, 501385, 492565, 483708, 475095, 466986, 459502, 452453, 445744, 439836, 435227, 431481, 427384, 422243, 416560, 411259, 406755, 402982, 399779, 396850, 393761, 390379, 387058, 384100, 381358, 378746, 376780, 376021, 376153, 376156, 375557, 375080, 375876, 378310, 381670, 384948, 387706, 390135, 392412, 394286, 395500, 396490, 398242, 401313, 405227, 408978, 411967, 414283, 416281, 418116, 419628, 420514, 420608, 420004, 418833, 416998, 414338, 411057, 407703, 404600, 401488, 397887, 393707, 389465, 386037, 384158]
58785C84158k94N22M52K43N90J345K035K741L821N013N538N037L809K113n5k448
58769D14620m491n852o627o882o569n877n118m259l177k361k501l321l609k773
58755C51203j511o26oO84J215J350J518K129K707K562J964J811K321K857K972
58740C73150K984L399M306N378O099O070N402M778M711M915M805M416M348M831
58726D39592N354N301M567L514K604K113J991J930J778J678J736J779J793K205
58712D77935L333M789N909O546O898O810N924M461L131K170J084n48k559m637
58698E21246o721q693j0214j1167j1773j2084j1744j0674r520q993q940q525p296
58685C94902n723m676m500m734m683m207l731l416k813j710q72j123j856j474
$$ y = [384158, 383864, 384386, 384838, 385081, 385671, 387016, 389051, 391792, 395613, 400626, 406164, 411201, 415010, 417123, 417068, 414620, 410129, 404277, 397650, 390768, 384199, 378322, 373204, 368945, 365768, 363407, 360906, 357585, 353976, 351203, 349692, 349066, 349060, 349744, 350959, 352309, 353827, 355956, 358663, 361225, 363189, 365000, 367321, 370178, 373150, 376134, 379533, 383839, 389217, 395316, 401386, 406788, 411566, 416277, 421192, 425997, 430413, 434761, 439592, 444946, 450247, 454814, 458328, 460932, 463045, 465036, 466966, 468744, 470422, 472158, 473937, 475730, 477935, 481268, 486057, 491966, 498512, 505410, 512220, 518144, 522605, 525736, 527906, 528990, 528442, 525883, 521246, 514525, 505832, 495618, 484451, 472678, 460594, 448850, 438176, 428656, 419663, 410723, 402198, 394902, 389179, 384503, 380003, 375269, 370586, 366379, 362648, 359232, 356419, 354709, 353837, 352714, 350858, 349384]
58671C49384M72K566L405L359L728M808N787O236O679P548Q327Q035O225L367
58657D19926M73j613k773l464l957m053l690l349l335l175k402j610j838k961
58643C82179l636l032j797j020r75j294j713k075k015j267j17Q93J523J869K036
58628C69559K070J952J516O52k24l63L62J166J361J234J372J620J446J094J493
58613C86310K916M449N041M675M140M028M166L975L178K139J446J212R71M25j32
58598D28939l70n27r90j572j856j961k334k833k765j948j020m94q7P10J962L449
58582D16303N031O469P301P299O785O236N766N302M882M531M131L734L751M489
58568D92010N697O891P900Q867R876J0971J2348J4174J6191J7810J8642J8807
$$ y = [349384, 349856, 352422, 355827, 359186, 362914, 367722, 373509, 379745, 386424, 393972, 402299, 410334, 416559, 419926, 420399, 418786, 416013, 412549, 408592, 404539, 400849, 397500, 394165, 390990, 388588, 386978, 385140, 382179, 378543, 375511, 373714, 372694, 371719, 370425, 368712, 366637, 364622, 363355, 363238, 364131, 365654, 367523, 369559, 371629, 373581, 375097, 375749, 375525, 375162, 375524, 376690, 378051, 379285, 380657, 382277, 383723, 384817, 386310, 389226, 393675, 398716, 403391, 407531, 411559, 415725, 419700, 422878, 425017, 426463, 427675, 428646, 429071, 428939, 428569, 428042, 427052, 425480, 423624, 421663, 419329, 416496, 413731, 411783, 410763, 410269, 410182, 410892, 412854, 416303, 421334, 427803, 435104, 442403, 449188, 455424, 461190, 466492, 471374, 475905, 480036, 483770, 487521, 492010, 497707, 504598, 512498, 521365, 531241, 542212, 554560, 568734, 584925, 602735, 621377, 640184]
58556F40184J8674J8377J7530J5544J2316Q543N084K094q37l695n760o477o206
58543G15371n772n614n694n991o661p784r241j0838j2365j3609j4331j4303j3523
58530E89645j2467j1787j1466j0609q627o288m818m222l463k222j262r01m71K29
58516E11271K50q58j914j751j064j325k463l036k349j141k47K22L75K43N3N3j9
58499D96300m68q99p27k78m07j057j245n64L28Q98J421K171K802K980K956L130
58483E07341L572M243N109N930O424O876P898R474J0866J1538J1570J0995R577
58470F11413P443N272L457J771Nj644l075m454n546n631m468k772j342k76O11
58455F00764J348K150L523N412O788O802N884N163N002M662L255O31k513n132
$$ y = [640184, 658858, 677235, 694765, 710309, 722625, 731168, 736252, 738346, 737509, 733814, 728054, 721577, 715371, 709599, 703985, 698291, 692300, 685639, 677855, 668614, 657776, 645411, 631802, 617471, 603168, 589645, 577178, 565391, 553925, 543316, 534689, 528401, 523583, 519361, 515898, 513676, 512414, 511513, 511042, 511271, 511521, 510663, 508749, 506998, 505934, 504609, 502146, 499110, 496761, 495620, 495373, 495595, 495970, 496213, 496266, 496319, 496300, 495832, 494933, 494206, 493928, 493521, 492464, 491219, 490655, 490983, 491881, 493302, 495473, 498275, 501255, 504211, 507341, 510913, 515156, 520265, 526195, 532619, 539495, 547393, 556867, 567733, 579271, 590841, 601836, 611413, 618856, 624128, 627585, 629356, 629361, 627717, 624642, 620188, 614642, 609011, 604543, 601771, 600429, 600153, 600764, 602112, 604262, 607785, 613197, 619985, 626787, 632671, 637834, 642836, 647498, 650753, 651384, 648871, 643739]
58441F43739o547o859o609o103n421m832m574m208l012j182J60M75N11J104K056
58426E98698K829L673N225P382R355J0641J1300J1383J0725R364P670N967M240
58413F98452K304J53j950l616m629n000m816m229l699l818m596n296n330m912
58399F49018m297l069r56J159K236K689L784N513O501O106N272M893M645L952
58385F87446L018K244J539P99K50o2l26k60O85K089K708K303K152L098M287M579
58369G16549M122L754L844M475N854P631Q761Q802Q581Q904R549J0108J0686J0973
58355H22593J0016P920O488O900P863P433N679M076L212K712K712L675N105N952
58341I02336O147O515P356Q274R127J0049J0803J1153J1599J2795J4457J5699
$$ y = [643739, 637192, 630333, 623724, 617621, 612200, 607368, 602794, 598586, 595574, 594392, 594552, 595027, 595538, 596642, 598698, 601527, 605200, 610425, 617807, 627162, 637803, 649103, 660486, 671211, 680575, 688245, 694212, 698452, 700756, 700909, 698959, 695343, 690714, 685714, 680898, 676669, 672970, 669152, 664556, 659260, 653930, 649018, 644721, 641652, 640696, 641855, 644091, 646780, 650564, 656077, 662578, 668684, 673956, 678849, 683494, 687446, 690464, 692708, 694247, 695046, 695296, 695234, 694908, 694648, 695333, 697422, 700130, 702433, 704585, 707683, 711970, 716549, 720671, 724425, 728269, 732744, 738598, 746229, 754990, 763792, 772373, 781277, 790826, 800934, 811620, 822593, 832609, 840529, 847017, 853917, 861780, 869213, 874892, 878968, 882180, 884892, 887604, 891279, 896384, 902336, 908483, 914998, 922354, 930628, 939755, 949804, 960607, 971760, 983359, 996154, 1010611, 1026310]
58329A026310J6090J5729J4721J3456J2656J2401J1769J0280Q873Q474Q527Q102
58317A167388P568P887Q946R900J0488J0815J0614R932R764J0764J2137J3057
58305A289260J4126J6018J7790J8290J8229J8999K0273K0748K0516K0634K1031
58294A495914K0914K0736K1551K2855K3277K3071K3731K5311K6372K6550K6964
58283A757246K7982K8672K8677K8688K8837K8463K7680K7489K8146K9063L0232
58272B071175L2204L4703L6946L9094M1779M4558M6616M8524N1316N4363N6361
58261B557639N7925O0816O4880O8299P0622P2979P5430P6817P7329P8596Q0990
58250C342322Q3356Q5542Q8712R3003R7392J01995J07950J14979J21689J28238
$$ y = [1026310, 1042400, 1058129, 1072850, 1086306, 1098962, 1111363, 1123132, 1133412, 1142285, 1150759, 1159286, 1167388, 1174956, 1182843, 1191789, 1201689, 1212177, 1222992, 1233606, 1243538, 1253302, 1264066, 1276203, 1289260, 1303386, 1319404, 1337194, 1355484, 1373713, 1392712, 1412985, 1433733, 1454249, 1474883, 1495914, 1516828, 1537564, 1559115, 1581970, 1605247, 1628318, 1652049, 1677360, 1703732, 1730282, 1757246, 1785228, 1813900, 1842577, 1871265, 1900102, 1928565, 1956245, 1983734, 2011880, 2040943, 2071175, 2103379, 2138082, 2175028, 2214122, 2255901, 2300459, 2347075, 2395599, 2446915, 2501278, 2557639, 2615564, 2676380, 2741260, 2809559, 2880181, 2953160, 3028590, 3105407, 3182736, 3261332, 3342322, 3425678, 3511220, 3599932, 3692935, 3790327, 3892322, 4000272, 4115251, 4236940, 4365178]
58240D365178J36034J44862J53197J61278J70898J82198J93758K05731K19590
58231E932724K34816K49385K63589K79834K98520L17918L38176L61625L88916
58222H665503M18831M51909M90062N32772N78309O28665O88274P57853Q34798
58213A4046976R19464J015004J121155J235442J361713J510783J691599J909046
58205B4811182K171495K492802K885958L364327L952245M686790N608420O760446
58197E6733665Q198891R988645J2183672J4822430J7947505K1608409K5802285
58190A67285502L0338161L4642892L7609595L7717000L3602691K4895136J2705094
58183C78796071p08499j2922986k2279021k8201023l0955378l1237016k9850385
$$ y = [4365178, 4501212, 4646074, 4799271, 4960549, 5131447, 5313645, 5507403, 5713134, 5932724, 6167540, 6416925, 6680514, 6960348, 7258868, 7576786, 7914962, 8276587, 8665503, 9084334, 9536243, 10026305, 10559077, 11137386, 11766051, 12454325, 13212178, 14046976, 14966440, 15981444, 17102599, 18338041, 19699754, 21210537, 22902136, 24811182, 26982677, 29475479, 32361437, 35725764, 39678009, 44364799, 49973219, 56733665, 64932556, 74921201, 87104873, 101927303, 119874808, 141483217, 167285502, 197623663, 232266555, 269876150, 307593150, 341195841, 366090977, 378796071, 378087572, 365164586, 342885565, 314684542, 283729164, 252492148, 222641763]
58176B22641763k7511417k4742034k1864611j9067833j6467366j4126218j2065074
58169H6797210j0283631q773386p512589o465345n594832m871818m269667l761641
58161C5264301l327378k954707k632226k346823k090351j861514j658666j476739
58153A6915897j312869j168405j042896r31711q31785p44563o71093o09009n55974
58144I047592n11386m73075m37024m02167l71094l44507l19382k94206k71469
58135E623282k52942k36651k20658k06040j93820j82474j70707j59704j50561
58126C849725j42245j33890j26471j20535j14882j08933j03818r9777r5218q9685
58116B714271q4979q1897p8620p3885o9088o5600o2556n8997n5772n3555n1268
$$ y = [222641763, 195130346, 170388312, 148523701, 129455868, 112988502, 98862284, 86797210, 76513579, 67740193, 60227604, 53762259, 48167427, 43295609, 39025942, 35264301, 31936923, 28982216, 26349990, 24003167, 21912816, 20051302, 18392636, 16915897, 15603028, 14434623, 13391727, 12460016, 11628231, 10883668, 10212575, 9603566, 9047592, 8536206, 8063131, 7626107, 7223940, 6852846, 6508339, 6188957, 5894751, 5623282, 5370340, 5133689, 4913031, 4706991, 4513171, 4330697, 4159990, 4000286, 3849725, 3707480, 3573590, 3447119, 3326584, 3211702, 3102769, 2998951, 2899174, 2803956, 2714271, 2629292, 2547395, 2468775, 2394890, 2325802, 2260202, 2197646, 2138649, 2082877, 2029322, 1978054]
58105A978054m8257m5766m4602m3500m1506l9907l9882m0305l9803l9131l9433
58094A515962l9813l8726l6521l4620l3307l1983l0587k9226k7414k5031k3088
58083A165646k2240k1627k0374j9105j8674j8585j7967j7090j6595j6257j5706
58072I61426j5397j5666j5793j5192j4579j4679j4834j4139j3055j2569j2457
58061H03066j1802j0591r675r569j0203j1319j2277j2149j0836r493r082r177
58049F76893q927q307p684p015o387o399p098p418o695n854n995o599o372n296
58035E80847m534m699n356o075o919p912q833r490r809r769r612r679r788r339
58021D69033q323p463p019o285m928l931m322n616o400o004m861l609k621k138
$$ y = [1978054, 1929797, 1884031, 1839429, 1795929, 1754423, 1714516, 1674634, 1634329, 1594526, 1555395, 1515962, 1476149, 1437423, 1400902, 1366282, 1332975, 1300992, 1270405, 1241179, 1213765, 1188734, 1165646, 1143406, 1121779, 1101405, 1082300, 1063626, 1045041, 1027074, 1009984, 993389, 977132, 961426, 946029, 930363, 914570, 899378, 884799, 870120, 855286, 841147, 828092, 815523, 803066, 791264, 780673, 770998, 761429, 751226, 739907, 727630, 715481, 704645, 695152, 686070, 676893, 667966, 659659, 651975, 644960, 638573, 632174, 625076, 617658, 610963, 605109, 599114, 592515, 586143, 580847, 576313, 571614, 566258, 560183, 553264, 545352, 536519, 527029, 517220, 507451, 497839, 488160, 478372, 469033, 460710, 453247, 446228, 439943, 435015, 431084, 426762, 421146, 414746, 408742, 403881, 400272, 397651, 395513]
58007C95513k197k483k598k411k014j725k059l106l995l729k525j495j001m45
57993C63730K68L87k41o71l86o9k99o83r72j712l051m019l956l533l465l337k654
57976C35337j981j946k114j883j645j890k064j441m14J87K59j2r00k310l071k346
57960C11766j057o68j201j686j874k103k102j393n10m38r94j068k84O50J108J057
57944B99203O13M4NP99J754K170K422L208M189M517M238M052M061L920L771L817
57928C42783L368J701m12j493j451j545k291k900k830k549k510k588k837l544
57914C20902m299m108k848j618j274j521j685j565j202o40k40m44j037j347j320
57899B95754j560k189k540k263j858j808j899j762j409r55l76J42K02k10o70r20
$$ y = [395513, 393316, 390833, 388235, 385824, 383810, 382085, 380026, 376920, 372925, 369196, 366671, 365176, 364175, 363730, 363998, 364385, 364144, 363473, 363087, 363018, 362719, 362036, 361064, 359352, 356301, 352282, 348326, 344793, 341328, 337991, 335337, 333356, 331410, 329296, 327413, 325768, 323878, 321814, 320373, 319959, 320146, 320405, 320393, 319493, 317183, 314112, 311766, 310709, 310041, 308840, 307154, 305280, 303177, 301075, 299682, 299172, 298734, 297740, 296672, 296388, 297038, 298146, 299203, 299816, 299860, 299865, 300664, 302418, 304588, 307010, 310218, 314407, 318924, 323162, 327214, 331275, 335195, 338966, 342783, 346151, 347852, 347440, 345947, 344496, 342951, 340660, 337760, 334930, 332381, 329871, 327283, 324446, 320902, 316603, 312495, 309647, 308029, 306755, 305234, 303549, 301984, 300782, 300142, 299902, 299458, 298421, 297074, 295754, 294194, 292005, 289465, 287202, 285344, 283536, 281637, 279875, 278466, 277511, 277135, 277277, 277479, 277269, 276599, 275679]
57883B75679j042r60m28L48P57N54K1o60j531k326k607k473k417k345j642l84
57867B58544M58M48L86R98J744J634Q04M33J262K764L825L890L386L098L202L124
57851B90000K468J693J428J331M19j489l334m050l710l187l136l560m046m161
57837B66666l802l299l045l090l263l486l640l379k548j519p16J0R38J772K064
57822B39663K206L081M614N480M572K230l08k143l182l805m372m902n125m939
57808B33070m641m501m352l967l512l183k722j898j165j113j469j375n44N56J513
57793B00697K283K773K887K930L227L468L191K699K692L080L140K780K622K823
57779B41292K859K600K557K830K915K722K716K732J807k17k034k500k045j801
$$ y = [275679, 274637, 273677, 273249, 273597, 274354, 274908, 274929, 274269, 272738, 270412, 267805, 265332, 262915, 260570, 258928, 258544, 259002, 259450, 259836, 260834, 262578, 264212, 265016, 265449, 266711, 269475, 273300, 277190, 280576, 283674, 286876, 290000, 292468, 294161, 295589, 296920, 297339, 295850, 292516, 288466, 284756, 281569, 278433, 274873, 270827, 266666, 262864, 259565, 256520, 253430, 250167, 246681, 243041, 239662, 237114, 235595, 234879, 234889, 235827, 237599, 239663, 241869, 244950, 249564, 255044, 259616, 261846, 261538, 259395, 256213, 252408, 248036, 243134, 238009, 233070, 228429, 223928, 219576, 215609, 212097, 208914, 206192, 204294, 203129, 202016, 200547, 199172, 198628, 199184, 200697, 202980, 205753, 208640, 211570, 214797, 218265, 221456, 224155, 226847, 229927, 233067, 235847, 238469, 241292, 244151, 246751, 249308, 252138, 255053, 257775, 260491, 263223, 265030, 264813, 262779, 260279, 258234, 256433]
57765B56433k167k891l781m549m599l790k852k446k334k102k022k385k570j826
57751B16119n77K7k24l02N23J693K109J472M72j1K73Q94J321J428J357J107O08
57734B28289J35J34N78R43R01O98N77M00K0l27m36n30r79j725k337k466k168j850
57716B19857j896k267k509k369k196k438k976l372l538l542l095j941o87l70j115
57701A85546j932j921j067J65J255J606R67j0l94k45m29j153j702j768j922k376
57685A74620k446j744q75l06M39J714K868L294L555M547O214Q014J0079J2928
57671B22901J6487K0381K4943L0907L8058M4579M7665M4642L4264J7906n81j6886
57659E25266k8416l4767l6875l6205l4080l1094k7192k2635j8359j5128j2800
$$ y = [256433, 254266, 251375, 247594, 243045, 238446, 234656, 231804, 229358, 227024, 224922, 222900, 220515, 217945, 216119, 215542, 215569, 215345, 215043, 215566, 217259, 219368, 220840, 221312, 221301, 221574, 222468, 223789, 225217, 226574, 227681, 228289, 228424, 228558, 229136, 230079, 230980, 231678, 232255, 232655, 232675, 232348, 231912, 231382, 230403, 228678, 226341, 223875, 221707, 219857, 217961, 215694, 213185, 210816, 208620, 206182, 203206, 199834, 196296, 192754, 189659, 187718, 187031, 186661, 185546, 183614, 181693, 180626, 180791, 182046, 183652, 184619, 184609, 184215, 183970, 183541, 182388, 180686, 178918, 176996, 174620, 172174, 170430, 169555, 169249, 169688, 171402, 174270, 177564, 181119, 185666, 191880, 199894, 209973, 222901, 239388, 259769, 284712, 315619, 353677, 398256, 445921, 490563, 524827, 542733, 542152, 525266, 496850, 462083, 425208, 389003, 354923, 323829, 296637, 274002, 255643, 240515, 227715]
57648B27715j0890r285q005o833n676m752m007k997j785j215j728k590k858k398
57634A62696j460p9J330J749Q64k01l75r2k63n87k46M53N33Pl36n12j287k559
57616A59635l180k546j277j66M97N57n2q01r57o12m52n42k51M72P91K45n96r93
57598A49772r00o73n84q10j338j777j824j803k152k509k165j271p17q14r77q11
57582A28647n67m20j91J6k11q01j181j237j424j755j641j015o77j039j455j273
57566A13776p70n02m97o05r58j445j358k46J336K452K787K595K064J311O86N20
57550A21146P63J152J482J539J101K82m16o00k36N73J610K269J918P44k97o56
57534A32374o90p68o24JP30J068J041Q61M46j62n02l93m41j108j715j177M12J771
$$ y = [227715, 216825, 207540, 199535, 192702, 187026, 182274, 178267, 175270, 173485, 172270, 170542, 167952, 165094, 162696, 161236, 161157, 162487, 164236, 165100, 164899, 164524, 164432, 164169, 163582, 163336, 163789, 164322, 164329, 163993, 163481, 162194, 159635, 156455, 153909, 152632, 152466, 152963, 153520, 153468, 152667, 151710, 151098, 150646, 150104, 149853, 150325, 151116, 151361, 150765, 149772, 148872, 148199, 147615, 146805, 145467, 143690, 141866, 140063, 137911, 135402, 133237, 131966, 131249, 130435, 129458, 128647, 128080, 127660, 127469, 127485, 127274, 126473, 125292, 124055, 122631, 120876, 119235, 118220, 117543, 116504, 115049, 113776, 113006, 112504, 112007, 111402, 110444, 108999, 107641, 107395, 108731, 111183, 113970, 116565, 118629, 119940, 120626, 121146, 121909, 123061, 124543, 126082, 127183, 127465, 127049, 126449, 126213, 126786, 128396, 130665, 132583, 133327, 133030, 132374, 131684, 130916, 130292, 130293, 131023, 132091, 133132, 133993, 134439, 134277, 133775, 133382, 132941, 131833, 130118, 128941, 129353, 131124]
57516A31124J965J287N37O6j58l2O28J655K428K418J732R83N13N6o78j347j345
57499A41832o93l4K13J79qm25r13j072r53j118j670j852j080J37Q17O78K08j18
57481A34128j49J02M77O97P05P06O27m7j383k429k215j048j66j95o13q06q86j252
57463A26253j837k178k012j481q72k74M21J244J927K134J853J396R09K55n45j039
57447A26154q81l40J01M36J068K070K913L000K238J116L27K68O80Q68M52j54j97
57430A40119M97J366J761J559J084O38K47j64m73l67K78J039J295R38M97M08M47
57413A51169J58l84o19j93O75J491J873J630P94k52q87p36J2P67J025O54l8n07
57395A56632l39L14P93O48K37L12R48J363J055O28R78J965K635K596K393K398
$$ y = [131124, 133089, 134376, 134913, 134979, 134821, 134789, 135417, 137072, 139500, 141918, 143650, 144633, 145146, 145202, 144524, 143177, 141832, 141139, 141105, 141318, 141497, 141489, 141064, 140151, 139079, 138126, 137008, 135338, 133486, 132406, 132543, 133360, 134038, 134246, 134128, 133979, 134081, 134558, 135255, 135960, 136666, 137293, 137246, 135863, 133434, 131219, 130171, 130005, 129810, 129197, 128391, 127505, 126253, 124416, 122238, 120226, 118745, 117873, 117599, 118020, 119264, 121191, 123325, 125178, 126574, 127483, 127738, 127193, 126154, 125273, 124933, 125034, 125470, 126538, 128608, 131521, 134521, 136759, 137875, 138202, 138470, 139150, 140018, 140470, 140316, 140119, 140616, 141982, 143743, 145302, 146386, 147024, 147271, 147107, 146634, 146267, 146545, 147584, 148879, 149817, 150314, 150722, 151169, 151327, 150943, 150324, 150131, 150806, 152297, 154170, 155800, 156594, 156342, 155455, 154719, 154731, 155498, 156523, 157177, 157139, 156632, 156293, 156607, 157400, 158048, 158285, 158597, 159545, 160908, 161963, 162591, 163569, 165534, 168169, 170765, 173158, 175556]
57379A75556K175J360M27M3K30O74J280J844J769Q23k55o43m75k60J96J243K248
57362A88235K247J489J124J364J359R49J084K077K790K327J365R79J111J162J296
57347B10958K017L022L480L215K721K238J617R58O00N30L62M3M5P75J965K771
57331B37317K459J171j0j28N19Q00K78l97p27j026j440j267q2J268J708J441J503
57314B43387K211L008L523L805L703K997K144J972K545L062L112L140L542L914
57300B86065L670K947K456K675L410M050M136L738L288L066K986K920K937L052
57286C31396L129L231L668M386M832M827M983N714O365O141N392N065N223N122
57272C99474M674M655N310N829N625N267N538O198O339N634M668M154M277M769
$$ y = [175556, 177731, 179091, 179518, 179561, 179791, 180465, 181745, 183589, 185358, 186181, 185926, 185283, 184808, 184548, 184744, 185987, 188235, 190482, 191971, 193095, 194459, 195818, 196767, 197851, 199928, 202718, 205045, 206410, 207389, 208500, 209662, 210958, 212975, 215997, 219477, 222692, 225413, 227651, 229268, 230226, 230826, 231356, 231718, 231761, 231806, 232581, 234546, 237317, 239776, 240947, 240937, 240809, 241328, 242128, 242406, 242009, 241282, 240256, 238816, 237549, 237467, 238735, 240443, 241884, 243387, 245598, 248606, 252129, 255934, 259637, 262634, 264778, 266750, 269295, 272357, 275469, 278609, 282151, 286065, 289735, 292682, 295138, 297813, 301223, 305273, 309409, 313147, 316435, 319501, 322487, 325407, 328344, 331396, 334525, 337756, 341424, 345810, 350642, 355469, 360452, 366166, 372531, 378672, 384064, 389129, 394352, 399474, 404148, 408803, 414113, 419942, 425567, 430834, 436372, 442570, 448909, 454543, 459211, 463365, 467642, 472411]
57258D72411N298N678N814N627N139M647M570M944N354N456N336N069M429L475
57244E43247L048L978N905P597Q356Q570Q809R029Q889Q432Q106Q385R364J0612
57230F52327J1421J1517J1357J1530J2007J2306J2213J1936J1742J1821J2248
57219G82425J2770J2880J2581J2606J3312J3873J3408J2479J2379J3192J3751
57208I25656J3566J3488J4155J4971J5177J4934J4765J4746J4884J5486J6471
57197A088299J7028J6720J6328J6837J8023J8863J8984J8910J9071J9346J9588
57186A287997J9970K0626K1359K1768K1559K0848K0281K0527K1470K2269K2467
57175A521141K2536K2972K3400K3216K2698K2605K2942K2915K2176K1354K1168
$$ y = [472411, 477709, 483387, 489201, 494828, 499967, 504614, 509184, 514128, 519482, 524938, 530274, 535343, 539772, 543247, 546295, 550273, 556178, 563775, 572131, 580701, 589510, 598539, 607428, 615860, 623966, 632351, 641715, 652327, 663748, 675265, 686622, 698152, 710159, 722465, 734678, 746614, 758356, 770177, 782425, 795195, 808075, 820656, 833262, 846574, 860447, 873855, 886334, 898713, 911905, 925656, 939222, 952710, 966865, 981836, 997013, 1011947, 1026712, 1041458, 1056342, 1071828, 1088299, 1105327, 1122047, 1138375, 1155212, 1173235, 1192098, 1211082, 1229992, 1249063, 1268409, 1287997, 1307967, 1328593, 1349952, 1371720, 1393279, 1414127, 1434408, 1454935, 1476405, 1498674, 1521141, 1543677, 1566649, 1590049, 1613265, 1635963, 1658568, 1681510, 1704425, 1726601, 1747955, 1769123]
57164A769123K1640K2350K2989K3320K3119K2538K2207K2472K2782K2256K0917
57153B015713J9840J9935K0928K1892K2492K3192K4295K5378K6023K6485K7183
57142B273356K7865K7978K7702K7877K8815K9900L0554L1035L1909L3267L4831
57131B605089L6518L8446M0644M3016M5456M7719M9443N0521N1284N2139N3313
57120C113588N4985N7366O0459O4132O8672P4786Q2812R2298J02705J14073J26686
57109D012562J40605J56112J74254J96409K23503K56170K95446L42823L99915
57100F197799M68665N51837O52867P75475R23591J101136J310811J552829J824535
57091A5359545K120089K429417K738249L030793L292874L512230L676712L772939
$$ y = [1769123, 1790763, 1813113, 1836102, 1859422, 1882541, 1905079, 1927286, 1949758, 1972540, 1994796, 2015713, 2035553, 2055488, 2076416, 2098308, 2120800, 2143992, 2168287, 2193665, 2219688, 2246173, 2273356, 2301221, 2329199, 2356901, 2384778, 2413593, 2443493, 2474047, 2505082, 2536991, 2570258, 2605089, 2641607, 2680053, 2720697, 2763713, 2809169, 2856888, 2906331, 2956852, 3008136, 3060275, 3113588, 3168573, 3225939, 3286398, 3350530, 3419202, 3493988, 3576800, 3669098, 3771803, 3885876, 4012562, 4153167, 4309279, 4483533, 4679942, 4903445, 5159615, 5455061, 5797884, 6197799, 6666464, 7218301, 7871168, 8646643, 9570234, 10671370, 11982181, 13535010, 15359545, 17479634, 19909051, 22647300, 25678093, 28970967, 32483197, 36159909, 39932848]
57083C9932848L783591L680654L421246K959856K278692J414795M57747m84182
57075E7445247j324066k015912k549470k934641l189109l331997l380906l350720
57067C5368426l254139l103094k909888k687536k449226k207099j971016j748244
57059A5038184j543868j360911j200045j059973r38712q34510p45448o68719o01127
57050F084871n40352m85345m35521l90080l48285l09904k74995k43420k14801
57041B842168j88735j64847j42742j22124j02634q3366o3181m2610k5628j8178
57031A888123k3634l9376n8321p3794q2907q5995q4428p9674p3485o7560o2639
57020A156310n8308n3819m8812m3448l8269l4027l1100k9052k7031k4673k2319
$$ y = [39932848, 43716439, 47397093, 50818339, 53778195, 56056887, 57471682, 57929429, 57445247, 56121181, 54105269, 51555799, 48621158, 45432049, 42100052, 38719146, 35368426, 32114287, 29011193, 26101305, 23413769, 20964543, 18757444, 16786428, 15038184, 13494316, 12133405, 10933360, 9873387, 8934675, 8100165, 7354717, 6685998, 6084871, 5544519, 5059174, 4623653, 4233573, 3885288, 3575384, 3300389, 3056969, 2842168, 2653433, 2488586, 2345844, 2223720, 2121086, 2037720, 1974539, 1931929, 1906301, 1888123, 1864489, 1825113, 1766792, 1692998, 1610091, 1524096, 1439668, 1359994, 1286509, 1218949, 1156310, 1098002, 1044183, 995371, 951923, 913654, 879627, 848527, 819475, 792444, 767771, 745452]
57009G45452k0337j8798j7819j7586j7751j7370j5916j4047j2785j2273j1738
56998E69032j0540q775o970n621m962m776m464l639k611j937j483m32J673M171
56984E18666N820N865M417J909j500n735j0171j3596j5141j5076j4261j3011j1126
56971D37060q952p466o903o144m283k067q60n40N05L288P106J0638J3243J4780
56957D49405J4859J2893Q767L146k784p944j1902j4828j6802j7396j6300j4070
56945C87044j1736r786q016o202m333k313p2K149M322P223J1556J6522K0216K1681
56931D28255K1481J9951J6087R020k46r403j6672k1367k3343k2984k1525k0385
56919C58869j9931j9388j8049j6076j4138j2661j1564j0466r127p732o724o213
$$ y = [745452, 725115, 706317, 688498, 670912, 653161, 635791, 619875, 605828, 593043, 580770, 569032, 558492, 549717, 542747, 537126, 532164, 527388, 522924, 519285, 516674, 514737, 513254, 512822, 514495, 518666, 524486, 530351, 534768, 536677, 535177, 529442, 519271, 505675, 490534, 475458, 461197, 448186, 437060, 428108, 420642, 413739, 407595, 403312, 401245, 400385, 399845, 400350, 403638, 410744, 421382, 434625, 449405, 464264, 477157, 485924, 489070, 486286, 478342, 466440, 451612, 434810, 417414, 401114, 387044, 375308, 365522, 357506, 351304, 346971, 344658, 344586, 346735, 351057, 358280, 369836, 386358, 406574, 428255, 449736, 469687, 485774, 494794, 494548, 485145, 468473, 447106, 423763, 400779, 379254, 358869, 338938, 319550, 301501, 285425, 271287, 258626, 247062, 236596, 227469, 219737, 213013, 206800]
56907B06800n821n124m074k912j930j484j754k314k269j224K43J316J867K303
56893A83623K929L870N269P093Q909J0267J1106J1456J0963R219O375L077j92
56880B73964l248n841p480p804o887n244l556k264j290k43J064K589M495P149
56866B45404J0509J3917J6917J9808K3040K6292K8454K8193K4408J6856O957k499
56854D58256r303j3440j6236j8279j8863j7431j4583j1414q402n295j736K339
56842C25613O766J1345J6005K0794K5740L0836L6077M1128M4690M4595L9126K8338
56830F71053J3963j636j6206k7802l5234l8614l9068l7696l4926l0822k5675k0108
56818C77229j4762r944n524j128L488Q297J3193J8152K3150K7942L1766L3092
$$ y = [206800, 200979, 195855, 191781, 188869, 186939, 185455, 183701, 181387, 179118, 177894, 178137, 179453, 181320, 183623, 186552, 190422, 195691, 202784, 211693, 221960, 233066, 244522, 255485, 264704, 271079, 274156, 273964, 270716, 264875, 257395, 249591, 242704, 237460, 233904, 231640, 230350, 230107, 231171, 233760, 238255, 245404, 255913, 269830, 286747, 306555, 329595, 355887, 384341, 412534, 436942, 453798, 460755, 458256, 448953, 435513, 419277, 400998, 382135, 364704, 350121, 338707, 330305, 325010, 323274, 325613, 332379, 343724, 359729, 380523, 406263, 437099, 473176, 514304, 558994, 603589, 642715, 671053, 685016, 683380, 667174, 639372, 604138, 565524, 526456, 488760, 453834, 423012, 397337, 377229, 362467, 352523, 346999, 345871, 349359, 357656, 370849, 389001, 412151, 440093, 471859, 504951]
56806E04951L0078K2008J0423j792j2577k1477k8308l2186l2554l0368k7391k4583
56794C56224k1835j8815j5401j1592p698m404j958L84L463P088J0414J3110J5237
56781C24217J6248J5126J1549O173k36p088j3387j7853j9983k0390j9894j8866
56769B55616j7572j6355j5155j3523j1403r468q275p640p029o250n391m522l701
56756A29332l047k613k411k543l046l588l726l403k851k134j289p62r99j662j940
56741I3318j658j312j060n37J89M41P7j72R0K62j02m20n7M97L88k70o83o65o19
56722H7707n72j46O06J180J458J705J765J082k20j121r28k01po15j343j402n68
56705H8380P62J847K101J615J117J170J530J516R13K01r7K4K20K46K6m60j060
$$ y = [504951, 535029, 557037, 567460, 565668, 553091, 531614, 503306, 471120, 438566, 408198, 380807, 356224, 334389, 315574, 300173, 288581, 280883, 276479, 274521, 274905, 278368, 285456, 295870, 308980, 324217, 340465, 355591, 367140, 373313, 373077, 365989, 352602, 334749, 314766, 294376, 274482, 255616, 238044, 221689, 206534, 193011, 181608, 172140, 163865, 156225, 149196, 142946, 137555, 133033, 129332, 126285, 123672, 121261, 118718, 115672, 112084, 108358, 104955, 102104, 99970, 98681, 97919, 96920, 95258, 93318, 91660, 90348, 89288, 88751, 88940, 89381, 89458, 89286, 89376, 89638, 89536, 89116, 89059, 89556, 89944, 89674, 88991, 88326, 87707, 87135, 86989, 87595, 88775, 90233, 91938, 93703, 94785, 94565, 93444, 92516, 92315, 92308, 91693, 90350, 88948, 88380, 89142, 90989, 93090, 94705, 95822, 96992, 98522, 100038, 100951, 101152, 101055, 101079, 101299, 101545, 101571, 101111, 100051]
56688A00051j392j122m07K49N77P16Q25Q09O16M92O56R28R13M63k45r56j435j447
56670A00291r30j29O17J140J369J150M71k74n17l5R29J959K617K538J712O55k
56653A13561o9K59Q60J719K539K725J976O57m44o84JJ036J578J179J15j011j798
56636A24199k147k081j728j301q62l33J26J23l31o10l31Jk36p59p38MQ08J063
56618A14867P03l3p73j036o70j88j55m36n90o88r71j087n90l5m12j509j958j176
56600A03263j37J83K4RO0j37l30j60J51K41K99P23J468K184K661K686K012Q84
56582A16084Q6j3J6l71q19p54l72k31k95j77J1n4p8N10J513K138K233K436K980
56563A24843L204K679K117K582M223O233P813Q594Q230O314L043l44k421k902
$$ y = [100051, 98659, 97537, 97130, 97379, 97956, 98672, 99497, 100306, 100922, 101414, 102070, 102998, 103911, 104374, 104129, 103173, 101738, 100291, 99361, 99232, 99849, 100989, 102358, 103508, 103979, 103705, 103188, 103153, 104082, 106041, 108658, 111196, 112908, 113563, 113561, 113492, 113751, 114611, 116330, 118869, 121594, 123570, 124227, 123783, 123099, 123100, 124136, 125714, 126893, 127008, 125997, 124199, 122052, 119971, 118243, 116942, 116080, 115747, 115873, 115996, 115665, 115055, 114724, 114725, 114489, 113730, 112992, 112996, 113804, 114867, 115570, 115537, 114764, 113728, 113058, 112870, 112715, 112279, 111689, 111001, 110030, 108943, 108353, 108318, 107906, 106397, 104439, 103263, 103126, 103309, 103333, 103342, 103402, 103265, 102935, 102775, 102926, 103167, 103466, 104189, 105657, 107841, 110502, 113188, 115200, 116084, 116170, 116157, 116173, 115802, 114983, 114229, 113857, 113626, 113331, 113154, 113165, 113111, 113033, 113543, 115056, 117194, 119427, 121863, 124843, 128047, 130726, 132843, 135425, 139648, 145881, 153694, 162288, 170518, 176832, 179875, 179531, 177110, 174208]
56549A74208k761k871k982k469j621j396j918k165j440m64m08j305k134k182j684
56534A46408j156p46m19l18n53q79q85n28j90j14k5M07Q72O40l89j355j540j294
56516A37936j332j504j088j08M98K16l61m68j41J59K64K67J94J54L97Q86J075
56499A37044N44m42j244j521j275o43J18O18O86N67N90P98R99J010P87M81L44
56482A39461L29m2r69j720j392k93K84j68o35k1J423K546K613J671K26q82q61
56465A41570K15J263J392R08O61Q60J090J117R95O06k26j165j473q74R1O05M07
56448A48042q7k97j30O5J47M39J022J273O91j30k16K36J15p85j295o39M29Q40
56430A49720O88P44J168J412J031N4j052j448o17P70J398J045Q66J493J985J397
$$ y = [174208, 171447, 168576, 165594, 163125, 161504, 160108, 158190, 156025, 154585, 154121, 153713, 152408, 150274, 148092, 146408, 145252, 144506, 144087, 143769, 143216, 142337, 141452, 140924, 140734, 140620, 140595, 141002, 141874, 142514, 142125, 140770, 139230, 137936, 136604, 135100, 134012, 133904, 134402, 134618, 134257, 133789, 133648, 133807, 134071, 134338, 134532, 134686, 135083, 135969, 137044, 137588, 137146, 135902, 134381, 133106, 132463, 132581, 133199, 133885, 134452, 135042, 135840, 136839, 137849, 138636, 139117, 139461, 139790, 139748, 138779, 137059, 135667, 135374, 135658, 135490, 134855, 134834, 136257, 138803, 141416, 143087, 143313, 142431, 141570, 141785, 143048, 144440, 145348, 146009, 146869, 147959, 149076, 150071, 150677, 150451, 149286, 147813, 146939, 147030, 147635, 148042, 147955, 147658, 147528, 147593, 147740, 148179, 149201, 150474, 151165, 151035, 150819, 151055, 151170, 150385, 149090, 148451, 148880, 149720, 150408, 151152, 152320, 153732, 154763, 154817, 153765, 152317, 151700, 152470, 153868, 154913, 155779, 157272, 159257, 160654]
56414A60654L31r4P6R4l8J88N79N38J95J06R1m30j122r64J75J174J173N21N4J05
56394A63406M78Q73J156J461K001K568K496J552M88J57M49O32M77L47N02Q79J361
56377A81283J688J406M95l01l99k60n94j142j101m53Q7L08P47J596K241K094J374
56360A89069Q15R42J644K211J945R41Ol86n67q55r00l69L50P44R13J138J310J350
56342B00301J550J872J663Q28M12J097K011K044J512J345J456J254J052J432J841
56327B21670J446Q60J323K459K713J884J399J943K537K303J573Q71K10j88J42
56312B43145Q52R66M24J88M96M30l66r12m27O51J745L001M350N000M607L965L704
56295B71819L316K253J059O02Q79J420K154L074L637L386K703K339K464K772L157
$$ y = [160654, 160985, 160891, 160967, 161061, 161023, 161211, 161790, 162328, 162523, 162629, 162720, 162290, 161168, 160204, 160379, 161553, 162726, 163247, 163301, 163406, 163884, 164757, 165913, 167374, 169375, 171943, 174439, 175991, 176479, 176636, 177085, 177717, 178194, 178541, 179043, 179922, 181283, 182971, 184377, 184872, 184571, 184172, 183912, 183318, 182176, 181075, 180622, 180709, 181017, 181764, 183360, 185601, 187695, 189069, 189884, 190826, 192470, 194681, 196626, 197567, 197573, 197187, 196620, 195765, 194865, 194496, 194846, 195590, 196503, 197641, 198951, 200301, 201851, 203723, 205386, 206214, 206626, 207723, 209734, 211778, 213290, 214635, 216091, 217345, 218397, 219829, 221670, 223116, 223976, 225299, 227758, 230471, 232355, 233754, 235697, 238234, 240537, 242110, 242981, 243191, 243003, 243145, 243997, 244963, 245387, 245575, 246071, 246501, 246135, 245223, 244796, 245447, 247192, 250193, 254543, 259543, 264150, 268115, 271819, 275135, 277388, 278447, 279049, 279928, 281348, 283502, 286576, 290213, 293599, 296302, 298641, 301105, 303877, 307034]
56280C07034L797M714N629O184O172N809N640N891O143O094O309P446R098J0267
56266C96227J0842J1533J2540J3328J3719J4159J4860J5789J7384K0149K3466
56255E63996K6217K8615L2081L7050M2417M7492N2914N9034O4945O9969P4755
56244A099485P9890Q4610Q7838Q9518Q9855Q8226Q3946P7482O9827O1067N0420
56233A962164L7394K2379O519q564k1555l2399m2062n0994n8538o4025o7638o9811
56221A612870p0707p0696p0451o9946o8250o4918o0856n7199n4062n0938m7650
56210I27197m4352m1155l8131l5264l2202k8755k5608k3607k2321k0485j7942
56199E97375j5869j4797j3874j2526j1293j0382q924o609m667m172m545m731m679
$$ y = [307034, 310831, 315545, 321174, 327358, 333530, 339339, 344979, 350870, 357013, 363107, 369416, 376862, 385960, 396227, 407069, 418602, 431142, 444470, 458189, 472348, 487208, 502997, 520381, 540530, 563996, 590213, 618828, 650909, 687959, 730376, 777868, 830782, 889816, 954761, 1024730, 1099485, 1179375, 1263985, 1351823, 1441341, 1531196, 1619422, 1703368, 1780850, 1850677, 1911744, 1962164, 1999558, 2021937, 2028456, 2019892, 1998337, 1965938, 1923876, 1872882, 1814344, 1750319, 1682681, 1612870, 1542163, 1471467, 1401016, 1331070, 1262820, 1197902, 1137046, 1079847, 1025785, 974847, 927197, 882845, 841690, 803559, 768295, 736093, 707338, 681730, 658123, 635802, 615317, 597375, 581506, 566709, 552835, 540309, 529016, 518634, 509710, 503101, 498434, 494262, 489717, 484986, 480307]
56186D80307m643m169k964j756j178p00K64J151J242R73J076J311J213J260K056
56171D75443L080L515L621M059M489M137L258K798K962L355M060N400O920P827
56157E34924Q251Q980J0059J0749J0914J1527J3490J6616J9994K3046K6142L0271
56145G24963L6094M3389N1556O0232O8721P5221P7827P6285P1661O4511N4932
56134A405392M4496L6203L1629K9630K8478K7604K6402K3205J7172R990M220P36
56122A685157j219k624m661r039j6773k7063l8264m9158n8513o4624o6570o5153
56110A281496o1546n6012m8980m2118l6835l2566k7921k2830j8330j4873j2129
56099I07356r867q038o440n108m352l763k264J83K158K860L251M174M916M818
$$ y = [480307, 475664, 471495, 468531, 466775, 465597, 464897, 465161, 466312, 467554, 468527, 469603, 470914, 472127, 473387, 475443, 478523, 482038, 485659, 489718, 494207, 498344, 501602, 504400, 507362, 510717, 514777, 520177, 527097, 534924, 543175, 552155, 562214, 572963, 583877, 595404, 608894, 625510, 645504, 668550, 694692, 724963, 761057, 804446, 856002, 916234, 984955, 1060176, 1138003, 1214288, 1285949, 1350460, 1405392, 1449888, 1486091, 1517720, 1547350, 1575828, 1603432, 1629834, 1653039, 1670211, 1680201, 1684421, 1685157, 1683938, 1681314, 1676653, 1667614, 1650841, 1623778, 1585514, 1536356, 1477843, 1413219, 1346649, 1281496, 1219950, 1163938, 1114958, 1072840, 1036005, 1003439, 975518, 952688, 934358, 919485, 907356, 897489, 889451, 883011, 877903, 873551, 869788, 867524, 867707, 869865, 872725, 875976, 880150, 885066, 889884]
56085H89884M818N874P225P738P775Q171Q565Q347Q201R049J0430J1377J1939
56072I99393J2440J2424J1722J1504J2675J4340J5209J5423J5618J5577J5229
56061A151554J5588J7067J8359J8547J8832K0429K2359K3202K3470K4175K4604
56050A378186K3745K2530K2445K3139K3553K3988K4950K5383K4401K3344K3800
56039A639464K4955K5283K5329K6333K7602K7986K8563L1046L4638L7258L8785
56028A967242M0569M2786M4817M6997M9559N1246N1310N1431N3209N5646N7530
56017B512342O0073O4293O8225P0070P1715P5498P9861Q2272Q4140Q8388R4168
56006C351045R8595J02056J07066J13380J18974J24472J31862J40178J47146J53752
$$ y = [889884, 894702, 900576, 907801, 915539, 923314, 931485, 940050, 948397, 956598, 965647, 976077, 987454, 999393, 1011833, 1024257, 1035979, 1047483, 1060158, 1074498, 1089707, 1105130, 1120748, 1136325, 1151554, 1167142, 1184209, 1202568, 1221115, 1239947, 1260376, 1282735, 1305937, 1329407, 1353582, 1378186, 1401931, 1424461, 1446906, 1470045, 1493598, 1517586, 1542536, 1567919, 1592320, 1615664, 1639464, 1664419, 1689702, 1715031, 1741364, 1768966, 1796952, 1825515, 1856561, 1891199, 1928457, 1967242, 2007811, 2050597, 2095414, 2142411, 2191970, 2243216, 2294526, 2345957, 2399166, 2454812, 2512342, 2572415, 2636708, 2704933, 2775003, 2846718, 2922216, 3002077, 3084349, 3168489, 3256877, 3351045, 3449640, 3551696, 3658762, 3772142, 3891116, 4015588, 4147450, 4287628, 4434774, 4588526]
55996D588526J62575J73052J83126J93850K07366K22185K35651K49101K65208
55987F480640K82520K98559L15928L38790L65603L92297M20399M54554M94159
55978I843449N35451N80006O32785O93584P59146Q32071R18508J018766J129755
55969A6943521J255096J403039J576750J777584K015816K306714K659331L082602
55961C3020453L600157M245966N050626O049166P297523Q860502J0785434J3105439
55953I2015266J5858261J9073221K2739633K6778350L0925635L4461149L6026873
55946B77878388L3985609K7358465J6666316L890334q470331j8476697k5245443
55939C07586641k8812225k9752711k8848607k6845856k4307229k1588298j8901408
$$ y = [4588526, 4751101, 4924153, 5107279, 5301129, 5508495, 5730680, 5966331, 6215432, 6480640, 6763160, 7061719, 7377647, 7716437, 8082040, 8474337, 8894736, 9349290, 9843449, 10378900, 10958906, 11591691, 12285275, 13044421, 13876492, 14795000, 15813766, 16943521, 18198617, 19601656, 21178406, 22955990, 24971806, 27278520, 29937851, 33020453, 36620610, 40866576, 45917202, 51966368, 59263891, 68124393, 78909827, 92015266, 107873527, 126946748, 149686381, 176464731, 207390366, 241851515, 277878388, 311863997, 339222462, 355888778, 359779112, 351308781, 332832084, 307586641, 278774416, 249021705, 220173098, 193327242, 169020013, 147431715, 128530307]
55932A28530307j6376149j4081728j2044836j0274877q770994p512140o461140
55925E3008443n583916m855154m248164l734399l294737k919762k598008k314255
55917B3460048k059769j833922j634576j455600j294312j152603j029428r19780
55909A2080058q21683p37037o64917o00911n43537m94827m53965m16604l81160
55900F965417l49995l23669k99507k76406k55972k38293k21386k05075j90934
55891D604180j78450j65822j54434j47587j44813j42087j37774j33605j29779
55882C269829j24092j16457j09561j04169r8169r0960q4614p9804p4769o9238
55872B317996o5434o4023o2797o0501n8477n7389n5628n2272m8598m5443m1953
$$ y = [128530307, 112154158, 98072430, 86027594, 75752717, 66981723, 59469583, 53008443, 47424527, 42569373, 38321209, 34586810, 31292073, 28372311, 25774303, 23460048, 21400279, 19566357, 17931781, 16476181, 15181869, 14029266, 12999838, 12080058, 11258375, 10521338, 9856421, 9255510, 8711973, 8217146, 7763181, 7346577, 6965417, 6615422, 6291753, 5992246, 5715840, 5459868, 5221575, 5000189, 4795114, 4604180, 4425730, 4259908, 4105474, 3957887, 3813074, 3670987, 3533213, 3399608, 3269829, 3145737, 3029280, 2919719, 2815550, 2717381, 2626421, 2541807, 2462003, 2387234, 2317996, 2252562, 2188539, 2125742, 2065241, 2006764, 1949375, 1893747, 1841475, 1792877, 1747434, 1705481]
55861A705481l8128l5890l6363l8302m0120m1416m1889m1016l9423l8485l8105
55850A276344l6875l4693l3009l2282l1371k9696k7828k5810k3187k0761j9960
55839I60872k0341k0023j8633j7542j7132j6347j5043j4243j3862j2715j1011
55828G83980j0221j0295r655q251p896r136j0462j1176j2292j3894j4435j3507
55816F52760j2664j2515j1627r454p818q112r170r332q626p683o400m880l938
55803E40541l546k441l25J286J350O50Rr53k190k403j118J52K39J73J332L317
55787E36073N171P219J0017J2440J2392Q845K381n472j2559j6857j7921j6901
55775E24828j4642j0851n572M2N210J0125J4059J4382R122l53j0387j8047k2267
$$ y = [1705481, 1667353, 1631463, 1595100, 1556798, 1516678, 1475262, 1433373, 1392357, 1352934, 1314449, 1276344, 1239469, 1204776, 1171767, 1139485, 1108114, 1078418, 1050590, 1024780, 1001593, 980832, 960872, 940531, 920508, 901875, 884333, 867201, 850854, 835811, 821568, 807706, 794991, 783980, 773759, 763464, 753809, 745558, 737662, 728526, 718064, 706888, 694596, 680702, 666267, 652760, 640096, 627581, 615954, 606500, 598682, 590570, 581400, 572068, 563442, 555759, 549359, 544479, 540541, 536995, 534554, 534229, 535515, 536865, 537515, 537524, 536571, 534381, 531978, 530860, 531012, 531251, 531424, 532756, 536073, 541244, 548463, 558480, 570920, 583312, 592157, 594538, 589066, 576507, 559650, 541729, 524828, 510186, 499335, 493763, 493805, 499015, 509140, 523199, 537581, 546703, 546350, 535963, 517916, 495649]
55762D95649k3196k1855j9765j7739j5391j2434r636p790o546n263m240m178m996
55749C42620o045p013p899q518q604q051o756m852l233k933l662l966l291k773
55735B65024l382m345m284l084j771j089j021j240j524k013l172n027o419o034
55721B20619m190k585k122k139j950j728j458n33R50J926K044K324L246L638K478
55706B20520N84o61j166j596j988k132k476l448m530n018n051m993m571l588k750
55691A77136k708k967k718k102j692j414r75o47o15k83P21J542J316O43O16R28
55675A66781M51p44j478j307r60q58n59J07N63M38J32R0K28L12L11K04j4o4L84
55656A64017J165J728J819J607J267Q04L17oj04o7jj10n91j202j323p65j14R1
$$ y = [495649, 472453, 450598, 430833, 413094, 397703, 385269, 375633, 367843, 361297, 356034, 351794, 347616, 342620, 336575, 329562, 321663, 313145, 304541, 296490, 289734, 284882, 281649, 278716, 275054, 271088, 267797, 265024, 261642, 257297, 253013, 249929, 248158, 247069, 246048, 244808, 243284, 241271, 238099, 233072, 226653, 220619, 216429, 213844, 211722, 209583, 207633, 205905, 204447, 203914, 204864, 206790, 208834, 211158, 214404, 218042, 220520, 221104, 220443, 219277, 217681, 215693, 213561, 211085, 207637, 203107, 198089, 193038, 188045, 183474, 179886, 177136, 174428, 171461, 168743, 166641, 164949, 163535, 162560, 161913, 161298, 161015, 161736, 163278, 164594, 165237, 165853, 166781, 167232, 166488, 165010, 163703, 162743, 161885, 161326, 161433, 161996, 162434, 162566, 162656, 162884, 163196, 163507, 163711, 163697, 163633, 164017, 165182, 166910, 168729, 170336, 171603, 172407, 172724, 172718, 172614, 172547, 172546, 172436, 171845, 170643, 169320, 168555, 168441, 168532]
55638A68532M2J17J40k57r31j511k038k777l624m275m690m920m720l936k978k403
55622A29771k189j931j470r71n42k60k60m70n67n68r80j971k859k986k617k379
55606A06751k273j978j658j653j734j445r57p28n90k7P17Q51L42M3K94L30m63
55589I5822j478j707j089l89jM08J051J501J288O97M37O46P63N23N52J484K939
55572A03447L950M212M217M262M052L370K474J562N56m51j110j460j975k722l090
55557A21294k719k122j984k348k822l043k740j930j238j385k069k201j541j103
55543I2049j476j806j219l02j08m99n40r3J43j20m92o88p41n33L3N99P55P38J031
55524H6731J518J704J508J152N51l80j159j271j137j583k533l075k782k072j281
$$ y = [168532, 168574, 168691, 168831, 168574, 167643, 166132, 164094, 161317, 157693, 153418, 148728, 143808, 139088, 135152, 132174, 129771, 127582, 125651, 124181, 123210, 122668, 122408, 122148, 121678, 121111, 120543, 119563, 117592, 114733, 111747, 109130, 106751, 104478, 102500, 100842, 99189, 97455, 96010, 95053, 94325, 93735, 93708, 94425, 95276, 95618, 95661, 95955, 96285, 95822, 94344, 92637, 91548, 91159, 91158, 91566, 92617, 94118, 95406, 96103, 96540, 97186, 97949, 98472, 99024, 100508, 103447, 107397, 111609, 115826, 120088, 124140, 127510, 129984, 131546, 132102, 131651, 130541, 129081, 127106, 124384, 121294, 118575, 116453, 114469, 112121, 109299, 106256, 103516, 101586, 100348, 98963, 96894, 94693, 93152, 92049, 90573, 88767, 87548, 87246, 87138, 86639, 86099, 86006, 86149, 86029, 85537, 84849, 84108, 83575, 83608, 84207, 84962, 85700, 86731, 88249, 89953, 91461, 92613, 93164, 92784, 91625, 90354, 89217, 87634, 85101, 82026, 79244, 77172, 75891]
55509G5891l65L64K38o86j319q60J72O70L00l90r25j423k106k672k407j103M00
55492F3779R47M27j30M2M40J91o03j070q19k33L12Q23J205J096M47k14l56k4K69
55473F6529J29l60p97r56j066j458j945j939j244l77M9l9l01l70RP07J039M42
55455E8052n36o45L62J318J318R12R77J294J156O16J62k72r24j302q45j22k60
55438F1261j222j784j243j52P20J201J349J091N61J37q5l68p33p99m08Q0J85j49
55420E9642n26m16K95J000R49L21R3N45P25j5q00n39K91L81l75r11q34q53j269
55401E7704j372o20N30J346J567J233M76l26p66r28j090j051m39M11P49M63K2
55384E7909m66j141j522q91K98P05j4o96m46K54O57Q78J192J179M37n49r85q01
$$ y = [75891, 75526, 75890, 76128, 75442, 74123, 73263, 73435, 74105, 74405, 74015, 73090, 71667, 69561, 66889, 64482, 63379, 63779, 64726, 65153, 65023, 65065, 65505, 65696, 65093, 64023, 63204, 62971, 63283, 64106, 65311, 66407, 66854, 66640, 66284, 66260, 66529, 66658, 66298, 65501, 64545, 63479, 62021, 60076, 58137, 56893, 56516, 56565, 56526, 56225, 55855, 55864, 56571, 57610, 58052, 57516, 56871, 57233, 58551, 59869, 60781, 61758, 63052, 64208, 64824, 64986, 64714, 63790, 62488, 61643, 61521, 61261, 60039, 58255, 57012, 56860, 57580, 58781, 60130, 61221, 61782, 61919, 61834, 61466, 60733, 59934, 59526, 59606, 59791, 59642, 59116, 58700, 58995, 59995, 60944, 61265, 61358, 61903, 62628, 62613, 61813, 61274, 61565, 61946, 61571, 60660, 59826, 58973, 57704, 56332, 55712, 56242, 57588, 59155, 60388, 60864, 60538, 59772, 58844, 57754, 56703, 56264, 56675, 57424, 57887, 57909, 57443, 56302, 54780, 53889, 54187, 54892, 54878, 54182, 53736, 53990, 54647, 55525, 56717, 57896, 58333, 57784, 56799, 55998]
55366E5998m53j67Q0J85O6r3j28j68l42m90m29k12L0J90J30j86m57l95j95j74
55346E2790q8M98J301J550J139O67L73q4o81q90p06p46j109j115n91k52l42p7
55328E1637Q38J305M21r53j333o58m8k7j20j2n0m90j034j258j013l98L15P98R54
55309D8874R41P70K89l00l80K07Q36J004R61J028R30M27M4L20Q10O84L1l26p3
55290E7077L18N54Q38J146R30p8j223j501o04P54J510J195L12k75k66j08k52o31
55272E9696r22r83q33n88n16p89j041o68K52R05Q70P20J075J622J638R97Q7q02
55254F0720j486j634j133m05J39O12J151J346Q25M5k64j75l15p47r05n65j15J75
55236E7269M10N08J20o71j141q23j86l1m32o58r6Q90J292O22m54r12o64n21q26
$$ y = [55998, 55545, 55378, 55458, 55643, 55709, 55616, 55488, 55320, 54978, 54488, 54059, 53847, 53877, 54067, 54197, 54011, 53554, 53159, 52964, 52790, 52702, 53200, 54501, 56051, 57190, 57857, 58230, 58146, 57465, 56575, 55869, 55123, 54014, 52899, 52308, 52056, 51714, 51637, 52475, 53780, 54201, 53248, 51915, 51257, 51209, 51182, 51062, 51050, 51000, 50510, 49476, 48218, 47205, 46807, 47122, 47920, 48874, 49815, 50585, 50874, 50574, 50194, 50401, 51237, 52241, 53202, 54230, 55160, 55587, 55631, 55951, 56761, 57445, 57476, 57150, 57077, 57395, 57949, 58787, 59933, 60863, 60785, 59562, 58061, 57457, 58211, 59721, 60916, 61228, 60953, 60687, 60579, 60327, 59696, 58774, 57791, 56958, 56370, 55854, 55065, 54024, 53356, 53608, 54513, 55383, 56103, 57178, 58800, 60438, 61435, 61522, 60720, 59234, 57600, 56467, 56062, 56201, 56813, 57964, 59310, 60135, 60180, 59916, 59741, 59426, 58679, 57774, 57209, 57094, 57269, 57679, 58187, 58307, 57636, 56495, 55672, 55486, 55455, 55023, 54365, 54269, 55159, 56451, 57073, 56619, 55707, 55043, 54522, 53696]
55217E3696q47M0J215J550R12J86jJ10P8j17k37j65L5K01K02J12J22J05l29j098
55197E5770j415p50L26Q53P08N01N00M43K64K29L20K07p5j44j1j34n24o08k25
55178E6235k2l84o79j60Q03J164O42j0j22J27K87L60O01R09R51P58P19Q85P26
55159F3790o8r32j110p50o64j036j089l28N79O67k8o42o49k56J52M36N35L98J34
55140E9139l4JK28O10R21P25r2j003j396j279j026o67n9M57K63n19r91n93J97
55121E4882O47O68N99N03K47L6L15J076J724J716J124L88j78m57l19K09O10K44
55103F4034p31j264o40N21J047P47M57O62Q64N44l2l16k57n6K70O59P40K98l28
55084F7219o81o81m03J51O43L93o41j417j043K4P18Q05P30M78k79j130j147k63
$$ y = [53696, 52849, 52889, 54104, 55654, 56566, 56752, 56751, 56861, 56939, 56822, 56585, 56420, 56455, 56656, 56858, 56970, 57092, 57197, 56868, 55770, 54355, 53605, 53931, 54784, 55492, 55993, 56493, 56936, 57200, 57429, 57749, 57956, 57881, 57737, 57726, 57592, 57068, 56460, 56235, 56213, 55829, 55150, 54990, 55793, 56957, 57599, 57589, 57467, 57594, 57881, 58241, 58842, 59751, 60702, 61460, 62179, 63064, 63790, 63722, 62790, 61680, 60930, 60266, 59230, 58141, 57813, 58392, 59059, 59031, 58389, 57740, 57484, 57636, 58072, 58607, 59005, 59139, 59105, 59106, 59334, 59944, 60865, 61590, 61498, 60495, 59099, 57820, 56794, 56127, 56068, 56525, 56788, 56269, 55278, 54685, 54882, 55529, 56197, 56796, 57299, 57546, 57582, 57897, 58973, 60697, 62413, 63537, 63925, 63747, 63290, 62971, 63180, 63790, 64034, 63303, 62039, 61399, 61920, 62967, 63714, 64171, 64833, 65697, 66241, 66209, 65893, 65636, 65580, 65850, 66509, 67249, 67547, 67219, 66538, 65857, 65454, 65605, 66248, 66641, 66000, 64583, 63540, 63564, 64282, 65087, 65817, 66295, 66016, 64886, 63739, 63476]
55066F3476N83P81O66N74K73l26p12n02qL07L82L04J9l38l96j31j8k92n59m90
55046F3593k85j39J90P66J002M16m86p96m10o3k21n42m86K2O32R71Q80M69Nl13
55026F5205m87n74n42m00l09l82m83l81lN22J001J198R08K03n04p58m89j9K55
55007F3961J94M9K77J021J734J603N22n58n69M52J366J168O8q10o42L28J214J400
54989G2778R60L05k51n90p51r27j290j642j515p37K34Q19R65R94J015Q32M17Q8
54971G1704J05L64N91O73O79O98P11O56N34M32K86j48r11j536j563j261j255j408
54953F9351q52N37J533J122j4m47P0O03O80P33R62Q41J7j067j834k152k013j365
54935F6705n25j05k04k76J3L75O30J038J571J599Q60R1K5M07O54R52J769K669
$$ y = [63476, 64059, 64840, 65506, 66080, 66353, 66027, 65315, 64813, 64805, 65112, 65494, 65798, 65817, 65479, 65083, 64952, 64934, 64642, 64083, 63593, 63308, 63169, 63359, 64125, 65127, 65543, 65057, 64261, 63851, 63788, 63567, 63025, 62539, 62561, 63193, 64164, 65044, 65513, 65518, 65205, 64718, 64144, 63602, 63202, 62893, 62511, 62028, 61647, 61644, 62166, 63167, 64365, 65273, 65476, 64972, 64214, 63725, 63706, 63961, 64155, 64204, 64481, 65502, 67236, 68839, 69361, 68803, 68234, 68686, 70052, 71220, 71288, 70478, 69836, 70164, 71378, 72778, 73738, 74043, 73792, 73202, 72451, 71524, 70234, 68592, 67077, 66340, 66574, 67393, 68358, 69352, 70367, 71199, 71616, 71704, 71809, 72173, 72764, 73437, 74116, 74814, 75525, 76181, 76715, 77147, 77433, 77285, 76374, 74838, 73275, 72014, 70759, 69351, 68499, 69036, 70569, 71691, 71677, 71230, 71300, 71903, 72583, 73316, 74278, 75119, 75136, 74069, 72235, 70083, 68070, 66705, 66180, 66075, 65871, 65595, 65608, 65983, 66613, 67651, 69222, 70821, 71681, 71772, 71797, 72204, 72858, 73810, 75579, 78248]
54917G8248K693J863J353J920L029L839M337M910N295M776L304J694N38m68j783
54902A15548l060l596l531l814m781n509n013l556k127j177n31k50n41r47n61
54887G6554O51J619J547Q75M34L24J52j07j08K60Q12J434K139K808L242L362L243
54870I9241L042K993L253L589L559L080K514K040J316Pj638l022l801m064m068
54855A08041l970l607k653j257l45p13j865k518k330k239k831l396l189k647k456
54840G2025k180j006O47J411P91l41j077j353j362j045m63j0J38K54N22P30O92
54823F8373M67M0o96j402j394o09O0k6k43L89J627K142J324J34j73L84Q16N86
54805G1799Q0k85o06r24p74J14J085J266P58M41O08O46J56l93n41n63p32n33N66
$$ y = [78248, 80941, 82804, 84157, 86077, 89106, 92945, 97282, 102192, 107487, 112263, 115567, 117261, 117799, 117331, 115548, 112488, 108892, 105361, 101547, 96766, 91257, 86244, 82688, 80561, 79384, 78853, 78603, 78062, 77115, 76554, 77205, 78824, 80371, 81246, 81680, 82004, 82156, 82049, 81941, 82201, 83013, 84447, 86586, 89394, 92636, 95998, 99241, 102283, 105276, 108529, 112118, 115677, 118757, 121271, 123311, 124627, 124634, 122996, 119974, 116173, 112109, 108041, 104071, 100464, 97811, 96554, 96209, 95496, 93631, 91113, 88783, 86544, 83713, 80317, 77128, 74481, 72025, 69845, 68839, 69486, 70897, 71688, 71347, 70270, 68917, 67555, 66510, 66047, 66037, 66175, 66429, 66951, 67681, 68373, 68840, 68880, 68184, 66782, 65388, 64779, 64839, 64813, 64570, 64959, 66586, 68728, 70052, 70186, 70013, 70397, 71213, 71799, 71879, 71594, 70988, 70064, 69290, 69404, 70489, 71755, 72513, 72954, 73562, 74208, 74364, 73971, 73430, 72867, 72135, 71602, 72168]
54786G2168J905K142R69m47q71k81M56O67L52l4K5O79J487J774J367Q02O85R68
54768H4813J090P30K62L85J355K663L532L650L364L208L394L785M073L907L115
54753A23326J941R39M02M8o14j742l071m157m598m262l537l108l218l380l033
54738I1936k267j627j380j354j322j186q83m24kJ81J55N9j12l04k48J94O27N74
54720H2617K52M11J315K379K990L290L825M667N308N333M827M029K869J185o69
54705A24628j901k174k204k901m130m840m505l725l158k596j639p46p27j504k116
54690H5762j984j469j097r01o90m87m06m34n67q05r67p78l25m2j21k17L9N34Q65
54671G5910Q19M28j22m84l38K17O19M88R1j07j03j82l53l90m11p48j169q57L85
$$ y = [72168, 74073, 76215, 77184, 76737, 75866, 75585, 76041, 76708, 77060, 77026, 77051, 77730, 79217, 80991, 82358, 83160, 83845, 84813, 85903, 86633, 86895, 87280, 88635, 91298, 94830, 98480, 101844, 105052, 108446, 112231, 116304, 120211, 123326, 125267, 126206, 126608, 126656, 126042, 124300, 121229, 117072, 112474, 108212, 104675, 101567, 98349, 94969, 91936, 89669, 88042, 86662, 85308, 83986, 82800, 81917, 81493, 81491, 81672, 81827, 81886, 81774, 81470, 81222, 81416, 82043, 82617, 82869, 83280, 84595, 86974, 89964, 93254, 97079, 101746, 107054, 112387, 117214, 121243, 124112, 125297, 124628, 122727, 120553, 118349, 115448, 111318, 106478, 101973, 98248, 95090, 92494, 90855, 90109, 89382, 87878, 85762, 83778, 82309, 81212, 80311, 79621, 79134, 78728, 78294, 77727, 76922, 75955, 75177, 74852, 74810, 74689, 74472, 74511, 75045, 75910, 76729, 77157, 77035, 76551, 76213, 76430, 77049, 77537, 77628, 77521, 77418, 77236, 76883, 76493, 76082, 75334, 74165, 73308, 73693]
54652G3693J452J163j26q87m68J41p7o48m34N83J286R53k7r69j543j540q08K50
54634G1994P76M67q1l14l95n76o30m01l20o27o98O7J125J374P29J44J98M85M77
54615G3794K72J88K16J80O8J8J66N84J115J340R78K63l47p65j187j559j576j142
54597G2606m48L02Q60P89n9j023j205o08j03j90l81k1Q41J682K131K074J525O92
54579G9464l6m00m13j80J84M17K58j01j03M55J059J021K35p63j334j234p11k12
54561G7606M0J38J98J84J54L15N92N25n6o14o26l11q2K64J067J839J729Q39J33
54542H3934N3J92L98J025J883K014J071rk95l2K4k58o13j010j391j317n90K34
54524H5313N63N48N45L31l85j147j269q70o13o41n66k99j35l2M02J118J549J396
$$ y = [73693, 75145, 76308, 76182, 75295, 74827, 74968, 74891, 74243, 73809, 74392, 75678, 76631, 76604, 75635, 74092, 72552, 71744, 71994, 72770, 73237, 73156, 72842, 72447, 71871, 71241, 70840, 70520, 69893, 69195, 69262, 70387, 71761, 72490, 72634, 72832, 73317, 73794, 74066, 74254, 74470, 74650, 74718, 74736, 74902, 75486, 76601, 77941, 78919, 79182, 78835, 78070, 76883, 75324, 73748, 72606, 72158, 72460, 73320, 74109, 74050, 73027, 71822, 71214, 71111, 70921, 70540, 70519, 71360, 73042, 75173, 77247, 78772, 79464, 79428, 79028, 78615, 78435, 78619, 79036, 79294, 79193, 79090, 79545, 80604, 81625, 81860, 81097, 79763, 78529, 77818, 77606, 77646, 77784, 77982, 78166, 78320, 78635, 79227, 79752, 79696, 79082, 78456, 78145, 78063, 78327, 79394, 81233, 82962, 83801, 83934, 83987, 84179, 84577, 85602, 87485, 89499, 90570, 90561, 90266, 90234, 90258, 90000, 89387, 88377, 86986, 85669, 85079, 85313, 85876, 86424, 86969, 87300, 86915, 85768, 84499, 83629, 83016, 82375, 81809, 81510, 81375, 81343, 81745, 82863, 84412, 85808]
54506H5808R68O03K36k86q57j213j129m98M92J329J565J237O64P0l52k93K64P14
54488H9322N11n5k89j39j16k15J76J092J589R56l03j135j144o37P5Q07J267J256
54470I3018J049J012J008O30M7k5O73J446J473P98J28r9l8Qp9l34p48j051q97
54451I8019l49J34L89P89J514J955J411J11r82j313j148r49q35q31j000j232j248
54434I4435j073j063j343j550j304n75M37J397J741J119Q4k25N93J698K104J715
54418I8190R67J50m50l87K58N34k33j359j625r09j49J09K32N88R10Q18L57j72
54400I7829m78l56O2K13j87m64K57J689K547K208J396R03N23k01q90q18q6M29
54382A04576K01m56r78j153j048p86m82k01R2M13N96M62J57J44P07J535J932J516
$$ y = [85808, 86776, 87379, 87615, 87329, 86472, 85259, 84130, 83632, 84124, 85453, 87018, 88255, 88919, 88989, 88637, 88344, 88608, 89322, 89833, 89778, 89489, 89350, 89234, 89019, 89195, 90287, 91876, 92832, 92529, 91394, 90250, 89613, 89688, 90495, 91762, 93018, 94067, 95079, 96087, 96717, 96764, 96739, 97412, 98858, 100331, 101129, 101257, 101158, 101120, 101128, 101049, 100715, 99967, 98916, 98019, 97670, 97804, 98193, 98982, 100496, 102451, 103862, 103973, 102991, 101678, 100530, 99581, 98746, 97915, 96915, 95683, 94435, 93362, 92299, 90956, 89406, 88102, 87527, 87964, 89361, 91102, 92221, 92305, 92080, 92673, 94371, 96475, 98190, 99157, 99307, 98857, 98470, 98728, 99262, 99029, 97670, 96045, 95136, 94987, 95096, 95328, 95916, 96826, 97644, 98001, 97829, 97351, 96995, 97057, 97270, 97083, 96619, 96876, 98565, 101112, 103320, 104716, 105619, 106142, 105941, 105051, 104233, 104147, 104576, 104777, 104321, 103343, 102190, 101142, 100356, 99874, 99673, 99765, 100178, 100774, 101236, 101393, 101537, 102244, 103779, 105711, 107227]
54364A07227O55J38L16P55Q04M17J54M79J298K157K615K440J744J016P57R53J134
54347A25059J014P67N33oj178k622l445l227k528k211k377k327j582o12k02l25
54331A04731j92N16J048O01n46j445j690j595j361q26j56M1l35m55L60J482J613
54314A01791M13j038j513r16j19J49q7l70m57m47m99n73m71l4P07J447J692J148
54296A00823J51n32n05j68j73o16j085j268j161q02k67R3j05o55q37k97M71P87
54278I3854O14M28M97O43O20M08J99K30N76R50Q20k9j041j302m94P14J360J168
54260A00215O88N35O80O37K14j94j16L77P65O91L56K60O65J284J475Q46k79j108
54242A07991j181p48l65l03n21q64j075q80m20k99q31j449j364p08l50o15q41
$$ y = [107227, 107882, 108020, 108336, 109091, 109895, 110312, 110466, 110945, 112243, 114400, 117015, 119455, 121199, 122215, 122972, 123925, 125059, 126073, 126840, 127373, 127367, 126189, 123567, 120122, 116895, 114367, 112156, 109779, 107452, 105870, 105258, 105056, 104731, 104539, 105055, 106103, 106704, 106158, 104713, 103023, 101428, 100067, 99241, 99085, 99126, 98791, 98336, 98696, 100178, 101791, 102204, 101166, 99653, 98737, 98618, 98767, 98680, 98310, 97853, 97406, 96907, 96334, 95863, 95829, 96536, 97983, 99675, 100823, 100974, 100442, 99937, 99769, 99596, 98980, 97895, 96627, 95466, 94664, 94397, 94490, 94385, 93730, 92893, 92596, 93067, 93854, 94468, 94896, 95393, 96036, 96656, 97064, 97263, 97493, 98069, 99019, 99839, 99810, 98769, 97467, 96973, 97687, 99047, 100215, 100903, 101438, 102118, 102755, 102969, 102775, 102659, 103036, 103801, 104492, 104848, 105108, 105773, 107057, 108532, 109378, 109099, 107991, 106810, 106062, 105697, 105394, 104873, 104009, 102934, 102054, 101634, 101335, 100504, 99055, 97691, 96983, 96633, 96018, 95177]
54225I5177l88M48R11P11J55l58o09n07j19K69L34p2q02j377j183m9J327J904
54207I5772J359L01n72j044j055m59N33J162R47L10J9K01M26M21K65P0m2J79P88
54188I9581J314J229O61J52j50n30r76j080p34l75l40m68n09m46k23L36J024J209
54170I9675O36o7j77J26Q5n60j308j628j443r10k02L70M42L4m05n04l11j0L85
54151I4228Q45J129J013N99J34l36q34j157j042o31l69l41n3Q59J928K200J336
54134I9508O9n61k72K75L56nk10O7M85N40K16kK70R21J459J417P49q9n32n54o74
54113A03433j121j303n92N26Q76K18l30J27R37Q51j58q80n12M19Q77M94l31r93
54095A02538j093o18L8M19M69M80N57M31nl74j85N71J434J954K024J795J402Q40
$$ y = [95177, 94789, 95237, 96148, 96859, 97014, 96656, 96047, 95540, 95421, 95690, 96024, 95952, 95150, 93773, 92590, 92541, 93868, 95772, 97131, 97432, 96860, 95816, 94761, 94302, 94835, 95997, 96944, 97254, 97273, 97474, 97900, 98321, 98586, 98656, 98614, 98793, 99581, 100895, 102124, 102785, 102937, 102787, 102257, 101281, 100201, 99467, 99092, 98752, 98284, 97775, 97329, 97106, 97442, 98466, 99675, 100311, 100244, 100067, 100193, 100278, 99718, 98410, 96782, 95339, 94429, 94227, 94597, 95039, 95073, 94668, 94164, 93853, 93843, 94228, 95073, 96202, 97215, 97814, 97948, 97612, 96778, 95621, 94579, 93948, 93579, 93238, 93185, 94044, 95972, 98172, 99508, 99577, 99016, 98744, 99019, 99375, 99370, 99160, 99227, 99712, 100252, 100468, 100466, 100736, 101657, 103116, 104533, 105282, 105193, 104661, 104107, 103433, 102312, 101009, 100417, 100943, 101819, 102037, 101707, 101834, 102771, 103622, 103464, 102584, 102072, 102491, 103368, 103862, 103531, 102538, 101445, 100827, 100865, 101284, 101753, 102233, 102790, 103221, 103216, 102842, 102657, 103228, 104662, 106616, 108640, 110435, 111837, 112677]
54077A12677Q4o35q29k06R10J780J891J287M06k29k48L39J132J692J928J982J922
54060A25883J769J631J440P70o15k093k652k045r91k31R5R4j75l44J96J492K741
54043A26965L245L158K955K642K067J557J630K292L143L946M539M548L833L050
54029A69570K990L415L309K373J551J694K354K383J331j27j036j104q95j250k387
54014A84171l571l865l290k860l287m077m229l571k882k771k938k783k336k153
54000A39558k458k740k446j737j274j300j317q28n2L95L81M09Q60J402J395P30
53984A30978j5k56n3J10N3J14N61J074J075M95j81n60o78o63m95k76k54l48p3
53965A30608O43R35nj643k470j726k13Q09R39O31L32J71K03M75Q41J054J115J272
$$ y = [112677, 112761, 112126, 111297, 111091, 112001, 113781, 115672, 116959, 117365, 117136, 116888, 117227, 118359, 120051, 121979, 123961, 125883, 127652, 129283, 130723, 131493, 130878, 128785, 126133, 124088, 123097, 122866, 122961, 123055, 122880, 122536, 122732, 124224, 126965, 130210, 133368, 136323, 138965, 141032, 142589, 144219, 146511, 149654, 153600, 158139, 162687, 166520, 169570, 172560, 175975, 179284, 181657, 183208, 184902, 187256, 189639, 190970, 190843, 189807, 188703, 187808, 186558, 184171, 180600, 176735, 173445, 170585, 167298, 163221, 158992, 155421, 152539, 149768, 146830, 144047, 141711, 139558, 137100, 134360, 131914, 130177, 128903, 127603, 126286, 125458, 125406, 125801, 126182, 126591, 127451, 128853, 130248, 130978, 130963, 130707, 130654, 130764, 130817, 130931, 131492, 132566, 133641, 134136, 133955, 133395, 132717, 132054, 131559, 131283, 131029, 130681, 130608, 131251, 132186, 132181, 130538, 128068, 126342, 126129, 126938, 127877, 128508, 128840, 129011, 129214, 129689, 130530, 131584, 132699, 133971]
53947A33971J606J835J678J301J207J728K685L625M217M356M022L349K792K905
53933A71277L727M572M709M103L268K606K202K237L053M651O387P541P938P804
53919B36075P210N967M163K347J057K74l49q53r42n86k93n21j064j332j159r02
53903B49092r01j185j739k545l190l097k367j964k561l655m362m671n171n801
53889B05883n777m901m085m167m808n042m518l684l032k638k353k019j537r69
53875A56353o08o95j107j519j847k230k621k680k199j450q84o76p01q95j312j755
53859A33174j650o75O00J081L32q84j522j371r90p21l36K91P63O52J29k55k32
53842A28386%J12m7m22p46o81j34N10P06L57p7j22J93M02J75l18n54j64P38J653
$$ y = [133971, 135577, 137412, 139090, 140391, 141598, 143326, 146011, 149636, 153853, 158209, 162231, 165580, 168372, 171277, 175004, 179576, 184285, 188388, 191656, 194262, 196464, 198701, 201754, 206405, 212792, 220333, 228271, 236075, 243285, 249252, 253415, 255762, 256819, 257093, 256744, 255891, 254949, 254363, 254070, 253549, 252485, 251153, 249994, 249092, 248191, 247006, 245267, 242722, 239532, 236435, 234068, 232104, 229543, 225888, 221526, 216855, 211684, 205883, 200106, 195205, 191120, 186953, 182145, 177103, 172585, 168901, 165869, 163231, 160878, 158859, 157322, 156353, 155745, 155050, 153943, 152424, 150577, 148347, 145726, 143046, 140847, 139397, 138513, 137837, 137136, 136241, 134929, 133174, 131524, 130849, 131449, 132530, 132862, 131978, 130456, 129085, 128095, 127374, 127038, 127329, 128092, 128744, 128873, 128618, 128386, 128386, 128498, 128451, 128029, 127283, 126602, 126468, 126978, 127684, 128041, 127964, 127842, 128035, 128437, 128612, 128294, 127740, 127576, 128314, 129967]
53822A29967K109J951J352O19L6k32j51K35Q56J621K345K755K616J963J213R50
53806A50205J423K314L091L584L958M198L921K942J703Q67O47Q49J320J967K455
53791A85444K398J897J433J195R41O20N53P74P32L8r16j559k020k797l718l997
53775A81018l361k583k533l181l839m059l904l510k871k029j234p31n61n84o20
53760A45418n26k69k1r1o60j571k324k364j482r0R60J086N37J02J93M85M86K02
53742A40071mj4RJ2J37M18P32R72J004N12n96j640j584k62J285J951J637R22K87
53723A45849J26Q91K504L940M176L423K721K443K055J337R10J198J663J559R20
53708A75715L35J16K46P62J780L167M562N573N881N330M205L151K557K242J886
$$ y = [129967, 132076, 134027, 135379, 135998, 136034, 135802, 135651, 135886, 136742, 138363, 140708, 143463, 146079, 148042, 149255, 150205, 151628, 153942, 157033, 160617, 164575, 168773, 172694, 175636, 177339, 178206, 178853, 179702, 181022, 182989, 185444, 187842, 189739, 191172, 192367, 193308, 193928, 194481, 195255, 195987, 196025, 195109, 193550, 191530, 188733, 185015, 181018, 177657, 175074, 172541, 169360, 165521, 161462, 157558, 154048, 151177, 149148, 147914, 147183, 146622, 146038, 145418, 144892, 144623, 144602, 144511, 143851, 142280, 139956, 137592, 136110, 136020, 136980, 138066, 138603, 138705, 138898, 139383, 139869, 140071, 140067, 140053, 140062, 140074, 140211, 140629, 141361, 142333, 143337, 143849, 143253, 141613, 140029, 139767, 141052, 143003, 144640, 145562, 145849, 145975, 146866, 149370, 153310, 157486, 160909, 163630, 166073, 168128, 169465, 170375, 171573, 173236, 174795, 175715, 176050, 176166, 176412, 177174, 178954, 182121, 186683, 192256, 198137, 203467, 207672, 210823, 213380, 215622, 217508]
53693B17508J536J446J613J759J606J047K51k82j90J28j97j269k072j788r19n26
53677B19651p27q17n73n21q74j113r08o65p82r44o62p6L18M22N04N83L86j40p06
53658B12356j122j467j721j591r67l00j72n23o73j65O53J130J110R56R48J069
53642B09521J345J912K571K738K146J303R04J034J270J386J485J597J619J671
53628B32502K073K756L103K599J514P39R68K090L353M124M461M834N307N364M728
53613B80515L973L873M353M603M188L539L287L512L786L644K894J777R17P78J136
53598C26775J297R34L41j00l10k73P6N12M98j72j044j603j833j931j830j419j044
53581C18874j200j849k411k495k320k294k419k299j714j034r16j458j904j472
$$ y = [217508, 219044, 220490, 222103, 223862, 225468, 226515, 226766, 226484, 226294, 226422, 226225, 224956, 222884, 221096, 220177, 219651, 218924, 218107, 217534, 217013, 216139, 215026, 214118, 213453, 212671, 211727, 211065, 210989, 211307, 211729, 212233, 212816, 213202, 213062, 212356, 211234, 209767, 208046, 206455, 205488, 205188, 205016, 204493, 203820, 203655, 204308, 205438, 206548, 207504, 208452, 209521, 210866, 212778, 215349, 218087, 220233, 221536, 222440, 223474, 224744, 226130, 227615, 229212, 230831, 232502, 234575, 237331, 240434, 243033, 244547, 245286, 246254, 248344, 251697, 255821, 260282, 265116, 270423, 275787, 280515, 284488, 288361, 292714, 297317, 301505, 305044, 308331, 311843, 315629, 319273, 322167, 323944, 324861, 325639, 326775, 328072, 329006, 329347, 329247, 328937, 328664, 328740, 329252, 329750, 329578, 328534, 326931, 325098, 323167, 321337, 319918, 318874, 317674, 315825, 313414, 310919, 308599, 306305, 303886, 301587, 299873, 298839, 297923, 296465, 294561, 293089]
53567B93089l75M35M95K67K25J98rM7Q36J924K336J766Q73M17N77J061J478J529
53549C07169J205Q97R73J335J642J880K340L050L705M156M610N250N998O701P230
53534C58141P425P284P193P584Q363R069R609J0315J1257J2036J2481J2960J3755
53521D87472J4540J4957J5270J5979J7027J7850J8159J8375J9197K0958K3273
53510F83057K5263K6170K5972K5278K4673K4355K4303K4448K4502K4076K3183
53499I55280K2292K1681K1093K0303J9598J9297J9148J8663J7913J7420J7423
53488A170111J7639J7742J7639J7382J7166J7315J7873J8206J7474J5563J3142
53477A357252J0856Q855P113N645M197K187o83l987p057r697j2090j4184j5532
$$ y = [293089, 292714, 293149, 293644, 293911, 294136, 294334, 294325, 294372, 295208, 297132, 299468, 301234, 302107, 302524, 303101, 304162, 305640, 307169, 308374, 309271, 310244, 311579, 313221, 315101, 317441, 320491, 324196, 328352, 332962, 338212, 344210, 350911, 358141, 365566, 372850, 380043, 387627, 395990, 405059, 414668, 424983, 436240, 448276, 460757, 473717, 487472, 502012, 516969, 532239, 548218, 565245, 583095, 601254, 619629, 638826, 659784, 683057, 708320, 734490, 760462, 785740, 810413, 834768, 859071, 883519, 908021, 932097, 955280, 977572, 999253, 1020346, 1040649, 1060247, 1079544, 1098692, 1117355, 1135268, 1152688, 1170111, 1187750, 1205492, 1223131, 1240513, 1257679, 1274994, 1292867, 1311073, 1328547, 1344110, 1357252, 1368108, 1376963, 1384076, 1389721, 1393918, 1396105, 1395422, 1391435, 1384378, 1374681, 1362591, 1348407, 1332875]
53464A332875j5843j5450j5053j5105j5617j6485j7797j9572k1358k2431k2489
53453A135675k1849k0993k0187j9728j9981k0797k1217k0385j8521j6531j4744
53442I20742j2736j0357q244p027o512n987m975l449j630N5J102J451J780K948
53428H67161N056P288Q795R614J0569J2255J4276J5735J6367J6861J7894J9392
53416A021263K0973K2713K4792K6743K7849K8332K9331L1527L4329L6735L8508
53405A343095M0178M2217M4592M6854M8554M9758N1114N3059N5014N5985N5989
53394A886409N6116N6980N7908N8023N7411N6539N5269N3190N0566M8077M5867
53383B482355M3529M0885L8092L5065L1440K7133K2447J7682J3054Q835N002Q01
$$ y = [1332875, 1317032, 1301582, 1286529, 1271424, 1255807, 1239322, 1221525, 1201953, 1180595, 1158164, 1135675, 1113826, 1092833, 1072646, 1052918, 1032937, 1012140, 990923, 970538, 952017, 935486, 920742, 908006, 897649, 889405, 882378, 875866, 869879, 864904, 861455, 859825, 859880, 860982, 862433, 864213, 867161, 872217, 879505, 888300, 897914, 908483, 920738, 935014, 950749, 967116, 983977, 1001871, 1021263, 1042236, 1064949, 1089741, 1116484, 1144333, 1172665, 1201996, 1233523, 1267852, 1304587, 1343095, 1383273, 1425490, 1470082, 1516936, 1565490, 1615248, 1666362, 1719421, 1774435, 1830420, 1886409, 1942525, 1999505, 2057413, 2115436, 2172847, 2229386, 2284655, 2337845, 2388411, 2436488, 2482355, 2525884, 2566769, 2604861, 2639926, 2671366, 2698499, 2720946, 2738628, 2751682, 2760517, 2765519, 2766320]
53371B766320m793j2055k0287k8532l6065m2366m7116n0415n2650n4147n5193
53360B362701n6109n6906n7017n5960n4157n2509n1246m9787m7799m5720m4175
53349A791316m3377m3270m3659m3999m3585m2267m0550l8854l7072l5025l2890
53338A346768l0791k8490k5739k2763k0030j7792j6088j4891j4091j3573j3467
53327A129053j4007j4917j5330j4601j3020j1431j0394r893r612r164q178o513
53315I91993m431k410q00L92J477K877M671O368P372P781Q421R971J2273J4597
53301A060552J6412J7786J9176K0960K3047K4947K6328K7365K8380K9326K9911
53290A324190L0052K9733K8652K6588K4117K2227K1075J9726J7303J3848R905
$$ y = [2766320, 2761527, 2749472, 2729185, 2700653, 2664588, 2622222, 2575106, 2524691, 2472041, 2417894, 2362701, 2306592, 2249686, 2192669, 2136709, 2082552, 2030043, 1978797, 1929010, 1881211, 1835491, 1791316, 1747939, 1704669, 1661010, 1617011, 1573426, 1531159, 1490609, 1451755, 1414683, 1379658, 1346768, 1315977, 1287487, 1261748, 1238985, 1218955, 1201163, 1185075, 1170184, 1156093, 1142520, 1129053, 1115046, 1100129, 1084799, 1070198, 1057178, 1045747, 1035353, 1025460, 1015848, 1006684, 998506, 991993, 987562, 985152, 984352, 984744, 986221, 989098, 993769, 1000137, 1007509, 1015290, 1023711, 1033682, 1045955, 1060552, 1076964, 1094750, 1113926, 1134886, 1157933, 1182880, 1209208, 1236573, 1264953, 1294279, 1324190, 1354242, 1383975, 1412627, 1439215, 1463332, 1485559, 1506634, 1526360, 1543663, 1557511, 1567416]
53279A567416N850K007j230l799o120q518j0821j2796j4581j6476j8709k1531
53267A460692k4880k7772k8854k8083k7133k7475k8709k9515k9563k9544k9754
53256A149410k9738k9295k8835k8645k8514k8259k7949k7551k6883k6040k5419
53245H42282k5175k5058k4794k4322k3659k2849k1998k1030j9600j7598j5483
53234F00716j3725j2172j0496q952q058p763p684p913q732r669r860r472r773
53221D76447j1404j3430j4540j4458j3717j2704j1593j0663j0056r486q635p585
53209C38176o564n602m854m778n507o395o745o690o824p191p262o830o269n867
53195B50798n429m703l798l038k640k681l059l396l214k432j548j180j487k134
$$ y = [1567416, 1573266, 1575273, 1574043, 1570244, 1564124, 1555606, 1544785, 1531989, 1517408, 1500932, 1482223, 1460692, 1435812, 1408040, 1379186, 1351103, 1323970, 1296495, 1267786, 1238271, 1208708, 1179164, 1149410, 1119672, 1090377, 1061542, 1032897, 1004383, 976124, 948175, 920624, 893741, 867701, 842282, 817107, 792049, 767255, 742933, 719274, 696425, 674427, 653397, 633797, 616199, 600716, 586991, 574819, 564323, 555371, 547313, 539550, 531866, 523953, 515221, 505552, 495692, 486220, 476447, 465043, 451613, 437073, 422615, 408898, 396194, 384601, 373938, 363882, 354396, 345761, 338176, 331612, 326010, 321156, 316378, 310871, 304476, 297731, 291041, 284217, 277026, 269764, 262934, 256665, 250798, 245369, 240666, 236868, 233830, 231190, 228509, 225450, 222054, 218840, 216408, 214860, 213680, 212193, 210059]
53181B10059k694l002l056k794k139j260n67l31m02m98o63j129j813k237k081
53166A85393j482p51p4M14N50L92K48K43O7n60j372j839j763j358p90j05M57M78
53148A78148j53r91j457j342q99m75k17k2K76O14P00L89l9j61M6K12J19j5O6K39
53128A75038K34J06J59M53P11P51P32Q83J140J170O53m30j591j946j027M81J198
53111A78715O01l75o08k66l54j148j891j979j603j098m96K5Kn12p12j35N92O62
53093A69420K17j40m06r37j486j408p38j80lK41P75J175J106Q90R56J255J404
53076A72141J132L53p88j786k096j720j138n88L0N48M36l34r74q20k21l6n52j291
53058A62296j605j179j57Q53J184P88L47M97J064J354R74J37o19q32m73j02l98
$$ y = [210059, 207365, 204363, 201307, 198513, 196374, 195114, 194547, 194216, 193814, 193316, 192653, 191524, 189711, 187474, 185393, 183911, 183160, 183086, 183500, 184050, 184442, 184690, 184933, 185000, 184440, 183068, 181229, 179466, 178108, 177318, 177213, 177670, 178148, 177995, 177004, 175547, 174205, 173306, 172831, 172614, 172592, 172868, 173482, 174182, 174571, 174532, 174371, 174417, 174629, 174748, 174733, 174799, 175038, 175272, 175378, 175537, 175990, 176701, 177452, 178184, 179067, 180207, 181377, 182030, 181600, 180009, 178063, 177036, 177517, 178715, 179316, 178941, 178333, 178067, 177713, 176565, 174674, 172695, 171092, 169994, 169498, 169523, 169525, 169013, 168301, 168166, 168758, 169420, 169637, 169497, 169091, 168154, 166668, 165260, 164522, 164342, 164339, 164580, 165355, 166530, 167636, 168526, 169482, 170737, 172141, 173273, 173626, 172838, 171052, 168956, 167236, 166098, 165510, 165540, 166088, 166524, 166190, 165216, 164396, 164175, 164139, 163587, 162296, 160691, 159512, 159355, 160208, 161392, 162180, 162527, 163024, 164088, 165442, 166416, 166553, 165934, 165102, 164629, 164527, 164129]
53041A64129j315j984j721q52k53l47q17j134j019n25PJ49j49m49l57j7J12r4
53023A53364k66K0P95J614J898J506R80R32J254J260O63j04n96q50r16n67J25
53006A61112M46p3r27j282j059p34m28N0N32O15L77K34J65j92p07p79k81J91K67
52987A57527K60M26M63J05l17m09l20l24j98M17J228J549J270J070J492K202K402
52970A68843J815J007O71Q18Q91O49N90J183J985K082J302M37O2k35j020j945
52954A79135k110j356n54n30j213j979k413k498k291j838j278q04m60j42J56K42
52938A60067n0n96j035j032n56J06N56N89L27M4j70m69r13j222j061n48k02l70
52920A53465q44j121q84j43Q28J578J646R53p6r07j326j372j035l04N34J000R37
$$ y = [164129, 162814, 160830, 159109, 158257, 158004, 157657, 156840, 155706, 154687, 154162, 154169, 154318, 154169, 153720, 153363, 153346, 153458, 153364, 153098, 153118, 153913, 155527, 157425, 158931, 159911, 160843, 162097, 163357, 164020, 163916, 163320, 162470, 161554, 160987, 161112, 161558, 161485, 160558, 159276, 158217, 157483, 157055, 157105, 157637, 158252, 158629, 158863, 159028, 158836, 158129, 157350, 157069, 157260, 157527, 157787, 158213, 158676, 158781, 158464, 158055, 157735, 157411, 157213, 157630, 158858, 160407, 161677, 162747, 164239, 166441, 168843, 170658, 171665, 172336, 173154, 174045, 174694, 175284, 176467, 178452, 180534, 181836, 182273, 182335, 182100, 181080, 179135, 177025, 175669, 175115, 174585, 173372, 171393, 168980, 166482, 164191, 162353, 161075, 160271, 159811, 159669, 159825, 160067, 160017, 159421, 158386, 157354, 156798, 156904, 157460, 158049, 158376, 158420, 158250, 157781, 156868, 155646, 154585, 154037, 153835, 153465, 152621, 151500, 150616, 150473, 151301, 152879, 154525, 155478, 155402, 154495, 153169, 151797, 150762, 150458, 150992, 151992, 152929]
52903A52929O45M68M18L05P5j66l53m94n73n39l99k03R6N71J067J162O14k34o96
52884A54693m81M2L68M01L01J22o4N9O93J397J432P04j19m81m81l44jN01O59J70
52864A59571m50m78k2J56k68q59j192j246j022l43O10J176R35K93j20k14k63k15
52846A56049K07Q16R56L82l72p73j026j667k617l148k758j655l09J030K114K421
52830A49650J536k31j909k601k064q00K11J72p87j651j626r65l67M5N31Q36M71
52813A40451j68k3J017J710J251M55N19J299J797J744J666J640J096j19j316j824
52797A51195j716j449j345j460j563j284n94p8k36p14p41k15K67L29Q1m24j175
52780A38878j624j078J29P54L49L8R20K415K986K093O27l65o88p12p21p66q31
$$ y = [152929, 153574, 154042, 154460, 154765, 154840, 154674, 154321, 153827, 153254, 152715, 152316, 152113, 152209, 152780, 153847, 155009, 155623, 155389, 154693, 154212, 154254, 154622, 155023, 155324, 155446, 155382, 155441, 156134, 157531, 158963, 159667, 159548, 159067, 158586, 158242, 158241, 158742, 159401, 159571, 159121, 158643, 158621, 158777, 158509, 157650, 156458, 155212, 154190, 153847, 154457, 155633, 156568, 156861, 156741, 156527, 156264, 156049, 156256, 157072, 158028, 158410, 158038, 157265, 156239, 154572, 151955, 148807, 146049, 144394, 144085, 145115, 147229, 149650, 151186, 150955, 149046, 146445, 144381, 143581, 143792, 143964, 143177, 141526, 139900, 138935, 138568, 138613, 139144, 139980, 140451, 140283, 140260, 141277, 142987, 144238, 144693, 145212, 146511, 148308, 150052, 151718, 153358, 154454, 154335, 153019, 151195, 149479, 148030, 146685, 145225, 143662, 142378, 141784, 141706, 141470, 140756, 140015, 139800, 140067, 140396, 140477, 140053, 138878, 137254, 136176, 136305, 137059, 137408, 137446, 138366, 140781, 143767, 145860, 146487, 146122, 145434, 144722, 144001, 143235, 142404]
52763A42404q89q81p25l39K43P87J015R16P01M92K83K01M42Q49R18M44j00j46
52745A46615L01P43Q16N62L07L74Q03J239J294J092J138J539J765J419Q38N47
52729A61392N15L86J97K80N52M92q9o88p53l54l2j93q12j557j999j819j058k10
52711A54250J08l02r93j239p38J48P93R07O89N42O67R22J004Q58P90R78R68J81
52693A60533r94j277j72J088J037n7o99l60jk73n52j85L61L54k0k49m92j080j535
52674A55427j182m31l28r46j238o23K32N16L84M60Q54J131R40L06m41q07m64L96
52656A54186J192J613J829J997J969J644J214Q14K81m26q66o09J01N33K38o26
52640A65084j599k241k282j764j094o63m40j43K78O23Q01Q89Q72P24P83J479K543
$$ y = [142404, 141515, 140634, 139909, 139570, 139813, 140600, 141615, 142531, 143232, 143724, 144007, 144208, 144650, 145499, 146417, 146861, 146761, 146615, 146916, 147659, 148475, 149037, 149344, 149718, 150521, 151760, 153054, 154146, 155284, 156823, 158588, 160007, 160845, 161392, 161907, 162293, 162490, 162770, 163322, 163814, 163725, 163037, 162284, 161930, 161898, 161705, 160893, 159336, 157337, 155518, 154460, 154250, 154358, 154056, 153063, 151824, 151086, 151234, 152027, 152934, 153623, 154165, 154832, 155754, 156758, 157616, 158406, 159384, 160352, 160533, 159539, 158262, 158090, 159178, 160215, 160158, 159459, 159099, 159098, 158825, 158273, 158088, 158449, 158803, 158783, 158534, 158042, 156962, 155427, 154245, 153814, 153486, 152540, 151302, 150679, 150911, 151427, 151811, 152271, 153125, 154256, 155196, 155502, 155061, 154254, 153790, 154186, 155378, 156991, 158820, 160817, 162786, 164430, 165644, 166458, 166739, 166313, 165447, 164838, 164939, 165472, 165710, 165084, 163485, 161244, 158962, 157198, 156104, 155441, 155001, 154858, 155136, 155759, 156560, 157449, 158321, 159045, 159828, 161307, 163850]
52623A63850K936K017M69m34k62L31O20M81J25k38l27N9N91N74j35q32q69m00
52605A68556J02N25Q71P46j07j073j216n15J37J31k99o79q31o60j68K36M2m45
52587A65353l26N62J222R42L99O47J506J828J155K73N5M43P39M89j81q17j076
52570A73213r83q41q42q46o38k42J50M39O05O03L85Jm58q30q30k54O60J331J444
52551A72067J177P54J70n12r81j076r62p01r7P45J165P76R4j22J60M81O96Q96
52533A74730Q87M76L9Q9L71J28p57j603j919j801j354n32K74L04m79j082p09K34
52515A67296P98P38N35N35O21O49P27J084J826K814L582L584K717J509O15K29
52499A89859J17j5l22q32j409j813j907j807j691j633j631j668j605j204l69O87
$$ y = [163850, 166786, 168803, 169272, 168838, 168576, 168907, 169527, 170008, 170133, 169895, 169568, 169627, 170218, 170792, 170657, 169825, 168956, 168556, 168658, 169183, 170054, 170800, 170693, 169620, 168404, 167889, 168026, 168157, 167858, 167179, 166348, 165688, 165520, 165756, 165798, 165353, 165027, 165589, 166811, 167753, 168152, 168799, 170305, 172133, 173288, 173561, 173616, 174059, 174798, 175287, 175106, 174289, 173213, 172230, 171389, 170547, 169701, 169063, 168821, 168971, 169410, 170015, 170618, 171003, 171004, 170546, 169716, 168886, 168632, 169292, 170623, 172067, 173244, 173998, 174168, 173656, 172675, 171599, 170637, 169936, 169839, 170584, 171749, 172525, 172619, 172497, 172657, 173138, 173834, 174730, 175617, 176093, 176132, 176221, 176592, 176720, 175963, 174360, 172441, 170640, 169286, 168754, 169028, 169332, 168853, 167771, 167062, 167296, 168094, 168832, 169367, 169902, 170523, 171172, 171899, 172983, 174809, 177623, 181205, 184789, 187506, 189015, 189630, 189859, 189976, 189961, 189639, 188807, 187398, 185585, 183678, 181871, 180180, 178547, 176916, 175248, 173643, 172439, 172070, 172757]
52483A72757J534J717J015k79j349j503q37JO38J135J395J023R0n26j08R00J411
52466A79014J066N64O20J093J315J002N46N59J238K198K802K631J726N01n37j083
52450A95255j230j306j445j453j270j271j728k157j844r78o29j186j625q92M86
52435A76727J074N21l2K98R12P32j92p98m82K24N24L46K24M59P76P62M01Q0J37
52416A82693N05Q23R22J101J785K949M001M435M471M798N741O785P040O022L922
52401B37993J355j079l013m344n076n099m317k949j600p73m41k73j59k58n10m73
52385B08984K05J232J832J486N05k44j47O36J552K328L005L455L323K646K124
52370B32922K339L031L515L651L777L932L709L050K487K322K040J085j41o31j11
$$ y = [172757, 174291, 176008, 177023, 176744, 175395, 173892, 173055, 173056, 173694, 174829, 176224, 177247, 177337, 176811, 176703, 177603, 179014, 180080, 180644, 181264, 182357, 183672, 184674, 185220, 185779, 187017, 189215, 192017, 194648, 196374, 196875, 196338, 195255, 194025, 192719, 191274, 189821, 188551, 187280, 185552, 183395, 181551, 180573, 179944, 178758, 177133, 176241, 176727, 177801, 178322, 178290, 178588, 179500, 180232, 180040, 179242, 178760, 178984, 179508, 179854, 180078, 180537, 181313, 182075, 182476, 182556, 182693, 183198, 184021, 184943, 186044, 187829, 190778, 194779, 199214, 203685, 208483, 214224, 221009, 228049, 234071, 237993, 239348, 238269, 235256, 230912, 225836, 220737, 216420, 213471, 211871, 211098, 210657, 210384, 210225, 209967, 209457, 208984, 209189, 210421, 212253, 213739, 214244, 214000, 213853, 214489, 216041, 218369, 221374, 224829, 228152, 230798, 232922, 235261, 238292, 241807, 245458, 249235, 253167, 256876, 259926, 262413, 264735, 266775, 267860, 267719, 267088, 266977]
52355B66977N79O15K13K11Q69J608J947K189K857L810M392M379M220M347M693
52340C03906N084N605O270O830P329Q395J0377J2506J3636J3715J3839J4806J6294
52327D38592J7581J8464J9137J9699K0177K0654K0979K0683J9517J7940J6741
52316F50164J6225J6029J5564J4479J2814J0920R238P983P093O400N715M722L101
52303G80447R49j081k337k757k821l061l649m335m715m667m573m903n561n893
52289G31043n433m469l661l311l108k457r31J424M087O450Q282R708J0848J1732
52275G60204J2516J3447J4479J5247J5503J5334J4872J4130J3216J2256J1003
52264I12207Q980O328M035K867K505K124J485R32N02j96j325k577l678m656n468
$$ y = [266977, 267556, 268171, 268384, 268595, 269464, 271072, 273019, 275208, 278065, 281875, 286267, 290646, 294866, 299213, 303906, 308990, 314595, 320865, 327695, 335024, 343419, 353796, 366302, 379938, 393653, 407492, 422298, 438592, 456173, 474637, 493774, 513473, 533650, 554304, 575283, 595966, 615483, 633423, 650164, 666389, 682418, 697982, 712461, 725275, 736195, 745433, 753416, 760509, 766909, 772624, 777346, 780447, 781396, 780315, 777978, 775221, 772400, 769339, 765690, 761355, 756640, 751973, 747400, 742497, 736936, 731043, 725610, 721141, 717480, 714169, 711061, 708604, 707673, 709097, 713184, 719634, 727916, 737624, 748472, 760204, 772720, 786167, 800646, 815893, 831396, 846730, 861602, 875732, 888948, 901204, 912207, 921187, 927515, 931550, 934417, 936922, 939046, 940531, 941463, 941965, 941769, 940444, 937867, 934189, 929533, 924065]
52249I24065n825n603n168n118n802p102q493r321r286q653p884p078o136n275
52235H27321m961n199n347m818l736k640j865j387j051o62k7P94J391J508J480
52220H00801J901K799L595L893L989M331M840N096N042N065N316N363M782L869
52206H60682L421L810M568M928M649M074L565L153K775K590K768L142L326L223
52192I10674L047K823K241J247L78J06J71Nl68n01m01n91j253k048k858l954n154
52175I03564n724n570n692o704p649p170n373l557k460j803j343j294j568j592
52161H46065j147n78m2P50J828K697L047L109L084K844K361J830J192J64j017
52146H66187j615j320n70L37J663L382M720N093M950N136N893O921P978Q961R811
$$ y = [924065, 918240, 912637, 907469, 902351, 896549, 889447, 880954, 871633, 862347, 853694, 845810, 838732, 832596, 827321, 822360, 817161, 811814, 806996, 803260, 800620, 798755, 797368, 796317, 795655, 795628, 796422, 797813, 799321, 800801, 802702, 805501, 809096, 812989, 816978, 821309, 826149, 831245, 836287, 841352, 846668, 852031, 856813, 860682, 864103, 867913, 872481, 877409, 882058, 886132, 889697, 892850, 895625, 898215, 900983, 904125, 907451, 910674, 913721, 916544, 918785, 920032, 920410, 920516, 920687, 920692, 920324, 919823, 919422, 918831, 917578, 915530, 912672, 908718, 903564, 897840, 892270, 886578, 879874, 872225, 865055, 859682, 856125, 853665, 851862, 850519, 849225, 847657, 846065, 844918, 844340, 844298, 845048, 846876, 849573, 852620, 855729, 858813, 861657, 864018, 865848, 867040, 867204, 866187, 864572, 863252, 862682, 863019, 864682, 868064, 872784, 877877, 882827, 887963, 893856, 900777, 908755, 917716, 927527]
52131I27527J0685J1798J2947J3769J4685J6603J9364K1401K1730K1368K1904
52120A113781K3387K4667K5112K4884K3902K1837J9007J6277J3996J1883R817
52109A328550P875N698K721q50m150o765r036j1182j2884j3871j4159j3648j2225
52096A246074j0381r062q589q335p656o567n347m087k881k076j930k287k652k423
52082A171801j203P54K585L752M813O618R025J1088J2378J3274J4036J4449J4526
52069A277896J4660J4737J4007J2157R861P880O254M718L250J777n1k317m599
52056A360230o622q657j0843j2788j4219j5464j6745j7632j7830j7926j8615j9579
52044A183310j9988j9808j9797k0242k0540k0114j9071j7781j6284j4431j2272
$$ y = [927527, 938212, 950010, 962957, 976726, 991411, 1008014, 1027378, 1048779, 1070509, 1091877, 1113781, 1137168, 1161835, 1186947, 1211831, 1235733, 1257570, 1276577, 1292854, 1306850, 1318733, 1328550, 1336425, 1342123, 1344844, 1343994, 1339844, 1333079, 1324043, 1312861, 1299977, 1286106, 1271947, 1258299, 1246074, 1235693, 1226631, 1218042, 1209707, 1202051, 1195484, 1190137, 1186050, 1183169, 1181093, 1179163, 1176876, 1174224, 1171801, 1170598, 1171352, 1173937, 1177689, 1182502, 1189120, 1198145, 1209233, 1221611, 1234885, 1248921, 1263370, 1277896, 1292556, 1307293, 1321300, 1333457, 1343318, 1351198, 1357452, 1362170, 1365420, 1367197, 1367146, 1364829, 1360230, 1353608, 1344951, 1334108, 1321320, 1307101, 1291637, 1274892, 1257260, 1239430, 1221504, 1202889, 1183310, 1163322, 1143514, 1123717, 1103475, 1082935, 1062821, 1043750, 1025969, 1009685, 995254, 982982]
52033I82982j0089q240p009o441o201n807n090m312l849l900m522n713p313q939
52019H95557j0173j0858j1142j1218j1140j1038j1341j2425j3921j4846j4686
52008G62769j4054j3858j4234j4678j4976j5263j5329j4724j3649j2999j3180
51997F05825j3606j3592j3135j2455j1360r640p674o129n256m897m851m908m769
51984D93553m336l887l668l624l776m473n844p385q505r201r697r814r260q354
51970D01729p719p348o630n376m179l461k688j015J476L684M678M695M720N227
51956C87793N743N747N500N511N463M384J996q23l115m771n949o250n163l070
51942C92996j079J27Q29J679L077N067P417R598J0982J1323J0980J0540J0135
$$ y = [982982, 972893, 964653, 957644, 951203, 945002, 939195, 934105, 929793, 925944, 922044, 917522, 911809, 904496, 895557, 885384, 874526, 863384, 852166, 841026, 829988, 818647, 806222, 792301, 777455, 762769, 748715, 734857, 720623, 705945, 690969, 675706, 660377, 645653, 632004, 619005, 605825, 592219, 578627, 565492, 553037, 541677, 532037, 524363, 518234, 512978, 508081, 503230, 498322, 493553, 489217, 485330, 481662, 478038, 474262, 469789, 463945, 456560, 448055, 438854, 429157, 419343, 410083, 401729, 394010, 386662, 380032, 374656, 370477, 367016, 364328, 363313, 364789, 368473, 373151, 377846, 382566, 387793, 393536, 399283, 404783, 410294, 415757, 420141, 422137, 421314, 418199, 413428, 407479, 401229, 396066, 392996, 391917, 392044, 392873, 394552, 397629, 402696, 410113, 419711, 430693, 442016, 452996, 463536, 473671]
$$ [...]
##END NTUPLES=NMR SPECTRUM
##END=
