##TITLE=NES1092_ptc170_9886698_P7uslTn7Oq
##JCAMPDX= 6.0         $$ Bruker NMR JCAMP-DX V2.0
##DATA TYPE= NMR SPECTRUM
##DATA CLASS= NTUPLES
##ORIGIN= BRUKER
##OWNER= Administrator
$$ 1.72 TOPSPIN		Version 2.1
$$ 2016-08-28 22:00:31.242 -0500  Administrator@X
$$ Compression mode = diff/dup
##.OBSERVE FREQUENCY= 400.02188249412
##.OBSERVE NUCLEUS= ^1H
##.ACQUISITION MODE= SIMULTANEOUS (DQD)
##.ACQUISITION SCHEME= undefined
##.AVERAGES= 8
##.DIGITISER RES= 22
##SPECTROMETER/DATA SYSTEM= spect
##.PULSE SEQUENCE= zg30
##.SOLVENT NAME= COFFEE_meoh
##.SHIFT REFERENCE= INTERNAL, COFFEE_meoh, 1, 14.98509
##AUDIT TRAIL= $$ (NUMBER, WHEN, WHO, WHERE, PROCESS, VERSION, WHAT)
$$ ##TITLE= Audit trail, TOPSPIN		Version 2.1
$$ ##JCAMPDX= 5.01
$$ ##ORIGIN= Bruker BioSpin GmbH
$$ ##OWNER= Administrator
$$ $$ E:\/data/COFFEE/nmr/NES1092_ptc170_9886698_P7uslTn7Oq/10/pdata/1/auditp.txt
$$ ##AUDIT TRAIL=  $$ (NUMBER, WHEN, WHO, WHERE, PROCESS, VERSION, WHAT)
(   1,<2016-08-28 22:00:24.242 -0500>,<Administrator>,<X>,<go>,<TOPSPIN 2.1>,
      <created by zg
	started at 2016-08-28 21:59:17.461 -0500,
	POWCHK enabled, PULCHK disabled,
       configuration hash MD5:
       21 0F 79 D6 B3 7B B4 F6 88 20 88 DB 03 48 BD 9F
       data hash MD5: 64K
       A9 28 4D 23 B0 3C 40 A6 CF 64 E3 A1 A4 1A ED 09>)
(   2,<2016-08-28 22:00:27.304 -0500>,<Administrator>,<X>,<proc1d>,<TOPSPIN 2.1>,
      <Start of raw data processing
       efp LB = 0 FT_mod = 6 PKNL = 1 PHC0 = 0 PHC1 = 0 SI = 32K 
       data hash MD5: 32K
       B1 8D 13 29 D7 92 A2 DD 2E 48 57 00 30 2D AE 03>)
(   3,<2016-08-28 22:00:27.570 -0500>,<Administrator>,<X>,<proc1d>,<TOPSPIN 2.1>,
      <pk PHC0 = 93.57605 PHC1 = 0 
       data hash MD5: 32K
       EB 18 4B 30 B9 60 AA AA 2B 60 62 46 04 B5 D4 1C>)
(   4,<2016-08-28 22:00:27.679 -0500>,<Administrator>,<X>,<proc1d>,<TOPSPIN 2.1>,
      <abs ABSG = 1 
       data hash MD5: 32K
       BC BC 7B 60 1F 13 6C 53 6D 4D CE 77 01 33 9C C3>)
(   5,<2016-08-28 22:00:27.742 -0500>,<Administrator>,<X>,<proc1d>,<TOPSPIN 2.1>,
      <abs ABSG = 2 
       data hash MD5: 32K
       AC 4F 69 7D 35 6B C9 AB 31 99 BE FD 4F F1 10 9A>)
(   6,<2016-08-28 22:00:27.804 -0500>,<Administrator>,<X>,<proc1d>,<TOPSPIN 2.1>,
      <abs ABSG = 3 
       data hash MD5: 32K
       DC 10 82 5A 70 A8 42 FD 56 CF EF E1 5B 94 A6 31>)
(   7,<2016-08-28 22:00:27.851 -0500>,<Administrator>,<X>,<proc1d>,<TOPSPIN 2.1>,
      <abs ABSG = 4 
       data hash MD5: 32K
       99 5A E2 23 A1 9E 7D AF 64 D0 63 AE 6E AD A4 54>)
(   8,<2016-08-28 22:00:27.898 -0500>,<Administrator>,<X>,<proc1d>,<TOPSPIN 2.1>,
      <abs ABSG = 5 
       data hash MD5: 32K
       7D 45 22 44 3C A2 11 ED A7 8E 98 F2 91 DE B5 5F>)
$$ ##END=
$$ 
$$ $$ hash MD5
$$ $$ B6 B6 64 E2 AE DB 43 EE 1C B9 33 65 1C 2D F1 FA
##$RELAX= 
##$RELAX= 
##$RELAX= 
##$RELAX= 
##$RELAX= 
##$RELAX= 
##$RELAX= 
$$ Bruker specific parameters
$$ --------------------------
##$DU= <E:\>
##$EXPNO= 10
##$NAME= <NES1092_ptc170_9886698_P7uslTn7Oq>
##$PROCNO= 1
$$ [...]
150 150 150 150 150 150 150 150
##$TP07= 0
##$TPNAME0= <>
##$TPNAME1= <>
##$TPNAME2= <>
##$TPNAME3= <>
##$TPNAME4= <>
##$TPNAME5= <>
##$TPNAME6= <>
##$TPNAME7= <>
##$TPOAL= (0..7)
0.5 0.5 0.5 0.5 0.5 0.5 0.5 0.5
##$TPOFFS= (0..7)
0 0 0 0 0 0 0 0
##$TUNHIN= 0
##$TUNHOUT= 0
##$TUNXOUT= 0
##$USERA1= <user>
##$USERA2= <user>
##$USERA3= <user>
##$USERA4= <user>
##$USERA5= <user>
##$V9= 5
##$VALIST= <valist>
##$VCLIST= <CCCCCCCCCCCCCCC>
##$VD= 0
##$VDLIST= <DDDDDDDDDDDDDDD>
##$VPLIST= <PPPPPPPPPPPPPPP>
##$VTLIST= <TTTTTTTTTTTTTTT>
##$WBST= 2048
##$WBSW= 25
##$XGAIN= (0..3)
0 0 0 0
##$XL= 0
##$YL= 0
##$YMAX_a= 567845
##$YMIN_a= -483861
##$ZGOPTNS= <>
##$ZL1= 120
##$ZL2= 120
##$ZL3= 120
##$ZL4= 120
##$ABSF1= 14.98509
##$ABSF2= -5.573092
##$ABSG= 5
##$ABSL= 3
##$ALPHA= 0
##$AQORDER= 0
##$ASSFAC= 0
##$ASSFACI= 0
##$ASSFACX= 0
##$ASSWID= 0
##$AUNMP= <proc_prof1d_extract_pilot.lims>
##$AXLEFT= 0
##$AXNAME= <>
##$AXNUC= <1H>
##$AXRIGHT= 0
##$AXTYPE= 0
##$AXUNIT= <>
##$AZFE= 0.1
##$AZFW= 0.1
##$BCFW= 0
##$BC_mod= 0
##$BYTORDP= 0
##$COROFFS= 0
##$CY= 15
##$DATMOD= 1
##$DC= 0
##$DFILT= <>
##$DTYPP= 0
##$F1P= 0
##$F2P= 0
##$FCOR= 0.5
##$FTSIZE= 32768
##$FT_mod= 6
##$GAMMA= 0
##$GB= 0
##$INTBC= 1
##$INTSCL= 1
##$ISEN= 128
##$LB= 0
##$LEV0= 0
##$LPBIN= 0
##$MAXI= 10000
##$MC2= 0
##$MEAN= 0
##$ME_mod= 0
##$MI= 0
##$NCOEF= 0
##$NC_proc= -8
##$NLEV= 6
##$NOISF1= 0
##$NOISF2= 0
##$NSP= 0
##$NTH_PI= 0
##$NZP= 0
##$OFFSET= 14.98509
##$PC= 1
##$PHC0= 93.57605
##$PHC1= 0
##$PH_mod= 1
##$PKNL= yes
##$PPARMOD= 0
##$PPDIAG= 0
##$PPIPTYP= 0
##$PPMPNUM= 2147483647
##$PPRESOL= 1
##$PSCAL= 4
##$PSIGN= 0
##$PYNMP= <proc.py>
##$REVERSE= no
##$SF= 400.02
##$SI= 32768
##$SIGF1= 0
##$SIGF2= 0
##$SINO= 400
##$SIOLD= 32768
##$SPECTYP= <>
##$SREGLST= <1H.CDCl3>
##$SSB= 0
##$STSI= 32768
##$STSR= 0
##$SW_p= 8223.68421052631
##$SYMM= 0
##$S_DEV= 0
##$TDeff= 65536
##$TDoff= 0
##$TI= <>
##$TILT= no
##$TM1= 0
##$TM2= 0
##$TOPLEV= 0
##$USERP1= <user>
##$USERP2= <user>
##$USERP3= <user>
##$USERP4= <user>
##$USERP5= <user>
##$WDW= 1
##$XDIM= 32768
##$YMAX_p= 434184783
##$YMIN_p= -692894
##$CURPLOT= <Network HP LaserJet P1505>
##$CURPRIN= <$Network HP LaserJet P1505>
##$DFORMAT= <normdp>
##$LAYOUT= <+/1D_H.xwp>
##$LFORMAT= <normlp>
##$PFORMAT= <normpl>
##$SURQMSG= 1
$$ End of Bruker specific parameters
$$ ---------------------------------
##NTUPLES= NMR SPECTRUM
##VAR_NAME=  FREQUENCY,     SPECTRUM/REAL,   SPECTRUM/IMAG
##SYMBOL=    X,             R,               I
##VAR_TYPE=  INDEPENDENT,   DEPENDENT,       DEPENDENT
##VAR_FORM=  AFFN,          ASDF,            ASDF
##VAR_DIM=   32768,         32768,           32768
##UNITS=     HZ,            ARBITRARY UNITS, ARBITRARY UNITS
##FACTOR=    0.250966925370066, 1,           1
##FIRST=     8223.43324360094, -4374,        81889
##LAST=      0,             95802,           -172741
##MIN=       0,             -692894,         0
##MAX=       8223.43324360094, 434184783,    0
$$ Real data points
##PAGE= N=1
##DATA TABLE= (X++(R..R)), XYDATA
$$ [...]
$$ plain form
19553 29770 -92902 -47401 110882 -250628 49858 158085 -192010 -295023 7124 -61051 -284849
19542 -284849 220400 100024 33240 -84628 -170890 -50059 349763 134038 156103 100871 -49824
19530 161933 147518 85312 -9402 113010 -103121 -28839 120869 47511 -51343 -8735 -307345
19519 -307345 -56003 92228 213227 -131989 -245348 199754 -150721 14456 77497 -108613
19508 -51262 -230215 330524 -411740 33966 228601 -228003 51856 -78304 349186 -252951
19497 89270 -218390 -84671 -209067 100904 -46807 50860 -66366 -268960 77722 -42269 -11625
19485 -113201 -137836 -79041 322513 -115492 -64148 130430 -30581 -171593 -139527 -59141 -81318
19474 -81318 -222661 -141582 -110870 -478670 -243551 32069 -96364 -37883 228594 87428 -15261
$$ packed form
19553B9770i2902M5501A10882b50628D9858J08227a92010j03013G124f1051k23798
19542b84849B20400A00024C3240h4628q6262e0059C49763A34038K2065n5232d9824
19530A61933j4415o2206i402A13010a03121b8839A20869D7511e1343h735k98610
19519c07345e6003I2228J20999a31989j13359A99754a50721A4456O3041a08613
19508e1262j78953C30524d11740C3966J94635b28003E1856g8304C49186b52951
19497H9270b18390h4671j24396A00904d6807E0860f6366k02594G7722d2269a1625
19485a13201k4635N8795C22513a15492N1344A30430c0581j41012L2066e9141k2177
19474h1318j41343Q1079L0712l67800K35119C2069i6364c7883B28594H7428a5261
$$ plain form
19462 26887 -21509 510788 -109591 -233826 120303 216492 86599 -301676 132847 34696
19451 232512 -151289 -5596 -28535 88909 42805 -289617 11741 -201776 -118403 -458449 -70366
19439 -71094 -130587 -357127 -40249 193178 -324896 -272520 -111581 -268010 -67379 346412
19428 21815 -201314 -126790 198359 -37347 44909 101690 148363 14279 -120811 -11365 38595
19416 403793 135899 108826 132031 76785 -169396 -125178 316 77696 -425031 -151708 228264
19404 -268888 -76852 161265 -22539 -12 -57388 -222992 93199 125910 228991 151077 -5246 46828
19391 -31407 -136521 72067 -53896 -96680 -61473 -114124 -29761 28598 -328788 -157046 -102899
19380 -102899 251048 -81040 -296062 49899 -247063 -185007 458553 -261850 -59829 443632
$$ packed form
19462B6887b1509E10788a09591j24235A20303R6189H6599c01676A32847C4696
19451B32512a51289e596k2939H8909D2805b89617A1741b01776Q3373l40046g0366
19439g1094n9493k26540d0249A93178c24896N2376a11581j56429f7379C46412
19428B1815b01314P4524A98359c7347D4909N6781M6673A4279a20811a1365C8595
19416D03793A35899k7073K3205n5246a69396M4218C16P7380d25031a51708B28264
19404b68888g6852A61265b2539a2n7376j65604I3199L2711J03081p7914e246D6828
19391c1407j05114G2067e3896m2784L5207n2651b9761B8598c28788a57046N4147
19380a02899B51048h1040k15022D9899b47063O2056D58553b61850e9829D43632
$$ plain form
19369 -75006 -99860 184760 -141455 -120943 -62990 72538 66765 21582 274488 -215580 -234403
19358 -234403 142921 -51360 -129857 -212223 86185 -240844 12524 7808 20793 -143459 -108008
19347 -108008 -83513 106705 -7887 35143 50093 -45674 -218452 -233871 -186019 66768 -77545
19335 -101312 -105306 184106 -167154 44100 -143579 -152156 -74265 -236259 206122 4066 -129275
19323 19798 -57407 270084 -333667 -470579 -82392 162787 -660217 -46555 -164895 -106424
19313 -106424 -26929 -102820 2618 -343380 -190561 76297 -45228 -1393 128826 -170711 -60314
19301 274685 -220499 -110593 -228469 -250963 -71039 15680 -200342 -128600 109027 -101793
19290 -192465 -24100 43253 -34595 83583 131925 -107017 -187894 -110149 84485 -154497 -310989
$$ packed form
19369g5006k4854A84760a41455K0512N7953G2538n773B1582K52906b15580j8823
19358b34403A42921e1360p8497q2366H6185b40844A2524m716J2985a43459L5451
19347a08008K4495A06705g887C5143J4950d5674j72778j5419M7852F6768g7545
19335a01312l994A84106a67154D4100a43579q577g4265j61994B06122D066a29275
19323A9798e7407B70084c33667j36912h2392A62787f60217d6555j18340N8471
19313a06424b6929p5891B618c43380J52819G6297d5228a393A28826a70711f0314
19301B74685b20499J09906j17876k2494g1039A5680b00342P1742A09027a01793
19290a92465b4100D3253c4595H3583M8342a07017q0877P7745H4485a54497j56492
$$ plain form
19279 -310989 -6565 -128420 125412 54364 -262183 434279 -107095 -159014 134750 183438
19269 183438 -7398 52129 -67938 301927 -403936 -138200 -192604 -55767 116185 59338 -86554
19257 121435 230260 112595 -131605 94675 -402947 67056 224769 -372404 -72852 -202 -60865
19246 -60865 -141657 -265513 177204 65971 5788 -194603 28010 -131300 16976 -132945 -126733
19235 -126733 13439 122749 -21736 138308 -156759 136707 -230722 -329212 193300 -370346
19224 84550 79762 54290 -319634 122657 107558 -194349 -91855 96784 -378234 30498 -12380
19212 39604 -89833 19813 -414742 71032 79469 167330 -130038 56709 -398521 -55647 151965
19200 -157603 -229094 -162943 -176828 -37057 -16001 99559 -15366 216018 -54706 158960 60292
$$ packed form
19279c10989f565j21855A25412E4364b62183D34279a07095n1919A34750M8688
19269A83438g398E2129f7938C01927d03936a38200n4404e5767A16185n6847h6554
19257A21435J08825A12595a31605I4675d02947F7056J57713c72404g2852b02o0663
19246f0865q0792j23856A77204F5971E788a94603B8010a31300A6976a32945O212
19235a26733A3439J09310b1736A38308a56759A36707b30722r8490A93300c70346
19224H4550m788k5472c19634A22657j5099a94349i1855I6784c78234C0498a2380
19212C9604h9833A9813d14742G1032Q437Q7861a30038E6709c98521e5647A51965
19200a57603p1491O6151j3885c7057a6001I9559a5366B16018e4706A58960F0292
$$ plain form
19188 132287 -346565 -71137 -156393 -235946 -219561 240675 -151500 66060 -111283 -161690 -204978
19177 -204978 -155513 15638 237719 -22179 51180 -268441 -48762 19617 -286439 -12907 -27479
19166 -27479 -158477 138542 26708 24933 -141061 -256411 -57351 -39147 160184 -222353 202151
19154 -33236 8999 174492 338098 -1198 -57093 -36554 193722 92769 279832 10906 20224
19143 20224 -333136 -294608 266588 -176560 98471 19002 -221361 -247963 -205879 -334205 154511
19131 -266723 -324019 296162 193427 113464 353235 51072 238081 -60450 -317648 -133390
19120 -220961 -114563 -11486 -304771 -214226 38737 -100711 -64577 -165883 -100969 -122020 -20986
19108 -431546 26161 100473 -31272 -167857 -338024 -42322 -235620 21823 133099 24211 -310881
$$ packed form
19188A32287c46565g1137q5256p9553J6385B40675a51500F6060a11283n0407m3288
19177b04978M9465A5638K22081b2179E1180b68441d8762A9617b86439a2907j4572
19166b7479j30998A38542B6708j775a41061j15350e7351J8204A60184b22353B02151
19154c3236H999J65493J63606a198n5895K0539A93722I2769J87063A0906R318
19143B0224c33136L8528B66588a76560I8471A9002b21361k6602M2084j28326A54511
19131b66723n7296B96162j02735p9963K39771E1072J87009f0450k57198a33390
19120b20961J06398a1486k93285R0545C8737a00711L6134j01306O4914k1051b0986
19108d31546B6161P4312c1272j36585j70167d2322j93298B1823J11276B4211c10881
$$ plain form
19096 -13642 -69030 2679 104125 51774 130994 -347723 75077 119060 -285771 128361 -174081
19084 -232419 34132 -211040 -50699 11486 110003 -105046 28849 -81642 15178 11561 -111593
19072 -123077 154575 302103 -441968 -469440 -121580 -247306 -14380 -116770 -294132 -304604
19062 -304604 99850 88659 -338628 -101795 -61468 -37133 -248338 13989 -226039 -16492 -117581
19051 -117581 10027 157207 20050 -222833 -14397 75027 62166 216630 83178 -23527 23743
19039 -179741 -26717 199182 55870 61947 -123698 -394137 -63666 -153110 -179673 146897 89566
19028 89566 42888 319461 -16676 197296 147061 216855 120632 -154456 102741 220838 -10871
19016 164756 -7505 -19198 -305868 100602 41342 198281 -191939 262737 91372 97925 -2393
$$ packed form
19096a3642n5388B679J01446E1774P9220c47723G5077M3983b85771A28361a74081
19084b32419C4132b11040e0699A1486R8517a05046B8849h1642A5178l617a11593
19072a23077A54575J47528d41968k7472a21580j25726a4380j02390j77362j0472
19062c04604I9850j1191c38628a01795M0327K4335k11205A3989b26039a6492j01089
19051a17581A0027J47180B0050b22833a4397G5027j2861J54464H3178b3527B3743
19039a79741b6717A99182E5870O077a23698k70439f3666q9444k6563A46897n7331
19028H9566D2888K76573a6676A97296n0235O9794r6223a54456A02741J18097a0871
19016A64756g505j1693k86670A00602D1342J56939a91939B62737I1372O553b393
$$ plain form
19004 44957 -50831 124981 91973 -321738 -204518 -218565 -101119 -82725 -79785 -64266 -165666
18993 -165666 -495943 -176900 122077 149595 176267 -20343 -120093 -122061 -141417 1085 85862
18982 85862 -92374 20419 -96755 16679 88788 -209292 -256111 -220844 -201944 -19078 -80916
18971 -80916 99714 -121633 17320 225896 99215 169077 -287118 -52942 7001 -269347 -27876
18959 -27925 -100731 -139956 4295 -91904 -47205 -312700 17640 -65088 57296 -64418 -161136 -20272
18946 -91637 -285838 303888 84194 244136 -147272 -464422 144217 -15185 -132916 -107497
18936 -107497 -212803 -96588 4177 -20366 -369536 -183554 -64629 -11815 306776 -36849 -280997
18925 -280997 10664 -436 -135156 102419 115308 31149 -238319 -13407 -421291 266996 15376
$$ packed form
19004D4957e0831A24981l3008c21738J17220j4047a01119J8394K940J5519j01400
18993a65666l30277a76900A22077K7518K6672b0343r9750j968j9356A085Q4777
18982H5862i2374B0419i6755A6679P2109b09292m6819L5267J8900a9078o1838
18971h0916I9714a21633A7320K08576I9215O9862b87118e2942G001b69347b7876
18959b7925p2806l9225D295i1904M4699k65495A7640f5088E7296f4418r6718b0272
18946i1637j94201C03888H4194J59942a47272l17150A44217a5185j17731K5419
18936a07497j05306i6588D177b0366l49170a83554f4629a1815C06776c6849k44148
18925b80997A0664d36j34720A02419J2889C1149b38319a3407m07884B66996A5376
$$ plain form
18913 -314935 14459 -150422 110394 -236792 -392104 -190493 -40310 9830 125877 100649
18903 100649 -136594 -45066 129116 -93456 336166 -283224 228906 231506 9717 37737 -473903
18891 -136308 -162143 165128 -61425 -247479 -218598 -332934 178495 68574 46488 -62409 -157574
18880 -157574 61326 -111531 -45381 153094 -11238 -180640 -183750 -117092 110805 -247726 395067
18868 -128738 17007 -105209 33992 143924 -33504 -129995 -73025 16424 -42834 -111826 154453
18856 -323529 116423 -176468 -256160 371298 129413 -268345 -140827 -103010 -81068 144496
18845 56347 194847 -116682 186492 71064 73175 -94605 207217 133083 182993 -211432 -147337
18834 -147337 -359911 -444166 -173640 -2483 93340 -16973 33257 -138923 -317749 -161269 -164000
$$ packed form
18913c14935A4459a50422A10394b36792j55312a90493d0310I830J16047k5228
18903A00649a36594d5066A29116i3456C36166b83224B28906K600I717K8020d73903
18891a36308k5835A65128f1425j86054K8881j14336A78495F8574k2086f2409r5165
18880a57574F1326a11531d5381A53094a1238j69402l110O6658A10805b47726C95067
18868a28738A7007a05209C3992J09932c3504r6491N6970A6424d2834o8992A54453
18856c23529A16423a76468p9692C71298A29413b68345J27518L7817K1942A44496
18845E6347J38500a16682A86492G1064K111i4605B07217p4134M9910b11432O4095
18834a47337k12574q4255a73640b483I3340a6973C3257a38923j78826J56480k731
$$ plain form
18823 -164000 -129147 6139 -82858 172905 67511 -250103 50070 -70986 203474 149658 194528
18812 194528 30720 208107 -65823 214323 228546 186269 43992 -249852 -24268 -478293 350728
18800 -189234 -27239 186636 -7679 192372 -234931 -27226 58359 -319326 48272 43173 13980
18788 -10929 -65292 -199732 -84955 -176177 184340 -310249 -77066 52756 222401 -116304 220672
18776 -139973 -180747 204678 -228389 6114 -156820 -114450 16238 1039 64297 -256808 -27747
18764 -87771 -341887 -38046 24709 -225561 -352617 -515604 331192 -217029 -155927 -82053
18754 -82053 247799 241464 429036 280260 -17124 50624 128468 66954 -7510 -219196 6187
18742 273732 -346596 52313 101251 -292404 -76146 177956 137687 -26635 -264835 -162425
$$ packed form
18823a64000L4853F139h2858A72905F7511b50103E0070g0986B03474n3816M4870
18812A94528C0720J77387f5823B14323J4223m2277D3992b49852b4268m54025C50728
18800a89234b7239A86636g679A92372b34931b7226E8359c19326D8272n099A3980
18788a0929n4363j34440h4955r1222A84340c10249g7066E2756J69645a16304B20672
18776a39973m0774B04678b28389F114a56820M2370A6238A039O3258b56808b7747
18764h7771k54116c8046B4709b25561j27056j62987C31192b17029O1102P3874
18754h2053B47799o335J87572j48776a7124E0624P7844o1514g510k11686F187
18742B73732c46596E2313M8938b92404g6146A77956m0269b6635k38200J02410
$$ plain form
18732 -162425 148590 -145035 -165025 -266818 -163695 -124590 -66697 -141116 170184 -482702
18721 -39569 -74487 31095 -227278 -210367 -42813 -137405 -72228 47395 -221732 -20754 133295
18709 -168930 -162204 36873 45257 -157123 -184391 -215662 274376 26426 262567 21757 -112095
18697 -300777 -192816 -35799 -149207 115699 -103909 -385829 -21528 146021 34056 -313584
18686 30916 72844 -1263 330183 -267979 -254083 20348 382260 -205773 76053 -337514 -62105
18674 -209342 263885 -273622 60257 -77322 246182 -368572 210911 33008 -28519 -147573
18664 -147573 36298 -123981 47756 -61837 -191258 -175355 -33984 -101992 115213 -15928 -41363
18653 -41363 -133093 -66779 -51843 97468 -302489 -185964 -19214 -218544 -100423 -216248 -25085
$$ packed form
18732a62425A48590a45035j9990j01793J03123L9105N7893p4419A70184d82702
18721c9569l4918C1095b27278J6911d2813r4592O5177D7395b21732b0754A33295
18709a68930O726C6873Q384a57123k7268l1271B74376B6426K36141B1757a12095
18697c00777J07961c5799j13408A15699a03909k81920b1528A46021C4056c13584
18686C0916M1928a263C30183b67979J3896B0348L61912b05773G6053c37514f2105
18674b09342B63885b73622F0257g7322B46182c68572B10911C3008b8519j19054
18664a47573C6298a23981D7756f1837j29421J5903c3984o8008A15213a5928k5435
18653d1363r1730O6314J4936I7468c02489J16525a9214j99330a00423j15825b5085
$$ plain form
18641 159102 -108643 310499 183243 -126149 28603 -18941 -172417 -39875 -36356 -174920
18631 -174920 -54285 -197434 15176 -202148 94223 179587 34166 -261013 -51330 -357204 170225
18619 -429318 24539 82362 157549 59537 -31551 100348 -131079 438039 -81595 26370 -72222
18607 -57166 -159369 -161910 62801 137143 205951 -221754 -140216 -133593 -199421 139897 -185066
18595 35305 -69084 94882 186842 5230 136725 -92911 -258220 7934 -203950 227501 -15456
18583 52930 -89119 93159 83607 -304015 -457884 161519 -173710 -11184 -40577 119398 41542
18571 -82595 -337711 -189435 -90266 -146063 95211 -295129 -34446 142299 74900 -148288 -14925
18559 189707 -271657 -46228 -83689 -69079 -209043 -110083 -210948 104434 -195876 -276947
$$ packed form
18641A59102a08643C10499j27256a26149B8603a8941j53476c9875L519j38564
18631a74920e4285j43149A5176b02148I4223Q5364C4166b61013e1330l05874A70225
18619d29318B4539N7823P5187E9537c1551A00348a31079D38039h1595B6370g2222
18607e7166j02203k541F2801P4342O8808b21754Q1538O623o5828A39897a85066
18595C5305f9084I4882R1960E230J31495i2911j65309G934b03950B27501a5456
18583E2930h9119I3159r552c04015j53869A61519a73710a1184k9393A19398D1542
18571h2595k55116J48276i0266n5797I5211b95129c4446A42299o7399a48288a4925
18559A89707b71657d6228l7461J4610j39964R8960j00865A04434a95876q1071
$$ plain form
18549 -276947 -104255 16412 -112556 -35722 -434588 -123682 -50004 74171 351942 82198
18538 -130412 -372488 223298 -244847 71921 141709 -177997 128398 84537 104960 28628
18527 -106531 87794 279610 142195 50357 -62957 413221 -114715 -87297 -19981 -62658 -319108
18516 -319108 -272950 113049 238017 27394 -82821 -377320 97953 254664 -176022 -165461
18506 -165461 -176704 48440 177636 105007 29980 -10329 -153174 107950 -71179 -20419 -26809
18495 -26809 -289406 168863 62927 -37866 -164699 -192811 -221102 -251766 -291605 -110515 -204439
18484 -204439 16658 79306 93964 170319 10631 -90658 -216897 187975 -221004 -214952 -379201
18473 -379201 -196830 -154556 -14758 -40895 -119783 -50479 264605 118799 33354 -46305 -132234
$$ packed form
18549b76947a04255A6412a12556c5722l98866a23682e0004G4171K77771H2198
18538a30412k42076B23298b44847G1921O9788a77997A28398m3861K0423B8628
18527a06531H7794J91816j37415E0357f2957D13221a14715K7418a9981m2677k56450
18516c19108M6158A13049J24968B7394h2821k94499I7953J56711a76022J0561
18506a65461j1243D8440J29196p2629B9980a0329j42845A07950g1179b0419o390
18495b6809k62597A68863F2927c7866j26833k8112k8291l0664l9839a10515r3924
18484b04439A6658O2648J4658P6355A0631i0658j26239A87975b21004O052j64249
18473c79201J82371M2274a4758k6137p8888e0479B64605A18799C3354d6305q5929
$$ plain form
18462 -132234 -238486 46562 -329251 -10012 319214 -37576 264088 -105089 -289385 -91239
18451 -35127 49086 44824 36925 176070 -210939 -267046 169381 -168508 -334422 -238837 -44666
18439 -20022 -131672 -328310 -99001 -175148 241257 -125675 165212 92695 59643 -70494 -133652
18428 -133652 -127303 8918 -167585 -61694 118761 -71841 -183182 -260525 -356084 -70885 218254
18416 -152073 199094 -2141 225000 62945 -232868 -151898 -316225 -127583 138708 -151878
18405 192931 -3016 -127456 -44734 -106931 48607 53130 27570 -318968 177981 -155416 -58264
18393 -92742 -116636 159408 129225 10853 -111016 -312059 196695 -46960 -475864 -36489 -72726
18382 -72726 126553 -148619 -272507 -26790 -94426 243187 27436 -69416 11247 15653 -31367
$$ packed form
18462a32234j06252D6562c29251a0012C19214c7576B64088a05089j84296i1239
18451c5127D9086m262p899J39145b10939n6107A69381a68508j65914R5585d4666
18439b0022j11650j96638i9001p6147B41257a25675A65212p2517l3052g0494o3158
18428a33652O349H918a67585f1694A18761g1841j11341p7343r5559g0885B18254
18416a52073A99094b141B25000F2945b32868Q0970j64327a27583A38708a51878
18405A92931c016j24440d4734o2197D8607M523k5560c18968A77981a55416e8264
18393i2742k3894A59408l0183A0853a11016k01043A96695d6960m28904c6489l6237
18382g2726A26553a48619j23888b6790o7636B43187B7436f9416A1247M406c1367
$$ plain form
18370 247700 126009 69868 -367433 -31568 162209 110099 336661 -65721 -189398 162869
18359 164150 -53846 -107917 120331 23402 -225313 -46279 149116 -132184 233708 -190923
18348 36633 -12115 -174770 115799 272557 77309 -253988 -83513 -232176 140076 -221301
18337 47829 143249 179263 -93948 473251 343847 -42676 60685 -130756 -32462 -194853 -139820
18326 -139820 236452 -110317 34696 143043 -21743 -150147 -328356 -175000 2539 -147496
18315 86204 -135539 -228166 22901 222895 -149023 54782 -63674 31216 70176 -162031 12441
18303 -81728 -88116 68340 128534 -45536 132003 95376 -57980 73892 106615 8098 -47369 -88766
18291 -88766 19896 8013 -262582 -217889 91919 -86317 104683 22216 -127069 -26074 14006
$$ packed form
18370B47700j21691n6141c67433c1568A62209n2110K26562f5721j23677A62869
18359A64150e3846n4071A20331B3402b25313d6279A49116a32184B33708a90923
18348C6633a2115j62655A15799J56758G7309b53988h3513j48663A40076b21301
18337D7829R5420L6014i3948D73251j29404d2676F0685a30756c2462j62391N5033
18326a39820B36452a10317C4696J08347b1743j28404j78209J53356B539a47496
18315H6204a35539r2627B2901J99994a49023E4782f3674C1216L8960a62031A2441
18303h1728o388F8340O0194d5536A32003l6627e7980G3892L2723H098d7369m1397
18291h8766A9896H013b62582M4693I1919h6317A04683B2216a27069b6074A4006
$$ plain form
18279 173360 118460 -42363 89246 118142 -116690 -73970 -237245 34625 -71799 -163326 -280400
18268 -280400 62954 21681 264643 -363840 -203069 -19664 -120202 -178447 -138628 177167
18257 -277412 -43187 -196754 174769 -96383 214657 32656 -111358 -94372 95758 147372 38992
18245 122846 -86758 237059 -302234 -16403 6842 -126253 -235194 -177860 -84067 62114 -87303
18233 -165105 25636 202937 -17711 -79391 -246657 172263 -285705 -34550 -77378 -3715 -133880
18222 -133880 -314598 -284801 -194244 -23276 -17969 -79219 -193726 -332857 129886 -121834 -109518
18211 -109518 -207666 -58026 -57158 -305874 -125706 54503 85950 -14356 -342808 -59456 -139142
18200 -139142 -338860 -228614 29588 -133365 40932 -84798 -7584 -14776 156740 250131 135871
$$ packed form
18279A73360n4900d2363H9246K8896a16690M2720j63275C4625g1799r1527j17074
18268b80400F2954B1681K42962c63840J60771a9664j00538n8245L9819A77167
18257b77412d3187j53567A74769i6383B14657C2656a11358J6986I5758N1614C8992
18245A22846h6758B37059c02234a6403F842a26253j08941N7334h4067F2114h7303
18233a65105B5636J77301a7711o1680j67266A72263b85705c4550m2828c715j30165
18222a33880j80718K9797R0557b3276N307o1250j14507j39131A29886a21834J2316
18211a09518r8148e8026Q68k48716a25706E4503L1447a4356l28452e9456p9686
18200a39142j99718J10246B9588a33365D0932h4798g584p192A56740R3391j14260
$$ plain form
18189 135871 103527 -21719 -10345 -84653 8053 -70930 206762 -256681 134279 -15343 -186659
18178 -186659 -106882 125339 -108228 -197462 -450709 49585 -55104 83011 -75834 -61253 -137055
18167 -137055 -42289 -251532 -329298 143800 -67398 -8052 -56388 -88976 195660 -268127 -20494
18155 -33624 -321838 -89719 -273065 103061 127192 41006 -205371 129179 -43784 -84399 102105
18143 -193006 -163388 -45776 -82527 -60231 -127569 -40711 32838 20805 -77053 -34872 65123
18131 -49869 253635 5287 -2600 209932 -447154 -149779 -34728 5966 -31271 -34479 -37405 -230503
18119 -230503 -389458 -183523 224038 -229689 147610 164527 -8492 132082 -121675 -70503
18109 -70503 -109248 87821 75089 165415 340892 -25295 33944 -256413 19863 -325020 -246718
$$ packed form
18189A35871l2344b1719a0345p4308H053g0930B06762b56681A34279a5343j71316
18178a86659P9777A25339a08228q9234k53247D9585e5104H3011g5834J4581p5802
18167a37055d2289k09243p7766A43800f7398h052m8336l2588A95660b68127b0494
18155c3624k88214h9719j83346A03061K4131D1006b05371A29179d3784m0615A02105
18143a93006K9618d5776l6751K2296o7338d0711C2838j2033g7053c4872F5123
18131d9869B53635E287b600B09932d47154a49779c4728E966c1271l208k926j93098
18119b30503j58955a83523B24038b29689A47610J6917h492A32082a21675N1172
18109g0503l8745H7821j2732R0326J75477b5295C3944b56413A9863c25020P8302
$$ plain form
18098 -246718 -4107 -33793 -35862 123159 133442 157493 -46408 -13055 41091 -163342 -57640
18086 288914 -127922 256368 233837 173096 -21793 169257 56383 -133675 476591 -9578 125507
18074 -138870 -108180 93068 27279 -269972 -326553 -334131 321371 -111432 -90600 102609 -218746
18062 31355 -145378 -175709 -61272 -31128 66186 -211841 21494 194318 22385 226136 -85701
18050 -367690 -154735 173369 123239 212899 -35682 69814 -70983 -100683 231696 183952 207344
18039 207344 -159568 92856 -377168 153616 -36564 66843 -82678 57460 221476 -184727
18028 -264832 -125296 -541 55634 -367629 -341147 -181528 -95182 -53738 133886 49963 -87591
18016 269971 56532 -144848 -105704 113830 29594 34569 -164050 -133233 -110015 263458 -218566
$$ packed form
18098b46718d107k9686k069A23159J0283K4051d6408a3055D1091a63342e7640
18086B88914a27922B56368k2531o0741b1793A69257E6383a33675D76591i578A25507
18074a38870L0690I3068B7279b69972n6581p578C21371a11432K0832A02609b18746
18062C1355a45378l0331f1272L0144F6186b11841B1494J72824B2385K03751h5701
18050c67690a54735A73369n0130Q9660c5682F9814g0983k9700B31696m7744K3392
18039B07344a59568I2856c77168A53616c6564F6843h2678E7460J64016a84727
18028b64832a25296e41E5634c67629K6482J59619Q6346M1444A33886D9963h7591
18016B69971E6532a44848L9144A13830B9594M975a64050L0817K3218B63458b18566
$$ plain form
18004 127586 -111897 -30617 -124575 55814 66494 -233053 -118017 54748 -69858 -76359 -133504
17993 -133504 -226680 260340 166399 -113494 -30936 -135439 25253 232917 73273 50 -129447
17981 -14012 -105834 167446 111916 -152784 24782 -601 445606 342436 -240726 -139895 -183325
17970 -183325 166179 119362 -56578 263522 44252 164516 37902 -94992 99792 -70720 33595
17958 -229605 -64647 105798 54781 96318 -196183 128074 -333285 76426 66886 -192620 -110228
17947 -110228 28282 -197983 20088 7851 11362 -20776 96022 251128 -17809 297355 -260487
17935 68340 -81655 -82993 -78750 -230521 -277511 -306572 65041 8288 162792 -89940 -43085 131114
17922 2186 161589 26421 124986 186344 39900 142102 183873 -173775 -265267 -15852 -68612
$$ packed form
18004A27586a11897c0617r3958E5814J0680b33053J15036E4748f9858o501n7145
17993a33504r3176B60340r3941a13494c0936j04503B5253K07664G3273E0a29447
17981a4012r1822A67446n5530a52784B4782f01D45606j03170b40726J00831m3430
17970a83325A66179m6817e6578B63522D4252J20264C7902i4992I9792g0720C3595
17958b29605f4647A05798n1017M1537a96183A28074c33285G6426r540a92620Q2392
17947a10228B8282a97983B0088G851L511b0776I6022J55106a7809B97355b60487
17935F8340h1655j338M243j51771m6990k9061F5041H288J54504h9940d3085A31114
17922B186J59403B6421R8565O1358C9900J02202M1771a73775r1492a5852n2760
$$ plain form
17911 -68612 -103784 57176 34413 -225411 -329021 30228 32147 -134802 -266677 -54795 68899
17899 126117 -94060 -155859 -134214 -9710 -221768 -259085 -29693 -144315 -227547 -94363 -32754
17887 -111235 -117226 -220601 -156063 58257 -127464 -4594 -108680 250122 -77056 45848 65809
17876 65809 93125 -74998 135678 48881 174931 99113 -80785 -24747 -15719 318986 7320
17864 -263620 146236 -277723 10210 -70082 -98575 -53611 -286505 122402 -298979 153890
17853 -180359 110730 -274397 44359 173615 -98055 333386 -285493 115823 77083 -211463
17842 96483 77212 -26113 -296525 112027 -201329 -216829 -57448 -17422 -132111 -49074 345137
17830 -180742 -31880 -31268 -13475 -187718 52186 13341 -140413 202169 86363 193447 -62663
$$ packed form
17911f8612l5172E7176k2763b25411j03610C0228J919a34802j31875e4795F8899
17899A26117i4060o1799K1645i710k12058l7317b9693j14622q3232i4363c2754
17887a11235n991j03375O4538E8257a27464d594j04086B50122g7056D5848J9961
17876F5809K7316g4998A35678D8881J26050p5818h0785b4747R028C18986G320
17864b63620A46236b77723A0210g0082k8493M4964k32894A22402b98979A53890
17853a80359A10730b74397D4359J29256i8055C33386b85493A15823l8740b11463
17842I6483j9271b6113k70412A12027b01329j5500e7448a7422j14689d9074C45137
17830a80742c1880O12a3475j74243E2186A3341a40413B02169H6363J07084f2663
$$ plain form
17818 107710 -54422 269597 -35403 -36334 72634 320737 -145947 -176784 -161376 -25232 88099
17806 199105 -340311 -171998 368380 -74327 -24699 12332 315191 148090 -85190 -53696
17796 -53696 -28951 126140 27491 26623 37275 325328 -28840 -27377 58510 -59272 203906 20066
17783 241835 -24810 -92120 262465 -194086 -160854 145220 -120479 255621 65969 -1950 340177
17771 218402 -500795 -29258 -148522 -158212 -116899 41183 -114334 144854 -181108 38043 -145869
17759 89952 -242533 94316 -6333 -32119 139769 82200 -247109 -139493 -56540 65612 393552
17748 393552 200622 -1862 -77810 -213140 36648 -281853 106321 -16796 12326 -105917 -67828
17737 -67828 82897 -127351 160034 188020 -142686 -310085 -136604 -111282 228589 -208472
$$ packed form
17818A07710e4422B69597c5403r31G2634K48103a45947l0837J5408b5232H8099
17806A99105c40311J68313C68380g4327b4699A2332L02859A48090h5190L1494
17796e3696K4745A26140B7491q68J0652K88053b8840J463E8510e9272B03906B0066
17783B41835b4810o7310B62465a94086L3232A45220a20479B55621F5969a950C40177
17771B18402e00795b9258j19264r690M1313D1183a14334A44854a81108C8043a45869
17759H9952b42533I4316f333k5786A39769n7569b47109J07616e6540F5612L27940
17748C93552j92930a862p5948j35330C6648b81853A06321a6796A2326a05917L8089
17737f7828H2897a27351A60034K7986a42686j67399a36604K5322B28589b08472
$$ plain form
17726 -46719 -52504 86060 -79672 153403 161624 180359 -6458 -190235 -85817 353318 -196295
17714 -130442 -67034 86096 -69464 160213 1895 -151747 294977 -136055 -247873 211225
17703 -110206 -414274 -26018 42608 -34898 -433918 161557 -152542 -285974 -64492 112098
17692 211033 -145398 -186520 41217 538376 -48549 -120320 252718 -52219 -65545 205130 -109324
17680 70545 -10500 -1973 -19427 -70654 149833 -6929 197546 128209 -91351 -33550 -146386
17669 -146386 -241007 -59946 193836 -39372 264257 119543 -174470 -63348 272391 179031
17659 179031 28376 39062 -151200 27284 -210633 -132934 -29730 90157 -195817 -151276 -180507
17648 -180507 -28746 387852 -41827 -285975 -29509 3545 -4525 -21939 -196838 92271 13350
$$ packed form
17726d6719n785H6060g9672A53403Q221J8735f458j83777h5817C53318a96295
17714a30442O3408H6096f9464A60213A895a51747B94977a36055j11818B11225
17703a10206l04068b6018D2608c4898l99020A61557a52542j33432f4492A12098
17692B11033a45398m1122D1217M97159d8549p1771B52718e2219j3326B05130a09324
17680G0545a0500a973j7454n1227A49833f929A97546o9337i1351c3550j12836
17669a46386r4621e9946A93836c9372B64257A19543a74470f3348B72391r3360
17659A79031B8376J0686a51200B7284b10633P7699b9730I0157a95817M4541k9231
17648a80507b8746C87852d1827k44148b9509C545d525j7414j74899I2271A3350
$$ plain form
17636 188926 205707 130163 300811 156392 -160274 24226 148216 -21370 -168751 -105233
17626 -105233 -157475 -144385 -72728 222197 131334 172016 90519 108940 237887 22421 261268
17615 261268 -158107 88832 -136165 -1986 -58378 -37031 -141199 193153 158800 42454 304883
17604 304883 90586 -22991 -67861 27860 -20786 -144170 65664 -131047 89919 -19412 -140701
17593 -140701 61254 -291906 351570 88252 -378900 -102691 -162778 -134660 409517 -76762
17582 -46116 -55866 -215978 93531 -34884 -75495 23265 110571 118378 -61567 86364 209461 -60040
17569 162428 -58131 -488002 112820 -42259 9336 129028 231500 -98458 24425 -11206 90065
17557 321146 144095 312532 -13221 -99164 148676 -320566 226011 -202172 208504 60884
$$ packed form
17636A88926J6781p5544J70648j44419a60274B4226J23990b1370j47381O3518
17626a05233n2242J3090P1657B22197r0863M0682q1497J8421J28947B2421K38847
17615B61268a58107H8832a36165a986n6392K1347j04168A93153l4353D2454K62429
17604C04883I0586b2991m4870B7860b0786j23384F5664a31047H9919a9412j21289
17593a40701F1254b91906C51570H8252c78900a02691o0087K8118D09517g6762
17582d6116r750j60112I3531c4884m0611B3265Q7306P807f1567H6364J23097f0040
17569A62428e8131m29871A12820d2259I336J19692J02472i8458B4425a1206I0065
17557C21146A44095J68437a3221q5943A48676c20566B26011b02172B08504F0884
$$ plain form
17546 41173 -20403 -153597 329736 -10274 -212227 86391 -214690 -469426 -13549 236922
17535 113339 -87290 419536 -111878 158519 141275 76623 235390 187919 -70458 94915 -150090
17523 69357 4174 -109607 -109810 39928 70638 383225 -241639 161648 125405 379123 192191
17512 192191 9072 118524 165277 124230 -26981 -42866 -103371 45195 63586 -156782 -50527
17500 141697 -35562 -318996 213863 429913 61664 218543 218123 131979 259219 -6929 -122194
17489 -122194 169066 19117 -250418 189986 171640 21264 111783 16860 77789 151652 445578
17478 445578 -273750 91737 218803 20811 34467 133725 140463 276220 214092 243629 491602
17467 491602 146547 7185 192717 -270901 193363 -352434 50330 229331 209829 179982
$$ packed form
17546D1173b0403j33194C29736a0274k01953H6391b14690k54736a3549B36922
17535A13339h7290D19536a11878A58519j7244o4652J58767m7471g0458I4915a50090
17523F9357D174a09607k03C9928L0710L12587b41639A61648l6243K53718j86932
17512A92191I072J09452M6753m1047b6981j5885o0505D5195J8391a56782e0527
17500A41697c5562k83434B13863K16050F1664J56879m20q6144J27240f929j15265
17489a22194A69066A9117b50418A89986j8346B1264R0519A6860O0929P3863K93926
17478D45578b73750I1737J27066B0811J3656R9258O738J35757o2128K9537K47973
17467D91602A46547G185J85532b70901A93363c52434E0330J79001j9502k9847
$$ plain form
17457 179982 -397158 55507 -30780 131178 16349 85449 75337 -105075 259043 446611
17447 446611 361021 406137 -68155 315847 95023 407993 138253 213985 331457 -138910
17436 333071 292627 -10462 79009 45242 102377 444636 473707 123671 26829 60816 269717
17425 269717 141450 351884 215347 471724 47182 357201 268379 78493 423099 172129
17414 507239 207356 247440 149598 129869 7120 148272 320072 -37113 313702 238439 153857
17403 153857 -68439 317848 -182502 268320 371717 177669 -84832 165550 335353 448899
17393 448899 181237 402167 -55118 111463 112506 -158160 -17352 238807 77010 72808 74092
17382 74092 19328 -23569 93557 -37425 330674 87982 -393479 48840 75649 284184 -160418
$$ packed form
17457A79982c97158E5507c0780A31178A6349O9100j0112a05075B59043J87568
17447D46611q5590M5116f8155C15847I5023L12970A38253P5732J17472a38910
17436C33071m0444a0462G9009l3767N7135L42259K9071A23671B6829L3987K08901
17425B69717j28267K10434j36537K56377D7182L10019q8822G8493L44606A72129
17414E07239B07356M0084r7842j9729G120J41152J71800c7113C13702p5263q4582
17403A53857f8439C17848a82502B68320J03397A77669h4832A65550J69803J13546
17393D48899A81237K20930e5118A11463J043a58160a7352B38807G7010m202J284
17382G4092A9328b3569I3557c7425C30674H7982c93479D8840K6809K08535a60418
$$ plain form
17370 -164590 57980 -37030 -15995 266185 132221 -100364 213876 43919 26041 266267
17360 266267 92350 -75559 73124 -256968 -22313 265903 -96322 74242 -8612 -15477 338983
17348 74198 227582 -6034 -79820 136738 247192 424116 26367 65423 207526 175981 -97640
17336 129089 164227 289728 207818 130378 323074 40722 447045 185566 60855 54538 -129184
17324 -200946 218442 140847 233158 354872 -337005 149112 -160041 140397 465435 57319
17313 -291390 18892 226570 87694 253460 75649 129540 299822 134891 134156 -81685 171600
17301 -41520 -77701 229749 26490 -40200 154501 408951 30295 36265 -57635 -41491 346273
17289 177809 368842 928 353387 87368 126531 159548 106387 28226 -152454 245969 227635
$$ packed form
17370a64590E7980c7030a5995B66185A32221a00364B13876D3919j7878K40226
17360B66267I2350g5559G3124b56968b2313B65903i6322G4242h612o865C38983
17348G4198J53384f034p3786A36738J10454J76924B6367L9056J42103l1545i7640
17336A29089L5138J25501q1910p7440J92696D0722M06323A85566F0855o317a29184
17324b00946B18442p7595R2311J21714c37005A49112a60041A40397L25038E7319
17313b91390A8892K07678H7694J65766G5649N3891J70282A34891p35h1685A71600
17301d1520l6181B29749B6490d0200A54501K54450C0295N970e7635J6144C46273
17289A77809J91033I28L52459H7368L9163L3017n3161B8226a52454B45969j8334
$$ plain form
17278 227635 285676 71607 376600 192788 -38082 29005 80848 -133829 573488 209926
17267 200320 71709 17711 70119 207330 258082 -391161 200471 146905 197257 153963 447673
17256 447673 -72831 380600 262393 -324444 269521 -44334 426353 132075 134424 -84223
17245 53243 -128628 -60865 388743 65352 549957 255316 173967 79856 195784 98902 205093
17234 205093 358426 252408 131426 417828 166825 210662 89713 -67105 242051 30682
17223 53675 260749 344063 512697 208426 148858 22850 -137062 -134156 278910 250332 110252
17211 10702 201159 49783 133778 60502 155384 -69407 386617 55144 -89848 173388 207165
17200 207165 119321 152722 333862 -17565 473930 177604 2671 65754 215901 -68590 308308
$$ packed form
17278B27635N8041G1607L04993j83812c8082B9005N1843a33829E73488B09926
17267B00320G1709A7711N2408J37211N0752c91161B00471n3566N0352m3294K93710
17256D47673g2831C80600j18207c24444B69521d4334D26353A32075K349h4223
17245E3243a28628f0865C88743F5352M84605B55316q1349G9856J15928r6882J06191
17234B05093J53333j06018j20982K86402A66825M3837H9713f7105B42051C0682
17223E3675K07074Q3314J68634B08426n9568B2850a37062K906B78910k8578A10252
17211A0702J90457D9783Q3995F0502R4882f9407C86617E5144h9848A73388L3777
17200B07165q7844L3401J81140a7565D73930A77604B671O3083J50147f8590C08308
$$ plain form
17188 -200459 68534 99502 465523 26847 284073 -142625 185079 262006 -27038 20515 320551
17177 320551 429174 272733 193442 397174 264240 82819 145779 342209 71015 174679
17167 174679 71211 399951 209316 158599 -20941 96782 230595 371298 16985 290299
17157 290299 441797 345962 254515 -120746 154030 106387 19001 129640 90814 322063
17147 322063 167751 420444 144153 -5808 177725 225980 38085 -91038 538957 -17186 220932
17135 163109 298053 438579 435677 1271 459135 255352 430735 509222 425112 56714 240588
17124 240588 -23124 49214 522655 19672 549074 577922 462921 259469 323846 151285
17113 154277 401513 539368 303822 27827 -93988 68363 392707 771173 456150 723286
$$ packed form
17188b00459F8534L0968L66021B6847K57226a42625A85079P6927b7038B0515L00036
17177C20551J08623j56441p9291K03732j32934H2819O2960J96430G1015J03664
17167A74679G1211L28740j90635n0717b0941I6782J33813J40703A6985K73314
17157B90299J51498r5835r1447a20746A54030m7643A9001J10639l8826K31249
17147C22063j54312K52693A44153e808A77725M8255C8085i1038E38957a7186B20932
17135A63109J34944J40526k902A271M57864k03783J75383P8487q4110E6714J83874
17124B40588b3124D9214M73441A9672N29402K8848j15001k03452O4377A51285
17113A54277K47236J37855k35546B7827i3988F8363L24344L78466l15023K67136
$$ plain form
17103 723286 634171 546402 86307 -107556 408783 158263 435808 485491 629109 163369
17092 430451 178840 139691 719112 -8434 380560 276967 -18078 464739 225626 640740
17082 640740 292326 476429 420232 449319 60090 517208 513934 307498 100755 423658
17072 423658 500724 127307 234997 78398 340835 377275 540686 453221 221266 226525 489854
17061 489854 48634 188416 312894 292530 260573 487885 284202 497916 694368 580746
17051 580746 607284 288743 -19885 712007 264720 409306 207837 332333 547905 420138
17041 420138 -33586 415948 412976 337746 202564 417459 651315 450884 542734 515420 254745
17029 465762 340105 750679 279708 563700 558742 245295 883944 463675 597775 528455
$$ packed form
17103G23286q9115q7769H6307a07556D08783A58263K77545M9683J43618A63369
17092D30451A78840l9149N79421h434C80560j03593a8078D64739B25626M15114
17082F40740B92326J84103n6197K9087F0090M57118l274k06436A00755L22903
17072D23658P7066A27307J07690G8398K62437L6440J63411q7465B21266N259K63329
17061D89854D8634J39782J24478k0364l1957K27312k03683K13714J96452j13622
17051E80746K6538B88743a9885G12007B64720J44586k01469J24496K15572j27767
17041D20138c3586D15948k972p5230j35182K14895K33856k00431R1850k7314B54745
17029D65762j25657M10574B79708K83992m958B45295O38649m20269J34100o9320
$$ plain form
17019 528455 536282 662321 591807 250599 493013 404762 526769 430241 448923 543737 286842
17008 286842 629095 501456 173108 618491 256018 396406 286097 770581 1102155 825373
16998 825373 723012 529224 452491 256250 580994 520809 665794 754968 620967 543426
16988 543426 501126 624608 677875 966429 702538 702948 739488 933240 679680 672098 645316
16977 645316 741481 825473 672436 460251 602752 632748 629080 532400 627155 859592 586604
16966 586604 591231 455233 878266 966055 722793 979091 563162 686203 414283 620620
16956 620620 1033948 868540 592348 912313 948565 1103617 583844 794774 958664 294254
16945 561031 1141320 1040396 1117992 683990 1090487 1175733 911768 794003 1058520 1101984
$$ packed form
17019E28455P827J26039p0514B50599K42414q8251J22007r6528J8682R4814k56895
17008B86842L42253j27639A73108M45383B56018J40388j10309M84484L31574k76782
16998H25373j02361j93788p6733j96241L24744o0185J44985Q9174j34001p7541
16988E43426m2300J23482N3267K88554k63891M10L6540J93752k53560p582k6782
16977F45316R6165Q3992j53037k12185J42501K9996l668r6680R4755K32437k72988
16966E86604M627j35998M23033Q7789k43262K56298m15929J23041k71920K06337
16956F20620M13328j65408k76192L19965L6252J55052n19773K10930J63890B94254
16945E61031N80289j00924P7596m34002M06497Q5246k63965j17765K64517M3464
$$ plain form
16935 1101984 922960 1012111 765347 1095974 991418 864374 944285 861210 1016035 1427148
16925 1427148 1093663 798253 767479 1174872 1128547 1272994 1199749 1228116 1172727 1079786
16915 1079786 1483781 935893 1077295 969865 1191262 1113573 1018555 1626321 1169256 1274677
16905 1274677 1448837 1078981 1297527 1193781 1320058 1358752 1058411 1469951 1480347 1404651
16895 1404651 1381641 1754408 1643218 1484079 1928140 1557120 1449239 1720722 1529128 1686798
16885 1686798 1823076 1952116 1670535 1192251 1501539 1768579 1917946 1645142 1709180 1778982
16875 1778982 2056544 1715371 1791945 1906846 1984975 1721777 2050213 2078096 2055772 2127003
16865 2127003 1984679 2173101 2276913 2164633 1936048 2179570 2242568 2133398 2428758 2362675
$$ packed form
16935A101984j79024Q9151k46764L30627j04556j27044P9911q3075J54825M11113
16925A427148l33485k95410l0774M07393m6325J44447p3245K8367n5389r2941
16915A079786M03995n47888J41402j07430K21397p7689r5018O07766m57065J05421
16905A274677J74160l69856K18546j03746J26277L8694l00341M11540J0396p5696
16895A404651k3010L72767j11190j59139M44061l71020j07881K71483j91594J57670
16885A686798J36278J29040k81581m78284L09288K67040J49367k72804O4038O9802
16875A778982K77562l41173P6574J14901P8129k63198L28436K7883k2324P1231
16865B127003j42324J88422J03812j12280k28585K43522O2998j09170K95360o6083
$$ plain form
16855 2362675 2214769 2387880 2506806 2575317 2481171 2258076 2328363 2872699 2932791 2633152
16845 2633152 2858205 2748801 2230427 3038334 3166100 3003388 3084039 3008678 3245685 2862527
16835 2862527 2805549 3271931 3729122 3402372 3456684 3528859 3999854 3754902 3478082 4033509
16825 4033509 3891163 4074635 4240157 4417186 4316478 4491569 4473933 4808001 4711309 4648836
16815 4648836 4860668 5164693 4893458 5091268 5332064 5545661 5491781 5238487 5525609 5941157
16805 5941157 5761966 5787962 6171315 6637147 6477860 6892742 6967485 7200470 7330077 7372861
16795 7372861 8015709 7814184 7990293 8364495 8523420 8608556 8993492 9103647 9761390 9679578
16785 9679578 9921237 10182805 10424477 10650436 11398316 11678220 11840890 12215316 12750386
$$ packed form
16855B362675j47906J73111J18926O8511r4146k23095P0287N44336O0092k99639
16845B633152K25053j09404n18374Q07907J27766j62712Q0651p5361K37007l83158
16835B862527n6978M66382M57191l26750N4312P2175M70995k44952k76820N55427
16825D033509j42346J83472J65522J77029j00708J75091j7636L34068r6692o2473
16815D648836K11832L04025k71235J97810K40796K13597n3880k53294K87122M15548
16805E941157j79191K5996L83353M65832j59287M14882P4743K32985J29607M2784
16795G372861O42848k01525J76109L74202J58925Q5136L84936J10155O57743q1812
16785I679578K41659K61568K41672K25959P47880K79904J62670L74426N35070
$$ plain form
16776 12750386 13033778 13498480 14132601 14539081 15140681 15414519 15809001 16835025 16986702
16767 16986702 17701120 18808025 19461401 20024638 21000267 22034439 23116068 23700625 24755831
16758 24755831 26095453 27216914 28381434 29757486 31422086 32545595 34567436 36267504
16750 36267504 38239305 40001816 42284092 44762154 47121356 49753269 52677909 56035427
16742 56035427 59362740 63152901 66950648 71373169 75705643 80918938 86152073 92079325
16734 92079325 98148954 104291636 111610352 118462670 126368538 133885597 141722602 149876211
16726 149876211 157345918 164940336 171716245 177539188 182375645 186014749 188082231 188401378
16718 188401378 187504923 184991142 181145795 176421196 170120945 163437997 155916221 147845804
$$ packed form
16776A2750386K83392M64702O34121M06480O01600K73838L94482J026024J51677
16767A6986702P14418J106905O53376N63237R75629J034172J081629N84557J055206
16758B4755831J339622J121461J164520J376052J664600J123509K021841J700068
16750C6267504J971801J762511K282276K478062K359202K631913K924640L357518
16742E6035427L327313L790161L797747M422521M332474N213295N233135N927252
16734I2079325O069629O142682P318716O852318P905868P517059P837005Q153609
16726A49876211P469707P594418O775909N822943M836457L639104K067482L19147
16718A88401378q96455k513781l845347m724599o300251o682948p521776q070417
$$ plain form
16710 147845804 140382154 132401071 123965734 116609884 109319372 102549524 95721127 89648376
16702 89648376 84122874 78564878 73640954 68769869 64749447 60764399 56828744 53700137
16694 53700137 50156584 47728511 44894089 42659440 39829130 38332270 36060753 34292662
16686 34292662 32817093 30766757 29104583 27759209 26784262 25630762 24328022 23296196
16678 23296196 22300733 21119377 20460983 19638493 18743916 17896303 17501366 16627965 16104659
16669 16104659 15485900 15193642 14049865 13540211 13229166 12925076 12496359 12057584 11600012
16660 11600012 11357170 10773927 10653346 10673524 9872427 9524661 9155022 9180673 8459041 8056767
16650 8056767 8420381 8259143 7851949 7604852 7326030 7260547 6829736 6963216 6610054 6163439
$$ packed form
16710A47845804p463650p981083q435337p355850p290512o769848o828397o072751
16702H9648376n525502n557996m923924m871085m020422l985048l935655l128607
16694E3700137l543553k428073k834422k234649k830310j496860k271517j768091
16686C4292662j475569k050336j662174j345374r74947j153500j302740j031826
16678B3296196r95463j181356o58394q22490q94577q47613l94937q73401n23306
16669A6104659o18759k92258j143777n09654l11045l04090m28717m38775m57572
16660A1600012k42842n83243j20581K0178q01097l47766l69639K5651p21632m02274
16650H056767L63614j61238m07194k47097k78822o5483m30811J33480l53162m46615
$$ plain form
16640 6163439 6285156 6213228 6089948 5613431 5698737 5558788 5289005 5024394 4895378 5317125
16630 5317125 5038020 5129918 4674709 4550422 4661802 4402966 4351264 4114131 4279963 3870313
16620 3870313 3915686 3818028 3915541 3731049 3731981 3535953 3649660 3489571 3575679 3056670 3140578
16609 3140578 3035659 3042804 3086194 3104784 2996857 2971491 2455502 2999942 2564963 2495955
16599 2495955 2538273 2433280 2453529 2430076 2586479 2467410 2386317 2532805 2250887 2261810
16589 2261810 2163673 2426436 2442253 2201060 2031718 2011526 2276293 2166490 2265652 2092255
16579 2092255 2162971 1968519 1769655 1863592 1656746 1630423 1837642 1529946 1679860 1581208
16569 1581208 1747561 1598658 1689230 1523920 1774922 1705809 1680629 1548444 1497493 1385359
$$ packed form
16640F163439J21717p1928j23280m76517Q5306j39949k69783k64611j29016M21747
16630E317125k79105R1898m55209j24287J11380k58836n1702k37133J65832m09650
16620C870313M5373r7658R7513j84492R32j96028J13707j60089Q6108n19009Q3908
16609C140578j04919P145M3390J8590j07927k5366n15989N44440m34979o9008
16599B495955M2318j04993K0249k3453J56403j19069q1093J46488k81918J0923
16589B261810r8137K62763J5817k41193j69342k0192K64767j09803R9162j73397
16579B092255P0716j94452j98864R3937k06846k6323K07219l07696J49914r8652
16569A581208J66353j48903R0572j65310K51002o9113k5180j32185n0951j12134
$$ plain form
16559 1385359 1411459 1056927 1286719 1337039 1476199 1508768 1434258 1515078 1272817 1091272
16549 1091272 1141542 1006578 1113992 910902 1156420 1085735 918881 1188777 1157172 1049868
16539 1049868 1170998 1034122 1138485 1040680 1014123 987067 988994 859439 1228351 1339453
16529 1339453 942269 1282580 793463 1114494 918650 1081119 971773 911997 1015558 922081
16519 922081 715079 1020154 911153 888465 986139 983709 710034 1195891 980873 929539
16509 929539 665726 890789 527976 684868 800087 648612 836269 613149 912752 717302
16499 717302 983714 639505 684773 788262 487358 947304 801741 816505 907766 837518
16489 837518 488182 778660 190905 656214 361615 756333 633409 491737 775774 583853
$$ packed form
16559A385359K6100l54532K29792N0320J39160L2569p4510Q0820k42261j81545
16549A091272N0270j34964J07414k03090K45518p0685j66854K69896l1605j07304
16539A049868J21130j36876J04363r7805k6557k7056J927j29555L68912J11102
16529A339453l97184L40311m89117L21031j95844J62469j09346n9776J03561r3477
16519I22081k07002L05075j09001k2688R7674k430k73675M85857k15018n1334
16509I29539k63813K25063l62813J56892J15219j51475J87657k23120K99603j95450
16499G17302K66412l44209M5268J03489l00904M59946j45563J4764R1261p0248
16489H37518l49336K90478A90905M65309k94599L94718j22924j41672K84037j91921
$$ plain form
16479 583853 399184 664157 434851 682557 637959 685047 538269 575534 711530 66853
16468 697693 482045 733166 364072 469257 470107 827375 282832 773659 202342 527654
16458 527654 342008 534239 432856 586148 776650 386251 358243 77301 364310 767466
16448 767466 654033 525178 456280 535827 543268 494462 424138 471366 242501 525820 324144
16437 324144 443582 734815 248119 246304 568261 427561 453043 428853 480327 241663
16427 241663 552525 545907 402076 154821 590757 216825 377720 163482 243141 303441
16417 303441 110952 189641 510911 460858 123920 271687 35316 155879 292080 466634
16407 466634 602682 448974 501849 92742 486384 205257 603544 254644 100470 196693
$$ packed form
16479E83853j84669K64973k29306K47706m4598M7088j46778L7265J35996F6853
16468F97693k15648K51121C64072J05185Q50L57268B82832M90827B02342L25312
16458E27654j85646J92231j01383J53292J90502C86251k8008G7301K87009M03156
16448G67466j13433j28855o8898P9547P441m8806p0324M7228k28865K83319k01676
16437C24144J19438K91233B48119j815L21957j40700K5482k4190N1474k38664
16427B41663L10862o618j43831A54821M35936B16825J60895A63482P9659O0300
16417C03441A10952P8689L21270n0053A23920J47767C5316J20563J36201J74554
16407D66634J36048j53708N2875I2742L93642B05257L98287B54644A00470R6223
$$ plain form
16397 196693 113002 581310 574987 266159 -36370 612162 592495 -22342 434280 245632 219613
16386 219613 -66438 33037 187040 377954 193758 -58891 67197 337521 198625 126154
16376 126154 241506 107146 357097 277387 237086 318458 251692 371162 -4634 199137 246702
16365 246702 176686 -46307 290134 422646 80317 100621 231538 495108 362670 280933
16355 280933 -17572 38567 253477 254590 205933 -69237 538535 95806 24772 142487 118199
16344 118199 419043 489090 236139 374571 63084 283819 306228 29205 -91537 193767
16333 324021 323825 460878 154983 215014 371550 185921 111391 238721 -100300 449311
16322 105141 42134 289717 49196 -157839 294487 275480 181469 71995 133074 -10460 -182480
$$ packed form
16397A96693q3691M68308o323B66159c6370F12162j9667b2342D34280j88648k6019
16386B19613f6438C3037J54003J90914j84196e8891F7197K70324j38896p2471
16376A26154J15352A07146K49951p9710m0301Q1372o6766J19470d634A99137M7565
16365B46702p0016d6307B90134J32512H0317K0304J30917K63570j32438q1737
16355B80933a7572C8567K14910J113m8657f9237E38535I5806B4772J17715k4288
16344A18199L00844P0047B36139J38432F3084K20735K2409B9205i1537A93767
16333C24021j96J37053A54983O0031J56536j85629p4530J27330a00300D49311
16322A05141D2134K47583D9196a57839B94487j9007r4011G1995O1079a0460j72020
$$ plain form
16311 -182480 -137230 195355 190439 -381310 246789 69709 40839 108309 -70979 236419 -60590
16299 141330 292720 391168 33003 99798 46655 400542 194142 -128906 241160 209213
16289 209213 -127731 395825 245948 67231 344118 -205342 166738 270995 172967 104617
16279 104617 306650 85547 -137053 -155460 -44681 392077 413433 54047 -106463 147429
16268 616987 236893 69207 180120 108154 114873 111371 286725 243410 249603 44744 209713
16257 209713 146703 100077 -85049 216782 412858 257955 -2431 -72039 6742 218284 278478
16246 278478 340305 -75677 334141 222294 375367 -132067 -72844 -60187 9576 72901 201236
16235 201236 227093 -95072 46665 226819 -275024 36580 301188 485219 328177 402552
$$ packed form
16311a82480M5250A95355m916c81310B46789F9709k8870O7470g0979B36419f0590
16299A41330J51390R8448C3003O6795D6655L53887A94142a28906B41160l1947
16289B09213a27731C95825j49877F7231K76887b05342A66738J04257r8028o8350
16279A04617K02033H5547a37053j8407d4681C92077K1356E4047a06463A47429
16268F16987B36893F9207J10913p1966O719l502J75354m3315O193D4744J64969
16257B09713o3010m6626h5049B16782J96076j54903b431o9608F742K11542O0194
16246B78478O1827g5677C34141j11847J53073a32067N9223J2657I576O3325J28335
16235B01236K5857i5072D6665J80154b75024C6580K64608J84031j57042P4375
$$ plain form
16225 402552 60878 337512 -270125 235381 191387 -37629 106324 53882 -135399 -48723
16214 152380 66543 106142 159420 -236717 12258 230920 -119407 -38761 43347 112809 355308
16203 355308 -40522 614598 166895 -18915 -57980 -21782 180248 216695 -224615 -176390 201490
16191 20428 95271 -116851 -427852 -343698 256041 -77724 -111684 5149 -82037 -78041 128865
16179 76021 -122491 154077 -258873 -157194 177125 193869 69762 -240091 -29697 14802
16168 241212 51289 -127991 -23867 148563 -73908 259501 -4655 246578 200088 251905 -49732
16156 277731 -80620 -9859 105118 -30552 24182 204325 -44180 -53213 24864 163113 -95618
16144 67039 -34286 -38291 74494 -46870 278331 -15485 270592 -179796 -189093 -299119 -27053
$$ packed form
16225D02552F0878K76634b70125B35381m3994c7629A06324n2442a35399d8723
16214A52380F6543L9599N3278b36717A2258K18662a19407c8761D3347O9462K42499
16203C55308d0522F14598A66895a8915l9065b1782A80248L6447b24615M8225B01490
16191B0428P4843a16851l11001Q4154B56041g7724l3960E149h2037L996A28865
16179G6021a22491A54077b58873J01679A77125J6744F9762b40091b9697A4802
16168B41212E1289a27991b3867A48563g3908B59501d655B46578m6490N1817d9732
16156B77731h0620i859A05118c0552B4182J80143d4180r033B4864J38249i5618
16144F7039c4286m005G4494d6870B78331a5485B70592a79796r297j10026b7053
$$ plain form
16132 155214 181720 -83358 125131 -33437 40850 43408 85501 214945 -133249 -274110 -199798
16121 -199798 244987 245079 -209666 63799 19206 -193204 137737 240803 -75069 -132008 259937
16109 23248 78636 -164006 11537 -275184 161783 172744 36971 -351405 -45049 4841 -4919
16097 441908 168205 80306 -23406 -126813 -98988 -163031 -124612 62994 -31711 -293718 294584
16085 611 -302421 -212732 -13474 -64499 14386 -54062 -287197 -256649 76129 -172467 30685
16073 -227485 69090 270649 -283611 261822 190944 -333005 -7846 -227784 -12661 184314
16062 -199288 -154192 225362 61780 -123631 -385772 127706 -355235 85401 -126191 27463
16051 64510 146856 -24330 7784 -147211 -256707 -5661 -35733 164579 -113159 10309 171015
$$ packed form
16132A55214K6506h3358A25131c3437D0850K558M2093J29444a33249j40861P4312
16121a99798B44987R2b09666F3799A9206a93204A37737J03066g5069n6939B59937
16109B3248N5388a64006A1537b75184A61783J0961C6971c51405d5049D841d919
16097D41908A68205H0306b3406j03407K7825o4043L8419F2994c1711k62007B94584
16085F11c02421Q9689a3474n1025A4386e4062k33135L0548G6129a72467C0685
16073b27485F9090K01559b83611B61822p0878c33005g846k19938a2661A84314
16062a99288M5096B25362F1780a23631k62141A27706c55235H5401a26191B7463
16051F4510Q2346b4330G784a47211j09496e661l0072A64579a13159A0309J60706
$$ plain form
16040 171015 129700 -2861 -19655 -8675 -322008 -242589 -189726 203608 -68052 -89386 -137409
16029 -137409 333122 41137 -395505 -318540 -135717 48473 -300105 128250 220212 153823
16019 153823 -96018 209227 234325 53776 -124558 124992 40782 260650 81566 140633 241347
16008 241347 55791 -206980 -281430 -301003 -332417 86178 1255 110651 -527179 -106657 -209250
15997 -209250 205377 -77299 -237480 34265 -241711 261418 115514 -266483 -55005 9545
15986 -75976 -80061 -232931 -153007 1945 342340 -6529 -157748 -32571 748 -53615 -64000 133830
15973 329835 -9372 -34890 18718 -370890 -418489 107330 -119222 -126974 -277515 78362 51549
15962 51549 12418 -139719 92315 -43068 8803 -311065 -154768 -109414 -85484 -11494 137739
$$ packed form
16040A71015m1315b861j6794h675l13333P9419N2863B03608f8052k1334m8023
16029a37409C33122D1137c95505P6965a35717D8473c00105A28250R1962o6389
16019A53823i6018B09227K5098E3776a24558A24992D0782K19868H1566N9067J00714
16008B41347E5791b06980p4450j9573l1414H6178A255J09396e27179a06657j02593
15997b09250B05377g7299j60181C4265b41711B61418A15514b66483e5005I545
15986g5976m085j52870P9924A945L40395f529j51219c2571G48e3615j0385A33830
15973C29835i372k5518A8718c70890m7599A07330a19222p752j50541G8362k6813
15962E1549A2418a39719I2315d3068H803c11065a54768M5354K3930a1494A37739
$$ plain form
15950 176693 248790 -130234 -180448 -616129 -178657 13541 191342 225563 -21656 -62780 -98981
15939 -98981 -85771 -207931 -131792 -147401 122083 -67943 -140088 -170256 283558 4821 184826
15928 184826 156761 113330 143965 -161341 -288154 356437 36335 25544 -243571 116437
15917 -243577 -227911 137527 163636 18447 -62831 -1036 128457 -58507 -222221 93786 106424
15906 106424 -76230 -80863 -225510 -28505 -18780 -41636 52408 103121 115358 -247 144708 33602
15893 -617733 100125 229649 5306 -112847 -92067 81383 -155126 243684 223140 -253405
15882 204675 -204535 37431 157758 615997 -22755 -83499 -453763 -193107 -267347 -35794
15871 -113030 83270 -156139 -68239 23534 72740 238002 -91874 2248 -195238 -244614 -84380
$$ packed form
15950A76693P2097a30234n0214m35681a78657A3541J77801L4221b1656m1124l6201
15939i8981J3210j22160P6139j5609A22083f7943p2145l0168B83558D821J80005
15928A84826k8065m3431L0635a61341j26813C56437C6335j0791b43571A16437
15917b43577J5666A37527K6109A8447f2831a036A28457e8507j63714I3786J2638
15906A06424g6230m633j44647b8505R725k2856E2408N0713J2237b47A44708C3602
15893f17733A00125J29524E306a12847K0780H1383a55126B43684k0544b53405
15882B04675b04535C7431J20327M58239b2755o0744l70264a93107p4240c5794
15871a13030H3270a56139f8239B3534M9206J65262i1874B248a95238m9376h4380
$$ plain form
15859 -72161 -127038 363633 -10002 182375 139003 -99053 97833 -319941 273914 9097 299291
15848 299291 -106765 -352202 -103295 -184839 -384096 -217177 248297 6927 38387 107661
15838 107661 416704 -106834 183758 -66425 178149 142150 167934 -67284 -9907 228865 119321
15827 119321 33441 -203577 541 -38016 110739 94955 84944 -204637 -168758 195082 -379597
15815 29319 -226745 180128 -304309 -316206 -136683 -63322 111063 12618 50404 251930
15805 251930 -195669 98078 -49721 -18027 -175595 156234 150994 -222442 -63306 6565 201911
15794 201911 118509 -119098 -223562 -371431 25317 -242033 -347397 181018 -76295 -142025
15784 -142025 -290902 212050 152764 -132278 124901 -390186 -29907 -257380 -190292 -160367
$$ packed form
15859g2161n4877C63633a0002A82375m3372i9053I7833c19941B73914I097K90194
15848B99291a06765k45437a03295q1544j99257J66919B48297F927L1460O9274
15838A07661L09043a06834A83758f6425A78149l5999K5784f7284i907B28865j09544
15827A19321C3441b03577E41c8016A10739j5784j0011b04637L5879A95082c79597
15815B9319b26745A80128c04309j1897a36683f3322A11063A2618L7786K01526
15805B51930a95669I8078d9721a8027j57568A56234n240b22442f3306F565J95346
15794B01911q3402a19098j04464j47869B5317b42033j05364A81018g6295o5730
15784a42025j48877B12050n9286a32278A24901c90186b9907k27473O7088K9925
$$ plain form
15774 -160367 131099 -15760 -22402 -307806 -79913 111222 -21465 172791 152953 7071 309133
15763 309133 35728 -37551 -169179 -165341 -8693 99801 165199 -104902 -189337 157819 133907
15752 133907 61695 -237672 -289322 49936 -41862 -267708 -305868 -43628 -207700 -313116 -29430
15740 -101742 10545 -169092 -20294 -223409 154996 -73235 357001 -149341 116231 -76340
15729 -114443 365986 45373 -5626 -199179 138527 70573 23240 -35556 7650 -101949 17855
15717 152521 102459 206219 -135464 109241 -344513 -11505 -834 -49952 -238570 -48050 -1781
15705 162822 231357 -257998 273030 -174419 -66710 -208598 60156 486204 -33412 -116327
15695 -116327 -144940 -123864 160677 -174842 -244547 342297 54328 186723 -57457 -39524 103020
$$ packed form
15774a60367A31099a5760o642k85404g9913A11222b1465A72791j9838G071L02062
15763C09133C5728c7551j31628L838h693I9801O5398a04902q4435A57819k3912
15752A33907F1695b37672n1650D9936d1862k25846l8160d3628j64072j05416b9430
15740a01742A0545a69092b0294k03115A54996g3235C57001a49341A16231g6340
15729a14443C65986D5373e626j93553A38527o7954B3240c5556G650a01949A7855
15717A52521n0062J03760a35464A09241c44513a1505h34m9118j88618d8050a781
15705A62822O8535b57998B73030a74419f6710j41888F0156M26048c3412q2915
15695a16327k8613K1076A60677a74842o9705C42297E4328J32395e7457J7933A03020
$$ plain form
15683 96601 123145 138027 157189 28040 132720 -125245 130448 -62833 417745 -24813 -217444
15672 -217444 -212003 182849 -3062 71597 198653 -274422 155055 -120826 21362 -92185 289435
15660 -213017 -25962 115541 -80164 -104316 -191926 68357 -82635 -64533 -104165 -58186 134297
15648 -38850 61016 -173020 62695 -25889 -203711 44716 -159937 -30963 81180 72683 65889
15637 65889 -158170 -382317 61702 -273409 123616 -52340 -267260 -249032 -390835 50495
15626 166149 -67446 88408 46406 -64447 51441 -124225 225953 17241 56481 -175947 -163843
15615 -163843 37472 -107973 105986 97072 -271515 -232343 -13975 266698 165220 250802 -117392
15603 36192 -276079 -152026 -110785 79994 -271039 -3080 -179429 -63538 -38782 -378251 -266831
$$ packed form
15683I6601K6544J4882J9162B8040J04680a25245A30448f2833D17745b4813j92631
15672b17444N441A82849c062G1597J27056b74422A55055a20826B1362i2185B89435
15660b13017b5962A15541h0164k4152q7610F8357h2635J8102l9632M5979A34297
15648c8850F1016a73020F2695b5889j77822D4716a59937c0963H1180q497o794
15637F5889a58170k24147F1702b73409A23616e2340k14920J8228j41803E0495
15626A66149f7446H8408m2002f4447E1441a24225B25953A7241L9240a75947J2104
15615a63843C7472a07973A05986q914b71515L9172a3975B66698j01478Q5582a17392
15603C6192b76079J24053M1241G9994b71039c080j76349f3538K4756l39469J11420
$$ plain form
15592 -266831 -192520 -74822 55108 71426 -69238 76614 36116 284241 97922 -163677 -4192
15580 -64846 91080 98276 165723 -180277 -2682 -31011 140841 193745 -33373 104400 -104850
15568 -230747 -199774 33943 -375028 -159578 -377404 17430 179173 238469 263688 327997 -112048
15556 -41858 -1312 199881 51918 242848 368427 -191578 -55144 -296985 168902 97456 -61030
15544 77470 -235338 160097 54760 43651 -379103 -101104 130325 57555 -6442 276501 119197
15532 -283365 -28737 -74007 199197 222242 -103393 255969 183814 -265062 183113 84681
15521 117554 114811 -183268 -314491 82139 84095 -106474 -113830 119768 -28287 -151881 -96337
15510 -96337 87167 210608 65276 295760 -100906 -290147 69309 -185360 -136495 76475 -280641
$$ packed form
15592b66831P4311g4822E5108J6318f9238G6614C6116K48125I7922a63677d192
15580f4846I1080P196O7447a80277b682k8329A40841N2904c3373A04400a04850
15568b30747L0973C3943c75028a59578k17826A7430J61743N9296K5219O4309a12048
15556d1858a312A99881E1918J90930J25579a91578e5144k41841A68902p1446f1030
15544G7470b35338A60097E4760j1109c79103a01104A30325E7555f442B76501A19197
15532b83365b8737m5270A99197K3045a03393B55969p2155b65062A83113H4681
15521A17554k743a83268j31223H2139J956a06474p356A19768b8287j23594N5544
15510i6337H7167J23441F5276K30484a00906j89241F9309a85360M8865G6475b80641
$$ plain form
15498 73796 -181416 131281 -26129 -417339 122068 58219 21865 386429 -141350 181 168156
15487 168156 -33268 -112080 -67041 -77574 175449 -49056 -126066 -107146 157422 -9462 198493
15475 -34742 -175728 183502 85369 94995 -163504 -175513 184831 31125 64622 -193012 29787
15463 6398 173106 75402 -112336 -262816 110826 329697 351656 165844 259236 169393 221074
15452 221074 89808 12159 155587 -234625 -223521 -23883 147700 1126 278469 136044 77340
15441 77340 -63734 121587 80912 -202918 212733 -136600 -48347 -304301 -187434 -86564
15430 -68795 -194386 163756 193823 -246233 -230551 253908 265796 13073 102104 254445 69188
15418 -159923 -42368 1318 -244050 -265617 -115341 -145317 -57133 -86578 -133616 143027 529916
$$ packed form
15498G3796a81416A31281b6129l91210A22068E8219B1865L64564a41350A81J67975
15487A68156c3268p8812M5039j0533A75449d9056p7010J8920A57422i462A98493
15475c4742j40986A83502H5369R626a63504j2009A84831C1125L3497a93012B9787
15463F398J66708G5402a12336j50480A10826K18871K1959A65844R3392q9843N1681
15452B21074H9808A2159J43428b34625J1104b3883A47700A126K77343A36044n8704
15441G7340f3734A21587m0675b02918B12733a36600d8347k55954J16867h6564
15430f8795j25591A63756L0067b46233J5682B53908J1888A3073Q9031J52341F9188
15418a59923d2368A318b44050k1567a15341k9976e7133k9445m7038A43027L86889
$$ plain form
15407 529916 281917 -49610 -43284 25749 -89791 -346247 -46098 145917 -12434 -138607 8598
15395 258361 191395 -151217 110317 244236 -2414 -94197 57023 -123897 -82364 -104544 -19769
15383 -12916 -531071 -259418 -13676 -220106 -98531 187477 19946 -10296 112995 50756 103422
15372 103422 -196957 -42011 -261388 -64682 44265 63396 -129403 32396 -96755 -82485 34554
15360 75430 -107637 -73690 -105965 -168033 -1404 39247 331256 60420 -6615 11547 -130619
15348 44905 -193365 -63160 87061 26845 97155 -66612 130884 28630 152739 49143 -101083
15336 -26658 118502 201603 -286025 60239 -129688 63877 -218093 -58885 286314 -101090
15325 -29495 380269 2230 -178897 -101074 288254 38095 121730 -327343 133629 -49788 197482
$$ packed form
15407E29916k47999d9610O326B5749h9791k56456d6098A45917a2434j26173H598
15395B58361o6966a51217A10317J33919b414r1783E7023a23897M1533k2180a9769
15383a2916n18155b59418a3676k06430i8531A87477A9946a0296A12995E0756N2666
15372A03422a96957d2011k19377f4682D4265J9131a29403C2396i6755J4270C4554
15360G5430a07637L3947l2275o2068a404C9247K92009F0420f615A1547a30619
15348D4905a93365f3160H7061B6845P0310f6612A30884B8630J24109D9143a01083
15336b6658A18502Q3101b86025F0239a29688F3877b18093e8885B86314a01090
15325b9495C80269B230a78897P7823B88254C8095Q3635c27343A33629d9788A97482
$$ plain form
15313 -216529 52348 78553 96193 -128542 -27867 -10019 8848 80486 43735 -50529 94551
15301 72752 -204113 -23826 -164364 286949 152542 -58400 -159849 -75292 38905 34082 348739
15290 348739 95029 -237810 210448 -174754 -29710 -137593 -73792 142710 -38106 169395
15279 112790 280065 -55411 -112760 39180 -61274 -114990 77544 282269 -58347 281953 118279
15267 151021 126650 -125520 -15938 -113178 -48145 23115 -129447 -24609 215619 50289 108165
15256 108165 16911 -91775 -119921 313670 188649 400559 1524468 739536 684739 1380943
15246 1380943 290657 102699 112799 77036 294090 269356 -208162 -146222 -51634 140940
15235 81558 -114091 -342478 -64099 -3151 138905 -39257 -1662 -257341 66753 117366 113045
$$ packed form
15313b16529E2348K6205J7640a28542b7867a0019H848P1638l6751e0529I4551
15301G2752b04113b3826j40538B86949j34407e8400j01449g5292C8905m823L14657
15290C48739I5029b37810B10448a74754b9710j07883O3801A42710c8106A69395
15279A12790J67275e5411n7349C9180f1274n3716G7544K04725e8347B81953A18279
15267A51021k4371a25520a5938r7240d8145B3115a29447b4609B15619E0289N7876
15256A08165A6911i1775k8146C13670j25021K11910J123909G39536n4797O96204
15246A380943B90657A02699J0100l5763K17054k4734b08162O1940e1634A40940
15235H1558a14091k28387f4099c151A38905c9257a662k55679F6753N0613m321
$$ plain form
15224 113045 58544 113392 185039 -83477 178650 605577 -176837 188618 198507 5143 194518
15213 194518 36735 -56905 -20933 276702 146511 248933 113074 52465 119185 10210 45870
15202 45870 21127 -205830 -1710 -107929 -1199 322421 285143 518771 110176 174726 -115508
15190 213445 -23611 120134 215728 176214 209230 100234 120632 376870 -121675 139958
15179 -131570 241118 -83969 -22567 468524 -509 -238652 30884 8744 117084 -42960 104279
15167 242708 -17490 -172335 -236003 8206 122051 12275 175436 -29311 168464 37346 195397
15156 195397 106097 306371 -233064 249304 -132870 -108535 42160 98683 255329 482089
15146 482089 79977 -33231 -213381 203634 198104 255345 65628 -169030 226419 59376 -13761
$$ packed form
15224A13045n4501N4848P1647h3477A78650M26927a76837A88618R889E143J89375
15213A94518C6735e6905b0933B76702j30191J02422A13074E2465O6720A0210L5660
15202D5870B1127b05830a710j06219a199C22421l7278K33628A10176O4550a15508
15190B13445b3611A20134R5594l9514L3016A00234K0398K56238a21675A39958
15179a31570B41118h3969b2567D68524e09k38143C0884H744J08340d2960A04279
15167B42708a7490j54845o3668H206J13845A2275J63161b9311A68464C7346J58051
15156A95397q9300K00274b33064B49304a32870K4335D2160N6523J56646K26760
15146D82089G9977c3231j80150B03634n530N7241F5628a69030B26419E9376a3761
$$ plain form
15134 90646 57986 -47376 209555 176814 15231 47310 83744 -8508 66160 59612 116779 49045
15121 454620 53095 74860 213309 371121 111414 129392 206719 -57624 121871 189201 204823
15110 204823 141064 65635 51328 -56055 113664 -45521 -76698 1621 -99343 274548 -35741
15098 167763 -213918 165543 71298 41523 281699 103695 169359 139113 591 172569 -106602
15086 164017 -70945 24725 -179440 59243 47514 -76267 232823 220417 86124 350775 -50357
15074 72236 -177325 12020 22191 88391 104226 -62112 -140341 261818 54980 59724 -149011
15062 247824 -18998 38758 298852 107211 362676 199920 237429 230918 103164 3365 48607
15051 48607 -108362 132059 138043 20247 -23209 -207060 79292 162953 -136470 -161139 -140272
$$ packed form
15134I0646l2660d7376B09555l2741A5231L2079L6434h508F6160o548N7167D9045
15121D54620E3095K1765J38449J57812A11414J7978P7327e7624A21871O7330J5622
15110B04823o3759F5635j4307e6055A13664d5521l1177A621i9343B74548c5741
15098A67763b13918A65543G1298k9775K40176A03695O5664l0246E91J71978a06602
15086A64017g0945B4725a79440E9243j1729g6267B32823j2406H6124K64651e0357
15074G2236a77325A2020J0171O6200J5835f2112p8229B61818E4980M744a49011
15062B47824a8998C8758K60094A07211K55465j62756L7509o511A03164C365M5242
15051D8607a08362A32059N984B0247b3209j83851G9292Q3661a36470k4669K0867
$$ plain form
15040 -140272 87849 90629 17613 -189832 176124 309390 261819 406658 482151 149998 378656
15029 378656 158772 -11299 389971 308406 112941 -124857 155042 283838 253946 407397
15019 407397 -110400 103792 160957 268843 379812 12777 -49791 -107476 91707 407466
15009 407466 121043 67399 168982 264609 175073 302518 127738 414645 7141 -122978
14998 8464 493471 41547 234488 491315 -81961 427242 111267 14218 -66827 167879 404875
14987 404875 -39204 198070 155496 -106577 97752 304033 -69835 186900 180996 -23408 74878
14975 232139 234260 81792 302782 57540 150746 424916 71939 207913 444622 321497 178066
14964 178066 334852 288838 211445 261191 366196 274568 178920 -21156 121320 -33856 105193
$$ packed form
15040a40272H7849K780A7613a89832A76124J33266m7571J44839P5493A49998K28658
15029C78656A58772a1299C89971q1565A12941a24857A55042J28796k9892J53451
15019D07397a10400A03792N7165J07886J10969A2777d9791n7685I1707L15759
15009D07466A21043n3644J01583R5627q9536J27445A27738K86907G141a22978
14998H464M85007D1547J92941K56827h1961D27242A11267A4218f6827A67879K36996
14987D04875c9204A98070m2574a06577I7752K06281f9835A86900n904b3408G4878
14975B32139K121H1792K20990E7540R3206K74170G1939J35974K36709j23125j43431
14964A78066J56786m6014p7393M9746J05005r1628r5648b1156A21320c3856A05193
$$ plain form
14952 450042 170481 -49513 79717 81381 91077 42373 9315 127963 322591 -109606 212748
14940 106861 138187 132182 -188176 262653 -71398 118588 542266 553696 289385 250527 184851
14929 184851 424905 386078 378117 544931 141419 -83708 421192 341679 246974 5124 411505
14918 411505 153700 162556 136285 236065 170728 359564 279862 475360 298792 211981 107570
14907 107570 200883 142414 122803 -318474 248492 317191 199647 132581 221744 348274 278533
14896 278533 221646 342238 349963 362671 140322 141895 172704 381017 450916 226241 305175
14885 305175 189555 58124 283269 448997 320025 314868 -16600 245980 68652 499774
14875 499774 541722 70642 312824 397249 377587 147364 251754 171962 233063 376675 335337
$$ packed form
14952D50042A70481d9513G9717J664R696D2373I315J18648J94628a09606B12748
14940A06861L1326o005a88176B62653g1398A18588M23678J1430k64311l8858o5676
14929A84851K40054l8827p961J66814A41419h3708D21192p9513r4705E124M06381
14918D11505A53700Q856k6271R9780o5337J88836p9702J95498j76568q6811j04411
14907A07570R3313n8469j9611c18474B48492O8699j17544o7066Q9163J26530o9741
14896B78533n6887J20592P725J2708A40322J573L0809K08313O9899k24675P8934
14885C05175j15620E8124K25145J65728j28972n157a6600B45980F8652M31122
14875D99774M1948G0642K42182Q4425j9662A47364J04390p9792O1101J43612m1338
$$ plain form
14864 335337 373398 66097 257780 519805 535634 275307 217978 193398 61352 474342 296294
14853 296294 704887 254238 328548 443421 486579 749337 379617 161949 513368 233307
14842 640380 89675 132062 335309 289255 350589 -48275 246303 87044 591775 70386 534204
14831 534204 372751 358701 475467 447130 214297 399334 384219 173933 403670 455851
14821 455851 487442 257847 656226 535864 476165 517241 343911 321810 595289 328471
14811 328471 411083 227430 490812 805765 402647 661065 207377 523204 124968 417182
14801 417182 -279896 450170 416712 446786 416396 509745 356160 394910 660183 613815 128858
14789 384032 101502 411000 513261 459398 456974 640383 314780 369484 332938 327548 512741
$$ packed form
14864C35337L8061F6097J91683K62025J5829k60327n7329k4580F1352M12990j78048
14853B96294M08593B54238P4310J14873M3158K62758l69720A61949L51419B33307
14842F40380H9675M2387K03247m6054O1334d8275B46303H7044N04731G0386M63818
14831E34204j61453j4050J16766k8337B14297J85037j5115A73933K29737N2181
14821D55851L1591k29595L98379j20362n9699M1076j73330k2101K73479k66818
14811C28471Q2612j83653K63382L14953D02647K58418B07377L15827A24968K92214
14801D17182b79896D50170l3458L0074l0390R3349j53585L8750K65273m6368A28858
14789C84032A01502L09498J02261n3863k424J83409C14780N4704l6546n390J85193
$$ plain form
14778 512741 473542 296645 581782 377759 436421 368103 593026 119145 565942 537968
14768 537968 648901 533494 527502 705644 521145 678417 641924 594621 727312 863043
14758 863043 677114 606072 405086 548629 540336 405384 219294 505401 578101 1000370
14748 1000370 430366 727040 813034 692405 285335 502907 786377 656650 505993 219901
14737 621981 786538 509945 498564 823793 195244 689020 563678 527682 745518 540316
14727 540316 404716 638076 416701 766346 642955 371746 525016 772244 570213 781736
14717 781736 663765 633710 970859 578074 638469 823165 447222 623257 495002 796653
14707 796653 770797 907449 773746 753773 774361 731303 472351 548137 540365 493313 853327
$$ packed form
14778E12741l9199j76897K85137k04023N8662o8318K24923A19145M46797k7974
14768E37968J10933j15407n992J78142j84499J57272l6493m7303J32691J35731
14758H63043j85929p1042k00986J43543q293j34952j86090K86107P2700M22269
14748A000370D30366K96674Q5994j20629B85335K17572K83470j29727j50657B19901
14737F21981J64557k76593j1381L25229A95244M93776j25342l5996K17836k05202
14727E40316j35600K33360k21375L49645j23391k71209J53270K47228k02031K11523
14717G81736j17971l0055L37149l92785O0395J84696l75943J76035j28255L01651
14707G96653k5856J36652j33703j9973K0588m3058k58952P5786p772m7052L60014
$$ plain form
14696 853327 731541 581965 792705 620119 640306 541375 938886 889332 693534 738105
14686 738105 707687 765847 643499 912224 772058 947010 1059160 1111572 1092501 629362
14676 629362 753638 944206 1105674 1228211 903695 726159 795083 679787 759206 592651
14666 592651 883855 1174761 820893 1158484 659926 972523 757814 687514 978273 762426
14656 762426 985043 981422 916211 739400 1159227 726333 1031404 821371 811398 923744
14646 923744 1004210 987357 981690 1037631 931646 807520 1235832 812214 1250740 911932
14636 911932 1319644 933696 927262 1036418 1236742 893324 1119222 1250988 1065513 1217023
14626 1217023 786283 1178389 1149221 1238833 1466420 988977 1287390 1073071 970208 1271244
$$ packed form
14696H53327j21786j49576K10740j72586K0187r8931L97511m9554j95798M4571
14686G38105l0418N8160j22348K68725j40166J74952J12150N2412j9071m63139
14676F29362J24276J90568J61468J22537l24516j77536O8924j15296P9419j66555
14666E92651K91204K90906l53868L37591m98558L12597k14709p0300K90759k15847
14656G62426K22617l621o5211j76811M19827m32894L05071k10033r973J12346
14646I23744Q0466j6853n667N5941j05985j24126M28312m23618M38526l38808
14636I11932M07712l85948o434J09156K00324l43418K25898J31766j85475J51510
14626A217023m30740L92106k9168Q9612K27587m77443K98413k14319j02863L01036
$$ plain form
14616 1271244 1121692 1266373 1698347 983790 1418402 1371537 946828 1096297 1007556 1177305
14606 1177305 1371316 1388585 1441653 1137691 1174166 1264730 1298902 1098781 1270727 1657491
14596 1657491 1391511 1437289 1472227 1422174 1497688 1475127 1496662 1362312 1516693 1660927
14586 1660927 1565398 1335286 1407665 1589029 1489944 1442997 1771092 1528525 1688661 1591266
14576 1591266 1734105 1712454 1830200 1742642 1679098 1937179 2011216 1976816 1991694 2132687
14566 2132687 2064811 2084978 2039714 2442028 2155438 2254170 1916555 2520022 2267603 2145044
14556 2145044 2518361 3022611 2688810 3719728 3855475 4447471 5130196 7403560 12179339
14547 12179339 22537727 40603561 30278964 13983087 7218148 4148105 2686535
$$ packed form
14616A271244j49552J44681M31974p14557M34612m6865m24709J49469q8741J69749
14606A177305J94011J7269N3068l03962L6475R0564L4172k00121J71946L86764
14596A657491k65980M5778L4938n0053P5514k2561K1535j34350J54381J44234
14586A660927r5529k30112P2379J81364r9085m6947L28095k42567J60136r7395
14576A591266J42839k1651J17746q7558o3544K58081P4037l4400J4878J40993
14566B132687o7876K0167m5264M02314k86590R8732l37615O03467k52419j22559
14556B145044L73317N04250l33801J030918J35747N91996O82725K273364M775779
14547A2179339J0358388J8065834j0324597A3983087o764939l070043j461570
$$ plain form
14540 2686535 2169049 2056153 1490129 1367394 1966576 1789993 2027262 1974706 1769445 2018407
14530 2018407 1853891 1876599 1773786 2045701 1779560 1715479 2329234 2007417 1708625 2294151
14520 2294151 1840911 2315963 2128181 2065079 2313578 1990954 2189173 2096587 2236919 2468071
14510 2468071 2432846 1956151 2121500 2687698 2473276 2672583 2501476 2651364 2511510 2959868
14500 2959868 2852508 2555987 2532732 2721015 2605123 3129803 2702681 3154900 2838880 3235558
14490 3235558 2780826 2696986 2917146 2974449 3040005 3475070 3097674 2906146 3024020 3455593
14480 3455593 3376859 3328373 3422952 3134327 3343587 3444775 3348498 3381071 3799490 3786289
14470 3786289 3671192 3538064 3254288 3752380 3501042 3800880 4044391 3862465 4089667
$$ packed form
14540B686535n17486j12896n66024j22735N99182j76583K37269n2556k05261K48962
14530B018407j64516K2708j02813K71915k66141o4081O13755l21817k98792N85526
14520B294151m53240M75052j87782o3102K48499l22624J98219r2586J40332K31152
14510B468071l5225m76695J65349N66198k14422J99307j71107J49888j39854M48358
14500B959868j07360k96521k3255J88283j15892N24680m27122M52219l16020L96678
14490C235558m54732q3840K20160N7303O5556M35065l77396j91528J17874M31573
14480C455593p8734m8486R4579k88625K09260J01188r6277L2573M18419j3201
14470C786289j15097j33128k83776M98092k51338K99838K43511j81926K27202
$$ plain form
14461 4089667 3541458 4205755 3673058 4077926 3847197 4009758 4514476 4638539 4233260
14452 4233260 4694770 4709420 4477894 4962289 4543612 4726374 4855949 4794223 4923890 5305173
14442 5305173 5165222 5141539 5164565 5128780 5160738 5775786 5274236 5811338 5572703 5663762
14432 5663762 5707941 5922942 5741261 5913492 6132599 6243851 6383061 6086639 6254384 6520227
14422 6520227 6526565 6772336 6414362 6534028 6853564 6846184 7348006 7095876 7322426 7252356
14412 7252356 8052790 7720062 7649768 8202615 8237526 8118646 8098105 8438815 8598825 8251848
14402 8251848 8865026 8694977 8755654 9238395 9228749 9330043 9744492 9629720 9692592 9942658
14392 9942658 10322873 10324206 10702672 10856734 10627413 11239403 11517802 11584426 11509688 12135964
$$ packed form
14461D089667n48209O64297n32697M04868k30729J62561N04718J24063m05279
14452D233260M61510J4650k31526M84395m18677J82762J29575o1726J29667L81283
14442E305173j39951k3683K3026l5785L1958O15048n01550N37102k38635R1059
14432E663762M4179K15001j81681J72231K19107J11252J39210k96422J67745K65843
14422F520227O338K45771l57974J19666L19536p380N01822k52130K26550p0070
14412G252356Q00434l32728p0294N52847L4911j18880k0541L40710J60010l46977
14402H251848O13178j70049O0677M82741r646J01294M14449j14772O2872K50066
14392I942658L80215J333L78466J54062k29321O11990K78399O6624p4738O26276
$$ plain form
14382 12135964 11989829 12644282 12725057 12508250 13246685 13183733 13500710 13968825 14411520 14796550
14372 14796550 14684311 14946265 15311157 15844297 15687534 16435131 16739745 17041942 17634789
14363 17634789 17714654 18412383 18784976 18896765 19119705 20042335 20448989 20696675 21437195
14354 21437195 22005726 22663005 22843047 23505986 23877651 24795762 25148956 25623909 26367063
14345 26367063 27403941 27640614 28758225 29151196 29982384 30791841 31806489 32698995 33624354
14336 33624354 34732820 35427832 36557279 37876503 38799056 40078136 41530773 42579084
14328 42579084 44064385 45366474 46599049 48489328 50255795 51530316 53489328 55568434
14320 55568434 57644497 59831277 61959337 64333821 66931527 69468972 72323122 75232813
$$ packed form
14382A2135964j46135O54453Q0775k16807P38435o2952L16977M68115M42695L85030
14372A4796550j12239K61954L64892N33140j56763P47597L04614L02197N92847
14363A7634789P9865O97729L72593J11789K22940R22630M06654K47686P40520
14354B1437195N68531O57279J80042O62939L71665R18111L53194M74953P43154
14345B6367063J036878K36673J117611L92971Q31188Q09457J014648Q92506R25359
14336C3624354J108466O95012J129447J319224R22553J279080J452637J048311
14328D2579084J485301J302089J232575J890279J766467J274521J959012K079106
14320E5568434K076063K186780K128060K374484K597706K537445K854150K909691
$$ plain form
14312 75232813 78100532 81169602 84754881 88755853 92413795 96511466 100673759 105288972
14304 105288972 110419845 115349813 120781198 127060599 132796717 139809648 146589639 154242563
14296 154242563 162089035 170524462 179186560 188986018 199003254 209764920 220757986
14289 220757986 232607953 244885189 258114926 271749925 285145766 299737953 314020209
14282 314020209 329001138 343825202 358284333 372773318 386132968 398627676 409911841
14275 409911841 419836925 428101092 433078898 434184783 432133091 431519067 427562463 421497942
14267 421497942 415434032 407820828 398371311 388141273 375930788 361644901 346538909
14260 346538909 330887988 315329285 300309672 285740885 271513335 257704881 244614996
$$ packed form
14312G5232813K867719L069070L585279M000972L657942M097671M162293M615213
14304A05288972N130873M929968N431385O279401N736118P012931O779991P652924
14296A54242563P846472Q435427Q662098R799458J0017236J0761666J0993066
14289B20757986J1849967J2277236J3229737J3634999J3395841J4592187J4282256
14282C14020209J4980929J4824064J4459131J4488985J3359650J2494708J1284165
14275D09911841R925084Q264167M977806J105885k051692o14024l956604o064521
14267D21497942o063910p613204r449517j0230038j2210485j4285887j5105992
14260C46538909j5650921j5558703j5019613j4568787j4227550j3808454j3089885
$$ plain form
14253 244614996 231566046 219712990 208553642 197407123 187215600 177730735 168519039
14246 168519039 160077645 152053716 145170721 137685091 131072888 125066956 119276026 113693695
14238 113693695 108815113 104054023 99298177 95439539 90773904 87103742 83886553 80359523
14230 80359523 77060510 73980296 71026656 68568874 65760068 63189663 60917210 58897428
14222 58897428 56503231 54633203 52880453 51274810 49196935 47721562 46206357 44626560
14214 44626560 43282743 42106932 40964050 39375055 38158442 37048377 36226753 35141203
14206 35141203 34457884 33146066 32200571 31130608 30588340 29731394 29343530 28158006 27810079
14197 27810079 26863794 26137635 25297888 24682856 24386441 23692268 22801173 22502304 21697990
$$ packed form
14253B44614996j3048950j1853056j1159348j1146519j0191523r484865r211696
14246A68519039q441394q023929o882995p485630o612203o005932n790930n582331
14238A13693695m878582m761090m755846l858638m665635l670162l217189l527030
14230H0359523l299013l080214k953640k457782k808806k570405k272453k019782
14222E8897428k394197j870028j752750j605643k077875j475373j515205j579797
14214D4626560j343817j175811j142882j588995j216613j110065q21624j085550
14206C5141203o83319j311818r45495j069963n42268q56946l87864j185524l47927
14197B7810079r46285p26159q39747o15032k96415o94173q91095k98869q04314
$$ plain form
14188 21697990 21347996 20911147 20238517 19989609 19841546 19332879 18601013 18520839 17858557
14179 17858557 17298055 17122470 16870828 16398274 16252970 15743105 15308784 15153301 14609248
14170 14609248 14623689 14052408 14159840 13565287 13778635 13159018 13151844 12978562 12732937 12250796
14160 12250796 12541440 11899475 11781789 11487948 10909074 11427459 10725561 10795794 10695466
14151 10695466 10563026 10403944 9811274 9941977 10011437 9674287 9546972 9610586 9276553 8887781
14141 8887781 8820916 8675897 8745393 8587270 8450708 8442612 8138923 7893991 7613226 8064318
14131 8064318 7861379 7440906 7742846 7338139 7084256 7097342 6929216 7164941 6839386 6718043
14121 6718043 6824222 6570758 6693844 6486401 6481475 6495054 6342108 5776874 5903718 5871157
$$ packed form
14188B1697990l49994m36849o72630k48908j48063n08667p31866q0174o62282
14179A7858557n60502j75585k51642m72554j45304n09865m34321j55483n44053
14170A4609248J4441n71281J07432n94553K13348o19617p174j73282k45625m82141
14160A2250796K90644o41965j17686k93841n78874N18385p01898P0233j00328
14151A0695466j32440j59082n92670J30703O9460l37150j27315O3614l34033l88772
14141H887781o6865j45019O9496j58123j36562q096l03689k44932k80765M51092
14131H064318k02939m20473L01940m04707k53883J3086j68126K35725l25555j21343
14121F718043J06179k53464J23086k07443m926J3579j52946n65234J26844l2561
$$ plain form
14111 5871157 6545387 5723464 5743862 5474520 5930931 5425603 5132134 5395413 5301305 5429812
14101 5429812 5129299 5032490 5115370 5173817 5194418 4773726 4927896 4908773 4662658 5050540
14091 5050540 4481326 4688722 4637399 4488725 4088920 4310557 4078672 3911726 4489583 4171018
14081 4171018 4359936 4083988 4325195 3997526 4108669 3887867 3812708 3983508 3875591 3846260
14071 3846260 3443472 4078754 3694347 3398117 3632499 3612917 3333266 3257667 3493845 3725854
14061 3725854 3503963 3312658 3419022 3518705 3528531 3608633 3312702 3099228 3247308 3227390
14051 3227390 3150913 3069255 3059004 2972071 2825246 2879931 2886815 2805642 2932445 2737717 2507072
14040 2507072 2615393 2967053 2608877 2735156 2883635 2473647 2638153 2766708 2431714
$$ packed form
14111E871157O74230q21923K0398k69342M56411n05328k93469K63279r4108J28507
14101E429812l00513r6809Q2880N8447K0601m20692J54170j9123k46115L87882
14091E050540n69214K07396n1323j48674l99805K21637k31885j66946N77857l18565
14081D171018J88918k75948K41207l27669J11143k20802p5159J70800j07917k9331
14071C846260m02788O35282l84407k96230K34382j9582k79651p5599K36178K32009
14061C725854k21891j91305J06364R9683R826Q0102k95931k13474J48080j9918
14051C227390p6477q1658j0251q6933j46825N4685O884q1173J26803j94728k30645
14040B507072J08321L51660l58176J26279J48479m09988J64506J28555l34994
$$ plain form
14031 2431714 2555089 2823746 2493349 2593957 2520586 2184665 2308574 2442082 2287502 2407746
14021 2407746 2282977 2648503 2335210 1949052 2479187 2339346 2220418 2008977 2347539
14012 2347539 2099852 2014636 1733517 2174011 1853651 2095519 2076039 1938294 2250392 1988323
14002 1988323 2122366 1804115 1770616 1813866 1893157 2000026 1926013 2060476 1777729 2155796
13992 2155796 2191507 2001364 2548996 3644091 7189061 15748437 34435785 33709170 18174551
13983 18174551 10889746 6940100 5266009 4535185 3568894 3181557 2889332 2548913 2732439
13974 2732439 2466385 2279619 2125866 1919038 2287133 2202680 1774494 1984622 1936061 1929306
13964 1929306 2496701 1774102 1715491 1864924 1861604 1795060 1987273 1631619 1997895 1657798
$$ packed form
14031B431714J23375K68657l30397J00608p3371l35921J23909J33508j54580J20244
14021B407746j24769L65526l13293l86158N30135j39841j18928k11441L38562
14012B347539k47687q5216k81119M40494l20360K41868j9480j37745L12098k62069
14002A988323J34043l18251l3499M3250P9291J06869p4013J34463k82747L78067
13992B155796L5711j90143N47632J095095L544970Q559376J8687348p26615j5534619
13983A8174551p284805l949646j674091p30824r66291l87337k92225l40419J83526
13974B732439k66054j86766j53753k06828L68095q4453m28186K10128m8561o755
13964A929306N67395p22599n8611J49433l320o6544J92213l55654L66276l40097
$$ plain form
13954 1657798 1749840 2010858 1757846 1961655 1684932 1693467 1791130 1603406 1406938 1471805
13944 1471805 1091121 1353540 1680697 1464146 1414311 1615884 1209884 1451318 1414073 1624496
13934 1624496 1387540 1444476 1540195 933010 1471271 1137184 1376086 1196691 1399261 1121696
13924 1121696 809652 1142372 1174726 1060542 1584712 1257611 1269238 794294 1240750 1429449
13914 1429449 938117 1259517 1097493 1251199 1138719 964830 1338135 1020426 1120190 1202229
13904 1202229 1332315 1449067 1009210 1260476 1134480 1070274 1407499 943663 889267 979943
13894 979943 938936 1381731 1094908 1239192 1091747 1139255 1034029 1026808 1152798 1015239
13884 1015239 946171 1225560 965615 1116003 1190280 913097 916850 1147750 1003007 726304
$$ packed form
13954A657798R2042K61018k53012K03809k76723Q535R7663j87724j96468O4867
13944A471805l80684K62419L27157k16551m9835K01573m06000K41434l7245K10423
13934A624496k36956N6936R5719o07185N38261l34087K38902j79395K02570k77565
13924A121696l12044L32720L2354j14184N24170l27101J1627m74944M46456J88699
13914A429449m91332L21400j62024J53706j12480j73889L73305l17709R9764Q2039
13904A202229J30086J16752m39857K51266j25996o4206L37225m63836n4396R0676
13894I79943m1007M42795k86823J44284j47445M7508j05226p221J25990j37559
13884A015239o9068K79389k59945J50388P4277k77183L753K30900j44743k76703
$$ plain form
13874 726304 864778 873287 821939 1150031 989352 1014161 957292 808730 650826 1170033
13864 1170033 871903 825362 925243 1072227 1174275 820321 672519 878421 950934 831546
13854 831546 591423 639802 867059 832638 1156858 969479 846767 827733 807416 978588
13844 978588 1027227 1196094 802196 939840 958803 553885 1080406 870989 813097 929258
13834 929258 736910 811165 1018404 863612 966781 691957 925593 865688 684856 930714
13824 930714 1127262 827749 605802 788920 664720 943229 832592 737999 615864 543384
13814 543384 889987 715949 643272 470134 377008 596925 780902 711070 565413 915046
13804 915046 845295 803414 754279 571170 473621 756035 854907 450240 546401 552352 665676
$$ packed form
13874G26304J38474Q509n1348L28092j60679K4809n6869j48562j57904N19207
13864A170033k98130m6541R9881J46984J02048l53954j47802K05902P2513j19388
13854H31546k40123M8379K27257l4421L24220j87379j22712j9034k0317J71172
13844I78588M8639J68867l93898J37644J8963m04918N26521k09417n7892J16161
13834I29258j92348P4255K07239j54792J03169k74824K33636n9905j80832K45858
13824I30714J96548k99513k21947J83118j24200K78509j10637r4593j22135p2480
13814E43384L46603j74038p2677j73138r3126K19917J83977o9832j45657L49633
13804I15046o9751m1881m9135j83109r7549K82414R8872m04667R6161N951J13324
$$ plain form
13793 665676 656035 837823 1012857 414561 834539 916519 552951 557096 757681 894992
13783 894992 568026 843983 420258 738018 759304 388842 492127 772407 463841 660439
13773 660439 492851 585019 454120 698047 560357 843157 586016 474347 583784 647654
13763 647654 496624 536328 614913 527267 690088 963302 459815 361821 631288 755894
13753 755894 420249 585885 579332 386271 508088 382517 584442 456632 493569 548911
13743 548911 340810 532750 644395 641821 849797 633076 182841 595659 479583 495715
13733 495715 656619 315143 440357 289050 450070 487010 383579 841542 484913 802972
13723 802972 254174 508650 532962 477968 501353 573469 603509 325853 454691 318949
$$ packed form
13793F65676r641J81788J75034D14561M19978Q1980l63568M145K00585J37311
13783H94992l26966K75957D20258L17760K1286l70462J03285K80280l08566J96598
13773F60439j67588R2168j30899K43927j37690K82800k57141j11669J09437O3870
13763F47654j51030L9704P8585q7646J62821K73214D59815r7994K69467J24606
13753G55894l35645J65636o553j93061J21817j25571K01925j27810L6937N5342
13743E48911k08101J91940J11645k574K07976k16721A82841M12818j16076J6132
13733D95715J60904C15143J25214j51307J61020L6940j03431M57963l56629L18059
13723H02972B54174K54476K4312n4994K3385P2116L0040k77656J28838j35742
$$ plain form
13713 318949 902714 566053 286989 178696 619585 321124 546768 433064 514159 438200
13703 438200 424947 462401 196381 401614 675625 199486 294908 169398 386964 235546
13693 235546 623704 706561 417973 268797 488215 626954 494531 589162 243864 131478
13683 131478 216914 548432 369366 749668 562441 447758 609728 149071 332936 269470
13673 269470 400984 364944 214512 440485 42258 422007 316390 165604 522163 377302
13663 377302 535085 400503 240816 453669 371999 569922 375548 431981 392756 398585
13653 398585 550878 459530 284166 353179 261484 449875 425249 416145 400406 339249 -85286
13641 497275 137841 293865 552161 443656 378009 608249 332972 204969 511753 758329
$$ packed form
13713C18949N83765l36661k79064j08293M40889k98461K25644j13704Q1095p5959
13703D38200j3253L7454A96381K05233K74011A99486R5422j25510K17566j51418
13693B35546L88158Q2857k88588j49176K19418J38739j32423R4631B43864j12386
13683A31478Q5436L31518j79066L80302j87227j14683J61970A49071J83865o3466
13673B69470J31514l6040j50432K25973D2258L79749j05617j50786L56559j44861
13663C77302J57783j34582j59687K12853q1670J97923j94374N6433l9225N829
13653C98585J52293r1348j75364O9013r1695J88391k4626r104j5739o1157h5286
13641D97275A37841J56024K58296j08505o5647K30240k75277j28003L06784K46576
$$ plain form
13631 758329 102262 -116273 420743 57611 587365 248688 378519 146252 -19913 408389
13620 387691 174286 572829 273956 264298 310087 230453 80050 197403 406982 493527 405398
13609 405398 347524 136039 93546 -14307 207446 284419 135024 227764 -77676 269753 500656
13598 500656 47174 300656 356529 374176 146128 303061 469722 674024 -65087 180457
13587 556840 328551 240699 442176 191532 621981 361841 314884 7895 190826 413716
13577 413716 196105 276616 256455 145519 237894 -46696 142192 313906 374317 174764
13566 366176 244914 215098 145304 140670 376753 247049 314406 189029 394684 433153 526478
13555 526478 586039 392869 93206 330415 -197738 126719 237327 420149 211644 150869
$$ packed form
13631G58329A02262a16273D20743E7611N29754B48688J29831A46252a9913D08389
13620C87691A74286L98543B73956r658M5789p9634H0050J17353K09579Q6545q8129
13609D05398n7874A36039m2493a4307B07446P6973A35024R2740g7676B69753K30903
13598E00656D7174K53482N5873J7647A46128J56933J66661K04302f5087A80457
13587E56840k28289q7852K01477A91532M30449k60140m6957G895J82931K22890
13577D13716A96105Q0511k0161j10936R2375d6696A42192J71714O0411A74764
13566C66176j21262k9816o9794m634K36083j29704O7357j25377K05655L8469R3325
13555E26478N9561j93170I3206K37209a97738A26719J10608J82822k08505o0775
$$ plain form
13545 150869 -63255 189834 378467 40601 74374 216409 18860 177403 -56559 517637
13534 233127 220081 250175 145569 233629 -106977 403895 21127 476907 364082 323316
13524 323316 292420 61570 155643 53353 53793 271122 153576 10785 320300 241664 166941
13513 166941 289723 -88649 136855 328986 102166 115775 188508 251097 -18412 482940
13502 349827 368025 439428 273725 629729 253265 159437 547966 154120 180361 40758
13491 119192 278064 119779 229077 75340 269035 271399 254372 235955 28947 105587 18649
13479 171362 245331 105869 392782 239410 153802 110160 284665 155488 462 65286 14361
13467 409306 40265 364480 346283 654117 30726 97579 7729 193134 233183 536726 170261
$$ packed form
13545A50869f3255A89834J88633D0601L3773J42035A8860J58543e6559E17637
13534B33127j3046L0094j04606Q8060a06977D03895B1127M55780j12825m0766
13524C23316l0896F1570R4073E3353M40K17329j17546A0785L09515p8636p4723
13513A66941J22782h8649A36855J92131A02166J3609P2733O2589a8412D82940
13502C49827J8198P1403j65703L56004B53265r3828L88529A54120K6241D0758
13491A19192J58872A19779J09298G5340J93695K364j7027j8417B8947P6640A8649
13479A71362P3969A05869K86913j53372q5608m3642J74505j29177D62O4824A4361
13467D09306D0265L24215j8197L07834C0726O6853G729J85405M0049L03543A70261
$$ plain form
13455 191066 210130 323244 41588 -2461 -49574 301236 74154 453867 -11262 240278 353223
13444 353223 466342 81469 199882 -22229 153657 155495 383037 390648 230399 -14386 221508
13432 -80151 119293 213222 156773 -6674 171331 67578 -38344 -62551 125410 377614 -237235
13420 162755 -14829 256227 254672 57660 279173 85665 261737 235186 -17087 32066 -69082
13408 218159 136046 274587 188617 -146119 -10211 153523 -94915 382445 281446 446333
13398 446333 352809 33219 287942 424115 139958 141488 265435 306417 205886 380987
13388 380987 195561 166944 328025 281615 201901 122393 349802 -99825 239575 311459 417834
13377 417834 30446 286845 145947 146973 -14286 15723 253773 92024 257275 -31836 7016
$$ packed form
13455A91066J9064J13114D1588b461m7113C01236G4154L79713a1262B40278J12945
13444C53223J13119H1469J18413b2229A53657J838K27542P611j60249a4386B21508
13432h0151A19293R3929n6449f674A71331F7578c8344k4207A25410K52204b37235
13420A62755a4829B56227j555E7660K21513H5665J76072k6551a7087C2066f9082
13408B18159q2113J38541q5970a46119a0211A53523i4915C82445j00999J64887
13398D46333r3524C3219K54723J36173A39958J530J23947M0982j00531J75101
13388C80987j85426k8617J61081m6410p9714p9508K27409i9825B39575P1884J06375
13377D17834C0446K56399j40898J026a4286A5723K38050I2024J65251c1836G016
$$ plain form
13365 335419 339461 237335 180914 141186 203330 484830 55747 -16716 131862 -14478 412375
13353 177059 -248791 66183 -10033 22113 8884 190720 75231 457778 147423 252042 469057
13342 469057 216097 583609 80364 225951 177519 218738 -34864 -9202 278122 183616 263521
13331 263521 181114 79269 420632 96502 -73648 88904 364133 109057 244272 -140347
13320 290248 459117 157196 -111555 -14967 148500 555855 289700 219401 -30135 321956
13309 165183 -34575 -145349 37784 -208245 364712 45602 -14061 315797 17292 56217 79138
13298 79138 161512 184795 183020 56910 169521 193420 139933 -150406 150956 208866 -104390
13286 45505 27878 133669 424730 57721 263087 219776 31115 -151367 124546 -249322
$$ packed form
13365C35419M042j02126n6421l9728O2144K81500E5747a6716A31862a4478D12375
13353A77059b48791F6183a0033B2113H884J81836G5231L82547A47423J04619K17015
13342D69057B16097L67512H0364J45587m8432M1219c4864i202B78122r4506P9905
13331B63521q2407G9269L41363I6502g3648H8904K75229A09057J35215a40347
13320B90248J68869A57196a11555a4967A48500M07355k66155p0299c0135C21956
13309A65183c4575j10774C7784b08245C64712D5602a4061C15797A7292L8925K2921
13298G9138Q2374K3283j775E6910J12611K3899n3487a50406A50956N7910a04390
13286D5505j7627J05791K91061E7721K05366m3311C1115a51367A24546b49322
$$ plain form
13275 147353 20721 29997 -339411 195180 248998 73890 349085 407249 266121 -122211 -166935
13264 -166935 -164986 407210 314176 -137225 350140 43905 211287 211268 196335 200313 300260 59433
13251 128802 307615 -93659 228220 41169 297467 61952 117039 232250 -178367 218471
13240 67850 281866 118046 57855 201306 104970 190804 298617 190409 16949 20224 230428
13229 230428 -53794 378795 55406 56783 153615 373019 92609 241562 -986 198168 284158
13218 284158 65972 170293 -104769 -155651 -107969 187495 -209062 125823 -164343 -108822
13208 -108822 123464 52515 226966 162673 -54432 -202072 77407 -71894 6226 -58486 -78240
13197 -78240 -100432 112030 148849 274793 -52312 74796 -63456 69566 -166702 347870 42728
$$ packed form
13275A47353B0721R276c39411A95180N3818G3890K75195N8164j41128a22211m4724
13264a66935J949D07210r3034a37225C50140D3905J67382j9j4933L978R9947E9433
13251A28802J78813i3659B28220D1169K56298F1952N5087J15211a78367B18471
13240F7850K14016A18046E7855J43451r6336Q5834J07813j08208A6949L275K10204
13229B30428e3794C78795E5406J377R6832K19404I2609J48953i86A98168Q5990
13218B84158F5972J04321a04769n0882M7682A87495b09062A25823a64343N5521
13208a08822A23464E2515J74451o4293e4432j47640G7407g1894F226e8486j9754
13197g8240k2192A12030L6819J25944e2312G4796f3456F9566a66702C47870D2728
$$ plain form
13185 39375 345509 -212 78272 169238 173411 -279202 124936 205289 98147 117443 332347
13174 332347 15308 27527 456689 113583 10845 121912 204838 37972 -234878 -4563 -129837
13163 -129837 -262792 -55792 -352492 -389953 70084 10656 40533 -83598 160829 275628 -76650
13151 234543 223825 226112 -91647 199096 -18986 146935 293693 171911 118416 313203 195040
13140 195040 -182616 164979 -142067 53676 110996 16582 91369 5041 320462 35972 -115502
13128 -248582 -11716 7680 31495 19942 135743 124619 -35590 190186 -61730 64525 330264
13117 330264 344980 259656 -59892 58664 -169590 -59223 -44064 59399 448440 90034 285
13105 -17548 31147 -153020 50931 90596 12344 185055 199733 -129001 -284242 220283 177281
$$ packed form
13185C9375L06134b12G8272R0966M173b79202A24936Q0353I8147J9296K14904
13174C32347A5308J2219M29162A13583A0845J11067Q2926C7972b34878d563j25274
13163a29837j32955e5792k96700l7461G0084A0656K9877h3598A60829J14799g6650
13151B34543j0718K287i1647A99096a8986A46935J46758j21782n3495J94787j18163
13140A95040a82616A64979a42067E3676N7320A6582P4787E041L15421C5972a15502
13128b48582a1716G680K3815j1553J15801j1124c5590A90186f1730F4525K65739
13117C30264J4716q5324e9892E8664a69590e9223J5159E9399L89041I0034B85
13105a7548C1147a53020E0931L9665A2344J72711J4678a29001j55241B20283m3002
$$ plain form
13094 177281 103155 -5455 148243 -34761 29843 -20700 -202716 233291 217950 169285 179978
13083 179978 -67865 27527 -69125 45010 -49676 270318 158148 23442 103604 117035 276346
13072 276346 -33655 11324 -40167 -31318 925 -108609 499752 143782 256490 170408 -178835
13060 -93053 128604 -288089 228153 169543 81092 -269820 217910 -44304 158041 248710
13050 248710 61638 23424 81863 -50135 -68632 62059 94725 16581 64450 516293 -945 27072
13037 -27875 77655 280028 258882 169389 17856 198261 210174 -28627 -44496 -206614 116045
13025 146889 240562 102695 -147933 86086 -16043 37029 345168 -229096 270151 345753
13015 345753 -89818 31836 61905 -32018 177843 102255 124627 -257742 37584 302211 208031
$$ packed form
13094A77281p4126e455A48243c4761B9843b0700j82016B33291j5341m8665J0693
13083A79978f7865B7527f9125D5010d9676B70318j12170B3442Q0162J3431J59311
13072B76346c3655A1324d0167Q849I25a08609D99752A43782J12708q6082a78835
13060i3053A28604b88089B28153n8610H1092b69820B17910d4304A58041R0669
13050B48710F1638B3424N8439e0135j8497F2059L2666A6581M7869M51843i45B7072
13037b7875G7655K02373k1146q9493A7856J80405J1913b8627j5869j62118A16045
13025A46889R3673A02695a47933H6086a6043C7029L08139b29096B70151P5602
13015C45753h9818C1836L0069c2018A77843p5588K2372b57742C7584K64627r4180
$$ plain form
13004 208031 -61451 -275112 113165 99011 32208 70591 29633 117521 314775 -179198 183904
12992 -74440 149809 -465560 5753 -98955 94361 -44362 33840 38219 -13748 -134320 -22529
12980 -324535 178188 177330 55457 387716 173083 -161246 262939 -96418 -400809 105385
12969 102546 -182468 22272 330683 23110 -146600 -120358 61913 43251 66196 214123 37837
12957 -246465 -105323 -134016 -270370 -45470 94865 -181865 92443 -8753 -91160 137849 204268
12946 204268 -213031 251953 -17876 -48923 194962 171953 -237031 -60591 303037 135848
12935 150322 306997 -219945 -269070 210837 225940 20457 280617 -179537 -30024 5764 -36953
12923 -3503 281589 -77396 475186 -94179 127535 -63032 151870 84428 -249845 42906 71446
$$ packed form
13004B08031f1451k13661A13165j4154C2208L8383B9633Q7888J97254a79198A83904
12992g4440A49809d65560E753i8955I4361d4362C3840M379a3748j20572b2529
12980c24535A78188q58E5457L32259A73083a61246B62939i6418l04391A05385
12969A02546a82468B2272L08411B3110a46600K6242F1913j8662K2945J47927C7837
12957b46465a05323k8693j36354d5470I4865a81865I2443h753q2407A37849O6419
12946B04268b13031B51953a7876l1047A94962k3009b37031f0591C03037A35848
12935A50322J56675b19945m9125B10837J5103B0457K60160a79537c0024E764c6953
12923c503B81589g7396D75186i4179A27535f3032A51870o7442b49845D2906K8540
$$ plain form
12912 71446 -132070 244369 162888 293960 -49812 -62740 122736 -88493 30792 186878 -175072
12900 -228643 275221 4562 115093 238161 69297 112729 -30500 2006 158567 3059 150517
12889 150517 361058 -132047 -102559 165956 267170 152158 -58231 251264 -51968 -130442
12879 -130442 193126 -39860 -232184 -179674 -359446 175269 -32340 60654 -67528 -122520 -201271
12868 -201271 42910 217027 12590 -28648 -117865 -56558 -122084 129194 -310979 12825 -7374
12856 231604 7928 -74086 381109 -67582 277515 294144 52345 13500 106949 -194076 -146093
12845 -146093 22743 -9899 -283717 -14304 219160 -18675 68389 -106647 -57306 -47640 -205968
12834 -205968 -16198 -38265 -48107 -338214 -34100 170984 157114 7828 -63074 140479 -190695
$$ packed form
12912G1446a32070B44369q1481J31072d9812j2928A22736h8493C0792J56086a75072
12900b28643B75221D562J10531J23068F9297M3432c0500B006J56561C059J47458
12889A50517K10541a32047K9488A65956J01214j15012e8231B51264e1968p8474
12879a30442A93126c9860j92324N2510j79772A75269c2340F0654f7528n4992p8751
12868b01271D2910J74117A2590b8648q9217e6558o5526A29194c10979A2825g374
12856B31604G928g4086C81109f7582B77515J6629E2345A3500R3449a94076M7983
12845a46093B2743i899k73818a4304B19160a8675F8389a06647M9341R666j58328
12834b05968a6198k2067r842k90107c4100A70984j3870G828f3074A40479a90695
$$ plain form
12822 -28251 -190179 -92805 -22639 16315 -148961 -81297 -77751 -125523 10250 -17124 226264
12810 7720 -391489 -31823 -15120 -135228 78080 -183477 -227360 -73841 199884 118460 43888
12798 204781 -173679 -91989 -46880 164190 108107 123502 -128389 -42837 -148754 302277
12787 -220154 -43416 51328 240152 93940 -17221 53706 -300904 -84978 30813 36510 -218065
12775 -238358 196590 -48599 -257633 -315221 -62912 116315 -209687 -6900 -10482 2131 -179954
12763 -184700 -55873 373045 132375 141411 -211432 -25316 -279456 -183069 160099 164292 18112
12751 -50076 95040 107999 93754 54411 -98554 -193009 -15912 -181141 -154448 -8107 74775 -270850
12738 204873 33882 24116 -239764 307016 204828 131294 -157823 -82530 -131551 -71014 -10676
$$ packed form
12822b8251j61928i2805b2639A6315a48961O7664L546m7772A0250a7124B26264
12810G720c91489c1823a5120j20108G8080a83477m3883g3841A99884q1424D3888
12798B04781a73679Q1690M5109A64190n6083J5395a28389d2837j05917C02277
12787b20154d3416E1328J88824I3940a7221E3706c00904h4978C0813N697b18065
12775b38358A96590d8599k09034n7588f2912A16315b09687f900l582B131a79954
12763a84700e5873C73045A32375R036b11432b5316k54140R6387A60099M193A8112
12751e0076I5040J2959j4245l9343i8554r4455a5912j65229K6693h107G4775b70850
12738B04873C3882r766b39764C07016j02188p3534a57823P5293m9021O0537a0676
$$ plain form
12726 -75257 -347462 56782 -104620 -46323 27632 26267 26295 -176404 371819 57723 -85228 -184769
12714 -184769 -102995 -42890 -35970 150380 -56347 84323 386674 196358 269926 295266 294856
12703 294856 -49466 -20242 -43655 103907 20317 254306 124546 251520 -145897 136718
12692 294064 379921 210941 59366 -212379 18176 256751 -158764 -53151 82539 -35751 118160
12680 -305043 86316 213481 15537 -35256 153722 6175 406493 376740 184647 -15564 405696
12668 -174716 10210 203651 322384 -16654 406941 -143793 73933 -79803 297725 72220
12657 89091 177834 26451 63319 267507 157867 87765 -347622 -33171 -115224 145877 388968
12646 388968 105552 97647 461779 208818 279204 195841 219693 67186 -96596 -74222 -128601
$$ packed form
12726g5257k72205E6782a04620d6323B7632j365K8a76404C71819E7723h5228r9541
12714a84769Q1774d2890O920A50380e6347H4323L02351j90316P3568K5340m10
12703B94856d9466b0242k3413A03907B0317K33989A24546J26974a45897A36718
12692B94064Q5857j68980E9366b12379A8176K38575a58764e3151H2539c5751A18160
12680c05043H6316J27165A5537c5256A53722F175M00318k9753A84647a5564D05696
12668a74716A0210J93441J18733a6654D06941a43793G3933g9803B97725G2220
12657H9091Q8743B6451L6868K04188j09640p0102c47622c3171q2053A45877K43091
12646C88968A05552p905L64132B08818P0386q3363K3852F7186i6596K2374n4379
$$ plain form
12635 -128601 89177 72489 31243 86103 -22866 98285 266600 23360 499245 196715 151685
12624 151685 413062 479674 263291 183035 -106142 -71426 -172344 182004 -45536 153242
12613 66464 -268138 10148 16202 31171 -151974 -1324 215400 -208660 76887 -208362 108327
12601 123871 -19972 223743 304843 -21362 95712 41699 143049 -215633 -164819 261496 27589
12589 -258686 172232 -93726 154551 167473 286255 -377481 -232331 -84038 -61045 189680
12578 164363 131593 -93557 -163532 170844 -53575 -32588 8297 254780 40028 19757 -36644
12566 -298527 -11830 308091 236241 -252017 171545 -240184 107162 -260216 326633 -92578
12555 127449 184663 107554 275552 -145866 82563 -179640 -90009 46242 -185074 -81437 98477
$$ packed form
12635a28601H9177j6688C1243N4860b2866I8285J68315B3360M75885A96715m5030
12624A51685K61377O6612k16383q0256a06142L4716j00918A82004d5536A53242
12613F6464b68138A0148O054J4969a51974a324B15400b08660G6887b08362A08327
12601A23871a9972B23743Q1100b1362I5712D1699J01350b15633N0814B61496B7589
12589b58686A72232i3726A54551J2922J18782c77481J45150h4038K2993A89680
12578A64363l2770i3557o9975A70844e3575K0987H297K46483D0028A9757c6644
12566b98527a1830C08091p1850b52017A71545b40184A07162b60216C26633i2578
12555A27449N7214p7109J67998a45866H2563a79640Q9631D6242a85074h1437I8477
$$ plain form
12543 8791 -268053 -114043 -72943 72114 219774 -134527 -20748 -82506 372195 249367 108595
12531 -55688 115811 -160194 -256501 152813 -102417 87626 153490 399414 230386 -104160
12520 33696 166513 -65082 199598 -209637 -92986 -225380 -356917 -300650 324483 -42291
12509 112741 -62959 -56247 -25803 96347 254378 -121221 187385 -43684 5604 -317515 199975
12497 54260 -82881 35073 250364 42592 74456 -126154 -105321 -126639 122142 -269516 -320054
12486 -320054 -5874 159875 -340 128663 131948 203127 12227 -96610 -137367 81656 31780 45093
12474 45093 12141 -294252 61683 -47123 103489 172949 -124410 -79625 -37439 121821 74337
12463 74337 -170495 56377 208910 132699 -223741 30636 130723 -20544 -130116 -105136 -77667
$$ packed form
12543H791b68053a14043M1100G2114J47660a34527b0748o1758C72195j22828A08595
12531e5688A15811a60194r6307A52813a02417H7626O5864K45924j69028a04160
12520C3696J32817f5082A99598b09637i2986j32394j31537N6267C24483d2291
12509A12741f2959O712b5803I6347J58031a21221A87385d3684E604c17515A99975
12497E4260h2881C5073K15291D2592L1864a26154K0833k1318A22142b69516n0538
12486c20054e874A59875c40A28663L285P1179A2227i6610m0757H1656C1780J3313
12474D5093A2141b94252F1683d7123A03489O9460a24410M4785c7439A21821m7484
12463G4337a70495E6377J52533p6211b23741C0636J00087b0544j09572K4980K7469
$$ plain form
12452 -77667 -151702 233916 324311 10365 9221 58718 -377204 -77030 -25638 6810 -18448 -202314
12440 -202314 68416 24199 -96000 12746 39555 -8851 -147367 -170394 36893 91016 192750
12429 192750 -98217 -165938 -105943 81245 54790 14674 -190813 -111367 -97618 15969 -261405
12417 -412280 -194177 167840 -277482 -201057 -113990 -63493 -62248 129970 84492 132357 -285310
12405 -170315 -44365 91216 -129653 100554 -132388 -205537 181719 22811 -130937 49690
12394 19297 -216335 74899 137168 -112792 -18134 137626 16452 -116938 -62014 304476 170649
12383 170649 239002 49953 146561 98548 -2779 171020 151257 -28494 -12597 -282703 -80923
12371 45082 -50320 -111183 39174 -142800 171918 -163953 -70524 29430 229624 -256541 32776
$$ packed form
12452g7667p4035B33916R0395A0365j144M9497c77204g7030b5638F810a8448j83866
12440b02314F8416B4199i6000A2746K6809h851j38516k3027C6893N4123J01734
12429A92750i8217o7721N9995H1245k6455A4674a90813P9446J3749A5969b61405
12417d12280a94177A67840b77482P6425Q7067N0497J245A29970m5478M7865b85310
12405a70315d4365I1216a29653A00554a32388p3149A81719B2811a30937D9690
12394A9297b16335G4899O2269a12792a8134A37626A6452a16938N4924C04476j33827
12383A70649O8353D9953R6608m8013b779A71020j9763b8494a2597k70106h0923
12371D5082e0320o0863C9174a42800A71918a63953g0524B9430K00194b56541C2776
$$ plain form
12359 102979 131151 276312 228477 18636 198459 -106716 -27718 197336 18368 203041
12349 203041 79559 -230058 98878 137874 72661 -8099 -5845 -116752 201507 -147262 70330
12337 -61258 57334 -103203 240315 -48474 -97185 31059 -156470 -11827 -322262 183351 172292
12326 172292 239073 90023 85186 138194 168022 -31974 115266 65147 95586 -12287 158782
12314 14170 -48788 -49640 -56616 80196 697 -40346 43138 36759 2764 -152933 -30949 37388 -74780
12300 39756 -31752 50710 138663 -248837 -218545 -32830 73212 386886 -27959 -148050 14747
12288 -111399 51339 -29283 147820 114663 223675 -58682 143172 176387 215329 244580 401993
12277 401993 32512 370849 169158 223110 191094 236177 -28802 23509 -20838 43864 49706
$$ packed form
12359A02979K8172J45161m7835A8636J79823a06716b7718A97336A8368J84673
12349B03041G9559b30058I8878L8996o5213h099K254j10907B01507a47262G0330
12337f1258E7334a03203B40315d8474m8711C1059a56470a1827l10435A83351j1059
12326A72292O6781I0023m837N3008K9828c1974A15266n0119L0439a2287A58782
12314A4170d8788q52o976H0196F97d0346D3138o379B764a52933c0949C7388g4780
12300C9756c1752E0710Q7953b48837L0292c2830G3212L13674b7959j20091A4747
12288a11399E1339b9283A47820l3157J09012e8682A43172L3215L8942K9251J57413
12277D01993C2512L38337A69158N3952l2016M5083b8802B3509b0838D3864N842
$$ plain form
12266 49706 42369 -275294 74211 -182490 355452 229271 -8019 -64591 -178421 -46674 272299
12254 -151615 69065 264658 346819 285332 339165 211062 124152 1417 -794 45562 -30630 -56404
12242 -56404 -103878 161453 -29510 -18661 277460 -174791 95312 944 -168691 308303 -74624
12230 -55189 106267 427361 -135235 142685 399865 406197 221343 156697 204354 -2982 395609
12218 449297 82256 352078 173878 -185203 260914 104757 782 405838 217552 216269 -120477
12206 -83337 229706 233031 87372 312114 -47501 649100 73428 154604 109028 54656 227886
12195 227886 -152942 196813 387137 36861 -103987 99959 -118322 -92537 168141 1970
12184 -253431 75050 -44900 130078 268533 -164825 164227 328688 192248 306612 343905
$$ packed form
12266D9706p337b75294G4211a82490C55452j26181h019n6572j13830d6674B72299
12254a51615F9065J95593Q2161o1487N3833j28103q6910A417g94D5562c0630k5774
12242e6404m7474A61453b9510J0849B77460a74791I5312I44a68691C08303g4624
12230e5189A06267L21094a35235A42685K57180O332j84854o4646M7657b982C95609
12218D49297H2256K69822A73878a85203B60914A04757G82M05056j88286j283a20477
12206h3337B29706L325H7372K24742d7501F49100G3428Q1176m5576n4372J73230
12195B27886a52942A96813J90324C6861a03987I9959a18322K5785A68141A970
12184b53431G5050d4900A30078J38455a64825A64227J64461j36440J14364L7293
$$ plain form
12174 343905 190716 103035 15635 -59976 18054 263263 82241 433339 -25225 252546 -293357
12162 356055 -292487 67070 -283343 7866 75343 -286759 -42765 -48626 -21790 -5344 -142723
12151 -142723 23826 108815 182430 -39526 -135583 71568 -94858 -62069 51364 85001 -175637
12139 32829 -87905 336846 -2340 -84903 59327 68290 146793 -49297 48430 -173635 243681
12127 48840 -62325 128098 -60663 -12083 198229 36145 218718 130317 -5108 -247083 122594
12115 -59230 -140665 -14850 -273221 314000 -42763 382008 -43940 -25443 -89732 -57362 -169236
12104 -169236 49439 18382 99342 79498 39540 -299324 31738 8958 78174 -80107 -362533
12093 -362533 45807 70258 -168022 -153725 -188172 137020 -138713 77159 189061 44865 147103
$$ packed form
12174C43905j53189q7681A5635e9976A8054K45209H2241L51098b5225B52546b93357
12162C56055b92487F7070b83343G866O7477b86759d2765n861b1790e344j37379
12151a42723B3826Q4989P3615c9526r6057G1568i4858L2789E1364L3637a75637
12139C2829h7905C36846b340q2563E9327Q963P8503d9297D8430a73635B43681
12127D8840f2325A28098f0663a2083A98229C6145J82573q8401e108k41975A22594
12115e9230q1435a4850k58371C14000d2763C82008d3940J8497o4289L2370j11874
12104a69236D9439A8382Q0960j9844C9540b99324C1738H958O9216h0107k82426
12093c62533D5807K4451a68022J4297l4447A37020a38713G7159J11902D4865J02238
$$ plain form
12082 147103 51958 1873 -15987 8060 -90918 -248416 195972 226245 75523 62971 251524
12071 251524 1341787 1344583 386785 -104747 -319320 566142 -160676 108185 -904 -96374
12061 -96374 -35544 68525 -43409 -53863 -53843 211666 78032 99851 -123124 87748 -140421 169
12048 -135669 -127006 107252 -183111 359031 49504 -311602 -277216 108349 309308 -183023
12037 -245714 122730 -252653 27278 66857 160208 -17080 147795 235475 -77239 -232026 6788
12025 286654 -131670 -137526 -209167 -304652 -676 47924 -118678 -228971 168611 -10379 -123332
12014 -123332 202152 -101513 6079 -221268 136707 27670 -25823 -24579 -482943 62988 -50757
12002 -49284 -165008 -437712 -37122 -273766 -4356 -241987 -94022 -286015 -374564 -67080 -56619
$$ packed form
12082A47103E1958A873a5987H060i0918j57498A95972L0273G5523j2552J88553
12071B51524J090263K796C86785a04747k14573E66142a60676A08185i04r5470
12061i6374c5544F8525d3409j0454K0B11666G8032K1819a23124H7748a40421A69
12048a35669Q663A07252a83111C59031D9504c11602L4386A08349K00959a83023
12037b45714A22730b52653B7278L9579R3351a7080A47795Q7680g7239j54787F788
12025B86654a31670n856p1641r5485f76D7924a18678j10293A68611a0379j12953
12014a23332B02152a01513F079b21268A36707B7670b5823J244m58364F2988e0757
12002d9284j15724k72704c7122k36644d356k37631i4022j91993q8549f7080J0461
$$ plain form
11991 -56619 -179477 139486 -60242 -215299 -53901 -13766 -101920 283916 96434 -53355 193391
11979 205462 -38596 -111327 195176 90694 255000 313020 307741 142726 82746 -51915 107068
11967 -304228 96410 -38360 -119648 84668 -93737 -104174 114629 -50084 -176061 -157552 -455381
11956 -455381 -44865 -343766 -360702 -28469 -296006 48793 17716 91174 18910 68017 -237251
11944 360637 142780 188270 -118278 91315 -200184 -268395 378464 199682 -28777 41050
11933 250572 194002 -44671 -252214 71635 -85183 185566 10336 -364400 195236 128218 -174144
11921 -188096 -107617 24268 -257738 24305 -149885 15226 176385 -166972 89942 -49326 182971
11909 -162476 -54225 260487 -171491 58209 -170148 40946 -200855 102659 142665 -122678
$$ packed form
11991e6619j22858A39486f0242j55057e3901a3766q8154B83916I6434e3355A93391
11979B05462c8596p2731A95176I0694J64306N8020n279A42726n9980e1915A07068
11967c04228I6410c8360q1288H4668i3737j0437A14629e0084j25977J8509k97829
11956d55381d4865k98901j6936b8469k67537D8793A7716P3458A8910M9107b37251
11944C60637A42780M5490a18278I1315b00184o8211C78464j78782b8777D1050
11933B50572n6570d4671k07543G1635h5183A85566A0336c64400A95236o7018a74144
11921a88096Q0479B4268b57738B4305a49885A5226J61159a66972H9942d9326A82971
11909a62476e4225B60487a71491E8209a70148D0946b00855A02659M0006a22678
$$ plain form
11898 40710 -316322 100760 -187111 -11193 43728 127297 -47778 526316 69045 -116904 -70164
11887 -70164 57300 -52013 56033 -96904 48160 81062 201160 9535 130230 -200701 -64628
11875 111917 256106 98290 -102862 -262705 -364 -208927 79372 -109818 75022 36440 90445
11864 90445 -176223 -8689 4446 -13640 -317106 131274 153058 218409 -176417 214548 -21129
11852 -260231 75507 -67080 -156096 -103656 151463 -443200 -108643 3372 133638 -274956 97927
11840 240176 -274979 -79840 142569 -27627 -129951 -321963 -79998 -173843 -52710 -132568 126342
11828 -85959 -124995 299946 133101 316595 -81058 -263342 129108 243920 115282 69085
11818 69085 -16883 164652 128175 45304 -246547 -42946 141409 -120524 -59658 -167036 -241285
$$ packed form
11898D0710c16322A00760a87111a1193D3728Q3569d7778E26316F9045a16904M6740
11887g0164E7300e2013E6033i6904D8160L2902J20098I535J20695b00701f4628
11875A11917J44189I8290a02862j59843c64k08563G9372a09818G5022C6440N4005
11864I0445a76223h689D446a3640l03466A31274K1784O5351a76417B14548b1129
11852b60231G5507f7080q9016N2440A51463d43200a08643C372J30266b74956I7927
11840B40176b74979g9840A42569b7627j02324j92012g9998r3845e2710p9858A26342
11828h5959l9036B99946A33101J83494h1058j82284A29108J14812A15282m6197
11818F9085a6883A64652l6477D5304b46547d2946A41409a20524e9658j07378p4249
$$ plain form
11807 -241285 14146 85454 169190 88791 13284 -107113 -107905 -105464 122155 46227 162056
11796 162056 47956 -109291 -85877 -22251 -11345 104303 133325 -155509 357222 91543 144959
11785 144959 -147795 -91818 -164110 -29027 -101097 7592 41064 147639 -151960 -102774 -36471
11773 125829 -119738 -227159 18219 -312148 -73388 -25616 6056 -423567 264259 -36651 262801
11761 -161745 314916 -222622 -57013 21237 132997 -194485 -243646 -179851 6658 -109458 -63527
11750 -63527 36365 -175188 241710 -200951 231874 -11677 -28196 252030 -268769 -195705
11740 -195705 399513 -104228 59386 -64993 269453 216271 152579 -38465 126465 -202434
11729 -75639 357369 -57742 -73500 -113748 -261962 -182393 -22228 323257 91406 -42517 147699
$$ packed form
11807b41285A4146P1308Q3736q0399A3284a07113p92K441A22155D6227J15829
11796A62056D7956a09291K3414b2251J0906A04303K9022a55509C57222I1543N3416
11785A44959a47795N5977p2292b9027p2070G592L3472J06575a51960M9186c6471
11773A25829a19738j07421A8219c12148g3388b5616F056d23567B64259c6651B62801
11761a61745C14916b22622e7013B1237J11760a94485m9161O3795F658a09458M5931
11750f3527C6365a75188B41710b00951B31874a1677j6519B52030b68769P3064
11740a95705C99513a04228E9386f4993B69453n3182o3692c8465A26465b02434
11729g5639C57369e7742j5758m0248j48214P9569b2228C23257I1406d2517A47699
$$ plain form
11717 -129004 -71895 111291 -32167 -136895 -94430 9630 24335 13959 -163376 -15542 171888
11705 -11741 308623 -154896 -159328 278320 265023 51548 -44197 -48668 -61288 -19744 318013
11693 199524 148872 416479 147709 -153334 38393 -134464 73319 -61460 -5518 -18182 2600
11681 84523 -234215 -24409 178302 109154 250856 152539 -68786 56995 -41674 245197 -50258
11669 -2736 116974 120157 240549 -70816 -218817 125517 306544 -323894 -190476 -59896 256420
11657 -219254 85031 126985 -169478 48920 120350 169775 53223 -74304 11746 -353217 -44786
11645 162880 13061 -62249 286219 93638 -66505 60249 -52228 145782 -163429 167789 -403953
11633 -172024 -115917 -118099 366057 193034 -119550 298684 -25918 -151587 34278 -262680
$$ packed form
11717a29004N7109A11291c2167j04728M2465I630J4705j0376a63376a5542A71888
11705a1741C08623a54896m432B78320j3297E1548d4197m471j2620a9744C18013
11693A99524n0652K67607A47709a53334C8393a34464G3319f1460e518j2664B600
11681H4523b34215b4409A78302o9148J41702r8317f8786E6995d1674B45197e0258
11669b736A16974L183J20392g0816j48001A25517J81027c23894J33418e9896B56420
11657b19254H5031M1954a69478D8920P1430M9425E3223g4304A1746c53217d4786
11645A62880A3061f2249B86219I3638f6505F0249e2228A45782a63429A67789d03953
11633a72024N6107k182C66057j73023a19550B98684b5918j25669C4278b62680
$$ plain form
11622 -253760 68168 -223012 -85176 -184888 -246099 278588 316508 118342 66112 439266 -191647
11610 188149 -15439 -30693 73141 251096 229267 -5617 53680 66899 93499 82732 93349
11599 93349 273849 316945 27973 66567 68766 52918 145026 33447 -250875 72248 151036
11588 151036 128099 308159 184895 306574 -169037 146951 330192 35283 94894 -108872
11577 143119 100379 160822 -69534 132718 9449 196672 84894 34961 99561 71529 -18579
11565 4717 87289 262568 108317 5729 102106 -80768 167342 308260 -60758 -119296 227525
11553 -3311 85038 -21997 182373 -14746 -282048 -254203 35124 24848 235648 -67502 130278
11541 -412528 153122 32235 51955 262764 3012 -138206 8467 116194 131626 78867 46279
$$ packed form
11622b53760F8168b23012h5176r9712o1211B78588L7920A18342n2230L73154a91647
11610A88149a5439j5254G3141J77955k1829e617E3680J3219K6600j0767J0617
11599I3349J80500M3096B7973L8594K199j5848R2108C3447b50875G2248P8788
11588A51036k2937J80060j23264J21679a69037A46951J83241C5283N9611a08872
11577A43119m2740O0443f9534A32718I449J87223H4894C4961O4600k8032a8579
11565D717Q2572J75279A08317E729R6377h0768A67342J40918f0758n8538B27525
11553c311H5038b1997A82373a4746k67302K7845C5124j0276K10800f7502A30278
11541d12528A53122C2235J9720K10809C012a38206H467J07727J5432n2759l2588
$$ plain form
11530 46279 171739 306632 124112 229262 200287 169453 105603 273901 -8629 -105640 -169621
11519 -169621 141609 74015 -49128 297227 -120483 105755 -114039 138800 -13142 -169464
11509 -169464 296606 17313 27126 -282231 192759 -20079 -151149 247083 -69223 -26478 144688
11497 -90823 16683 67035 54287 83672 147800 155637 17952 -29754 18391 40028 166540 -24847
11484 200472 -7284 329004 51893 214868 141262 401451 295533 -135808 -215551 162899
11473 92271 462932 -37944 243592 84365 184981 2704 109959 150075 113015 258337 -111968
11461 10058 -61612 91062 136408 208130 53637 51034 343271 324450 -150569 246875 -361955
11449 -25827 232789 -136928 -83733 85272 -55589 389411 -62187 -156302 243699 69063 -30177
$$ packed form
11530D6279J25460J34893A24112J05150k8975l0834o3850J68298h629r7011o3981
11519a69621A41609o7594d9128B97227a20483A05755a14039A38800a3142j56322
11509a69464B96606A7313R813b82231A92759b0079j31070B47083f9223b6478A44688
11497i0823A6683N0352j2748K9385O4128P837A7952b9754A8391K1637J26512b4847
11484B00472g284C29004E1893J62975p3606K60189j05918a35808p9743A62899
11473I2271L70661c7944B43592H4365J00616B704J07255M0116l7060J45322a11968
11461A0058f1612I1062M5346P1722E3637k603K92237j8821a50569B46875c61955
11449b5827B32789a36928N3195H5272e5589C89411f2187r4115B43699F9063c0177
$$ plain form
11437 -205536 -271748 8000 265567 -159869 171655 -246527 597624 -233165 -114738 398793
11426 -179346 -31454 271282 189679 -231083 -102892 -192549 30451 -10102 83838 129126 -122102
11414 78255 -306280 -145500 8624 156596 -17893 -80735 -183614 -14960 145474 270328 56369
11402 151732 106533 16344 -122059 108700 -48895 -415465 152049 228153 191191 100148 -54946
11390 -53202 -146083 -490217 202875 113852 -7874 -13868 101165 189518 -68943 -251310 384616
11378 -23843 52173 118587 169788 24423 -242073 -227227 260016 -285069 -13763 -18096 123387
11366 -3274 84509 9178 -226286 -99871 -60987 -259666 -35737 111780 236324 -58790 -26508
11354 -101396 2904 -209700 97045 74695 271732 -55403 120227 -138538 -298806 36143 -129072
$$ packed form
11437b05536o6212H000K57567a59869A71655b46527E97624b33165a14738C98793
11426a79346c1454B71282q1603b31083a02892q9657C0451a0102H3838M5288a22102
11414G8255c06280a45500H624J47972a7893o2842j02879a4960A45474J24854E6369
11402A51732m5199A6344a22059A08700d8895l66570A52049P6104l6962r1043e4946
11390e3202r2881l44134B02875q9023g874n994A01165Q8353f8943j82367C84616
11378b3843E2173O6414N1201B4423b42073J4846B60016b85069a3763m333A23387
11366c274H4509I178b26286i9871L8884j98679c5737A11780J24544e8790b6508
11354a01396B904b09700I7045k2350J97037e5403A20227a38538j60268C6143a29072
$$ plain form
11342 39379 298608 201618 104246 218905 -175034 143475 64383 44296 264763 75451 19622
11330 -452001 231989 149589 -65911 37188 -284583 -166907 -23187 -251784 -75025 492383
11319 -240279 224988 -18213 276483 52507 -332240 -167450 41860 -56877 -177613 94968
11308 -84775 -138642 183559 31978 -151553 93207 -281518 -120571 -66129 -26042 12953 -107341
11296 -207922 148877 -149385 -88840 -186092 -265710 -96634 291252 -42059 112848 16957 -1039
11284 277466 -40413 -142001 -64662 -318528 50336 137710 60534 192895 -38393 -176386 83829
11272 -160779 -69422 178410 -62809 -56163 -55399 42569 -115247 -52784 46876 133600 17793 75457
11260 75457 107287 -174881 138332 -17945 -103096 -112658 32367 -224794 315246 -86908 185049
$$ packed form
11342C9379K59229r6990r7372J14659a75034A43475F4383k0087K20467G5451A9622
11330d52001B31989q2400f5911C7188b84583J17676b3187k28597g5025D92383
11319b40279B24988a8213B76483E2507c32240J64790D1860e6877j20736I4968
11308h4775n3867A83559C1978a51553I3207b81518a20571N4442b6042A2953a07341
11296b07922A48877a49385O0545r7252p9618i6634B91252d2059A12848A6957a039
11284B77466d0413j01588f4662k53866E0336Q7374F0534J32361c8393j37993H3829
11272a60779f9422A78410f2809O646P64D2569a15247e2784D6876Q6724A7793N7664
11260G5457L1830a74881A38332a7945q5151r562C2367b24794C15246h6908A85049
$$ plain form
11248 -210219 -252106 58553 17513 51507 -337700 -207989 -275147 179166 1735 -395064 339983
11236 -109261 47601 86051 130248 97642 -42968 117507 -23779 131040 -216289 70700 38406
11225 38406 -256729 30157 95072 -99219 24212 -106421 -29472 162690 -123986 -224313 69752
11213 -156345 -418763 -282116 -166756 248585 155217 -162315 -78750 -255768 230868 188045
11203 188045 -205462 -16698 -66018 -203290 114407 -129221 47751 -96729 -283983 -121517
11192 -58290 66888 1846 -218298 -6249 235796 -442147 -26087 36343 187227 84784 -54813
11180 -346032 143399 4096 -65355 -82732 -136951 -192946 -92605 38920 -39658 -265759 -153916
11169 -153916 46460 13878 -134640 -229506 -76423 126993 -198150 -22624 -181360 89657 8404
$$ packed form
11248b10219m1887E8553A7513L3994c37700J29711o7158A79166A735c95064C39983
11236a09261D7601L8450M4197l2606d2968A17507b3779A31040b16289G0700l2294
11225C8406b56729C0157O4915i9219B4212a06421b9472A62690a23986j00327F9752
11213a56345k62418J36647J15360B48585r3368a62315g8750j77018B30868m2823
11203A88045b05462a6698m9320j37272A14407a29221D7751i6729j87254a21517
11192e8290F6888A846b18298f249B35796d42147b6087C6343J50884H4784e4813
11180c46032A43399D096f5355j7377n4219n5995i2605C8920c9658k26101J11843
11169a53916D6460A3878a34640r4866g6423A26993a98150b2624j58736H9657H404
$$ plain form
11157 96689 -337225 126709 120059 -397884 -128659 -26547 -277974 -97753 -489614 67118 84100
11146 84100 16101 -51406 149874 237324 2917 28799 -167635 28282 187245 192018 168682
11135 168682 99475 108826 23172 105210 -58080 254680 -117942 86712 154251 -128144 319219
11123 213541 1695 96638 -88033 -4269 38508 168446 14347 128169 37891 220346 162009
11112 162009 68748 194527 -29954 2501 -96781 109898 71349 83865 133301 3142 -36230
11100 96375 88528 291910 100395 -146047 310132 87904 87900 -269515 111963 -25260 397254
11088 290178 289521 190874 -419626 376178 223884 93957 500894 253150 249850 95280 279150
11077 279150 225160 473524 264169 272156 37962 327671 34309 73484 248763 399912 465708
$$ packed form
11157I6689c37225A26709o650c97884a28659b6547k51427i7753l91861F7118J6982
11146H4100A6101e1406A49874Q7450B917K5882a67635B8282J58963M773k3336
11135A68682o9207R351B3172Q2038e8080B54680a17942H6712O7539a28144C19219
11123B13541A695R4943h8033d269C8508J29938A4347J13822C7891J82455n8337
11112A62009F8748J25779b9954B501i6781A09898l8549J2516M9436C142c6230
11100I6375p847K03382A00395a46047C10132H7904mb69515A11963b5260C97254
11088B90178o57r8647d19626C76178j52294I3957M06937k47744l300I5280J83870
11077B79150n3990K48364k09355P987C7962K89709C4309L9175J75279J51149O5796
$$ plain form
11066 465708 38003 232044 254569 452286 551730 579310 427464 340253 573731 687476
11056 687476 550718 274412 661064 492446 570244 557431 406225 893881 593403 707340
11046 707340 649966 343987 697824 974923 488069 607117 515442 777977 446766 702600
11036 702600 810432 591109 558878 537489 324703 399366 548843 585907 589180 587101 538770
11025 538770 695915 524391 708896 579761 867571 462727 565863 414895 469852 378990
11015 378990 396993 363952 632250 402759 339561 612321 597687 181029 325976 506835
11005 506835 616730 453403 510903 217619 266803 491620 551930 596858 552076 438165
10995 438165 551185 347662 484054 432323 630199 653988 649811 565533 532543 726230 763566
$$ packed form
11066D65708C8003J94041K2525J97717R9444K7580j51846q7211K33478J13745
11056F87476j36758B74412L86652j68618P7798j2813j51206M87656l00478J13937
11046G07340n7374l05979L53837K77099m86854J19048r1675K62535l31211K55834
11036G02600J07832k19323l2231k1389k12786P4663J49477L7064L273k079m8331
11025E38770J57145j71524J84505j29135K87810m04844J03136j50968N4957r0862
11015C78990J8003l3041K68298k29491o3198K72760j4634A81029J44947J80859
11005E06835J09895j63327N7500B17619M9184K24817O0310M4928m4782j13911
10995D38165J13020k03523J36392n1731J97876K3789m177q4278l2990J93687L7336
$$ plain form
10984 763566 906743 815231 938454 781903 1231481 1030699 1056979 1384924 1914743 2130826
10974 2130826 2220433 2181227 2440757 2156738 2438722 2357507 2054961 1899341 1532045 1773765
10964 1773765 1437473 1257092 1403505 1467492 1197470 1189642 1246353 1780370 1432676 1211403
10954 1211403 845143 1304363 719237 946860 405924 244599 370502 289684 337791 226147
10944 226147 37107 244691 244107 136929 -25362 85551 283849 -125342 -50540 97460 181278
10933 181278 126513 14002 282658 -44115 -109629 115825 307375 14970 -138863 17865 150149
10922 150149 -232845 211278 152393 3590 -291772 246445 -41658 -1717 -372653 -58845 -40093
10911 -40093 -157066 -60108 202282 -338180 -298964 79627 97452 95799 -72593 -88849 -122881
$$ packed form
10984G63566J43177r1512J23223j56551M49578k00782K6280L27945N29819K16083
10974B130826Q9607l9206K59530k84019K81984q1215l02546j55620l67296K41720
10964A773765l36292j80381J46413O3987k70022p828N6711N34017l47694k21273
10954A211403l66260M59220n85126K27623D05924j61325J25903q0818M8107j11644
10944B26147C7107K07584n84j07178b5362H5551J98298a25342e0540I7460Q3818
10933A81278n4765A4002K68656d4115o5514A15825J91550A4970a38863A7865J32284
10922A50149b32845B11278n8885C590b91772B46445d1658a717l70936e8845J8752
10911d0093j16973f0108B02282c38180L9216G9627J7825j653g2593j6256l4032
$$ plain form
10900 -122881 -202558 -89235 -105301 -61597 44085 185032 -20296 86027 324119 -322912 -130154
10888 -1529 8215 90324 -304936 157472 -149224 166402 -151869 -56553 -21345 -96457 -145768
10877 -145768 -152728 -164635 73946 -270302 70761 73790 -93013 72565 -161166 111001 72509
10866 72509 6302 162140 -307999 154697 -349 -463325 -246 -61710 -85552 -82718 30234 172002
10854 172002 149028 -156574 199479 29532 196401 -107085 95593 77612 51254 -118665
10843 238157 293224 -256636 4245 -56267 39694 -153678 172424 111074 149839 7869 -342035
10831 -258431 -124887 328854 40518 -135780 -278609 -58878 -130719 146813 -2569 -111294
10821 -111294 36828 74381 -143707 -344825 -128265 169551 -80394 -12428 -162677 -203756
$$ packed form
10900a22881p9677h9235j6066M3704D4085J40947b0296H6027K38092c22912a30154
10888a529H215Q2109c04936A57472a49224A66402a51869e6553b1345p5112m9311
10877a45768o960j1907G3946b70302G0761L029i3013G2565a61166A11001l8492
10866G2509F302J55838c07999A54697c49m62976b46o1464k3842K834C0234J41768
10854A72002k2974a56574A99479B9532J66869a07085I5593j7981k6358a18665
10843B38157N5067b56636D245e6267C9694a53678A72424o1350L8765G869c42035
10831b58431a24887C28854D0518a35780j42829e8878p1841A46813b569j08725
10821a11294C6828L7553a43707k01118a28265A69551h0394a2428j50249m1079
$$ plain form
10811 -203756 16527 -96832 -31397 104954 -30864 -252020 -63137 -185954 -17763 59461 -90867
10799 54699 39751 -130998 171549 -232335 72036 27949 -59922 73192 49332 -225275 -110180
10787 -167376 -83622 -1413 -85062 -26663 -124361 97906 -171436 -248841 173621 230591 -58583
10775 -130399 -174347 -232673 20780 -86532 -117868 -39300 -140488 49477 -211196 -227678 -225660
10764 -225660 -165572 -134962 -73529 460088 -177264 85727 -155943 -4992 -2515 88437 191184
10753 191184 103323 -206421 -167926 -182880 -205036 -97058 24405 -49499 11744 107542 126054
10742 126054 -76497 129136 -70478 -108358 25 106441 252458 -293186 -42395 -265838 191744
10730 -46267 -104329 -24263 34770 112973 143495 -54904 -109001 146689 -281028 -155223 -64370
$$ packed form
10811b03756A6527i6832c1397A04954c0864k21156f3137j22817a7763E9461i0867
10799E4699j4948a30998A71549b32335G2036B7949e9922G3192k3860b25275a10180
10787a67376h3622a413q3649b6663r7698I7906a71436p7405A73621N6970e8583
10775a30399m3948n8326B0780h6532l1336c9300j01188D9477b11196j6482K018
10764b25660O0088L0610O1433D60088a77264H5727a55943d992K477H8437J02747
10753A91184q7861b06421L8495j4954k2156i7058B4405d9499A1744R5798J8512
10742A26054g6497A29136g0478l7880B5J06416J46017b93186d2395k23443A91744
10730d6267n8062b4263C4770P8203L0522e4904n4097A46689b81028J25805f4370
$$ plain form
10718 -365746 -376802 -45981 -5252 214230 -121970 215169 -106177 -172956 -104350 -160165 -197807
10707 -197807 208054 129098 -265118 9742 8407 -4334 -16228 -76158 -246804 -92062 -144676
10696 -144676 -186486 -96338 -391408 -184698 856 -152345 -80360 -157274 -219488 -239001 -210356
10685 -210356 -53402 -8682 18806 -38886 238324 -152223 -306488 -269358 -349978 -111781 -61126
10674 -61126 187189 155279 6913 20821 129102 -198900 116698 -86593 -141942 28805 -1730
10662 -219038 11249 -133318 -20198 -229295 -129967 -51895 -6610 -350111 58241 -201980 -296173
10651 -296173 -65936 194544 -108897 -100098 -19565 -19143 601 -90917 117822 -301437 38913 35254
10639 35254 50315 10129 82322 110565 -72837 -44898 147678 -90356 134819 -103098 222376
$$ packed form
10718c65746j1056d5981e252B14230a21970B15169a06177o6779O8606n5815l7642
10707a97807B08054p8956b65118I742j335d334j1894n9930j70646i2062n2614
10696a44676m1810R0148k95070a84698H56a52345P1985p6914o2214j9513K8645
10685b10356e3402h682A8806c8886B38324a52223j54265L7130q0620a11781N0655
10674f1126A87189l1910F913J3908J08281a98900A16698h6593n5349B8805a730
10662b19038A1249a33318b0198k09097R9328e1895f610l43501E8241b01980r4193
10651b96173f5936A94544a08897Q799a9565M22F01i0917A17822c01437C8913l659
10639C5254J5061A0129P2193K8243g2837K7939A47678i0356A34819a03098B22376
$$ plain form
10627 -142520 -360905 76305 -38295 53638 61006 -250568 -141276 -463039 255156 98125 59861
10616 59861 -140591 -68954 124943 -218997 -184371 -63400 120069 -167507 36988 -125002
10605 -164821 -390846 251704 -50113 -138633 40445 61940 -164104 -134444 -40599 -108352 21995
10593 -383354 301628 -154620 118479 -17377 34443 40592 465471 137110 -124263 -97015
10583 -97015 -126848 10630 5635 -95907 145345 -154727 -69364 183350 223403 -142118 156987
10571 -376288 -45068 -57754 -81572 43239 -308246 103035 43409 -184636 179238 -251087
10560 333184 -303188 -442438 -134573 -81767 12345 -52861 -203190 -74416 -229919 -184582
10550 -184582 500464 55256 164388 -139195 -11820 -260598 -117603 2876 390713 -336653
$$ packed form
10627a42520k18385G6305c8295E3638P368b50568J09292l21763B55156I8125l8264
10616E9861a40591f8954A24943b18997L4626f3400A20069a67507C6988a25002
10605a64821k26025B51704e0113q8520D0445K1495a64104K9660d0599o7753B1995
10593c83354C01628a54620A18479a7377C4443O149M24879A37110a24263K7248
10583i7015k9833A0630m995i5907A45345a54727f9364A83350M0053a42118A56987
10571c76288d5068j2686k3818D3239c08246A03035D3409a84636A79238b51087
10560C33184c03188j39250a34573N2806A2345e2861j50329g4416j55503M5337
10550a84582E00464E5256J09132a39195a1820k48778a17603B876L87837c36653
$$ plain form
10539 83357 157590 -124708 -130766 12166 -192675 -339232 -131493 38597 -275200 -108860 434070
10527 -16827 237853 -108556 -47925 19070 7573 179627 -2195 -186502 -7928 193486 -214209
10515 -30604 -152229 49976 38692 -87841 183499 -88733 -206271 -82510 204668 -413988 221459
10503 53447 -183404 -128054 54900 120749 229694 -197508 -614072 -87461 -70823 -173010 81627
10491 16213 315694 -284851 232881 402761 -210824 122150 246817 82489 99781 461214
10481 461214 438741 169314 -59368 111440 329931 237735 -80166 5176 27273 206230 -4657
10469 100091 -150156 62229 -33490 291919 120194 -215944 59933 -191129 140739 -81632
10458 -163174 -343222 -84482 -155674 138110 -355242 -187484 -194161 -56346 2751 -45000 -229688
$$ packed form
10539H3357P4233a24708o058A2166a92675j46557a31493C8597b75200a08860D34070
10527a6827B37853a08556d7925A9070G573J72054b195j84307g928A93486b14209
10515c0604j21625D9976j1284h7841A83499h8733j17538h2510B04668d13988B21459
10503E3447a83404N5350E4900O5849J08945a97508m16564h7461J6638j02187H1627
10491A6213K99481b84851B32881J69880b10824A22150J24667H2489J7292L61433
10481D61214k2473A69314e9368A11440K18491r2196h0166E176K2097J78957d657
10469A00091a50156F2229c3490B91919A20194b15944E9933a91129A40739h1632
10458a63174j80048h4482p1192A38110c55242J67758o677e6346B751d5000j84688
$$ plain form
10447 -229688 -30858 -2396 -42975 243 -122019 152163 129016 -108713 -216008 54244 -59811
10435 -103676 -185771 -75889 81681 27604 -499 -23773 256159 -100627 -47982 235955 -88758
10423 -47519 -264952 -392201 332153 251252 260939 -180855 397418 -196173 -11729 391560
10412 145558 137784 -360687 -210681 -240575 179254 -123053 -142891 12122 -135780 691 -143396
10400 -112027 149713 -166995 119184 -206995 -3305 -211210 276139 131012 243513 170910
10390 170910 65687 -51584 297605 169719 -31965 38530 334173 227724 180295 -1300 179044
10378 -28732 404985 138074 -112888 -174982 -95608 31697 402252 299987 -66352 167437
10367 510504 504166 349405 478164 114580 209684 245337 406650 316108 234291 14472 100314
$$ packed form
10447b29688c0858b396m0579B43a22019A52163k3147a08713j07295E4244e9811
10435a03676q2095g5889H1681B7604d99k3274B56159a00627d7982B35955h8758
10423d7519k17433j27249C32153q0901R687a80855C97418a96173a1729C91560
10412A45558p774c60687J50006k9894A79254a23053j9838A2122a35780F91a43396
10400a12027A49713a66995A19184b06995c305k07905B76139A31012J12501p2603
10390A70910F5687e1584B97605j27886c1965C8530K95643j06449m7429a300A79044
10378b8732D04985A38074a12888o2094P9374C1697L70555j02265f6352A67437
10367E10504o338j54761J28759A14580R5104L5653J61313r0542q1817A4472Q5842
$$ plain form
10356 100314 37547 -99063 -129776 126105 344926 452239 457921 407844 354153 300324 182836
10345 182836 322200 135341 430099 354823 132810 30350 271543 353684 157826 221207
10335 221207 53653 35687 -192367 -183333 -45120 -90404 213060 39217 153984 -113973 261164
10323 178845 -46399 224983 -139128 -36277 220686 -34937 197085 65980 108454 79076 114465
10312 114465 52410 7433 -44301 80387 -5521 -79113 76896 -180609 -392147 -181394 -132324
10301 -132324 73848 270528 588795 -29971 -43763 -199050 186988 29833 -126076 -206001
10291 -206001 177734 -223086 -148106 -130518 -202759 155700 103945 -210596 -29760 91543 -258126
10279 167579 5278 -187048 185575 -33999 -272535 149254 -132282 326621 -308099 -182965
$$ packed form
10356A00314C7547i9063l0713A26105K18821J07313N682n0077n3691n3829j17488
10345A82836J39364A35341K94758p5276A32810C0350K41193Q2141A57826O3381
10335B21207E3653j7966a92367R034d5120m5284B13060C9217J14767a13973B61164
10323A78845d6399B24983a39128c6277B20686c4937A97085F5980M2474k9378L5389
10312A14465E2410G433d4301H0387e521p3592G6896a80609k11538a81394M9070
10301a32324G3848J96680L18267b9971j3792j55287A86988B9833a26076p9925
10291b06001A77734b23086P4980J7588p2241A55700n1755b10596b9760I1543b58126
10279A67579E278a87048A85575c3999k38536A49254a32282C26621c08099J25134
$$ plain form
10269 -182965 168929 -174663 -19120 138930 -182880 5489 -98338 52179 22071 21729 317227
10258 317227 499061 44806 113399 296555 -16696 -198834 155463 -272294 -139722 284852
10247 338107 125663 266160 -177762 44647 -43294 13133 59555 96634 -246735 184568
10236 -22655 -48066 -162713 5111 27814 -49922 -99738 1276 -36306 6971 -67883 -307730 -304255
10224 -304255 -377259 -71902 -217128 180165 251247 -27225 88796 -285888 -353564 -483011 -392227
10213 -392227 -190402 -9129 47196 -214438 177918 -121838 313945 168978 3229 -128975
10202 -157868 -3874 -51846 4701 -37662 -60788 154930 -286685 7231 -404125 150428 80053
10191 80053 -66313 -213299 -92165 -174347 -42843 -48818 32342 53362 255011 -29519 220180
$$ packed form
10269a82965A68929a74663a9120A38930a82880E489i8338E2179B2071l42K95498
10258C17227J81834D4806O8593J83156a6696j82138A55463b72294J32572B84852
10247C38107A25663J40497a77762D4647d3294A3133M6422L7079b46735A84568
10236b2655k5411j14647E111K2703d9922m9816A276c6306F971f7883k39847L475
10224c04255p3004g1902j45226A80165P1082b7225H8796b85888o7676j29447R0784
10213c92227a90402i129D7196b14438A77918a21838C13945j44967C229a28975
10202a57868c874m7972D701c7662k3126A54930b86685G231d04125A50428p0375
10191H0053f6313j46986i2165q2182d2843n975C2342K1020K01649b9519B20180
$$ plain form
10179 63571 -22469 -109909 -31862 -145277 -4205 -92106 78819 201582 -113821 74742 177156
10168 177156 193563 -31476 42479 -95930 25475 -149368 -126312 143611 -56351 -203949 1549
10156 15528 -86686 -7837 -242313 13298 -420748 151990 -86779 198620 118323 157859 51640
10144 59841 344982 204118 -352108 285405 -44344 36327 -56555 -81166 -272478 42390 23870
10133 23870 124220 -70330 -11172 -112390 -64338 -98152 1590 -157263 53778 -182113 -81251
10121 -16701 117397 -14733 95936 -133444 -141017 123118 102320 -105791 5514 -63620 67442
10109 -12739 -233510 -88606 -103305 93523 -5762 48627 81647 -146820 -382221 -22810 150554
10097 155373 -3184 249810 -122618 48355 -64622 187216 -38425 -3976 85232 -49790 -89502
$$ packed form
10179F3571b2469q7440c1862j13415d205q7901G8819J22763a13821G4742J02414
10168A77156J6407c1476D2479i5930B5475a49368K3056A43611e6351j47598A549
10156A5528h6686g837k34476A3298d20748A51990h6779A98620q0297L9536E1640
10144E9841K85141j40864c52108B85405d4344C6327e6555k4611j91312D2390j8520
10133B3870J00350g0330a1172j01218M8052l3814A590a57263E3778a82113h1251
10121a6701A17397a4733I5936a33444p573A23118k0798a05791E514f3620F7442
10109a2739k20771h8606j4699I3523e762D8627L3020a46820k35401b2810A50554
10097A55373c184B49810a22618D8355f4622A87216c8425c976H5232d9790l9712
$$ plain form
10086 -89502 75159 -82469 82345 -132216 -400927 -97737 -384977 -102295 183311 -102644
10075 -83548 -386343 102859 108603 214021 -156805 167622 91901 -76795 -189026 100077
10064 157840 -7802 -26077 -18443 -188758 -4348 21956 -48244 5779 -100850 184983 161213 -37899
10051 109864 159438 150210 -41498 -235676 -74012 -73085 -183079 197441 -367508 189920 -3160
10039 -26220 -172236 12459 -112681 -51740 -168482 -117930 -405628 -133187 -134763 26908 81282
10028 81282 123704 -150224 -199843 -259907 -103007 -180107 33145 -151213 -34618 136879 158423
10017 158423 -115484 -244130 26062 -383163 125261 254104 -158235 283411 112402 -5891
10006 -116270 -7227 -73084 120272 -242935 109479 82991 -328421 81211 -186727 28010 -90294
$$ packed form
10086h9502G5159h2469H2345a32216k68711i7737k87240a02295A83311a02644
10075h3548l02795A02859N744J05418a56805A67622p5721g6795j12231A00077
10064A57840g802j8275P634j70315d348B1956d8244E779a00850A84983k3770c7899
10051A09864M9574r228d1498j94178g4012R27j09994A97441c67508A89920c160
10039b6220j46016A2459a12681e1740j16742N0552k87698a33187j576B6908N4374
10028H1282M2422a50224m9619o0064a03007p7100C3145a51213c4618A36879K1544
10017A58423a15484j28646B6062c83163A25261J28843a58235B83411A12402e891
10006a16270g227o5857A20272b42935A09479k6488c28421H1211a86727B8010i0294
$$ plain form
9994 -47002 -33103 -197542 -261765 11377 -344550 -143625 253367 26910 87301 83447 -49609
9982 -110201 27784 148594 -198422 -30130 -31637 -238367 -293143 -47785 -100371 -356371 157854
9970 -74531 -171976 -55250 -8519 312155 82606 -173760 -110508 22897 207881 -69711 138894
9958 -388907 41382 -132744 -74763 -393309 -4507 -38593 -323551 31937 -143772 50744 -380982
9946 129628 -249009 40283 -44424 -260115 137960 23058 15844 4575 -225726 128798 158468
9935 158468 202557 -124465 149118 66017 -187998 -138526 176532 152030 -89710 -204439 41258
9923 -291751 -170753 101207 -114229 141701 -203965 264366 207146 -194640 -26263 -384947
9913 -384947 115063 -330061 -45707 -42102 -82125 82024 -165456 -48675 -124601 56763 -337281
$$ packed form
9994d7002J3899j64439o4223A1377c44550a43625B53367B6910O0391l854d9609
9982a10201B7784J20810a98422c0130j507k06730n4776d7785n2586k56000A57854
9970g4531r7445e5250h519C12155H2606a73760O3252B2897J84984f9711A38894
9958c88907D1382a32744N7981l18546d507l4086k84958C1937a43772E0744c80982
9946A29628b49009D0283d4424k15691A37960B3058p214D575b25726A28798K9670
9935A58468M4089a24465A49118F6017a87998M9472A76532k4502h9710j14729D1258
9923b91751J20998A01207a14229A41701b03965B64366n7220a94640b6263l58684
9913c84947A15063c30061d5707L605m0023H2024a65456d8675p5926E6763c37281
$$ plain form
9901 -199110 -306316 -102076 -16097 -192453 -236105 -177845 50093 230977 30428 -89346 -141340
9890 -141340 -69592 -150848 144432 -43325 -290321 65057 64756 -250468 60837 169654 -152619
9878 -67663 -92687 250589 -99445 88286 -16904 -41817 -395144 -302001 -270265 -312115 -146427
9866 -504285 -194023 -52715 90207 26769 -115515 -228566 -5194 -87136 122421 -47508 -97015
9855 -97015 -110540 154962 -295793 -210948 -61880 65963 163123 -63290 -112742 316544 -207921
9843 426512 -46967 -114389 -253207 298588 287944 -6137 -134350 206258 3474 -68327 -271611
9832 -271611 116442 -401071 -140112 -555503 296131 -111295 -67888 275198 -94541 -99055
9822 -99055 238508 -161183 283727 7885 229154 -149946 -56800 334649 -281236 -104677
$$ packed form
9901a99110j07206a02076a6097j76356m3652N8260E0093J80884C0428h9346n1994
9890a41340f9592q1256A44432d3325k46996F5057l01b50468F0837J08817a52619
9878f7663k5024B50589i9445H8286a6904k4913l53327R3143L1736m1850a46427
9866e04285a94023e2715I0207B6769a15515j13051e194q1942A22421d7508m9507
9855i7015j3525A54962b95793Q4845f1880F5963R7160f3290m9452C16544b07921
9843D26512d6967o7422j38818B98588j0644f137j28213B06258C474f8327k03284
9832b71611A16442d01071a40112m15391B96131a11295M3407B75198i4541m514
9822i9055B38508a61183B83727G885K21269a49946e6800C34649b81236a04677
$$ plain form
9811 -207671 -195836 -8505 74515 -315415 -42183 -322741 -257306 193049 -227024 -213462 -178576
9800 -178576 -212423 -106623 158594 119021 -140798 -60158 -147242 -320595 241769 263712 -104740
9788 -281323 213589 -74452 101465 150251 -45675 -27569 -202680 -91593 -317073 219102 -322715
9776 -264325 -139796 44574 -171814 -194907 -137894 -326874 -70997 142427 -412563 155185
9765 -148779 -364312 157466 -52042 59571 199105 -87970 -189149 -300930 -6433 815 389159
9754 389159 238685 -154606 -239620 -438635 222496 161027 82254 -69472 -290801 -52220 -110630
9743 -110630 63064 -23112 -234685 189547 270720 232812 -4802 -224575 -231896 -261681 115246
9731 57469 -160528 -55761 -112238 -174753 43326 11200 -245209 36570 247000 143830 -86262
$$ packed form
9811b07671J1835h505G4515c15415d2183k80558O5435A93049b27024J3562L4886
9800a78576l3847J05800A58594l9573a40798f0158q7084j73353B41769K1943a04740
9788b81323B13589g4452A01465M8786d5675J8106j75111i1593k25480B19102c22715
9776b64325J24529D4574a71814k3093N7013j88980g0997A42427d12563A55185
9765a48779k15533A57466e2042E9571J39534h7970j01179j11781f433H15L88344
9754C89159j50474a54606q5014j99015B22496o1469p8773f9472k21329e2220n8410
9743a10630F3064b3112k11573A89547Q1173l7908d802k19773p321k9785A15246
9731E7469a60528e5761n6477o2515D3326A1200b45209C6570K10430j03170h6262
$$ plain form
9719 -319787 221743 28676 186777 -524738 -229167 -126858 -89322 120331 -52597 -124220
9709 -124220 -104473 -466823 -71186 -374063 -6503 99504 -35066 -30821 -178226 -332243 -191842
9698 -191842 -178052 -31606 -211096 195031 -37032 -158331 22073 -237424 294614 225337 -76424
9686 121410 13630 -193748 -51988 61670 20473 -92776 9237 -112868 -373670 276424 41013
9674 104664 -43807 -231733 17242 -226954 333874 -113238 -381096 47390 -51441 -99473 -427254
9663 -427254 -3779 139288 -90715 -73167 -122056 124479 -20391 -137538 126692 156336 77395
9651 -239020 -156826 -144890 -36552 74795 30508 125616 -342178 108048 -61676 -68712 -227216
9640 -227216 3542 -45814 211937 115835 -181248 142246 -238968 -48660 -61133 2473 -203423
$$ packed form
9719c19787B21743B8676J58101e24738b29167J02309L7536A20331e2597p1623
9709a24220J9747l62350g1186l02877f503I9504c5066M245j47405j54017J40401
9698a91842J3790c1606j79490A95031c7032j21299B2073b37424B94614o9277g6424
9686A21410A3630a93748e1988F1670B0473i2776I237a12868k60802B76424D1013
9674A04664d3807j87926A7242b26954C33874a13238k67858D7390e1441m8032l27781
9663d27254c779A39288i0715J7548m8889A24479b0391j17147A26692K9644G7395
9651b39020Q2194J1936c6552G4795C0508R5108c42178A08048f1676p036j58504
9640b27216C542d5814B11937r6102a81248A42246b38968d8660j2473B473b03423
$$ plain form
9628 -54925 19182 -36567 -113859 -186289 148664 279483 -247256 -121939 -17388 -34640 -12169
9616 153220 -435937 358800 -115546 -292925 -68543 -116710 85053 -57769 -349347 -5678 -93124
9605 -93124 30494 -192477 -213337 -18870 140948 -172645 122784 -22815 161506 -79973 -7482
9593 69318 49375 -121414 -254190 -230140 69822 -402463 -61871 241840 -156193 253739 244848
9582 244848 308468 179195 -221163 115318 -124241 64884 -7559 -281392 -408286 33351 237342
9571 237342 327717 -251218 95701 -8414 -174309 200259 -335015 185369 228897 74665 -260458
9559 -77459 -205628 439204 -165279 194085 557444 47173 -192106 4106 73160 145559 -273750
9547 -57136 -162784 -87436 162145 101388 -249002 64522 -295424 204752 -109100 -185665 129410
$$ packed form
9628e4925A9182c6567p7292p2430A48664J30819b47256a21939a7388j7252a2169
9616A53220d35937C58800a15546j77379f8543m8167H5053e7769k91578e678q7446
9605i3124C0494a92477k0860a8870A40948a72645A22784b2815A61506g9973g482
9593F9318j9943a21414j32776K4050F9822d02463f1871B41840a56193B53739q891
9582B44848O3620j29273b21163A15318a24241F4884g559k73833j26894C3351K03991
9571B37342R0375b51218I5701h414j65895B00259c35015A85369M3528G4665b60458
9559g7459j28169D39204a65279A94085L63359D7173a92106D106O9054P2399b73750
9547e7136j05648P5348A62145o0757b49002F4522b95424B04752a09100p6565A29410
$$ plain form
9535 -443707 27855 -96862 -155718 129792 -91282 161473 -64314 128715 67616 -86466 -63634
9524 -63634 22377 -83727 34592 68188 136475 -69185 32789 66627 212875 -321990 -153458
9512 184194 4204 -18546 -265160 -86487 65021 -41258 -1706 -35613 -227531 267846 -237509
9500 111286 53355 -149332 -229937 -282233 6277 75654 -305548 100248 -186598 184318 148319
9489 148319 75194 -2292 -235665 90665 101374 -49296 -73386 40417 -5018 -82810 -356423 95712
9476 -243635 -37359 -77700 -378491 -77510 -225782 1949 -68307 -214363 -200201 -4852 77980
9464 -21338 83379 -18066 -150358 -305200 129027 286977 -29952 -409860 -63520 36963 -192263
9452 -265347 59129 -244084 -189192 -135944 -359181 -218560 25807 98749 32759 -122202 -5612
$$ packed form
9535d43707B7855i6862n8856A29792i1282A61473f4314A28715o1099h6466K2832
9524f3634B2377h3727C4592L3596O8287f9185C2789L3838J46248c21990a53458
9512A84194D204a8546k46614h6487F5021d1258a706l3907j91918B67846b37509
9500A11286E3355a49332q0605n2296F277O9377c05548A00248a86598A84318l5999
9489A48319p3125b292k33373I0665J0709d9296k4090D0417e018p7792k73613I5712
9476b43635c7359m0341l00791g7510j48272A949f8307j46056J4162d852G7980
9464b1338H3379a8066j32292j54842A29027J57950b9952l79908f3520C6963a92263
9452b65347E9129b44084N4892N3248k23237J40621B5807P2942C2759a22202e612
$$ plain form
9440 75688 -172658 120920 101303 50712 -217113 -101914 154243 -28179 -198453 41421 -34048
9428 -90952 -232938 41027 34005 -172693 -161968 -149797 -165672 -310471 -195559 -270813 14727
9416 -119841 110017 -68809 152268 -250586 100839 -223612 150701 -350364 289470 -180544
9405 -100476 289686 123769 -34431 57785 -411751 204205 -247594 30702 -315451 -286616
9395 -286616 -188036 -40045 -488073 -83914 -14195 46965 -114864 29964 -52073 -216794 84060
9383 -394483 -42082 -272343 -309812 -106686 -109269 -151818 56201 -52085 223026 368530 -83650
9371 -72174 -137965 -81340 241660 -254470 -22779 54715 -107290 -68428 9714 -78186 44772
9359 139829 256222 60019 52404 7717 350223 99876 -143051 -21085 -59395 -133786 -56316
$$ packed form
9440G5688a72658A20920j9617n0591b17113a01914A54243b8179j70274D1421c4048
9428i0952j41986D1027p022a72693J0725J2171j5875j44799J14912p5254A4727
9416a19841A10017f8809A52268b50586A00839b23612A50701c50364B89470a80544
9405a00476B89686A23769c4431E7785d11751B04205b47594C0702c15451K8835
9395b86616R8580d0045m48028h3914a4195D6965a14864B9964e2073j64721H4060
9383c94483d2082k30261l7469a06686k583m2549E6201e2085B23026J45504h3650
9371g2174o5791N6625B41660b54470b2779E4715a07290L8862I714g8186D4772
9359A39829J16393F0019p615G717L42506I9876a43051b1085l8310p4391e6316
$$ plain form
9347 77686 -394274 -262046 77884 -78217 -90726 -393248 -12313 -182374 -102512 2557 -47736
9335 -249713 -115834 151813 92322 -264180 210370 -108116 150197 173220 47761 35030
9325 35030 -163383 -52825 -126036 -91408 72915 206 23905 48332 -66326 13558 -101840 -340775
9313 -340775 167673 -258794 46662 -151658 235975 -108336 19213 79848 72811 -70590 -60115
9302 -60115 100383 56989 -193059 -189628 32867 132662 232909 -76916 -30618 -66260 -21006
9290 -78326 -95588 -196327 -34173 -238423 316283 -121481 2871 -56007 25059 -270680 -130612
9278 -1165 -49742 100133 -84824 -93521 -75968 41917 -138829 -97548 -149492 -33044 56757 150914
9266 150914 -203814 -47379 182421 303674 -145887 147780 -111610 -384130 -259520 311366
$$ packed form
9347G7686c94274J32228G7884g8217j2509l02522a2313j70061P9862B557d7736
9335b49713a15834A51813n9491b64180B10370a08116A50197K3023D7761j2731
9325C5030a63383e2825p3211L4628G2915B06K3699K4427f6326A3558a01840k38935
9313c40775A67673b58794D6662a51658B35975a08336A9213O0635p037g0590J0475
9302f0115A00383m3394a93059L431C2867R9795J00247g6916c0618l5642b1006
9290g8326j7262j00739c4173k04250C16283a21481B871e6007B5059b70680a30612
9278a165m8577A00133h4824q697J7553D1917a38829M1281n1944c3044E6757R4157
9266A50914b03814d7379A82421J21253a45887A47780a11610k72520J24610C11366
$$ plain form
9255 75954 39125 -33177 154297 28822 240547 -8228 -202403 -38032 21 -317707 -284118 160037
9242 179372 249034 28681 -306360 -97125 -65582 271588 -146470 196132 -256632 -283971 6625
9230 -134744 -255560 219352 -104216 -195452 -218190 -138582 -236547 -190649 217632 45930 69214
9219 69214 53439 -346471 15254 -228476 74679 -299 130027 -16322 -31321 -118499 -34117 -47834
9207 -47834 -56443 195207 15812 -14495 149121 -231703 73605 -135857 3728 -142624 25008
9195 -63669 -136256 -142015 391068 9918 140158 -172731 25781 -318479 125369 -110910 -87317
9184 -87317 -58982 -99108 123731 270129 -162454 -134405 -91708 -173509 -31239 95954 22302
9172 -364994 -161930 124788 32737 114718 -300322 -236995 159156 -184168 93175 -116554
$$ packed form
9255G5954l6829c3177A54297B8822K11725h228j94175c8032B1c17707L3589A60037
9242A79372O9662B8681c06360i7125L1543B71588a46470A96132b56632k7339F625
9230a34744j20816B19352a04216r1236k2738P9608r7965M5898B17632D5930K3284
9219F9214j5775c46471A5254b28476G4679b99A30027a6322j4999q7178c4117j3717
9207d7834q609A95207A5812a4495A49121b31703G3605a35857C728a42624B5008
9195f3669p2587n759C91068I918J30240a72731B5781c18479A25369a10910K3593
9184h7317K8335m0126A23731J46398a62454K8049M2697q1801c1239I5954B2302
9172c64994a61930A24788C2737Q1981c00322O3327A59156a84168I3175a16554
$$ plain form
9161 179922 262808 -147743 126165 -198901 -120569 323745 -159828 -150342 -205418 -98344 97036
9149 166150 -179965 -68222 -15470 -227707 -116876 69560 -213108 -139498 -68310 359471 -147163
9137 -383085 -371278 53110 -11569 -85805 -321019 -141366 256484 203653 140084 103921 -203182
9125 -172249 -224561 99710 -36598 -119635 -199770 68268 179569 27796 129657 -146110 -122882
9114 -122882 369078 216000 -450105 -13508 -181352 -221012 266484 -57305 124252 -216479
9103 149899 -36769 136617 -267587 -178179 242243 -224757 128673 -146885 42562 69686
9093 69686 -152009 -162763 -66126 -60290 -36053 -164785 -95297 -26541 -199576 -180969 -87359
9081 -9231 50524 119468 -267797 -109694 118796 -47507 -233377 -83360 93533 91303 -65920
$$ packed form
9161A79922Q2886a47743A26165a98901P8332C23745a59828R486n5076i8344I7036
9149A66150a79965f8222a5470k12237J10831F9560b13108P3610f8310C59471a47163
9137c83085J1807E3110a1569p4236k35214a41366B56484n2831o3569l6163b03182
9125a72249n2312I9710c6598q3037q0135F8268J11301B7796J01861a46110K3228
9114a22882C69078j53078d50105a3508j67844l9660B66484e7305A24252b16479
9103A49899c6769A36617b67587Q9408B42243b24757A28673a46885D2562K7124
9093F9686a52009j0754f6126N836K4237j28732O9488b6541j73035J8607h7359
9081i231E0524O8944b67797a09694A18796d7507j85870h3360I3533k230f5920
$$ plain form
9069 -550646 132921 159841 -204592 -84373 111557 108161 224963 137024 107120 -148734 -283491
9058 -283491 -341461 -113300 -43152 -428522 -109085 -213838 80774 -111157 -180634 -53214 -262737
9047 -262737 -18632 65237 -22388 -45546 37675 175506 -173097 -282957 -162159 -30862 -127641
9036 -127641 41444 206424 198337 -127189 -183031 -58872 -10823 194064 39041 -79253 -178554
9025 -178554 24176 -210967 96815 16602 -123069 -221112 133181 -344346 25218 -370795 183008
9013 172928 -432880 -149505 -20521 -34120 -247293 223396 -499295 -74155 -102473 101090
9002 51327 202809 -15749 -94408 -289840 -44920 111850 -29589 200980 301059 181125 -189883
8990 34659 -252913 -211840 71662 -1925 44481 58165 86742 -168580 94270 -67531 162638
$$ packed form
9069e50646A32921K6920b04592h4373A11557l396J16802q7939k9904a48734j34757
9058b83491n7970a13300d3152l85370a09085j04753H0774a11157o9477e3214k09523
9047b62737a8632F5237b2388k3158C7675J37831a73097j09860J20798c0862r6779
9036a27641D1444J64980q087a27189n5842e8872a0823A94064C9041g9253r9301
9025a78554B4176b10967I6815A6602a23069r8043A33181c44346B5218c70795A83008
9013A72928d32880a49505b0521j3599k13173B23396d99295g4155k8318A01090
9002E1327J51482a5749p8659j95432d4920A11850b9589B00980J00079j19934a89883
8990C4659b52913M1073G1662a925D4481J3684K8577a68580I4270f7531A62638
$$ plain form
8978 -248482 -1397 -80707 -194458 112387 31517 18065 -54862 -146177 88547 -331945 -58239
8966 -41060 -59911 -180680 -274500 28702 48782 329511 -53418 -147318 26029 -384883 -66764
8954 35860 -201068 310330 528651 -249483 -438720 79797 -72035 224068 55835 -22524 37994
8942 181876 -158614 -359658 -300582 152914 -168515 -196262 80100 -227286 32455 42611 126353
8931 126353 -238379 6711 122334 -112939 175797 109232 34601 70047 295599 1278435 694725
8920 694725 85361 -84432 -183574 -156456 -337824 24465 -298058 -81451 118586 -80247 223616
8908 -128708 -236202 -395495 186 -253291 -178974 -42005 -149451 178159 25095 -287506 54108
8896 -206808 -206260 166894 14198 245512 33934 -114677 -31013 59480 95945 -280154 -272414
$$ packed form
8978b48482a397p9310j13751A12387C1517j3452e4862r1315H8547c31945e8239
8966d1060j8851j20769r3820B8702K0080K80729e3418r3900B6029c84883f6764
8954C5860b01068C10330K18321b49483j89237G9797g2035B24068E5835b2524C7994
8942A81876a58614k01044N9076A52914a68515k7747H0100b27286C2455J0156Q3742
8931A26353b38379F711J15623a12939A75797o6565C4601L5446K25552R82836n83710
8920F94725H5361h4432r9142K7118j81368B4465b98058h1451A18586h0247B23616
8908a28708j07494j59293A86b53291P4317d2005j07446A78159B5095b87506E4108
8896b06808N48A66894A4198K31314C3934a14677c1013E9480L6465b80154P740
$$ plain form
8885 -272414 234344 75880 -160871 -73597 -36280 239872 -122932 159817 75243 -125622
8874 -190471 41486 -227035 -67470 -180109 -151387 -130433 22327 55252 166383 -97495 53251
8862 -40449 -55914 99667 302732 -363466 -221790 -77451 157395 311283 -130067 97567 -308833
8850 -154258 13554 -90880 -338414 -413301 -116805 -194322 -307558 -104405 170985 -132182
8839 81809 25388 41054 80266 -321825 89936 87884 106335 50842 -135366 -133407 53982 -174865
$$ packed form
8885b72414B34344G5880a60871g3597c6280B39872a22932A59817G5243a25622
8874a90471D1486b27035f7470j12639K8722K0954B2327L2925J11131i7495E3251
8862d0449j5465I9667K03065c63466J41676g7451A57395J53888a30067I7567c08833
8850a54258A3554i0880k47534p4887a16805p7517j13236a04405A70985a32182
8839H1809B5388J5666L9212c21825H9936k052J8451E0842a35366J959E3982a74865
$$ [...]
##END NTUPLES=NMR SPECTRUM
##END=
