##TITLE=NES1093_RSB_9886830_fKTSD0sDcw
##JCAMPDX= 6.0         $$ Bruker NMR JCAMP-DX V2.0
##DATA TYPE= NMR SPECTRUM
##DATA CLASS= NTUPLES
##ORIGIN= BRUKER
##OWNER= Administrator
$$ 1.72 TOPSPIN		Version 2.1
$$ 2016-08-28 16:03:35.664 -0500  Administrator@X
$$ Compression mode = diff/dup
##.OBSERVE FREQUENCY= 400.02188249412
##.OBSERVE NUCLEUS= ^1H
##.ACQUISITION MODE= SIMULTANEOUS (DQD)
##.ACQUISITION SCHEME= undefined
##.AVERAGES= 8
##.DIGITISER RES= 22
##SPECTROMETER/DATA SYSTEM= spect
##.PULSE SEQUENCE= zg30
##.SOLVENT NAME= COFFEE_meoh
##.SHIFT REFERENCE= INTERNAL, COFFEE_meoh, 1, 14.98509
##AUDIT TRAIL= $$ (NUMBER, WHEN, WHO, WHERE, PROCESS, VERSION, WHAT)
$$ ##TITLE= Audit trail, TOPSPIN		Version 2.1
$$ ##JCAMPDX= 5.01
$$ ##ORIGIN= Bruker BioSpin GmbH
$$ ##OWNER= Administrator
$$ $$ E:\/data/COFFEE/nmr/NES1093_RSB_9886830_fKTSD0sDcw/20/pdata/1/auditp.txt
$$ ##AUDIT TRAIL=  $$ (NUMBER, WHEN, WHO, WHERE, PROCESS, VERSION, WHAT)
(   1,<2016-08-28 16:03:28.570 -0500>,<Administrator>,<X>,<go>,<TOPSPIN 2.1>,
      <created by zg
	started at 2016-08-28 16:02:21.867 -0500,
	POWCHK enabled, PULCHK disabled,
       configuration hash MD5:
       21 0F 79 D6 B3 7B B4 F6 88 20 88 DB 03 48 BD 9F
       data hash MD5: 64K
       AA CB 0F D0 2E 53 99 12 54 40 D5 11 2D 77 E1 54>)
(   2,<2016-08-28 16:03:31.664 -0500>,<Administrator>,<X>,<proc1d>,<TOPSPIN 2.1>,
      <Start of raw data processing
       efp LB = 0 FT_mod = 6 PKNL = 1 PHC0 = 0 PHC1 = 0 SI = 32K 
       data hash MD5: 32K
       89 A0 77 09 E5 43 7E 99 BA F8 09 A4 3A 80 5E 3B>)
(   3,<2016-08-28 16:03:31.929 -0500>,<Administrator>,<X>,<proc1d>,<TOPSPIN 2.1>,
      <pk PHC0 = 93.15308 PHC1 = 0 
       data hash MD5: 32K
       A5 70 1C 9A 0E 61 CE 3B 35 4B 05 B9 75 EE AD 41>)
(   4,<2016-08-28 16:03:32.039 -0500>,<Administrator>,<X>,<proc1d>,<TOPSPIN 2.1>,
      <abs ABSG = 1 
       data hash MD5: 32K
       37 CD A1 CB 64 F7 D1 BD 6B E5 F1 3D BE BE 36 52>)
(   5,<2016-08-28 16:03:32.086 -0500>,<Administrator>,<X>,<proc1d>,<TOPSPIN 2.1>,
      <abs ABSG = 2 
       data hash MD5: 32K
       49 77 7C F1 88 04 56 39 86 9E 0B BA AB 09 BF DC>)
(   6,<2016-08-28 16:03:32.148 -0500>,<Administrator>,<X>,<proc1d>,<TOPSPIN 2.1>,
      <abs ABSG = 3 
       data hash MD5: 32K
       EC F1 99 A8 0D 9C F6 7E 0B 36 7C 53 80 F8 07 97>)
(   7,<2016-08-28 16:03:32.226 -0500>,<Administrator>,<X>,<proc1d>,<TOPSPIN 2.1>,
      <abs ABSG = 4 
       data hash MD5: 32K
       05 93 E3 83 BB F7 BE 50 89 FF E4 E9 6A F9 E3 13>)
(   8,<2016-08-28 16:03:32.289 -0500>,<Administrator>,<X>,<proc1d>,<TOPSPIN 2.1>,
      <abs ABSG = 5 
       data hash MD5: 32K
       75 90 39 99 20 BF 92 48 60 F6 79 A0 29 90 16 61>)
$$ ##END=
$$ 
$$ $$ hash MD5
$$ $$ 45 CF 2A EA FB 17 1F FE E8 C8 A2 8E 4F 54 1E D2
##$RELAX= 
##$RELAX= 
##$RELAX= 
##$RELAX= 
##$RELAX= 
##$RELAX= 
##$RELAX= 
$$ Bruker specific parameters
$$ --------------------------
##$DU= <E:\>
##$EXPNO= 20
##$NAME= <NES1093_RSB_9886830_fKTSD0sDcw>
##$PROCNO= 1
$$ [...]
150 150 150 150 150 150 150 150
##$TP07= 0
##$TPNAME0= <>
##$TPNAME1= <>
##$TPNAME2= <>
##$TPNAME3= <>
##$TPNAME4= <>
##$TPNAME5= <>
##$TPNAME6= <>
##$TPNAME7= <>
##$TPOAL= (0..7)
0.5 0.5 0.5 0.5 0.5 0.5 0.5 0.5
##$TPOFFS= (0..7)
0 0 0 0 0 0 0 0
##$TUNHIN= 0
##$TUNHOUT= 0
##$TUNXOUT= 0
##$USERA1= <user>
##$USERA2= <user>
##$USERA3= <user>
##$USERA4= <user>
##$USERA5= <user>
##$V9= 5
##$VALIST= <valist>
##$VCLIST= <CCCCCCCCCCCCCCC>
##$VD= 0
##$VDLIST= <DDDDDDDDDDDDDDD>
##$VPLIST= <PPPPPPPPPPPPPPP>
##$VTLIST= <TTTTTTTTTTTTTTT>
##$WBST= 2048
##$WBSW= 25
##$XGAIN= (0..3)
0 0 0 0
##$XL= 0
##$YL= 0
##$YMAX_a= 587717
##$YMIN_a= -491853
##$ZGOPTNS= <>
##$ZL1= 120
##$ZL2= 120
##$ZL3= 120
##$ZL4= 120
##$ABSF1= 14.98509
##$ABSF2= -5.573092
##$ABSG= 5
##$ABSL= 3
##$ALPHA= 0
##$AQORDER= 0
##$ASSFAC= 0
##$ASSFACI= 0
##$ASSFACX= 0
##$ASSWID= 0
##$AUNMP= <proc_prof1d_extract_pilot.lims>
##$AXLEFT= 0
##$AXNAME= <>
##$AXNUC= <1H>
##$AXRIGHT= 0
##$AXTYPE= 0
##$AXUNIT= <>
##$AZFE= 0.1
##$AZFW= 0.1
##$BCFW= 0
##$BC_mod= 0
##$BYTORDP= 0
##$COROFFS= 0
##$CY= 15
##$DATMOD= 1
##$DC= 0
##$DFILT= <>
##$DTYPP= 0
##$F1P= 0
##$F2P= 0
##$FCOR= 0.5
##$FTSIZE= 32768
##$FT_mod= 6
##$GAMMA= 0
##$GB= 0
##$INTBC= 1
##$INTSCL= 1
##$ISEN= 128
##$LB= 0
##$LEV0= 0
##$LPBIN= 0
##$MAXI= 10000
##$MC2= 0
##$MEAN= 0
##$ME_mod= 0
##$MI= 0
##$NCOEF= 0
##$NC_proc= -8
##$NLEV= 6
##$NOISF1= 0
##$NOISF2= 0
##$NSP= 0
##$NTH_PI= 0
##$NZP= 0
##$OFFSET= 14.98509
##$PC= 1
##$PHC0= 93.15308
##$PHC1= 0
##$PH_mod= 1
##$PKNL= yes
##$PPARMOD= 0
##$PPDIAG= 0
##$PPIPTYP= 0
##$PPMPNUM= 2147483647
##$PPRESOL= 1
##$PSCAL= 4
##$PSIGN= 0
##$PYNMP= <proc.py>
##$REVERSE= no
##$SF= 400.02
##$SI= 32768
##$SIGF1= 0
##$SIGF2= 0
##$SINO= 400
##$SIOLD= 32768
##$SPECTYP= <>
##$SREGLST= <1H.CDCl3>
##$SSB= 0
##$STSI= 32768
##$STSR= 0
##$SW_p= 8223.68421052631
##$SYMM= 0
##$S_DEV= 0
##$TDeff= 65536
##$TDoff= 0
##$TI= <>
##$TILT= no
##$TM1= 0
##$TM2= 0
##$TOPLEV= 0
##$USERP1= <user>
##$USERP2= <user>
##$USERP3= <user>
##$USERP4= <user>
##$USERP5= <user>
##$WDW= 1
##$XDIM= 32768
##$YMAX_p= 436987687
##$YMIN_p= -676027
##$CURPLOT= <Network HP LaserJet P1505>
##$CURPRIN= <$Network HP LaserJet P1505>
##$DFORMAT= <normdp>
##$LAYOUT= <+/1D_H.xwp>
##$LFORMAT= <normlp>
##$PFORMAT= <normpl>
##$SURQMSG= 1
$$ End of Bruker specific parameters
$$ ---------------------------------
##NTUPLES= NMR SPECTRUM
##VAR_NAME=  FREQUENCY,     SPECTRUM/REAL,   SPECTRUM/IMAG
##SYMBOL=    X,             R,               I
##VAR_TYPE=  INDEPENDENT,   DEPENDENT,       DEPENDENT
##VAR_FORM=  AFFN,          ASDF,            ASDF
##VAR_DIM=   32768,         32768,           32768
##UNITS=     HZ,            ARBITRARY UNITS, ARBITRARY UNITS
##FACTOR=    0.250966925370066, 1,           1
##FIRST=     8223.43324360094, -163866,      70545
##LAST=      0,             250808,          -231471
##MIN=       0,             -676027,         0
##MAX=       8223.43324360094, 436987687,    0
$$ Real data points
##PAGE= N=1
##DATA TABLE= (X++(R..R)), XYDATA
$$ [...]
19512b36349f7723I1923O7515e607k74462J15609B33688b5914k10716c9430k62663
19501c02093j65040J03953Q8753D8235a0074k98906b2982o1936I0691k7299J85456
19490B48848d3439j82301A50298F9956c2838H7401c3447H1943c27315A26391d5294
19478b07570I2466J9026k6600a70508j45328a22665I0572c6520j20792A84125
19467A06129l317K73667a20792d763D8629a05094J3305k32630J47094D1079a5716
19455a8934A9178Q1212b08894e5646A0460g6250a1759l59371R8944A25198a06899
19443E7250A3616J03653b6524r6913r5644Q2950k8691p7397O9358f2205k48037
19432c10242R9938a04771A4824m777a84741A81215c38899A53752b20607k0843
$$ y = [-236349, -67723, 91923, 159438, -5607, -280069, -164460, 233688, -25914, -236630, -39430, -302093, -467133, -363180, -274427, 48235, -10074, -308980, -22982, -84918, 90691, 63392, 248848, -43439, -225740, 150298, 69956, -32838, 87401, -33447, 81943, -327315, 126391, -45294, -207570, 92466, 111492, 84892, -170508, -315836, -122665, 90572, -36520, -157312, 184125, 106129, 102812, 376479, -120792, -4763, 48629, -105094, -91789, -324419, -177325, 41079, -15716, -18934, 19178, 100390, -208894, -55646, 10460, -76250, -11759, -371130, -272186, 125198, -106899, 57250, 13616, 117269, -26524, -123437, -219081, -136131, -164822, -242219, -172861, -62205, -310242, -210304, -104771, 14824, 10047, -184741, 181215, -338899, 153752, -220607, -241450]
19422b41450G3315f8706n1591a2820o6418k62846o1933A17301f5232p3545O2026
19411g6751k40483a55152m2929C42218A41894i445k36336N5343l444d2422j82215
19400b24637B8328a5083k81768G5789c59221i8027k92128O8146M8333A99269e6912
19388A85920b11934b2890L490A45426a64530Q890A425Q701e4576J9591A66644
19376a93521e0891E8832M158f443j01923H4974J74131c81184J01583F14N5568
19365E6182b21212c4734l0027j2590F9972b1738A19852b88475c0497j25063n1956
19354b07516i9135G562d81450a97290A07777l4639a1765j18054L4315A30234J9278
19343A49512a87839A81787n1847E9463c25962K9709e9454G745f9908A61826a28429
$$ y = [-241450, 73315, -68706, -120297, -12820, -79238, -342084, -404017, 117301, -65232, -138777, -76751, -317234, -155152, -198081, 342218, 141894, -9445, -245781, -190438, -193882, -42422, -224637, 28328, -15083, -296851, 75789, -359221, -98027, -390155, -322009, -273676, 199269, -56912, 185920, -211934, -22890, -19400, 145426, -164530, -155640, 1425, 10126, -54576, -34985, 166644, -193521, -50891, 58832, 62990, -6443, -108366, 84974, 259105, -381184, -279601, 614, 56182, -221212, -34734, -64761, -77351, 69972, -21738, 119852, -288475, -30497, -155560, -207516, -99135, 7562, -481450, -197290, 107777, 73138, -11765, -129819, -95504, 130234, 149512, -187839, 181787, 129940, 59463, -325962, -296253, -59454, 7745, -69908, 161826, -128429]
19331A05445b11995a01054d7465C84759b04910A34250f4439C6126d606j63439
19321a68045N8441j00790B97579i3280A3315a72964j03153A52499i1281J4451
19311g6830K3245j06157A36049C2244a11769r575K4338j29006A52014C8907g6107
19299A13590J41303g3585j24061a246C4690e4092j01584K7992A09672e8648b4186
19287a5157l45079C62574b52009e6841n0143j29292M8790d8405A48220a6010B0775
19275e1846o1550B9496a24562E7554B5911a87357h6975l2254c8497A02518A3597
19263B22923a14586o1270J7757m4839B07160a07058n2670m7658g1341A03731k0782
19252H2949d5411a683B24147e2385i401j28329B96050O753a84161E8261B2090
$$ y = [105445, -211995, -101054, -47465, 384759, -204910, 134250, -64439, 36126, -4606, -168045, -109604, -210394, 297579, -93280, 13315, -172964, -276117, 152499, -91281, -76830, -53585, -159742, 136049, 32244, -111769, -121344, -97006, -226012, 152014, 38907, -76107, 113590, 254893, -73585, -197646, -1246, 34690, -54092, -155676, -127684, 109672, -58648, -24186, -15157, -360236, 362574, -252009, -56841, -106984, -236276, -187486, -48405, 148220, -16010, 20775, -51846, -113396, 29496, -124562, 57554, 25911, -187357, -86975, -119229, -38497, 102518, 13597, 222923, -114586, -175856, -158099, -202938, 207160, -107058, -159728, -207386, -71341, 103731, 82949, -45411, -1683, 224147, -52385, -9401, -137730, 296050, 302803, -184161, 58261, 22090]
19240i1472N795A9028a59396I9344b26657E5515c0439j47581r9220a00689J1924
19229h8765j16294K1315B21078H1435a62864M0100j96567Q2851i8502M3585k22355
19218b77272B65331c5557k02462d918j71314B18894b88387J5813A29246b60277
19207a18257d2089I1555d34570b14935C78239b35994b0531j43228J8199A52853
19196d3757k64765J51006j73011A17765O1245a0254D2663a87427B18383D069b06610
19184e538k08310M7793C6119L776j2739e2766l58846B1111K18266m0522i255G1164
19171g9238A370a27451c5828r5214i461j61692f7215A3920b46912j36506A02168
19159f8663k9828k16778B07255E2671B1250e913n4505r4332F5794a47997B42756
$$ y = [-91472, -85677, 19028, -159396, 99344, -226657, 55515, -30439, -178020, -277240, -100689, -88765, -205059, -183744, 221078, 81435, -162864, -122764, -319331, -236480, -98502, -54917, -277272, 265331, -35557, -238019, -4918, -176232, 218894, -288387, -272574, 129246, -260277, -118257, -42089, 91555, -434570, -214935, 378239, -235994, -20531, -163759, -145560, 152853, -43757, -308522, -157516, -330527, 117765, 179010, -10254, 42663, -187427, 218383, 4069, -206610, -5538, -213848, -166055, 36119, 39895, 27156, -52766, -411612, 21111, 239377, 198855, -9255, 71164, -79238, 1370, -127451, -35828, -131042, -9461, -171153, -67215, 13920, -246912, -383418, 102168, -68663, -98491, -315269, 207255, 52671, 21250, -5913, -60418, -154750, 65794, -147997, 242756]
19147i1226K4829M525N469k71542A73375a57840j1987B50821A09572a33405I1736
19135b1489p8856k64258J64434A29893b877j43599m1559O5012A27179b68258P1252
19124a97006A85799i3370B16708E5421h8658j40957J03221C6682c3047j06192
19114a39239J7949G932M08404d043B9784a25791e2863j57252H8974J71170a58314
19102a73906O8358M2287r6794B64289F2858b04929A43033j8980D1789e8418A24555
19090e0802m4258A20899h564A33556L6212F7124l2693d7142A910M3753M3255b50171
19077e3548A18794f1412F0502A4626g9760A70215a35227L4374m79A61887a51244
19065f5105m494j1182G4755q888k5211b32567g0207j91812A22570a2540k82063
$$ y = [-91226, -66397, -61872, -56403, -327945, 173375, -157840, -169827, 250821, 109572, -133405, 91736, -21489, -100345, -364603, -200169, 129893, -2877, -146476, -188035, -123023, 127179, -268258, -197006, 185799, -93370, 216708, 55421, -88658, -229615, -126394, 36682, -33047, -139239, -121290, 7932, 416336, -4043, 29784, -125791, -52863, -210115, 88974, 260144, -158314, -173906, -105548, -63261, -160055, 264289, 62858, -204929, 143033, 124053, 41789, -58418, 124555, -50802, -95060, 120899, -8564, 133556, 169768, 67124, 34431, -47142, 1910, 45663, 88918, -250171, -53548, 118794, -61412, 60502, 14626, -79760, 170215, -135227, -100853, -101332, 161887, -151244, -65105, -69599, -80781, 74755, 65867, 40656, -232567, -70207, -262019, 122570, -12540, -294603]
19054b94603B52224j0733A6980b09865A65063L0634a53414F1992i7231K9942c895
19042A56036P0760b12815Q0982B00772c97534A65012o9850i4311r4368C82478
19031E18J99577b68823a10844A29955a01440l8439e5300m0346G0656M2576O459
19020A19691E3168a4320A0084J58355m3177b70981i6628l4521D2318d6944J2849
19009c4095j27752D7689J43951A1236b01075c1698k75325A69056E792K90043d4348
18997I0005g426B37506b56032H9340e6086n4510j4465l90467A45331n2973b0029
18985G1320a67249A4655c87368g7897A10298E0701a23677N9832F8627N9597M0642
18974A68866L31365o2992j46170O3088E601b71354L8310h3964p8865B09445a33295
$$ y = [-294603, 252224, 241491, 16980, -209865, 165063, 195697, -153414, 61992, -97231, -67289, -3895, 156036, 226796, -212815, -131833, 200772, -397534, 165012, 95162, -94311, -188679, 382478, 518, 200095, -268823, -110844, 129955, -101440, -139879, -55300, -95646, 70656, 113232, 119691, 53168, -14320, 10084, 168439, 125262, -270981, -96628, -131149, 42318, -46944, -34095, -161847, 47689, 191640, 11236, -201075, -31698, -307023, 169056, 5792, 295835, -44348, 90005, -7426, 237506, -256032, 89340, -56086, -110596, -125061, -515528, 145331, 92358, -20029, 71320, -167249, 14655, -387368, -77897, 110298, 50701, -123677, -63845, 68627, 128224, 168866, 500231, 437239, 291069, 354157, 5601, -271354, -233044, -83964, -162829, 209445, -133295]
18962C04862b23626i3455a2011E0770a62477B06780p9665e6135D7119K6473b87978
18950C4229J15216O7166n482c25645A51990m0499f1825l5369A6523J29931a56183
18938g4781H6583a69322E2245O0480N5870n1484a61481k47387a72671E4939b45972
18926b6219m7579A37239c71512J56693B8131R5523k7007e0455j86454A84056i8216
18914b05610f486k94312B90376k8316J72899P1999A37534D7047K1380b70135c951
18902B24968B9908J0956M2393a74767B33599a80073n3743J5210B11491a31490
18891b14641N6326D4355b6595F0372P7317c76581E785d37372D6702a16245j46508
18880b62753B29298i9789D04586a99374b9728j4993k97518a43746r7803A86538
$$ y = [304862, -223626, -93455, -12011, 50770, -162477, 206780, 127115, -56135, 47119, 73592, -287978, 34229, 149445, 216611, 211129, -325645, 151990, 111491, -61825, -97194, 16523, 146454, -156183, -74781, 86583, -169322, 52245, 112725, 168595, 117111, -161481, -408868, -172671, 54939, -245972, -26219, -73798, 137239, -371512, -214819, 28131, 123654, 96647, -50455, -236909, 184056, -98216, -205610, -6486, -300798, 290376, 262060, 434959, 506958, 137534, 47047, 68427, -270135, -3951, 224968, 29908, 40864, 83257, -174767, 233599, -180073, -233816, -218606, 211491, -131490, -214641, -158315, 44355, -26595, 60372, 137689, -376581, 5785, -437372, 46702, -116245, -262753, 229298, -99789, 404586, -199374, -29728, -44721, -342239, -143746, -241549, 186538]
18869A41996a15106E5749c2551R128j40228j11143d0256p1762d6960j94896Q0480
18858a61376A03912b15979K1251E8918A1585d05615b6446A55605j5908K07D2152
18846a52745P3593q2030j30705B09171b21003q4469D7196c2803I3757a04279J5689
18835h8590q783l5012c4635o41392B1525e6152A67190p9318J0017b23418k4940
18824b48358R9064B4750d39626d553k9083J3215j52911h2635B40621b7537C4141
18812A94069a88613C36516D0269J75298l113q7556a29263A37869K4317L6241A8707
18800A31575g0665j12751h1506E973b17621a5648B36589J46541a32474B8964a13853
18788b02231a00844B43098a88905l4495A27343a62205C6365b92080C3396i0048
$$ y = [141996, -115106, 55749, -32551, -23423, -163651, -274794, -40256, -112018, -46960, -241856, -161376, 103912, -215979, -194728, 58918, 11585, -405615, -26446, 155605, 139697, 139904, 42152, -152745, -79152, -161182, -291887, 209171, -221003, -305472, 47196, -32803, 93757, -104279, -88590, -97373, -132385, -34635, -676027, 21525, -56152, 167190, 87872, 97889, -223418, -248358, -149294, 24750, -439626, -4553, -33636, -20421, -173332, -82635, 240621, -27537, 34141, 194069, -188613, 336516, 40269, 215567, 212454, 124898, -129263, 137869, 162186, 198427, 18707, 131575, -70665, -183416, -81506, 5973, -217621, -15648, 236589, 383130, -132474, 28964, -113853, -202231, -100844, 243098, -188905, -223400, 127343, -162205, 36365, -292080, 33396, -90048]
18777b14867P4285A06378a4948k8589k0897q0943G6015K06274F2221f9441r6404
18766a65845m609O0935l074j07204Q2280f5026k34915M2978a2500C3835a99871
18754E7686L2362b02221c9594O494k80975L8000g4143j2947j51314F1190J07260
18743A68450A7705b2676r2316N4720K6412k21355D91a65763g459C2244c2262k14449
18731b46711p6152A74870b34531A06123j7362i6802G3494P2091g1417A41794E806
18719a07793j30484O4433H169P9761b0308k58158N4055r8317g7107p0419M6790
18708a00736D4886J11204a88690f8734A83509B1268b11621B49396b4993j23543
18698a48536j08196j38278F5398J60834G8631h4451L9198A58268c16862H5106
$$ y = [-214867, -140582, 106378, -14948, -43537, -64434, -145377, 76015, 282289, 62221, -69441, -165845, -170454, -109519, -112593, -219797, -137517, -65026, -299941, -256963, -12500, 33835, -199871, 57686, 90048, -202221, -39594, -33100, -314075, -276075, -74143, -87090, -238404, 61190, 168450, 17705, -22676, -114992, -60272, -33860, -255215, 491, -165763, -7459, 32244, -32262, -246711, -322863, 174870, -234531, 106123, 88761, -96802, 73494, 145585, -71417, 141794, 5806, -107793, -238277, -173844, 8169, 87930, -20308, -278466, -224411, -322728, -77107, -147526, -100736, 44886, 156090, -188690, -68734, 183509, 21268, -211621, 249396, -24993, -148536, -256732, -395010, 65398, 226232, 78631, -84451, -45253, 158268, -316862, 85106]
18687F3066b9951D7244a79559D5784F90c1525l59870H0954c66616e8419b6338
18675b5229j02631J7397N4489k90961A30995A2730J42437J3023b24655b0960B5723
18663B74521f1393j26813P5963L5812A1487g542E2157b33548A83080g9048l6285
18652a15333B22814p8058i403C758b01650R3247A52065g0372G8528a70213a1314
18640b19689J9155B29552a09497n8798m9109B57864E1894J14085a13341k77902
18630c91243a21118A08238e8527l44037b8346C80184j86915d3793j03549j71708
18620c19050D2923J75295d5599N208A51971b81439a02716j72694L4065I1747I191
18608a96592O3572f4385A81922k5005a46897M0620A23615a4853C2919a98583O4438
$$ y = [63066, -29951, 47244, -179559, 45784, 690, -31525, -391395, 80954, -366616, -58419, -26338, -25229, -127860, -110463, -55974, -346935, 130995, 12730, 155167, 168190, -224655, -20960, 25723, 274521, -61393, -188206, -112243, -76431, 11487, -7542, 52157, -233548, 183080, -79048, -115333, 222814, 144756, -9403, 3758, -201650, -108403, 152065, -70372, 78528, -170213, -11314, -219689, -200534, 229552, -109497, -168295, -217404, 257864, 51894, 165979, -113341, -391243, -121118, 108238, -58527, -402564, -28346, 380184, 193269, -43793, -147342, -319050, 42923, 218218, -45599, -40391, 151971, -281439, -102716, -275410, -241345, 91747, 9191, -196592, -133020, -64385, 181922, 156917, -146897, -106277, 123615, -14853, 32919, -198583, -134145]
18597a34145J0426m6657F3990a17969J7318J3760N511H9748a02947A06761c32895
18585g8112A36179I343d1808m4726m4536j69320a08938F7482O2228I861J0996
18574B0857a36782G6010a18033k09890J40701j2504k8523e5842n8523m2587J3768
18563a43184A17255b52277A15561D7338a55590A24468l7828b56110A28999e5501
18552a84715A52106a18649M6238k3393l4047E449L877J26565a54778q6250i8699
18540A81053q6166b9672F9884h625a288F3204J67852a97933Q6845p5486A5387
18528A61915b93821F1525b0104F396a31601A97031a57821g1444a6630k684l7137
18517e6451E0280a58689j04666P5807A03038i3406j75556Q0278B27074c3748q8433
$$ y = [-134145, -123719, -170376, 63990, -117969, -100651, -86891, -81380, 89748, -102947, 106761, -332895, -78112, 136179, 9343, -41808, -86534, -131070, -300390, -108938, 67482, 129710, 9861, 20857, -136782, 76010, -118033, -327923, -187222, -199726, -228249, -55842, -114365, -156952, -143184, 117255, -252277, 115561, 47338, -155590, 124468, 86640, -256110, 128999, -55501, -184715, 152106, -118649, -72411, -95804, -129851, 5449, 9326, 135891, -154778, -241028, -98699, 181053, 94887, -29672, 69884, -8625, -1288, 63204, 231056, -197933, -111088, -186574, 15387, 161915, -293821, 61525, -20104, 6396, -131601, 197031, -157821, -71444, -16630, -19314, -56451, 50280, -158689, -263355, -187548, 103038, -93406, -268962, -188684, 227074, -33748, -122181]
18506a22181L8669K7182A1848a7049l5627J9930G8509P3702a04757j50220j56144
18495d11121h8741o3534A23013c54346D9939a6017l19325D504a00521A3016K7996
18484D1012c8320I8487i7124A15072M4265c383p4409C4597b16179B17189a53301
18472b69240B7883d0354j74876b0388k26563M3313C3866d18213a55112k4364d8889
18460c35740e6718a5466j30040r2759e9352m47914J49593L852d2282G4659c33727
18448a45351C37084D8106A1934a24442A7018J17145a57381L9742G3198j1305O6065
18437A27958a2548n2276A61176n9246d925C1947f1797a081o5833A86865c52676
18425h4375q2611k12096a31873J5013B62110E1718O820e5646j41248B78623q839
$$ y = [-122181, -83512, -56330, 11848, -17049, -52676, -32746, 78509, 152211, -104757, -254977, -411121, -88741, -152275, 123013, -354346, 49939, -16017, -335342, 4504, -100521, 13016, 41012, -38320, 98487, -97124, 115072, 159337, -3383, -77792, 34597, -216179, 217189, -153301, -269240, 27883, -40354, -215230, -20388, -246951, -203638, 33866, -418213, -155112, -179476, -48889, -335740, -56718, -15466, -145506, -238265, -59352, -507266, -357673, -353821, -42282, 74659, -333727, -145351, 337084, 48106, 11934, -124442, 17018, 134163, -157381, -117639, 73198, 61893, 127958, -12548, -64824, 161176, 101930, -4925, 31947, -61797, -1081, -66914, 186865, -352676, -84375, -166986, -379082, -131873, -116860, 262110, 51718, 58538, -55646, -196894, 278623, 269784]
18414B69784b61192D0747a44254j22610B48814b41049F0931B7743A0589b64925
18403A91207h2932O272E0069M0068J00284J20301j13889f188n7833A47397p1385
18392G6012f0621m6297j15075L9050a9310G5736C2475a08768G1960J94763b19500
18380a35140k52634i6870A80767E9025g6138k04042F8312b42897I4386c08894
18369A21269b19068A56496c9317a1902l47109a27331K3909A40823b16395A02763
18358a08535c3178A30751A2314a4467r6014E1284j0836j6189a55610j21445c6078
18346D7496c6713D9214c64970I7516k4420f9458B9257J66522D2750a02759F9145
18334A54454m6914h4681l0085J6639M4550j32010B731a90286G1738M2155B553
$$ y = [269784, -261192, 40747, -144254, -266864, 248814, -241049, 60931, 27743, 10589, -264925, 191207, -82932, -76660, 50069, 90137, 190421, 310722, 196833, -6188, -64021, 147397, 76012, -60621, -106918, -221993, -182943, -19310, 75736, 32475, -108768, 71960, 266723, -219500, -135140, -387774, -96870, 180767, 59025, -76138, -280180, 68312, -242897, 94386, -308894, 121269, -219068, 156496, -39317, -11902, -359011, -127331, -103422, 140823, -216395, 102763, -108535, -33178, 130751, 12314, -14467, -110481, 51284, 40448, 24259, -155610, -277055, -36078, 47496, -36713, 49214, -364970, 97516, 73096, -69458, 29257, 195779, 42750, -102759, 69145, 154454, 107540, -84681, -114766, -98127, -53577, -185587, 2731, -190286, 71738, 113893, 2553]
18322E0031c5997r510j19887a7895j53501b6893A85623g3225k4379G4470o3a52175
18309I0931J21123e0396L938j65624A22802h359n3024k12690J08932N441E371
18297e7195A11290k9679J37360c80221D3798J47416E417a88555A16397B4483c7343
18285b47605C8365c5098F1357k3361R58K7626C1105O3944h1152A00751a20039
18273d1488j04907F6254d2667A63151B6911K40890a17353A16788C4764i4049A62631
18261f2885E851K6178b10637a01471L504A00637g3285a9854j89478e784j59409
18250a65193G5394f852j55464p510L2074f6054K2231m5868j84576c9280B42967
18238a90617r0092g4192j5633K5098A66522m9322a25610b0132R504j3719m9734
$$ y = [50031, -35997, -45507, -165394, -17895, -171396, -26893, 185623, -73225, -97604, 74470, 74407, -152175, 90931, 212054, -50396, -46458, -212082, 122802, -8359, -61383, -274073, -165141, -159700, 5371, -57195, 111290, 81611, 218971, -380221, 43798, 191214, 5417, -188555, 116397, 24483, -37343, -247605, 38365, -35098, 61357, 37996, 38954, 66580, 31105, 95049, -81152, 100751, -120039, -41488, -146395, 66254, -42667, 163151, 26911, 267801, -117353, 116788, 34764, -94049, 162631, -62885, 5851, 32029, -210637, -101471, -97967, 100637, -73285, -19854, -209332, -5784, -165193, 75394, -6852, -162316, -169826, -137752, -66054, -43823, -89691, -274267, -39280, 242967, -190617, -280709, -74192, -89825, -64727, 166522, 117200, -125610, -20132, -10628, -24347, -74081]
18227g4081b7842j44522B8460i0820C8061e2247I9832d01891a71216P7848I1393
18215c97014B54496A2302L83060F5795q097a83231J2954a6552B55325a8516j7705
18204c6221A1896c92116J80227A7167a6676j10308Q822B15690a70501e7730I5159
18192B01100j1617a8521E1752j9506e12992a42893h276k0695k575q0118e0773
18180b17523h1257B46928f4224a3785A9554M9603d0459A09750P8827F4247L4185
18169I8432M4955f026A8628c48320A1996a01821c9696j98139A11691J16209g3829
18157h2763I0279a48494d8805B05220r5002e7102q8083j5883A22035a67948A87099
18145A39821A8525c6862H3180O435a247p9169j9128B99379c78114e8982C8274
$$ y = [-74081, -27842, -172364, 28460, -90820, 38061, -52247, 99832, -401891, -171216, -93368, 91393, -397014, 254496, 12302, 395362, 65795, 57698, -183231, -170277, -16552, 255325, -18516, -36221, 11896, -392116, -211889, 17167, -16676, -126984, -118162, 215690, -170501, -57730, 95159, 201100, 189483, -18521, 51752, 32246, -512992, -142893, -8276, -28971, -31546, -111664, -50773, -217523, -81257, 246928, -64224, -13785, 19554, 69157, -40459, 109750, 188577, 64247, 98432, 143387, -6026, 18628, -348320, 11996, -101821, -39696, -237835, 111691, 227900, -73829, -82763, 90279, -148494, -48805, 205220, 110218, -57102, -145185, -161068, 122035, -167948, 187099, 139821, 18525, -36862, 83180, 89615, -1247, -80416, -99544, 299379, -378114, -58982, 38274]
18133b25311E1870K71538f4151j28505C3462b87755J07835E4959a9258o8093L7447
18122d9904j12845c5606B00625r5212A0887d2470A4633J69769b7326j10325c5407
18110a22786F0527f4547m0915B8033J0491a49524A37563d4165B4705a03212A04866
18098a23579A51380a33648H7358l7411b18644R4278c2529j45174C95616D9908
18087E273K9179J14736f6960a3911C33114d0681j50803g679p8555O139N387A11367
18074H3451J15072d54373c5813j40813B8569a78385A52047J68354m1858c5162
18063c04279B17041O5291I2248d7758j23408A42085J71395a19748D9097a46268
18052a91490F6715O36119a84187D0241J11517J1434n0869J85158k5989a16166
$$ y = [-225311, 51870, 323408, -64151, -192656, 33462, -287755, -179920, 54959, -19258, -87351, -49904, -162749, -35606, 200625, 105413, 10887, -42470, 14633, 184402, -27326, -137651, -35407, -122786, 60527, -64547, -105462, 28033, 38524, -149524, 137563, -44165, 24705, -103212, 104866, -123579, 151380, -133648, 87358, 49947, -218644, -124366, -32529, -177703, 395616, 49908, 5273, 34452, 149188, -66960, -13911, 333114, -40681, -191484, -7679, -86234, -80095, -74708, 111367, 83451, 198523, -454373, -35813, -176626, 28569, -178385, 152047, 320401, 278543, -35162, -304279, 217041, 282332, 92248, -47758, -171166, 142085, 313480, -119748, 49097, -146268, -191490, 66715, 702834, -184187, 40241, 151758, 163192, 112323, 297481, 271492, -116166]
18041i6521p7713j1325E8832b87143I4348c447C29589A32405a08003C8015c9073
18029b40214o8399a0347q5370l528n3307B0056J1469g9026o1362k2693H0900j8742
18017F2158c5278n2947A92515b35636d8072A75463b32701P4580O010A23090D1922
18005d3551k12881M291A45664a83919E3077b22426A99411a75240B64823c36090
17994a07682B15384b10050A12144J04278H8373J81884b01102C71386a4712A50876
17983B34182D8046L6306D0052a84158D5356j7494h3266b8713C12414B8892a00462
17971A51339C912h774n1970j44147B295g5493k6083K5383F2453B0875a3449F6919
17958A51735J20032a79405A08882M7223b07242g8387b7677l7757a4062G8970J64703
$$ y = [-96521, -174234, -185559, 58832, -287143, 94348, -3447, 329589, 132405, -108003, 38015, -39073, -240214, -308613, -10347, -95717, -99245, -152552, 20056, 31525, -79026, -140388, -163081, 80900, 62158, -35278, -88225, 192515, -235636, -48072, 175463, -232701, -158121, -152111, 123090, 41922, -43551, -256432, -252141, 145664, -183919, 53077, -222426, 199411, -175240, 264823, -336090, -107682, 215384, -210050, 112144, 216422, 88373, 270257, -201102, 371386, -14712, 150876, 234182, 48046, 84352, 40052, -184158, 45356, 27862, -83266, -28713, 312414, 28892, -100462, 151339, 3912, -8774, -60744, -204891, 2295, -75493, -101576, -76193, 62453, 20875, -13449, 66919, 151735, 271767, -179405, 108882, 156105, -207242, -78387, -27677, -65434, -14062, 78970, 243673]
17947B43673e5014A48157a06656d8398C20760C9272A0227c09055N5954o1391J11288
17936b03204A9272J38950c5544P416j46565I4245a12997L7210A04715a88432K2568
17925a65864D84521A83394b5224j4691j02719F7546O2363P8930b96282d6840j74345
17914b21185P9859A3922i8652q9959K8728G5705A3951J2308J0238e2950E6574
17902A51453b16911C53796h1384E1775b6709a0414A88789G0549O2093K1420d6325
17890B53274i6759k767j38093c6009j37436A68605a00642A45415b4289r6616A86571
17878a17949H0283a98201C20502b0784j11855c8465G7537D405i7294p746F22355
17866A66441J39922f4622B99674a98048j17288c0155n3815F9212d66A83930e2483
$$ y = [243673, -55014, 148157, -106656, -48398, 320760, 39272, 10227, -309055, -253101, -314492, -203204, 19272, 158222, -35544, -28128, -174693, 94245, -112997, -75787, 104715, -188432, -165864, 484521, 183394, -25224, -39915, -142634, 67546, 129909, 208839, -296282, -46840, -221185, -141326, 13922, -98652, -188611, -159883, 75705, 13951, 26259, 36497, -52950, 56574, 151453, -216911, 353796, -81384, 51775, -26709, -10414, 188789, 70549, 132642, 154062, -46325, 253274, -96759, -99526, -237619, -36009, -173445, 168605, -100642, 145415, -24289, -120905, 186571, -117949, 80283, -198201, 320502, -20784, -132639, -38465, 77537, 4405, -97294, -105040, 622355, 166441, 306363, -64622, 299674, -198048, -315336, -30155, -83970, 69212, -466, 183930, -52483]
17854H4847A716a05668j8489A31196i6116B36353c1733A90881k0131c4916A36671
17842A49018k6700d5312j05675L9807j5159K6622D6312M785a39145B0543a21944
17830e8499I6934l8587b02750B43870f7220a3874k36780A66118a1480I3742a73025
17818a02644A18046n3367B3883Ei542n5598b8256C29264A49093g1598j26400e8792
17805F8978M7945J79802B0947i9339j4361G2790K11344A2661a50093F4485a97135
17793a83448G2038J60787D2226J31494K0155E7131K97444A01895K18338l5665
17783B84568L3560E5892J1069k3380H853h5611B49168o0595h5194p258C92432
17771B8347J90824D2976c08789A39077D7756L1879i3464a8352k5923j1060A22606
$$ y = [84847, 1716, -105668, -124157, 131196, -96116, 236353, -31733, 190881, 170750, -34916, 136671, 149018, 122318, -45312, -150987, -111180, -126339, -99717, 46312, 51097, -139145, 20543, -121944, -58499, 96934, 58347, -202750, 243870, -67220, -13874, -250654, 166118, -11480, 93742, -173025, -102644, 118046, 64679, 23883, 5, -9542, -65140, -28256, 329264, 149093, -71598, -197998, -58792, 68978, 116923, 296725, 20947, -99339, -113700, 72790, 284134, 12661, -150093, 64485, -197135, -183448, 72038, 232825, 42226, 173720, 193875, 57131, 354575, 101895, 320233, 284568, 318128, 55892, 66961, 43581, 8853, -85611, 249168, 188573, -85194, -92452, 392432, 28347, 219171, 42976, -308789, 139077, 47756, 79635, -93464, -18352, -44275, -55335, 122606]
17759b72844B07097H9301J28696o2645N9085o1662m2430b569l9379F0481g6989
17747B19706e4565B02733K09351b86535F4661J75052b7980l7557Q068F6083J00384
17736A66467J46702b2524j55313B31340b24252F2524e196A91658D5372r871Q0851
17725A16352a97961A9828J1098P8359K84884E1401I709K28718p8918E1707J62630
17714B14337Q1133E2737L1088d3591A01515a24771l0612a8989m4135j31789r4361
17703b89274f9397B8595L07179A56166m7312I439O6941A824d3509n7839G3575
17691D5532j9570j0244c77792D19457C9104K11332p4011a41384C3077J86313o4995
17680A54395M3385J41482H0523J36042c6513j37258g9268I9299a85759I7539L3175
$$ y = [-272844, 207097, 89301, 217997, 155352, 214437, 152775, 110345, -2569, -41948, 60481, -76989, 219706, -54565, 202733, 412084, -286535, 64661, 239713, -27980, -65537, -57469, 66083, 166467, 313169, -22524, -177837, 231340, -224252, 62524, -5196, 191658, 45372, 35501, 116352, -197961, 19828, 30926, 109285, 394169, 51401, 9709, 238427, 159509, 51707, 214337, 295470, 52737, 83825, -43591, 101515, -124771, -155383, -18989, -63124, -194913, -289274, -69397, 28595, 335774, 156166, 108854, 9439, 76380, 1824, -43509, -101348, 73575, 45532, 25962, 15718, -377792, 419457, 39104, 250436, 176425, -141384, 33077, 219390, 154395, 197780, 339262, 80523, 216565, -36513, -173771, -79268, 99299, -185759, 97539, 130714]
17669A30714Q8098a66550g8359A85665M5654N1840m9208A15949m4529c3397A71107
17657A85084a06309L3708j17554B94660A33267A9016K06134J6101i963B77840
17646A59463n9027j0555O8229G4553M7775C1216L5422c8384H2222l2667b3143
17634B57788b3246A35095m7591k776J13740c7405G2080J13009L13582A91484J06207
17623B97691b6649C21957j01842c3007j48949C01754A37825a77743A19897c2366
17612D03332a00913B44253D6425F043J27251a07730B61805B8578a94014A39562
17601B90685A20847M3428J5001C25c1210B07733a44666m11253A10461R7556a2031
17589C89268A08K97787a6899A77376m1013a59706E2865K87114a51202G7186a11142
$$ y = [130714, 218812, -166550, -78359, 185665, 231319, 283159, 233951, 115949, 71420, -33397, 171107, 185084, -106309, -72601, -190155, 294660, 133267, 19016, 225150, 241251, -9963, 277840, 159463, 100436, 89881, 158110, 74553, 122328, 31216, 66638, -38384, 82222, 49555, -23143, 257788, -23246, 135095, 87504, 84728, 198468, -37405, 72080, 185089, 498671, 191484, 297691, -26649, 321957, 220115, -33007, -181956, 301754, 137825, -177743, 119897, -32366, 403332, -100913, 244253, 46425, 6043, 133294, -107730, 261805, 28578, -194014, 139562, 290685, 120847, 164275, 179276, 325, -31210, 207733, -144666, -555919, 110461, 208017, -12031, 389268, 108, 297895, -16899, 177376, 136363, -159706, 52865, 339979, -151202, 77186, -111142]
17577A66586p9049M2565D0239J57112q2553K74881b07365A8857d1771D7195J9679
17566F6874A6061M8307f4014A19744J8493O5409M0127C8423K33370g2292A53995
17554D8817K69529j00881G002K34302a68255B30010l5867a06064B91440K0233
17544C11673F2930k1894L29328H1696e626C06783e6480h777C89440k3340A00009
17532C19814b4965B18385O5442h4705A96734J04599J35829L00871k50282L01391
17522G89142J54394l11489K50175A93231J19471n9402J56922j00229R1437j17060
17512B84370j29033K62957J18508j1203K23195k05591l2038P867k56836M0101
17502C02297M148m9299d3770A22550L2270J24514J907G9695J77779n4584I3167
$$ y = [166586, 87537, 130102, 40239, 197351, 114798, 389679, -207365, 18857, -41771, 47195, 66874, 16061, 64368, -64014, 119744, 138237, 203646, 243773, 38423, 271793, -72292, 153995, 48817, 318346, 217465, 7002, 241304, -168255, 230010, 194143, -106064, 291440, 311673, 62930, 41036, 370364, 81696, -5626, 306783, -56480, -8777, 389440, 366100, 100009, 319814, -24965, 218385, 283827, -84705, 196734, 301333, 437162, 738033, 487751, 789142, 943536, 632047, 882222, 193231, 312702, 253300, 410222, 309993, 401430, 284370, 155337, 418294, 536802, 525599, 748794, 543203, 511165, 519032, 262196, 302297, 306445, 257146, -43770, 122550, 154820, 279334, 281241, 79695, 257474, 202890, 93167]
17490A27948K46338A49973J74300L7047A63461D2766K38006q4556B9563J34057
17480A63620Q7909r6417g9648b4307I578J42516J47619j19656j636J34521l6878
17469B76064A18802L42691H4776K49044A2710J43723b1859A41292J40737A17661
17458A83915Q5883J83787c1066D97486B27266p239k2755J94003O3085A22673L90771
17447E13444k43551d6150E42308k69901J36627J6943Q3669B07950K36463H4152
17436I9392A1247K39063J02187j45718K22900j83109o1616L16709a79913D70183
17425C36500N4296j49536K1270g269B41256F6540H081J67669J43152J4540r2092
17414B41350M38656k76550n9924J28958A65085O3137J79164j76497O7902O5626
$$ y = [127948, 374286, 149973, 324273, 361320, 163461, 42766, 280772, 196216, 29563, 163620, 251529, 155112, -79648, -24307, 9578, 152094, 299713, 180057, 178421, 312942, 276064, 118802, 461493, 84776, 333820, 12710, 156433, -21859, 141292, 282029, 117661, 183915, 269798, 453585, -31066, 497486, 227266, 220027, 197272, 391275, 454360, 122673, 513444, 269893, -46150, 542308, 272407, 409034, 425977, 509646, 207950, 444413, 84152, 99392, 11247, 250310, 352497, 206779, 429679, 246570, 184954, 501663, -179913, 470183, 336500, 390796, 241260, 262530, -7269, 241256, 66540, 8081, 175750, 318902, 333442, 241350, 680006, 403456, 343532, 472490, 165085, 228222, 407386, 230889, 298791, 364417]
17404C64417A54110K72508r9392C3384J93893p6315J01631m7878K27113j80553
17394B51275o9583K76566A05405D6131K62869j4680j20580J47193E4618A9472
17383C11166Q5998j19542j35975l5631J39768m7962a84178D11626h7954B57475
17372f972E665J01945M9785K3558K30244A26866A2753J54876p0682J88185l5185
17361B49947A22060N16891b35938H7167K22111O9650j11754r3071K37585B5845
17350D377J84075K13256b290A42273E0411J36532g0079j5196D80488j27234j0347
17339C42907k7871p4858b3540n0601H6687J08585n8794K20773e7216B65946n4276
17328B11670K07804F0446L42939A62541K08780j82575K52609A18847J03431k7705
$$ y = [364417, 154110, 426618, 327226, 33384, 227277, 150962, 252593, 204715, 431828, 251275, 181692, 458258, 105405, 46131, 309000, 294320, 173740, 320933, 54618, 19472, 311166, 397164, 277622, 141647, 106016, 245784, 197822, -184178, 411626, -87954, 257475, -6972, 5665, 107610, 157395, 180953, 411197, 126866, 12753, 167629, 96947, 285132, 249947, 122060, 638951, -235938, 87167, 309278, 378928, 267174, 174103, 411688, 25845, 4377, 188452, 401708, -2290, 142273, 50411, 186943, -70079, -85275, 480488, 353254, 342907, 315036, 240178, -23540, -74141, 86687, 195272, 136478, 357251, -57216, 265946, 211670, 419474, 60446, 403385, 162541, 371321, 188746, 441355, 118847, 222278, 194573]
17318A94573N7468J57191P4756j26486O0813k06462G9666J3906M65357k13987
17308C44942l6791N9374R4878H7472L5935D4590J65345N3067r2431J03789B9961
17296C55948j17053m5367o5092J06812J77391n4373K6989R75K32680p6217k56043
17285B86650A1823J15675M08923B49804A24078J13309J50042A80792a37428B03501
17274D22859L1867F6575K23756j14224J7907Q8830P1392j02138j2907j6551B6986
17262I4672J73415J19962j10469Q7753F2716K64477L064A13881M459M5306J66759
17251C30405A09112M14033A89456r0298j9099Q5313p0859L42864d981C03241J04959
17240D08200p0783O4123J17064l9816l9091d1702C54167P8399L4481j68270M868
$$ y = [194573, 252041, 409232, 483988, 357502, 418315, 211853, 79666, 93572, 558929, 344942, 308151, 367525, 462403, 87472, 123407, 44590, 209935, 263002, 170571, 274360, 29961, 355948, 238895, 193528, 128436, 235248, 412639, 358266, 385255, 386230, 618910, 542693, 286650, 11823, 127498, 536421, 249804, 124078, 237387, 387429, 180792, -137428, 203501, 422859, 454726, 66575, 290331, 176107, 194014, 282844, 354236, 252098, 239191, 222640, 26986, 94672, 268087, 388049, 277580, 365333, 62716, 327193, 330257, 113881, 118340, 163646, 330405, 109112, 523145, 189456, 99158, 80059, 165372, 94513, 437377, -4981, 303241, 408200, 337417, 401540, 518604, 478788, 439697, -41702, 354167, 432566, 467047, 298777, 303645]
17229C03645n7324K04379I4492H068K81460q4492J80115m0935J63529j85625j9234
17218C02886f4525B78909K53235k24488J61220A11308J63951L0568H072K538O34445
17207F45055k01967J02017m1677k9731j46101l7236J496K02256B03688L85156
17197E88844B69730K37438j48198K25301B58413K55566J8709j89154r5573J3496
17187B61457K92149k31585J12275r3247M3539j16927N43238C87593N6142j47411
17177B96324K08875l3828A94958M14351k42769L3236J88211A17413M69559A34626
17166B49706L54726j09658l2791J16974B04443K95984j17274o6529R7459J14954
17156E29037j37163l168J81513j89608M04355C20768J4712K32131j36681K47351
$$ y = [303645, 246321, 450700, 94492, 8068, 289528, 205036, 385151, 344216, 507745, 322120, 302886, -64525, 278909, 532144, 307656, 468876, 111308, 275259, 305827, 8072, 10610, 645055, 443088, 545105, 503428, 473697, 327596, 290360, 291856, 494112, 203688, 588844, 269730, 507168, 358970, 584271, 258413, 513979, 532688, 343534, 247961, 261457, 553606, 322021, 434296, 341049, 384588, 267661, 810899, 387593, 443735, 296324, 505199, 471371, 194958, 609309, 366540, 399776, 587987, 117413, 586972, 134626, 249706, 604432, 494774, 461983, 578957, 204443, 500427, 383153, 316624, 414083, 529037, 391874, 388706, 570219, 380611, 784966, 320768, 335480, 567611, 430930, 678281]
17146F78281j20800A69478K84742k17003J36179K16323j38297B02524M71371j31524
17136E42371A78458J44851P0514G7061K96510O1657j24985L87473J9277B81441
17125C28142J02835J03347j145k02377L99626j07437j23684K09832j77285j9297
17115E12557L09341q7642j50570j76040M92115k85034j38991r4389K50504M1260
17105F73111O9701k68836O4418J41157o6862P2412o6178j67454K17170r2943J04410
17094F80106m3076k11079K51356J96791k78793K7275k7936j46914K26437j27222
17084E46945Q4389L38640k67997k35400L43200J44908p3982l3145j65882j76582
17074E05094J72266j48574M57180p9661l57631N1235L5726o9919M2458J02980
$$ y = [678281, 557481, 169478, 454220, 237217, 373396, 589719, 451422, 202524, 673895, 542371, 178458, 323309, 393823, 77061, 373571, 435228, 310243, 697716, 716993, 281441, 328142, 430977, 534324, 533179, 330802, 730428, 622991, 499307, 709139, 531854, 512557, 821898, 734256, 583686, 407646, 899761, 614727, 475736, 381347, 631851, 673111, 742812, 473976, 538394, 679551, 612689, 685101, 618923, 451469, 668639, 575696, 680106, 637030, 425951, 677307, 874098, 595305, 622580, 594644, 447730, 674167, 546945, 631334, 969974, 701977, 466577, 809777, 954685, 880703, 847558, 681676, 505094, 677360, 528786, 985966, 906305, 548674, 599909, 635635, 565716, 608174, 711154]
17064G11154O210J35133P8805j05324n9832m0607o6318p7535M03657k31579K45299
17053I99063m56901K02441J59146k16873O6803K22878l02200j0295j7394J9247
17043F65915J20164n1723j92459K48453K3580L4823N2034L5416m35537N06019
17033A006685l2868j8476j04607K90791j85533r7577k706M44843k80223J03233
17023A123562k14777J71564j52570j17548L23778j08549j8393j95026K67460k89209
17013G90292J99689j86897O266L95876r2733l5894q3714J49474l12222L59881
17003A190018l31611P04098j22418k62071J54169j91955K0182o1508j66424L36833
16993A269313j82296j26254J42570k68017P19893n25275J14362K28098l556k05138
$$ y = [711154, 717364, 852497, 931302, 825978, 766146, 725539, 659221, 581686, 985343, 753764, 999063, 542162, 744603, 903749, 686876, 753679, 976557, 674357, 664062, 646668, 665915, 786079, 734356, 541897, 790350, 813930, 848753, 900787, 936203, 500666, 1006685, 973817, 955341, 850734, 1141525, 955992, 858415, 855709, 1300552, 1020329, 1123562, 908785, 1080349, 927779, 810231, 1134009, 1025460, 1007067, 812041, 1079501, 790292, 989981, 803084, 809350, 1205226, 1112493, 1076599, 992885, 1142359, 830137, 1190018, 858407, 1562505, 1440087, 1178016, 1332185, 1140230, 1160412, 1098904, 932480, 1269313, 1087017, 960763, 1103333, 835316, 1555209, 1029934, 1144296, 1372394, 1368838, 1163700]
16983A163700J35157j77079J30891J29401p7546k30919Q8286L78747m04941N87622
16973A723319m30300K03613m3111J45937J77402q1831p7650J55975j04220k44350
16963A424784J44386n6967n783o6962K38794j29475L00509m21628J06637K99426
16953A833721l31604J18592J37608k13880N31749k78057J5890k92504J51171K19792
16943A892478j2315j24794K87429k67295K00481o2220R0366J3833j34086N5084
16933A938961K50124m33202O60327n88235K49219J58920j1268J03471k54825K56707
16923B330199l73882N12777J4323j82732O0657J84724k47836p4906K49798j25412
16913B347710J95585l20828K6881M94432k04194k35K29598J14155k13972P6644
$$ y = [1163700, 1298857, 1121778, 1252669, 1382070, 1304524, 1073605, 1161891, 1540638, 1135697, 1723319, 1293019, 1496632, 1453521, 1599458, 1776860, 1695029, 1617379, 1773354, 1669134, 1424784, 1569170, 1512203, 1506420, 1439458, 1678252, 1548777, 1849286, 1427658, 1534295, 1833721, 1502117, 1620709, 1758317, 1544437, 2076186, 1798129, 1814019, 1521515, 1672686, 1892478, 1880163, 1755369, 2042798, 1775503, 1975984, 1913764, 2004130, 2017963, 1883877, 1938961, 2189085, 1755883, 2416210, 1827975, 2077194, 2236114, 2224846, 2328317, 2073492, 2330199, 1956317, 2469094, 2483417, 2300685, 2361342, 2546066, 2298230, 2223324, 2473122, 2347710, 2543295, 2222467, 2249348, 2743780, 2539586, 2539351, 2768949, 2883104, 2669132, 2745776]
16903B745776k6557J19865R2414k10389L26466o4325K72059j44679k45972L24546
16893C189204k6863J41873q0294n0162L47639j09233r3674K68181k48378J95126
16883C533419K41615j00833J83319p5511k40648K7518J51803q2920K89788K51820
16873D179370n4350p911Q3947j99637L48238j53506k0444J92690J09492Q4417
16863D562306R500J27580o6904K36437K31270k78282p9321N55274L9085K10606
16853E547551j21301k70682M1146L99991L5722J7549L52956k96209K04052N58107
16843F468882k52993r1864K64003K15788l2693K01461m0404K22592L49611J09133
16833G413516k6664L18087l66831Q6395J23546N57281R7605N57002k91941L93229
$$ y = [2745776, 2719219, 2839084, 2931498, 2721109, 3047575, 2983250, 3255309, 3110630, 2864658, 3189204, 3162341, 3304214, 3223920, 3173758, 3521397, 3412164, 3318490, 3586671, 3338293, 3533419, 3775034, 3674201, 3857520, 3782009, 3541361, 3568879, 3720682, 3637762, 3927550, 4179370, 4125020, 4117109, 4201056, 4001419, 4349657, 4196151, 4175707, 4368397, 4477889, 4562306, 4571806, 4699386, 4632482, 4868919, 5100189, 4821907, 4742586, 5297860, 5336945, 5547551, 5426250, 5155568, 5196714, 5596705, 5632427, 5649976, 6002932, 5706723, 5910775, 6468882, 6215889, 6124025, 6388028, 6603816, 6571123, 6772584, 6732180, 6954772, 7304383, 7413516, 7386852, 7704939, 7338108, 7424503, 7548049, 8105330, 8202935, 8759937, 8467996, 8861225]
16823H861225J33234m3477L19381r1575L94509L25939J01124K47543N902L49727
16813A0603532M29544J14797j25463O09887l1504K07813K12159M34882K64368
16804A2720015N29167K79720r2116O16657L33412K35547N41251J1984R19612M1960
16794A6137209M19943J81527M47965M31830M98405O85313L33564O51313K27518
16785B0014587M07154P92534N37075N23663O15587O66488O38071L48291J125045
16776B5668495R12729M55894Q62650N76837O80867J188183P39615J375382O33500
16767C3094152J152679J247015P73116J493297O40127J653460J001504J389020
16759D2444370J552004J117456J545650J790049J102258J702527J333249J784621
$$ y = [8861225, 8994459, 8950982, 9270363, 9178788, 9573297, 9899236, 10000360, 10247903, 10253805, 10603532, 11033076, 11147873, 11022410, 11632297, 11600793, 11808606, 12020765, 12455647, 12720015, 13249182, 13528902, 13436786, 14053443, 14386855, 14622402, 15163653, 15175637, 16095249, 16137209, 16557152, 16738679, 17186644, 17618474, 18116879, 18802192, 19135756, 19787069, 20014587, 20421741, 21214275, 21751350, 22275013, 22890600, 23557088, 24195159, 24543450, 25668495, 26581224, 27037118, 27899768, 28476605, 29157472, 30345655, 31085270, 32460652, 33094152, 34246831, 35493846, 36266962, 37760259, 38400386, 40053846, 41055350, 42444370, 43996374, 45113830, 46659480, 48449529, 49551787, 51254314, 52587563, 54372184]
16751E4372184K044569J502308J828828J730005J957623J780655K060513K065761
16743F9342446J857101K249016J941596J337716K150837J948933J847249J881871
16735H4556765J395018J844145J807664J140173J366894J205354Q08099R34194
16727I5058306O83117M59151K72849O7661J82895m80077j54051p89519r18507
16718I4381825o49216j272465j160901j680093j185071j801639j513344j842729
16710H3276367j417602k266448k114566j650590j985027k023885j724045k207647
16702F7886557j836788k042244j634189j956795k157045j601281j586018j723531
16694E3348666j430532j575634j343159k015143j260728j453330j305796j187726
$$ y = [54372184, 56416753, 57919061, 59747889, 61477894, 63435517, 65216172, 67276685, 69342446, 71199547, 73448563, 75390159, 76727875, 78878712, 80827645, 82674894, 84556765, 85951783, 87795928, 89603592, 90743765, 92110659, 93316013, 94124112, 95058306, 95741423, 96200574, 96473423, 96541084, 96723979, 96243902, 96089851, 95300332, 94381825, 93732609, 92460144, 91299243, 89619150, 88434079, 86632440, 85119096, 83276367, 81858765, 79592317, 77477751, 75827161, 73842134, 71818249, 70094204, 67886557, 66049769, 64007525, 62373336, 60416541, 58259496, 56658215, 55072197, 53348666, 51918134, 50342500, 48999341, 46984198, 45723470, 44270140, 42964344, 41776618]
16686D1776618j376740r98713j421249j016401j412094n66663j244345j061615
16678C2678798n73969j388126o98855o51656r10731r69634p79380m95387n26122
16669B5684938o88151q23720n72778o93426l87510p85648m86520o08679o17812
16660B0020694J04540r96299l69439o84790l65783k60039m68883j70061l65749
16651A6444191o54204l23057k06061p2018o09388l49971j45121q9714q20160j3439
16641A3161058j25365l66304k75253r8442k39176n51517J42474m19929J03748
16632A1331294m56549m25225j66648k4147l40933L6675l91189J15300j57627l90476
16622I130475k01871J0716j04685K8747n86689J33563j1269m28698k42217J74902
$$ y = [41776618, 40399878, 39401165, 37979916, 36963515, 35551421, 34984758, 33740413, 32678798, 32104829, 30716703, 30017848, 29366192, 28455461, 27485827, 26706447, 26211060, 25684938, 24996787, 24173067, 23600289, 22906863, 22519353, 21733705, 21247185, 20638506, 20020694, 20125234, 19128935, 18759496, 18074706, 17708923, 17448884, 16980001, 16809940, 16444191, 15789987, 15466930, 15260869, 15188851, 14579463, 14229492, 14084371, 13994657, 13174497, 13161058, 13035693, 12669389, 12394136, 12295694, 12056518, 11505001, 11647475, 11227546, 11331294, 10874745, 10449520, 10282872, 10258725, 9917792, 9954467, 9563278, 9678578, 9520951, 9130475, 8928604, 8939320, 8834635, 8863382, 8276693, 8410256, 8398987, 7970289, 7728072, 7902974]
16612G902974M8055m52187k18689O2684j72604J73189m56705O7360j66200J3220
16602F801097j39556k44386j92741M66844m07504n0099M864k22329m8813l28484
16592E638893K35849j5971k31030j69675K17925n4254n55234M1504K6208k69719
16582D864496l7261N34959k89490k98674j22925m000K09117k41682m14518j9594
16572D180428M35399k14686K5838J74745n02236K40275j32629J34398m00320M9702
16562C990914Q0355k43087J82069m82287L25996l19633j6657R9307K67074k61910
16552C622141q2693L5582Q4770k54253J3632P4538l11459o0396R4220l13343M43167
16541C345906n8283K70769m47643j10364J6726r0639K7175n1388K74588k43643
$$ y = [7902974, 7951029, 7498842, 7280153, 7342837, 7170233, 7343422, 6886717, 6954077, 6787877, 6801097, 6661541, 6417155, 6224414, 6691258, 6283754, 6233655, 6238519, 6016190, 5967377, 5638893, 5874742, 5858771, 5627741, 5458066, 5675991, 5621737, 5066503, 5108007, 5134215, 4864496, 4827235, 5362194, 5072704, 4774030, 4651105, 4647105, 4856222, 4614540, 4200022, 4180428, 4615827, 4401141, 4426979, 4601724, 4099488, 4339763, 4207134, 4341532, 3941212, 3990914, 4071269, 3828182, 4010251, 3527964, 3853960, 3534327, 3517670, 3616977, 3884051, 3622141, 3539448, 3575030, 3659800, 3405547, 3419179, 3493717, 3182258, 3121862, 3216082, 2902739, 3345906, 3287623, 3558392, 3110749, 3000385, 3017111, 2926472, 2953647, 2902259, 3176847, 2933204]
16531B933204N3241M6710p5102k30265J71512L9026J94054p03149N83903m23329
16521B589805J74764O0821k74505m1016K11289K0583n57651M79072r5294j67614
16511B400254p401J20348n8364j8018j94828k9647J62023k227o2438K460j93727
16500B118435J35413q8571J74709r2289q1217P4846N5927j11033j42808L778N2836
16489B100026k8097K67577k32600j51431n6866K95575m13213J71851Q4200R0626
16479B127648j28705n40013K70710M55093m51128K86116o7842j48495K48706j4601
16469B037489k18973k37583L16355m8942J59146m29936j46115N30483r6359l63867
16459A501698j43178K00536r0779L2431K91277l69626M6910K30308K4300L8614
$$ y = [2933204, 2986445, 3033155, 2958053, 2727788, 2899300, 2938326, 3132380, 2429231, 3013134, 2589805, 2764569, 2825390, 2550885, 2509869, 2721158, 2741741, 2184090, 2663162, 2567868, 2400254, 2392853, 2513201, 2454837, 2436819, 2241991, 2212344, 2374367, 2372140, 2309702, 2312162, 2118435, 2253848, 2165277, 2339986, 2247697, 2166480, 2241326, 2297253, 2186220, 2043412, 2047190, 2100026, 2071929, 2339506, 2106906, 1955475, 1898609, 2194184, 1780971, 1952822, 2037022, 2127648, 1998943, 1458930, 1729640, 2184733, 1733605, 2019721, 1951879, 1803384, 2052090, 2037489, 1818516, 1580933, 1897288, 1848346, 2007492, 1577556, 1431441, 1961924, 1865565, 1501698, 1358520, 1559056, 1468277, 1500708, 1791985, 1422359, 1469269, 1699577, 1723877, 1762491]
16449A762491n38833K63083L95369m20984K48304m09697K75818M7112k37482j5044
16439A370137k79859M93189P080k82260J77300K8850J88615k08684j14501K0536
16429A400403q417L37515k82352J44662m31723M62374o49192N15786o4392n169
16419A419495m9331j43024j03135L27762j54489p6882L80369j31111k01576M5716
16409A313794N0356k51178l1822J58277J60189j05563j4150k22139J45869M5166
16399A248799j30391P8026o1479J8496l2188L055L08498m91347K56781O4093P818
16388A270161k58405K51304j70454K02615k45713j92145M54053j37924P7411k95599
16378I55304q292J72832o6436j34776L58499k55737J06306j82550J00407K82911
$$ y = [1762491, 1223658, 1486741, 1882110, 1461126, 1709430, 1299733, 1575551, 1622663, 1385181, 1370137, 1090278, 1583467, 1590547, 1308287, 1485587, 1514437, 1703052, 1494368, 1379867, 1400403, 1391986, 1729501, 1447149, 1591811, 1160088, 1622462, 973270, 1489056, 1424664, 1419495, 1370164, 1227140, 1124005, 1451767, 1297278, 1220396, 1600765, 1469654, 1268078, 1313794, 1364150, 1112972, 1081150, 1239427, 1399616, 1294053, 1279903, 1057764, 1203633, 1248799, 1118408, 1196434, 1134955, 1153451, 1121263, 1124318, 1432816, 941469, 1198250, 1262343, 1270161, 1011756, 1263060, 1092606, 1295221, 1049508, 857363, 1311416, 1173492, 1250903, 955304, 947012, 1119844, 1053408, 918632, 1277131, 1021394, 1127700, 945150, 1045557, 1328468]
16368A328468j57086k34426M4942O596j66730J52482j84094J30788K28219m42800
16358G06359K59525j79183m5023K09586j9220K43347m55538L42466l90711J42083
16348H13691j55200o5524L47911Q8066K73487m68590j76402L34584p7603r9050
16338H15370L18700l4352m03407J50837J6455o5235j59192l0185K62613J05117
16328I76721k89943k3356M6696k9535K53513n4640k12956N4808K85962K05706
16318A212976k56753N5790l36421L4985m6973J05873q3141J77576j28702J30446
16308H65656j70848J19672l81825N30862l43778l6784L26704r7633q3897J02729
16298H30858k13178Q1301j41853L30474k89007m7057J47161J07573k8727K40028
$$ y = [1328468, 1171382, 936956, 981898, 988494, 821764, 974246, 790152, 920940, 1149159, 706359, 965884, 786701, 741678, 951264, 932044, 1175391, 719853, 1062319, 671608, 813691, 658491, 592967, 940878, 1028944, 1302431, 833841, 657439, 992023, 914420, 815370, 1134070, 1099718, 696311, 847148, 863603, 798368, 639176, 608991, 871604, 976721, 686778, 663422, 710118, 680583, 934096, 879456, 666500, 721308, 1007270, 1212976, 956223, 1012013, 675592, 710577, 663604, 769477, 686336, 863912, 735210, 865656, 694808, 814480, 432655, 963517, 619739, 582955, 909659, 812026, 728129, 830858, 617680, 698981, 557128, 887602, 598595, 551538, 698699, 806272, 777545, 1017573]
16288A017573l82088P0313k3323j5858K38976l72248n5377J18025J72692q9724
16278F78961m2858K08936J49486k94338B71515M20617j53707J2792j5822K04399
16268G39794K3394j41910O8076k282C16867J49472J17130j63130L03305l27393
16258C96251M20663C65500p4078L88386H8078N81648j63747j89467K00352j15343
16248D01521o4560K38303j26234j0350j79786M34147m9169B93972P8445L50267
16238G22684C37693J84408K23333p8720k66808R6115J90361M4454k27827l966
16228D99043p9869L6268q7318K92046j83165l3550K7432L49867C60139N63521
16218I23660k06372K5688C38660J28059o9580L39485l3036l47947L7896j29674
$$ y = [1017573, 635485, 705798, 682475, 666617, 905593, 533345, 477968, 595993, 768685, 678961, 636103, 845039, 994525, 700187, 271515, 692132, 538425, 551217, 535395, 739794, 763188, 621278, 689354, 687072, 316867, 466339, 583469, 420339, 723644, 396251, 816914, 365500, 291422, 679808, 88078, 669726, 505979, 316512, 516864, 401521, 336961, 575264, 449030, 438680, 258894, 693041, 643872, 293972, 372417, 722684, 337693, 522101, 745434, 666714, 399906, 496021, 686382, 730836, 503009, 499043, 419174, 455442, 368124, 660170, 477005, 443455, 470887, 820754, 360139, 923660, 717288, 742976, 338660, 466719, 397139, 736624, 703588, 355641, 393537, 263863]
16208B63863M10583k95118o1816L40845C01554J75997j02684Q4312n3276J76533
16198E82436K16091l02389j25407j15600J86286j26132L21682B10300J04466M82487
16188G97253C83876l1345J90093j14505J89351k05818j40583K83257j37967k1669
16178C94690M5620r1993k5389j41726J3626Q7793M35899i4998E05576B09252n9608
16167A49644J79950J29616A59528O21861C2808J10713J16418K72939j54006I3456
16156D27618J35737A99782r5507M34439p6136A38157J43554J92443j02683G6336
16145A18889O6133k134K78629j30055J17347J44821H0443R6318p9579J46612L48169
16134E91963A47534K58433O3778E6167M32283B34409K2640L83357A61822k3624
$$ y = [263863, 674446, 379328, 317512, 658357, 301554, 477551, 374867, 459179, 405903, 582436, 798527, 496138, 370731, 255131, 441417, 315285, 636967, 210300, 314766, 797253, 383876, 352531, 542624, 428119, 617470, 411652, 271069, 554326, 416359, 394690, 440310, 348317, 322928, 181202, 194828, 282621, 718520, -94998, 505576, 209252, 149644, 329594, 459210, 159528, 781389, 32808, 143521, 259939, 532878, 378872, 93456, 427618, 563355, 199782, 104275, 538714, 462578, 138157, 281711, 474154, 371471, 76336, 118889, 185022, 182888, 461517, 331462, 448809, 593630, 80443, 176761, 97182, 243794, 591963, 147534, 405967, 469745, 56167, 488450, 234409, 257049, 640406, 161822, 138198]
16124A38198L06113H4272L2253L05787a3759D93748B29381P7380g1953D40075
16113A39465J68829O7527E3723K07009J7994J85399K01879A24288n9291C008O21014
16102F24022A53644M0203K19642n0264N5824j43498A06916j4691I840K13226q8067
16091A34999n861J93539N1998j79998D8631J11593K34215j8398p0905l9359j00166
16080A65611m1629a54649a962B46242L26782k53618A21913J32508K01653I224
16069B78550K31510i4690E7070J21316a91500D23586b3952A45080K36783p702
16059C74161A16993b7122I1804d3184m518E94141a8507C46430f6545M550E30304
16047a0491A18099K41618a9979D5023i2049A88270l7617l173K11035j42347b39415
$$ y = [138198, 444311, 84272, 116525, 422312, -13759, 493748, 229381, 306761, -71953, 440075, 139465, 308294, 375821, 53723, 260732, 278726, 464125, 666004, 124288, 64997, 3008, 624022, 153644, 193847, 413489, 363225, 419049, 275551, 106916, 92225, 9840, 223066, 134999, 129138, 322677, 374675, 194677, 48631, 160224, 394439, 376041, 305136, 265777, 165611, 123982, -154649, -1962, 246242, 573024, 319406, 121913, 254421, 456074, 9224, 278550, 510060, -94690, 57070, 178386, -191500, 423586, -23952, 145080, 381863, 374161, 116993, -27122, 91804, -43184, -47702, 594141, -18507, 346430, -66545, -61995, 530304, -10491, 118099, 359717, -19979, 45023, -92049, 188270, 150653, 147480, 358515, 216168, -239415]
16035E02068A3839a5478G5376A2331O4142K24170B2613J78479F4090a17180C18425
16023B65511D4671h5508A33968D5074K74131j57297J52138j37556Q1872b0379
16012B61190b26655E8909K30388r6610n8568b3239j01055K5024a6610m3192B48514
16000G1639a28433n3660C58397j65938P4933R7951j47639l1255n4081B2833K30065
15989B52898O28145M1448l8798p4169L21842j61407j97342C58006M9016A98826
15978A7825J08514b7486C49511j71469J12097J29108a6721k77706F6417d6644
15967B03436C5437J83179R6817g8749B47756A08476l0995K2881e2898B32050a95325
15955E3489b25839B16074b03584A53851K55274j99186b93258a2023I6100N06c4399
$$ y = [502068, 13839, -15478, 75376, 12331, 76473, 300643, 22613, 201092, 64090, -117180, 318425, 265511, 44671, -85508, 133968, 45074, 319205, 161908, 314046, 176490, 258362, -20379, 261190, -226655, 58909, 289297, 192687, 134119, -23239, -124294, -99270, -16610, -59802, 248514, 71639, -128433, -182093, 358397, 192459, 267392, 365343, 217704, 186449, 132368, 22833, 252898, 881043, 922491, 883693, 809524, 1131366, 969959, 772617, 358006, 407022, 198826, 17825, 126339, -27486, 349511, 178042, 290139, 419247, -16721, -294427, 66417, -46644, 203436, 35437, 218616, 315433, -78749, 247756, 108476, 77481, 100362, -52898, 232050, -195325, 53489, -225839, 216074, -203584, 153851, 409125, 209939, -293258, -12023, 96100, 96606, -34399]
15943e6411K7188B33770q9870N1349d0317B48009h8138A29606a5434o8803A4552
15931A49367g2696o178n9851k14927A44345J06482j00237J38655b0200F8218b120
15919i3265B2591K78145c37030B3472a40272A81617l7830J35478b3021C06862
15908B74736f2749A1167K01808a25773a5331A58600a42077F4318e8738E8934J99584
15897B58518e6289B2058c5682j60777G3833b27698I9064f1264A37593m2413c45198
15885E417J52889r303f4911B64959a19915k44610B25335E5826O6583J18801j04165
15874A37045M0123n0344b18414a1686n630D24134A50550o6144g6520H2752J63450
15863B46202H1607b3379j66798q980f1982D7246L5843b0406k6256B62575d7018
$$ y = [-56411, -29223, 233770, 143900, 195249, -40317, 248009, -88138, 129606, -15434, -84237, 14552, 149367, -72696, -78874, -138725, -353652, 144345, 250827, 150590, 289245, -20200, 68218, -2120, -93265, 22591, 300736, -337030, 23472, -140272, 181617, 143787, 279265, -23021, 306862, 274736, -62749, 11167, 212975, -125773, -15331, 158600, -142077, 64318, -58738, 58934, 258518, -56289, 22058, -35682, -196459, 73833, -227698, 99064, -61264, 137593, 95180, -345198, 5417, 158306, 149003, -64911, 264959, -119915, -364525, 225335, 55826, 122409, 241210, 137045, 177168, 126824, -218414, -11686, -17316, 424134, 150550, 84406, -76520, 82752, 246202, 81607, -23379, -190177, -199157, -61982, 47246, 83089, -20406, -46662, 262575, -47018]
15851A58374k258n1651i640A51049n3836N0635b6830D01638j82510R0015b8829
15839A23578e8143B870d4809A43239N3786a94740B81995E2599a17716d8731C90087
15827H6927F963J67000E6621J31215d7325A10699o168I550a70601B52147P5434
15816C27581A8669a5002A29238J01814a16756i409I6762K879b34774F7790c33970
15804C372L2493J71972e0120o1736a1428C64224j69333a34470k56924B99264a26890
15792B57965A2128e7005D2268R2444g1560A88420P6040j06404J13446m3639a9936
15780H7083a3352l0929B15670A1299J00918C3492j2437L687M868J13238L5644
15769A78492M2743d00544B6727c0170C124L62922b28146N5820a9158F7194A6728
$$ y = [158374, 156116, 104465, -9640, 151049, 97213, 147848, -26830, 401638, 219128, 309143, -28829, 123578, -58143, 2870, -44809, 143239, 197025, -194740, 281995, 52599, -117716, -48731, 390087, 86927, 6963, 173963, 56621, 187836, -47325, 110699, 104531, 9550, -170601, 252147, 327581, 18669, -15002, 129238, 231052, -116756, -9409, 96762, 99641, -234774, 67790, -333970, 3372, 35865, 207837, -50120, -111856, -11428, 364224, 194891, -134470, -391394, 299264, -126890, 257965, 12128, -57005, 42268, 134712, -71560, 188420, 264460, 158056, 271502, 227863, -19936, 87083, -13352, -44281, 215670, 11299, 112217, 33492, 21055, 24742, 29610, 142848, 178492, 221235, -400544, 26727, -30170, 3124, 366046, -228146, -172326, -19158, 67194, 16728]
15757C25667a30881m0729j11872b7180A68472a06641c3325j26473B56028a17484
15746A50670A7528i0134K4368B87438A24918a15321j28228H3001k9795h7985k1068
15735a09053n6200A7031a0960C747J79338R8322a1439A54783i1280k39357M9770
15724b80867j33533f5194j09481B039K50122a00614B42792Q3784a37642J6185
15714a21457A66337d6034j57723a00849B11304C7885b9798j94922M0182e1040
15703B40745c7903k76851j17195C9313a09277A43566P5053a64468B06589a51228
15692a63067a0796k90402a1841j80674B44065B4874J2724b79725A65553a53230
15681B60721a78427k2258f2604j39028E7123M64227B24181b12884B17073H9200
$$ y = [325667, -130881, -171610, -283482, -27180, 168472, -106641, -33325, -159798, 256028, -117484, 150670, 17528, -90134, -65766, 287438, 124918, -115321, -243549, 83001, 53206, -87985, -109053, -165253, 17031, -10960, 3747, 183085, 281407, -11439, 154783, -91280, -330637, -280867, -414400, -65194, -174675, 2039, 252161, -100614, 242792, 326576, -137642, -121457, 166337, -46034, -203757, -100849, 211304, 37885, -29798, -224720, -184538, -51040, 240745, -37903, -314754, -431949, 39313, -109277, 143566, 218619, -164468, 206589, -151228, -163067, -10796, -301198, -11841, -192515, 244065, 24874, 37598, -279725, 165553, -153230, 260721, -178427, -200685, -62604, -201632, 57123, 521350, 224181, -212884, 217073, 89200]
15670b20398i5970B69568a33116H1495K8576a25445B18671A02711J31074e1374
15659h7539A84828b04635A64976D9264c4293A13724a1226A02267l8317a21242
15648b6705j6894E6266a25297K9903A06668i318F6724a61284P4984B08189a29685
15636B31198d8386j76274D9317a74992A46540e3968j66850A27269F0210J07177
15626A67387F8886E418a52402D7558A8782f302A11225a37805A5800a78246o4778
15615b43024J17058I004J45236a26363q3829e3695K4294A09535b3360j31738B9857
15603h3831l8614k3124E359e1280j49426e5798C0450f3531H5728M3057J01304
15592B30089a17107E7435K6447b10928P1607A27797B5599a37685e8213a0902j15875
$$ y = [-220398, -95970, 269568, -133116, 81495, 110071, -125445, 218671, 102711, 233785, -51374, -87539, 184828, -204635, 164976, 49264, -34293, 113724, -11226, 102267, 63950, -121242, -26705, -43599, 56266, -125297, -95394, 106668, -9318, 66724, -161284, -86300, 208189, -129685, 231198, -48386, -224660, 49317, -174992, 146540, -53968, -220818, 127269, 60210, 167387, 68886, 5418, -152402, 47558, 18782, -6302, 111225, -137805, 15800, -178246, -243024, -125966, 9004, 154240, -126363, -210192, -53695, -29401, 109535, -23360, -155098, 29857, -83831, -122445, -145569, 5359, -51280, -200706, -55798, 30450, -63531, 85728, 128785, 230089, -117107, 57435, 83882, -210928, -139321, 127797, 25599, -137685, -58213, -10902, -126777]
15581a26777j06441Q8660a7868j17143b6378k7565m121C37874i1797A08299d74156
15569A82509B9575J37542e874m8929B14421a4059j28551B2948J68326a10750C01772
15557c9873A4694e284j39603I9615K5064A2793M5502P006a68187P336b6060j32322
15545a58382L2323C91182A84593o8274b3485q1798R391c5434H0019b73649N0731
15534b22918A19791g3615K4632m637l03098a34308A03560M8739g3529D7278L45873
15523C93151b92448f5362i563l6748B35292a26328C52997B9485J36336a1812B36128
15511A18771h625F2979J24078q7668a01714A26454a65647C07716J13035j38247
15501B82504n774m7060a39074A36165J04214b0888F5647a7144k64663J18577i286
$$ y = [-126777, -233218, -144558, -17868, -135011, -26378, -53943, -58064, 337874, -91797, 108299, -474156, 182509, 29575, 167117, -5874, -54803, 214421, -14059, -142610, 22948, 191274, -110750, 301772, -39873, 14694, -5284, -144887, 99615, 124679, 12793, 58295, 65301, -168187, -160851, -26060, -158382, -126059, 391182, 184593, 116319, -23485, -105283, -95892, -35434, 80019, -273649, -222918, 119791, -73615, -48983, -53620, -356718, -134308, 103560, 152299, -73529, 47278, 393151, -292448, -65362, -9563, -46311, 235292, -126328, 352997, 29485, 165821, -11812, 236128, 118771, -8625, 62979, 187057, 99389, -101714, 126454, -165647, 307716, 420751, 282504, 276730, 229670, -139074, 136165, 240379, -20888, 65647, -17144, -281807, -163230, -9286]
15489B33233c3927A61687f0362k5887C08573B8917K86100b4532A07505E3241Q4246
15478A37487K01430K71393k06923j85411K08763M8422A48478K46697A33872N5379
15468A89251r0548L0971l9222J73797g1644H5890K38786A39264a2676j2831E5901
15456F550b9623D56473F7330a35112L6480B35669A00497h6517A04668N5226E8570
15444C18016k3446L43833K63165j68763k26146B06888J61684j33043C1049j3723
15434A7326L89443b88632B53506A09976B1316d1712r7778e3533a0627m45133F0577
15422d6134D7366a63269r4975R4071A20435a64790a503B5664c3780H4105L2857
15411A16962i6472B16005a0977I0815A1933J90845b018D5415h8816C5786b2410
$$ y = [233233, -33927, 161687, -60362, -86249, 308573, 28917, 315017, -24532, 107505, 53241, 137487, 338917, 610310, 403387, 217976, 426739, 475161, 148478, 395175, 133872, 189251, 98703, 129674, 90452, 264249, -71644, 85890, 324676, 139264, -12676, -25507, 55901, 6550, -29623, 456473, 67330, -135112, -98632, 235669, 100497, -86517, 104668, 159894, 58570, 318016, 294570, 638403, 901568, 732805, 506659, 206888, 368572, 235529, 31049, 17326, 406769, -288632, 253506, 109976, 21316, -41712, -139490, -53533, -10627, -455760, 60577, -46134, 47366, -163269, -258244, -164173, 120435, -164790, -1503, 25664, -33780, 84105, 116962, -96472, 216005, -10977, 90815, 11933, 202778, -2018, 45415, -88816, 35786, -22410]
15399b8749k20100A31983h5297B04815a62381j6670J9817B04238D427J6065g3570
15387B2623b83286h6648A70368j7352i6689B74682F1428f595B07338a31304B13270
15375A35561K2769a64054A68781g0270k00605C62855b7031B56042F0987P5768
15365A36755d117I3260b10013D4564J15084K62067J5199a51480g1774C61268A39977
15353A11275K1338a45991B26445Q2362b10986O548b3046A77632c8444A99221a743
15341A17959K15440A41102L81726A46128K880D3267e8901m0608J5617B8358I125
15329a38269B76735J12344o4642A991K11615r6637R0653H9334c9432j75089A31348
15317b43274j0387D6248L32635c557C96431j46832b3009E71730B10274J26901
$$ y = [-28749, -248849, 131983, -85297, 204815, -162381, -179051, -159234, 204238, 4427, 20492, -73570, 22623, -283286, -86648, 170368, 153016, -96689, 274682, 61428, -6595, 207338, -131304, 213270, 135561, 158330, -164054, 168781, -70270, -270875, 362855, -27031, 256042, 60987, 136755, -4117, 93260, -210013, 44564, 159648, 421715, 436914, -151480, -71774, 361268, 139977, 111275, 132613, -145991, 226445, 308807, -210986, -204438, -23046, 177632, -38444, 199221, -1743, 117959, 333399, 141102, 522828, 146128, 149008, 43267, -58901, -99509, -83892, 28358, 9125, -138269, 276735, 389079, 324437, 1991, 213606, 116969, 207622, 89334, -39432, -214521, 131348, -243274, -253661, 46248, 378883, -3557, 396431, 249599, -23009, 571730, 210274, 337175]
15307C37175I2869B5423a5839A47832a0512B18205j6371o0195M1643a04111G658
15295A75167b56588E23520A56584n4101h803M295k27170A51886a81195e7790A37775
15283f0901n2311A30235J64994q2701a85362c7732E539E54J19074J08787H0026
15271A2087M9285a19302A43594b23231A78426E8053M1972i2211O232o3856A47519
15259B03978b5989j43246m689e957B74187J9137b2915q4013j48110B39045k1831
15248B17214p1824P0749O42198O27813l04177o3224l0924A57987P1204B1288J15881
15237A37169E1426L35862A06162m2356j2059Q9618A593a10938A8807K44495c00062
15225a6980n2607p2588C6447h4522G9639H446K79641p5417I4663f4066B09137
$$ y = [337175, 92869, 25423, -15839, 147832, -10512, 218205, 201834, 141639, 183282, -104111, 7658, 175167, -256588, 523520, 156584, 102483, -8803, -4508, -231678, 151886, -181195, -57790, 137775, -60901, -113212, 130235, 295229, 212528, -185362, -37732, 5539, 554, 119628, 228415, 80026, 12087, 61372, -119302, 143594, -223231, 178426, 58053, 100025, -92211, -85979, -149835, 147519, 203978, -25989, -169235, -173924, -5957, 274187, 293324, -22915, -106928, -255038, 239045, 217214, 145390, 216139, 858337, 1486150, 1181973, 1118749, 1087825, 157987, 229191, 21288, 137169, 51426, 387288, 106162, 63806, 51747, 141365, 1593, -110938, 18807, 263302, -300062, -16980, -69587, -142175, 36447, -84522, 79639, 8446, 288087, 212670, 94663, -64066, 209137]
15213H1277e9082F4261k6175J66169B7735K19429g87k28811G0537k6684a23970
15201e291j83828E1098c6015A47259a99433B81551a37240H2281j1810C5201a46625
15189E9604B0980M8781g145A5829j72d3124E6155K67827f1151k34888A83415O2836
15177B46251q9876E1723B924J30418f4175C67292J233a51612e6816n73B56611
15165B08339F5889J30074B6951h1373j8159M5417A61505b76967B46953H5921J67145
15154B53066r8856i5341A37488P8550j791a6273n6483k56587A28591a27668I9781
15142A32920e5159A23918B7687J24020K11091B8583J27566a21190B3997K58587
15132B82584m2866e8106F0869j3053a39570A40779M65469C01223A28360l5522
$$ y = [81277, -59082, 64261, 38086, 204255, 27735, 247164, -787, -229598, 70537, 43853, -123970, -5291, -189119, 51098, -36015, 147259, -199433, 281551, -137240, 82281, 70471, 35201, -146625, 59604, 20980, 69761, -7145, 15829, 15657, -43124, 56155, 323982, -61151, -296039, 183415, 246251, 156375, 51723, 2924, 133342, -64175, 367292, 368525, -151612, -56816, -57389, 256611, 208339, 65889, 195963, 26951, -81373, -99532, -54115, 161505, -276967, 246953, 85921, 253066, 154210, -95341, 137488, 216038, 214247, -16273, -72756, -329343, 128591, -127668, 99781, 132920, -55159, 123918, 27687, 151707, 362798, 28583, 156149, -121190, 23997, 282584, 239718, -58106, 60869, 47816, -139570, 140779, 606248, 301223, 128360, 92838]
15122I2838J1591L17001K37018B43070O0346j30282o4851K98355a98834a1085
15111E0183j7860K45009A9340A104N2515P4379k7980j7306J46633F2308N1974
15100A14282a25798A45824D1315K29008i0639i567B70082a52627b1363C27954
15089D27795A91445b86510E3133j9624b3031E2917P3075J1459E4826d2598j0521
15078e3119m67766C51364j02795a48212B0421J46029j1027b78447C95341D0295
15067a40311B92022j14389l5845E8870A0426K9934J70959J17330A23323L3979
15057A57302J4163l3256J86032B9221L48110A64564J31285j30540b8938C37788
15046C02871L44544B59800O843M8249A28126D6133K72978N3859j74718p3171K27760
$$ y = [92838, 104429, 421430, 658448, 243070, 303416, 173134, 108283, 406638, -198834, -11085, 50183, 32323, 277332, 19340, 1104, 53619, 127998, 100018, 82712, 229345, 62308, 114282, -125798, 145824, 41315, 270323, -90639, -9567, 270082, -152627, -21363, 327954, 427795, 191445, -286510, 53133, 33509, -23031, 52917, 125992, 137451, 54826, -42598, -53119, -520885, 351364, 248569, -148212, 20421, 166450, 155423, -278447, 395341, 40295, -140311, 292022, 177633, 141788, 58870, 10426, 40360, 211319, 328649, 123323, 157302, 171465, 138209, 324241, 29221, 377331, 164564, 295849, 165309, -28938, 337788, 302871, 647415, 259800, 266643, 314892, 128126, 46133, 319111, 372970, 198252, 125081, 352841]
15035C52841j2460H4012B4622O9532K43350A14110K75518K92085k8622l15919
15025C37172j4503j21783J2670K3865L4485l7497J61337I8776L94449M4467Q9481
15014F27173k33327q5362L1884j03719J59533j27246k6663K52714j51747j39305
15004B03935M5235O9334O9565A05845M35996B59432M0647H547L31326A64339K49594
14993D13933R7451B09739J18964L59122A89262N88894A75690K42310A38163N0002
14983A88165R3855K88802O8680J69073R0103k99832j47516l142A14706J1712j6605
14972A09813M48608l6480n3933J3339p4831j43949N3412o2340K4993j4531J17933
14961C82034J11833P3264k81618r1755L92270C9207L32085G1641J02896Q7731
$$ y = [352841, 340381, 84012, 24622, 94154, 337504, 114110, 389628, 681713, 653091, 337172, 322669, 200886, 213556, 237421, 271906, 234409, 395746, 98776, 493225, 537692, 627173, 393846, 308484, 340368, 236649, 396182, 268936, 242273, 494987, 343240, 203935, 249170, 318504, 388069, 105845, 541841, 259432, 300079, 8547, 339873, 164339, 413933, 511384, 209739, 328703, 687825, 189262, 778156, 175690, 418000, 138163, 188165, 282020, 570822, 639502, 808575, 898678, 598846, 451330, 448188, 114706, 126418, 109813, 558421, 521941, 468008, 481347, 406516, 262567, 315979, 253639, 278632, 264101, 382034, 493867, 567131, 285513, 193758, 586028, 39207, 371292, 71641, 174537, 262268]
14951B62268j13959K24155j68998J6303J34210j35042K73575J01916J01165j25732
14941E69861k20390K52442j83299P0514j36884l4859l9723M4392K52633J62788
14931G37475k01585K12220L35798J5966l9216l2657K99563m74970J30392J42434
14921A125420n7327l9636L38367K36694j05171J48860k82896k01387m30689L63750
14911A095985l18055O1362C56740K66028k97449j8846j14256K99000G5739j2287
14901F3452L27044l5676J04782A95577J92814n1905j17078J28086L04897C23701
14890B68472L34220B28114Q8258M35182j43394C00192M64515j94342P6969j91302
14880D56032j12210L47390k21673N2717k25013J09242j3993k5465A20715L0306
$$ y = [262268, 148309, 372464, 203466, 219769, 353979, 218937, 492512, 594428, 695593, 569861, 349471, 601913, 418614, 489128, 352244, 317385, 277662, 322054, 574687, 737475, 535890, 748110, 1083908, 1099874, 1060658, 1028001, 1327564, 852594, 982986, 1125420, 1068093, 1028457, 1366824, 1603518, 1498347, 1647207, 1364311, 1162924, 732235, 1095985, 777930, 839292, 356740, 622768, 325319, 306473, 192217, 491217, 75739, 63452, 390496, 354820, 459602, 195577, 388391, 336486, 219408, 347494, 652391, 323701, 268472, 602692, 228114, 316372, 751554, 608160, 300192, 764707, 570365, 647334, 456032, 343822, 691212, 469539, 522256, 297243, 406485, 392492, 367027, 120715, 151021]
14870A51021K22421K95073B20992N96316k53801J76801K10193l02345j17845k60163
14860B70148J9518p8412L39636k49879K0147J0193D7290N06407j81879o0244o3095
14849B48479L18390j3294A67705K3944K97862J8861L59264J52517k42144k9088
14839G48921K77812l88142J34218J13219k14001j03657N5173k49214Q8415j76799
14829B85945r788J93298K05482j95041L30983C34450K76916K3588J5967j94082
14819D56839O4875O3751J02588B54206M4949N06404p1562l43549J83514q4759
14809D89203J92189j20308k0513K87329l35880J26682j20053J98029J42131j74993
14799F63816Q5589j02178k97355K08103j12316J25747k60875J92018N9143j67463
$$ y = [151021, 373442, 668515, 220992, 817308, 563507, 740308, 950501, 648156, 530311, 270148, 289666, 211254, 550890, 301011, 321158, 331351, 47290, 553697, 371818, 311574, 248479, 566869, 553575, 167705, 191649, 489511, 508372, 867636, 1020153, 778009, 748921, 1026733, 638591, 772809, 886028, 672027, 568370, 623543, 374329, 462744, 285945, 276157, 469455, 674937, 479896, 810879, 334450, 611366, 634954, 650921, 456839, 521714, 585465, 688053, 254206, 299155, 805559, 733997, 390448, 573962, 489203, 681392, 561084, 540571, 827900, 492020, 618702, 498649, 696678, 838809, 663816, 749405, 647227, 349872, 557975, 445659, 571406, 310531, 502549, 561692, 394229]
14789C94229A34899N25328p0929k21403K86346K22323k17397B50388K33527J39064
14779F22979J32196j57944L9298J11010k57675O89465m43965J06896k61458J54288
14769G35090k53655q4044L53866k55447j15634J01501J73123r898k86355L90700
14759G49247p7087r7230k09522J75818j44876O6183L4681L40522j00647k84234
14749D52855L74699r4430B73570K38980J4280J21278k13318L23775k41653J19217
14739F36129j64937K69137k77734K19418o5213m3755K23991m4123J14554k96499
14729E70968L02025L5321K81104M5677P7162K05739r6558l15661k31071J79662
14719A054368k41110j94866J89033l67470M8394K38392J60995N8250J96822l73293
$$ y = [394229, 134899, 660227, 589298, 367895, 654241, 876564, 659167, 250388, 483915, 622979, 755175, 597231, 636529, 747539, 489864, 1179329, 735364, 842260, 580802, 735090, 481435, 397391, 751257, 495810, 380176, 481677, 654800, 644902, 358547, 749247, 672160, 574930, 365408, 541226, 396350, 462533, 497214, 837736, 737089, 452855, 827554, 733124, 273570, 512550, 526830, 648108, 434790, 758565, 516912, 636129, 471192, 740329, 462595, 682013, 616800, 573045, 797036, 752913, 867467, 570968, 872993, 908314, 1189418, 1235095, 1312257, 1517996, 1421438, 1105777, 874706, 1054368, 813258, 618392, 807425, 439955, 488349, 726741, 887736, 945986, 1142808, 769515]
14709G69515j63320K74212j81624K14905o8131N76395k52601l920q8086L40654
14699A417999r200j52449j87596R0454k36961Q9358l50677N39418j51218k27158
14689H21970k17662M5150L78237k28936M08208m04956R3629R936r2665K6455L0754
14678H70120J0675J27394l8201n1231q0573K470L26037k99752q7551l2607l8525
14667G08256P9966L46988j08993Q0964k57692K03158R1115j77188l03363K09954
14657H73165J1330Q4673n0769J03510K9680J30349k06615L8692L87278j95031
14647A206262Q9294k61487k18348M63236n06716K29403J82224N4912o8485l40119
14637H30176L00879L9910R6222j32173J32017J28796l61834L32726j23396j5452
$$ y = [769515, 606195, 880407, 698783, 913688, 845557, 1421952, 1169351, 1165431, 1077345, 1417999, 1408799, 1256350, 1068754, 1159208, 922247, 1011605, 660928, 1200346, 1049128, 821970, 604308, 649458, 1027695, 798759, 1206967, 802011, 895640, 905576, 812911, 839366, 870120, 880795, 1008189, 969988, 918757, 838184, 840654, 1166691, 866939, 779388, 746781, 708256, 788222, 1135210, 1026217, 1107181, 849489, 1052647, 1143762, 966574, 663211, 873165, 884495, 969168, 918399, 1021909, 1051589, 1181938, 975323, 1014015, 1401293, 1206262, 1295556, 1034069, 815721, 1278957, 772241, 1001644, 1183868, 1238780, 1170295, 830176, 1131055, 1170965, 1267187, 1135014, 1267031, 1395827, 1033993, 1366719, 1243323, 1227871]
14627A227871l14215Q0381M0528r8751K42896l8094J03184k44384P821J32515
14617A139752J29083O3835l83575N26910o5729j19627k10568K73198p4689p9427
14607A199163k455J40094K469Q5605l9334q2135K61793j72665N23833l67773l14674
14596A233921N17583m98672Q3545j47470N43112n65286L12974l95476N46952l2270
14586A598913o6390o0737L88887m27898l659M28185j02956l45773M82803k68572
14576A622803J49110k28954N17759j82564j93828L48580j24425J7702K63653l08791
14566A881045J97143m01354M64113M5783J05916M0686l754J39932j5158M23945
14556B878297k29389K11833M92960j54143O48561L25233R47436K457418M036036
$$ y = [1227871, 913656, 994037, 1034565, 935814, 1178710, 1140616, 1243800, 999416, 1007237, 1139752, 1268835, 1332670, 949095, 1476005, 1410276, 1290649, 1080081, 1353279, 1278590, 1199163, 1196708, 1336802, 1339271, 1424876, 1385542, 1303407, 1565200, 1392535, 1916368, 1548595, 1233921, 1751504, 1252832, 1336377, 1188907, 1732019, 1166733, 1479707, 1084231, 1631183, 1598913, 1532523, 1471786, 1860673, 1432775, 1429116, 1857301, 1754345, 1408572, 1891375, 1622803, 1771913, 1542959, 2060718, 1878154, 1684326, 2032906, 1908481, 1926183, 2189836, 1881045, 2078188, 1676834, 2140947, 2186730, 2292646, 2333332, 2329578, 2469510, 2454352, 2878297, 2648908, 2860741, 3353701, 3199558, 3848119, 4173352, 5120788, 7578206, 11614242]
14547A1614242Q650573J8080005m734703A4806114G152386j719544n02988k199085
14539B730769m93041l85873o457j48700j03634J61544K14871J12733k91973J16319
14529A906558k1596k00091K76613J90327l34173N846L23484j88732L48006j053
14519B305189k93786L41173l11087N19697j19781J04677j99239P1203Q4443J12309
14509B614798J21224l92684J85944q834j43409L23406k0056n8267J5817o2214
14499B575725Q2167J7625j7920L02972j32410J49796j06747M86833j48720j73910
14489C035411K95778l11195J85472l82163M87720j39812J04640J0320J21801j43713
14479C264259L23334l54884L31846J02787k49657K06225K7234L30566m01184J52997
$$ y = [11614242, 20264815, 38344820, 33610117, 14806114, 7152386, 5432842, 4929854, 2730769, 2237728, 1851855, 1845398, 1696698, 1593064, 1754608, 1969479, 2082212, 1790239, 1906558, 1884962, 1684871, 1961484, 2151811, 1817638, 1823484, 2146968, 1958236, 2306242, 2305189, 2011403, 2352576, 2041489, 2561186, 2441405, 2546082, 2346843, 2418046, 2502489, 2614798, 2736022, 2343338, 2529282, 2520448, 2377039, 2700445, 2680389, 2622122, 2637939, 2575725, 2657892, 2675517, 2657597, 2960569, 2828159, 2977955, 2871208, 3358041, 3209321, 3035411, 3331189, 3019994, 3205466, 2823303, 3311023, 3171211, 3275851, 3286171, 3407972, 3264259, 3587593, 3232709, 3564555, 3667342, 3417685, 3623910, 3651144, 3981710, 3580526, 3733523]
14469C733523J80775n9926K38382R83n9541J65827k57035M26595M1690p3058P3886
14458D412101l09853K85092J62770p614Q0768j04799J75863j28561J99666r9457
14448D665976J89594k02841O84277l75599L00128R3788j88653M54686j90339K40063
14438E671080l41534M4428J65237M57525m0136m5977Q8819J23505L20561j96281
14428F247227p7522Q4381N15897j72561j10939L05608M38834L3520k13113K34274
14418G285606L42640l4367N1770J99050q3719K16538j0980K43504K44213j58626
14408H295629L7979N52146K24971J02476L24575j2181n29791L55093L25478m5199
14398I631176J47782j69471M71247J37454P5173L40925N77210r7609p4039M59734
$$ y = [3733523, 3914298, 3854372, 4092754, 4093737, 4034196, 4200023, 3942988, 4369583, 4411273, 4338215, 4412101, 4102248, 4387340, 4550110, 4542496, 4623264, 4518465, 4694328, 4565767, 4765433, 4665976, 4855570, 4652729, 5337006, 4961407, 5261535, 5355323, 5166670, 5621356, 5431017, 5671080, 5329546, 5373974, 5539211, 5996736, 5956600, 5910623, 5999442, 6122947, 6443508, 6247227, 6169705, 6254086, 6769983, 6597422, 6486483, 6792091, 7230925, 7264445, 7051332, 7285606, 7628246, 7593879, 7645649, 7844699, 7760980, 7977518, 7966538, 8210042, 8454255, 8295629, 8333608, 8885754, 9110725, 9213201, 9537776, 9525595, 8995804, 9350897, 9676375, 9631176, 9778958, 9609487, 10080734, 10218188, 10293361, 10634286, 11211496, 11113887, 11039848, 11499582]
14388A1499582m3818N11746Q8172J35741L83415J32172M96950j6338N06408R8795
14378A3792825J9179K95039K97667L24917J06361K88346J77201R22385m1361O48768
14368A6831327J14610K13899O21614K66834L23359M70628K83369L02921L21037
14359A9749598M05327Q25020O3374K19535J122797M11057L85736N33386O83925
14350B4399755R15169L60596R04884M60750O43677O28018Q76351P41745R62311
14341C0893256N83724J100372Q76159J048993Q99832O91467Q92936J572169Q05902
14332C9364810J489434J285131J221428J629698J408764J369075J485083K147403
14324E1400826J363854J903285K139381J535668K147459K026274K380119K038495
$$ y = [11499582, 11455764, 11967510, 12055682, 12191423, 12574838, 12707010, 13203960, 13187622, 13694030, 13792825, 13812004, 14107043, 14404710, 14729627, 14835988, 15124334, 15301535, 16223920, 16182559, 16831327, 16945937, 17159836, 17781450, 18048284, 18371643, 18842271, 19125640, 19428561, 19749598, 20154925, 20979945, 21043319, 21262854, 22385651, 22796708, 23182444, 23715830, 24399755, 25314924, 25675520, 26580404, 27041154, 27684831, 28312849, 29189200, 29930945, 30893256, 31476980, 32577352, 33453511, 34502504, 35402336, 36093803, 36986739, 38558908, 39364810, 40854244, 42139375, 43360803, 44990501, 46399265, 47768340, 49253423, 51400826, 52764680, 54667965, 56807346, 58343014, 60490473, 62516747, 64896866, 66935361]
14316F6935361K898562K305348K752959L204650L632198K617103L487371L610566
14308I1444118L923580L796454M835526M461364N168713N132943N475756N749013
14300A29987467O170239O258380P049081P505578P467041Q595991Q970956R128541
14292A91133274R958781J0389163J1034451J1594599J2007048J2749509J3330669
14285B72197494J3725116J3838284J4691340J4639890J5061104J4767060J4348163
14278C73268451J3894255J3167457J2171063J0555833Q419774M477492N96639
14271D36550964M36723n50458k143056o144011m911122p835681j0200242j1797638
14263C93405479j3410142j5230672j5335052j5968847j5603318j5730202j5113760
$$ y = [66935361, 69833923, 72139271, 74892230, 78096880, 81729078, 84346181, 87833552, 91444118, 95367698, 99164152, 103999678, 108461042, 113629755, 118762698, 124238454, 129987467, 136157706, 142416086, 149465167, 156970745, 164437786, 173033777, 182004733, 191133274, 201092055, 211481218, 222515669, 234110268, 246117316, 258866825, 272197494, 285922610, 299760894, 314452234, 329092124, 344153228, 358920288, 373268451, 387162706, 400330163, 412501226, 423057059, 431476833, 435954325, 436550964, 436987687, 436437229, 434294173, 428150162, 423239040, 415403359, 405203117, 393405479, 379995337, 364764665, 349429613, 333460766, 317857448, 302127246, 287013486]
14256B87013486j4768812j4190065j3705184j3076894j1221009j1149897j1082649
14249A97818976j0282404r663125r172037q913385p597403p005199p147223o722321
14241A31315879o390271o144137n084546m939439m785349m609743m355795m191085
14233I0815514l764417l569297k879751l600764l026375k977114k985687k489498
14225F5522611k279742k234227k196480k024126j882584j802889j804537j912481
14217D9385545j816861j408031j670977o23630j712560j177615j457528j196156
14209C8322187j118110q35090p13228j179720j215485j043389o97676p52186n15595
14200C0251708q49134p00995j020948n65944o77907o93300o77885n25473o07684
$$ y = [287013486, 272244674, 258054609, 244349425, 231272531, 220051522, 208901625, 197818976, 187536572, 177873447, 168701410, 159788025, 152190622, 145185423, 138038200, 131315879, 124925608, 118781471, 113696925, 108757486, 103972137, 99362394, 95006599, 90815514, 87051097, 83481800, 80602049, 77001285, 73974910, 70997796, 68012109, 65522611, 63242869, 61008642, 58812162, 56788036, 54905452, 53102563, 51298026, 49385545, 47568684, 46160653, 44489676, 43866046, 42153486, 40975871, 39518343, 38322187, 37204077, 36368987, 35655759, 34476039, 33260554, 32217165, 31519489, 30767303, 30251708, 29402574, 28701579, 27680631, 27114687, 26436780, 25743480, 25065595, 24540122, 23932438]
14191B3932438o33459o83845m28029m68159n61474m97534n13306m48169k07695
14182A9490768p23712k22068k84829l86904n74747Q4574q83142j01482m52322
14173A5946136k91463m67271j24570l63362j95035r9012m93228l84830J08543
14164A3635908l92249k03901o0553k55696k78002l02496l81254L06869l65046
14155A1703580l39915m90668J14711l8831l90798J33880o12117M7667j61611j07451
14145I858447k59094q9159q0349n94630J13540k00366k66031J03385k49112j71743
14135H164888k4790K17001n51935q736k66188Q2072o3751k75501K13401m71459
14125G015002r4317k14853M24895n2589k79605j23292k49815l22344O19187o54646
$$ y = [23932438, 23298979, 22615134, 22187105, 21718946, 21157472, 20659938, 20146632, 19698463, 19490768, 18767056, 18544988, 18260159, 17873255, 17298508, 17383082, 16499940, 16398458, 15946136, 15654673, 15187402, 15062832, 14699470, 14504435, 14405423, 13912195, 13527365, 13635908, 13243659, 13039758, 12979205, 12723509, 12445507, 12143011, 11761757, 12068626, 11703580, 11363665, 10872997, 10987708, 10948877, 10558079, 10691959, 10079842, 10127509, 9965898, 9858447, 9599353, 9510194, 9429845, 8835215, 8948755, 8748389, 8482358, 8585743, 8336631, 8164888, 8140098, 8357099, 7805164, 7796428, 7530240, 7612312, 7548561, 7273060, 7486461, 7015002, 6920685, 6705832, 7130727, 7078138, 6798533, 6675241, 6425426, 6103082, 6722269, 6067623]
14115F067623J19501J79833l18670k8409J8837j5524l48976K32717l43687J0041
14105E573286O0737j84341k10001j27414R815R5181P5970k03932k43591P7095
14095D922805K6122j86343K9608o6337L69333j31574l10533k57968k51329L59379
14085D503163j73559R213j44379K5785k74327L21303j85891O9150O4801O7823
14075D283082k26697J07753k65216N661k86266J2228J8212n7499Q2745m369k08941
14064C460693L17456j89208o7525l63987M13524J877l6764q2008j06635q395L43057
14053C682085m75217k31916K87337k61376j25124L56556j91921k6808J39127k43057
14043B909686o7627J15834K0259k9705j686l9723j4147j9944p8985K40313l4151
$$ y = [6067623, 6187124, 6366957, 6048287, 6019878, 6038715, 6023191, 5674215, 5906932, 5563245, 5573286, 5634023, 5449682, 5239681, 5112267, 5122082, 5217263, 5293233, 5089301, 4845710, 4922805, 4948927, 4762584, 4792192, 4725855, 5095188, 4963614, 4653081, 4395113, 4143784, 4503163, 4329604, 4338817, 4194438, 4220223, 3945896, 4267199, 4081308, 4150458, 4215259, 4283082, 4056385, 4164138, 3898922, 3904583, 3618317, 3630545, 3648757, 3591258, 3674003, 3669634, 3460693, 3778149, 3588941, 3521416, 3157429, 3570953, 3572830, 3536066, 3454058, 3347423, 3339028, 3682085, 3206868, 2974952, 3262289, 3000913, 2875789, 3232345, 3040424, 3013616, 3152743, 2909686, 2842059, 2957893, 2978152, 2948447, 2946761, 2907038, 2892891, 2872947, 2793962, 3034275, 3000124]
14032C000124j65411p3202k4815j90693J95974m05412j74441J96484J4588j83099
14022B190097J27507J24252k02102J21017k36945J8364J27438L7925k32095N7000
14012B132458r026r9029m13L23917j86540K1697k41979K44281j89176m1300r241
14001A945649j23347K80092l12765M4909K97468N6528P6135k31320j48213J77760
13991B062896L12927j6473J286799L107822O336056J7583963Q534363j7524047
13983B1684306j0446007m280273j576416j217673o81087j99410k43326j39929
13975B900185k27158l02600J28059j36455k42903J39250j73500j5143J36584l4045
13965B172274J41345l05363o7806k3986j8521r1041j76152P8912P6305j06469
$$ y = [3000124, 2834713, 2761511, 2736696, 2546003, 2741977, 2336565, 2162124, 2358608, 2373196, 2190097, 2317604, 2441856, 2239754, 2360771, 2123826, 2142190, 2269628, 2307553, 2075458, 2132458, 2123432, 2024403, 2023990, 2347907, 2161367, 2183064, 1941085, 2185366, 1996190, 1954890, 1945649, 1822302, 2102394, 1789629, 1834538, 2132006, 2188534, 2264669, 2033349, 1885136, 2062896, 2375823, 2359350, 3646149, 6753971, 13090027, 30673990, 39208353, 21684306, 11238299, 6958026, 5381610, 4163937, 3482850, 3283440, 3040114, 2900185, 2673027, 2370427, 2498486, 2362031, 2119128, 2258378, 2084878, 2069735, 2206319, 2172274, 2313619, 2008256, 1940450, 1916464, 1897943, 1806902, 1630750, 1709662, 1785967, 1679498]
13955A679498J77177j00577l35382L34822j14590L74423n68197L4692R3075K24992
13945A799933k73216J36502k75793N3646R5678m19025L92343J92820j50099p9465
13935A473324J5970L9131J11779j66164j77595K89211j45282j27428K09968o52563
13925H70351N61973o7157q365j22418L49311k05338k02400J89109K15305j12530
13915A467841j13399k98384K29893l2314j14321j15264J08017l7594K02465k67157
13905A029783O9833j37955L2729K14612l21707J36310K50886k44901J76949l7228
13895A169311Q0529l3624J52482j26604M8956F38789N51401j20312J57053k56072
13885I70859K17570m0434k9533m1126J51281j83116k3495j5399j84648N7435q6025
$$ y = [1679498, 1856675, 1756098, 1420716, 1755538, 1640948, 2015371, 1447174, 1481866, 1574941, 1799933, 1526717, 1663219, 1387426, 1441072, 1536750, 1117725, 1510068, 1702888, 1552789, 1473324, 1489294, 1528425, 1640204, 1474040, 1296445, 1585656, 1440374, 1312946, 1522914, 870351, 1432324, 1365167, 1356802, 1234384, 1583695, 1378357, 1175957, 1365066, 1580371, 1467841, 1354442, 1056058, 1285951, 1253637, 1139316, 1024052, 1132069, 1094475, 1296940, 1029783, 1099616, 961661, 994390, 1209002, 887295, 1023605, 1274491, 1029590, 1206539, 1169311, 1249840, 1216216, 1368698, 1242094, 1291050, 638789, 1190190, 1069878, 1226931, 970859, 1188429, 1147995, 1118462, 1077336, 1228617, 1045501, 1022006, 1006607, 821959, 879394, 793369]
13874G93369N10836n55218N7854K40357p9237L61015l81299L2105J46732k20943
13864I05571N3054J61578J67637l93952J44133o5948J1758j56582J02102J32414
13854A061765k67857l11951O01079m20116L39177J30810j02414m16429J96154
13845H10218p7915j0428K31736k78149J74407K4864R842j04160j02370K3763j68906
13834E32902K34075L37055l63226M8679j27890J35120k41870k57629N80448k9183
13824H48481J21629j57340J26518j17476k50664N6565K63925k82848k8493L25883
13814I06180l231k31972J90037k21082j73423L30539l9987R2231J29958j02000
13804H77250j90739j46624J19172L110M26349m34046J3536r021k16855K12626
$$ y = [793369, 1304205, 748987, 806841, 1047198, 967961, 1328976, 947677, 979782, 1126514, 905571, 958625, 1120203, 1287840, 893888, 1038021, 972073, 983831, 827249, 929351, 1061765, 793908, 481957, 1083036, 662920, 1002097, 1132907, 1030493, 614064, 810218, 732303, 721875, 953611, 675462, 849869, 874733, 884575, 780415, 678045, 701808, 532902, 766977, 1104032, 740806, 789485, 661595, 796715, 554845, 297216, 877664, 848481, 970110, 812770, 939288, 821812, 571148, 627713, 891638, 608790, 580297, 906180, 902949, 670977, 861014, 639932, 466509, 797048, 757061, 849292, 979250, 877250, 686511, 539887, 659059, 662169, 1088518, 654472, 668008, 658987, 442132, 654758]
13794F54758k26096K44979K1927l09241O80893m91177R0305r352J79581J12279
13784I48856j94613o7622k04216R2596L25487r7595k66660n598Q9465n0736P5355
13773F44719j60571q6363j50628N31912C64661K33175O9619k22819L2605p0284
13763D06957M08398o4118k63373P3075j02326J61869j86707L09964m906J98931
13753I37764l54349L5959l6728B15903L07020k10846m7124M28295C25035r3964
13743B31071m4873J63234K10430K9393o390J44742r1987k03332j15217K28865
13733E45936N7516J17954l58658L11046j02557J20570j44222L7664M5244j51790
13723D78703L22048l13752k42219K94029R9414j06483J2407K2899N6703L033j20822
$$ y = [654758, 428662, 673641, 695568, 386327, 1067220, 576043, 666348, 656996, 836577, 948856, 754243, 686621, 482405, 575001, 900488, 802893, 536233, 530635, 620100, 569364, 644719, 484148, 397785, 247157, 779069, 364661, 597836, 667455, 444636, 477241, 406957, 815355, 751237, 487864, 560939, 458613, 620482, 433775, 743739, 738833, 937764, 583415, 619374, 582646, 215903, 522923, 312077, 264953, 693248, 325035, 231071, 186198, 349432, 559862, 589255, 582865, 727607, 635620, 432288, 317071, 545936, 603452, 721406, 362748, 673794, 571237, 691807, 547585, 585249, 630493, 478703, 800751, 486999, 244780, 538809, 638223, 531740, 544147, 567046, 623749, 626782, 505960]
13712E05960j85195J30024L0398m7731J36082B5822N36945J9752L1943j23861
13702D90601r2816K65237K98282D77070L9332K008A64487K76685l7085J46334
13692E50421j36790j29949R4028K33509H8796J93474J28294J62910j91844L6222
13682D17852j16804o9606K89077B14115K84288k17350K63259j84540r5641K23878
13672D88009P266j9435A78772J23804K63736q8773j69814J22790q8196Q6513l3957
13661C94875K17835r5248n6224j31888q5574L70004j90215H9077K56904L08148
13651F54129j53416k21721q458K09980L392j10393A13282M18028n7416m3178k00699
13640B30017L98931k50676k7500J98159O0129B54858n764L68278k64165j53218
$$ y = [505960, 320765, 450789, 481187, 433456, 569538, 25822, 562767, 582519, 614462, 490601, 397785, 663022, 961304, 477070, 516402, 518410, 164487, 441172, 404087, 550421, 413631, 283682, 377710, 611219, 88796, 282270, 410564, 573474, 381630, 417852, 301048, 231442, 520519, 214115, 498403, 281053, 544312, 359772, 264131, 488009, 495275, 475840, 178772, 302576, 566312, 477539, 307725, 430515, 342319, 428832, 394875, 612710, 517462, 461238, 329350, 243776, 613780, 423565, 89077, 345981, 654129, 500713, 278992, 270534, 480514, 483906, 373513, 113282, 531310, 473894, 430716, 230017, 628948, 378272, 350772, 548931, 609060, 254858, 249094, 617372, 353207, 199989]
13630A99989J13400j53866K71670B07098J28996J58285k46496Q4879A64368J30603
13620B94971m1311I4499g5278B41744M2470m8817K31926A11805L4404K18294K22705
13609E87208B77031k4422j02816N31326B24065j9394Q0032J93592j11350H4790
13598A07595L77521j61509c5848A81333R2151L90162i8673C75045j26217K76931
13588E25759r1341J05246j47354A62083O3818n1732J51935N9896m3612p2907K00105
13577D69586j89274p2990D8677J62778k8391G0828L67634j52096Q6782K3240j91580
13566B04808J08071j32110K3987M26025A84655l7696L12079A71897n1729J96112
13556C16280J38278A82338E2943R7834O4971N577J39785j13840j07368c03053
$$ y = [199989, 313389, 159523, 431193, 207098, 336094, 494379, 247883, 332762, 164368, 294971, 253660, 94499, -75278, 241744, 284214, 235397, 467323, 111805, 146209, 364503, 587208, 277031, 252609, 149793, 681119, 224065, 204671, 284703, 478295, 366945, 84790, 107595, 485116, 323607, -35848, 181333, 273484, 663646, -98673, 375045, 248828, 525759, 434418, 539664, 392310, 162083, 225901, 174169, 326104, 386000, 342388, 269481, 469586, 280312, 207322, 48677, 211455, 183064, 70828, 438462, 286366, 373148, 396388, 204808, 312879, 180769, 204756, 630781, 184655, 146959, 459038, 171897, 120168, 316280, 454558, 182338, 52943, 150777, 215748, 221325, 361110, 247270, 139902, -303053]
13545C57785A52194J27815m3240B9969K00784D922J53369a80734D4690J16258
13535A60948L87589j17564j45514a04930C65711n8504o4912J96720l0894L8258
13525D46379a43775A07813K25928G1311o837L70191q9880i6441B56005k9315C8346
13513C39559j37554L506J73783j43060Q4032q9393J10940h4664C59096D769L66312
13502C71081j60833B0378P1062K74964j82299L21940d2597G6508L24859J7987
13492D19354A79539d2524D30435A84386O8648A25112J52066j8841A7666i5499
13481B87792a8256C96989j13731G8510B5154J82444J77241A78875J5303L98475
13471E92653i53A8339J43418K46512A68077K66128B06496L37999B52031c06001
$$ y = [357785, 152194, 280009, 236769, 29969, 230753, 4922, 158291, -180734, 44690, 160948, 548537, 430973, 285459, -104930, 365711, 307207, 242295, 439015, 408121, 446379, -143775, 107813, 333741, 71311, 64474, 434665, 344785, -96441, 256005, 226690, 38346, 339559, 202005, 205511, 379294, 236234, 320266, 230873, 341813, -84664, 359096, 4769, 371081, 210248, 20378, 91440, 366404, 184105, 506045, -42597, 76508, 401367, 419354, 179539, -42524, 430435, 184386, 253034, 125112, 277178, 258337, 17666, -95499, 287792, -18256, 396989, 283258, 78510, 25154, 207598, 384839, 178875, 194178, 592653, -953, 18339, 161757, 408269, 168077, 434205, 206496, 544495, 252031, -306001]
13460h2515A43081E4479J53398H2408C3800G817K4520b830C24955o5700C8388
13448C72824A72834a08731A49643n7590K97094F4867L07156j27820a32154B24568
13437B39833m1505H4272J3061K82541j28682J23905G3788J82103p8529f8394B01254
13425A59202K09329K7352j51184A19389i6286A295M08665J54217C180J94000m9492
13414A47688J32536j16500K18028A1040K25932q1350K23008j69227O3034D4898
13403B3072M7616J74979B5999a00803B99695C2717J17545Q880A9432K6622N4087
13392A00141e8143A9736K59128E0201K90422A41181J98841j09546F4888J31990
13382A96878o0061E4172Q2948K49983j03326m268F2101J38355R730R2111p3699
$$ y = [-82515, 143081, 54479, 207877, 82408, 33800, 7817, 32337, -2830, 324955, 259255, 38388, 372824, 172834, -108731, 149643, 92053, 389147, 64867, 372023, 244203, -132154, 224568, 239833, 198328, 84272, 97333, 379874, 251192, 375097, 73788, 255891, 177362, -68394, 201254, 159202, 368531, 395883, 244699, 119389, -96286, 1295, 409960, 564177, 3180, 197180, 147688, 280224, 163724, 381752, 11040, 236972, 155622, 378630, 209403, 272437, 44898, 23072, 70688, 245667, 25999, -100803, 299695, 32717, 150262, 159142, 19432, 46054, 100141, -58143, 19736, 278864, 50201, 340623, 141181, 340022, 230476, 64888, 196878, 136817, 54172, 137120, 387103, 283777, 279509, 62101, 200456, 210186, 302297, 228598]
13371B28598C7776L98542A18153a1028A65676a30739A98808k8412J98178A37742
13360a95236A49159K83960a12652B09841D9333J64947m2341Q6829a88502H6983
13349E14144G2649J04999J40572A51472J02397A09568R0300l3811k2209L03576
13339D47424A06636K08621n7694J96769O9031b12043B96093r931j10481L05581
13329D81262q6985a33295p1425A56430a54808B28587J13193E2426Q528B4502J27578
13318A52080B5879J86191A9596L76202j61634C7520M28285j71829b37956F0495
13307b3310B00501J0254K5729F7228L62262B05900J6811J52482K19314k89296
13297C05211o2262J36922a92531D03282G6552J88006A3339L01301A3448J38569
$$ y = [228598, 37776, 436318, 118153, -11028, 165676, -130739, 198808, 170396, 368574, 137742, -195236, 149159, 433119, -112652, 209841, 49333, 214280, 171939, 258768, -188502, 86983, 514144, 72649, 177648, 318220, 151472, 253869, 109568, 199868, 166057, 143848, 447424, 106636, 315257, 257563, 454332, 523363, -212043, 296093, 286162, 175681, 481262, 394277, -133295, -204720, 156430, -154808, 228587, 341780, 52426, 60954, 24502, 152080, 25879, 212070, 19596, 395798, 234164, 37520, 465805, 293976, -237956, 60495, -23310, 200501, 210755, 236484, 67228, 429490, 205900, 222711, 375193, 594507, 305211, 242949, 379871, -192531, 403282, 76552, 264558, 13339, 314640, 13448, 152017]
13287A52017b07387a1525G1458h2023I9701J7968K57817i0752K2514B26061A10083
13275B9094K45959i8330A04660c0620A0263J7545J12004J74504M134E4323b6109
13263E17299k36591b12963a6319m9893B03540L1151a04683A07235e8611A7167
13252i2250A0490g311J98l616I462Q1586g3265j32586A30838B1046g86I0240j3873
13239G6367K20425K03396a62811F6637n641K87923e7903m813B7416a98779b5653
13227b5033H5562a8124o6526I154J03808b77542a3645B61279G0714J3025Q1644
13216A65383g141A37946L3703m538o6594M089Q613a12938A31032C6850a64218
13204i3216C5099i8583F3726O3329O29b31263p3428A60290E4684a09065C72888
$$ y = [152017, -207387, -11525, 71458, -82023, 99701, 117669, 375486, -90752, -68238, 226061, 110083, 29094, 275053, -98330, 104660, -30620, 10263, 27808, 139812, 314316, 318450, 54323, -26109, 517299, 280708, -212963, -16319, -66212, 203540, 234691, -104683, 107235, -58611, 17167, -92250, 10490, -7311, -7113, -10729, 9462, 91048, -73265, -205851, 130838, 21046, -786, 90240, 76367, 296792, 500188, -162811, 66637, 60996, 348919, -57903, -62716, 27416, -198779, -25653, -25033, 85562, -18124, -84650, 9154, 112962, -277542, -13645, 261279, 70714, 83739, 165383, -7141, 137946, 171649, 167111, 100517, 104606, 113219, -112938, 131032, 36850, -164218, -93216, 35099, -98583, 63726, 127055, 127684, -231263, -304691, 160290, 54684, -109065, 372888]
13192D2697R0268J64991j4817a17775k11614A32472R3571D0698K9016D758K5701
13181C0459a39680A26525K63027A5140J16218J18133b63653F1694a01976n7002
13171a58978C34958A01247R8637e6612H7466K3785J40880K8135H6421A5547b25927
13159B05818j9717j5152a48876A07559m9409L53213c10472B7944R6624B7391J53169
13148A80560H9195J19753C7960K4258J20764k7499D3442R6750J85049H1928a76447
13136B18523m1628J58275a7641A9740M5263O4400a55887F4887J88077D1774J99149
13125B40923a52953A21353J2747B6477R3552J83285A20567e1272C11066G7611
13114B05619p8383P4156C3478a64731E2868J3116b3755m4708B30341a72915A00097
$$ y = [42697, 132965, 297956, 283139, -117775, -329389, 132472, 226043, 40698, 69714, 4758, 30459, -139680, 126525, 389552, 15140, 131358, 249491, -263653, 61694, -101976, -158978, 334958, 101247, 199884, -56612, 87466, 111251, 252131, 280266, 86421, 15547, -225927, 205818, 186101, 170949, -148876, 107559, 58150, 411363, -310472, 27944, 124568, 27391, 180560, 89195, 208948, 37960, 62218, 182982, 155483, 43442, 140192, 325241, 81928, -176447, 218523, 176895, 335170, -17641, 19740, 65003, 129403, -155887, 64887, 252964, 41774, 240923, -152953, 121353, 134100, 26477, 120029, 303314, 120567, -51272, 311066, 77611, 205619, 127236, 201392, 33478, -164731, 52868, 65984, -23755, -68463, 230341, -172915, 100097]
13102i620D11949j34576a53132B56659e2780j17658D3773K02197a68578B42620
13091F8034R956b00350C15957A29706b3994B5095J33475b13001O1761p8884E7539
13079a75164A15542L09724A68505k3545J26048H1019a34291C68292A03144L7278
13069A40422N9018C6119Q6394K28356h8367H5255a1148D52215G3426L317K14901
13058B91644j38422c5327C23510j45243p640B7899L26256a15485J9118A48978
13047C41066a7147q2967q4831D69888A73080K2994r6178g882j95910a00296B32447
13035e2490n8515G6287d8747E6785j702J36771J27910G0261R3855a11412C9954
13023a4515j97597A36663D1848J3608J68923R474F9731J63888N6008A454P2992
$$ y = [-9620, 411949, 277373, -153132, 256659, -52780, -170438, 43773, 245970, -168578, 242620, 68034, 77990, -200350, 315957, 129706, -23994, 25095, 158570, -213001, -151240, -230124, 57539, -175164, 115542, 425266, 168505, 144960, 271008, 81019, -134291, 368292, 103144, 140422, 199440, 36119, 122513, 350869, -88367, 85255, -11148, 452215, 73426, 76743, 291644, 153222, -35327, 323510, 178267, 170627, 27899, 354155, -115485, -96367, 148978, 341066, -17147, -100114, -184945, 469888, 173080, 196074, 99896, -7882, -203792, -100296, 232447, -52490, -111005, 76287, -48747, 56785, 55083, 191854, 319764, 70261, 164116, -111412, 39954, -14515, -212112, 136663, 41848, 55456, 224379, 233853, 69731, 233619, 289627, 1454, 74446]
13012G4446a57225A15235c9421M890q7978B12279q1493a41114B06959f4905I9499
13000B15343a24135A73019l5926K88126d03195B60293C1451J17815C107i2847
12989b32866C77110a92486A27752a98454K5229a7134r5079B4998L69583a46970
12978e5856D0833B938K40694I0242J06335G0795b83980I6276R4669M74a76395
12966A52357o2004b2142P731j63183a4883D3755P452A3372a44145n4813k03171
12955d02129J98259D1832K28944m4179g4960c0043A07489a34311D7173a50532
12944c308E0030K9891L7291M2520E8370O7213N7686a10850r9432C08091a66963
12932A18996l8030a93968B60481j14707E958f7435j0778K1276j8898L4991A13700
$$ y = [74446, -157225, 115235, -39421, -34531, -122509, 212279, 130786, -141114, 206959, -64905, 99499, 215343, -124135, 173019, 137093, 425219, -403195, 260293, 31451, 149266, 3107, -92847, -232866, 377110, -192486, 127752, -198454, -173225, -17134, -112213, 24998, 394581, -146970, -55856, 40833, 2938, 243632, 90242, 196577, 70795, -283980, 96276, 190945, 191419, -176395, 152357, 90353, -22142, -14411, -177594, -14883, 43755, 51207, 13372, -144145, -198958, -402129, -203870, 41832, 270776, 226597, -74960, -30043, 107489, -134311, 47173, -150532, -3308, 50030, 79921, 117212, 159732, 58370, 125583, 183269, -110850, -210282, 308091, -166963, 118996, 80966, -193968, 260481, 145774, 5958, -67435, -78213, -56937, -75835, -40844, 113700]
12920i7996J5243A56590p0011a67424A83137q8450O1003l3870c29015I0430c16868
12908E8981K0082Q9676D7677B0072L05357e8593A11595N5495D5953b48487a6620
12896A0092L70210A20864h4200q3197a285k8467p4131a1427j31030E7508a18611
12884A5288P3758a5813E9357a42751p2799i5558r1281N4778D91589B08600n3630
12873A54970q493I135a40282D6824K17200A23419a96050j36702a5745A64278J69751
12862C34029a23449E162K09670F6352j877f1670j85644A95631l4291i3705d1143
12850H9215f295m0240l1223j07018j01135A69334b4442C2215e0786C9708J19853
12839A59561k2772E1664N1861g2342j7710k094b8733I8538a0559j2073j33794
$$ y = [-97996, -82753, 156590, 86579, -167424, 183137, 94687, 155690, 121820, -329015, 90430, -316868, 58981, 79063, 168739, 47677, 20072, 325429, -58593, 111595, 167090, 45953, -248487, -16620, 10092, 380302, 120864, -84200, -167397, -1285, -29752, -103883, -11427, -142457, 57508, -118611, 15288, 89046, -15813, 59357, -142751, -215550, -95558, -186839, -132061, 491589, 208600, 154970, 146477, 9135, -140282, 46824, 264024, 123419, -196050, -332752, -15745, 164278, 334029, -123449, 5162, 214832, 66352, 64475, -61670, -247314, 195631, 161340, -93705, -41143, 89215, -6295, -46535, -77758, -184776, -285911, 169334, -24442, 32215, -50786, 39708, 159561, 136789, 51664, 103525, -72342, -90052, -92146, -28733, 98538, -10559, -22632, -156426]
12828a56426G1718N0168L13446b1735H0312a50861e7453m1236o3107A33596b60989
12816a5512F66a12348e4644A33182C8279c31099B02171e5966g751n5157n8837
12805a21745l0352H3691K5025k2430c70501B25379d6615j79860G1085K9985e7955
12793h9716I6744b11030A01838A6471a9505A93269o2144F684J75897a12949G3120
12781b6907l2979j32752F079J23863b0634A04458b16564c5953m8306B9702J13450
12770A43152l8139m8353K61405H9627K4891J39361G8685a59369j25817D4852L4637
12759G9489J09464R8727M3137A36310D6050J90905A0018K14649b42634r0396A36410
12747b18484C29859c71813J38673I3952k5223K02415q0656b9342E6385K0989B3324
$$ y = [-156426, 71718, 121886, 435332, -21735, 80312, -150861, -57453, -98689, -161796, 133596, -260989, -15512, 666, -112348, -54644, 133182, 38279, -331099, 202171, -55966, -7751, -62908, -121745, -152097, 83691, 108716, 86286, -370501, 225379, -46615, -226475, 71085, 101070, -57955, -89716, 96744, -211030, 101838, 16471, -19505, 193269, 131125, 6684, 182581, -112949, 73120, -26907, -59886, -192638, 6079, 129942, -20634, 104458, -216564, -35953, -84259, 29702, 143152, 105013, 56660, 318065, 89627, 114518, 253879, 78685, -159369, -285186, 44852, 79489, 188953, 287680, 330817, 136310, 46050, 236955, 10018, 224667, -242634, -333030, 136410, -218484, 329859, -371813, -233140, 93952, 68729, 271144, 190488, -29342, 56385, 77374, 23324]
12735i8094C04570a59144e0042A9261g636B16957i1914j83552Q9576A8395O0207
12724G8602b40127d336A47058c7591j23749A43786J65716h0563j35476q654K6193
12713a98500A6133M6315b82915B6654P5836a33610j51629B56958J1501E10b235
12701B8813J54101A2770a80650E3347L2866m1423K6985f8690A27900h1170c5201
12689F3718J67717a02188G2840l3565c5240o4693n4895A36816J32354J44102c8901
12677a19422D6590a58694n5324l7721C05110a75586A79521j9528O990l1102l4673
12666A01208K5650D9785K22055j30229J69567O6153a72905g581l5910A70405b35086
12654A06198J12619i103I587c9392B50194a81794B41075H4200B42a68344j03985
$$ y = [-98094, 304570, -159144, -50042, 19261, -7636, 216957, -91914, -275466, -185890, 18395, 78602, -240127, -4336, 147058, -37591, -161340, 143786, 309502, -80563, -216039, -224693, -198500, 16133, 62448, -282915, 26654, 102490, -133610, -285239, 256958, 268459, 510, -2235, 28813, 182914, 12770, -180650, 53347, 86213, 44790, 71775, -68690, 127900, -81170, -35201, 63718, 231435, -102188, 72840, 39275, -35240, -99933, -154828, 136816, 269170, 413272, -38901, -119422, 46590, -158694, -214018, -251739, 305110, -175586, 179521, 159993, 166983, 135881, 101208, 126858, 49785, 271840, 141611, 311178, 377331, -172905, -7581, -43491, 170405, -235086, 106198, 218817, -9103, 9587, -39392, 250194, -181794, 241075, 84200, 242, -168344, -272329]
12643b72329C5660K88034B4165c24461B58618d9287F7883j9163J109K5161K92461
12632C67451m8753j27622f82B55541H0109P6356a64860A14202r852K29091A08841
12620C3074K8036d1458j17331A02514c0270a1221G1413j4881R8220C980d7513
12608H0260G711h7816B03444k0174J37143C0312a38383C86072C651c88306C1621
12596a68621C94747c0412j42096B18354D0817p510b66341n4053I1452H322b20209
12584G6426g8698G8116j4841K46612a3816k55833A44724m8997B7401R162E087
12572A7356a82345g6551n4292a6904A41676K0041f6400k13979N2309B24612k3288
12561B01324k9916E8458a33141B6577c1279A58947J05258r723D049J21272a96089
$$ y = [-272329, 35660, 323694, 24165, -324461, 258618, -49287, 67883, 48720, 49829, 74990, 367451, 318698, 191076, -682, 255541, 80109, 156465, -164860, 114202, 104350, 333441, 108841, 33074, 61110, -41458, -158789, 102514, -30270, -11221, 71413, 56532, 154752, 3980, -47513, 80260, 7711, -87816, 203444, 183270, 320413, 30312, -138383, 386072, 3651, -388306, 31621, -168621, 394747, -30412, -172508, 218354, 40817, 33307, -266341, -320394, 91452, 8322, -220209, 76426, -78698, 78116, 63275, 309887, -13816, -269649, 144724, 95727, 27401, 36563, 5087, 17356, -182345, -76551, -130843, -16904, 141676, 161717, -66400, -280379, -228070, 224612, 201324, 171408, 58458, -133141, 26577, -31279, 158947, 264205, 254482, 4049, 125321, -196089]
12549a26861d669k41420j64851a07795k3812A28549a93689N1878a2136A15702
12538b24457e7704m8313j62212C8195d2441j05688A35709a22331j20520H7956
12527b1560k58903A42202c63150a20407q6717A26531c2275B31185j00267h4588
12516A39420O0208a69239a2466D46623E7906B4057K50078i3672A79819H9861c2214
12504C1081L00267j63955a64001B98768d5033m9796l6751k36a9577o9360H8434
12492B19119H7794d16604d3016p0836C633b04807p4654h3816a3480A64a29979
12480c1697k5725M195a078j52686B65164f7812g286B84892j05991M5799f9020
12468a95117B60897H9189a85931f3856m8628O129C09555h3670A07038b25824b6393
$$ y = [-126861, -4669, -246089, -410940, -107795, -131607, 128549, -193689, -141811, -12136, 115702, -224457, -57704, -106017, -268229, 38195, -42441, -148129, 135709, -122331, -242851, 87956, -21560, -280463, 142202, -363150, -120407, -207124, 126531, -32275, 231185, 130918, -84588, 139420, 199628, -169239, -12466, 446623, 57906, 24057, 274135, -93672, 179819, 89861, -32214, 31081, 331348, 167393, -164001, 298768, -45033, -94829, -131580, -131816, -19577, -88937, 88434, 219119, 87794, -416604, -43016, -113852, 3633, -204807, -279461, -83816, -13480, 164, -129979, -31697, -57422, -53227, -1078, -153764, 265164, -67812, -7286, 284892, 178901, 224700, -69020, -195117, 260897, 89189, -185931, -63856, -112484, -106355, 309555, -83670, 107038, -225824, -26393]
12456C17057B5535K1652N8808E0246c09991f278r4430K5490k286I769K01980l1691
12444A80058G9051N7994c00983a14352M9545p5050C6965b71439A09433J95171
12434C04604p7966b7669E4048f4146j25977A38669c79989J59234A11219b05097
12423B85776B809M3134c7918l61998J96254A88065A6441b0093I5860b7779n9204
12412h6983n4471l60200B36166A4199e9040G5615j5207b1418k13602A03905a80298
12400G8705J77042g7176B01567G9633c43077G5389K6120e380H012R6539J16932
12389B21483M8782A30988C4605i8138A87725E6505K22723C8561L65612a38509
12378H821n57a75008P9674M492c7197B1591a62038D7866M0485K20472b8262A00828
$$ y = [317057, 25535, 47187, 105995, 50246, -309991, -6278, -100708, -75218, -77504, 9769, 211749, 180058, 79051, 137045, -300983, -114352, -64807, -139857, 36965, -271439, 109433, 304604, 226638, -27669, 54048, -64146, -190123, 138669, -379989, -220755, 111219, -205097, 285776, 2809, 45943, -37918, -399916, -203662, 188065, 16441, -20093, 95860, -27779, -86983, -141454, -501654, 236166, 14199, -59040, 75615, 60408, -21418, -235020, 103905, -180298, 78705, 255747, -77176, 201567, 79633, -343077, 75389, 101509, -5380, 8012, 104551, 221483, 270265, 130988, 34605, -98138, 187725, 56505, 279228, 38561, 404173, -138509, 8821, 8264, -175008, -95334, -90842, -37197, 21591, -162038, 47866, 88351, 308823, -28262, 100828]
12365a72458A31368Q3665d8152j21373O8563O069A50355d12082A58257j9958a2076
12353A03946a5134k38969g516K742j56104D1970K56314b35553B32386a82314j08452
12342b90766L4363j6877A57710a11100A18771g559A00130a96031C26665N5695
12332C82360j14422a83927a6053A23231J58025E4698d7378D53132b9028m9145
12322g8173H3888a75713A01908J70727j5084P7691A5149K67137D1126J99518l0629
12311B10015F5196K19058a30625A79456b59301A67236b44109C0248J33399g4112
12300A09141K18476d8602A87009p1897a39708k51742A7609c8700j11408b7452
12289E7621A9291J16568a6703B38532e2461l783A3785K43588G5463Q3968o4353
$$ y = [-172458, 131368, 215033, -48152, -169525, -100962, -94893, 150355, -412082, 158257, 138299, -12076, 103946, -15134, -254103, -7516, -4774, -160878, 41970, 298284, -235553, 232386, -182314, -290766, -256403, -273280, 157710, -111100, 118771, -7559, 100130, -196031, 326665, 382360, 267938, -183927, -16053, 123231, 281256, 54698, -47378, 453132, -29028, -78173, 83888, -175713, 101908, 272635, 257551, 335242, 15149, 282286, 41126, 240644, 210015, 65196, 284254, -130625, 179456, -259301, 167236, -244109, 30248, 163647, -74112, 109141, 327617, -48602, 187009, 115112, -139708, -391450, 17609, -38700, -150108, -27452, 57621, 19291, 135859, -16703, 238532, -52461, -56244, 13785, 257373, 75463, 159431, 95078]
12278I5078m2482P0152J79791j33727K08852A70489g4366C47237p6156J18673
12268C89754r0118A36536E4994K47371l5289L4127q9611k3658o0955O4998l3916
12257A58061L21123A84208J9354c1088A33186B1109b7305e125k4892D64308A84765
12245E20354A72296F4336n690a40264A11789c4363A44136R0558c2507l9293j65937
12234b37737I168g548E9654K18095A7188J44256R50J25973d9444D55684g6421
12222B00026J55888i1632L9595B33377O3404A17541l5367K97764j87716J97281
12212C89503j14922j28407a3249j12593B97479a06081A66220p866a38681f3176
12201A82055J29716j52508f5395D6330M3666a67107d4563J919j03557D3635R0069
$$ y = [95078, 52596, 122748, 302539, 168812, 377664, 170489, -74366, 347237, 271081, 389754, 299636, 136536, 54994, 302365, 267076, 301203, 211592, 187934, 126979, 191977, 158061, 479184, 184208, 203562, -31088, 133186, 21109, -27305, -5125, -30017, 464308, 184765, 520354, 172296, 64336, 58646, -140264, 111789, -34363, 144136, 234694, -32507, -71800, -237737, 9168, -7548, 59654, 277749, 17188, 161444, 162394, 288367, -49444, 455684, -76421, 200026, 355914, -91632, -52037, 233377, 296781, 117541, 82174, 379938, 192222, 389503, 274581, 146174, -13249, -125842, 297479, -106081, 166220, 158354, -138681, -63176, 182055, 311771, 159263, -65395, 46330, 89996, -167107, -44563, -42644, -146201, 43635, 133704]
12190A33704c2778j2242A73342G854J4824K87534I2189a19839m7432D12344A22279
12178E3382M4812B4184J04182j8039J05675L5877f2719B65741G3011j0268J91953
12167B54696o6242g5324B63759j1262E2838J6880g4064C80044j86251B8891J16498
12156A45389m7595j1708P163Q9941m8555a28569j3822j72256C0937P8235m6111
12145F3061b66328C05375r5366k4103D2162J19982b81116B35022n7116a59110
12134A07907b45147l4425i4594B55983a09431r8845b4091j17564J2167C8792K21992
12123B60784J72298A45090D9836P1137L19548m5724b3915A70891D5712r253f6356
12111I1327O2313B4843J94850a6107A55548J22918f88C6057b30551C27737b68619
$$ y = [133704, -32778, -45020, 173342, 7854, 22678, 310212, 92189, -119839, -167271, 412344, 122279, 53382, 98194, 24184, 128366, 110327, 216002, 251879, -62719, 265741, 73011, 62743, 254696, 188454, -75324, 263759, 252497, 52838, 69718, -74064, 380044, 193793, 28891, 145389, 97794, 86086, 93249, 183190, 134635, -128569, -142391, -314647, 30937, 109172, 63061, -266328, 305375, 210009, 185906, 42162, 162144, -281116, 235022, 177906, -159110, 107907, -245147, -279572, -94594, 255983, -109431, -208276, -24091, -141655, -129488, 38792, 260784, 433082, 145090, 49836, 120973, 440521, 394797, -23915, 170891, 45712, 36459, -66356, 91327, 153640, 24843, 219693, -16107, 155548, 278466, -688, 36057, -230551, 327737, -268619]
12099F4167j1008c33245g649A61417b91746B55979D5233a51882A12911N96Q3941
12088A97448f1807D4405b23835b3255j88757j8913B43890P9921A25175C5332L7605
12077G2937K14532J42641b9209A42302P8278a8935q725B22070C2006a14147C80343
12065A15725i3920G3061M49913k42612A18964e6685B19952a31280j26272B60169
12054A39693L3345J29345b7717G8595a4269j19346B33306b1465A1282P5088a13546
12042e9925j02306k68478a07386k8886A11894m0098e9574B38169a18054N3535
12032f4519E3820B4302M7681J08556a40425p6525c9639A40613d1406E2564a15619
12020D4999h9167a2120B2143K09238o7845a72841A5766K02838k2730b9535q8748
$$ y = [64167, 53159, -333245, -7649, 161417, -291746, 255979, 45233, -151882, 112911, 113507, 197448, -61807, 44405, -223835, -23255, -212012, -230925, 243890, 323811, 125175, 35332, 72937, 287469, 430110, -29209, 142302, 220580, -18935, -27660, 222070, 32006, -114147, 380343, 115725, -93920, 73061, 522974, 280362, 118964, -56685, 219952, -131280, -257552, 260169, 139693, 173038, 302383, -27717, 78595, -14269, -133615, 233306, -21465, 11282, 86370, -113546, -59925, -162231, -430709, -107386, -136272, 111894, 71796, -59574, 238169, -118054, -64519, 53820, 24302, 71983, 180539, -140425, -216950, -39639, 140613, -41406, 52564, -115619, 44999, -89167, -12120, 22143, 231381, 163536, -172841, 15766, 218604, 195874, -29535, -118283]
12009a18283A21088O741a56624d6386A40374F1068h8313c3510D5265K36965o8073
11998B14157E8627a7159E9464a61954b4191A29307b47187J23295j74595j44139
11988d42626a25008I3625a57104q335C47419b35343G4426a34169b0298A02186
11977b52274J25345A61511c1602q5985d4404A36663F5940b52114H2312B6038c59503
11965a37970c2788A40230n6200a20868k002d6847A06728b45024d8380j32117R0199
11954i0298L0380a7306A47b53753j40082h8126L8637G8680M497b63216b9452l0370
11942e9822E7170b16022a7868A68346F8198h5846m6908H5546k6797c24564b5348
11930a45059c7421B33768b50011f0378E3827a55199G327d24601I6054J8108b69932
$$ y = [-118283, 121088, 127829, -156624, -46386, 140374, 61068, -88313, -33510, 45265, 282230, 214157, 58627, -17159, 59464, -161954, -24191, 129307, -247187, -123892, -298487, -442626, -125008, 93625, -157104, -165439, 347419, -235343, 74426, -134169, -20298, 102186, -252274, -126929, 161511, -31602, -117587, -44404, 136663, 65940, -252114, 82312, 26038, -359503, -137970, -32788, 140230, 84030, -120868, -122870, -46847, 106728, -245024, -48380, -180497, -90298, -59918, -17306, 147, -253753, -393835, -88126, -49489, 78680, 83177, -263216, -29452, -59822, 57170, -216022, -17868, 168346, 68198, -85846, -132754, 85546, 58749, -324564, -25348, -145059, -37421, 233768, -250011, -60378, 53827, -155199, 7327, -424601, 96054, 114162, -269932]
11918c136m6154A69609n6027h1940A21805d5594d831j44291q6566P1094B31684
11906a30036A399f5577A2775g6203A72694q1223c2984k76431L6904L7032a1711
11894A01774K3484d0293C31040d814D1211J24665C7953J30124b16187B01491G3922
11882a31059c6211A2411a99651J816m5723R5295A22550b57749J10692j46978A85002
11870b85681e2477H1135b2801m4292B32996k5097c7073F1314g0557l4591B7571
11858a01163A4039c4318B64444f7823B5441a14833N6838p5079c1315G7013C17
11846a36661A44419N5399o8657L14303D8939a03591k31220D98441D2K83960a15203
11834b2815j33410H4299g058A05487C6029g4532A14119M2189n7988b53877O6473
$$ y = [-3136, -49290, 169609, 113582, -81940, 121805, -45594, -4831, -149122, -235688, -164594, 231684, -130036, 1399, -65577, 12775, -76203, 172694, 91471, -32984, -309415, -272511, -235479, -11711, 101774, 125258, -40293, 331040, -4814, 41211, 165876, 37953, 168077, -216187, 201491, 73922, -131059, -36211, 12411, -199651, -197835, -243558, -148263, 122550, -257749, -147057, -294035, 185002, -285681, -52477, 81135, -22801, -67093, 232996, 207899, -37073, 61314, -70557, -105148, 27571, -101163, 14039, -34318, 264444, -67823, 25441, -114833, -57995, -133074, -31315, 77013, 317, -136661, 144419, 199818, 131161, 445464, 48939, -103591, -334811, 498441, 42, 284002, -115203, -22815, -156225, 84299, -7058, 105487, 36029, -74532, 114119, 156308, 98320, -253877, -187404]
11823a87404c6123j69599B8265b12998p7831B41080C030J15693N8285b31104J01036
11812a30068l7975B3997d04933a04109B53223j17755a02617j03070J00863r0021
11802a94845f8230k31417A16425i6386J4447l61530h4640L5927n749A86083c42640
11790A35780O4415i1750j12956j475k2100H8344C2652f1060j1341A73187a25981
11778b13970K9222D0866b48782b3971A33701b60619D19472D8255P9817d24566
11767a86673h3458L1319G9931C148b27329A8876J3910e6383j12887P2929n6985
11756a53326B07786a47150k90276J89293B1908f6820A13142b52683F8290b9464
11745A91930a66261A9897a09846k62847A40017a62005G0870M5d917G55b5169j49567
$$ y = [-187404, -36123, -205722, 28265, -212998, -290829, 241080, 3030, 118723, 177008, -231104, -130068, -168043, 23997, -404933, -104109, 253223, 135468, -102617, -205687, -104824, -194845, -68230, -299647, 116425, -96386, -81939, -443469, -84640, -48713, -54462, 186083, -342640, 135780, 200195, -91750, -204706, -206181, -228281, 88344, 32652, -61060, -72401, 173187, -125981, -213970, -184748, 40866, -248782, -23971, 133701, -260619, 419472, 48255, 128072, -424566, -186673, -83458, -52139, 79931, 3148, -227329, 18876, 32786, -56383, -169270, -96341, -153326, 207786, -147150, -437426, -248133, 21908, -66820, 113142, -252683, 68290, -29464, 191930, -166261, 19897, -109846, -372693, 140017, -162005, 70870, 70915, -4917, 755, -25169, -174736]
11733a74736A58447o6074a51060e5337f942p6799F1801k2817Q3462l4763A2368
11721b51763O1313n0186A388J95135G0116a25030A1344J23759a45210A05389b9740
11709c17325g0385j21519A8488K85457j32260N2110f8947F7251f0802k7204K4720
11698f3286G360L5976k0190K45091a88952A15906b57072e175l7298B40640a13698
11686A7177a41493B7688i5003A46015i6946B89281h5662j39034a9478l9667k28611
11675b87756N1269H2249d3736A01115a29102D9741a75648A02327K4410O0993c8341
11663B78773a00934o8363B97248p8201F6076P5776a70382q7579A08669R8605J3958
11652B21232b9997B42229r3093l1897l9614b0386A95058F9216M0797o637g248
$$ y = [-174736, 158447, 92373, -151060, -55337, -6942, -83741, 61801, 38984, 122446, 87683, 12368, -251763, -190450, -240636, 1388, 196523, 70116, -125030, 11344, 135103, -145210, 105389, -29740, -317325, -70385, -191904, 18488, 303945, 171685, 223795, -68947, 67251, -60802, -88006, -63286, 7360, 43336, 23146, 268237, -188952, 115906, -257072, -5175, -42473, 240640, -113698, 17177, -141493, 27688, -95003, 146015, -96946, 289281, -85662, -224696, -19478, -59145, -287756, -236487, 82249, -43736, 101115, -129102, 49741, -175648, 102327, 126737, 187730, -38341, 278773, -100934, -169297, 297248, 219047, 66076, 141852, -170382, -257961, 108669, 207274, 221232, -29997, 242229, 149136, 117239, 77625, -20386, 195058, 69216, 110013, 103376, -7248]
11640I519f4624o2945b7656A11482M0365a61770d9729q3909C8075g7281A99233
11628C3803R4903K1092J72098C7194a54784j2559I5206a05747b9995I1145a61527
11616a50184c7364I7506A9408a4120l25640G2134a77729H8135f5292D3734J9860
11605F3594K06213a26216A29903J7327a08274b4070r2063L1883a1899B33505a10414
11593b36332A06279a1090B11407i8247m8450N1914k3066L8452B61057r6327J81553
11582C46283a54833l0745C89639b49969B97202r2055q1474b54188H0855i2292
11571B63659G5356K86968F6345Q6047J93748a38518B58686Q5753D2804K56396
11561B99200f4802G3210J69594b5271A51028a78702H88i590k56451d5363j95160
$$ y = [9519, -64624, -127569, -27656, 111482, 151847, -161770, -49729, -133638, 38075, -77281, 199233, 33803, 128706, 149798, 321896, 37194, -154784, -167343, 95206, -105747, -29995, 91145, -161527, -150184, -37364, 97506, 19408, -14120, -339760, 72134, -177729, 88135, -65292, 43734, 63594, 269807, -126216, 129903, 147230, -108274, -24070, -116133, -84250, -11899, 233505, -110414, -236332, 106279, -11090, 211407, -98247, -146697, -94783, -117849, -79397, 261057, 164730, 346283, -154833, -185578, 389639, -249969, 297202, 205147, 123673, -254188, 80855, -92292, 263659, 75356, 362324, 66345, 152392, 346140, -138518, 258686, 344439, 42804, 299200, -64802, 73210, 242804, -25271, 151028, -178702, 888, -9590, -266041, -45363, -240523]
11550b40523i0268C00642G0132J15560d8576q0380C29513G7372A8746a90562B79968
11538B42057f3084A24325a32103D5391L56920B6126L60356a33673D23817D4562
11527B11045D1114Q7931b11540f1783B27738r7556a3607q1121L1400j07298A67870
11515F4645J84119b31990A29197O2463e2015C91695b42328A20063a27050O1951
11505f5099C28588A41379a06177E9981a1178C53518a92672D3242j0658a11532
11494A84443J12436b6799C17731a09251L7037B97297N1970a95818A28900d9270
11483H9900b07159a2708F0815A3682J95011m91r3438K01166A39212K29769e6713
11471f9485l2345M2824E3564J20627m1476L03269D4048a50294M3973j08101B93170
$$ y = [-240523, -90268, 300642, 70132, 185692, -48576, -128956, 329513, 77372, 18746, -190562, 279968, 242057, -63084, 124325, -132103, 45391, 402311, 26126, 386482, -133673, 423817, 44562, 211045, 41114, 129045, -211540, -61783, 227738, 130182, -13607, -94728, -63328, -170626, 167870, 64645, 248764, -231990, 129197, 191660, -52015, 391695, -242328, 120063, -127050, -65099, 328588, 141379, -106177, 59981, -11178, 353518, -192672, 43242, 32584, -111532, 184443, 296879, -26799, 317731, -109251, -72214, 297297, 349267, -195818, 128900, -49270, 89900, -207159, -12708, 60815, 13682, 208693, 208202, 114764, 315930, 139212, 368981, -56713, -69485, -101830, -59006, 53564, 174191, 132715, 435984, 44048, -150294, -106321, -214422, 293170]
11459a63305R736A24211b59610G3007K469b479j72548j09118l0177P6098R3292
11448a44932j38818Q5564b5757k42165E8200N4206A4051d04217i3790E9582K7845
11437H7427a67254A89829q2510R1534b30738B15785R6800F3990O4151a11552B63230
11425a23904D9206f8763k10049n7197E1952d385j80469B31806h855F1603b94408
11413A77528L4239E4806K40115A12746j7657A7266J29397J7393d811I5784d762
11401I1914i0485j0730L7529B3311g1686b0364a25j27088L0429p8344Q3097j07330
11389a99361g6701m89251a35342H6678d66509A26928d0727j07727N2424A80467
11378a02265I8343e16E5744J14726k08a72195j778d6101B74751B4772a06825D4471
$$ y = [-163305, -153569, 124211, -259610, 73007, 75476, -2479, -175027, -284145, -314322, -238224, -144932, -283750, -198186, -25757, -267922, 58200, 112406, 14051, -404217, -93790, 59582, 87427, -167254, 189829, 107319, 198853, -230738, 215785, 312585, 63990, 128141, -111552, 263230, -123904, 49206, -68763, -278812, -336009, 51952, -4385, -184854, 231806, -8855, 61603, -294408, 177528, 211767, 54806, 294921, 112746, 95089, 17266, 146663, 164056, -4811, 95784, -4762, 91914, -90485, -101215, -63686, 23311, -71686, -20364, -125, -127213, -96784, -175128, -92031, -199361, -76701, -565952, -135342, 86678, -466509, 126928, -40727, -148454, -96030, 180467, -102265, 98343, -516, 55744, 170470, 170262, -172195, -173973, -46101, 274751, 24772, -106825, 44471]
11365A24363c88952H3059J60260j08482b90604e9069k28745i0313D3340b2903
11354B5933d6515A43538G0026R8882b4957j38592R576b5630j66169N2261B59528
11342c2960r4769B62441o5366B714L0806M5941C1083f0798d485k1581A33829b65919
11329B53a60688A76466a37826K5754G0176J29542c86117A47277f3434m58689B17390
11317b23600B73949j33048D6058g5772K4671B33328a15950A56288a4517k28432
11307b42949f8284k05820A81706e3822A59536B8771L9309P9720c4786m39523C3001
11295b49325G6763P3949b76371d606k2161j64004A51160G058a81662h4880j0426
11284i5306I8280g2511B04446r5927g5481j65274o5595J24413q7125B42816q6302
$$ y = [124363, -388952, 83059, 243319, 134837, -290604, -59069, -287814, -90313, 43340, -22903, 25933, -46515, 143538, 70026, 168908, -24957, -163549, -153973, -25630, -191799, -139538, 259528, -32960, -127729, 262441, 197075, 2714, 33520, 79461, 31083, -60798, -4485, -26066, 133829, -265919, 253, -160688, 176466, -137826, -112072, 70176, 199718, -386117, 147277, -63434, -522123, 217390, -223600, 273949, 140901, 46058, -75772, -51101, 233328, -115950, 156288, -14517, -242949, -68284, -274104, 181706, -53822, 159536, 28771, 68080, 147800, -34786, -474309, 33001, -249325, 76763, 150712, -276371, -4606, -26767, -190771, 151160, 7058, -181662, -84880, -95306, 98280, -72511, 204446, 108519, -75481, -240755, -306350, -181937, -269062, 242816, 156514]
11273A56514f0448B59e2434m1376k56197C482K24548a81101a8102A42765b03287
11261e0112j29859p2634C33964a77612b7955r7269l3298j18536b7247n157I5469
11249a40402B6582c9908l50468d8972l9405k1194q1157b1681A67314b40019I8602
11237B65056b00598C2892N4639a77807H25f526A86449a67914E8441b49520E7278
11225b52117a00258d1988A66129A7323b32518i0860k3943J1549E393f3976D237
11213A59668e7814j76607a14541Q100J4492L2394B08515a0157k45378a12025G625
11201F0737M01P5583a32858d708j68316I4103a53859E4671J15006c28585E1215
11189A15500f8440l34791i0886A44944J20496h8878j77545J11658I8945D915K43425
$$ y = [156514, -60448, 259, -52434, -93810, -350007, 3482, 228030, -181101, -18102, 142765, -203287, -50112, -179971, -252605, 333964, -177612, -27955, -125224, -158522, -277058, -27247, -32404, 95469, -140402, 26582, -39908, -390376, -48972, -88377, -109571, -190728, -21681, 167314, -240019, 98602, 265056, -200598, 32892, 87531, -177807, 825, -6526, 186449, -167914, 58441, -249520, 57278, -252117, -100258, -41988, 166129, 17323, -232518, -90860, -114803, -103254, 5393, -63976, 4237, 159668, -57814, -234421, -114541, -106441, -91949, -59555, 208515, -10157, -255535, -112025, 7625, 60737, 61138, 136721, -132858, -4708, -173024, 94103, -153859, 54671, 169677, -328585, 51215, 115500, -68440, -403231, -90886, 144944, 265440, -88878, -266423, -154765, 98945, 4915, 248340]
11178B48340a25124m3031J1315i632E4191J14124h1558K7300j57877P6304f3339
11166f2765l55502A83412b72247B10795c20498F5210f18856b45823Q9173B42483
11155d1053k35069h8426F6681a24641A35415d15153A11834J53579b9198B20025
11144a64741E3909a04702A9835Q9472J1030b16993h3244G7844a65284A61407a17907
11132A48766a69548I4725c9098B7824M8157Q0572J00202i4181D48666i840o1009
11121g0849b9658a1604j98809B1826i3806J0554D02443g0157A00587a10000e1830
11109A00598d4245B7041J01053A259K64494a7473p4542F1444j2191C125g7769
11097E61095b0951j22121F5303J85286m4820e8443J7536A17212a57810B20810
$$ y = [248340, -125124, -168155, -156840, -9632, 54191, 168315, -81558, -54258, -212135, -135831, -63339, -62765, -418267, 183412, -272247, 210795, -320498, 65210, -618856, -245823, -156650, 242483, -41053, -276122, -88426, 66681, -124641, 135415, -415153, 111834, 265413, -29198, 220025, -164741, 53909, -104702, 19835, 109307, 120337, -216993, -83244, 77844, -165284, 161407, -117907, 148766, -169548, 94725, -39098, 27824, 75981, 156553, 256755, -94181, 448666, -9840, -70849, -29658, -11604, -210413, 21826, -93806, -83252, 402443, -70157, 100587, -110000, -51830, 100598, -44245, 27041, 128094, 1259, 265753, -17473, -92015, 61444, 49253, 3125, -77769, 561095, -20951, -143072, 65303, 250589, 205769, -58443, -40907, 117212, -157810, 220810]
11086F6364K61828o877h0576A20341d5786A51796a04682I8230J8617O8783J16473
11075C02103K0473o0699B0539J52632a54907I9245J77159I3739K44233H0781N51025
11064F31806E259L34904j21746K94833A61381K50712j2242J31784k06367M1199
11054C66467J26631k24948P1968L20627N0303B34393N0428J06622L34065k48934
11044D76574q1363Q3055J8671J88672m7687k28042K88014j61488n2206D3142M77770
11033E20912K29690l57115J22438j5389m4984A70530L37025j69304L0871R9097
11023D68219M0355K57878m8796j68117k46471L02736k30681J04072o5093M9838
11013D63940k4182F1503M50859P9687m5208j96398K45988N0089k18341K75240
$$ y = [66364, 328192, 321315, -80576, 120341, -45786, 151796, -104682, 98230, 116847, 185630, 302103, 322576, 261877, 20539, 173171, -154907, 99245, 276404, 93739, 337972, 80781, 631806, 5259, 340163, 218417, 513250, 161381, 412093, 399851, 531635, 325268, 366467, 493098, 268150, 340118, 660745, 711048, 234393, 284821, 391443, 725508, 476574, 395211, 478266, 496937, 685609, 637922, 409880, 697894, 536406, 484200, 43142, 520912, 750602, 393487, 515925, 500536, 455552, 170530, 507555, 338251, 369122, 468219, 508574, 766452, 717656, 549539, 303068, 605804, 375123, 479195, 414102, 463940, 439758, 61503, 512362, 592049, 546841, 350443, 596431, 646520, 428179, 703419]
11003G03419B22571L66909A53534J66658J03048r19J71329J3065j75422J80081
10993F11374r1931j49926L14139A90408O35897k81046Q5123k39069M60346j80288
10983F71371K08330p9373k6208L1672J00769p5463q9927l4802L45666j85372L97575
10972A264238j63582K23687L49700K33953k2665O4782o1987j41085J53137J17710
10962B017888o90165M1623l15945M44483k52638J57714l017L01525m98436m478
10952A198554M89778l03434l35453k34582J1881C88426K25957k67339K57436j27616
10942D76864B33383K01311H7571J32184N3257E8858J42103A0995a05746A06977
10931f6460J836A99469b2944j16364A8484a1625D8295a1045l51492J65460P2060
$$ y = [703419, 222571, 589480, 153534, 320192, 423240, 422321, 593650, 606715, 431293, 611374, 519443, 369517, 683656, 190408, 826305, 545259, 630382, 391313, 851659, 671371, 879701, 800328, 774120, 805792, 906561, 831098, 741171, 706369, 1052035, 866663, 1264238, 1100656, 1324343, 1674043, 1907996, 1885331, 1950113, 1888126, 1747041, 1900178, 2017888, 1327723, 1369346, 1053401, 1497884, 1245246, 1402960, 1399943, 1701468, 1203032, 1198554, 1688332, 1384898, 1049445, 814863, 826744, 388426, 614383, 347044, 604480, 476864, 233383, 434694, 87571, 219755, 273012, 58858, 200961, 10995, -105746, 106977, -66460, -64624, 199469, -22944, -139308, 18484, -11625, 48295, -11045, -362537, -197077, -125017]
10920a25017M7127j09840B83879g3961j17456A89253a35007A39862i4933A8073
10909A70620c8868g841j01248l8728A26037K04218a51518A10181J04801a52861
10898c7736A7274a10752A13452b24319e8372F9863a4654l15710i3606j44991Q4329
10887a54268b2056l55422H1690b75437a1313B26823a00738d9527k0923A58517
10876A0082a24972A66608h5851b5580A21969a92752C40651c82721B42013f1787
10865H7359d4279A0247K4433a67208E937L07306a67034I2223D0793a37651p340
10854a44991A49025a44469O7947j4560K0374b3585k91048a56592d8418A51184
10843H1329a13771J8750A37572b66529A17017d8782A48624a71381o0471D735J01513
$$ y = [-125017, -77890, -187730, 283879, -73961, -191417, 189253, -135007, 139862, -94933, 18073, 170620, -38868, -7841, -109089, -147817, 126037, 330255, -151518, 110181, 214982, -152861, -37736, 17274, -110752, 113452, -224319, -58372, 69863, -14654, -330364, -93606, -238597, -154268, -22056, -377478, 81690, -275437, -11313, 226823, -100738, -49527, -70450, 158517, 10082, -124972, 166608, -85851, -25580, 121969, -192752, 340651, -382721, 242013, -61787, 87359, -44279, 10247, 34680, -167208, 5937, 313243, -167034, 92223, 40793, -137651, -144991, 149025, -144469, -76522, -91082, -70708, -23585, -314633, -156592, -48418, 151184, 81329, -113771, -95021, 137572, -266529, 117017, -48782, 148624, -171381, -231852, 4735, 106248]
10832A06248Q5151f630j70150F9923K0675J4761k117j0540i0413G6267O1588b6610
10819f5534l7800k23423a8058j89457h66n270j82788i3052C0821a22204j26724
10808b48928f7641o1242k71674C70769B4019E063i3651a0287j74888A48548c53739
10796h8082m801K0238o9435B4007L4791d27712A83352E3091g4576j65567a08810
10784i3997a6131r6933C39271b9414D26969a75980O9740m73649A63500a73167
10773A79492a18044C8172a84971a00k1898l18327f7558m46002b37420f2269A10942
10761H2857J04779C1608c09201A11520c5542o6764b3161j56036N8633B05855d7900
10749b8955I0159b16032D38363E7154d7588k76252a07675A60608H812K46106h3674
$$ y = [106248, 191399, -6630, -176780, 69923, 90598, 105359, 103242, 92702, -90413, 76267, 137855, -26610, -65534, -103334, -326757, -18058, -207515, -866, -6136, -188924, -93052, 30821, -122204, -248928, -67641, -128883, -400557, 370769, 24019, 5063, -93651, -10287, -185175, 148548, -353739, -88082, -92883, -72645, -142080, 24007, 58798, -427712, 183352, 53091, -74576, -240143, -108810, -93997, -16131, -113064, 339271, -29414, 426969, -175980, -106240, -579889, 163500, -173167, 179492, -118044, 38172, -184971, -100, -21998, -340325, -67558, -513560, -237420, -62269, 110942, 82857, 187636, 31608, -309201, 111520, -35542, -102306, -23161, -179197, -120564, 205855, -47900, -28955, 90159, -216032, 438363, 57154, -47588, -323840, -107675, 160608, 8812, 254918, -83674]
10737e4575l4208o7324A603a75061B55369a36349K162E8262f5647A12905B7592
10725A32532a16767L9331k10018P0169P5040j24692a00735A69549j5952D4361
10714a61060j12076d0664a6488A1957P3791a66301K1668e6880j39668o6695H7715
10702b0122o183j47469h5963B39955a47481M4087K5471k82923D11178a08246L0320
10691g7926A21626c6744D22342b0031k77250J37112e1561j82775b1204I3556e5709
10679i6597j67055R9863r1194J05994M9373I0780K27818d8165k70316K4367A69489
10667c8992A50432M7737a00300A64447g0131D5802f5423b4725j11897a6839j07873
10656a24712A5742K7432J31052F9833a0151j84016D9946b60387E7585c51988A17477
$$ y = [-54575, -88783, -156107, 1603, -175061, 255369, -136349, -134187, 58262, -65647, 112905, 27592, 132532, -116767, -77436, -287454, -217285, -142245, -266937, -100735, 169549, 153597, 44361, -161060, -273136, -40664, -16488, 11957, 85748, -166301, -144633, -56880, -196548, -263243, 87715, -20122, -26305, -173774, -85963, 239955, -147481, -103394, -77923, -360846, 411178, -108246, -77926, 121626, -36744, 422342, -20031, -297281, -160169, -51561, -234336, -21204, 93556, -55709, -96597, -263652, -163789, -254983, -148989, -99616, 90780, 318598, -48165, -318481, -294114, 169489, -38992, 150432, 198169, -100300, 164447, -70131, 45802, -65423, -24725, -136622, -16839, -124712, 15742, 43174, 174226, 69833, -10151, -194167, 49946, -260387, 57585, -351988, 117477]
10644B45294e9472j11960c938I1569l3485K01893b6398j5812A43084k1161a72647
10632C648i9742n9653A68110a31141e7238k40656a15667l1456A8987a6279A3307
10620a04737D0071a66542D38546d49448b3644E8637d51413a19936F1637k4541
10610C7096e990l223I0066m0434J1076b52758a12084A9839Q9561i9606j13517
10599b13123J8560p3257j69124A14440a37117j79213B9978Q6095D2160f4459q8880
10588a53339q8904e5960A25904i9671j38611A75535i1708D2598b48367B31169
10577F583O9407C2552a2614B00116p9858d08l95798E9250Q5260m4625J59626D1462
10564D2173i9055A69240P6796D9940b09325A53862a93408f4459A0186Q0664A0077
$$ y = [245294, -59472, -171432, -3938, 91569, 58084, 259977, -26398, -42210, 143084, 121923, -172647, 3648, -99742, -159395, 168110, -131141, -57238, -297894, -115667, -147123, 18987, -16279, 13307, -104737, 40071, -166542, 438546, -449448, -23644, 58637, -451413, -119936, 61637, 37096, -5990, -9213, 90066, 49632, 60708, -252758, -112084, 19839, 109400, -99606, -213123, -194563, -267820, -436944, 114440, -137117, -316330, 29978, 116073, 42160, -64459, -153339, -242243, -55960, 125904, -99671, -238282, 175535, -91708, 42598, -248367, 231169, 6583, 75990, 32552, -12614, 200116, 120258, -408, -396206, 59250, 144510, 99885, 259511, 41462, 42173, -99055, 169240, 246036, 49940, -209325, 153862, -193408, -64459, 10186, 90850, 10077]
10552D5509h8328A11889a33812q0653m1207k1200h6783D3949o729c68550a19179
10540C4523f0140k10574E8760J02793e7969k86112J01325N9446G7989J16126r4526
10529I9589a37358m8480A08541B165J8824J50390a20221A32634b57111h0564j42572
10518b23136N7678C5407h4753n5570r1535Q539A06807g2429A45779B0818O0461
10507H1279i4045j09638H5387b21896p7690A45242c3064n21k86261h6228k7188
10496a13416g463k77445A93620a79029g040k11907Q5425e5975E0858b2249A6382
10484b09506K4669J4116q2447e9072H8002g6104A9292J08271P0469j1536j0548
10473A75948K09129d2379j10180B2896g2728A95907B5310J56377o0814h2761j06862
$$ y = [45509, -88328, 111889, -133812, -214465, -255672, -276872, -86783, 43949, 37220, -368550, -119179, 34523, -60140, -270714, 58760, 161553, -57969, -344081, -242756, -183310, 77989, 194115, 99589, -137358, -185838, 108541, 2165, 20989, 171379, -120221, 132634, -257111, -80564, -223136, -165458, 35407, -84753, -140323, -231858, -223319, 106807, -72429, 145779, 20818, 81279, -94045, -203683, 85387, -221896, -299586, 145242, -33064, -33585, -319846, -86228, -113416, -7463, -284908, 193620, -179029, -7040, -218947, -133522, -55975, 50858, -22249, 16382, -209506, -184837, -170721, -253168, -59072, 88002, -76104, 19292, 127563, 198032, 186496, 175948, 385077, -42379, -152559, 22896, -72728, 195907, 25310, 181687, 120873, -82761, -189623]
10462a89623h4246A18706B4598P9514b3877o8620M3937G1799a04666F7822k4590
10451D3232R4246h4240l2181C2740i3669K1928E324J37996a36895k67182A20827
10439i0246q0350B05091E8572b52137j10612Q0015A42138C615i2887I8710B1960
10427a66962A7835J6823P4025j2636G420a53240B92245r8709b89541I6578P2402
10416A68980b86954d3424C5629a05075I7932f3404R382r1209c1658H4099d0027
10404d946l28383a51795m9680d3217a4930j84298N5561B2750N5867a24319B00493
10392a1999A07432L1600K6579a57416C04473P699G5119e0032A26206a51659J4415
10381a37244a9519h963A62348n8593D6639K9504L936N1434j3230j8320g2331D73833
$$ y = [-189623, -84246, 118706, 24598, 104112, -23877, -92497, -48560, 71799, -104666, 67822, 43232, 137478, -84240, -116421, 32740, -93669, -71741, 5324, 143320, -136895, -404077, 120827, -90246, -170596, 205091, 58572, -252137, -362749, -282734, 142138, 3615, -92887, 98710, 21960, -166962, 17835, 34658, 108683, 96047, 7420, -153240, 292245, 193536, -289541, 96578, 168980, -286954, -43424, 35629, -105075, 97932, -63404, -54022, -145231, -31658, 84099, -40027, -4946, -333329, -151795, -201475, -43217, -14930, -199228, -143667, 22750, 78617, -124319, 200493, -11999, 107432, 139032, 165611, -157416, 304473, 312172, 75119, -50032, 126206, -151659, -137244, -19519, -8963, 162348, 103755, 46639, 76143, 80079, 131513, 118283, 99963, -72331, 473833]
10368D4255Q0051J905J8925J59855Q7711A63315m4375k4578b6971E05163d0030
10356E14534k00089F1524J81869j10031a5874E29554A8584L82087R7723A24226
10345C77051a12753L9520D61728k02923J04087A36273K99498E8530K9083K77955
10335C65568a3413B03947J24176C5378J4642K32288N9508a39088I2540m3008J1000
10324F0532j3377L3580l5483Q3244B9642J88165J4350d820B94693M8896A36230
10312F4625R3110c39384A81341J00848A22255l0520b0705A2460a19438o3207h6931
10300C8311b6890j32511j03290J30068j10961E4974a86779l16116a84014A02853
10289B47808I2400b73464a14927A20487D8240N0016i8820r5591E7186b03054D8920
$$ y = [44255, 124306, 126211, 145136, 304991, 392702, 163315, 118940, 94362, -26971, 505163, -40030, 514534, 314445, 61524, 243393, 133362, -15874, 529554, 18584, 400671, 498394, 124226, 377051, -112753, -73233, 461728, 258805, 362892, 136273, 435771, 58530, 87613, 365568, -13413, 203947, 328123, 35378, 50020, 282308, 341816, -139088, 92540, 49532, 60532, 47155, 80735, 45252, 128496, 29642, 217807, 232157, -4820, 294693, 343589, 136230, 64625, 157735, -339384, 181341, 282189, 122255, 91735, -20705, 12460, -119438, -182645, -86931, 38311, -26890, -159401, -262691, -132623, -243584, 54974, -186779, -502895, -184014, 102853, 247808, 92400, -273464, -114927, 120487, 48240, 98256, -98820, -194411, 57186, -203054, 48920]
10277i6096i919j55918b0147C8406a83076N873L8414F5183a65582c2803B40143
10265F1358c15115J34710D291K75353B6299a39071B42392r6102a51249D31262
10254B10010P8791R7290O5864j1470j33863j22864l8786n8687R9272b0312l59185
10243c79497c9969F8022b83571a38949F2361a43656e9612p0254A77939C153J28791
10232A31944C9937a07323j63799A43451a540j70638A60147c7978D9817a10683
10221E4967a75720m02470A0434d4172D3612i9884K2597B27589J14815C8874a471
10209a23621j75987Q2091B0874J8580a86733O7484n4950N3715e9213j38382K2284
10198a75311a4592j58202B01395a15696L6990J1873A00943M5408b50186B3896
$$ y = [-96096, -9919, -165837, -20147, 38406, -183076, -177203, -138789, 65183, -165582, -32803, 240143, 61358, -315115, -180405, 4291, 279644, 26299, -139071, 242392, 146290, -151249, 431262, 210010, 288801, 386091, 451955, 440485, 306622, 183758, 144972, 86285, 185557, -20312, -379497, -39969, 68022, -283571, -138949, 62361, -143656, -59612, -129866, 177939, 3153, 131944, 39937, -107323, -271122, 143451, -1540, -172178, 160147, -37978, 49817, -110683, 54967, -175720, -578190, 10434, -44172, 43612, -99884, -77287, 227589, 342404, 38874, -1471, -123621, -299608, -217517, 20874, 39454, -186733, -119249, -174199, -120484, -59213, -197595, -175311, -14592, -172794, 201395, -115696, -78706, -66833, 100943, 146351, -250186, 23896]
10187c5527A39924a8216I9526b47200J17727n243j62188a31681j02161b934G1273
10175i3583A25786C6185c39612C7783a68011G1125a64655O1399G0489a30587e5262
10163E7872a2382A82069g7272r205B03275a41511e7531L648k13825c6938j85221
10152b22159G0124a69945N9035r6220j53930m3082a41796I4837b11390B72466
10141B7952B039K2015d4095J2234B25720a71579A4175e63966C754a28484B57688
10129a05983A7071a95455a5095C7794A0744O6333a27757e3432A98346o5748c59075
10117c05202i5116L1539C28976a01127J5174o5011j69976D9996h8427B12982A7091
10105C8473L4933A227a50347A09245b23726J8780G7567a17053j64198a26686j24637
$$ y = [-35527, 139924, -18216, 99526, -247200, -129473, -134716, -296904, -131681, -233842, -2934, 71273, -93583, 125786, 36185, -339612, 37783, -168011, 71125, -164655, -103256, 70489, -130587, -55262, 57872, -12382, 182069, -77272, -86477, 203275, -141511, -57531, -53883, -267708, -36938, -222159, 70124, -169945, -110910, -207130, -361060, -404142, -141796, 94837, -211390, 272466, 27952, 2039, 24054, -44095, -31861, 225720, -171579, 14175, -563966, 3754, -128484, 257688, -105983, 17071, -195455, -15095, 37794, 10744, 77077, -127757, -53432, 198346, 132598, -359075, -305202, -95116, -63577, 328976, -101127, -85953, -150964, -320940, 49996, -88427, 212982, 17091, 38473, 73406, 1227, -150347, 109245, -223726, -204946, 77567, -117053, -281251, -126686, -251323]
10094b51323f5157l29332F7259B2539J5591Q8679a7014j4212E6918g7758H7776
10082C4959R3637l4766A6985a46574j93211A0368a10087j36343f3017A91031a55514
10070A95864N1908f4682j59661M6578j04072B7802g7206b8864K78k64017A46845
10058C0397d8920D0666f2683B4456a7954j71701A30372a01329a8970D3230L4885
10047G8115j4124a16010A66651l8641e7000j99928a4105j0578A18043f4876l89933
10036d54809B15499e225l26774e8423j08313B67129c2206l1388K3193j616n5007
10025i7024d5031l59128A62212l8949b07045n3732g6828C13430a10521b7722A22261
10013a8807H0627d4521j32458C55027D1503f9365A77665k1202d29056g2640J2280
$$ y = [-251323, -65157, -394489, 67259, 22539, 38130, 126809, -17014, -31226, 56918, -77758, 87776, 34959, 128596, 93830, 16985, -146574, -339785, 10368, -110087, -246430, -63017, 191031, -155514, 195864, 247772, -64682, -224343, -177765, -281837, 27802, -77206, -28864, -28586, -292603, 146845, 30397, -48920, 40666, -62683, 24456, -17954, -189655, 130372, -101329, -18970, 43230, 78115, 63991, -116010, 166651, 128010, -57000, -256928, -14105, -24683, 118043, -64876, -454809, 215499, -5225, -331999, -58423, -166736, 267129, -32206, -63594, -40401, -42017, -97024, -45031, -404159, 162212, 123263, -207045, -260777, -76828, 313430, -110521, -27722, 122261, -18807, 80627, -44521, -176979, 355027, 41503, -69365, 177665, 156463, -429056, -72640, -60360]
10002f0360A6037b674k58634K6218e4323k76968D1486b25735h7584L301G1000
9990b47834E3206h8011q7931G4022g2119o5443D0563b45531k6893J33401p8657
9979b17680J02275A28308P5328a47506B64784c83964a36792H7633m2366b08045
9968C5168C686a29452j03973a10351G1861b58459C4067a6156j07810N0417k71994
9957c45543G2985a57310n2307o7683J24822E7223a31652J5587A0401J85066b33637
9945e7125C9164a33495B98531d41015B1891a78920A87340a50177d3290l33669
9935c76959L3200J44136d8794j44973K2805g2968c1636A01036b3858D1470L4321
9924G5791a12436A26678m9390f0343j75662e4505j56684j37875c693n8367k15893
$$ y = [-60360, 16037, -2674, -261308, -235090, -54323, -331291, 41486, -225735, -87584, -84283, 71000, -247834, 53206, -88011, -175942, 74022, -72119, -137562, 40563, -245531, -272424, -139023, -217680, -115405, 128308, 203636, -147506, 264784, -383964, -136792, 87633, 45267, -208045, 35168, 3686, -129452, -233425, -110351, 71861, -258459, 34067, -16156, -123966, -73549, -345543, 72985, -157310, -209617, -277300, -152478, 57223, -131652, -116065, 10401, 195467, -233637, -57125, 39164, -133495, 298531, -441015, 21891, -178920, 187340, -150177, -43290, -376959, -343759, -199623, -48794, -193767, -170962, -72968, -31636, 101036, -23858, 41470, 75791, -112436, 126678, 77288, -60343, -236005, -54505, -211189, -349064, -3693, -62060, -277953]
9913b77953J19228b8552B416K51775j24360a33025o3785a1835j3693B66150a15684
9901c69474A00901h4104J4503A90555a35059G7462a07692B6323a41598D9406a76394
9889b2051k62454A36719b07099j07495h2658K47k35919f5871B18746b30465j00821
9878c31286P1763C3392h8770H8158A5282J38907d61224K16987J12897F4781a02227
9866a27198A35826a13743k393G1554J04888G8077l7080c19168a33119C15189b3467
9854B6150e7563A35976C8801J85685b40654j7423P9522B86997a2938j03537j32581
9843b49056C3203G177a73357B62193D5725j0257g5654E4373f043B05175a5138
9831D6255J15974D4351Q4644P0886c18093b4575A97328c06068b6037K442n1455
$$ y = [-277953, -158725, -28552, 2416, 254191, 129831, -133025, -196810, -11835, -25528, 266150, -115684, -369474, 100901, -84104, -69601, 190555, -135059, 77462, -107692, 26323, -141598, 49406, -176394, -22051, -284505, 136719, -207099, -314594, -82658, -82411, -318330, -65871, 218746, -230465, -331286, -259523, 33392, -88770, 88158, 15282, 154189, -461224, -244237, -131340, 64781, -102227, -127198, 135826, -113743, -116136, 71554, 176442, 78077, 40997, -319168, -133119, 315189, -23467, 26150, -57563, 135976, 38801, 224486, -240654, -258077, -178555, 286997, -12938, -116475, -249056, 33203, 7177, -173357, 262193, 45725, 35468, -75654, 54373, -6043, 205175, -15138, 46255, 162229, 44351, 128995, 199881, -318093, -24575, 197328, -306068, -26037, -23595, -75050]
9820g5050A07356N2745A1629b29117q8586A1921a1161G1798a67172O2029A75234
9808I9634a16658J521A02366a94933F2590j2849c20705a51596H3660a06363D1879
9796c42558a57313A07034R7927b6122A02769b38270j1113M5298q6285l4770f6576
9784H4584e2372k27441d3484j05482f432j07213a8822k24736H5557a60712A3069
9772a57071j15416A01265M0148C1915P9222j1286b42494A31627a26683R624A3552
9760b7484l15027G2579b15203P3344c6410j17105B23034g7151j06515D8245a68343
9748c46015J39587a6769l20089O5612k6230a3470m8696I2722a34694F5664a70810
9736a94865A81019f239A86209a3554k44217F5595p045K15337j20178h0432k84199
$$ y = [-75050, 107356, 160101, 11629, -229117, -317703, 11921, -11161, 71798, -167172, -105143, 175234, 99634, -116658, -115137, 102366, -194933, 62590, 49741, -320705, -151596, 83660, -106363, 41879, -342558, -157313, 107034, 204961, -26122, 102769, -238270, -249383, -204085, -290370, -325140, -66576, 84584, -52372, -279813, -43484, -148966, -6432, -113645, -18822, -243558, 85557, -160712, 13069, -157071, -272487, 101265, 141413, 31915, 111137, 99851, -242494, 131627, -126683, -117059, 13552, -27484, -342511, 72579, -215203, -141859, -36410, -153515, 223034, -77151, -183666, 48245, -168343, -346015, -206428, -16769, -336858, -271246, -297476, -13470, -62166, 92722, -134694, 65664, -170810, -194865, 181019, -6239, 186209, -13554, -257771, 65595, 58550, 273887, 153709, -80432, -364631]
9725c64631a49104J0765A51719a39159n1624j21978b8878B1787b48348A67865
9714g6821q0784c7643j35607b0555k6013B51688F6069a00150b7121k1104C85199
9702D8388a82822n7086i3921p3695E7395b44835R2869m4314A010f8338e282p2564
9690g7846j68451d7846H3657G821a37075j17178A65985E6902a92727k2359f9429
9678a02615J7406R350k85784B6553b4966A07476a42292f3907p475D616K46225
9667B50841g7200G521a43932g552C0392J93110A1704c16883N0372J164i1830a6503
9654c4357A00161b62467D5776g0130A57241a31457n4276e6645l4673A63545d60308
9642B7074b50456N6926G8425c53746a49445c2499k7923B75114I2434a46520e5033
$$ y = [-364631, -149104, -138339, 151719, -139159, -190783, -312761, -28878, 21787, -248348, 167865, -76821, -157605, -37643, -173250, -20555, -46568, 251688, 66069, -100150, -27121, -48225, 385199, 48388, -182822, -239908, -93921, -167616, 57395, -244835, -151966, -196280, 1010, -68338, -5282, -77846, -246297, -47846, 83657, 7821, -137075, -254253, 165985, 56902, -192727, -215086, -69429, -102615, -85209, -75859, -361643, 26553, -24966, 107476, -142292, -63907, -71382, 4616, 250841, -77200, 7521, -143932, -7552, 30392, 223502, 11704, -316883, -266511, -265347, -91830, -16503, -34357, 100161, -262467, 45776, -70130, 157241, -131457, -185733, -56645, -91318, 163545, -460308, 27074, -250456, -193530, 78425, -353746, -149445, -32499, -60422, 275114, 92434, -146520, -55033]
9630e6077n1600c4869A52867E1674B015J52172L2146a03678j09022B68950i7138
9618D76078C6574a45066f8928o0601k45712e2274p3264A02548c3321D5895a60081
9606a31181B8230h5864k79238a71580k8979A23870a66275P3589H3957N8385n6178
9595H6164D1961O0230a69623A05623l2556b22104c5310k9875H8300g2283c4874
9583d1077j73406c6474H18i8953K2120n337j85839C9888b73814P1501A65331P0029
9571B35360a97452A26714a12804C1728a88511I1688O1085b42559h8009B86577
9560E4104b33066n8648D8126b01195h0932k50017J28861r2085L8852h9858A9147
9548a21314L6524A57249b63221A06960g6116j70A02506a55660J002B36431J72380
$$ y = [-56077, -107677, -34869, 152867, 51674, 2015, 154187, 186333, -103678, -212700, 268950, -97138, 476078, 36574, -145066, -68928, -129529, -375241, -52274, -125538, 102548, -33321, 45895, -160081, -131181, 28230, -85864, -365102, -171580, -200559, 123870, -166275, -92686, 83957, 142342, 86164, 41961, 102191, -169623, 105623, 73067, -222104, -35310, -65185, 88300, -72283, -34874, -41077, -214483, -36474, 818, -98953, -76833, -82170, -268009, 39888, -273814, -202313, 165331, 235360, -197452, 126714, -112804, 31728, -188511, 91688, 152773, -242559, -88009, 286577, 54104, -233066, -291714, 48126, -201195, -80932, -330949, -202088, -294173, -255321, -89858, 19147, -121314, -84790, 157249, -263221, 106960, -76116, -76286, 102506, -155660, -154658, 236431, 408811]
9537D08811C9178b42064R7739G8228a39543A51923D5513B1556J40967m9726a22299
9525E0001c3503j81033b6154k86069f1688j09853n9583P5586l7236i5229a9901
9513A35351e6306j40850A14456a18592k37532a40750A64094f8323A01612k9104
9503G2508c97571i459k4381j99082B5302f9691A4057c1088k08464g1071L3283
9492c7788k12101D064a49895q3531b0670j29812K0756K7193j63189b8142A84023
9480a51742A8951c82158j34359i0337m4108k76841A17270a3504B04403f6213g106
9468B40192d1321o2982A70747a0329r8851j53380N5273j20127C41450f2901k9055
9457i1956m227L7328a0604A25755G626L51371I4233j7825J96107a39661A69909
$$ y = [408811, 39178, -242064, -144325, 78228, -139543, 151923, 45513, 21556, 162523, 112797, -122299, 50001, -33503, -214536, -26154, -312223, -61688, -171541, -231124, -155538, -192774, -95229, -19901, 135351, -56306, -197156, 114456, -118592, -356124, -140750, 164094, -68323, 101612, 72508, -397571, -9459, -33840, -232922, 25302, -69691, 14057, -31088, -239552, -71071, -37788, -249889, 4064, -149895, -233426, -20670, -150482, -129726, -102533, -265722, -28142, 184023, -151742, 18951, -382158, -516517, -90337, -134445, -411286, 117270, -13504, 204403, -66213, -7106, 240192, -41321, -104303, 170747, -10329, -109180, -262560, -207287, -327414, 341450, -62901, -91956, -96183, -58855, -10604, 125755, 7626, 358997, 94233, 76408, 272515, -139661, 169909]
9445D1544a78509C4038c5641k4728j34009e3518C6323f3279A80226D5851L6601
9434H2452O386b45422k5959L7090j00885J17226a5518j60235H6667g8271A31199
9422b42967e0251j40979n7264D4747L26789g0963F6097e3674j47451N5379a1880
9410a83665A52438b19860A53876L3293D1852e286j92553P9713k9311O9413k87534
9399c65558C17236a60789A52177a0005n8945k31748Q5149C9928b59849J05574
9389a54275D0876a20659A5869P1795l8367h4617j4465A14787g3401k67058A38177
9377B0685J1477e1599A24396A1954d6898r3569M4429A96601o6745A6771J72026
9366A88797b09904M0470j14973a37034L5089C8338c7724A32052a74881r4572J02117
$$ y = [41544, -178509, 34038, -35641, -60369, -194378, -53518, 36323, -63279, 180226, 45851, 82452, 88838, -245422, -271381, -234291, -335176, -217950, -15518, -175753, 86667, -78271, 131199, -242967, -50251, -191230, -248494, 44747, 371536, -70963, 66097, -53674, -201125, -145746, -11880, -183665, 152438, -219860, 153876, 187169, 41852, -5286, -197839, -118126, -147437, -78024, -365558, 317236, -160789, 152177, -10005, -68950, -300698, -215549, 39928, -259849, -154275, 40876, -120659, 15869, 87664, 49297, -84617, -99082, 114787, -73401, -340459, 138177, 20685, 32162, -51599, 124396, 11954, -46898, -140467, -96038, 196601, 129856, 16771, 188797, -209904, -169434, -284407, -137034, -101945, 38338, -37724, 132052, -174881, -269453, -167336]
9355a67336F8564c3615j98968L8694k13576a56846b4773d815F1088P0467D033
9343b36956D2222K69938F8498b01000j992p0552A8085i0889B13091c7366h705
9331i6296r7257a5430k21490d9209k33194l4663B34874b96553a1247n5044b0928
9319A40269f4071j33523j74040a83325A36029g2006E0668J57535r8706f8579A93270
9307c21946O7077a21609p9587A18021L1595e4863l94698a98287L6499B8335R3148
9296A21483N3226q2709c29922A2926c27872C2576b28726E0833a87179M5377C45577
9284b86525J27084a2406j57022m4103j33175J69857D628c49042J73102l3806b8213
9272a36053K1516A08309D2715b8716o0101j16347Q4230r5504q832B75989A07767
$$ y = [-167336, 68564, -33615, -232583, -193889, -407465, -156846, -24773, -4815, 61088, 131555, 4033, -236956, 42222, 312160, 68498, -201000, -202992, -273544, 18085, -90889, 213091, -37366, -8705, -96296, -193553, -15430, -236920, -49209, -282403, -317066, 234874, -296553, -11247, -66291, -20928, 140269, -64071, -197594, -371634, -183325, 136029, -72006, 50668, 208203, 109497, -68579, 193270, -321946, -254869, -121609, -201196, 118021, 149616, -54863, -449561, -198287, -161788, 28335, 121483, 174709, 92000, -329922, 12926, -327872, 32576, -228726, 50833, -187179, -141802, 345577, -286525, -159441, -12406, -169428, -213531, -346706, -176849, 4628, -349042, -175940, -209746, -28213, -136053, -114537, 108309, 42715, -28716, -88817, -205164, -120934, -216438, -225270, 275989, 107767]
9260E9723a74262c3325F9214M8549M7014f9905B2857a61735B08264a00010k10627
9249c10637e1472j98725b0878H583J5808Q4270a05925G6391l6290K2341h8626
9237G7855b03153n7903r8256D9753a4453j89682C6705b92059I4364C8437K20786
9226B59223B6484a02137E3758K02289H7687k0322J00975o1744b3593C19L8171
9215C8490b2725n9743I0384a80364A73965a64210N6813H122h8872k32078A82460
9203c41810C6661L0962a32404d3450B1205Q7734a73979f1943b8567r0338L318
9192a15587m9360j42002B74296b46j37264K2900A56106J6859G9903a68097d7020
9180h7137a159o5326A2547c88057B17600j3224b35966A8972a81527H5448B5087
$$ y = [59723, -174262, -33325, 69214, 117763, 164777, -69905, 22857, -161735, 208264, -100010, -310637, -51472, -250197, -20878, 8583, 24391, 108661, -105925, 76391, 40101, 62442, -88626, 77855, -203153, -261056, -359312, 49753, -14453, -204135, 36705, -292059, 94364, 38437, 259223, 26484, -102137, 53758, 256047, 87687, 67365, 168340, 106596, -23593, 319, 38490, -22725, -82468, 90384, -180364, 173965, -164210, -107397, 8122, -88872, -320950, 182460, -341810, 36661, 67623, -132404, -43450, 21205, 108939, -173979, -61943, -28567, -118905, -115587, -164947, -306949, 274296, -246, -137510, -114610, 156106, 172965, 79903, -168097, -47020, -87137, -1159, -66485, 12547, -388057, 217600, 204376, -235966, 18972, -181527, 85448, 25087]
9168A9793J40124J36589a29045H9812a99918B77010B6051e06131A47347M8747
9158A96094K783c35964A97803a50183k13743J68578K2291B6496j3131J9057K85423
9147C17845E0469B761a39346k3804C8317d0911j65740d3327p2216A8808K6281
9136D5089b26413l77595a01961A24592a45850C3901J61056a24140N5146A71052
9125B90657o0221D3082a33429B81123a90501l4087g7431m0027H6816a27890A17142
9113i0034A47380c71308h5654j79615P2989A57000b1609m9851l63060d9610J0822
9102c8788l9082k87935a07299l7875f6908E7454a41835b0097k17520A25398c6360
9090b49847d2874p045k9803B9528c32188R0704P3594b3526j91719i3570k02154
$$ y = [19793, 159917, 296506, -129045, 89812, -199918, 277010, 26051, -506131, 147347, 196094, 198877, -335964, 197803, -150183, -363926, -195348, -173057, 26496, 13365, 32422, 317845, 50469, 2761, -139346, -163150, 38317, -40911, -206651, -43327, -115543, 18808, 45089, -226413, -604008, -101961, 124592, -145850, 33901, 194957, -124140, -68994, 171052, 290657, 230436, 43082, -133429, 281123, -190501, -224588, -77431, -117458, 86816, -127890, 117142, -90034, 147380, -371308, -85654, -265269, -192280, 157000, -21609, -71460, -434520, -49610, -38788, -77870, -365805, -107299, -145174, -66908, 57454, -141835, -20097, -237617, 125398, -36360, -249847, -42874, -49919, -79722, 29528, -332188, -241484, -167890, -23526, -215245, -93570, -295724]
9079b95724A03740f1328j9190C45086f9447k1405B34384d9462B94532i8066b6790
9067B41412n9978b51039B07834E3333h1096b6842k33236C8894a37166j02504C6854
9055D2094B675h9709J5571k6378H7373a7927A77840a4319j71762r2168j26039
9044d04288A76225G3067a93610f9569a239k78389P7419k3428B13407C8611g8246
9032b398l33641A46986h209l3235H2791L1789e30535a60333n0783A2275a56058
9020d86153A74738o9952g6910O518F9674e1024B31417I4838a99182i9421D572
9008a59253B87782o4537b6305j34769j39396a09541P38c1291j50998D4229J00100
8997A44329b6626F3896J21632a84786j59674h2402A81336a17585j9713I6145d7200
$$ y = [-295724, 103740, -61328, -80518, 345086, -69447, -90852, 234384, -49462, 294532, -98066, -26790, 241412, 181434, -251039, 207834, 53333, -81096, -26842, -260078, 38894, -137166, -239670, 36854, 42094, 2675, -89709, -74138, -100516, 87373, -17927, 177840, -14319, -186081, -278249, -404288, 176225, 73067, -193610, -69569, -1239, -279628, -202209, -225637, 213407, 38611, -78246, -2398, -336039, 146986, -8209, -41444, 82791, 114580, -530535, -160333, -211116, 12275, -156058, -486153, 174738, 104786, -76910, -70392, 69674, -51024, 231417, 94838, -199182, -99421, 4572, -159253, 287782, 223245, -26305, -161074, -300470, -109541, -108803, -31291, -182289, 44229, 144329, -26626, 63896, 185528, -184786, -344460, -82402, 181336, -117585, -137298, 96145, -47200]
8985a80903k2218A15693j6088l5933b27347D3600a15094B06197b29887F4397D952
8973A29252J709h4409j34198C4158g3440j0899A22606b03160j79427F8732a61763
8961c42525J08483d4200k8332L953l124C9266h7790r7333J4429c610j11640F5428
8948f1056p8450j41181h4928B6776i5208k74306J08773A11598l8285b11867k01888
8937d13755D6231a91288A62946b96368H6349a02150A36877a15298q0847a5207
8926B3162D346h7639j3093B3296c45012J23673E6005J009722D88881k09227F377
8914G6579a24951e0970j72328H144a67864F126b42696A63698J34495d38854B68516
8902B1716k747e047C8731r046J07861k6910A443R6117m7366b50392f1339j56719
$$ y = [-180903, -203121, 115693, 99605, 63672, -227347, 43600, -115094, 206197, -229887, 64397, 4952, 129252, 130961, -84409, -218607, 34158, -73440, -84339, 122606, -203160, -382587, 68732, -161763, -342525, -234042, -44200, -72532, -68579, -71703, 39266, -87790, -185123, -170694, -3610, -115250, 65428, -61056, -139506, -280687, -84928, 26776, -95208, -369514, -260741, 111598, 73313, -211867, -413755, 46231, -191288, 162946, -296368, 86349, -102150, 136877, -115298, -196145, -15207, 23162, 4346, -87639, -100732, 23296, -345012, -221339, 56005, 1065727, 488881, 279654, 6377, 76579, -124951, -50970, -223298, 8144, -167864, 6126, -242696, 163698, 298193, -438854, 268516, 21716, 18969, -5047, 38731, 29685, 137546, 110636, 1443, 97560, 50194, -250392, -61339, -218058]
8890b18058E9047a52039a1947B7739a43952A8367g1381m26126B53889c3882k14256
8879b48138B85033H2488d13899i0569k03346D7109b64531e4245l1266m7777L8102
8868i5186j4171d3710k98516b5131G324N9605b35758L9685b6248A2967K24248
8857B37215a48961A55606a39013p1108E7568K0797b5470C7616N9333a2937C4506
8845a96427C5706a12928A85534f31E0257a79883Q2603l5488F3992O4620E6041
$$ y = [-218058, 59047, -152039, -11947, 27739, -143952, 18367, -71381, -497507, 253889, -33882, -248138, 285033, 82488, -413899, -90569, -293915, 47109, -264531, -54245, -85511, -133288, -95186, -109357, -43710, -342226, -25131, 7324, 66929, -235758, -196073, -26248, 12967, 237215, -148961, 155606, -139013, -210121, 57568, 78365, -25470, 37616, 96949, -12937, 34506, -196427, 35706, -112928, 185534, -631, 50257, -179883, -97280, -132768, 63992, 128612, 56041]
$$ [...]
##END NTUPLES=NMR SPECTRUM
##END=
