##TITLE=NES1093_RSB_9886830_fKTSD0sDcw
##JCAMPDX= 6.0         $$ Bruker NMR JCAMP-DX V2.0
##DATA TYPE= NMR SPECTRUM
##DATA CLASS= NTUPLES
##ORIGIN= BRUKER
##OWNER= Administrator
$$ 1.72 TOPSPIN		Version 2.1
$$ 2016-08-28 16:16:38.586 -0500  Administrator@X
$$ Compression mode = diff/dup
##.OBSERVE FREQUENCY= 400.02188249412
##.OBSERVE NUCLEUS= ^1H
##.ACQUISITION MODE= SIMULTANEOUS (DQD)
##.ACQUISITION SCHEME= undefined
##.AVERAGES= 64
##.DIGITISER RES= 22
##SPECTROMETER/DATA SYSTEM= spect
##.PULSE SEQUENCE= noesygpps1d.comp
##.SOLVENT NAME= COFFEE_meoh
##.SHIFT REFERENCE= INTERNAL, COFFEE_meoh, 1, 14.96252
##AUDIT TRAIL= $$ (NUMBER, WHEN, WHO, WHERE, PROCESS, VERSION, WHAT)
$$ ##TITLE= Audit trail, TOPSPIN		Version 2.1
$$ ##JCAMPDX= 5.01
$$ ##ORIGIN= Bruker BioSpin GmbH
$$ ##OWNER= Administrator
$$ $$ E:\/data/COFFEE/nmr/NES1093_RSB_9886830_fKTSD0sDcw/22/pdata/1/auditp.txt
$$ ##AUDIT TRAIL=  $$ (NUMBER, WHEN, WHO, WHERE, PROCESS, VERSION, WHAT)
(   1,<2016-08-28 16:16:33.429 -0500>,<Administrator>,<X>,<go>,<TOPSPIN 2.1>,
      <created by zg
	started at 2016-08-28 16:05:03.398 -0500,
	POWCHK enabled, PULCHK disabled,
       configuration hash MD5:
       21 0F 79 D6 B3 7B B4 F6 88 20 88 DB 03 48 BD 9F
       data hash MD5: 64K
       9B F1 0D 97 A6 58 26 03 D1 C4 A2 A3 5C 40 B5 49>)
(   2,<2016-08-28 16:16:36.539 -0500>,<Administrator>,<X>,<proc1d>,<TOPSPIN 2.1>,
      <Start of raw data processing
       efp LB = 0.3 FT_mod = 6 PKNL = 1 PHC0 = 0 PHC1 = 0 SI = 128K 
       data hash MD5: 128K
       97 E5 01 CA 9C 17 E2 B5 92 CD 33 BB BD 6A E2 D5>)
(   3,<2016-08-28 16:16:37.398 -0500>,<Administrator>,<X>,<proc1d>,<TOPSPIN 2.1>,
      <pk PHC0 = -84.55078 PHC1 = 0 
       data hash MD5: 128K
       E4 97 8D 62 DE F9 43 19 34 B7 63 77 24 4D F8 E0>)
(   4,<2016-08-28 16:16:37.758 -0500>,<Administrator>,<X>,<proc1d>,<TOPSPIN 2.1>,
      <abs ABSG = 1 
       data hash MD5: 128K
       6F 2A 17 0B FB 82 F3 4B 57 D2 98 6A 35 10 40 ED>)
(   5,<2016-08-28 16:16:37.851 -0500>,<Administrator>,<X>,<proc1d>,<TOPSPIN 2.1>,
      <abs ABSG = 2 
       data hash MD5: 128K
       02 1C A7 39 2D 66 79 0F F7 C7 62 C0 49 51 50 73>)
(   6,<2016-08-28 16:16:37.914 -0500>,<Administrator>,<X>,<proc1d>,<TOPSPIN 2.1>,
      <abs ABSG = 3 
       data hash MD5: 128K
       18 1A 42 10 1A F7 C5 63 FD 49 5E C7 8C 0B 48 1D>)
(   7,<2016-08-28 16:16:38.023 -0500>,<Administrator>,<X>,<proc1d>,<TOPSPIN 2.1>,
      <abs ABSG = 4 
       data hash MD5: 128K
       36 81 18 5A F5 CC 1C E1 90 7D B7 6A CC 2F DA 36>)
(   8,<2016-08-28 16:16:38.148 -0500>,<Administrator>,<X>,<proc1d>,<TOPSPIN 2.1>,
      <abs ABSG = 5 
       data hash MD5: 128K
       5B 4F BD B1 C2 5F 62 BC 9B CF 1A AE 63 D7 D6 32>)
$$ ##END=
$$ 
$$ $$ hash MD5
$$ $$ B5 CE 5B D4 2B 85 89 43 52 CC BD 43 14 BE 43 E9
##$RELAX= 
##$RELAX= 
##$RELAX= 
##$RELAX= 
##$RELAX= 
##$RELAX= 
##$RELAX= 
##$RELAX= 
$$ Bruker specific parameters
$$ --------------------------
##$DU= <E:\>
##$EXPNO= 22
$$ [...]
##$TP07= 0
##$TPNAME0= <>
##$TPNAME1= <>
##$TPNAME2= <>
##$TPNAME3= <>
##$TPNAME4= <>
##$TPNAME5= <>
##$TPNAME6= <>
##$TPNAME7= <>
##$TPOAL= (0..7)
0.5 0.5 0.5 0.5 0.5 0.5 0.5 0.5
##$TPOFFS= (0..7)
0 0 0 0 0 0 0 0
##$TUNHIN= 0
##$TUNHOUT= 0
##$TUNXOUT= 0
##$USERA1= <user>
##$USERA2= <user>
##$USERA3= <user>
##$USERA4= <user>
##$USERA5= <user>
##$V9= 5
##$VALIST= <valist>
##$VCLIST= <CCCCCCCCCCCCCCC>
##$VD= 0
##$VDLIST= <DDDDDDDDDDDDDDD>
##$VPLIST= <PPPPPPPPPPPPPPP>
##$VTLIST= <TTTTTTTTTTTTTTT>
##$WBST= 2048
##$WBSW= 25
##$XGAIN= (0..3)
0 0 0 0
##$XL= 0
##$YL= 0
##$YMAX_a= 6922735
##$YMIN_a= -14467017
##$ZGOPTNS= <>
##$ZL1= 120
##$ZL2= 120
##$ZL3= 120
##$ZL4= 120
##$ABSF1= 14.96252
##$ABSF2= -5.595662
##$ABSG= 5
##$ABSL= 3
##$ALPHA= 0
##$AQORDER= 0
##$ASSFAC= 0
##$ASSFACI= 0
##$ASSFACX= 0
##$ASSWID= 0
##$AUNMP= <proc_prof1d_extract.lims>
##$AXLEFT= 0
##$AXNAME= <>
##$AXNUC= <1H>
##$AXRIGHT= 0
##$AXTYPE= 0
##$AXUNIT= <>
##$AZFE= 0.1
##$AZFW= 0.1
##$BCFW= 0
##$BC_mod= 0
##$BYTORDP= 0
##$COROFFS= 0
##$CY= 15
##$DATMOD= 1
##$DC= 0
##$DFILT= <>
##$DTYPP= 0
##$F1P= 0
##$F2P= 0
##$FCOR= 0.5
##$FTSIZE= 131072
##$FT_mod= 6
##$GAMMA= 0
##$GB= 0
##$INTBC= 1
##$INTSCL= 1
##$ISEN= 128
##$LB= 0.3
##$LEV0= 0
##$LPBIN= 0
##$MAXI= 10000
##$MC2= 0
##$MEAN= 0
##$ME_mod= 0
##$MI= 0
##$NCOEF= 0
##$NC_proc= -2
##$NLEV= 6
##$NOISF1= 0
##$NOISF2= 0
##$NSP= 0
##$NTH_PI= 0
##$NZP= 0
##$OFFSET= 14.96252
##$PC= 1
##$PHC0= -84.55078
##$PHC1= 0
##$PH_mod= 1
##$PKNL= yes
##$PPARMOD= 0
##$PPDIAG= 0
##$PPIPTYP= 0
##$PPMPNUM= 2147483647
##$PPRESOL= 1
##$PSCAL= 4
##$PSIGN= 0
##$PYNMP= <proc.py>
##$REVERSE= no
##$SF= 400.020009029904
##$SI= 131072
##$SIGF1= 0
##$SIGF2= 0
##$SINO= 400
##$SIOLD= 131072
##$SPECTYP= <>
##$SREGLST= <1H.CDCl3>
##$SSB= 0
##$STSI= 131072
##$STSR= 0
##$SW_p= 8223.68421052631
##$SYMM= 0
##$S_DEV= 0
##$TDeff= 65536
##$TDoff= 0
##$TI= <>
##$TILT= no
##$TM1= 0
##$TM2= 0
##$TOPLEV= 0
##$USERP1= <user>
##$USERP2= <user>
##$USERP3= <user>
##$USERP4= <user>
##$USERP5= <user>
##$WDW= 1
##$XDIM= 131072
##$YMAX_p= 382407463
##$YMIN_p= -10760
##$CURPLOT= <Network HP LaserJet P1505>
##$CURPRIN= <$Network HP LaserJet P1505>
##$DFORMAT= <normdp>
##$LAYOUT= <+/1D_H.xwp>
##$LFORMAT= <normlp>
##$PFORMAT= <normpl>
##$SURQMSG= 1
$$ End of Bruker specific parameters
$$ ---------------------------------
##NTUPLES= NMR SPECTRUM
##VAR_NAME=  FREQUENCY,     SPECTRUM/REAL,   SPECTRUM/IMAG
##SYMBOL=    X,             R,               I
##VAR_TYPE=  INDEPENDENT,   DEPENDENT,       DEPENDENT
##VAR_FORM=  AFFN,          ASDF,            ASDF
##VAR_DIM=   131072,        131072,          131072
##UNITS=     HZ,            ARBITRARY UNITS, ARBITRARY UNITS
##FACTOR=    0.0627417313425164, 1,          1
##FIRST=     8223.62146879497, 21,           -47141
##LAST=      0,             2842,            -47414
##MIN=       0,             -10760,          0
##MAX=       8223.62146879497, 382407463,    0
$$ Real data points
##PAGE= N=1
##DATA TABLE= (X++(R..R)), XYDATA
$$ [...]
61004A814850J03311J13641J25133J39183J56956J81403K16205K62086L17096
60995C429864L80955M55516N41091O38054P53694R00726J085385J303453J549772
60986A1038510J814190K047282K137524J960318J483536Q27220K02336k20090
60978B1290826l85487l27625j08015J91172M37204M66854J81322l69901j010164
60969B0366186j547564j874789j985497j929546j768626j557438j337126j131075
60961G234525r47645p89070o56144n46546m54914l77315l13132k61928k21416
60952B666415j89447j65175j47056j32112j18391j06204r5984q6769p7776o9570
60942A477931o2675n6600n1248m7690m6423m6243m5816m5154m4684m4080m2979
$$ y = [1814850, 1918161, 2031802, 2156935, 2296118, 2453074, 2634477, 2850682, 3112768, 3429864, 3810819, 4266335, 4807426, 5445480, 6199174, 7099900, 8185285, 9488738, 11038510, 12852700, 14899982, 17037506, 18997824, 20481360, 21308580, 21510916, 21290826, 20905339, 20577714, 20469699, 20660871, 21098075, 21564929, 21746251, 21376350, 20366186, 18818622, 16943833, 14958336, 13028790, 11260164, 9702726, 8365600, 7234525, 6286880, 5497810, 4841666, 4295120, 3840206, 3462891, 3149759, 2887831, 2666415, 2476968, 2311793, 2164737, 2032625, 1914234, 1808030, 1712046, 1625277, 1547501, 1477931, 1415256, 1358656, 1307408, 1259718, 1213295, 1167052, 1121236, 1076082, 1031398, 987318, 944339]
60931I44339m1696m0250l7776l3857k9583k6320k4187k2514k0980j9540j7953
60920F29683j6251j5052j4670j4397j3342j1544r732q452p772p385o669n213l546
60907D95658k700k821k930k330j446r86j054j420j900k029j296o6N74L04Q4O80
60891D76322J668K451L282M503N658O226O559P210P940Q227Q202Q192P844O608
60877E60892M759L097J914R49O8p20j655k898m089m894n676o895q082q286p344
60862E21140n965m625l190j701o58l07k28J31R49K235L886N416O111N860N431
60847E34485N628O374O916O801O340O232O913Q210R451R976R745R388R532J0021
60833F46012J0073R231P990P180O998O917O556O135N895N535M612L290K221J785
$$ y = [944339, 902643, 862393, 824617, 790760, 761177, 734857, 710670, 688156, 667176, 647636, 629683, 613432, 598380, 583710, 569313, 555971, 544427, 534695, 526243, 518471, 511086, 504417, 499204, 495658, 492958, 490137, 487207, 484877, 483431, 482445, 481391, 479971, 478071, 476042, 474746, 474680, 475254, 475558, 475642, 476322, 477990, 480441, 483723, 488226, 493884, 500110, 506669, 513879, 521819, 530046, 538248, 546440, 554284, 560892, 565651, 568748, 570662, 571611, 571679, 570959, 569304, 566406, 562317, 557423, 551747, 544852, 536770, 528484, 521140, 515175, 510550, 507360, 505659, 505001, 504694, 504466, 504597, 505546, 507781, 511667, 517083, 523194, 529054, 534485, 540113, 546487, 553403, 560204, 566544, 572776, 579689, 587899, 597350, 607326, 617071, 626459, 635991, 646012, 656085, 665316, 673306, 680486, 687484, 694401, 700957, 707092, 712987, 718522, 723134, 726424, 728645, 730430]
60819G30430J764J753J523R86J38r49k262l882n749p495q822r862j0858j1635
60805F75080j1867j1665j1437j1187j0454r064p472o246n567n265m994m350l217
60792E72295k030j308r29l45N69J374J875K352K840K799J905P19J07K82P64J083
60776E84352J226J480K090L002L890M515N016N644O365P015P720Q671R588R954
60762F60528R765R518R411R124Q602Q297Q489Q852Q999Q882Q417P437O307N839
60748G78467O105N993M617K562J020K16m46j087j271j067j165j797k378k517k660
60733G84592l362m553n900p380r012j0466j1410j2036j2679j3192j3236j3046
60721F68320j3205j3656j3590j2570j1191j0247r753r292q850q576q052o724m950
$$ y = [730430, 732194, 733947, 735470, 736456, 736594, 735645, 733383, 729501, 723752, 716257, 707435, 697573, 686715, 675080, 663213, 651548, 640111, 628924, 618470, 609406, 601934, 595688, 590121, 584856, 579862, 575512, 572295, 570265, 568957, 568028, 567683, 568252, 569626, 571501, 573853, 576693, 579492, 581397, 582116, 582223, 582505, 583269, 584352, 585578, 587058, 589148, 592150, 596040, 600555, 605571, 611215, 617580, 624595, 632315, 640986, 650574, 660528, 670293, 679811, 689222, 698346, 706948, 715245, 723734, 732586, 741585, 750467, 758884, 766321, 772628, 778467, 784572, 790565, 795182, 797744, 798764, 798980, 798534, 797447, 796176, 795109, 793944, 792147, 789769, 787252, 784592, 781230, 776677, 770777, 763397, 754385, 743919, 732509, 720473, 707794, 694602, 681366, 668320, 655115, 641459, 627869, 615299, 604108, 593861, 584108, 574816, 565966, 557390, 549338, 542614, 537664]
60708E37664l684l001j957k37J144J427J449K458M270N762O666P648Q794R349
60694E77752R012Q350P626O283L996J357r81l012m823o098o800p646r196j0954
60680E64866j1975j2006j1403j0435r257q254p650p042n909m439l232k343j295
60667D69626M5J249K064K719L330L575L188K451J890J710J699J558J208R29J186
60652D98427K111L093L267K508J692J627K058K069J348N96N96J383K511L673M709
60637E31668N354N534N803O781Q163Q971Q902Q766R254R934J0059R745R611R660
60623F48205R368Q688Q122P837P457O880O506O461O230N426M360L475K668J515
60609G33198o7j758l231m402n437o646q220r948j1281j1798j1473j0600r580q640
$$ y = [537664, 533980, 530979, 529022, 528785, 529929, 531356, 532805, 535263, 539533, 545295, 551961, 559609, 568403, 577752, 586764, 595114, 602740, 609023, 613019, 614376, 613395, 610383, 605560, 599462, 592662, 585016, 575820, 564866, 552891, 540885, 529482, 519047, 509790, 501536, 493886, 486844, 480935, 476496, 473264, 470921, 469626, 469671, 470920, 472984, 475703, 479033, 482608, 485796, 488247, 490137, 491847, 493546, 495104, 496312, 497241, 498427, 500538, 503631, 506898, 509406, 511098, 512725, 514783, 516852, 518200, 518796, 519392, 520775, 523286, 526959, 531668, 537022, 542556, 548359, 555140, 563303, 572274, 581176, 589942, 599196, 609130, 619189, 628934, 638545, 648205, 657573, 666261, 674383, 682220, 689677, 696557, 703063, 709524, 715754, 721180, 725540, 729015, 731683, 733198, 733131, 731373, 728142, 723740, 718303, 711657, 703437, 693489, 682208, 670410, 658937, 648337, 638757, 630117]
60595F30117p578o037m220k931k475k030p57Q54J643J546J533J915J943J413J264
60580F16200J953K436J722N94N20J440J847Q94p43k096k994l600l749l350k946
60565F08128l212m079m768m722m158l563k916j797j89J277K170K969M540P065
60551E96745R893J2362J4376J6265J8485K1392K4905K8494L1897L5591L9927M3953
60539H94285M5879M4680M0488L3507K3607J1316j730j3803k3897l1292l5303l6075
60527I51662l4774l2257k8215k2391j5847j0162n761j981J514M275N947O815P445
60514H26270Q256R403J0662J1685J2637J4373J7523K1817K6713L2300L8997M6771
60502A077407N5373O5025P6081Q8164J00372J12228J23809J35107J46070J57223
$$ y = [630117, 622539, 616502, 612282, 609351, 606876, 604846, 604089, 604943, 606586, 608132, 609665, 611580, 613523, 614936, 616200, 618153, 620589, 622311, 622905, 623425, 624865, 626712, 627606, 626863, 624767, 621773, 618173, 614424, 611074, 608128, 604916, 600837, 596069, 591347, 587189, 583626, 580710, 578913, 578724, 580001, 582171, 585140, 589680, 596745, 606638, 619000, 633376, 649641, 668126, 689518, 714423, 742917, 774814, 810405, 850332, 894285, 940164, 984844, 1025332, 1058839, 1082446, 1093762, 1092032, 1078229, 1054332, 1023040, 987737, 951662, 916888, 884631, 856416, 834025, 818178, 808016, 802255, 800274, 801788, 806063, 812010, 818825, 826270, 834526, 843929, 854591, 866276, 878913, 893286, 910809, 932626, 959339, 991639, 1030636, 1077407, 1132780, 1197805, 1273886, 1362050, 1462422, 1574650, 1698459, 1833566, 1979636, 2136859]
60492B136859J69530J83555J99292K16616K34770K50749K58767K52074K25824
60483D128036J78868J13838L6146m7245j28726k00600k56068k90951l05003l01451
60473B926844k85183k61246k34103k07069j81781j58508j37268j18531j02867
60464A240288r0236p9866p0781o2419n4827m8282m2777l7985l3711l0001k6725
60453F62678k3533k0440j7996j6447j5164j3391j1263r516q420p638o982o668
60441E05220o766o962o947o663o084n180m141l322k901k873l276m130n073n477
60427D35425m911l367j178J029K521K951K707K435K373K344K218K051J903J880
60413D50381K213K915L570L829L962M440N151N530N386N148N253N677O019N826
$$ y = [2136859, 2306389, 2489944, 2689236, 2905852, 3140622, 3391371, 3650138, 3902212, 4128036, 4306904, 4420742, 4456888, 4409643, 4280917, 4080317, 3824249, 3533298, 3228295, 2926844, 2641661, 2380415, 2146312, 1939243, 1757462, 1598954, 1461686, 1343155, 1240288, 1150052, 1070186, 999405, 936986, 882159, 833877, 791100, 753115, 719404, 689403, 662678, 639145, 618705, 600709, 584262, 569098, 555707, 544444, 534928, 526508, 518870, 511888, 505220, 498454, 491492, 484545, 477882, 471798, 466618, 462477, 459155, 456254, 453381, 450105, 445975, 440902, 435425, 430514, 427147, 425969, 426998, 429519, 432470, 435177, 437612, 439985, 442329, 444547, 446598, 448501, 450381, 452594, 455509, 459079, 462908, 466870, 471310, 476461, 481991, 487377, 492525, 497778, 503455, 509474, 515300]
60399E15300M973L964L564L807L776K900K012K328L667M601M385L712L399L227
60385E65615K633J808J490J934K548K519J519p7j596k678l485m159m408l952l160
60370E56551k665k469k032j174k57N52J464K390K813K659K649L359M418N058N088
60355E78404M909M840M917N093N257N179M697L856K721J209o26k440l925n118
60341F08973o127o704o445n299l717k264j258p13m14l1P47J999L388M280M203
60326E90618L338K394J904J785J710J621J603J491J027K60n17j088j296r47k29
60311F03674P4o20j744k120j452o25l06q0N63J071L90j570l630m542m063k881
60295E82139j820j260j068r40p07l96m5L65Q86J571K417L198L492L149K665K757
$$ y = [515300, 520273, 524237, 527801, 531608, 535384, 538284, 540296, 542624, 546291, 550892, 555277, 558989, 562388, 565615, 568248, 570056, 571546, 573480, 576028, 578547, 580066, 579989, 578393, 575715, 572230, 568071, 563663, 559711, 556551, 553886, 551417, 549385, 548211, 547954, 548506, 549970, 552360, 555173, 557832, 560481, 563840, 568258, 573316, 578404, 583313, 588153, 593070, 598163, 603420, 608599, 613296, 617152, 619873, 621082, 620456, 618016, 614091, 608973, 602846, 596142, 589697, 584398, 580681, 578417, 577159, 576446, 576032, 576001, 576748, 578747, 582135, 586415, 590618, 593956, 596350, 598254, 600039, 601749, 603370, 604973, 606464, 607491, 607751, 607234, 606146, 604850, 603903, 603674, 603748, 603128, 601384, 599264, 597812, 597187, 596881, 596801, 597364, 598435, 598825, 597255, 593625, 589083, 585020, 582139, 580319, 579059, 577991, 577051, 576344, 575948, 575903, 576268, 577154, 578725, 581142, 584340, 587832, 590981, 593646, 596403]
60279E96403L503M216M294L897L643L849M349M868N339N784O146O391O713P406
60265F66801Q441R373R878J0211J0793J1502J1945J2406J3828J6460J9221K0937
60253H21796K1740K2644K4128K5830K7466K9321L1922L5621M0396M5596N0237
60242A176697N4121N8346O4050P0853P7303Q2610Q7024R0718R3317R4641R4865
60231B044545R3702R0362Q4670P7407O9253O0139N0056L9553K9020J8247P240
60220B664194l300j2879k1760k9921l6202l9431l9844l8501l5711l1056k4723
60209B350866j7730j0763l554M439J3430K3452L4410M5745N6628O6697P6143Q4912
60197B724675R2297R7592J00679J01641J00101R5405Q7376P6606O4006N0256L5613
$$ y = [596403, 599906, 604122, 608416, 612313, 615956, 619805, 624154, 629022, 634361, 640145, 646291, 652682, 659395, 666801, 675242, 684615, 694493, 704704, 715497, 726999, 738944, 751350, 765178, 781638, 800859, 821796, 843536, 866180, 890308, 916138, 943604, 972925, 1004847, 1040468, 1080864, 1126460, 1176697, 1230818, 1289164, 1353214, 1424067, 1501370, 1583980, 1671004, 1761722, 1855039, 1949680, 2044545, 2138247, 2228609, 2313279, 2390686, 2459939, 2520078, 2570134, 2609687, 2638707, 2656954, 2664194, 2660894, 2648015, 2626255, 2596334, 2560132, 2520701, 2480857, 2442356, 2406645, 2375589, 2350866, 2333136, 2322373, 2318819, 2323258, 2336688, 2360140, 2394550, 2440295, 2496923, 2563620, 2639763, 2724675, 2816972, 2914564, 3015243, 3116884, 3216985, 3312390, 3399766, 3476372, 3540378, 3590634, 3626247]
60186C626247K0153M088j2062k7681m2365n5868o7603p6495q1626q3078q1787
60175C121923p8442p2875o4757n4570m3331l1553j9100o197O324J8068K9679M1646
60163B846815N2992O1955O7730P0637P0752O7454O0672N1622M1767L1601K0979
60152C444976J0060o44j0806k0153k7964l3302l5812l5838l3766k9636k3434j5404
60140C188277n860N099J7463L1017M5347O0167P5488R1504J08362J26126J44755
60129C887745J63909J82851K00857K17787K33976K49371K63147K74251K81971
60120E955865K85647K84329K77266K64538K46661K23857J96338J65084J31555
60111H031140R6510N9773K1264j8279n7785r6365j33078j66689j96042k20341
$$ y = [3626247, 3646400, 3650488, 3638426, 3610745, 3568380, 3512512, 3444909, 3368414, 3286788, 3203710, 3121923, 3043481, 2970606, 2905849, 2851279, 2807948, 2776395, 2757295, 2751098, 2757422, 2775490, 2805169, 2846815, 2899807, 2961762, 3029492, 3100129, 3170881, 3238335, 3299007, 3350629, 3392396, 3423997, 3444976, 3455036, 3454392, 3443586, 3423433, 3395469, 3362167, 3326355, 3290517, 3256751, 3227115, 3203681, 3188277, 3182417, 3187516, 3204979, 3235996, 3281343, 3341510, 3416998, 3508502, 3616864, 3742990, 3887745, 4051654, 4234505, 4435362, 4653149, 4887125, 5136496, 5399643, 5673894, 5955865, 6241512, 6525841, 6803107, 7067645, 7314306, 7538163, 7734501, 7899585, 8031140, 8127650, 8187423, 8208687, 8190408, 8132623, 8036258, 7903180, 7736491, 7540449, 7320108]
60101G320108k38801k50488k54847k52183k43305k29026k10215j88044j63847
60092E289352j38814j13930q9933o7042m4922k3076j358J9866L9847N7778P3097
60081E000865Q5450R4143R8012R6230Q9140P7795O2865M4637K3921K196j9297
60070E655957l9991n9468p7267r3413j08281j21586j32166j39237j43219j44921
60060D596408j44450j41471j35942j28075j18067j06397r3877q0842o6740n1207
60050C529340l5009j9207l821J1749K7290M1844N5153O7938Q0424R1456R9620
60039C946777J04565J06567J05273R9726Q9588P5728N9384M1240K1589J055j9447
60028D632045l9411n8849p7437r3949j06992j16055j21489j23628j22428j17931
$$ y = [7320108, 7081307, 6830819, 6575972, 6323789, 6080484, 5851458, 5641243, 5453199, 5289352, 5150538, 5036608, 4946675, 4879633, 4834711, 4811635, 4810277, 4830143, 4869990, 4927768, 5000865, 5086315, 5180458, 5278470, 5374700, 5463840, 5541635, 5604500, 5649137, 5673058, 5675254, 5655957, 5615966, 5556498, 5479231, 5385818, 5277537, 5155951, 5023785, 4884548, 4741329, 4596408, 4451958, 4310487, 4174545, 4046470, 3928403, 3822006, 3728129, 3647287, 3580547, 3529340, 3494331, 3475124, 3471303, 3483052, 3510342, 3552186, 3607339, 3675277, 3755701, 3847157, 3946777, 4051342, 4157909, 4263182, 4362908, 4452496, 4528224, 4587608, 4628848, 4650437, 4651492, 4632045, 4592634, 4533785, 4456348, 4362399, 4255407, 4139352, 4017863, 3894235, 3771807, 3653876]
60018C653876j10550j00858q9487p7227o4736n2015l8678k4820j1159J885J4791
60007C101022K8300M2584N7319P2232Q7181J01943J16225J29696J41745J51269
59997D029516J56911J57519J52452J41743J26127J06712Q4556O0609L5810J0863
59987E062818j3985l8513o1925q3151j01589j16989j28559j35021j35736j31271
59977D116079j22680j10804r6498q0801o4579m8315l2540j7834m217Q860K1634
59966C568305L3712M4875N5484O5671P4803Q2209Q7824R1587R2830R0962Q6283
59955D374545P9538P1062O0893M9379L7102K4496J2068O67q967j6597k2036k4707
59943D637443k4057k0028j2624j508J3430L1535N2033P4830J00039J27157J55302
$$ y = [3653876, 3543326, 3442468, 3352981, 3275754, 3211018, 3159003, 3120325, 3095505, 3084346, 3086231, 3101022, 3129322, 3171906, 3229225, 3301457, 3388638, 3490581, 3606806, 3736502, 3878247, 4029516, 4186427, 4343946, 4496398, 4638141, 4764268, 4870980, 4955536, 5016145, 5051955, 5062818, 5048833, 5010320, 4948395, 4865244, 4763655, 4646666, 4518107, 4383086, 4247350, 4116079, 3993399, 3882595, 3786097, 3705296, 3640717, 3592402, 3559862, 3542028, 3537811, 3546671, 3568305, 3602017, 3646892, 3702376, 3768047, 3842850, 3925059, 4012883, 4104470, 4197300, 4288262, 4374545, 4454083, 4525145, 4586038, 4635417, 4672519, 4697015, 4709083, 4709750, 4700783, 4684186, 4662150, 4637443, 4613386, 4593358, 4580734, 4579226, 4592656, 4624191, 4676224, 4751054, 4851093, 4978250, 5133552]
59932E133552J84047K13297K42581K71125K98264L23091L43700L57479L62150
59923G729286L56156L38318L07665K63688K06651J38178O2044j6222r1398j60187
59913I134179k20490k69850l05821l27695l36849l35284l24725l07154k85000
59904F421311k60088k32916k03562j72948j42656j13685q5848n8496l1489n233
59894E114390K0129M5077O9864R3619J14878J32918J47792J58914J64410J62425
59884F224416J52408J34690J09494P7146L8811l638m8079r1860j31743j65143
59874F296502j91239k10228k21880k25872k23137k15797k05611j93356j79769
59865D429613j66102j53522j42628j33709j26752j20965j15025j08152j00537
$$ y = [5133552, 5317599, 5530896, 5773477, 6044602, 6342866, 6665957, 7009657, 7367136, 7729286, 8085442, 8423760, 8731425, 8995113, 9201764, 9339942, 9401986, 9385764, 9294366, 9134179, 8913689, 8643839, 8338018, 8010323, 7673474, 7338190, 7013465, 6706311, 6421311, 6161223, 5928307, 5724745, 5551797, 5409141, 5295456, 5209608, 5151112, 5119623, 5114390, 5134519, 5179596, 5249460, 5343079, 5457957, 5590875, 5738667, 5897581, 6061991, 6224416, 6376824, 6511514, 6621008, 6698154, 6736965, 6733327, 6685248, 6593388, 6461645, 6296502, 6105263, 5895035, 5673155, 5447283, 5224146, 5008349, 4802738, 4609382, 4429613, 4263511, 4109989, 3967361, 3833652, 3706900, 3585935, 3470910, 3362758, 3262221]
59856C262221r2565q4152p5029o5194n4813m4149l3769k4433j6590j0311n888
59845B755328m087n492r771j5751k2121k7962l2818l6434l8508l8798l7537l5492
59833B450557l3492l1954l0848k9797k8138k5286k1178j6109j0113l192L823R467
59821B233740J3316J6726K1241K6860L2487L7480M1835M5321M7435M8007M7063
59810B611511M4263L9304L2717K5518J8255J1091M608l14l230m060k538J385O931
59797B785441J3238K0636L0235M2294N5998P0772Q6806J04262J23062J43653J66915
59786C643312J92952K20786K49426K78120L04952L25692L34489L25180K92466
59777F167375K33883J52389N7013l9877j26735j95418k41923k66224k71423k62123
$$ y = [3262221, 3169656, 3085504, 3010475, 2945281, 2890468, 2846319, 2812550, 2788117, 2771527, 2761216, 2755328, 2751241, 2745749, 2735978, 2720227, 2698106, 2670144, 2637326, 2600892, 2562384, 2523586, 2486049, 2450557, 2417065, 2385111, 2354263, 2324466, 2296328, 2271042, 2249864, 2233755, 2223642, 2220450, 2224273, 2233740, 2247056, 2263782, 2285023, 2311883, 2344370, 2381850, 2423685, 2469006, 2516441, 2564448, 2611511, 2655774, 2695078, 2727795, 2753313, 2771568, 2782659, 2787267, 2786953, 2783723, 2779663, 2777125, 2778510, 2785441, 2798679, 2819315, 2849550, 2891844, 2947842, 3018614, 3105420, 3209682, 3332744, 3476397, 3643312, 3836264, 4057050, 4306476, 4584596, 4889548, 5215240, 5549729, 5874909, 6167375, 6401258, 6553647, 6610660, 6570783, 6444048, 6248630, 6006707, 5740483, 5469060, 5206937]
59767E206937k42990k18153j91030j63985j38293j14668r3656p5405n9494m5305
59757C863958l2398k0497r344J267J1518K1702L2070M2605N3271O4443P6681R0038
59745D195314J03965J17996J32277J47357J63730J81584K00784K21193K43104
59736E707304K67190K93718L22091L51441L81226M10855M39096M64383M85297
59727I122601N00162N06660N02784M88124M63747M31308L93342L54051L18514
59718A3081293K90640K72372K64620K67936K82008L05232L34951L67607L98791
59709A5865450M24138M40471M45649M37677M14926L77370L26834K65825J96964
59700A9195304J23627N0216j8730p9314j28387j63649j84021j89427j80218j57246
$$ y = [5206937, 4963947, 4745794, 4554764, 4390779, 4252486, 4137818, 4044162, 3968757, 3909263, 3863958, 3831560, 3811063, 3801719, 3802986, 3814504, 3836206, 3868276, 3910881, 3964152, 4028595, 4105276, 4195314, 4299279, 4417275, 4549552, 4696909, 4860639, 5042223, 5243007, 5464200, 5707304, 5974494, 6268212, 6590303, 6941744, 7322970, 7733825, 8172921, 8637304, 9122601, 9622763, 10129423, 10632207, 11120331, 11584078, 12015386, 12408728, 12762779, 13081293, 13371933, 13644305, 13908925, 14176861, 14458869, 14764101, 15099052, 15466659, 15865450, 16289588, 16730059, 17175708, 17613385, 18028311, 18405681, 18732515, 18998340, 19195304, 19318931, 19369147, 19350417, 19271103, 19142716, 18979067, 18795046, 18605619, 18425401, 18268155]
59690A8268155j22194p7044k3152L8437J06101J77947K52922L30611M09905M88769
59680A9850457N65131O36852P00661P52087P86458P98898P83395P33626O45690
59671B6253255N19804L59752J72339l2080k40003m37235o11353p52743q55201
59662B4376535r16793r39685r28761q90789q34593p70413p08310o57485o26347
59653A7103359o20622o39706o75530p16120p50465p70880p73382p57879p27639
59644A0671136o87341o41232n92737n44487m97856m53120m10615l71187l35291
59635F137270l02639k73086k46880k23581k01844j80892j61234j43374j26861
59626D276879j11272r7069q4610p3366o2869n3524m5671l8871l2989k8982k7611
$$ y = [18268155, 18145961, 18068917, 18045765, 18084202, 18190303, 18368250, 18621172, 18951783, 19361688, 19850457, 20415588, 21052440, 21753101, 22505188, 23291646, 24090544, 24873939, 25607565, 26253255, 26773059, 27132811, 27305150, 27273070, 27033067, 26595832, 25984479, 25231736, 24376535, 23459742, 22520057, 21591296, 20700507, 19865914, 19095501, 18387191, 17729706, 17103359, 16482737, 15843031, 15167501, 14451381, 13700916, 12930036, 12156654, 11398775, 10671136, 9983795, 9342563, 8749826, 8205339, 7707483, 7254363, 6843748, 6472561, 6137270, 5834631, 5561545, 5314665, 5091084, 4889240, 4708348, 4547114, 4403740, 4276879, 4165607, 4068538, 3983928, 3910562, 3847693, 3794169, 3748498, 3709627, 3676638, 3647656, 3620045]
59615C620045k8289l0204l3647l9106m5863n2667n9162o5465p0870p4259p5424
59604C045089p5028p3500p0859o7276o3002n7970n2177m6071m0008l3838k7556
59593B437804k1690j6535j1670o851k488J359N434R937J3752J5983J7289J8506
59581B460830J9106J8350J7148J7111J8357J9761K1003K2856K5704K9155L3069
59570B702450L7742M3151M9071N5746O3471P1787Q0084Q8755R8620J09557J20748
59559C521182J32043J43902J56276J68644J80970J93420K05235K15037K22256
59550E138965K27167K29610K28659K23710K15131K03811J90517J75199J56269
59541F989038J31526J01149O9213M0733J7415k386k0057l4868m5651n2251n4693
$$ y = [3620045, 3591756, 3561552, 3527905, 3488799, 3442936, 3390269, 3331107, 3265642, 3194772, 3120513, 3045089, 2970061, 2896561, 2825702, 2758426, 2695424, 2637454, 2585277, 2539206, 2499198, 2465360, 2437804, 2416114, 2399579, 2387909, 2381058, 2378570, 2379929, 2385363, 2395300, 2409052, 2425035, 2442324, 2460830, 2479936, 2498286, 2515434, 2532545, 2550902, 2570663, 2591666, 2614522, 2640226, 2669381, 2702450, 2740192, 2783343, 2832414, 2888160, 2951631, 3023418, 3103502, 3192257, 3290877, 3400434, 3521182, 3653225, 3797127, 3953403, 4122047, 4303017, 4496437, 4701672, 4916709, 5138965, 5366132, 5595742, 5824401, 6048111, 6263242, 6467053, 6657570, 6832769, 6989038, 7120564, 7221713, 7290926, 7331659, 7349074, 7346688, 7326631, 7291763, 7246112, 7193861, 7139168]
59530G139168n2360m4816l2354j5249O607L2696O1314R0507J18832J44776J66035
59519G615156J79788J83499J75510J55521J24506Q3810L4630k1091p9948j38309
59509H313072j93877k44922k88540l21377l42144l52026l52491l44152l28077
59500E545466l06590k82093k56067k29684k04176j79964j56572j33992j13178
59491C683150r4589p7243o0011m2942k6561j0675N341K1646L8129N4897P1850
59480C562992Q8294J03692J18420J33201J48047J62278J75142J85832J93247J96389
59470E067534J94852J88445J76424J57651J31588R8979O1538K1142k0718o2720
59460F014715j03079j39551j70388j95093k13819k26302k32043k31520k26521
$$ y = [7139168, 7086808, 7041992, 7009638, 6994389, 7000996, 7033692, 7095006, 7185513, 7304345, 7449121, 7615156, 7794944, 7978443, 8153953, 8309474, 8433980, 8517790, 8552420, 8531329, 8451381, 8313072, 8119195, 7874273, 7585733, 7264356, 6922212, 6570186, 6217695, 5873543, 5545466, 5238876, 4956783, 4700716, 4471032, 4266856, 4086892, 3930320, 3796328, 3683150, 3588561, 3511318, 3451307, 3408365, 3381804, 3371129, 3376470, 3398116, 3436245, 3491142, 3562992, 3651286, 3754978, 3873398, 4006599, 4154646, 4316924, 4492066, 4677898, 4871145, 5067534, 5262386, 5450831, 5627255, 5784906, 5916494, 6015473, 6077011, 6098153, 6077435, 6014715, 5911636, 5772085, 5601697, 5406604, 5192785, 4966483, 4734440, 4502920, 4276399]
59451D276399k19005k09952j99434j87390j74174j60584j47443j35042j23151
59442B720224j11673j00937r1042q1447p1736o2397n4157m6943m0173l3720k7813
59431A998186k2249j6624j1273o988l869j165J677M556P239R745J2257J5099J8332
59418B004923K0817K0369J6089J0101N717M145M281N292P685J1738J6770K2403
59406B150330K8891L5456L9861M0770L9509L8579L9312M1792M6126N2619O1123
59395B614368P1109Q2177R4072J06723J20660J36734J54919J74104J93613K14308
59385C962787K37507K63425K91437L21284L53125L86438M19480M49745M74569
59376G159797M91558M98935M95710M81690M57726M25945L89223L50154L10795
$$ y = [4276399, 4057394, 3847442, 3648008, 3460618, 3286444, 3125860, 2978417, 2843375, 2720224, 2608551, 2507614, 2416572, 2335125, 2263389, 2200992, 2146835, 2099892, 2059719, 2025999, 1998186, 1975937, 1959313, 1948040, 1941052, 1937183, 1936018, 1937695, 1942251, 1949490, 1959235, 1971492, 1986591, 2004923, 2025740, 2046109, 2062198, 2072299, 2078016, 2082161, 2086442, 2091734, 2099419, 2111157, 2127927, 2150330, 2179221, 2214677, 2254538, 2295308, 2334817, 2373396, 2412708, 2454500, 2500626, 2553245, 2614368, 2685477, 2767654, 2861726, 2968449, 3089109, 3225843, 3380762, 3554866, 3748479, 3962787, 4200294, 4463719, 4755156, 5076440, 5429565, 5816003, 6235483, 6685228, 7159797, 7651355, 8150290, 8646000, 9127690, 9585416, 10011361, 10400584, 10750738, 11061533]
59367A1061533K73127K38910K08747J81885J57102J33297J09066Q2572N2242J7204
59357A2515685k3155o9179j20176j74115k28413k80525l27806l67881l99728m23835
59347A0100872m40877m50958m54322m51929m44599m32382m15441l94906l72136
59338F243322l47655l21685k95211k69647k45552k22405j99648j77443j56358
59329D007718j36873j19119j02904q7943p4229o2017n1282m1442l1878k2550j3825
59318C263656n884J504Q598J5322K1343K6548L1272L5796L9673M2010M2664M2514
59306C565016M2109M0609L6826L0883K4015J7095J0273L812j772o309r776j1496
59294C741285j0545p021j898M502J2849K3411L5289M7339N8839O9003P6839Q2127
$$ y = [11061533, 11334660, 11573570, 11782317, 11964202, 12121304, 12254601, 12363667, 12446239, 12498481, 12515685, 12492530, 12423351, 12303175, 12129060, 11900647, 11620122, 11292316, 10924435, 10524707, 10100872, 9659995, 9209037, 8754715, 8302786, 7858187, 7425805, 7010364, 6615458, 6243322, 5895667, 5573982, 5278771, 5009124, 4763572, 4541167, 4341519, 4164076, 4007718, 3870845, 3751726, 3648822, 3560879, 3486650, 3424633, 3373351, 3331909, 3300031, 3277481, 3263656, 3257772, 3259276, 3267874, 3283196, 3304539, 3331087, 3362359, 3398155, 3437828, 3479838, 3522502, 3565016, 3607125, 3647734, 3684560, 3715443, 3739458, 3756553, 3766826, 3770638, 3768866, 3762557, 3752781, 3741285, 3730740, 3723719, 3721821, 3726323, 3739172, 3762583, 3797872, 3845211, 3904050, 3973053, 4049892, 4132019]
59282D132019Q5731Q8520R0516R1409R1105Q9313Q5267P8241O7983N4495L8132
59271D992731K0051J925j5076l0472m3754n4346o2267o7889p1021p1186o8922
59260D529774o5675o2224n8339n4163n0648m8247m6407m4827m4080m4412m5143
59249C965609m5797m6729m7991m8750m8384m7077m4685m0392l4143k7112j9789
59238C514760j0882Q08J4643K9488M5690O4318Q5326J07863J31765J57289J83941
59227D325009K10941K38367K66409K93570L16770L33230L41293L39598L26467
59218F991654L00382K60674K07988J44640P4124k75p6085j50441k19150k77927
59208G255584l24286l57515l77410l84154l79223l65334l45214l20940k94200
$$ y = [4132019, 4217750, 4306270, 4396786, 4488195, 4579300, 4668613, 4753880, 4832121, 4900104, 4954599, 4992731, 5012782, 5014707, 4999631, 4969159, 4925405, 4871059, 4808792, 4740903, 4669882, 4598696, 4529774, 4464099, 4401875, 4343536, 4289373, 4238725, 4190478, 4144071, 4099244, 4055164, 4010752, 3965609, 3919812, 3873083, 3825092, 3776342, 3727958, 3680881, 3636196, 3595804, 3561661, 3534549, 3514760, 3503878, 3504686, 3519329, 3548817, 3594507, 3658825, 3744151, 3852014, 3983779, 4141068, 4325009, 4535950, 4774317, 5040726, 5334296, 5651066, 5984296, 6325589, 6665187, 6991654, 7292036, 7552710, 7760698, 7905338, 7979462, 7979187, 7903102, 7752661, 7533511, 7255584, 6931298, 6573783, 6196373, 5812219, 5432996, 5067662, 4722448, 4401508, 4107308]
59199D107308k66500k39040k12803j88694j67263j48429j31728j16718j03114
59190B533019r1019q1045p3528o7480o1126n3781m6422m0113l4833l0214k6326
59179A927132k2976j9326j4985j0635o855l208O48M029O385Q544J1581J5210J8390
59166A913934K0957K3558K6478K9657L3347L7668M1978M5620M8884N2255N5228
59155B329564N7003N7805N8416N8690N7710N5148N1390M6595M0583L3523K5730
59144B872157J7074P523k002j0323j7355k3742k9316l2984l4277l4010l3220l2071
59132B647454k9944k6121k0419j3476o271Q08Q105J5752K3333L0883L9225M8622
59120B717951N7987O6364P4334Q2809R1238R8292J03876J09081J14432J19426
$$ y = [4107308, 3840808, 3601768, 3388965, 3200271, 3033008, 2884579, 2752851, 2636133, 2533019, 2442000, 2360955, 2287427, 2219947, 2158821, 2105040, 2058618, 2018505, 1983672, 1953458, 1927132, 1904156, 1884830, 1869845, 1859210, 1852355, 1849147, 1849795, 1853824, 1860209, 1868753, 1880334, 1895544, 1913934, 1934891, 1958449, 1984927, 2014584, 2047931, 2085599, 2127577, 2173197, 2222081, 2274336, 2329564, 2386567, 2444372, 2502788, 2561478, 2619188, 2674336, 2725726, 2772321, 2812904, 2846427, 2872157, 2889231, 2896754, 2894752, 2884429, 2867074, 2843332, 2814016, 2781032, 2746755, 2712745, 2679525, 2647454, 2617510, 2591389, 2570970, 2557494, 2551223, 2552031, 2560136, 2575888, 2599221, 2630104, 2669329, 2717951, 2775938, 2842302, 2916636, 2999445, 3090683, 3188975, 3292851, 3401932, 3516364, 3635790]
59110C635790J23773J27878J32161J36761J41969J48052J54571J60457J64607
59101D926019J65920J63168J55379J41996J22178R4801O0044K0310k1424o3560
59091E764831j05119j43904j76937k02566k20898k32404k37328k36467k31281
59082C977927k23104k12926k01767j90317j78369j65528j52308j39809j28439
59073B385360j17804j07599r7879q8643p9992p2376o5978o0236n4549m9071m4116
59062A547117l9434l4737l0261k6033k1492j6686j2846j0645q961o647m493l883
59050A330999m506n213o267q690j1911j4203j5219j6068j7032j7141j6128j4834
59038A183787j3507j1405q402n366k654J98L099N265O689Q233R995J1001J0822
$$ y = [3635790, 3759563, 3887441, 4019602, 4156363, 4298332, 4446384, 4600955, 4761412, 4926019, 5091939, 5255107, 5410486, 5552482, 5674660, 5769461, 5829505, 5849815, 5828391, 5764831, 5659712, 5515808, 5338871, 5136305, 4915407, 4683003, 4445675, 4209208, 3977927, 3754823, 3541897, 3340130, 3149813, 2971444, 2805916, 2653608, 2513799, 2385360, 2267556, 2159957, 2062078, 1973435, 1893443, 1821067, 1755089, 1694853, 1640304, 1591233, 1547117, 1507683, 1472946, 1442685, 1416652, 1395160, 1378474, 1365628, 1354983, 1346022, 1339375, 1334882, 1330999, 1326493, 1321280, 1315013, 1306323, 1294412, 1280209, 1264990, 1248922, 1231890, 1214749, 1198621, 1183787, 1170280, 1158875, 1150473, 1145107, 1142453, 1142651, 1145750, 1151015, 1157704, 1165937, 1175932, 1186933, 1197755]
59025A197755J0097R217P958O581N909O028O277O616P537Q536Q394P132O088N688
59011A299813M866L095J251j05j562l322m531m948n647p142q285q070p179o678
58997A251556o337n337l700k034o65K02L25R6N32J894L276M061M792N886O702
58982A261249O751O879Q131J0175J1764J2301J2117J1748J1673J2382J4034J6236
58970A395440J8484K0529K2218K3587K5212K7720L0746L3083L4022L3898L3222
58959A698161L2132L0771K9271K7244K4257K0908J8436J7175J6467J6227J7243
58948A948292J9730K2845K6023K9546L3421L7057M0519M4730M9809N4601N8558
58937B365131O2736O8104P4117P9963Q6003R2894J00323J07833J16091J26127
$$ y = [1197755, 1207852, 1217069, 1225027, 1231608, 1237517, 1243545, 1249822, 1256438, 1263975, 1272511, 1280905, 1288037, 1294125, 1299813, 1304679, 1307774, 1309025, 1308920, 1307358, 1304036, 1299505, 1294557, 1288910, 1281768, 1273483, 1265413, 1258234, 1251556, 1245219, 1239882, 1236182, 1234148, 1233483, 1233685, 1234010, 1234106, 1234638, 1236532, 1239808, 1243869, 1248661, 1254547, 1261249, 1268000, 1274879, 1283010, 1293185, 1304949, 1317250, 1329367, 1341115, 1352788, 1365170, 1379204, 1395440, 1413924, 1434453, 1456671, 1480258, 1505470, 1533190, 1563936, 1597019, 1631041, 1664939, 1698161, 1730293, 1761064, 1790335, 1817579, 1841836, 1862744, 1881180, 1898355, 1914822, 1931049, 1948292, 1968022, 1990867, 2016890, 2046436, 2079857, 2116914, 2157433, 2202163, 2251972, 2306573, 2365131, 2427867, 2495971, 2570088, 2650051, 2736054, 2828948, 2929271, 3037104, 3153195, 3279322]
58927C279322J37873J50541J64000J78751J94851K11800K29448K48378K69399
58918E064363K92838L18181L44394L70952L98479M27672M57742M86788N13620
58909H675029N37924N58331N71627N74485N65069N42381N05012M51559L81765
58900A3363182K96889J99545R3681j5882j24314k27036l19463l97733m59991n06249
58890A1902629n36930n52544n54842n46903n31483n10119m84051m54979m24422
58881G306356l93338l62807l34181l08218k84866k64148k46221k30502k15869
58872D666206k01932j89063j77023j64868j52425j40520j29476j18728j08228
58863C283943r8724r0229q1735p3019o5243n9118n3838m8449m2964l7475l1651
$$ y = [3279322, 3417195, 3567736, 3731736, 3910487, 4105338, 4317138, 4546586, 4794964, 5064363, 5357201, 5675382, 6019776, 6390728, 6789207, 7216879, 7674621, 8161409, 8675029, 9212953, 9771284, 10342911, 10917396, 11482465, 12024846, 12529858, 12981417, 13363182, 13660071, 13859616, 13953297, 13937415, 13813101, 13586065, 13266602, 12868869, 12408878, 11902629, 11365699, 10813155, 10258313, 9711410, 9179927, 8669808, 8185757, 7730778, 7306356, 6913018, 6550211, 6216030, 5907812, 5622946, 5358798, 5112577, 4882075, 4666206, 4464274, 4275211, 4098188, 3933320, 3780895, 3640375, 3510899, 3392171, 3283943, 3185219, 3094990, 3013255, 2940236, 2874993, 2815875, 2762037, 2713588, 2670624, 2633149, 2601498]
58852B601498k5708k0500j5923j0682m307K007P311J2111J6986K1529K5591L0009
58840B639922L5199M0365M5023M9892N5400O0831O5891P1555P8300Q5157R1625
58829C319160R8948J08193J18583J29094J40245J52903J66772J81560J98267K17660
58819D831385K38739K60324K83094L08422L36197L65359L95502M26349M56512
58810G901883M84320N09091N30027N44713N50193N44677N26836M94354M45012
58801A2531106L78761K97483K03450R9512r807j18891k22541l16205l95847m59097
58791A1987924n06009n37745n55153n59454n53052n38411n17074m90899m62852
58782G267275m35068m07276l78710l50484l24435l00704k78402k57766k39769
$$ y = [2601498, 2575790, 2555290, 2539367, 2528685, 2524378, 2526385, 2533696, 2545807, 2562793, 2584322, 2609913, 2639922, 2675121, 2715486, 2760509, 2810401, 2865801, 2926632, 2992523, 3064078, 3142378, 3227535, 3319160, 3418108, 3526301, 3644884, 3773978, 3914223, 4067126, 4233898, 4415458, 4613725, 4831385, 5070124, 5330448, 5613542, 5921964, 6258161, 6623520, 7019022, 7445371, 7901883, 8386203, 8895294, 9425321, 9970034, 10520227, 11064904, 11591740, 12086094, 12531106, 12909867, 13207350, 13410800, 13510312, 13500505, 13381614, 13159073, 12842868, 12447021, 11987924, 11481915, 10944170, 10389017, 9829563, 9276511, 8738100, 8221026, 7730127, 7267275, 6832207, 6424931, 6046221, 5695737, 5371302, 5070598, 4792196, 4534430, 4294661]
58773D294661k24183k09815j96171j83313j70676j57709j45186j34250j24577
58764B748781j14977j05333r6461q8510q0923p3549o6516n9559n2671m6742m2220
58753A921320l7971l2875k7729k4024k1701j9665j7822j6843j6581j6380j6405
58742A673324j7143j8194j9123k0696k3610k6777k8614k9331l0125l0832l0355
58731A398524k8833k7416k6306k4921k3591k3182k3373k3134k2582k2575k2842
58720A129769k2404k1410k0691j9945j8334j6489j5800j5947j5249j3434j1993
58709I38073j1757j2029j2216j2434j2429j1693j0734j0529j0766j0283r229q923
58697H05051r672j0452j0794j1122j1261j0449r008q163q014p341n616l645k138
$$ y = [4294661, 4070478, 3860663, 3664492, 3481179, 3310503, 3152794, 3007608, 2873358, 2748781, 2633804, 2528471, 2432010, 2343500, 2262577, 2189028, 2122512, 2062953, 2010282, 1963540, 1921320, 1883349, 1850474, 1822745, 1798721, 1777020, 1757355, 1739533, 1722690, 1706109, 1689729, 1673324, 1656181, 1637987, 1618864, 1598168, 1574558, 1547781, 1519167, 1489836, 1459711, 1428879, 1398524, 1369691, 1342275, 1315969, 1291048, 1267457, 1244275, 1220902, 1197768, 1175186, 1152611, 1129769, 1107365, 1085955, 1065264, 1045319, 1026985, 1010496, 994696, 978749, 963500, 950066, 938073, 926316, 914287, 902071, 889637, 877208, 865515, 854781, 844252, 833486, 823203, 813974, 805051, 795379, 784927, 774133, 763011, 751750, 741301, 732293, 724130, 716116, 708775, 703159, 699514, 697376]
58684F97376j117p22r47q49L63J726J778J077J349K459K591J461Q42J529K233
58669G11149K097K052K841L840M631N718O770O059K842j283m436o420p711p989
58655G20160o873n041l504k476j626p01N60K324M171N502O548Q028R760J0827
58641G47659J1123J1501J2328J3191J4131J5795J8146K0375K2266K4470K7221
58630I38206L0095L3097L6615M0331M3500M6487N0558N6149O2664O9948P8408
58619A486058Q7680R6843J06008J16102J26892J37003J45961J54383J61886J66721
58609B785537J67811J65311J58554J45440J24757R7624O5918L0976n350l9995
58599C696583p0309r5494j15749j30978j41037j46296j47302j44657j39575j33641
$$ y = [697376, 696259, 695537, 694590, 693741, 694104, 695830, 697608, 698685, 700034, 702493, 705084, 706545, 707387, 708916, 711149, 713246, 715298, 718139, 721979, 726610, 732328, 739098, 745157, 747999, 746716, 742280, 735860, 728149, 720160, 713287, 708246, 704742, 702266, 700640, 699939, 700499, 702823, 706994, 712496, 719044, 727072, 736832, 747659, 758782, 770283, 782611, 795802, 809933, 825728, 843874, 864249, 886515, 910985, 938206, 968301, 1001398, 1038013, 1078344, 1121844, 1168331, 1218889, 1275038, 1337702, 1407650, 1486058, 1573738, 1670581, 1776589, 1892691, 2019583, 2156586, 2302547, 2456930, 2618816, 2785537, 2953348, 3118659, 3277213, 3422653, 3547410, 3645034, 3710952, 3741928, 3736578, 3696583, 3626274, 3530780, 3415031, 3284053, 3143016, 2996720, 2849418, 2704761, 2565186, 2431545]
58589B431545j27616j21146j13833j05793r7222q8325p9652p1650o4118n6913
58579A505277n0674m5747m1098l5730l0523k6992k4765k2189j8976j6307j4539
58568A177737j2838j1105j0198j0281j0754j1769j3954j6643j8358j9007j9736
58557A023094k0633k0649j9691j8691j7611j5544j2867j1133j0670j0327r681
58546H55597r306q949p693o041n433n650n026l390k236j895j211k34n04k095l243
58531G92691l429m209o245q195r338j0580j2174j2909j2480j2060j1858j0740
58519F78474r001q581r572r435p001m368l436l269k466j576j443j354n50L01N24
58504F17247N23M52k49j152q50N63J371J321K127M071N044M195L511M261M807
$$ y = [2431545, 2303929, 2182783, 2068950, 1963157, 1865935, 1777610, 1697958, 1626308, 1562190, 1505277, 1454603, 1408856, 1367758, 1332028, 1301505, 1274513, 1249748, 1227559, 1208583, 1192276, 1177737, 1164899, 1153794, 1143596, 1133315, 1122561, 1110792, 1096838, 1080195, 1061837, 1042830, 1023094, 1002461, 981812, 962121, 943430, 925819, 910275, 897408, 886275, 875605, 865278, 855597, 846291, 837342, 829649, 823608, 818175, 812525, 807499, 804109, 801873, 799978, 798767, 798533, 798029, 795934, 792691, 789262, 785053, 778808, 770613, 761275, 750695, 738521, 725612, 713132, 701072, 689214, 678474, 669473, 660892, 651320, 641885, 634884, 630516, 627080, 623811, 621345, 619769, 618326, 616972, 616422, 616723, 617247, 617770, 618222, 617973, 616821, 615971, 616534, 617905, 619226, 621353, 625424, 630468, 634663, 638174, 642435, 647242]
58489F47242L663K078J643J821J648J538J707J201J48M88K784M760M843M542N464
58474F85570O505O147N089M428L456J403p05k046l729o497q809r270q928r094
58460F63520q979p612o095n724n707m892l913l664l422k393j459j450j495p78
58446F05937j18j65L4J029J650J305J385K692L753L402K739K756K500J390P77
58431F31066J249J120l53j026N89K604L035L031M225N598N862O387Q691J1255
58417F83333J1888J1269J1271J1704J1467J0976J0832J0036P949O007N125L766
58405G95623R84j263j508j701l711n660n116l391l104l721l106j564p72m94K96
58390G61792P82O2k94J301L286L456K730L125L942L459K559L173M663N189N088
$$ y = [647242, 650905, 652983, 654626, 656447, 658095, 659633, 661340, 662541, 662689, 663177, 665961, 670721, 675564, 680106, 685570, 692075, 698222, 703311, 707739, 711195, 712598, 711893, 709847, 706118, 699621, 690812, 681542, 672614, 663520, 654541, 646929, 640834, 635110, 629403, 624511, 620598, 616934, 613512, 611119, 609660, 608210, 606715, 605937, 605819, 605654, 605688, 606717, 608367, 609672, 611057, 613749, 617502, 620904, 623643, 626399, 628899, 630289, 631066, 632315, 633435, 633082, 632056, 632645, 635249, 638284, 641315, 645540, 651138, 657000, 663387, 672078, 683333, 695221, 706490, 717761, 729465, 740932, 751908, 762740, 772776, 780725, 786732, 791857, 795623, 796607, 795344, 793836, 792135, 788424, 782764, 777648, 774257, 771153, 767432, 764326, 762762, 761990, 761496, 761792, 762574, 762636, 762342, 763643, 766929, 770385, 773115, 776240, 780182, 783641, 786200, 789373, 794036, 799225, 804313]
58375H04313N682O353N953N468O123O686N819N115O454Q297Q095O556O010O336
58361H93260O014N463N902O550O255O137P418Q568P817O476O439O693N679M699
58347I83370N362O153N194M057M943O554O677O355P449Q703Q382Q166J0090J2244
58333A083699J2025J1037J2063J3858J3724J2768J3524J4871J4361J3209J3819
58322A228958J4776J3583J1980J3080J5504J5854J4761J5014J5891J5007J3598
58311A388006J4224J5408J4302J2518J3426J5960J6941J7173J9134K1190K0472
58300A568754J9034K0523K3236K3283K2123K3710K6626K6650K4994K6132K9267
58289A834332K9930K8532K9274L1952L2768L2197L3998L7512L8854L8712M1009
$$ y = [804313, 809995, 816348, 822301, 827769, 833892, 840578, 846397, 851512, 857966, 866263, 874358, 880914, 886924, 893260, 899274, 904737, 910639, 917189, 923444, 929581, 936999, 945567, 953384, 959860, 966299, 972992, 978671, 983370, 988732, 994885, 1000079, 1004136, 1009079, 1015633, 1022310, 1028665, 1036114, 1044817, 1053199, 1061365, 1071455, 1083699, 1095724, 1106761, 1118824, 1132682, 1146406, 1159174, 1172698, 1187569, 1201930, 1215139, 1228958, 1243734, 1257317, 1269297, 1282377, 1297881, 1313735, 1328496, 1343510, 1359401, 1374408, 1388006, 1402230, 1417638, 1431940, 1444458, 1457884, 1473844, 1490785, 1507958, 1527092, 1548282, 1568754, 1587788, 1608311, 1631547, 1654830, 1676953, 1700663, 1727289, 1753939, 1778933, 1805065, 1834332, 1864262, 1892794, 1922068, 1954020, 1986788, 2018985, 2052983, 2090495, 2129349, 2168061, 2209070]
58278B209070M4906M6174M5336M6356M8443M7558M4828M4945M7223M6990M4782
58267B716611M5336M8367M9435M8967N1365N5996N8264N8682O1626O6163O7761
58256C328573O7841P1715P8245Q1729Q2813Q6949R3357R6583R7677J02475J09903
58245D297860J13801J15277J21032J30501J37143J41453J49738J60963J68361
58236E536129J73197J83021J97119K08088K16850K31105K49825K65005K77846
58227G538185K96762L20383L39859L57080L82334M14715M44140M72001N09453
58218A1074912N55842O00515O45685P04717P77839Q53528R33931J033490J152720
58209A8333179J280750J423677J601257J816454K060659K348447K712164L164181
$$ y = [2209070, 2253976, 2300150, 2345486, 2391842, 2440285, 2487843, 2532671, 2577616, 2624839, 2671829, 2716611, 2761947, 2810314, 2859749, 2908716, 2960081, 3016077, 3074341, 3133023, 3194649, 3260812, 3328573, 3396414, 3468129, 3546374, 3628103, 3710916, 3797865, 3891222, 3987805, 4085482, 4187957, 4297860, 4411661, 4526938, 4647970, 4778471, 4915614, 5057067, 5206805, 5367768, 5536129, 5709326, 5892347, 6089466, 6297554, 6514404, 6745509, 6995334, 7260339, 7538185, 7834947, 8155330, 8495189, 8852269, 9234603, 9649318, 10093458, 10565459, 11074912, 11630754, 12231269, 12876954, 13581671, 14359510, 15213038, 16146969, 17180459, 18333179, 19613929, 21037606, 22638863, 24455317, 26515976, 28864423, 31576587, 34740768]
58201C4740768L704695M364477N192106O197529P359666Q692051J0247773J2069001
58193I2568066J4207043J6781917J9909612K3541839K7457287L1336597L4539818
58186B60342179L5673817L2767858K4507361J1598812l193916j6532841k6161312
58179C19001958l1465061l2997813l1796528k8942554k5314994k1481785j7760110
58172A29243113j4333958j1289919q649825o506102n097557m622684m958477n653949
58164F8130642o230388o443212o281089n834172n219440m556235l927125l358008
58156B6280973k852330k421909k070790j780197j531922j326150j161911j022511
58148A2113253q95400p86442p01099o29802n63868n08131m66405m30723l95334
$$ y = [34740768, 38445463, 42809940, 48002046, 54199575, 61559241, 70251292, 80499065, 92568066, 106775109, 123557026, 143466638, 167008477, 194465764, 225802361, 260342179, 296015996, 328783854, 353291215, 364890027, 361696111, 345163270, 319001958, 287536897, 254539084, 222742556, 193800002, 168485008, 147003223, 129243113, 114909155, 103619236, 94969411, 88463309, 83365752, 78743068, 73784591, 68130642, 61900254, 55457042, 49175953, 43341781, 38122341, 33566106, 29638981, 26280973, 23428643, 21006734, 18935944, 17155747, 15623825, 14297675, 13135764, 12113253, 11217853, 10431411, 9730312, 9100510, 8536642, 8028511, 7562106, 7131383, 6736049]
58139F736049l65796l44630l23010k95777k70432k52511k35653k14496j94358
58130D239386j79830j66163j49821j36153j29190j24593j19272j17216j19581
58121B997567j19622j13689j07094j03469r8511q9818q2614p9818p6344o9102
58111B057486o3019o1375n9506n4044m9354m8809m8297m4338m0477l9775l8827
58100A509665l4966l1825l2147l2274k9278k6526k6870k7112k4541k2340k3284
58089A198502k4373k2762k0969k1385k1556j9635j8557k0245k1451j9821j8320
58078I69428j9342k0165j8610j7364j8252j8099j4881j2214j2889j3593j1007
58067G93012p828p523q144o598m478m445m917l481j778k282l710m062m676p018
$$ y = [6736049, 6370253, 6025623, 5702613, 5406836, 5136404, 4883893, 4648240, 4433744, 4239386, 4059556, 3893393, 3743572, 3607419, 3478229, 3353636, 3234364, 3117148, 2997567, 2877945, 2764256, 2657162, 2553693, 2455182, 2365364, 2282750, 2202932, 2126588, 2057486, 1994467, 1933092, 1873586, 1819542, 1770188, 1721379, 1673082, 1628744, 1588267, 1548492, 1509665, 1474699, 1442874, 1410727, 1378453, 1349175, 1322649, 1295779, 1268667, 1244126, 1221786, 1198502, 1174129, 1151367, 1130398, 1109013, 1087457, 1067822, 1049265, 1029020, 1007569, 987748, 969428, 950086, 929921, 911311, 893947, 875695, 857596, 842715, 830501, 817612, 804019, 793012, 785184, 777661, 769517, 762919, 758441, 753996, 749079, 745598, 743820, 741538, 737828, 733766, 729090, 722072]
58053G22072r009q589p577q015q277o559m688m602m550k653p41q22j136L84K113
58038F57351J976J493K672M007L458K356K677L258K309Q65K14j078m084o472o208
58023F64794n350o514q386q490p644p763p872o209m098l850m792m837m138l934
58009E80917l756k828k132k271j589O84K113R40m13P71K863K936J878K331L595
57994E86039K923M35j337j739k130k618k175j217j033j313r98n91j095j710j170
57979E70271k11k52q26p73o17j240j609m26J280J820J719K381L162K569J221R03
57963E79372J562J661P64m45j725k861k782j143M26N72L05R67J719J249L40L93
57947E80374Q43L80n77r93j368k522l591l553l360m223n245n091m549n003n872
$$ y = [722072, 713063, 704474, 696897, 688882, 680605, 674046, 669358, 664756, 660206, 657553, 656812, 655990, 654854, 655238, 657351, 659327, 660820, 663492, 667499, 670957, 673313, 675990, 679248, 681557, 682422, 682636, 681558, 677474, 671002, 664794, 659444, 652930, 644544, 636054, 628410, 620647, 612775, 606566, 602468, 598618, 593826, 588989, 584851, 580917, 577161, 574333, 572201, 569930, 568341, 569025, 571138, 572078, 571665, 572436, 575299, 578235, 580113, 582444, 586039, 588962, 589397, 588060, 586321, 584191, 581573, 579398, 578181, 577148, 575835, 574837, 574246, 573151, 571441, 570271, 570060, 569808, 568982, 568209, 567592, 566352, 564743, 564317, 565597, 567417, 569136, 571517, 574679, 577248, 578469, 579372, 580934, 582595, 583359, 582914, 581189, 578328, 575546, 574403, 574829, 575401, 575706, 576673, 578392, 579641, 579981, 580374, 581217, 581597, 581020, 580027, 578659, 576137, 572546, 568993, 565633, 561410, 556165, 551074, 546525, 541522, 535650]
57932E35650n995o137p444q858q740p806p695p836o554m242k702k155j545r05
57918D57036p88k74J850M634O243O908Q080R517R757Q849Q107P741P127O711P201
57903E48699P527O072L356J165l41k276m489n882o705q058r549r782q822p922
57889E02993p255o125m921m544m359l005q79M27Q20J675L429N341P196R173J0450
57874E10416J0102Q970Q586Q728Q136P060O721O783N743L661K061J300K59j415
57860E87111k896l999n343o709p171o819o574o484n909n099m780m573l639k413
57846E14703j826j436l24P81N48l56j60R13Q78p70k463l203l575m088m579n323
57830D89720o714p892p639o541o209o617o347n245m563m580m346l773l657l632
$$ y = [535650, 529655, 523518, 516074, 507216, 498476, 490670, 482975, 475139, 468585, 464343, 461641, 459486, 457941, 457036, 456248, 455974, 457824, 462458, 468701, 475609, 483689, 493206, 502963, 511812, 519919, 527660, 534787, 541498, 548699, 556226, 562298, 565654, 566819, 566478, 564202, 559713, 553831, 547126, 539068, 529519, 519737, 510915, 502993, 495738, 489613, 484692, 480148, 475789, 472784, 471905, 472332, 473152, 474827, 478256, 483597, 490793, 499966, 510416, 520518, 529488, 538074, 546802, 554938, 561998, 568719, 575502, 581245, 584906, 586967, 588267, 588526, 587111, 584215, 580216, 574873, 568164, 560993, 554174, 547600, 541116, 535207, 530108, 525328, 520755, 517116, 514703, 512877, 511441, 511117, 511898, 512446, 512090, 511930, 512843, 513721, 512951, 510488, 507285, 503710, 499622, 495043, 489720, 483006, 475114, 467475, 460934, 454725, 448108, 441761, 436516, 431953, 427373, 423027, 419254, 415597, 411965]
57816D11965k456m22Q35J105J860L498M700M931N265O190O781O614O527O835O758
57801D70986O062N624N837O234O803P977R136R176Q630R114J0395J0375Q374O086
57787E80809M647L022K39k903n381p334r025j0034j0426j1037j1863j1719j0228
57774D98767q576p570o534m863l143j896p49M92J297J587K065K818L067K750K861
57759D82373L690M279M195M287N052N808O127O496O974O784N914N524O090O681
57745E60274O710O791P151O912N774M830M735M697M123L740M035M107L273K497
57731F29649K974M466O066P587R079J0014J0015R618R480R546R680J0183J1062
57718G39419J1714J1940J2375J3418J4679J5906J7371J8974K0101K0863K2235
$$ y = [411965, 409509, 409087, 409922, 411027, 412887, 416385, 421085, 426016, 431281, 437471, 444252, 450866, 457393, 464228, 470986, 477048, 482672, 488509, 494743, 501546, 509523, 518659, 527835, 536465, 545579, 555974, 566349, 574723, 580809, 585456, 588478, 588717, 585814, 580433, 573099, 564074, 554040, 543614, 532577, 520714, 508995, 498767, 490191, 482621, 476087, 471224, 468081, 466185, 465436, 465928, 467225, 468812, 470877, 473695, 476762, 479512, 482373, 486063, 490342, 494537, 498824, 503876, 509684, 515811, 522307, 529281, 536065, 541979, 547503, 553593, 560274, 566984, 573775, 580926, 587838, 593612, 598442, 603177, 607874, 611997, 615737, 619772, 623879, 627152, 629649, 632623, 637089, 643155, 650742, 659821, 669835, 679850, 689468, 698948, 708494, 718174, 728357, 739419, 751133, 763073, 775448, 788866, 803545, 819451, 836822, 855796, 875897, 896760, 918995]
57707I18995K4506K6806K8715L1011L4274L7983M1622M5438M9609N3939N8905
57696A351803O5617P4183Q3440R2878J03294J14953J26706J37741J48681J59923
57686B459219J70339J78448J83429J84062J78238J64872J45150J20936R3294O3795
57676C941782L5923J3636p91o639l574P950K5187M2086M9060L5008o484p0263
57664D062881j40114j98339k35257k50210k46896k30299k06262j80112j54728
57655B220664j30985j09678r1661p6636o3360n1098l9945l0068k1487j4220p882
57644A583644j729M280R360J3544J8386K4972L2364L9215M5849N3353O1608O9796
57632A954642P8195Q7656R7817J07440J16278J25011J33385J39880J43244J43043
$$ y = [918995, 943501, 970307, 999022, 1030033, 1064307, 1102290, 1143912, 1189350, 1238959, 1292898, 1351803, 1417420, 1491603, 1575043, 1667921, 1771215, 1886168, 2012874, 2150615, 2299296, 2459219, 2629558, 2808006, 2991435, 3175497, 3353735, 3518607, 3663757, 3784693, 3877987, 3941782, 3977705, 3991341, 3990550, 3983911, 3980337, 3988287, 4013474, 4055560, 4104620, 4139628, 4133144, 4062881, 3922767, 3724428, 3489171, 3238961, 2992065, 2761766, 2555504, 2375392, 2220664, 2089679, 1980001, 1888340, 1811704, 1748344, 1697246, 1657301, 1627233, 1605746, 1591526, 1583644, 1581915, 1586195, 1595555, 1609099, 1627485, 1652457, 1684821, 1724036, 1769885, 1823238, 1884846, 1954642, 2032837, 2120493, 2218310, 2325750, 2442028, 2567039, 2700424, 2840304, 2983548, 3126591]
57622C126591J38469J27893J10178Q5809N6417K3735j0602m4605p5665j01242
57612C436978j20192j33284j41763j45651j44388j38944j31794j24389j16185
57603B240388j06690r7008q8341q0409p2570o5253n9020n3256m7258m1694l7533
57592A491356l4335l1030k7711k5105k2896k0164j7166j5079j4105j3172j1520
57581A259073r415p347n601m496m175m122l710l039k469j724l20J382K517K960
57567A219514L333M059N108O462Q046R411J0210J0753J1481J2339J3279J4797
57555A328792J7184J9677K1310K2187K3153K4546K6114K7809K9853L2297L5214
57544A608136L8927M3448M8108N2414N6736O1636O7135P3289Q0657Q9315R8141
$$ y = [3126591, 3265060, 3392953, 3503131, 3588940, 3645357, 3669092, 3658490, 3613885, 3538220, 3436978, 3316786, 3183502, 3041739, 2896088, 2751700, 2612756, 2480962, 2356573, 2240388, 2133698, 2036690, 1948349, 1867940, 1795370, 1730117, 1671097, 1617841, 1570583, 1528889, 1491356, 1457021, 1425991, 1398280, 1373175, 1350279, 1330115, 1312949, 1297870, 1283765, 1270593, 1259073, 1249658, 1242311, 1236710, 1232214, 1228039, 1223917, 1220207, 1217168, 1214699, 1212975, 1212655, 1214037, 1216554, 1219514, 1222847, 1226906, 1232014, 1238476, 1246522, 1255933, 1266143, 1276896, 1288377, 1300716, 1313995, 1328792, 1345976, 1365653, 1386963, 1409150, 1432303, 1456849, 1482963, 1510772, 1540625, 1572922, 1608136, 1647063, 1690511, 1738619, 1791033, 1847769, 1909405, 1976540, 2049829, 2130486, 2219801, 2317942]
57533B317942J05936J12518J17841J21018J21285J19027J14398J05700R0767O9672
57523C396104M4708J7979r498l6521o1018q0921r5018j03058j05912j05299j02486
57512B759060r7489r0320q2320p5091o8621o1784n4384m7305m0948l4860k8996
57501B076942k4009k0123j6742j3314r764o084k333J050L741O242R250J2601J5670
57488B033127J8537K1769K5322K8671L1905L5667M0081M4672M9228N3987N9158
57477B442124O4956P1754P9387Q6799R3296R9605J06626J13527J18290J19620
57467C395984J17170J10407R8639Q2013O1262L6801R348j8862m4895o7053q4846
57456C695968r7554j04543j06806j06391j04133r9356r1987q3373p4738o6289
$$ y = [2317942, 2423878, 2536396, 2654237, 2775255, 2896540, 3015567, 3129965, 3235665, 3326432, 3396104, 3440812, 3458791, 3449293, 3412772, 3351754, 3270833, 3175815, 3072757, 2966845, 2861546, 2759060, 2661571, 2571251, 2488931, 2413840, 2345219, 2283435, 2229051, 2181746, 2140798, 2105938, 2076942, 2052933, 2032810, 2016068, 2002754, 1992990, 1986906, 1984573, 1985623, 1989364, 1995606, 2004856, 2017457, 2033127, 2051664, 2073433, 2098755, 2127426, 2159331, 2194998, 2235079, 2279751, 2328979, 2382966, 2442124, 2507080, 2578834, 2658221, 2745020, 2838316, 2937921, 3044547, 3158074, 3276364, 3395984, 3513154, 3623561, 3722200, 3804213, 3865475, 3902276, 3911624, 3892762, 3847867, 3780814, 3695968, 3598414, 3493871, 3387065, 3280674, 3176541, 3077185, 2985198, 2901825, 2827087, 2760798]
57446B760798n8206n1120m5099l9443l3876k8929k4781k0837j6835j3339j0730
57435B417603q663o795n135l466j327J194L512N475P303Q689R139R186J0042J1777
57421B458534J3113J3292J2981J3025J3377J3717J4124J4654J5113J5550J6255
57410B613735J7075J7508J7522J7534J7673J7902J8607J9932K0883K0411J9225
57399B818007J8992J9892K0590K0604K0930K1989K2802K2740K2430K2317K1945
57388C053238K1254K1100K1689K2045K1759K1745K2449K2837K2250K1730K2269
57377C294365K3067K2911K2187K2115K2794K3401K3709K4118K4668K5080K5519
57366C553934K6350K7380K8020K7976K7347K6493K6082K6640K7721K8357K8621
$$ y = [2760798, 2702592, 2651472, 2606373, 2566930, 2533054, 2504125, 2479344, 2458507, 2441672, 2428333, 2417603, 2408940, 2402145, 2397010, 2393544, 2392217, 2393411, 2396923, 2402398, 2409701, 2418390, 2427529, 2436715, 2446757, 2458534, 2471647, 2484939, 2497920, 2510945, 2524322, 2538039, 2552163, 2566817, 2581930, 2597480, 2613735, 2630810, 2648318, 2665840, 2683374, 2701047, 2718949, 2737556, 2757488, 2778371, 2798782, 2818007, 2836999, 2856891, 2877481, 2898085, 2919015, 2941004, 2963806, 2986546, 3008976, 3031293, 3053238, 3074492, 3095592, 3117281, 3139326, 3161085, 3182830, 3205279, 3228116, 3250366, 3272096, 3294365, 3317432, 3340343, 3362530, 3384645, 3407439, 3430840, 3454549, 3478667, 3503335, 3528415, 3553934, 3580284, 3607664, 3635684, 3663660, 3691007, 3717500, 3743582, 3770222, 3797943, 3826300, 3854921]
57355C854921K9676L1765L3357L3122L1770L0950L1151L1697L2145L2552L2827
57344D205933L2735L2368L2002L1776L1858L2499L3469L4057L3941L3486L2963
57333D567087L2276L1694L1848L2673L3350L3762L4708L6179L6754L5649L4102
57322D940082L3651L4129L4510L4693L5141L5563L5383L4964L5149L5942L6704
57311E325911L7208L7593L7832L8167L9378M1613M3559M3988M3527M3729M4862
57300E777367M5938M6545M7293M8484M9645N0499N1297N2008N2085N1281N0007
57289F322449M8680M7249M5406M2816L9185L4540K9378K4218J9211J4428J0178
57278F677738O678L766J412N1J0R72K430M142N806O957P742R019J1137J3275J4700
$$ y = [3854921, 3884597, 3916362, 3949719, 3982841, 4014611, 4045561, 4076712, 4108409, 4140554, 4173106, 4205933, 4238668, 4271036, 4303038, 4334814, 4366672, 4399171, 4432640, 4466697, 4500638, 4534124, 4567087, 4599363, 4631057, 4662905, 4695578, 4728928, 4762690, 4797398, 4833577, 4870331, 4905980, 4940082, 4973733, 5007862, 5042372, 5077065, 5112206, 5147769, 5183152, 5218116, 5253265, 5289207, 5325911, 5363119, 5400712, 5438544, 5476711, 5516089, 5557702, 5601261, 5645249, 5688776, 5732505, 5777367, 5823305, 5869850, 5917143, 5965627, 6015272, 6065771, 6117068, 6169076, 6221161, 6272442, 6322449, 6371129, 6418378, 6463784, 6506600, 6545785, 6580325, 6609703, 6633921, 6653132, 6667560, 6677738, 6684416, 6688182, 6689594, 6689645, 6689655, 6690627, 6693057, 6697199, 6703005, 6709962, 6717704, 6726723, 6737860, 6751135, 6765835]
57263F765835J5931J7818K0076K1691K2311K2444K2612K3033K3722K4203K3650
57252G003326K1963K0153J8995J8037J6612J5091J4089J3262J2078J1148J1396
57241G176150J2336J2527J1632J0698J0531J0940J1631J2715J4073J5212J5919
57230G314364J6346J6337J5496J4033J2827J2451J2664J2897J2779J2168J1231
57219G463593J0396R863R256Q127O588N029L584K335J616J502J347M07j241k897
57205G519505m017m464m451m621n664p420q963r996j1298j3252j4915j5417j5364
57192G399663j5824j6754j7521j8187j9025j9450j8820j7853j7818j8686j9351
57181G200374j9396j9384j9620j9919k0419k1422k2533k3174k3735k5080k7043
$$ y = [6765835, 6781766, 6799584, 6819660, 6841351, 6863662, 6886106, 6908718, 6931751, 6955473, 6979676, 7003326, 7025289, 7045442, 7064437, 7082474, 7099086, 7114177, 7128266, 7141528, 7153606, 7164754, 7176150, 7188486, 7201013, 7212645, 7223343, 7233874, 7244814, 7256445, 7269160, 7283233, 7298445, 7314364, 7330710, 7347047, 7362543, 7376576, 7389403, 7401854, 7414518, 7427415, 7440194, 7452362, 7463593, 7473989, 7483852, 7493108, 7501235, 7507823, 7512852, 7516436, 7518771, 7520387, 7521889, 7523236, 7523643, 7522402, 7519505, 7515488, 7511024, 7506573, 7501952, 7496288, 7488868, 7479905, 7469909, 7458611, 7445359, 7430444, 7415027, 7399663, 7383839, 7367085, 7349564, 7331377, 7312352, 7292902, 7274082, 7256229, 7238411, 7219725, 7200374, 7180978, 7161594, 7141974, 7122055, 7101636, 7080214, 7057681, 7034507, 7010772, 6985692, 6958649]
57170F958649k8637k9664l0878l2640l4565l6543l8917m1623m4215m6777m9710
57159F544480n2697n4933n6371n7573n8378n7969n6297n4188n1909m8824m4772
57148E950569m0607l7002l3713l0335k6940k3695k0736j8600j7877j8319j9178
57137E663567k0530k3273k7571l2194l5765l7813l8461l7844l6136l3480k9666
57126E310834k4381j7821j0461k460N955J3655J9150K2121K3773K5720K9131L4831
57114E430047M3448N5373P1021R0885J14880J42118J71953K04834K41745K83732
57104F850036L32709L91927M64782N54140O63699P98871R65227J167198J409134
57095A3597723J695556K028315K404762K820451L272111L756023M264576M784848
$$ y = [6958649, 6930012, 6900348, 6869470, 6836830, 6802265, 6765722, 6726805, 6685182, 6640967, 6594190, 6544480, 6491783, 6436850, 6380479, 6322906, 6264528, 6206559, 6150262, 6096074, 6044165, 5995341, 5950569, 5909962, 5872960, 5839247, 5808912, 5781972, 5758277, 5737541, 5718941, 5701064, 5682745, 5663567, 5643037, 5619764, 5592193, 5559999, 5524234, 5486421, 5447960, 5410116, 5373980, 5340500, 5310834, 5286453, 5268632, 5258171, 5255711, 5261666, 5275321, 5294471, 5316592, 5340365, 5366085, 5395216, 5430047, 5473495, 5528868, 5599889, 5690774, 5805654, 5947772, 6119725, 6324559, 6566304, 6850036, 7182745, 7574672, 8039454, 8593594, 9257293, 10056164, 11021391, 12188589, 13597723, 15293279, 17321594, 19726356, 22546807, 25818918, 29574941, 33839517, 38624365]
57087C8624365N296203N765822O149877O401979O474003O302140N804246M918590
57079H5737225L664289K161775N84402r15565k244707l359208m243369m899741
57071G6485101n344263n597654n679453n610343n415945n125261m766872m367481
57063C4577829l951072l536637l137098k761247k415797k105241j831235j593160
57055A3246342j388651j213550j062661r31383q16459p15512o26885n49759m83439
57046E458043m26476l77171l34629k98374k67357k40334k16867j96861j79498
57037B920476j63683j49155j36085j24052j12541j01922r2754q4589p6709o9447
57027A809539o3345n7596n0952m3733l7179l1056k3787j4891n374M465J5804K9535
$$ y = [38624365, 43920568, 49686390, 55836267, 62238246, 68712249, 75014389, 80818635, 85737225, 89401514, 91563289, 92147691, 91232126, 88987419, 85628211, 81384842, 76485101, 71140838, 65543184, 59863731, 54253388, 48837443, 43712182, 38945310, 34577829, 30626757, 27090120, 23953022, 21191775, 18775978, 16670737, 14839502, 13246342, 11857691, 10644141, 9581480, 8650097, 7833638, 7118126, 6491241, 5941482, 5458043, 5031567, 4654396, 4319767, 4021393, 3754036, 3513702, 3296835, 3099974, 2920476, 2756793, 2607638, 2471553, 2347501, 2234960, 2133038, 2040284, 1955695, 1878986, 1809539, 1746194, 1688598, 1637646, 1593913, 1556734, 1525678, 1501891, 1487000, 1481626, 1486091, 1501895, 1531430]
57015A531430M5383O2829Q0416R2903R1478O9574K8987k0312o6120r9847j18556
57004A698165j23871j19753j10425r9058q7465p6424o6270n7399n0117m4094l8452
56993H24837l2838k7831k3852k0273j6334j2360r203o846m547k062J78J774K215
56980F72858N32l663q886j2741j4289j4476j4281j3595j2076r964p787n974m870
56967E50788m371l609j825M99K411M113O642R975J2904J4863J6409J7357J5965
56954F42121J0903L030n495j3097j9039k2777k4096k3509k1779j9284j6215j2934
56942D77829r695o405l121k99J894M157P348J1461J5675J9350K2538K5400K7171
56929E93303K5900J9759Q952l854j5405k3958k9321l1640l1180k8964k6362k3851
$$ y = [1531430, 1576813, 1639642, 1720058, 1812961, 1904439, 1974013, 2003000, 1982688, 1916568, 1816721, 1698165, 1574294, 1454541, 1344116, 1245058, 1157593, 1081169, 1014899, 957500, 907383, 863289, 824837, 791999, 764168, 740316, 720043, 703709, 691349, 682146, 675300, 670753, 668691, 668869, 670643, 672858, 673390, 669727, 660841, 648100, 633811, 619335, 605054, 591459, 579383, 569419, 561632, 555658, 550788, 546417, 542808, 540983, 541482, 543893, 548006, 554648, 564623, 577527, 592390, 608799, 626156, 642121, 653024, 656054, 650559, 637462, 618423, 595646, 571550, 548041, 526262, 506978, 490763, 477829, 468134, 461729, 458608, 458309, 460203, 464360, 471708, 483169, 498844, 518194, 540732, 566132, 593303, 619203, 638962, 647914, 644060, 628655, 604697, 575376, 543736, 512556, 483592, 457230, 433379]
56917D33379k1031j8018j5743j4622j3866j2600j0880r123p362n608m345l865
56905B96316l569k670j413r30j754k952k989j360Q64K276K738L375M969O989Q574
56890C08464R882J1742J4361J7102J9313K0502J9851J6548J0788L882k738q168
56878D41529j1807j3255j2647j0657q051n507l527k002j13K680N830Q538J1073
56865D02084J4377J8659K3381K8464L4218L9874M3187M1914L5144K3371Q317p164
56853G05826k0117k8999l3754l4572l1727k6599k1466j7486j3748q860k675L998
56841D69821J0606J7054K3445L0182L7898M6695N5777O3967O9738P0427O2554
56830I58164M4367J8197j0197l4798n2058o1460o4441o2869n8114n1116m2880
$$ y = [433379, 412348, 394330, 378587, 363965, 350099, 337499, 326619, 317496, 310134, 304526, 300181, 296316, 292747, 290077, 288664, 287734, 285980, 283028, 280039, 278679, 279543, 281819, 284557, 287932, 292901, 299890, 308464, 318346, 330088, 344449, 361551, 380864, 401366, 421217, 437765, 448553, 452435, 449697, 441529, 429722, 416467, 403820, 393163, 385112, 379605, 376078, 374076, 373963, 376643, 382473, 391011, 402084, 416461, 435120, 458501, 486965, 521183, 561057, 604244, 646158, 681302, 704673, 712990, 705826, 685709, 656710, 622956, 588384, 556657, 530058, 508592, 491106, 477358, 468498, 465823, 469821, 480427, 497481, 520926, 551108, 589006, 635701, 691478, 755445, 825183, 895610, 958164, 1002531, 1020728, 1010531, 975733, 923675, 862215, 797774, 734905, 676791, 625675, 582795]
56819E82795l4500k6698j9649j3163o774J17P665J5279K2423K9408L6774M3959
56807F37636M9235N0663M6550L5532J7708m064k4969m0926n0234n3177n1264m6837
56795E65853m1972l7088l1374k4746j8402j3255q964m907j031K771P106J2169
56783D06160J7244K1643K5234K7381K6216K0085R457l205j5070k4200k9873l2421
56771D48651l2664l1230k8584k5495k2673j9950j6709j3233j0648r270q147o668
56759B23380n467n155n143m576l591k824k425k317k721l532l841k939j401l42
56745A77106l0J4j03q14k261l860m722m281k716r96j57l01o98r03j187j727k092
56728A50272j901j352p45j07M42N69L13J71L52N15M28K14j95j006j806j837j229
$$ y = [582795, 548295, 521597, 501948, 488785, 482011, 482128, 489793, 505072, 527495, 556903, 593677, 637636, 686871, 737534, 784084, 819616, 837324, 833260, 808291, 767365, 717131, 663954, 612690, 565853, 523881, 486793, 455419, 430673, 412271, 399016, 390052, 385145, 384114, 386885, 393991, 406160, 423404, 445047, 470281, 497662, 523878, 543963, 553420, 550215, 535145, 510945, 481072, 448651, 415987, 384757, 356173, 330678, 308005, 288055, 271346, 258113, 247465, 238195, 230048, 223380, 217913, 212758, 207615, 203039, 199448, 196624, 194199, 191882, 189161, 185629, 181788, 178849, 177448, 177106, 177076, 177090, 176987, 176173, 173912, 170052, 165330, 161049, 158333, 157337, 157180, 156879, 156181, 155278, 154091, 152364, 150272, 148371, 147019, 146274, 146167, 146609, 147178, 147491, 147662, 148014, 148529, 148957, 149171, 148976, 147970, 146164, 144327, 143098]
56711A43098r90j448j749j344p81n49k56L87Q66Q88R67J288J067m7j012q61j44
56694A39380J22O3L83R34J052P51N23M08J88P5K92N33N74Q61J674K333K106J334
56676A53586Q01N01l4p00r93q45m95j8L79J50p50j397j044j88K51J71J3j45m05
56657A48838o71j027j781k493k006k46J118Q41j03j20N98P23Ro15o97n29k29J82
56639A41792J20p71j688j653r79n90m08J50P03M01m20o50k35j36o16r79r81j067
56621A31993j205q32l5M72O15J050J819K141J688J005N27J18k73m22l63l21j28
56604A37849M64J056J006M70J46J52O9j25l8L58P48J058J245Q94l5o37k46L33
56586A44767Qp02m20Q23J621J394J019J183J553J811K198K723K941K767K620K553
$$ y = [143098, 142108, 140660, 138911, 137567, 136786, 136237, 135981, 136368, 137234, 138122, 139089, 140377, 141444, 141397, 140385, 139524, 139380, 139502, 139565, 139948, 140882, 141934, 142685, 143208, 143616, 143804, 143879, 144171, 144704, 145278, 146139, 147813, 150146, 152252, 153586, 154387, 154888, 154854, 154154, 153161, 152316, 151821, 151803, 152182, 152332, 151582, 150185, 149141, 148953, 149204, 149375, 149388, 149243, 148838, 148167, 147140, 145359, 142866, 140860, 140614, 141732, 142573, 142470, 142350, 142948, 143671, 143680, 143065, 142368, 141839, 141610, 141792, 141912, 141141, 139453, 137800, 136821, 136231, 135823, 135973, 136676, 137077, 136657, 136007, 135772, 135636, 135020, 134041, 133060, 131993, 130788, 129956, 129921, 130393, 131008, 132058, 133877, 136018, 137706, 138711, 139238, 139356, 139083, 138661, 138298, 137977, 137849, 138313, 139369, 140375, 140845, 140991, 141143, 141212, 141087, 141049, 141407, 142155, 143213, 144458, 145352, 145317, 144680, 144434, 144767, 144775, 144073, 143653, 144476, 146097, 147491, 148510, 149693, 151246, 153057, 155255, 157978, 160919, 163686, 166306, 168859]
56570A68859K275K045K510L546M232M112L626L249L013K935L060L191L211L454
56556B13318L977L957K789J294O91Q62Q46N29M12K06p71k026k412k060k175k921
56540B16516l258k917k818l249l368k890k700l190l503l033k392k274k427k311
56526A76186j862j162k71L59K04m43q41j021j550k206k139j445j177j605j807
56511A59220j219l86J23L32K27l22q87q61n44o45q52l22N45N13l00m38N04J314
56493A56002J325J313J738J906J583J634K359K746K267J852K220K712K663K538
56479A84858K763K778K193J759K158K927L380L635L983M233M307M577N027N041
56465B33619M507M092M023L794L339L191L151K277O53l62k61k00j038k175l039
$$ y = [168859, 171134, 173179, 175689, 179235, 183467, 187579, 191205, 194454, 197467, 200402, 203462, 206653, 209864, 213318, 217295, 221252, 224041, 225335, 226026, 226888, 227734, 228263, 228675, 228881, 228110, 226084, 223672, 221612, 219437, 216516, 213258, 210341, 207523, 204274, 200906, 198016, 195316, 192126, 188623, 185590, 183198, 180924, 178497, 176186, 174324, 173162, 172891, 173250, 173454, 173011, 172170, 171149, 169599, 167393, 165254, 163809, 162632, 161027, 159220, 158001, 157615, 157738, 158070, 158297, 157975, 157088, 156227, 155683, 155038, 154186, 153864, 154409, 154922, 154622, 154184, 154688, 156002, 157327, 158640, 160378, 162284, 163867, 165501, 167860, 170606, 172873, 174725, 176945, 179657, 182320, 184858, 187621, 190399, 192592, 194351, 196509, 199436, 202816, 206451, 210434, 214667, 218974, 223551, 228578, 233619, 238126, 242218, 246241, 250035, 253374, 256565, 259716, 261993, 262646, 262284, 262023, 261823, 260785, 258610, 255571]
56450B55571l998m935m667k911j269j034j432j292r80j309j834j767j534j921
56436B24688k558k623k369k568l091l220k851k366j779r43j54K40L77L80J1o79
56420B00495j046p74l82l59o12j072j931k814k830j956j290j368j361n79L93P08
56404A83222L80k05q13r62j39J086J420P83N38J342K173K127J619J172N77L9N11
56387A94870J949K803K186J113O83O54O79J240K251K484J577R78J608K267J738
56372B19080Q31P83J176J106J026J716K570K616K143J891J655J119R21J511K003
56357B42147J628J192J649K348K204J557J352J452J201P98P90J043J354K073L062
56342B65850L262K402J800K318K979K874K853L754M603M269L492L492L917L916
$$ y = [255571, 251573, 246638, 241971, 239060, 237791, 236757, 235325, 234033, 233053, 231744, 229910, 228143, 226609, 224688, 222130, 219507, 217138, 214570, 211479, 208259, 205408, 203042, 201263, 200320, 200166, 200406, 200783, 201163, 201174, 200495, 199449, 198675, 198293, 197934, 197322, 196250, 194319, 191505, 188675, 186719, 185429, 184061, 182700, 182121, 182514, 183222, 183602, 183397, 182584, 181622, 181483, 182569, 183989, 184772, 185310, 186652, 188825, 190952, 192571, 193743, 194320, 194359, 194870, 196819, 199622, 201808, 202921, 203604, 204258, 204937, 206177, 208428, 210912, 212489, 213467, 215075, 217342, 219080, 219911, 220694, 221870, 222976, 224002, 225718, 228288, 230904, 233047, 234938, 236593, 237712, 238633, 240144, 242147, 243775, 244967, 246616, 248964, 251168, 252725, 254077, 255529, 256730, 257528, 258318, 259361, 260715, 262788, 265850, 269112, 271514, 273314, 275632, 278611, 281485, 284338, 288092, 292695, 296964, 300456, 303948, 307865, 311781]
56328C11781L929M525M819L947K931L131L989M197M001M381M945M660L761L131
56314C68128K628J802J250J512J637O48n74p25k05p3M6R40J874J757J249J644
56298C83538K541K728K467K875L855M607N323O430P137O737O382P469R264J0240
56284D61593J0764J2200J4242J5484J5959J6844J8319J9810K1648K4374K7187
56273F58424K9137L1117L4557L8997M3107M7241N2680N9157O5405P1504P8420
56262A209746Q5838R2660R8939J05337J11280J15733J18861J21027J21182J18271
56252B298874J13121J06753R8260Q6674P3505O0812M8146L4245K0284Q438j554
56241B947558j1168j9678k5455k9703l5318m2556m9292n4981o1040o7638p3567
$$ y = [311781, 315710, 320235, 325054, 329001, 331932, 335063, 339052, 343249, 347250, 351631, 356576, 361236, 364997, 368128, 370756, 372558, 373808, 375320, 376957, 377605, 377031, 376306, 376101, 376028, 376074, 377014, 378888, 380645, 381894, 383538, 386079, 388807, 391274, 394149, 398004, 402611, 407934, 414364, 421501, 428238, 434620, 442089, 451353, 461593, 472357, 484557, 498799, 514283, 530242, 547086, 565405, 585215, 606863, 631237, 658424, 687561, 718678, 753235, 792232, 835339, 882580, 935260, 994417, 1059822, 1131326, 1209746, 1295584, 1388244, 1487183, 1592520, 1703800, 1819533, 1938394, 2059421, 2180603, 2298874, 2411995, 2518748, 2617008, 2703682, 2777187, 2837999, 2886145, 2920390, 2940674, 2949112, 2947558, 2936390, 2916712, 2891257, 2861554, 2826236, 2783680, 2734388, 2679407, 2618367, 2550729, 2477162]
56230B477162p9000q5094r1059r4809r6341r7410r8200r7459r5423r3327r0425
56219A458615q5006p8065p2365o8065o2884n6450n0788m6415m1708l6450l2300
56208H28119k9422k6161k2478k0169j9247j7631j4911j2923j2052j0566q173o705
56196F27681o581n985m396l471l668l283j705l62K84J429K946L098J981J886L437
56181F13291M761N183O267Q274R218Q543Q267R288R956R506R520J0662J1230J0396
56167G34362R733J0168J0401R758R635J0757J1846J2241J3120J5006J6813J8320
56155H82160K0802K4464K8027L1614L6987M4392N2358O1123P2787Q7413J02587
56144A444714J17708J34749J53609J70278J80886J84245J79490J65432J43935
$$ y = [2477162, 2398162, 2313068, 2222009, 2127200, 2030859, 1933449, 1835249, 1737790, 1642367, 1549040, 1458615, 1373609, 1295544, 1223179, 1155114, 1092230, 1035780, 984992, 938577, 896869, 860419, 828119, 798697, 772536, 750058, 729889, 710642, 693011, 678100, 665177, 653125, 642559, 634386, 627681, 621100, 615115, 610719, 607248, 603580, 600297, 598592, 598230, 598514, 599943, 602889, 605987, 607968, 609854, 613291, 618052, 623235, 629502, 637776, 646994, 655537, 663804, 673092, 683048, 692554, 702074, 712736, 723966, 734362, 744095, 754263, 764664, 774422, 784057, 794814, 806660, 818901, 832021, 847027, 863840, 882160, 902962, 927426, 955453, 987067, 1024054, 1068446, 1120804, 1181927, 1254714, 1342127, 1444714, 1562422, 1697171, 1850780, 2021058, 2201944, 2386189, 2565679, 2731111, 2875046]
56135B875046J20515R9889Q3577P2275O6431O3176N6764M4048K6763P724j1420
56124C504788k7959l8353m2810m6165n2768o3820q0121j02572j28143j49827j62937
56113B609313j67976j66191j56870j40903j22517j04942q8003p1718n8240m8337
56103A483616m0052l2701k8169k6534k4761k1643j9656j9985k0205j8863j7776
56092A213271j7580j5814j1785q609p912p103m361j742p34N55L156M839M564M717
56078A155462O410P265O397O636R203J1209J1166J1765J4371J6115J5456J5237
56066A286692J7065J8160J7010J6668J8936K0821K0280J9911K1390K2034K0543
56055A499510K0286K2894K4519K2634K0692K1804K3640K3891K4766K7646K9355
$$ y = [2875046, 2995561, 3095450, 3179027, 3251302, 3317733, 3380909, 3437673, 3481721, 3508484, 3516208, 3504788, 3476829, 3438476, 3395666, 3349501, 3296733, 3232913, 3152792, 3050220, 2922077, 2772250, 2609313, 2441337, 2275146, 2118276, 1977373, 1854856, 1749914, 1661911, 1590193, 1531953, 1483616, 1443564, 1410863, 1382694, 1356160, 1331399, 1309756, 1290100, 1270115, 1249910, 1231047, 1213271, 1195691, 1179877, 1168092, 1159483, 1151571, 1144468, 1140107, 1138365, 1137631, 1138186, 1141342, 1146181, 1150745, 1155462, 1161872, 1169137, 1175534, 1182170, 1191373, 1202582, 1213748, 1225513, 1239884, 1255999, 1271455, 1286692, 1303757, 1321917, 1338927, 1355595, 1374531, 1395352, 1415632, 1435543, 1456933, 1478967, 1499510, 1519796, 1542690, 1567209, 1589843, 1610535, 1632339, 1655979, 1679870, 1704636, 1732282, 1761637]
56044A761637K8334K8408L1815L4743L4466L4412L7204L9416L8525L8302M1607
56033B148869M4591M3895M3079M5853M9419N0580N1908N5754N8746N8399N8496
56022B709589O1807O4436O3526O3272O6929P0459P0671P1741P6813Q1324Q1948
56011C482515Q3583Q9914R5811R7154R9057J05919J12648J14747J17571J26116
56001D525035J35257J40002J45501J56542J67373J72836J79208J92466K06516
55992F020736K15018K23951K39826K56697K68243K81104L02260L25096L42548
55983H475479L61753L90381M21462M48004M78960N23338N72786O18337O69456
55974A2959956P36849Q12372Q87339R73815J084900J211794J345400J501660J698683
$$ y = [1761637, 1789971, 1818379, 1850194, 1884937, 1919403, 1953815, 1991019, 2030435, 2068960, 2107262, 2148869, 2193460, 2237355, 2280434, 2326287, 2375706, 2426286, 2478194, 2533948, 2592694, 2651093, 2709589, 2771396, 2835832, 2899358, 2962630, 3029559, 3100018, 3170689, 3242430, 3319243, 3400567, 3482515, 3566098, 3656012, 3751823, 3848977, 3948034, 4053953, 4166601, 4281348, 4398919, 4525035, 4660292, 4800294, 4945795, 5102337, 5269710, 5442546, 5621754, 5814220, 6020736, 6235754, 6459705, 6699531, 6956228, 7224471, 7505575, 7807835, 8132931, 8475479, 8837232, 9227613, 9649075, 10097079, 10576039, 11099377, 11672163, 12290500, 12959956, 13696805, 14509177, 15396516, 16370331, 17455231, 18667025, 20012425, 21514085, 23212768]
55965B3212768J929975K190621K507955K913615L410423M004144M739388N658886
55957E0567775O755165Q011891R463592J1165721J3153886J5502190J8359464
55950A32979684K1813812K5751101K9920719L3962950L7028700L7375675L2891748
55943C51724389K2637445Q045629p572043k0853286k9905309l4506415l5431617
55936B54138793l3795160l0697362k7012994k3284650j9790316j6680803j4026049
55929H8851459j1803410r942436q393187p122978o077454n195419m448856l830146
55921C2037573l314232k867854k481955k161440j893916j657969j451216j282015
55913A4926976j142682j016674r03401q11704p36677o65671n99782n47851n05917
$$ y = [23212768, 25142743, 27333364, 29841319, 32754934, 36165357, 40169501, 44908889, 50567775, 57322940, 65334831, 74798423, 85964144, 99118030, 114620220, 132979684, 154793496, 180544597, 210465316, 244428266, 281456966, 318832641, 351724389, 374361834, 382407463, 374835420, 353982134, 324076825, 289570410, 254138793, 220343633, 189646271, 162633277, 139348627, 119558311, 102877508, 88851459, 77048049, 67105613, 58712426, 51589448, 45511994, 40316575, 35867719, 32037573, 28723341, 25855487, 23373532, 21212092, 19318176, 17660207, 16208991, 14926976, 13784294, 12767620, 11864219, 11052515, 10315838, 9650167, 9050385, 8502534, 7996617]
55904G996617m62809m19976l86522l60285l31989l02845k80751k63832k44167
55895D943441k23321k08617j98336j85272j70732j60983j54020j43473j31523
55886C367164j24747j21057j13638j04013r8553r5726q9088p9759p4002p1396
55876B395185o6767o0981n8781n8616n5198m9551m6513m5190m1854l9177m2395
55865A830162m9022n2212n1866n2773n4487n2696m8365m5943m4537m0028l3881
55854A304352l0845k9975k6751k2171k0822k1830k0449j7082j6066j7049j6008
55843A065304j3485j3498j5533j5636j4282j5255j7969j8655j7900j9213k1404
55832H82474k0261j6726j5491j6431j5268j1936j0428j0853r570o975p329j0633
$$ y = [7996617, 7533808, 7113832, 6727310, 6367025, 6035036, 5732191, 5451440, 5187608, 4943441, 4720120, 4511503, 4313167, 4127895, 3957163, 3796180, 3642160, 3498687, 3367164, 3242417, 3121360, 3007722, 2903709, 2805156, 2709430, 2620342, 2540583, 2466581, 2395185, 2328418, 2267437, 2208656, 2150040, 2094842, 2045291, 1998778, 1953588, 1911734, 1872557, 1830162, 1781140, 1728928, 1677062, 1624289, 1569802, 1517106, 1468741, 1422798, 1378261, 1338233, 1304352, 1273507, 1243532, 1216781, 1194610, 1173788, 1151958, 1131509, 1114427, 1098361, 1081312, 1065304, 1051819, 1038321, 1022788, 1007152, 992870, 977615, 959646, 940991, 923091, 903878, 882474, 862213, 845487, 829996, 813565, 798297, 786361, 775933, 765080, 755510, 748535, 741206, 730573]
55820G30573j2165j0577r417r960r377o827m986m632l510j197K77R10K500M058
55806F65670K900nj234r91k332m863n189l402l113m989o158o057o984q677q178
55791F06398n483l663l057r61K515L874K033p34l994r669j6740k0990k1095j9954
55777E08480j9162j7204j3909j1595j0775r456p594p626r762j1290j1287j1523
55765C67297j2207j1462r589r032r626q581n871m647n482n279l006j582k596l886
55751B74451l907m114n415o322o178o301o729n672l322k257k995l123j924j686
55737B14506l238m221l320k223k011j363J95R20K10k20J93k73k081l282l121l257
55721A87414m245m409l390l090l853l449j250L40J45J76J665K742K028J137J637
$$ y = [730573, 718408, 707831, 698414, 688454, 679077, 672250, 667264, 662632, 659122, 657925, 658202, 659112, 661612, 665670, 668570, 668565, 667331, 666340, 664008, 659145, 653956, 650554, 647441, 642452, 636294, 630237, 623253, 614576, 606398, 600915, 597252, 594195, 593234, 595749, 599623, 601656, 600922, 596928, 587259, 570519, 549529, 528434, 508480, 489318, 472114, 458205, 446610, 435835, 426379, 418785, 411159, 401397, 390107, 378820, 367297, 355090, 343628, 334039, 325007, 315381, 306800, 300929, 296282, 290800, 285521, 282515, 280933, 278337, 274451, 270544, 266430, 261015, 254693, 248515, 242214, 235485, 229813, 226491, 224234, 221239, 218116, 216192, 214506, 211268, 207047, 203727, 201504, 199493, 198130, 198325, 199245, 199455, 199235, 199428, 199155, 197074, 193792, 190671, 187414, 183169, 178760, 175370, 172280, 168427, 164978, 163728, 164068, 164213, 164389, 166054, 168796, 170824, 171961, 173598]
55706A73598K511K616K771L591L906K992J916J312L91p64o83O27J169L59n2N26
55690A96786L04j424k761k592k330k931l171k330j574j236J67K766M270L701L112
55675A90757L921M598L775K707K717K974K708K972M296N168M695M354N232N976
55661B46850N288M107L563L080K142J668K047K033J121O09R39M53j669l805m740
55646B63686n497o772p274o398n887o881p860p461o879p378p839p038o053o232
55632A68237o775o505o061o249o142m876l517l241l376k985k592k651k329j435
55618A09503j436k781l461k165o71r22j939j864j120j089j458j248r41j250j264
55603H5894n3J260J160J52m34p05j325j757j378j047j656k386k180j636j644j609
$$ y = [173598, 176109, 178725, 181496, 185087, 188993, 191985, 193901, 195213, 195604, 194840, 194157, 194784, 195953, 196312, 196260, 196786, 197090, 195666, 192905, 190313, 187983, 185052, 181881, 179551, 177977, 176741, 176908, 179674, 183944, 187645, 190757, 194678, 199276, 203051, 205758, 208475, 211449, 214157, 217129, 221425, 226593, 231288, 235642, 240874, 246850, 252138, 256245, 259808, 262888, 265030, 266698, 268745, 270778, 271899, 272508, 273447, 273900, 272231, 268426, 263686, 258189, 251417, 244143, 237745, 231858, 224977, 217117, 209656, 202777, 195399, 187560, 180522, 174469, 168237, 161462, 154957, 148896, 142647, 136505, 131629, 128112, 124871, 121495, 118510, 115918, 113267, 110938, 109503, 108067, 105286, 101825, 99660, 98989, 98067, 96128, 94264, 93144, 92055, 90597, 89349, 88408, 87158, 85894, 85841, 87101, 88261, 88413, 87979, 87274, 85949, 84192, 82814, 81767, 80111, 77725, 75545, 73909, 72265, 70656]
55587G0656q75m11j138j963j480l38J2l13m49o52j388j774r35K22L92oM3J63l85
55568E9381q93l89M46M84K03O30J254J016M04N55J087Q02q6l18L32R77J138Q64
55550F7887L7j161j732j137k50Q5M47J495K466K415J880J858K134K090K062K462
55534H3038K635K120J851K606L396K973J929J585J938K196K404K844K895K069
55520A16479J171R05M41j012k407k425j799k218l742n072n591n476m641l234k453
55505G8926l173m475m900m400l716k881j820j335j851k262j590p27q74j419j176
55490D2327o37j023k020k396k083j796j354k84P17P08J71J15K52k26r45j102j067
55473B9357j457j602p34K03j07j089j277p03l27l7P41J263N23o39o54J97M98K78
$$ y = [70656, 69781, 69370, 68232, 66269, 64789, 64451, 64463, 64150, 63701, 63049, 61661, 59887, 58952, 59174, 59566, 59560, 59603, 59766, 59381, 58488, 58099, 58545, 59029, 59232, 59862, 61116, 62132, 62536, 63091, 64178, 64980, 64894, 64576, 64908, 65885, 67023, 67887, 67924, 66763, 65031, 63894, 63644, 63729, 64176, 65671, 68137, 70552, 72432, 74290, 76424, 78514, 80576, 83038, 85673, 87793, 89644, 92250, 95646, 98619, 100548, 102133, 104071, 106267, 108671, 111515, 114410, 116479, 117650, 118555, 118996, 117984, 115577, 113152, 111353, 109135, 105393, 100321, 94730, 89254, 84613, 81379, 78926, 75753, 71278, 66378, 61978, 58262, 55381, 53561, 52226, 50375, 48113, 46523, 45796, 44922, 43503, 42327, 41690, 40667, 38647, 36251, 34168, 32372, 31018, 30734, 31451, 32159, 32330, 32445, 32697, 32471, 31526, 30424, 29357, 27900, 26298, 25564, 25767, 25660, 24571, 23294, 22591, 22264, 22227, 22968, 24231, 24754, 24115, 23461, 23658, 24156, 24434]
55455B4434N83J111O93k49k01P54J010J97m71n26p39j207j060l28r5n08m89L42
55437B3251J111J266J143Q66J95l75J1J063J512R27K0o64j061q63J07J040J061
55420C0610O42P30J010O62K33Q34J833J491k42j516j303n22j90k43m37q64j268
55403C1460j162p35n59m88j05J11n25j386j256k65M24N45O87P15Qr18r03j67o2
55384B5419q01j285j111r82j014n07M41P47J31n18p47r61j167q00n1J76k36m66
55366A6268j96J52N57J318J908J448K90l74l86n76j023r92n58n21p91n44K9r6
55348A5913p89q67k12L8l96m94Q7M32J72M5L01J62o12j236j362j493j621j014
55330G054K31J063J174J354J753J494M15l39l7O64R56Q24M76j4k94j04m1o71j164
$$ y = [24434, 25017, 26128, 26821, 26572, 26371, 27125, 28135, 28332, 27861, 27335, 26596, 25389, 24329, 24001, 23906, 23398, 22909, 23251, 24362, 25628, 26771, 27637, 27832, 27457, 27468, 28531, 30043, 30970, 30990, 30326, 29265, 28402, 28509, 29549, 30610, 31252, 31982, 32992, 33654, 33887, 34721, 36554, 38045, 37803, 36287, 34984, 34462, 34272, 34029, 33592, 32728, 31460, 30298, 29563, 29004, 28516, 28411, 28522, 27997, 26611, 25355, 25090, 25514, 26059, 26746, 27461, 27469, 26551, 25648, 25481, 25419, 24618, 23333, 22222, 21240, 20226, 19719, 20160, 20907, 21038, 20520, 19773, 18812, 17645, 16845, 16794, 16970, 16734, 16268, 16072, 16224, 16781, 18099, 20007, 21455, 21745, 21371, 20985, 20409, 19386, 18394, 17836, 17315, 16524, 15980, 16009, 15913, 15124, 14257, 14045, 14083, 13687, 13193, 13280, 13712, 13884, 13929, 14230, 14392, 13780, 12544, 11182, 9689, 8068, 7054, 7285, 8348, 9522, 10876, 12629, 14123, 14538, 14199, 14162, 14826, 15782, 16606, 17082, 17068, 16774, 16670, 16629, 15958, 14794]
55311A4794l33J227J836J306Q76Q44L71l70k18O32O54k99o93j20Rp28q41K60R83
55292B0190L36l56J67R86Q36J86K5R8j29k32Q8jj039k062k071j493j091o60L5
55273A3813K84l81j069q23n8L37L92O01R71J343J808K112J634N67n1L4j18q20
55255B0576j024j78O84O13J22l4r3l69l68Q6K03l52o74k29J03l72q53m88K06M64
55235A8023N43P48M86m40r34k84M94L33q9K69P83K12j083j628r48K08J158J633
55217A9484J341M36j42J93P99R00P27O40O8j374k614k280o79O65Q97L24m67q73
55199A8045k86J163K250J958P10m26j069j346j143m79J2j57o12q79j022r57r2
55182A5670J502K516K025Q08R8q6l43n63l90k14n37r73q91m60j36J99O23N89j69
$$ y = [14794, 14461, 15688, 17524, 18830, 19706, 20550, 20921, 20551, 20333, 20965, 21619, 21320, 20627, 20507, 20516, 19788, 18947, 19207, 20190, 20526, 20170, 20337, 21323, 22159, 22345, 22370, 22468, 22339, 22107, 22195, 22194, 21155, 19093, 17022, 15529, 14438, 13778, 13813, 14097, 13716, 12647, 11824, 11766, 12103, 12495, 13096, 14067, 15410, 17218, 19330, 20964, 21531, 21480, 21514, 21396, 20576, 19552, 19374, 20058, 20671, 20793, 20759, 20666, 20297, 19929, 20015, 20218, 19866, 19192, 18963, 19066, 18694, 17841, 17353, 17559, 18023, 18566, 19314, 19800, 19360, 18426, 18142, 18636, 18969, 18880, 19149, 19932, 20144, 19061, 17433, 16485, 16693, 17851, 19484, 20825, 21261, 21119, 21312, 22111, 23011, 23738, 24378, 24446, 23072, 20458, 18178, 17499, 18164, 19061, 19385, 18918, 18045, 17759, 18922, 21172, 23130, 23840, 23414, 22345, 20999, 19856, 19377, 19389, 19232, 18620, 17741, 16719, 15762, 15670, 17172, 19688, 21713, 22521, 22619, 22533, 22190, 21627, 21237, 21023, 20486, 19513, 18622, 18162, 18026, 18225, 18848, 19437, 19268]
55163A9268q71q20m24j61M55J728K591J909K98p29p31l21J41N80N48j37o72l13
55145B2339L94M75N9r4P9J89L56P15O45k99j229j019J2O62O33N53P58J168J888
55126B8284K751K844J700L78J44P17R93Q19O91M19l49q97m15K80k42j578j872
55109C4667o32O02O09r5n18m85k27K12O28O19K36%J44L96N32M67N8n83p82j00
55089C5748Q74J220Q68L29k47q71j082n31K16M20L22N67R87J031R83J456K055
55072D4345J798O54m82j125j417j307p16k50n33j034p08L31R85Q38M53K37J30
55055D2199K86P55P52m81k161k660j692n44j04rK02M08O29J162J773J841J438
55038D3794J227J194O70k93p49l51J44J40q3j92k63j71M83J457J828J231K94k83
$$ y = [19268, 18397, 17577, 17153, 16992, 17447, 19175, 21766, 23675, 23973, 23244, 22513, 22192, 22333, 22913, 23461, 23324, 22652, 22339, 22733, 23208, 23267, 23173, 23252, 23441, 23797, 24512, 25157, 24858, 23629, 22610, 22622, 23284, 23917, 24470, 25228, 26396, 28284, 31035, 33879, 35579, 35957, 36101, 36818, 37811, 38630, 39321, 39740, 39391, 38494, 38079, 38359, 38117, 36539, 34667, 34035, 34637, 35246, 35151, 34633, 34148, 33921, 34133, 34761, 35380, 35616, 35616, 35760, 36156, 36688, 37155, 37213, 36630, 35848, 35748, 36622, 37842, 38710, 39039, 38792, 37921, 36839, 36308, 36524, 36944, 37266, 37833, 38820, 39851, 40834, 42290, 44345, 46143, 46797, 46315, 45190, 43773, 42466, 41750, 41500, 40967, 39933, 39225, 39556, 40541, 41379, 41832, 42069, 42199, 42485, 43240, 43992, 43511, 41350, 38690, 36998, 36454, 36350, 36341, 36543, 36951, 37580, 38742, 40515, 42356, 43794, 45021, 46215, 46885, 46592, 45843, 45492, 45636, 45776, 45693, 45501, 45238, 45067, 45550, 47007, 48835, 50066, 50360, 50077]
55020E0077l68j3N89P57o5j224j509r84r87j989k766k233r42n8K08L24L54N7m31
55001C8797o54l64L84J308J873J614Q08L65P36J314J260N90J03L70J068J331P44
54984E1647j01k66L72J078J442J843K464K751K373J959K028K096J745J818L164
54969G6413M896N374M640M354N442P150Q599R840J1171J2528J3918J5560J7266
54956A97151J8484J8976J8778J7450J4301R336L276l226r569j4710j7835j9316
54944B33096k0001j9689j7685j4601j2214j1240j0685r607q301p278o283m899
54932I0613l241j606j67P22P74M57O35J467K484L630N157O609P186P190P839R462
54916A39211J1238J2848J4921J7365J8775J8188J6121J3209R116L693j964o632
$$ y = [50077, 49709, 49696, 50285, 51042, 50977, 49753, 48244, 47260, 46273, 44284, 41518, 39285, 38343, 38285, 38493, 38817, 39171, 39228, 38797, 38143, 37779, 38163, 39471, 41344, 42958, 43766, 44131, 44867, 46181, 47441, 48031, 48134, 48504, 49572, 50903, 51647, 51546, 51280, 51652, 52730, 54172, 56015, 58479, 61230, 63603, 65562, 67590, 69686, 71431, 73249, 76413, 81309, 86683, 91323, 95677, 101119, 108269, 116868, 126708, 137879, 150407, 164325, 179885, 197151, 215635, 234611, 253389, 270839, 285140, 294476, 297752, 294526, 284957, 270247, 252412, 233096, 213095, 193406, 175721, 161120, 148906, 137666, 126981, 117374, 109073, 101795, 95512, 90613, 87372, 85766, 85599, 86321, 87095, 87552, 88187, 89654, 92138, 95768, 100925, 107534, 114720, 121910, 129749, 139211, 150449, 163297, 178218, 195583, 214358, 232546, 248667, 261876, 270992, 274685, 272721, 266089]
54904B66089j0328j3656j6519j8299j8737j7948j6114j3815j2030j1189j0604
54893A06850r366p388n297l780l231l447l527k743j629j321j760j723q16k06p21
54878E9895j501j410p72o25j057j317j136r16q79q39p48q21j081j234j020n36
54862D4003k49n91j340j640j055l15k76n18R5J494K272J629L65m54p88j091j404
54845D0137j552j605j650j538j230q02j03R74J866J855J277J184J691J782J084
54830D3370N51R54J710J920J562J097P06N71R94J709J869J292Q94J373K267K867
54814F5706L219L644M099M625N675P321Q958J0243J1592J3220J4599J5444J6276
54801A84621J7341J7790J6686J4045J0321N741Q08l471o728r652j2559j4478j4655
$$ y = [266089, 255761, 242105, 225586, 207287, 188550, 170602, 154488, 140673, 128643, 117454, 106850, 97484, 90096, 84799, 81019, 77788, 74341, 70814, 68071, 66442, 65121, 63361, 61638, 60822, 60616, 59895, 58394, 56984, 56212, 55587, 54530, 53213, 52077, 51161, 50282, 49443, 48695, 47874, 46793, 45559, 44539, 44003, 43754, 43163, 41823, 40183, 39128, 38813, 38537, 38019, 38114, 39608, 41880, 43509, 43874, 43420, 42632, 41541, 40137, 38585, 36980, 35330, 33792, 32562, 31760, 31657, 32631, 34497, 36352, 37629, 38813, 40504, 42286, 43370, 43921, 44875, 46585, 48505, 50067, 51164, 51870, 52441, 53435, 55144, 57013, 58305, 59199, 60572, 62839, 65706, 68925, 72569, 76668, 81293, 86968, 94289, 103247, 113490, 125082, 138302, 152901, 168345, 184621, 201962, 219752, 236438, 250483, 260804, 266545, 267353, 263882, 257154, 247502, 234943, 220465, 205810]
54788B05810j3966j3650j3411j2085r711p600o524o003n300m258l192k545k605
54775A04960l036k935j825k46J035J957K848L702M463N501P101Q809R997J0772
54761A53103J1747J3207J4912J6459J7284J6724J4491J0952O635J856k954p178
54749B67238j0557j3293j5310j6040j5309j3765j2112j0595r469r149r453r514
54737A22672q888p989p104n944m614l918m045m003l067j882j348j374j521j905
54723F5070k530k706k063j299r68m94N84J383R95J62K33J112J570J162M13m62
54707F2162j593k496k342j248j93L03N53Q62J180J474J672J413N69l00o14n74
54691F0828o02m91O4O23N87J60r6k46o06q39m50K66P12J029J619K076J697Q04
$$ y = [205810, 191844, 178194, 164783, 152698, 142987, 135387, 128863, 122860, 117560, 113302, 110110, 107565, 104960, 101924, 98989, 97164, 96918, 97953, 99910, 102758, 106460, 110923, 116424, 123525, 132334, 142331, 153103, 164850, 178057, 192969, 209428, 226712, 243436, 257927, 268879, 275514, 277370, 274416, 267238, 256681, 243388, 228078, 212038, 196729, 182964, 170852, 160257, 150788, 141639, 132186, 122672, 113784, 105795, 98691, 92747, 88133, 84215, 80170, 76167, 73100, 71218, 69870, 68496, 66975, 65070, 62540, 59834, 57771, 56472, 55504, 55010, 55594, 56977, 57972, 58134, 58367, 59479, 61049, 62211, 62624, 62162, 60569, 58073, 55731, 54483, 54290, 54593, 55146, 56008, 57188, 58662, 60334, 61747, 62316, 62016, 61402, 60828, 60226, 59735, 59799, 60422, 61009, 61169, 61073, 60827, 60221, 59382, 58932, 59198, 59910, 60939, 62558, 64634, 66331, 67135]
54673F7135M50R69J751K291K531K410J911J454J478J823K120K325K239J325k28
54658I1984j023k69P77M66p66j239p17m88r39r53P8J252J650J479J236R31O28
54641I4087P57J424K139K577K860K967K665K168K001J994J281m57k451l797m341
54626A05874m411m259l974l518k814j985j353r31l55L60O70N64Q66J729J882N30
54610H8875r70q78L50Q92M03J03L55K01o53j327j527j994k821k997k209j508j556
54593G2739j743j633j858k714l263k749j789j269j063o97l76m87q23j063j350
54578D9862j732j753j199n66k54L6N12P22L01l03m77k46L9K61L45J07k98l79p7
54559D4901J09k6j02Kj27n32o30k18J19M2K9L69N30J51j76J58P71R74P99O59N58
$$ y = [67135, 67585, 68554, 70305, 72596, 75127, 77537, 79448, 80902, 82380, 84203, 86323, 88648, 90887, 92212, 91984, 90961, 90692, 91469, 91935, 91169, 89930, 89213, 88725, 87786, 86833, 86911, 88163, 89813, 91292, 92528, 93459, 94087, 94844, 96268, 98407, 100984, 103844, 106811, 109476, 111644, 113645, 115639, 116920, 116463, 114012, 110215, 105874, 101463, 97204, 93230, 89712, 86898, 84913, 83560, 82629, 82274, 82634, 83304, 83868, 84734, 86463, 88345, 88875, 87905, 87027, 87377, 88269, 88672, 88775, 89130, 89331, 88678, 87351, 85824, 83830, 81009, 78012, 75803, 74295, 72739, 70996, 69363, 67505, 64791, 61528, 58779, 56990, 55721, 54658, 53961, 53585, 53098, 52275, 51212, 49862, 48130, 46377, 45178, 44612, 44358, 44394, 44906, 45628, 45929, 45626, 45149, 44903, 44942, 45203, 45548, 45655, 45357, 44978, 44901, 45010, 44984, 44882, 44884, 44757, 44225, 43595, 43377, 43496, 43538, 43567, 43936, 44466, 44617, 44441, 44599, 45370, 46344, 47143, 47802, 48360]
54538D8360K81p9l76o74q32l67O99J574J798J927K546L210L151K466J857J594
54522F7135J423J129N89l39j455k085j927j526j439j390r24l82m35r09r46k15
54506E6304P06J187J200J000O63R5o57j272j376r46m17j81j42j3J71K91N71J155
54488E8339J472R10J1j00N25O54j36p21k85L83K19n03q40n81n5O97J577J841J012
54469F4419j54n56k82k10m84l99K42P60O03k9p07j179j256q73l69j84k73k10J25
54450E8984M78O90Q17Q16N40L8n01r85j320j253p75m14o91j297j394o93J78M71
54432E3689J81j05L8L62L56M0R0Q11J401Q48m67j038k35Q23R17L26P8L47N54N99
54412E9615R56J668K165K166K072K358L010L607L661K927J776J100J468K488L309
$$ y = [48360, 48641, 48562, 48186, 47512, 46680, 46313, 47012, 48586, 50384, 52311, 54857, 58067, 61218, 63684, 65541, 67135, 68558, 69687, 70276, 69937, 68482, 66397, 64470, 62944, 61505, 60115, 59191, 58809, 58374, 57465, 56519, 56304, 57010, 58197, 59397, 60397, 61060, 61155, 60498, 59226, 57850, 56904, 56487, 56306, 56164, 56151, 56322, 56613, 57184, 58339, 59811, 60721, 60732, 60632, 61157, 61811, 61675, 60954, 60669, 61052, 61271, 60768, 59928, 59347, 59292, 59989, 61566, 63407, 64419, 64265, 63709, 63427, 63217, 62733, 62334, 62576, 63336, 63939, 63910, 63203, 62024, 60768, 59895, 59526, 59342, 59069, 58859, 58984, 59462, 60152, 60969, 61785, 62325, 62363, 61862, 60877, 59557, 58304, 57529, 57115, 56424, 55127, 53733, 53040, 53218, 53689, 53870, 53765, 53803, 54165, 54521, 54561, 54651, 55462, 56863, 57711, 57244, 56206, 55971, 56794, 57711, 58037, 58115, 58462, 59016, 59615, 60571, 62239, 64404, 66570, 68642, 71000, 74010, 77617, 81278, 84205, 85981, 87081, 88549, 91037, 94346]
54397I4346L564L384K805J764N62k53n23o01q01j137j539j974k371k704l090l522
54381H7910l628l066k095j330j015q16m13O6K27j89j034j794j923j345n17O3K98
54364F9399L82M90P06R17P30p5r12p62M95J675J747J138R91J571K188K426K556
54347H5662K776K867K742K619K478J975J156O60P80R16L94m78q95q18j065k039
54331I9730k966k891j988j337j504k033k355k590l003l273k950k325k091k251
54317F6173k067j235m67n36j326k046k117j568q17l40l07n25q40j447k374k953
54301D5208k433j107k6L86O44R49P11k68j105j064o94q58j302j048O7J230J754
54284D1044J609J004K04l35l06n9r0j41M63J564K039J218j94j003q89m61k57k07
$$ y = [94346, 97910, 101294, 104099, 105863, 106425, 106172, 105649, 105048, 104247, 103110, 101571, 99597, 97226, 94522, 91432, 87910, 84282, 81216, 79121, 77791, 76776, 75960, 75547, 75613, 75840, 75651, 74617, 72823, 70900, 69555, 69038, 69101, 69399, 69781, 70271, 70977, 71894, 72624, 72549, 71637, 70875, 71370, 73045, 74792, 75930, 76921, 78492, 80680, 83106, 85662, 88438, 91305, 94047, 96666, 99144, 101119, 102275, 102935, 103715, 104631, 105025, 104547, 103652, 102834, 101769, 99730, 96764, 93873, 91885, 90548, 89044, 87011, 84656, 82066, 79063, 75790, 72840, 70515, 68424, 66173, 64106, 62871, 62404, 61868, 60542, 58496, 56379, 54811, 53994, 53654, 53347, 52822, 51982, 50535, 48161, 45208, 42775, 41668, 41642, 42028, 42672, 43621, 44332, 44064, 42959, 41895, 41201, 40343, 39041, 37993, 38060, 39290, 41044, 42653, 43657, 43861, 43526, 43220, 43161, 43071, 42930, 43393, 44957, 46996, 48214, 48020, 47017, 46128, 45667, 45410, 45203]
54266D5203k9K32L45L16M32Q39J302J525J490J332J010M08l49r86j327j235n10
54249D9998O57J385R62o5l69M16J206R80P5m81l07J67M26L18k2k36k7L89M09j67
54229E5714p93q54l43L17P23O02k5n95m07M49J045P15k53j176j628j396n28L22
54211E1889L35l39o64k60j9n94j268j074k49K64J63k68r03j577j602n32R33J688
54193D5923J599J264Q25p3j241j849j425l07Q90J683J746J118L32j30l79o84r06
54176D8386p64l28K19Q72J370J089N5o82m22O0k02p00l10P34J205R07Q19J180
54158E3488R96k33j639k348k512k457j885o41O10J167J181J154J104Q08M31L05
54142D9529M03M32K47j75q12j425j541r38K2P47R60P71M31J19j53m20m86l2P75
$$ y = [45203, 45174, 45406, 45751, 46067, 46499, 47338, 48640, 50165, 51655, 52987, 53997, 54405, 54056, 53070, 51743, 50508, 49998, 50655, 52040, 53002, 52937, 52568, 52984, 54190, 55170, 55245, 54764, 54457, 54624, 55050, 55368, 55346, 55110, 55083, 55472, 55881, 55714, 54921, 54067, 53724, 54041, 54764, 55366, 55341, 54746, 54339, 54788, 55833, 56548, 56295, 55119, 53491, 52095, 51567, 51889, 52224, 51885, 51221, 50961, 50942, 50348, 49080, 48006, 47757, 48021, 48184, 47916, 47013, 45436, 43834, 43302, 44235, 45923, 47522, 48786, 49611, 49538, 48297, 46448, 45023, 44716, 45606, 47289, 49035, 50153, 50485, 50355, 49976, 49292, 48386, 47622, 47294, 47513, 48385, 49755, 50844, 50899, 50217, 49795, 49855, 49653, 48953, 48643, 49377, 50582, 51489, 52308, 53488, 54484, 54251, 52612, 50264, 47752, 45295, 43410, 42769, 43379, 44546, 45727, 46881, 47985, 48793, 49224, 49529, 49932, 50364, 50611, 50436, 49624, 48199, 46658, 45720, 45742, 46489, 47449, 48220, 48651, 48770, 48617, 48197, 47711, 47679, 48454]
54123D8454J103M08o96j079m83L08O13M99K87P0j05j25n9j07j71J01P68J385J503
54104E2674J068L37l13n77m95n01q66j259j201p18j30M98J143J362P13m20j156
54087E0159j177q89n58n8N61R65J070J115J083O71o0o27q02p62n20R5Q15R84N52
54068E2617K88P17J349J438J050Q40J121J546J637J327R45Q04Q91J017J189J570
54052G0346K051K300K375K821L724M315M004L272K884K747K354J941K207L138
54038A10479M075M851N817O876P468P621P954Q501Q529P788O980O672O500N861
54024B05972M670L109J364r8o59l13K30M44L60l7j045k559l914m754n396o034
54008A91340o321o102n860n912n836n163m209l622l528l553l419l153k885k752
$$ y = [48454, 49557, 49965, 49269, 48190, 47707, 48015, 48628, 49127, 49414, 49484, 49379, 49254, 49195, 49088, 48917, 49018, 49786, 51171, 52674, 53742, 54079, 53766, 53189, 52694, 52193, 51327, 50068, 48867, 48149, 48019, 48517, 49660, 51022, 51735, 51315, 50159, 48982, 48093, 47535, 47477, 48038, 49003, 50073, 51188, 52271, 52942, 52882, 52255, 51453, 50691, 50171, 50266, 51081, 52065, 52617, 52905, 53622, 54971, 56409, 57459, 58299, 59420, 60966, 62603, 63930, 64875, 65679, 66570, 67587, 68776, 70346, 72397, 74697, 77072, 79893, 83617, 87932, 91936, 95208, 98092, 100839, 103193, 105134, 107341, 110479, 114554, 119405, 125222, 132098, 139566, 147187, 155141, 163642, 172171, 179959, 186939, 193611, 200111, 205972, 210642, 213751, 215115, 215017, 214358, 214045, 214275, 214719, 215079, 215042, 213997, 211438, 207524, 202770, 197374, 191340, 185019, 178917, 173057, 167145, 161309, 156146, 151937, 148315, 144787, 141234, 137815, 134662, 131777, 129025]
53994A29025k777k693k177j299m36K22O43N73k32j350j950j737j133m86J91P05
53978A15089P16M20M38Q27R78O52K99J09l16j048j413j025m45l12n36p75j034
53961A12624j274j201q68q68j317j385m50Q92J608J556J325J303J525K095L022
53946A18587L907M325M381M475M784N307O107P141Q093Q693Q915Q728Q083P260
53932B08786O671O066M633K261O2q37n62q4m5m13p54m25R59K818L860L604L130
53915B39730L741N360O830P406P269O895O535O256N943N331M299L028J724M76
53901C10823n70j257j795k552l322l429k802k283k580l508m596n785p026p928
53887B61390q293q461q676q619q060p350o869o559o415o643o914o280m566k968
$$ y = [129025, 126248, 123555, 121378, 120079, 119643, 119865, 120508, 121081, 120849, 119499, 117549, 115812, 114679, 114193, 114384, 115089, 115805, 116225, 116663, 117490, 118468, 119120, 119419, 119528, 119212, 118164, 116751, 115726, 115281, 114969, 114433, 113658, 112624, 111350, 110149, 109281, 108413, 107096, 105711, 105261, 106153, 107761, 109317, 110642, 111945, 113470, 115565, 118587, 122494, 126819, 131200, 135675, 140459, 145766, 151873, 159014, 167107, 175800, 184715, 193443, 201526, 208786, 215457, 221523, 226156, 228417, 228479, 227642, 227080, 226996, 226951, 226538, 225784, 225359, 226318, 229136, 232996, 236600, 239730, 243471, 248831, 255661, 263067, 270336, 277231, 283766, 290022, 295965, 301296, 305595, 308623, 310347, 310823, 310253, 308996, 307201, 304649, 301327, 297898, 295096, 292813, 290233, 286725, 282129, 276344, 269318, 261390, 253097, 244636, 235960, 227341, 219281, 211931, 205062, 198503, 192088, 185445, 178531, 172251, 167685, 164717]
53873A64717k603l117l541l746m075m222l688k905k791l363l817l785l598l440
53859A16026l135k762k605k453j757n87K12Rr50j902k234j810j022m96m74n60
53843I3500l13J58M44L93J20k20m25l34j57k96o24o00k61l26r25j127l65N43N91
53824H9776N4j33K18P34J384K163K392J522L30J04Q54J393J165Q63J179J939K640
53807A08577L113L484M017M961O094O629O182N462N384N766N769N308N049N204
53793A80999N303N113M867M568L866K755J618N97l94j117j197q63p72j122j586
53778B02635k045k672l333l733l990m450m925m910m403l851l376k871k606k845
53764A52625l053k479j378o97o17m73j22j94q28j334j303j017n29N29J755J861
$$ y = [164717, 162114, 158997, 155456, 151710, 147635, 143413, 139725, 136820, 134029, 130666, 126849, 123064, 119466, 116026, 112891, 110129, 107524, 105071, 103314, 102727, 102939, 102948, 101998, 100096, 97862, 96052, 95030, 94534, 94060, 93500, 93187, 93345, 93789, 94182, 94302, 94082, 93657, 93323, 93166, 92870, 92246, 91646, 91385, 91059, 90134, 89007, 88642, 89185, 89776, 89830, 89697, 89915, 90649, 92033, 94196, 96588, 98110, 98440, 98544, 99398, 100791, 101956, 102819, 103998, 105937, 108577, 111690, 115174, 119191, 124152, 130246, 136875, 143057, 148519, 153903, 159669, 165438, 170746, 175795, 180999, 186302, 191415, 196282, 200850, 204716, 207471, 209089, 209686, 209292, 208175, 206978, 206115, 205343, 204221, 202635, 200590, 197918, 194585, 190852, 186862, 182412, 177487, 172577, 168174, 164323, 160947, 158076, 155470, 152625, 149572, 147093, 145715, 145018, 144401, 143928, 143806, 143612, 142784, 141450, 140147, 139130, 138601, 139130, 140885, 142746]
53748A42746L34j687k799k833k436k007j728j894k501k992k990k856k994l183
53734A10180l088k867k732k340j321o8O27N43J33j97m54p79j125j242q41J50J408
53717I5987K446K995L074K784K345K130K192J859M41j627k957k718j408O4J495
53702A09102L208N164O757P366O851N592M177K982K001J118L58k26o82r64q80
53687A51924n20l82o75r18o60j93KJ07N68J207J526J556J609J464P29k29p11p90
53669A55614j061j405j190n92m92r70j083m26K66L88K85M03N65M71J21n41j507
53652A48846k098j517j79N69L73K60P41R51L48j80J92P98O65J24R0N43Q58R50
53634A52334J018P04k73j225j216m05L35P04R86J172J057R13J087J257R54N44
$$ y = [142746, 143080, 141393, 138594, 135761, 133325, 131318, 129590, 127696, 125195, 122203, 119213, 116357, 113363, 110180, 107092, 104225, 101493, 99153, 97832, 97764, 98391, 98934, 99067, 98870, 98416, 97637, 96512, 95270, 94429, 94579, 95987, 98433, 101428, 104502, 107286, 109631, 111761, 113953, 115812, 116253, 114626, 111669, 108951, 107543, 107607, 109102, 112310, 117474, 124231, 131597, 138448, 144040, 148217, 151199, 153200, 154318, 154676, 154450, 153768, 152804, 151924, 151404, 151022, 150347, 149429, 148769, 148576, 148578, 148685, 149253, 150460, 151986, 153542, 155151, 156615, 157344, 157115, 156404, 155614, 154553, 153148, 151958, 151366, 150874, 149904, 148821, 148395, 148661, 149049, 149334, 149737, 150302, 150773, 150894, 150353, 148846, 146748, 145231, 145052, 145621, 145994, 146254, 146995, 147946, 148294, 148114, 148306, 149104, 149769, 149893, 149983, 150526, 151384, 152334, 153352, 154056, 153783, 152558, 151342, 150937, 151272, 151976, 152962, 154134, 155191, 156104, 157191, 158448, 159402, 159946]
53618A59946O81J098J006N49P26J773K755K950K696K572K565K431K225K072J904
53603A87949J759J908K400K865L062L218L600M019M129L968L903M128M424M405
53589B35737L871K965K096J677J784K056K030J686J574K135K975L172K482J783
53575B68023J907K469K455J637P18K69K73O12J229J676J432P53M97Q96J330J457
53559B87633J578J670J091j71j013o65K60Q65J286K001K599K290J171O0o16q79
53543B99160o52kL90q7r81j346j031o44m45j51K54M47M77P26J148J261R98Q86
53525C00408J279J967K604L027L149L042L075L573M373N185O100P221Q094Q254
53511C61351Q123Q525R390R821R511R228R716J0855J2171J3465J4595J5233J5283
$$ y = [159946, 160627, 161725, 162731, 163280, 164006, 165779, 168534, 171484, 174180, 176752, 179317, 181748, 183973, 186045, 187949, 189708, 191616, 194016, 196881, 199943, 203161, 206761, 210780, 214909, 218877, 222780, 226908, 231332, 235737, 239608, 242573, 244669, 246346, 248130, 250186, 252216, 253902, 255476, 257611, 260586, 263758, 266240, 268023, 269930, 272399, 274854, 276491, 277209, 277478, 277751, 278363, 279592, 281268, 282700, 283453, 283950, 284846, 286176, 287633, 289211, 290881, 291972, 291801, 290788, 290123, 290383, 291248, 292534, 294535, 297134, 299424, 300595, 300655, 300039, 299160, 298508, 298506, 298896, 298809, 297828, 296482, 295451, 294807, 294362, 294211, 294465, 294912, 295389, 296115, 297263, 298524, 299522, 300408, 301687, 303654, 306258, 309285, 312434, 315476, 318551, 322124, 326497, 331682, 337782, 345003, 353097, 361351, 369474, 377999, 387389, 397210, 406721, 415949, 425665, 436520, 448691, 462156, 476751, 491984, 507267]
53498E07267J5102J5067J5293J5911J7093J8559J9525J9589J9230J9177J9530
53487G01343J9848J9772J9331J8795J8533J8807J9443J9862J9658J9137J9056
53476I13585J9817K0981K1635K1233K0103J9041J8467J8157J7783J7306J6657
53465A124765J5539J3984J2747J2521J2866J2577J1059Q866O797N084L569K166
53453A242540P72q13k607m256n475o407p352q385r495j0842j2516j4117j5024
53440A146023j5206j5369j6099j7035j7313j6789j6319j6645j7429j7849j7753
53429I62217j7645j7681j7496j6976j6478j5981j4838j2798j0639r219q402p613
53417G96451o894o638o599o034m739l213j815l99J132K572L818M979N998O613
$$ y = [507267, 522369, 537436, 552729, 568640, 585733, 604292, 623817, 643406, 662636, 681813, 701343, 721191, 740963, 760294, 779089, 797622, 816429, 835872, 855734, 875392, 894529, 913585, 933402, 954383, 976018, 997251, 1017354, 1036395, 1054862, 1073019, 1090802, 1108108, 1124765, 1140304, 1154288, 1167035, 1179556, 1192422, 1204999, 1216058, 1224924, 1231721, 1236805, 1240374, 1242540, 1243312, 1242499, 1239892, 1235636, 1230161, 1223754, 1216402, 1208017, 1198522, 1187680, 1175164, 1161047, 1146023, 1130817, 1115448, 1099349, 1082314, 1065001, 1048212, 1031893, 1015248, 997819, 979970, 962217, 944572, 926891, 909395, 892419, 875941, 859960, 845122, 832324, 821685, 812466, 804064, 796451, 789557, 782919, 776320, 770286, 765547, 762334, 760519, 760120, 761252, 763824, 767642, 772621, 778619, 785232]
53403G85232O963P707R297J1412J3284J4437J4991J5515J6618J8481K0662K2465
53391I57064K3565K4177K4762K5702K7130K8810L0266L1219L1787L2162L2437
53380A269081L2920L4168L6230L8207L9156L9289L9553M0169M0334L9441L7942
53369A686490L6613L5570L4378L2745L0700K8259K5413K2362J9519J7109J4931
53358A984089J2572R839O920M124J579p40k879n062p782j1283j4966j7868j9931
53345A938612k2224k5540k9278l2213l3904l4781l5169l5010l4441l3926l3670
53334A588456l3375l2717l1830l1168l1062l1395l1635l1357l0774l0455l0392
53323A242296k9846k8392k6673k5578k5128k4594k3489k1862j9979j8218j6970
$$ y = [785232, 792195, 799902, 809199, 820611, 833895, 848332, 863323, 878838, 895456, 913937, 934599, 957064, 980629, 1004806, 1029568, 1055270, 1082400, 1111210, 1141476, 1172695, 1204482, 1236644, 1269081, 1302001, 1336169, 1372399, 1410606, 1449762, 1489051, 1528604, 1568773, 1609107, 1648548, 1686490, 1723103, 1758673, 1793051, 1825796, 1856496, 1884755, 1910168, 1932530, 1952049, 1969158, 1984089, 1996661, 2006500, 2013420, 2017544, 2019123, 2018383, 2015504, 2010442, 2002660, 1991377, 1976411, 1958543, 1938612, 1916388, 1890848, 1861570, 1829357, 1795453, 1760672, 1725503, 1690493, 1656052, 1622126, 1588456, 1555081, 1522364, 1490534, 1459366, 1428304, 1396909, 1365274, 1333917, 1303143, 1272688, 1242296, 1212450, 1184058, 1157385, 1131807, 1106679, 1082085, 1058596, 1036734, 1016755, 998537, 981567]
53312I81567j6125j4994j3264j1577j0620j0142r583r039q718p951o064l836k751
53299H56903k830k643j548m85q8M66J953L677M552M711M989N492N745N879O603
53284H93376Q173J0143J2103J3955J5521J6460J6668J6328J5656J4928J4666J5267
53272A063244J6399J7116J6696J5191J3229J1501J0394R816R200P933N936L852
53260A200507K521K155K066J364n1j436k246k936m349o513q538r704j0266j0969
53246A151605j2191j3684j4994j5920j6628j7358j8042j8342j8166j7871j7786
53235I70623j7753j7481j7066j6800j6630j6248j5555j4697j3830j3229j3291
53224G98043j3921j4241j3601j2577j2182j2352j2107j1156j0258r868r469q542
$$ y = [981567, 965442, 950448, 937184, 925607, 914987, 904845, 895262, 886223, 877505, 869554, 863490, 859654, 856903, 854073, 851430, 849882, 849397, 849309, 849775, 851728, 855405, 859957, 864668, 869657, 875149, 880894, 886773, 893376, 901549, 911692, 923795, 937750, 953271, 969731, 986399, 1002727, 1018383, 1033311, 1047977, 1063244, 1079643, 1096759, 1113455, 1128646, 1141875, 1153376, 1163770, 1173586, 1182786, 1190719, 1196655, 1200507, 1203028, 1205183, 1207249, 1208613, 1208562, 1207126, 1204880, 1201944, 1197595, 1191082, 1182544, 1172840, 1162574, 1151605, 1139414, 1125730, 1110736, 1094816, 1078188, 1060830, 1042788, 1024446, 1006280, 988409, 970623, 952870, 935389, 918323, 901523, 884893, 868645, 853090, 838393, 824563, 811334, 798043, 784122, 769881, 756280, 743703, 731521, 719169, 707062, 695906, 685648, 675780, 666311, 657769]
53212F57769p288n967m443k869k046k373l159l604l911m682n711o208o012n797
53198E93699o104o747p177p118o740o485o660p051p150o837o617o915p494p824
53184D96780p738p447p142p005p301q080q900r194q874q371q134q187q186p771
53170C84450p021o512o702p253p339o597n498m667m348m570n356o404p016o719
53156B98448n767m772m124l947m219m676m826m463l920l692l864m132m133l726
53142B38187l103k683k694k845k759k535k499k537k301k000k226k899l244k958
53128B00904k587k444k123j491j217j675k138j912j426j409j614j388q82o74n39
53113A77385J28J010J116L98k0N43J449J805J590J365J465J854K298K358J645
$$ y = [657769, 650481, 644514, 640071, 637202, 635156, 632783, 629624, 626020, 622109, 617427, 611716, 605508, 599496, 593699, 587595, 580848, 573671, 566553, 559813, 553328, 546668, 539617, 532467, 525630, 519013, 512098, 504604, 496780, 489042, 481595, 474453, 467448, 460147, 452067, 443167, 433973, 425099, 416728, 408594, 400407, 392221, 384450, 377429, 370917, 364215, 356962, 349623, 343026, 337528, 332861, 328513, 323943, 318587, 312183, 305167, 298448, 292681, 287909, 283785, 279838, 275619, 270943, 266117, 261654, 257734, 254042, 250178, 246046, 241913, 238187, 235084, 232401, 229707, 226862, 224103, 221568, 219069, 216532, 214231, 212231, 210005, 207106, 203862, 200904, 198317, 195873, 193750, 192259, 191042, 189367, 187229, 185317, 183891, 182482, 180868, 179480, 178598, 177924, 177385, 177513, 178523, 179639, 180037, 180017, 180560, 182009, 183814, 185404, 186769, 188234, 190088, 192386, 194744, 196389]
53098A96389L73p25j229j433j744k183k640l224l980m604m733m409l971l687l634
53083A54566l727l678l118j990p46J9K1o11j506k211k400k170j953j965j851j173
53067A25507j79K95j88j062j436j154p45m78jQ74J592J513Q04J84jK6L7J1j90
53048A25409p20j332j512j166o77k68J24L44N9n71q85o21k31j30k94p75j730k647
53030A12377k382p33R60J440J078R10Q47R4j132j614r18k8M7n38j035j113r10
53013A07350n56o7N18J083J378J132M23j99l65m07p89j253j190o85m49p05q71
52996A04348n02J07N28P85R90R61N94K00J47M28Q53J318J691J704J297P79M30
52979A16658K54K15M58R57J361J445J492J771J948J480N43L2N29J663K595K891
$$ y = [196389, 196762, 196037, 194808, 193375, 191631, 189448, 186808, 183584, 179604, 175000, 170267, 165858, 161887, 158200, 154566, 150839, 147161, 144043, 142053, 141307, 141326, 141347, 140736, 139230, 137019, 134619, 132449, 130496, 128531, 126680, 125507, 125328, 125623, 125435, 124373, 122937, 121783, 121038, 120560, 120559, 121433, 123025, 124538, 125342, 125526, 125525, 125551, 125588, 125599, 125409, 124689, 123357, 121845, 120679, 120002, 119734, 119858, 120202, 120261, 119690, 118805, 118184, 117953, 117823, 117529, 116754, 115024, 112377, 109995, 109262, 110222, 111662, 112740, 113650, 114497, 114591, 113459, 111845, 110927, 110899, 110946, 110408, 109373, 108260, 107350, 106794, 106727, 107245, 108328, 109706, 110838, 111261, 111062, 110697, 110290, 109501, 108248, 107058, 106373, 105924, 105219, 104348, 103846, 103953, 104481, 105266, 106256, 107217, 107811, 108011, 108158, 108586, 109439, 110757, 112448, 114152, 115449, 116228, 116658, 116912, 117127, 117585, 118542, 119903, 121348, 122840, 124611, 126559, 128039, 128582, 128614, 129143, 130806, 133401, 136292]
52963A36292K789K775L107L603L743L104J896J020J308K677M111M601M026L024
52949A78076K204J644J045K14p03j356j568j537j608j788j759j392j058j134j529
52934A67751j934k335k782l005k700k129j776j507p85L30J120J279J206J070M48
52919A54251o51j263p59Q1J00n65p69j00O65P54K95j47k42M0N61J010J069P73
52901A55103M71L75L96L57K15O1N1L05P31J072J166R36K07j019j990j632M0J539
52883A58384J521L74m77m46r8Q2L15Q25J281J261Q01K73J9J64N02O11L57J24K56
52864A66129M72K58l46q18q53n19P7P92J271J256J017R27Q89O79O11J117J831
52847A74790J929J303O26K65Jj47K19Q95R41O2p13l63P05J302J073P71J017J504
$$ y = [136292, 139081, 141856, 144963, 148566, 152309, 155413, 157309, 158329, 159637, 162314, 166425, 171026, 175052, 178076, 180280, 181924, 182969, 183183, 182480, 181124, 179556, 178019, 176411, 174623, 172864, 171472, 170414, 169280, 167751, 165817, 163482, 160700, 157695, 154995, 152866, 151090, 149583, 148798, 149128, 150248, 151527, 152733, 153803, 154251, 153600, 152337, 151578, 151659, 151759, 151194, 150425, 150325, 150990, 151744, 152039, 151892, 151650, 151690, 152251, 153261, 154330, 155103, 155574, 155949, 156345, 156702, 156917, 156978, 157029, 157334, 158065, 159137, 160303, 161239, 161446, 160427, 158437, 156805, 156845, 158384, 159905, 160279, 159802, 159356, 159258, 159340, 159655, 160480, 161761, 163022, 163823, 164096, 164115, 164279, 164781, 165392, 165749, 165873, 166129, 166601, 166859, 166513, 165695, 164842, 164323, 164400, 165192, 166463, 167719, 168736, 169663, 170552, 171231, 171842, 172959, 174790, 176719, 178022, 178648, 178913, 178914, 178767, 178986, 179881, 180822, 180884, 180171, 179808, 180513, 181815, 182888, 183659, 184676, 186180]
52829A86180J527R22K71K08N90N48m66j862k512k162j700k008k966l792l939l420
52813A65419k618k063k157k757l195k891j930r20l96l89m74k77J6j84j080k117
52797A41987k610k504k170j758j253r21j012j244j137q54r91j614k136k226k102
52782A17455j896j418p76m80o80r08r06r85j354j611j404j007q93j061j242j342
52766I9492j398j339j194j149j254j320j312j418j618j582j220q00n16l74n68
52751H2430j250j823j358m7O90J10p77p55j63j46p94j218j026n87J3J043K082
52734G6424K042O50r67j631j395j041r22q80q87j034j082o56N4L25j93r80j321
52717F6506j188j020r01m48L59Q99P37K26j00k47l66j26P23J506J312L84j65m5
$$ y = [186180, 187707, 188629, 188900, 189108, 189698, 190246, 189780, 187918, 185406, 183244, 181544, 179536, 176570, 172778, 168839, 165419, 162801, 160738, 158581, 155824, 152629, 149738, 147808, 146888, 146492, 146103, 145629, 145352, 145368, 145184, 144104, 141987, 139377, 136873, 134703, 132945, 131692, 130771, 129759, 128515, 127378, 126524, 125533, 123919, 121783, 119557, 117455, 115559, 114141, 113365, 112885, 112205, 111297, 110391, 109406, 108052, 106441, 105037, 104030, 103137, 102076, 100834, 99492, 98094, 96755, 95561, 94412, 93158, 91838, 90526, 89108, 87490, 85908, 84688, 83888, 83372, 82998, 82430, 81180, 79357, 77999, 77952, 78642, 78752, 77975, 77220, 77057, 76911, 76117, 74899, 73873, 73286, 73299, 74342, 76424, 78466, 79116, 78149, 76518, 75123, 74082, 73160, 72280, 71393, 70359, 69277, 68621, 68675, 69000, 68807, 67827, 66506, 65318, 64298, 63397, 62949, 63308, 64207, 64944, 65170, 65070, 64823, 64457, 64331, 65054, 66560, 67872, 68256, 68091, 68046]
52699F8046o4m63l14Q63J995J943J210J053J535J709J353J267J859K489K536K167
52683H9184J841J707J735J894J902J348L57l80n00n29j191k426l424l487k647
52668H5384j520p50n08m54k50rj55p91j482j710j436j042q11o39l25q6m76j585
52650G1355k548k350j107QK10p9j63j36m41q38o32K20R55J011N72P7k60l09LL80
52630F5928L54k8j67J76M56K07k06k11K3r5m85m32K66Q79P71K44n0j17l97p97
52610F6319p32o9N71P49P53R33J053Q22O45J077J760J715P36k29k85L43Q41Q52
52592G7854O10L94L15M93R81J541J748J434Q22L27K02L34L80K48K67O89J176J157
52574I0972P08M98P97J085R03N61N90R15J118J214J533K000K088J568Q70N57P49
$$ y = [68046, 67982, 67519, 67205, 68068, 70063, 72006, 73216, 74269, 75804, 77513, 78866, 80133, 81992, 84481, 87017, 89184, 91025, 92732, 94467, 96361, 98263, 99611, 99968, 99588, 99088, 98559, 97368, 94942, 91518, 88031, 85384, 83864, 83114, 82606, 82152, 81902, 81893, 81738, 80947, 79465, 77755, 76319, 75277, 74466, 73827, 73502, 73416, 72940, 71355, 68807, 66457, 65350, 65358, 65568, 65489, 65326, 65190, 64749, 63911, 63279, 63499, 64454, 65465, 66037, 66114, 65854, 65545, 65548, 65928, 66282, 66254, 66087, 66263, 66719, 66926, 66720, 66509, 66532, 66437, 65952, 65520, 65786, 66665, 67436, 67680, 67630, 67513, 67116, 66319, 65587, 65518, 66089, 66838, 67591, 68524, 69577, 70399, 71044, 72121, 73881, 75596, 76332, 76103, 75818, 76161, 77002, 77854, 78464, 78858, 79173, 79666, 80647, 82188, 83936, 85370, 86192, 86519, 86721, 87055, 87435, 87683, 87950, 88639, 89815, 90972, 91680, 92178, 92975, 94060, 94963, 95524, 96114, 97029, 98147, 99361, 100894, 102894, 104982, 106550, 107420, 107977, 108726]
52557A08726J103J228J049Q73J015J386J539J288R56Q56Q22N76L29N00R73J116
52541A24335O33oj66J98N99O43M15K79N11J053J559J656J227N45J04K34P43J062
52523A35624P69op32r14l81O08J355J138l2j208j466q91k68M3L02N71M41k05q30
52504A33918r84r07j021j210j124p99n66m97l56qM21P13O65K51j59j3P15J235
52486A30274P80m40j371j194m5J249J929J818J262O92K93J24K89P90J332J594
52470A39376J612J490J000n3j179j607j364j225j444j270j21J431K339K234J513
52455A42732O86Q1j47j40k21m29m89l70m19p17q55n43j5M66Q82J091P75J24k28
52436A42264k08n01j333j953j844j539j495j173q9J005J126N30R0j85q15j464
$$ y = [108726, 109829, 111057, 112106, 112979, 113994, 115380, 116919, 118207, 119163, 120019, 120841, 121417, 121746, 122246, 123219, 124335, 124968, 124962, 124796, 124994, 125593, 126236, 126651, 126930, 127441, 128494, 130053, 131709, 132936, 133481, 133585, 133819, 134562, 135624, 136393, 136387, 135655, 134741, 134360, 134968, 136323, 137461, 137429, 136221, 134755, 133864, 133596, 133639, 133941, 134512, 134953, 134748, 133918, 132934, 132027, 131006, 129796, 128672, 127873, 127307, 126810, 126454, 126446, 126867, 127580, 128245, 128496, 128337, 128324, 129039, 130274, 131054, 130614, 129243, 128049, 128004, 129253, 131182, 133000, 134262, 134954, 135247, 135371, 135660, 136450, 137782, 139376, 140988, 142478, 143478, 143425, 142246, 140639, 139275, 138050, 136606, 135336, 135215, 136646, 138985, 141219, 142732, 143418, 143499, 143352, 143212, 142991, 142562, 142073, 141703, 141284, 140567, 139712, 139169, 139154, 139620, 140502, 141593, 142368, 142492, 142264, 142056, 141555, 140222, 138269, 136425, 134886, 133391, 132218, 132129, 133134, 134260, 134790, 134880, 134695, 133880, 132416]
52420A32416j214l7J211K079K741L099K762J972J498J582J862K234K824L211K782
52405A61022J865J373J338R27L2m66l01l84j263k161k219j745j447j301r97p70
52389A53503r52j179r02l50k38p42j301j418j086n64n9L26N88P90R11Q91Q28R58
52371A50004J376J933K394K517K147J517J226J559K053K244K480L251L996L550
52357A82247J880L68J11P72J466J936K354K711K945L203L420L130K155J153R16
52342B10767J478K222K583K307J463O23O27J697K975L438K941K101J457J192J454
52327B39325K338L500M239M135L495L081L429M368N182N313M883M462M440M762
52313B96952N137N285N125N029N588O813P811P784P098O782P203P955Q840J0047
$$ y = [132416, 131202, 131165, 132376, 134455, 137196, 140295, 143057, 145029, 146527, 148109, 149971, 152205, 155029, 158240, 161022, 162887, 164260, 165598, 166525, 166557, 166091, 165790, 165406, 164143, 161982, 159763, 158018, 156571, 155270, 154273, 153503, 152551, 151372, 150470, 150120, 149882, 149140, 147839, 146421, 145335, 144771, 144712, 145038, 145626, 146416, 147327, 148218, 149046, 150004, 151380, 153313, 155707, 158224, 160371, 161888, 163114, 164673, 166726, 168970, 171450, 174701, 178697, 182247, 184127, 184495, 184606, 185378, 186844, 188780, 191134, 193845, 196790, 199993, 203413, 206543, 208698, 209851, 210767, 212245, 214467, 217050, 219357, 220820, 221443, 222070, 223767, 226742, 230180, 233121, 235222, 236679, 237871, 239325, 241663, 245163, 249402, 253537, 257032, 260113, 263542, 267910, 273092, 278405, 283288, 287750, 292190, 296952, 302089, 307374, 312499, 317528, 323116, 329929, 337740, 345524, 352622, 359404, 366607, 374562, 383402, 393449]
52299C93449J1272J1701J1177J0570J0587J0967J1217J1474J2053J2707J2937
52288E20111J2659J2135J1554J1081J0926J0991J0804J0155R405Q891Q355P423
52276F44490O298N550N377N461N358M849M046L301K846K542K186J925J948J951
52262F98128J582J283J819K910L303K562J817K225L541M812N713O438O909O995
52248G50037O991P186P290O946O517O613P124P451P430P413P552P609P449P190
52234H50798P006P049P384P664P230N970M675M060L818L283K666K773L667M333
52220I22376L872K426Q58j38m36l66k98l12k80l47q85j865k679k910k807k646
52204I13563k203j349o68p69j323j463r25j01P58J653K244K094J488J282J753
$$ y = [393449, 404721, 416422, 427599, 438169, 448756, 459723, 470940, 482414, 494467, 507174, 520111, 532770, 544905, 556459, 567540, 578466, 589457, 600261, 610416, 619821, 628712, 637067, 644490, 650788, 656338, 661715, 667176, 672534, 677383, 681429, 684730, 687576, 690118, 692304, 694229, 696177, 698128, 699710, 700993, 702812, 705722, 709025, 711587, 713404, 715629, 719170, 723982, 729695, 736133, 743042, 750037, 757028, 764214, 771504, 778450, 784967, 791580, 798704, 806155, 813585, 820998, 828550, 836159, 843608, 850798, 857804, 864853, 872237, 879901, 887131, 893101, 897776, 901836, 905654, 908937, 911603, 914376, 918043, 922376, 926248, 928674, 929532, 929394, 928958, 928592, 928294, 927982, 927702, 927355, 926470, 924605, 921926, 919016, 916209, 913563, 911360, 910011, 909343, 908574, 907251, 905788, 904863, 904762, 905520, 907173, 909417, 911511, 912999, 914281, 916034]
52189I16034K254K180J670J159P54L78R4n9k83p30j201j350j115p77o42q15j208
52172I16343j663k036k257k392k662l226l837l961l435k854k854l251l366l118
52158H75431l087l466l695l351k777k476k481k622k869l039k834k470k638l390
52144H34236l849l474k887k837l079l019k785k774k788k500k293k586k885k578
52130G93902k185k699l877m515m232l846l906m109m258m647n129m959l993l072
52116G38475k721k282j053M75J239J019N31M36Q39J632K822M357N917P080P754
52101G66520Q407R616J1266J2508J2774J2517J2543J2968J3378J3720J4281J4935
52089I15433J5128J4686J4005J3371J2682J1861J0999J0087R076Q205P690P171
$$ y = [916034, 918288, 920468, 922138, 923297, 924051, 924429, 924523, 924464, 924181, 923451, 922250, 920900, 919785, 919008, 918366, 917551, 916343, 914680, 912644, 910387, 907995, 905333, 902107, 898270, 894309, 890874, 888020, 885166, 881915, 878549, 875431, 872344, 868878, 865183, 861832, 859055, 856579, 854098, 851476, 848607, 845568, 842734, 840264, 837626, 834236, 830387, 826913, 824026, 821189, 818110, 815091, 812306, 809532, 806744, 804244, 801951, 799365, 796480, 793902, 791717, 789018, 785141, 780626, 776394, 772548, 768642, 764533, 760275, 755628, 750499, 745540, 741547, 738475, 735754, 733472, 732419, 732894, 734133, 735152, 735683, 736119, 736958, 738590, 741412, 745769, 751686, 758766, 766520, 774927, 784543, 795809, 808317, 821091, 833608, 846151, 859119, 872497, 886217, 900498, 915433, 930561, 945247, 959252, 972623, 985305, 997166, 1008165, 1018252, 1027328, 1035533, 1043223, 1050394]
52077A050394O120M678L447K483J336J31l52L4L06l67j608k468k656k591k652
52062A056235k878l042k827k112j329j153j644k086j897j223m95J80Q24J232J179
52047A038964P92L86J17n8k39m65n38j05P86J408J149M40K27N09L17p47j832k143
52029A038968k137k723l847m630m667m439m534m997n496n763n738n500n116m654
52015I74727m317m536n601p208q635r436r743r876j0013j0296j0948j2087j3557
52002H58474j4944j5696j5486j4764j4598j5556j6970j7749j7652j7231j6871
51991F80957j6637j6701j7078j7171j6579j6129j6923j8400j8756j7489j6078
51980D93016j5656j5508j4680j3677j3354j3215j2190j0399q878p987p391p165
$$ y = [1050394, 1056514, 1061192, 1064639, 1067122, 1068458, 1068589, 1068237, 1068271, 1068577, 1068210, 1066602, 1064134, 1061478, 1058887, 1056235, 1053357, 1050315, 1047488, 1045376, 1044047, 1042894, 1041250, 1039164, 1037267, 1036044, 1035549, 1035729, 1036553, 1037785, 1038964, 1039756, 1040142, 1040259, 1040201, 1039962, 1039497, 1038959, 1038854, 1039640, 1041048, 1042197, 1042637, 1042864, 1043373, 1043690, 1042943, 1041111, 1038968, 1036831, 1034108, 1030261, 1025631, 1020964, 1016525, 1011991, 1006994, 1001498, 995735, 989997, 984497, 979381, 974727, 970410, 965874, 960273, 953065, 944430, 934994, 925251, 915375, 905362, 895066, 884118, 872031, 858474, 843530, 827834, 812348, 797584, 782986, 767430, 750460, 732711, 715059, 697828, 680957, 664320, 647619, 630541, 613370, 596791, 580662, 563739, 545339, 526583, 509094, 493016, 477360, 461852, 447172, 433495, 420141, 406926, 394736, 384337, 375459, 367472, 360081, 352916]
51968C52916p673q476q533p601o456n660n067m626m703n316n755n444m649m027
51954B68930l818l792l743l694l708l689l463l036k730k758k813k439j871j822
51940B25554k329k456j637o38m65r44j164r10p27p52n41o0O1m86j169j399j281
51923B08657j254j432j637j794k000k358k832l155k951k187j369j054j213j393
51909A82028j356j275j302j344j215q09k06K17jp76j374j284q82p82q85p29m43
51892A67582n90j142j415j116p01n70n61m58l38j82K26P24O99l1q08r88o96l52
51874A59283R2Q19J504J570J054O42P85J196J233N96m02j092j041m86o5p6j43
51857A65469J96Q85J487J719J640J416J253J356J648J633Q83k63q34k11J152K093
$$ y = [352916, 345243, 336767, 328234, 320633, 314177, 308517, 303450, 298824, 294121, 288805, 283050, 277606, 272957, 268930, 265112, 261320, 257577, 253883, 250175, 246486, 243023, 239987, 237257, 234499, 231686, 229247, 227376, 225554, 223225, 220769, 219132, 218494, 218029, 217085, 215921, 215011, 214284, 213532, 212991, 212931, 212992, 212506, 211337, 209938, 208657, 207403, 205971, 204334, 202540, 200540, 198182, 195350, 192195, 189244, 187057, 185688, 184634, 183421, 182028, 180672, 179397, 178095, 176751, 175536, 174727, 174521, 174738, 174737, 173961, 172587, 171303, 170421, 169639, 168754, 168025, 167582, 166992, 165850, 164435, 163319, 162618, 162048, 161487, 161029, 160691, 160509, 160735, 161459, 162158, 162127, 161319, 160331, 159635, 159283, 159375, 160194, 161698, 163268, 164322, 164964, 165749, 166945, 168178, 168774, 168372, 167280, 166239, 165753, 165688, 165612, 165469, 165665, 166550, 168037, 169756, 171396, 172812, 174065, 175421, 177069, 178702, 179585, 179322, 178488, 178277, 179429, 181522]
51841A81522J846P26k43l97LK55J21n8j01k78o44n31O00K077K483J371j20o45
51823A87987j80L32L91L93P71J338J658J651J565J536J455J154N94m2m67n54m90
51806A99092m93m78k67n8k71q69j271j145p89n51k89J83O39Q47J037J379J397
51789A98093O51l34n76l2M29M59P72J875L077L261K175N67o63j041o17J35P13
51772B08944J017J242J425J432J363J422J397Q90J47j07K07L70J67L95J480K536
51756B24327K555J929J733K101K249J787J014J75o69j157r57n30o22j074j006
51741B31855l05J63l7k38J72Q00J026R38Q64N85k10j069j170m75K20L76L17N38
51723B34350Q88P69Kq87j281j204j254j819k627l102k980k462j895j562j576j794
$$ y = [181522, 183368, 184094, 183851, 183454, 183457, 183712, 183833, 183775, 183674, 183396, 182752, 182221, 182821, 184898, 187381, 188752, 188632, 187987, 187807, 188139, 188530, 188923, 189694, 191032, 192690, 194341, 195906, 197442, 198897, 200051, 200645, 200603, 200136, 199582, 199092, 198599, 198121, 197854, 197796, 197525, 196656, 195385, 194240, 193451, 192900, 192611, 192794, 193433, 194280, 195317, 196696, 198093, 198744, 198410, 197834, 197802, 198231, 198690, 199462, 201337, 204414, 207675, 209850, 210417, 209754, 208713, 208096, 208231, 208944, 209961, 211203, 212628, 214060, 215423, 216845, 218242, 219132, 219279, 219172, 219379, 219749, 219916, 220311, 221791, 224327, 226882, 228811, 230544, 232645, 234894, 236681, 237695, 237870, 237201, 236044, 235087, 234557, 233935, 232861, 231855, 231550, 231713, 231676, 231438, 231610, 232410, 233436, 234374, 235238, 235823, 235613, 234544, 233374, 232899, 233119, 233495, 233812, 234350, 235238, 236007, 236009, 235122, 233841, 232637, 231383, 229564, 226937, 223835, 220855, 218393, 216498, 214936, 213360, 211566]
51707B11566j937j941k040k316k414k018j409j110j144j058o36j33J28M7l11o89
51691A92585o07J49J134J811K439L748N652P013O885N414L264Q55j404k787k857
51676B23294k182j761j883j983j522n48N77J562K242K586K740K831K670J978R30
51661B31531J39o1m4l78j092j757k213k773l567m118l957l401l194l431l448k911
51645A95325k424k623l153l198k681k316k432k581k340j971j941k240k514k520
51631A60391k209j625j031q41j134j405j121l70K86N29N66P25J010J114P81J11
51615A55777m88p12p01q46j189j195l34J159K290K212J062j34m49J05Q04J122
51599A58483J218J461J822J943J659J183Q99J102J881K979L862M183M069L830
$$ y = [211566, 209629, 207688, 205648, 203332, 200918, 198900, 197491, 196381, 195237, 194179, 193543, 193410, 193538, 193585, 193274, 192585, 191978, 192127, 193261, 195072, 197511, 201259, 206911, 213924, 220809, 226223, 229487, 230342, 228938, 226151, 223294, 221112, 219351, 217468, 215485, 213963, 213415, 213992, 215554, 217796, 220382, 223122, 225953, 228623, 230601, 231531, 231670, 231609, 231565, 231187, 230095, 228338, 226125, 223352, 219785, 215667, 211710, 208309, 205115, 201684, 198236, 195325, 192901, 190278, 187125, 183927, 181246, 178930, 176498, 173917, 171577, 169606, 167665, 165425, 162911, 160391, 158182, 156557, 155526, 154685, 153551, 152146, 151025, 150655, 150941, 151470, 152036, 152761, 153771, 154885, 155666, 155777, 155289, 154577, 153876, 153030, 151841, 150646, 150312, 151471, 153761, 155973, 157035, 156901, 156452, 156557, 157361, 158483, 159701, 161162, 162984, 164927, 166586, 167769, 168668, 169770, 171651, 174630, 178492, 182675, 186744, 190574]
51585A90574L587L419L594M220M833M826M278L854L862L913L553K776J722M45
51571B39456q57j774k182k450k887l292l282k824k162j486r25o53o06l78L57J370
51555B15425K158K666L409M792O416P274O749N466M829N501O516O354M727K784
51541B85066J632J236J016P68O18N42M60M91O61O35J73l98n67l47j30q6j35l14
51523B91321p50j347j927k558l325l913l953l682l752m324m833m758m205l585
51509B44409l118k750k347j858j487j626k288k760k299j196n01o59r98q12k91
51494B19419j6n7j34k22l83l24K41R26J086P77P20J224J764J814J536J341J286
51477B30998J186J064J079J170J213J376K040L259M597N479N676N421N070M682
$$ y = [190574, 194161, 197580, 201174, 205394, 210227, 215053, 219331, 223185, 227047, 230960, 234513, 237289, 239011, 239456, 238599, 236825, 234643, 232193, 229306, 226014, 222732, 219908, 217746, 216260, 215335, 214682, 214076, 213698, 214055, 215425, 217583, 220249, 223658, 228450, 234866, 242140, 248889, 254355, 259184, 264685, 271201, 277555, 282282, 285066, 286698, 287934, 288950, 289718, 290336, 290878, 291338, 291829, 292490, 293125, 293298, 292900, 292333, 291986, 291856, 291770, 291635, 291321, 290571, 289224, 287297, 284739, 281414, 277501, 273548, 269866, 266114, 261790, 256957, 252199, 247994, 244409, 241291, 238541, 236194, 234336, 232849, 231223, 228935, 226175, 223876, 222680, 222179, 221520, 220522, 219710, 219419, 219403, 219346, 219212, 218990, 218607, 218283, 218524, 219450, 220536, 221313, 222033, 223257, 225021, 226835, 228371, 229712, 230998, 232184, 233248, 234327, 235497, 236710, 238086, 240126, 243385, 247982, 253461, 259137, 264558, 269628, 274310]
51463B74310L982K865J795J396J704K122K200K015J667R14l12j414j680j146m57
51448B89961n5J17K41M51R03J533J824J256j8j393k603l753m672m937m600m292
51432B69963m400m750n209n889o532o436n463m429m000l804l239k515k234k348
51418B08715k356k155j946j590q40n4J64n4M6O47J127J096R81J315K042K754L203
51401B13095L297K982K346J540N59o85j995l016l707m308m867n188n304n515n871
51386A83363o058n868n389m673l736k905k669l037l448l487l244k852k289j756
51372A31952j661j973k068j575q40l35m1J86J49k86p13o18q6L16K15l03q58j011
51354A20450n93j5M4m78q61o12j15M6r6k35m62r12j154o90R7L48M0N1Q62J822
$$ y = [274310, 278292, 281157, 282952, 284348, 286052, 288174, 290374, 292389, 294056, 294970, 294658, 293244, 291564, 290418, 289961, 289906, 290023, 290264, 290715, 291618, 293151, 294975, 296231, 296213, 294820, 292217, 288464, 283792, 278855, 274255, 269963, 265563, 260813, 255604, 249715, 243183, 236747, 231284, 226855, 222855, 219051, 215812, 213297, 211063, 208715, 206359, 204204, 202258, 200668, 199828, 199774, 199938, 199884, 199930, 200577, 201704, 202800, 203781, 205096, 207138, 209892, 213095, 216392, 219374, 221720, 223260, 223819, 223134, 221139, 218123, 214416, 210108, 205241, 200053, 194749, 189234, 183363, 177305, 171437, 166048, 161375, 157639, 154734, 152065, 149028, 145580, 142093, 138849, 135997, 133708, 131952, 130291, 128318, 126250, 124675, 123835, 123500, 123459, 123645, 123794, 123508, 122795, 122177, 122091, 122407, 122622, 122319, 121461, 120450, 119857, 119842, 119886, 119408, 118547, 117935, 117820, 117866, 117770, 117535, 117073, 116161, 115007, 114317, 114414, 114762, 114802, 114853, 115715, 117537]
51334A17537K110J753J397J410J673J977K225K397K574K920L465L939L989L599
51320A52965L166L179L754M450M621M052L159K448J851Q24r10k939m554n387n535
51305A65144n269m845m516m486m705m820m464l655k802k325k258k288k089j589
51291A15033r89n89n67q28j093j133q94l74L75J033J115N40o4p0K98K64l09o82
51273A11066l31K23J48n40j042q57k77J91M29N21M10L5k84o8P04J411J495J127
51255A14361R22J028R74M58j00j23L26P05P59P31Q56J055J146J067Q68O42M85
51238A26160L10j38q85j511j611j250p08m3O48Q56K20o72q12q7O05O30L27K32
51220A22271L22L36L11L97M94M78L90K52mk53k33j2M6p8m4J06j46q83j367r89
$$ y = [117537, 119647, 121400, 122797, 124207, 125880, 127857, 130082, 132479, 135053, 137973, 141438, 145377, 149366, 152965, 156131, 159310, 163064, 167514, 172135, 176187, 179346, 181794, 183645, 184469, 183559, 180620, 176066, 170679, 165144, 159875, 155030, 150514, 146028, 141323, 136503, 132039, 128384, 125582, 123257, 120999, 118711, 116622, 115033, 114044, 113455, 112888, 112060, 110967, 109834, 108940, 108566, 108941, 109974, 111089, 111629, 111565, 111495, 111793, 112057, 111748, 111066, 110735, 110958, 111106, 110566, 109524, 108667, 108390, 108581, 109010, 109531, 109941, 109976, 109692, 109624, 110328, 111739, 113234, 114361, 115283, 116311, 117285, 117743, 117643, 117520, 117846, 118551, 119310, 120041, 120897, 121952, 123098, 124165, 125033, 125675, 126160, 126470, 126332, 125447, 123936, 122325, 121075, 120367, 120324, 120972, 121828, 122048, 121376, 120564, 120477, 121082, 121712, 122039, 122271, 122593, 122929, 123240, 123637, 124131, 124609, 124999, 125251, 125247, 124994, 124761, 124749, 124795, 124717, 124673, 124779, 124633, 123750, 122383, 121394]
51200A21394j05N35O54M05o4n24o34m46m41p56q29l33J48o2p13j082j046j036
51182A15065j229j400j428j333j044n57j31O3K11M15L98Q3nN04J094J054M80q0
51164A12160n64j192j722j720j442j509j891j973j576j116q38o18m48l88j30O37
51148I5670J456J541R75O19Q09J024R41R54J369J878K123K140J982J563J094J015
51132A17153J261J317J109J116J283Q10n11j662j811j551j884k498k173o86P02
51117A11975Q62M0p55j007r12o08J73J545K882L236K406J286Q81J190J489J369
51101A26052J044O66P1o25q13j53Q13J224Q64K45n0J34N57Q72Q75P12O72Q12Q75
51082A34847O58K78J3N4L91Q17J017Q77O84O84O35Q4q28j378j190p24o02p85q38
$$ y = [121394, 121289, 121824, 122478, 122883, 122819, 122295, 121661, 121215, 120774, 120018, 119189, 118856, 119004, 118942, 118229, 117147, 116101, 115065, 113836, 112436, 111008, 109675, 108631, 108074, 107943, 108006, 108217, 108632, 109030, 109113, 109108, 109612, 110706, 111760, 112240, 112160, 111596, 110404, 108682, 106962, 105520, 104011, 102120, 100147, 98571, 97455, 96617, 95999, 95551, 95163, 95033, 95670, 97126, 98667, 99642, 100261, 101070, 102094, 103035, 103989, 105358, 107236, 109359, 111499, 113481, 115044, 116138, 117153, 118414, 119731, 120840, 121956, 123239, 124049, 123538, 121876, 120065, 118514, 116630, 114132, 111959, 111273, 111975, 112837, 112877, 112122, 111115, 110203, 109595, 109768, 111313, 114195, 117431, 119837, 121123, 122004, 123194, 124683, 126052, 127096, 127762, 127833, 127208, 126395, 126242, 127055, 128279, 129143, 129388, 129338, 129472, 130029, 130901, 131776, 132488, 133160, 133972, 134847, 135505, 135783, 135796, 135850, 136241, 137058, 138075, 138952, 139636, 140320, 140955, 141039, 140211, 138833, 137643, 136919, 136317, 135532, 134694]
51063A34694o94p06j019j240q78P7J101J644J583J175P41N10O78J266J885J963
51047A42780J447R25Q28Q39M48k00n64m87k64q8J8j35o97j241j042j2J096J512
51029A45163J127L50k97m27n3M18O88R67J469J834J611J089R17J112J178J137
51013A58283J476K081K222J890K015L026M064M253L838L460L045K333J833K338
50999A96157L727N022N586N628N668N979O529P053P291P427Q012R188J0346J0984
50985B94597J1554J2820J4643J6145J7062J8208K0336K3039K5257K6613K7819
50974E08093K9681L2156L4569L6663L8773M0939M2367M2328M1187L9926L8840
50963I25522L7339L4996L2069K9007K6172K4067K3101K2825K2170K0801J9587
$$ y = [134694, 134000, 133294, 132275, 131035, 130157, 130234, 131335, 132979, 134562, 135737, 136478, 136988, 137666, 138932, 140817, 142780, 144227, 145152, 145980, 146819, 147267, 147067, 146503, 146016, 145752, 145664, 145682, 145547, 144850, 143609, 142567, 142555, 143651, 145163, 146290, 146640, 146343, 145916, 145863, 146281, 146969, 147936, 149405, 151239, 152850, 153939, 154856, 155968, 157146, 158283, 159759, 161840, 164062, 165952, 167967, 170993, 175057, 179310, 183148, 186608, 189653, 191986, 193819, 196157, 199884, 204906, 210492, 216120, 221788, 227767, 234296, 241349, 248640, 256067, 264079, 273267, 283613, 294597, 306151, 318971, 333614, 349759, 366821, 385029, 405365, 428404, 453661, 480274, 508093, 537774, 569930, 604499, 641162, 679935, 720874, 763241, 805569, 846756, 886682, 925522, 962861, 997857, 1029926, 1058933, 1085105, 1109172, 1132273, 1155098, 1177268, 1198069, 1217656]
50952A217656J9438K0290K1569K2985K4331K5204K5347K4820K3374K0278J5334
50941A460626R455L623k170q399j4975k1491k7979l4640m1127m6830n1609n5530
50929A168954n8190n9138n8729n7767n6413n4125n0704m6646m2424l8073l3611
50918F13134k9334k5585k2510k0110j8211j6449j4645j3006j1708j0478q953p250
50906D14895n771m668l855l254k714j992j195q53j090j231q34m70p62j186q03
50891C84217K52J103J643K510L677M349M366M493N072N530N633O073P205Q233
50877D44356Q461Q513R438J1202J2911J4189J5509J7343J9645K2009K3993K5472
50865F33041K7047K9852L4438M0081M5573N0495N5247O0085O4761O9077P3266
$$ y = [1217656, 1237094, 1257384, 1278953, 1301938, 1326269, 1351473, 1376820, 1401640, 1425014, 1445292, 1460626, 1470081, 1473704, 1471534, 1463135, 1448160, 1426669, 1398690, 1364050, 1322923, 1276093, 1224484, 1168954, 1110764, 1051626, 992897, 935130, 878717, 824592, 773888, 727242, 684818, 646745, 613134, 583800, 558215, 535705, 515595, 497384, 480935, 466290, 453284, 441576, 431098, 422145, 414895, 409124, 404456, 400601, 397347, 394633, 392641, 391446, 390593, 389503, 388272, 387438, 386968, 386206, 385020, 384217, 384469, 385572, 387215, 389725, 393402, 397751, 402117, 406610, 411682, 417212, 422845, 428918, 436123, 444356, 452817, 461330, 470768, 481970, 494881, 509070, 524579, 541922, 561567, 583576, 607569, 633041, 660088, 689940, 724378, 764459, 810032, 860527, 915774, 975859, 1040620, 1109697, 1182963]
50854A182963P7617Q2056Q6122Q9291R1285R2147R1893Q9999Q5580P8436O9750
50843B117139O1342N4224M8169M2619L7615L3746L1531L1180L2763L6249M1266
50832B567843M7009N2634N7698O2002O4880O4914O0613N1442L8040K1583L222
50821C091880j6048l5453n4666p3637r1994j08679j22472j32723j39447j42805
50811B173956j42838j39716j33997j26425j17498j07458r6693q5958p5984o6954
50801A080435n8665n1162m4819l9556l4473k8719k2626j7397j3715j1098q758
50790G49447o564m845l730l085k943l485m556n630o378o959p616q258q706r128
50776F67564r785j0453j0561j0091r782j0113j0504j0098r014q134p702o999n558
$$ y = [1182963, 1260580, 1342636, 1428758, 1518049, 1609334, 1701481, 1793374, 1883373, 1968953, 2047389, 2117139, 2178481, 2232705, 2280874, 2323493, 2361108, 2394854, 2426385, 2457565, 2490328, 2526577, 2567843, 2614852, 2667486, 2725184, 2787186, 2852066, 2916980, 2977593, 3029035, 3067075, 3088658, 3091880, 3075832, 3040379, 2985713, 2912076, 2820082, 2711403, 2588931, 2456208, 2316761, 2173956, 2031118, 1891402, 1757405, 1630980, 1513482, 1406024, 1309331, 1223373, 1147389, 1080435, 1021770, 970608, 925789, 886233, 851760, 823041, 800415, 783018, 769303, 758205, 749447, 742883, 738038, 734308, 731223, 728280, 724795, 720239, 714609, 708231, 701272, 693656, 685398, 676692, 667564, 657779, 647326, 636765, 626674, 616892, 606779, 596275, 586177, 577163, 569029, 561327, 554328, 548770]
50763E48770l865k487j222L78K162L734N255P177R435J1528J3292J4965J6614
50750F25736J8150J9832K2156K5135K8264L1297L4478L7955M1466M4778M7977
50739I77224N1074N3746N5767N7289N8441N8846N7854N5147N0939M5707L9854
50728A561888L3575K6937K0133J3524P363J702l174o426p190n433j938K514P625
50715A651100J3256J9090K4667K9391L2447L3006L0771K6066J9328J0706J43j2352
50703A877619k6413m1072n4834o6321p4888q0430q2942q2614q0198p6537p1837
50692A139533o5906n9170n2722m7160m2016l6651l1191k6252k2077j8283j4319
50681G23786r912n379j451J433L741O262Q980J1088J2204J2824J3295J3161J2073
$$ y = [548770, 544905, 542418, 541196, 541574, 543736, 547470, 552725, 559902, 569337, 580865, 594157, 609122, 625736, 643886, 663718, 685874, 711009, 739273, 770570, 805048, 843003, 884469, 929247, 977224, 1028298, 1082044, 1137811, 1195100, 1253541, 1312387, 1370241, 1425388, 1476327, 1522034, 1561888, 1595463, 1622400, 1642533, 1656057, 1663420, 1665122, 1661948, 1655522, 1648332, 1642899, 1640961, 1643475, 1651100, 1664356, 1683446, 1708113, 1737504, 1769951, 1802957, 1833728, 1859794, 1879122, 1889828, 1889971, 1877619, 1851206, 1810134, 1755300, 1688979, 1614091, 1533661, 1450719, 1368105, 1287907, 1211370, 1139533, 1073627, 1014457, 961735, 914575, 872559, 835908, 804717, 778465, 756388, 738105, 723786, 713874, 708495, 707044, 708477, 712218, 718480, 727460, 738548, 750752, 763576, 776871, 790032, 802105]
50668H02105J0667R846R606R237Q380P236O073N157M868N280N760N673N371N815
50654I01074P276R059J0580J2021J3832J6191J9130K2559K5870K8125K9097K9696
50642A124510L0874L2347L2892L1715K9108K5882K2588J9284J5708J1639P263
50631A383810L281L11j757l484m908n353m402k663j067K64J904L915N484N926
50617A381261N525M991M334K893L64k554m746n717n985o540q033j0512j3785j7762
50603A323734k2219k6559l0297l3703l7373m1067m3567m4093m3243m2156m1162
50592I18295l9861l8077l5981l3497l0399k6990k4020k1770j9761j7478j4905
50581F15556j2226r542o990m731k617l83J768L182L640L812M598O237Q247R930
$$ y = [802105, 812772, 822618, 832224, 841461, 849841, 857077, 863150, 868307, 873175, 878455, 884215, 889888, 895259, 901074, 908350, 917409, 927989, 940010, 953842, 970033, 989163, 1011722, 1037592, 1065717, 1094814, 1124510, 1155384, 1187731, 1220623, 1252338, 1281446, 1307328, 1329916, 1349200, 1364908, 1376547, 1383810, 1387091, 1387402, 1385645, 1382161, 1377253, 1371900, 1367498, 1364835, 1363768, 1364032, 1365936, 1369851, 1375335, 1381261, 1386786, 1391777, 1396111, 1399004, 1399368, 1396814, 1392068, 1386351, 1380366, 1373826, 1365793, 1355281, 1341496, 1323734, 1301515, 1274956, 1244659, 1210956, 1173583, 1132516, 1088949, 1044856, 1001613, 959457, 918295, 878434, 840357, 804376, 770879, 740480, 713490, 689470, 667700, 647939, 630461, 615556, 603330, 593788, 586798, 582067, 579450, 579067, 580835, 584017, 587657, 591469, 596067, 602304, 610551, 620481]
50567F20481J0885J1301J1862J3048J4562J5707J6378J7187J8596K0455K2407
50556G92869K4130K5042K4539K2981K1754K1776K2426K2548K2091K2068K3037
50545A045261K4444K5620K6701K8251L0321L2393L4211L6297L9333M3245M7220
50534A413297N0693N3914N7303O0647O3460O5822O8102O9893P0004O7692O3357
50523B104184N7762N1102M3207L4155K4226J3556K219r486k1026l1783m1141m8778
50511B178197n4964o0217o4474o6954o6954o4446n9801n3476m6179l8761l1546
50500A570425k4205j6572r110k356L606Q767J2883J6006J8728K1249K2559K1258
50488A643238J6912J0038J090r741k1788l3669m4101n2585n9243o4242o7416o8346
$$ y = [620481, 631366, 642667, 654529, 667577, 682139, 697846, 714224, 731411, 750007, 770462, 792869, 816999, 842041, 866580, 889561, 911315, 933091, 955517, 978065, 1000156, 1022224, 1045261, 1069705, 1095325, 1122026, 1150277, 1180598, 1212991, 1247202, 1283499, 1322832, 1366077, 1413297, 1463990, 1517904, 1575207, 1635854, 1699314, 1765136, 1833238, 1903131, 1973135, 2040827, 2104184, 2161946, 2213048, 2256255, 2290410, 2314636, 2328192, 2330411, 2320925, 2299899, 2268116, 2226975, 2178197, 2123233, 2063016, 1998542, 1931588, 1864634, 1800188, 1740387, 1686911, 1640732, 1601971, 1570425, 1546220, 1529648, 1520538, 1518182, 1521788, 1530555, 1543438, 1559444, 1578172, 1599421, 1621980, 1643238, 1660150, 1670188, 1671278, 1661537, 1639749, 1606080, 1561979, 1509394, 1450151, 1385909, 1318493, 1250147]
50476A250147o6903o3731n9943n6183n2364m8370m4463m0686l6537l1822k7284
50465G21861k3722k0846j7753j4268j1063q580o603m879l426k083l76J877M270
50452F14409O285P766Q890R875J0827J1682J2311J2813J3534J4624J5792J6710
50440G55518J7387J7885J8079J8007J8086J8442J8493J7804J6983J6985J7746
50429I51415J8346J8395J8357J8544J8662J8650J9102K0483K2452K4448K6479
50418A175333K8882L1578L3896L5146L5183L4469L3600L2693L1292K8936K5590
50407A526598K1380J6268J0418M487j062o693j3250k0808k8625l6051m2787m8380
50395A381495n2286n4591n5977n6718n6348n4470n1276m7135m2216l6784l1308
$$ y = [1250147, 1183244, 1119513, 1059570, 1003387, 951023, 902653, 858190, 817504, 780967, 749145, 721861, 698139, 677293, 659540, 645272, 634209, 625629, 619026, 614147, 610721, 608638, 608262, 610139, 614409, 620694, 628460, 637350, 647225, 658052, 669734, 682045, 694858, 708392, 723016, 738808, 755518, 772905, 790790, 808869, 826876, 844962, 863404, 881897, 899701, 916684, 933669, 951415, 969761, 988156, 1006513, 1025057, 1043719, 1062369, 1081471, 1101954, 1124406, 1148854, 1175333, 1204215, 1235793, 1269689, 1304835, 1340018, 1374487, 1408087, 1440780, 1472072, 1501008, 1526598, 1547978, 1564246, 1574664, 1579151, 1578089, 1571396, 1558146, 1537338, 1508713, 1472662, 1429875, 1381495, 1329209, 1274618, 1218641, 1161923, 1105575, 1051105, 999829, 952694, 910478, 873694, 842386]
50384H42386k6025k0830j5748j0950o223j069M386R238J2810J5249J6786J7137
50372H37147J6073J3998J1346P870L061k962r396j5257j9624k1943k2655k3109
50360G74549k4225k5427k5463k4001k1858j9864j8196j6743j5536j4642j3987
50349E54607j3374j2570j1363r821q326p135o090m948l779k740j731o81J48N86
50335D72783J102K361M321O267P672Q536Q909Q709Q123P713P869Q537R534J0743
50321E73179J1867J2507J2731J3095J3764J4088J3443J2231J1445J1452J1746
50310G11548J1786J1567J1308J1068J0837J0604J0153R182P818O692O144N805
50298H24512N213M500L924L043J121j691m321o119p589r450j1541j3173j4106
$$ y = [842386, 816361, 795531, 779783, 768833, 762610, 761541, 765927, 775165, 787975, 803224, 820010, 837147, 853220, 867218, 878564, 886434, 889495, 886533, 877137, 861880, 842256, 820313, 797658, 774549, 750324, 724897, 699434, 675433, 653575, 633711, 615515, 598772, 583236, 568594, 554607, 541233, 528663, 517300, 507479, 499153, 492018, 485928, 480980, 477201, 474461, 472730, 472049, 472197, 472783, 473885, 476246, 480567, 486834, 494506, 503042, 511951, 520660, 528783, 536496, 544365, 552902, 562436, 573179, 585046, 597553, 610284, 623379, 637143, 651231, 664674, 676905, 688350, 699802, 711548, 723334, 734901, 746209, 757277, 768114, 778718, 788871, 798053, 805871, 812563, 818707, 824512, 829725, 834225, 838149, 841192, 842313, 840622, 836301, 830182, 822593, 813143, 801602, 788429, 774323]
50285G74323j4638j4929j4853j4488j4210j4201j4203j3896j3282j2571j1888
50274F21164j1092r879q139o222m697l724k963k166j485r81k94P56J717K180K582
50259E76757L525M732N443N716O304P230P591P040O433O440O398N371L662K417
50245F55059K062K030J802J383P61l82k098l870n098n643n791n861n977o048n954
50230F16375n758n651n581n129m054k709j672j033m41K66Q83J351J960K946M123
50215E95876N101N648N686N175M238L264K606K246J878J270M43m72j393k227k944
50200F26395l696m724n944o843p066p050p631q985j0256j0597j0178r885j0105
50187E23435j0323r896q824p603o630n912n249m505l771l237k936k634k150j624
$$ y = [774323, 759685, 744756, 729903, 715415, 701205, 687004, 672801, 658905, 645623, 633052, 621164, 610072, 600193, 592054, 585832, 581135, 577411, 574448, 572282, 570797, 569816, 569522, 570278, 571995, 574175, 576757, 580282, 585014, 590457, 596173, 602477, 609707, 617298, 624338, 630771, 637211, 643609, 648980, 652642, 655059, 657121, 659151, 660953, 662336, 663097, 662715, 660617, 656747, 651649, 646006, 640215, 634354, 628377, 622329, 616375, 610617, 604966, 599385, 594256, 590202, 587493, 585821, 584788, 584347, 584613, 585496, 586847, 588807, 591753, 595876, 600977, 606625, 612311, 617486, 621724, 624988, 627594, 629840, 631718, 632988, 633431, 632959, 631566, 629339, 626395, 622699, 617975, 612031, 605188, 598122, 591072, 583441, 574456, 564200, 553603, 543425, 533540, 523435, 513112, 503216, 494392, 486789, 480159, 474247, 468998, 464493, 460722, 457485, 454549, 451915, 449765, 448141]
50173D48141j279j048p99q11j612l198m824n712n765n381m917m500m125l729l296
50158C97145l046l323m126m907n046m449l539k768k313k146k177k350k653k983
50144C51319l093k829k407k262k462k590k263j554q00j93K33M08K99N6l6K84J225
50127C33335K824M700O089O432N904N195M799M659M497M224L999L992M215M505
50113C99369M654M566M312M035L788L498L104K736K662K973L383L506L380L435
50099D49401L882M360M383L932L460L434M054N226O527P447P824P910P891P674
50085E27405P357P411P932Q181P494O338N770O084O740P357P969Q393Q311Q033
50071F30775Q268R041R709J0157J0938J1948J2229J1635J1572J3161J5578J7287
$$ y = [448141, 446862, 445814, 445015, 444204, 442592, 439394, 434570, 428858, 423093, 417712, 412795, 408295, 404170, 400441, 397145, 394099, 390776, 386650, 381743, 376697, 372248, 368709, 365941, 363628, 361482, 359305, 356955, 354302, 351319, 348226, 345397, 342990, 340728, 338266, 335676, 333413, 331859, 331059, 330866, 331099, 331507, 331806, 331862, 331826, 332110, 333335, 336159, 340859, 346948, 353380, 359284, 364479, 369278, 373937, 378434, 382658, 386657, 390649, 394864, 399369, 404023, 408589, 412901, 416936, 420724, 424222, 427326, 430062, 432724, 435697, 439080, 442586, 445966, 449401, 453283, 457643, 462026, 465958, 469418, 472852, 476906, 482132, 488659, 496106, 503930, 511840, 519731, 527405, 534762, 542173, 550105, 558286, 565780, 572118, 577888, 583972, 590712, 598069, 606038, 614431, 622742, 630775, 639043, 648084, 657793, 667950, 678888, 690836, 703065, 714700, 726272, 739433, 755011, 772298]
50059G72298J8166J9218K0702K1874K2403K2829K3478K3976K4141K4499K5512
50048A019096K6987K8604L0392L2312L3733L3975L3060L1525K9514K6522K2161
50037A347881J6957J2102Q393N726L713K510K560L662M892N506N404M468K003
50024A425777k666r355j7134k4986l2046l7567m1164m2955m3154m1826l9226l5991
50012A057707l2586k8929k4994k1413j8864j7259j6070j5205j4858j4752j4292
50001H38485j3515j3158j3707j4811j5744j6040j5682j5069j4785j4984j5110
49990F75880j4594j3623j2829j2368j1916j1349j0743r849q392o874o302o835
49978E50206p421p092n970m789l925l286k713k141j666j597k083k629k507j731
$$ y = [772298, 790464, 809682, 830384, 852258, 874661, 897490, 920968, 944944, 969085, 993584, 1019096, 1046083, 1074687, 1105079, 1137391, 1171124, 1205099, 1238159, 1269684, 1299198, 1325720, 1347881, 1364838, 1376940, 1385333, 1391059, 1394772, 1397282, 1399842, 1403504, 1408396, 1413902, 1419306, 1423774, 1425777, 1423111, 1413756, 1396622, 1371636, 1339590, 1302023, 1260859, 1217904, 1174750, 1132924, 1093698, 1057707, 1025121, 996192, 971198, 949785, 930921, 913662, 897592, 882387, 867529, 852777, 838485, 824970, 811812, 798105, 783294, 767550, 751510, 735828, 720759, 705974, 690990, 675880, 661286, 647663, 634834, 622466, 610550, 599201, 588458, 578609, 570217, 563343, 557041, 550206, 542785, 535693, 529723, 524934, 521009, 517723, 515010, 512869, 511203, 509606, 507523, 504894, 502387, 500656]
49964E00656j070r11q02l62M3J1j68q8M3j28l17j0O50J078J240J678K574L465
49946E07582L955M216M639N462O837Q755J0722J2042J2687J3551J5494J8390K1523
49933F45855K4669K8302L2742L7591M2200M6379N0307N3891N6468N7269N6024
49922A131697N3064M9005M4483M0126L6534L4122L2914L2592L2808L3359L3910
49911A554614L3567L1020K5359J6713O003n844j8166l0235m1085m9834n6052n9836
49899A406224o1696o2373o2432o1994o1031n9735n8260n6191n2925m8651m4353
49888G76583m0670l7375l4201l1406k9034k6373k2963j9542j7121j5520j3810
49877D88568j1919j0703j0376j0030r046q021p737p948p859p267o601o125n732
$$ y = [500656, 499586, 498675, 497873, 497511, 497554, 497565, 497397, 497309, 497352, 497224, 496907, 496897, 497547, 498625, 499865, 501543, 504117, 507582, 511537, 515753, 520392, 525854, 532691, 541446, 552168, 564210, 576897, 590448, 605942, 624332, 645855, 670524, 698826, 731568, 769159, 811359, 857738, 908045, 961936, 1018404, 1075673, 1131697, 1184761, 1233766, 1278249, 1318375, 1354909, 1389031, 1421945, 1454537, 1487345, 1520704, 1554614, 1588181, 1619201, 1644560, 1661273, 1667276, 1661432, 1643266, 1613031, 1571946, 1522112, 1466060, 1406224, 1344528, 1282155, 1219723, 1157729, 1096698, 1036963, 978703, 922512, 869587, 820936, 776583, 735913, 698538, 664337, 632931, 603897, 577524, 554561, 535019, 517898, 502378, 488568, 476649, 465946, 455570, 445540, 436494, 428473, 420736, 412788, 404929, 397662, 391061, 384936, 379204]
49864C79204n361n092m811m200l198k245j880k098k226j620n01J22m46j744k686
49849C41218k713k103j376q45o61p71q02m28J33L74K57K13L73M41M05P30J484
49832C35929J958J599Q74O74J150J722K045K399L129M138N115N986O939Q118R406
49817C91181J0536J1438J2289J3276J4434J5886J7990K0926K4276K7402L0162
49806E89796L2886L5686L8214M0039M0822M0146L7697L3753K9030K3981J8814
49795I60864J4262J1544J1163J2345J4006J5680J7023J7064J4711R716K522o458
49783A094442j6807k7548l7466m5817n2217n5988n6491n4163n0495m6667m2756
49772F08027l8480l4060k9898k5962k2090j8647j6165j4427j2580j0328q452p707
$$ y = [379204, 373843, 368751, 363940, 359740, 356542, 354297, 352417, 350319, 348093, 346473, 345972, 346094, 345648, 343904, 341218, 338505, 336402, 335026, 334181, 333520, 332749, 331947, 331519, 331652, 332026, 332283, 332496, 332869, 333310, 333715, 334445, 335929, 337887, 339486, 340360, 341034, 342184, 343906, 345951, 348350, 351479, 355617, 360732, 366718, 373657, 381775, 391181, 401717, 413155, 425444, 438720, 453154, 469040, 487030, 507956, 532232, 559634, 589796, 622682, 658368, 696582, 736621, 777443, 817589, 855286, 889039, 918069, 942050, 960864, 975126, 986670, 997833, 1010178, 1024184, 1039864, 1056887, 1073951, 1088662, 1098378, 1100900, 1094442, 1077635, 1050087, 1012621, 966804, 914587, 858599, 802108, 747945, 697450, 650783, 608027, 569547, 535487, 505589, 479627, 457537, 438890, 422725, 408298, 395718, 385390, 376938, 369231]
49760C69231p596o837m938k772j456j150j195j064p32l77j42j70m71p81p94m85
49744C38271J1P44J771K748L112K746K047J376P49J84j10LL79P82J057J087Q48
49727C57805N30K96M2l31n21j88M43Q38R24R94R27K96p00j278j208j047r89m64
49709C56369O76J561J587J366J628J945J576Q94Q79J530J963J849J706J792J719
49694C79040J266P49L71M1j21K40J036J717J995J991J660Q01k20n79r9M45M55
49677C90788K80M74R35J170R48K69p79j684j594k93J248J902J672J478J832K331
49661D00977K364J836J123O40M97M20J02k80j29O81J393J197K73n02p80r95j443
49644D07374j662j141j45N58N88K66J59N75J402K214K576K408K002J631J169L47
$$ y = [369231, 361635, 354798, 349860, 347088, 345632, 344482, 343287, 342223, 341491, 341114, 340972, 340802, 340331, 339550, 338756, 338271, 338282, 339026, 340797, 343545, 346657, 349403, 351450, 352826, 353575, 353759, 353649, 353652, 354031, 354813, 355870, 356957, 357805, 358335, 358631, 358673, 358342, 357821, 357633, 358076, 358914, 359838, 360832, 361759, 362055, 361355, 360077, 358869, 357822, 356833, 356369, 357045, 358606, 360193, 361559, 363187, 365132, 366708, 367602, 368481, 370011, 371974, 373823, 375529, 377321, 379040, 380306, 381055, 381426, 381467, 381346, 381586, 382622, 384339, 386334, 388325, 389985, 390786, 390566, 389987, 389888, 390333, 390788, 391068, 391542, 392477, 393647, 394595, 394864, 394085, 392401, 390807, 390514, 391762, 393664, 395336, 396814, 398646, 400977, 403341, 405177, 406300, 406940, 407437, 407857, 407959, 407679, 407550, 408231, 409624, 410821, 411094, 410592, 409812, 408817, 407374, 405712, 404571, 404426, 404984, 405572, 405838, 405997, 406572, 407974, 410188, 412764, 415172, 417174, 418805, 419974, 420321]
49628D20321p25j513j519p05N09J469J623R18k8m62j90L92R29J449J947K204K182
49611D28801K260K747L483M286N293O467P132O757N939N844O741P822Q492Q992
49597E11056R577R937R791R489R475R761J0193J0787J1411J1731J1840J2384J3588
49584F51020J4798J5516J6237J7614J9254K0303K0670K1009K1748K2967K4816
49573H65952K7101K8859K9384K9505L0639L2651L3994L4031L3912L4668L5805
49562A216501L6498L7004L7873L8703L8761L8291L8048L7863L6740L4252L0927
49551A621461K7299K3371J9036J4390R559M770N02l068o670j1165j6074j9712
49539A663699k1101k0940k0410j9766j8727j7506j6560j5698j4220j1931r272
$$ y = [420321, 419596, 418083, 416564, 415859, 416368, 417837, 419460, 420378, 420350, 419888, 419698, 420090, 421019, 422468, 424415, 426619, 428801, 431061, 433808, 437291, 441577, 446870, 453337, 460469, 467226, 473165, 479009, 485750, 493572, 502064, 511056, 520633, 530570, 540361, 549850, 559325, 569086, 579279, 590066, 601477, 613208, 625048, 637432, 651020, 665818, 681334, 697571, 715185, 734439, 754742, 775412, 796421, 818169, 841136, 865952, 893053, 921912, 951296, 980801, 1011440, 1044091, 1078085, 1112116, 1146028, 1180696, 1216501, 1252999, 1290003, 1327876, 1366579, 1405340, 1443631, 1481679, 1519542, 1556282, 1590534, 1621461, 1648760, 1672131, 1691167, 1705557, 1715116, 1719886, 1720388, 1717320, 1710650, 1699485, 1683411, 1663699, 1642598, 1621658, 1601248, 1581482, 1562755, 1545249, 1528689, 1512991, 1498771, 1486840, 1477568]
$$ [...]
##END NTUPLES=NMR SPECTRUM
##END=
