##TITLE=NES1093_RSB_9886830_fKTSD0sDcw
##JCAMPDX= 6.0         $$ Bruker NMR JCAMP-DX V2.0
##DATA TYPE= NMR SPECTRUM
##DATA CLASS= NTUPLES
##ORIGIN= BRUKER
##OWNER= Administrator
$$ 1.72 TOPSPIN		Version 2.1
$$ 2016-08-28 22:45:55.461 -0500  Administrator@X
$$ Compression mode = diff/dup
##.OBSERVE FREQUENCY= 400.02188249412
##.OBSERVE NUCLEUS= ^1H
##.ACQUISITION MODE= SIMULTANEOUS (DQD)
##.ACQUISITION SCHEME= undefined
##.AVERAGES= 64
##.DIGITISER RES= 22
##SPECTROMETER/DATA SYSTEM= spect
##.PULSE SEQUENCE= noesygpps1d.comp
##.SOLVENT NAME= COFFEE_meoh
##.SHIFT REFERENCE= INTERNAL, COFFEE_meoh, 1, 14.96246
##AUDIT TRAIL= $$ (NUMBER, WHEN, WHO, WHERE, PROCESS, VERSION, WHAT)
$$ ##TITLE= Audit trail, TOPSPIN		Version 2.1
$$ ##JCAMPDX= 5.01
$$ ##ORIGIN= Bruker BioSpin GmbH
$$ ##OWNER= Administrator
$$ $$ E:\/data/COFFEE/nmr/NES1093_RSB_9886830_fKTSD0sDcw/12/pdata/1/auditp.txt
$$ ##AUDIT TRAIL=  $$ (NUMBER, WHEN, WHO, WHERE, PROCESS, VERSION, WHAT)
(   1,<2016-08-28 22:45:50.351 -0500>,<Administrator>,<X>,<go>,<TOPSPIN 2.1>,
      <created by zg
	started at 2016-08-28 22:34:20.820 -0500,
	POWCHK enabled, PULCHK disabled,
       configuration hash MD5:
       21 0F 79 D6 B3 7B B4 F6 88 20 88 DB 03 48 BD 9F
       data hash MD5: 64K
       BE CF 33 32 E9 35 5B AD 15 9C DF 40 F9 FE 94 F4>)
(   2,<2016-08-28 22:45:53.461 -0500>,<Administrator>,<X>,<proc1d>,<TOPSPIN 2.1>,
      <Start of raw data processing
       efp LB = 0.3 FT_mod = 6 PKNL = 1 PHC0 = 0 PHC1 = 0 SI = 128K 
       data hash MD5: 128K
       8A A9 35 99 02 9F 29 E3 F2 8B EF 1B 28 99 FD 6E>)
(   3,<2016-08-28 22:45:54.320 -0500>,<Administrator>,<X>,<proc1d>,<TOPSPIN 2.1>,
      <pk PHC0 = -85.3418 PHC1 = 0 
       data hash MD5: 128K
       25 B5 9A C0 8A 6C 5E E4 AE 58 CB 65 89 31 FC 58>)
(   4,<2016-08-28 22:45:54.679 -0500>,<Administrator>,<X>,<proc1d>,<TOPSPIN 2.1>,
      <abs ABSG = 1 
       data hash MD5: 128K
       43 B9 45 E3 05 87 CD A2 BB B3 4C 1B 8A 4F DE 96>)
(   5,<2016-08-28 22:45:54.773 -0500>,<Administrator>,<X>,<proc1d>,<TOPSPIN 2.1>,
      <abs ABSG = 2 
       data hash MD5: 128K
       26 E9 6C 8C 63 27 77 90 B8 33 1D B4 54 7A E7 BC>)
(   6,<2016-08-28 22:45:54.851 -0500>,<Administrator>,<X>,<proc1d>,<TOPSPIN 2.1>,
      <abs ABSG = 3 
       data hash MD5: 128K
       A9 3C A8 F4 D7 14 83 2D 95 DA CF C4 C2 59 3E AC>)
(   7,<2016-08-28 22:45:54.945 -0500>,<Administrator>,<X>,<proc1d>,<TOPSPIN 2.1>,
      <abs ABSG = 4 
       data hash MD5: 128K
       24 ED 07 DF 94 22 7A 8C 1C 39 96 89 36 2A 70 5F>)
(   8,<2016-08-28 22:45:55.023 -0500>,<Administrator>,<X>,<proc1d>,<TOPSPIN 2.1>,
      <abs ABSG = 5 
       data hash MD5: 128K
       07 4C 40 A2 5C 3D B0 8F 40 35 30 A6 2E EA A0 95>)
$$ ##END=
$$ 
$$ $$ hash MD5
$$ $$ FD 5B 61 0F C1 43 6A B2 49 20 FD 68 71 59 94 4D
##$RELAX= 
##$RELAX= 
##$RELAX= 
##$RELAX= 
##$RELAX= 
##$RELAX= 
##$RELAX= 
##$RELAX= 
$$ Bruker specific parameters
$$ --------------------------
##$DU= <E:\>
##$EXPNO= 12
$$ [...]
##$TP07= 0
##$TPNAME0= <>
##$TPNAME1= <>
##$TPNAME2= <>
##$TPNAME3= <>
##$TPNAME4= <>
##$TPNAME5= <>
##$TPNAME6= <>
##$TPNAME7= <>
##$TPOAL= (0..7)
0.5 0.5 0.5 0.5 0.5 0.5 0.5 0.5
##$TPOFFS= (0..7)
0 0 0 0 0 0 0 0
##$TUNHIN= 0
##$TUNHOUT= 0
##$TUNXOUT= 0
##$USERA1= <user>
##$USERA2= <user>
##$USERA3= <user>
##$USERA4= <user>
##$USERA5= <user>
##$V9= 5
##$VALIST= <valist>
##$VCLIST= <CCCCCCCCCCCCCCC>
##$VD= 0
##$VDLIST= <DDDDDDDDDDDDDDD>
##$VPLIST= <PPPPPPPPPPPPPPP>
##$VTLIST= <TTTTTTTTTTTTTTT>
##$WBST= 2048
##$WBSW= 25
##$XGAIN= (0..3)
0 0 0 0
##$XL= 0
##$YL= 0
##$YMAX_a= 6652176
##$YMIN_a= -13646389
##$ZGOPTNS= <>
##$ZL1= 120
##$ZL2= 120
##$ZL3= 120
##$ZL4= 120
##$ABSF1= 14.96246
##$ABSF2= -5.595722
##$ABSG= 5
##$ABSL= 3
##$ALPHA= 0
##$AQORDER= 0
##$ASSFAC= 0
##$ASSFACI= 0
##$ASSFACX= 0
##$ASSWID= 0
##$AUNMP= <proc_prof1d_extract.lims>
##$AXLEFT= 0
##$AXNAME= <>
##$AXNUC= <1H>
##$AXRIGHT= 0
##$AXTYPE= 0
##$AXUNIT= <>
##$AZFE= 0.1
##$AZFW= 0.1
##$BCFW= 0
##$BC_mod= 0
##$BYTORDP= 0
##$COROFFS= 0
##$CY= 15
##$DATMOD= 1
##$DC= 0
##$DFILT= <>
##$DTYPP= 0
##$F1P= 0
##$F2P= 0
##$FCOR= 0.5
##$FTSIZE= 131072
##$FT_mod= 6
##$GAMMA= 0
##$GB= 0
##$INTBC= 1
##$INTSCL= 1
##$ISEN= 128
##$LB= 0.3
##$LEV0= 0
##$LPBIN= 0
##$MAXI= 10000
##$MC2= 0
##$MEAN= 0
##$ME_mod= 0
##$MI= 0
##$NCOEF= 0
##$NC_proc= -2
##$NLEV= 6
##$NOISF1= 0
##$NOISF2= 0
##$NSP= 0
##$NTH_PI= 0
##$NZP= 0
##$OFFSET= 14.96246
##$PC= 1
##$PHC0= -85.3418
##$PHC1= 0
##$PH_mod= 1
##$PKNL= yes
##$PPARMOD= 0
##$PPDIAG= 0
##$PPIPTYP= 0
##$PPMPNUM= 2147483647
##$PPRESOL= 1
##$PSCAL= 4
##$PSIGN= 0
##$PYNMP= <proc.py>
##$REVERSE= no
##$SF= 400.020009052452
##$SI= 131072
##$SIGF1= 0
##$SIGF2= 0
##$SINO= 400
##$SIOLD= 131072
##$SPECTYP= <>
##$SREGLST= <1H.CDCl3>
##$SSB= 0
##$STSI= 131072
##$STSR= 0
##$SW_p= 8223.68421052631
##$SYMM= 0
##$S_DEV= 0
##$TDeff= 65536
##$TDoff= 0
##$TI= <>
##$TILT= no
##$TM1= 0
##$TM2= 0
##$TOPLEV= 0
##$USERP1= <user>
##$USERP2= <user>
##$USERP3= <user>
##$USERP4= <user>
##$USERP5= <user>
##$WDW= 1
##$XDIM= 131072
##$YMAX_p= 409998100
##$YMIN_p= -12429
##$CURPLOT= <Network HP LaserJet P1505>
##$CURPRIN= <$Network HP LaserJet P1505>
##$DFORMAT= <normdp>
##$LAYOUT= <+/1D_H.xwp>
##$LFORMAT= <normlp>
##$PFORMAT= <normpl>
##$SURQMSG= 1
$$ End of Bruker specific parameters
$$ ---------------------------------
##NTUPLES= NMR SPECTRUM
##VAR_NAME=  FREQUENCY,     SPECTRUM/REAL,   SPECTRUM/IMAG
##SYMBOL=    X,             R,               I
##VAR_TYPE=  INDEPENDENT,   DEPENDENT,       DEPENDENT
##VAR_FORM=  AFFN,          ASDF,            ASDF
##VAR_DIM=   131072,        131072,          131072
##UNITS=     HZ,            ARBITRARY UNITS, ARBITRARY UNITS
##FACTOR=    0.0627417313425164, 1,          1
##FIRST=     8223.62146879497, -578,         -46105
##LAST=      0,             1871,            -46425
##MIN=       0,             -12429,          0
##MAX=       8223.62146879497, 409998100,    0
$$ Real data points
##PAGE= N=1
##DATA TABLE= (X++(R..R)), XYDATA
$$ [...]
63378C12840J2053J3214J3823J4349J5127J6232J7540J8668J9183J8967J8122
63367D90118J6504J3836J0343O801L695P84k253n005o621o736n870m944m541m611
63353E01500m798n067n856p485r589j1483j3020j4598j6326j7599j7785j6961
63341C60933j5705j4409j3167j2121j1515j1313j1048j0262r048p977p355o724
63329B30289n417l554k061j573j694j729j643j798k034j748q23J18M84K94p3k58
63313B06780MO90J315J401J129J062J264J243Q57N06L39j8o31q94m77J7j04o16
63295B13867q52o89m76k73J11N08N21J93m6r9k67n64m91K62J241J682J318N72
63277B16518N2K2L66R39J769K751L337K944J719N98L41Q51J570K225K841L344
$$ plain form
63378 312840 324893 338107 351930 366279 381406 397638 415178 433846 453029 471996 490118
63367 490118 506622 520458 530801 537602 541297 542081 539828 534823 528202 521466 515596 510652 506111 501500
63353 501500 496702 491635 485779 478294 468705 457222 444202 429604 413278 395679 377894 360933
63341 360933 345228 330819 317652 305531 294016 282703 271655 261393 252345 244368 237013 230289
63329 230289 224872 221318 219257 217684 215990 214261 212618 210820 208786 207038 206215 206333 206817 207111 207038 206780
63313 206780 206784 207474 208789 210190 211319 212381 213645 214888 215745 216251 216590 216572 215941 215047 214570 214587 214483 213867
63295 213867 213015 212326 211850 211577 211688 212196 212717 212910 212864 212765 212498 211934 211443 211705 212946 214628 215946 216518
63277 216518 216570 216592 216958 217897 219666 222417 225754 228698 230417 231015 231356 232207 233777 236002 238843 242187
63261B42187L527L383L118K923K868K952L135L458M094N033N693N381M248L286
63247B95286L107L276L282L504M572O186P379P759P772P920Q331R049R990J0633
63233C88046J0474R919J0054J1242J2560J2946J2458J2006J2151J2550J2535J1925
63221E28866J1228J1082J1533J1994J1921J1437J1067J1066J1182J0892R629P103
63209F59000L774P25j385l099n388q341j1163j3245j4547j5025j4509j3253j1865
63196E51679j0473q591o057l420j101J168L696O165Q097R579J1086J2933J5207
63183E89968J7848K0427K2229K2988K3229K3529K3806K3783K3668K3817K4053
63172H39345K3941K3539K3228K2920K2124K0792J9382J7887J5490J1535O404J044
$$ plain form
63261 242187 245714 249097 252215 255138 258006 260958 264093 267551 271645 276678 282371 287752 292000 295286
63247 295286 298393 301669 304951 308455 313027 319213 326592 334351 342123 350043 358374 367423 377413 388046
63233 388046 398520 408439 418493 429735 442295 455241 467699 479705 491856 504406 516941 528866
63221 528866 540094 551176 562709 574703 586624 598061 609128 620194 631376 642268 651897 659000
63209 659000 662774 663499 662114 659015 653627 645286 634123 620878 606331 591306 576797 563544 551679
63196 551679 541206 532615 526558 523138 522037 523205 526901 533066 541163 550742 561828 574761 589968
63183 589968 607816 628243 650472 673460 696689 720218 744024 767807 791475 815292 839345
63172 839345 863286 886825 910053 932973 955097 975889 995271 1013158 1028648 1040183 1046587 1047631
63160A047631m094r234j4573j9813k4419k8062l0688l2333l3054l2977l2274l1049
63148G55061k9364k7387k5407k3547k1619j9503j7510j5981j4619j2743j0359
63137E37022q463p779p736p174n861m552l738l102k396k004k194k408j972j178
63123D76465r00j256j373o49M85J350J930K506K850K544J876J664K176K860L242
63108D95770L483L819M042L977L837L743L358K551J955K167K760K867K474K268
63094E39071K311J934J088P50J441K254K065J178R12J799K969L298K584J509Q63
63079E66026R50J493J982K212K421K916L707M647N645O504O836O576O366O952
63065F25233Q203R173R317R237R887J1351J2815J3751J4624J6176J8248J9939
$$ plain form
63160 1047631 1043537 1034303 1019730 999917 975498 947436 916748 884415 851361 818384 786110 755061
63148 755061 725697 698310 672903 649356 627737 608234 590724 574743 560124 547381 537022
63137 537022 528559 520780 513044 505870 500009 495457 491719 488617 486221 484217 482023 479615 477643 476465
63123 476465 475565 474309 472936 472287 472772 474122 476052 478558 481408 483952 485828 487492 489668 492528 495770
63108 495770 499253 503072 507114 511091 514928 518671 522029 524580 526535 528702 531462 534329 536803 539071
63094 539071 541382 543316 544404 545154 546595 548849 550914 552092 553004 554803 557772 561070 563654 565163 566026
63079 566026 566976 568469 570451 572663 575084 578000 581707 586354 591999 598503 605339 611915 618281 625233
63065 625233 633436 642609 651926 661163 671050 682401 695216 708967 723591 739767 758015 777954
63053G77954K0909K1896K3530K5172K5707K5244K5114K6033K7166K7478K7183
63042A053386K7121K7175K6390K4592K2964K2716K3725K4945K5702K6142K6539
63031A331397K6634K5798K3619K0158J5638J0167L851k894r436j5364k0703k5587
63019A383278k9853l2991l4499l4319l2966l1123k8935k5844k1377j5949j0514
63008A084908n519o91M182Q845J3138J7387K1884K6411L0536L4033L6857L9119
62996A311090M1278M3775M6193M7490M7480M7299M7788M8169M7259M5279M3336
62985A816436M1524L8915L5206L0993K6143J9394J0117o34j1550k2601l4268m5979
62973A903696n6318o4453p0498p4654p6831p7107p5964p3952p1391o8377o4765
$$ plain form
63053 777954 798863 820759 844289 869461 895168 920412 945526 971559 998725 1026203 1053386
63042 1053386 1080507 1107682 1134072 1158664 1181628 1204344 1228069 1253014 1278716 1304858 1331397
63031 1331397 1358031 1383829 1407448 1427606 1443244 1453411 1457262 1454368 1444932 1429568 1408865 1383278
63019 1383278 1353425 1320434 1285935 1251616 1218650 1187527 1158592 1132748 1111371 1095422 1084908
63008 1084908 1079389 1078698 1082880 1091725 1104863 1122250 1144134 1170545 1201081 1235114 1271971 1311090
62996 1311090 1352368 1396143 1442336 1489826 1537306 1584605 1632393 1680562 1727821 1773100 1816436
62985 1816436 1857960 1896875 1932081 1963074 1989217 2008611 2018728 2018094 2006544 1983943 1949675 1903696
62973 1903696 1847378 1782925 1712427 1637773 1560942 1483835 1407871 1333919 1262528 1194151 1129386
62962A129386o0264n4965m9663m5265m1839l8509l4433k9710k5351k2359k0706
62951G06322j9312j7174j4545j2528j1570j0907r752q324p245o558o019n814o078
62938E70496o145n283m040l731m493m947m207l120k885l336l500l238l281l839
62924E14451m220l900l198k689k507k487k518k579k737l208m108n075n531n361
62910D64333m957m504l778k784k086k051k259k082j598j364j518j619j341r19
62896D31473q42j385k400l341l643l332l114l546m312m680m446l928l286k475
62882C86743j782j651j893j797j220q07r00j017q08p35j156j477j010j81Q6k09
62866C70186k87jl8o82j287j279r04o72p44j139j909k681k689j775q35p67j356
$$ plain form
62962 1129386 1069122 1014157 964494 919229 877390 838881 804448 774738 749387 727028 706322
62951 706322 687010 669836 655291 642763 631193 620286 610534 602210 594965 588407 582388 576574 570496
62938 570496 564351 559068 555028 551297 546804 541857 537650 534530 531645 528309 524809 521571 518290 514451
62924 514451 510231 506331 503133 500444 497937 495450 492932 490353 487616 484408 480300 475225 469694 464333
62910 464333 459376 454872 451094 448310 446224 444173 441914 439832 438234 436870 435352 433733 432392 431473
62896 431473 430631 429246 426846 423505 419862 416530 413416 409870 405558 400878 396432 392504 389218 386743
62882 386743 384961 383310 381417 379620 378400 377593 376693 375676 374868 374133 372977 371500 370490 370309 370395 370186
62866 370186 369899 369898 369860 369178 367891 366612 365708 365036 364292 363153 361244 358563 355874 354099 353264 352497 351141
62849C51141j745j601j240q65l81J58N16P34J072J468J552J253R61R59J121J291
62833C56394J550J958K344K571K657K458J656M74q1P74K412L261K534R76j46l89
62817C81403j43J60L37J84m95j408j788j165K7Q65R64Q34J201K106K877K972K623
62800C91554K557L244M597O272P848Q809Q815Q267Q215R308J1126J2841J4251
62787D97704J5674J7133J8401J9819K2247K5898K9811L2894L5074L7044L9268
62776G90967M1683M4019M5889M6772M6332M4694M2080L8297L3033K6423J8982
62765A219171J1029K567o273j5035k3072k9719l4524l7743m0302m2818m4751m5168
62753I13362m4149m2776m1634m0173l7773l4713l1653k8743k5860k3296k1511
$$ plain form
62849 351141 349396 347795 346555 345690 345309 345467 345983 346717 347789 349257 350809 352062 353023 353982 355103 356394
62833 356394 357944 359902 362246 364817 367474 369932 371588 372062 371981 372755 375167 378428 380962 381938 381792 381403
62817 381403 381260 381420 381757 381941 381446 380038 378250 377085 377112 377977 378941 379775 380976 383082 385959 388931 391554
62800 391554 394111 397355 401952 408224 416072 424881 433696 441963 450178 459486 470612 483453 497704
62787 497704 513378 530511 548912 568731 590978 616876 646687 679581 714655 751699 790967
62776 790967 832650 876669 922558 969330 1015662 1060356 1102436 1140733 1173766 1200189 1219171
62765 1219171 1230200 1232767 1226494 1211459 1188387 1158668 1124144 1086401 1046099 1003281 958530 913362
62753 913362 869213 826437 784803 744630 706857 672144 640491 611748 585888 562592 541081
62742E41081k0374j9245j7698j5789j3628j1180q582o282m783m335m774n392n137
62729D03882l468j092N76R11O85J008K060L203M029M659N129N166M835M876N962
62714D42421P834R694J1258J2947J5063J7391J9755K2451K5731K9240L2417L5280
62702F81482L8393M2160M6544N1441N6946O3010O9106P4386P8183Q0367Q1209
62691A363227Q0824P8694P4006O6575N7130M6412L4244K0020M033j2176k6993
62680A785996l9875n1187o1236o9666p5727p8953p9614p8616p6889p4815p2219
62669A027199o8706o4091n8670n3289m8815m5361m2216l8788l5246l1987k8873
62658E11157k5609k2479j9999j7974j5782j3507j1963j1408j1074j0324r429q807
$$ plain form
62742 541081 520707 501462 483764 467975 454347 443167 434585 428303 423520 419185 414411 409019 403882
62729 403882 400414 399322 399898 400809 401494 402502 404562 407765 411794 416453 421582 426748 431583 436459 442421
62714 442421 450255 459949 471207 484154 499217 516608 536363 558814 584545 613785 646202 681482
62702 681482 719875 762035 808579 860020 916966 979976 1049082 1123468 1201651 1282018 1363227
62691 1363227 1444051 1522745 1596751 1663326 1720456 1766868 1801112 1821132 1825165 1812989 1785996
62680 1785996 1746121 1694934 1633698 1564032 1488305 1409352 1329738 1251122 1174233 1099418 1027199
62669 1027199 958493 894402 835732 782443 733628 688267 646051 607263 572017 540030 511157
62658 511157 485548 463069 443070 425096 409314 395807 383844 372436 361362 351038 341609 332802
62646C32802q218p369o633o454o442n861m724l748l366l415l685m082m277l884
62632B60644l059k460k396k525k476k365k443k632k678k546k351k063j499n68
62618B28583O06J710K336K187J368M73K06Q03J824K589K807K827L181M051N200
62603B60751O349P384Q292R121J0015J1120J2397J3783J5411J7443J9585K1219
62591D12870K2151K2848K3742K4554K4573K3349K0913J7598J3899J0209O387J890
62579F24983l347q433j2326j4865j6648j8113j9286k0165k0768k0840k0094j8774
62567D31324j7469j6339j5037j3459j2022j0957r891q435o799n467m619m146m020
62554C02664m221m538m744m846m889m692m119l455l073k874k394j565q65o27n76
$$ plain form
62646 332802 324584 317215 310582 304128 297686 291825 287101 283353 279987 276572 272887 268805 264528 260644
62632 260644 257585 255125 252729 250204 247728 245363 242920 240288 237610 235064 232713 230650 229151 228583
62618 228583 229189 230899 233235 235422 236790 237263 237469 238272 240096 242685 245492 248319 251500 255551 260751
62603 260751 267100 274484 282776 291897 301912 313032 325429 339212 354623 372066 391651 412870
62591 412870 435021 457869 481611 506165 530738 554087 575000 592598 606497 616706 623093 624983
62579 624983 621636 613203 600877 586012 569364 551251 531965 511800 491032 470192 450098 431324
62567 431324 413855 397516 382479 369020 356998 346041 336150 327715 320916 315449 310830 306684 302664
62554 302664 298443 293905 289161 284315 279426 274734 270615 267160 264087 261213 258819 257254 256389 255762 255186
62539B55186k81K37O87J068J656K487L262L852M496N400O349P012P409P824Q417
62524C15061R202J0284J1832J3773J5866J8070K0538K3227K5827K8225L0737L3633
62512E56275L6696L9476M1780M3611M4702M4508M2671L9289L4677K8976K2109
62501I74770J4056N118m088j2846k0592k6930l1642l4796l6829l8248l9156l9229
62489G09588l8229l6407l4321l2316l0271k7799k4718k1388j8521j6508j5053
62478D14057j3655j2186j0787r403p946o722o136n963n538m697l892l247k352
62465C21533j235p09j139j623j154qQ16J131J594K512L533M471N496O487O954
62450C48659O811O531O346N917M956L626K099K75j759l475m470n017n726o856
$$ plain form
62539 255186 254905 255142 255829 256897 258553 261040 264302 268154 272650 278050 284399 291411 298820 306644 315061
62524 315061 324263 334547 346379 360152 376018 394088 414626 437853 463680 491905 522642 556275
62512 556275 592971 632447 674227 717838 762540 807048 849719 889008 923685 952661 974770
62501 974770 988826 993944 989856 977010 956418 929488 897846 863050 826221 787973 748817 709588
62489 709588 671359 634952 600631 568315 538044 510245 485527 464139 445618 429110 414057
62478 414057 400402 388216 377429 368026 360080 353358 347222 341259 335721 331024 327132 323885 321533
62465 321533 320298 319589 318450 316827 315673 315665 316481 317612 319206 321718 325251 329722 335218 341705 348659
62450 348659 355470 362001 368347 374264 379220 382846 384945 385220 383461 379986 375516 370499 364773 357917
62436C57917q122r040r333r093q600p865o644n124m192m476n242n059l567j844
62422B69716r36o98m00L13J452L044M857O179O473O052N717N922O607P552Q491
62407C30341R127R437R726J0138J0340J0079R664R413Q943P637N730M152L259
62394D37986K314N90j510k879l061k776l085m306n812o723o633n734m443l029
62380C90899j473M09K699N111P072Q296R279J1018J4110J8203K2399K6057K9163
62367E43242L2102L5153L8197M0910M3179M5184M6862M7489M6097M2324L6617
62356I97356K9742K2360J5081Q400K455k991q193j3286j8414k3639k8665l3011
62344I47195l6472l9086m0587m0495l8885l6557l4175l1690k8950k6299k4138
$$ plain form
62436 357917 349795 340755 331422 322329 313729 305864 299220 294096 289904 285428 280186 275127 271560 269716
62422 269716 268780 268082 267682 267995 269447 272491 277348 283527 290000 296052 301769 307691 314298 321850 330341
62407 330341 339468 348905 358631 368769 379109 389188 398852 408265 417208 424845 430575 434727 437986
62394 437986 440300 440890 439380 436501 433440 430664 427579 423273 417461 410738 404105 398371 393928 390899
62380 390899 389426 389835 392534 397645 404717 413013 422292 433310 447420 465623 488022 514079 543242
62367 543242 575344 610497 648694 689604 732783 777967 824829 872318 918415 960739 997356
62356 997356 1027098 1049458 1064539 1072939 1075394 1072403 1064210 1050924 1032510 1008871 980206 947195
62344 947195 910723 871637 831050 790555 751670 715113 680938 649248 620298 593999 569861
62333E69861k2229k0063j7654j5514j3923j2722j1685j0721r698q420o854n108
62321D15270l295j553j08R52J751K376K766L002L372L829L783K875J589O01j68
62306D37042j246k628l770m556n386o285o650o201n492n101m791l987k740j743
62292C76466j480j751j913j354J59K235L988M666M319L717L610M114M821N419
62278D07016O061P003Q032Q609Q748R363J1287J4096J6517J8002J9325K1337K3755
62265E79151K5709K7153K8980L1672L4379L5697L5078L3127L0576K7367K2935
62254I11824J7181J0854M867n06n587j0582j5244j9269k2741k6017k9188l1800
62242G83792l3191l3138l2144l0936k9627k7585k4338k0484j7289j5389j4172
$$ plain form
62333 569861 547632 527569 509915 494401 480478 467756 456071 445350 435652 427232 420378 415270
62321 415270 411975 410422 410314 411266 413017 415393 418159 421161 424533 428362 432145 435020 436609 437210 437042
62306 437042 435796 433168 429398 424842 419456 413171 406521 400320 394828 389727 384936 380949 378209 376466
62292 376466 374986 373235 371322 369968 370127 372362 376350 381016 385335 389052 392662 396776 401597 407016
62278 407016 413077 420080 428112 436721 445469 454832 466119 480215 496732 514734 534059 555396 579151
62265 579151 604860 632013 660993 692665 727044 762741 797819 830946 861522 888889 911824
62254 911824 929005 939859 944726 944220 938633 928051 912807 893538 870797 844780 815592 783792
62242 783792 750601 717463 685319 654383 624756 597171 572833 552349 535060 519671 505499
62231E05499j2637j0554q593p446p085o813n873m092k081q26q57j742k466k364
62217D32070j619q60m34j44L35R80J421J363R28N76P87J733L142M420N142N441
62201D55281N881O731P634Q135Q416R157J0666J2504J4154J5701J7525J9415K0421
62188F11621J9729J7520J4808J2503J0755R173P472N835M781M748N814P671R894
62175G42324J2293J4947J7894K0916K3745K6243K8118K8619K7047K3611J9385
62164I85142J5233J1241P426M353K463J186n14k813m947o452p786r478j1317j2769
62150I70968j3633j3912j3455j2313j1037j0125r371q316p147o494o447o445o193
62137H46080o060o229o162n373m288l776l964m107l569k431j048M21J851K831
$$ plain form
62231 505499 492862 482308 473715 466269 459184 452371 446498 442406 440325 439499 438642 436900 434434 432070
62217 432070 430451 429591 429157 429013 429348 430328 431749 433112 434040 434616 435403 437136 440278 444698 449840 455281
62201 455281 461162 467893 475527 483662 492078 501235 511901 524405 538559 554260 571785 591200 611621
62188 611621 631350 648870 663678 676181 686936 696109 703581 709416 714197 718945 724759 732430 742324
62175 742324 754617 769564 787458 808374 832119 858362 886480 915099 942146 965757 985142
62164 985142 1000375 1011616 1019042 1023395 1025858 1027044 1026530 1023717 1018770 1012318 1004532 995054 983737 970968
62150 970968 957335 943423 929968 917655 906618 896493 887122 878806 871659 865165 858718 852273 846080
62137 846080 840020 833791 827629 822256 817968 814192 810228 806121 802552 800121 799073 799494 801345 804176
62123H04176L033K724K636L269M517O018P592R246J0832J2034J2732J3295J4380
62110I06484J6329J8779K0849K1698K0990J8962J6238J3618J1875J1606J2998
62099A090426J5648J8615K0856K1780K1397K0034J8141J6416J5822J6919J9180
62088A295234K1415K3042K4620K6915K9772L2337L4145L5418L6328L6585L5994
62077A631805L5013L4297L3927L3554L3197L3407L4408L5398L5159L3292L0589
62066B004046K8027K5709K2989J9529J5825J2678J0410Q803P567O595N798M982
62054B172958L913K488Q53n60j251j042k53P04J749L010M439N806P114Q637J0500
62039B219065J2373J3746J4434J4658J4745J4737J4361J3441J2340J1656J1410
$$ plain form
62123 804176 807209 809933 812569 815838 820355 826373 833965 843211 854043 866077 878809 892104 906484
62110 906484 922813 941592 962441 984139 1005129 1024091 1040329 1053947 1065822 1077428 1090426
62099 1090426 1106074 1124689 1145545 1167325 1188722 1208756 1226897 1243313 1259135 1276054 1295234
62088 1295234 1316649 1339691 1364311 1391226 1420998 1453335 1487480 1522898 1559226 1595811 1631805
62077 1631805 1666818 1701115 1735042 1768596 1801793 1835200 1869608 1905006 1940165 1973457 2004046
62066 2004046 2032073 2057782 2080771 2100300 2116125 2128803 2139213 2148016 2155583 2162178 2167976 2172958
62054 2172958 2176871 2179359 2180212 2179652 2178401 2177359 2177106 2177810 2179559 2182569 2187008 2192814 2199928 2208565 2219065
62039 2219065 2231438 2245184 2259618 2274276 2289021 2303758 2318119 2331560 2343900 2355556 2366966
62028B366966J0844R400P607O476O120N590M226K489J192L67n47j647k279j903
62014B414901q96k73n75j221j068K61J881K703K787L229M715O692Q048Q182P263
61999B456629N826M458L475K618J250q29l110n073o768q364r492r612q814p764
61985B414430o934o262n576m913m321l724l166k973l497m638n735o102n797n662
61971B345130o310p286p685p511p658q485r255r353r281r742j0496j0908j1125
61958B230035j1671j2249j2041j1116j0458j0493j0513r861q804p898p205o505
61946B111221n731m794l518k072r57k30P22K297M083N563O945Q727J0838J2712
61932B145806J4045J5032J6023J7353J9297K1897K4924K8261L2087L6495M1327
$$ plain form
62028 2366966 2377810 2387210 2394817 2401293 2407413 2413003 2417229 2419718 2420910 2421277 2420730 2419083 2416804 2414901
62014 2414901 2414005 2413732 2413157 2411936 2410868 2411129 2413010 2415713 2418500 2421729 2426444 2433136 2441184 2449366 2456629
61999 2456629 2462455 2466913 2470388 2473006 2474256 2473427 2470317 2465244 2458476 2450112 2440620 2431008 2422194 2414430
61985 2414430 2407496 2401234 2395658 2390745 2386424 2382700 2379534 2376561 2373064 2368426 2362691 2356589 2350792 2345130
61971 2345130 2338820 2331534 2323849 2316338 2308680 2300195 2290940 2281587 2272306 2262564 2252068 2241160 2230035
61958 2230035 2218364 2206115 2194074 2182958 2172500 2162007 2151494 2141633 2132829 2124931 2117726 2111221
61946 2111221 2105490 2100696 2097178 2095106 2094149 2093919 2094641 2096938 2101021 2106584 2113529 2122256 2133094 2145806
61932 2145806 2159851 2174883 2190906 2208259 2227556 2249453 2274377 2302638 2334725 2371220 2412547
61921B412547M6773N3647O2474P2601Q2905R3368J05278J19798J36904J55876
61911C342171J76453J99097K24478K52967K84513L18668L54667L91363M26994
61902E971371M58821M83035M94807M88461M58252M00166L14004K04217P8910n1805
61892I300239j77278k87774l76430m40584m81173n00780n02272m89071m65538
61883E579339m36149m04051l70792l37282l04567k73609k44933k18863j95769
61874B793324j75714j58106j42068j27136j13403j01117r0448q1405p3606o6310
61864A664011n9028n2071m6118m1265l6881l2419k7972k3963k0636j7914j5483
61853A290261j2989j0439q307o918n891m692l594l367l951m337m043l833m406
$$ plain form
61921 2412547 2459320 2512967 2575441 2648042 2730947 2824315 2929593 3049391 3186295 3342171
61911 3342171 3518624 3717721 3942199 4195166 4479679 4798347 5153014 5544377 5971371
61902 5971371 6430192 6913227 7408034 7896495 8354747 8754913 9068917 9273134 9352044 9300239
61892 9300239 9122961 8835187 8458757 8018173 7537000 7036220 6533948 6044877 5579339
61883 5579339 5143190 4739139 4368347 4031065 3726498 3452889 3207956 2989093 2793324
61874 2793324 2617610 2459504 2317436 2190300 2076897 1975780 1885332 1803927 1730321 1664011
61864 1664011 1604983 1552912 1506794 1465529 1428648 1396229 1368257 1344294 1323658 1305744 1290261
61853 1290261 1277272 1266833 1258526 1251608 1245717 1241025 1237431 1234064 1230113 1225776 1221733 1217900 1213494
61840A213494n133m950l931l033k517j685j36J585K816L522L884L808L255K539
61826A213518J863R19n15j848k101j066L99J344J735K328L797O044Q344J0080
61812A244841J1439J3338J6483K0512K4243K6927K9042L1628L5111L9057M2971
61801A535592M6907N1182N5899O0959O6265P1732P7350Q3464R0633R8993J08134
61790B347110J17973J29300J42921J58683J76059J95435K17897K43791K72539
61781D001708L04107L39762L80804M27278M78446N33824N93005O54873P17542
61772H431349P78445Q33432Q75632Q95846Q84302Q32333P33854N87389L98161
61763A5250743J78449n4286k80528m82264o46356p66454q42417q78247q80449
$$ plain form
61840 1213494 1208361 1203411 1199480 1196447 1193930 1192245 1192109 1193694 1196510 1200032 1203916 1207724 1210979 1213518
61826 1213518 1215381 1216300 1215785 1213937 1211836 1210770 1211169 1212513 1214248 1216576 1220373 1226417 1234761 1244841
61812 1244841 1256280 1269618 1286101 1306613 1330856 1357783 1386825 1418453 1453564 1492621 1535592
61801 1535592 1582499 1633681 1689580 1750539 1816804 1888536 1965886 2049350 2139983 2238976 2347110
61790 2347110 2465083 2594383 2737304 2895987 3072046 3267481 3485378 3729169 4001708
61781 4001708 4305815 4645577 5026381 5453659 5932105 6465929 7058934 7713807 8431349
61772 8431349 9209794 10043226 10918858 11814704 12699006 13531339 14265193 14852582 15250743
61763 15250743 15429192 15374906 15094378 14612114 13965758 13199304 12356887 11478640 10598191
61754A0598191q57033q16015p63794p04986o43541n83148n26207m73286m24200
61745D805981l79238l38943l03280k71675k43645k18866j96834j76986j59155
61736B517359j43488j29874j17705j06288r5350q5178p6338o9071o2874n6958
61726A574235n1200m6273m2554l9338l5597l1352k7700k5535k4670k4234k3461
61715A202321k2032k0086j8144j6760j6055j5740j5560j5450j5189j4350j2835
61704A020120j1209j0246j0235j0873j1677j2269j2466j2288j1893j1407j0918
61693H94639j0632j0713j0888j0564r623q760q605q802q547p808p344p487p692
61680G77174p503p207p063o547n134l413k561k807l195k926k198j521r53m64l50
$$ plain form
61754 10598191 9741158 8925143 8161349 7456363 6812822 6229674 5703467 5230181 4805981
61745 4805981 4426743 4087800 3784520 3512845 3269200 3050334 2853500 2676514 2517359
61736 2517359 2373871 2243997 2126292 2020004 1924654 1839476 1763138 1694067 1631193 1574235
61726 1574235 1523035 1476762 1434208 1394870 1359273 1327921 1300221 1274686 1250016 1225782 1202321
61715 1202321 1180289 1160203 1142059 1125299 1109244 1093504 1077944 1062494 1047305 1032955 1020120
61704 1020120 1008911 998665 988430 977557 965880 953611 941145 928857 916964 905557 894639
61693 894639 884007 873294 862406 851842 842219 833459 824854 816052 807505 799697 792353 784866 777174
61680 777174 769671 762464 755401 748854 743720 740307 737746 734939 731744 728818 726620 725099 724146 723682 723332
61665G23332p02r06m09K64N4j126k155k116j343p08n24n67p50j159j582j687j575
61648G06341j662k006k255k358k692l280l426k640j471r00j117j455j392j006
61634F78681m62K88J154J784K058K326K916L739M611N539O395O732O287N421M595
61619G32064L657K135J13j678k656k954l091l366l669l728l495l349l735m496
61605G01752m898m589m199m541n419n820n281m443m161m562n198n677n813n464
61591F31687m609l548k721k332k189j874j156k00N89J101J688K662L816M721N386
61576F33021O230P459Q832J0059J1145J2230J3378J4567J5736J6909J8273J9923
61564G87762K1350K1708K0992K0435K0988K1897K1707K0442J9484J9318J8816
$$ plain form
61665 723332 722630 721724 721315 721579 721633 720507 718352 716236 714893 714185 713661 713094 712344 711185 709603 707916 706341
61648 706341 704679 702673 700418 698060 695368 692088 688662 686022 684551 683651 682534 681079 679687 678681
61634 678681 678219 678507 679661 681445 683503 685829 688745 692484 697095 702634 709029 715761 722048 727469 732064
61619 732064 735721 737856 737969 736291 733635 730681 727590 724224 720555 716827 713332 709983 706248 701752
61605 701752 696854 692265 688066 683525 678106 672286 667005 662562 658401 653839 648641 642964 637151 631687
61591 631687 627078 623530 620809 618477 616288 614414 613258 613058 613647 614748 616436 619098 622914 627635 633021
61576 633021 639251 646710 655542 665601 676746 688976 702354 716921 732657 749566 767839 787762
61564 787762 809112 830820 851812 872247 893235 915132 936839 957281 976765 996083 1014899
61553A014899J7214J5524J5002J5238J4890J3745J2825J2636J2407J1141Q734
61542A164255N793K969O32j192k756m365o163q180j0360j2370j3700j4155j4015
61529A086393j3493j2448j0910r358q078o600m424j943L9J474L126N481Q315J1309
61515A048883J4539J8118K1936K5916L0267L5221M0772M6738N2935N9328O6086
61504A460739P3503Q1755R0945J01346J13224J26182J39161J51442J63132J74116
61494B675545J82945J87401J85853J77444J61459J37676J07338P2908L6634O9
61484C925272l4988o6052r1078j09501j21892j29087j31963j31405j27996j21986
61474B859324j13928j04900r5759q6500p6794o6835n7253m8380m0044l1971k4072
$$ plain form
61553 1014899 1032113 1047637 1062639 1077877 1092767 1106512 1119337 1131973 1144380 1155521 1164255
61542 1164255 1170048 1173017 1173649 1172457 1169701 1165336 1159173 1150993 1140633 1128263 1114563 1100408 1086393
61529 1086393 1072900 1060452 1049542 1040184 1032106 1025506 1021082 1019139 1019178 1020652 1023778 1029259 1037574 1048883
61515 1048883 1063422 1081540 1103476 1129392 1159659 1194880 1235652 1282390 1335325 1394653 1460739
61504 1460739 1534242 1615997 1706942 1808288 1921512 2047694 2186855 2338297 2501429 2675545
61494 2675545 2858490 3045891 3231744 3409188 3570647 3708323 3815661 3888569 3925203 3925272
61484 3925272 3890284 3824232 3733154 3623653 3501761 3372674 3240711 3109306 2981310 2859324
61474 2859324 2745396 2640496 2544737 2458237 2381443 2314608 2257355 2208975 2168931 2136960 2112888
61463B112888j6359q923j939M485J0476J6212K1597K6306L0193L3479L6381L8661
61451B303457L9687L9153L7696L6471L6070L6020L5594L4779L4184L4191L4625
61440B701927L5130L5434L5306L4647L3765L3145L2846L2399L1305K9338K6338
61429C061580K2220J7273J2063O759J000n379j1711j6991k0796k3505k5714k7782
61417B989017k9825l1749l3127l3183l1299k7691k3536k0148j7899j6017j3519
61406B711024j0186o614l608j715j134j688k962m646o712r079j1367j3175j4433
61393B623705j5150j4985j3376j0033n103R70P623J4511K1987L0955M1860N4149
61381B737113O7107Q0788R5564J11173J26937J42621J58151J72699J84984J94495
$$ plain form
61463 2112888 2096529 2087606 2085667 2090152 2100628 2116840 2138437 2164743 2194936 2228415 2264796 2303457
61451 2303457 2343144 2382297 2419993 2456464 2492534 2528554 2564148 2598927 2633111 2667302 2701927
61440 2701927 2737057 2772491 2807797 2842444 2876209 2909354 2942200 2974599 3005904 3035242 3061580
61429 3061580 3083800 3101073 3113136 3119895 3120895 3115516 3103805 3086814 3066018 3042513 3016799 2989017
61417 2989017 2959192 2927443 2894316 2861133 2829834 2802143 2778607 2758459 2740560 2724543 2711024
61406 2711024 2700838 2694224 2690616 2688901 2687767 2686079 2683117 2678471 2671759 2662680 2651313 2638138 2623705
61393 2623705 2608555 2593570 2580194 2570161 2565058 2566028 2573651 2588162 2610149 2641104 2682964 2737113
61381 2737113 2804220 2885008 2980572 3091745 3218682 3361303 3519454 3692153 3877137 4071632
61371D071632K01315K04450K01430J90214J70854J44901J13841P8927M1988N443
61361E424995k8732n9638q7132j11262j32087j49764j64556j76558j85414j90468
61351D139384j91517j89232j84627j78210j69995j60206j49448j38241j26761
61342B651147j15101j03443r2017q1171p1239o2087n2976m3474l4129k5654j7849
61331A952007j0155k915L074Q100J3351J9050K4100K7942L1460L5416L9117M1536
61319B182083M2735M3309M3230M2203M0403L7926L4107K8563K2294J6694J1850
61308B545397P031K456p43k358l509m908n881n655m814m710o021q392j1236j4260
61294B482397j7389k0620k3945k7150k9732l1187l1486l1109l0545k9868k8876
$$ plain form
61371 4071632 4272947 4477397 4678827 4869041 5039895 5184796 5298637 5377564 5419552 5424995
61361 5424995 5396263 5336625 5249493 5138231 5006144 4856380 4691824 4515266 4329852 4139384
61351 4139384 3947867 3758635 3574008 3395798 3225803 3065597 2916149 2777908 2651147
61342 2651147 2536046 2432603 2340586 2259415 2188176 2126089 2073113 2029639 1995510 1969856 1952007
61331 1952007 1941852 1938937 1942011 1950111 1963462 1982512 2006612 2034554 2066014 2101430 2140547 2182083
61319 2182083 2224818 2268127 2311357 2353560 2393963 2431889 2465996 2494559 2516853 2533547 2545397
61308 2545397 2552428 2554884 2554141 2551783 2548274 2543366 2537485 2531830 2527016 2522306 2516285 2507893 2496657 2482397
61294 2482397 2465008 2444388 2420443 2393293 2363561 2332374 2300888 2269779 2239234 2209366 2180490
61283B180490k7550k6074k4396k2148j9251j6296j3885j1825r558p128n145l865
61271A993369l110l082m427p203j0616j4086j7813k1841k5369k7524k8193k7521
61259A802584k5221k1151j5986j0563m925J370Q452J6289K5143L4987M4849N3667
61247A909495O1531O9240P6806Q3343Q8424R2524R5810R7217R5122Q8506P7211
61236B835229O1481M1605J8005q294l5265o0288q1367r7795j09470j16030j17231
61225B330580j13912j07840j00619r3137q5901p9291p3418o8146o3305n8634n3706
61214A432671m8209m2223l5979k9614k3436j7973j3317q807l921Q86M750P342
61202A222170Q651Q382O494M037K357J681J296J011J288J945J969R57k35q14j160
$$ plain form
61283 2180490 2152940 2126866 2102470 2080322 2061071 2044775 2030890 2019065 2009507 2002379 1997234 1993369
61271 1993369 1990259 1987177 1982750 1975547 1964931 1950845 1933032 1911191 1885822 1858298 1830105 1802584
61259 1802584 1777363 1756212 1740226 1729663 1724738 1726108 1734560 1750849 1775992 1810979 1855828 1909495
61247 1909495 1971026 2040266 2117072 2200415 2288839 2381363 2477173 2574390 2669512 2758018 2835229
61236 2835229 2896710 2938315 2956320 2948026 2912761 2852473 2771106 2673311 2563841 2447811 2330580
61225 2330580 2216668 2108828 2008209 1915072 1829171 1749880 1676462 1608316 1545011 1486377 1432671
61214 1432671 1384462 1342239 1306260 1276646 1253210 1235237 1221920 1213113 1209192 1210078 1214828 1222170
61202 1222170 1230821 1239203 1245697 1249734 1252091 1253772 1255068 1256079 1257367 1259312 1261281 1262238 1262003 1261189 1260029
61187A260029k068l560n092o471p920r512j1126j2766j4534j6293j7655j8343
61175A134689j8457j8344j8270j8175j7798j7051j6130j5182j4091j2779j1433
61164I56979j0257r204q198p348o756o525p141r298j2947j6944k0186k2588k4526
61151G95061k5879k6300k5908k4927k3148k0507j7732j5532j3634j1548r731q883
61139E71332q482p411n781m698m267l317j279J026K775M047M979N322N368O139
61125E65753P991J0066J1577J2644J3394J3447J2969J3107J4455J6009J6510J5968
61113G23890J4945J3192J0110O064K215p23k781m182n202o207p163p443o781o005
61099G23929o186p323q501r049q926q319p515o975o917p020o916o708o589o393
$$ plain form
61187 1260029 1257961 1254401 1249309 1242838 1234918 1225406 1214280 1201514 1186980 1170687 1153032 1134689
61175 1134689 1116232 1097888 1079618 1061443 1043645 1026594 1010464 995282 981191 968412 956979
61164 956979 946722 937518 929320 921972 915216 908691 901550 892252 879305 862361 842175 819587 795061
61151 795061 769182 742882 716974 692047 668899 648392 630660 615128 601494 589946 580215 571332
61139 571332 562850 555439 549658 544960 540693 537376 536097 537123 539898 543945 548924 554246 559614 565753
61125 565753 573744 583810 595387 608031 621425 634872 647841 660948 675403 691412 707922 723890
61113 723890 738835 752027 762137 768201 770416 769693 766912 762730 757528 751321 744158 736715 729934 723929
61099 723929 717743 710420 701919 692870 683944 675625 668110 661135 654218 647198 640282 633574 626985 620592
61085F20592o027n918o401p004p023o535o198o211o135n649m898m099l282k440
61071E42772j656j005n62l75k87M7P67J625K339K822L000K765K337K213K572L065
61055E62439L383L618L851L928L815L726L720L691L943N019O753Q125Q534Q497
61041F33042Q785R476J0282J1076J1694J1971J2349J3663J5840J7766J8902K0079
61029G94925K1936K3734K4648K5282K6628K8440K9894L1308L3743L7214M0579
61018A118331M2942M4132M4110M3176M2600M3931M7574N2907N9642O8106P8248
61007A685699Q9206R9876J09537J18525J29064J44769J68403K00756K42424K95224
60997C283483L60291M36499N23536O25727P50518R05671J102906J359762J679057
$$ plain form
61085 620592 614565 608647 602246 595242 588219 581684 575486 569275 563140 557491 552593 548494 545212 542772
61071 542772 541116 540111 539549 539174 538887 538934 539701 541326 543665 546487 549487 552252 554589 556802 559374 562439
61055 562439 565822 569440 573291 577219 581034 584760 588480 592171 596114 601133 607886 616011 624545 633042
61041 633042 641827 651303 661585 672661 684355 696326 708675 722338 738178 755944 774846 794925
61029 794925 816861 840595 865243 890525 917153 945593 975487 1006795 1040538 1077752 1118331
61018 1118331 1161273 1205405 1249515 1292691 1335291 1379222 1426796 1479703 1539345 1607451 1685699
61007 1685699 1774905 1874781 1984318 2102843 2231907 2376676 2545079 2745835 2988259 3283483
60997 3283483 3643774 4080273 4603809 5229536 5980054 6885725 7988631 9348393 11027450
60988A1027450K008590K224407K180404J805950J172284M64991j15269m40220
60980B0328587m75341k58620J11663M76677O48983M94767J4058o53053j304687
60971A9383034j778559k008543k018525j880359j670044j441557j222598j024417
60963F338432q51979p06750n85951m84553l98992l27955k70495k25068j89954
60954B296735j63154j42119j24678j09980r7699q6904p6726o7356n9302n2122
60944A316695m5125l8819l4440l2354l1999l2907l4626l6034l6129l5374l4963
60933I23925l4832l3698l1178k8528k6845k5721k4204k2246k0527j9459j8915
60922F37772j8623j8333j7823j6994j5846j4415j2874j1563j0605r673q526p548
$$ plain form
60988 11027450 13036040 15260447 17440851 19246801 20419085 20884076 20768807 20328587
60980 20328587 19853246 19594626 19706289 20182966 20831949 21326716 21340774 20687721 19383034
60971 19383034 17604475 15595932 13577407 11697048 10027004 8585447 7362849 6338432
60963 6338432 5486453 4779703 4193752 3709199 3310207 2982252 2711757 2486689 2296735
60954 2296735 2133581 1991462 1866784 1756804 1659105 1572201 1495475 1428119 1368817 1316695
60944 1316695 1271570 1232751 1198311 1165957 1133958 1101051 1066425 1030391 994262 958888 923925
60933 923925 889093 855395 824217 795689 768844 743123 718919 696673 676146 656687 637772
60922 637772 619149 600816 582993 565999 550153 535738 522864 511301 500696 491023 482497 474949
60910D74949p184p120o633n692m975m773m565l848k806j930j419j220j230j293
60896D20261j191q37l29J80M61K68l05p00m93J07P14J381K305L203L751M356N655
60879D38787P349Q400Q459Q250Q310Q287P816P219O765O029M622K977J683N44
60865E25497r31k433l110k848k498k713l213l383l068k478j718q61k60l45j058
60850D94580j781j949j534p95K44J732L431M600M663L804K679J722J062R12J626
60835E14996L226N219P015Q396R438J0174J0500J0363R941R611R575R527Q880
60822F26861P493O045N367N516N788N564M828L875K973K402K365K651K647J929
60808F86304O58q14k431m313o269p817q723r312j0099j1163j1987j2018j1291
$$ plain form
60910 474949 467765 460645 454012 448320 443345 438572 434007 430159 427353 425423 424004 422784 421554 420261
60896 420261 419070 418233 417904 418084 418545 418813 418508 417808 417315 417422 418136 419517 421822 425025 428776 433132 438787
60879 438787 446136 454536 462995 471245 479555 487842 495658 502877 509642 515671 520293 523270 524953 525497
60865 525497 524566 522133 519023 516175 513677 510964 507751 504368 501300 498822 497104 496243 495983 495638 494580
60850 494580 492799 490850 489316 488521 488765 490497 493928 498528 503191 506995 509674 511396 512458 513370 514996
60835 514996 518222 523441 530456 538852 548290 558464 568964 579327 589268 598879 608454 617981 626861
60822 626861 634354 640399 645766 651282 657070 662634 667462 671337 674310 676712 679077 681728 684375 686304
60808 686304 686962 686148 683717 679404 673135 665318 656595 647283 637184 626021 614034 602016 590725
60795E90725j0369r644r009q246p404o552n452l967k490j482p39K71J378J748
60781E28768J186O70J194K518L567L700L165K527K138K072K208K443K908L777
60767E62841M743N058M500L892M185N282O245O536O412O201N869N486N546O430
60753F39226P875R257J0200J0654J0638J0194R483Q663P716O564N337M241L221
60740G43269J942L68q59r26J10J160J269P35O10J143J332K61j740l717n390p116
60724G32451q903j0250j0997j1537j2035j2075j1465j0790j0761j1337j1947j2211
60712E98143j2077j1515j0579r639r144r139r213q904p952o307m259k431j352
60699D95632q86l52Q10K530M269N532O308P041Q107R255R779R338Q280P043N554
$$ plain form
60795 590725 580356 570712 561703 553457 546053 539501 534049 530082 527592 526110 525371 525642 527020 528768
60781 528768 529954 530624 531818 534336 537903 541603 544768 547295 549433 551505 553713 556156 559064 562841
60767 562841 567584 572642 577142 581034 585219 590501 596746 603282 609694 615895 621764 627250 632796 639226
60753 639226 647101 656358 666558 677212 687850 698044 707527 716190 723906 730470 735807 740048 743269
60740 743269 745211 745579 744720 743794 743904 745064 746333 747068 747678 748821 750153 750414 748674 744957 739567 732451
60724 732451 723548 713298 702301 690764 678729 666654 655189 644399 633638 622301 610354 598143
60712 598143 586066 574551 563972 554333 545189 536050 526837 517933 509981 503674 499415 496984 495632
60699 495632 494746 494394 495204 497734 502003 507535 513843 520884 528991 538246 548025 557363 565643 572686 578240
60684E78240L597J427m79k126l914n925p777r222j0388j1345j1785j1424j0404
60671D98475r168q109p394o901o249n179l865k687j691o57L58R46R31O50N46P71
60655D50777J260J836K181K090J810J757J828J560R94P55R81R08J7j016j119j80
60639D66439J043J982K627L096L501M094M960N674N841N802O203O993P549P744
60625E33548Q151R033R837R979R641R472R827J0573J1324J1714J1705J1704J2073
60612F68581J2472J2133J0802R037P408N857L937J311k119o100r842j2407j3582
60599F87488j4034j4364j4452j3911j2712j1031q990o992n822n809o179n833m558
60586E62801l012j752q52l19j33Q8Q30J943K714K843K776K889K893K447J876J722
$$ plain form
60684 578240 581837 583264 582785 580659 576745 570820 563043 553821 543433 532088 520303 508879 498475
60671 498475 489307 481198 473804 466903 460654 455475 451610 448923 447232 446575 446933 447879 448810 449460 450006 450777
60655 450777 452037 453873 456054 458144 459954 461711 463539 465099 466093 466848 467829 468737 468754 467738 466619 466439
60639 466439 467482 469464 472091 475187 478688 482782 487742 493416 499257 505059 511262 518255 525804 533548
60625 533548 541699 550732 560569 570548 580189 589661 599488 610061 621385 633099 644804 656508 668581
60612 668581 681053 693186 703988 713025 720433 726290 730227 731538 729419 723319 713477 701070 687488
60599 687488 673454 659090 644638 630727 618015 606984 597994 591002 585180 579371 573192 567359 562801
60586 562801 559789 558037 557185 556866 556733 556821 557651 559594 562308 565151 567927 570816 573709 576156 578032 579754
60570E79754J829J528O86J2Q9N53N96O1m29l65N4M28Q02J373J893J905J615J882
60552E94266L187N092P055R281J2273J5912J9590K3158K7100L1711L6554M0835
60540H26014M3848M4896M3193L8208K9949J8900O006p232j9083k8349l4600l7683
60528I24067l7508l4595l0238k5537k0540j4932r234m567j339J023K985M302M857
60515G58744N268O169P329Q185Q911J0364J3145J7191K2071K7308L2567L8052
60503I55304M4639N3099O3330P4753Q7176J00530J14021J26466J37726J49043
60493A906087J61746J76382J93286K12879K34369K54334K67094K66355K46867
60484C919399K05943J44813O8558j5788j00799j78624k41178k82600l01949l02752
$$ plain form
60570 579754 581583 583111 583797 583809 583898 584451 585047 585108 584679 584314 584368 584796 585598 586971 588864 590769 592384 594266
60552 594266 597453 602545 609600 618881 631154 647066 666656 689814 716914 748625 785179 826014
60540 826014 869862 914758 957951 996159 1026108 1045008 1051014 1043782 1024699 996350 961750 924067
60528 924067 886559 851964 821726 796189 775649 760717 751483 746916 745577 746600 749585 753887 758744
60515 758744 764012 770181 777510 785695 794606 804970 818115 835306 857377 884685 917252 955304
60503 955304 999943 1053042 1116372 1191125 1278301 1378831 1492852 1619318 1757044 1906087
60493 1906087 2067833 2244215 2437501 2650380 2884749 3139083 3406177 3672532 3919399
60484 3919399 4125342 4270155 4338713 4322925 4222126 4043502 3802324 3519724 3217775 2915023
60474B915023k89989k68120k41283k13300j86531j61528j38411j17946j00877
60465A197038q6976p5457o5831n7894n1232m5367m0140l5585l1640k8302k5664
60454F52950k3568k1539j9416j7649j6544j5626j4247j2516j1114j0328r809r135
60442D71459q148o794n161l686k873k681k545k137j810k121l062m071m720n193
60428D16457n899o720o876n700l367o91J670L471M518M563L652K261Q87j76o68
60413D07382l57N96J656K487L229M077M906N516N886N956N518M632L828L581L784
60398D62677M052M293M652N085N340N271M963M599M287L940L291K258J285R78
60384E16971J373J947K428K999L627L750L034J849O37o71k130l300l865m210m737
$$ plain form
60474 2915023 2625034 2356914 2115631 1902331 1715800 1554272 1415861 1297915 1197038
60465 1197038 1110062 1034605 968774 910880 859648 814281 774141 738556 706916 678614 652950
60454 652950 629382 607843 588427 570778 554234 538608 524361 511845 500731 490403 480594 471459
60442 471459 463311 456517 451356 447670 444797 442116 439571 437434 435624 433503 430441 426370 421650 416457
60428 416457 410558 403838 396962 391262 387895 387204 388874 392345 396863 401426 405078 407339 408226 408050 407382
60413 407382 407025 407621 409277 411764 414993 419070 423976 429492 435378 441334 446852 451484 455312 458893 462677
60398 462677 466729 471022 475674 480759 486099 491370 496333 500932 505219 509159 512450 514708 515993 516971
60384 516971 518344 520291 522719 525718 529345 533095 536129 537978 538615 537944 535814 532514 528649 524439 519702
60369E19702n014m407l180k176j546p14N21J629K192K416K591K770L118M005N363
60354E27270O471O694O155N424M826M369M068M010M039L617K205r0k406l877m478
60339E68297m811n095m933m187l380k884k336j442p24p01q92m95K82N76L11K50
60323E37836O63J025J072J210J538J564J218J233K002K843K961K474J876J207
60309E60722L60k85l41j61m08j101j706k004k253k583k766k673k498k473k664
60294E37166l071l653m219m482m292l699k798j639k37J364K935L976M077L484
60280E24912L028L235L732L845L547L478L986M622M716M277M007M505N627O698
60266E84215P221P178O796O337O145O548P486Q520R397J0295J1268J1963J2253
$$ plain form
60369 519702 514688 510281 507101 504925 503379 502665 503186 504815 507007 509423 512014 514784 517902 521907 527270
60354 527270 533741 540435 546590 552014 556840 561209 565277 569287 573326 576943 579148 579058 576652 572775 568297
60339 568297 563486 558391 553458 549271 545891 543007 540671 539229 538505 537804 536912 536417 536699 537275 537586 537836
60323 537836 538499 539524 540596 541806 543344 544908 546126 547359 549361 552204 555165 557639 559515 560722
60309 560722 561082 560797 560456 560295 559887 558786 557080 555076 552823 550240 547474 544801 542303 539830 537166
60294 537166 534095 530442 526223 521741 517449 513750 510952 509313 509076 510440 513375 517351 521428 524912
60280 524912 527940 531175 534907 538752 542299 545777 549763 554385 559101 563378 567385 571890 577517 584215
60266 584215 591436 598614 605410 611747 617892 624440 631926 640446 649843 660138 671406 683369 695622
60253F95622J2725J3889J5298J6255J7162J9079K1975K4540K6107K7714L0558
60242I20924L4297L7812M1019M4890M9866N5297O0537O5771P1448P7438Q3151
60231A542450Q8100R1969R4321R4648R2811Q9129Q3930P7127O8538N8547M8085
60220B429655L7736K7229J6154M893n630j4974k3268l0353l5456l7996l8193l6570
60208B293227l3347k8646k2934j6863j0772m522K378J0494J9967L0240M0583N0900
60196B330705O1518P2177Q1893Q9931R6148J00178J01176R8931R4304Q7869P8868
60185C293698O6487N1602L6162K1078N830r997k5780m0565n3776o4925p3444p9106
60173C127264q2035q2078p8846p2619o4612n5910m6552l6015k4209j1628J162
$$ plain form
60253 695622 708347 722236 737534 753789 770951 790030 812005 836545 862652 890366 920924
60242 920924 955221 993033 1034052 1078942 1128808 1184105 1244642 1310413 1381861 1459299 1542450
60231 1542450 1630550 1722519 1816840 1911488 2004299 2093428 2177358 2254485 2323023 2381570 2429655
60220 2429655 2467391 2494620 2510774 2515667 2510037 2495063 2471795 2441442 2405986 2367990 2329797 2293227
60208 2293227 2259880 2231234 2208300 2191437 2180665 2176143 2178521 2189015 2208982 2239222 2279805 2330705
60196 2330705 2392223 2464400 2546293 2636224 2732372 2832550 2933726 3032657 3126961 3214830 3293698
60185 3293698 3360185 3411787 3447949 3469027 3474857 3464860 3439080 3398515 3344739 3279814 3206370 3127264
60173 3127264 3045229 2963151 2884305 2811686 2747074 2691164 2644612 2608597 2584388 2572760 2573922
60162B573922J3735K5735L6929M7211N6330O3648O8318O9736O7802O2964N6040
60151C142370M7723L8183K7316J5408L320q012j7927k5812l0989l3149l2708l0431
60139C095292k6712k1379j4065m644O558J8858L1611M4602N8062P2331Q7611J04058
60127C452183J21793J40707J60397J80411K00354K19682K37694K53859K67923
60118E235003K79367K87010K89504K86162K77071K62515K42684K17968J89052
60109G566336J56531J20613Q1537M0118k409m4948q6679j26620j63403j95690
60099G345386k22511k43042k56285k61525k59099k50331k36545k18440j96696
60090E200912j72746j48422j24766j01595p8343n4986l2057r997J1110L1167M9625
$$ plain form
60162 2573922 2587657 2613392 2650321 2697532 2753862 2817510 2885828 2955564 3023366 3086330 3142370
60151 3142370 3190093 3228276 3255592 3271000 3274320 3266308 3248381 3222569 3191580 3158431 3125723 3095292
60139 3095292 3068580 3047201 3033136 3028492 3035050 3053908 3085519 3130121 3188183 3260514 3348125 3452183
60127 3452183 3573976 3714683 3875080 4055491 4255845 4475527 4713221 4967080 5235003
60118 5235003 5514370 5801380 6090884 6377046 6654117 6916632 7159316 7377284 7566336
60109 7566336 7722867 7843480 7925017 7965135 7962726 7917778 7831099 7704479 7541076 7345386
60099 7345386 7122875 6879833 6623548 6362023 6102924 5852593 5616048 5397608 5200912
60090 5200912 5028166 4879744 4754978 4653383 4575040 4520054 4487997 4478000 4489110 4520277 4569902
60079D569902O5505P7796Q5847Q9433Q8458Q2743P2235N7451L9597K0111K14j9142
60067E230150l7120n3148o7177p9587r0744j00810j09850j17809j24232j28414
60057D321259j30032j29421j26894j22168j14876j05421r4682q2936o9784n5324
60047C289721m0617k6675j3510o48J2064K4748L7994N2167O6399P9195Q9884R8679
60035C669401J05322J08652J07721J02489R3201P9946O3360M4923K5830O124j4434
60024D392535l5176n4958p3297r0145j04731j15579j21847j23879j22378j17688
60014C432857j10187j00642q9744p7635o4386n0604l7089k3977j0706L089J6989
60003B887965L0263M2830N5486O9130Q3902R9110J13820J27250J38606J46873
$$ plain form
60079 4569902 4635407 4713203 4799050 4888483 4976941 5059684 5131919 5189370 5228967 5249078 5249292 5230150
60067 5230150 5193030 5139882 5072705 4993118 4902374 4801564 4691714 4573905 4449673 4321259
60057 4321259 4191227 4061806 3934912 3812744 3697868 3592447 3497765 3414829 3345045 3289721
60047 3289721 3249104 3222429 3208919 3208271 3220335 3245083 3283077 3335244 3401643 3480838 3570722 3669401
60035 3669401 3774723 3883375 3991096 4093585 4186786 4266732 4330092 4375015 4400845 4406969 4392535
60024 4392535 4357359 4302401 4229104 4138959 4034228 3918649 3796802 3672923 3550545 3432857
60014 3432857 3322670 3222028 3132284 3054649 2990263 2939659 2902570 2878593 2867887 2870976 2887965
60003 2887965 2918228 2961058 3016544 3085674 3169576 3268686 3382506 3509756 3648362 3795235
59993C795235J51051J50528J45132J34949J20355J02173Q1595N9763L7367J4550
59983D792698q756l2372n5574p7269r6342j11873j23128j29590j30981j27258
59973C899555j18764j06534r2168p6983o1439m5769l0812j7456n327O912J9696
59962C370911L1881M2496N2273O2505P2984Q2073Q8593R2628R4455R3701Q9864
59951D174364Q3052P3894O3195N1791M0218K8440J6321M561n408j2656j7348j9864
59939D480560j9734j5936p839M499K0624L9864O1421Q4794J10087J37534J66806
59928E062680J97026K27317K56876K84514L08594L27571L40238L45146L40124
59919G690086L22772K91580K46527J88935J21266M7142k8891j02145j68507k24671
$$ plain form
59993 3795235 3946286 4096814 4241946 4376895 4497250 4599423 4681018 4740781 4778148 4792698
59983 4792698 4783942 4751570 4695996 4618727 4522385 4410512 4287384 4157794 4026813 3899555
59973 3899555 3780791 3674257 3582089 3505106 3443667 3397898 3367086 3349630 3344303 3351215 3370911
59962 3370911 3402792 3445288 3497561 3560066 3633050 3715123 3803716 3896344 3990799 4084500 4174364
59951 4174364 4257416 4331310 4394505 4446296 4486514 4514954 4531275 4535836 4530428 4517772 4500424 4480560
59939 4480560 4460826 4444890 4437051 4441550 4462174 4502038 4563459 4648253 4758340 4895874 5062680
59928 5062680 5259706 5487023 5743899 6028413 6337007 6664578 7004816 7349962 7690086
59919 7690086 8012858 8304438 8550965 8739900 8861166 8908308 8879417 8777272 8608765 8384094
59909H384094k68369k98840l16978l24415l22407l11860k94239k71820k46738
59900E728428k20181j92644j64540j36224j07860p9736n2482k6599j893K2212
59890D768481M5842O8506Q9635J08985J26320J40938J51505J56413J54417J45032
59880E956074J28213J03835P1984L3898p918n0799r2684j31527j64778j90400
59870E655898k08115k18799k22886k20258k11673j99118j84458j68536j52024
59861C870031j36312j22828j11926j03066r5831r0117q5540q1331p6892p2045
59851B894143o6678o0466n3134m4810l6030k7509j9885j3587q839n813m713n570
59839B547109q036j1597j6013k1504k8219l5528m1898m5697m6220m3962l9983
$$ plain form
59909 8384094 8115725 7816885 7499907 7175492 6853085 6541225 6246986 5975166 5728428
59900 5728428 5508247 5315603 5151063 5014839 4906979 4827243 4774761 4748162 4746269 4768481
59890 4768481 4814323 4882829 4972464 5081449 5207769 5348707 5500212 5656625 5811042 5956074
59880 5956074 6084287 6188122 6260106 6294004 6286086 6235287 6142603 6011076 5846298 5655898
59870 5655898 5447783 5228984 5006098 4785840 4574167 4375049 4190591 4022055 3870031
59861 3870031 3733719 3610891 3498965 3395899 3300068 3209951 3124411 3043080 2966188 2894143
59851 2894143 2827465 2766999 2713865 2669055 2633025 2605516 2585631 2572044 2563205 2557392 2552679 2547109
59839 2547109 2539073 2527476 2511463 2489959 2461740 2426212 2384314 2338617 2292397 2248435 2208452
59828B208452l5199l0315k6049k3001k1289k0469j9838j8711j6444j2505o752
59817A977880L30P831J4974K1646K8292L5229M2014M7680N1526N3415N3339N1088
59805B385244M6641M0542L3566K6165J8542J1196M976O33j602j978q79J597N764
59792B570407J1887J9537K7826L6483M6311N8302P2602Q8777J06758J27008J49912
59781C315810J75459K03356K33028K63486K93256L19813L38335L41369L21039
59772E804951K72804J98036J04119K738r3002j72172k28775k61898k73918k68925
59762E083958k52044k28426k01830j74335j47434j22640j00751q1398o3903m8208
59752C662989l4464k2256j0876q9R933J9413K9058L9380N0272O1399P2810Q4926
$$ plain form
59828 2208452 2173253 2142938 2116889 2093888 2072599 2052130 2032292 2013581 1997137 1984632 1977880
59817 1977880 1978210 1986041 2001015 2022661 2050953 2086182 2128196 2175876 2227402 2280817 2334156 2385244
59805 2385244 2431885 2472427 2505993 2532158 2550700 2561896 2566872 2567505 2565903 2563925 2563046 2564643 2570407
59792 2570407 2582294 2601831 2629657 2666140 2712451 2770753 2843355 2932132 3038890 3165898 3315810
59781 3315810 3491269 3694625 3927653 4191139 4484395 4804208 5142543 5483912 5804951
59772 5804951 6077755 6275791 6379910 6382648 6289646 6117474 5888699 5626801 5352883 5083958
59762 5083958 4831914 4603488 4401658 4227323 4079889 3957249 3856498 3775100 3711197 3662989
59752 3662989 3628525 3606269 3595393 3595304 3605237 3624650 3653708 3693088 3743360 3804759 3877569 3962495
59740C962495R7964J11603J25437J39687J55144J72317J91054K11280K33567K58408
59730E658956K85354L13588L43061L74149M06280M37745M66785M91917N11065
59721I288900N21584N21638N10876M89642M58813M21112L81517L45229L15668
59712A3254979K94929K84915K86535K98181L16368L37881L60168L79894L92609
59703A6206459L94579L84181L61089L25044K76240K16604J49993Q1024J3888m8067
59693A8361034j02139j45994j77634j95690j99715j90145j68109j35188r3071
59684A6953349m3077J3873P6717J43929K14083K86493L60808M36048N10386N81603
59674A9534212O47040P02894P44089P65096P60535P25123O54090N44942L99385
$$ plain form
59740 3962495 4060459 4172062 4297499 4437186 4592330 4764647 4955701 5166981 5400548 5658956
59730 5658956 5944310 6257898 6600959 6975108 7381388 7819133 8285918 8777835 9288900
59721 9288900 9810484 10332122 10842998 11332640 11791453 12212565 12594082 12939311 13254979
59712 13254979 13549908 13834823 14121358 14419539 14735907 15073788 15433956 15813850 16206459
59703 16206459 16601038 16985219 17346308 17671352 17947592 18164196 18314189 18395213 18409101 18361034
59693 18361034 18258895 18112901 17935267 17739577 17539862 17349717 17181608 17046420 16953349
59684 16953349 16910272 16924145 17000862 17144791 17358874 17645367 18006175 18442223 18952609 19534212
59674 19534212 20181252 20884146 21628235 22393331 23153866 23878989 24533079 25078021 25477406
59665B5477406K23747K8025j75310l72410n49835o96934q07408q79109r12824
59656B1335348r11552q80512q26950p59199o85807o15560n57815n21547n12691
59647A5063715n31372n71130o20788o67840p01761p16270p10122o86357o50273
59638I207802o07061n60458n12883m66165m21693l80086l41335l05621k73533
59629E338967k45293k20178j97226j76170j57232j40198j24344j09259r5113q2096
59619C791858p0171n9486n0408m2914l6522l1175k7627k6503k7418k9553l2816
59608C357265l7741m4290n1373n7748o2956o7130p0165p1557p1044o9064o6299
59597B687898o2910n8627n3546m8380m3593l8758l3255k7275k1551j6280j1066
$$ plain form
59665 25477406 25701153 25729178 25553868 25181458 24631623 23934689 23127281 22248172 21335348
59656 21335348 20423796 19543284 18716334 17957135 17271328 16655768 16097953 15576406 15063715
59647 15063715 14532343 13961213 13340425 12672585 11970824 11254554 10544432 9858075 9207802
59638 9207802 8600741 8040283 7527400 7061235 6639542 6259456 5918121 5612500 5338967
59629 5338967 5093674 4873496 4676270 4500100 4342868 4202670 4078326 3969067 3873954 3791858
59619 3791858 3721687 3662201 3611793 3568879 3532357 3501182 3473555 3447052 3419634 3390081 3357265
59608 3357265 3319524 3275234 3223861 3166113 3103157 3036027 2965862 2894305 2823261 2754197 2687898
59597 2687898 2624988 2566361 2512815 2464435 2420842 2382084 2348829 2321554 2300003 2283723 2272657
59586B272657n858j174K839O692J0583J3790J5666J6705J7978J9756K1326K2098
59574B413058K2310K2566K3084K3704K4441K5784K8344L2201L6842M1830M7362
59563B741526N3855O1172O8709P6218Q4154R3089J03164J14068J25346J36693
59553C657994J48276J60543J73324J85389J95563K03972K11169K16332K17659
59544E370221K14837K09503K02419J91424J73507J48297J18549Q7828N8753L2864
59534F808202J0572q918k6692m2816n6536o7448p5708q1061q2532p9108p0124
59523F227831n5210l4731j0254J6481M5154P6454J09792J42358J70906J93505
59513F882286K08850K14797K08851J89981J59112J17862O7634J0229n1361j13340
$$ plain form
59586 2272657 2266799 2265625 2268464 2275156 2285739 2299529 2315195 2331900 2349878 2369634 2390960 2413058
59574 2413058 2435368 2457934 2481018 2504722 2529163 2554947 2583291 2615492 2652334 2694164 2741526
59563 2741526 2795381 2856553 2925262 3001480 3085634 3178723 3281887 3395955 3521301 3657994
59553 3657994 3806270 3966813 4140137 4325526 4521089 4725061 4936230 5152562 5370221
59544 5370221 5585058 5794561 5996980 6188404 6361911 6510208 6628757 6716585 6775338 6808202
59534 6808202 6818774 6809856 6783164 6740348 6683812 6616364 6540656 6459595 6377063 6297955 6227831
59523 6227831 6172621 6137890 6127636 6144117 6189271 6265725 6375517 6517875 6688781 6882286
59513 6882286 7091136 7305933 7514784 7704765 7863877 7981739 8049373 8059602 8008241 7894901
59503G894901j72129k24861k69222l03353l26122l37283l37428l27965l11145
59494E285393k89600k65383k39554k12828j86398j61626j39050j18130r8088p8559
59484C496177n9487m0876k2874n665J0866K7117M3296N9397P5628R2356J09430
59473C785365J26052J41492J55487J67742J77556J84131J86685J84100J75186
59464E283796J59589J37883J10503P7494L9745m81m0916q0382j17808j51053j77877
59453E240493j97652k11146k19117k22099k20971k16533k08732j97550j84477
59444C362216j71748j60109j48458j35951j23278j11539j00892r0915q1519p2873
59434B164934o4898n7357n0168m3391l7125l1417k6057k0592j4982r913n914k433
$$ plain form
59503 7894901 7722772 7497911 7228689 6925336 6599214 6261931 5924503 5596538 5285393
59494 5285393 4995793 4730410 4490856 4278028 4091630 3930004 3790954 3672824 3574736 3496177
59484 3496177 3436690 3395814 3372940 3367275 3378141 3405258 3448554 3507951 3583579 3675935 3785365
59473 3785365 3911417 4052909 4208396 4376138 4553694 4737825 4924510 5108610 5283796
59464 5283796 5443385 5581268 5691771 5769265 5809010 5808529 5767613 5687231 5569423 5418370 5240493
59453 5240493 5042841 4831695 4612578 4390479 4169508 3952975 3744243 3546693 3362216
59444 3362216 3190468 3030359 2881901 2745950 2622672 2511133 2410241 2319326 2237807 2164934
59434 2164934 2100036 2042679 1992511 1949120 1911995 1880578 1854521 1833929 1818947 1809034 1803120 1800687
59422A800687J439N619R369J2798J6786K1123K3816K2882J8205J1342M312j055
59410A947323l505k936k59L763R209J6149K3562K9541L2401L1579K7930K3413
59398B138170K0108J9081K0380K3875K9561L6978M5196N3643O2504P2006Q1934
59387B603436R2157J03036J15015J28265J42970J59454J77743J97621K19354K43746
59377D182797K71164L01063L32785L66022L99921M32232M59987M80637M92226
59368G718834M93259M83264M63293M35369M01671L64573L26821K90891K58217
59359A1236192K29392K04523J82701J61552J38251J10963P8800M0628n050n8903
59349A2319049j19910j85723k53235l18819l78740m29965m70472m98933n14666
$$ plain form
59422 1800687 1802126 1807745 1817114 1829912 1846698 1867821 1891637 1914519 1932724 1944066 1948378 1947323
59410 1947323 1943818 1940882 1940623 1944386 1953595 1969744 1993306 2022847 2055248 2086827 2114757 2138170
59398 2138170 2158278 2177359 2197739 2221614 2251175 2288153 2333349 2386992 2449496 2521502 2603436
59387 2603436 2695593 2798629 2913644 3041909 3184879 3344333 3522076 3719697 3939051 4182797
59377 4182797 4453961 4755024 5087809 5453831 5853752 6285984 6745971 7226608 7718834
59368 7718834 8212093 8695357 9158650 9594019 9995690 10360263 10687084 10977975 11236192
59359 11236192 11465584 11670107 11852808 12014360 12152611 12263574 12342374 12383002 12377952 12319049
59349 12319049 12199139 12013416 11760181 11441362 11062622 10632657 10162185 9663252 9148586
59340I148586n18185n11378m96681m76088m51000m22641l92228l60771l29053
59331E190561k97895k68243k40829k15739j92574j70983j50943j32472j15355
59322C405528r9419q4883p2135o1135n1330m2248l3943k6674k0323j4243p808
59311B891387j084N205J0574J5583K1331K8077L4805M0506M5282M9754N3803N6676
59299C251899N8121N8612N8462N7432N5338N2475M9301M6203M3615M1759M0080
59288C813297L7390L2922K7086K1299J7384J6871K0198K6462L4345M3163N2519
59277D142936O1279O7818P1293P1854O9550O3954N5025M3397K9509J3437m099
59266D685953k1445l7331n1631o4275p4332q0912q4285q5311q4256q0960p5734
$$ plain form
59340 9148586 8630401 8119023 7622342 7146254 6695254 6272613 5880385 5519614 5190561
59331 5190561 4892666 4624423 4383594 4167855 3975281 3804298 3653355 3520883 3405528
59322 3405528 3306109 3221226 3149091 3087956 3036626 2994378 2960435 2933761 2913438 2899195 2891387
59311 2891387 2890303 2895508 2906082 2921665 2942996 2971073 3005878 3046384 3091666 3141420 3195223 3251899
59299 3251899 3310020 3368632 3427094 3484526 3539864 3592339 3641640 3687843 3731458 3773217 3813297
59288 3813297 3850687 3883609 3910695 3931994 3949378 3966249 3986447 4012909 4047254 4090417 4142936
59277 4142936 4204215 4272033 4343326 4415180 4484730 4548684 4603709 4647106 4676615 4690052 4685953
59266 4685953 4664508 4627177 4575546 4511271 4436939 4356027 4271742 4186431 4102175 4021215 3945481
59255C945481o9274o1950n3848m5292l6809k8767k1479j5396j0769p316m711l088
59243C586782k764l795o053r292j2794j5462j6690j6691j5623j3008q540k723
59231C463347L985J2163K2813L6198N1940O9819Q9735J11314J34385J59433J86749
59220D341881K15419K43919K71269K96501L17237L30008L32163L22676L01042
59211F972115K66551K19122J60149R2155J8148n8355j33298k02614k62779l11029
59201F760165l45709l66690l75072l72313l60009l40455l16603k90992k64935
59192C727387k39000k13850j90291j68822j49618j32777j18216j05463r3947q3572
59182B231831p4676o7311o0877n4675m8680m3270l8343l3241k7814k2946j9462
$$ plain form
59255 3945481 3876207 3814257 3760409 3715117 3678308 3649541 3628062 3612666 3601897 3594581 3589870 3586782
59243 3586782 3584018 3580223 3574170 3564878 3552084 3536622 3519932 3503241 3487618 3474610 3466070 3463347
59231 3463347 3467332 3479495 3502308 3538506 3590446 3660265 3750000 3861314 3995699 4155132 4341881
59220 4341881 4557300 4801219 5072488 5368989 5686226 6016234 6348397 6671073 6972115
59211 6972115 7238666 7457788 7617937 7710092 7728240 7669885 7536587 7333973 7071194 6760165
59201 6760165 6414456 6047766 5672694 5300381 4940372 4599917 4283314 3992322 3727387
59192 3727387 3488387 3274537 3084246 2915424 2765806 2633029 2514813 2409350 2315403 2231831
59182 2231831 2157155 2089844 2028967 1974292 1925612 1882342 1843999 1810758 1782944 1759998 1740536
59171A740536j6895j3967j0204o247k720M11L227N504P372R535J2324J5200J7639
59158A761715K0010K2937K6339K9640L2600L5394L8264M1479M5263M9250N2542
59147B155433N4747N6455N8152N9291N9118N7842N6070N3514M9306M3370L6513
59136B739811K9214K1255J2618L999l797j0344j5416j8903k1013k2048k1921k0254
59124B673201j6974j2459p135j330M708J1113J8450K6981L5950M4196N1273N7430
59112B885404O2742O7029P0538P3877P7200Q0122Q2643Q5548Q9697R5339J02251
59101C772390J10116J18604J27425J36339J44813J51692J55538J55138J49447
59092E021502J37337J18036R1827N9893K3751j4680n2851q8254j19509j46245
$$ plain form
59171 1740536 1723641 1709674 1699470 1693223 1690503 1690914 1694141 1699645 1707017 1716552 1728876 1744076 1761715
59158 1761715 1781725 1804662 1831001 1860641 1893241 1928635 1966899 2008378 2053641 2102891 2155433
59147 2155433 2210180 2266635 2324787 2384078 2443196 2501038 2557108 2610622 2659928 2703298 2739811
59136 2739811 2769025 2790280 2802898 2806897 2803100 2792756 2777340 2758437 2737424 2715376 2693455 2673201
59124 2673201 2656227 2643768 2636633 2635303 2640011 2651124 2669574 2696555 2732505 2776701 2827974 2885404
59112 2885404 2948146 3015175 3085713 3159590 3236790 3316912 3399555 3485103 3574800 3670139 3772390
59101 3772390 3882506 4001110 4128535 4264874 4409687 4561379 4716917 4872055 5021502
59092 5021502 5158839 5276875 5368702 5428595 5452346 5437666 5384815 5296561 5177052 5030807
59082E030807j68103j84531j95524k01749k03791k01934j96818j89670j81528
59073C307159j72724j63320j53604j43894j34265j24727j15471j06685r8404r0578
59063B003487q3145p6052o9302o2942n6886n0991m5446m0671l6579l2428k7811
59052A421234k3297j9589j6511j3491j0587q245o503n212m781n707p564r409j0973
59039A279365j2622j4323j5589j6248j6324j5346j2940r933p585n812l468n02
59027A148673J726K578L005L716L972L155K182K234L072L794M369N280O236O609
59013A200601O709P375Q420Q681P667O243N363M831L659J269j915m891o991q489
58999A238532j0146j2140j3699j3963j2896j1117r167p251n460l879k549j451
$$ plain form
59082 5030807 4862704 4678173 4482649 4280900 4077109 3875175 3678357 3488687 3307159
59073 3307159 3134435 2971115 2817511 2673617 2539352 2414625 2299154 2192469 2094065 2003487
59063 2003487 1920342 1844290 1774988 1712046 1655160 1604169 1558723 1518052 1481473 1449045 1421234
59052 1421234 1397937 1378348 1361837 1348346 1337759 1329514 1323011 1317799 1313018 1307311 1299747 1290338 1279365
59039 1279365 1266743 1252420 1236831 1220583 1204259 1188913 1175973 1166040 1158455 1152643 1149175 1148673
59027 1148673 1150399 1152977 1155982 1159698 1163670 1166825 1169007 1171241 1174313 1178107 1182476 1187756 1193992 1200601
59013 1200601 1207310 1214685 1223105 1231786 1239453 1245696 1251059 1255890 1259549 1260818 1258903 1254012 1247021 1238532
58999 1238532 1228386 1216246 1202547 1188584 1175688 1164571 1155404 1148153 1142693 1138814 1136265 1134814
58987A134814m58P19K199L552M225M441N066O381P600P974P827P980Q662R526
58973A210508J0369J1195J1837J2130J2378J3127J4529J6254J8016J9778K1557
58962A371678K3345K5219K7204K9089L0533L1333L1450L0858K9635K8002K6103
58951A684449K3839K1144J8381J6246J5240J5330J6146J7479J9550K2713K6814
58940A897331L1059L4789L8225M2088M6597N1254N5687O0094O4755O9528P4141
58929B465548P8695Q3543Q8880R4670J00895J07736J15651J25238J36909J50540
58919C548305J65538J81310J97568K14448K32490K52265K73811K96616L20413
58910E682764L45668L72774M01104M29332M56424M81582N03547N20696N31707
$$ plain form
58987 1134814 1134356 1135075 1137274 1140826 1145051 1149492 1154558 1160939 1168539 1176513 1184340 1192320 1200982 1210508
58973 1210508 1220877 1232072 1243909 1256039 1268417 1281544 1296073 1312327 1330343 1350121 1371678
58962 1371678 1395023 1420242 1447446 1476535 1507068 1538401 1569851 1600709 1630344 1658346 1684449
58951 1684449 1708288 1729432 1747813 1764059 1779299 1794629 1810775 1828254 1847804 1870517 1897331
58940 1897331 1928390 1963179 2001404 2043492 2090089 2141343 2197030 2257124 2321879 2391407 2465548
58929 2465548 2544243 2627786 2716666 2811336 2912231 3019967 3135618 3260856 3397765 3548305
58919 3548305 3713843 3895153 4092721 4307169 4539659 4791924 5065735 5362351 5682764
58910 5682764 6028432 6401206 6802310 7231642 7688066 8169648 8673195 9193891 9725598
58901I725598N35279N29214N10803M78393M31858L71517K97589K11311J15832
58892A3207394J5565q4933j81286k69436l46290m09999m59386m93651n13034n19263
58882I945681n14800n01869m82384m58288m31412m03118l74406l46177l19301
58873F113926k94686k73186k55043k39381k24863k10921j97776j85334j72873
58864D059863j60092j47650j36327j26242j17182j08999j01348r3719q6133p9171
58854B903000p2935o6664n9794n2650m5671l8750l1931k5934k1159j6726j1443
58843B459343n342N49N646J0274J4889J9527K3996K8083L1709L5220L9278M4125
58831B707297M9267N4277N9513O5553P2287P9194Q6236R3924J02575J12058J22206
$$ plain form
58901 9725598 10260877 10790091 11300894 11779287 12211145 12582662 12880251 13091562 13207394
58892 13207394 13222959 13138026 12956740 12687304 12341014 11931015 11471629 10977978 10464944 9945681
58882 9945681 9430881 8929012 8446628 7988340 7556928 7153810 6779404 6433227 6113926
58873 6113926 5819240 5546054 5291011 5051630 4826767 4615846 4418070 4232736 4059863
58864 4059863 3899771 3752121 3615794 3489552 3372370 3263371 3162023 3068304 2982171 2903000
58854 2903000 2830065 2763401 2703607 2650957 2605286 2566536 2534605 2508671 2487512 2470786 2459343
58843 2459343 2454001 2454550 2460196 2470470 2485359 2504886 2528882 2556965 2588674 2623894 2663172 2707297
58831 2707297 2756564 2810841 2870354 2935907 3008194 3087388 3173624 3267548 3370123 3482181 3604387
58820C604387J33076J44802J57553J71527J86797K03274K20973K40217K61370
58811E323976K84580L09786L36753L64978L93850M22806M51010M76938M98809
58802H863486N15181N24346N23323N08601M78236M32316L71219K94907K04780
58793A2716395J05119J535j01361j99869k89765l66688m28120m73980n05214n22636
58783I935416n27290n21104n06698m86715m63286m37812m11178l84342l58539
58774E838452l34720l12972k92709k73300k54415k36075k18572k02188j86908
58765C526593j72693j59825j48490j38159j28050j18250j09536j01935r4395q6159
58755B269101p7609o9395o1616n4324m7944m2575l7644l2834k8645k5526k3139
$$ plain form
58820 3604387 3737463 3882265 4039818 4211345 4398142 4601416 4822389 5062606 5323976
58811 5323976 5608556 5918342 6255095 6620073 7013923 7436729 7887739 8364677 8863486
58802 8863486 9378667 9903013 10426336 10934937 11413173 11845489 12216708 12511615 12716395
58793 12716395 12821514 12823049 12721688 12521819 12232054 11865366 11437246 10963266 10458052 9935416
58783 9935416 9408126 8887022 8380324 7893609 7430323 6992511 6581333 6196991 5838452
58774 5838452 5503732 5190760 4898051 4624751 4370336 4134261 3915689 3713501 3526593
58765 3526593 3353900 3194075 3045585 2907426 2779376 2661126 2551590 2449655 2355260 2269101
58755 2269101 2191492 2122097 2060481 2006157 1958213 1915638 1877994 1845160 1816515 1790989 1767850
58744A767850k1027j9183j7576j5990j4881j5316j7276j9141j9809k0320k2209
58733A565122k5134k7441k8412k8641k8619k8292k7799k7438k6971k5953k4644
58722A265778k3789k3659k3977k4475k4843k4572k3643k2907k2962k3111k2290
58711A005550k0578j8791j7039j4818j2234j0087q825q278q302q830r497r984
58699H58287j0494j1281j1996j2231j2225j2357j2398j2075j1804j2002j2174
58688G27250j1640j0622r736q954q016p202o616n471l309j217l57K1J509L939
58674F59579N622N918N810N955N899N413N006M848M538M132M093L976K658J10
58660G23557k409m217n940p936r445r779r241q245o683m681k982j988j255l47
$$ plain form
58744 1767850 1746823 1727640 1710064 1694074 1679193 1663877 1646601 1627460 1607651 1587331 1565122
58733 1565122 1539988 1512547 1484135 1455494 1426875 1398583 1370784 1343346 1316375 1290422 1265778
58722 1265778 1241989 1218330 1194353 1169878 1145035 1120463 1096820 1073913 1050951 1027840 1005550
58711 1005550 984972 966181 949142 934324 922090 912003 903178 894900 886598 877768 868271 858287
58699 858287 847793 836512 824516 812285 800060 787703 775305 763230 751426 739424 727250
58688 727250 715610 704988 695252 686298 678282 671080 664464 658993 655684 654467 654110 654131 655640 659579
58674 659579 665201 671119 676929 682884 688783 694196 699202 704050 708588 712720 716813 720789 723447 723557
58660 723557 721148 716931 710991 703055 693610 683831 674590 666345 659662 654981 651999 650011 648756 648409
58646F48409O38J711L234N122O701P729Q668R739J0524J0956J1698J3100J4632
58633G52861J5801J6844J8100J9409K0586K1873K3551K5615K7987L0576L3115
58622A006318L5561L8628M3055M8470N3811N8910O4675P1676P9549Q7942R6947
58611A685542J06422J15816J24945J33997J42595J49777J54909J57554J56350
58602B927907J49325J35726J16509R2778O4897L3537M25l2446o3365r0377j11466
58591C223450j25962j34894j39465j40101j37329j32361j26100j18510j09613
58582B059115j00226r1155q2461p4088o6271n8950n1769m5189m0488l7902l5878
58571A374738l2985k9654k7116k5505k4124k2752k1539k0112j7919j5318j3371
$$ plain form
58646 648409 649047 650758 653992 659114 665815 673544 682212 691951 702475 713431 725129 738229 752861
58633 752861 768662 785506 803606 823015 843601 865474 889025 914640 942627 973203 1006318
58622 1006318 1041879 1080507 1123562 1172032 1225843 1284753 1349428 1421104 1500653 1588595 1685542
58611 1685542 1791964 1907780 2032725 2166722 2309317 2459094 2614003 2771557 2927907
58602 2927907 3077232 3212958 3329467 3422245 3487142 3520679 3521104 3488658 3425293 3334916 3223450
58591 3223450 3097488 2962594 2823129 2683028 2545699 2413338 2287238 2168728 2059115
58582 2059115 1958889 1867734 1785273 1711185 1644914 1585964 1534195 1489006 1448518 1410616 1374738
58571 1374738 1341753 1312099 1284983 1259478 1235354 1212602 1191063 1170951 1153032 1137714 1124343
58560A124343j2597j2653j3154j4195j5893j7891j9455k0119k0166k0288k0541
58549I37391k0120j8620j7065j6716j7167j6816j5167j3366j2265j1286r801q408
58537G60594p927q020p704o720n638m963m665m361l592k321j184q18r25o46Q5
58522G01195L86k11j115j666k012k627l651m967o371p437p826p840q044q309p949
58507F31556o783n335l982k742j821j541j676j757j822k063k023j212j57M26J057
58492F00125K595M263M391L029J958J959K087J860K102L005L375K618J639J023
58478F36029J49j014j174R4J207Q84M3Q0P19Q89M38l32j601l186l906l057j560
58461F24702n56P5P74J189J112J310K164K614J714J44j088k287m065n753o297
$$ plain form
58560 1124343 1111746 1099093 1085939 1071744 1055851 1037960 1018505 998386 978220 957932 937391
58549 937391 917271 898651 881586 864870 847703 830887 815720 802354 790089 778803 769002 760594
58537 760594 752667 744647 736943 730223 724585 719622 714957 710596 707004 704683 703499 702681 701756 701110 701195
58522 701195 701581 701370 700255 698589 696577 693950 690299 685332 678961 671524 663698 655858 647814 639505 631556
58507 631556 624773 619438 615456 612714 610893 609352 607676 605919 604097 602034 600011 598799 598642 599068 600125
58492 600125 602720 606983 611374 614403 616361 618320 620407 622267 624369 627374 630749 633367 635006 636029
58478 636029 636178 635164 633990 634084 635291 636175 636218 636298 637017 637906 638344 638012 636411 633225 629319 626262 624702
58461 624702 624146 624221 624995 626184 627296 628606 630770 633384 635098 635242 634154 631867 627802 622049 615752
58446F15752n844n119m057k430j003o68j016j010m94L7M71Q82Q90K95l63o57r97
58429E94669j655k063j862j714k065k167j320j08P02J443K674L990M857N623O636
58414F07640P347P335P246P595P756P273P083Q178J0016J1436J2110J2048J0870
58401G23933Q863P534P704Q107P323N976N448N485M722K863Q18p24j594j719j535
58386G83204j982l060l404k275p52J24R46K367L423L090K147J802J708J023K19
58371G88580J15K30o3R5J665L738M794M974N289N573N113M404M440N013N384N752
58355H45096O494P001O896P118Q132Q438O872M970M800N741N801M957M681N007
58341I32004M762M064M082M755N032N030N786P232Q419R326J0594J1943J2665
$$ plain form
58446 615752 609908 604789 600732 598302 597299 596631 595615 594605 594111 594148 594619 595501 596391 596686 596323 595666 594669
58429 594669 593014 590951 589089 587375 585310 583143 581823 581715 582417 583860 586534 590524 595381 601004 607640
58414 607640 614987 622322 629568 637163 644919 652192 659275 667453 677469 688905 701015 713063 723933
58401 723933 732796 740330 748034 756141 763464 769440 774888 780373 785095 787958 788776 788052 786458 784739 783204
58386 783204 781222 778162 774758 772483 771731 771855 772801 775168 778591 781681 783828 785630 787338 788361 788580
58371 788580 788695 788925 788862 788957 790622 794360 799154 804128 809417 814990 820103 824507 828947 833960 839344 845096
58355 845096 851590 858591 865487 872605 880737 889175 896047 901017 905817 911558 917359 922316 926997 932004
58341 932004 936766 940830 944912 949667 954699 959729 965515 972747 981166 990492 1001086 1013029 1025694
58328A025694J3060J3756J4332J4260J4220J4869J5378J4992J4714J5514J6332
58317A187121J6011J5687J6798J8163J7681J5738J4271J3632J2986J2662J3365
58306A354115J4126J3753J3222J4024J5383J5884J6433J8536K0956K1485K0759
58295A538676K0994K2014K2079K1710K2933K5405K6944K7408K8525L0332L1309
58284A818329L1635L2838L4583L5158L4853L5608L7641L9657M1794M5170M8999
58273B236265N1469N2928N5002N7242N7856N7037N6341N5753N4601N4174N6015
58262B844683N8833O0651O2403O5795O9456P1317P2885P6624Q1129Q3726Q5889
58251C633391R0737R6997J01141J03882J08633J15024J20100J24569J31517J40033
$$ plain form
58328 1025694 1038754 1052510 1066842 1081102 1095322 1110191 1125569 1140561 1155275 1170789 1187121
58317 1187121 1203132 1218819 1235617 1253780 1271461 1287199 1301470 1315102 1328088 1340750 1354115
58306 1354115 1368241 1381994 1395216 1409240 1424623 1440507 1456940 1475476 1496432 1517917 1538676
58295 1538676 1559670 1581684 1603763 1625473 1648406 1673811 1700755 1728163 1756688 1787020 1818329
58284 1818329 1849964 1882802 1917385 1952543 1987396 2023004 2060645 2100302 2142096 2187266 2236265
58273 2236265 2287734 2340662 2395664 2452906 2510762 2567799 2624140 2679893 2734494 2788668 2844683
58262 2844683 2903516 2964167 3026570 3092365 3161821 3233138 3306023 3382647 3463776 3547502 3633391
58251 3633391 3724128 3821125 3922266 4026148 4134781 4249805 4369905 4494474 4625991 4766024
58241D766024J46723J52487J61087J71819J80546J87295J95860K06565K16575
58232F384981K26619K40184K56643K72562K88885L09209L32135L53487L74872
58223I039577M01426M32372M63038M94804N33278N77904O23926O73230P32134
58214A3971689P99828Q71042R48769J041604J149993J269086J403734J565509
58206B3021254J756699J974113K227557K536630K911426L357453L898863M574715
58198D6258710N414029O438942P687531R201505J0996394J3086518J5543819J8495050
58190A33122498K2070783K6392414L1493569L6947083M1353886M2378419L7789093
58183C71547745K6943463J1506892n224029j9840121l0111213l5433753l6503248
$$ plain form
58241 4766024 4912747 5065234 5226321 5398140 5578686 5765981 5961841 6168406 6384981
58232 6384981 6611600 6851784 7108427 7380989 7669874 7979083 8311218 8664705 9039577
58223 9039577 9441003 9873375 10336413 10831217 11364495 11942399 12566325 13239555 13971689
58214 13971689 14771517 15642559 16591328 17632932 18782925 20052011 21455745 23021254
58206 23021254 24777953 26752066 28979623 31516253 34427679 37785132 41683995 46258710
58198 46258710 51672739 58111681 65799212 75000717 85997111 99083629 114627448 133122498
58190 133122498 155193281 181585695 213079264 250026347 291380233 333758652 371547745
58183 371547745 398491208 409998100 404774071 384933950 354822737 319388984 282885736
58176B82885736l4610894l0993432k6548986k1939304j7775896j4587017j2603844
58169A23826363j1647849j1264347j0976663j0474173r669128q647603p560439
58162E3586161o522131n581175m752199m042866l448945k951453k532920k185373
58154B1569099j898544j655004j442961j262049j111761r84971q76487p86984
58146A1550338p14448o51618n95383n49107n12362m77648m40808m05824l75851
58137F827289l47796l19298k93150k70980k49673k27649k08215j93616j81653
58128D535259j71003j63838j60471j57138j51603j45694j40233j32907j23388
58119C188984j15067j09442j03869r6924r0914q7027q2967p7553p2877o9824o6099
$$ plain form
58176 282885736 248274842 217281410 190732424 168793120 151017224 136430207 123826363
58169 123826363 112178514 100914167 89937504 79463331 69794203 61146600 53586161
58162 53586161 47064030 41482855 36730656 32687790 29238845 26287392 23754472 21569099
58154 21569099 19670555 18015551 16572590 15310541 14198780 13213809 12337322 11550338
58146 11550338 10835890 10184272 9588889 9039782 8527420 8049772 7608964 7203140 6827289
58137 6827289 6479493 6160195 5867045 5596065 5346392 5118743 4910528 4716912 4535259
58128 4535259 4364256 4200418 4039947 3882809 3731206 3585512 3445279 3312372 3188984
58119 3188984 3073917 2964475 2860606 2763682 2672768 2585741 2502774 2425221 2352344 2282520 2216421
58108B216421o0757n6202n3726n1360m7967m5180m3537m1008l7160l4449l3653
58097A711422l2300k9448k7693k8439k9331k8588k7903k8821l0018l0333l0896
58086A387652l2138l2073k9817k7504k6796k6564k5805k5532k6021k5504k3554
58075A086344k2486k3401k4031k2501k0137j8508j6781j4186j2151j1748j1621
58064H88793j0581r690r747r288p189m893m050m180m512n748q096r852r847r258
58050G81862r208q764o998m960l840l220k699l103m497n195m302l127k539j394
58036G18016Q47K381J956J105J484K075J189p04k264l602n262o528o795p029q090
58021F88779r081r043q670q748q521p292n975n429m893l772l100l600m086l529
$$ plain form
58108 2216421 2155664 2099462 2045736 1994376 1946409 1901229 1857692 1816684 1779524 1745075 1711422
58097 1711422 1679122 1649674 1621981 1593542 1564211 1535623 1507720 1478899 1448881 1418548 1387652
58086 1387652 1355514 1323441 1293624 1266120 1239324 1212760 1186955 1161423 1135402 1109898 1086344
58075 1086344 1063858 1040457 1016426 993925 973788 955280 938499 924313 912162 900414 888793
58064 888793 878212 868522 858775 849487 842298 837405 833355 829175 824663 818915 810819 800967 791120 781862
58050 781862 772654 763890 756892 751932 748092 744872 742173 739070 734573 729378 725076 721949 719410 718016
58036 718016 718863 721244 723200 724305 725789 727864 729053 728349 726085 722483 717221 710693 703898 696869 688779
58021 688779 679698 670655 661985 653237 644716 637424 631449 626020 621127 617355 614255 610655 606569 603040
58007F03040k863k938k711j457p18j757k993k446j022p05j003j06J627K297J815
57992E88060J789K483K539J568O65L21j39r33j464j609j848k165k181k235k905
57977E81946l724l721l000k522k514k372j886j409r67k66N92J290J896K449K440
57962E68232J516K87l84m61m27n52j048k146l281l114j246R80K173K557L010L520
57946E69616L543L065K246R21p11j770k011k400l474m331m285m243n117o076n926
57931E39047n143m977n428n655n679o136o940p553p951q101p282n242l232k483
57917D57245k392j687n07K22P53K075L977N284N785O324P192P816P890P559O727
57902E14263N313L864K854J816K05j518k756m017n906p693q368q472r223j0447
$$ plain form
58007 603040 600177 597239 594528 593071 592353 590596 587603 585157 584135 583430 582427 582321 583948 586245 588060
57992 588060 589849 592332 594871 596439 597104 597425 597286 596353 594889 593280 591432 589267 587086 584851 581946
57977 581946 578222 574501 571501 568979 566465 564093 562207 560798 559831 559565 560157 561447 563343 565792 568232
57962 568232 569748 570035 569651 569190 568763 568211 567163 565017 561736 558622 557376 558356 560529 563086 566096 569616
57946 569616 573159 576224 578470 579391 578680 576910 574899 572499 569025 564694 560409 556166 551049 544973 539047
57931 539047 533904 528927 523499 517844 512165 506029 499089 491536 483585 475484 468202 462960 459728 457245
57917 457245 454853 453166 452659 452881 453634 455709 459686 464970 470755 477079 484271 492087 499977 507536 514263
57902 514263 519576 523440 526294 528110 528315 526797 524041 520024 514118 506425 498057 489585 480362 469915
57888D69915j1009j0781j0448r788q005n563l800k775j252J035K889L621L957
57875D17996M645N503O261P022P608P589P224P346Q066Q612Q474P705O247M117
57861E14415K233J625J710O99j982m907o616p150p267p262p135p026o892o397
57847D58048n477m460l493k438j423p87m41m8K08k28j330k448l235l891m498m865
57831D19194n086n515o195o896p615q411q962q940q599q275p650o392n035m296
57817C21327l885l079k070j564j264j61J740L377M289N000N649N586M728M060
57803C43733M251M822N113N212N521O121O955P955Q751Q936Q760Q877R312R408
57789D43727Q833P891O776N350L645J860k05k879n874q582j0987j3285j4883j4909
$$ plain form
57888 469915 458906 448125 437677 427889 419884 414321 410521 407746 406494 407529 410418 414039 417996
57875 417996 422641 428144 434405 441427 449035 456624 463848 471194 479260 487872 496346 504051 510298 514415
57861 514415 516648 518273 519983 520682 518700 513793 507177 500027 492760 485498 478363 471337 464445 458048
57847 458048 452571 448111 444618 442180 440757 439970 439529 439481 439689 439461 438131 435683 432448 428557 424059 419194
57831 419194 414108 408593 402398 395502 387887 379476 370514 361574 352975 344700 337050 330658 325623 321327
57817 321327 317442 314363 312293 310729 309465 309304 311044 314421 318710 323710 329359 334945 339673 343733
57803 343733 347984 352806 357919 363131 368652 374773 381728 389683 398434 407370 416130 425007 434319 443727
57789 443727 452560 460451 467227 472577 476222 478082 477877 474998 469124 460542 449555 436270 421387 406478
57775D06478j3748j2759j2316j1436r558p469n990m912l814k929k571k439k064
57762C14473j351m17N63J151J095J033J848L240L929L557L294M077N298N863N691
57747C53344N501N756O332O826O781O041N101M616M587M496M230M000L549K430
57733D23590J058M22N91O66L75N47J648L060M223N259O110O265N953O283P491
57718D73541Q322Q040P729Q512R582R477Q524Q460R946J1820J2829J3067J3488
57705F03337J4709J6507J8135J9120J9880K1325K3730K6459K9059L1965L5759
57694H59985M0338M5294N0565N6216O2047O7995P4516Q2076R0708J00474J11871
57683A642085J25141J39527J53799J67276J79849J91200K00344K05859K06377
$$ plain form
57775 406478 392730 379971 367655 356219 346661 339192 333202 328290 324476 321547 318976 316537 314473
57762 314473 313122 312705 313268 314419 315514 316547 318395 321635 325564 329121 332415 336492 341790 347653 353344
57747 353344 358845 364601 370933 377759 384540 390581 395682 400298 404885 409381 413611 417611 421160 423590
57733 423590 424648 425070 425661 426327 426702 427249 428897 431957 436180 441439 447549 453814 459767 466050 473541
57718 473541 481863 489903 497632 506144 515726 525203 533727 542187 552133 563953 576782 589849 603337
57705 603337 618046 634553 652688 671808 691688 713013 736743 763202 792261 824226 859985
57694 859985 900323 945617 996182 1052398 1114445 1182440 1256956 1339032 1429740 1530214 1642085
57683 1642085 1767226 1906753 2060552 2227828 2407677 2598877 2799221 3005080 3211457
57674C211457K01207J90791J76667J61291J47849J38801J32324J19783Q8938L2186
57664D601294m7087j35475k16136k75511l07259l12956k99598k75255k45964k15577
57654B270476j86638j60370j36692j15412r7092q2160o9891n9111m9419m0876
57644A272815l3070k5505j8546j2949q622m668m74L951Q548J3317J8046K2600
57632A235443K7378L2846L8769M4604N0495N7196O4981P3251Q1334Q9265R7684
57621A893246J07122J17272J26762J33888J37647J37696J33246J22780J05305
57612C014964Q1338N2275J9575j4853m8205p7767j02148j20961j33919j41006
57602B529293j43116j41582j37238j30629j22761j14722j06794r8706r0564q2778
$$ plain form
57674 3211457 3412664 3603455 3780122 3941413 4089262 4228063 4360387 4480170 4569108 4601294
57664 4601294 4554207 4418732 4202596 3927085 3619826 3306870 3007272 2732017 2486053 2270476
57654 2270476 2083838 1923468 1786776 1671364 1574272 1492112 1422221 1363110 1313691 1272815
57644 1272815 1239745 1214240 1195694 1182745 1174123 1169455 1168981 1172932 1181480 1194797 1212843 1235443
57632 1235443 1262821 1295667 1334436 1379040 1429535 1486731 1551712 1624963 1706297 1795562 1893246
57621 1893246 2000368 2117640 2244402 2378290 2515937 2653633 2786879 2909659 3014964
57612 3014964 3096302 3148577 3168152 3153299 3105094 3027327 2925179 2804218 2670299 2529293
57602 2529293 2386177 2244595 2107357 1976728 1853967 1739245 1632451 1533745 1443181 1360403
57592A360403p5315o7933o0939n4883m9593m4458l9601l5798l3145l0710k7773
57581H40255k4661k2060k0129j8536j6901j4998j2993j1541j1140j1241j0585
57570F65470q649o324m900m723n103n198m728l923l046k097r74K19J335K536M086
57555F23981N733O861P504Q480J0191J1909J2851J3277J3938J4979J6210J7867
57543G63781K0153K2494K4279K5956K8352L1212L3665L6021L9694M5139N1143
57532A121889N6660O2195O8677P5922Q3022Q9601R5924J02107J07804J12338J14623
57521B090762J13234J07017R5649P9446N8964L5006Q737j8386m4604o7771q5903
57510B372151r8273j05659j09231j09483j06545j01111r4468q7605q0705p3570
$$ plain form
57592 1360403 1285088 1217155 1156216 1101333 1051740 1007282 967681 931883 898738 868028 840255
57581 840255 815594 793534 773405 754869 737968 722970 709977 698436 687296 676055 665470
57570 665470 656821 650497 645597 640874 635771 630573 625845 621922 618876 616779 615805 616024 617359 619895 623981
57555 623981 629714 636575 644079 652559 662750 674659 687510 700787 714725 729704 745914 763781
57543 763781 783934 806428 830707 856663 885015 916227 949892 985913 1025607 1070746 1121889
57532 1121889 1178549 1240744 1309421 1385343 1468365 1557966 1653890 1755997 1863801 1976139 2090762
57521 2090762 2203996 2311013 2406662 2486108 2545072 2580078 2588815 2570429 2525825 2458054 2372151
57510 2372151 2273878 2168219 2058988 1949505 1842960 1741849 1647381 1559776 1479071 1405501
57500A405501o6282n9298n2978m7196m1533l5816l0350k5507k1369j7839j4843
57489I92490j2154r353o231l020R0L330O793R893J2112J4100J7146K1513K6064
57476A072773K9832L3204L7141M1809M6578N1058N5644O1049O7624P5139Q2973
57465A654824R0488R7219J02738J06429J07558J05410R9201Q8018P1321M9544
57455B572750K4059l378l0835n6184p7526r3938j05443j12215j14285j12200j07462
57444A783343j01742r5773q9267q1915p4113o6654n9951n3806m7926m2426l7631
57433A032139l3564k9984k6848k4228k1798j8984j5843j3205j1544j0274q637
57422H17230o767n286m276l370k544k077j925j764j534j296q09Q5Q92J102J103
$$ plain form
57500 1405501 1339219 1279921 1226943 1179747 1138214 1102398 1072048 1046541 1025172 1007333 992490
57489 992490 980336 970983 964752 961732 961822 965152 971945 981838 993950 1008050 1025196 1046709 1072773
57476 1072773 1102605 1135809 1172950 1214759 1261337 1312395 1368039 1429088 1496712 1571851 1654824
57465 1654824 1745312 1842531 1945269 2051698 2159256 2264666 2363867 2451885 2523206 2572750
57455 2572750 2596809 2593431 2562596 2506412 2428886 2334948 2229505 2117290 2003005 1890805 1783343
57444 1783343 1681601 1585828 1496561 1414646 1340533 1273879 1213928 1160122 1112196 1069770 1032139
57433 1032139 998575 968591 941743 917515 895717 876733 860890 847685 836141 825867 817230
57422 817230 810463 805177 800901 797531 794987 792910 790985 789221 787687 786391 785582 785667 786559 787661 788764
57407G88764J597K357K584K374K665L527L858L225K825L807N551O524O271N638
57393H41567N452N877O794Q021R046R227Q435P263O465O364O775P341P929Q650
57379I45206R499J0106J0124R748R505R545R578R484R515R790J0043J0082J0066
57366A072291J0182J0378J0536J0617J0576J0475J0690J1499J2531J3071J3017
57355A195863J2952J3214J3560J3843J4292J4837J4934J4474J4166J4576J5284
57344A351995J5601J5539J5531J5678J5855J6197J6820J7405J7635J7838J8490
57333A534584J9326J9609J9234J8945J9334K0117K0582K0456K0129K0243K1091
57322A753650K2388K3578K4390K4900K5132K4927K4369K4010K4377K5363K6377
$$ plain form
57407 788764 790361 792718 795302 797676 800341 803868 807726 810951 813776 817583 823134 829658 835929 841567
57393 841567 847019 852896 859690 867711 876757 885984 894419 901682 908147 914511 921286 928627 936556 945206
57379 945206 954705 964811 974935 984683 994188 1003733 1013311 1022795 1032310 1042100 1052143 1062225 1072291
57366 1072291 1082473 1092851 1103387 1114004 1124580 1135055 1145745 1157244 1169775 1182846 1195863
57355 1195863 1208815 1222029 1235589 1249432 1263724 1278561 1293495 1307969 1322135 1336711 1351995
57344 1351995 1367596 1383135 1398666 1414344 1430199 1446396 1463216 1480621 1498256 1516094 1534584
57333 1534584 1553910 1573519 1592753 1611698 1631032 1651149 1671731 1692187 1712316 1732559 1753650
57322 1753650 1776038 1799616 1824006 1848906 1874038 1898965 1923334 1947344 1971721 1997084 2023461
57311B023461K6914K6886K6575K6425K6719K7357K8121K9084L0400L1765L2628
57300B336335L3114L4126L6253L8992M1432M3177M4316M4973M5406M6146M7458
57289B791728M8899M9832N0119M9889M9048M7602M6123M5082M3918M1468L7484
57278C301192L3010K9101K5752K2446J9224J6732J5391J4981J5087J5597J6562
57267C525075J7789J8879J9709K0611K1923K3570K5295K7046K8915L0818L2634
57256C792264L4386L6068L7400L8244L8972L9941M0840M1192M1327M1955M2880
57245D225469M3100M2312M1341M0795M0253L9269L8209L7521L6934L6102L5325
57234D656630L4958L4736L4408L4440L5306L6622L7706L8546L9499M0536M1542
$$ plain form
57311 2023461 2050375 2077261 2103836 2130261 2156980 2184337 2212458 2241542 2271942 2303707 2336335
57300 2336335 2369449 2403575 2439828 2478820 2520252 2563429 2607745 2652718 2698124 2744270 2791728
57289 2791728 2840627 2890459 2940578 2990467 3039515 3087117 3133240 3178322 3222240 3263708 3301192
57278 3301192 3334202 3363303 3389055 3411501 3430725 3447457 3462848 3477829 3492916 3508513 3525075
57267 3525075 3542864 3561743 3581452 3602063 3623986 3647556 3672851 3699897 3728812 3759630 3792264
57256 3792264 3826650 3862718 3900118 3938362 3977334 4017275 4058115 4099307 4140634 4182589 4225469
57245 4225469 4268569 4310881 4352222 4393017 4433270 4472539 4510748 4548269 4585203 4621305 4656630
57234 4656630 4691588 4726324 4760732 4795172 4830478 4867100 4904806 4943352 4982851 5023387 5064929
57223E064929M2826M4418M5380M4850M3463M2681M2912M3243M2930M2032M0636
57212E540300L8616L6403L4955L4534L4301L3553L2666L2330L2393L2082L1105
57201E913238L0090K9857L0554L1505L1917L1669L1214L0704K9698K7953K6018
57190F244417K4516K3221K1452J9148J6921J5296J4446J4444J5079J5638J5635
57179F440213J5621J6470J7970J9015J9224J9496K0706K2627K4450K5650K6017
57168F667459K5414K4008K2401K1108K0142J9214J8037J6327J3918J1055Q178
57157F867261N236J598l123q449j3419j7450k0660k3533k6298k8642k9985l0080
57145F672456k9096k7078k3803j9459j5008j1327q378n758l750l102l977n825
$$ plain form
57223 5064929 5107755 5152173 5197553 5242403 5285866 5328547 5371459 5414702 5457632 5499664 5540300
57212 5540300 5578916 5615319 5650274 5684808 5719109 5752662 5785328 5817658 5850051 5882133 5913238
57201 5913238 5943328 5973185 6003739 6035244 6067161 6098830 6130044 6160748 6190446 6218399 6244417
57190 6244417 6268933 6292154 6313606 6332754 6349675 6364971 6379417 6393861 6408940 6424578 6440213
57179 6440213 6455834 6472304 6490274 6509289 6528513 6548009 6568715 6591342 6615792 6641442 6667459
57168 6667459 6692873 6716881 6739282 6760390 6780532 6799746 6817783 6834110 6848028 6859083 6867261
57157 6867261 6872497 6874095 6870972 6862523 6849104 6831654 6810994 6787461 6761163 6732521 6702536 6672456
57145 6672456 6643360 6616282 6592479 6573020 6558012 6546685 6538307 6532549 6528799 6525697 6521720 6515895
57133F515895q276j1495j5624k0301k4681k7594k8004k5885k2429j8881j5437
57122F297288j1800q307n711m250l680l877m441m142j735K875R255J7803K9188
57109F308466M2762N6999P1559Q7777J07183J30926J60619J98214K44813L01034
57099G710352L68953M52451N55674O82538Q37655J025511J247881J503201J788287
57090A6172503K098473K425808K759613L089557L405444L692794L930677M093391
57082D1668260M148084M047799L735701L171568K364218J380035L19825p14969
57074F0120521j644393k417901l015112l440927l714153l855476l882495l811674
57066C4338390l660859l448992l194598k914677k623823k333709k053454j790243
$$ plain form
57133 6515895 6507619 6496124 6480500 6460199 6435518 6407924 6379920 6354035 6331606 6312725 6297288
57122 6297288 6285488 6277181 6271470 6267220 6263540 6259663 6255222 6251080 6249345 6252220 6261475 6279278 6308466
57109 6308466 6351228 6408227 6479786 6567563 6674746 6805672 6966291 7164505 7409318 7710352
57099 7710352 8079305 8531756 9087430 9769968 10607623 11633134 12881015 14384216 16172503
57090 16172503 18270976 20696784 23456397 26545954 29951398 33644192 37574869 41668260
57082 41668260 45816344 49864143 53599844 56771412 59135630 60515665 60835490 60120521
57074 60120521 58476128 56058227 53043115 49602188 45888035 42032559 38150064 34338390
57066 34338390 30677531 27228539 24033941 21119264 18495441 16161732 14108278 12318035
57058A2318035j549293j333582j144102r80309q40296p21203o19981n33877m60358
57049D135034l97313l43556k98475k60900k28917k01094j77223j57324j40530
57040A929702j25605j12085j00275r0335q1966p4741o8270o2097n5941m9973m4624
57029A063790m0013l5866l1808k7618k3233j8621j3625p897j131O844J6569K9337
57017I16728M6009O4436P8147P8729O0915K6670j5108n3226p9802r2835r4691
57006I35972q9121p9624o9176n9750n1727m4501l7892l2462k8393k5007k1712
56995C96607j8771j6701j5451j4639j4127j3798j3186j1861r995q073o214m164
56983B49627j826L92J605P76k470p108j1242j3744j4847j4915j3441j0149o346
$$ plain form
57058 12318035 10768742 9435160 8291058 7310749 6470453 5749250 5129269 4595392 4135034
57049 4135034 3737721 3394165 3095690 2834790 2605873 2404779 2227556 2070232 1929702
57040 1929702 1804097 1692012 1591737 1501402 1419436 1344695 1276425 1214328 1158387 1108414 1063790
57029 1063790 1023777 987911 956103 928485 905252 886631 873006 865109 863978 870822 887391 916728
57017 916728 962737 1027173 1105320 1184049 1244964 1271634 1256526 1203300 1123498 1030663 935972
57006 935972 846851 767227 698051 638301 586574 542073 504181 471719 443326 418319 396607
56995 396607 377836 361135 345684 331045 316918 303120 289934 278073 268078 260005 253791 249627
56983 249627 247801 248193 249798 250574 248104 240996 229754 216010 201163 186248 172807 162658 156312
56970A56312l902k940j750P89L802N894P046Q247R931J1691J3346J5398J8231
56957B42095K1337K3482K3331J9974J3441M992l382j0055j4425j6590j6804j5545
56945B71851j3710j2186j1098r794p660m796j785R27L314N661Q391J1882J6177
56932B57174K0822K5043K7980K8629K5833J8905Q521l144j3465k0736k4681k6011
56920C24870k5670k4417k2679k0550j8019j5309j2862j0874r086p341o131o038
56908A45894o572o283m454k151r24q93q38l8R12J272J222J394J990K863L980N262
56892A42636O386P230Q295J0095J2351J4257J5388J5917J5926J4943J2217P371
56880B83012R54n446r965j1749j1429j0273r057p893o629m960k510O83M003O941
$$ plain form
56970 156312 152410 149470 147720 148509 152311 158205 165251 173498 183429 195120 208466 223864 242095
56957 242095 263432 286914 310245 330219 343660 348652 345270 335215 320790 304200 287396 271851
56945 271851 258141 245955 234857 225063 217403 212607 210822 211749 215063 220724 229115 240997 257174
56932 257174 277996 303039 331019 359648 385481 404386 412907 409763 396298 375562 350881 324870
56920 324870 299200 274783 252104 231554 213535 198226 185364 174490 165404 158063 151932 145894
56908 145894 139322 133039 128585 126434 125510 124617 123779 123741 124653 125925 127147 128541 130531 133394 137374 142636
56892 142636 149022 156252 164547 174642 186993 201250 216638 232555 248481 263424 275641 283012
56880 283012 283966 278520 268555 256806 245377 235104 226047 218154 211525 206565 204055 204738 208741 215682
56866B15682R642J2393J5120J7939K1781K7402L3946L9157M1015L8532L1272J9414
56854E23295M684r663k0598k6927k9199k8664k6580k3809k0466j6131j0725m971
56842C10246K87M959R697J5187K1622K8703L6050M3680N1851N9918O5283O4179
56830G11662N4080L5591J2188j1555l1712m6035n4140n6816n5143n0202m3350
56819D64568l6049k9158k2689j6415j0408m827M94N968J1946J8629K6056L3896
56807D42011M1162M6112M6486M0397K7666J0439p825k4057l6360m3748m6123m4602
56795D51558m1088l7006l2685k7954k2885j7776j2892q462m570q80L211P982J3140
56782B69693J8155K2422K5110K5285K2367J6261P310l370j3641k1306k5612k7379
$$ plain form
56866 215682 225324 237717 252837 270776 292557 319959 353905 393062 434077 472609 503881 523295
56854 523295 527979 518316 497718 470791 441592 412928 386348 362539 342073 325942 315217 310246
56842 310246 310533 315492 325189 340376 361998 390701 426751 470431 522282 582200 647483 711662
56830 711662 765742 801333 813521 801966 770254 724219 670079 613263 558120 507918 464568
56819 464568 428519 399361 376672 360257 349849 345022 345516 351484 363430 382059 408115 442011
56807 442011 483173 529285 575771 616168 643834 654273 646448 622391 586031 542283 496160 451558
56795 451558 410470 373464 340779 312825 289940 272164 259272 250810 246240 245360 248571 256553 269693
56782 269693 287848 310270 335380 360665 383032 399293 406603 403233 389592 368286 342674 315295
56770C15295k7602k6564k4361k1457j8364j5396j2965j1461j0589r429p554n536
56758A24017m034l030k296j953k084k324k324k171j929j372n57q2k83o47n75k05
56742I8151n4k70p34j359j896j860j237p33q57j252j412j436j551j497j059o42
56726H0302o57q31p55n82m60L4J068J756J241P7n25m73n92r81q87k04J79j48m34
56707G7128j3O64P60J83m89q24q93j025j419j798j600o81L67R49J183J381J256
56690G5129M55n16p95m46k40k02N18K117L544L787L011K046J417J322J821K560
56674I5528K854K406J651J064O50L02J68K72K76q6o48j148j529j755j774j794
56658I6437k142k598k403j331j48L01J20OK10L27m3p52j199q86J9O83M80k42o26
$$ plain form
56770 315295 287693 261129 236768 215311 196947 181551 168586 157125 146536 137107 129553 124017
56758 124017 119983 116953 114657 112704 110620 108296 105972 103801 101872 100500 99943 99861 99578 98931 98356 98151
56742 98151 98097 97827 97093 95734 93838 91978 90741 90008 89151 87899 86487 85051 83500 82003 80944 80302
56726 80302 79645 78814 78059 77477 77017 77051 78119 79875 81116 81193 80668 80195 79603 78622 77735 77531 77710 77562 77128
56707 77128 77115 77779 78539 78722 78233 77409 76516 75491 74072 72274 70674 69993 70360 71309 72492 73873 75129
56690 75129 75584 75068 74273 73827 73587 73385 73903 76020 79564 83351 86362 88408 89825 91147 92968 95528
56674 95528 98382 100788 102439 103503 104153 104455 104623 104895 105171 105085 104437 103289 101760 100005 98231 96437
56658 96437 94295 91697 89294 87963 87815 88116 88236 88242 88452 88779 88736 87984 86785 85899 85918 86601 87081 86839 86213
56639H6213m55k80m46o58o88p50q98p30j65J65j64o34n52j15J7k11l27k79n27
56620G8516j130j433q91J64Q71P75K44RL42P96P81L30k7r2k29o82j105j072o68
56601G5499k26J87O39R44Q48M69J18j07k23PQ88K206L239L450K926K141J491J065
56583I5561P17L01q9j53K17P52J189J584J979K080J685J245J422K089K406K052
56567A15037J771K240K975L014K389K188L032M238M738M341L655L203L058L103
56553A58982L110K716J833J014Q47R77M44r09k019k029j500j574k387l070l120
56538A53315k989l200l546l498l014k563k471k577k519k190j752j290o70J05O03
56523A21744L79l43q43q31p61j047j384j261p01j60O2q8n99j274j626j330o02
$$ plain form
56639 86213 85758 85478 85032 84374 83686 82936 82038 81308 81143 81308 81144 80510 79958 79843 79860 79649 79322 79043 78516
56620 78516 77386 75953 75062 75226 76097 76872 77116 77125 77467 78263 79044 79374 79347 79255 79026 78344 77239 76167 75499
56601 75499 75273 75460 76099 77043 77891 78360 78478 78371 78148 78155 79043 81249 84488 87938 90864 93005 94496 95561
56583 95561 96278 96579 96490 96337 96554 97306 98495 100079 102058 104138 105823 107068 108490 110579 112985 115037
56567 115037 116808 119048 122023 125037 127426 129614 132646 136884 141622 145963 149618 152821 155879 158982
56553 158982 162092 164808 166641 167655 168502 169479 169923 169014 166995 164966 163466 161892 159505 156435 153315
56538 153315 150326 147126 143580 140082 137068 134505 132034 129457 126938 124748 122996 121706 121036 121141 121744
56523 121744 122123 121780 120937 120106 119345 118298 116914 115653 114952 114792 114854 114766 114167 112893 111267 109937 109335
56506A09335J92Q98J235O33r37k305k151n94R77J608J558J315P57l72j658k246
56490A08245j619MJ849L050L191K529J701J253J476K334L257L384K499J411R89
56475A35553J178J437J797K649L767M447M561M677N033N252N126M960M907M765
56461A90109M602M860N478N602M559K675Q18m36j009j137j296j894k795l463l701
56446B02972l753l694l242k406j718j556j659j666j694k075k770l347l455l186
56432A66751k962l010k923k097q21k98j088k133k127j317r04j043p46K61R95P35
56416A47273l8o52j107j462j379p94k95l19o38r48j260j372q69K6M36J40NO45
56398A37392J457J554Q81l6p44p80J31J283J347J31q94n27O35J425J842K498L135
$$ plain form
56506 109335 109527 110425 111660 112293 111356 109051 106900 106306 107283 108891 110449 111764 112521 112149 110491 108245
56490 108245 106626 106630 108479 111529 114720 117249 118950 120203 121679 124013 127270 130654 133153 134564 135553
56475 135553 136731 138168 139965 142614 146381 150828 155389 160066 165099 170351 175477 180437 185344 190109
56461 190109 194711 199571 205049 210651 215210 217885 218703 218267 217258 216121 214825 212931 210136 206673 202972
56446 202972 199219 195525 192283 189877 188159 186603 184944 183278 181584 179509 176739 173392 169937 166751
56432 166751 163789 160779 157856 155759 154938 154640 153552 151419 149292 147975 147071 146028 145282 145543 146538 147273
56416 147273 147235 146583 145476 144014 142635 141841 141546 141227 140589 139641 138381 137009 136140 136166 136602 136742 136747 137392
56398 137392 138849 140403 141284 141248 140504 139724 139855 141138 142485 142616 141722 141195 141830 143255 145097 147595 150730
56381A50730K977K165J579J436J090K77l73j75P62J750K175J949J439J017O40
56366A69438K00O6O61J581J977J879K132K828K924J887O18J07J74K64L88N77L62
56349A88063k27k24P23J441R32J02L81J505K151K102K138K282J868J199J472K833
56333B08741L903L668K700K158K435L151L704L595K838K192K454L489M442M802
56319B54272M700M397M120M238M864N449N379M854M530M503M370L986L462K671
56305C15795J574Q25J137K158K758K421J598Q50M44O29J489K502L010L086L284
56290C43560L629L749L791M344N428O363O809P124P630Q253Q999J0132J1663J3266
56276D44740J4830J6603J8633K0558K2094K3372K4810K6900L0025L4054L8351
$$ plain form
56381 150730 153707 155872 157451 158887 159977 160254 159881 159706 160468 162218 164393 166342 167781 168798 169438
56366 169438 169638 169704 170365 171946 173923 175802 177934 180762 183686 185573 186191 186298 186472 186736 187124 187701 188063
56349 188063 187836 187612 188335 189776 190708 190810 191191 192696 194847 196949 199087 201369 203237 204436 205908 208741
56333 208741 212644 216312 219012 221170 223605 226756 230460 234055 236893 239085 241539 245028 249470 254272
56319 254272 258972 263369 267489 271727 276591 282040 287419 292273 296803 301306 305676 309662 313124 315795
56305 315795 317369 318194 319331 321489 324247 326668 328266 329116 329560 330189 331678 334180 337190 340276 343560
56290 343560 347189 350938 354729 359073 364501 370864 377673 384797 392427 400680 409679 419811 431474 444740
56276 444740 459570 476173 494806 515364 537458 560830 585640 612540 642565 676619 714970
56265G14970M2522M6945N2168N8117O4385P0907P7749Q4555R0868R6712J02205
56254A502103J06854J09917J11308J11391J09991J06313R9813R0708P9676O7511
56244B495585N4894M2206K9637J7721P233j642r502j6759k3067k8243l2903l7746
56232B497414m2850m8302n4636o1861o8905p4807p9763q4208q7798r0135r1562
56221A712587r2159r1050q7888q4051q0829p7440p2479o6552o1602n8032n4391
56210H86114m9702m4381l8977l3628k8826k5221k2542j9953j7446j5590j4162
56199E75686j2357j0293q808p906o872n845n703o314o400n395m047k961j884o87
56185D90214J20K39lj61J96J596L919N854O307N967O251P151P630P697Q343R637
$$ plain form
56265 714970 757492 804437 856605 914722 979107 1050014 1127763 1212318 1303186 1399898 1502103
56254 1502103 1608957 1718874 1830182 1941573 2051564 2157877 2257690 2348398 2428074 2495585
56244 2495585 2550479 2592685 2622322 2640043 2647276 2645634 2636132 2619373 2596306 2568063 2535160 2497414
56232 2497414 2454564 2406262 2351626 2289765 2220860 2146053 2066290 1982082 1894284 1804149 1712587
56221 1712587 1620428 1529378 1441490 1357439 1276610 1199170 1126691 1060139 998537 940505 886114
56210 886114 836412 792031 753054 719426 690600 665379 642837 622884 605438 589848 575686
56199 575686 563329 553036 544228 536322 529450 523605 517902 511588 505188 499793 495746 492785 490901 490214
56185 490214 490334 490573 490570 490409 490605 492201 496120 501974 508281 514248 520499 527650 535280 542977 551320 560957
56169E60957J0565J0778J0844J0922J0830J1255J2978J5009J5417J4169J3226
56158F96950J3637J4483J5021J5868J7430J9137K0924K3868K8602L4500M1004
56147I41424M8450N7229O7538Q0128R5700J13173J30085J44951J57464J66052
56137B002194J67235J58545J41024J18567R6063P8131O7378O2714O0199N5938
56127C007988M7525L3695J5071m654k0535l0254l5032l7284l9706m6318o0912
56116B829584q3085j07862j30121j47388j58062j60163j53566j41297j26735j11057
56106A510248r4564p8556o4388n2060m1055l1319k2695j4804q258m363k932k171
56094A093083j350j607l416n399o621p823r395j0210r665q823q293p053m606k277
$$ plain form
56169 560957 571522 582300 593144 604066 614896 626151 639129 654138 669555 683724 696950
56158 696950 710587 725070 740091 755959 773389 792526 813450 837318 865920 900420 941424
56147 941424 989874 1047103 1114641 1194769 1290469 1403642 1533727 1678678 1836142 2002194
56137 2002194 2169429 2327974 2468998 2587565 2683628 2761759 2829137 2891851 2952050 3007988
56127 3007988 3055513 3089208 3104279 3099625 3079090 3048836 3013804 2976520 2936814 2890496 2829584
56116 2829584 2746499 2638637 2508516 2361128 2203066 2042903 1889337 1748040 1621305 1510248
56106 1510248 1415684 1337128 1272740 1220680 1179625 1148306 1125611 1110807 1102549 1098186 1095254 1093083
56094 1093083 1091733 1090126 1086710 1081311 1074690 1066867 1057472 1047262 1037597 1028774 1020481 1013428 1008822 1006545
56080A006545j027M3J693L085L653M499O408Q302R132R588J0522J1428J1805J2358
56066A098034J3496J4338J4426J4807J6190J7665J8294J8375J8257J7705J7131
56055A278718J7600J8871J9539J9582K0416K1983K2564K2097K2596K4407K5341
56044A513714K4682K4624K6268K7633K7443K7465K9078L0777L1255L1935L4122
56033A828996L6618L8345M0468M3775M6745M8360N0035N2841N5705N8050O1078
56022B361016O4749O6973O7572O9200P2581P4973P5359P6648Q0255Q3284Q4024
56011C176634Q5401Q9650R4287R6925R9553J04198J08991J12472J17213J25009
56001D210333J33002J38777J44710J53006J61224J67251J73871J83682J94387
$$ plain form
56080 1006545 1005518 1005561 1007254 1010339 1013992 1018491 1024899 1033201 1042333 1051921 1062443 1073871 1085676 1098034
56066 1098034 1111530 1125868 1140294 1155101 1171291 1188956 1207250 1225625 1243882 1261587 1278718
56055 1278718 1296318 1315189 1334728 1354310 1374726 1396709 1419273 1441370 1463966 1488373 1513714
56044 1513714 1538396 1563020 1589288 1616921 1644364 1671829 1700907 1731684 1762939 1794874 1828996
56033 1828996 1865614 1903959 1944427 1988202 2034947 2083307 2133342 2186183 2241888 2299938 2361016
56022 2361016 2425765 2492738 2560310 2629510 2702091 2777064 2852423 2929071 3009326 3092610 3176634
56011 3176634 3262035 3351685 3445972 3542897 3642450 3746648 3855639 3968111 4085324 4210333
56001 4210333 4343335 4482112 4626822 4779828 4941052 5108303 5282174 5465856 5660243
55992E660243K03896K14924K29652K45172K59376K75620K96172L17123L35704
55983H037882L56219L82471M10970M38471M69220N07321N49130N91219O38480
55974A2381383O95804P59588Q26619R03265R96041J101753J217676J352342J514812
55965B1749283J703313J917471K171517K481980K854617L299629L847473M532692
55957D4557975N376518O403624P656499R169173J0950422J3027663J5489471J8456019
55949A31087364K2039196K6337458L1288662L6229138L9503806L8809254L2420096
55942C57714974K0461506N142785j0260872k2867923l1137719l4978775l5280178
55935B48793798l3278911l0070525k6408641k2747449j9351571j6352254j3773688
$$ plain form
55992 5660243 5864139 6079063 6308715 6553887 6813263 7088883 7385055 7702178 8037882
55983 8037882 8394101 8776572 9187542 9626013 10095233 10602554 11151684 11742903 12381383
55974 12381383 13077187 13836775 14663394 15566659 16562700 17664453 18882129 20234471 21749283
55965 21749283 23452596 25370067 27541584 30023564 32878181 36177810 40025283 44557975
55957 44557975 49934493 56338117 63994616 73163789 84114211 97141874 112631345 131087364
55949 131087364 153126560 179464018 210752680 246981818 286485624 325294878 357714974
55942 357714974 378176480 383319265 373058393 350190470 319052751 284073976 248793798
55935 248793798 215514887 185444362 159035721 136288272 116936701 100584447 86810759
55928H6810759j1583512r742583q211813o940918n879915m996695m268643l666360
55920C1520320l160261k734649k381005k084233j827988j606675j420057j261369
55912A5044083j121484r99123q96307q08492p28847o57733n98646n48866n02716
55903H181869m60207m24179l92519l61092l31068l05981k84690k64038k45205
55894E112890k30689k18159k03921j89497j78400j69315j58712j47456j38614
55885C478127j31295j22623j13446j06309j00080r2201q3979p8086p3128o6208
55875B510772n8834n4653n3238n1634n0380n2405n7088o0686o1829o1924o1108
55864A886993n8348n4690n2110n0058m6942m3792m2531m1996l9703l6223l3755
$$ plain form
55928 86810759 75227247 65484664 57272851 50331933 44452018 39455323 35186680 31520320
55920 31520320 28360059 25625410 23244405 21160172 19332184 17725509 16305452 15044083
55912 15044083 13922599 12923476 12027169 11218677 10489830 9832097 9233451 8684585 8181869
55903 8181869 7721662 7297483 6904964 6543872 6212804 5906823 5622133 5358095 5112890
55894 5112890 4882201 4664042 4460121 4270624 4092224 3922909 3764197 3616741 3478127
55885 3478127 3346832 3224209 3110763 3004454 2904374 2812173 2728194 2650108 2576980 2510772
55875 2510772 2451938 2397285 2344047 2292413 2242033 2189628 2132540 2071854 2010025 1948101 1886993
55864 1886993 1828645 1773955 1721845 1671787 1624845 1581053 1538522 1496526 1456823 1420600 1386845
55853A386845l1845k8621k5022k3526k3807k3754k3614k4911k6330k5187k2223
55842A108005k0554k0412j9232j6609j4852j4601j3966j2391j1616j2350j3261
55831I38161j3659j4212j4822j4589j3934j4041j4391j3575j2255j2405j3901
55820G86377j4719j4372j4221j4582j4380j3636j3436j3418j2116r791q185p448
55808F36073n952l417j440o07M42K636N247P291Q281P657N436L113J938P16k368
55793F65046o318q353q024p478p570o631l507N59L657M655K709k404q931j4105
55779F03305j6879j8144j8313j6843j4152j1730r957p809n104l180k981m281o932
55766D67000j0970j5213j7668j7765j6592j4791j2116r218p759q122q720q197
$$ plain form
55853 1386845 1355000 1326379 1301357 1277831 1254024 1230270 1206656 1181745 1155415 1130228 1108005
55842 1108005 1087451 1067039 1047807 1031198 1016346 1001745 987779 975388 963772 951422 938161
55831 938161 924502 910290 895468 880879 866945 852904 838513 824938 812683 800278 786377
55820 786377 771658 757286 743065 728483 714103 700467 687031 673613 661497 651706 643521 636073
55808 636073 630121 626704 625264 624657 625099 627735 632982 640273 648554 656211 661647 664760 666698 667414 665046
55793 665046 658728 650375 642351 634873 627303 620672 617165 617724 621381 626036 628745 626341 617410 603305
55779 603305 586426 568282 549969 533126 518974 507244 497287 489478 484374 481194 478213 473932 467000
55766 467000 456030 440817 423149 405384 388792 374001 361885 352667 344908 336786 328066 319869
55754C19869o969o054n757n906o254o292n759n251n419n719n237m282l824l786
55740B43360l432k970l086l365k951k358k650l182k399n91L51l2k45L67N74m14
55724B16977j652k166k264k508k789k995l282l378k856k108j805j539n16O91Q56
55709A88666L38O43J807K299J637R62P63J91r50j597j447j530k146k144j014R3
55693A86571K83J81M92Q97J140J658K413K501J695R47P64M88j91m57J78J004J317
55676B01881J267R89K16p49j050o98n89p66k60R93J775J729K047L290M327M316
55660B18718M076M425M797M567M317M588M691L956K933K258J464J6j562k645l494
55645B53105m289m295l137j925j915k821l553l850m157m544m797n063n535n993
$$ plain form
55754 319869 312900 306846 301089 295183 288929 282637 276878 271627 266208 260489 255252 250970 247146 243360
55740 243360 239928 236958 233872 230507 227556 225198 222548 219366 216967 216376 216727 216695 216450 216817 217391 216977
55724 216977 215325 213159 210895 208387 205598 202603 199321 195943 193087 190979 189174 187635 187119 187810 188666
55709 188666 189004 189647 191454 193753 195390 196352 197115 197306 196356 194759 193312 191782 189636 187492 186478 186571
55693 186571 186854 187035 187527 188424 189564 191222 193635 196136 197831 198778 199542 200030 199839 199382 199560 200564 201881
55676 201881 203148 204137 204353 203604 202554 201856 201267 200501 200241 201234 203009 204738 206785 210075 214402 218718
55660 218718 222794 227219 232016 236583 240900 245488 250179 254135 257068 259326 260790 260806 259244 256599 253105
55645 253105 248816 244521 241384 239459 237544 234723 231170 227320 223163 218619 213822 208759 203224 197231
55631A97231o293o728p310p387o604n558m927m588m169l765l604l627l815m203
55617A24653m326l506k057j178j325j653j542j470j871k200j872j185o78m28m63
55602I8899r35j438j219m97m27j252j796j322o46o49j032j296j719k391k589k032
55586G7659j680k138k505j892j002r39j434j502j087p36l99J66M29k37j347j859
55570E9497j592j074n01K12P54Q25Q02J125J393R28o8p77q85p21n48l38j2N39
55552E9559J302J756J221%o01J48J540K534K862K561J448j12r09l44O32Q56M99
55535G4952M30Q03J228J618J977J916J352R90J285J623J464J477K433L635L753
55520A00936K772J881J714J866J964K109K196J709M09j307k750l374l106k526
$$ plain form
55631 197231 190938 184210 176900 169513 162909 157351 152424 147836 143667 139902 136298 132671 128856 124653
55617 124653 120327 116821 114764 113586 112261 110608 109066 107596 105725 103525 101653 100468 99790 99362 98899
55602 98899 97964 96526 95307 94810 94383 93131 91335 90013 89367 88718 87686 86390 84671 82280 79691 77659
55586 77659 75979 73841 71336 69444 68442 67503 66069 64567 63480 62744 62345 62511 62940 62703 61356 59497
55570 59497 57905 56831 56330 56542 57296 58121 58923 60048 61441 62369 62301 61524 60639 59918 59370 59032 59020 59559
55552 59559 60861 62617 63838 63838 63237 63385 64925 67459 70321 72882 74330 74218 73309 72965 73597 74453 74952
55535 74952 75382 76185 77413 79031 81008 82924 84276 85266 86551 88174 89638 91115 93548 97183 100936
55520 100936 103708 105589 107303 109169 111133 113242 115438 117147 117556 116249 113499 110125 107019 104493
55506A04493k371k672k882k988l577m570m949m333l670l675l706l075k416k563
55492E7046l041k953k517k401k267j338LO27K89l00p91j393j989k161j936j612
55476C3266j068k15L20m1p46q46m80o30j544k464k760k446j729q98m11l05J22
55459A7125J278K362K374J519O76O3n27o63J17J064R58o0o87m48j21k01k50L3
55441B4612K60K19K72N70O72K84k98o43n83j31M70P28M76J85K70M39L27K20L03
55422B8652nr94j625r19K32K03p09n86J113K678K622J503O45M02L92M21M09J62
55404C4596j87k01P1K4m51p52o24o39j133j534j262o12k08k09m56r20j437j566
55386B2500j150o81o38q43p72k56M35R95J277J248Q89J91o94j259r91q6N58M48
$$ plain form
55506 104493 102122 99450 96568 93580 90003 85433 80484 76151 72481 68806 65100 62025 59609 57046
55492 57046 54005 51052 48535 46134 43867 42529 42532 43159 43448 43148 42357 40964 38975 36814 34878 33266
55476 33266 32198 31983 32303 32262 31516 30670 30190 29560 28016 25552 22792 20346 18617 17719 17308 17003 17125
55459 17125 18403 20765 23139 24658 25334 25397 24870 24207 24324 25388 26346 26286 25599 25151 25030 24829 24579 24612
55441 24612 24872 25091 25363 25933 26605 26889 26591 25948 25365 25234 25704 26432 26908 27093 27363 27802 28129 28349 28652
55422 28652 28647 27653 26028 25109 25341 25544 24835 24249 25362 28040 30662 32165 32810 33212 33604 34025 34434 34596
55404 34596 34409 34208 34279 34303 33852 33100 32476 31837 30704 29170 27908 27296 27088 26879 26423 25503 24066 22500
55386 22500 21350 20669 20031 19188 18416 18160 18595 19590 20867 22115 23004 23195 22501 21242 20251 20165 20723 21171
55368B1171Q0O1K15J68J59M50N24j37r35r30l53j65l69j39M81M55m78j213r08
55349A8137n7M61N11M01K99L35N41N19j59j049j250p25k87j53L07J176J549R43
55331B1499M2m87q40j145q89%N26Pp84q05l07k01m84l96K17O95O01J10m75r32
55311A5952r76n24l9n8m54p06o58n81n15j14P52J622J886J363M34l07n40m16k79
55292A5842k39j81m9J28M60J083J776K013J506M59o94j559j842j525j001o93n34
55275A4950j47N07J024J047N70j64p63q38m91l76q03j151p94j94k01n76l17N96
55257A1879R89L12n16n44j27j86q02j268j092m10L63R18J225J507J804J708J000
55240A6760K64J98M37J8r84j365o54Q9j30q43r65l01M87Q95Q61N55L95Q34J659
$$ plain form
55368 21171 21251 21312 21527 21695 21854 22304 22828 22691 21756 20826 20473 20308 19939 19800 20281 20736 20258 19045 18137
55349 18137 18080 18541 19052 19453 19752 20087 20628 21147 20988 19939 18689 17964 17677 17524 17831 19007 20556 21499
55331 21499 21541 21054 20214 19069 18180 18180 18706 18713 17929 17124 16817 16616 16132 15736 15953 16648 17249 17359 16884 15952
55311 15952 14976 14452 14413 14355 13901 13195 12537 11956 11441 11327 12079 13701 15587 16950 17384 17077 16537 16121 15842
55292 15842 15603 15422 15373 15501 15961 17044 18820 20833 22339 22798 22104 20545 18703 17178 16177 15484 14950
55275 14950 14803 15310 16334 17381 17951 17787 17024 16186 15695 15319 14516 13365 12571 12377 12176 11600 11283 11879
55257 11879 12868 13180 12664 12120 11993 11807 11005 9737 8645 8235 8598 9516 10741 12248 14052 15760 16760
55240 16760 17024 17222 17659 17677 16693 15328 14674 14763 14633 13790 12825 12524 13011 13906 14767 15322 15717 16551 18210
55221A8210J948J185l9q46j059r64o97l41j59j86o5K66K98j86n60k57L19M15q
55202A7274m95q98j278j359q72j94N6p8M5P16J528J870J475N59k63m38p1J83L4
55183A7794j08J5k1m66o71J2J002J088Q3r47j136p72n88p57q35m00M70J222J291
55164A6276P10J19M1L05M73N41Q10J220J273P07j76r07j328j527j515j136l59
55147A5527M67P66L38k99l96J47O90O23J3o52j020j013o93k42L4j02n42q15m69
55128A2362M04J060Q49J22q1O09J440J772J985K521K833K320J677J941K599K154
55112C6567N39o08l74K92L07j34n51j200k127k453j694p91p70j177r84k87J49
55095B4704L29P43J025L35j085j900j311J73J628K524K681K174J415P88K36l82
$$ plain form
55221 18210 20158 21343 21304 20458 19399 18435 17738 17397 17238 17052 16987 17253 17551 17365 16805 16548 16867 17282 17274
55202 17274 16779 15881 14603 13244 12372 12178 12234 12156 12201 12917 14445 16315 17790 18349 18086 17648 17577 17760 17794
55183 17794 17686 17701 17680 17214 16543 16555 17557 18645 18728 17781 16645 15873 15285 14528 13693 13293 13763 14985 16276
55164 16276 16986 17105 17146 17451 17924 18465 19275 20495 21768 22475 22299 21392 20064 18537 17022 15886 15527
55147 15527 15994 16760 17098 16799 16403 16550 17240 17863 17876 17224 16204 15191 14498 14256 14290 14188 13646 12831 12362
55128 12362 12766 13826 14675 14797 14716 15325 16765 18537 20522 23043 25876 28196 29873 31814 34413 36567
55112 36567 37106 36498 36124 36416 36723 36589 36038 34838 32711 30258 28564 27773 27003 25826 24842 24555 24704
55095 24704 25033 25776 26801 27136 26051 24151 22840 23013 24641 27165 29846 32020 33435 34223 34459 34077
55079C4077p81o63l36k68k89J11Q15J214J068O41P4n87r19m53M62Q81M14l96q79
55060C4186q34l31M33J002R62M74N2k10n86r15n63N11J324R17m48j579j649q82
55042C1864r7J35j38m65m63l6O38J177J189O36m8m03m21l24m9N41J103J111P31
55023C6681P15J270J732J602J165P83L25k21l75R3O72R39J161J544J585Q39k34
55006E0276r40j279j524j487j033o91r41j337j267r99j099j273q66j49M8l22o01
54989C4516n58m44j66M96J065R31N59R46J887K142J414Q13J061J457J243Q15R76
54972D9153J735K546K987K733J576L9o29K94K116L584M192M342M579N165O121
54957I0533P276Q402R481J0663J2018J3547J5348J7263J8505J8240J6534J4065
$$ plain form
55079 34077 33296 32633 32297 32029 31740 31851 32666 33880 34948 35589 35663 35076 34157 33704 34166 35047 35461 35065 34186
55060 34186 33352 33021 33454 34456 35418 35892 35944 35734 35148 34233 33670 34181 35505 36422 35974 34395 32746 31864
55042 31864 31767 31902 31764 31299 30836 30800 31438 32615 33804 34440 34392 33989 33568 33244 33195 33736 34839 35950 36681
55023 36681 37396 38666 40398 42000 43165 43948 44273 44052 43677 43770 44442 45381 46542 48086 49671 50510 50276
55006 50276 49336 48057 46533 45046 44013 43322 42381 41044 39777 38778 37679 36406 35540 35391 35439 35117 34516
54989 34516 33958 33514 33348 33844 34909 35840 36399 37345 39232 41374 42788 43601 44662 46119 47362 48177 49153
54972 49153 50888 53434 56421 59154 60730 60769 60140 60434 62550 66134 70326 74668 79247 84412 90533
54957 90533 97809 106211 115692 126355 138373 151920 167268 184531 203036 221276 237810 251875
54945B51875J0883O275J44o229j1300j4561j6400j7155j6904j5840j4339j2753
54933A43696j1383j0467r947r347q185o396m408k849k097j848j291m7J190J440
54919G8061P49K39P52K033L367M522N794P452R426J1403J3085J4499J5874J7114
54905A84370J7580J6682J4475J1329P327K445k908q093j2691j6324j8375j8554
54893A77263j7509j6140j4527j2378j0097q505p559o513n294m590m472m108l160
54880F2411k348k187k215j938j592j409j000j83M18L03l0Q5L60L1r31j771j874
54863D6130j256m38j42p49j787k345k213k015k029j778j124p87j152j405q11R
54847B6108Q3l18k48K04J00o20r16k84M79N21M2l02l31k05J31Q11J636K186K231
$$ plain form
54945 251875 262758 269033 269177 262948 251648 237087 220687 203532 186628 170788 156449 143696
54933 143696 132313 121846 111899 102552 94367 87971 83563 80714 78617 76769 75478 75431 76621 78061
54919 78061 78810 79049 79801 81834 85201 89723 95517 102969 112395 123798 136883 151382 167256 184370
54905 184370 201950 218632 233107 244436 251763 254208 251300 243207 230516 214192 195817 177263
54893 177263 159754 143614 129087 116709 106612 98107 90548 84035 78741 74151 69679 65571 62411
54880 62411 60063 57876 55661 53723 52131 50722 49722 49539 49957 50260 50230 50315 50675 50706 49775 48004 46130
54863 46130 44874 44436 44294 43545 41758 39413 37200 35185 33156 31378 30254 29467 28315 26910 26099 26108
54847 26108 26191 25873 25625 25829 25929 25309 24393 24109 24588 25109 25151 24849 24518 24313 24444 25255 26891 29077 31308
54828C1308J840J252Q24Q35J205J499J388J011P72Q38J005J028J000J232J731
54813D8768K008J647R77Q36J629K910M025M778N299N630N808O108O886Q210R911
54798A15430J1835J3843J5666J6981J7560J7172J5536J2559Q550M031n82n007
54786B43574q900j1857j3623j4240j4041j3476j2795j1884j0550q946p564o743
54774A08955o363o009n260l849j920j26Q21Q41N63O46J210J932K504K885L339
54759A00169M239N659P231Q589R816J1242J2928J4700J6395J7571J7288J4853
54747B40680J0737O084J405l494q338j2137j4373j5570j6182j5808j4188j2209
54735A46607j1067j0781j0321r106p562o293n326m469l830l697l971m108l681
$$ plain form
54828 31308 33148 34400 35224 36059 37264 38763 40151 41162 41934 42772 43777 44805 45805 47037 48768
54813 48768 50776 52423 53400 54236 55865 58775 62800 67578 72877 78507 84315 90423 97309 105519 115430
54798 115430 127265 141108 156774 173755 191315 208487 224023 236582 245132 249163 248581 243574
54786 243574 234674 222817 209194 194954 180913 167437 154642 142758 132208 123262 115698 108955
54774 108955 102592 96583 91323 87474 85554 85428 86249 87090 87653 88299 89509 91441 93945 96830 100169
54759 100169 104408 110067 117298 125887 135703 146945 159873 174573 190968 208539 225827 240680
54747 240680 251417 257501 258906 255412 247074 234937 220564 204994 188812 173004 158816 146607
54735 146607 135540 124759 114438 105332 97770 91477 86151 81682 77852 74155 70184 66076 62395
54722F2395k910k339k009j374k42O61N60l18j148j607j847j683q17K61O27K87
54706D8497J69N88Q08M35J02K41K97j82o26m30j4k6k51j88k9j67l22o6K67K04
54686D9307J09O21J421J593R70K22k11l85k63K49P50O71J50o3M20J302K132K569
54668F1564K433K020K088K810L215K415J045M10N20J76j069k203k249j423m99
54653G1253J23L83K93Q5M4M9j80l82k8P12J085R57R83J374J438P69N3J54J061
54634H0226K190L127L602L414K896K847L421L622K534O05r74j757k282l096m185
54619I6190n174n562m889l246j492m36N3O42J385J660J239P48P38R22O56q7p51
54602H2596j017j182j583j994j872j105k82j07p34j749k709l410l713l410k483
$$ plain form
54722 62395 59485 57146 55137 53763 53521 54182 54742 54424 53276 51669 49822 48139 47322 47583 48210 48497
54706 48497 48666 49254 50062 50497 50599 50840 51137 50955 50329 49899 49885 49859 49608 49420 49391 49224 48902 48836 49103 49307
54686 49307 49416 50037 51458 53051 54021 54243 54032 53647 53384 53633 54383 55054 55204 55141 55561 56863 58995 61564
54668 61564 63997 66017 68105 70915 74130 76545 77590 78000 78520 78696 77627 75424 73175 71752 71253
54653 71253 71376 71759 72052 72137 72181 72230 72050 71668 71640 72352 73437 74394 75377 76751 78189 78958 79011 79165 80226
54634 80226 82416 85543 89145 92559 95455 98302 101723 105345 107879 108484 107510 105753 103471 100375 96190
54619 96190 91016 85454 80565 77319 75827 75391 75444 76086 77471 79131 80370 81118 81856 82778 83434 83347 82596
54602 82596 81579 80397 78814 76820 74948 73843 73561 73454 72720 70971 68262 64852 61139 57729 55246
54587E5246j364o60n85q00q38o44n26o73q48p44m42l08m64o56p48r73j477j845
54569D0651j474m04N96Q74N90L68M43L94j48q40r04j36P50R90P30P03J117J373
54551D5673R47L0q22j320j426j166p11l40p5L33P84P06j32j075j366j085q20o69
54533C7466k31M98R74Q77N57M65O50R26J245J646K047K263K219K034J943K078
54517E7657K255K083J385M24l89r32j394j947k459k487j661l22M50j09j429k105
54501D9020j520l76M49Q03P94K78n90j051o82j58l14q52p83J25J148J632J547
54484D9470J169Q32Q92J291J377O64l93q95n58K76J263K051K029R64l71j014j011
54467E8036j053j153p23J98Q31P85M28P8k52l54L3N43N63K91M31Q59P27m3n83
$$ plain form
54587 55246 53882 53222 52637 51837 50999 50355 49829 49156 48308 47564 47122 46814 46350 45694 44946 43973 42496 40651
54569 40651 39177 38773 39369 40243 40833 41201 41644 42038 41890 41050 40146 40010 40760 41750 42480 43183 44300 45673
54551 45673 46620 46650 45828 44508 43082 41916 41205 40865 40790 41123 41907 42613 42481 41406 40040 38955 38135 37466
54533 37466 37235 37733 38707 39584 40141 40606 41256 42182 43427 45073 47120 49383 51602 53636 55579 57657
54517 57657 59912 61995 63380 63804 63415 62483 61089 59142 56683 54196 52535 52213 52663 52554 51125 49020
54501 49020 47500 47124 47573 48376 49170 49448 48858 47807 47125 46967 46653 45801 45018 45143 46291 47923 49470
54484 49470 50639 51471 52363 53654 55031 55695 55302 54407 53849 54125 55388 57439 59468 60432 60061 59047 58036
54467 58036 56983 55830 55107 55305 56136 56921 57349 57427 57175 56821 56854 57397 57960 58251 58682 59541 60268 60225 59642
54448E9642o20q59j480j596q58k54n06q52m15K66K29l31o17o95j061j312n82Q57
54430D8956J653J094j68j101j178l43J020K081K206J691J238Q52O4q87j136n72
54414E5470j33l48n19O1Q52Q72K25o3M64J236J735K190K923L621L819L658L618
54397G9681L652L294K583K191K376K433J667M58k86m13n53r69j203j034j063j901
54381I0913l162l817l359k315j594j543j684j361o10k42q69k073k805k558j780
54366F1141j194j070j171j083n89R2N00N92R17J759K460K219J286O65P38J018
54350F8280J199J531K000K156J983K072K499K498J761J186J599K450K607J924
54336I5745J130O21J96k58o25r89j563k190k509k540k601k726k672k545k808l564
$$ plain form
54448 59642 59022 58163 56683 55087 54229 53975 53469 52617 52202 52468 52697 52366 51749 51054 49993 48681 48099 48956
54430 48956 50609 51703 51535 50434 49256 48913 49933 52014 54220 55911 57149 58001 58065 57178 56042 55470
54414 55470 55337 54989 54470 54531 55383 56255 56480 56417 56881 58117 59852 62042 64965 68586 72405 76063 79681
54397 79681 83333 86627 89210 91401 93777 96210 97877 98335 98049 97636 97083 96114 94911 93877 92814 90913
54381 90913 87751 83934 80575 78260 76666 75123 73439 72078 71468 71226 70357 68284 65479 62921 61141
54366 61141 59947 58877 57706 56623 56034 56126 56626 57218 58135 59894 62354 64573 65859 66524 67262 68280
54350 68280 69479 71010 73010 75166 77149 79221 81720 84218 85979 87165 88764 91214 93821 95745
54336 95745 96875 97496 97692 97434 96809 95820 94257 92067 89558 87018 84417 81691 79019 76474 73666 70102
54320G0102m188l927k704j244m82p49j548k153k351k321j954r05N34J304P54m46
54304D7722j083p64j18Q6l57j030j241o11L78P68K74l89o14p48j285j804j497
54287C7687n09J31j45q34j134p81j2Q21J393J525J261P46N0o86j127j027n48l4
54269C6777L77O98Q55Q19P34O57L96p4k57L02J293J868J553O64j32l62l0M31N35
54250D7104K70M9O3j8m33q58q20l01L38P21N38k42r85q46O4N53l0p88n95K10M52
54229D4446o3m58k97j8J26L96O57K05j022j899j433p4Q37O10k08o07j70O39J059
54210D2726Q57M52K23M3k58m18k34o9l21o09k83N00R90J039J206J598J542P04
54192D9688k36n23k97j78l10l47j13J30ln90j250j374p61L5K60k02p83r72o90
$$ plain form
54320 70102 65914 61987 59283 58039 57557 56808 55260 53107 50756 48435 46481 45576 46110 47414 48168 47722
54304 47722 46639 45875 45757 45843 45486 44456 43215 42604 42982 43750 44024 43635 43021 42273 40988 39184 37687
54287 37687 37178 37309 37164 36330 35196 34415 34403 35224 36617 38142 39403 40149 40199 39513 38386 37359 36811 36777
54269 36777 37154 37852 38707 39526 40260 40917 41313 41239 40982 41284 42577 44445 45998 46662 46530 46168 46138 46569 47104
54250 47104 47374 47423 47486 47468 47035 46177 45357 45056 45394 46115 46653 46411 45426 44580 44644 45197 45167 44379 43784 43994 44446
54229 44446 44383 43925 43628 43610 43736 44132 44789 44994 43972 42073 40640 40566 41403 42013 41805 41198 41028 41667 42726
54210 42726 43583 44035 44258 44301 44043 43625 43391 43322 43001 42392 42109 42609 43599 44638 45844 47442 48984 49688
54192 49688 49452 48929 48632 48454 48144 47797 47684 47814 47811 47221 45971 44597 43836 43871 44131 43929 43146 42174 41484
54173D1484j09M48N25o4q52j187j037q53p61n27j95m6Q9O68J491J755J233O43
54155D2705N02M29k5n79p79p46q00q32o63n18o47q14o89m31l21j61L89J095J355
54136C8470R78L46j48l78l92l57m97p61p74m63l62q48j322q60M27J342J054K5
54118C5480p55r38q42o24m6R08J695J744J213P81P23O07O3n21m91O3M04J65j99
54099C9430j32L57R06J252J257Q50K56l0J56M04L20P6Q2L77P24J082J509J758
54081E0634J389L87o64j117q67l42n6j20k15n0K00J67l6J62R11J560J464Q56M88
54062E4751O67J123J654K260K648K272J106Jj69N55J376J702J663J709K014K358
54046G7690K502K538K850L687M775N462N380M941M923N566O292O472O223O168
$$ plain form
54173 41484 41375 41823 42348 42284 41432 40245 39208 38355 37594 37067 36872 36826 36915 37583 39074 40829 42062 42705
54155 42705 43207 43636 43611 43032 42253 41507 40707 39875 39212 38694 38047 37233 36544 36113 35792 35631 36020 37115 38470
54136 38470 39448 39794 39646 39268 38876 38519 38022 37261 36487 36024 35662 34814 33492 32632 33059 34401 35455 35480
54118 35480 34725 33787 32945 32321 32275 33183 34878 36622 37835 38616 39339 39946 40009 39488 38997 39060 39464 39629 39430
54099 39430 39298 39655 40561 41813 43070 43920 44176 44146 44302 44706 45026 45102 45184 45561 46285 47367 48876 50634
54081 50634 52023 52410 51746 50629 49762 49420 49364 49244 49029 48979 49179 49346 49310 49472 50383 51943 53407 54263 54751
54062 54751 55418 56541 58195 60455 63103 65375 66481 66482 66313 66868 68244 69946 71609 73318 75332 77690
54046 77690 80192 82730 85580 89267 94042 99504 104884 109825 114748 120314 126606 133078 139301 145469
54032A45469O483O711O443N823N126M299L263K330J899J864J712J185N03p6n48
54017A92486j019j507j951k243k280k091j939k100k640l447m326m924m875m264
54003A52880l705l625l759l697l576l747l991l718k832j837j107o68n93r21j249
53988A13855j062n42l78p21r97q67o34m72j07N02Q13N35J30P2K15K88M13O39N68
53969A12250j8p13j179j755k681l308k872j720r40r31j134j023o57k12L38R38
53953I4383J300J191O42m0k81M48J964L263L575L249L142L399L515L364L480M282
53937A30876N626P139Q453R145Q988Q339P777P366O755N872M906L671J862j9q65
53922B15891m13L25N23O41J437K630L401L765M447N539O248O166N924O199O664
$$ plain form
54032 145469 151952 158663 165106 170929 176055 180354 183617 185947 187846 189710 191422 192607 193110 193034 192486
54017 192486 191467 189960 188009 185766 183486 181395 179456 177356 174716 171269 166943 162019 157144 152880
54003 152880 149175 145550 141791 138094 134518 130771 126780 123062 120230 118393 117286 116618 116025 115104 113855
53988 113855 112793 112251 111873 111152 110155 109288 108654 108182 108075 108577 109390 109925 110055 110127 110342 110630 111043 111682 112250
53969 112250 112232 111519 110340 108585 105904 102596 99724 98004 97064 96133 94999 93976 93319 93107 93445 94383
53953 94383 95683 96874 97516 97476 97195 97643 99607 102870 106445 109694 112836 116235 119750 123114 126594 130876
53937 130876 136502 143641 152094 161239 170227 178566 186343 193709 200464 206336 211242 214913 216775 216756 215891
53922 215891 215478 215803 216326 216967 218404 221034 224435 228200 232647 238186 244434 250600 256524 262723 269387
53907B69387O477N459M173K978J572l19k247l367l386k824k383k258k252k395
53893B68615l054m337n668o267o086n915o390p129p224o500n827o028o930p710
53879A83550p878p437o454m984l484k668k816l543m275m706m715m275l652l240
53865A19423l079k806k309k002k268k916l391l269k396r80K76N95J7n71n52l48
53849I3424o22j267j690j771j817j854j585j011m50N2P34J513J883J545P91J25
53833H8000j89j99j60l45o76p01j90M08N32K90J21m4n45j048o92N64J569J383
53815H8078M46j09K23J078J966K622K971L118L312L539L450K997K866L667M974
53800A25198N666N303M579M378M824N465N861N736M890L476K220J898K519L291
$$ plain form
53907 269387 275864 281323 285496 288474 290046 289727 287480 284113 280727 277903 275520 273262 271010 268615
53893 268615 265561 261224 255556 249289 243203 237288 230898 223769 216545 210045 204218 198190 191260 183550
53879 183550 175672 168235 161781 156797 153313 150645 147829 144286 140011 135305 130590 126315 122663 119423
53865 119423 116344 113538 111229 109227 106959 104043 100652 97383 94987 94007 94283 94878 94895 94324 93772 93424
53849 93424 92802 91535 89845 88074 86257 84403 82818 81807 81357 81409 82143 83656 85539 87084 87875 88000
53833 88000 87811 87612 87452 87107 86431 85730 85540 85948 86480 86770 86891 86847 86302 85254 84562 85126 86695 88078
53815 88078 88524 88415 88638 89716 91682 94304 97275 100393 103705 107244 110694 113691 116557 120224 125198
53800 125198 130864 136167 140746 145124 149948 155413 161274 167010 171900 175376 177596 179494 182013 185304
53786A85304L439K821J725M36p19j290j117p64j069k182l438m233m614m838m806
53771A64655m362l875l938m524m829m097k395n08P59J108P81K04l57p36o68m1
53755A37177O17M09q88k385l024k714k116j715j609j913k637l240l097k419k101
53740A08345k419k619k104j347j131j386j415r65m38j59j6J11K5m61j108j455
53724I1458j309r44p63q23p76l24M58J288K029K604K783K407J861J819K367K734
53708A06869K187Q54m83j216j161l19J186L009M667N763O005N270L872K536J742
53693A40781J199L72o24j096p97l69n24j170j630j512j031n84l25j81l7K11O19
53676A33302J125J540J651J373Q08J89k38l65k28N7L35L96P1n41j049j072n78
$$ plain form
53786 185304 188743 191564 193289 193725 193006 191716 190599 189835 188766 186584 183146 178913 174299 169461 164655
53771 164655 160293 156418 152480 147956 143127 139030 136635 136127 136886 137994 138775 138979 138622 137886 137218 137177
53755 137177 137794 138203 137315 134930 131906 129192 127076 125361 123752 121839 119202 115962 112865 110446 108345
53740 108345 105926 103307 101203 99856 98725 97339 95924 94959 94521 94362 94346 94457 94482 94021 92913 91458
53724 91458 90149 89205 88442 87619 86843 86519 86977 88265 90294 92898 95681 98088 99949 101768 104135 106869
53708 106869 109056 109910 109427 108211 107050 106731 107917 110926 115593 121356 127361 132631 136503 139039 140781
53693 140781 141980 142352 141728 140632 139835 139466 138942 137772 136142 134630 133599 133015 132690 132509 132472 132683 133302
53676 133302 134427 135967 137618 138991 139799 139988 139750 139385 139157 139214 139549 139945 140016 139475 138426 137354 136776
53659A36776J71Q57J219J060M57p4KN41P41J11q73j367j132n44J40Q99J409J063
53641A41456j63j375j669j094l54J37M43O19N36K52P2J11J20p8k60o9M76J001
53623A40161J217J216J312J676K117K260J966J548J521K046K685K786K228J642
53609A66381J719K336K660K223J563J475J991K579L098L840M663M886M355L875
53595B07644M086M449M039K919J957J568J429J349J598K171K494K195J636J309
53581B40843J154R02P05R14J379J506J045M42K99P38J410J980K364K536K341J645
53565B62203O21k07l45K30R72J216P93K30J94P62J375J601J608J705J754J399
53549B76111P66L88M62O97Q50Q84O05j69r23q21n4J3j258k569k312q01K45J33
$$ plain form
53659 136776 136947 137804 139023 140083 140540 140466 140468 141009 141750 141861 140988 139621 138489 137945 138085 138984 140393 141456
53641 141456 141293 139918 138249 137155 136801 136938 137381 138000 138536 138788 138860 138971 139091 139013 138753 138684 139160 140161
53623 140161 141378 142594 143906 145582 147699 149959 151925 153473 154994 157040 159725 162511 164739 166381
53609 166381 168100 170436 173096 175319 176882 178357 180348 182927 186025 189865 194528 199414 203769 207644
53595 207644 211730 216179 220218 223137 225094 226662 228091 229440 231038 233209 235703 237898 239534 240843
53581 240843 241997 242899 243604 244518 245897 247403 248448 248890 249189 249927 251337 253317 255681 258217 260558 262203
53565 262203 262824 262617 262272 262502 263474 264690 265483 265713 265907 266669 268044 269645 271253 272958 274712 276111
53549 276111 276877 277265 277727 278424 279274 280158 280763 280594 279671 278850 278796 278809 277551 274982 272670 271869 272114 272247
53531B72247j06M18J152J206Q50J125K327L635M169L941L637L753M187M665N286
53516C12492O250P152P157O217N557O286P922R041R153R124R750J0817J1800J2719
53502D31437J3815J4924J5664J5945J5957J5922J6008J6306J6728J7137J7637
53491F07480J8390J9132J9316J8886J8415J8318J8377J8278J8140J8201J8393
53480H11326J8573J8863J9375J9862K0028J9961J9950J9965J9660J8838J7740
53469A024141J6812J6318J6100J5747J5058J4270J3610J2814J1461R744Q407P798
53457A182280P382O350M418J839r44l516n585p099q134q723q982r312j0012j0855
53443A129107j1490j2145j3287j4615j5250j5103j5188j6170j7396j7855j7523
$$ plain form
53531 272247 272141 272559 273711 274917 275767 276892 279219 282854 287023 290964 294601 298354 302541 307206 312492
53516 312492 318742 325894 333051 339268 344825 351111 359033 368074 377227 386351 396101 406918 418718 431437
53502 431437 445252 460176 475840 491785 507742 523664 539672 555978 572706 589843 607480
53491 607480 625870 645002 664318 683204 701619 719937 738314 756592 774732 792933 811326
53480 811326 829899 848762 868137 887999 908027 927988 947938 967903 987563 1006401 1024141
53469 1024141 1040953 1057271 1073371 1089118 1104176 1118446 1132056 1144870 1156331 1166075 1174482 1182280
53457 1182280 1189662 1196012 1200430 1202269 1201325 1197809 1192224 1185125 1176991 1168268 1159286 1149974 1139962 1129107
53443 1129107 1117617 1105472 1092185 1077570 1062320 1047217 1032029 1015859 998463 980608 963085
53432I63085j7097j6910j6765j6410j5709j4623j3484j2915j2966j2820j1855
53421H01531j0446r163p776n954m352l886m124l643k027l91L70P93J732L015L917
53406G59596M486N458P115Q888J0164J0930J1536J2231J3086J4158J5476J6987
53394H90111J8598K0239K1856K3388K4835K6289K7761K9039K9856L0247L0626
53383A172845L1416L2670L4180L5750L7166L8100L8388L8349L8422L8534L8156
53372A573976L7125L5917L4972L4107L2902L1307K9512K7456K4891K1903J8935
53361A903003J6264J3662J0788P725M921K523Q5k879o105q844j0944j3109j5794
53348A901296j8489k0638k2749k5686k9193l2112l3973l5328l6463l6855l6254
$$ plain form
53432 963085 945988 929078 912313 895903 880194 865571 852087 839172 826206 813386 801531
53421 801531 791085 781922 774146 768192 763840 759954 755830 752187 750160 749769 750139 750932 752664 755679 759596
53406 759596 764082 769540 776655 785543 795707 806637 818173 830404 843490 857648 873124 890111
53394 890111 908709 928948 950804 974192 999027 1025316 1053077 1082116 1111972 1142219 1172845
53383 1172845 1204261 1236931 1271111 1306861 1344027 1382127 1420515 1458864 1497286 1535820 1573976
53372 1573976 1611101 1647018 1681990 1716097 1748999 1780306 1809818 1837274 1862165 1884068 1903003
53361 1903003 1919267 1932929 1943717 1951442 1956363 1958886 1958971 1956092 1949987 1941143 1930199 1917090 1901296
53348 1901296 1882807 1862169 1839420 1813734 1784541 1752429 1718456 1683128 1646665 1609810 1573556
53337A573556l5201l4060l2526l0597k9165k8871k9229k9609l0312l1675l2891
53326A229420l2750l1244k9371k7648k5849k4047k2858k2427k2063k1065j9432
53315I50666j7562j5785j4243j2958j1899j1212j1130j1406j1223j0039q197o244
53303H08768m276k425j364j355j361k36J489K251J816J662K825M592N825O481
53289H24692P120P769Q175Q620R671J1295J2891J4113J5198J6482J7841J8760
53277I72627J8789J8010J6963J6064J5226J4262J3360J2774J2203J1107R570Q260
53265A139215P396O410M823K982J559P03M2o99j471k233l213m707o641q457r663
53250A126046j0471j1509j2858j3802j3932j3941j4776j6345j7768j8559j8902
$$ plain form
53337 1573556 1538355 1504295 1471769 1441172 1412007 1383136 1353907 1324298 1293986 1262311 1229420
53326 1229420 1196670 1165426 1136055 1108407 1082558 1058511 1035653 1013226 991163 970098 950666
53315 950666 933104 917319 903076 890118 878219 867007 855877 844471 833248 823209 815012 808768
53303 808768 804492 802067 800703 799348 797987 797751 799240 801491 803307 804969 807794 812386 818211 824692
53289 824692 831812 839581 847756 856376 866047 877342 890233 904346 919544 936026 953867 972627
53277 972627 991416 1009426 1026389 1042453 1057679 1071941 1085301 1098075 1110278 1121385 1130955 1139215
53265 1139215 1146611 1153021 1157844 1160826 1162385 1163088 1163130 1162431 1160960 1158727 1155514 1150807 1144166 1135709 1126046
53250 1126046 1115575 1104066 1091208 1077406 1063474 1049533 1034757 1018412 1000644 982085 963183
53239I63183j8921j8526j7910j7496j7296j6966j6462j6073j5771j5233j4509
53228G78020j4042j3943j3859j3617j3399j3244j3013j2818j2822j2654j1746
53217F32863j0235q770p462n905m223l099k679k488k550l412m767n350m763m222
53203E62938m778n846o360o325o331o330n979n495n187m705l749k960l071l682
53189D92140l894l780m115m941n539n691n914o400o707o618o469o488o484o345
53175D12755o186n995n695n585o054o836p199o932o494o134n574m728m103m161
53161C31079m680n115n206n088n052n306n767o034n837n361m864m195l159k173
53147B63242j914k367k896l189l484l767l539k760k283k848m011m652m296l508
$$ plain form
53239 963183 944262 925736 907826 890330 873034 856068 839606 823533 807762 792529 778020
53228 778020 763978 750035 736176 722559 709160 695916 682903 670085 657263 644609 632863
53217 632863 622628 613858 606396 600491 596268 593169 590490 588002 585452 582040 577273 571923 567160 562938
53203 562938 558160 552314 545954 539629 533298 526968 520989 515494 510307 505602 501853 498893 495822 492140
53189 492140 488246 484466 480351 475410 469871 464180 458266 451866 445159 438541 432072 425584 419100 412755
53175 412755 406569 400574 394879 389294 383240 376404 369205 362273 355779 349645 344071 339343 335240 331079
53161 331079 326399 321284 316078 310990 305938 300632 294865 288831 282994 277633 272769 268574 265415 263242
53147 263242 261328 258961 256065 252876 249392 245625 242086 239326 237043 234195 230184 225532 221236 217728
53133B17728l103l317l761l930l739l552l609l613l087k109j297j077j322j740
53119A78472k152k307j902j123o66q83j265j184p77o55r42j264j540k090k779
53104A56943k808j830p44p05j568k060j529p32n56p14l58N05J116J259J495K013
53088A49727K179J634J034J112J614J848J869K207K723K584J445n6j144j727k155
53073A64894k617l067l402l543l493l388l333l144k530j592q56p41j146j638j860
53058A28544j708j324r69p73o43n03n20q51j312j535j393j037o44l65m35q92j357
53041A12283j439j307j449j848j950j489q85n95n02k38K76Q19J181J147N09o10
53025A03903j549j650r45j23J93k0l46m52l65l23m49o68q71j031j062p81k45Q1
$$ plain form
53133 217728 214625 211308 207547 203617 199878 196326 192717 189104 186017 183908 182611 181534 180212 178472
53119 178472 176320 174013 172111 170988 170322 169439 168174 166990 166213 165558 164616 163352 161812 159722 156943
53104 156943 154135 152305 151561 150856 149288 147228 145699 144967 144411 143697 143339 143844 144960 146219 147714 149727
53088 149727 151906 153540 154574 155686 157300 159148 161017 163224 165947 168531 169976 169920 168776 167049 164894
53073 164894 162277 159210 155808 152265 148772 145384 142051 138907 136377 134785 133929 133188 132042 130404 128544
53058 128544 126836 125512 124543 123770 123127 122624 122104 121253 119941 118406 117013 115976 115332 114967 114532 113640 112283
53041 112283 110844 109537 108088 106240 104290 102801 101916 101321 100819 100581 100857 101676 102857 104004 104513 103903
53025 103903 102354 100704 99759 99636 99829 99809 99463 99011 98646 98323 97874 97206 96335 95304 94242 93461 93216 93297
53007I3297k35r65j417j236o86j21M54J119J675J817J541J096O58K56j00k85j55
52990I6713L17Q81J030M06p08j457j204j73P89J041O80L12M80J217K040K351J965
52973A06680J262P64N92M21M8j59L39J446K252J908N94o45r38k87O87J384J556
52956A17904J298R49Q46J058J475K037K607K701J909P01K56J179K711L596L378
52941A44605K568J916J909K615L481L610K764J822J702K136K133J364L83l39p97
52926A71872r55p12m52q37j806k523k520k209j931j371l84L10j9r87j528j274
52910A52674q59q88j166j048l19N09P27J76n83r98j120j234j115l24Q20J261N34
52893A47047n40q75l41L79P17N21j76j097j634j336m61L01O04O79Q89J316J713
$$ plain form
53007 93297 93062 92097 90680 89444 88758 88637 89091 90210 91885 93702 95243 96339 96997 97253 97153 96868 96713
52990 96713 97030 97911 98941 99347 98639 97182 95978 95805 96594 97635 98315 98627 99107 100324 102364 104715 106680
52973 106680 107942 108706 109298 109719 109767 109608 109947 111393 113645 115553 116147 115502 114564 114277 114964 116348 117904
52956 117904 119202 120151 120997 122055 123530 125567 128174 130875 132784 133485 133741 134920 137631 141227 144605
52941 144605 147173 149089 150998 153613 157094 160704 163468 165290 166992 169128 171261 172625 173008 172669 171872
52926 171872 170917 170205 169753 168916 167110 164587 162067 159858 157927 156556 156172 156482 156463 155476 153948 152674
52910 152674 151815 150927 149761 148713 148394 148903 149630 149806 149223 148225 147105 145871 144756 144432 145252 146513 147047
52893 147047 146507 145632 145291 145670 146387 146908 146732 145635 144001 142665 142204 142505 143109 143788 144677 145993 147706
52876A47706J700J107K31m32p46r33r84n62L27J083J268J151J122J030N47j81
52860A53434p76j133j217p53K31R13N25n33j119p50J25J097K096K740K382J155
52844A58417N7l00m24q99j373j177m85j31m93j159j620j705j403p77j38L7l88
52827A46039r98j221q29m8P29J204J305J139Q99P79R34J368J876K174K146J962
52811A59458J863J868J702R87l64j873k809k849k444k267k440k565k409k194k094
52796A41570j914j532j361j900k934l582l228k137j071n72p21j362k139k528k151
52781A12438j267o19o39r95j149j158j507k267k841k683j886r24j64J26k27j019
52765I3219j600j524j096r08j068j282j497j883k304k343j951j538j314j088q18
$$ plain form
52876 147706 149406 150513 150744 150312 149566 148633 147649 147087 147414 148497 149765 150916 152038 153068 153615 153434
52860 153434 152658 151525 150308 149555 149786 150699 151224 150691 149572 148822 148947 150044 152140 154880 157262 158417
52844 158417 158474 158174 157750 156851 155478 154301 153816 153685 153192 152033 150413 148708 147305 146528 146390 146427 146039
52827 146039 145041 143820 142991 142943 143672 144876 146181 147320 148219 148998 149932 151300 153176 155350 157496 159458
52811 159458 161321 163189 164891 165878 165514 163641 160832 157983 155539 153272 150832 148267 145858 143664 141570
52796 141570 139656 138124 136763 134863 131929 128347 125119 122982 121911 121339 120618 119256 117117 114589 112438
52781 112438 111171 110552 109913 108918 107769 106611 105104 102837 99996 97313 95427 94503 94339 94465 94238 93219
52765 93219 91619 90095 88999 88091 87023 85741 84244 82361 80057 77714 75763 74225 72911 71823 71005
52750G1005q28j164j271p09J17M19k9q19j518j900j750r22L02J245J424R09J23
52733F4634n37q41o41O9R56J351P65m29j164q88l56o88j732k165j340k07R4k96
52715E6585n28m12k98j48K56M41j65r89q04L57J081P24L61R33J661J400N62L12
52697F1329N48J87p43r20J10J026O17n46j160j055r80j059n70P14J931K110J272
52680F2811J98m79o57m61N2P76J433J759J802J829J903J832J639J811K625L452
52664H2325L312K144R85O34P23N03m0l91n03q06j353j691j667j685j916j865j180
52647G7529m10l69r76j343j012n06m94r37j348j591j926k426k734k507j749o64
52631E6537N17J421J584R20n8p85j245j734k183k125j348k36O39R77P71K50j31
$$ plain form
52750 71005 70177 69013 67742 67033 67150 67569 67540 66721 65203 63303 61553 60631 60933 62178 63602 64511 64634
52733 64634 64097 63256 62615 62684 63640 64991 65756 65327 64163 63275 62919 62231 60499 58334 56994 56787 56881 56585
52715 56585 56057 55645 55347 55199 55455 55896 55731 54742 53938 54295 55376 56100 56461 57394 59055 60455 61017 61329
52697 61329 61877 62064 61321 60401 60511 61537 62154 61608 60448 59393 58413 57354 56784 57498 59429 61539 62811
52680 62811 63009 62530 61873 61412 61464 62240 63673 65432 67234 69063 70966 72798 74437 76248 78873 82325
52664 82325 85637 87781 88766 89400 90123 90626 90586 90195 89692 88886 87533 85842 84175 82490 80574 78709 77529
52647 77529 77119 76750 75774 74431 73419 72913 72419 71482 70134 68543 66617 64191 61457 58950 57201 56537
52631 56537 57054 58475 60059 60979 60921 60136 58891 57157 54974 52849 51501 51265 51904 52881 53652 53902 53771
52614E3771Q2P85J299J069K94l57n09l26j36k2K01O53J138J265R67P19R39J356
52596F3188J391J061R36J106R48J85m72k90M43R38J042J144J261J041N78M49Q79
52579G5828J467J832J977J915J489P60R7k44k72j1N18R92R87N74K32J28L2K3N98
52560H8922J766K639K426J342K26m15m87k5P18J133Q54L42M27J253K125K328J784
52543A07358R51L40K23M71O54M53M6n5N05J573K630L128K889K223J548R70L51
52526A26258k33m80l26n8J80O14J304J778J523O19m05j176j600j673j462j194
52510A23669j031r29q40q60r93j001p94o39p22p60m38L4J99o4n54j108j467j148
52492A10554o2R38Q17l14j247j116k70M04M65J40o8K17Q57J166O81q9j43O78J488
$$ plain form
52614 53771 53853 54638 55937 57006 57300 56943 56434 56108 55972 55950 56151 56804 57942 59207 60174 60893 61832 63188
52596 63188 64579 65640 66576 67682 68630 68815 68343 68053 68496 69434 70476 71620 72881 73922 74500 74949 75828
52579 75828 77295 79127 81104 83019 84508 85268 85365 85121 84849 84838 85356 86348 87335 87909 88141 88269 88301 88324 88922
52560 88922 90688 93327 95753 97095 97321 96906 96419 96394 97112 98245 99099 99441 99868 101121 103246 105574 107358
52543 107358 108309 108649 108872 109343 109997 110450 110496 110441 110946 112519 115149 118277 121166 123389 124937 125907 126258
52526 126258 126025 125545 125219 125161 125341 125955 127259 129037 130560 131179 130774 129598 127998 126325 124863 123669
52510 123669 122638 121709 120869 120009 119016 118015 117221 116582 115860 115100 114662 114696 114895 114831 114277 113169 111702 110554
52492 110554 110492 111430 112247 111933 110686 109570 109300 109704 110169 110309 110241 110458 111315 112481 113162 113073 112930 113608 115096
52473A15096J640J507J658J938J882J556J314J085N62q5m21n24q86j444j413m31
52457A23034P13R45K38m25k53N36J129J024M04j80m23m98p04r54p81k3P45P73
52439A25300M1p01q44m65R4P19J316J486R26q3r33j337j350j022n10l32q53j563
52421A19889j583r63o50r31r08J3R79Q78Km70k07J27K41N49J116J333J010Q04
52403A21229J095J292R04N37J057K187K824K576K124K049K084J772J298J171J433
52388A45632J642J571J546J963K634K912K414J425N18q0n38j013j405j575j491
52373A56155j144n30J06K85k07r24j126n92R3J81l77q79o49K36J095J444J444
52356A54611J510J785K136K507K972L476L804L764L289K437J529J147J601K445
$$ plain form
52473 115096 116736 118243 119901 121839 123721 125277 126591 127676 128238 128153 127732 127208 126322 124878 123465 123034
52457 123034 123747 124692 124930 124505 124252 124788 125917 126941 127345 127165 126742 126244 125540 124586 123805 123782 124527 125300
52439 125300 125341 124640 123796 123331 123425 124144 125460 126946 127872 127789 126856 125519 124169 123147 122637 122305 121452 119889
52421 119889 118306 117343 116693 115762 114854 114867 115846 116724 116726 116256 116049 116176 116417 116966 118082 119415 120425 121229
52403 121229 122324 123616 124520 125057 126114 128301 131125 133701 135825 137874 139958 141730 143028 144199 145632
52388 145632 147274 148845 150391 152354 154988 157900 160314 161739 162257 162177 161639 160626 159221 157646 156155
52373 156155 155011 154481 154587 154872 154665 153741 152615 152023 152116 152297 151920 151041 150392 150628 151723 153167 154611
52356 154611 156121 157906 160042 162549 165521 168997 172801 176565 179854 182291 183820 184967 186568 189013
52342A89013K864K617K227K138K144J828J264Q74Q37J018J358J963K781L460L647
52327B20033L326K819K551K733L147L316L079K966L716N363P011P700P348O696
52313B81804O444O664P041P370P637P902Q297Q978R846J0384J0204R668R596J0249
52299D02084J1012J1276J1217J1331J1596J1624J1391J1220J1097J0640R855R301
52287E33644R269R297Q893Q310Q095Q109P625O408N193M786N021M976M097K792
52273F26515J825J423J239R65O48L87Q0l16o00o02m68l35M6J014K409L651M403
52256F42284M824N214N685O238O797P138P105P017P422Q350R178R462R512R863
52242G46089J0474J0878J0907J0822J0809J0678J0249R664R163Q707Q000O908
$$ plain form
52342 189013 191877 194494 196721 198859 201003 202831 204095 204969 205806 206824 208182 210145 212926 216386 220033
52327 220033 223359 226178 228729 231462 234609 237925 241004 243970 247686 253049 260060 267760 275108 281804
52313 281804 288248 294912 301953 309323 316960 324862 333159 342137 351983 362367 372571 382239 391835 402084
52299 402084 413096 424372 435589 446920 458516 470140 481531 492751 503848 514488 524343 533644
52287 533644 542913 552210 561103 569413 577508 585617 593242 599650 604843 609629 614650 619626 623723 626515
52273 626515 628340 629763 631002 631967 632615 633002 633082 632766 632166 631564 631096 630761 630807 631821 634230 637881 642284
52256 642284 647108 652322 658007 664245 671042 678180 685285 692302 699724 708074 717252 726714 736226 746089
52242 746089 756563 767441 778348 789170 799979 810657 820906 830570 839733 848440 856440 863348
52230H63348N708M846M535M648M932N181N134M466L108J481K21l80n95r60j844
52215I03829l168m361m773m361l817l802m137m159l680l119k748k343j738j216
52201H56407j017q63l58M57J227J785K225K563K633K310J712J202J123J369J321
52186H74096N50l98n01L44R86M84o52j249j030o78n90n00l63p98k166l755m468
52169H59312m084l423l353l994m838n281m963l906k612j855k124l145m151m539
52155H07044m224l416k396j563j359j835k462k732k790l132l795m276m257l947
52141G64860l657l431l255l230l325l335l255l410l956m551m732m397l739l045
52127G13542k716l043l689l767k848j526n72N1Q40J738K197K083J900K061K548
$$ plain form
52230 863348 869056 873902 878437 883085 888017 893198 898332 902798 905906 907387 907608 907228 906633 905673 903829
52215 903829 900661 896300 891527 887166 883349 879547 875410 871251 867571 864452 861704 859361 857623 856407
52201 856407 855390 854527 854169 854626 855853 857638 859863 862426 865059 867369 869081 870283 871406 872775 874096
52186 874096 874646 874248 873747 874091 875077 875561 874909 873660 872630 871952 871362 870862 870499 869701 867535 863780 859312
52169 859312 855228 851805 848452 844458 839620 834339 829376 825470 822858 821003 818879 815734 811583 807044
52155 807044 802820 799404 797008 795445 794086 792251 789789 787057 784267 781135 777340 773064 768807 764860
52141 764860 761203 757772 754517 751287 747962 744627 741372 737962 734006 729455 724723 720326 716587 713542
52127 713542 710826 707783 704094 700327 697479 695953 695381 695432 696272 698010 700207 702290 704190 706251 708799
52112G08799L292M310N347N926O038O303P132Q121Q643Q731R004R826J0951J1928
52098H14351J2561J2957J3314J3749J4192J4380J4032J3106J1896J0880J0362
52087I55780J0190R838Q862P356N853M779M087L414K548J608Q36L01j15m86p90
52072A014061j091j659k601l560l974l760l471l601l961l906l120k013j236r72
52058I75136p70j19Q56J510J553J505J982K742K989K549K139K340K843L002K678
52043A002935K198J816J626J598J427O73n33j388j494j615k661m262n123m804
52029I90393m307m711n894o888p036o505n962n999o667p440p828q005q488r236
52015H95427r521q896p869p356p775q874j0198j1399j2239j2589j2465j2091j1932
$$ plain form
52112 708799 712091 716401 721748 727674 733712 740015 747147 755268 763911 772642 781646 791472 802423 814351
52098 814351 826912 839869 853183 866932 881124 895504 909536 922642 934538 945418 955780
52087 955780 965970 975808 984670 992026 997879 1002658 1006745 1010159 1012707 1014315 1015151 1015452 1015337 1014851 1014061
52072 1014061 1012970 1011311 1008710 1005150 1001176 997416 993945 990344 986383 982477 979357 977344 976108 975136
52058 975136 974366 974247 975103 976613 978166 979671 981653 984395 987384 989933 992072 994412 997255 1000257 1002935
52043 1002935 1005133 1006949 1008575 1010173 1011600 1012273 1011740 1010352 1008858 1007243 1004582 1000320 995197 990393
52029 990393 986086 981375 975481 968593 961557 955052 949090 943091 936424 928984 921156 913151 904663 895427
52015 895427 885906 877010 869141 861785 854010 845136 834938 823539 811300 798711 786246 774155 762223
$$ [...]
##END NTUPLES=NMR SPECTRUM
##END=
