##TITLE=NES1093_RSB_9886830_fKTSD0sDcw
##JCAMPDX= 6.0         $$ Bruker NMR JCAMP-DX V2.0
##DATA TYPE= NMR SPECTRUM
##DATA CLASS= NTUPLES
##ORIGIN= BRUKER
##OWNER= Administrator
$$ 1.72 TOPSPIN		Version 2.1
$$ 2016-08-28 22:32:52.804 -0500  Administrator@X
$$ Compression mode = diff/dup
##.OBSERVE FREQUENCY= 400.02188249412
##.OBSERVE NUCLEUS= ^1H
##.ACQUISITION MODE= SIMULTANEOUS (DQD)
##.ACQUISITION SCHEME= undefined
##.AVERAGES= 8
##.DIGITISER RES= 22
##SPECTROMETER/DATA SYSTEM= spect
##.PULSE SEQUENCE= zg30
##.SOLVENT NAME= COFFEE_meoh
##.SHIFT REFERENCE= INTERNAL, COFFEE_meoh, 1, 14.98509
##AUDIT TRAIL= $$ (NUMBER, WHEN, WHO, WHERE, PROCESS, VERSION, WHAT)
$$ ##TITLE= Audit trail, TOPSPIN		Version 2.1
$$ ##JCAMPDX= 5.01
$$ ##ORIGIN= Bruker BioSpin GmbH
$$ ##OWNER= Administrator
$$ $$ E:\/data/COFFEE/nmr/NES1093_RSB_9886830_fKTSD0sDcw/10/pdata/1/auditp.txt
$$ ##AUDIT TRAIL=  $$ (NUMBER, WHEN, WHO, WHERE, PROCESS, VERSION, WHAT)
(   1,<2016-08-28 22:32:45.758 -0500>,<Administrator>,<X>,<go>,<TOPSPIN 2.1>,
      <created by zg
	started at 2016-08-28 22:31:39.742 -0500,
	POWCHK enabled, PULCHK disabled,
       configuration hash MD5:
       21 0F 79 D6 B3 7B B4 F6 88 20 88 DB 03 48 BD 9F
       data hash MD5: 64K
       2F 95 9B 1B FE 03 95 09 95 6A 0F FE 3B 38 86 B9>)
(   2,<2016-08-28 22:32:48.820 -0500>,<Administrator>,<X>,<proc1d>,<TOPSPIN 2.1>,
      <Start of raw data processing
       efp LB = 0 FT_mod = 6 PKNL = 1 PHC0 = 0 PHC1 = 0 SI = 32K 
       data hash MD5: 32K
       7E B7 1B 44 1A E1 91 3E E8 4C 21 13 84 52 56 63>)
(   3,<2016-08-28 22:32:49.101 -0500>,<Administrator>,<X>,<proc1d>,<TOPSPIN 2.1>,
      <pk PHC0 = 92.3291 PHC1 = 0 
       data hash MD5: 32K
       B3 E6 F0 AF 68 DD 4E 84 54 6D 12 5E 0F 86 D4 E2>)
(   4,<2016-08-28 22:32:49.195 -0500>,<Administrator>,<X>,<proc1d>,<TOPSPIN 2.1>,
      <abs ABSG = 1 
       data hash MD5: 32K
       E1 2C FE 0A 3D E1 36 36 EC 3C 7F 5E CD 09 08 EA>)
(   5,<2016-08-28 22:32:49.258 -0500>,<Administrator>,<X>,<proc1d>,<TOPSPIN 2.1>,
      <abs ABSG = 2 
       data hash MD5: 32K
       88 0D 56 CC 18 7E 5B 32 8F 22 84 12 1F 25 22 2E>)
(   6,<2016-08-28 22:32:49.320 -0500>,<Administrator>,<X>,<proc1d>,<TOPSPIN 2.1>,
      <abs ABSG = 3 
       data hash MD5: 32K
       B1 F3 EC 12 AE 83 49 FD 39 09 B0 FF 88 E8 83 D4>)
(   7,<2016-08-28 22:32:49.367 -0500>,<Administrator>,<X>,<proc1d>,<TOPSPIN 2.1>,
      <abs ABSG = 4 
       data hash MD5: 32K
       8C C2 CD 7F AB 2C F0 4E 91 A5 33 50 06 33 42 A3>)
(   8,<2016-08-28 22:32:49.414 -0500>,<Administrator>,<X>,<proc1d>,<TOPSPIN 2.1>,
      <abs ABSG = 5 
       data hash MD5: 32K
       2E 6B DA 73 63 B8 77 C6 16 3D BD 96 1C E6 50 AF>)
$$ ##END=
$$ 
$$ $$ hash MD5
$$ $$ 08 D6 2B 42 69 C7 24 1F 49 4C 4F 27 A5 66 2C 1B
##$RELAX= 
##$RELAX= 
##$RELAX= 
##$RELAX= 
##$RELAX= 
##$RELAX= 
##$RELAX= 
$$ Bruker specific parameters
$$ --------------------------
##$DU= <E:\>
##$EXPNO= 10
##$NAME= <NES1093_RSB_9886830_fKTSD0sDcw>
##$PROCNO= 1
$$ [...]
##$TP= (0..7)
150 150 150 150 150 150 150 150
##$TP07= 0
##$TPNAME0= <>
##$TPNAME1= <>
##$TPNAME2= <>
##$TPNAME3= <>
##$TPNAME4= <>
##$TPNAME5= <>
##$TPNAME6= <>
##$TPNAME7= <>
##$TPOAL= (0..7)
0.5 0.5 0.5 0.5 0.5 0.5 0.5 0.5
##$TPOFFS= (0..7)
0 0 0 0 0 0 0 0
##$TUNHIN= 0
##$TUNHOUT= 0
##$TUNXOUT= 0
##$USERA1= <user>
##$USERA2= <user>
##$USERA3= <user>
##$USERA4= <user>
##$USERA5= <user>
##$V9= 5
##$VALIST= <valist>
##$VCLIST= <CCCCCCCCCCCCCCC>
##$VD= 0
##$VDLIST= <DDDDDDDDDDDDDDD>
##$VPLIST= <PPPPPPPPPPPPPPP>
##$VTLIST= <TTTTTTTTTTTTTTT>
##$WBST= 2048
##$WBSW= 25
##$XGAIN= (0..3)
0 0 0 0
##$XL= 0
##$YL= 0
##$YMAX_a= 596838
##$YMIN_a= -500458
##$ZGOPTNS= <>
##$ZL1= 120
##$ZL2= 120
##$ZL3= 120
##$ZL4= 120
##$ABSF1= 14.98509
##$ABSF2= -5.573092
##$ABSG= 5
##$ABSL= 3
##$ALPHA= 0
##$AQORDER= 0
##$ASSFAC= 0
##$ASSFACI= 0
##$ASSFACX= 0
##$ASSWID= 0
##$AUNMP= <proc_prof1d_extract_pilot.lims>
##$AXLEFT= 0
##$AXNAME= <>
##$AXNUC= <1H>
##$AXRIGHT= 0
##$AXTYPE= 0
##$AXUNIT= <>
##$AZFE= 0.1
##$AZFW= 0.1
##$BCFW= 0
##$BC_mod= 0
##$BYTORDP= 0
##$COROFFS= 0
##$CY= 15
##$DATMOD= 1
##$DC= 0
##$DFILT= <>
##$DTYPP= 0
##$F1P= 0
##$F2P= 0
##$FCOR= 0.5
##$FTSIZE= 32768
##$FT_mod= 6
##$GAMMA= 0
##$GB= 0
##$INTBC= 1
##$INTSCL= 1
##$ISEN= 128
##$LB= 0
##$LEV0= 0
##$LPBIN= 0
##$MAXI= 10000
##$MC2= 0
##$MEAN= 0
##$ME_mod= 0
##$MI= 0
##$NCOEF= 0
##$NC_proc= -8
##$NLEV= 6
##$NOISF1= 0
##$NOISF2= 0
##$NSP= 0
##$NTH_PI= 0
##$NZP= 0
##$OFFSET= 14.98509
##$PC= 1
##$PHC0= 92.3291
##$PHC1= 0
##$PH_mod= 1
##$PKNL= yes
##$PPARMOD= 0
##$PPDIAG= 0
##$PPIPTYP= 0
##$PPMPNUM= 2147483647
##$PPRESOL= 1
##$PSCAL= 4
##$PSIGN= 0
##$PYNMP= <proc.py>
##$REVERSE= no
##$SF= 400.02
##$SI= 32768
##$SIGF1= 0
##$SIGF2= 0
##$SINO= 400
##$SIOLD= 32768
##$SPECTYP= <>
##$SREGLST= <1H.CDCl3>
##$SSB= 0
##$STSI= 32768
##$STSR= 0
##$SW_p= 8223.68421052631
##$SYMM= 0
##$S_DEV= 0
##$TDeff= 65536
##$TDoff= 0
##$TI= <>
##$TILT= no
##$TM1= 0
##$TM2= 0
##$TOPLEV= 0
##$USERP1= <user>
##$USERP2= <user>
##$USERP3= <user>
##$USERP4= <user>
##$USERP5= <user>
##$WDW= 1
##$XDIM= 32768
##$YMAX_p= 446350594
##$YMIN_p= -664398
##$CURPLOT= <Network HP LaserJet P1505>
##$CURPRIN= <$Network HP LaserJet P1505>
##$DFORMAT= <normdp>
##$LAYOUT= <+/1D_H.xwp>
##$LFORMAT= <normlp>
##$PFORMAT= <normpl>
##$SURQMSG= 1
$$ End of Bruker specific parameters
$$ ---------------------------------
##NTUPLES= NMR SPECTRUM
##VAR_NAME=  FREQUENCY,     SPECTRUM/REAL,   SPECTRUM/IMAG
##SYMBOL=    X,             R,               I
##VAR_TYPE=  INDEPENDENT,   DEPENDENT,       DEPENDENT
##VAR_FORM=  AFFN,          ASDF,            ASDF
##VAR_DIM=   32768,         32768,           32768
##UNITS=     HZ,            ARBITRARY UNITS, ARBITRARY UNITS
##FACTOR=    0.250966925370066, 1,           1
##FIRST=     8223.43324360094, -120225,      -76795
##LAST=      0,             -69357,          53817
##MIN=       0,             -664398,         0
##MAX=       8223.43324360094, 446350594,    0
$$ Real data points
##PAGE= N=1
##DATA TABLE= (X++(R..R)), XYDATA
$$ [...]
$$ plain form
19489 -12368 -251388 71691 -137664 -10405 -62176 -135535 -247664 -267388 -108088 5036 -125212
19477 -123378 -456805 -122675 -7799 -334311 -3888 197054 -61596 132635 -136930 -313397
19467 -313397 -319742 -85346 177046 -80417 94761 -74639 -22692 -218248 -304361 -277230 -257709
19456 -257709 -82086 -290771 -120783 -162123 -24358 119053 29190 287219 -49041 32376 -23162
19444 123298 150296 129170 14749 18730 183635 78800 -111321 42949 201839 116862 -191922
19432 -164164 -138632 109392 -496523 -201702 -142923 20316 147777 -164372 -53779 22141
19421 -125070 36645 -226184 70651 -64059 50336 -247172 42361 -160562 37512 -105130 -242174
19410 -242174 -108592 -275058 18061 -82401 -219441 84868 -340467 -246286 161711 -179379
$$ packed form
19489a2368k39020G1691a37664a0405n1771p3359j12129j9724a08088E036a25212
19477a23378l33427a22675g799l26512c888A97054f1596A32635a36930j76467
19467c13397o345h5346A77046h0417I4761g4639b2692j95556q6113K7131J9521
19456b57709h2086k08685a20783m1340b4358A19053B9190K58029d9041C2376b3162
19444A23298K6998k1126A4749L981J64905G8800a11321D2949J58890q4977a91922
19432a64164K5532A09392d96523b01702N8779B0316J27461a64372e3779B2141
19421a25070C6645b26184G0651f4059E0336b47172D2361a60562C7512a05130j37044
19410b42174a08592j66466A8061h2401j37040H4868c40467R4181A61711a79379
$$ plain form
19399 -146991 -185345 -77277 -398775 703 -7136 -135747 -194365 -45553 -143958 -211904 74061 -254789
19386 -294940 125587 228663 -267844 -84318 -64740 35035 -255180 159620 -223578 21836
19375 -415229 175728 -182092 60268 149486 -37002 23735 -206293 88734 -84488 -186714 -96974
19364 -96974 142523 -91961 -54951 -146487 62228 -87486 128971 37541 91233 17935 144923
19353 144923 -229534 2977 168241 -279538 -269960 -92043 142173 -337519 -266757 -8442 -251123
19342 -251123 -173749 -14698 -160054 -124 -180470 157785 71536 -99126 -39307 -216857 41332
19330 41411 -198695 -45107 -485435 150415 -99526 -250906 -103082 -18343 -340061 -24018
19319 -74618 23944 -202892 -115807 -216962 112473 -150258 384258 -65524 -385950 122481
$$ packed form
19399a46991l8354g7277l21498G03g136j28611n8618d5553r8405o7946G4061b54789
19386b94940A25587J03076b67844h4318J9578C5035b55180A59620b23578B1836
19375d15229A75728a82092F0268Q9218c7002B3735b06293H8734h4488j02226Q9740
19364i6974A42523i1961L7010r1536F2228h7486A28971C7541N3692A7935J26988
19353A44923b29534B977J65264b79538R578i2043A42173c37519P0762h442k42681
19342b51123P7374a4698j45356a24j80346A57785G1536i9126c9307j77550D1332
19330D1411a98695d5107m40328A50415i9526j51380a03082a8343l21718b4018
19319g4618B3944b02892Q7085j01155A12473a50258C84258f5524l20426A22481
$$ plain form
19308 75892 -148398 -180959 -12529 142083 2672 -122826 -99262 -28158 -255737 -160270 -330644
19297 -330644 -88760 -13094 -157138 -58466 -13119 202000 -60640 59242 102295 -164354 476991
19285 -223774 121528 6039 -342550 -259166 -68733 -223342 -208290 -145210 212191 -198206 -182336
19274 -182336 22417 -145323 121622 82065 -4400 68806 242750 110470 65216 -101448 -77321
19263 -77321 -105835 -100465 -109237 -175514 13874 -145841 75029 133671 -104342 119173 314406
19252 314406 -47666 -33983 360183 -10469 158256 -276858 37135 -10798 83294 -300344 -45689
19240 330497 45944 58209 -117812 -430 40279 -75030 -113634 -236344 -125705 -130604 -102203
19229 -102203 -279602 26320 95276 -266184 -132143 -167503 -394939 86781 -56130 -7528 3992
$$ packed form
19308G5892a48398l2561a2529A42083B672a22826K3564b8158k27579R5467j70374
19297c30644h8760a3094j44044e8466a3119B02000f0640E9242M3053a64354D76991
19285b23774A21528F039c42550Q3384f8733j54609J5052O3080B12191a98206J5870
19274a82336B2417a45323A21622l9557d400F8806J73944A10470m5254a01448K4127
19263g7321k8514N370q772o6277A3874a45841G5029N8642a04342A19173J95233
19252C14406d7666J3683C60183a0469A58256b76858C7135a0798H3294c00344d5689
19240C30497D5944J2265a17812d30D0279g5030l8604j22710J10639m899K8401
19229a02203j77399B6320O8956b66184a32143l5360k27436H6781e6130g528C992
$$ plain form
19217 79100 -261214 133905 120463 -91299 40333 208343 -305129 -41619 3763 -111259 40450
19205 249565 -50526 -130533 151306 -219519 29037 -19565 -11111 -25308 167299 -311748 -16300
19193 -222226 95843 -37450 129758 -355329 -169010 -84541 150950 -68949 -167806 225990
19182 111311 -495002 -26063 -449598 -246896 84100 -60198 -137375 -52233 -231088 56180 -28625
19170 47460 -143608 123476 109551 -202005 268744 122617 79091 -228283 -200981 -246736
19160 -246736 166267 52781 -71933 -9522 -263605 -282019 -39068 -226420 -158417 -229575 39717
19148 -51078 316013 -47198 -50528 -80988 -56231 -26811 -42717 -32219 103888 -295343 -166116
19137 -166116 60594 -16271 81726 -56805 -262489 -359670 -113357 -68193 37728 -299587 -190776
$$ packed form
19217G9100b61214A33905j3442i1299D0333J68010c05129d1619C763a11259D0450
19205B49565e0526q0007A51306b19519B9037a9565Q454j4197A67299c11748a6300
19193b22226I5843c7450A29758c55329a69010Q4469A50950f8949r8857B25990
19182A11311d95002b6063m23535K02702H4100f0198p7177e2233j78855E6180b8625
19170D7460a43608A23476j3925b02005B68744A22617m3526b28283K7302m5755
19160b46736A66267E2781g1933i522k54083j8414c9068j87352O8003p1158C9717
19148e1078C16013d7198l330l0460K4757b6811j5906J0498A03888b95343J29227
19137a66116F0594a6271H1726e6805k05684r7181a13357M5164C7728b99587J08811
$$ plain form
19126 -190776 -365980 -272342 115145 -54871 -61282 -28317 -85146 -439939 -299557 -81065 -268452
19115 -268452 32674 -272588 -107450 -106226 225141 15456 99594 43678 96912 193328 -100440
19103 -38175 -72207 -111884 -51761 39239 -186218 81483 -203325 891 36644 -49388 -21993 85860
19090 113227 -174209 -270840 -89754 -200640 -77298 -98854 -84966 -157551 -54519 -58010 256660
19078 -125144 -331034 -157780 -242285 45539 -454399 282765 -7363 125526 -150666 135105
19067 -316129 150261 -70744 -132014 -364810 -222835 -7647 51220 132742 122723 -25960 -118772
19056 -118772 157131 194282 62205 81848 -35971 18830 50307 -200700 -64305 -314560 22443
19044 40525 168202 -140252 280163 -151809 -139117 -77434 37438 -95615 7774 -166527 -168163
$$ packed form
19126a90776j75204R3638A15145e4871o411b8317n6829l54793J40382h1065j87387
19115b68452C2674b72588a07450J224B25141A5456Q4138D3678N3234R6416a00440
19103c8175l4032l9677e1761C9239a86218H1483b03325H91L5753d9388b1993H5860
19090A13227a74209r6631h9754j10886g7298k1556J3888p2585e4519l491B56660
19078a25144k05890a57780q4505D5539d54399B82765g363A25526a50666A35105
19067c16129A50261g0744o1270k32796J41975g647E1220Q1522j0019b5960r2812
19056a18772A57131L7151F2205J9643c5971A8830L1477b00700f4305k50255B2443
19044D0525J27677a40252B80163a51809J2692O1683C7438i5615G774a66527j636
$$ plain form
19033 -168163 -56343 -5005 -112012 38451 139869 -275298 433126 -84522 65704 175144 287193
19022 287193 -409852 -244577 217282 84658 -112508 -31579 157877 156877 -310610 -205519
19012 -205519 137071 258775 -291581 -240157 73861 -29895 -197152 -108945 66865 86518 -60708
19000 104002 -71128 -55319 -50796 -77337 57398 96302 -295546 198598 -102292 -218542 102568
18988 -15520 130828 84896 -272122 56059 -199569 239178 -275049 -20329 -176077 -104743
18978 -104743 -285841 216887 -169267 -172674 457794 334899 148154 37668 7243 -22080 45677
18966 -99109 -194321 -116850 50087 89982 -95504 -257186 139477 -216461 39592 -341827 22522
18954 334578 -37127 -137226 -4516 40250 17980 -82671 -152109 -352707 -14345 322098 -271784
$$ packed form
19033a68163e6343e005j07007C8451J01418b75298D33126h4522F5704J09440J12049
19022B87193d09852J65275B17282H4658a12508c1579A57877j000c10610J05091
19012b05519A37071J21704b91581N1424G3861b9895j67257Q8207F6865J9653f0708
19000A04002g1128J5809M523k6541E7398L8904b95546A98598a02292j16250A02568
18988a5520A30828m5932b72122E6059a99569B39178b75049b0329j55748P1334
18978a04743j81098B16887a69267l407D57794j22895A48154C7668G243b2080D5677
18966i9109r5212P7471E0087L9895i5504j61682A39477b16461C9592c41827B2522
18954C34578c7127j00099d516D0250A7980h2671o9438k00598a4345C22098b71784
$$ plain form
18942 -108180 168680 18114 -72207 -129865 34867 19991 -95512 95764 -154465 218423 -56450
18930 -29571 -134873 247089 127267 -284294 72011 149904 219125 -54819 305279 190189
18920 190189 77833 125865 157983 -315190 -83703 -92443 -5837 130583 70006 526285 403991
18909 403991 116472 -22982 -19756 -162097 74150 -322933 28292 114398 -232490 -113194 130241
18897 61175 29768 98585 -151807 -27204 -268171 -65541 -129594 -148854 223241 -103447 -77808
18886 -77808 -131811 238487 -29101 80108 158198 -51093 -101602 -182149 -271844 514027 -147525
18874 -104750 -203207 62103 152464 -104678 -2317 -303245 -189219 44872 -308082 -253546 -14473
18862 158483 -17172 -71463 103708 -295873 97372 10790 -247397 -383085 -174980 -76831
$$ packed form
18942a08180A68680A8114g2207n7658C4867j4876i5512I5764a54465B18423e6450
18930b9571j05302B47089j19822b84294G2011P7893O9221e4819C05279j15090
18920A90189G7833M8032L2118c15190h3703q740e837A30583o0577M56279j22294
18909D03991A16472b2982L226j42341G4150c22933B8292Q6106b32490a13194A30241
18897F1175B9768O8817a51807b7204k40967f5541o4053j9260B23241a03447K5639
18886g7808n4003B38487b9101H0108P8090e1093n0509q0547q9695E14027a47525
18874a04750r8457F2103R0361a04678b317l00928J14026D4872c08082N4536a4473
18862A58483a7172n4291A03708b95873I7372A0790b47397j35688a74980g6831
$$ plain form
18851 -400296 -118757 -100302 215756 -108992 -68569 -245518 -246708 102868 -163923 -253494
18841 -253494 104275 45246 86272 -87815 -75765 -357237 21055 -193082 -183613 -122563 -91000
18830 -91000 -220256 -245046 -101221 -18077 246858 -380443 -49764 -155211 -268161 -172820
18820 -172820 262156 143968 -37147 -202610 -32404 108913 -35236 265142 -25340 352658
18809 101931 121307 243648 -322385 -74087 -42954 -79280 -245660 -86887 64534 -553095 -13945
18797 29647 -214622 -59184 165483 316394 149698 192253 23127 -116517 -204644 127465
18786 -39770 -284521 -166657 233834 -166349 -124764 -117446 -161476 -458107 142921 -42296 142036
18774 -285664 -208020 -38258 -60638 -225214 166399 250356 338826 -127689 201739 -37148 -108641
$$ packed form
18851d00296a18757J8455B15756a08992M0423j76949j190A02868a63923q9571
18841b53494A04275D5246M1026h7815J2050k81472B1055a93082R469O1050L1563
18830i1000j29256k4790a01221a8077B46858c80443d9764j05447j12950R5341
18820a72820B62156j18188c7147j65463c2404A08913c5236B65142b5340C52658
18809A01931J9376J22341c22385g4087L1133l6326j66380h6887F4534e53095a3945
18797B9647b14622e9184A65483J50911A49698M2555B3127a16517q8127A27465
18786c9770k44751J17864B33834a66349M1585P318m4030k96631A42921d2296A42036
18774b85664P7644c8258k2380j64576A66399Q3957Q8470a27689B01739c7148p1493
$$ plain form
18763 -108641 -161962 163015 224508 -95299 258803 -106861 177483 -52197 48129 230197
18753 230197 -217026 -180250 114550 -168018 -276274 -96280 -218814 -32232 -86264 83618
18742 224369 440522 -164696 -173087 -135362 98204 10902 -1318 -178611 -411197 110270 -239168
18730 -151753 -78799 173325 105159 108613 -60270 107789 95790 60229 11848 -47338 -96327
18719 -96327 -107327 82833 -105263 -60397 -245898 -242603 -109748 -278940 -141864 -322814 -218729
18708 -218729 -177397 -209909 -243326 -4433 -37868 144762 -33232 -192537 -289128 50752 -154906
18696 36273 32078 104720 -160294 -85193 -26283 -125553 -6371 -209922 77375 27244 7164 175771
18684 175771 -104013 103759 -25900 -223951 -95804 -200760 12754 188394 158037 -66759
$$ packed form
18763a08641n3321A63015O1493i5299B58803a06861A77483e2197D8129J82068
18753B30197b17026L6776A14550a68018j08256i6280j22534c2232n4032H3618
18742B24369K16153a64696q391L7725I8204A0902a318j77293k32586A10270b39168
18730a51753P2954A73325o8166L454f0270A07789j1999l5561A1848d7338m8989
18719i6327j1000H2833a05263M4866j85501L295a09748j69192J37076j80950J04085
18708b18729M1332l2512l3417d433l3435A44762c3232j59305r6591E0752a54906
18696C6273m195P2642a60294P5101b6283r9270f371k03551G7375B7244G164J68607
18684A75771a04013A03759b5900j98051i5804j04956A2754J75640l0357f6759
$$ plain form
18673 -19612 12145 220212 -125720 -8574 8068 45740 -93953 -324799 54206 273696 -96151
18661 61918 268967 -109265 -400105 -16592 -78238 -249354 -259302 -334886 54369 103148 108169
18650 108169 -94007 223332 301153 -381638 -35472 138337 -232267 -220564 175733 -77903
18639 -211161 -451262 4187 -209981 123525 -319118 -80260 -51814 3552 60901 -59031 -178977
18628 -178977 183727 -92361 -21930 -24077 -144623 299906 117260 -11992 354359 -326638
18617 110283 -362617 57347 99069 -81197 86646 -76537 -29525 -60227 -124516 -52601 -72525
18606 -72525 -79652 -111486 -7066 87580 31953 -37693 -264411 109247 -108831 -217090 124894
18594 -412579 -92428 -150642 113844 -89515 227959 95403 117053 -27422 -44390 -48875 76250
$$ packed form
18673a9612A2145K08067a25720h574H068L7672i3953k30846E4206K19490i6151
18661F1918K07049a09265k90840a6592o1646j71116r948p5584E4369M8779N021
18650A08169i4007B23332P7821c81638c5472A38337b32267J1703A75733g7903
18639b11161k40101D187b09981A23525c19118h0260K8446C552N7349e9031j19946
18628a78977A83727i2361b1930k147j20546B99906A17260a1992C54359c26638
18617A10283c62617E7347M1722h1197H6646g6537b9525l0702o4289e2601j9924
18606g2525p127l1834g066H7580C1953c7693k26718A09247a08831j08259A24894
18594d12579i2428n8214A13844h9515B27959I5403K1650b7422j6968m485G6250
$$ plain form
18582 -207156 -92111 4729 -20950 -102819 -68845 -36962 -135092 -121062 37341 -167298 86959
18570 -117636 36415 -252151 24784 -11497 174084 81532 -79935 13154 -194018 105495 -194693
18558 -105920 -130117 35584 -85397 -92305 -73709 -82894 -202323 -126601 -186380 -311981 5146 30656
18546 30656 112224 -64140 -163733 -97117 -94493 60764 27024 -25412 -147085 -150590 -308278 236272
18533 -81961 151145 71470 127801 -323587 -44488 41458 -74177 112591 -95079 42166 -85157
18521 -246282 -20098 -281898 -203746 -24376 -282954 -171443 -400525 -9619 -194731 137360
18510 180683 -435756 -254387 -298421 20380 8961 -81520 -318974 -145158 199753 24280 40528
18499 40528 14347 -120343 -158156 187462 -137166 -145868 171544 -8563 -97589 -391748 94126
$$ packed form
18582b07156i2111D729b0950q1869L3974L1883r8130J4030C7341a67298H6959
18570a17636C6415b52151B4784a1497A74084H1532g9935A3154a94018A05495a94693
18558a05920k4197C5584h5397o908J8596r185j19429P5722n9779j25601E146K5510
18546C0656Q1568f4140r9593O6616K624F0764B7024b5412j21673l505j57688B36272
18533h1961A51145G1470N6331c23587d4488D1458g4177A12591i5079D2166h5157
18521b46282b0098k61800P8152b4376k58578J11511k29082i619j85112A37360
18510A80683d35756J81369m4034B0380H961h1520k37454a45158A99753B4280J6248
18499D0528A4347a20343l7813A87462a37166q702A71544h563q9026k94159I4126
$$ plain form
18487 -204348 -197013 269306 126554 245749 140289 273590 55936 -42103 16923 155432
18477 155432 -18335 85795 22243 -57637 -114319 -29705 -290604 12253 -179173 -125403 -119077
18466 -119077 194278 -337023 -77489 256473 244839 -188854 -86938 225296 86443 -234819
18455 -93817 -202317 -153642 46718 378770 -65902 -419535 -22672 -229319 74533 -73564 -161611
18444 -161611 -103638 9263 274667 -81970 211733 78887 82326 -71028 -199181 -1628 -108329
18433 -108329 -95116 127122 -281670 141573 -60738 -94306 51600 -180299 205744 215825
18423 215825 11887 -6151 115162 -85781 126838 -186604 -112122 46017 11033 127882 198740
18412 198740 19507 -126219 60080 -87587 255262 -147392 -34410 -76808 -207311 -166832 -191612
$$ packed form
18487b04348P335B69306A26554J19195j05460J33301E5936d2103A6923J38509
18477A55432a8335H5795B2243e7637n6682b9705k60899A2253a79173N3770O326
18466a19077A94278c37023g7489B56473j1634a88854h6938B25296H6443b34819
18455i3817j08500M8675D6718L32052f5902l53633b2672k06647G4533g3564q8047
18444a61611N7973I263K65404h1970B11733G8887L439g1028j28153a628j06701
18433a08329J3213A27122b81670A41573f0738l3568E1600a80299B05744J0081
18423B15825A1887f151A15162h5781A26838a86604P4482D6017A1033J16849P0858
18412A98740A9507a26219F0080h7587B55262a47392c4410m2398j30503M0479k4780
$$ plain form
18401 -191612 313323 79582 25984 379538 -1095 -319600 191399 12145 -281838 83673 63015
18390 63015 -203942 -184982 -269721 -300608 7845 12139 69015 -87270 7685 -1529 -288261 91206
18377 -221277 19497 9221 168232 -34322 180737 -11614 -226352 -91480 -118611 137900 201833
18366 201833 246097 -144026 150651 -444769 19257 -60856 -88530 -37072 43326 -116771 -34478
18354 -62027 141717 223472 80100 -220193 87676 -2824 -108067 -113376 -164876 -498207 -314554
18343 -314554 -50174 -327650 -27274 -36926 -100804 51829 -344279 -130447 335158 -74381 1501
18331 163150 -329148 -121251 31273 -369453 -59907 180263 -164306 46846 -114436 -24504
18320 140322 -186695 -47922 36684 -303 -11718 88088 -102540 69361 -194410 -211911 211821
$$ packed form
18401a91612C13323G9582B5984L53554a095l18505A91399A2145b81838H3673k0658
18390F3015b03942J8960q4739l0887G845M294N6876h7270G685a529k86732I1206
18377b21277A9497I221J59011c4322A80737a1614k14738i1480k7131A37900O3933
18366B01833M4264a44026A50651d44769A9257f0856k7674c7072D3326a16771c4478
18354f2027A41717Q1755H0100b20193H7676b824j05243n309n1500l33331J83653
18343c14554e0174k77476b7274r652o3878E1829c44279a30447C35158g4381A501
18331A63150c29148a21251C1273c69453e9907A80263a64306D6846a14436b4504
18320A40322a86695d7922C6684c03j1415H8088a02540F9361a94410j7501B11821
$$ plain form
18308 345928 62094 -143574 -121673 114697 286165 205475 57973 -78940 -123842 67399 77136
18297 77136 212477 224183 -166170 396255 -325346 236101 -143227 39583 -17035 13141
18286 109133 265248 -292142 -287865 -71599 -53237 154121 -192466 205552 -92382 -76278 -117262
18275 -117262 -43178 -359166 12442 -233638 50340 81471 -94757 -191103 158476 -187350 -33925
18263 -244515 -88733 -142509 83519 148098 -230809 -246483 -20004 -9856 260661 -217568 86162
18251 76598 -116141 -13079 206440 51023 -41650 -59063 331157 37831 -80738 37984 -246055
18239 -48415 155290 274632 -130647 -58622 -27937 -85090 -182021 293582 -75059 42810 102849
18228 102849 -230445 -40381 -176905 68441 100050 129499 72611 -143761 -19332 -8165 174021
$$ packed form
18308C45928F2094a43574K1901A14697J71468q0690E7973g8940m4902F7399R737
18297G7136J35341J1706a66170C96255c25346B36101a43227C9583a7035A3141
18286A09133J56115b92142M277g1599J8362A54121a92466B05552i2382J6104m0984
18275a17262d3178l15988A2442b33638E0340L1131i4757r6346A58476a87350c3925
18263b44515h8733n3776H3519O4579b30809j5674b0004i856B60661b17568H6162
18251G6598a16141a3079B06440E1023d1650j7413C31157C7831h0738C7984b46055
18239d8415A55290J19342a30647e8622b7937n7153r6931B93582g5059D2810O0039
18228A02849b30445d0381j36524F8441L1609K9449n6888a43761a9332h165A74021
$$ plain form
18216 78545 76497 -66934 -11455 129857 -287879 -58880 -204384 -309981 -66049 -110228 -85301
18205 -85301 -156608 35679 9661 37051 -317998 -153446 -161433 -85597 -101814 -293478 -94977
18193 -32549 -82269 191404 32545 -126016 26910 96332 -117948 -339481 79749 -119475 -189024
18182 -189024 334763 -63575 83397 407127 88996 -49802 -230298 -97678 -335113 85482 113903
18171 113903 -68868 -263123 186629 -177870 -157788 54436 42652 145961 -171527 -14981
18160 -66863 -87572 102126 -147046 13191 -128600 253121 -67136 20172 -162610 -111949 207618
18148 22290 -119698 -61990 202099 106456 -8101 -200862 -50711 -238195 38330 -87627 -97101
18137 -97101 92184 183852 -129823 48809 -104648 -136325 -379407 70472 -7886 39877 39863 116490
$$ packed form
18216G8545k048f6934a1455A29857b87879e8880j45504j05597f6049m4179K4927
18205h5301p1307C5679I661K7390c17998a53446p987P5836j6217j91664i4977
18193c2549m9720A91404C2545a26016B6910O9422a17948k21533G9749a19475o9549
18182a89024C34763f3575H3397L23730H8996d9802j80496i7678k37435H5482K8421
18171A13903f8868j94255A86629a77870K0082E4436j1784J03309a71527a4981
18160f6863k0709A02126a47046A3191a28600B53121f7136B0172a62610N0661B07618
18148B2290a19698N7708B02099r5643h101j92761e0711j87484C8330h7627r474
18137i7101I2184R1668a29823D8809a04648l1677k43082G0472g886C9877j4P6627
$$ plain form
18125 116490 -272016 -133089 -92311 -90817 143543 -40263 -188170 347822 74750 182801
18115 182801 58039 -269294 -20600 234780 -149754 -103562 -61748 -50000 -92232 -89775 -119627
18104 -119627 18700 -150101 -6745 -238682 85635 95778 -127093 24339 -84184 -75099 2037
18092 -189484 222389 -63611 11209 -32825 8029 -13776 248398 50831 -53561 -166037 -220376
18081 -220376 23250 -202111 -131453 -137288 104552 14287 16613 -358714 -2537 -231919 -311335
18070 -311335 54639 289856 -25262 32837 -102221 66419 -195945 142545 -159385 140465
18059 -221588 -38079 159860 -243499 197307 130971 -71579 -49644 14472 -81434 93989 -368341
18047 -27648 -36949 -71142 -34454 130625 -276254 171691 -210120 113013 36214 73608 -375325
$$ packed form
18125A16490b72016a33089M0778J494A43543d0263j47907C47822G4750J08051
18115A82801E8039b69294b0600B34780a49754M6192M1814J1748m2232K457k9852
18104a19627A8700a50101f745k31937H5635J0143a27093B4339h4184R085B037
18092a89484B22389f3611A1209c2825H029a3776B48398E0831e3561j12476n4339
18081b20376B3250b02111P0658n835A04552A4287K326c58714b537k29382p9416
18070c11335E4639K35217b5262C2837a02221F6419a95945A42545a59385A40465
18059b21588c8079A59860b43499A97307o6336g1579K1935A4472h1434I3989c68341
18047b7648r301l4193c4454A30625b76254A71691b10120A13013C6214L7394c75325
$$ plain form
18035 186936 96601 172101 -14005 -33260 -87706 76868 -293254 -210127 187830 -113552 -106362
18024 -106362 208354 -127156 -117553 -164532 11558 396999 175628 59639 133090 -23567 -193364
18013 -193364 -229737 -4211 53878 -45837 110434 59053 177188 -36890 -110234 -23009 -127258
18002 -127258 59032 53391 36304 -142688 -96574 160835 -42083 -333129 22893 295371 110055
17990 26077 -118571 -62929 217828 -408650 2323 171736 89069 94823 27502 332572 117410
17978 -136956 -21381 8580 -148314 57503 226003 -179570 -48943 -59035 -241618 282069 306831
17967 306831 6607 -36377 75739 64129 -27471 137155 282274 -9824 26853 -247972 -194045
17956 -194045 -90831 34411 -20428 175789 -368799 -67621 34556 -108629 3748 33484 -178492
$$ packed form
18035A86936r0335P5500a4005j9255n4446G6868b93254Q3127A87830a13552P190
18024a06362B08354a27156R603m6979A1558L85441A75628E9639P3451b3567j69797
18013a93364l6373d211E3878d5837A10434n1381J18135c6890p3344b3009j04249
18002a27258E9032n641j7087a42688M6114A60835d2083k91046B2893K72478A10055
17990B6077a18571N5642B17828d08650B323J69413q2667N754B7502L05070A17410
17978a36956b1381H580a48314E7503J68500a79570d8943j0092j82583B82069K4762
17967C06831F607c6377G5739j1610b7471A37155J45119i824B6853b47972N3927
17956a94045i0831C4411b0428A75789c68799f7621C4556a08629C748K9736a78492
$$ plain form
17944 -24736 -164045 265679 149186 -49292 -153545 -93726 -126415 86212 313412 -85119 122862
17932 -177407 -132921 39106 115458 -93853 58914 3209 -118278 187915 101097 -9373 -177090
17921 -177090 65689 58359 -90279 56360 -157082 -301366 159090 -19780 70641 -48992 24944
17909 -9812 352788 -109691 -6658 34941 14076 -203597 68462 -49409 -25467 -257218 -73103
17897 158028 24461 -152629 162087 -169640 110841 -143552 285393 82023 -12126 169174
17886 96426 -23914 1412 -59338 -182444 -118673 -117236 -83861 22405 -65031 135170 106434 -22835
17873 240194 346390 90370 316368 -180603 -100568 193665 135663 171062 -234109 149415
17862 -181758 -18451 12163 81790 187045 -50349 224989 152820 131436 103389 11964 -46981
$$ packed form
17944b4736j39309B65679j16493d9292j04253N9819l2689H6212K27200h5119A22862
17932a77407M4486C9106P6352i3853E8914C209a18278A87915q6818i373j67717
17921a77090F5689p330i0279E6360a57082j44284A59090a9780G0641d8992B4944
17909i812C52788a09691f658C4941A4076b03597F8462d9409K3942k31751g3103
17897A58028B4461a52629A62087a69640A10841a43552B85393H2023a2126A69174
17886I6426b3914A412e9338j23106O3771J437L3375B2405f5031A35170k8736b2835
17873B40194J06196I0370K25998a80603Q0035A93665n8002L5399b34109A49415
17862a81758a8451A2163O9627J05255e0349B24989p2169k1384k8047A1964d6981
$$ plain form
17850 12677 77478 -125130 -118733 -29502 -229412 226516 20737 236052 124452 71054 26103
17838 212302 132544 130314 -53386 55966 230991 37664 -113074 191450 131720 -7265 -93756
17827 -93756 10357 -135719 -337573 -6496 51777 36892 49037 304356 -160150 -138525 -85892
17816 -85892 -39174 232199 -93904 -43278 87813 108067 15899 127795 140054 182232 -176332
17804 122695 -125310 -70780 71486 -75036 -127779 209005 146853 15080 85856 45631 -74830
17792 84383 -930 66567 190435 -59451 66854 66447 294146 221688 -38055 -120790 -166754 -135491
17780 -135491 70544 119366 88625 144412 -14618 76833 -91990 -91918 -194480 -68643 -7079 -27129
17768 -27129 -10814 -41912 -44456 -94760 52804 172108 151751 139009 -26039 184202 -162605
$$ packed form
17850A2677O4801a25130O397b9502j99910B26516B0737K15315j11600n3398B6103
17838B12302p9758k230e3386E5966J75025C7664a13074A91450n9730g265q6491
17827i3756A0357a35719k01854f496E1777j4885J2145K55319a60150K1625N2633
17816h5892c9174B32199i3904d3278H7813K0254A5899J11896J2259M2178a76332
17804A22695a25310N4530G1486g5036n2743B09005o2152A5080P0776m0225g4830
17792H4383i30F6567J23868e9451F6854m07K27699p2458c8055q2735m5964L1263
17780a35491G0544M8822l0741N5787a4618G6833i1990P2j02562f8643g079k0050
17768b7129a0814l1098k544n0304E2804J19304k0357j2742b6039A84202a62605
$$ plain form
17756 182030 146885 362051 -136635 -55808 177848 356263 -186470 152880 -25573 -126157
17746 -126157 -59134 -149298 -121853 -63449 -86789 -191167 268084 -210569 63020 220315 72818
17734 -134309 49893 -175470 -23017 -86086 389771 190898 36482 69882 -206486 111274
17723 -95008 214592 -12041 284095 132773 -51807 255604 175034 -44457 337107 132841
17712 -7373 140181 -18223 -261279 -48266 39628 -6384 -5098 101531 272842 220059 -303849
17700 144245 345316 6071 166532 -112381 41590 76381 263746 -84578 -110987 263671 21641
17688 -247638 -49742 -142805 216644 439148 76480 -42387 32970 37717 163090 -168665 -208102
17677 -208102 -59855 -126042 47360 281568 -37656 -71291 -43439 138791 -101244 -132887 103372
$$ packed form
17756A82030l5145K15166a36635e5808A77848J78415a86470A52880b5573j00584
17746a26157e9134r0164K7445N8404k3340j04378B68084b10569F3020J57295G2818
17734a34309D9893a75470b3017o3069C89771A90898C6482L3400b06486A11274
17723i5008B14592a2041B84095A32773e1807B55604q0570d4457C37107A32841
17712g373A40181a8223k43056d8266C9628f384J286A01531J71311n2783c03849
17700A44245K01071F071J60461a12381D1590L4791J87365h4578k6409B63671B1641
17688b47638d9742r3063B16644K22504G6480d2387C2970M747J25373a68665l9437
17677b08102e9855o6187D7360K34208c7656l3635K7852A38791a01244l1643A03372
$$ plain form
17665 86320 -141794 -58364 213565 265461 -4783 46187 -133414 247019 25681 332204 14257
17653 -49562 13197 -72663 222652 292497 -15580 62946 162664 57551 288737 271563 38492
17641 287517 -186041 327871 226643 -7658 -92990 -85366 227570 101280 20733 -139785 241582
17629 95085 33179 93611 29754 148065 -119729 -271678 -59391 -96217 309842 194515 -145462
17617 -176123 383091 291890 127804 18864 265832 126377 159591 -268405 160694 238216
17607 238216 87115 -151238 137061 48994 231830 222136 -131850 -10286 -191261 -68064 143514
17595 -89288 317407 -52448 264593 -122804 -5607 300445 17716 145864 -296484 328515
17584 83741 105236 257052 -195145 229093 117541 138934 55700 -17119 16795 115442 185352
$$ packed form
17665H6320a41794e8364B13565N1896d783D6187a33414B47019B5681L06523A4257
17653d9562A3197g2663B22652O9845a5580F2946R9718E7551K31186j7174C8492
17641B87517a86041C27871j01228g658q5332P624B27570A01280B0733a39785B41582
17629I5085C3179O0432B9754J18311a19729j51949e9391l6826C09842j15327a45462
17617a76123C83091r1201A27804A8864K46968A26377L3214b68405A60694P7522
17607B38216H7115a51238A37061D8994J82836r694a31850a0286j80975f8064A43514
17595h9288C17407e2448B64593a22804e607C00445A7716J28148b96484C28515
17584H3741K1495J51816a95145B29093j11552K1393E5700a7119A6795R8647O9910
$$ plain form
17573 185352 434383 -217257 188128 107388 172963 439098 101257 15387 514501 137049
17562 269544 -182524 -31604 143973 245723 282481 195094 -37568 330743 197520 -13949
17551 -99859 179807 -148445 251070 208340 200175 77285 97716 490238 312221 317867 422519
17540 422519 317576 411952 220339 -42932 -231356 370257 45567 342195 55247 -60831
17529 -69395 310474 355398 447208 131562 398716 566635 805296 972880 896903 370300
17518 807832 140977 628341 -7444 78914 255491 445311 364713 379804 425042 418540 402334
17507 402334 1098527 416565 910977 295702 266659 381464 53081 429000 220999 113226
17497 113226 516449 471543 434453 226191 184809 607270 509252 213980 65080 259402
$$ packed form
17573A85352K49031b17257A88128q0740O5575K66135A01257A5387M99114A37049
17562B69544a82524c1604A43973J01750L6758q7387c7568C30743j33223a3949
17551i9859A79807a48445B51070m2730q165G7285K0431L92522j78017N646J04652
17540D22519j04943R4376j91613d2932j88424C70257D5567K96628E5247f0831
17529f9395C10474M4924R1810A31562K67154J67919K38661J67584p5977C70300
17518H07832A40977M87364g444G8914J76577J89820q0598J5091M5238o502j6206
17507D02334O96193D16565M94412B95702k9043J14805E3081L75919k08001j07773
17497A13226M03223m4906l7090k08262m1382M22461r8018B13980F5080J94322
$$ plain form
17487 259402 135823 -87341 75794 7247 495939 204191 -52395 -5092 165327 350305 217955
17476 217955 9780 74673 463482 7226 17290 458958 20607 279107 191093 445992 205549
17464 115222 253676 144885 120583 377702 321125 246357 109365 212404 -108348 147472
17453 326785 28774 47852 319639 202804 394840 133544 -9056 338010 480642 147394
17442 118532 256041 335405 287679 253146 253821 277609 439663 699577 130545 282077 505730
17431 505730 247308 293243 262478 291520 221979 91981 52052 227149 184620 372807 160276
17419 308033 124419 369842 200934 6980 403828 324977 335758 146175 441961 88853
17408 268979 132024 201803 162925 55777 140314 353035 120039 276643 -94894 -29495 97085
$$ packed form
17487B59402j23579h7341G5794G247M88692B04191e2395e092A65327J84978j32350
17476B17955I780O4893L88809G226J0064M41668B0607K58500q8014K54899B05549
17464A15222J38454j08791k4302K57119n6577p4768A09365J03039a08348A47472
17453C26785B8774J9078K71787j16835J92036A33544i056C38010J42632A47394
17442A18532J37509P9364m7726l4533O75K3788J62054K59914A30545J51532K23653
17431E05730B47308M5935l0765K9042o9541I1981l9929J75097m2529J88187A60276
17419C08033A24419K45423j68908F980L96848p8851J0781A46175K95786H8853
17408B68979A32024O9779l8878E5777Q4537K12721A20039J56604i4894b9495I7085
$$ plain form
17396 -50002 -77325 183041 280155 133005 208094 367122 274431 -101891 393189 53523 -30095
17384 189270 257380 523514 345677 87589 5899 250217 173370 288601 351857 227330 90430
17372 141111 156003 141995 399960 347117 288352 129005 385690 383648 -7977 320382 412421
17361 412421 7439 38811 339317 141508 184752 177000 -24298 266440 54796 291408 187174
17350 187174 162784 117885 294499 122657 413221 315533 228008 329260 80185 293359
17340 293359 64336 55394 -184810 79699 295293 547389 127821 103719 160488 471728 255059
17329 255059 326893 -5527 119594 234829 552043 -12806 -57635 186046 232927 207034 239426
17318 239426 365789 306241 292578 437625 -65293 297664 -194556 49738 -16146 165441
$$ packed form
17396e0002k7323A83041R7114A33005P5089J59028r2691a01891C93189E3523c0095
17384A89270O8110K66134j77837H7589E899K44318p6847J15231O3256j24527I0430
17372A41111J4892j4008K57965n2843n8765A29005K56685k042g977C20382R2039
17361D12421G439L1372L00506A41508M3244p752b4298B66440E4796K36612j04234
17350A87174k4390m4899J76614A22657K90564r7688q7525J01252H0185K13174
17340B93359F4336q942a84810G9699K15594K52096A27821k4102N6769L11240k16669
17329B55059P1834e527A19594J15235L17214a2806m4829A86046M6881k5893L2392
17318B39426J26363n9548j3663J45047f5293B97664a94556D9738a6146A65441
$$ plain form
17307 359345 402671 175006 234015 110292 372708 146843 632276 277597 -108432 298284
17296 494557 450354 219764 96749 -130819 -122524 250968 404001 153526 269750 296925
17286 296925 419628 514393 309911 112150 358064 109427 129495 -351934 230390 253329
17276 253329 364624 471598 343490 12921 30719 339942 256012 274672 224312 508686
17266 508686 211326 314580 86767 98659 206547 275868 251849 283568 145817 80097 251034
17255 251034 144865 375496 250479 133473 234943 292856 332360 281855 459902 107326
17244 294906 294821 407059 302666 70325 328719 404254 -15790 112508 186864 284374 220869
17233 220869 389789 59703 673911 23356 254227 -57298 160914 640486 329496 357257
$$ packed form
17307C59345M3326A75006N9009A10292K62416A46843M85433B77597a08432B98284
17296D94557m4203B19764I6749a30819Q295B50968J53033A53526J16224K7175
17286B96925J22703R4765k04482A12150K45914A09427K0068c51934B30390K2939
17276B53329J11295J06974j28108A2921J7798L09223q3930J8660n0360K84374
17266E08686B11326J03254H6767J1892J07888O9321k4019L1719j37751o5720J70937
17255B51034j06169K30631j25017j17006J01470N7913L9504n0505J78047A07326
17244B94906q5J12238j04393G0325K58394P5535a5790A12508P4356R7510o3505
17233B20869J68920E9703O14208B3356K30871e7298A60914M79572l10990K7761
$$ plain form
17223 357257 435918 20577 93141 346430 322833 198881 481807 378844 -7077 458637 417673
17212 417673 529282 181120 402379 333035 264271 170531 123491 168711 -85361 345891 243155
17201 243155 515246 115590 413571 355932 130549 386606 510986 304706 556365 359971
17191 359971 398974 400954 237887 413447 234073 456508 416487 486831 633602 461730
17181 461730 276446 591031 349685 503018 71901 511743 554825 468159 429329 586610
17171 586610 434036 330192 491712 257544 354477 264569 572957 48748 297379 365671
17161 365671 454220 439520 551813 472480 488631 315405 166873 165853 520128 409596 362426
17150 362426 441006 759709 596685 321743 148271 677311 547935 782200 675564 539390
$$ packed form
17223C57257P8661B0577P2564K53289k3597j23952K82926j02963g077D58637m0964
17212D17673J11609A81120K21259o9344o8764r3740m7040M5220h5361C45891j02736
17201B43155K72091A15590K97981n7639A30549K56057J24380k06280K51659j96394
17191C59971L9003J980j63067J75560j79374K22435m0021P0344J46771j71872
17181D61730j85284L14585k41346J53333G1901M39842M3082q6666l8830J57281
17171E86610j52574j03844J61520k34168R6933q9908L08388D8748K48631O8292
17161C65671Q8549j4700J12293p9333J6151j73226j48532j020L54275j10532m7170
17150C62426P8580L18703j63024k74942A48271N29040j29376K34265j06636j36174
$$ plain form
17140 539390 615333 281010 376074 280093 496580 484879 438047 399817 444323 286992 653679
17129 653679 475860 229866 317518 659665 496191 503024 646499 392228 544103 662275
17119 662275 696624 522160 690055 601684 436813 472312 432785 380680 368573 617655 417268
17108 417268 515530 647746 617693 690396 435423 563285 195235 590598 645243 555198
17098 555198 708599 539917 461457 670153 157386 430485 389104 809071 619651 430948
17088 430948 605089 523124 503534 505555 777700 448032 763471 666309 761319 357494 647642
17077 647642 552919 748818 425582 663297 436265 997196 746451 628985 790628 378277
17066 551638 600530 476801 639546 833032 695060 705009 549778 636936 672849 836764
$$ packed form
17140E39390P5943B81010R5064r5981K16487j1701m6832l8230M4506j57331L66687
17129F53679j77819B29866Q7652L42147j63474O833J43475k54271J51875J18172
17119F62275L4349j74464J67895q8371j64871L5499l9527n2105j2107K49082k00387
17108D17268R8262J32216l0053P2703k54973J27862A95235L95363N4645r0045
17098E55198J53401j68682p8460K08696A57386K73099m1381M19967j89420j88703
17088D30948J74141q1965j9590K021K72145l29668L15439r7162R5010C57494K90148
17077F47642r4723J95899l23236K37715k27032N60931k50745j17466J61643C78277
17066E51638M8892j23729J62745J93486j37972R949j55231Q7158L5913J63915
$$ plain form
17056 836764 901195 630446 732658 399540 825810 846032 622538 966468 854301 885895
17046 885895 935014 601766 830704 661482 713873 1011707 1065173 755211 636059 746405
17036 746405 854718 1040127 1027617 1061303 536817 1295039 707200 1081865 989463 670197
17026 670197 875099 1236691 920477 1022598 715432 995660 998393 993663 891975 990451
17016 990451 1073852 920772 848515 923938 1191953 890160 747788 982213 1018785 1192160
17006 1192160 952110 1404448 832803 1056214 957958 1213663 764865 1097072 921455 1261158
16996 1261158 1094460 1244561 1041859 1127701 1264762 932897 1613995 1264700 961317 930681
16986 930681 1239420 736534 1121752 1095910 1214098 1028686 1287285 1461968 1310722 1651138
$$ packed form
17056H36764O4431k70749J02212l33118M26270K0222k23494L43930j12167L1594
17046H85895M9119l33248K28938j69222N2391K97834N3466l09962j19152J10346
17036G46405J08313J85409j2510L3686n24486P58222n87839L74665r2402l19266
17026F70197K04902L61592l16214J02121l07166K80228K733m730j01688R8476
17016I90451Q3401j53080p2257P5423K68015l01793j42372K34425L6572J73375
17006A192160k40050M52338n71645K23411r8256K55705m48798L32207j75617L39703
16996A261158j66698J50101k02702Q5842J37061l31865O81098l49295l03383l0636
16986I30681L08739n02886L85218k5842J18188j85412K58599J74683j51246L40416
$$ plain form
16976 1651138 1379415 1489211 1262472 1448156 1257916 1491010 1440328 1177750 1227381 1364945
16966 1364945 1315396 992271 1564020 1208349 1427184 1515139 1299499 2009210 1590212 1387982
16956 1387982 1527200 1765911 1624402 1587809 1796521 1213274 1522399 1537450 1513204 1592230
16946 1592230 1483706 1789359 1756884 1863138 1594113 1824601 1604993 1783380 1954042 1650340
16936 1650340 1679344 2089033 1712405 1886486 1829006 1938782 1625975 1855209 2195379 1899410
16926 1899410 1916573 2222084 1965949 2143837 2176678 2431007 2045403 2300508 2215229 2053398
16916 2053398 2342414 1917798 2638820 2416155 2186161 2367499 1950498 2399726 2505120
16907 2505120 2535638 2652500 2543581 2488408 2780179 2874301 2673428 2806681 2978413 2864847
$$ packed form
16976A651138k71723J09796k26739J85684j90240K33094n0682k62578M9631J37564
16966A364945m9549l23125N71749l55671K18835Q7955k15640P09711m18998k02230
16956A387982J39218K38711j41509l6593K08712n83247L09125J5051k4246P9026
16946A592230j08524L05653l2475J06254k69025K30488k19608J78387J70662l03702
16936A650340K9004M09689l76628J74081n7480J09776l12807K29234L40170k95969
16926A899410J7163L05511k56135J77888L2841K54329l85604K55105q5279j61831
16916B053398K89016m24616P21022k22665k29994J81338m17001M49228J05394
16907B505120L0518J16862j08919n5173K91771R4122k00873J33253J71732j13566
$$ plain form
16897 2864847 2812092 2873390 2798027 2920308 2826801 3273424 2868862 3105996 3114641 2832174
16887 2832174 3130784 3206953 3094630 3036497 3483982 3532703 3607301 3421572 3509583 3809962
16877 3809962 3737679 3735419 3421976 3676787 3779398 3601016 3879194 3928427 4002366 3821567
16867 3821567 4038748 4125682 4238505 4396716 4607738 4553797 4259673 4385289 4324029 4606724
16857 4606724 4649055 4995178 4927742 5077672 4958993 4780473 5253269 5101411 5293119 5347482
16847 5347482 5408898 5585594 5388932 5702974 5851261 6023330 6151389 6070592 6250209 6322408
16837 6322408 6470218 6495748 6779964 6879666 6900309 6866457 7025073 7169775 7124340 7483375
16827 7483375 7656012 7798301 7866195 8396609 8167657 8687396 8927144 8987702 9087633 9172622
$$ packed form
16897B864847n2755O1298p5363J22281r3507M46623m04562K37134Q645k82467
16887B832174K98610P6169j12323n8133M47485M8721P4598j85729Q8011L00379
16877C809962p2283k260l13443K54811J02611j78382K78178M9233P3939j80799
16867C821567K17181Q6934J12823J58211K11022n3941k94124J25616o1260K82695
16857D606724M2331L46123o7436J49930j18679j78520M72796j51858J91708N4363
16847E347482O1416J76696j96662L14042J48287J72069J28059q0797J79617P2199
16837F322408J47810K5530K84216R9702K0643l3852J58616J44702m5435L59035
16827G483375J72637J42289O7894N30414k28952N19739K39748O0558R9931Q4989
$$ plain form
16817 9172622 9565508 9471597 9823742 9942580 10002595 10450317 10942009 10885090 10881219 11059623
16807 11059623 11834761 12140665 12243214 12489016 12884562 13226598 13217143 13685444 13972114 14334242
16797 14334242 14733949 15082429 15537911 15613826 15860374 16425821 16823179 17264298 17954258
16788 17954258 18605881 18651995 19418070 20275265 20368569 21005472 21771212 22304092 23308801
16779 23308801 23561102 24232235 25106673 25730500 26903135 27493620 28260681 29404712 30077508
16770 30077508 31086585 32090800 33252298 34194502 35188462 36389499 37401687 38832734
16762 38832734 40289977 41575047 42739849 44517351 46177839 47486408 49204761 50719701
16754 50719701 52691809 54634154 56384390 58466064 60185143 62669429 64679552 66862933
$$ packed form
16817I172622L92886r3911L52145J18838O0015M47722M91692n6919l871J78404
16807A1059623P75138L05904J02549K45802L95546L42036r455M68301K86670L62128
16797A4334242L99707L48480M55482P5915K46548N65447L97358M41119O89960
16788A7954258O51623M6114P66075Q57195R3304O36903P65740N32880J004709
16779B3308801K52301O71133Q74438O23827J172635N90485P67061J144031O72796
16770C0077508J009077J004215J161498R42204R93960J201037J012188J431047
16762C8832734J457243J285070J164802J777502J660488J308569J718353J514940
16754E0719701J972108J942345J750236K081674J719079K484286K010123K183381
$$ plain form
16746 66862933 69337549 71476060 73254870 76035931 77917638 80307944 82567752 85524454
16738 85524454 87512991 89675117 91913886 93945324 96074777 97891935 99514016 101190905
16730 101190905 102178001 103639181 104988775 105441422 105932347 106299291 106068175 106172309 105701270
16721 105701270 105169737 104060846 103198593 101673685 100331760 98745781 96841998 94868091
16713 94868091 92975341 90786508 88208544 86480425 83977440 81397704 79036340 76917607
16705 76917607 74521103 72076603 70095730 67597768 65582223 63273094 61452499 59448898
16697 59448898 57418542 55311740 53639511 51864723 50337232 48320223 46633354 45286274
16689 45286274 43982797 42329302 40988572 39288088 38439116 37190217 36043185 34964414
$$ packed form
16746F6862933K474616K138511J778810K781061J881707K390306K259808K956702
16738H5524454J988537K162126K238769K031438K129453J817158J622081J676889
16730A01190905R87096J461180J349594M52647M90925L66944k31116J04134m71039
16721A05701270n31533j108891q62253j524908j341925j585979j903783j973907
16713I4868091j892750k188833k577964j728119k502985k579736k361364k118733
16705G6917607k396504k444500j980873k497962k015545k309129j820595k003601
16697E9448898k030356k106802j672229j774788j527491k017009j686869j347080
16689D5286274j303477j653495j340730j700484q48972j248899j147032j078771
$$ plain form
16681 34964414 33729190 32691250 31710977 30760465 30007725 29314278 28230634 27447386 26518963
16672 26518963 26024359 25082991 24453307 23823457 23369728 22453117 22165441 21293956 21124996
16663 21124996 20410474 19738948 19124022 18615850 18209658 17918128 17493540 16741178 16595403
16654 16595403 15801541 15933923 15295875 15388497 14551250 14365691 14204621 13942222 13636852
16645 13636852 13103950 12973601 12895761 12175948 12181796 12059181 11792992 11400111 11397148 10744389
16635 10744389 10594204 10772600 10439121 10221244 10007298 9926209 9485378 9677492 9000502
16626 9000502 9405233 8979251 8627916 8741462 8270639 8290278 8286884 8140016 8122515 7593162
16616 7593162 7522123 7682650 7745200 7456223 7669964 7392944 7084853 7218312 7290717 7001293
$$ packed form
16681C4964414j235224j037940r80273r50512p52740o93447j083644p83248r28423
16672B6518963m94604r41368o29684o29850m53729r16611k87676q71485j68960
16663B1124996p14522o71526o14926n08172m06192k91530m24588p52362j45775
16654A6595403p93862J32382o38048R2622q37247j85559j61070k62399l05370
16645A3636852n32902j30349p7840p19813N848j22615k66189l92881k963o52759
16635A0744389j50185J78396l33479k17877k13946q1089m40831J92114o76990
16626I000502M04731m25982l51335J13546m70823J9639l394j46868j7501n29353
16616G593162p1039J60527O2550k88977K13741k77020l08091J33459P2405k89424
$$ plain form
16606 7001293 6870465 6626342 6349683 6089582 6227394 6149006 5863639 5718951 5878367 5928657
16596 5928657 5464634 5501632 5645439 5709871 5436891 5450614 5337342 5047386 5217109 5007671
16586 5007671 4736005 5084909 5004187 4908323 4841342 4629728 4564215 4795247 4419174 4224198
16576 4224198 4613558 4144063 4613767 3797252 4179342 4291399 4269725 4208802 3839612 3898380
16566 3898380 3813237 4028010 3882872 3398498 3721076 3619129 3540531 3592562 3658930 3506253
16556 3506253 3596129 3478240 3480628 3476911 3281022 2932111 2996928 3464118 3294672 3269008 2957437
16545 2957437 3050754 3222542 2772255 3231729 3120486 2977481 2867321 2838076 2936920 2814442
16535 2814442 2997393 2803331 2452962 2725568 2784087 2915196 2562034 3006855 2629976 2627287
$$ packed form
16606G001293j30828k44123k76659k60101J37812p8388k85367j44688J59416N0290
16596E928657m64023L6998J43807O4432k72980J3723j13272k89956J69723k09438
16586E007671k71666L48904q0722r5864o6981k11614o5513K31032l76073j94976
16576D224198L89360m69495M69704q16515L82090J12057k1674o0923l69190N8768
16566C898380q5143K14773j45138m84374L22578j01947p8598N2031O6368j52677
16556C506253Q9876j17889K388l717j95889l48911O4817M67190j69446k5664l11571
16545B957437R3317J71788m50287M59474j11243j43005j10160k9245R8844j22478
16535B814442J82951j94062l50369K72606N8519J31109l53162M44821l76879k689
$$ plain form
16525 2627287 2238498 2459354 2725703 2740294 2692683 2344038 2662581 2396391 2385332 2329077
16515 2329077 2406696 2443951 2389643 2361016 2505527 2479625 2016159 2145760 2356689 2297954
16505 2297954 1950170 1966133 2447716 2080805 2445968 2093776 2408556 1991420 2016485 2027345
16495 2027345 2206088 2179939 2272206 2146982 1926151 2404615 1973623 2209407 2197862 2163779
16485 2163779 2069976 1731086 1831594 1716399 2073531 2152978 1916534 1514283 1535739 1367120
16475 1367120 1820452 1925504 1514138 1913272 1373936 1689561 1776578 2084524 1506857 1691200
16465 1691200 1929281 1841149 1730583 1800933 1381856 1901718 1690041 1844742 1397967 1537393
16455 1537393 1723586 1396998 1514524 1703126 1443870 1766576 1499238 1538676 1393025 1515893
$$ packed form
16525B627287l88789K20856K66349J4591m7611l48645L18543k66190j1059n6255
16515B329077P7619L7255n4308k8627J44511k5902m63466J29601K10929n8735
16505B297954l47784J5963M81583l66911L65163l52192L14780m17136K5065J0860
16495B027345J78743k6149R2267j25224k20831M78464m30992K35784j1545l4083
16485B163779r3803l38890J00508j15195L57132P9447k36444m02251K1456j68619
16475A367120M53332J05052m11366L99134n39336L15625Q7017L07946n77667J84343
16465A691200K38081q8132j10566P0350m19077N19862k11677J54701m46775J39426
16455A537393J86193l26588J17526J88602k59256L22706k67338L9438j45651J22868
$$ plain form
16445 1515893 1308046 1379780 1456219 1464566 1331418 1598131 1331517 1461735 1132938 1458599
16435 1458599 1347265 1438062 1360494 1629588 1399396 1630983 1361961 1449835 1479889 1444526
16425 1444526 1125485 1351250 1363083 1467187 1081697 1167430 1373082 1090574 1088598 1433899
16415 1433899 1323791 1291525 1260012 1290683 1338464 1223389 1139314 1350451 1231802 1548577
16405 1548577 1288531 1367991 1171192 1070595 1050682 1328619 1217189 1412534 1233813 1387001
16395 1387001 1074608 1472731 1159582 1072085 1185299 1166093 962784 1142786 1049442 1042139
16385 1042139 798741 917042 1104842 1298138 1067672 911411 1232385 767154 904107
16376 904107 1324000 775322 1001187 983538 909347 1450295 1144958 971647 1039867 830958
$$ packed form
16445A515893k07847P1734P6439Q347j33148K66713k66614J30218l28797L25661
16435A458599j11334R0797p7568K69094k30192K31587k69022Q7874L0054l5363
16425A444526l19041K25765J1833J04104l85490Q5733K05652k82508j976L45301
16415A433899j10108l2266l1513L0671M7781j15075q4075K11137j18649L16775
16405A548577k60046P9460j96799j00597j9913K77937j11430J95345j78721J53188
16395A387001l12393L98123l13149q7497J13214j9206k03309J80002r3344p303
16385A042139k43398J18301J87800J93296k30466j56261L20974m65231J36953
16376I04107M19893n48678K25865j7649p4191N40948l05337j73311O8220k08909
$$ plain form
16366 830958 1060606 904970 898778 746507 1065551 1137981 1301603 1140723 838099 852839
16356 852839 706447 968430 831003 1017735 907807 923970 967930 738253 987734 850762
16346 850762 690323 770748 757902 1122040 772141 963583 1004231 947198 973034 751480
16336 751480 628653 807123 1235314 904581 1058577 928982 1001802 719504 881643 809691
16326 809691 625209 835385 869841 895585 678222 706790 608074 651162 515725 697636
16316 697636 1006170 903708 746647 312358 634989 860266 998799 639301 541126 827688
16306 827688 623257 700920 787994 741959 671467 987665 428400 544211 748575 687604
16296 687604 765360 885533 547674 660007 666158 823156 837859 493356 626281 662153
$$ packed form
16366H30958K29648j55636o192j52271L19044P2430J63622j60880l02624J4740
16356H52839j46392K61983j37427J86732j09928J6163M3960k29677K49481j36972
16346H50762j60439Q0425j2846L64138l49899J91442M0648n7033K5836k21554
16336G51480j22827J78470M28191l30733J53996j29595P2820k82298J62139p1952
16326H09691j84482K10176L4456K5744k17363K8568r8716M3088j35437J81911
16316F97636L08534j02462j57061C12358L22631K25277J38533l59498r8175K86562
16306H27688k04431P7663Q7074m6035p0492L16198D28400J15811K04364o0971
16296F87604P7756J20173l37859J12333O151J56998J4703l44503J32925L5872
$$ plain form
16286 662153 774332 769500 726939 680727 422091 695740 640655 992442 781386 760549 890920
16275 890920 597241 832046 467591 594623 583431 959747 1031955 636174 668538 866453
16265 866453 673089 451281 434611 664610 601542 502151 392862 665186 645910 442949
16255 442949 815283 975243 803186 1069416 503068 1009590 676376 478103 572084 807017
16245 807017 690087 592528 594132 718908 792821 660006 281325 809541 553086 851270
16235 851270 363145 435526 190868 533792 274480 427144 383609 718868 535829 527128
16225 527128 506725 843783 396570 422827 276518 61995 512479 340849 208344 690285
16215 690285 460066 209140 655502 502738 368626 321951 396604 523077 494016 386407
$$ packed form
16286F62153J12179m832m2561m6212k58636K73649n5085L51787k11056k0837J30371
16275H90920k93679K34805l64455J27032j1192L76316P2208l95781L2364J97915
16265H66453j93364k21808j6670K29999o3068r9391j09289K72324j9276k02961
16255D42949L72334J59960j72057K66230E03068N06522l33214j98273R3981K34933
16245H07017j16930r7559J604J24776P3913j32815B81325N28216k56455K98184
16235H51270C63145P2381A90868L42924k59312J52664m3535L35259j83039q701
16225E27128k0403L37058C96570K6257j46309F1995M50484j71630j32505M81941
16215F90285k30219B09140M46362j52764j34112m6675P4653J26473k9061j07609
$$ plain form
16205 386407 484966 159167 388033 387970 224835 474553 600626 550690 555570 407229 648501
16194 648501 398165 400299 159509 563693 599972 775346 258516 602300 895362 350383
16183 617001 341761 152373 338744 449091 43187 355250 477252 382833 566524 370025
16173 370025 599681 526853 329143 401133 450313 279484 523506 219048 582774 509689
16163 509689 519208 571540 520444 487820 574050 196426 223291 49391 250023 322139 73386
16151 239538 262007 466388 277162 169660 207984 304753 414527 481890 466791 357856
16141 357856 80504 412520 368936 15490 237853 197838 471286 122826 168372 450179
16131 450179 386973 97708 219963 232357 251086 31478 630735 194060 306915 169380
$$ packed form
16205C86407R8559A59167K28866o3j63135K49718J26073m9936M880j48341K41272
16194F48501k50336K134A59509M04184L6279J75374B58516L43784K93062C50383
16183F17001k75240A52373J86371J10347D3187L12063J22002r4419J83691j96499
16173C70025K29656p2828j97710P1990M9180j70829K44022B19048L63726p3085
16163E09689R519N2332n1096l2624Q6230A96426K6865D9391K00632P2116G3386
16151B39538K2469K04381j89226j07502L8324R6769J09774O7363j5099j08935
16141C57856H0504L32016m3584A5490K22363m0015K73448A22826M5546K81807
16131D50179o3206I7708J22255J2394J8729C1478N99257A94060J12855j37535
$$ plain form
16121 169380 98943 291952 -259069 284877 252668 153531 444098 225268 69657 240569
16111 240569 229709 -43121 206410 199633 135732 120468 60411 265343 427969 268961 -116747
16099 433443 319072 529777 288739 304588 333285 294533 106737 -122335 79086 365788
16089 365788 104847 4713 218285 52870 364830 423739 443725 266880 255129 117225 299297
16078 299297 448318 226676 184082 288288 484186 373333 138953 123155 118794 311455
16068 311455 53143 -77199 393017 312628 111572 261094 301367 101635 19405 126804
16058 126804 121222 161723 -158456 -258174 481715 155624 12205 598760 448087 123333
16047 443404 79516 212359 179515 340673 -75938 316760 156764 125479 260503 154591
$$ packed form
16121A69380p0437J93009b59069B84877l2209r9137K90567k18830F9657J70912
16111B40569j0860d3121B06410o777o3901j5264o0057K04932J62626j59008a16747
16099D33443j14371K10705k41038J5849K8697l8752A06737a22335G9086K86702
16089C65788A04847D713K13572E2870L11960N8909J9986j76845j1751A17225J82072
16078B99297J49021k21642m2594J04206J95898j10853A38953j5798m361J92661
16068C11455E3143g7199C93017q0389A11572J49522M0273A01635A9405J07399
16058A26804n582M0501a58456r9718D81715A55624A2205N86555j50673A23333
16047D43404G9516J32843l2844J61158g5938C16760A56764l1285J35024j05912
$$ plain form
16037 154591 -69212 -65680 -37279 278089 53191 260412 -20215 215272 68036 110539 163109
16026 163109 3626 115589 499844 -60706 -36774 -25165 219902 -7822 64887 147602 323877
16015 323877 66282 116707 -400157 -124211 317426 439830 479930 218890 -282790 -11559
16004 22707 158763 11160 51620 126022 -69440 346469 57269 150587 -195621 -24077 107719
15992 139291 192926 252372 493933 210424 429338 678420 1185983 1207290 819284 1161668
15982 1161668 872282 416046 170730 -26145 359999 -69448 275976 -120366 -78006 -141711
15972 -141711 -124177 90259 38000 -349429 21311 122703 126887 138022 77101 -302052 182647
15960 -95359 -255305 -158815 -50659 309110 -45495 247793 10415 -120126 -67206 187650 -36494
$$ packed form
16037A54591f9212L532K8401B78089E3191K07221b0215B15272F8036M2503N2570
16026A63109C626J11963L84255f0706K3932J1609B19902g822F4887Q2715J76275
16015C23877F6282N0425d00157a24211C17426J22404M0100B18890b82790a1559
16004B2707J36056A1160M0460P4402f9440C46469E7269R3318a95621b4077A07719
15992A39291N3635N9446K41561B10424K18914K49082N07563K1307l88006L42384
15982A161668k89386D16046A70730b6145C59999f9448B75976a20366M2360o3705
15972a41711J7534I0259C8000c49429B1311J01392M184J1135o0921c02052A82647
15960i5359j59946R6490e0659C09110d5495B47793A0415a20126N2920A87650c6494
$$ plain form
15948 217640 -150219 -339234 30425 323488 -293567 107352 300755 -248759 -41484 431
15937 318269 410880 229555 300383 89432 -22259 153783 -106649 -105039 -160479 -230127 163113
15925 95898 44358 170217 19521 -341763 58060 99923 21300 -212681 -105662 262353 -420769
15913 -85559 -30994 -131493 14584 -72296 123873 -149659 674583 12823 219236 202413 178688
15902 178688 -70279 121881 251682 -209365 -201674 131638 192871 42171 -134878 320853
15891 76867 -360020 145716 94211 5674 -286658 146024 -285915 -181132 147116 60511
15880 117209 226024 103813 12219 -103760 177306 -193567 -86120 -8864 -446857 -309782
15870 -309782 -160052 107449 -49884 68423 147836 425759 108646 106439 -183381 45984 67408
$$ packed form
15948B17640a50219j89015C0425K93063b93567A07352J93403b48759d1484D31
15937C18269R2611j81325P0828H9432b2259A53783a06649J610n5440o9648A63113
15925I5898D4358J25859A9521c41763E8060M1863B1300b12681a05662B62353d20769
15913h5559c0994j00499A4584g2296A23873a49659F74583A2823K06413j6823k3725
15902A78688g0279A21881J29801b09365P691A31638O1233D2171a34878C20853
15891G6867c60020A45716n1505E674b86658A46024b85915J04783A47116F0511
15880A17209J08815A03813A2219a03760A77306a93567h6120h864m37993J37075
15870c09782J49730A07449d9884F8423P9413K77923A08646k207a83381D5984K1424
$$ plain form
15859 67408 52976 -142928 90338 -207814 -7983 -29738 -83852 -237458 -62648 165505 28512
15847 229708 62730 126591 -206303 249454 -86392 -83851 97830 152815 27366 104034 173863
15836 173863 -115002 199641 63296 -265244 101190 -270582 269174 -88497 -113933 67055
15825 -66465 -152165 -24092 -37819 102332 179299 28436 -72064 29448 -101808 -382744 131358
15813 8503 93915 253499 116534 -119950 48286 -8007 3397 22342 230346 -86630 -80352 57147
15800 -23185 258810 155849 145741 -89992 31325 17519 -140940 -20151 197936 -138912 -38963
15788 -233974 -110539 -303469 14251 119952 -34152 44753 277252 -386689 178829 -52540
15777 483998 104370 -90958 338786 154120 -74687 -81574 -200425 -171015 17791 44934 -115179
$$ packed form
15859F7408j4432a42928I0338b07814g983k1755n4114j53606f2648A65505B8512
15847B29708F2730O3861b06303B49454h6392K541I7830N4985B7366P6668O9829
15836A73863a15002A99641F3296b65244A01190b70582B69174h8497k5436F7055
15825f6465q5700b4092j3727A02332P6967B8436g2064B9448a01808k80936A31358
15813H503Q5412J59584A16534a19950D8286h007C397J8945K08004h6630O278E7147
15800b3185B58810j02961j0108h9992C1325j3806a40940b0151A97936a38912c8963
15788b33974a10539j92930A4251J05701c4152D4753K32499c86689A78829e2540
15777D83998A04370i0958C38786A54120g4687o887j18851K9410A7791K7143a15179
$$ plain form
15765 -16896 -13897 176006 120356 -94867 146677 194466 139871 180143 -200623 -208392 -54954
15753 -209094 -195963 66333 -162241 -212973 148302 57621 -22868 86922 57469 57241 -42815
15741 -47219 94981 -185592 -35947 264728 -71383 -200841 -36949 230283 291084 225587 94899
15729 -247330 -49748 -248496 -175677 49993 -41177 91389 -118759 14780 291216 143654 56969
15717 -76502 -156730 -106210 33129 -212673 86245 83578 -4067 71911 54744 -312255 -119885
15705 -178707 -198757 84820 -375997 -67406 -179518 -35827 -162769 -369920 -164961 184492
15694 -202629 352516 -11603 -32746 143684 -107885 146848 -89125 238097 -490 58428 230027
15683 230027 93898 -47289 25847 -53376 -24886 -91886 112403 -30719 28983 58590 -150160
$$ packed form
15765a6896K999A76006n5650i4867A46677M7789n4595M0272b00623p769e4954
15753b09094J3131F6333a62241n0732A48302E7621b2868H6922k9453k28d2815
15741d7219I4981a85592c5947B64728g1383j29458c6949B30283O0801o5497I4899
15729b47330d9748j98748P2819D9993d1177I1389a18759A4780K76436A43654E6969
15717g6502q0228N0520C3129b12673H6245k667d067G1911j7167c12255a19885
15705a78707k0050H4820c75997f7406j12112c5827j26942k07151a64961A84492
15694b02629C52516a1603k1143A43684a07885A46848h9125B38097d90E8428J71599
15683B30027I3898d7289B5847e3376b4886o7000A12403c0719B8983K9607a50160
$$ plain form
15671 -3936 183660 -287110 -255713 71944 5967 -51817 199031 -238676 -183513 -140713 -224795
15660 -224795 79759 -54424 -170869 -165880 238067 7060 -39182 249247 26334 -121952 185461
15648 -59847 -24991 253764 -7283 83721 302552 65642 -181545 68933 169771 -106839 114961
15636 -262546 3957 -212525 156466 -116325 146120 -327932 -333233 -72726 -288020 -425830
15626 -425830 -3151 -154843 -171815 -66192 -173933 -205414 -114541 -193645 -295489 -93900 -444827
15615 -444827 -452136 176893 -12125 175977 66928 174783 -66871 -161680 221581 -196351 49659
15603 -224907 -32143 -473519 -13762 167741 38505 -64901 49732 172123 -114651 89109 -202548
15591 168922 -15652 14827 -127806 51030 104098 -16432 134687 -93453 -35954 36919 -95362
$$ packed form
15671c936A83660b87110L1397G1944E967e1817A99031b38676N5163M2800q4082
15660b24795G9759e4424j16445M989B38067G060c9182B49247B6334a21952A85461
15648e9847b4991B53764g283H3721K18831F5642a81545F8933J00838a06839A14961
15636b62546C957b12525A56466a16325A46120c27932n301g2726k15294j37810
15626d25830c151j51692j6972f6192j07741l1481R0873p9104j01844i3900l50927
15615d44827p309A76893a2125A75977F6928J07855f6871r4809B21581a96351D9659
15603b24907c2143m41376a3762A67741C8505f4901D9732J22391a14651H9109b02548
15591A68922a5652A4827a27806E1030N3068a6432A34687i3453c5954C6919i5362
$$ plain form
15579 -114177 -222872 -213965 41016 -9244 -287324 -99623 92289 37229 -1965 -387836 -189094
15567 227312 110292 -61370 -120592 220467 -49185 -140291 -95982 -199926 159528 7133 -45382
15555 -85727 184457 167762 -75581 -44209 -233033 -21189 -91574 -109289 294361 -14877 104335
15543 -259729 7121 -144 125228 196178 378850 109452 -18960 69640 -211790 -45463 -17334
15531 62268 63622 -46467 142976 -137900 166192 3390 189275 -105410 46987 90217 22037
15519 117940 -108094 87304 184976 86667 -60884 68695 10859 11768 150283 92564 49811
15508 49811 213679 301133 -151644 86208 22487 77093 -394775 106161 339211 181019
15498 181019 972 248401 58658 -109966 260695 221553 42903 -405798 -211793 -301840 331579
$$ packed form
15579a14177j08695Q907D1016i244k78080i9623I2289C7229a965l85871a89094
15567B27312A10292f1370n9222B20467d9185r1106M4309j03944A59528G133d5382
15555h5727A84457j6695g5581L1372j88824b1189p0385j7715B94361a4877A04335
15543b59729G121a44A25228P0950J82672A09452a8960F9640b11790d5463a7334
15531F2268J354d6467A42976a37900A66192C390J85885a05410D6987M3230B2037
15519A17940a08094H7304R7672H6667f0884F8695A0859R09J38515n7719m2753
15508D9811J63868Q7454a51644H6208B2487N4606c94775A06161K33050j58192
15498A81019I72K47429E8658a09966B60695l9142D2903d05798J94005r0047C31579
$$ plain form
15486 149522 -24427 -62199 209582 433102 64681 320421 167856 357135 280812 -192744
15475 444742 15382 249110 343218 41955 -32805 216741 -55564 34796 271640 150036 -128522
15463 204731 46904 119098 -159099 -217484 228085 -106046 16461 210818 -146306 -111938
15453 -111938 168281 153561 -138824 267935 45114 448701 -115187 244299 215716 475755
15443 475755 288608 628754 658490 456104 433716 258482 250808 -59544 -47034 -37391 -21822
15432 -21822 -28934 86451 -337830 -31352 317512 299877 312933 -11453 -175020 -207448 50117
15420 145994 446918 59121 166533 -163373 -132844 -107085 283135 160076 382360 8666
15409 56781 114631 250902 11871 -277389 -72524 -46318 235627 323002 240468 3675 -243133
$$ packed form
15486A49522b4427l7772B09582K23520F4681K55740j52565J89279p6323a92744
15475D44742A5382K33728R4108D1955c2805B16741e5564C4796K36844j21604a28522
15463B04731D6904P2194a59099n8385B28085a06046A6461J94357a46306L4368
15453a11938A68281j4720a38824B67935D5114M03587a15187B44299k8583K60039
15443D75755j87147L40146K9736k02386k2388j75234p674e9544J2510R643J5569
15432b1822p112H6451c37830c1352C17512j7635J3056a1453j63567l2428E0117
15420A45994L00924E9121J07412a63373L0529K5759B83135j23059K22284H666
15409E6781N7850J36271A1871b77389g2524K6206B35627Q7375q2534C675b43133
$$ plain form
15397 -243453 -24321 20961 53872 -374796 109952 206467 -239565 24020 -25295 -16057 47828
15385 139157 -152378 119924 -53944 -64540 271315 74101 359370 -39408 -310573 211166
15374 -183519 2906 34021 101740 365012 241968 74459 -50776 274868 -98626 129603 82992
15363 82992 149157 227400 -143226 -216578 273566 58539 147107 138813 127244 182359 35701
15351 37990 -56459 -129087 193909 136828 -90603 201141 -83815 678460 44641 -186191 226069
15339 170074 -241812 224456 218061 125124 -27549 442292 109802 -378513 33858 265104
15329 265104 -11765 279402 235728 163719 8681 -10228 236439 259483 -40342 51416 240517
15318 240517 210124 376087 73844 -40659 -28667 -23352 -261775 145573 20538 160580 -44510
$$ packed form
15397b43453b4321B0961L2911c74796A09952R6515b39565B4020b5295R238D7828
15385A39157a52378A19924e3944j0596B71315G4101K85269c9408k71165B11166
15374a83519B906L1115O7719K63272j23044G4459e0776B74868i8626A29603m6611
15363H2992O6165P8243a43226p3352B73566E8539Q8568q294j1569N5115C5701
15351C7990e6459p2628A93909n7081i0603B01141h3815F78460D4641a86191B26069
15339A70074b41812B24456o395r2937b7549D42292A09802c78513C3858K31246
15329B65104a1765B79402m3674p2009H681a0228B36439K3044d0342E1416J89101
15318B40517l0393J65963G3844d0659J1992N315k38423A45573B0538J40042d4510
$$ plain form
15306 -118935 220675 50061 564 67652 -37126 -79149 -157441 153944 -3279 117686 41815
15294 79581 248942 44587 -31017 86811 87275 6109 357126 204687 -78113 79718 80801 -154564
15281 -156880 443490 22881 72584 -197851 62657 -226096 130895 -120 118371 -32130 21859
15269 -48803 146755 -254205 87580 6993 -11732 -144905 161481 146014 87830 329938 -1333
15257 -141709 -6523 -96919 62668 220933 375821 72920 1177 -95005 270501 -7181 387205
15245 1229089 1142355 1013082 1256884 387403 333766 246753 284244 -155018 245386 31523
15234 -155652 -82392 116772 -153652 -19557 -95714 -99283 -58996 -141313 -199747 15429 -26929
15222 181742 249296 364375 310534 94767 76437 -96992 282288 471032 332192 -45840 5835
$$ packed form
15306a18935B20675E0061E64O7088c7126m2023p8292A53944c279A17686D1815
15294G9581J69361D4587c1017H6811M64F109L51017j52439g8113G9718J083a54564
15281a56880D43490B2881M9703a97851F2657b26096A30895a20A18371c2130B1859
15269d8803A46755b54205H7580F993a1732j33173A61481j5467n8184K42108a333
15257a41709f523r0396F2668J58265J54888G2920A177i5005B70501g181C87205
15245A229089q6734j29273K43802C87403n3637q7013L7491a55018B45386C1523
15234a55652P3260A16772a53652a9557p6157l569M0287q2317n8434A5429b6929
15222A81742O7554J15079n3841I4767j8330i6992B82288J88744j38840d5840E835
$$ plain form
15210 152551 105664 -256537 -25432 81246 101902 210887 181267 105036 -27629 238893 240072
15199 240072 68830 447084 -112440 447087 -61056 50579 186422 -144897 -73811 403759
15188 -15554 38508 259702 355723 95861 174809 206525 -212970 -135706 202335 195660 -119932
15176 -48246 -32985 131051 121175 -163463 56446 -96178 174279 283379 195132 -169799 20145
15164 68217 -16118 -96445 235032 190232 -369363 -169704 -61814 258059 95330 128581 199729
15153 199729 103510 176597 -18083 150657 -17438 -120801 -3235 -297238 -24800 150365 -138384
15141 176503 217784 344891 306970 -28376 147685 -124118 52893 262490 410369 331014
15131 331014 -50141 -148626 -209133 104269 434975 -57622 -117522 86713 460419 102400 505021
$$ packed form
15210A52551m6887b56537b5432H1246K0656J08985k9620p6231b7629B38893J179
15199B40072F8830L78254a12440D47087f1056E0579J35843a44897P1086D03759
15188a5554C8508K21194R6021I5861P8948L1716b12970P7264B02335o675a19932
15176d8246J5261A31051r876a63463E6446i6178A74279J09100q8247a69799B0145
15164F8217a6118q0327B35032m4800c69363a69704f1814B58059I5330L3251P1148
15153A99729r6219P3087a8083A50657a7438j03363c235k94003b4800A50365a38384
15141A76503M1281J27107l7921b8376A47685a24118E2893K09597J47879p9355
15131C31014e0141r8485o0507A04269L30706e7622n9900H6713L73706A02400M02621
$$ plain form
15120 505021 192640 238112 -1951 -118382 -81694 88766 221009 106644 342578 129034
15109 -155776 166032 331719 -32993 -253064 145357 -106155 276208 -6640 -120395 6862
15098 51294 184021 39726 156930 92749 190369 -300819 -122134 198128 247550 26990 -97414
15086 131510 115895 373910 308255 102799 -14045 -61302 326180 -229705 265328 218677
15076 218677 98934 125564 -150051 676139 422289 377514 -122079 29475 45891 -54123 -292528
15065 -292528 169957 -104028 -77658 166289 -78373 265344 151008 -128966 172587 123269
15055 123269 206913 325689 123027 339066 129682 361499 96341 8883 149679 270637
15045 270637 114381 310965 502531 287999 163852 209780 -121906 267714 247397 209050
$$ packed form
15120E05021A92640M5472a951j16431L6688H8766J32243A06644K35934A29034
15109a55776A66032J65687c2993k20071A45357a06155B76208f640j13755F862
15098E1294J32727C9726J17204o4181R7620c00819a22134A98128M9422B6990i7414
15086A31510j5615K58015o5655A02799a4045m7257C26180b29705B65328m6651
15076B18677I8934K6630a50051F76139k53850m4775a22079B9475J6416e4123k38405
15065b92528A69957a04028K6370A66289g8373B65344j14336a28966A72587m9318
15055A23269Q3644J18776A23027K16039A29682K31817I6341H883J40796J20958
15045B70637A14381J96584J91566k14532j24147M5928a21906B67714k0317l8347
$$ plain form
15035 209050 135152 355267 207769 28223 292826 -11512 94965 516130 745857 455944
15025 455944 483897 449547 415264 479800 220952 177896 575259 559752 543444 624307 366948
15014 366948 570790 549500 154925 506519 143002 97600 416604 527271 357054 485597
15004 485597 246406 288529 535576 170891 251355 44408 477555 439305 296221 440098
14994 440098 501226 351039 205655 424180 375642 535391 415706 882813 284879 -10616
14983 295740 259273 498727 289051 554503 285634 712660 593418 638016 124062 258284
14973 258284 370903 218351 121017 250003 723486 564788 269767 264508 326322 381508
14963 381508 193350 290885 77201 240378 563269 421578 348067 -105857 154368 184282
$$ packed form
15035B09050p3898K20115j47498B8223K64603a1512I4965M21165K29727k89913
15025D55944K7953l4350l4283O4536B20952m3056L97363j5507j6308Q0863k57359
15014C66948K03842k1290A54925L51594A43002m5402L19004J10667j70217J28543
15004D85597k39191M2123K47047A70891Q0464D4408M33147l8250j43084J43877
14994D40098O1128j50187j45384K18525m8538J59749j19685M67107B84879a0616
14983B95740l6467K39454k09676K65452k68869M27026j19242M4598A24062J34222
14973B58284J12619j52552r7334J28986M73483j58698B69767n259O1814N5186
14963C81508j88158R7535G7201J63177L22891j41691p3511a05857A54368K9914
$$ plain form
14953 184282 442633 16579 141563 420004 154980 652980 335004 588049 344679 247152
14943 247152 683742 627202 286992 135374 237242 589293 408187 141292 365075 234527
14933 234527 464692 364289 586050 470641 819896 910031 804131 788780 1083615 1137345
14923 1137345 1250145 783505 1061698 1250873 1190984 1333155 1394631 1768040 1675497 1323018
14913 1323018 879988 984318 804133 564227 190192 457709 460526 676868 547510 356580
14903 356580 101505 299896 468747 11921 596132 177134 296031 447830 378310 400070
14893 400070 527417 374978 310552 454372 585812 357449 648965 462319 634235 711259
14883 711259 569251 92299 735319 439692 585002 594087 550588 488922 720730 141108
$$ packed form
14953A84282K58351A6579J24984K78441A54980M98000l17976K53045k43370r7527
14943B47152M36590n6540B86992A35374J01868L52051j81106A41292K23783j30548
14933B34527K30165j00403K21761j15409L49255R0135j05900j5351K94835N3730
14923A137345J12800m66640K78193J89175n9889J42171O1476L73409r2543l52479
14913A323018m43030J04330j80185k39906A90192K67517K817K16342j29358j90930
14903C56580A01505J98391J68851A1921N84211A77134J18897J51799o9520K1760
14893D00070J27347j52439o4426J43820J31440k28363K91516j86646J71916P7024
14883G11259j42008I2299O43020k95627J45310R085m3499o1666K31808A41108
$$ plain form
14872 569609 356118 327948 444842 522054 581003 546448 388880 743289 610826 550954
14862 550954 611692 809826 564962 431425 403312 253480 232175 429446 470824 351132
14852 351132 67022 237061 430263 269822 650245 271906 457925 516704 716328 737963
14842 737963 744809 914009 508691 908544 634476 1154805 913243 809596 601019 82640
14831 360155 373795 441567 505301 814606 634290 565049 216221 469526 455708 401718 839625
14820 839625 321046 345682 515329 771716 525780 254016 652997 539499 460466 197644
14809 470045 673691 529443 358824 93767 614507 547235 670415 770947 860484 620502
14799 620502 947067 1020379 415738 437241 351482 750619 509058 359088 562275 210043
$$ packed form
14872E69609k13491k8170J16894P7212N8949l4555j57568L54409j32463n9872
14862E50954O0738J98134k44864j33537k8113j49832k1305J97271M1378j19692
14852C51132F7022J70039J93202j60441L80423B71906J86019N8779J99624K1635
14842G37963O846J69200m05318L99853k74068N20329k41562j03647k08577H2640
14831C60155J3640O7772O3734L09305j80316o9241B16221K53305j3818n3990M37907
14820H39625C21046K4636J69647K56387k45936B54016L98981j13498p9033A97644
14809D70045K03646j44248j70619I3767N20740o7272J23180J00532Q9537k39982
14799F20502L26565P3312D15738K1503q5759L99137k41561j49970K03187B10043
$$ plain form
14788 686180 720559 512035 581345 612570 510573 639634 655610 564177 521599 303084 534931
14777 534931 405419 663347 540270 945774 619439 783506 855648 788462 570120 473463
14767 473463 419966 251652 600096 732243 394611 517978 466875 617078 228082 597904
14757 597904 360294 384264 625927 679479 687424 516849 312015 845705 418265 535112
14747 535112 579910 452708 369343 645530 340595 486081 468253 886795 743773 690726
14737 690726 662920 364261 668226 639758 635954 946548 1155968 674996 920048 776832
14727 776832 1183525 1101439 1344844 1256941 1472407 1405122 1402731 888529 1074103 941312
14717 941312 418278 818746 841835 564322 769073 596814 742734 694292 661142 1002026
$$ packed form
14788F86180L4379k08524O9310L1225j01997J29061J5976r1433m2578k18515K31847
14777E34931j29512K57928j23077M05504l26335J64067P2142o7186k18342r6657
14767D73463n3497j68314L48444J32147l37632J23367n1103J50203B28082L69822
14757E97904k37610K3970K41663N3552P945j70575k04834N33690D18265J16847
14747E35112M4798j27202q3365K76187l04935J45486j7828M18542j43022n3047
14737F90726k7806k98659L03965k8468l804L10594K09420m80972K45052j43216
14727G76832M06693q2086K43405q7903K15466o7285k391n14202J85574j32791
14717I41312D18278M00468K3089k77513K04751j72259J45920m8442l3150L40884
$$ plain form
14707 1002026 646228 652034 638682 1065862 992382 920448 973926 1331557 1402680 1487117 1553428
14696 1553428 1284389 1028021 926729 1062494 421868 1103856 867343 882181 964723 683902
14686 683902 704905 857466 805992 769605 749373 785520 915890 1109285 757006 922614
14676 922614 881159 629286 540626 844120 749618 1002134 841435 1055199 1013944 858145
14666 858145 970335 834293 740510 549992 919589 927721 1088705 745605 1059385 1054079
14656 1054079 1280989 841157 827362 857255 1137300 1243732 1195454 1248249 996087 1111308
14646 1111308 1180981 945678 781082 921301 739297 1092441 1244767 1361312 913227 1243475
14636 1243475 647367 966007 1243416 1424324 847705 816773 1069742 931653 1235052 1175250
$$ packed form
14707A002026l55798N806j3352M27180p3480p1934N3478L57631P1123Q4437O6311
14696A553428k69039k56368j01292J35765D21868O81988k36513J4838Q2542k80821
14686F83902K1003J52561n1474l6387k0232L6147J30370J93395l52279J65608
14676I22614m1455k51873q8660L03494r4502K52516j60699K13764m1255j55799
14666H58145J12190j36042r3783j90518L69597Q132J60984l43100L13780n306
14656A054079K26910m39832j3795K9893K80045J06432m8278N2795k52162J15221
14646A111308O9673k35303j64596J40219j82004L53144J52326J16545m48085L30248
14636A243475n96108L18640K77409J80908n76619l0932K52969j38089L03399n9802
$$ plain form
14626 1175250 1046239 934945 1418397 1491139 1450024 617183 1547807 1312934 949813 1340743
14616 1340743 1238665 1375559 851760 1492502 1219126 1200353 1076807 1285132 1489386 1249466
14606 1249466 1439861 1205742 1408415 1465173 1356219 1415647 1448956 1505958 1287009 1589632
14596 1589632 1421174 1458363 1640534 1442369 1590915 1406336 1173621 1734514 1541280 1472036
14586 1472036 1265130 1571898 1645292 1383829 1723699 1700170 1704263 1889487 2056020 1664617
14576 1664617 1817134 1765800 1614265 1814307 2136644 1652529 2036773 1841817 2032775 2062779
14566 2062779 2166425 1974124 2260009 2203397 2303659 2311033 2270829 2135746 2571371 2866779
14556 2866779 2864347 2668201 2699018 3267589 3680957 4441200 5160738 6869779 10465715 17994906
$$ packed form
14626A175250j29011j11294M83452P2742m1115F17183R30624k34873l63121L90930
14616A340743j02078J36894n23799O40742k73376j8773j23546K08325K04254k39920
14606A249466J90395k34119K02673N6758j08954N9428L3309N7002k18949L02623
14596A589632j68458L7189J82171j98165J48546j84579k32715N60893j93234o9244
14586A472036k06906L06768P3394k61463L39870k3529M093J85224J66533l91403
14576A664617J52517n1334j51535K00042L22337m84115L84244j94956J90958L0004
14566B062779J03646j92301K85885n6612J00262P374m0204j35083M35625K95408
14556B866779k432j96146L0817N68571M13368P60243P19538J709041L595936P529191
$$ plain form
14546 17994906 35604536 39994947 17958390 8726757 6491145 3612531 2343726 2081160
14538 2081160 2030859 1867481 1925865 1839337 1775179 1587996 1748175 1726339 1851404 1835779
14528 1835779 1776094 2089597 1908134 2031178 2321590 1994555 2123846 2021141 2208893 2047600
14518 2047600 2221723 1948927 2183684 2010772 2264391 2542140 2320759 2361011 2548325 2377516
14508 2377516 2458123 2453086 2635015 2643199 2591265 2704330 2839852 2679972 2372224 2759608
14498 2759608 2846913 3081636 3053322 2980039 2572533 2754903 2785396 3416019 2865758 3108512
14488 3108512 3240233 3048719 3119893 3206437 3237520 3452958 3196845 3639712 3320869 3363892
14478 3363892 3635147 3538354 3533714 3631585 3566156 3759889 3586735 3774962 3965808 4047480
$$ packed form
14546A7994906J7609630M390411A7958390H726757k235612k878614j268805k62566
14538B081160n0301j63378N8384q6528o4158j87183J60179k1836J25065j5625
14528A835779n9685L13503j81463J23044K90412l27035J29291j02705J87752j61293
14518B047600J74123k72796K34757j72912K53619K77749k21381M0252J87314j70809
14508B377516Q0607n037J81929Q184n1934J13065J35522j59880l07748L87384
14498B759608Q7305K34723k8314p3283m07506J82370L0493O30623n50261K42754
14488C108512J31721j91514P1174Q6544L1083K15438k56113M42867l18843M3023
14478C363892K71255r6793m640R7871o5429J93733j73154J88227J90846Q1672
$$ plain form
14468 4047480 4061337 3945752 4002198 4228211 4000307 4004652 4055467 4432221 4302467 4394980
14458 4394980 4561003 4412441 4168779 4567042 4242654 4476703 4810295 4631372 4737335
14449 4737335 5351436 4655516 5131599 5046842 5285111 4621342 5293549 5063409 5415856 5192131
14439 5192131 5507098 5684439 5893113 5709808 5800427 5856807 5705923 5837278 6027331 5905263
14429 5905263 6446676 6496095 6248011 6570755 6510668 6761655 6688281 6949190 6951954 7604361
14419 7604361 7273457 7627269 7804735 7709738 7698958 7734501 7531110 7870293 7692250 8092512
14409 8092512 8253447 8593369 8623592 8884221 8938505 9187165 9190732 9516854 9636029 9441614
14399 9441614 9541623 9648052 9619915 9978110 10080048 10453695 10646064 10672890 10867916 11051346
$$ packed form
14468D047480J3857j15585N6446K26013k27904M345N0815L76754j29754R2513
14458D394980J66023j48562k43662L98263l24388K34049L33592j78923J05963
14449D737335O14101o95920M76083q4757K38269o63769O72207k30140L52447k23725
14439E192131L14967J77341K08674j83305R0619N6380j50884J31355J90053j22068
14429E905263N41413M9419k48084L22744o0087K50987p3374K60909K764O52407
14419G604361l30904L53812J77466r4997j0780L5543k03391L39183j78043M00262
14409H092512J60935L39922L0223K60629N4284K48660L567L26122J19175j94415
14399I441614J00009J06429k8137L58195J01938L73647J92369K6826J95026J83430
$$ plain form
14389 11051346 11337665 11223382 11528326 11834516 11943318 12076988 12570594 12927682 13248122
14380 13248122 13498587 13605910 13571183 14005786 14367065 14340246 14925394 14775969 15381568 15834523
14370 15834523 16215284 16286900 16480269 17055036 17522769 17499717 18085694 18331143 19310042 19246851
14360 19246851 19885545 20164645 20468906 20816212 21762954 21965654 23140860 23515582 23845765
14351 23845765 24472998 24856314 25930557 26287323 27298131 27328124 28488598 29319471 29482932
14342 29482932 30654706 31634077 32511589 33340011 34519348 35651308 36315990 37584056 38506861
14333 38506861 39657413 40894706 42443617 43805986 45046674 46778334 48330777 49700282
14325 49700282 51137688 53117109 55032262 57078023 58572172 61067450 63540355 65799290
$$ packed form
14389A1051346K86319j14283L04944L06190J08802J33670M93606L57088L20440
14380A3248122K50465J07323l4727M34603L61279k6819N85148j49425O05599M52955
14370A5834523L80761P1616J93369N74767M67733k3052N85977K45449R78899o3191
14360A9246851O38694K79100L04261L47306R46742K02700J175206L74722L30183
14351B3845765O27233L83316J074243L56766J010808K9993J160474Q30873J63461
14342B9482932J171774R79371Q77512Q28422J179337J131960O64682J268066R22805
14333C8506861J150552J237293J548911J362369J240688J731660J552443J369505
14325D9700282J437406J979421J915153K045761J494149K495278K472905K258935
$$ plain form
14317 65799290 68436896 70581227 73339153 76355967 79466648 82668995 86015330 89658694
14309 89658694 93178455 97627481 101916939 106059643 110902445 116070815 121272685 127496871
14301 127496871 133232395 139507206 146311911 153707782 161297643 169496937 178006818 186830967
14293 186830967 196472161 206521208 216915779 228520890 240046538 252664701 265210328
14286 265210328 278791677 292643102 306906995 321425975 335955552 350693711 365225382
14279 365225382 379673886 393480880 406645730 418691980 429007084 437858932 444112945
14272 444112945 446350594 446100102 444941170 443151751 437775526 432606925 424608454 414794461
14264 414794461 403100081 389231786 374244778 358430015 342487337 326698936 310900687
$$ packed form
14317F5799290K637606K144331K757926L016814L110681L202347L346335L643364
14309H9658694L519761M449026M289458M142704M842802N168370N201870O224186
14301A27496871N735524O274811O804705P395871P589861Q199294Q509881Q824149
14293A86830967R641194J0049047J0394571J1605111J1525648J2618163J2545627
14286B65210328J3581349J3851425J4263893J4518980J4529577J4738159J4531671
14279C65225382J4448504J3806994J3164850J2046250J0315104Q851848O254013
14272D44112945K237649k50492j158932j789419n376225n168601p998471r813993
14264D14794461j1694380j3868295j4987008j5814763j5942678j5788401j5798249
$$ plain form
14257 310900687 295196639 280193478 265808962 252052011 239056596 226906471 215264052
14250 215264052 203969860 193448041 183250334 173682145 165177902 157129277 149414607
14243 149414607 142181468 135292700 128610039 122692334 117193382 112286818 107347913 102445460
14235 102445460 97953693 93710180 89809126 85951690 83086920 79361527 76550123 73483891
14227 73483891 70409183 67881996 65211398 63123230 60813498 58351932 56543079 54832479
14219 54832479 52881447 50999259 49236328 47662895 46297883 44601743 44017149 42234605
14211 42234605 40855700 39955043 38553978 37439132 36733306 35876117 34316259 33559555 32462902
14202 32462902 32043880 31432071 30356735 29678004 28345955 27560749 27649698 26506744 26019424
$$ packed form
14257C10900687j5704048j5003161j4384516j3756951j2995415j2150125j1642419
14250B15264052j1294192j0521819j0197707r568189q504243q048625p714670
14243A49414607p233139o888768o682661n917705n498952m906564m938905m902453
14235A02445460m491767m243513l901054l857436k864770l725393k811404l066232
14227G3483891l074708k527187k670598k088168k309732k461566j808853j710600
14219E4832479j951032j882188j762931j573433j365012j696140n84594j782544
14211D2234605j378905r00657j401065j114846p05826q57189j559858p56704j096653
14202C2462902m19022o11809j075336o78731j332049p85206Q8949j142954m87320
$$ plain form
14193 26019424 25463222 24577848 24394034 23487899 22895181 22345387 21911818 21250804 20891178
14184 20891178 20289791 20173101 19930741 19126195 18567909 18496496 17916748 17743002 17618142
14175 17618142 16960036 16389309 16350670 15888341 15473824 15300474 15118355 14746497 14658664 13925273
14165 13925273 13903221 13798158 13660812 13322059 12660577 12952998 12383248 12352291 12020762 12176607
14155 12176607 11919743 11888919 11343351 11225294 10903728 10710995 10681320 10550488 10333447 10058247
14145 10058247 9973036 9817724 9773579 9709908 9184962 9330458 9485697 8932344 8916294 8726344
14135 8726344 8447589 8314141 8261184 8335087 7935450 7986434 7604033 7761509 7806684 7670774
14125 7670774 7488531 7273070 7178516 6792093 6989924 6919080 6727101 6480306 6675219 6663897
$$ packed form
14193B6019424n56202q85374j83814r06135n92718n49794m33569o61014l59626
14184B0891178o01387j16690k42360q04546n58286p1413n79748j73746j24860
14175A7618142o58106n70727l8639m62329m14517j73350j82119l71858q7833p33391
14165A3925273k2052j05063j37346l38753o61482K92421n69750l0957l31529J55845
14155A2176607k56864l0824n45568j18057l21566j92733k9675j30832k17041k75200
14145A0058247q5211j55312m4145o3671n24946J45496J55239n53353j6050j89950
14135H726344k78755j33448n2957P3903l99637N0984l82401J57476M5175j35910
14125G670774j82243k15461r4554l86423J97831p0844j91979k46795J94913j1322
$$ plain form
14115 6663897 6681087 6463166 6145682 6518803 5904503 6038410 6068009 5977317 5919804 5773741
14105 5773741 5903613 5597914 5387592 5659143 5212184 5471579 5413979 5488525 5266105 5400316
14095 5400316 5123388 4786283 5057828 4846219 5013545 4958925 4600016 4891285 4759030 4955166
14085 4955166 4495296 4285303 4644552 4536893 4230208 4024245 4143082 4194157 3911282 4182124
14075 4182124 3974837 4101377 4003717 3789002 3838273 3789824 4226118 3798245 3823339 3879524
14065 3879524 3513457 3824648 3712966 3701258 3554256 3269706 3413521 3486344 3786064 3300120
14055 3300120 3428587 3640580 3463437 3242645 3296844 3308224 2878962 3317712 3218604 3188502
14045 3188502 3011640 2785656 2954859 2909796 2824564 2922804 3190321 2788294 2821038 2682919
$$ packed form
14115F663897J7190k17921l17484L73121o14300J33907K9599r0692n7513j46063
14105E773741J29872l05699k10322K71551m46959K59395n7600P4546k22420J34211
14095E400316k76928l37105K71545k11609J67326n4620l58909K91269j32255J96136
14085D955166m59870k09993L59249j07659l06685k05963J18837N1075k82875K70842
14075D182124k07287J26540r7660k14715M9271m8449M36294m27873K5094N6185
14065C879524l66067L11191j11682j1708j47002k84550J43815P2823K99720m85944
14055C300120J28467K11993j77143k20792N4199J1380m29262M38750r9108l0102
14045C188502j76862k25984J69203m5063q5232R8240K67517m02027L2744j38119
$$ plain form
14035 2682919 2914556 2973153 2719032 2955887 2767688 2795951 2522199 2621564 2766162 2674481
14025 2674481 2398276 2272679 2473139 2307022 2375383 2491385 2182724 2520950 2540215 2348120
14015 2348120 2191520 2271701 2219882 2240208 2394217 2030801 2148246 2289532 2252922 1837115
14005 1837115 1873263 2077910 2099669 2235105 2059924 1990187 1978344 1876860 2052799 1823183
13995 1823183 1863633 2373163 1890918 2058756 2307775 2470112 3652735 5768000 11024138
13986 11024138 27036711 42840877 24910130 12763046 7736699 5262847 4338152 3955763
13978 3955763 3513154 2948019 2863603 2994132 2678463 2504930 2393852 2406739 2066957 2022060
13968 2022060 2122712 2160812 2081146 1995139 1973682 1659534 2173604 1960042 2094125 1963837
$$ packed form
14035B682919K31637N8597k54121K36855j88199K8263k73752R9365J44598r1681
14025B674481k76205j25597K00460j66117O8361J16002l08661L38226J9265j92095
14015B348120j56600Q0181n1819K0326J54009l63416J17445J41286l6610m15807
14005A837115L6148K04647K1759J35436j75181o9737j1843j01484J75939k29616
13995A823183M0450N09530m82245J67838K49019J62337J182623K115265N256138
13986A1024138J6012573J5804166j7930747j2147084n026347k473852r24695l82389
13978C955763m42609n65135q4416J30529l15669j73533j11078J2887l39782m4897
13968B022060J00652L8100p9666q6007k1457l14148N14070k13562J34083j30288
$$ plain form
13958 1963837 1745554 1614993 1682716 1852408 1411893 1678369 1856009 1298426 1635870 1440628
13948 1440628 1749784 1643334 1519471 1519964 1601260 1506023 1582882 1400047 1585893 1480450
13938 1480450 1433710 1685644 1637379 1885220 1664367 1673723 1867659 1906616 1694293 1572174
13928 1572174 1432066 1522557 1320621 1236782 1281644 1398540 1214192 1388996 1343181 1060704
13918 1060704 1200117 1646886 1285885 1145769 1507080 1060606 1126100 1296480 1354984 1142127
13908 1142127 1194777 1487735 1309546 1154454 1391493 1511902 1359004 1187727 1224525 1121637
13898 1121637 1169786 1396409 1313996 1573401 946200 1139023 1027809 1271147 1037142 1212923
13888 1212923 1264559 1122147 1462375 687875 1325545 1010318 951492 765819 1208424 795160
$$ packed form
13958A963837k18283j30561O7723J69692m40515K66476J77640n57583L37444j95242
13948A440628L09156j06450j23863M93Q1296r5237P6859j82835J85846j05443
13938A480450m6740K51934m8265K47841k20853R356J93936L8957k12323j22119
13928A572174j40108R0491k01936q3839M4862J16896j84348J74804m5815k82477
13918A060704J39413M46769l61001j40116L61311m46474O5494J70380N8504k12857
13908A142127N2650K92958j78189j55092K37039J20409j52898j71277L6798j02888
13898A121637M8149K26623q2413K59405o27201J92823j11214K43338k34005J75781
13888A212923N1636j42412L40228F87875O37670l15227n8826j85673M42605m13264
$$ plain form
13878 795160 1124621 1286296 1184979 1241577 889002 1090978 1075603 1096099 786320 838346
13868 838346 892588 872669 921657 1171527 872863 1145768 943494 1058034 1108031 934041
13858 934041 1119126 922390 1131542 916298 844551 911913 900112 1125886 959752 1003353
13848 1003353 767279 1080008 790257 1195832 874092 776397 989149 1330687 958180 940131
13838 940131 1148529 726756 802440 397346 1182645 842850 697626 668269 1142171 685673
13828 685673 875897 817597 573852 708448 718885 713322 853508 481267 762593 659691
13818 659691 577152 981780 905857 842395 643378 774017 741665 786792 597383 744206
13808 744206 492792 617474 629986 800990 805296 512865 766349 709983 710073 751602 554975
$$ packed form
13878G95160L29461J61675j01317N6598l52575K01976j5375K0496l09779N2026
13868H38346N4242j9919M8988K49870k98664K72905k02274J14540M9997j73990
13858I34041J85085j96736K09152k15244p1747O7362j1801K25774j66134M3601
13848A003353k36074L12729k89751M05575l21740r7695K12752L41538l72507j8049
13838I40131K08398m21773P5684C97346P85299l39795j45224k9357M73902m56498
13828F85673J90224n8300k43745J34596J0437n563J40186l72241K81326j02902
13818F59691q2539M04628p5923o3462j99017J30639l2352M5127j89409J46823
13808G44206k51414J24682J2512J71004M306k92431K53484n6366R0M1529j96627
$$ plain form
13797 554975 704683 764523 980042 873132 693772 654887 627568 887666 599585 613994
13787 613994 264047 669757 650541 946131 627273 1034029 806926 478829 907707 654585
13777 654585 584805 763738 608888 703385 265631 503685 463376 443046 468217 390538 398150
13766 398150 431878 597591 588884 500499 379672 400517 241626 578628 211032 511471
13756 511471 563371 472452 694966 697172 767114 654570 645843 726311 338766 845857 498366
13745 498366 522544 467656 549332 559639 902930 378303 655416 274952 657396 184336
13734 559260 446714 532466 689229 576911 598200 693884 421605 602929 595752 514381 493640
13723 493640 498149 364850 655234 315339 299031 518225 433135 733580 550830 304417
$$ packed form
13797E54975J49708N9840K15519j06910j79360l8885k7319K60098k88081J4409
13787F13994B64047M05710j9216K95590l18858M06756k27103l28097M28878k53122
13777F54585o9780J78933j54850R4497B65631K38054m0309k0330K5171p7679P612
13766C98150L3728J65713q707q8385j20827K0845j58891L37002B11032L00439
13756E11471N1900r0919K22514K206O9942j12544q727Q0468C38766N07091l47491
13745D98366K4178n4888Q1676J0307L43291C78303K77113B74952L82444A84336
13734E59260j12546Q5752J56763j12318K1289R5684k72279J81324p177q1371k0741
13723D93640M509j33299K90384C15339j6308K19194q5090L00445j82750k46413
$$ plain form
13713 304417 528184 681473 160600 476064 595678 504188 590455 494596 384189 651333
13703 651333 775580 375105 283779 493091 130840 558682 779408 368265 72926 475644
13693 475644 102674 331292 138834 571660 357044 706154 602972 345922 194735 203811
13683 203811 166947 426654 288084 488839 378844 657134 655023 521861 451913 266071
13673 266071 159554 645283 559891 437858 -97585 401147 490113 120066 447473 500153
13663 500153 298476 586915 286399 4636 330950 307507 469565 288345 157007 484857
13653 484857 481164 449154 563588 316987 445007 146975 440005 176657 599802 354292
13643 354292 191408 386370 338488 212305 368662 360785 543894 385201 109797 324713
$$ packed form
13713C04417K23767J53289A60600L15464J19614r1490Q6267r5859j10407K67144
13703F51333J24247C75105r1326K09312A30840M27842K20726C68265G2926M02718
13693D75644A02674K28618A38834M32826k14616L49110j03182k57050j51187R076
13683B03811l6864K59707j38570K00755j09995K78290k111j33162o9948j85842
13673B66071j06517M85729q5392j22033i7585D01147Q8966A20066L27407N2680
13663E00153k01677K88439B86399D636L26314k3443J62058j81220j31338L27850
13653D84857l693l2010J14434k46601J28020A46975K93030A76657M23145k45510
13643C54292j62884J94962m7882j26183J56357p877J83109j58693A09797K14916
$$ plain form
13633 324713 631907 573391 170560 296036 190660 -88297 403501 456074 162787 268477
13623 268477 261625 120191 536098 270884 98537 379606 174310 326355 184499 490736
13613 490736 354159 413756 402761 277257 20393 184332 327847 318006 256829 210206 534313
13602 534313 331219 451758 444804 380336 200869 318308 407685 230179 383322 574198
13592 574198 308377 -171677 434966 2698 331519 394922 440018 199590 335284 71593
13581 318414 311806 309707 466840 381612 77833 74887 313631 208485 32811 366944 434258
13570 434258 484250 186498 287888 388835 719364 196874 80049 182896 205859 183352
13560 183352 165602 276524 486070 91051 271803 343964 244067 111509 231227 431756
$$ packed form
13633C24713L07194n8516A70560J25476j05376h8297D03501N2573A62787J05690
13623B68477o852A20191M15907k65214I8537K81069A74310J52045j41856L06237
13613D90736j36577N9597j0995j25504B0393J63939J43515r841o1177m6623L24107
13602E34313k03094J20539o954o4468j79467J17439Q9377j77506J53143J90876
13592E74198k65821a71677D34966B698L28821O3403M5096A99590J35694G1593
13581C18414o608k099J57133q5228G7833k946K38744j05146C2811L34133O7314
13570D34258M9992A86498J01390J00947L30529A96874H0049J02847K2963k2507
13560A83352j7750J10922K09546I1051J80752P2161r9897A11509J19718K00529
$$ plain form
13550 431756 266392 199663 362198 458987 102594 92617 368614 171013 384110 17267
13539 352195 378716 249809 481046 259875 297149 295991 345633 283427 343491 83192 265527
13528 265527 252621 468340 243112 -150095 132607 263404 76520 221183 464470 168451
13517 398565 232039 69541 -85097 -284052 264926 529935 92493 275656 72573 103567
13507 103567 195257 349929 41981 291987 451794 190109 443981 361470 261605 62709
13496 170804 336763 193418 167235 326834 -155352 341287 203168 248122 35900 112505
13486 112505 37285 185527 359584 224606 13060 -64216 472343 -27726 80143 -79496 321607
13474 -30805 296110 256139 72495 340010 -350002 5037 -27232 143740 468989 451022 350202
$$ packed form
13550D31756j65364o6729J62535R6789A02594r977K75997A71013K13097A7267
13539C52195K6521j28907K31237k21171L7274j158M9642o2206O0064H3192J82335
13528B65527j2906K15719k25228a50095A32607J30797G6520J44663K43287A68451
13517C98565j66526F9541h5097j98955B64926K65009I2493J83163G2573L0994
13507A03567R1690J54672D1981K50006J59807A90109K53872q2511r9865F2709
13496A70804J65959j43345k6183J59599a55352C41287j38119M4954C5900P6605
13486A12505C7285J48242J74057j34978A3060f4216D72343b7726H0143g9496C21607
13474c0805B96110l9971G2495K67515c50002E037b7232A43740L25249j7967j00820
$$ plain form
13463 350202 200137 137463 331938 618595 143828 386668 -104175 205405 156010 187394
13453 187394 298407 190353 181102 36537 328946 102835 140773 18132 67049 -5636 137345
13441 240286 23530 82139 278944 129978 -309958 299779 395602 -7280 167674 334295
13431 334295 137345 190623 -86700 204792 72597 216142 61230 234466 279120 405646
13421 405646 280191 468370 -14413 96816 -72735 287928 194142 -84596 -3344 206441 3098
13409 55299 123135 221945 -103748 -2178 186969 9121 349284 103101 141281 89170 247556
13398 247556 182174 30632 -16973 169231 266488 166627 194539 369818 164342 32592 206814
13387 206814 435642 986 -83670 303737 457044 317678 222450 311046 20358 131437 409969
$$ packed form
13463C50202j50065o2674J94475K86657A43828K42840a04175B05405m9395L1384
13453A87394J11013j08054r251C6537K92409A02835L7938A8132M8917e636A37345
13441B40286B3530N8609J96805A29978c09958B99779R5823g280A67674J66621
13431C34295A37345N3278h6700B04792G2597J43545F1230J73236M4654J26526
13421D05646j25455J88179a4413I6816g2735B87928r3786h4596c344B06441C098
13409E5299O7836R8810a03748b178A86969I121L40163A03101L8180n2111J58386
13398B47556o5382C0632a6973A69231R7257r9861K7912J75279A64342C2592J74222
13387B06814K28828I86h3670C03737J53307j39366r5228Q8596B0358J11079K78532
$$ plain form
13376 409969 328644 171518 -49577 156474 253466 281309 458689 249483 210998 326189
13366 326189 -366377 135135 82695 434688 19331 61837 117377 -7956 291764 -219167 339859
13354 287935 140889 226585 -172065 227133 246873 100750 199116 144368 209258 78853 325967
13343 325967 411077 392206 182398 380276 82739 315782 339690 259158 199134 207597 -14143
13331 343200 133943 200715 51696 -29309 -40201 180086 315557 159470 -48692 31238 95818
13320 95818 190023 141695 102180 186161 16658 -36876 192701 -44539 309599 -32474 141439
13308 328677 -37180 182140 -60780 342974 -142489 -181755 187387 18715 155372 393966
13298 393966 21773 199896 136450 353646 136805 282225 81568 198033 60422 104147
$$ packed form
13376D09969q1325j57126d9577A56474R6992K7843J77380k09206l8485J15191
13366C26189c66377A35135n2440L51993A9331M2506N5540g956B91764b19167C39859
13354B87935A40889Q5696a72065B27133J9740A00750R8366n4748O4890G8853K47114
13343C25967Q5110j8871A82398J97878H2739K33043K3908q0532o0024Q463a4143
13331C43200A33943O6772E1696b9309j0892A80086J35471j56087d8692C1238O4580
13320I5818R4205m8328l9515Q3981A6658c6876A92701d4539C09599c2474A41439
13308C28677c7180A82140f0780C42974a42489l9266A87387A8715J36657K38594
13298C93966B1773J78123o3446K17196A36805J45420H1568J16465F0422M3725
$$ plain form
13288 104147 256852 53136 145058 134715 279884 10723 -4421 148196 -47663 227075 -409266
13276 239157 59227 -152961 190726 200529 354336 303345 77751 169183 85539 332935 -49107
13264 390321 361176 52662 -196337 182071 -17624 53817 22533 241511 343659 280521 -87463
13252 69411 143659 182076 165817 9741 230902 243471 -169442 212288 191934 63381 341328
13241 341328 218038 112211 123414 118949 167860 285373 145738 -142423 60416 -234464
13230 57499 182391 160768 -84472 129130 78956 -35492 334089 -65584 116582 -161529 -128968
13219 -128968 -183583 110933 325440 11176 59322 -109959 -152194 -58193 -11930 284702 26636
13207 144126 83271 34794 815 266022 147971 52890 -135747 56870 -41209 -96579 131525
$$ packed form
13288A04147J52705E3136R1922j0343J45169A0723d421A48196d7663B27075d09266
13276B39157E9227a52961A90726R803J53807n0991G7751R1432q3644K47396d9107
13264C90321k9145E2662a96337A82071a7624E3817B2533K18978J02148o3138h7463
13252F9411P4248L8417j6259I741K21161J2569a69442B12288k0354F3381K77947
13241C41328j23290j05827J1203m465M8911J17513j39635a42423F0416b34464
13230E7499J24892k1623h4472A29130n0174c5492C34089f5584A16582a61529L2561
13219a28968n4615A10933K14507A1176M8146a09959m2235e8193a1930B84702B6636
13207A44126o0855C4794H15K65207j18051E2890a35747E6870d1209n5370A31525
$$ plain form
13195 488265 434676 139933 -39434 -35231 35645 -201577 75434 91731 -59237 305537 329726
13184 329726 -31786 22338 -168803 7387 -96157 -35076 -72481 173192 110794 32557 22078
13173 22078 468634 183096 97219 95304 325472 -8923 -108438 102942 -51534 77344 -147775
13161 -61952 181689 34903 -105101 231659 489720 192303 77957 55165 144006 244541
13151 244541 164434 228083 62117 158695 -205704 144666 81186 101730 -59579 294040 -200388
13139 -12059 -57976 221147 -425289 254407 231744 -82432 285236 -43505 -179325 -270660 138322
13127 271123 -10514 63656 -254640 -216021 135712 132058 -101155 232610 -23634 87154 35289
13115 -74756 185526 234835 -213536 -141199 -108858 227966 -85886 51802 -192111 -306360 330983
$$ packed form
13195D88265n3589A39933c9434M203C5645b01577G5434J6297e9237C05537K4189
13184C29726c1786B2338a68803G387i6157c5076l7405A73192o2398C2557j0479
13173B2078M46556A83096q5877j915K30168h923r9515A02942e1534G7344a47775
13161f1952A81689C4903a05101B31659K58061A92303G7957k2792Q8841J00535
13151B44541q0107O3649F2117R6578b05704A44666o3480K0544e9579B94040b00388
13139a2059m5917B21147d25289B54407k2663h2432B85236d3505j35820r1335A38322
13127B71123a0514F3656b54640L8619A35712l654a01155B32610b3634H7154C5289
13115g4756A85526M9309b13536P2337L2341B27966h5886E1802a92111j14249C30983
$$ plain form
13103 -13708 -83613 207162 -187752 -128093 277934 118341 5630 -43857 -49390 -121792 -98798
13092 -98798 101664 69490 101108 22771 -51468 -135044 419658 25357 193949 117871 275268
13081 275268 68523 105207 40531 -10421 -195393 226970 -99291 62762 25011 191373 9676
13069 142068 42375 -21167 208222 9321 -66379 132239 281052 324416 14082 -209211 40320
13057 113558 146696 -147569 42360 329471 97587 -189989 23027 86269 79948 240502 203633
13046 203633 218866 134311 135857 75134 53545 36662 184143 118047 410101 -80765 -67290
13035 -67290 326626 48359 356064 177736 54308 427972 16205 46445 -163978 -126906 38466
13023 117975 144009 49770 -284655 105914 205927 131801 322761 -104134 84754 193996
$$ packed form
13103a3708o9905B07162a87752N9659B77934A18341E630d3857n533p2402K2994
13092i8798A01664l2174L1618B2771e1468q3576D19658B5357J68592p6078J57397
13081B75268F8523L6684D0531a0421j84972B26970i9291F2762B5011J66362I676
13069A42068D2375b1167B08222I321f6379A32239J48813M3364A4082b09211D0320
13057A13558L3138a47569D2360K87111I7587a89989B3027O3242o321J60554l6869
13046B03633J5233q4555J546o0723k1589j6883J47481o6096K92054h0765J3475
13035f7290C26626D8359L07705A77736E4308L73664A6205L0240a63978L7072C8466
13023A17975K6034D9770b84655A05914J00013p4126J90960a04134H4754J09242
$$ plain form
13013 193996 129936 -53707 295472 120496 36199 292515 -78613 -311997 -164545 272426
13002 25587 25480 127034 317359 166144 -241637 106894 -17787 -53283 -19336 -317 140894
12990 32272 20261 -30181 40027 17137 -232321 -3530 50999 -148816 77484 101522 -352802
12978 286256 98001 -170931 -145392 51257 67728 -36201 222403 -195276 -105158 -22359 299027
12966 260437 -319150 -187864 198077 8219 21992 37495 -131852 196646 -244288 -24852
12955 188384 -8231 3090 54806 -162054 59618 73400 -139422 246184 -21413 -10511 -75892
12944 -75892 3506 140798 56742 146652 474859 -22473 150938 -133662 -157698 23642 21188
12933 21188 35393 84162 328503 124719 44783 -213336 190018 -29488 239970 142443 211302
$$ packed form
13013A93996o4060e3707B95472A20496C6199K56316g8613k33384J47452B72426
13002B5587j07J01554J90325j51215b41637A06894a7787l5496a9336c17A40894
12990C2272j2011c0181D0027A7137b32321c530E0999a48816G7484K4038c52802
12978B86256I8001a70931K5539E1257J6471c6201B22403a95276R0118b2359B99027
12966B60437c19150J31286A98077H219J3773J5503a31852A96646b44288b4852
12955A88384h231C090N1716a62054E9618J3782a39422B46184b1413a0511o5381
12944g5892C506J37292E6742Q9910L28207b2473A50938a33662k4036B3642k454
12933B1188J4205M8769K44341A24719D4783b13336A90018b9488B39970r7527O8859
$$ plain form
12922 211302 -98249 -164796 119931 170870 -48236 75715 -172369 -83245 -163912 216129 -230310
12910 -41815 -106511 63911 -87375 266683 297432 152754 -65290 -100465 -104048 95020 -7487 170012
12897 337987 3003 83732 167789 118661 259230 -54736 -152378 253617 102122 93759 117495
12886 117495 -31364 -27245 225244 157498 -301644 124177 -87635 -166164 -94122 -221068 22581
12874 104808 -196737 186852 24927 31956 -173740 -270778 187159 63193 188062 534492
12864 534492 -230817 38023 -1888 -59345 -169665 193013 -148816 75515 163268 200801 99989
12852 -7481 -149730 -179665 160857 -66976 -177575 248972 172553 -21148 61623 -279324 1075
12840 55981 -54998 68912 -239060 239837 72138 -33745 207336 -72295 180363 94910 -39853
$$ packed form
12922B11302i8249o6547A19931N0939d8236G5715a72369h3245q0667B16129b30310
12910d1815o4696F3911h7375B66683L0749j44678f5290l5175l583I5020g487A70012
12897C37987C003Q0729Q4057m9128J40569e4736r7642B53617A02122q363K3736
12886A17495c1364M119B25244o7746c01644A24177h7635p8529P2042j26946B2581
12874A04808a96737A86852B4927P029a73740r7038A87159F3193J24869L46430
12864E34492b30817C8023a888n7457j10320A93013a48816G5515Q7753L7533I9989
12852g481j42249k9935A60857f6976j10599B48972p6419b1148F1623b79324A075
12840E5981e4998F8912b39060B39837G2138c3745B07336g2295A80363q5453c9853
$$ plain form
12828 67025 -8427 200381 -230128 -20868 -267841 -149994 92587 -208941 -31013 120380 -266824
12816 84386 -171717 -247440 10303 21805 -110674 169279 -314368 -137114 -13092 219240
12805 -22270 -355318 -22365 228552 -157103 -177329 -63812 175686 137468 20231 66697 201326
12794 201326 -120351 -100033 -107027 -29221 -230950 -133898 -188188 248010 -67714 64238 36370
12783 36370 40074 22891 -196029 75489 -169079 284678 -8904 132477 -122981 -21861 60774
12771 -117432 -68510 44146 -53460 428693 -106428 132627 -441886 -477874 -158974 119543
12760 289261 -60602 43034 164380 -17430 -351336 -84982 -211767 61794 -26000 692 32107
12749 32107 -47147 -42940 135446 -188674 152987 -13170 -179109 -9862 -89964 240593 290469
$$ packed form
12828F7025h427B00381b30128b0868k46973J17847I2587b08941c1013A20380b66824
12816H4386a71717p5723A0303J1502a10674A69279c14368a37114a3092B19240
12805b2270l33048b2365B28552a57103k0226f3812A75686l8218B0231M6466J34629
12794B01326a20351K0318o994b9221k01729R7052n4290B48010f7714F4238k7868
12783C6370L704j7183a96029G5489a69079B84678h904A32477a22981b1861F0774
12771a17432M8922D4146e3460D28693a06428A32627d41886l5988a58974A19543
12760B89261f0602D3034J21346a7430l33906h4982j26785F1794b6000F92L1415
12749C2107d7147M207A35446a88674A52987a3170j65939i862q0102B40593M9876
$$ plain form
12738 290469 -164235 154375 167951 -98635 -1386 92125 259665 177775 58629 194647 144038
12727 144038 -141561 -145858 -325626 72713 303949 -138031 111 -324980 67278 81028 11116
12715 -13050 -127563 38001 50231 37946 -11869 188459 258446 261528 14379 356548 167716
12703 399545 293550 104297 -256631 164301 -353043 216297 5477 -393 85560 69681 132293
12692 132293 -7252 -101831 107612 -278335 -109642 104082 285016 -64453 -13138 -297802
12682 -297802 -30336 136149 -21941 468662 -74876 -153875 177223 -84594 -70701 -60973 -243673
12671 -243673 146257 30653 201724 106495 264713 74342 -3971 183685 87759 -210627 5402
12659 -149394 -42153 -102127 177947 190378 209893 -28341 116376 289349 156700 -34013 261116
$$ packed form
12738B90469a64235A54375J3576i8635a386I2125J67540q1890E8629J36018n0609
12727A44038a41561m297j79768G2713K31236a38031A11c24980F7278J3750A1116
12715a3050j14513C8001J2230j2285a1869A88459O9987L082A4379L42169A67716
12703C99545j05995A04297b56631A64301c53043B16297E477c93H5560j5879O2612
12692A32293g252r4579A07612b78335a09642A04082J80934f4453a3138k84664
12682b97802c0336A36149b1941D68662g4876p8999A77223h4594J3893R728j82700
12671b43673A46257C0653J71071r5229J58218G4342c971A83685H7759b10627E402
12659a49394d2153n9974A77947J2431J9515b8341A16376J72973j32649c4013B61116
$$ plain form
12647 -12814 195810 44534 262766 -120338 -104182 -100490 -117243 69324 -116362 -8640 18276
12635 -22677 -291793 118406 84952 217101 -175879 114230 449972 25900 -93277 298444
12624 -117835 282779 169848 165178 298536 -8931 -60667 1468 45473 826 82961 220705 34384
12611 -103411 79476 76291 232912 -273126 -96115 5424 -171520 63397 42002 -19908 -51569
12600 -51569 176239 -125508 398036 -28717 -171647 -87234 137957 -10334 109665 -169962
12589 -41612 -131208 -6517 -126236 146959 -106642 139927 -100354 -270698 -240846 219031
12578 -1630 -73085 104772 -143873 -304313 103938 179378 263829 -256734 275195 -190549
12567 -42218 -232690 -144018 -170382 -14132 165696 -164745 -104559 109199 -137565 202804
$$ packed form
12647a2814A95810D4534K18232a20338J6156L692j6753F9324a16362h640A8276
12635b2677k69116A18406l3454J32149a75879A14230L35742B5900i3277B98444
12624a17835B82779j12931m670J33358h931n1736A468M4005H26Q2135J37744C4384
12611a03411G9476l185J56621b73126i6115E424a71520F3397k1395a9908l1661
12600e1569A76239a25508C98036b8717j42930Q4413A37957a0334A09665a69962
12589d1612q9596f517j19719A46959a06642A39927a00354j70344K9852B19031
12578a630p1455A04772a43873j60440A03938P5440Q4451b56734B75195a90549
12567d2218j90472Q8672k6364a4132A65696a64745O0186A09199a37565B02804
$$ plain form
12556 77657 -293700 -124964 -48677 -298481 -255944 -169471 -227403 142525 -183321 2120 137071
12545 137071 -493472 387891 -132919 -16697 34459 -7208 215934 142813 -252374 218866
12534 332044 124262 187314 116033 -198679 -194799 471542 126763 -222689 15475 26574 -44289
12522 78619 97485 -73263 -11477 49646 -49172 3937 112810 156209 177717 101775 -322524
12510 241657 225620 -107338 -82338 -325631 224236 16372 131470 -143533 -15017 240897
12499 -37721 -315281 30334 -73969 -201138 36769 211415 60098 172348 -125620 -277657
12489 -277657 145658 -174387 57709 89438 -47520 -38165 269744 -130670 -75966 -215046 -326692
12478 -326692 -248597 -133763 147302 -209702 90054 187904 34807 -288963 -29765 91267 -29914
$$ packed form
12556G7657b93700a24964d8677k49804M2537Q6473n7932A42525a83321B120J34951
12545A37071d93472C87891a32919a6697C4459g208B15934p3121b52374B18866
12534C32044A24262O3052p1281a98679L880D71542A26763b22689A5475J1099d4289
12522G8619J8866g3263a1477D9646d9172C937J08873M3399K1508p5942c22524
12510B41657j6037a07338K5000k43293B24236A6372J15098a43533a5017B40897
12499c7721k77560C0334g3969j27169C6769J74646F0098J12250a25620j52037
12489b77657A45658a74387E7709L1729d7520R355B69744a30670N4704j39080j11646
12478c26692P8095J14834A47302b09702I0054R7850C4807b88963b9765I1267b9914
$$ plain form
12466 252067 -366283 -159249 -5413 11737 61106 -495111 -111123 15727 -140032 -301343
12456 -301343 -145124 404903 -29752 -162722 -104813 33890 311582 -77987 21581 -198911
12445 47018 231432 24525 -27055 -248058 13627 -25451 -169143 125455 -121111 -295693
12435 -295693 116440 198539 -73490 -156282 -27221 -140010 -155280 -28345 64758 48500 12017
12423 -57263 -110947 -7154 -199056 4804 22275 -66433 -119391 -60779 160887 66021 132688 -85448
12410 -132600 -141182 33620 24808 254320 -1792 -125900 -47914 -165914 -349380 146642 -36999
12398 -398876 116990 -290417 -66836 50870 83403 -51773 189777 227129 273260 190529 -118716
12386 159093 349 -96366 -139625 -94871 76236 287939 8424 153181 91 169009 76093 81248
$$ packed form
12466B52067c66283a59249e413A1737M9369d95111a11123A5727a40032j61311
12456c01343a45124D04903b9752j32970N7909C3890K77692g7987B1581a98911
12445D7018J84414B4525b7055k21003A3627b5451j43692A25455a21111j74582
12435b95693A16440Q2099g3490q2792b7221j12789j5270b8345F4758j6258A2017
12423e7263n3684g154j91902D804J7471f6433n2958N8612A60887F6021O6667h5448
12410a32600q582C3620q812K29512a792j24108d7914j18000j83466A46642c6999
12398c98876A16990b90417f6836E0870L2533e1773A89777L7352M6131q2731a18716
12386A59093C49i6366m3259M4754G6236K11703H424J44757I1J68918G6093N155
$$ plain form
12374 81248 112217 345876 -111954 134277 -56433 80156 87566 -26471 101528 100531 -53490
12362 -253994 39015 -14017 -182924 166970 195605 -104018 -107456 80635 114164 20150 -360297
12350 227255 -28836 11205 82096 -65362 -184201 259920 517245 157305 236334 8057 105631
12339 105631 575285 -89452 133203 -14418 215802 130191 -31033 -172145 206153 -106678
12328 -112608 -44332 -77886 134624 177481 -22126 -109777 -120133 108850 98396 -92204 61900
12316 310028 81354 319334 44352 215664 109249 70233 146812 -13172 65386 -188114 -228798
12305 -228798 -7279 -176520 303421 -40782 -216149 -21516 130895 67358 -77805 47923 -73158
12293 135557 161663 -335164 -64544 156391 -236037 49103 278610 249076 501907 354901
$$ packed form
12374H1248L0969K33659a11954A34277e6433H0156P410b6471A01528r97e3490
12362b53994C9015a4017j68907A66970K8635a04018l438H0635L3529B0150c60297
12350B27255b8836A1205P0891f5362j18839B59920K57325A57305P9029H057R7574
12339A05631M69654h9452A33203a4418B15802q5611c1033j41112B06153a06678
12328a12608d4332l3554A34624M2857b2126q7651j0356A08850j0454i2204F1900
12316C10028H1354K37980D4352J71312j06415l9016P6579a3172F5386a88114m0684
12305b28798g279j69241C03421d0782j75367b1516A30895o3537g7805D7923g3158
12293A35557K6106c35164f4544A56391b36037D9103K29507k9534K52831j47006
$$ plain form
12283 354901 66966 -217077 30012 -716 32164 -40348 70610 -293095 200770 277412 6715
12271 -72451 19034 67808 190623 -68063 -62184 78699 412124 321845 155541 217041 189241
12260 189241 619041 307076 158138 -240379 197037 -23893 -28687 36593 -92977 302184
12249 -33046 212718 68012 -95094 270002 219214 -40945 -247593 221750 30767 72378 159253
12238 159253 253471 -39137 155995 419690 -63763 -77605 -51336 58378 101981 -51139 -269020
12227 -269020 -234656 45953 84100 89241 67085 -29858 -23432 257378 -75399 257364 -27648
12215 398717 399582 186710 165018 58149 -92119 -103975 19098 283553 -51816 79615 88695 4169
12202 129638 14424 112130 120290 261545 222356 127937 18611 57848 -170363 163252 128044
$$ packed form
12283C54901F6966b17077C0012g16C2164d0348G0610b93095B00770P6642F715
12271g2451A9034M8774J22815f8063N879G8699L33425r0279A55541O1500k7800
12260A89241M29800C07076j48938b40379A97037b3893m794C6593i2977C02184
12249c3046B12718F8012i5094B70002n0788d0945k06648B21750C0767M1611Q6875
12238A59253R4218c9137A55995K63695f3763j3842K6269E8378M3603e1139k17881
12227b69020L4364D5953L8147N141k2156b9858O426B57378g5399B57364b7648
12215C98717Q65A86710k1692E8149i2119j1856A9098K64455e1816G9615R080D169
12202A29638A4424R7706Q160J41255l9189r4419A8611L9237a70363A63252l5208
$$ plain form
12191 128044 242510 -166022 367825 248911 22829 346895 140431 -109383 149578 -15425
12180 424330 104011 224750 -171295 69554 108494 83476 357380 205302 332878 -60 -1366
12169 -1366 327540 -72294 67 97747 160176 93585 46457 225695 24273 102848 121365 158605
12157 158605 -58366 79939 68057 139131 -246379 50250 226905 -560085 58482 200631 -30992
12145 196811 199708 170879 -154673 71804 13509 8562 162894 -74178 57806 -52232 -82164
12134 -82164 277504 -43368 62740 172911 -150769 -338401 98737 161653 160690 45214 66439
12123 66439 218790 -94980 445398 -33898 129714 -278810 -25833 141792 106099 68910 -253951
12111 126820 142701 87226 484609 213618 -165108 -131763 -88734 -96111 308197 -20045 46393
$$ packed form
12191A28044J14466a66022C67825j18914B2829L24066A40431a09383A49578a5425
12180D24330A04011J20739a71295F9554L8940k5018K73904j52078J27576f0j306
12169a366C27540g2294F7R7680O2429o6591D6457J79238B4273P8575J8517L7240
12157A58605e8366G9939j1882P1074b46379E0250J76655e60085E8482J42149c0992
12145A96811K897k8829a54673G1804A3509m947J54332g4178E7806e2232k9932
12134h2164B77504d3368F2740J10171a50769j87632I8737O2916r63D5214K1225
12123F6439J52351i4980D45398c3898A29714b78810b5833A41792l5693l7189b53951
12111A26820J5881n5475L97383B13618a65108L3345M3029p377C08197b0045D6393
$$ plain form
12099 440660 139370 51199 -25331 185551 91828 -210853 98731 -168538 165771 -90677
12088 30840 283085 9255 -280067 -79215 303416 51703 106303 48289 6531 55590 -239865
12076 249529 -146931 -223251 448453 -115853 286262 31571 27868 262371 -122945 -196352
12066 -196352 352710 -350 133497 -189220 140513 198522 195533 -88603 22642 -210161 -46585
12054 118623 -77796 375294 115982 54452 137991 403555 90522 96984 253741 192563 188596
12043 188596 -16601 -227275 -26941 121749 -55653 101210 277484 5200 -75667 -160686 206165
12031 121204 -21501 -47780 -145952 87966 162544 64060 -175118 47685 -200122 87443 185906
12020 185906 71289 16500 -84961 -50371 165734 45838 183044 7441 -21568 -45960 -122483
$$ packed form
12099D40660A39370E1199b5331A85551I1828b10853I8731a68538A65771i0677
12088C0840K52245I255b80067g9215C03416E1703N4600D8289F531M9059b39865
12076B49529a46931p6320D48453a15853B86262C1571l703K34503a22945p3407
12066a96352C52710c50A33497a89220A40513N8009k989h8603B2642b10161d6585
12054A18623g7796C75294A15982E4452Q3539K65564I0522O462J56757o1178l967
12043A88596a6601k10674b6941A21749e5653A01210J76274E200g5667q5019B06165
12031A21204b1501k6279r8172H7966P4578F4060a75118D7685b00122H7443R8463
12020A85906G1289A6500h4961L4590A65734D5838J37206G441b1568k4392p6523
$$ plain form
12009 -122483 -90678 -205132 68328 13156 -261677 11076 -101583 146057 31454 200374
11999 200374 -380667 -9852 169550 114870 -218782 71357 195639 -191974 -16662 -169968
11989 -169968 72763 165899 -70301 -135100 -16091 -135936 20877 -112429 -125653 63693 -157780
11977 141807 84581 -242593 -199665 58499 -98967 22300 161229 -110608 -157821 -67131 111484
11965 120172 -43658 41301 -45344 256106 -40667 -388042 -104992 -133209 -221225 261117 -157781
11953 237609 15029 -152676 -485002 -224603 126565 -271397 238119 -200333 -328219 -251736
11943 -251736 -250440 -242173 -101036 180509 -158109 -124782 185756 3801 347106 336385 57115
11931 104858 -19788 62335 -94066 -209075 -97951 237203 191875 189643 24581 169273 75230
$$ packed form
12009a22483L1805j14454F8328A3156b61677A1076a01583A46057C1454J68920
11999B00374c80667i852A69550n4680b18782G1357J24282a91974a6662j53306
11989a69968G2763R3136g0301o4799a6091j19845B0877a12429j3224F3693a57780
11977A41807n7226b42593M2928E8499i8967B2300J38929a10608m7213f7131A11484
11965A20172d3658D1301d5344B56106d0667l47375a04992k8217q8016B61117a57781
11953B37609A5029a52676l32326b24603A26565b71397B38119b00333j27886P6483
11943b51736J296Q267a01036A80509a58109L3327A85756C801L43305j0721E7115
11931A04858a9788F2335i4066j15009i7951B37203m5328k232B4581J44692G5230
$$ plain form
11919 30937 78448 67218 221554 -17183 -121071 -253654 206307 91074 140620 -246454 127616
11907 -39704 -298798 -1308 -55360 -203584 -90592 -5065 76546 -217540 -6071 -72147 -198463
11896 -198463 83297 -151116 -95598 -149956 76860 244823 20081 -182827 -143166 -294462 54874
11884 193640 -65814 60470 -370528 -150815 136695 64352 -323110 87894 161412 253118 -347141
11872 -295365 -128225 236035 286824 20545 -338369 37766 -86908 -143315 -95958 -291027 -11514
11860 33929 -444834 221382 -234128 -210285 -185525 22804 -206834 -39974 -37464 262346 -98334
11848 49572 -133058 -86741 -160715 -186815 -85848 -205567 88580 137991 144037 50144 22983
11836 156078 56132 -231898 -341332 -98498 -34040 -13551 -58230 -75239 -28289 -37896 12137
$$ packed form
11919C0937M7511j1230J54336a7183j03888j32583B06307I1074M9546b46454A27616
11907c9704k59094a308n4052j48224i0592e065G6546b17540f071o6076j26316
11896a98463H3297a51116N5518n4358G6860J67963B0081a82827L9661j51296E4874
11884A93640f5814F0470c70528a50815A36695F4352c23110H7894P3518R1706c47141
11872b95365a28225B36035N0789B0545c38369C7766h6908n6407M7357j95069a1514
11860C3929d44834B21382b34128K3843K4760B2804b06834c9974K510B62346i8334
11848D9572a33058M6317p3974k6100h5848j19719H8580M9411O046E0144B2983
11836A56078E6132b31898j09434i8498c4040a3551m4679j7009b8289r607A2137
$$ plain form
11824 39271 17431 352852 -136024 -128548 29717 155319 114367 -72652 268612 21614 67940
11813 67940 -58401 -184315 -123973 -147576 -206171 -99447 30483 148826 14610 285869 -213476
11801 -93850 -62402 41096 55428 -120687 -174050 245333 37896 43199 -61105 26024 220278
11790 220278 -214076 226074 -4093 94437 -110887 -262389 -222918 -131082 -40282 -41440 -80350
11779 -80350 -172395 -153964 -78744 166819 67321 178259 90510 -305735 166321 240936 27296
11767 -120423 128347 6938 -281369 -148405 -72711 103574 154657 91680 -130252 -52640 -155720
11756 -155720 212238 -82677 182132 -103166 -68417 54317 47147 90281 115036 178393 183940
11745 183940 14084 127375 58849 17357 365828 127423 191454 120904 48977 83064 -364479
$$ packed form
11824C9271A7431L35421a36024P476B9717J25602m0952g2652B68612B1614M6326
11813F7940e8401j25914O0342k3603n8595i9447C0483J18343A4610K71259b13476
11801i3850L1448D1096J4332a20687n3363B45333C7896N303f1105B6024J94254
11790B20278b14076B26074d093I4437a10887j51502L9471R1836d0282j158l8910
11779h0350r2045J8431P5220A66819F7321J10938q7749c05735A66321P4615B7296
11767a20423A28347F938b81369J32964g2711A03574N1083o2977a30252e2640j03080
11756a55720B12238h2677A82132a03166L4749E4317p170M3134K4755O3357N547
11745A83940A4084J13291E8849A7357L48471A27423O4031p0550D8977L4087c64479
$$ plain form
11733 -52257 33786 -274259 -8618 -110282 -32272 -77735 -22614 -67781 -61243 31083 -11497 -50833
11721 -50833 -65366 -84501 33255 343519 42047 97273 1087 -272049 177387 -56310 -256673
11710 -256673 150717 247271 -83257 176 -173370 -362783 5986 14463 -170679 -182623 -200900
11699 -200900 -195223 259987 18041 -51183 268811 -163266 44400 -50796 -134298 124033 51472
11687 153258 -9577 -18704 -147054 24919 208274 -147508 -60881 218621 281642 -136588 -19558
11675 -161147 240490 208923 116948 -90225 282803 -184801 -105326 -148899 310889 -79125 26443
11663 23131 57211 397302 105494 242301 -99633 -66465 44074 7827 91470 111784 3431
11651 320852 264624 74340 -101227 -72244 -41047 68191 60535 -341037 -38197 90720 121744
$$ packed form
11733e2257C3786b74259h618j01664c2272m5463b2614m5167O538C1083a1497l9336
11721e0833j4533j9135C3255L10264D2047N5226A087b72049A77387e6310k00363
11710b56673A50717R6554h3257A76a73370j89413E986Q477a70679j1944j8277
11699b00900N677B59987A8041e1183B68811a63266D4400e0796q3502A24033E1472
11687A53258i577r127j28350B4919J83355a47508f0881B18621O3021a36588a9558
11675a61147B40490l1567r1975i0225B82803a84801P9475m3573C10889g9125B6443
11663B3131L4080L40091A05494J36807i9633L3168D4074G827Q3643K0314C431
11651C20852n6228G4340a01227K8983L1197F8191p656c41037c8197I0720L1024
$$ plain form
11640 121744 29603 46758 -205414 129464 -229920 107899 409940 135751 21438 164403
11630 164403 250377 -34483 61771 165162 65751 205092 -60750 55695 -170543 75188 -115021
11618 149383 -68002 -102409 -47447 36729 -136944 -99616 -168164 -575143 -315791 -86537 -140617
11607 -140617 -212304 168007 126509 -76286 5637 -143694 49933 152129 -116080 -93519 248247
11595 244651 -17832 10160 39750 -133119 -137653 -234982 84416 -51470 -47793 -146429 57825 -89303
11582 -262939 180106 143865 118047 -132929 -43815 -384186 187294 -116747 264457 -161589
11571 -414255 74662 -38272 -144968 -11397 367229 -368 156809 -4708 340436 164454 80615
11559 300895 -252158 -5496 401305 -349757 58926 222221 -228622 -85444 81396 51589 18473
$$ packed form
11640A21744B9603J7155b05414A29464b29920A07899L02041A35751B1438J42965
11630A64403Q5974c4483F1771J03391F5751J39341f0750E5695a70543G5188a15021
11618A49383f8002l4407d7447C6729a36944L7328o8548m06979K59352h6537n4080
11607a40617p1687A68007m1498g6286E637a43694D9933J02196a16080K2561B48247
11595B44651a7832A0160K9590a33119m534r7329H4416e1470L677r8636E7825h9303
11582b62939A80106l6241k5818a32929d3815l40371A87294a16747B64457a61589
11571d14255G4662c8272j06696a1397C67229c68A56809d708C40436A64454H0615
11559C00895b52158e496D01305c49757E8926J63295b28622h5444H1396k9807A8473
$$ plain form
11547 372541 -128118 86041 438577 73671 220491 81499 126111 -27 63990 10283 -83153
11535 -29702 -27446 74037 81463 -63427 -52347 -30205 -5094 -81926 -176324 -98391 90200 42879
11522 483546 143638 16191 -169431 46204 -8867 -28559 -85873 -2187 -217754 53597 193445
11511 193445 -2521 -180002 -321905 -74659 191045 -297451 47716 43270 210430 -57640 132792
11499 203056 169554 -304693 -198376 67659 232116 236132 46883 66292 387283 260075 27909
11487 95984 -2634 386741 -9875 -15054 32174 -86648 307257 116636 82056 122092 -3047 68423
11474 211179 -179185 88135 244993 -193052 292864 40975 -96376 -54386 63712 154966 232607
11463 232607 256649 66040 195906 249074 10003 -85448 91622 169019 -45574 279874 67822
$$ packed form
11547C72541a28118H6041L52536G3671J46820H1499M4612b7F3990A0283h3153
11535b9702K256G4037P426f3427J1080K2142e094p6832r4398P7933I0200D2879
11522D83546A43638A6191a69431D6204h867j9692n7314b187k15567E3597J39848
11511A93445b521j77481j41903g4659A91045b97451D7716m446J67160e7640A32792
11499B03056l3502c04693J06317F7659J64457M016D6883J9409L20991j27208B7909
11487I5984b634C86741i875n179C2174h6648C07257A16636l4580M0036c047F8423
11474B11179a79185H8135J56858a93052B92864D0975i6376M1990F3712R1254P7641
11463B32607K4042F6040J29866N3168A0003h5448I1622P7397d5574B79874F7822
$$ plain form
11451 223155 -165824 -45549 -228971 145047 -180383 123627 110772 224700 -82720 207277
11440 -427550 128914 185490 227360 -18509 193125 -31613 -19362 -160654 101320 -91530 -71001
11429 -71001 102634 -145415 -345855 13719 -202710 -270352 74559 -361812 86345 -76067 -38735
11418 -38735 146379 -39703 145532 -166010 -124456 135539 -140084 187987 -53636 52850
11407 -142319 -244644 -142047 -215489 -513513 173240 114128 213318 396779 -73106 144521
11396 163378 -32484 83147 231126 176226 61491 349453 102922 65813 -153779 143923
11385 -584377 44259 267848 76711 157126 132147 67797 163588 16533 -144356 -12748 200344
11373 -200909 210565 -39856 -171347 -99271 -36207 -72998 -114453 29125 292751 -22050 -366190
$$ packed form
11451B23155a65824d5549j83422A45047a80383A23627j2855J13928h2720B07277
11440d27550A28914N6576M1870a8509A93125c1613J2251j41292A01320i1530K0529
11429g1001A02634a45415k00440A3719b02710o7642G4559c61812H6345g6067L7332
11418c8735A46379c9703A45532a66010M1554A35539a40084A87987e3636E2850
11407a42319j02325J02597p3442k98024A73240n9112R9190J83461g3106A44521
11396A63378c2484H3147J47979n4900F1491K87962A02922l7109a53779A43923
11385e84377D4259K23589G6711Q0415k4979o4350R5791A6533a44356a2748B00344
11373b00909B10565c9856j31491P2076c6207l6791m1455B9125K63626b2050l44140
$$ plain form
11362 -366190 -206852 -50418 -220710 -5102 -17540 -159903 85338 -127624 -83277 -65864 115620
11350 58872 -81233 168446 50304 176006 36359 -172100 83362 -30482 43786 207699 -26139
11338 -199558 -31715 55853 -36551 -182207 79413 -41908 -95103 -239502 59964 -64433 -293473
11327 -293473 -312478 -191422 -1471 228633 -209829 3176 -106384 6032 156157 84352 83043
11316 83043 -95501 -83003 -222776 -95302 -93793 315645 97635 230592 162349 54133 -258347
11304 -227139 -103163 277891 152794 148088 89107 -29492 212101 149374 -256264 -196594 95202
11292 -95122 -135682 -85690 -167300 -115170 -110163 -153469 13232 208700 -501759 118017 -91185
11280 -237807 12446 120276 170991 -423645 -95223 -333853 138195 -77793 49957 -98720 -97630
$$ packed form
11362c66190J59338e0418j70292e102j2438j42363H5338a27624M4347J7413A15620
11350E8872h1233A68446E0304J25702C6359a72100H3362c0482D3786J63913b6139
11338a99558c1715E5853c6551j45656G9413d1908n3195j44399E9964f4433k29040
11327b93473j9005J21056a471B28633b09829C176a06384F032J50125p1805j309
11316H3043i5501J2498j39773i5302J509C15645I7635J32957o8243E4133b58347
11304b27139a03163B77891j25097m706n8981b9492B12101o2727b56264N9670I5202
11292i5122m0560M9992q1610N2130N007m3306A3232J95468e01759A18017i1185
11280b37807A2446J07830N0715d23645i5223k38630A38195g7793D9957i8720J090
$$ plain form
11269 -97630 -119507 -160855 306690 161795 209968 -51874 -35317 55967 61610 251885 -49445
11257 -277707 -100955 166161 10956 -176034 -70045 50201 16383 -184029 -250401 -126186
11247 -126186 -239868 -71940 -409711 13631 -283991 89878 -38006 118358 82260 -435516
11236 -117027 76142 -26327 49549 -144794 -381858 -413879 -37301 -152615 30937 197619 -245007
11224 49305 232744 -64811 -38138 -89210 -461184 31521 -294821 -12918 -81447 -93703 -364317
11213 -364317 161881 -170926 -129307 -151125 -336906 -79550 -39843 -99998 206048 -74583 -204045
11202 -204045 -288001 -126670 -164061 -212150 -219257 -101221 273376 -72600 164948 -74450 -87905
11191 -87905 -20211 228506 70989 -123543 182704 -96587 -49800 56107 -113264 151821 -210693
$$ packed form
11269i7630k1877m1348C06690j44895M8173e1874J6557E5967N643J90275d9445
11257b77707a00955A66161A0956a76034g0045E0201A6383a84029o6372J24215
11247a26186j13682g1940l37771A3631b83991H9878c8006A18358l6098d35516
11236a17027G6142b6327D9549a44794k37064l2021c7301j15314C0937J66682b45007
11224D9305J83439f4811K6673n1072l71974C1521b94821a2918o8529j2256k70614
11213c64317A61881a70926M1619k1818j85781g9550L9707o0155B06048g4583j29462
11202b04045q3956a26670l7391m8089p107a01221B73376g2600A64948g4450j3455
11191h7905b0211B28506G0989a23543A82704i6587M6787E6107a13264A51821b10693
$$ plain form
11179 26251 -66512 -193978 -131597 -4724 -144868 224741 -171259 81454 9286 86072 100998
11168 100998 48632 -14642 316142 -192148 103154 -15489 417375 -162622 14984 91812
11158 91812 -9717 157808 49173 -500901 -71690 -87529 10672 243618 -257073 -136140 -241705
11147 -241705 -108562 -56567 32225 18092 -120276 116805 -121248 41300 -316285 23722
11136 136198 -270127 -86024 -67046 -59935 -117330 -31479 104797 265944 243948 -214783 -126413
11125 -126413 4914 216199 -55876 -140036 -2494 114185 -25528 -33912 225232 -253134 90926
11113 276717 -247425 -191563 -114984 48662 -3872 148824 79123 212665 -112105 251297 233494
11102 233494 96690 -11070 36367 290594 -238997 299934 -21264 242399 -202892 33338
$$ packed form
11179B6251f6512j27466O2381d724j40144B24741a71259H1454I286P6786J4926
11168A00998D8632a4642C16142a92148A03154a5489D17375a62622A4984P6828
11158I1812i717A57808D9173e00901g1690j5839A0672K32946b57073J20933j05565
11147b41705a08562N1995C2225j4133a20276A16805a21248D1300c16285B3722
11136A36198b70127h6024J8978P111n7395c1479A04797J61147k1996b14783Q8370
11125a26413D914K11285e5876q4160b494A14185b5528q384B25232b53134I0926
11113B76717b47425N5862P6579D8662c872A48824o9701J33542a12105B51297j7803
11102B33494I6690a1070C6367K54227b38997B99934b1264B42399b02892C3338
$$ plain form
11091 29285 19090 238939 30508 -24653 21425 -167399 70049 129843 299034 -40212 123891
11079 -187485 64197 -97239 -114928 -237936 175194 -32496 -77913 83418 361595 -71057 32139
11067 126990 184891 546809 311272 220192 180797 236220 294754 245429 472528 413991 197656
11055 209636 199592 724721 162166 589954 604664 144840 563074 524430 316918 448006
11045 448006 516201 301534 592322 300146 468673 621297 366661 388590 487796 277608
11035 277608 565901 572067 314801 548844 516484 465732 489810 225063 775457 291061
11024 402400 537835 278118 529788 527085 403714 480898 262769 687252 499421 433076
11014 433076 324944 368043 396399 178885 572737 643844 406741 271668 557096 312148
$$ packed form
11091B9285j0195K19849C0508b4653B1425a67399G0049N9794J69191d0212A23891
11079a87485F4197i7239j7689j23008A75194c2496m5417H3418K78177g1057C2139
11067A26990N7901L61918k35537r1080l9395N5423N8534m9325K27099n8537A97656
11055B09636j0044N25129A62166M27788J4710A44840M18234l8644k07512J31088
11045D48006O8195k14667K90788k92176J68527J52624k54636K1929R9206k10188
11035B77608K88293O166k57266K34043l2360n0752K4078B25063N50394B91061
11024D02400J35435k59717K51670k703j23371P7184k18129M24483j87831o6345
11014D33076j08132M3099K8356A78885L93852P1107k37103j35073K85428k44948
$$ plain form
11004 312148 421260 68738 296389 615059 629029 462251 520874 347881 231812 535440
10994 535440 182895 455123 429072 317431 188644 608841 621838 337655 577214 725075
10984 725075 576679 597042 683811 837671 809667 493375 832664 850727 738599 843587
10974 843587 1057379 1198864 1639299 1286431 1392332 1530740 1960246 1772248 1915868 2189779
10964 2189779 1723178 1702469 1706072 1382006 1118611 1372848 1559022 1293527 1477838 1147131
10954 1147131 1177328 1263298 1172793 1620240 1145967 1045902 1142265 374424 449383 238906
10944 238906 343025 393542 64814 159032 324244 52919 185604 -138963 -119665 229771
10933 -106939 -37201 138546 236046 300563 -268443 131807 -121656 -6132 100257 9667 48032
$$ packed form
11004C12148J09112F8738K27651L18670J3970j66778N8623j72993j16069L03628
10994E35440A82895K72228k6051j11641j28787M20197J2997k84183K39559J47861
10984G25075j48396K0363Q6769J53860k8004l16292L39289J8063j12128J04988
10974H43587K13792J41485M40435l52868J05901J38408M29506j87998J43620K73911
10964B189779m66601k0709L603l24066k63395K54237J86174k65495J84311l30707
10954A147131L0197Q5970r0505M47447m74273j00065R6363C74424P4959k10477
10944B38906J04119N0517F4814R4218J65212E2919J32685a38963J9298B29771
10933a06939c7201A38546R7500O4517b68443A31807a21656f132A00257I667L8365
$$ plain form
10922 48032 -160079 -125789 155463 -122264 55526 75740 -126305 50105 -152899 -163989 12115
10910 17188 191699 166573 -195909 -49631 146768 -107417 14210 -100504 -304139 92172
10899 128461 35140 243800 -114859 -127544 18177 -69276 307413 -3125 -227760 -334360 -101896
10887 129607 107069 25814 -9478 96591 -121390 140604 -142430 211625 -396217 -109991
10876 186857 -62024 -449125 -171240 13361 -60575 -239713 71641 202940 -140869 -92737
10866 -92737 122141 141738 94252 122564 28219 162172 95058 101221 150660 -68274 -223160
10855 -223160 176438 -26758 26998 67483 -172665 40338 -193555 -166498 341257 -36053 -127766
10844 -127766 113138 -138934 -245125 -56343 -236169 408863 74202 26977 35807 -42491 -145493
$$ packed form
10922D8032a60079L4290A55463a22264E5526K0214a26305E0105a52899j1090A2115
10910A7188J74511k5126a95909d9631A46768a07417A4210a00504k03635I2172
10899A28461C5140K08660a14859j2685A8177f9276C07413c125k24635j06600a01896
10887A29607k2538B5814i478I6591a21390A40604a42430B11625c96217a09991
10876A86857f2024l87101a71240A3361f0575j79138G1641J31299a40869M8132
10866i2737A22141J9597m7486K8312B8219J33953o7114O163M9439f8274j54886
10855b23160A76438b6758B6998M0485a72665D0338a93555K7057C41257c6053r1713
10844a27766A13138a38934j06191e6343j79826D08863G4202B6977Q830d2491j03002
$$ plain form
10833 -145493 -58312 26052 -140093 -9563 31611 58998 50396 21638 70306 -288994 117617
10821 -172131 -17608 102229 -529101 68142 35488 -275872 -99933 -520304 31516 -246729
10810 -97034 -98495 -14302 -147015 -256809 43325 351078 -239409 2066 -85304 -71757 -80605
10799 -80605 -162482 94258 171153 -246061 41255 262129 235992 -203171 -166190 47544 -36565
10787 -104470 238639 55555 28523 52724 -6764 227273 -93447 -192906 -136883 6180 -226810
10775 -136944 -25350 -26472 -22828 173311 -57303 22386 -179214 23635 -371250 -462591 68272
10763 -142110 -14612 69693 -414398 -13354 -230944 -336820 -53591 272527 314904 -62256 58680
10751 -72697 312832 141325 158499 -132088 275365 -191827 89610 262292 -275896 121287
$$ packed form
10833a45493e8312B6052a40093i563C1611K7387q602B1638M8668b88994A17617
10821a72131a7608A02229e29101F8142l2654b75872i9933m20371C1516b46729
10810i7034j461a4302j32713j09794D3325L07753b39409B066h5304J3547q848
10799h0605q1877I4258P6895b46061D1255K20874k6137b03171L6981D7544c6565
10787a04470B38639E5555k7032K4201f764B27273i3447r9459N6023F180b26810
10775a36944b5350j122L644A73311e7303B2386a79214B3635c71250r1341F8272
10763a42110a4612F9693d14398a3354k17590j05876e3591B72527M2377f2256E8680
10751g2697C12832A41325J7174a32088B75365a91827H9610J72682b75896A21287
$$ plain form
10740 163820 -138089 -4292 234235 389868 -47043 -17407 25191 -176107 100966 -147082
10729 -154823 59997 -146147 -24312 -94997 -325283 31576 -141770 220756 -261563 -83126
10718 146810 -201404 -21564 -257783 -108214 -16175 -61820 -162292 -187532 -81733 18348 185283
10707 185283 -189529 -231919 -79600 -274929 -42549 -186877 -233293 146438 -346530 -82710
10696 -324053 -312056 -228369 -67929 -115229 -99952 196375 -15215 -35188 66977 34278 -331501
10684 -181309 131634 -283495 -173941 182560 134275 -54537 120556 144669 -68548 219383
10673 -51379 158259 433478 -177308 -145357 -210616 -132028 109927 10651 -267314 150243
10662 190883 -283561 -50014 -179033 47107 174175 -137105 -155605 43795 -363166 7678 -229158
$$ packed form
10740A63820a38089d292B34235J55633d7043a7407B5191a76107A00966a47082
10729a54823E9997a46147b4312p0685k30286C1576a41770B20756b61563h3126
10718A46810b01404b1564k36219a08214a6175m5645j00472k5240h1733A8348J66935
10707A85283a89529m2390g9600j95329d2549j44328m6416A46438c46530h2710
10696c24053J1997Q3687f7929m7300J5277A96375a5215j9973F6977l2699c31501
10684a81309A31634b83495J09554A82560m8285e4537A20556K4113f8548B19383
10673e1379A58259K75219a77308L1951o5259P8588A09927A0651b67314A50243
10662A90883b83561e0014j29019D7107J27068a37105j8500D3795c63166G678b29158
$$ plain form
10650 32362 90197 -200114 -329768 -10672 -99432 172342 -34429 -31361 -63546 286737 74193
10638 -81217 -206896 60970 133390 194073 241666 -276794 -63334 -62388 31923 -34027 -173508
10627 -173508 35187 263440 -277822 90627 31071 -476079 -326115 20442 -84376 69672 -186333
10615 -176317 -29974 50385 -157519 -184079 32800 -66398 -368765 43184 -94220 -249863 -392668
10604 -392668 103195 -320240 -205365 -69070 156784 89601 -181203 42444 -62037 -252498
10594 -252498 -231660 -81812 117693 81261 -43788 -22523 -31012 -131279 205310 360449 12340
10582 -206408 -158398 -91650 59157 106632 -227722 95932 -60776 -165125 -141903 -22817 102438
10570 160208 -135200 -157160 -94212 -95843 107395 -176891 87534 -122250 -295407 115348
$$ packed form
10650C2362N7835b00114j29654a0672q8760A72342c4429L068l2185B86737G4193
10638h1217j25679F0970P2420O0683M7593b76794f3334R46C1923c4027j39481
10627a73508C5187K28253b77822I0627C1071d76079J49964B0442h4376F9672a86333
10615a76317b9974E0385a57519k6560C2800f6398l02367D3184i4220j55643j42805
10604c92668A03195c20240J14875f9070A56784o7183a81203D2444f2037j90461
10594b52498K0838h1812A17693l6432d3788K1265q489j00267B05310J55139A2340
10582b06408M8010O6748E9157M7475b27722I5932f0776j04349K3222b2817A02438
10570A60208a35200k1960O2948j631A07395a76891H7534a22250j73157A15348
$$ plain form
10559 225447 -259388 109586 -137153 171788 12230 203102 46033 89233 -274364 -31992
10548 -39288 -343252 81442 -166148 8607 56118 -86563 68910 -198200 -325003 -277287 -238929
10537 -238929 215511 128131 169988 330807 -138701 85008 -300808 330176 -49148 54531
10526 -171490 95584 -116183 309524 -39033 134781 -236340 -11620 41024 85624 30299 51178
10515 51178 35099 -315669 217548 -281431 286367 -129960 213583 -62119 -391662 -3546
10504 108230 197877 -111381 32030 -203169 -161545 -200842 162005 -111534 -190531 -111945 -244609
10493 -244609 -309926 -255884 -145999 61192 -184880 -217160 -369039 27959 -120425 255777
10482 93913 222288 -83065 -45199 109260 167670 228956 -18167 276076 3426 293830 161018
$$ packed form
10559B25447b59388A09586a37153A71788A2230J90872D6033M3200b74364c1992
10548c9288l03964H1442a66148H607M7511h6563F8910a98200j26803M7716L8358
10537b38929B15511q7380M1857J60819a38701H5008c00808C30176d9148E4531
10526a71490I5584a16183C09524c9033A34781b36340a1620D1024M4600C0299K0879
10515E1178j6079c15669B17548b81431B86367a29960B13583f2119l29543c546
10504A08230Q9647a11381C2030b03169M1624l9297A62005a11534p8997P8586j32664
10493b44609o5317N4042J09885F1192a84880l2280j51879B7959a20425B55777
10482I3913J28375h3065L7866A09260N8410O1286a8167B76076C426K90404j32812
$$ plain form
10471 161018 -209078 198066 -206362 58766 105107 95210 -78717 79026 -165903 58015 75596
10460 75596 -177686 36312 -130693 -189586 -150659 -140409 -48593 -128273 26150 -128505 -189454
10449 -189454 -254037 -28058 -380461 -161433 -44132 -282772 -390931 41611 -270669 -80993
10438 -141004 -399013 176108 -194760 -17290 -327869 163493 -199247 320157 -144450 -29843
10427 -12488 91104 34884 5601 -229261 288036 -283304 -332371 -247782 12092 -151621 90022
10415 150023 170262 -106431 199505 61873 -190385 -60539 254713 398956 210035 30280
10404 191549 52139 316315 19808 113894 239047 154219 -64856 -58900 131896 -147143 -134451
10393 -134451 -518056 67637 386 -69703 35389 198331 73836 -177844 -27259 -122024 -80956
$$ packed form
10471A61018b09078A98066b06362E8766M6341r897g8717G9026a65903E8015J7581
10460G5596a77686C6312a30693n8893L8927J0250d8593p9680B6150a28505o0949
10449a89454o4583b8058l52403a61433d4132k38640j08159D1611b70669h0993
10438a41004k58009A76108a94760a7290l10579A63493a99247C20157a44450b9843
10427a2488I1104C4884E601b29261B88036b83304m9067Q4589A2092a51621I0022
10415A50023K0239a06431A99505F1873a90385f0539B54713J44243j88921C0280
10404A91549E2139K64176A9808R4086J25153q4828f4856N956A31896a47143J2692
10393a34451l83605F7637C86f9703C5389J62942G3836a77844b7259r4765M1068
$$ plain form
10382 -80956 -224279 -42734 211006 321367 -87131 142410 214011 -153136 196882 94033
10371 -177306 37929 -56680 296982 -25892 229751 358246 295909 450442 500265 343405
10361 343405 186467 137368 76160 44127 227564 9676 -56470 124165 153796 243405 -96261
10349 202512 234981 188915 751078 407302 -1953 -66873 399673 -257011 106701 278035
10339 278035 26715 -48758 -250226 20515 189725 353590 98685 -62272 -48942 429 278054
10328 278054 99333 31061 209959 97748 -341489 119326 123793 89437 271825 -44859 129163
10316 -2366 248181 -36704 2215 122455 7668 50631 220329 150957 -140013 92120 -218825
10304 -138975 24406 -34217 -129856 60488 -214250 36184 -214104 -130548 6369 -171787 170280
$$ packed form
10382h0956j43323d2734B11006J10361h7131A42410P1601a53136A96882I4033
10371a77306C7929e6680B96982b5892B29751J28495o2337J54533M9823j56860
10361C43405j56938m9099o1208l2033J83437I676e6470A24165K9631Q9609i6261
10349B02512L2469m6066N62163l43776a953o4920C99673b57011A06701J71334
10339B78035B6715d8758k01468B0515J69210J63865I8685f2272J3330D29K77625
10328B78054I9333C1061J78898I7748c41489A19326M467l4356J82388d4859A29163
10316b366B48181c6704B215J20240G668M2963J69698o9372a40013I2120b18825
10304a38975B4406c4217r5639F0488b14250C6184b14104Q3556F369a71787A70280
$$ plain form
10292 -27322 182680 9222 -118685 -22998 306576 -126817 31030 27337 -230403 167767 175369
10281 175369 -250542 -256522 -112157 139360 -255747 -74555 -73685 -71245 -43204 -108434 317973
10269 -206043 -428577 98843 -240628 145736 -138109 141883 86406 -17562 -29238 246765
10258 128167 199376 257278 469507 109743 128424 493006 128667 104204 -151238 -31206
10247 -68789 66573 -133340 176400 -41253 -95 147674 -241250 -29584 -235325 320382 -58437
10235 -78914 265453 77785 -3722 -111595 -372 349039 57484 358302 -32571 -415432 -60716
10223 -257461 -121630 175033 -129274 -295875 -73105 354968 364599 93984 93605 -88754 -67483
10212 -67483 167592 -392699 -288264 98390 -38920 -214444 -66285 -80547 -255968 5074 122821
$$ packed form
10292b7322A82680I222a18685b2998C06576a26817C1030l693b30403A67767P602
10281A75369b50542n980a12157A39360b55747g4555Q70K440K8041o5230C17973
10269b06043k22534I8843b40628A45736a38109A41883n5477a7562j1676B46765
10258A28167P1209N7902K12229A09743J8681L64582A28667k4463a51238c1206
10247f8789F6573a33340A76400d1253i5A47674b41250b9584k05741C20382e8437
10235g8914B65453G7785c722j07873c72C49039E7484L00818c2571l82861f0716
10223b57461a21630A75033a29274j66601g3105C54968R631I3984l79h8754K1271
10212f7483A67592c92699J04435I8390c8920j75524f6285j4262j75421E074J17747
$$ plain form
10201 122821 -116896 -31303 -83610 -371092 44305 -96312 30990 -86014 -139866 -196617 -296453
10190 -296453 -130035 -251155 97143 -85283 -253452 -205931 79274 -89876 -156115 -7935 -13402
10179 -13402 -130391 295517 79904 105256 -136483 -193903 -67231 -123580 14046 -171784 -289547
10168 -289547 91538 -202538 -487179 -49471 -59925 -219726 13372 -280517 -407770 -282874
10158 -282874 -148122 146127 -97196 77185 -167593 166569 -36131 -198635 -226143 -2696 -112502
10147 -112502 -282136 107010 -364674 59598 -42675 -138066 -412460 -93842 191672 27545
10136 152047 -201342 -334574 -95427 -312029 142533 -465947 -73041 -151843 -87771 -70431
10126 -70431 91219 15710 16427 -7052 156329 -86561 -72270 -29748 86688 87290 -1057 63268 -60575
$$ packed form
10201A22821a16896c1303n2307k87482D4305i6312C0990h6014n3852n6751r9836
10190b96453a30035j21120I7143h5283j68169M7521G9274h9876o6239g935n467
10179a3402j16989B95517G9904K5352a36483n7420f7231n6349A4046a71784j17763
10168b89547I1538b02538k84641d9471j0454j59801A3372b80517j27253J24896
10158b82874J34752A46127i7196G7185a67593A66569c6131j62504k7508b696j09806
10147a12502j69634A07010c64674E9598d2675r5391k74394i3842A91672B7545
10136A52047b01342j33232i5427k16602A42533d65947g3041p8802O4072J7340
10126g0431I1219A5710P17g052A56329h6561J4291b9748H6688O02a057F3268f0575
$$ plain form
10112 227453 238610 149763 430476 -11152 -144265 -91069 -46532 -337869 252243 75997 -47862
10100 -174976 -92181 151752 57777 5620 159275 224742 47815 -66814 -92222 -302428 -113581
10088 138732 -226981 -80203 131210 56925 -34053 -12822 63230 -95070 -140042 -79701 104162
10076 -50509 -36154 10461 -132484 -276141 12552 -301121 -154991 48712 249675 39671 94115
10065 94115 47537 -283270 25220 466 80590 -55356 170503 -380639 -133890 66937 -57465
10053 -25069 156162 2444 -80094 2152 23072 30512 106553 168083 134321 -319772 210224 39671
10040 -86714 53482 -125482 148171 -78900 -24195 -34662 -184408 -141597 434723 -69968 -222444
10029 -222444 -76108 -31162 -274566 -40874 220832 -219618 20388 71029 -224067 1318 -177631
$$ packed form
10112B27453J1157q8847K80713a1152j33113N3196M4537k91337B52243G5997d7862
10100a74976Q2795A51752E7777E620J53655O5467D7815f6814k5408k10206a13581
10088A38732b26981h0203A31210E6925c4053a2822F3230i5070m4972O0341A04162
10076e0509J4355A0461a32484j43657A2552c01121J46130D8712K00963C9671N4444
10065I4115m6578b83270B5220D66Q0124e5356A70503c80639a33890F6937e7465
10053b5069A56162B444h0094B152K0920P440P6041O1530l3762c19772B10224C9671
10040h6714E3482a25482A48171g8900b4195j0467j49746M2811D34723f9968j52476
10029b22444g6108c1162k43404d0874B20832b19618B0388N0641b24067A318a77631
$$ plain form
10017 -236719 302494 -126347 124699 839 -77074 -44685 -227328 -371283 -33311 -78410 -86688
10006 -86688 -541034 -305670 -183501 -114974 -22336 -537244 -200820 -98067 117856 6876 -94278
9994 89146 895 -254590 376267 -233273 155694 -149112 85266 168840 -456874 -167180 57465
9982 -286134 -203635 -61538 177266 6822 -283661 10442 318116 -104909 -99805 -11988 -84197
9971 -84197 70909 -32576 -87572 -135033 -57971 212122 -250608 -214240 -6655 -1873 138479 -145880
9958 -50254 147274 72940 -78995 -161079 -154303 -291498 -38716 -92570 -55039 402200 90665
9946 30115 102645 -271901 -438483 -25476 302529 110631 -296917 -58251 -36258 94509 70815
9935 70815 48724 -23023 -193922 105416 47913 -103549 -264547 52672 -214957 -61660 -34398
$$ packed form
10017b36719C02494a26347A24699H39g7074L2389j82643j43955c3311m5099q278
10006h6688m54346K35364J22169O8527b2336n14908b00820i8067A17856F876i4278
9994H9146H95b54590C76267b33273A55694a49112H5266Q3574d56874a67180E7465
9982b86134Q2499f1538A77266F822b83661A0442L07674a04909N104a1988p2209
9971h4197G0909c2576n4996m7461e7971B12122b50608L6368f655a873A38479a45880
9958e0254A47274G2940g8995q2084O776j37195c8716n3854L7531D02200I0665
9946C0115P2530b71901j66582b5476C02529A10631b96917e8251K1993I4509k3694
9935G0815k2091b3023j70899A05416D7913a03549j60998E2672b14957f1660K7262
$$ plain form
9924 -34398 119812 -354673 300457 -182547 148393 35382 -161724 -197135 -313677 -170226
9914 -170226 -93220 -71133 -156040 -85063 -209841 138708 -9067 -23197 -96263 19980 -42691
9902 -386993 332174 -99746 -79754 -77062 -226 -56563 -139107 -196464 -83175 -128715 -272263 80124
9889 -5249 -141904 169768 -280899 -141718 208736 21574 -136059 66444 49049 -247712 -223760
9878 -223760 52637 -197650 -181614 -304729 -315636 -274938 198245 -455763 88486 -223614 -79395
9866 -56790 -10031 -119268 -192591 54148 172364 -49914 -42287 -91562 -201473 -57143 -58114 -208263
9854 -208263 -146209 -46435 202608 -140708 -83999 -31238 66919 261246 -113433 -175842 4796
9842 -38047 60519 -158579 -268932 17623 -166348 -56465 127749 -256435 -245929 149111 179227
$$ packed form
9924c4398A19812c54673C00457a82547A48393C5382a61724l5411j16542J43451
9914a70226P7006K2087q4907P0977j24778A38708i067j4130p3066A9980d2691
9902c86993C32174i9746J9992K692b26n6337q2544n7357h3175m5540j43548H0124
9889e249j36655A69768b80899J39181B08736B1574a36059F6444j7395b47712K3952
9878b23760E2637a97650J6036j23115j0907M0698A98245d55763H8486b23614g9395
9866e6790a0031j09237p3323E4148J18216d9914P627m9275j09911e7143r71j50149
9854b08263O2054d6435B02608a40708N6709c1238F6919J94327a13433o2409D796
9842c8047F0519a58579j10353A7623a66348e6465A27749b56435J0506A49111L0116
$$ plain form
9831 179227 -245248 -327532 9147 -113754 -89157 -5716 19874 57059 -32694 -259669 32785
9819 49571 -124197 119398 -205474 234344 -16390 322472 -236448 -53514 -53854 -8959 9362
9807 -536005 -74209 -43027 -136359 -275606 78312 -107674 147672 -119832 38748 -190000 -247113
9796 -247113 -4028 146249 108018 69425 -93235 101949 -243096 134600 44372 -163188 137251
9784 -232787 -267701 -264639 186616 -100593 -202227 -30928 21697 138412 -190410 -149136 -90783
9773 -90783 -99806 -79771 -372836 62781 92226 -127216 176797 -29323 -9462 -105180 7972 47515
9761 47515 65695 -195322 -16373 140660 -362267 -53844 106822 -79098 -281763 -1765 123635
9749 33699 47840 176352 245035 34974 -243505 171470 -35019 -202983 -23090 -15594 15494
$$ packed form
9831A79227b45248q2284I147a13754K4597e716A9874L7185c2694k26975C2785
9819D9571a24197A19398b05474B34344a6390C22472b36448e3514l40h959I362
9807e36005g4209L1182r3332j39247G8312a07674A47672a19832C8748a90000n7113
9796b47113d028A46249l8231l8593i3235A01949b43096A34600D4372a63188A37251
9784b32787l4914L062A86616a00593j01634c0928B1697J16715a90410M1274N8353
9773i0783r023K0035k93065F2781K9445a27216A76797b9323i462r5718G972L9543
9761D7515J8180a95322a6373A40660c62267e3844A06822g9098k02665a765A23635
9749C3699J4141J28512O8683C4974b43505A71470c5019j67964b3090P496A5494
$$ plain form
9737 -339815 280988 -9797 -115300 -182389 -316009 -214993 -350090 -122629 -146031 128890
9726 -101258 134281 -121536 -196307 -33529 -69648 -120630 -64124 -18234 -215976 57118 -114534
9714 265184 -272647 -148604 -25434 -113511 -203275 -46906 42391 259210 136226 -22567 99302
9702 -325952 109338 -29527 -171081 -75706 -102990 134141 78289 80908 -85102 116402 221802
9691 221802 118413 -281141 -20949 100611 -31729 -402640 -423987 -168101 -135622 -115415 -57875
9680 -57875 -116925 63554 -76777 -60662 300771 184972 -129851 -110143 88884 -255910 -9283
9668 105752 146870 -115496 77333 -35933 82068 -32332 50190 -28898 -63231 -97665 269997
9656 -426429 -53106 -283156 74584 -247308 -201131 -233366 244438 -96509 -18267 -125155 -199764
$$ packed form
9737c39815B80988i797j05503o7089j33620J01016j35097a22629k3402A28890
9726a01258A34281a21536p4771c3529l6119n0982N6506a8234j97742E7118a14534
9714B65184b72647J24043b5434q8077q9764d6906D2391K16819j22984b2567I9302
9702c25952A09338b9527j41554g5706k7284A34141n5852K619h5102A16402J05400
9691B21802j03389b81141b0949A00611c1729l70911k1347a68101L2479K0207N7540
9680e7875n9050F3554g6777J6115C00771j15799a29851J9708H8884b55910i283
9668A05752M1118a15496G7333c5933H2068c2332E0190b8898l4333l4434B69997
9656d26429e3106k30050G4584b47308M6177l2235B44438i6509a8267j06888p4609
$$ plain form
9645 -199764 -83885 -253039 -360941 -27626 -29951 -231928 -170300 33846 -195289 -97061 -140412
9634 -140412 -341164 -220360 -24559 -160321 -12883 -62094 98128 29132 -222252 -253688 -194389
9623 -194389 -180814 64127 -109526 -160623 -75266 -55598 71351 -56272 360 104926 30570 -227847
9610 75547 -92176 -158007 21589 82731 108801 -148251 -78379 -93974 87096 -268385 -98004
9598 -92170 367527 -71288 -187882 -284523 -452057 -231784 -110203 -273690 -160658 88666
9587 -212070 -23917 -198833 -236632 -208570 -15853 13229 148400 -197298 -220055 70378 -16549
9575 203703 -276852 232438 179956 -182427 -167700 -132231 146167 49847 -54217 238557 -345917
9563 142630 -217455 -39472 -83384 -10828 -36562 70762 146946 -179511 -136433 55683 -57326
$$ packed form
9645a99764h3885j69154j07902b7626k325k01977O1628C3846a95289i7061m3351
9634a40412k00752J20804b4559j35762a2883m9211I8128B9132b22252l1436N9299
9623a94389J3575F4127a09526n1097g5266J9668G1351e6272C60J04566C0570b27847
9610G5547i2176o5831B1589O1142K6070a48251O9872j5595H7096b68385i8004
9598i2170C67527g1288j16594r6641j67534K20273a10203j63487J13032H8666
9587b12070b3917j74916l7799K8062a5853A3229J35171a97298k2757G0378a6549
9575B03703b76852B32438n2482a82427J4727L5469A46167D9847e4217B38557c45917
9563A42630b17455c9472m3912a0828k5734G0762P6184a79511M3078E5683e7326
$$ plain form
9551 71594 147406 -459855 -72675 181740 -254754 244198 -112412 110283 -59902 -203827
9541 -203827 18642 -211023 108026 -157254 21279 -127022 24617 -347763 -25954 -257427
9531 -257427 -10863 -77589 92536 174663 169446 84025 -165197 -166622 -349118 12 83947 -177037
9518 -161363 -148653 113404 48464 -132825 -67459 -349997 -187054 -185643 -21491 107603 -199704
9506 -137154 -218839 257939 276929 -49221 48671 -356107 67016 -312576 198334 -68353 28857
9494 -102437 414983 -68740 365820 54248 -138634 60231 219152 289278 -203612 -144492 -371357
9483 -371357 -70853 191150 -169180 130338 47368 186607 -154718 -123957 -232224 -217607
9473 -217607 176394 -113206 29390 -120129 -229668 -273816 -43933 48337 -120320 -180528 -77776
$$ packed form
9551G1594P5812d59855g2675A81740b54754B44198a12412A10283e9902j43925
9541b03827A8642b11023A08026a57254B1279a27022B4617c47763b5954k31473
9531b57427a0863o6726I2536Q2127n217H4025a65197j425j82496A2Q3935a77037
9518a61363J2710A13404D8464a32825O5366k82538J62943J411b1491A07603a99704
9506a37154q1685B57939J8990d9221D8671c56107F7016c12576A98334f8353B8857
9494a02437D14983f8740C65820E4248a38634F0231J58921P0126b03612N9120k26865
9483c71357g0853A91150a69180A30338D7368J39239a54718L0761j08267J4617
9473b17607A76394a13206B9390a20129j09539m4148d3933D8337a20320o0208g7776
$$ plain form
9461 -99100 -84715 -34309 -29872 -112438 160021 -322444 59083 17990 -138125 -242868 66652
9449 -129482 -170885 -25622 233364 298196 -149654 -206260 -324286 -432516 193356 69837 28615
9437 346661 -53350 -138565 -359491 -176639 -385187 -459666 -159698 11232 386830 11807 -163224
9425 -221325 -71479 -296621 -44276 -161070 -40734 -267828 -65073 -41113 203569 -150489 -31616
9413 137489 175241 24424 -191569 -142342 38422 -49773 -196102 -36265 323624 -46929 27870
9401 265346 92081 148207 -78286 -92311 68491 175304 -75205 197121 -12690 396 -185580
9389 99705 -89286 288853 -78316 -211288 -21640 -41871 194833 51798 -342417 38252 16129
9377 107752 -55872 -101094 2524 -114318 -220053 -179734 -250353 -132013 34236 54801 -139398
$$ packed form
9461i9100J4385c4309M437q2566A60021c22444E9083A7990a38125j04743F6652
9449a29482m1403b5622B33364O4832a49654n6606j18026j08230A93356F9837B8615
9437C46661e3350q5215k20926a76639k08548p4479a59698A1232L75598A1807a63224
9425b21325g1479k25142d4276j16794d0734k27094f5073K3960B03569a50489c1616
9413A37489L7752B4424a91569M9227C8422d9773j46329c6265C23624d6929B7870
9401B65346I2081N6126g8286j4025F8491J06813g5205A97121a2690C96a85580
9389I9705h9286B88853g8316j32972b1640k0231A94833E1798c42417C8252A6129
9377A07752e5872m5222B524a14318j05735M0319p0619J18340C4236K0565a39398
$$ plain form
9365 -142468 57929 6769 -303997 -176164 -17584 47322 -210288 107445 -50985 -89927 -162947
9354 -162947 -312507 137892 -321625 33573 58831 -314607 193985 -171190 -107275 130351
9343 19909 -213209 8529 225439 -137801 -127321 178636 14200 -42151 51870 -66328 158095
9331 -31476 110063 -30541 76143 -201606 47745 -3725 -127925 -241974 -163324 -193361 87537
9319 -23276 -145337 -197239 -268254 -234999 42075 19074 -96117 4708 -233378 -167690 -21514 81319
9306 -56666 -241158 -102963 176415 214218 -54618 97545 -30162 -219169 -85270 328179 -412163
9294 -130241 -156566 -163611 96563 -203871 10825 -37772 180023 -168033 -18413 64264 -326141
9282 -62722 -33685 -201510 17291 -46017 214851 -48159 -486740 159977 -203156 -36878 -68179
$$ packed form
9365a42468E7929F769c03997J27833a7584D7322b10288A07445e0985l8942p3020
9354a62947j49560A37892c21625C3573K5258c14607A93985a71190O3915A30351
9343A9909b13209H529K16910a37801J0480A78636A4200d2151E1870f6328A58095
9331c1476A10063c0541G6143b01606D7745c725j24200j14049P8650l0037H7537
9319b3276j22061n1902p1015L3255D2075A9074i6117D708b33378O5688b1514H1319
9306e6666j84492a02963A76415L7803e4618I7545c0162j89007h5270C28179d12163
9294a30241k6325p045I6563b03871A0825c7772A80023a68033a8413F4264c26141
9282f2722K9037j67825A7291d6017B14851d8159m38581A59977b03156c6878l1301
$$ plain form
9271 -68179 -22082 65874 124685 247484 -135569 -445997 -4725 3466 -64322 98538 115756 -287077
9258 -42327 -41710 99346 -157506 135733 -209900 -163197 -205363 -224599 -116992 -134619 -49260
9246 -100695 -17453 -106528 -327814 -101208 -464094 -145852 120950 -84057 -49882 -66647 273867
9234 -109013 -68908 -136974 -106047 -22918 149529 437421 -103200 280594 179783 -65438 -92372
9223 -92372 101040 99712 -146425 -17972 78072 -85426 -231760 -77971 165839 -238043 -136880
9212 -136880 173386 4144 -45651 -134821 -72556 85393 -278099 -26486 -52848 -131154 88268
9200 894 -160619 -175873 -65153 -205860 -69592 79073 -54113 79955 177284 -82113 -224066 70459
9187 -10769 -206099 -82630 15405 -86802 127471 -46236 232542 -7107 -504486 135169 94627
$$ packed form
9271f8179b2082F5874N8811J22799a35569l10428d725C466f4322I8538J7218b87077
9258d2327O17I9346a57506A35733b09900M6703m2166j9236J07607j7627d9260
9246a00695a7453q9075k21286a01208l62886a45852A20950h4057L4175j6765B73867
9234a09013M0105o8066L0927b2918A49529K87892a03200B80594j00811f5438k6934
9223i2372A01040j328a46425a7972G8072h5426j46334g7971A65839b38043J01163
9212a36880A73386D144d5651q9170O2265H5393b78099b6486k6362p8306H8268
9200H94a60619j5254f5153j40707f9592G9073e4113G9955R7329h2113j41953G0459
9187a0769j95330h2630A5405h6802A27471d6236B32542g107m97379A35169m0542
$$ plain form
9176 94627 275557 -67613 -195110 295022 -119844 -208532 -85032 -152473 -65908 -93992 -10073
9164 -27487 -169221 37345 -72166 -109115 -101964 -284738 -75789 -188777 18821 -226986 -51920
9152 -115693 -96470 -128737 1652 -85171 155725 105730 -32436 25500 17021 -304615 -312250 -47572
9139 36011 -100547 -98447 37792 -3639 -59880 226809 -127369 145019 -175685 -17278 -181830
9128 -181830 -156040 45141 -7169 128267 158758 6963 -74104 -39867 160474 151104 -119067 129181
9115 -228833 -271917 -32735 45950 -337845 -170905 -33742 -62162 -332045 -42681 55253 -32683
9103 306324 -458060 -184951 -175247 107620 -194321 -196293 -61093 -242582 -170827 31322 -214209
9091 -81821 172837 -1339 323799 126796 -383135 -227157 454497 68502 332664 -29630 -277256
$$ packed form
9176I4627J80930f7613j27497B95022a19844q8688h5032o7441f5908k8084a0073
9164b7487j41734C7345g2166l6949P151j82774g5789j12988A8821b26986e1920
9152a15693J9223l2267A652h5171A55725m9995c2436B5500q479c04615p635d7572
9139C6011a00547K100C7792c639n6241B26809a27369A45019a75685a7278j64552
9128a81830K5790D5141g169A28267L0491F963g4104L4237A60474r370a19067A29181
9115b28833m3084c2735D5950c37845J66940c3742k8420k69883d2681E5253c2683
9103C06324d58060a84951R704A07620a94321j972f1093j81489P1755C1322b14209
9091h1821A72837a339C23799A26796c83135J55978D54497F8502K64162b9630k47626
$$ plain form
9080 -277256 -84341 164277 -74245 -64694 -70093 -57048 -127348 -256083 -265552 49476 -268833 103801
9067 241450 -99060 -131570 129161 -63294 -168234 -158595 -42164 95455 162105 -277702 -252336
9056 -252336 81899 -31074 -142893 -67369 -54294 287258 -94844 -462765 -225539 -164095 -21644
9044 -57422 418059 -71227 210097 -192871 116646 -41865 -70497 -174621 246302 -16076 -320850
9033 -320850 108614 33402 -104511 63567 36724 -184398 266091 -129573 -294201 -17106
9022 -56182 143450 -393 -71891 -9835 -52222 -56149 144888 -349072 -149914 -123414 132172 -218503
9009 -234080 -97387 -5746 -140547 -216737 -294175 87983 -352772 51555 230056 -14074 -9647
8998 -9647 66028 -340945 238373 -269373 -203046 -25760 -50762 -27177 -21816 -55020 -208725
$$ packed form
9080b77256h4341A64277g4245R551n399J3045p0300j28735r469D9476b68833A03801
9067B41450i9060l2510A29161f3294j04940R639d2164I5455O6650b77702K5366
9056b52336H1899c1074j11819f7369J3075B87258i4844l67921b25539O1444b1644
9044e7422D18059g1227B10097a92871A16646d1865k8632j04124B46302a6076l04774
9033c20850A08614C3402a04511F3567k6843a84398B66091a29573j64628a7106
9022e6182A43450c93p1498i835m2387l927A44888c49072a49914K6500A32172b18503
9009b34080i7387e746j34801p6190p7438H7983c52772E1555J78501a4074M427
8998i647F6028c40945B38373b69373O6327b5760k5002K3585N361l3204j53705
$$ plain form
8987 -208725 -86063 -6079 -288080 182117 100595 -225389 3225 -60210 -148256 -193518 45519
8975 -136380 -365474 -70224 136742 -278656 -133843 60469 89263 43058 -198382 -185653 -34436
8963 -164338 145882 9827 39127 104974 103993 -23470 -161205 285909 -56514 -140098 138250
8951 116569 -132500 -22160 115004 -194378 -33847 -71865 -175361 -139670 -159378 -188538 -22748
8939 232413 51110 -347704 2588 -43832 -438272 56470 -198018 -65190 153761 -224859 -159256
8928 -159256 -231855 -155413 234501 -223142 344374 -67070 -190342 411880 473931 740553
8918 740553 474416 261290 -43562 -42541 -194365 54040 24872 -328366 220118 240498 125582
8907 125582 24646 56382 90528 -85609 -103330 -15995 -170386 -158220 -293525 -196459 -27625
$$ packed form
8987b08725h6063f079k82001A82117q1522b25389C225f0210q8046m5262D5519
8975a36380k29094g0224A36742b78656a33843F0469K8794D3058a98382J2729c4436
8963a64338A45882I827K9300O5847r81b3470j37735B85909e6514q3584A38250
8951A16569a32500b2160A15004a94378c3847l8018j03496L5691j9708k9160b2748
8939B32413E1110c47704B588d3832l94440E6470a98018f5190A53761b24859O5603
8928a59256p2599P6442B34501b23142C44374f7070j23272D11880O2051K66622
8918G40553k66137k13126d3562J021j51824E4040B4872c28366B20118K0380j14916
8907A25582B4646L1736L4146h5609j7721a5995j54391J2166j35305R7066b7625
$$ plain form
8895 -194476 -211265 -360736 -192119 -42080 126339 293322 -54015 -268006 -16859 235043
8884 65658 199917 -314995 -131567 -203304 -272341 -60144 236231 -69640 -366395 -66925 128616
8872 361116 15735 -36469 164114 -57287 -261280 178534 -21968 782 -45287 113268 -95222
8860 81136 -138477 -39252 203483 -205017 27843 118795 -95354 -171137 -133064 -455851 -88370
8848 -160576 39138 16963 -191460 -198785 195551 -66198 1817 16296 -204538 -115602 -32606
$$ packed form
8895a94476j6789j49471J68617d2080A26339J66983e4015k13991a6859B35043
8884F5658J34259c14995a31567p1737o9037f0144B36231f9640k96755f6925A28616
8872C61116A5735c6469A64114e7287k03993A78534b1968G82d5287A13268i5222
8860H1136a38477c9252B03483b05017B7843R0952i5354p5783L8073l22787h8370
8848a60576C9138A6963a91460p325A95551f6198A817J4479b04538Q8936c2606
$$ [...]
##END NTUPLES=NMR SPECTRUM
##END=
