##TITLE=NES1094_ptc140_9886742_WoWcRdBwYx
##JCAMPDX= 6.0         $$ Bruker NMR JCAMP-DX V2.0
##DATA TYPE= NMR SPECTRUM
##DATA CLASS= NTUPLES
##ORIGIN= BRUKER
##OWNER= Administrator
$$ 1.72 TOPSPIN		Version 2.1
$$ 2016-08-28 17:40:40.336 -0500  Administrator@X
$$ Compression mode = diff/dup
##.OBSERVE FREQUENCY= 400.02188249412
##.OBSERVE NUCLEUS= ^1H
##.ACQUISITION MODE= SIMULTANEOUS (DQD)
##.ACQUISITION SCHEME= undefined
##.AVERAGES= 8
##.DIGITISER RES= 22
##SPECTROMETER/DATA SYSTEM= spect
##.PULSE SEQUENCE= zg30
##.SOLVENT NAME= COFFEE_meoh
##.SHIFT REFERENCE= INTERNAL, COFFEE_meoh, 1, 14.98509
##AUDIT TRAIL= $$ (NUMBER, WHEN, WHO, WHERE, PROCESS, VERSION, WHAT)
$$ ##TITLE= Audit trail, TOPSPIN		Version 2.1
$$ ##JCAMPDX= 5.01
$$ ##ORIGIN= Bruker BioSpin GmbH
$$ ##OWNER= Administrator
$$ $$ E:\/data/COFFEE/nmr/NES1094_ptc140_9886742_WoWcRdBwYx/10/pdata/1/auditp.txt
$$ ##AUDIT TRAIL=  $$ (NUMBER, WHEN, WHO, WHERE, PROCESS, VERSION, WHAT)
(   1,<2016-08-28 17:40:33.304 -0500>,<Administrator>,<X>,<go>,<TOPSPIN 2.1>,
      <created by zg
	started at 2016-08-28 17:39:27.289 -0500,
	POWCHK enabled, PULCHK disabled,
       configuration hash MD5:
       21 0F 79 D6 B3 7B B4 F6 88 20 88 DB 03 48 BD 9F
       data hash MD5: 64K
       CC B6 09 6F 7D CF DF B1 34 95 71 37 07 05 A2 E7>)
(   2,<2016-08-28 17:40:36.336 -0500>,<Administrator>,<X>,<proc1d>,<TOPSPIN 2.1>,
      <Start of raw data processing
       efp LB = 0 FT_mod = 6 PKNL = 1 PHC0 = 0 PHC1 = 0 SI = 32K 
       data hash MD5: 32K
       3E F2 D5 CD 49 85 08 8A 6F A1 20 E3 2C 56 BD 8F>)
(   3,<2016-08-28 17:40:36.617 -0500>,<Administrator>,<X>,<proc1d>,<TOPSPIN 2.1>,
      <pk PHC0 = 94.38354 PHC1 = 0 
       data hash MD5: 32K
       56 05 45 CB 33 F9 5C 15 59 0F 3E 07 4C 38 C1 FD>)
(   4,<2016-08-28 17:40:36.711 -0500>,<Administrator>,<X>,<proc1d>,<TOPSPIN 2.1>,
      <abs ABSG = 1 
       data hash MD5: 32K
       DB 22 39 C8 C5 03 C7 D4 42 11 73 F8 B6 51 F4 B5>)
(   5,<2016-08-28 17:40:36.773 -0500>,<Administrator>,<X>,<proc1d>,<TOPSPIN 2.1>,
      <abs ABSG = 2 
       data hash MD5: 32K
       78 3D 37 41 4C B6 C3 18 2D C1 19 A9 11 D0 05 20>)
(   6,<2016-08-28 17:40:36.836 -0500>,<Administrator>,<X>,<proc1d>,<TOPSPIN 2.1>,
      <abs ABSG = 3 
       data hash MD5: 32K
       F3 85 CE A7 E6 AA 0D 7E 72 B1 15 B4 B5 DC 1C 9E>)
(   7,<2016-08-28 17:40:36.898 -0500>,<Administrator>,<X>,<proc1d>,<TOPSPIN 2.1>,
      <abs ABSG = 4 
       data hash MD5: 32K
       BD 00 12 50 9D 80 9C E7 13 8C E1 07 C2 78 EF D6>)
(   8,<2016-08-28 17:40:36.945 -0500>,<Administrator>,<X>,<proc1d>,<TOPSPIN 2.1>,
      <abs ABSG = 5 
       data hash MD5: 32K
       02 8B 6B 6D C8 97 EC D9 19 0A 5B 55 6C 7C 24 FE>)
$$ ##END=
$$ 
$$ $$ hash MD5
$$ $$ 8B CC DF 92 9C 47 4C AA DC 43 2F 21 83 99 8D DB
##$RELAX= 
##$RELAX= 
##$RELAX= 
##$RELAX= 
##$RELAX= 
##$RELAX= 
##$RELAX= 
$$ Bruker specific parameters
$$ --------------------------
##$DU= <E:\>
##$EXPNO= 10
##$NAME= <NES1094_ptc140_9886742_WoWcRdBwYx>
##$PROCNO= 1
$$ [...]
150 150 150 150 150 150 150 150
##$TP07= 0
##$TPNAME0= <>
##$TPNAME1= <>
##$TPNAME2= <>
##$TPNAME3= <>
##$TPNAME4= <>
##$TPNAME5= <>
##$TPNAME6= <>
##$TPNAME7= <>
##$TPOAL= (0..7)
0.5 0.5 0.5 0.5 0.5 0.5 0.5 0.5
##$TPOFFS= (0..7)
0 0 0 0 0 0 0 0
##$TUNHIN= 0
##$TUNHOUT= 0
##$TUNXOUT= 0
##$USERA1= <user>
##$USERA2= <user>
##$USERA3= <user>
##$USERA4= <user>
##$USERA5= <user>
##$V9= 5
##$VALIST= <valist>
##$VCLIST= <CCCCCCCCCCCCCCC>
##$VD= 0
##$VDLIST= <DDDDDDDDDDDDDDD>
##$VPLIST= <PPPPPPPPPPPPPPP>
##$VTLIST= <TTTTTTTTTTTTTTT>
##$WBST= 2048
##$WBSW= 25
##$XGAIN= (0..3)
0 0 0 0
##$XL= 0
##$YL= 0
##$YMAX_a= 565375
##$YMIN_a= -481609
##$ZGOPTNS= <>
##$ZL1= 120
##$ZL2= 120
##$ZL3= 120
##$ZL4= 120
##$ABSF1= 14.98509
##$ABSF2= -5.573092
##$ABSG= 5
##$ABSL= 3
##$ALPHA= 0
##$AQORDER= 0
##$ASSFAC= 0
##$ASSFACI= 0
##$ASSFACX= 0
##$ASSWID= 0
##$AUNMP= <proc_prof1d_extract_pilot.lims>
##$AXLEFT= 0
##$AXNAME= <>
##$AXNUC= <1H>
##$AXRIGHT= 0
##$AXTYPE= 0
##$AXUNIT= <>
##$AZFE= 0.1
##$AZFW= 0.1
##$BCFW= 0
##$BC_mod= 0
##$BYTORDP= 0
##$COROFFS= 0
##$CY= 15
##$DATMOD= 1
##$DC= 0
##$DFILT= <>
##$DTYPP= 0
##$F1P= 0
##$F2P= 0
##$FCOR= 0.5
##$FTSIZE= 32768
##$FT_mod= 6
##$GAMMA= 0
##$GB= 0
##$INTBC= 1
##$INTSCL= 1
##$ISEN= 128
##$LB= 0
##$LEV0= 0
##$LPBIN= 0
##$MAXI= 10000
##$MC2= 0
##$MEAN= 0
##$ME_mod= 0
##$MI= 0
##$NCOEF= 0
##$NC_proc= -8
##$NLEV= 6
##$NOISF1= 0
##$NOISF2= 0
##$NSP= 0
##$NTH_PI= 0
##$NZP= 0
##$OFFSET= 14.98509
##$PC= 1
##$PHC0= 94.38354
##$PHC1= 0
##$PH_mod= 1
##$PKNL= yes
##$PPARMOD= 0
##$PPDIAG= 0
##$PPIPTYP= 0
##$PPMPNUM= 2147483647
##$PPRESOL= 1
##$PSCAL= 4
##$PSIGN= 0
##$PYNMP= <proc.py>
##$REVERSE= no
##$SF= 400.02
##$SI= 32768
##$SIGF1= 0
##$SIGF2= 0
##$SINO= 400
##$SIOLD= 32768
##$SPECTYP= <>
##$SREGLST= <1H.CDCl3>
##$SSB= 0
##$STSI= 32768
##$STSR= 0
##$SW_p= 8223.68421052631
##$SYMM= 0
##$S_DEV= 0
##$TDeff= 65536
##$TDoff= 0
##$TI= <>
##$TILT= no
##$TM1= 0
##$TM2= 0
##$TOPLEV= 0
##$USERP1= <user>
##$USERP2= <user>
##$USERP3= <user>
##$USERP4= <user>
##$USERP5= <user>
##$WDW= 1
##$XDIM= 32768
##$YMAX_p= 435050368
##$YMIN_p= -640017
##$CURPLOT= <Network HP LaserJet P1505>
##$CURPRIN= <$Network HP LaserJet P1505>
##$DFORMAT= <normdp>
##$LAYOUT= <+/1D_H.xwp>
##$LFORMAT= <normlp>
##$PFORMAT= <normpl>
##$SURQMSG= 1
$$ End of Bruker specific parameters
$$ ---------------------------------
##NTUPLES= NMR SPECTRUM
##VAR_NAME=  FREQUENCY,     SPECTRUM/REAL,   SPECTRUM/IMAG
##SYMBOL=    X,             R,               I
##VAR_TYPE=  INDEPENDENT,   DEPENDENT,       DEPENDENT
##VAR_FORM=  AFFN,          ASDF,            ASDF
##VAR_DIM=   32768,         32768,           32768
##UNITS=     HZ,            ARBITRARY UNITS, ARBITRARY UNITS
##FACTOR=    0.250966925370066, 1,           1
##FIRST=     8223.43324360094, -16585,       -70182
##LAST=      0,             -156958,         -104588
##MIN=       0,             -640017,         0
##MAX=       8223.43324360094, 435050368,    0
$$ Real data points
##PAGE= N=1
##DATA TABLE= (X++(R..R)), XYDATA
$$ [...]
19556c77221e6153G1796f7611j36250j27038q696d4325j06846B8769J17684D7485
19544h1395j77765h5317H0763a31255D8343i2116m2696j00199D5680e2984A34431
19532c6290n0479j68044A34042a07166A94703a888D7403b29192h2783A18268f2051
19520C0528b00562I1436a14355a41o4073A1235a28815d7026A66263a95518b1281
19508G7911L7222M6342D9146b33842f3824k0333k18127a08169A0303N6547N2318
19497A19168a41800P0520D2374c42034J34138r0536e2239F869a59397d819n61352
19486e66171A1908h7612k31718J1588H6042c7683A01251K55670e3162C0379j849
19475B8530P3798O4707a53400O2743f530p7502B40046b03455B924L12221A21280
$$ y = [-377221, -56153, 71796, -67611, -203861, -330899, -339595, -44325, -151171, 28769, 146453, 47485, -81395, -259160, -85317, 80763, -131255, 48343, -92116, -134812, -235011, 45680, -52984, 134431, -36290, -86769, -254813, 134042, -107166, 194703, -1888, 47403, -229192, -82783, 118268, -62051, 30528, -200562, 91436, -114355, -141, -64214, 11235, -128815, -47026, 166263, -195518, -21281, 77911, 115133, 161475, 49146, -233842, -63824, -84157, -302284, -108169, 10303, 66850, 119168, -141800, -71280, 42374, -342034, -207896, -298432, -52239, 6869, -159397, -4819, -566171, 11908, -87612, -319330, -307742, 86042, -37683, 101251, 356921, -53162, 30379, 28530, 102328, 167035, -153400, -90657, -6530, -84032, 240046, -203455, 2924, 315145, 121280]
19463B92094a15768C11919j23255b48731B03860b43327A0607b43954J11124b2853
19452a3873j76368A16190k1486m147a32387D29010a2561E0646b34298F4472J33578
19441A98050d15275C2436F38Q2383a4002D3117h1916A90962d3101A33719P7668
19430B11387i7045C83440e0071c850o0023A98087a18038D6052b3656m4835b0000
19418A5250f5275l4654M974k05529J48825A33897g576k600k07779k00411M8556
19407c69810F4691O3938C6627a3649H8438N9594o8371K2135k7483b32785F5773
19395A15797k4431b16772M7118P4403B77124a25256K6095J5755B59194d41547
19384a62050d4398j03477B22555H8084f2477j84789P5809j84923A79176b44174
$$ y = [292094, -115768, 311919, 188664, -248731, 203860, -243327, 10607, -243954, -132830, -22853, -13873, -190241, 116190, 94704, 90557, -132387, 429010, -12561, 50646, -234298, 64472, 198050, -415275, 32436, 638, 83021, -14002, 43117, -81916, 190962, -43101, 133719, 211387, -97045, 383440, -50071, -3850, -63873, 198087, -118038, 46052, -23656, -68491, -20000, 15250, -65275, -99929, -94955, -300484, -151659, 133897, -7576, -10176, -217955, -418366, -369810, 64691, 128629, 36627, -13649, 88438, 148032, 79661, 101796, 74313, -232785, 65773, 115797, 91366, -216772, -169654, -95251, 277124, -125256, -99161, -83406, 259194, -441547, -162050, -44398, -147875, 222555, 88084, -62477, -247266, -171457, -356380, 179176, -244174]
19373A53487Q2911j18114K3620R3533c7588O499E3086l141a28812F9968a00052
19361h8536j57894H3521e3080p3919n7058M3565c8948o3396B60499A0845b2064
19349b77800g0378j25359A03665G814a56388L6283E0540Q3256e60740A05286a43222
19337I3230a53304A70623a42805b6368k80874L0762a30096A6888Q4494l5510a48852
19325b18547k05047a24902A12855j3212c00570B79776e29116a28190m5742c8880
19314A17556b85598A5845J03145J02660a41301A98600K12085f2479j49302D03808
19303G6034L0188b64993b1691A54777a57339H6401a22091k98305a66719E7456
19292i9680k59744J15553A2008b09742c0359A51496a81375B08101h819A326J0386
$$ y = [153487, 236398, 118284, 141904, 235437, -37588, -31089, 53086, 49945, -128812, 69968, -100052, -88536, -246430, 83521, -53080, -126999, -184057, -140492, -38948, -102344, 260499, 10845, -22064, -277800, -70378, -195737, 103665, 7814, -156388, -120105, 50540, 133796, -560740, 105286, -143222, 93230, -153304, 170623, -142805, -26368, -307242, -276480, -130096, 16888, 101382, 65872, -148852, -218547, -423594, -124902, 112855, 99643, -300570, 279776, -529116, -128190, -173932, -38880, 117556, -285598, 15845, 118990, 221650, -141301, 198600, 410685, -62479, -211781, 403808, 76034, 106222, -264993, -21691, 154777, -157339, 86401, -122091, -420396, -166719, 57456, -99680, -359424, -243871, 12008, -209742, -30359, 151496, -181375, 208101, -8819, 1326, 11712]
19281A1712a28757q788o8145a296r87G3457b27800M4056o8358R2390B95526B5486
19268B984h6651E3271J74460o8376n4708D5500a69543A80260Q866b79623k0629
19257c00252P0755I9747d3537j07423d5804j21049k31907J13993J10335A52185
19246H7121c15386b0308n5447B58253c9182j09094C7989a11807A78597h8584j02524
19235a91108R2133j20174p4969A09750a79912f7805k8891l3233j14999n7365a27385
19223b3435r6887l8023g304k60183C25073A27939k4700j6976R456a13562A72738
19211c34854a00301k01414I3834f0882M200k7587A91791p9106e67084e7156k7444
19200h4600A39376K0879b15760C2343b81272M6497a6959C16127C0066a75171l7519
$$ y = [11712, -128757, -137545, -205690, -1296, -2283, 73457, -227800, -183744, -252102, -159712, 295526, 25486, 2984, -86651, 53271, 227731, 159355, 104647, 45500, -169543, 180260, 189126, -279623, -300252, -229497, 99747, -43537, -150960, -45804, -166853, -398760, -284767, -174432, 152185, 87121, -315386, -20308, -75755, 258253, -39182, -148276, 37989, -111807, 178597, -88584, -191108, -98975, -219149, -294118, 109750, -179912, -67805, -96696, -129929, -244928, -302293, -127385, -23435, -120322, -158345, -7304, -267487, 325073, 127939, 103239, 86263, 95719, -113562, 172738, -334854, -100301, -301715, 93834, -60882, -56682, -84269, 191791, 112685, -567084, -57156, -84600, 139376, 160255, -215760, 32343, -281272, -234775, -16959, 316127, 30066, -175171, -212690]
19189b12690A15456j5753a57019B39427h6629A28254M277g9766p8849e816j41541
19178a47357p687m33649a98055E7311a92971A26734B376b25090D5243f2114O743
19167e5371k29174A25696i7234m743M9219j94268a07399n9277j36045A53737a4775
19155a30227k61753B47272f0535B43611e7587G2897c12971h0120B56343j14640
19145A41703a37631B14469b84331h145D3035N6391a97093A54861c9016B2685K3232
19134D5917N1390R9160c95845e5906B17436A00059h9051a629H5657M6904A6951
19122a55809I4170N3350a58051b6082o150j89458r883B64691f1703A35625B9846
19110E6347N7432m7514L1782c26493E847J75661A1140b93040D8236b3868q6507
$$ y = [-212690, 115456, 99703, -157019, 239427, -86629, 128254, 132531, -79766, -158615, -5816, -147357, -155044, -588693, -198055, 57311, -192971, 126734, 2376, -225090, 45243, -62114, -55371, -284545, 125696, -97234, -101977, -52758, -247026, -107399, -166676, -302721, 153737, -14775, -130227, -391980, 247272, -60535, 243611, -57587, 72897, -312971, -80120, 256343, 141703, -137631, 214469, -284331, -8145, 43035, 99426, -197093, 154861, -39016, 22685, 45917, 97307, 196467, -395845, -55906, 217436, 100059, -89051, -1629, 85657, 132561, 16951, -155809, 94170, 147520, -158051, -26082, -32232, -221690, -231573, 264691, -61703, 135625, 29846, 56347, 113779, 66265, 98047, -326493, 5847, 181508, 11140, -293040, 48236, -23868, -110375]
19099a10375f671j07477k3290A40276a42945e3466j40415f4515k3493A0074M1477
19088E1551n329P4824K08764j57443f4025o9175k4826M6954A3135M8112A5529
19076B48588a96270C64072A43868h1981B94962h7661A85017c4594j01174A76872
19065H115J00458a53347D3293b15876j94454d8004q4462D0468J0740i7661k0218
19054a17879A92097a14158c7515j42995N7650k10542G0006i111A13480h6194j28463
19043b14657A57007j1353D1468a09740j80793a43730j03371R133i4469A10292
19032A50113b25123A18436a29439A67123C1184L51796A19826c6972C9703K9084
19022F8787C1998a31587a0066A80399b81672g3243E6790R3296a24404o2938j13844
$$ y = [-110375, -6671, -114148, -137438, 140276, -142945, -53466, -193881, -64515, -88008, 10074, 51551, 46222, 121046, 329810, 172367, -64025, -133200, -158026, -111072, 13135, 61247, 15529, 248588, -196270, 364072, 143868, -81981, 294962, -87661, 185017, -34594, -135768, 176872, 8115, 108573, -153347, 43293, -215876, -410330, -48004, -132466, 40468, 51208, -97661, -117879, 192097, -114158, -37515, -180510, -122860, -333402, 70006, -9111, 113480, -86194, -214657, 157007, 145654, 41468, -109740, -290533, -143730, -247101, -237968, -94469, 110292, 150113, -225123, 118436, -129439, 167123, 31184, 382980, 119826, -36972, 39703, 68787, 31998, -131587, -10066, 180399, -281672, -73243, 56790, 150086, -124404, -187342, -301186]
19011c01186g9031j46410P9830j11844Q4430D4587A2K68961c88720a74196Q5340
19000h8856A63517o5207c58971B70147C7501b03975P436j28186J37567e4204A68681
18988a66125j44961J2589A58503N4832a56260j33410d0004A24970b6626n1840
18978g8466j74495k66965A72892k8204h8725p5932K7428A1149f764j36613o4703
18967b08080Q0499j24081J19644b7065A10057J86612j20658f9731A01600k9516
18957G2084L4865E3273b21327P3929C9113J88709c52970A2862M8364a92176A02621
18945a83373i862C569b49139A71678a70625C1729O6806D579b57005h0500K7528
18934e2972j39924g0998B1663f8670B7513a97811Q3128j13191f7693a3959l03874
$$ y = [-301186, -79031, -225441, -145611, -257455, -173025, 44587, 12, 268973, -388720, -174196, -88856, 163517, 98310, -358971, 270147, 37501, -203975, -196539, -324725, -187158, -54204, 168681, -166125, -311086, -298497, 158503, 213335, -156260, -289670, -40004, 124970, -26626, -78466, -252961, -519926, 172892, 144688, -88725, -164657, -137229, 11149, -6764, -143377, -208080, -127581, -251662, -132018, -27065, 110057, 296669, 176011, -69731, 101600, 72084, 106949, 53273, -221327, -147398, 39113, 227822, -352970, 12862, 61226, -192176, 102621, -183373, -9862, 3569, -249139, 171678, -170625, 31729, 98535, 4579, -257005, -80500, -52972, -192896, -70998, 21663, -68670, 27513, -197811, -114683, -227874, -67693, -13959, -317833]
18923c17833a2541k24204A75704G9131c874m38872A50493o2674c50516C6636O6246
18912A02882D9883d3700A58607a57167j0653A66478J18504H0911l6395a50903
18901a3469l02889E6666O6763Q7278a55484F9872d2655m5691k85618B22831j3449
18890B09382a86533D2761N2752d4177C3791N1860Q4267a41230j4288f4791k7622
18879i2413c9852B77047c041j76964B13386c6911l56864A52997e0212k77661A62774
18867a11528j40504J14906m8948Q2B95490a23225B79846A08375K2814f9281k1286
18856i0567q8688d7780l0634D4541a09463A66655H934K00407a00734j46791J08029
18845a39496m5476R013G6005q310F996a95359b2669D0055h4699A32630e1528D6164
$$ y = [-317833, -12541, -236745, 175704, 79131, -3874, -442746, 150493, 87819, -350516, 36636, 102882, 49883, -43700, 158607, -157167, -167820, 166478, 284982, 80911, 44516, -150903, -13469, -316358, 56666, 123429, 210707, -155484, 69872, -42655, -88346, -373964, 222831, 209382, -186533, 42761, 95513, -44177, 33791, 85651, 169918, -141230, -155518, -64791, -92413, -39852, 277047, -3041, -180005, 213386, -36911, -393775, 152997, -50212, -327873, 162774, -111528, -252032, -137126, -186074, -185992, 295490, -123225, 279846, 108375, 131189, -69281, -90567, -179255, -47780, -78414, 44541, -109463, 166655, 8934, 209341, -100734, -247525, -139496, -184972, -175959, 76005, 67695, 6996, -195359, -22669, 40055, -84699, 132630, -51528, 46164]
18832C923a97175J0169e533k10330A51721b78823A29796A7713a34642A8091J03794
18821A21885a16281B9237a10672K2983B87861b28470m9691A81401Q9278e2422
18810A1405J86098a60884A12613M9479b13572A99228d2698B00891c35119A05030
18799a12679B30213a97793k59057c2830C9311b98774a27453L0376K2807B5202
18788A63257f4022K2212I6802h9769o3626g6628a4205C7383a86550O9196C42470
18776B18540r1449h294c853j64549N3953A25306c8763j12095p4673p7046B5424
18764b136B06985h686j22696j0951K3578D6168A2467a88008A10237J96043e9505
18752A76296b91257B74414a75958D6829j5022f1222m2108l2612J2835d9627A38279
$$ y = [3923, -197175, -187006, -5533, -215863, 151721, -278823, 129796, 17713, -134642, 18091, 121885, -116281, 29237, -110672, -87689, 287861, -228470, -278161, 181401, 270679, -52422, 11405, 197503, -160884, 112613, 162092, -213572, 199228, -42698, 200891, -335119, 105030, -112679, 230213, -197793, -456850, -32830, 39311, -298774, -127453, -97077, -74270, 25202, 163257, -64022, -41810, 96802, -89769, -153395, -76628, -14205, 37383, -186550, -117354, 342470, 218540, 127091, -8294, -3853, -168402, -114449, 125306, -38763, -150858, -225531, -302577, 25424, -2136, 206985, -8686, -131382, -142333, -118755, 46168, 12467, -188008, 110237, 306280, -59505, 176296, -291257, 274414, -175958, 46829, 31807, -61222, -103330, -135942, -123107, -49627, 138279]
18740i4364B49630c45543F4977J50983E5397c2532A04290b91431J35600e2581
18729c4419j12759j69401J56794g5050j32855j27694A11204b47311H6784a83350
18718b58881f1423j36459R7295L2934r614B11548b5342H6315a46466m0499R018
18707a77947C28380a36062f4069k28084a34924j02083A27342j1263C8644a37808
18696f99j45821D6719J04751A371a36500a3197j47918j83404C69175A36614D8145
18684b3526j96228Q2888B63410b5728F5660A8113a91495A3962b19430A6646a19878
18672E9288a08583e3456A46398e2347n0372R380d6384A94638i4251k10707A93732
18660a33183j7324f9987j69674n45B11348a19421k3919A74748g6270b9948B5261
$$ y = [-94364, 249630, -345543, 64977, 215960, 55397, -32532, 104290, -291431, -155831, -52581, -34419, -147178, -316579, -159785, -75050, -207905, -335599, 111204, -247311, 86784, -183350, -258881, -61423, -197882, -100587, -67653, -77267, 211548, -25342, 86315, -146466, -186965, -177947, 328380, -136062, -64069, -292153, -134924, -237007, 127342, 116079, 38644, -137808, -699, -146520, 46719, 151470, 1371, -136500, -13197, -161115, -344519, 369175, 136614, 48145, -23526, -219754, -136866, 263410, -25728, 65660, 18113, -191495, 13962, -219430, 16646, -119878, 59288, -108583, -53456, 146398, -52347, -102719, -93339, -46384, 194638, -94251, -304958, 193732, -133183, -150507, -69987, -239661, -240206, 211348, -119421, -143340, 174748, -76270, -29948, 25261]
18648f4489a4083j26965J3289D8638G244O8875a32260b6988j44658A38611h1251
18636c32963A7698a16878A10622Q7680b26007B8508a86613A37299o4813A3618
18625b25286j4671a7582B39334D8155P8472c4664A61149b12098g9903b0667B23224
18613e3777B2417K62653A11137b96579g6600A95488m9523f6705A2743P2619B4948
18601a21517J3867G5563R662i4191R770k60534B33215a13806B81482F5182P5733
18590A40915a61294C82715a69757K8051K415l7637G2991b04326E937b71699c0069
18578a02989j27375A51441b3010o9775A6982a88005P4152a754A25558a56346k13221
18567c69567A74729E5785b63406f3762B9108a85739C2332J77964B6101a30879
$$ y = [-64489, -14083, -141048, -127759, 48638, 7244, 76119, -132260, -26988, -171646, 138611, -81251, -332963, 17698, -116878, 110622, 198302, -226007, 28508, -186613, 137299, 72486, 13618, -225286, -239957, -17582, 239334, 48155, 126627, -34664, 161149, -212098, -79903, -20667, 223224, -53777, 22417, 285070, 111137, -296579, -76600, 195488, 145965, -66705, 12743, 85362, 24948, -121517, -107650, 75563, 85225, -94191, -84421, -344955, 233215, -113806, 281482, 65182, 140915, -161294, 382715, -169757, -141706, -139291, -176928, 72991, -204326, 5937, -271699, -30069, -102989, -230364, 151441, -23010, -92785, 16982, -188005, -113853, -1754, 125558, -156346, -369567, 174729, 55785, -263406, -63762, 29108, -185739, 32332, 210296, 26101, -130879]
18556a27704K8108D1861h8057A28334B8172N3928k9650d37715B5313J0836J89818
18545B25967h9543K2847K7993k85039A90683b01050f2294p8609l46205K30974
18535b56134d6503C52416d0872j7538A7766c39256B87897b02180N0941B19075
18524d60006J83696N1079a12212B00280F4424R2631b55337g5745A43103Q5901
18514B29004j09031c30830B5352D028e0411B6328a94724A7168h1231j23482g6375
18502A7105d1040j15536B78475A14493b0091A47830A9955b16569F7405b1147j73181
18491a94328m8385R2779D1186J21466g0849A01307a93453A1158d096A39651b01648
18479c3400h746l70402g2568A07309J87082h9857A43342a01094B50432h6056A65696
$$ y = [-127704, -99596, 41861, -88057, 128334, 28172, 82100, 52450, -437715, 25313, 36149, 225967, -89543, -66696, -38703, -323742, 190683, -201050, -62294, -140903, -487108, -256134, -46503, 352416, -40872, -58410, 17766, -339256, 287897, -202180, -151239, 219075, -460006, -276310, -225231, -112212, 200280, 64424, 157055, -255337, -75745, 143103, 229004, 119973, -330830, 25352, 4028, -50411, 26328, -194724, 17168, -81231, -204713, -76375, 17105, -41040, -156576, 278475, 114493, -20091, 147830, 19955, -216569, 67405, -21147, -194328, -242713, -149934, 41186, 162652, -70849, 101307, -193453, 11158, -4096, 139651, -201648, -33400, -8746, -379148, -72568, 107309, 294391, -89857, 143342, -101094, 250432, -86056, 165696]
18467a52941p0716I3063c19868a18248M2902j54093A94131Q8742b77323J32620
18457a44703j62419a37199R627A20209C9414j0395a02173m0278B1274a0178I238
18445B11814b54413d077B0396e6660B58526c2485G7675L9689b2056k01901A1580
18433E4167Q6508c89146C4724J24787l5640c9924k05208G718b7644m2914A8227
18421B9141d7192D4683a68611P4642j56222i6784C22449d10830a22320l57180
18411d79500a56320A70774a03207B4262c1619E9207J15023a29383G2780b43748
18400A1254O9367a63669k23003J42884h039B00409b03362F8605B749L91825I5954
18388A441b20809G2261a59332N2885N1613Q684D23557B5989g8831m7620B39736
$$ y = [-152941, -223657, 93063, -319868, -118248, -75346, -229439, 194131, 282873, -277323, -144703, -307122, -137199, -127572, 120209, 39414, 29019, -102173, -142451, 21274, -10178, 9238, 211814, -254413, -4077, 20396, -56660, 258526, -32485, 77675, 117364, -22056, -223957, 11580, 54167, 140675, -389146, 34724, 159511, 123871, -39924, -245132, 7718, -27644, -70558, 18227, 29141, -47192, 44683, -168611, -93969, -250191, -96784, 322449, -410830, -122320, -479500, -156320, 170774, -103207, 24262, -31619, 59207, 174230, -129383, 72780, -243748, 11254, 80621, -163669, -386672, -243788, -8039, 200409, -203362, 68605, 2749, 394574, 95954, 1441, -220809, 72261, -159332, -106447, -54834, -46150, 423557, 25989, -78831, -126451, 239736]
18376E2911J9320a03622B06492D3070a84861k3273A01826a4904C0756J24405b01584
18364A79594C2523a80700E3199a78858e4071I0899b20707d5333J8657m009E5273
18352c04025c6493A52074D4282a94072A33178L8775b37148A60314a87234h7091
18341b66311A0633J22988d33812J36821a47171H2397a36299k8044P9267C74206
18330d8923l68347a26223q9559m3672d959B6642d04323d0371b496p0343M636k27198
18318b95401a01744K4864p389A1189a28082J974n1446M6366B75378C3889b52331
18306A42611a13996A20222a31268D1714a44213B34453k7819b66878a23633j00113
18296b23746b2198Q709H0381J117b53068I1415a51729B11794I0757A900J17732
$$ y = [52911, 72231, -103622, 206492, 43070, -184861, -208134, 101826, -14904, 30756, 155161, -201584, 179594, 32523, -180700, 53199, -178858, -54071, 90899, -220707, -45333, -26676, -30685, 55273, -304025, -36493, 152074, 44282, -194072, 133178, 171953, -237148, 160314, -187234, -87091, -266311, 10633, 133621, -433812, -296991, -147171, 82397, -136299, -164343, -85076, 374206, -48923, -417270, -126223, -215782, -259454, -4959, 26642, -404323, -40371, -2496, -72839, -68203, -295401, -101744, -76880, -84269, 11189, -128082, -126108, -177554, -131188, 275378, 33889, -252331, 142611, -113996, 120222, -131268, 41714, -144213, 234453, 206634, -266878, -123633, -223746, -22198, -13489, 80381, 81498, -253068, 91415, -151729, 211794, 90757, 1900, 119632]
18285A19632b2190k12734B57192b21917h6000A82530E8506L0714a61643C17233
18274A5139b0708F5692C0916J11725m3040Q2725K8138c23293J45900f5456B7920
18262a3792j99570A72557h3942A69029h6974C2834K39286l377m2571b09021l8808
18251b47829O1951g6637A78728c16437A79348E9186a54404K2506k5810E1268c1808
18239a00243d9970A66879a16105j17056G1889c8006A78040m1876h7937I4572a52458
18227C6018q919a75369O5499o9973m9415A3276M9542a94401D6017a60437j88771
18216c49208J50819j08757l837b9177E89672B20809a87687N73R0595k02377e3703
18204a90417n9874A69040b914k1121I5717A0862e5936B15681a30533I7047b31562
$$ y = [119632, -22190, -234924, 257192, -221917, -86000, 182530, 58506, 89220, -161643, 317233, 15139, -20708, 65692, 30916, 142641, 99601, 182326, 210464, -323293, -177393, -65456, 27920, -13792, -213362, 172557, -83942, 169029, -86974, 32834, 272120, 268743, 226172, -209021, -247829, -185878, -76637, 178728, -316437, 179348, 59186, -154404, -131898, -157708, 51268, -31808, -100243, -49970, 166879, -116105, -233161, 71889, -38006, 178040, 136164, -87937, 94572, -152458, 36018, 27099, -175369, -109870, -179843, -229258, 13276, 62818, -194401, 46017, -160437, -349208, -198389, -307146, -310983, -29177, 589672, 220809, -187687, -187114, -96519, -298896, -53703, -190417, -250291, 169040, -2914, -24035, 95717, 10862, -55936, 215681, -130533, 97047, -231562]
18192a83130E0887a68433f5269E9236N4112c11710e6749H8165e36525A8729J84003
18181B02732f3591k92221a05655A80632a30095J8286b9520A0009d2696H7928J58476
18170B46404b57373A2031d0229j91027F0480J28780b55488H4030K64377C3510
18159A0147h3266A21108J80983a07273b1728B41648j17551a54134e9891M281k28324
18148b83934a32834j5283K5058E5318a7956n7262k28534d4798E1993g3507A25904
18136D0371J85178b04869H0737c4837p0942n1328B07189a64783b0161n696E8346
18124B9268c9532r6716J067M6544b0245k36169e6592o2638j92407J32664n3525
18113b32498C6720a10686p2681b9521B4439M0134N9033M8434A4290J1665a79378
$$ y = [-183130, 50887, -168433, -65269, 59236, 113348, -311710, -56749, 88165, -536525, 18729, 202732, -63591, -355812, -105655, 180632, -130095, -111809, -29520, 10009, -42696, 87928, 246404, -257373, 12031, -40229, -231256, 60480, 189260, -255488, 84030, 348407, 33510, 10147, -83266, 121108, 302091, -107273, -21728, 241648, 124097, -154134, -59891, -55610, -283934, -132834, -148117, -123059, 55318, -17956, -75218, -303752, -44798, 51993, -73507, 125904, 40371, 225549, -204869, 80737, -34837, -105779, -157107, 207189, -164783, -20161, -25857, 58346, 29268, -39532, -136248, -135181, -88637, -20245, -256414, -56592, -119230, -311637, -178973, -232498, 36720, -110686, -183367, -29521, 24439, 64573, 123606, 172040, 14290, 25955, -179378]
18101A4726b77173F776d574A9792d1016j14583A19918b65357I943a79731A59149
18089b5489A32287g3749q2373B26642d91388a6189j53880g0575j62786A00612
18078c094B61513b62109b3310B55486i134A6326K6761f7470A0065R0325a27326
18066B89460A38379E2379d74k59953d2227p1542l3067a1707J453j05640A76643
18054c5219B351b65080P4975d0582a8364l19016R6450A55072o5424J3624B7593
18042A35141a58420E9335a4855j11582M3670k01716J38326J151n3455A45265h7434
18030a75361F5955K3966L6962c71440B07793b30159A84962f9441a8885F8319d4494
18018C0524e0761B68655b34279A10311b6768p1546E3208K6333g1173C05397b15214
$$ y = [14726, -277173, 6776, -4574, 19792, -41016, -155599, 119918, -265357, 9943, -179731, 159149, -25489, 132287, -73749, -156122, 226642, -491388, -16189, -170069, -70575, -233361, 100612, -3094, 261513, -262109, -23310, 255486, -9134, 16326, 43087, -67470, 10065, 100390, -127326, 289460, 138379, 52379, -474, -260427, -42227, -113769, -146836, -11707, -10254, -115894, 176643, -35219, 2351, -265080, -190105, -40582, -18364, -337380, -240930, 155072, 89648, 103272, 27593, 135141, -158420, 59335, -14855, -126437, -82767, -284483, -146157, -145006, -198461, 145265, -87434, -175361, 65955, 89921, 126883, -371440, 207793, -230159, 184962, -69441, -18885, 68319, -44494, 30524, -50761, 268655, -234279, 110311, -26768, -98314, 53208, 79541, -71173, 305397, -215214]
18006b50999B39026C3656b9488o3915C9522a54834A75L7157K05287F8259b18864
17994a19952A95923H0866a30591A10433C3390O9484O5663a8181A76241f0167E8559
17982i7693K242B43529M3763d1433g973j9661j84964K1717a8581J959j95071E6366
17969a66537m0222A63490b28432G3524d19786J62572J18542j09476P9157H0640
17958b46371A58542d8227I4806b06095a00023j2399r8516p3925D42929k14844
17948B28085J05860b9171o0072B01031D8861a66952A13337a5884k6786k78730
17938c21400B82097a33148F9418a69392L6453o0868D31858i0688A32174a82589
17927a75627B43700G0456j5347J16025b81813e3064K66I5100J16260D7185f2548
$$ y = [-250999, 239026, 33656, -29488, -93403, 39522, -154834, 175, 37332, 242619, 68259, -218864, -119952, 195923, 80866, -130591, 110433, 33390, 102874, 168537, -18181, 176241, -60167, 58559, -97693, -95451, 243529, 287292, -41433, -7973, -27634, -212598, -190881, -18581, -16622, -211693, 56366, -166537, -206759, 163490, -228432, 73524, -419786, -257214, -138672, -248148, -168991, 80640, -246371, 158542, -48227, 94806, -206095, -100023, -112422, -210938, -284863, 442929, 228085, 333945, -29171, -89243, 201031, 48861, -166952, 113337, -15884, -42670, -321400, 282097, -133148, 69418, -169392, -132939, -193807, 431858, -90688, 132174, -182589, -175627, 243700, 70456, 55109, 171134, -281813, -53064, -52798, 95100, 211360, 47185, -62548]
17915B19R7862J60487j09265C8999i139k01436B21180L7649H7284a99889j03478
17904c03367A07373l4181d5336o1495m5607j47545J30368k6204f3184k84470J67163
17893a80491G6440d206A42121J0342a11833K3103A9197b43887j64612h5343m2473
17882a27816b4132H344g9655k32884C60703A41776P9364A5213K08410b08261C09082
17870H2233f3262F848a83811M1687o2886B18844a64877l6997B0581a47296H0109
17858h8152A39610i5753B71482b73105a3921j12650A63867i8263E6952J16a76938
17846a6610B13521A5187G192c6020A78583E2585a51513l4628A81507G5515a6984
17834A04522n1663d1702k77589a02718B52015b69238A84173d45103a87115b9384
$$ y = [219, 98081, 258568, 149303, 38999, -9139, -210575, 221180, 258829, 87284, -199889, -303367, 107373, 73192, -45336, -106831, -152438, -299983, -169615, -195819, -63184, -347654, -180491, 76440, -4206, 142121, 152463, -111833, -88730, 19197, -243887, -408499, -85343, -127816, -24132, 8344, -79655, -312539, 360703, 141776, 221140, 15213, 223623, -208261, 309082, 82233, -63262, 6848, -183811, -142124, -205010, 218844, -164877, -201874, 20581, -147296, 80109, -88152, 139610, -95753, 271482, -273105, -13921, -126571, 163867, -98263, 56952, 57068, -176938, -16610, 213521, 15187, 7192, -36020, 178583, 52585, -151513, -186141, 181507, 75515, -16984, 104522, 52859, -41702, -319291, -102718, 252015, -269238, 184173, -445103, -187115, -29384]
17823a36504e8261b286A50270b49890i2824G2003a15290B06078p4555E0128d0701
17811I110M04212A02577a07144M1601c25E5114b09529L8812B43035A5688J60046
17800A75734d9493B2566Q3624m2865M8080k9477N8941P2113K2090A08820J0075
17789A18895L0582a41119A42021a03385j6519B13707E7041e1286j52662h0379
17778B41383k1502a43229B71006C8129a33440f3985b4822A76737l3803m8517a76587
17766d6258l4299r7132b5381B18254A03500N7518g1706D25148G1089L7505f9817
17754A46760b67674j54035a24278A2465e332k12422f0628P995l95658C0350a4771
17742b08721L0365A50264a89693N7398b8886C26310B8249K43868g5267B38138
$$ y = [-136504, -58261, -2286, 150270, -249890, -92824, 72003, -115290, 206078, 131523, 50128, -40701, 9110, 413322, 102577, -107144, -65543, -325, 55114, -209529, -170717, 243035, 15688, 175734, -49493, 22566, 106190, 63325, 111405, 81928, 140869, 212982, 235072, 108820, 118895, 149477, -141119, 142021, -103385, -119904, 213707, 57041, -51286, -203948, -80379, 241383, 219881, -143229, 271006, 38129, -133440, -63985, -24822, 176737, 142934, 94417, -176587, -46258, -80557, -177689, -25381, 218254, 103500, 161018, -71706, 425148, 71089, 108594, -69817, 146760, -267674, -421709, -124278, 12465, -5332, -217754, -60628, -52633, -448291, 30350, -14771, -208721, -178356, 150264, -189693, -132295, -28886, 326310, 28249, 272117, -75267, 238138]
17731a15285A28231Q974R0674H0208k5192G11J53034d6451p4428O628L4652m9892
17719a29491j59907A55160g5517k357p5812F0591J41204E805a33209j797E7426
17707A44418I235a09028j13732B9992d3515B17184M2078F3589c1228A00019i2666
17695C1883j5828J61382a52812D31642g7776n6670j57128D516K41498b48352a21177
17683B1999K7629Q4187a99536j29662h4808c1546d484C0723a67363A93152B469
17671i8775c0461D0466f8421n6172P169c7331B20g8634H5355J64945g0126C798
17658a05391F4437a0960D3845O8006A2808a49884a7935q1425E1438b43799k430
17647b46229G5793B9740i3745A22774b07050A39306m2931e5375j55594B27287
$$ y = [-115285, 128231, 137205, 227879, 80208, 55016, 711, 153745, -46451, -120879, -114251, -79599, -129491, -289398, 155160, -75517, -77874, -153686, 60591, 201795, 5805, -133209, -135006, 57426, 144418, 9235, -109028, -222760, 29992, -43515, 217184, 259262, 63589, -31228, 100019, -92666, 31883, 16055, 177437, -152812, 431642, -77776, -134446, -291574, 4516, 246014, -248352, -121177, 21999, 49628, 133815, -199536, -329198, -84808, -31546, -4484, 30723, -167363, 193152, 2469, -98775, -30461, 40466, -68421, -124593, -117424, -37331, 220, -78634, 85355, 250300, -70126, 3798, -105391, 64437, -10960, 43845, 111851, 12808, -149884, -17935, -99360, 51438, -243799, -246229, 75793, 29740, -93745, 122774, -207050, 139306, 96375, -55375, -210969, 227287]
17636a06984D4833b66188Q4585e994p1898H4084g2702A61999b13518G8616N9542
17625A38158A5399a56413B63887e7436n1851j9916O0176B2758K4172K15946D1586
17613c85021B0552K11099a01797F8585A3182a8166q6786a0150A38816b2567p979
17602c0546C20691a6943E86036H2838b43950n8956B75370d7986C43799b42957
17591A62996B4981J49228K6096K5549a47585e8457A33765F234M9473O8441j9399
17580A04749a75019A72670a69707a525B16507B2995c8536A09618j3507c12345
17569A53430g1927A49616J08241M3652b5885B76882A23566a49187I191J48412
17559A57603a92069e538A23908a6106H0319i7367I0434a07673a5385C6204J55877
$$ y = [-106984, 44833, -266188, -181603, -5994, -77892, 84084, -72702, 161999, -213518, 78616, 138158, 15399, -156413, 263887, -57436, -109287, -129203, -69027, 22758, 46930, 262876, 41586, -385021, 20552, 231651, -101797, 68585, 13182, -18166, -104952, -10150, 138816, -22567, -30546, 320691, -16943, 586036, 82838, -243950, -302906, 275370, -47986, 343799, -242957, 162996, 24981, 174209, 200305, 225854, -147585, -58457, 133765, 6234, 55707, 124148, 104749, -175019, 172670, -169707, -1525, 216507, 22995, -38536, 109618, 96111, -312345, 153430, -71927, 149616, 257857, 301509, -25885, 276882, 123566, -149187, 9191, 157603, -192069, -5538, 123908, -16106, 80319, -97367, 90434, -107673, -15385, 36204, 192081]
17548A92081C6127L5551b04646C95826b12769i1606b0143j98796C3958b3450j29011
17537a52461l2069B50804a85259E7655a08049j17316o2300c0152F4183a84180
17526B64408j23436a48433B31631L354L195g9697b9116l20k3768F5120P6307l9668
17514A01759A6474J28416K5782K6245b66877d7207F3816n293a24813I3965J01639
17503A95604E4801D545J21974M3571B1908K63106q7248G0152k4137L1125J11546
17492A88686r0367D8000b43426G7698C5137d37252B19468a36708A87753e5222
17481A64210E493i4090r7263A38453a85910A27857m6055a86099I521J99546a76105
17469B69629L5270j05931n6318a2677I9481Q0413G6942Q8539K1927N9817J71978
$$ y = [192081, 36127, 71678, -204646, 395826, -212769, -91606, -20143, -218939, 33958, -23450, -152461, -184530, 250804, -185259, 57655, -108049, -225365, -287665, -30152, 64183, -184180, 264408, 140972, -148433, 231631, 234985, 238180, -79697, -29116, -29436, -53204, 65120, 141427, 101759, 16474, 144890, 170672, 196917, -266877, -47207, 63816, 58523, -124813, 93965, 195604, 54801, 4545, 126519, 170090, 21908, 285014, 197766, 70152, 46015, 77140, 188686, 98319, 48000, -243426, 77698, 35137, -437252, 219468, -136708, 187753, -55222, 164210, 5493, -94090, -191353, 138453, -185910, 127857, 81802, -186099, 9521, 209067, -176105, 269629, 304899, 198968, 142650, -12677, 99481, 179894, 76942, 165481, 187408, 247225, 419203]
17458D19203E0339C005K76859A11731a66619G474L49281A30614a79692B55945
17447E14496k43221E4767h1093C6821M2585a97587A66305J7739K62580j94027
17437B52597K89898b10113A3242b8621D12469A52198J55695e7798D02880j94949
17427B07931J04193J99016H4602K13901F2435J69970n4858n5004J68637j8624
17417B72556j27585J6802f8815C00186E8229N9646O7959J03500A16086K23796
17407C39882q8532J86173D8039L2120a56073c541A55786l1865M1633L5034J3928
17396B14516n4696J02609J30266b14192B48181I2058P0433G3468J37624a01381
17385F8112a74715B46689b3966C7787L92329h0472A46479O4554C2795J60233L91450
$$ y = [419203, 50339, 3005, 279864, 111731, -166619, 7474, 356755, 130614, -179692, 255945, 514496, 271275, 54767, -81093, 36821, 79406, -197587, 166305, 184044, 446624, 252597, 542495, -210113, 13242, -28621, 412469, 152198, 307893, -57798, 402880, 207931, 312124, 511140, 84602, 298503, 62435, 232405, 177547, 122543, 291180, 272556, 144971, 161773, -68815, 300186, 58229, 117875, 185834, 289334, 116086, 339882, 251350, 437523, 48039, 80159, -156073, -3541, 155786, 123921, 165554, 200588, 214516, 159820, 262429, 392695, -214192, 248181, 92058, 162491, 73468, 211092, -101381, 68112, -174715, 246689, -23966, 37787, 430116, -80472, 146479, 211033, 32795, 193028, 584478]
17374E84478A74265J36767N728J2351A8080J50490O051J76762j72725J45377M6266
17363C70301b9505o367n1850A55470Q6666K18609a41956A48044Q7937J50157A36941
17351B42654n8141f8531j28951B47406A9267K0136L28453G1085P9822d2695F3794
17339a37586F0839L17214A27567K84271a50438I2907a22876d621A87594J31053
17329C18647a8144D8060P9884K2059F8122J60865q5207e1470F9436J26598j4077
17318A81957A8420P6934g3081A12318b1149j87691B77614p3004r4262a8669B73804
17306D16097j35449J13369j72509Q3540A16097a92031D34897b9882k20355A3650
17295C10323j37996J44494A20623c2445o5295H7798a4002B20353K4969j05799
$$ y = [584478, 174265, 311032, 316760, 329111, 18080, 168570, 174621, 351383, 178658, 324035, 370301, -29505, -35872, -87722, 155470, 242136, 460745, -141956, 148044, 235981, 386138, 136941, 242654, 184513, -68531, -197482, 247406, 19267, 39403, 367856, 71085, 150907, -42695, 63794, -137586, 60839, 378053, 127567, 411838, -150438, 92907, -122876, -4621, 187594, 318647, -18144, 48060, 127944, 150003, 68122, 228987, 143780, -51470, 69436, 196034, 181957, 18420, 95354, -73081, 112318, -21149, -208840, 277614, 204610, 110348, -18669, 273804, 416097, 280648, 394017, 221508, 305048, 116097, -192031, 434897, -29882, -250237, 13650, 310323, 172327, 316821, 120623, -32445, -97740, 87798, -14002, 220353, 245322, 139523]
17285A39523A4656d9470A21285J1027n9676g2175A59313a48536c6604E2731N2507
17274A05238l2770E999R3466D0659J62237I1221b48711C14418b38545i0920o6003
17263a56923B11372c4296B34447e8151A32377K36844A16014B5977L12987B7775
17252A93086L46969c7712p330B98417j19757J55618H3756L1545O4893K81222A89605
17240D18977e7983B18921Q3509m3676j26103L15172A84386D3651K32976C0847
17229A68787N1613O8104L3013j60003K59500J88551B81639F958J41889J23160
17219B72007a86493B97627k9273J07734j63545F3602K86710C3653M89319n8700
17209D64272j13375E5062K09705a47031M3986B79606o720k1307G7169J3559a7098
$$ y = [139523, 14656, -49470, 121285, 132312, 72636, -72175, 159313, -148536, -36604, 52731, 105238, 72468, 5999, 99465, 40659, 202896, 91221, -248711, 314418, -238545, -90920, -156923, 211372, -34296, 234447, -58151, 132377, 369221, 116014, 25977, 338964, 27775, 193086, 540055, -37712, -45042, 298417, 178660, 334278, 83756, 115301, 180194, 461416, 189605, 418977, -57983, 218921, 302430, 258754, 132651, 447823, 184386, 43651, 276627, 30847, 168787, 220400, 288504, 321517, 161514, 421014, 609565, 281639, 6958, 148847, 272007, -186493, 297627, 268354, 376088, 212543, 63602, 350312, 33653, 522972, 464272, 350897, 55062, 264767, -147031, -103045, 279606, 272886, 251579, 77169, 90728, -17098]
17197a16578A95479e7261G8305k1485M23727k6547B26372M43732A80167D0888
17186D25716b6250B61340n7305K621F3433N2367a47656A99493I253K40935I9109
17174A72450k9570A5300M47840h6370C42892a3846C73686o4251A24578O7217J41743
17163C33538J52187B11829R4237j39225k2029R9588c389m2476A1530K2737a28407
17151A54808F7256O5679K8343L48275j90075m9761o5588J76510a27495L4801A61004
17139C24752K36544F5599N00796l7778k37822K72911A53588J32447p7461p0169
17129A38405L49394A1345L96098q114p7948A34438a2920A66777J71334A03975
17118B96494i4415C14655j55733K08250A83404L20411k06828H1362K37604f6853
$$ y = [-116578, 195479, -57261, 78305, 56820, 480547, 454000, 226372, 670104, 180167, 40888, 425716, -26250, 261340, 204035, 206656, 63433, 115800, -147656, 199493, 9253, 250188, 99109, 172450, 142880, 15300, 463140, -86370, 342892, -13846, 373686, 309435, 124578, 191795, 333538, 485725, 211829, 306066, 166841, 144812, 244400, -3389, -45865, 11530, 34267, -128407, 154808, 67256, 132935, 161278, 509553, 319478, 269717, 204129, 380639, -127495, -92694, 161004, 324752, 561296, 65599, 566395, 528617, 290795, 563706, 153588, 286035, 208574, 138405, 487799, 11345, 407443, 399329, 321381, 134438, -12920, 166777, 338111, 103975, 296494, -94415, 314655, 158922, 367172, 183404, 503815, 296987, 81362, 318966, -66853]
17107D83164K00093B73464p3669J54288J16073c7071B28455K84761K7588B56222
17096A83581q5058J93815H1855L09778O4327A08802J17312K1081J28686G0103
17085C08729J43725j0322k20936k0800B8809N42517A94588N8810j1836K16537
17075D58099K6967A35394Q1523m9688o2313b98735A77932K22378L5960j81238
17065B55032L15867o0078j94677l472J03853M3405A43528K51535J68439Q7896
17055F51398H8670K12507j33398R0730N276K04369j638B15617K49488K14525B06136
17043F36734L488j14613n7243N2353A95853J9216J94830J39330m9438n99j75369
17032C23823J49366L65846C36842K06885n0495j32216j30340M85500A86392K86366
$$ y = [483164, 683257, 273464, 199795, 354083, 470156, -37071, 228455, 513216, 540804, 256222, 183581, 98523, 292338, 81855, 391633, 455960, 108802, 226114, 247195, 375881, 70103, 308729, 452454, 442132, 221196, 200396, 28809, 571326, 194588, 253398, 241562, 458099, 485066, 135394, 216917, 167229, 104916, -298735, 177932, 400310, 436270, 255032, 570899, 510821, 316144, 312672, 416525, 459930, 143528, 395063, 563502, 651398, 88670, 301177, 167779, 258509, 263785, 468154, 466516, 215617, 465105, 679630, 206136, 636734, 640222, 525609, 468366, 520719, 195853, 215069, 409899, 549229, 499791, 499192, 323823, 473189, 839035, 336842, 543727, 493232, 361016, 230676, 716176, 186392, 472758]
17022D72758j67676J60013j7182K61557k62738J30282B43607J05390K20568q3832
17012D85733k7021K03146j13126R3760k33632J44664k40430K9729L16585Q8027
17002G47435C37819M28162l49135P1401P498M8085n4048K3106j52962P8947M33344
16991H72217j35078j16828j33191j55338K46019j24340L6350M95605j87382C85282
16980G14962L8577J83988l87768K352m9177K23296r451o4489j9539j76409N31679
16969I88021l50772C14253L48267l7076J67117N2587l15759k4887L43275k05212
16959F42565K73854n1929J27169j01507J11152k21802q4133j44796K82571J32237
16949I65381m9168l46276J61426J10426k33662L5910M43166l46287Q8648K0888
$$ y = [472758, 305082, 465095, 447913, 709470, 446732, 577014, 243607, 348997, 569565, 485733, 458712, 661858, 548732, 642492, 408860, 553524, 313094, 342823, 659408, 747435, 337819, 765981, 416846, 488247, 495745, 543830, 489782, 512888, 359926, 438873, 872217, 737139, 620311, 487120, 331782, 577801, 453461, 489811, 985416, 798034, 385282, 714962, 753539, 937527, 549759, 552111, 502934, 726230, 716779, 652290, 632751, 456342, 988021, 637249, 314253, 662520, 625444, 792561, 845148, 529389, 504502, 847777, 642565, 916419, 864490, 991659, 890152, 1001304, 779502, 695369, 550573, 833144, 965381, 916213, 569937, 731363, 841789, 608127, 644037, 1087203, 740916, 829564, 850452]
16939H50452L65050m10746J19687j23674J34859J34481n5388r2232L2736k15775
16929G39450J71357L68011k10058k96735O37001o47045M21473j91852K04413k47039
16919I48976J15363K23597j82858J76324o11148L00685L56625N5038k5211J3379
16909A370770j59124R3989q2922L77878k83672J27489j0241K50705o10125L07509
16899A382256j78980J4967l4317L23998J40076l74996k16866M88687j97548J71930
16889A519207O9611m3427p6049J48881j43126J83295M1611K59497l55100p8892
16879A525508J55642K90109l72948N68565j45921k39748K87108l90888J84113
16870A861540J51207R549j47543R0575P7349r9558K7106K84047j68381L16794
$$ y = [850452, 1215502, 804756, 924443, 800769, 935628, 1070109, 1014721, 922489, 955225, 739450, 910807, 1278818, 1068760, 772025, 1409026, 761981, 1183454, 991602, 1196015, 948976, 1064339, 1287936, 1105078, 1281402, 670254, 970939, 1327564, 1382602, 1357391, 1370770, 1211646, 1305635, 1222713, 1600591, 1316919, 1444408, 1434167, 1684872, 1074747, 1382256, 1203276, 1218243, 1183926, 1507924, 1648000, 1273004, 1056138, 1544825, 1347277, 1519207, 1588818, 1545391, 1469342, 1618223, 1475097, 1658392, 1700003, 1959500, 1604400, 1525508, 1681150, 1971259, 1598311, 2166876, 2020955, 1781207, 2068315, 1677427, 1861540, 2012747, 2022296, 1874753, 1965328, 2042677, 1943119, 1970225, 2254272, 2085891, 2402685]
16860B402685o4383j43345K99424k1504j72430N0864J26999J89112k44648j14922
16850B307852J97624L37816j45208Q4653q2731K1546J77913j07665K38263l59920
16840B670143K39877K29098Q8923k45315N2922L96834j92203R323J10643L02132
16830C662377k25672L9374J77284k87358M02854j9351J47640J38319R4494K8197
16820D158158K13850J18991q985K71985k6292J43565j47106L34384m8078K1488
16810E031960L36721K9928j93903N43010L23141l72312L48707K45059j09190j0930
16800F172191K59333P3659J18462K26273k7236K70150L81700k88525R72509k84840
16790G873676N44849J3301J80245L95140K09039J95934N11775K74008J73793K30415
$$ y = [2402685, 2338302, 2194957, 2494381, 2472877, 2300447, 2351311, 2478310, 2667422, 2422774, 2307852, 2505476, 2843292, 2698084, 2782737, 2700006, 2721552, 2899465, 2791800, 3030063, 2670143, 2910020, 3139118, 3228041, 2982726, 3035648, 3432482, 3240279, 3249602, 3360245, 3662377, 3436705, 3476079, 3653363, 3366005, 3768859, 3749508, 3897148, 4035467, 4129961, 4158158, 4372008, 4490999, 4482014, 4753999, 4727707, 4871272, 4724166, 5058550, 5010472, 5031960, 5368681, 5398609, 5204706, 5747716, 6070857, 5698545, 6047252, 6292311, 6183121, 6172191, 6431524, 6505183, 6623645, 6849918, 6822682, 7092832, 7474532, 7186007, 8158516, 7873676, 8418525, 8431826, 8612071, 9007211, 9216250, 9412184, 9923959, 10197967, 10371760, 10602175]
16780A0602175O72737K02317K03749L49298K76912P06570N78239O17584K97848
16771A4507429L20586L01350P93981N44462O42945M84079R55931K90200J331259
16762B0172222M72725P45508Q63060J000777J201923Q88205J219762J336588J072570
16753B8973340J489924J616214J357729J753872J945129J823916K168426K105120
16745D3233670K464248K549246L126544K653246L815198L349825L855102L705365
16737F8752444M677826M869792N280611N549874N657923O413104P040427O389928
16729A14631929P719610P375700P759865Q043014P330672P345392O905587N797990
16721A72909759N385851L324856K316863J413612q73610j588820l278883m371866
$$ y = [10602175, 11274912, 11477229, 11680978, 12030276, 12307188, 13013758, 13591997, 14209581, 14507429, 14828015, 15129365, 15923346, 16467808, 17110753, 17594832, 18550763, 18840963, 20172222, 20644947, 21390455, 22253515, 23254292, 24456215, 25344420, 26564182, 27900770, 28973340, 30463264, 32079478, 33437207, 35191079, 37136208, 38960124, 41128550, 43233670, 45697918, 48247164, 51373708, 54026954, 57842152, 61191977, 65047079, 68752444, 73430270, 78300062, 83580673, 89130547, 94788470, 101201574, 108242001, 114631929, 122351539, 129727239, 137487104, 145530118, 152860790, 160206182, 167111769, 172909759, 178295610, 181620466, 183937329, 185350941, 184477331, 182888511, 179609628, 175237762]
16713A75237762n618497o331210p063695p845179p608430p733333p690336p430015
16705A17917067p462233o821445o379104o264130o053497n157124m720351m905025
16697G0154158m251035m201990l496645l748649k638585l128030k873809k500170
16689D3315245k220906k773854j559639j810139k147325j783889j040461j645846
16681B8333186j278725j231952j265268q11913j058084j100822o81584j179992
16673A9724846r61508n64586p07009m77221p77929o52783m58637n47428p17122
16664A3860623j44154m67540o91352k17786k48430n84758m86945l36478l61266
16655A0321914m23832k63406k90405j35097l00205j44406l78633O312k36607Q6376
$$ y = [175237762, 169619265, 163288055, 156224360, 148379181, 140770751, 133037418, 125347082, 117917067, 110454834, 103633389, 97254285, 90990155, 84936658, 79779534, 75059183, 70154158, 65903123, 61701133, 58204488, 54455839, 51817254, 48689224, 45815415, 43315245, 41094339, 38320485, 36760846, 34950707, 32803382, 31019493, 29979032, 28333186, 27054461, 25822509, 24557241, 23745328, 22687244, 21586422, 20904838, 19724846, 18763338, 18198752, 17491743, 17014522, 16236593, 15583810, 15125173, 14577745, 13860623, 13716469, 13248929, 12557577, 12339791, 12091361, 11506603, 11019658, 10683180, 10321914, 9898082, 9634676, 9344271, 9209174, 8908969, 8764563, 8385930, 8392242, 8155635, 8242011]
16645H242011n99431k51445k70798q5941o41681L44372j66067k03567n24279L05100
16635F148274k09323K37675o18434j11468k28599j16134k90199M63653l93718
16626D881727k6918m5153k15775k21955k54637J69495L2123q2780k17114k09047
16616C809966j80976j06342p014l2664j63667j09868O6832M9828o0775l0125j97639
16605C037556o0048q8339j32467L73516m43736M18576l91010J22846k99911L24108
16595B861091l05862j06297p714O7201k46776J85797N9300j15354P0097l13094
16585B148389J9433j27405M7079j78963n0502L35611k19982j6283P4394P4050
16575B105821j28855j98937j32528m1450L68288k24139M14310l16550l98339M76487
$$ y = [8242011, 7642580, 7391135, 7120337, 7034396, 6392715, 6737087, 6571020, 6367453, 5843174, 6148274, 5938951, 6176626, 5558192, 5446724, 5218125, 5101991, 4811792, 5275445, 4881727, 4854809, 4809656, 4593881, 4371926, 4117289, 4286784, 4318907, 4236127, 4019013, 3809966, 3628990, 3522648, 3515634, 3482970, 3319303, 3209435, 3276267, 3326095, 3265320, 3235195, 3037556, 2977508, 2889169, 2756702, 3130218, 2686482, 3105058, 2714048, 2836894, 2536983, 2861091, 2555229, 2448932, 2441218, 2508419, 2261643, 2447440, 2506740, 2391386, 2461483, 2148389, 2167822, 2040417, 2087496, 1908533, 1858031, 2193642, 1973660, 1957377, 2031771, 2105821, 1976966, 1778029, 1645501, 1604051, 1972339, 1748200, 2162510, 1845960, 1447621, 1924108]
16565A924108m27273O8610l70766L20507k0925J03298j15212J80257k74444J64202
16555A552362k22074K44339O7844j14518o0322n32849L25113K06919j45023k373
16545A319418J54902j86872l0544j6319q074p5003j89952J28626J33462j66719
16535A062925l87686M08510Q7736m9307Q7029l74494L60706k52354p2944K43509
16525A113630K03169j19889j67171j73489L4883n2823j8834q956n2242N2300O01461
16514A412039n56428j4051K63270l73068K17639k66960J68779L600J85916l57843
16504F82893P5492M9622C49985K34055L476J41867J58823L216o9006p4738n9725
16493F87953N1968J21651q0241Q636k36907L63899k10023J91991k80997K16040
$$ y = [1924108, 1496835, 1565445, 1194679, 1515186, 1494261, 1597559, 1482347, 1662604, 1388160, 1552362, 1330288, 1574627, 1642471, 1527953, 1467631, 934782, 1259895, 1466814, 1321791, 1319418, 1474320, 1287448, 1256904, 1240585, 1232511, 1157508, 967556, 1096182, 1229644, 1062925, 675239, 1083749, 1171485, 1122178, 1209207, 834713, 1195419, 943065, 870121, 1113630, 1316799, 1196910, 1029739, 856250, 891133, 838310, 819476, 810520, 758278, 810578, 1412039, 855611, 841560, 1104830, 731762, 949401, 682441, 851220, 854820, 1040736, 682893, 758385, 808007, 349985, 584040, 587516, 729383, 888206, 891422, 822416, 747678, 687953, 739921, 861572, 781331, 789967, 553060, 916959, 706936, 898927, 617930, 833970]
16483H33970l67084J30568l0524N2097r588r871J63462j13379k30257K98599n2702
16472F65291j57747r3562L51671j80554J13012l02150J54507k48865K27079J8986
16462E47668r2944O1099j550K43542B09965L08145N964j4631L00856C87492J2847
16451D00339L3574j29336K49390R4312G7198P19929l84180I0130J67386K26409
16441D83925j43429M98929D05399Q4535k02457M72587k69065k06328q2748n0081
16431A51842N49217k60125j48053J96208j70593L4962j16381K31512j32110J07694
16421D44173n3516n2406j58152E2372L18548J93601M7315B39843A1718N03129
16411E14847A72333J85603j48676Q1404J51526J31716A71594j2615M37364B21263
$$ y = [833970, 466886, 597454, 566930, 619027, 609439, 599568, 763030, 649651, 419394, 717993, 665291, 507544, 413982, 765653, 585099, 698111, 395961, 550468, 301603, 528682, 547668, 454724, 515823, 514273, 757815, 209965, 518110, 524074, 509443, 810299, 387492, 400339, 433913, 304577, 553967, 648279, 77198, 797127, 412947, 90130, 257516, 483925, 340496, 839425, 405399, 489934, 287477, 760064, 490999, 284671, 201923, 151842, 701059, 440934, 292881, 489089, 318496, 353458, 237077, 468589, 336479, 444173, 390657, 338251, 180099, 52372, 370920, 564521, 611836, 239843, 11718, 514847, 172333, 357936, 209260, 290664, 442190, 573906, 171594, 158979, 596343, 221263]
16400D44430b5372C16562L5265G2266L73737j07905p0576N5219J66043O1238j82334
16389C67688p4572F4216J71082r4564R9808K18649q5471m5563A35353O3680J92400
16378C91433j17111A08a77096G39885A39275b26C88380A55604N428L17931k31404
16367B47559M7990K14508A43140K33525K52464A53255M63158A14355J23069J79953
16357D17377j14989C4394M5750L00113j59266o2258D7067j0622b5270C6087L8458
16346G4545K52848j20242K33840B08563J75613A78703Q1548j25937P0561Q1755
16336B86630M9158G1174K11875L2615L212A09763a91955D07729A25115n4759g4346
16324B47180I3465K52040K0174A23510J01724J94802A78269L5092E1098L75156
$$ y = [444430, -25372, 316562, 351827, 72266, 446003, 338098, 267522, 322741, 488784, 550022, 367688, 293116, 64216, 235298, 140734, 240542, 459191, 373720, 328157, 135353, 199033, 391433, 274322, 108, -177096, 739885, 139275, -226, 388380, 155604, 161032, 478963, 247559, 295549, 510057, 143140, 376665, 629129, 153255, 616413, 114355, 237424, 417377, 302388, 34394, 80144, 380257, 220991, 158733, 47067, 36445, -25270, 36087, 74545, 327393, 207151, 440991, 208563, 384176, 178703, 260251, 134314, 204875, 286630, 335788, 71174, 283049, 315664, 318876, 109763, -191955, 407729, 125115, 70356, -74346, 247180, 93465, 345505, 365679, 123510, 225234, 420036, 178269, 213361, 51098, 426254]
16314D26254N1660k25635M7119J41701E9841J64042l9212J621J89813j35000f0235
16302A70057j4539J2850P07c47314J56478B19538q8969m2245i3722b6745B00207
16290B33944L04375A17712J16471b2272A94100J6696q7044e0881B09309J79985
16280C89294A87460k0090b96185E245J84653B5344K72668e7737D8896A3146K98138
16269C11284j02595B1084J81364J60896D0957K01051d9489n3128A35179M3116
16259A78295K4674a62830B45687a45171I6594j1445Q0454b13205A44061b1951
16248D59875A57705O7574K9069p0723D6509b48154A65222D4449K3781J72155j1944
16237B28441d7944A03183j5754K97972D1792L50594C9133f6988B31678A1758K27008
$$ y = [426254, 477914, 252279, 299398, 441099, 59841, 223883, 184671, 186292, 376105, 241105, -60235, 170057, 155518, 168368, 169075, -347314, -190836, 219538, 130569, 88324, -93722, -26745, 200207, 233944, 538319, 117712, 234183, -22272, 194100, 210796, 123752, -50881, 209309, 389294, 187460, 167370, -296185, 5245, 189898, 25344, 298012, -57737, 48896, 13146, 311284, 208689, 21084, 202448, 363344, 40957, 242008, -49489, -102617, 135179, 178295, 202969, -162830, 245687, -145171, 96594, 85149, 165603, -213205, 144061, -21951, 459875, 157705, 225279, 254348, 183625, 46509, -248154, 165222, 44449, 68230, 240385, 228441, -47944, 103183, 87429, 385401, 41792, 392386, 39133, -66988, 231678, 11758, 238766]
16226B38766c13940C8526O9955C0742a32897e2025C20235M515j40255B8850J86753
16215B15603R2139j34953l9547O728J08940R9786A41568l9496a34385e0270o6878
16204a17148c1944a3604j3467j79228C8566i0810q4085P5033B35278a21859D0462
16192B29900j6173a11562l3305r1791F765a00357B47910a83077A52331F8568a30583
16180C88806D2974L5489J09753F3126J81148A00825a55710A60338o1428l556I907
16168b86193c7902D85898b09396A87615E226b5055j95579C494J26463L3486d3507
16156B78434j4826j13390a33587d2185F6683O4644c62109J17834F8744b70294
16145A83438a40212A07006F671P7347h5080H2641J93047A33093a16622q0964O3262
$$ y = [238766, -313940, 38526, 108481, 30742, -132897, -52025, 320235, 324750, 184495, 28850, 215603, 307742, 172789, 133242, 139970, 248910, 348696, 141568, 102072, -134385, -50270, -117148, -31944, -13604, -27071, -206299, 38566, -90810, -174895, -99862, 235278, -121859, 40462, 229900, 213727, -111562, -144867, -236658, 6765, -100357, 247910, -183077, 152331, 68568, -130583, 388806, 42974, 78463, 188216, 63126, 244274, 100825, -155710, 160338, 98910, 95354, 9907, -286193, -37902, 485898, -209396, 187615, 5226, -25055, -220634, 3494, 129957, 163443, -43507, 278434, 263608, 150218, -133587, -42185, 66683, 131327, -362109, -244275, 68744, -270294, 183438, -140212, 107006, 6671, 84018, -85080, 82641, 275688, 133093, -116622, -197586, -134324]
16134a34324A003J19180l6930K79169A07937A7068J95132b41448B44508a85709
16123A44948J95558G5962Q9204J1548d9281F8007J26078b28382A64396q0825i3298
16111A78978B738J13927b75247J27980N1828B65012A14483i0o9798C43082Q7315
16100D30397D0882a03475j67319c6802N077j22145A58736m8498a4205H4030K37411
16089C21441o110A35468L8316b48196A80510b57789g4056D9678L7168b91500O8350
16078b23150H6849d7736j08572G7421c1003p4773A6175K75257a36901f1602j03188
16067a64790D3506a2951j96855D5658E427J28796K25925j58889B3140b62920Q6153
16056a76767B40166h9832q28F9043a21017o0681h1729D9025K65685j25074D8497
$$ y = [-134324, 1003, 120183, 83253, 362422, 107937, 17068, 212200, -241448, 244508, -185709, 144948, 340506, 75962, 165166, 176714, -49281, 68007, 194085, -228382, 164396, 83571, -93298, 178978, 2738, 116665, -275247, -147267, -95439, 265012, 114483, -90, -69888, 343082, 430397, 40882, -103475, -270794, -36802, -31725, -153870, 158736, 110238, -14205, 84030, 321441, 315331, 135468, 173784, -248196, 180510, -257789, -74056, 49678, 86846, -291500, -223150, 86849, -47736, -156308, 77421, -31003, -105776, 16175, 291432, -136901, -61602, -164790, 43506, -12951, -209806, 45658, 5427, 134223, 360148, 201259, 23140, -262920, -176767, 240166, -89832, -90660, 69043, -121017, -181698, -81729, 49025, 314710, 189636, 48497]
16044c3546j8281B28370a79011A03601a56863B093c91501J14660A642a13382k2280
16033a35662j22379B39146a36438d917r3434C23281c3066H7703M5608a78437M0521
16022a37916c5613G8081C5371a2422n800m5575F7006b35535I4559O4548l6596
16011A22511c6703l22210a2316C3323J23936m3361b75249b6224l53950a5441l82180
16000c97621i5691j69303l4215H7892O8524I974a41676A27603b51002a08017A68661
15988b5048D5223b08468k2472D61373A46567i5266A64054A9004P848M2685A3768
15976C6123J841N5016J42526a53794A50345f2595K0418C21996F0917E009a22234
15964g3829C4606a13839j53251b4294k7788H0491f9464o271A3236a02585H6867
$$ y = [-33546, -51827, 228370, -179011, 103601, -156863, 2093, -391501, -276841, 1642, -113382, -135662, -258041, 239146, -136438, -4917, -98351, 323281, -33066, 87703, 133311, -178437, -137916, -35613, 78081, 35371, -12422, -18222, -63797, 67006, -235535, 94559, 159107, 122511, -36703, -358913, -12316, 33323, 157259, 113898, -275249, -26224, -380174, -15441, -397621, -95691, -264994, -299209, 87892, 156416, 9974, -141676, 127603, -251002, -108017, 168661, -25048, 45223, -208468, -230940, 461373, 146567, -95266, 164054, 19004, 26852, 69537, 13768, 36123, 37964, 92980, 235506, -153794, 150345, -62595, -42177, 321996, 60917, 5009, -122234, -73829, 34606, -113839, -267090, -24294, -52082, 80491, -69464, -75735, 13236, -102585, 86867]
15952b62975J0784J10892A92835E5004h5523j4962F6358c52205J64036H5457N9869
15941A45326b17545j711g6103D1879A7314b42820A10656a84759G2129b86697A56422
15929B25561a95811f6652A2417K22239R3353H305P1730a05768Q662k83589J37822
15918b42873h5884A49179E7865N6716d23209J67536A03911c07946a52769j33939
15908b86708B41623c63435A22129L1543n4513D7959M9176k6270a48639a6918k61871
15897b78789b2929j08588A14668b46561A18608b57824a28626P171n9898h6876
15886a9785k23544i4354B02223a14745a0164j73549E2788A5103J11361b39564
15875A11110l7455c33345i2597j14863r1315b8353j1288r4302M1670i754C331
$$ y = [-262975, -252191, -141299, 192835, 55004, -85523, -100485, 66358, -352205, -188169, 85457, 145326, -217545, -219256, -76103, 41879, 17314, -242820, 110656, -184759, 72129, -286697, 156422, 225561, -195811, -66652, 12417, 234656, 328009, 8305, 80035, -105768, -97106, -380695, -242873, -85884, 149179, 57865, 114581, -423209, -255673, 103911, -307946, -152769, -286708, 241623, -363435, 122129, 153672, 99159, 47959, 97135, 70865, -148639, -16918, -278789, -22929, -131517, 114668, -246561, 118608, -257824, -128626, -121455, -181353, -86876, -19785, -243329, -94354, 202223, -114745, -10164, -183713, 52788, 15103, 126464, -239564, 111110, 73655, -333345, -92597, -207460, -298775, -28353, -39641, -133943, -92273, -9754, 3331]
15863B92454L4099c56741f1405n8324A42515f6260J7748G6119b97836J23681f1577
15851A16185f7758n807n9954B37639b04499e0035r5802c0848k90312a44029G6439
15839c65706d5821j5825E4253J40785b80132N8132D6868Q7939l7946l2689g0561
15827i3064j87573a05397n6727j24126c0349C9404c5752q0200H4937l9639j7541
15816B7757K30185h9059H3551N7427d5711B2522J6763b7411k14932c0827j24902
15805a55729N1993B54493H9782b0774k58057A84094e7471A02693j7955J50611
15795B35349b5973n0726j74774A90884q2400h1372K2125a6074o4168B82605i6906
15783a37741M9043c7297H8002C6452N9328c28696a56079c2240b216k46316H8842
$$ y = [292454, 326553, -356741, -61405, -119729, 142515, -66260, -48512, 76119, -297836, -174155, -61577, 116185, -67758, -73565, -133519, 237639, -204499, -50035, -145837, -30848, -321160, -144029, 76439, -365706, -45821, -61646, 54253, 195038, -280132, -222000, 46868, 134807, 96861, 64172, -70561, -93064, -280637, -105397, -162124, -286250, -30349, 39404, -35752, -115952, 84937, 45298, 27757, 257942, -89059, 83551, 140978, -45711, 22522, 39285, -27411, -242343, -30827, -155729, -103736, 254493, 89782, -20774, -278831, 184094, -57471, 102693, 84738, 235349, -25973, -76699, -251473, 190884, 108484, -81372, -59247, -16074, -80242, 282605, -96906, -137741, -88698, -37297, 88002, 36452, 95780, -328696, -156079, -32240, -2216, -248532, 88842]
15771A41461b47881E8397J05272o6870e19950B91920c04420k102J20618D5959
15760a11005N0729R761J4848j00758B26383N4672a85805A43578R6722b51592J10502
15749a41090O6724G1459d6382f958G1108J40941q7984a39518A9718f4891l0688
15738i5579L421A68297b7279D9457a50967k25340J21889G5139a81013j75276d3841
15726h6881m5306C7681O622J35405a70822I5416K046D7015M9500a43783o0495
15715b04278r4010A14874b43626F3166a6851G7731i2552L2655j30538R3755F0754
15703a71798A24426c3990H4687C2480d91610g5617B54048A7645q321K67097F114
15691G0643J60824F4236j9092d15633C57812b48239E1171b7294k2222j95370A49228
$$ y = [141461, -247881, 58397, 163669, 96799, -519950, 291920, -304420, -306522, -185904, 45959, -111005, -60276, -50515, -35667, -136425, 226383, 281055, -185805, 143578, 240300, -251592, -141090, -74366, 71459, -46382, -6958, 71108, 212049, 124065, -139518, 19718, -64891, -95579, -92158, 168297, -27279, 49457, -150967, -376307, -254418, 75139, -181013, -356289, -43841, -86881, -132187, 37681, 44303, 179708, -170822, 95416, 97462, 47015, 96515, -143783, -204278, -298288, 114874, -243626, 63166, -16851, 77731, -92552, -59897, -190435, -96680, 60754, -171798, 124426, -33990, 84687, 32480, -491610, -75617, 254048, 17645, 9324, 276421, 6114, 70643, 231467, 64236, 45144, -415633, 357812, -248239, 51171, -27294, -49516, -244886, 149228]
15679A09516D2842a28815q4555h2429B8837P5675N4666c14382A9358a66107B57659
15667A89203c07414h2993G2004i6488k4505N0101D9448K73984F934f8372q0064
15656a48436M4719a4791j57962A04723b42660A22574N8329c18089a42286A4415
15645A7006d26488b2070p7568A06937a85296c0971m19128i9064l8586j3653q682
15634a59985B187L30394a80543h4440A46887h6674c6201k50882c0161F5733A9853
15622e7293C00007n0714B6735b40603J09275k294C1363K62086G9820m39J83180
15611B62561c1145F4599a64706o8803r097B64145e8809B71669j20983A5580L5227
15600E0807j3449a328k4542E2618J4505k6275f2764A45778a22782N512B429L14603
$$ y = [109516, 42842, -128815, -213370, -82429, 28837, 104512, 159178, -314382, 19358, -166107, 257659, 189203, -307414, -82993, 72004, -96488, -120993, -70892, 49448, 323432, 6934, -68372, -148436, -103717, -14791, -172753, 104723, -242660, 122574, 180903, -318089, -142286, 14415, 17006, -426488, -22070, -99638, 106937, -185296, -30971, -450099, -99064, -137650, -151303, -159985, 2187, 332581, -180543, -84440, 146887, -86674, -36201, -287083, -30161, 65733, 19853, -57293, 300007, 249293, 26735, -240603, -131328, -133622, 31363, 293449, 79820, 79381, 262561, -31145, 64599, -164706, -233509, -242606, 264145, -58809, 271669, 150686, 15580, 50807, 37358, -1328, -25870, 52618, 67123, 40848, -62764, 145778, -122782, -117270, 2429, 317032]
15588C17032A35092J16N6338O3955m5113E1363J60750d4679a7572A88385b71782
15576f3641l48241A52365b55790K0562f4404b0525B24217H4982a26423A79685
15565A77022l9901c54175A35928j3099d29342a91330A16824e124n3470A01059
15554A07917M4480N7736a17369o4116Q138d3830F2895e6378k027o201m5851J7366
15542i3091A73342a03799P820o1679k94548A80199o7304a34463j20751A72052
15531A53885a39132A74808a43347E9057N261d11746J50032O2998L3678C75254
15520B18401F9798Q086a09424A7029b3412j91794l2961A56433J60084a24687A57079
15508D6362a23964F218A62a27117N1289m5732I6617J95244D4051a96148j07610
$$ y = [317032, 135092, 135208, 191546, 255501, 210388, 51363, 212113, -44679, -17572, 188385, -271782, -63641, -411882, 152365, -255790, -235228, -64404, -20525, 224217, 84982, -126423, 179685, 177022, 137121, -354175, 135928, 122829, -429342, -191330, 116824, -5124, -58594, 101059, 107917, 152397, 210133, -117369, -181485, -173347, -43830, 62895, -56378, -58405, -64606, -110457, -93091, 173342, -103799, -95979, -157658, -452206, 180199, 112895, -134463, -255214, 172052, 153885, -139132, 174808, -143347, 59057, 64318, -411746, -261714, -198716, -165038, 375254, 218401, 69798, 77884, -109424, 17029, -23412, -215206, -248167, 156433, 316517, -124687, 157079, 46362, -123964, 6218, 162, -127117, -75828, -121560, 96617, 291861, 44051, -196148, -303758]
15497c03758I2223c81735A73798K91690b2595j9340j20502a2639A39433c70631
15486a08269C3666b07536e6038m2881q6623B05985a7548n1001C20796b18888d9654
15474b9823I6850f7075o897a6011k1993H4615b79341I3534k0593a44406A29032
15462A38414d5679B24124e3713B36116H4149l2589R475a17303A33068g5184j22193
15451a97377B28114m8686b80013J35710A08736P6834a52916R421p8221B07134
15440B15364e535j49626C7793K8101N591J60662a88972r0781C586e3326A73652
15428a52928c8918I9320b46218A80655a13184G2570Q5432e2566b418j58521L8311
15417a22628A2242J05135b50655A80686j5421p8948g1714j06416C75031a02077
$$ y = [-303758, 92223, -381735, 173798, 465488, -22595, -41935, -162437, -12639, 139433, -370631, -108269, 33666, -207536, -56038, -98919, -185542, 205985, -17548, -68549, 320796, -218888, -49654, -29823, 96850, -67075, -73972, -16011, -38004, 84615, -279341, 93534, 72941, -144406, 129032, 138414, -45679, 224124, -53713, 236116, 84149, 51560, 61035, -117303, 133068, -75184, -197377, 228114, 179428, -280013, -144303, 108736, 185570, -152916, -143495, -221716, 207134, 215364, -5535, -155161, 37793, 65894, 71485, 232147, -188972, -279753, 3586, -53326, 173652, -152928, -38918, 99320, -246218, 180655, -113184, 72570, 158002, -52566, -2418, -160939, -122628, 12242, 117377, -250655, 180686, 165265, 86317, -71714, -178130, 375031, -102077]
15406f5958J0329I6244M2227i7973E8543d19904d1506A48862a00898q0501c5390
15394B0846h0380c5165A29865g3409A12923l0272N773a361j9770A79823o0669
15383A19154b66592F0042k7787a00631m3667K0299j18722b5602I8605Q5987k7312
15372A57280a38132B97206K5059A19731M9400A1908J49564e3774C3489J48529
15362A82018D1489b94912J4507O239a9286p0870A28689m8501j1368C902h2997
15350E5185c04437a49183M3435A32644a80694C4821h8387C79629b04871g3157
15339A8078L5518a52022A27422R4581p2844n2363K15072j27993D8707a94817d9287
15327A98608O0389i5534L9476C73741j15967j25635d6648p1604C24298p9361a45779
$$ y = [-65958, -55629, 96244, 138471, -97973, 58543, -419904, -41506, 148862, -100898, -181399, -35390, 20846, -80380, -35165, 129865, -73409, 112923, 82651, 88424, -1361, -21131, 179823, 119154, -266592, 60042, 32255, -100631, -144298, -123999, -242721, -25602, 98605, 184592, 157280, -138132, 297206, 322265, 119731, 169131, 11908, 161472, -53774, 33489, 182018, 41489, -294912, -280405, -274166, -19286, -90156, 128689, 80188, 68820, 3902, -82997, 55185, -304437, -149183, -105748, 132644, -180694, 34821, -88387, 379629, -204871, -73157, 18078, 53596, -152022, 127422, 222003, 149159, 96796, 311868, 183875, 48707, -194817, -49287, 198608, 258997, -95534, -56058, 373741, 257774, 132139, -46648, -118252, 324298, 244937, -145779]
15315C12783g3512A69218G2106K33578F0339b093G4912h2717H7244h0721j68428
15304b49149e6011D12004i4099A14215c08076D8417C842K0420b07996C9234L887
15293D3121J31510J46853G4368R528f0615B31520r1327D8894Q399a06179c0448
15281c45201J15145O092B90070I407N4536J68109M4046o6057E1965a11334I7488
15269B02344e42880C73408n972B9219b84917d6071F8112l945K70367A06721K7917
15258A34638l6885b52203A09624Q5508n7555J62051J47188j43154J61419Q37550
15248A302631n72547J49506J33844C22079A09119a36642A45162e4774A66828a12324
15237G3785K10701J40097a87311A86613f9418D7504J79892b27187H0595b77599
$$ y = [312783, -73512, 169218, 72106, 305684, 60339, -2093, 74912, -82717, 87244, -80721, -249149, -56011, 412004, -94099, 114215, -308076, 48417, 3842, 24262, -207996, 39234, 43121, 174631, 321484, 74368, 83896, -60615, 231520, 140193, 48894, 57293, -106179, -30448, -345201, -230056, -223964, 290070, 9407, 63943, 232052, 276098, 210041, 51965, -111334, 97488, 202344, -542880, 373408, 367436, 29219, -284917, -46071, 68112, 64167, 334534, 106721, 134638, 97753, -252203, 109624, 195132, 137577, 299628, 446816, 303662, 465081, 1302631, 730084, 879590, 1013434, 322079, 109119, -136642, 145162, -54774, 166828, -112324, 73785, 284486, 424583, -187311, 186613, -69418, 47504, 227396, -227187, 80595, -277599]
15226d5102C62094j05622H7190J05702h9211I7023c03188g6355C1475J02046D7644
15214B48573F0691a12919K7056A76129F6054c2943A34162E3368J2181P0645i2373
15202A58039N678D6311a25543E38440b943B94849d334k12923b3618k21173A25385
15190a46265N9561j4471C89356a1713j07542A87074F7652K29566A23419f9262
15179e5487o8389a2016k52855A43771D5609J24917O4328J28429A56343a34418
15168a89846d3744q0444o2169Q3794c7556E7610a323A31820j3010P4111L1180
15157B24101Q9170G8801R5726R5685E503J1217f2439B18702G2755K01676b5998
15145G8504i3958B39714A13653n1555J28482q1315j1099K0302a1548j93993B90076
$$ y = [-45102, 362094, 256472, 87190, 192892, -89211, 97023, -303188, -76355, 31475, 133521, 47644, 248573, 60691, -112919, -85863, 176129, 66054, -32943, 134162, 53368, 65549, 136194, -92373, 158039, 163717, 46311, -125543, 538440, -2943, 294849, -4334, -217257, -23618, -244791, 125385, -146265, -86704, -101175, 389356, -11713, -119255, 187074, 67652, 297218, 123419, -69262, -55487, -123876, -12016, -264871, 143771, 45609, 170526, 234854, 363283, 156343, -134418, -189846, -43744, -124188, -186357, -102563, -37556, 57610, -1323, 131820, 118810, 192921, 224101, 313271, 78801, 174527, 270212, 5503, 16720, -62439, 218702, 72755, 274431, -25998, 78504, -93958, 239714, 113653, 62098, 190580, 109265, 98166, 118468, -11548, -205541, 290076]
15133A83197C7308h7432A61080a30047A03696b86999a25177B07579J83308A45743
15122A1341J45093l9090L0685G0019K92530d1033B15925C3021e1899B73667r9234
15111A74433D3204e2784p4391M3326F9177K8728f4637A24649a06073A59614J82989
15100C42603A42552k2495m4390K71922j54629r0079a2563k8723G2708R9852L0815
15089B03375c4610a952A25385m8416O7970C3608L18050J27713C6587O8984a27886
15077E2494f5425G913Q6744P9324F2658M8213K60043E1235K30422A28524g8577
15065A78157J63304A9332i088B22279h9483m0850I6958a43998K3762c7433A15805
15053C0762J86579p8968K21608b11338A4451P4052J46796C8709K2455L97804I8769
$$ y = [183197, 37308, -87432, 161080, -130047, 103696, -286999, -125177, 207579, 390887, 145743, 11341, 156434, 117344, 148029, 70019, 362549, -41033, 215925, 33021, -51899, 273667, 174433, 43204, -52784, -127175, -83849, 69177, 97905, -64637, 124649, -106073, 159614, 342603, 142552, 120057, 75667, 347589, 192960, 102881, -12563, -41286, 72708, 172560, 203375, -34610, -1952, 125385, 76969, 144939, 33608, 351658, 479371, 36587, 105571, -127886, 52494, -65425, 7913, 94657, 173981, 62658, 110871, 370914, 51235, 281657, 128524, -78577, 178157, 341461, 19332, -9088, 222279, -89483, -130333, 96958, -143998, -120236, -37433, 115805, 30762, 217341, 138373, 359981, -211338, 14451, 88503, 235299, 38709, 61164, 458968, 98769]
15041a29451A6667J44790J48167a47938E2396J84660a54694A26167a55709D90352
15030B25335d2811l01230B7807b91351B22576M83j1498a3921A91519o5047L192
15019A29664J67773M972C2551L2668f0527B41438K93719r3528h7903B1696J76038
15008A97734J59671C7880J5519J15342J18721j18850J24065B2357J47427b6439
14997A14192J59973I2155K39783a4023C72586a80705A67723J6220c67219A58918
14986F70201k30046A0612O46716C02239o9131q0906J41800A0499K16656m214h9486
14974I5347J01073B2936L20732F1525K15037f029B20232f3213B08918J70141A84983
14962D13278B05330c076B04041N0245b24184D93501d21237B67177C0619K14910
$$ y = [-129451, 16667, 161457, 309624, -147938, 52396, 237056, -154694, 126167, -155709, 490352, 225335, -42811, -344041, 27807, -291351, 222576, 223059, 211561, -13921, 191519, 126472, 129664, 297437, 302409, 32551, 65219, -60527, 241438, 535157, 441629, -87903, 21696, 197734, 357405, 37880, 53399, 168741, 287462, 168612, 292677, 22357, 169784, -26439, 114192, 274165, 92155, 331938, -14023, 372586, -180705, 167723, 183943, -367219, 158918, 670201, 440155, 10612, 657328, 302239, 233108, 152202, 294002, 10499, 227155, 222941, -89486, 95347, 196420, 22936, 343668, 61525, 276562, -6029, 220232, -63213, 208918, 379059, 184983, 413278, 205330, -3076, 204041, 254286, -224184, 493501, -421237, 267177, 30619, 245529]
14952B45529r1593k2875n5107J29999O6133L70792B3652J13031M6872J66238O4348
14941D14141j78818J11932J4672j01176A3951K25310J73718m7453b528E13397
14930C18586D7178J5564K49411K15968k26404N6258A08648a86338C18212K68861
14920E87073B81102I9472J8548P589N62340B01997K19002A72903L19275A40289
14909B81686d5866B36905G9458K07351K04661A33301O514K66170j17888r3854
14899A94243q7292Q4658J658n8437M67683A40049L27J70106j9636A7454J77561
14888A95015J7713a23798A73241L34331H1242J49400m7422K35465j59250I8301
14877a44531B12624J0147D5214L12027j37762J79843j70294P241Q329P0401j0347
$$ y = [245529, 153936, 131061, 75954, 205953, 272086, 642878, 23652, 136683, 183555, 349793, 414141, 235323, 347255, 361927, 260751, 13951, 239261, 412979, 365526, -2528, 513397, 318586, 47178, 62742, 312153, 528121, 301717, 357975, 108648, -186338, 318212, 587073, 281102, 99472, 118020, 125609, 687949, 201997, 420999, 172903, 492178, 140289, 281686, -45866, 236905, 79458, 286809, 491470, 133301, 139815, 405985, 288097, 194243, 106951, 191609, 193267, 134830, 602513, 140049, 140376, 310482, 290846, 17454, 195015, 212728, -123798, 173241, 507572, 81242, 230642, 183220, 418685, 259435, 98301, -144531, 212624, 222771, 45214, 357241, 219479, 399322, 229028, 236269, 244598, 314999, 304652]
14866C04652Q9635A89321L1362L87970A58837J89870k1185N0005A37729J44597
14856B82326N1602j32351L41706F9338P07677l10661o9166L01193j97696a4997
14845E33497B02288J33471K8725L26560j90664k3344J22631j85105o2828j21736
14835B29998O3275E8150R9427L00213n3659K2325j47452L10217B28154Q8687q3795
14824B33046K42163j23237L7110j58651J28805R8468j5978B10732J28770j64229
14814A75273L67397j5539j69457m9112J2582J49590L3488J98774k12719B44446
14803B66594K01852r5322l8085J82925j67770L59770B3520K29690K27705N5023
14793E35938j30413L85868j4541l85620l470L3113r5994J68460j62250K50543
$$ y = [304652, 394287, 189321, 220683, 608653, 158837, 348707, 327522, 377527, 137729, 282326, 333928, 201577, 543283, 69338, 777015, 466354, 397188, 698381, 500685, -14997, 533497, 202288, 335759, 364484, 691044, 500380, 477036, 599667, 414562, 351734, 229998, 293273, 58150, 157577, 457790, 404131, 426456, 279004, 589221, 228154, 316841, 233046, 475209, 351972, 389082, 230431, 359236, 457704, 441726, 210732, 339502, 175273, 542670, 527131, 357674, 308562, 321144, 470734, 504222, 702996, 490277, 244446, 266594, 468446, 373124, 335039, 517964, 350194, 709964, 23520, 253210, 480915, 535938, 405525, 791393, 776852, 391232, 387762, 420875, 324881, 493341, 331091, 581634]
14783E81634j1541Q9463j13974O8993k10462J88836k79267L93602l23615L31757
14773G15426B39981L15903B50771k0066L1484j3965M64176k31196K6361k08258
14763B99307r4431J21496J46533j32172L59674l21914M07381l38077N7320j1893
14753D93224J14582m6823P5997k32447K3910K30155k32363N7600K48712R0014
14743H22561C85842A25515M45967P910L17996k57324j47453K06668C38269L36623
14733F74892P2606j52659O2369P3982j12290J64838k31892J46194p9447j15075
14723E03518J98480L04152m01407K14391j82904J86759C09187L62477k08177L44569
14713H08056l35488O3906N8138K23213M3715k94581q8188M60083j12950l47137
$$ y = [581634, 570093, 659556, 545582, 614575, 404113, 592949, 313682, 707284, 383669, 715426, 239981, 555884, 250771, 230705, 262189, 248224, 712400, 481204, 507565, 299307, 204876, 326372, 472905, 340733, 700407, 378493, 785874, 447797, 505117, 493224, 607806, 560983, 636980, 404533, 428443, 658598, 426235, 483835, 732547, 822561, 385842, 125515, 571482, 579392, 897388, 640064, 492611, 699279, 338269, 674892, 747498, 594839, 657208, 731190, 618900, 783738, 551846, 698040, 618593, 503518, 701998, 1006150, 604743, 819134, 636230, 822989, 309187, 671664, 463487, 808056, 472568, 536474, 594612, 817825, 861540, 566959, 478771, 938854, 825904, 478767]
14703D78767O56016m79318J82005j67601o0961M27540j89095Q9392k31356M8407
14693G53796l11157M24738r2885p7914M0269J60938j76814O4964Q1724j34206
14683G33453K8772j0067l0655K74024k67087M27696l83643k08677M96814l83408
14673F77222K01800P8206k03921j5558m2882m817L40841o2j86084J85187o0204
14662I69728k52439J88030o2056J72149l1471K0905m6925J3432n7576j28959k31577
14651E53241n6953M56513N0120q6968L77475M5258k87867j12521K60752m97597
14641G01453J95287M07712l93621j1985J64492L423j57270L49920l20465K58925
14631A197871m22816K80605L5741l10428J90938K0056K59073k35308K5588L79207
$$ y = [478767, 1134783, 655465, 837470, 669869, 608908, 1036448, 847353, 936745, 705389, 753796, 442639, 867377, 774492, 696578, 736847, 897785, 720971, 785935, 867659, 733453, 762225, 752158, 721503, 995527, 728440, 1156136, 772493, 563816, 1060630, 677222, 879022, 957228, 753307, 737749, 694867, 690050, 1030891, 1030829, 844745, 1029932, 969728, 717289, 905319, 843263, 1015412, 983941, 1004846, 957921, 971353, 913777, 784818, 553241, 496288, 952801, 1002921, 915953, 1293428, 1338686, 1050819, 938298, 1199050, 701453, 896740, 1304452, 910831, 898846, 1063338, 1066761, 909491, 1259411, 938946, 1197871, 775055, 1055660, 1091401, 780973, 971911, 991967, 1251040, 1015732, 1041320, 1420527]
14621A420527m69327M70601p4094j30383N4777j8277j69687J32993J07590j1599
14611A313121K195K42649J9638n11616j03236N12182K8592j82552K3187j66549
14601A177611K01875m3892O3179j15794K76815K52938m39789r7008L17340l86262
14591A207013K07851K70131l07118K42772o3228J25192j37991J58462k57470J61946
14581A607560O2352k08079K38064K61916m45541N1815J10138K05486L7559R4440
14571B015710R6301l25766j20542J90898J9855j50294J67903K10123j57756N131
14561A951563l6153L38445P5764j14806L5610K25956M25564J90694L15678l4997
14551C373318J084519R49884K912825N365965J0003684J3674959n427126A4638343
$$ y = [1420527, 951200, 1421801, 1347707, 1217324, 1272101, 1253824, 1084137, 1217130, 1324720, 1313121, 1315316, 1557965, 1577603, 1065987, 962751, 1474933, 1503525, 1320973, 1344160, 1177611, 1379486, 1335594, 1398773, 1282979, 1559794, 1812732, 1372943, 1275935, 1593275, 1207013, 1414864, 1684995, 1377877, 1620649, 1557421, 1682613, 1544622, 1703084, 1445614, 1607560, 1669912, 1461833, 1699897, 1961813, 1516272, 1568087, 1678225, 1883711, 1921270, 2015710, 2112011, 1786245, 1665703, 1856601, 1876456, 1726162, 1894065, 2104188, 1946432, 1951563, 1915410, 2253855, 2329619, 2214813, 2250423, 2476379, 2901943, 3092637, 3408315, 3373318, 4457837, 5407721, 8320546, 13686511, 23690195, 37365154, 31938028, 14638343]
14542F392783k705814j060085p50337J07825j78294j38689j39699L33078j47955
14533A712813O1901N3997j51447K72689k9493L24799k51005J15930l5830j36795
14523A937559l2613O7025r4732j43669N70734k52892K45208k24848J64749J84620
14513B421141m21447J05215M56087j66935p0535j13098L32134j79525r0282N617
14503B278372p1917M17877p6311l9900O0738k05411M79774l43637L71625k38185
14493B633025L4992j7332L9630M18186m38717J79270J00284L23316o542O4675
14483C330787m73666J86170K0196K55879r335k43728N95454n32203M29927k56592
14473C302889R1214L4324j7120L44575l33908J97075L06420M594j48953J67882
$$ y = [6392783, 3686969, 2626884, 1876547, 1984372, 1806078, 1667389, 1527690, 1860768, 1712813, 1774714, 1828711, 1677264, 1949953, 1920460, 2245259, 1994254, 2110184, 2074354, 1937559, 1904946, 1971971, 1877239, 1733570, 2304304, 2051412, 2296620, 2071772, 2236521, 2421141, 1999694, 2104909, 2560996, 2394061, 2323526, 2210428, 2542562, 2363037, 2272755, 2278372, 2206455, 2624332, 2548021, 2508121, 2568859, 2363448, 2843222, 2499585, 2871210, 2633025, 2668017, 2650685, 2690315, 3108501, 2669784, 2849054, 2949338, 3272654, 3266112, 3330787, 2857121, 3043291, 3063487, 3319366, 3310031, 3066303, 3661757, 3129554, 3559481, 3302889, 3394103, 3428427, 3411307, 3755882, 3421974, 3619049, 3925469, 3930063, 3781110, 3948992]
14463C948992K1541J95351k73013j8125l54710L55157L52244l9009J15550l16209
14453C987769N38659k51001J50413J98268k3456j41639M70767M0381m26300K48326
14443D792187L81297j36605O1820P5295l06037L17725q0047J74018K18590K07007
14433E705250j69842k36863P11738k66400r3293J52989O1094l4157J4534K60978
14423F106028p7903L40244J52049M6795j39791L84526J6785M47567j14589k7270
14413G134441l0812M6276L87215L6563p8802J66157R6239K89168Q3892M51432
14403H581769l61649L14763L59498k83282L81311K30321k04687M36759q0175M95541
14393I870169j95622M18005N48330m61189K86649R2348L51538L66192n5262K43695
$$ y = [3948992, 3970533, 4165884, 3892871, 3874746, 3520036, 3875193, 4227437, 4188428, 4303978, 3987769, 4526428, 4275427, 4425840, 4624108, 4600652, 4459013, 4929780, 4970161, 4543861, 4792187, 5173484, 5036879, 5098699, 5173994, 4867957, 5185682, 5105635, 5279653, 5498243, 5705250, 5535408, 5298545, 6010283, 5743883, 5650590, 5803579, 5864673, 5830516, 5845050, 6106028, 6028125, 6368369, 6520418, 6567213, 6427422, 6811948, 6828733, 7276300, 7161711, 7134441, 7103629, 7149905, 7537120, 7573683, 7494881, 7661038, 7757277, 8046445, 8130337, 8581769, 8220120, 8534883, 8894381, 8611099, 8992410, 9222731, 9018044, 9454803, 9374628, 9870169, 9674547, 10092552, 10640882, 10179693, 10466342, 10558690, 10910228, 11276420, 11221158, 11464853]
14383A1464853M46409M34336k29006L12357L52659j22282M65760J85836M29953
14374A3740875O6427L78634l20K84327M40021L78102j14250O58853J25056K39859
14364A6197584O03280L17966M58127N65623L89679L3626N92372M92856L21507
14355A9972620L69743N57865M25912R60320J04802N12423L10679J074446L82303
14346B4671113P26272Q94702M41116Q23612O61044M96221J159999P34978J113532
14337C1722589O32135J010200P51439J336238R06734J205786J155582J438459
14329D0159162J239264J394266J255556J325955J545885J624205J870685J498116
14321E1913094J985505J920290K039396K414897K195427K249295K799606K688347
$$ y = [11464853, 11911262, 12345598, 12116592, 12428949, 12781608, 12659326, 13125086, 13310922, 13740875, 13807302, 14185936, 14185616, 14469943, 14909964, 15288066, 15173816, 15832669, 15957725, 16197584, 16800864, 17118830, 17576957, 18142580, 18532259, 18565885, 19158257, 19651113, 19972620, 20342363, 20900228, 21326140, 22286460, 22391262, 22903685, 23214364, 24288810, 24671113, 25397385, 26292087, 26733203, 27556815, 28217859, 28714080, 29874079, 30609057, 31722589, 32354724, 33364924, 34116363, 35452601, 36359335, 37565121, 38720703, 40159162, 41398426, 42792692, 44048248, 45374203, 46920088, 48544293, 50414978, 51913094, 53898599, 55818889, 57858285, 60273182, 62468609, 64717904, 67517510, 70205857]
14313G0205857K586536L023153L316526K992614L628587L805835L781929M211417
14305I7552454M476515N151937M816623N168559N955746O147568O334761P232016
14297A42836179P060298P755830Q487411Q909443R382330J0202854J0483585J1494547
14289B16612477J1879830J2850779J2917834J3990798J4578800J4953196J5457158
14282C13240872J5514778J5368963J5672613J4847413J4609225J3151740J1920319
14275D14325923J0038139P599374K894744J92188r5396r99290l018576j780324
14267D29156782m652094q113259j0463082j2281559j3901006j5222669j5382208
14260C49140905j5826447j5728350j5494845j5485815j3703145j3962569j3474938
$$ y = [70205857, 72792393, 75815546, 79132072, 82124686, 85753273, 89559108, 93341037, 97552454, 102028969, 107180906, 111997529, 117166088, 123121834, 129269402, 135604163, 142836179, 149896477, 157652307, 166139718, 175049161, 184431491, 194634345, 205117930, 216612477, 228492307, 241343086, 254260920, 268251718, 282830518, 297783714, 313240872, 328755650, 344124613, 359797226, 374644639, 389253864, 402405604, 414325923, 424364062, 431963436, 434858180, 435050368, 434954972, 433955682, 430937106, 429156782, 424504688, 416391429, 405928347, 393646788, 379745782, 364523113, 349140905, 333314458, 317586108, 302091263, 286605448, 272902303, 258939734, 245464796]
14253B45464796j2970899j2450121j1824214j1068671j0140363r563063r274415
14246A68173050q566548q153754p651746o884160o491551o717118n963460m977060
14238A12767653n321393m988276m488610m396648m012151l981597l139533l180621
14230G9258824l505462k705762k851445l245457k331849k536226k356965k078017
14222E7647641k212665j669452j583250k001364j814609j804188j420046j215193
14214D3926874j237864j209915j523095j332385r24026j292437q87976o62293
14206C4856883j134468r55020j160530p16333j073926m33476m08722j035010q80602
14197B7058796o12120n72437r72373l82372o39493r92717j74121n97046n03584
$$ y = [245464796, 232493897, 220043776, 208219562, 197150891, 187010528, 177447465, 168173050, 159606502, 151452748, 143801002, 136916842, 130425291, 123708173, 117744713, 112767653, 107446260, 102457984, 97969374, 93572726, 89560575, 85578978, 82439445, 79258824, 75753362, 73047600, 70196155, 66950698, 64618849, 62082623, 59725658, 57647641, 55434976, 53765524, 52182274, 50180910, 48366301, 46562113, 45142067, 43926874, 42689010, 41479095, 39956000, 38623615, 37699589, 36407152, 35519176, 34856883, 33722415, 32767395, 31606865, 30890532, 29816606, 29383130, 28974408, 27939398, 27058796, 26446676, 25874239, 24901866, 24519494, 23880001, 22887284, 22713163, 22116117, 21612533]
14188B1612533o05664j78484p41286m80124o09340j96246n38448k44439l94431
14179A7624071m22672k95443n77239n37229K51986m93721n81277j94883l21012
14170A4452581r2936o69445j56448K12355n69016J1622j70370n52771k20764J31541
14160A2376349m69877j73076k54943o7524o86980M31370l97395k70070j59440
14151A0328414l38792m11566j42061J69124k08599J03907m68453l08897Q3734
14142H806811l86047M03845J17332o39753J25229l92633r1126l07999r6776l53769
14132G185114K94626K07622m35128m7625r7974M2103R798J05694l57642l11521
14122F595067n7598K4198n3333k54838K9378j85789j81128J88048p3841l06529
$$ y = [21612533, 21006869, 20828385, 20087099, 19606975, 18997635, 18801389, 18262941, 18018502, 17624071, 17201399, 16905956, 16328717, 15791488, 16043474, 15549753, 14968476, 14773593, 14452581, 14359645, 13690200, 13533752, 13746107, 13177091, 13188713, 13018343, 12465572, 12244808, 12376349, 11906472, 11733396, 11478453, 11410929, 10723949, 11155319, 10757924, 10487854, 10328414, 9989622, 9578056, 9435995, 9605119, 9396520, 9500427, 9031974, 8723077, 8806811, 8420764, 8824609, 8941941, 8302188, 8427417, 8034784, 7943658, 7635659, 7538883, 7185114, 7479740, 7687362, 7252234, 7204609, 7106635, 7148738, 7158536, 7264230, 6906588, 6595067, 6537469, 6561667, 6508334, 6253496, 6282874, 6097085, 5915957, 6104005, 6030164, 5723635]
14112E723635O1059j99281L65525l34944j11906k40183O9257l06506l5293L15218
14102E306581j00224l339k14248R516l57741o0518k7775J03339k1599k18025j82208
14091D233759M54042m59746L02071j94637l18898K72416m22723M03933j75573
14082D094644k46368J32199o2550K3137k61224K36183k74465m6649K40727K23800
14072D059434n41648Q9058j18829N50635p36673K41398j49540r0300j64657o5324
14062C073554K96476k15916J40330J9318J44796J21285l00385j11939L7244R6163
14052C300926l75376k25671K34456k62731J97382p0797N7484l36778k5025L66256
14042B860126q8799l46762L21944l59972r889k4481Q1224K88979J15753j37067
$$ y = [5723635, 5784694, 5585413, 5950938, 5615994, 5504088, 5263905, 5333162, 5026656, 4991363, 5306581, 5206357, 5203018, 4988770, 4998286, 4640545, 4580027, 4552252, 4655591, 4633992, 4415967, 4233759, 4687801, 4228055, 4530126, 4335489, 4016591, 4289007, 3866284, 4270217, 4094644, 3848276, 3980475, 3917925, 3941062, 3679838, 3916021, 3641556, 3594907, 3835634, 4059434, 3517786, 3606844, 3488015, 4038650, 3301977, 3543375, 3393835, 3303535, 3138878, 3073554, 3370030, 3154114, 3294444, 3313762, 3458558, 3579843, 3279458, 3167519, 3204763, 3300926, 2925550, 2699879, 2934335, 2671604, 2868986, 2798189, 2855673, 2518895, 2493870, 2860126, 2771327, 2424565, 2746509, 2386537, 2376648, 2352167, 2433391, 2722370, 2838123, 2701056]
14032B701056j78338j53129K98100k44051k48961J75265l8097q2061j55148J17212
14022B191848j46623J06339j16614J99848Q8875l85086L70196k67452P5856j40409
14012A976778Q6298k85819J80267j99604P8200k10214L10109P0223J24917m08220
14002A722935R2494n8797O4132l4734r9970m9451K8499r769J10413J28867J60786
13991B055405K23181M36911K018280L755665R060584J5349053k89304j4008450
13983A8601325q667769m097330j308755p18767n84437p2445m87265k07788k21438
13974B235331j21671p1650M0229K63319m27770J58545j01414O3433k39060K20239
13964B019531j60266l0459l0128k02219k13105K09617J2392o1955K38020j85169
$$ y = [2701056, 2522718, 2369589, 2667689, 2423638, 2174677, 2349942, 2311845, 2229784, 2074636, 2191848, 2045225, 2151564, 2034950, 2234798, 2323673, 1938587, 2308783, 2041331, 2117187, 1976778, 2063076, 1777257, 1957524, 1757920, 1836120, 1625906, 1936015, 2006238, 2131155, 1722935, 1815429, 1756632, 1820764, 1786030, 1686060, 1636609, 1665108, 1655339, 1765752, 1894619, 2055405, 2278586, 2715497, 4733777, 8489442, 17550026, 32899079, 32609775, 18601325, 9933556, 5836226, 4527471, 3808704, 3224267, 3151822, 2664557, 2456769, 2235331, 2113660, 2042010, 2082239, 2345558, 1917788, 2076333, 1974919, 2038352, 1799292, 2019531, 1859265, 1828806, 1798678, 1596459, 1383354, 1592971, 1605363, 1543408, 1781428, 1596259]
13954A596259J12551m2107l20973O5085K92326k51244L04248l48384Q8561m448
13944A491874k06339M7059N6257j12648P5976k8934K94956k06726j72627J76881
13934A415729j73102J41810M7927k56633K83378k69992N4279j54491K69741m11957
13924I46689M10710k16264N8852L18290j85094j12664N0079n2454J00001l27062
13914I91083N52488R632m32438K7238J11468j04871r3048K26234k21508N8420
13904A124698R1192R1854k48849L44030k12739J22670k31048N9811k48938J91553
13894A084234K26387j28495j87743k8115J00997R6867k98560L41250j0604m04597
13884G91621M21397p5818M1098r0234J1917N5578l84325j0418J14306L3768q3498
$$ y = [1596259, 1708810, 1666703, 1345730, 1410815, 1703141, 1451897, 1756145, 1407761, 1496322, 1491874, 1285535, 1332594, 1388851, 1276203, 1352179, 1323245, 1618201, 1411475, 1238848, 1415729, 1242627, 1384437, 1432364, 1175731, 1459109, 1189117, 1243396, 1088905, 1358646, 946689, 1357399, 1141135, 1199987, 1518277, 1333183, 1220519, 1270598, 1218144, 1318145, 991083, 1543571, 1553203, 1120765, 1148003, 1259471, 1154600, 1061552, 1287786, 1066278, 1124698, 1215890, 1307744, 1058895, 1402925, 1190186, 1312856, 1081808, 1141619, 892681, 1084234, 1310621, 1182126, 994383, 966268, 1067265, 1164132, 865572, 1206822, 1196218, 791621, 1213018, 1137200, 1178298, 1088064, 1099981, 1155559, 771234, 760816, 875122, 908890, 825392]
13873H25392J72638J57855M265J04698n09682O09135j78156j60658j5205l88321
13863F21961L02432R4207m02242K24424J27661J20230l52852L71242r8295j24478
13853H84290o6513l35699M06552j77981P8778j63578K56796J31515j41396m7592
13843H25172M9277l25852L28093j69520m2531J08551j57364L84714k19171K50353
13833A031722k45651M1639j58458J53640K6794j9817k36877L13595k24608K82344
13823I64323j93768o6004J88783M6917k99979r0035k508J61470o676j45265K82490
13812H39748B83249l0803N54042B02818P76137l45829K5492j68825o3493J58148
13802E84448k01521K30135L3229o8015j51643J61314K7271J97564j65812Q0515
$$ y = [825392, 998030, 1155885, 1160150, 1264848, 755166, 1364301, 1186145, 1025487, 1010282, 621961, 924393, 1018600, 616358, 840782, 968443, 1088673, 735821, 1107063, 1008768, 884290, 817777, 482078, 888630, 710649, 789427, 625849, 882645, 1014160, 872764, 825172, 874449, 548597, 876690, 707170, 664639, 773190, 615826, 1000540, 781369, 1031722, 786071, 827710, 669252, 822892, 849686, 829869, 592992, 906587, 681979, 964323, 770555, 704551, 893334, 940251, 640272, 550237, 547729, 709199, 702523, 557258, 839748, 283249, 252446, 806488, 202818, 978955, 633126, 658618, 489793, 426300, 584448, 382927, 613062, 646291, 578276, 426633, 587947, 615218, 812782, 646970, 727485]
13792G27485J15357C13491L11979O1429J27047k14075J0959J48029O525j47203
13782F18181N722k03144m5932m5052K27777j96396R5414J61256m5248J15039j77196
13771E10421A19578Q069m1216L93411l6131j04356L9076L78760B81011J97541
13761D78552j99789K75147M8543K39577j57505B80640P05965l40236k90928J37664
13751D93105L52277j85421k21123A68237k4714n9947L83313J43790j37743j55380
13741C17556J02680O4680l7348n8581R7643N5512j8515q9097J37524J60441C05002
13729C46512q2503J11733j54545O4455J7991N0847R2794P9547J08773J39908B46589
13717C36231J96441M5639j1046k03794M9722p4718o6791M16581j16186p9442j08397
$$ y = [727485, 842842, 313491, 625470, 686899, 813946, 599871, 610830, 758859, 765384, 618181, 623903, 420759, 374827, 329775, 557552, 361156, 456570, 617826, 572578, 687617, 510421, 119578, 127647, 86431, 479842, 443711, 339355, 378431, 757191, 281011, 478552, 278763, 553910, 602453, 842030, 684525, 280640, 986605, 646369, 355441, 493105, 845382, 659961, 438838, 168237, 143523, 83576, 466889, 610679, 472936, 317556, 420236, 484916, 447568, 388987, 486630, 542142, 523627, 434530, 572054, 732495, 305002, 346512, 264009, 375742, 221197, 285652, 303643, 354490, 447284, 526831, 635604, 775512, 246589, 336231, 532672, 578311, 567265, 363471, 413193, 338475, 271684, 688265, 572079, 492637, 384240]
13706C84240K80465r9686l9651j7277j22598k3318L32602k90120J67161B22677
13695E06216e59C14279K76740j75054J5435J61237j04412Q7834k20061K03788
13685E59786B17351o1356K42660j12851K50798j55571A08079p139J80287K8800
13675C10027L32225k74836L70909l48625M7454j40829L34507j66326j05197k9581
13665C29728N0422p967J18810B42428R4096L0646j56444J8083H6142M06338B12045
13653B42268O0118M24132A56494J56461K10389k24217O515J82862o0682j52398
13643B75424L19699j69057j29328J72536j78690C4713N01447A53863K79752j46513
13633B87102K6254N76645A36823j7678N01245A95129K52434N3014K5339j88698
$$ y = [384240, 664705, 565019, 525368, 508091, 385493, 362175, 694777, 404657, 571818, 222677, 506216, -559, 314279, 591019, 415965, 431400, 592637, 488225, 576059, 355998, 559786, 217351, 155995, 398655, 285804, 536602, 381031, 108079, 100940, 281227, 310027, 642252, 367416, 738325, 389700, 437154, 296325, 630832, 464506, 359309, 329728, 380150, 372183, 490993, 242428, 336524, 367170, 210726, 228809, 86142, 492480, 212045, 242268, 302386, 726518, 156494, 312955, 523344, 299127, 305642, 488504, 427822, 275424, 595123, 426066, 296738, 469274, 290584, 34713, 536160, 153863, 433615, 287102, 313356, 890001, 136823, 119145, 620390, 195129, 447563, 500577, 525916, 337218]
13623C37218j05733P0522K06346A45055Q098i5340C51890i6589C08962A10382
13612D71830A05605N23643H1520g6516B51115O7430A21539b2582D28507l7145
13602C91362L4209j04194j09080M4483j07744K31272K5963j52827n6218Q7033
13592B84259m9839B3299K87006j52675R8133N696E0239K23223e3137B11024K15337
13581D26361e3680B9939J63831L24554q288l3976B28482j1435J16231d2998A94954
13569B96197E4618K18723N9221j2858e286C49821E0414K78129E1181J16461J28230
13558B95872J441J86034f1483B53649n4782K91863k33480J11258J38636a4222
13547C26793j25477k4286G7851L95049j53728b1975C23331L0686j33881K9552
$$ y = [337218, 231485, 302007, 508353, 145055, 153153, -95340, 351890, -96589, 308962, 110382, 471830, 105605, 629248, 81520, -76516, 251115, 318545, 121539, -22582, 428507, 391362, 425571, 321377, 212297, 256780, 149036, 380308, 406271, 253444, 197226, 284259, 234420, 23299, 310305, 157630, 255763, 261459, 50239, 273462, -53137, 211024, 426361, -53680, 29939, 193770, 518324, 510036, 476060, 228482, 217047, 333278, -42998, 194954, 296197, 54618, 273341, 332562, 319704, -5286, 349821, 50414, 328543, 51181, 167642, 295872, 297313, 483347, -61483, 253649, 198867, 490730, 257250, 368508, 507144, -14222, 326793, 201316, 177030, 77851, 472900, 319172, -21975, 323331, 354017, 220136, 249688]
13537B49688r6072K829M8114L3076N7719A05880R6536J16931A19910O7945J51418
13526C39273A02789J56953I7973L27284E9912K52641r5146A6962L42906A11797
13515A93546K63856H4075b1193B87781j41176i2231A00287P9396K6040F1922L48123
13504D10045A0704M83185B8996b7574G1701K5555l1201e7016D9039L60212A89523
13492C63800j57947O0333l4520r0686a99104C98217A00823N3068M11056A31212
13481A76823K16372q2498A28231K94905A8037Q657J43582J06947D7524a01491
13470a22244B75187e9563B18756J39641j19375A18882E5377K06240J17554L6750
13460D15921a87600G7001K32629H4825L37814A82700D3417d2229A87531l0806
$$ y = [249688, 153616, 156445, 204559, 237635, 295354, 105880, 202416, 319347, 119910, 187855, 339273, 102789, 259742, 97973, 425257, 59912, 312553, 217407, 16962, 359868, 111797, 193546, 457402, 84075, -21193, 287781, 146605, -92231, 100287, 179683, 205723, 61922, 410045, 10704, 493889, 28996, -27574, 71701, 97256, 66055, -57016, 49039, 409251, 189523, 363800, 205853, 266186, 231666, 140980, -199104, 398217, 100823, 153891, 564947, 131212, 176823, 393195, 310697, 128231, 423136, 18037, 26694, 170276, 277223, 47524, -101491, -122244, 275187, -59563, 218756, 358397, 239022, 118882, 55377, 261617, 379171, 415921, -187600, 77001, 309630, 84825, 422639, 182700, 43417, -42229, 187531, 156725]
13450A56725l628c06026C45606B585K54644e3252E48280k52868C1019M37748A41653
13438C51193d0486A38306b73788A45214B202I02a93082A01932m824R0406R4312
13427B81826A26200a37281A62822p0703c19336G8850F507O6562J99137j16924
13417A55282c23A05293J76808F3837L63687c8217A88591g988j77189A88717A0551
13405a17753A42934c7686C53657A57449g5765F6657e6220q9734B26385c0971A35260
13393D4874a59582a9175C21509A22655n7641K9308Q2695C8106J22784J53989b66414
13381A4029M67377d3109j91920B98690r8744p2964J17498Q4224j58696J27286
13371B97294P5184j13160B4695L30390J30977B34281D688K71216E8268j8015J0909
$$ y = [156725, 153097, -306026, 345606, 2585, 257229, -53252, 548280, 295412, 31019, 468767, 141653, 351193, -40486, 138306, -273788, 145214, 2202, 902, -193082, 101932, 97108, 187514, 281826, 126200, -137281, 162822, 92119, -319336, 78850, 6507, 73069, 272206, 155282, -323, 105293, 282101, 63837, 427524, -38217, 188591, -7988, -185177, 188717, 10551, -117753, 142934, -37686, 353657, 157449, -75765, 66657, -56220, -145954, 226385, -30971, 135260, 44874, -159582, -19175, 321509, 122655, 65014, 94322, 177017, 38106, 160890, 314879, -266414, 14029, 481406, -43109, -235029, 298690, 199946, 126982, 244480, 328704, 170008, 297294, 372478, 259318, 24695, 355085, 486062, 234281, 4688, 275904, 58268, 40253, 51162]
13360E1162K55976L7574c5732B53254O6497j28361h0898A82450Q402H3636K45963
13349C29599B5373L4257J64458p602J08184k8302J03493j48348C7587a41190B71527
13337C09054J71280A92608i0221A06475C112L32227B5314J02037M9020J17542
13327B93913r5694B7934J91190c9218j4510a3329C2241a68401B09213a18955C32081
13315A18876l6496J25061c0070F8757N8331a69067E0215K52916a11320e0424H6184
13303B42916m0321b01971i023B40296j06758F4289J6017L19331a36317F6164K34119
13292C00283L1774D1072a99608C14788C9670a68006j75227B04489o1734L384r821
13281A36318c2741B16582D6710P7007o1401g5586A05778a05993G3807J31650J97150
$$ y = [51162, 307138, 344712, -35732, 253254, 319751, 191390, -80898, 182450, 190852, 83636, 329599, 25373, 59630, 224088, 216486, 324670, 296368, 399861, 251513, 37587, -141190, 271527, 309054, 480334, 192608, -90221, 106475, 3112, 335339, 25314, 127351, 176371, 293913, 198219, 27934, 219124, -39218, -53728, -13329, 32241, -168401, 209213, -118955, 332081, 118876, 82380, 207441, -30070, 68757, 127088, -169067, 50215, 303131, -111320, -50424, 86184, 242916, 202595, -201971, -9023, 240296, 133538, 64289, 80306, 399637, -136317, 66164, 300283, 332057, 41072, -199608, 314788, 39670, -168006, -343233, 204489, 142755, 146139, 136318, -32741, 216582, 46710, 123717, 62316, -75586, 105778, -105993, 73807, 205457, 402607]
13270D02607c8968G8366J78947a06734B92256a45512C02124F9764K92499B274
13259b55776d5065A79525q6204O3917e900A46061b1758C95555A91812d5887A9393
13247g0655I0087P1982G3762b71681A51203A0689g7463A2261J43505g279B61857
13235C85661f629D8164h2067B8992J89655e2961m4927C38105j37293p0369R3055
13224B23498J42386G0619P4181c5966j73576k488B98429E7015a28091B15519m2173
13213A73346e0415e269A47815P0802J53222B1272a84599n832D35375n5200A23713
13201g0769p2554B10120a02164A24668M97J64940G680K79615b659F9032e6256
13189f6803B45861n7069h5326A59636b02841A23245N1245G3799e5323D8956j6437
$$ y = [402607, -38968, 78366, 257313, -106734, 292256, -145512, 302124, 69764, 362263, 2274, -255776, -45065, 179525, 93321, 157238, -5900, 146061, -21758, 395555, 191812, -45887, 19393, -70655, 90087, 162069, 73762, -271681, 151203, 10689, -77463, 12261, 155766, -7279, 261857, 385661, -6629, 48164, -82067, 28992, 218647, -52961, -97888, 338105, 200812, 130443, 223498, 365884, 70619, 144800, -35966, -209542, -212030, 298429, 57015, -128091, 215519, 173346, -50415, -5269, 147815, 218617, 371839, 21272, -184599, -190431, 435375, 380175, 123713, -70769, -143323, 210120, -102164, 124668, 125165, 290105, 7680, 287295, -2659, 69032, -56256, -66803, 245861, 188792, -85326, 159636, -202841, 123245, 174490, 73799, -55323, 48956, 32519]
13178C2519J53844G3639k9383c2190E7182J87768h2237l8792G3611J11933a77065
13166B87152E9298B4058b12677J1954H1718L5680e2213B1311K94932b56334A76851
13154B67912f8091m72E2788a75620L1590f4337B66216d2013G7978c7913B00094
13142A9316a59319f7293j79646E6339d671j10173D39117C7909J27978a0208C01001
13130A94964a06165A14699m1130a5415B79970I391a05477A11754h8751p2331C71313
13118f5335C3081a5071A33047b17473A15164J8875A9173J8114i3651j47158E15971
13106C666c0348A63118e7312H5423a83150A36946c014A51014M2622K6003a22537
13094A35727a84339E2678J32052J96220A2132K98642P7777f6433E6855M2375J25753
$$ y = [32519, 186363, 73639, 44256, -32190, 57182, 244950, -82237, -121029, 73611, 185544, -177065, 287152, 59298, 24058, -212677, -200723, 81718, 117398, -52213, 21311, 316243, -256334, 176851, 267912, -68091, -68563, 52788, -175620, -144030, -64337, 266216, -42013, 77978, -37913, 200094, 19316, -159319, -67293, -246939, 56339, -4671, -114844, 439117, 37909, 165887, -10208, 301001, 194964, -106165, 114699, 73569, -15415, 279970, 9391, -105477, 111754, -88751, -161082, 371313, -65335, 33081, -15071, 133047, -217473, 115164, 134039, 19173, 37287, -93651, -240809, 515971, 3666, -30348, 163118, -57312, 85423, -183150, 136946, -3014, 151014, 193636, 219639, -122537, 135727, -184339, 52678, 184730, 380950, 12132, 310774, 388551, -66433, 56855, 99230, 224983]
13083B24983p6448h7808k11243h563q508B44912F5631a7909C70165M294A72071
13071A80095q3514K18054E5658J73235d8490q6788A37872C0615h5296I7601a32462
13059a95624A60681j2533a19781F5332K30900p6287B4018g8017j63855j0928A86929
13047b23059A74373a62599A70399F2061J15320G6924a52945C7807a28744B30548
13036b3157l44062H8368a28860E7367j9403b07157H168K51217a52209B8673a15008
13024A37336J06829A21102J81127n5534l7647b0363j75867C7253b09132A31747
13013B44837O36A07761J6162a50836B04103I4756b12886A09659a25619B5401R9807
13002A25208J31907A06527K26607D3363J32892G028J65910J09819A40088K4545
$$ y = [224983, 148535, -87808, -299051, -8563, -17071, 244912, 65631, -17909, 370165, 374459, 172071, 180095, 96581, 314635, 55658, 228893, -48490, -135278, 137872, 30615, -85296, 97601, -132462, -195624, 160681, 148148, -119781, 65332, 296232, 219945, 24018, -78017, -241872, -252800, 186929, -223059, 174373, -162599, 170399, 62061, 177381, 76924, -152945, 37807, -128744, 230548, -23157, -367219, 88368, -128860, 57367, 37964, -207157, 8168, 259385, -152209, 28673, -115008, 137336, 244165, 121102, 302229, 246695, 209048, -20363, -196230, 37253, -209132, 131747, 244837, 245473, 107761, 123923, -150836, 204103, 94756, -212886, 109659, -125619, 25401, 125208, 257115, 106527, 333134, 43363, 176255, 7028, 172938, 282757, 140088, 164633]
12992A64633J89081j34250d86A16134i5195L9995j11278h0009D2918j6833Q0978
12981A07063f3306k82959J67108C47117k0572J0758a41154D11859f4464C73183
12970G9103M3245l372K05425e4148C9704e3519j57233h4528l90062C36759h8568
12958A08529b68977A30811n3109K24882A01646J36746e854j56386D4102L165p937
12947C9330h1042B45595a38052j80611a18877k1866A36126C12K12994I0003M1652
12936A31655i9000H4204J48839a66316e4892A07806l0949J68225a89826D6749
12925A66890n7632j9362a37399B886a47202B5432J69755i0k41670A44762c46270
12913b84582H4984R1091g1183J7648A45318h8347A18986E3755A9803a06341E09193
$$ y = [164633, 353714, 219464, -486, 116134, -95195, -55200, -166478, -80009, 42918, 26085, 107063, -63306, -346265, -179157, 347117, 326545, 337303, -141154, 411859, -64464, 373183, 79103, 122348, 118976, 324401, -54148, 39704, -53519, -210752, -84528, -474590, 336759, -88568, 108529, -268977, 130811, 77702, 302584, 101646, 238392, -5854, -162240, 44102, 47267, 39330, -81042, 245595, -138052, -318663, -118877, -140743, 136126, 312, 213306, 90003, 131655, -99000, 84204, 233043, -166316, -54892, 107806, 76857, 245082, -189826, 46749, 166890, 109258, 89896, -137399, 2886, -147202, 25432, 195187, -90, -241760, 144762, -346270, -284582, 84984, 176075, -71183, -53535, 145318, -88347, 118986, 53755, 19803, -106341, 509193]
12901C795R6131b89584b3739D05365d0461l314I4282l9853k3970O3330K00418
12890B94207G3488J44145J77072a31182C01499F7477L0896A475J84443g1229L261
12879f7968A67869n4277B3598a82194G6824B071d064I2989g1919G7451b24070
12867A71088J33049B5501a20815a0688E9668f2872K4087l83011h6924o0322D2857
12855A46166b78697G0633b40315F4318a20753l9578e7927A68453c8743C7528h0261
12843B80849A03019b17355O0382d6832j40567k3974A10428a00040d4864B4662
12832c65767D43942A56214a01162e126n6562l0863I897Q2938d17668D3955R4199
12821A38154b51799E2100n157J13111p1070a09764L8773I015c2394m8867A69332
$$ y = [3795, 99926, -289584, -23739, 405365, -40461, -43775, 94282, 54429, 30459, 93789, 294207, 73488, 217633, 394705, -131182, 301499, 67477, 98373, 1475, 185918, -71229, -67968, 167869, 113592, 23598, -182194, 76824, 2071, -4064, 92989, -71919, 77451, -224070, 171088, 304137, 25501, -120815, -10688, 59668, -62872, -38785, -421796, -86924, -147246, 42857, 146166, -278697, 70633, -240315, 64318, -120753, -160331, -57927, 168453, -38743, 37528, -80261, 280849, 103019, -217355, -156973, -46832, -187399, -211373, 110428, -100040, -44864, 24662, -365767, 443942, 156214, -101162, -5126, -61688, -92551, 9897, 92835, -417668, 43955, 138154, -251799, 52100, 46943, 160054, 88984, -109764, -70991, 9015, -32394, -81261, 169332]
12809d9765E9691a28999J0499c2473j30552Q0355B4780O7802g103A56932a89101
12797I8048l6379K90581F0987h9358j77158P649O8503M59P8958N0034j62980k0151
12785b44044a3837k4701b195C43994d75498f809k19154g9959J8497r3791g1055
12773c03105A18803a1119C516J8557b34527E2403K00830D9529b41081H6077i0555
12761b7236F9328P0601J223K17903a8516b924q6023D3009e3497A41073b23587
12749A04545d2442G6196J31014a47800b1921E4337D33J17871B4995Q2213d6485
12737A81614J2832H079L905b8913e347A32324h5110E886d6592B52344G8054K22312
12725C00366F0134Q2236a4760A68621b10855F848K24266g5426l07069a56862A87635
$$ y = [-49765, 59691, -128999, -118500, -32473, -163025, -82670, 24780, 92582, -7103, 156932, -189101, 98048, 61669, 352250, 60987, -89358, -266516, -258867, -190364, -189905, -110947, -60913, -223893, -244044, -13837, -38538, -2195, 343994, -475498, -6809, -225963, -79959, -61462, -155253, -71055, -303105, 118803, -11119, 3516, 22073, -234527, 52403, 253233, 49529, -241081, 86077, -90555, -27236, 69328, 139929, 141152, 359055, -18516, -2924, -88947, 43009, -53497, 141073, -223587, 104545, -42442, 76196, 207210, -147800, -21921, 54337, 433, 118304, 24995, 107208, -46485, 181614, 194446, 8079, 11984, -28913, -5347, 132324, -85110, 5886, -46592, 252344, 78054, 300366, 60134, 142370, -14760, 168621, -210855, 6848, 231114, -75426, -382495, -156862, 187635]
12713a26081B09366C4357L21723A59396c1782C86388b0584j8270B34446E5512
12702B16580D4439J67031M6802p8325L5602H1601M3124D8843c7254k95396B36215
12690C92597f0269j84279k04389g822B30850c4599A82715J81589a60716B32918
12679B43890J6966A29238O249c3766B10894G7349M8036F0301K707b31619D6176
12667G37f1885C95719a8591B46655j20428n4316d7321j66641j77019D87105a17881
12655B73637j26429J15529I3746c7282j21563d7461A4811c73994C27617B3089
12644A05745j5042i5047A12618a24285j58708L7268R4433f8931D8141d4691i194
12632a15031L6908D72684h591A03661k3434i4825D8549N3246m4164g8772A23668
$$ y = [-126081, 209366, 34357, 356080, 159396, -31782, 386388, -20584, -38854, 234446, 55512, 216580, 44439, 211470, 258272, 179947, 215549, 81601, 124725, 48843, -37254, -332650, 236215, 392597, -60269, -244548, -448937, -7822, 230850, -34599, 182715, 364304, -160716, 232918, 243890, 260856, 129238, 135487, -33766, 210894, 77349, 125385, 60301, 63008, -231619, 46176, 737, -61885, 395719, -18591, 246655, 126227, 71911, -47321, -213962, -390981, 487105, -117881, 273637, 147208, 262737, 93746, -37282, -158845, -47461, 14811, -373994, 327617, 23089, 105745, 90703, -95047, 112618, -124285, -282993, -245725, -151292, -68931, 48141, -44691, -9194, -115031, -78123, 472684, -8591, 103661, 80227, -94825, 48549, 101795, 57631, -78772, 123668]
12620B94953K10890d6691A37174j4439K7294h8773j6263A42337g3001l92957a85280
12608i4892L1532C0069d3189C26927a12344L2032K7027A18511D6640c89181C48622
12596C5041e0372A8108O4284L10134i0111b7555j98216a09032o0847A38642K07801
12585C46443I6009b65785P365l1409f3972H8244c32906c2084H9698J7674D714
12573h4774M1631l6032B15722a40503A4511a31724q1895H2136C0789K5261i4833
12561C58437A1198N0987J11282N2904e8049A14142a1762B54720b33803B03333
12550E001b1135A53907b1252C73593B7307M6078K09393D8569a98067I2341l8779
12539E3562J69175h3290M0420a1555k12835R5203o4755I1301B6427K25996a24131
$$ y = [294953, 505843, -46691, 137174, 122735, 150029, -88773, -105036, 142337, -73001, -465958, -185280, -94892, -63360, 30069, -43189, 326927, -112344, -80312, -53285, 118511, 46640, -389181, 348622, 35041, -50372, 18108, 82392, 392526, -90111, -27555, -225771, -109032, -169879, 138642, 346443, 96009, -265785, -258420, -289829, -63972, 88244, -332906, -32084, 89698, 107372, 4714, -84774, -43143, -79175, 215722, -140503, 14511, -131724, -213619, 82136, 30789, 56050, -94833, 358437, 11198, 62185, 173467, 226371, -58049, 114142, -11762, 254720, -233803, 203333, 5001, -21135, 153907, -21252, 373593, 27307, 73385, 282778, 48569, -198067, 92341, 53562, 222737, -83290, -42870, -11555, -224390, -129187, -193942, 91301, 26427, 252423, -124131]
12527a4161j33007A7975J71169a79711A8645K86756A18530Q91E132J15868b46504
12515H171M6093e5031m4907b2506n791A70654a78832e301k57666D1472a08738
12503I4528k8140f6159o2274k2981j18371A54746e8818j99523a749k29951B16408
12491e643j10413B3208b74480J23558B20462n9566b9001o1752D4865J06810e2481
12479a84284A5336h7281D1118g3540k0527k9453c7719D28325h1469B31350a58025
12467g3273j29156A22312a21902j48524a07606I8298a33031A17113c614A35395
12456a13301A3194b74863G5501b5919k15025i789E5941J88317b75375i5443n6644
12445a52087D840b20059F4302a64816g3972G8230a79327g6274E2136J82199G3993
$$ y = [-14161, -147168, 17975, 189144, -179711, 18645, 305401, 118530, 119421, 5132, 121000, -246504, 8171, 54264, -55031, -99938, -22506, -28297, 170654, -178832, -5301, -262967, 41472, -108738, 94528, 66388, -66159, -128433, -151414, -269785, 154746, -58818, -258341, -1749, -231700, 216408, -5643, -116056, 23208, -274480, -150922, 220462, 160896, -29001, -90753, 44865, 151675, -52481, -184284, 15336, -87281, 41118, -73540, -94067, -123520, -37719, 428325, -81469, 231350, -158025, -73273, -202429, 122312, -121902, -270426, -107606, 98298, -133031, 117113, -3614, 135395, -113301, 13194, -274863, 75501, -25919, -240944, -9789, 55941, 244258, -275375, -95443, -152087, 4840, -220059, 64302, -164816, -73972, 78230, -179327, -76274, 52136, 234335, 73993]
12433E3711N2821d5676q1503k7060G9389K28547a15024A75386D9469o564b29858
12421C925M5172K3392e9897B80912J04726g5335j77351A76601a6334E4951L99083
12410D54034k21235a28675n4745L9770N1768A78452k5474d3720Q605A62135a9877
12398H8139l2319O1387c3258r3360j73635J13386a8930F5041h9061K1101D2793
12386A74788A8841g4042k42566A37499d01929A37662o5415J5003a39910A01680
12375a94937g9955A28275i0084E5692a59388B8110b0343A58040K417a50704p94
12364a51498C5240a4239b872A94634f592r4077d3371A95934e558A11907a10125
12352c34379c9290A77381a3762A56490o9647I684g7339m8872a4313F3699a24888
$$ y = [53711, 106532, -45676, -127179, -154239, 79389, 307936, -115024, 175386, 49469, 42905, -229858, 3925, 49097, 72489, -59897, 280912, 385638, -75335, -252686, 176601, -16334, 54951, 454034, 232799, -128675, -183420, -143650, -91882, 178452, 152978, -43720, -35115, 162135, -19877, 88139, 55820, 117207, -33258, -126618, -300253, -186867, -18930, 65041, -89061, -67960, 42793, 174788, 18841, -74042, -316608, 137499, -401929, 137662, 72247, 87250, -139910, 101680, -194937, -79955, 128275, -90084, 55692, -159388, 28110, -20343, 158040, 160457, -150704, -151498, 35240, -14239, -2872, 194634, -6592, -100669, -43371, 195934, -5558, 111907, -110125, -334379, -39290, 177381, -13762, 156490, 86843, 9684, -77339, -126211, -14313, 63699, -124888]
12340A08014c3421j0170C74034a08543m3258e5313j40511d5274k48612m3206a60675
12328A96916O1476a82781F9468c2675k76152C23196F7958e0885j671A29331b90909
12316i0585A46911e2128k15030a15031J1844D2607K9451d4815r4898L4563B74484
12304a16769k9910o9760l17560G4299j3249k6629O1634a76787j67571A70386c46134
12292b32374J06109B22617e941B9201b94137D744J35044g2387D0425J3426J04023
12281A57874C0198e6369a8825k249q0058A04606J37709Q005h7919A00140D5106
12269a69551M1407C7576K3330J43690I1846L2223K47836B8377J47968c5900F5966
12257B22925j06251k9836R0082l639a64764G9770c25925A41301J08336D9102J0298
$$ y = [108014, -33421, -43591, 374034, -108543, -151801, -55313, -195824, -45274, -293886, -337092, -160675, 196916, 258392, -182781, 69468, -32675, -308827, 323196, 67958, -50885, -52556, 129331, -290909, -90585, 146911, -52128, -267158, -115031, -103187, 42607, 72058, -44815, -139713, -105150, 274484, -116769, -146679, -216439, -533999, 74299, 61050, 34421, 96055, -176787, -344358, 170386, -346134, -232374, -126265, 222617, -5941, 29201, -294137, 4744, 139788, -72387, 40425, 53851, 157874, 30198, -56369, -18825, -21074, -101132, 104606, 242315, 250320, -87919, 100140, 45106, -169551, -128144, 37576, 60906, 204596, 91846, 124069, 371905, 28377, 176345, -35900, 65966, 222925, 116674, 86838, 176920, 173281, -164764, 79770, -325925, 141301, 249637, 49102, 59400]
12246E9400J07989Q9586J65636f2301B9740A1489R7595A7589J05264J56858j09388
12235A70323a31273F5487Q6659J8993M00773a40777B09091J05538h7900A76592
12224I6516K75392A4618b28024A80977N8327n6949G4087L61400j36559D6483R7111
12213A43594a20931e0322J9334l0321B52731L6965j11728J88218p2635Q8747G6882
12201b1998j17727a9144D63910f9889A61593J07682E5812J94708J52968A25070
12190C21597G0436a64627C81072i9294D9560Q4601a17755L4128A2824a20837A79967
12178G6277C0293L14989A36627d1593j47231C58486H5144J24170A6348l246J64666
12167A77768K0250E8083a6961I7622Q0280J14507H4951L19667D681J0081K82955
$$ y = [59400, 167389, 256975, 422611, -62301, 29740, 11489, 109084, 17589, 122853, 279711, 170323, -131273, 65487, 152146, 171139, 571912, -140777, 209091, 314629, -87900, 176592, 96516, 371908, 14618, -228024, 180977, 239304, 182355, 74087, 435487, 298928, 46483, 143594, -120931, -50322, -30988, -61309, 252731, 289696, 177968, 366186, 293551, 382298, 76882, -21998, -139725, -19144, 463910, -69889, 161593, 269275, 55812, 250520, 403488, 125070, 321597, 70436, -164627, 381072, -99294, 49560, 134161, -117755, -83627, 12824, -120837, 179967, 76277, 30293, 345282, 136627, -41593, -188824, 358486, 85144, 209314, 16348, 13102, 177768, 198018, 58083, -16961, 97622, 177902, 292409, 84951, 404618, 4681, 14762, 297717]
12156B97717a69960F074a24639j48120D162b66035C36187A21345c0962A93781
12145a45984A00198a84395J5104b9950R882k11236A2483a5396C3492F498L00008
12134C06506a55853M6674A63213a8743A82837B7846a23588B8332a67118G2402
12123f5369A72542l8817b1045j52549d3754a0795j10564A18382j2727L6092d1847
12111e0235B99493A45131K2389f3021A36860d1360j79901l1482a09024b0601l4995
12100e5596a2566I2389b68655J23655O0341c9719E2348f5577k50676c0545n823
12089c6368k41776i5169j01786E8807b0196D4266b55928e861A18078l9848a01660
12077H7503b9744j69871e6641n5963C2105a58319D0589L6687K30585q3614M96996
$$ y = [297717, -169960, 6074, -124639, -272759, 4162, -266035, 336187, 121345, -30962, 193781, -145984, 100198, -184395, -169291, -29950, -20068, -231304, 12483, -15396, 33492, 6498, 306506, -155853, -109179, 163213, -18743, 182837, 27846, -123588, 28332, -167118, 72402, -65369, 172542, 133725, -21045, -173594, -43754, -10795, -121359, 118382, 105655, 141747, -41847, -50235, 299493, 145131, 167520, -63021, 136860, -41360, -221261, -252743, -109024, -20601, -55596, -12566, 92389, -268655, -145000, -84659, -39719, 52348, -65577, -316253, -30545, -36368, -278144, -95169, -196955, 58807, -20196, 44266, -255928, -5861, 118078, 78230, -101660, 87503, -29744, -199615, -56641, -112604, 32105, -158319, 40589, 77276, 307861, 224247, 721243]
12066G21243K29820N94753m59697B3127K61797e4575E8793B0636h1069L4895A2469
12054b31301f0414j06876A64730a20564L4334D14236b02874A04706l5892h4962
12043a30541B67892b91159H49c6955r0792A12135o306d67263a5805C19181r3487
12032B25694a59596F826b08755B5690g5440A40388b24562F7428e871E1294J7472
12021F8766a21026N3911H9759K01607A00620a32714A51380i8761j55986A62029
12010B24473F6064e3414k48214L7919a03225A7576Q9427a04273O229b837I9416
11998d5817l59017B338O0814g4549H8932c6478j00413r0903G9123a49624O045
11987a43579r5508A07317k6826c0183K561n4k4409C01776b90240A0719J577a29221
$$ y = [721243, 951063, 1545816, 1086119, 23127, 284924, -54575, 58793, 20636, -81069, -46174, 12469, -231301, -60414, -167290, 164730, -120564, -86230, 414236, -202874, 104706, 68814, -84962, -130541, 267892, -291159, 849, -36955, -127747, 112135, 105829, -467263, -15805, 319181, 225694, -159596, 6826, -208755, 25690, -75440, 140388, -224562, 67428, -5871, 51294, 68766, -121026, -67115, 89759, 291366, 100620, -132714, 151380, -98761, -254747, 162029, 224473, 66064, -53414, -301628, -263709, -103225, 17576, 107003, -104273, -98044, -2837, 99416, -45817, -404834, 2338, 63152, -74549, 88932, -36478, -136891, -227794, 79123, -149624, -143579, -239087, 107317, 80491, -30183, -27622, -27676, -52085, 301776, -290240, 10719, 12296, -129221]
11974H2111L6320b10603A92992D3263Q1129l2558q701I258b22679B98170a25114
11962a55155r830A15700C8336Q4535l7672A1819O0202M7918k7411D2421a77916
11950C5894b65810C4799a20751A0327P0389C2250Q8744h8671a961p0147j87478
11939b59586M0449B69649A06840a16829j9819A7568b90870a4569k52782A04244
11928c1069D9853a70982A63179b60953B36690b8558M524m07171A21389a3933j11934
11917a25867C76804a35507j29237A49820f2963p1040a4683k52776J27179H4554
11906B2709J25671a0663A91809n8220a12044A55389E5640A8060g5573j13265n8436
11895b47274L0109B10899c48752B49752i2792C02579f151A88097a21679A43169
$$ y = [82111, 118431, -210603, 192992, 43263, 124392, 91834, 83133, 9258, -222679, 298170, -125114, -155155, -164985, 115700, 38336, 122871, 85199, 11819, 72021, 119939, 92528, 42421, -177916, 35894, -265810, 34799, -120751, 10327, 80716, 32250, 120994, -88671, -1961, -72108, -259586, -219137, 269649, 106840, -116829, -136648, 17568, -290870, -14569, -267351, 104244, -31069, 49853, -170982, 163179, -260953, 236690, -28558, -24034, -431205, 121389, -13933, -125867, 376804, -135507, -264744, 149820, -62963, -134003, -14683, -267459, -140280, 84554, 22709, 148380, -10663, 191809, 133589, -112044, 155389, 55640, 18060, -75573, -188838, -247274, -217165, 210899, -348752, 249752, -92792, 302579, -6151, 188097, -121679, 143169]
11884c47840A85107f6115A44966J806k8817b37942j31908A85132F8446A3854o669
11873G185O0760J03179L7519o5167L62514F1719e1923j71033A47727c22631A5127
11861b37464m1291Q1962g8361F5588k7112K68976a21034D08956d11556E2575c1782
11849e512H7924D1619M7565a81898J1471B28493b59076O0660K3768j49052C17378
11837a7693o7213j6308C49374a33236k53795E0512B3620a37982N7554D8523b97465
11825B7352i6199F9811d21375D5889a4988k26543B0613L2563f4179r3548b877
11813a75438c0602B47361q3307J35035b90934J1780H2424b893n2177A65960n9119
11802A06841O0351b32916a14175a7648C3943c81220a14706j7099j21866Q0111
$$ y = [-347840, 185107, -66115, 144966, 146772, 117955, -237942, -369850, 185132, 68446, 13854, 7185, 67945, 171124, 208643, 143476, 505990, 61719, -51923, -222956, 147727, -322631, 15127, -237464, -278755, -196793, -78361, 65588, 38476, 307452, -121034, 408956, -411556, 52575, -31782, -5512, 87924, 41619, 89184, -181898, -170427, 228493, -259076, -198416, -174648, -323700, 317378, -17693, -84906, -101214, 349374, -133236, -387031, 50512, 23620, -137982, -80428, 48523, -297465, 27352, -96199, 69811, -421375, 45889, -14988, -241531, 20613, 53176, -64179, -157727, -2877, -175438, -30602, 247361, 164054, 299089, -290934, -279154, 82424, -2893, -55070, 165960, 106841, 167192, -232916, -114175, -17648, 33943, -381220, -114706, -131805, -253671, -173560]
11792a73560n0836a2737E2896K43931h1399p5082O2837j79004j5477A39635A1231
11780A28782c40785A73571B8892d7824E7558d7920k06540A39964b11668a9262
11769g7171J3071B06419c25553C6594f7202r5079b6819j03722d4200o8339A69200
11757A01953J20353C2375a57149A20598E5515K7079b2648j19626E2096b33120
11746d1814J1834A21975K60298c2479p2736K697C93255A88452G6925N8315a34041
11734a97119F0350J77429I7212b25967C06543c84127M0329b3547j39659A07843
11723a8889A66841J2772m1467C8979K9656J4427c6539j13408B401f2808k04332
11712b67140a04338B0108e0297j7101D26195c2271j40115L3910K22a0107A03500
$$ y = [-173560, -224396, -12737, 52896, 296827, -81399, -156481, -93644, -272648, -288125, 139635, 11231, 128782, -340785, 173571, 28892, -47824, 57558, -47920, -254460, 139964, -211668, -19262, -77171, -64100, 206419, -325553, 36594, -67202, -162281, -26819, -130541, -44200, -112539, 169200, 101953, 222306, 32375, -157149, 120598, 55515, 82594, -22648, -142274, 52096, -233120, -41814, -29980, 121975, 382273, -32479, -105215, -102518, 393255, 188452, 76925, 135240, -134041, -197119, 60350, 237779, 97212, -225967, 306543, -384127, -343798, -23547, -163206, 107843, -18889, 166841, 179613, 138146, 38979, 68635, 83062, -36539, -149947, 2401, -62808, -267140, -104338, 20108, -50297, -67398, 426195, -32271, -172386, -138476, -138254, -10107, 103500]
11700B02163D4069M9264L2888J79161C457K3711N8562g7501j53450h7692D6036
11688C85203A86084d9566F125b96840A00681R5880g4754A75952q0799A9083K3733
11677D2816J32360b01003A29185g4413m4344B41271a10210A33381J04620b36254
11666B3606b03675A78758a09452K4750K8715I2189P508P010m0015J72918R6684
11655C36294n9766R7590A9796F377i7874I4603f9392F5584i2212I4043A1059c34706
11642b70892F6538e44559f5374B11482d62166G1433A0895M3534f5541k04098D142
11630a72172A09524m3757L32042B6226K18122C4764h8888A35681n9009j3684a80
11618F5670h2614B11548r1474O9207a75036F7840a03569B7165L8095P7414h2545
$$ y = [202163, 44069, 93333, 126221, 305382, 3457, 27168, 85730, -77501, -230951, -87692, 46036, 385203, 186084, -49566, 6125, -296840, 100681, 196561, -74754, 175952, 95153, 19083, 42816, 175176, -201003, 129185, -74413, -118757, 241271, -110210, 133381, 238001, -236254, 23606, -203675, 178758, -109452, -84702, -55987, 92189, 99697, 106707, 66692, 239610, 336294, 276528, 374118, 19796, 6377, -97874, 94603, -69392, 65584, -92212, 94043, 11059, -334706, -270892, 66538, -544559, -65374, 211482, -462166, 71433, 10895, 54429, -65541, -269639, 4142, -172172, 109524, 65767, 397809, 26226, 244348, 34764, -88888, 135681, 76672, 62988, -180, 65670, -82614, 211548, 120074, 189281, -175036, 67840, -103569, 27165, 65260, 142674, -82545]
11606A52169E1981J45120m3243b725k86973F3927k0527J53892C1736P3961e5023
11594B14036b71455F1567b55204A25991O0449m3723D4940K56952j37241N0727
11584B15378p5473l2044a48719e3739j15088l9331g6249L6314B32872M2601A16657
11572C35678B8910J57076R5344j39472J78474d7089A91679b43856J00388F3309
11561c51693B89327e6106E2749a40122r9831B24865P2401e4499D5143R338b6367
11549a12407A01967k174R1744L29457g4477A25402a58749b8971k90218G5535b18031
11537A00590p65a03756G5352b15455c8609q8181A60377K60640h7286k12736a0430
11525A7704j229f0072C5863Q1378m0445O0825a04494A71779G0170J70727A961
$$ y = [152169, 51981, 197101, 153858, -2725, -289698, 63927, 43400, 197292, 31736, 105697, -55023, 214036, -271455, 61567, -255204, 125991, 186440, 142717, 44940, 301892, 164651, 215378, 139905, 107861, -148719, -53739, -168827, -208158, -76249, -39935, 232872, 275473, 116657, 335678, 28910, 185986, 281330, 141858, 320332, -47089, 191679, -243856, -143468, 63309, -351693, 289327, -56106, 52749, -140122, -239953, 224865, 297266, -54499, 45143, 54481, -26367, -112407, 101967, 99793, 191537, 520994, -74477, 125402, -158749, -28971, -319189, 75535, -218031, 100590, 99825, -103756, 75352, -215455, -38609, -126790, 160377, 421017, -87286, -300022, -10430, 17704, 16475, -60072, 35863, 117241, 76796, 137621, -104494, 171779, 70170, 240897, 1961]
11513b36031c2279M784R968A50963b05892B32375R3378j47722k1142K17037A80442
11501b1444E7870a98528A54043B121J25994k4309O6180J29786e6355I2676C4493
11489h0074B58220A21486P7379F7970a3291k8021k891A64140Q7431E4869N1854
11478A06723k0606M3113a41977A60351C7138J25184K0255G3338J46850N5294j0127
11467B65355H9825K22239J18699p0295H7461J52066k4687L5995f5546n5966j35032
11456b56544A70473a9635B43632P7779c8797j71824A62010a70535a0133A0245
11445B61915J58264d5089A18933c85427B82989r5630g0243k50705B61518r1072
11435A70446N7273c12056c5698D0226b06402J4195I6507K61735a04810D70477
$$ y = [-236031, -32279, -27495, -17527, 150963, -205892, 232375, 325753, 178031, 156889, 373926, 180442, -21444, 57870, -198528, 154043, 2121, 128115, 103806, 169986, 299772, -56355, 92676, 34493, -80074, 258220, 121486, 198865, 67970, -13291, -41312, -44203, 164140, 251571, 54869, 106723, 86117, 129230, -141977, 160351, 37138, 162322, 182577, 73338, 220188, 275482, 265355, 89825, 312064, 430763, 360468, 87461, 239527, 214840, 250835, -65546, -121512, -256544, 170473, -19635, 243632, 321411, -38797, -210621, 162010, -170535, -10133, 10245, 261915, 420179, -45089, 118933, -385427, 282989, 187359, -70243, -320948, 261518, 170446, 227719, -312056, -35698, 40226, -206402, -192207, 96507, 358242, -104810, 470477]
11424A49075I807b2385k17496B14472c73019A06527a72697G2202e2926C49884
11413D0838f1059j82608Q3816m5024N3092F5670b09250B07025p9689J05514b8783
11401B64067A22212a4978A47049b186E4108b52726L2273B3697O877b83645a06881
11389B38303H1372a99086Q2981o3564m0103A23990K56567A35309a72267f9195
11378C1171K5508a53928D9886g5709K0112j39313B17097d13715B5121b35689c3893
11366B57254c5308j47867C5570J93925c23853f5149B53460g9713A81666d8898
11355A18971a50128j4265C7829J01252a20158q4881f7560r8298H8616c65817a2106
11343A20980O6794a7247A88417A4327K44541b45236E2050J00282b03068H7275
$$ y = [149075, 9807, -22385, -239881, 214472, -373019, 106527, -172697, 72202, -52926, 349884, 40838, -61059, -243667, -159851, -204875, -151783, 65670, -209250, 207025, 127336, 232850, -28783, 264067, 122212, -14978, 147049, -2186, 54108, -252726, -220453, 23697, 30574, -283645, -106881, 238303, 81372, -199086, -116105, -179669, -219772, 123990, 380557, 135309, -172267, -69195, 31171, 56679, -153928, 49886, -75709, -55597, -194910, 217097, -413715, 25121, -235689, -33893, 257254, -35308, -183175, 35570, 229495, -323853, -65149, 253460, -79713, 181666, -48898, 118971, -150128, -164393, 37829, 139081, -120158, -205039, -67560, -165858, 88616, -365817, -12106, 120980, 187774, -17247, 188417, 14327, 258868, -245236, 52050, 152332, -203068, 87275]
11332a33496j8938p5506D0975J74777R1951a45662J1301H151c75169A12499b46487
11320A9462i7802c5842C74000a28730N9492o7083b9065l99013H1805J41506c7629
11308D1222A6607g8819o6276G176J59998p9712a51049f6088A86770l4594k9681
11297A22495B8002J26114a083k36483a3523B57735f4380D81443a68281L9140M6281
11286h2860P66a6902k21221Q0879M787k6072I4100g0166k33257B6770c29054J62340
11274a66714M3987A69898b12559a1542j44534q3816A55807F449b8697m10906B11376
11262a09883C65787E2364A1349K4234j0652a48284a7114k16492j09626A50073
11251a85623A60957h5714A78001a66273d0122l81978a96194O6460E6705d11077
$$ y = [-133496, -152434, -227940, 40975, 215752, 307703, -145662, -134361, 8151, -375169, 112499, -246487, 19462, -97802, -35842, 374000, -128730, -69238, -136321, -29065, -428078, 81805, 223311, -37629, 41222, 16607, -78819, -145095, 7176, 167174, 87462, -151049, -66088, 186770, 152176, 122495, 28002, 154116, -1083, -237566, -13523, 257735, -64380, 481443, -168281, -129141, -82860, -82094, -16902, -238123, -157244, -152457, -178529, 94100, -70166, -303423, 26770, -329054, -166714, -122727, 169898, -212559, -11542, -156076, -239892, 155807, 6449, -28697, -439603, 211376, -109883, 365787, 52364, 11349, 35583, 24931, -148284, -17114, -233606, -343232, 150073, -185623, 160957, -85714, 178001, -166273, -40122, -422100, -196194, -129734, 56705, -411077]
11240B6429i5606C5442j6182L4740j2116b1176q5742H1004a34184H6079b64774
11228C72895A19989J5943b14378O5948k6347K6955N4245B845a14392L0599d1410
11216a48048M4921I2425m1386a4392m6467B0046b56090d6461k59710a13242k00607
11205c13849h684C15642b17195l550E0233P907k1196j4615O6256B7458J9355d77333
11192d09505A49119m6806P0880c3439b320q3824B39637a38598A7354b1456k85919
11181c07375D3066i3562A06520b02190M2212k4158k21714i9195D1582a61712r2868
11170b54580A9895O2522b6407C0064a18791l09362G3348a7434k85922n1538g5633
11158b7303j91504C3189b83474d9224j22358A20370M9621e9349m3017B3310M3183
$$ y = [26429, -95606, 35442, 19260, 54000, 41884, -21176, -106918, 81004, -134184, 86079, -264774, 372895, 119989, 135932, -214378, -148430, -174777, -147822, -93577, 2845, -114392, -83793, -41410, -148048, -103127, 92425, 51039, -14392, -60859, 20046, -256090, -46461, -306171, -113242, -313849, -8684, 315642, -217195, -220745, 50233, 58140, 36944, 22329, 88585, 27458, 46813, -477333, -409505, 149119, 102313, 173193, -33439, -2320, -86144, 239637, -138598, 17354, -21456, -307375, 43066, -93562, 106520, -202190, -159978, -184136, -405850, -99195, 41582, -161712, -254580, 19895, 82417, -26407, 30064, -118791, -428153, 73348, -17434, -303356, -354894, -75633, -27303, -218807, 33189, -283474, -49224, -171582, 120370, 169991, -59349, -102366, 23310, 66493]
11147F6493K31441n2385a97384i784n2730m00083b22444d4361j00416A58345c2483
11135B28110f7274C17922A56944P3893a0227o6161A10220q444D2651e8997K5018
11124c3979A58973d9408h040H7022K14319r4733A434b1285l62344A85164c4316
11112i9428I6130J44133b58952I9456J53297i4057B19649K40716p2777H4151R7357
11101A81508J03316B70K71061J8738Q0381D8372K66537E0170O503J75434A2777
11089A76453m1087K37851H4969J48516C4453K00642K62697B16073c3714C0663
11078B13236k3294D9761K66766n8103I5249b7831C76996A58339L20784o5869J85758
11067E99012B31027J56205o0930o4347J23823M2716M9972K47660k58663L11559
$$ y = [66493, 297934, 245549, -197384, -9784, -62514, -462597, -222444, -44361, -144777, 158345, -32483, 228110, -67274, 317922, 156944, 230837, -10227, -76388, 110220, 101776, 42651, -58997, -33979, 158973, -49408, -8040, 87022, 301341, 206608, 1434, -21285, -383629, 185164, -34316, -99428, 96130, 240263, -258952, 99456, 252753, -94057, 219649, 460365, 387588, 84151, 181508, 284824, 270, 271331, 290069, 370450, 48372, 314909, 50170, 56673, 232107, 12777, 176453, 135366, 373217, 84969, 233485, 34453, 235095, 497792, 216073, -33714, 30663, 213236, 189942, 49761, 316527, 258424, 95249, -27831, 376996, 158339, 479123, 413254, 599012, 231027, 387232, 326302, 261955, 385778, 428494, 478466, 726126, 467463, 779022]
11057G79022C29685N37911k83753N43932D28205M05144C78484L51018k24806J01631
11047F06327k0156n8487M83240l46163l6978K68302l2671j58833j18403k83704
11037C02474J99916M5016K13846k91684A97022M19160K46686m21289J28680Q0686
11027F50945P8435M1514P10C67604J54257K47825l76216p49o7752J04120o8403
11016C60686Q8974r5023J81921Q655o7585j71496L90512K70562l48474J1839q1946
11005E48625j83512M99125D29704J26702j31923n2342k274L63784l47395K11673
10995E97929K37102B86924L02092K45132l43461L15172l40984J12828q299K58282
10985H27686K1160K55712J07255k04045J50102Q6118M2251M8354N71201k18036
$$ y = [779022, 329685, 867596, 583843, 1127775, 428205, 833349, 378484, 729502, 504696, 606327, 586171, 527684, 1010924, 664761, 627783, 896085, 863414, 704581, 586178, 302474, 502390, 547406, 761252, 469568, 197022, 616182, 862868, 441579, 570259, 650945, 729380, 770894, 771604, 367604, 521861, 769686, 393470, 392721, 324969, 429089, 360686, 449660, 354637, 536558, 545213, 477628, 306132, 696644, 967206, 618732, 630571, 548625, 365113, 864238, 429704, 556406, 424483, 372141, 369867, 733651, 386256, 597929, 835031, 286924, 589016, 834148, 490687, 805859, 464875, 577703, 569404, 827686, 848846, 1104558, 1211813, 1007768, 1157870, 1243988, 1286239, 1334593, 1905794, 1687758]
10975A687758O56104J05703k00368J60623J50355K8718m67921j09357j61068j82577
10965A667970j54785j58043K92962m15078K69963k08281o246L48713k10981j20996
10955A305198k79576r9948q0660j66767O1951l56745p9740J66016k2564A53046
10944I4802L86992A56143L23961j41844b55072a27416A03970M4794c5694j21152
10934a56846C379K6630R3377d47436A01398b0635A38159b2417A04072L2711i0842
10922i046A92021c48658H300J14757j3759H140K7058a09783A42307F6767c129
10910A25422A5653f0753H7603D3709i6300K5205A59738n8203c6418H3527g4278
10898c7717o926p7103B24619a97585q7811P4939a3242A27749a19787A44646g7991
$$ y = [1687758, 2343862, 2449565, 2249197, 2409820, 2560175, 2588893, 2120972, 2011615, 1850547, 1667970, 1513185, 1355142, 1648104, 1233026, 1502989, 1294708, 1288462, 1637175, 1426194, 1305198, 1025622, 925674, 845014, 678247, 740198, 383453, 303713, 469729, 447165, 153046, 94802, 481794, 156143, 480104, 338260, -255072, -127416, 103970, 148764, -35694, -156846, 3379, 30009, 123386, -447436, 101398, -20635, 138159, -22417, 104072, 136783, -90842, -9046, 192021, -348658, 8300, 123057, 109298, 8140, 35198, -109783, 142307, 66767, -3129, 125422, 15653, -60753, 87603, 43709, -96300, -71095, 159738, 101535, -36418, 83527, -74278, -37717, -44643, -121746, 224619, -197585, -285396, -210457, -13242, 127749, -119787, 144646, -77991]
10886i8691j43189g5687A26398a80260O528F9867f9045l16226l1347A1925J26982
10875A38907e8107j4850C17010a95132E2845d4776j79341A1381a61702b7865A9891
10863d29024D6161b51781C65958b78158a00823p752E3010a8087A2443c5884C52282
10851a24882B02914b57439I2915i2036A5366O8551L50462F2436J76172d21784
10840B49570A13100K1677J33096C7365j3963e3448j26947g9113B36087k9031c8757
10828a86215M6711M1958A92444e8740A20325A7734a78882e5293l58982J45985
10818b68290A68250i1793H1099l5118J32345b56491D3291b14425J00338A14219
10807a0093m5652k07917f9342I9994a59684c2632j34026O0205J5729A59792b13045
$$ y = [-98691, -241880, -75687, 126398, -180260, -173732, 69867, -69045, -385271, -416618, 11925, 138907, -58107, -72957, 317010, -195132, 52845, -44776, -224117, 11381, -161702, -27865, 19891, -429024, 46161, -251781, 365958, -278158, -100823, -108575, 53010, -18087, 12443, -35884, 352282, -124882, 202914, -257439, 92915, -92036, 15366, 83917, 434379, 62436, 238608, -421784, 249570, 113100, 134777, 267873, 37365, 23402, -53448, -180395, -79113, 236087, 207056, -38757, -186215, -139504, -97546, 192444, -58740, 120325, 17734, -178882, -55293, -414275, -268290, 168250, -91793, 81099, 45981, 178326, -256491, 43291, -214425, -114087, 114219, -10093, -55745, -263662, -69342, 99994, -159684, -32632, -166658, -106453, -90724, 159792, -213045]
10795A84714D165b24387L1096h0304c7109B32455h718C80900A83854l3835i7525
10783b14060L484B15045i0361k2771l21516c4894k60625J10240M0535I8265a68889
10771B37283g9868B1461b01059A82416l3097B0498K39654d2429F9669a11881m05560
10760e17441A9815b72114A95668q0858N9716E5649J861J28280q4224b69275N6177
10749b13098j708c3440A0291c57289H1925P4152a03415B78691Q858j29984e0653
10737b4940A60872D872a32886m1310A14735J57726b11597G7832K67223d1116j1277
10726e2393j61348k6353A90361b93440J26099o507j59308e1608j7671r3481D90315
10714A6242N1194a79144P5939e0885B96742a76055b0470p7590d0347C77861b03435
$$ y = [184714, 4165, -224387, -193291, -80304, -37109, 232455, -8718, 380900, 183854, 150019, -97525, -214060, -210576, 215045, -90361, -113132, -434648, -34894, -295519, -185279, -144744, 98265, -168889, 237283, -79868, 21461, -201059, 182416, 149319, 20498, 260152, -42429, 69669, -111881, -517441, 19815, -272114, 195668, 114810, 174526, 55649, 57510, 185790, 101566, -269275, -213098, -214806, -33440, 10291, -357289, 81925, 156077, -103415, 278691, 287549, 157565, -50653, -24940, 160872, 4872, -132886, -174196, 114735, 272461, -211597, 77832, 345055, -41116, -52393, -213741, -240094, 190361, -293440, -167341, -173848, -333156, -51608, -69279, -162760, 490315, 16242, 67436, -179144, -103205, -50885, 296742, -176055, -20470, -98060, -40347, 377861, -203435]
10702b581H8841k3072O0901a9164N513j108k30139d212A12249a13749l7172L9390
10690a11531j585e317m5989E1436b07616P1818e0920H8124J57143a86928e2609
10678c47831J19871J03060J7466I4551A8138e9263A19532a00498j34887G572g8789
10666h1533m9829j04495D4227b31588A1541N2545a29829M3909L3710l9564B837
10654a35727A2798b6208H9091N2739B9591f5801l6570c2812A79014a02558A92119
10642a97968K4483A43665a83914d2890A37119B7265b8665d71A00259k4379a5832
10630A4280a8384o5244l5105E203a15532E2454b54647A4883d2470A4033d76053
10618A98961a10635K6731A60114c63691C33447c15393h8950I5130b21959A42533
$$ y = [-2581, 88841, 65769, 126670, -19164, -13651, -14759, -244898, -4212, 112249, -113749, -150921, -111531, -113116, -5317, -51306, 51436, -207616, -135798, -50920, 88124, 245267, -186928, -52609, -347831, -227960, -124900, -107434, 94551, 18138, -59263, 119532, -100498, -235385, 7572, -78789, -81533, -131362, -235857, 44227, -231588, 11541, 64086, -129829, -85920, -52210, -91774, 2837, -135727, 12798, -26208, 89091, 141830, 29591, -65801, -102371, -32812, 179014, -102558, 192119, -197968, -173485, 143665, -183914, -42890, 137119, 27265, -28665, -471, 100259, 75880, -15832, 14280, -18384, -83628, -118733, 5203, -115532, 52454, -254647, 14883, -42470, 14033, -476053, 198961, -110635, -83904, 160114, -363691, 333447, -315393, -88950, 95130, -221959, 142533]
10607C46582a56964d9169A02439l1070i7534n0118q6442i0141m57208I3822N5813
10596A49635b6937n4614F7913b85639C8419d0872j9527l97887a08085A49430b916
10584A01248a80016f4586I1104a95002k1819A48395B1427a63812k90903a08508
10573E7761c1160j21173a6123k506j11415F7145N9356b80446B35275N0246D4325
10561F7487J32064C0161O16J92451B3483a12108a3225k90620A1447c13110B55249
10549B4870O3767O463a58965a0308H9535c4556q0318j23123a8222j93844A14021
10537f7572k31343N6648R0591p5657a8944j9350A36241b51295i4330A2988L32143
10526C45131H0092h5578j73500A55428E4745b24520i084F9914K2828j053d4094
$$ y = [346582, -156964, -49169, 102439, 71369, -97534, -147652, -234094, -90141, -547349, 93822, 149635, -26937, -81551, 67913, -285639, 38419, -40872, -60399, -458286, -108085, 149430, -2916, 101248, -180016, -64586, 91104, -195002, -216821, 148395, 21427, -163812, -454715, -108508, 57761, -31160, -152333, -16123, -18629, -130044, 67145, 126501, -280446, 235275, 285521, 44325, 67487, 199551, 30161, 30777, 223228, 23483, -112108, -13225, -303845, 11447, -313110, 255249, 24870, 88637, 95100, -158965, -10308, 89535, -34556, -114874, -237997, -18222, -212066, 114021, -67572, -298915, -242267, -151676, -227333, -18944, -38294, 136241, -251295, -94330, 12988, 345131, 80092, -85578, -259078, 155428, 54745, -224520, -9084, 69914, 92742, 91689, -44094]
10514A01719m8000b24963A48777a20544K5894A36508O8494d4363j54986d4451
10503A00656g1362l1397L8831b8332B57252a11820a578j00925A29132h0131A32468
10491a25712c810j96147Q803A20800b4829I5603b15814G2460J86914Q7999a38553
10479B89811q1687r4526J2566a08694a5546B86280C6027L7260b25257L8971c1095
10467B42478a43546A70382b416H2834m0234o776b23478k5504D9724K34172K7150
10456C11046a81146N2338A9010b95449G6404a81156N1739A1463Q4770e9855a2532
10444A59079n1176A7727a37602H618a94276P2282D9552b65525b8268B9729d1727
10432A12119a91628A02418d36672h8187L3320F4256R3702I762d41641C7007e7342
$$ y = [101719, 53719, -224963, 148777, -120544, -94650, 136508, 205002, -44363, -199349, -44451, 100656, -71362, -102759, -63928, -28332, 257252, -111820, -1578, -102503, 129132, -80131, 132468, -125712, -3810, -199957, -191154, 120800, -24829, 95603, -215814, 72460, 259374, 347373, -138553, 289811, 208124, 113598, 126164, -108694, -15546, 286280, 36027, 73287, -225257, -186286, -31095, 242478, -143546, 170382, -2416, 82834, 42600, 35824, -223478, -248982, 49724, 283896, 311046, -181146, -128808, 19010, -295449, 76404, -181156, -129417, 11463, 96233, -59855, -12532, 159079, 107903, 17727, -137602, 8618, -194276, -121994, 49552, -265525, -28268, 29729, -41727, 112119, -191628, 102418, -436672, -88187, -54867, 64256, 157958, 9762, -441641, 37007, -57342]
10420a5601m1403n7851d2204A29625d8737q9877C17780b23801A61453b3717B49623
10408d9770l02466A6309a08554D8089R4619a05557I018c303j03426o6764j138
10397a74631b6510q5824B22052E953a6297F2104i2131O964A19388J37918j3152
10386B44154E3968R5301c9548J7868A8181L43833G665J16185J76267R7385A35208
10374A66054J0180Q6928f9019A35672J05923J11039p4085K99520B52312K64491
10364E16803I2228L26778k06694n884j00515J2506C5669e3521A11363b00138h3314
10352C8837J71433K02075N3560J01818B68090j4375J63403j91050A5902M43931
10342D59833A00136D2833K18070K78282B36577B969K69725M4738A7779J85008
$$ y = [-15601, -57004, -114855, -42204, 129625, -48737, -138614, 317780, -223801, 161453, -23717, 249623, -49770, -352236, 16309, -108554, 48089, 142708, -105557, 9018, -3303, -106729, -173493, -174631, -26510, -112334, 222052, 5953, -16297, 62104, -92131, -85167, 119388, 257306, 244154, 53968, 149269, -39548, -21680, 18181, 362014, 7665, 123850, 300117, 397502, 135208, 166054, 176234, 263162, -69019, 135672, 241595, 352634, 278549, 578069, 252312, 516803, 92228, 419006, 212312, 206428, 105913, 118419, 35669, -53521, 111363, -200138, -83314, 38837, 210270, 412345, 465905, 567723, 268090, 253715, 417118, 226068, 15902, 459833, 100136, 42833, 260903, 539185, 236577, 2969, 272694, 317432, 17779, 202787]
10332B02787J4029A02220J41527n5204i6598B52848H9323J13408J0353d9787C53384
10320b53527C4535a0202n8090A01011b82683A89182o1663C517K07433p4334b4581
10308b28873A20842Q1187f8936j34383h7063j82295B85194e5553A00662n825B4708
10296H9571b2288E8411a88689E2753L90480B08897a39733f6691J752h769p7401
10285h6170m209B26927j05437a25l95631B3078b32308B3797O7208K1217A5729
10273c0463j20053A3054g3311D1320f7532K5331A80628a69693A07905l7466J85634
10262B56073k722D7107J96647O3615j21069k1792J50355q5950J37208a22916J9408
10251a03508D07255a484j6342j58784d7427j16212A11344b77629e350j86286L2428
$$ y = [202787, 216816, 102220, 243747, 188543, -96598, 252848, 89323, 202731, 213084, -49787, 353384, -253527, 34535, -10202, -68292, 101011, -282683, 189182, 127519, 3517, 210950, 136616, -24581, -228873, 120842, 202029, -68936, -203319, -87063, -269358, 285194, -55553, 100662, 94837, 24708, 89571, -22288, 58411, -188689, 52753, 443233, 208897, -139733, -66691, -64939, -8769, -86170, -90379, 226927, 121490, -125, -395756, 23078, -232308, 23797, 91005, 112222, 15729, -30463, -150516, 13054, -73311, 41320, -67532, -42201, 180628, -169693, 107905, 70439, 256073, 253351, 47107, 243754, 307369, 186300, 164508, 314863, 228913, 366121, -122916, -103508, 407255, -1484, -17826, -176610, -47427, -163639, 111344, -277629, -5350, -191636, -159208]
10240a59208A77502q3786b43150J09917j64113a03204L316I7599b9092q5968r956
10229a25016c2349j27734c7512k34121I3680h8056N689A76871l2496m9795B2110
10217A67644J9171b26711b2393m5421j37282a215j37270f0422B60280e4967m9653
10206a04620C28128g7155n2798k5167f3562A30843i6588A2632K5702a27186a3861
10194C9262j742J16314k8000a00587H9045e3114k94367a16851k83988F0144b16716
10182B19816b25199M157k5828o6866m038a1360j67914A73515J21294p1706b3355
10170a68754k19488d1898A6421h9455K8338j5454k197C3341J65356g3452A8441
10158a5259J990k75092A90255b38210C06692j00294h6440H1201N142B8110a95970
$$ y = [-159208, 177502, 93716, -243150, -133233, -297346, -103204, -99888, 97599, -29092, -115060, -125016, -32349, -160083, -37512, -271633, 93680, -88056, -82367, 176871, 144375, 94580, 22110, 167644, 186815, -226711, -22393, -67814, -205096, -1215, -138485, -60422, 260280, -54967, -104620, 328128, -77155, -129953, -155120, -63562, 130843, -96588, 12632, 38334, -127186, -13861, 39262, 37520, 153834, 125834, -100587, 89045, -53114, -347481, -116851, -400839, 60144, -216716, 219816, -225199, -221042, -246870, -313736, -317774, -11360, -179274, 173515, 294809, 223103, -23355, -168754, -388242, -41898, 16421, -89455, -61117, -76571, -78768, 33341, 198697, -73452, 18441, -15259, -13269, -288361, 190255, -238210, 306692, 206398, -86440, 81201, 86343, 28110, -195970]
10146b11670j02189A60460c35777K5907A13487G43a81693b8656j1531A79202G1097
10134c39427a36936K4795A93450C1131i9779B7619A2711a94151c7363B64460a50706
10122b16795A54091b1872A86740G641h0996o0711j65924D0612b76936j16311b0191
10110f6940j53156O6151A84603g2708f676j11783A12953a32474n26C13327a97802
10098a98125A48016J2241a83238k0252F4329J94975c67323L4976e1073l3066r809
10087i3948l7018C73476a0638o3595k6351j18573A49055g8906A69680o7000a00913
10075A17805c04272B42377b05536j62369e6944j37185A52645a07026j2429F7280
10064B53463G1717c32131c3624F2197b13026N5095e3255d648l4282R786j10294
$$ y = [-211670, -313859, 160460, -335777, -309870, 113487, 743, -181693, -28656, -40187, 179202, 71097, -339427, -136936, -112141, 193450, 31131, -99779, 27619, 12711, -194151, -37363, 264460, -150706, -216795, 154091, -21872, 186740, 7641, -80996, -141707, -307631, 40612, -276936, -393247, -20191, -66940, -220096, -153945, 184603, -72708, -6676, -118459, 112953, -132474, -133000, 313327, -197802, -198125, 148016, 160257, -183238, -203490, 64329, 259304, -367323, -332347, -51073, -84139, -93948, -130966, 373476, -10638, -74233, -100584, -219157, 149055, -78906, 169680, 102680, -100913, 117805, -304272, 242377, -205536, -367905, -56944, -194129, 152645, -107026, -119455, 67280, 253463, 71717, -332131, -33624, 62197, -213026, -157931, -53255, -4648, -38930, -29144, -139438]
10053a39438d9771F5333k3860j1306a8320j12525e347j85170d0348j38303d5651
10041a45116A71193d0854B93240l2892c92486L4872B76074a39383O6548j48658
10031b21493K9784f3703j48072R6734e846B4397b947j00089n7527K8371j4815
10020a47007N3711k85757c2933m3190M305k481K1941l0274q6131D1914a73497
10008F9300c8962G0340a7165D3728d21936I0221Q161c65514A51603a67438H5944
9996c5428j06574b3077B3339c3916M434j2626k33162A3524a57498M0406M8673
9985f8419C70573c16004c2671A19047a27012A1108b58529N4167e7477D6907M0979
9974H7886k201a75289B03154d0719p8211k33274a37782n8471A20640b4283j92827
$$ y = [-139438, -49771, 65333, 41473, 30167, -18320, -130845, -5347, -190517, -40348, -178651, -45651, -145116, 171193, -40854, 293240, 260348, -392486, -357614, 276074, -139383, -72835, -221493, -191709, -63703, -211775, -115041, -5846, 24397, -2947, -103036, -160563, -132192, -147007, -93296, -379053, -32933, -76123, -71818, -74299, -52358, -82632, -168763, 41914, -173497, 69300, -38962, 70340, -17165, 43728, -421936, 90221, 98382, -365514, 151603, -167438, 85944, -35428, -142002, -23077, 23339, -33916, -29482, -42108, -275270, 13524, -157498, -117092, -68419, 370573, -316004, -32671, 119047, -127012, 11108, -258529, -204362, -57477, 46907, 87886, 85685, -175289, 203154, -40719, -118930, -352204, -137782, -196253, 120640, -24283, -217110]
9963b17110D54b95003A50304k4885c9511j4953J7673A65582H2473b44030p750
9952b51780A6246b27779F2081i1698l17072I3547a09118p6695B28397E5385a20160
9940B67021o6073a02126k08909A8910L6193a70752A66522j4365F3847K38300C8565
9928A12137b40260b118o1741A83301e2481F4810j9133b52638R4032I3297h5024
9916g1996j52045M956A33485D2893c06907B33847b37838f0796o4939M9789L7799
9905c8147B08647M2943C0983J35339a18513j29039O0649O608A11452J90052D2469
9893g2000B65082C0373c15540c6795l1958q5892H7632a37998k14466q6800A88304
9881c3874J1694A181J89674g3211R303C9913q496a30293j9267c575j01193A37123
$$ y = [-217110, 454, -295003, 150304, 125419, -39511, -54464, -36791, 165582, 82473, -244030, -251780, 16246, -227779, 62081, -91698, -408770, 93547, -109118, -185813, 228397, 55385, -120160, 267021, 200948, -102126, -311035, 18910, 55103, -170752, 166522, 152157, 63847, 302147, 38565, 112137, -240260, -2118, -63859, 183301, -52481, 64810, 45677, -252638, -158606, 93297, -85024, -71996, -224041, -219085, 133485, 42893, -306907, 233847, -237838, -60796, -125735, -75946, -38147, 208647, 251590, 30983, 166322, -118513, -247552, -186903, -180295, 111452, 301504, 42469, -72000, 265082, 30373, -315540, -36795, -68753, -154645, 87632, -137998, -352464, -439264, 188304, -33874, -22180, 1181, 190855, -73211, -63908, 39913, 31417, -130293, -149560, -3575, -104768, 137123]
9868b77452A55254i8369J3192G5133a55196j49199d0417E50L47061B6608a82394
9856a68200P6192c6424k11385I6827b48878I7190K14172I4i0981C8440L3134c81642
9843b31269C23590F2621B3082R099K29918a20558n0396b5543E0527c01105e5807
9831B22729H0241k4156a70222K3775A56097b8326B37498a22074b4402e464B56696
9819a43042j13524a21706L1275j28917B93198b37299J320K6591A96040a33913
9808c1952A66638a57663E0876c68281J82171A87780M6971N0480I8344a26679M0919
9797h5760A2934J00559b75405J24918K2637K5154j57697m5051F6153a3937A45749
9785F1756b31077I1665C0274K8603d77285B18138i9170J7520L0938o3795C41327
$$ y = [-277452, 155254, -98369, -85177, 75133, -155196, -304395, -40417, 550, 347611, 26608, -182394, -168200, -92008, -36424, -247809, 96827, -248878, 97190, 311362, 94, -90981, 38440, 71574, -381642, -231269, 323590, 62621, 23082, 32181, 262099, -120558, -170954, -25543, 50527, -301105, -55807, 222729, 80241, 56085, -170222, -146447, 156097, -28326, 237498, -122074, -24402, -5464, 256696, -143042, -256566, -121706, -90431, -219348, 293198, -237299, -235979, -209388, 196040, -133913, -31952, 166638, -157663, 50876, -368281, -186110, 187780, 234751, 285231, 98344, -126679, -85760, 12934, 113493, -275405, -150487, -127850, -102696, -260393, -305444, 66153, -13937, 145749, 61756, -231077, 91665, 30274, 58877, -477285, 218138, -99170, -81650, -50712, -114507, 341327]
9773d16753a21170c6484j90251B32438e2020B6709e1763A7836b39290a00580o1786
9762a62366r4996A75229c5012m9814r1518g7500G9361L3957a04342k99567f7334
9750c88818A9459h2345j7065G5107J74184b5245f065A8746b50532B00086G9467
9738e40105D9130g3200D33b00748M9163B42778p5868b46740J4360N6216L1632
9727a44532Q436k68514B91254A38005b3303m7667A16975D0834L0208C0780h9106
9715a40527j25654A45743m7594d4796k93309P5667r692C7926K07256i7137F8728
9703C72792C695b15256N1762L1974j02507H6012a3403m4145B05060d2948j55529
9692a98477j30112N1232F8333d82256b01384A836b05734i2140H2201A1866c93662
$$ y = [-416753, -121170, -36484, -226735, 232438, -52020, 26709, -51763, 17836, -239290, -100580, -162366, -257362, 175229, -35012, -84826, -176344, -77500, 79361, 113318, -104342, -403909, -67334, -388818, 19459, -82345, -99410, 75107, 249291, -25245, -6065, 18746, -250532, 200086, 79467, -540105, 49130, -73200, 433, -200748, -151585, 242778, 166910, -246740, -232380, -176164, -144532, -136096, -404610, 291254, 138005, -23303, -70970, 116975, 40834, 71042, 30780, -89106, -140527, -266181, 145743, 98149, -44796, -338105, -262438, -272130, 37926, 245182, -97137, 68728, 372792, 3695, -215256, -163494, -131520, -234027, 86012, -13403, -57548, 205060, -42948, -198477, -328589, -277357, 68333, -482256, -201384, 1836, -205734, -92140, 82201, 11866, -393662]
9680A32955j0440O158b33020a16371c561o6858B74689F8372a62544B84442q3194
9669B01248h2249I6728B8728J91234e284j07719K8808A36845n6606d9148j78335
9658b27483j09088J60546j41819j5380D3880J53170c17151B53528e1908D5555
9647d0505a5131q1297A72524C6732b31042A11864a75540B54911b82893C05295
9636g0147K8457j38045G6554c32456a15919J686I0921a04127P765L8511C4394
9624c3762p5230B8291a52204D7072c58758A8165d27122h8403k41682d6623b993
9612b74736A87656e8673k68852h0206l1210A51875O3412F4408a91994A00409a29862
9600e5108K2412Q761J526A93309i273j13795F3347g9393q430E5930b79383A78391
$$ y = [132955, 122515, 128673, -233020, -116371, -3561, -70419, 274689, 68372, -162544, 284442, 201248, -82249, 96728, 28728, 219962, -5284, -113003, -84195, 136845, 80239, -49148, -227483, -336571, -176025, -317844, -333224, 43880, 197050, -317151, 253528, -51908, 45555, -40505, -15131, -96428, 172524, 36732, -231042, 111864, -175540, 254911, -282893, 305295, -70147, -41690, -179735, 76554, -332456, -115919, -114233, 90921, -104127, -96362, -57851, 34394, -33762, -108992, 28291, -152204, 47072, -358758, 18165, -427122, -88403, -330085, -46623, -2993, -274736, 187656, -58673, -327525, -80206, -111416, 151875, 215287, 64408, -191994, 100409, -129862, -55108, -32696, -23935, -22409, 193309, -9273, -123068, 63347, -79393, -87823, 55930, -279383, 178391]
9587B85952d2813j17554M4132b5288A44842J57859a18263k51936a78432B0549
9576b01945b4050I6770a03960L2759A84077G5720a09185A2383c12473F2819K58609
9565C21428e6009A51157A3137J72681a19953A23477e1747A93437e7250j46618
9555b03868b1101k28269r2077c3011A62572a18185L0305k3453j29959p9675a0312
9543b87085J36433j62957J53183r1460J02226A75262b3404B73977j15297J33512
9533B92192b38565a05455p7200e4681k8935B49802a05860A83681H0981b98001
9522a88087g7454k86219c8649B21645a02348j3501j76240a02375G9345F9J44754
9511A44823p0838a38959k86578f4296J7477E3959A467Q0011M4642l9282a24396
$$ y = [285952, -42813, -160367, -116235, -25288, 144842, 302701, -118263, -370199, -178432, 20549, -201945, -24050, 96770, -103960, -71201, 184077, 75720, -109185, 12383, -312473, 62819, 321428, -56009, 151157, 13137, 185818, -119953, 123477, -51747, 193437, -57250, -203868, -21101, -249370, -341447, -33011, 162572, -118185, -87880, -111333, -241292, -320967, -10312, -287085, -150652, -313609, -160426, -251886, -149660, 175262, -23404, 273977, 158680, 292192, -238565, -105455, -182655, -54681, -83616, 249802, -105860, 183681, 80981, -298001, -188087, -77454, -363673, -38649, 221645, -102348, -115849, -292089, -102375, 79345, 69, 144823, 73985, -138959, -425537, -64296, -46819, 53959, 1467, 81478, 126120, 86838, -124396]
9499a61226B4515a41837o8638C232a72129O7664B45005a51551l7687g0570A68151
9487a58267B35146i9515j24935A95627E0276R2466b0797A95795b64380D7148h2251
9475A69809a7969G4463a62438j06658f1704A51188l0431a03147M2607m27269A1630
9463B07975a14133L4112c0690G1997A9365a30463I9819C6685h5632j19785l7035
9452b42452B75065H3571e8187B18319a47746A55286a85218b147n2782k70566A3485
9440A06522c77468H9099b91838A05511l8403b9500B31449a42873l6666o7726i0729
9428B09922a03667k7510C4007a79218D2015a92735K8784d2709B72777c45746B62767
9416G1129c19201i1926A11101c5894j75838i9410k33135a2583D6200O4149a0796
$$ y = [-161226, 24515, -141837, -210475, 3232, -172129, -104465, 245005, -151551, -189238, -70570, 168151, -158267, 235146, -99515, -224450, 195627, 50276, 142742, -20797, 195795, -264380, 47148, -82251, 169809, -17969, 74463, -162438, -269096, -61704, 151188, 120757, -103147, -60540, -487809, 11630, 207975, -114133, -80021, -30690, 71997, 19365, -130463, 99819, 36685, -85632, -205417, -242452, 275065, 83571, -58187, 218319, -147746, 155286, -185218, -2147, -54929, -325495, 13485, 106522, -377468, 89099, -291838, 105511, 67108, -29500, 231449, -142873, -179539, -247265, -90729, 209922, -103667, -131177, 34007, -179218, 42015, -192735, -163951, -42709, 272777, -345746, 262767, 71129, -319201, -91926, 111101, -35894, -211732, -99410, -332545, -12583, 46200, 110349, -10796]
9404a16234j12848M0743B3724i3296k41255h0614L9404k48845A22255K19706h4240
9392i4808j30766L1581F7370a14050c5980h041H6239b14753k6339a19860B5497
9380a63253O7196E702K32159a73267A13806a3693G3973k0144J96859o493a68335
9368a38537E9061a79183c8726j18997N4900l6359c9815C8938a1662B9617b05637
9356c1597A28202a99847j2910N6701M6545L1122A01863b17288l1345a1598j17345
9345a28943J5450B0168a94623P559K7380N563j651M8065L8099j79308D0799J18809
9333A59608a4167j7638G7296a6081n8313A63259p3124a30265m0065A7543a01813
9321B93347a89284F0302B5168a5549m7308j22101A69411c00075P2495A58231A7932
$$ y = [-116234, -229082, -188339, 23724, -93296, -334551, -80614, -41210, -290055, 122255, 341961, -84240, -94808, -225574, -193993, 67370, -114050, -35980, -8041, 86239, -214753, -241092, -119860, 25497, -163253, -96057, 5702, 237861, -173267, 113806, -13693, 73973, 53829, 250688, 244195, -168335, -138537, 59061, -179183, -38726, -157723, -102823, -139182, -39815, 38938, -11662, 29617, -205637, -31597, 128202, -199847, -212757, -156056, -109511, -78389, 101863, -217288, -248633, -11598, -128943, -113493, 20168, -194623, -187064, -159684, -154121, -155772, -107707, -69608, -248916, 40799, 159608, -14167, -31805, 77296, -16081, -74394, 163259, 90135, -130265, -170330, 17543, -101813, 293347, -189284, 60302, 25168, -15549, -62857, -184958, 169411, -300075, -227580, 158231, 17932]
9309d6386j69924a03609k0181K108d8952q4326n9355P7825L1897A93347E3101
9297d42599c9028c448A80470b59138L1477d8483A51492E0314a80735E976M2482
9286D8458e7342F0512A1048O4447Q8025b7389B06734a35684A52075b79032A37944
9274a52913D9974K21015b9047A11797b68513C7798A3521b35975e3874A03541i0491
9262D25026E7760a92200B0256a88142A04839d2591n7329k831K3284B73700a24815
9250d5450k14904i2363B4305a38868j25399a3561p6840j07581B01889h4042q0322
9239a64364B48232b69945a9797r4624B417a20184e465j23462A41699c7686G0535
9227a91920p3743J10570c5384C25593c66518f7011j23319E9876b08532n8059A27875
$$ y = [-46386, -216310, -103609, -123790, -121682, -48952, -133278, -192633, -114808, -82911, 193347, 53101, -442599, -39028, -3448, 180470, -259138, -227661, -48483, 151492, 50314, -180735, 5976, 48458, -57342, 60512, 11048, 75495, 163520, -27389, 206734, -135684, 152075, -279032, 137944, -152913, 49974, 270989, -29047, 111797, -268513, 37798, 13521, -235975, -53874, 103541, -90491, 425026, 57760, -192200, 20256, -188142, 104839, -42591, -99920, -102751, -79467, 273700, -124815, -45450, -260354, -92363, 24305, -138868, -264267, -13561, -90401, -197982, 201889, -84042, -164364, 248232, -269945, -19797, -114421, 2417, -120184, -5465, -128927, 141699, -37686, 70535, -191920, -265663, -155093, -35384, 325593, -366518, -67011, -190330, 59876, -208532, -266591, 127875]
9215f5486B8141b93391B472h0291A62836a60410r29Q0432G4624b08405F3611C534
9202A40263D6917a2023r7852m9885A72344a41592a9774A32032f3552I1177Q8936
9191A80113F3604a2528j98062P0345j10926i3778j02676R6540A08813e8010A94417
9179F6165J23136B8179a75405F3322b313j31004A18504Q7911a29105q3644A27254
9167a52012N4414B25814h5959C57474b20975P4996r2114M3847k55448J71709h2307
9155g6753l8597l3089k6676B13442c6315j9621j92308I3515f9930n4671e3332
9143A10595a02351p8926B05705M4365N7408c26026A47152b43358P4320r3932M2451
9132b20519R9053B59269G7543R4801i7196f483j96768A02523b05996I7255i6986
$$ y = [-65486, 28141, -293391, 2472, -80291, 162836, -160410, -161339, -80907, 74624, -208405, 63611, 3534, 140263, 46917, -12023, -109875, -159760, 172344, -141592, -19774, 132032, -63552, 91177, 180113, 63604, -12528, -210590, -140245, -251171, -93778, -196454, -99914, 108813, -58010, 194417, 66165, 189301, 28179, -175405, 63322, -2313, -133317, 118504, 206415, -129105, -212749, 127254, -152012, -97598, 225814, -85959, 357474, -220975, -145979, -238093, -194246, -449694, -277985, -82307, -76753, -115350, -148439, -175115, 213442, -36315, -55936, -248244, 93515, -69930, -124601, -53332, 110595, -102351, -181277, 205705, 250070, 307478, -326026, 147152, -243358, -169038, -262970, -220519, -121466, 259269, 77543, 172344, -97196, -6483, -203251, 102523, -205996, 97255, -96986]
9120B45420c99095a71609I044P120a99220N8060A44784d725l76667J06278b9373
9108d08951A84425a45386a1287n28985G2490b11434d2547B2303E587K66230b54200
9096b21446j89417B47987a48998b5237D0833D807a77257G0667b29146I926b59965
9084G1366B7600e1867G6108a23314e1842B12722E3401c9756j30553I1300B2484
9072b11078b8564m265k1360q209a5505j44627n6836b7599j35168A16155c98807
9060d7477m7838m0193K7205e1326A41199Q2632D5073i3077A3135b93930c4234
9048A96336A2611a23r9520G3791a01594B26707e1483n8682k15408d8157l3684
9037h1841r8182N762b2540j10241A6528N618M464a42694A51929c17053D51938
$$ y = [245420, -399095, -171609, 9044, 16164, -199220, -141160, 144784, -4725, -381392, -275114, -29373, -408951, 184425, -145386, -11287, -540272, 72490, -211434, -42547, 22303, 5587, 271817, -254200, -221446, -410863, 247987, -148998, -25237, 40833, 4807, -177257, 70667, -229146, 9926, -259965, 71366, 27600, -51867, 76108, -123314, -51842, 212722, 53401, -39756, -170309, 91300, 22484, -211078, -28564, -32829, -54189, -62398, -15505, -160132, -216968, -27599, -162767, 116155, -398807, -47477, -95315, -135508, -108303, -51326, 141199, 223831, 45073, -93077, 13135, -293930, -34234, 196336, 12611, -123, -99643, 73791, -101594, 226707, -51483, -110165, -325573, -48157, -81841, -180023, -174261, -22540, -132781, 16528, 22146, 26610, -142694, 151929, -317053, 451938]
9025C45679a1090j99109d4041j34984O5655j65934A84613G8595c06537R9607P0320
9014a36610J049j88036a47731q9758A4968L53505B5992J26824N5875G3806H191
9002i1898m5658A51378L9110d0233j23489N5086C57466k4755a7966A58341a48797
8990e3068A76746a71012B99843j27896b85210i9002G163a79161h9301j65476a26134
8978b13221O9995O0444m6096O1804b1812B6410c5357l19613J42040C11297a02449
8966A35563a16910n1137c5542j64866C7702a30792H5533a89204A94123e6949A67994
8954a75605B41773b01848A53427a23536A1226c68926f1542C08925a78722k30832
8944d09554a18592j67448F4389a10832A56477p3975a28139k57940A869J16862
$$ y = [345679, -11090, -210199, -44041, -179025, -113370, -279304, 184613, 78595, -306537, -206930, -136610, -135561, -323597, -147731, -237489, 14968, 368473, 25992, 152816, 208691, 73806, 8191, -91898, -137556, 151378, 190488, -40233, -163722, -108636, 357466, 332711, -17966, 158341, -148797, -53068, 176746, -171012, 299843, 171947, -285210, -99002, 7163, -179161, -89301, -254777, -126134, -213221, -143226, -82782, -128878, -67074, -21812, 26410, -35357, -354970, -212930, 311297, -102449, 135563, -116910, -168047, -35542, -200408, 37702, -130792, 85533, -189204, 194123, -56949, 167994, -175605, 241773, -201848, 153427, -123536, 11226, -368926, -61542, 308925, -178722, -409554, -118592, -286040, 64389, -110832, 156477, 82502, -128139, -386079, 1869, 118731]
8934A18731n1391c03648e2862l51353E806b6169j45379F2107a965B01502I1394
8922E20825N72246f2134j86865C04249C0187p91K0258d06973A99225b63860o854
8911b70714n7385I5243j5901c17805A05707c6206B7984K9037A1569Q759a66580
8899G1618C0467M3477L3283e4063A45962d6177A32188f91B7345b48782A9924b3579
8886g3124A84571P4326b21140R0176A16595J1292N5739D6375b21328A25076n8491
8875F6585c95017a25063H9473j2057b75649O8287f3475I4065P0663G7019J01403
8864A78422k9815N9391b80783A5851d31113H3377a83313b1290l1224C9032L9122
8853G8154a33684I9978e0414l63743A49123D2741j2731a49128j30009M0640F3824
$$ y = [118731, 67340, -303648, -52862, -404215, 5806, -26169, -171548, 62107, -1965, 201502, 91394, 520825, 1093071, -62134, -248999, 304249, 30187, 29396, 49654, -406973, 199225, -263860, -270714, -328099, 95243, 79342, -317805, 105707, -36206, 27984, 57021, 11569, 20328, -166580, 71618, 30467, 73944, 107227, -54063, 145962, -46177, 132188, -691, 27345, -248782, 19924, -23579, -73124, 184571, 258897, -221140, -130964, 116595, 127887, 183626, 46375, -221328, 125076, 66585, -395017, -125063, 89473, 77416, -275649, -207362, -63475, 94065, 164728, 77019, 178422, 148607, 207998, -280783, 15851, -431113, 83377, -183313, -21290, -52514, 39032, 78154, -133684, 99978, -50414, -414157, 149123, 42741, 30010, -149128, -279137, -238497, 63824]
8841C0671a99063B91468A9892a8993E8673K0101n039c1449A27586F2017K04202
8830B66219b77989J33147q3581O0298c8318A52537e3118l95590a01453n035C4847
8818B8428c03213K1527m7632B18070F911c51046Q7973B616e5140B36968q1526
8807A55442J78561r4634b12766A58706b33371c1286P142m3166B39573c0907C51778
8795I5788p222J73830d53437K08025J12908d5905K0169r2172B2504a44714C6364
$$ y = [30671, -199063, 291468, 19892, -18993, 58673, 78774, 73735, -31449, 127586, 62017, 266219, -277989, -144842, -228423, -168125, -38318, 152537, -53118, -448708, -101453, -106488, 34847, 28428, -303213, -281686, -329318, 218070, 6911, -351046, -263073, 2616, -55140, 236968, 155442, 334003, 239369, -212766, 158706, -233371, -31286, -24144, -67310, 239573, -30907, 351778, 95788, 88566, 262396, -453437, -245412, -132504, -45905, -25736, -117908, 22504, -144714, 36364]
$$ [...]
##END NTUPLES=NMR SPECTRUM
##END=
