##TITLE=NES1094_ptc140_9886742_WoWcRdBwYx
##JCAMPDX= 6.0         $$ Bruker NMR JCAMP-DX V2.0
##DATA TYPE= NMR SPECTRUM
##DATA CLASS= NTUPLES
##ORIGIN= BRUKER
##OWNER= Administrator
$$ 1.72 TOPSPIN		Version 2.1
$$ 2016-08-28 17:53:42.851 -0500  Administrator@X
$$ Compression mode = diff/dup
##.OBSERVE FREQUENCY= 400.02188249412
##.OBSERVE NUCLEUS= ^1H
##.ACQUISITION MODE= SIMULTANEOUS (DQD)
##.ACQUISITION SCHEME= undefined
##.AVERAGES= 64
##.DIGITISER RES= 22
##SPECTROMETER/DATA SYSTEM= spect
##.PULSE SEQUENCE= noesygpps1d.comp
##.SOLVENT NAME= COFFEE_meoh
##.SHIFT REFERENCE= INTERNAL, COFFEE_meoh, 1, 14.96047
##AUDIT TRAIL= $$ (NUMBER, WHEN, WHO, WHERE, PROCESS, VERSION, WHAT)
$$ ##TITLE= Audit trail, TOPSPIN		Version 2.1
$$ ##JCAMPDX= 5.01
$$ ##ORIGIN= Bruker BioSpin GmbH
$$ ##OWNER= Administrator
$$ $$ E:\/data/COFFEE/nmr/NES1094_ptc140_9886742_WoWcRdBwYx/12/pdata/1/auditp.txt
$$ ##AUDIT TRAIL=  $$ (NUMBER, WHEN, WHO, WHERE, PROCESS, VERSION, WHAT)
(   1,<2016-08-28 17:53:37.648 -0500>,<Administrator>,<X>,<go>,<TOPSPIN 2.1>,
      <created by zg
	started at 2016-08-28 17:42:08.242 -0500,
	POWCHK enabled, PULCHK disabled,
       configuration hash MD5:
       21 0F 79 D6 B3 7B B4 F6 88 20 88 DB 03 48 BD 9F
       data hash MD5: 64K
       A2 5A F9 3B 47 60 E9 A8 BB B9 1A 01 1B 48 18 43>)
(   2,<2016-08-28 17:53:40.820 -0500>,<Administrator>,<X>,<proc1d>,<TOPSPIN 2.1>,
      <Start of raw data processing
       efp LB = 0.3 FT_mod = 6 PKNL = 1 PHC0 = 0 PHC1 = 0 SI = 128K 
       data hash MD5: 128K
       DC 5A 3C 96 62 65 3E DF 07 8D C3 7C 23 E7 B6 E3>)
(   3,<2016-08-28 17:53:41.695 -0500>,<Administrator>,<X>,<proc1d>,<TOPSPIN 2.1>,
      <pk PHC0 = -83.28735 PHC1 = 0 
       data hash MD5: 128K
       26 45 84 42 05 4E FC 57 DE 3A 62 F1 C1 A3 61 0E>)
(   4,<2016-08-28 17:53:42.054 -0500>,<Administrator>,<X>,<proc1d>,<TOPSPIN 2.1>,
      <abs ABSG = 1 
       data hash MD5: 128K
       F7 64 85 51 60 CF B0 D8 76 F6 A6 11 4A DF A6 5A>)
(   5,<2016-08-28 17:53:42.148 -0500>,<Administrator>,<X>,<proc1d>,<TOPSPIN 2.1>,
      <abs ABSG = 2 
       data hash MD5: 128K
       AC FE 95 1C 27 DD C1 B3 DA 0E B1 EB 9A 33 BD E4>)
(   6,<2016-08-28 17:53:42.226 -0500>,<Administrator>,<X>,<proc1d>,<TOPSPIN 2.1>,
      <abs ABSG = 3 
       data hash MD5: 128K
       33 E6 29 35 C9 A3 8B 01 51 3C 44 56 60 6A EE FC>)
(   7,<2016-08-28 17:53:42.304 -0500>,<Administrator>,<X>,<proc1d>,<TOPSPIN 2.1>,
      <abs ABSG = 4 
       data hash MD5: 128K
       53 25 8A A2 FB 2D FD C0 CB 3C E6 7E 5E 4D AC BD>)
(   8,<2016-08-28 17:53:42.429 -0500>,<Administrator>,<X>,<proc1d>,<TOPSPIN 2.1>,
      <abs ABSG = 5 
       data hash MD5: 128K
       28 D4 97 06 70 5E 0E 29 86 08 03 C8 E2 78 93 49>)
$$ ##END=
$$ 
$$ $$ hash MD5
$$ $$ CC 74 69 3A 6D 2E 03 FD 3F 79 8C 71 1E 7B 6A 16
##$RELAX= 
##$RELAX= 
##$RELAX= 
##$RELAX= 
##$RELAX= 
##$RELAX= 
##$RELAX= 
##$RELAX= 
$$ Bruker specific parameters
$$ --------------------------
##$DU= <E:\>
##$EXPNO= 12
$$ [...]
##$TP07= 0
##$TPNAME0= <>
##$TPNAME1= <>
##$TPNAME2= <>
##$TPNAME3= <>
##$TPNAME4= <>
##$TPNAME5= <>
##$TPNAME6= <>
##$TPNAME7= <>
##$TPOAL= (0..7)
0.5 0.5 0.5 0.5 0.5 0.5 0.5 0.5
##$TPOFFS= (0..7)
0 0 0 0 0 0 0 0
##$TUNHIN= 0
##$TUNHOUT= 0
##$TUNXOUT= 0
##$USERA1= <user>
##$USERA2= <user>
##$USERA3= <user>
##$USERA4= <user>
##$USERA5= <user>
##$V9= 5
##$VALIST= <valist>
##$VCLIST= <CCCCCCCCCCCCCCC>
##$VD= 0
##$VDLIST= <DDDDDDDDDDDDDDD>
##$VPLIST= <PPPPPPPPPPPPPPP>
##$VTLIST= <TTTTTTTTTTTTTTT>
##$WBST= 2048
##$WBSW= 25
##$XGAIN= (0..3)
0 0 0 0
##$XL= 0
##$YL= 0
##$YMAX_a= 5596556
##$YMIN_a= -10550040
##$ZGOPTNS= <>
##$ZL1= 120
##$ZL2= 120
##$ZL3= 120
##$ZL4= 120
##$ABSF1= 14.96047
##$ABSF2= -5.597712
##$ABSG= 5
##$ABSL= 3
##$ALPHA= 0
##$AQORDER= 0
##$ASSFAC= 0
##$ASSFACI= 0
##$ASSFACX= 0
##$ASSWID= 0
##$AUNMP= <proc_prof1d_extract.lims>
##$AXLEFT= 0
##$AXNAME= <>
##$AXNUC= <1H>
##$AXRIGHT= 0
##$AXTYPE= 0
##$AXUNIT= <>
##$AZFE= 0.1
##$AZFW= 0.1
##$BCFW= 0
##$BC_mod= 0
##$BYTORDP= 0
##$COROFFS= 0
##$CY= 15
##$DATMOD= 1
##$DC= 0
##$DFILT= <>
##$DTYPP= 0
##$F1P= 0
##$F2P= 0
##$FCOR= 0.5
##$FTSIZE= 131072
##$FT_mod= 6
##$GAMMA= 0
##$GB= 0
##$INTBC= 1
##$INTSCL= 1
##$ISEN= 128
##$LB= 0.3
##$LEV0= 0
##$LPBIN= 0
##$MAXI= 10000
##$MC2= 0
##$MEAN= 0
##$ME_mod= 0
##$MI= 0
##$NCOEF= 0
##$NC_proc= -2
##$NLEV= 6
##$NOISF1= 0
##$NOISF2= 0
##$NSP= 0
##$NTH_PI= 0
##$NZP= 0
##$OFFSET= 14.96047
##$PC= 1
##$PHC0= -83.28735
##$PHC1= 0
##$PH_mod= 1
##$PKNL= yes
##$PPARMOD= 0
##$PPDIAG= 0
##$PPIPTYP= 0
##$PPMPNUM= 2147483647
##$PPRESOL= 1
##$PSCAL= 4
##$PSIGN= 0
##$PYNMP= <proc.py>
##$REVERSE= no
##$SF= 400.020009848487
##$SI= 131072
##$SIGF1= 0
##$SIGF2= 0
##$SINO= 400
##$SIOLD= 131072
##$SPECTYP= <>
##$SREGLST= <1H.CDCl3>
##$SSB= 0
##$STSI= 131072
##$STSR= 0
##$SW_p= 8223.68421052631
##$SYMM= 0
##$S_DEV= 0
##$TDeff= 65536
##$TDoff= 0
##$TI= <>
##$TILT= no
##$TM1= 0
##$TM2= 0
##$TOPLEV= 0
##$USERP1= <user>
##$USERP2= <user>
##$USERP3= <user>
##$USERP4= <user>
##$USERP5= <user>
##$WDW= 1
##$XDIM= 131072
##$YMAX_p= 365371787
##$YMIN_p= -10422
##$CURPLOT= <Network HP LaserJet P1505>
##$CURPRIN= <$Network HP LaserJet P1505>
##$DFORMAT= <normdp>
##$LAYOUT= <+/1D_H.xwp>
##$LFORMAT= <normlp>
##$PFORMAT= <normpl>
##$SURQMSG= 1
$$ End of Bruker specific parameters
$$ ---------------------------------
##NTUPLES= NMR SPECTRUM
##VAR_NAME=  FREQUENCY,     SPECTRUM/REAL,   SPECTRUM/IMAG
##SYMBOL=    X,             R,               I
##VAR_TYPE=  INDEPENDENT,   DEPENDENT,       DEPENDENT
##VAR_FORM=  AFFN,          ASDF,            ASDF
##VAR_DIM=   131072,        131072,          131072
##UNITS=     HZ,            ARBITRARY UNITS, ARBITRARY UNITS
##FACTOR=    0.0627417313425164, 1,          1
##FIRST=     8223.62146879497, 4038,         -44114
##LAST=      0,             4971,            -44013
##MIN=       0,             -10422,          0
##MAX=       8223.62146879497, 365371787,    0
$$ Real data points
##PAGE= N=1
##DATA TABLE= (X++(R..R)), XYDATA
$$ [...]
$$ plain form
61840 884525 907463 925961 938524 944670 944987 940264 930912 917169 899780 880502 861805 845776
61828 845776 833243 824220 819062 818656 823397 832548 844915 859661 875995 892430 906904 917597 923300
61815 923300 923183 916678 903651 884405 859542 830005 797146 762351 726578 690452 654749 620416
61803 620416 588159 558317 531199 507152 486161 467715 451344 437063 425049 415030 406348 398576
61791 398576 391795 386213 381788 378332 375790 374113 372957 371786 370316 368722 367321 366195 365181 364067
61777 364067 362635 360683 358201 355501 353009 350944 349293 348011 347018 346113 345130 344205 343674 343642 343813 343838 343651
61760 343651 343469 343611 344420 346181 348951 352450 356134 359410 361917 363749 365330 366919 368276 369022 369179
61745 369179 369121 369038 368771 368142 367139 365743 363915 361910 360301 359551 359726 360648 362079 363656 364955 365780 366207
$$ packed form
61840H84525K2938J8498J2563O146L17m723r352j3743j7389j9278j8697j6029
61828H45776j2533r023n158m06M741R151J2367J4746J6334J6435J4474J0693N703
61815I23300j17o505j3027j9246k4863k9537l2859l4795l5773l6126l5703l4333
61803F20416l2257k9842k7118k4047k0991j8446j6371j4281j2014j0019q682p772
61791C98576o781n582m425l456k542j677j156j171j470j594j401j126j014j114
61777C64067j432j952k482k700k492k065j651j282r93r05r83r25n31l2J71K5j87
61760C43651j82J42Q09J761K770L499L684L276K507J832J581J589J357P46J57
61745C69179n8q3k67o29j003j396j828k005j609p50J75R22J431J577J299Q25M27
$$ plain form
61728 366207 366344 366355 366690 367823 369564 371138 372246 373660 376298 380035 383894 387209 390033 392545 394646
61713 394646 396319 397928 399874 402104 404077 405085 404588 402471 399083 394943 390302 385106 379402 373603
61699 373603 368250 363557 359331 355305 351456 347949 344907 342312 340043 337818 335125 331595 327574 324066
61685 324066 321766 320358 319077 317748 316791 316285 315610 314186 312167 310216 308924 308546 308926 309491 309612 309157
61669 309157 308451 307698 306862 306144 306046 306724 307769 308835 309994 311210 312060 312405 312767 313485 314009 313689 312961 313015
61651 313015 314445 316847 319589 322366 325037 327561 330188 333288 336950 341032 345507 350354 355221 359648
61637 359648 363508 366827 369318 370592 370690 369873 368018 364824 360564 356025 351657 347405 343374 339960 337145
61622 337145 334361 331393 328789 327042 325860 324733 323854 323994 325565 328075 330415 331523 330986 329150 326568
$$ packed form
61728C66207J37J1L35J133J741J574J108J414K638L737L859L315K824K512K101
61713C94646J673J609J946K230J973J008m97k117l388m140m641n196n704n799
61699C73603n353m693m226m026l849l507l042k595k269k225k693l530m021l508
61685C24066k300j408j281j329r57n06o75j424k019j951j292l78L80N65J21m55
61669C09157p06p53q36p18r8O78J045J066J159J216Q50L45L62P18N24l20p28N4
61651C13015J430K402K742K777K671K524K627L100L662M082M475M847M867M427
61637C59648L860L319K491J274R8q17j855l194m260m539m368m252m031l414k815
61622C37145k784k968k604j747j182j127q79J40J571K510K340J108n37j836k582
$$ plain form
61607 326568 323373 319452 315077 310806 306679 302043 296468 290456 284936 280389 276643 273217 269649 265811
61593 265811 262084 258938 256227 253341 250164 247325 245151 243008 240189 237007 234368 232537 230941 229007
61579 229007 226642 223993 221361 219290 218149 217495 216343 214191 211434 208733 206415 204605 203468 203006 202932
61564 202932 202999 203261 203769 204221 204221 203720 202974 202186 201514 201332 202103 203783 205621 206782 207088 207002 207014 207298 207938
61545 207938 209109 210824 212650 213947 214360 213982 213165 212349 211976 212291 213169 214295 215529 216933 218440 219733
61529 219733 220508 220716 220439 219667 218350 216602 214791 213347 212387 211480 209897 207274 204006 200890 198488 196920
61513 196920 196030 195475 194867 194238 194240 195437 197411 199080 199956 200543 201338 202000 201870 200876 199463 197961 196397
61496 196397 194817 193335 191986 190846 190215 190369 191166 192111 192780 193043 193025 193059 193509 194366 195172 195562 195713 195979
$$ packed form
61607C26568l195l921m375m271m127m636n575o012n520m547l746l426l568l838
61593B65811l727l146k711k886l177k839k174k143k819l182k639j831j596j934
61579B29007k365k649k632k071j141o54j152k152k757k701k318j810j137m62p4
61564B02932O7K62N08M52%n01p46p88o72j82P71J680J838J161L06q6J2K84O40
61545B07938J171J715J826J297M13l78q17q16l73L15Q78J126J234J404J507J293
61529B19733P75K08k77p72j317j748j811j444r60r07j583k623l268l116k402j568
61513A96920q90n55o08o29KJ197J974J669Q76N87P95O62j30r94j413j502j564
61496A96397j580j482j349j140o31J54P97R45O69K63j8L4M50Q57Q06L90J51K66
$$ plain form
61478 195979 196288 196309 196150 196422 197497 199045 200412 201203 201379 201042 200387 199749 199492 199766 200363 200859 200954 200718
61460 200718 200404 200054 199484 198760 198349 198568 199103 199448 199635 200126 201074 202221 203505 205202 207180 208532 208426
61443 208426 207101 205659 205006 205355 206547 208339 210344 212246 214303 217318 221779 227170 232355 236478 239327
61428 239327 241130 242451 244140 246789 249984 252433 253112 252177 250697 249758 249976 251422 253603 255728 257412
61413 257412 259061 261224 263690 265586 266308 265936 264765 262923 260563 258066 255806 253989 252699 251787 250604
61398 250604 248343 244897 241106 237945 235765 234414 233676 233297 232969 232693 232833 233501 234170 234337 234282 234691 235683
61381 235683 236717 237338 237612 237909 238745 240722 244013 247742 250463 251491 251496 251618 252394 253674 255112 256371
61365 256371 257122 257345 257528 258291 259836 261973 264529 267454 270607 273764 276905 280250 283997 288238 293121
$$ packed form
61478A95979L09K1j59K72J075J548J367P91J76l37o55o38k57K74N97M96R5k36
61460B00718l14l50n70p24m11K19N35L45J87M91R48J147J284J697J978J352j06
61443B08426j325j442o53L49J192J792K005J902K057L015M461N391N185M123K849
61428B39327J803J321J689K649L195K449O79r35j480r39K18J446K181K125J684
61413B57412J649K163K466J896P22l72j171j842k360k497k260j817j290r12j183
61398B50604k261l446l791l161k180j351p38l79l28k76J40O68O69J67n5M09R92
61381B35683J034O21K74K97Q36J977L291L729K721J028NJ22P76J280J438J259
61365B56371P51K23J83P63J545K137K556K925L153L157L141L345L747M241M883
$$ plain form
61350 293121 298772 304897 310805 316088 321046 326097 330988 335117 338591 342330 346900 351760 356118 360050
61336 360050 364180 368503 372330 375421 378415 381792 384952 386792 386878 385648 383669 381121 377960 374312 370564
61321 370564 367130 364093 361172 358254 355913 354947 355323 356046 356381 356793 358377 361744 366844 373421 381002
61306 381002 388705 395763 402236 408621 414794 419953 423686 426434 428665 430123 430224 428778 425945 421896
61292 421896 416977 412000 407856 404746 402058 399067 395600 392000 388624 385502 382469 379544 377069 375392
61278 375392 374530 374334 374926 376665 379607 383261 387053 390859 394858 399022 403017 406647 410155 413988 418330
61263 418330 422955 427533 432001 436636 441781 447545 453660 459571 464740 469015 472762 476509 480444 484427
61249 484427 488435 492674 497062 500913 503453 504483 504258 502940 500648 497894 495362 492976 489721 484763
$$ packed form
61350B93121N651O125N908N283M958N051M891M129L474L739M570M860M358L932
61336C60050M130M323L827L091K994L377L160J840Q6j230j979k548l161l648l748
61321C70564l434l037k921k918k341r66L76P23L35M12J584L367N100O577P581
61306C81002P703P058O473O385O173N159L733K748K231J458J01j446k833m049
61292D21896m919m977m144l110k688k991l467l600l376l122l033k925k475j677
61278C75392q62j96N92J739K942L654L792L806L999M164L995L630L508L833M342
61263D18330M625M578M468M635N145N764O115N911N169M275L747L747L935L983
61249D84427M008M239M388L851K540J030k25j318k292k754k532k386l255m958
$$ plain form
61235 484763 478525 472321 467055 462570 458187 453540 448879 444802 441813 439952 438752 437605 436315 435250
61221 435250 434995 435867 437792 440468 443562 446808 450125 453672 457648 461938 466124 469942 473617 477485 481389
61206 481389 484781 487459 489868 492536 495537 498795 502663 507718 514053 521204 528918 537707 548312 560719
61192 560719 573933 586746 598583 609490 619419 627817 634129 638587 642217 646009 650235 654627 658929
61179 658929 663053 666865 670110 672552 674080 674697 674513 673661 672190 670129 667750 665479 663355 660769 657008
61164 657008 652024 646391 640527 634184 626725 617712 607207 595714 583973 572701 562369 553132 544925
61151 544925 537660 531381 526145 521631 517008 511474 504889 497569 489518 480419 470505 460781 451951 443594
61137 443594 435012 426565 419529 414724 411855 410218 409411 409302 409783 410846 412586 414963 417823 421281 425882
$$ packed form
61235D84763o238o204n266m485m383m647m661m077k989j861j200j147j290j065
61221D35250k55Q72J925K676L094L246L317L547L976M290M186L818L675L868L904
61206D81389L392K678K409K668L001L258L868N055O335P151P714Q789J0605J2407
61192E60719J3214J2813J1837J0907R929Q398O312M458L630L792M226M392M302
61179F58929M124L812L245K442J528O17j84q52j471k061k379k271k124k586l761
61164F57008m984n633n864o343p459r013j0505j1493j1741j1272j0332r237q207
61151E44925p265o279n236m514m623n534o585p320q051r099r914r724q830q357
61137D43594q582q447p036m805k869j637q07j09M81J063J740K377K860L458M601
$$ plain form
61122 425882 432248 440689 451134 463273 476782 491655 508269 526966 547594 569662 592734 616395
61110 616395 640040 663160 685830 708437 730954 752914 774089 794624 814363 832523 848250
61099 848250 861095 870686 876479 878262 876679 872760 866994 859119 848782 836110 821611 805776 788907
61086 788907 771257 753167 734973 716817 698682 680601 662686 644938 627281 609916 593395
61075 593395 578193 564476 552372 542018 533062 524615 516266 508788 503197 499300 495850 492046 488238
61062 488238 485207 483407 482983 483902 485889 488753 492832 498601 505755 513273 520538 527905 536089 545526 556433
61047 556433 568911 582755 597678 613850 631847 651998 674283 698841 725956 755499 787050
61036 787050 820645 856768 895509 936464 979453 1024527 1071174 1118482 1166276 1215295 1266227
$$ packed form
61122D25882O366Q441J0445J2139J3509J4873J6614J8697K0628K2068K3072K3661
61110F16395K3645K3120K2670K2607K2517K1960K1175K0535J9739J8160J5727
61099H48250J2845R591N793J783j583l919n766p875j0337j2672j4499j5835j6869
61086G88907j7650j8090j8194j8156j8135j8081j7915j7748j7657j7365j6521
61075E93395j5202j3717j2104j0354q956q447q349p478n591l897l450l804l808
61062D88238l031j800m24R19J987K864M079N769P154P518P265P367Q184R437J0907
61047E56433J2478J3844J4923J6172J7997K0151K2285K4558K7115K9543L1551
61036G87050L3595L6123L8741M0955M2989M5074M6647M7308M7794M9019N0932
$$ plain form
61025 1266227 1319707 1377357 1441406 1512781 1590893 1675912 1769928 1875382 1994234 2130118 2290127
61014 2290127 2483319 2718605 3005169 3353454 3774659 4281223 4889545 5620547 6496729
61005 6496729 7542539 8788262 10259560 11939997 13731565 15460871 16942334 18050086
60997 18050086 18744068 19052727 19056912 18890855 18723975 18694669 18831918 19034441 19129331 18958498
60987 18958498 18428762 17514645 16247282 14710523 13030569 11344086 9759329 8337866
60979 8337866 7102886 6055617 5184303 4467787 3880976 3400928 3008655 2687528 2422681
60970 2422681 2201980 2016032 1857044 1718459 1595535 1485444 1386641 1298339 1220030 1150755
60960 1150755 1088952 1033398 983919 940709 903224 870165 840151 811955 784491 757234 730445
$$ packed form
61025A266227N3480N7650O4049P1375P8112Q5019R4016J05454J18852J35884J60009
61014B290127J93192K35286K86564L48285M21205N06564O08322P31002Q76182
61005F496729J045810J245723J471298J680437J791568J729306J481463J107752
60997A8050086O93982L08659M185j66057j66880k9306J37249K02523R4890j70833
60987A8958498n29736r14117j267363j536759j679954j686483j584757j421463
60979H337866j234980j047269q71314p16516n86811m80048l92273l21127k64847
60970B422681k20701j85948j58988j38585j22924j10091r8803q8302p8309o9275
60960A150755o1803n5554m9479m3210l7485l3059l0014k8196k7464k7257k6789
$$ plain form
60949 730445 704596 679821 656345 634968 616464 600742 587125 575223 564941 555906 547565 539734
60937 539734 532423 525160 517080 507777 497687 487590 478090 469441 461442 453538 445405 437418 430229 424043
60923 424043 418653 413946 409878 406094 402161 398195 394791 392285 390488 389066 387735 386161 384234 382494
60909 382494 381730 382025 382643 382980 383134 383326 383301 382621 381281 379690 378195 376821 375366 373667 371883 370460
60893 370460 369603 368875 367720 366298 365278 364696 363586 361053 357249 352994 348853 345035 341837 339594 338214
60878 338214 337209 336163 334960 333639 332388 331593 331615 332544 334382 337338 341578 346700 351948 357042 362447
60863 362447 368661 375528 382531 389446 396336 403049 409119 414248 418602 422567 426394 430135 433674 436698
60849 436698 438921 440520 442147 444224 446419 448152 449480 451013 452934 454617 455474 455727 455904 455887 455020 453129
$$ packed form
60949G30445k5849k4775k3476k1377j8504j5722j3617j1902j0282r035q341p831
60937E39734p311p263q080r303j0090j0097r500q649p999p904q133p987p189o186
60923D24043n390m707m068l784l933l966l404k506j797j422j331j574j927j740
60909C82494p64K95O18L37J54J92k5o80j340j591j495j374j455j699j784j423
60893C70460q57p28j155j422j020n82j110k533l804m255m141l818l198k243j380
60878C38214j005j046j203j321j251p95K2R29J838K956M240N122N248N094N405
60863C62447O214O867P003O915O890O713O070N129M354L965L827L741L539L024
60849D36698K223J599J627K077K195J733J328J533J921J683Q57K53J77j7q67j891
$$ plain form
60833 453129 450962 449495 449133 449776 451355 454015 457820 462481 467485 472579 478163 485087 493894 504299
60819 504299 515605 527594 540725 555433 571523 588451 605973 624202 643090 662119 680658
60808 680658 698469 715709 732349 747751 760985 771566 779616 785247 788073 787677 784381 779057 772066
60795 772066 762798 750484 735262 718255 700832 683955 668022 652936 638301 623766 609283 595068
60783 595068 581344 568201 555564 543225 531006 519006 507563 496931 487177 478457 471092 465088
60771 465088 459772 454275 448284 442079 435967 430057 424533 419610 415099 410395 405159 399702 394455 389315
60757 389315 383822 377803 371494 365128 358702 352153 345567 339177 333341 328430 324517 321268 318361 315975
60743 315975 314468 313546 312152 309408 305420 300928 296467 292245 288603 286049 284639 283717 282549 281050 279749
$$ packed form
60833D53129k167j467l62O43J579K660L805M661N004N094N584O924Q807J0405
60819E04299J1306J1989J3131J4708J6090J6928J7522J8229J8888J9029J8539
60808F80658J7811J7240J6640J5402J3234J0581Q050N631K826l96l296n324o991
60795G72066r268j2314j5222j7007j7423j6877j5933j5086j4635j4535j4483j4215
60783E95068j3724j3143j2637j2339j2219j2000j1443j0632r754q720p365o004
60771D65088n316n497n991o205o112n910n524m923m511m704n236n457n247n140
60757C89315n493o019o309o366o426o549o586o390n836m911l913l249k907k386
60743C15975j507r22j394k744l988m492m461m222l642k554j410r22j168j499j301
$$ plain form
60728 279749 279159 279368 280155 281315 282832 284795 287121 289364 290956 291811 292503 293602 294870 295411 294681 293046
60712 293046 291279 289779 288487 287249 285885 283977 281038 277058 272702 268843 265950 263911 262232 260313
60698 260313 257715 254397 250691 247020 243672 240824 238651 237323 236895 237227 237943 238576 238908 239171 239751 240682
60682 240682 241625 242360 243025 243735 244293 244484 244470 244642 245203 246117 247318 248742 250244 251742 253367 255225 257088
60665 257088 258568 259529 260102 260374 260321 260002 259534 259031 258857 259811 262590 266985 271983 276724 281031 285036 288844
60648 288844 292687 296947 301725 306716 311647 316413 320587 323297 324011 323078 321128 318378 314930 311294 307911
60633 307911 304380 299911 294527 289169 284549 280536 276875 273873 271918 270642 269089 266675 263726 261087
60619 261087 259378 258663 258595 258735 258689 258195 257341 256710 256933 257861 258484 257944 256435 254845 253748 253114 252774 252621
$$ packed form
60728B79749n90K09P87J160J517J963K326K243J592Q55O92J099J268N41p30j635
60712B93046j767j500j292j238j364j908k939l980m356l859k893k039j679j919
60698B60313k598l318l706l671l348k848k173j328m28L32P16O33L32K63N80R31
60682B40682R43P35O65P10N58J91j4J72N61R14J201J424J502J498J625J858J863
60665B57088J480R61N73K72n3l19m68n03j74R54K779M395M998M741M307M005L808
60648B88844L843M260M778M991M931M766M174K710P14r33j950k750l448l636l383
60633C07911l531m469n384n358m620m013l661l002j955j276j553k414k949k639
60619B61087j709p15o8J40m6m94q54o31K23R28O23n40j509j590j097o34l40j53
$$ plain form
60601 252621 252414 251933 251440 251504 252154 252629 252195 250941 249536 248476 247799 247393 247293 247643 248425 249270 249649 249441
60583 249441 249184 249532 250552 251858 253312 255151 257483 260162 263294 267291 272212 277495 282732 288363 295258
60568 295258 303819 313726 324275 334557 343588 350726 356010 359809 362180 362724 361002 356903 350845 343826
60554 343826 337090 331417 326809 323053 320374 319221 319557 320841 322794 325822 330509 336896 344437 352549
60540 352549 360993 369633 377945 385019 390249 393883 396592 398529 399178 398183 395898 392931 389646 386447 384097
60525 384097 383140 383164 383121 382334 380773 378583 375912 373224 371139 369764 368615 367369 366306 365864 366207 367442
60509 367442 369813 373303 377423 381921 387599 396020 408387 424879 444972 468013 493513 521264 551402
60496 551402 584142 619208 655476 691201 724553 753911 777738 794294 801690 798461 784331 760497
$$ packed form
60601B52621k07m81m93O4O50M75m34j254j405j060o77m06j00L50P82Q45L79k08
60583B49441k57L48J020J306J454J839K332K679L132L997M921N283N237N631O895
60568B95258Q561R907J0549J0282R031P138N284L799K371N44j722m099o058p019
60554C43826o736n673m608l756k679j153L36J284J953L028M687O387P541Q112
60540C52549Q444Q640Q312P074N230L634K709J937O49r95k285k967l285l199k350
60525C84097r57K4m3p87j561k190k671k688k085j375j149j246j063m42L43J235
60509C67442K371L490M120M498N678Q421J2367J6492K0093K3041K5500K7751L0138
60496E51402L2740L5066L6268L5725L3352K9358K3827J6556P396l229j4130k3834
$$ plain form
60484 760497 729189 692955 654222 615054 576886 540429 506109 474618 446758 422773 402234
60473 402234 384777 370523 359371 350179 341334 332230 323653 316592 311088 306496 302340 298475 294730
60460 294730 290940 287272 284094 281527 279401 277553 275812 273779 271069 267750 264207 260586 256883 253570
60446 253570 251484 250793 250548 249715 248378 247496 247678 248581 249470 250036 250567 251415 252324 252377 250839 248042 245124
60429 245124 242827 240927 239018 237372 236648 237052 238267 239989 242106 244497 247097 250060 253400 256524 258573
60414 258573 259265 259040 258427 257659 256944 256610 256745 257022 257157 257323 257901 258978 260258 261342 261970 262124 262093 262397
60396 262397 263492 265453 267892 270185 271848 272863 273577 274237 274742 275043 275669 277483 280763 284722 288183
60381 288183 290633 292474 294297 296134 297541 298292 298796 299703 301266 303208 305123 306784 308110 309147 310125
$$ packed form
60484G60497l1308l6234l8733l9168l8168l6457l4320l1491k7860k3985k0539
60473D02234j7457j4254j1152r192q845r104q577p061n504m592m156l865l745
60460B94730l790l668l178k567k126j848j741k033k710l319l543l621l703l313
60446B53570k086o91k45q33j337q82J82R03Q89N66N31Q48R09N3j538k797k918
60429B45124k297j900j909j646p24M04J215J722K117K391K600K963L340L124K049
60414B58573O92k25o13p68p15l34J35K77J35J66N78J077J280J084O28J54l1L04
60396B62397J095J961K439K293J663J015P14O60N05L01O26J814L280L959L461
60381B88183K450J841J823J837J407P51N04R07J563J942J915J661J326J037R78
$$ plain form
60366 310125 311224 312203 312591 312432 312455 313206 314275 314823 314736 314874 316223 319110 323205 327935 332896 338143 344127
60349 344127 351192 359171 367621 376207 384540 391745 396714 398856 398368 395744 391363 385602 378990 372020
60335 372020 364981 358083 351642 346070 341692 338461 335814 333046 329979 327017 324401 321839 319239 317245
60321 317245 316352 315851 314542 312375 310447 309334 308460 307473 307203 308613 311534 315208 319575 325194 332255
60306 332255 340511 350019 361135 373688 386806 399694 412110 423912 434507 442937 448266 449825
60294 449825 447427 441525 432982 422522 410491 397189 383292 369874 358062 348591 341486 336174 331986
60281 331986 328642 326254 324934 324433 324062 322929 320504 317108 313730 311143 309285 307646 306096 305061 304864
60266 304864 305150 305008 303612 300812 297225 293769 291007 288935 287393 286411 286012 285885 285590 285073 284691 284691 284888
$$ packed form
60366C10125J099R79L88j59K3P51J069N48q7J38J349K887M095M730M961N247N984
60349C44127P065P979Q450Q586Q333P205M969K142m88k624m381n761o612o970
60335C72020p039o898o441n572m378l231k647k768l067k962k616k562k600j994
60321C17245q93n01j309k167j928j113q74r87k70J410K921L674M367N619P061
60306C32255Q256R508J1116J2553J3118J2888J2416J1802J0595Q430N329J559
60294D49825k398n902q543j0460j2031j3302j3897j3418j1812r471p105n312m188
60281C31986l344k388j320n01l71j133k425l396l378k587j858j639j550j035j97
60266C04864K86j42j396k800l587l456k762k072j542r82l99j27k95n17l82%J97
$$ plain form
60249 284888 284974 284939 285008 285221 285327 285182 285096 285525 286431 287243 287643 288100 289267 291010 292566 293634 294754 296406
60231 296406 298277 299773 300866 301961 303220 304497 305768 307202 308852 310665 312686 314886 316882 318275
60217 318275 319211 320184 321370 322672 324382 327103 330807 334588 337769 340755 344302 348351 352231 355817 359790
60202 359790 364676 370181 375699 381046 386427 391977 397616 403136 408160 412195 415044 417096 418951 420806
60188 420806 422440 423697 424645 425243 425246 424489 422983 420626 417216 412923 408406 404167 400108 396008 392114 388773
60172 388773 385792 382699 379489 376542 373867 371087 368223 365840 364188 362816 361284 359758 358523 357474
60158 357474 356536 356112 356554 357462 358054 358082 357979 358260 359223 361014 363425 365730 367282 368314 369714 371935 374538
60141 374538 376934 379187 381866 385324 389369 393565 397764 402262 407320 412551 417128 420732 423900 427062
$$ packed form
60249B84888Q6l5O9K13J06j45q6M29R06Q12M00M57J167J743J556J068J120J652
60231B96406J871J496J093J095J259J277J271J434J650J813K021K200J996J393
60217C18275R36R73J186J302J710K721L704L781L181K986L547M049L880L586L973
60202C59790M886N505N518N347N381N550N639N520N024M035K849K052J855J855
60188D20806J634J257R48N98Lp57j506k357l410m293m517m239m059m100l894l341
60172C88773k981l093l210k947k675k780k864k383j652j372j532j526j235j049
60158C57474r38m24M42R08N92K8j03K81R63J791K411K305J552J032J400K221K603
60141C74538K396K253K679L458M045M196M199M498N058N231M577L604L168L162
$$ plain form
60127 427062 429663 430857 430830 430699 431155 431900 432492 432983 433414 433428 432903 432493 432905 433926 434724 434966 435169 435948
60109 435948 437325 438816 439886 440249 439998 439535 439229 439111 438962 438600 437910 436653 434515 431444 427811 424068
60093 424068 420384 416727 413301 410697 409437 409367 409708 409762 409429 408933 408354 407756 407600 408508 410537 413062 415496
60076 415496 417730 419681 420868 420854 419899 418666 417347 415446 412478 408576 404323 400177 396159 391952 387246
60061 387246 382093 376962 372350 368317 364571 360982 357843 355463 353693 352050 350352 349062 348856 349888
60047 349888 351624 353444 355253 357379 360041 363175 366703 370602 374620 378289 381473 384682 388494 392765
60033 392765 396762 400037 402813 405388 407421 408084 406876 404108 400558 396698 392274 386671 379684 371893
60019 371893 364259 357413 351339 345600 339731 333543 327327 321765 317412 314204 311635 309423 307799 307025
$$ packed form
60127D27062K601J194k7j31M56P45N92M91M31J4n25m10M12J021P98K42K03P79
60109D35948J377J491J070L63k51m63l06j18j49l62o90j257k138l071l633l743
60093D24068l684l657l426k604j260p0L41N4l33m96n79n98j56R08K029K525K434
60076D15496K234J951J187j4r55j233j319j901k968l902m253m146m018m207m706
60061C87246n153n131m612m033l746l589l139k380j770j643j698j290k06J032
60047C49888J736J820J809K126K662L134L528L899M018L669L184L209L812M271
60033C92765L997L275K776K575K033O63j208k768l550l860m424n603o987p791
60019C71893p634o846o074n739n869o188o216n562m353l208k569k212j624p74
$$ plain form
60005 307025 306862 306749 306411 306053 305959 306097 306188 306095 306009 306177 306467 306379 305708 305173 306048 308909 312871 316248 318006
59986 318006 318447 318668 319631 321651 324426 327362 330030 332448 334870 337318 339460 340892 341350 340688 338988
59971 338988 336798 334918 333735 332977 332314 331876 331877 332043 331925 331698 332090 333430 335240 336934 338488 340047 341230
59954 341230 341348 340321 338975 338322 338722 339788 340868 341457 341323 340582 339744 339448 339906 340616 340781 339994 338395
59937 338395 336237 333676 331068 329021 327781 326812 325427 323669 322092 320770 319158 317089 315345 314824 315519
59922 315519 316693 317814 318910 320127 321397 322624 323946 325696 328173 331452 335278 339182 342806 346161
59908 346161 349561 353322 357503 361810 365785 369264 372577 376120 379702 382602 384272 384670 383919 382119 379668
59893 379668 377309 375528 374220 373233 372825 373210 374064 375023 376415 378912 382580 386827 391201 395729 400524
$$ packed form
60005C07025j63j13l38l58r4J38R1r3q6J68K90q8o71n35Q75K861L962L377J758
59986C18006M41K21R63K020K775K936K668K418K422K448K142J432M58o62j700
59971C38988k190j880j183p58o63m38JJ66j18k27L92J340J810J694J554J559J183
59954C41230J18j027j346o53M00J066J080N89j34p41q38k96M58P10J65p87j599
59937C38395k158k561k608k047j240r69j385j758j577j322j612k069j744n21O95
59922C15519J174J121J096J217J270J227J322J750K477L279L826L904L624L355
59908C46161L400L761M181M307L975L479L313L543L582K900J670L98p51j800k451
59893C79668k359j781j308r87m08L85Q54R59J392K497L668M247M374M528M795
$$ plain form
59878 400524 405566 410825 416040 420372 422903 423658 423618 423524 423119 421726 419101 415448 411112 406631 402774 400075
59862 400075 398440 397419 396722 396345 396501 397611 400095 403968 408898 414788 421894 430067 438267 445232 450382
59847 450382 453680 454976 454140 451805 449385 448086 448061 448487 448164 446061 441719 435372 427590 418848 409587
59832 409587 400557 392668 386395 381604 378010 375505 373945 372937 372104 371333 370570 369528 367862 365557 362947
59817 362947 360364 357957 355816 354085 352885 352174 351694 351071 350067 348890 348142 348307 349326 350745 352215
59802 352215 353578 354555 354696 353766 351965 349625 346888 343824 340541 336933 332603 327427 322073 317545 314279
59787 314279 312023 310450 309342 308220 306529 304420 302709 301688 300617 298894 297124 296309 296400 296578 296714
59772 296714 297545 299302 301180 302510 303624 304994 306209 306529 306130 306066 307087 308993 311106 312927 314383
$$ packed form
59878D00524N042N259N215M332K531P55m0r4m05j393k625l653m336m481l857k699
59862D00075j635j021o97l77J56J110K484L873M930N890P106Q173Q200O965N150
59847D50382L298J296q36k335k420j299k5M26l23k103m342o347p782q742r261
59832D09587r030p889o273m791l594k505j560j008q33p71p63j042j666k305k610
59817C62947k583k407k141j731j200p11m80o23j004j177p48J65J019J419J470
59802C52215J363R77J41r30j801k340k737l064l283l608m330n176n354m528l266
59787C14279k256j573j108j122j691k109j711j021j071j723j770q15R1J78J36
59772B96714Q31J757J878J330J114J370J215L20l99o4J021J906K113J821J456
$$ plain form
59757 314383 315790 317638 320215 323410 327060 331279 336194 341486 346586 351323 355992 360743 365268 369197
59743 369197 372490 375223 377265 378522 379413 380777 383110 386005 388470 389784 389943 389391 388615 388110 388383 389521
59727 389521 390805 391235 390641 389932 390012 390789 391567 392090 392713 393706 394961 396380 398000 399560 400414 400214 399371
59710 399371 398565 398058 397841 398156 399326 401136 402908 404340 405877 407959 410251 411984 412911 413549 414492 415798
59694 415798 417123 418164 418821 419157 419344 419548 419709 419548 418908 417981 417044 416100 415019 413978 413503 413870 414607
59677 414607 414743 413638 411480 408910 406261 403329 399947 396448 393275 390325 387088 383468 379961 376937
59663 376937 374209 371552 369189 367405 366077 365073 364825 365886 368062 370489 372538 374236 375906 377909
59649 377909 380663 384320 388332 391778 394202 395708 396328 395867 394412 392305 389566 386025 382263 379563 378441
$$ packed form
59757C14383J407J848K577L195L650M219M915N292N100M737M669M751M525L929
59743C69197L293K733K042J257Q91J364K333K895K465J314J59n52p76n05K73J138
59727C89521J284M30n94p09Q0P77P78N23O23R93J255J419J620J560Q54k00q43
59710C99371q06n07k17L15J170J810J772J432J537K082K292J733R27O38R43J306
59694D15798J325J041O57L36J87K04J61j61o40r27r37r44j081j041m75L67P37
59677D14607J36j105k158k570k649k932l382l499l173k950l237l620l507l024
59663C76937k728k657k363j784j328j004k48J061K176K427K049J698J670K003
59649C77909K754L657M012L446K424J506O20m61j455k107k739l541l762k700j122
$$ plain form
59634 378441 377861 376508 374285 372014 370160 368587 367200 365962 364399 361880 358487 355055 352280 350151
59620 350151 348283 346316 343964 341119 338042 335205 332913 331315 330594 330741 331304 331866 332731 334573 337272
59605 337272 339714 341003 341396 341711 342167 342264 341592 340302 338836 337541 336610 336161 336177 336465 336802 337161 337680 338340
59587 338340 338756 338521 337734 336948 336424 335701 334117 331609 328763 326209 324192 322566 320878 318669 316052 313966
59571 313966 313421 314451 316060 317148 317197 316251 314802 313727 313759 314703 315628 316021 316338 317155 318221 318808 318710 318424
59553 318424 318518 319241 320618 322482 324487 326461 328809 332118 336306 340567 344431 348588 354425 362840 373833
59538 373833 387090 402501 419730 437457 453398 465288 471825 472793 468781 461170 452079 443585 436602
59525 436602 430789 425767 422172 421152 423056 427007 431747 436489 440888 444566 447039 447968 447306 445213 441966
$$ packed form
59634C78441n80j353k223k271j854j573j387j238j563k519l393l432k775k129
59620C50151j868j967k352k845l077k837k292j598p21J47N63N62Q65J842K699
59605C37272K442J289L93L15M56R7o72j290j466j295r31m49J6K88L37L59N19O60
59587C38340M16k35p87p86n24p23j584k508k846k554k017j626j688k209k617k086
59571C13966n45J030J609J088M9r46j449j075L2R44R25L93L17Q17J066N87r8k86
59553C18424R4P23J377J864K005J974K348L309M188M261L864M157N837Q415J0993
59538C73833J3257J5411J7229J7727J5941J1890O537R68m012p611r091q494o983
59525D36602n813n022l595j020J904L951M740M742M399L678K473R29o62k093l247
$$ plain form
59510 441966 437886 433196 427954 422158 415847 408977 401344 392863 383984 375638 368604 362965 358225 353871
59496 353871 349710 345774 342163 339086 336887 335802 335611 335683 335510 335197 335323 336310 338054 340255 342942 346449
59480 346449 350876 355753 360406 364587 368683 373274 378470 383680 388048 391192 393455 395415 397326 399130
59466 399130 400773 402086 402523 401591 399734 398326 398543 400542 403896 408298 413480 419011 424816 431529 439695
59451 439695 448899 458305 467797 477796 488124 498009 507152 515718 522984 527087 526810 522917 517076 510063
59437 510063 501741 492310 482661 473566 465118 456948 448594 439761 430677 422126 414911 409407 405779 404210
59423 404210 404563 406266 409058 413534 420413 429548 440214 452110 465516 480750 498056 517696 539173
59410 539173 560341 578117 590341 596499 596828 591677 582046 569926 557536 546548 538213 533505 532434
$$ packed form
59510D41966m080m690n242n796o311o870p633q481q879q346p034n639m740m354
59496C53871m161l936l611l077k199j085j91P2j73l13J26R87J744K201K687L507
59480C46449M427M877M653M181M096M591N196N210M368L144K263J960J911J804
59466C99130J643J313M37r32j857j408K17J999L354M402N182N531N805O713Q166
59451D39695R204R406R492R999J0328R885R143Q566P266M103k77l893n841p013
59437E10063q322r431r649r095q448q170q354q833r084q551p215n504l628j569
59423D04210L53J703K792M476O879R135J0666J1896J3406J5234J7306J9640K1477
59410E39173K1168J7776J2224O158L29n151r631j2120j2390j0988q335m708j071
$$ plain form
59397 532434 533433 533933 531655 525375 514909 500838 484146 465906 447250 429494 413823 400628 389412
59384 389412 379601 371329 365244 361661 359985 358865 357011 354163 351245 349332 348501 348046 347672 347905 349185
59369 349185 351201 353407 355685 358128 360590 362941 365472 368565 372149 375913 379905 384497 389773 395389
59355 395389 401028 406735 412758 419374 426925 435735 445873 457117 469235 482200 496049 510591 525385
59342 525385 540040 554536 569137 583921 598452 611991 623875 633599 640754 645225 647398 647731 646082
59329 646082 641821 634793 625779 615782 605202 593975 582205 570223 558235 546403 535242 525461
59317 525461 517246 510055 503334 497165 491938 487636 483903 480870 479440 480445 483811 489005 496114 505713
59303 505713 517390 528953 537656 541993 541912 537659 529226 517053 502625 487922 474416 462723 452865
$$ packed form
59397E32434R99N00k278o280j0466j4071j6692j8240j8656j7756j5671j3195j1216
59384C89412r811q272o085l583j676j120j854k848k918j913q31m55l74K33J280
59369C49185K016K206K278K443K462K351K531L093L584L764L992M592N276N616
59355C95389N639N707O023O616P551Q810J0138J1244J2118J2965J3849J4542J4794
59342E25385J4655J4496J4601J4784J4531J3539J1884R724P155M471K173L33j649
59329F46082m261p028r014r997j0580j1227j1770j1982j1988j1832j1161r781
59317E25461q215p191o721o169n227m302l733l033j430J005L366N194P109R599
59303E05713J1677J1563Q703M337q1m253q433j2173j4428j4703j3506j1693r858
$$ plain form
59290 452865 444716 438283 433776 431341 430734 431398 432771 434401 435923 437253 438739 440789 443368 446180 449256
59275 449256 452954 457375 462271 467636 473942 481596 490546 500522 511260 522240 532600 541683 549447
59262 549447 556118 561626 565562 567466 566962 563849 558309 550963 542573 533700 524561 515025 504858 494239
59248 494239 483917 474596 466363 459136 453372 449570 447167 444890 442432 440897 441191 442741 444389 445840
59234 445840 447605 450056 453228 457075 461172 464551 466534 467505 468202 468530 467764 465664 462555 458440 452889
59219 452889 445935 438361 430922 423851 417273 411451 406390 401645 396893 392394 388609 385647 383306 381486
59205 381486 380356 380168 380930 382159 383063 383245 383170 383621 384722 385851 386538 387001 387662 388513 389297 390081 391267
59188 391267 393057 395207 397391 399638 402243 405333 408706 412170 415793 419641 423441 426891 430255 434277
$$ packed form
59290D52865q149o433m507k435o07O64J373J630J522J330J486K050K579K812L076
59275D49256L698M421M896N365O306P654Q950R976J0738J0980J0360R083P764
59262E49447O671N508L936J904n04l113n540p346q390q873r139r536j0167j0619
59248D94239j0322r321q233p227n764l802k403k277k458j535K94J550J648J451
59234D45840J765K451L172L847M097L379J983R71O97L28p66k100l109m115n551
59219D52889o954p574p439p071o578n822n061m745m752m499l785k962k341j820
59205C81486j130j88P62J229R04J82p5M51J101J129O87M63O61Q51P84P84J186
59188C91267J790K150K184K247K605L090L373L464L623L848L800L450L364M022
$$ plain form
59174 434277 439390 445327 451580 457845 463872 469356 474341 479404 485043 491072 496955 502530 508073 513849
59160 513849 519824 525632 530567 533945 535796 536878 537642 537506 535591 531844 526881 521045 514276 506756 498966
59145 498966 491063 482831 474365 466268 459072 452933 447942 444175 441289 438568 435660 432845 430421 428214
59131 428214 425985 424027 423057 423617 425643 428401 430885 432656 434381 437160 441181 445432 449029 452455 457093
59116 457093 463623 471248 478533 484769 490380 496081 501895 507245 511918 516484 521511 526763 531613 536006
59102 536006 540435 545025 549200 552382 554516 555703 555777 554545 552196 549230 546133 543199 540452 537593 534286
59087 534286 530685 527521 525465 524456 523671 522108 519247 515285 510714 505616 499579 492536 485339 478973
59073 478973 473334 467428 460887 454656 449856 446481 443644 440791 438149 436076 434402 432548 430098 427216
$$ packed form
59174D34277N113N937O253O265O027N484M985N063N639O029N883N575N543N776
59160E13849N975N808M935L378J851J082P64j36j915l747m963n836o769p520p790
59145D98966p903q232q466q097p196o139m991l767k886k721k908k815k424k207
59131D28214k229j958r70N60K026K758K484J771J725K779M021M251L597L426M638
59116D57093O530P625P285O236N611N701N814N350M673M566N027N252M850M393
59102E36006M429M590M175L182K134J187P4j232k349k966l097k934k747k859l307
59087E34286l601l164k056j009p85j563k861l962m571n098o037p043p197o366
59073D78973n639n906o541o231m800l375k837k853k642k073j674j854k450k882
$$ plain form
59059 427216 424508 422467 421078 420040 419265 418912 418961 419085 419024 418846 418723 418715 418868 419241 419688 419886 419775 419778 420378
59040 420378 421648 423399 425609 428383 431550 434529 436690 437813 438234 438628 439604 441384 443824 446716 450057
59025 450057 454082 459041 464905 471307 477878 484735 492363 500885 509631 517731 525014 532003 539082 545992
59011 545992 552105 556858 559846 560915 560426 559264 558362 558112 558247 558281 558173 558634 560627 564414 569275 574260
58995 574260 578997 583532 587757 591393 594339 596563 597835 598071 597768 597457 596772 594719 590975 586328 581669
58980 581669 577177 572776 568806 565799 563947 563179 563498 564914 567277 570463 574561 579623 585431 591681 598178
58965 598178 604673 610850 616722 622848 629783 637409 644890 651153 655344 657169 657079 655954 654336 651995 648246
58950 648246 642448 634184 623414 610819 597764 585525 574586 564759 555724 547234 538999 530824 522867
$$ packed form
59059D27216k708k041j389j038p75l53M9J24o1j78j23qJ53L73M47J98j11LO00
59040D20378J270J751K210K774L167K979K161J123M21L94R76J780K440K892L341
59025D50057M025M959N864O402O571O857P628Q522Q746Q100P283O989P079O910
59011E45992O113M753K988J069m89j162r02k50J35L4j08M61J993L787M861M985
58995E74260M737M535M225L636K946K224J272K36l03l11o85k053l744m647m659
58980E81669m492m401l970l007j852p68L19J416K363L186M098N062N808O250O497
58965E98178O495O177N872O126O935P626P481O263M191J825r0j125j618k341l749
58950F48246n798q264j0770j2595j3055j2239j0939r827r035q490q235q175p957
$$ plain form
58937 522867 515565 509184 503521 498060 492452 486935 482199 478643 475852 473091 470219 467734 465911 464462
58923 464462 463157 462177 461551 460812 459753 459080 459606 460984 461924 461733 461020 460825 461627 463469 466505 470864 476176
58906 476176 481790 487518 493805 501039 509003 517243 525750 534923 544907 555241 565197 574231 582121 589085
58892 589085 595929 603686 612860 623291 634978 648561 664523 682230 700372 718229 735851 752999
58880 752999 768569 781324 790781 797161 800795 801785 799973 795071 787009 776268 763681 749897 735261
58867 735261 720161 705111 690433 676183 662507 649789 638272 627766 617805 607950 597983 588022
58855 588022 578439 569452 560868 552381 543911 535411 526683 517762 509144 501121 493305 485516 478748 474207
58841 474207 471487 468769 464975 460739 457014 453781 450574 447290 443882 440032 435806 431965 429017 426610
$$ packed form
58937E22867p302o381n663n461n608n517m736l556k791k761k872k485j823j449
58923D64462j305r80o26p39j059o73N26J378R40j91p13j95Q02J842L036M359N312
58906D76176N614N728O287P234P964Q240Q507R173R984J0334R956R034P890O964
58892E89085O844P757R174J0431J1687J3583J5962J7707J8142J7857J7622J7148
58880G52999J5570J2755R457O380L634R90j812m902q062j0741j2587j3784j4636
58867G35261j5100j5050j4678j4250j3676j2718j1517j0506r961r855r967r961
58855E88022r583q987q584q487q470q500q728q921q618q023p816p789o768m541
58841D74207k720k718l794m236l725l233l207l284l408l850m226l841k948k407
$$ plain form
58827 426610 424449 423106 423145 424027 424712 424942 425154 425577 426293 427840 430776 434656 438292 441115 443573 446147
58811 446147 448656 450760 452584 454507 456613 458593 460052 460812 461033 461005 460762 459998 458435 456121 453317 450330
58795 450330 447538 445209 443172 441097 439204 438197 438184 438239 437542 436548 436460 437902 440626 444182 448225 452377
58779 452377 456472 460936 466342 472516 478448 483112 486039 487211 486760 484822 481371 476273 469713 462482
58765 462482 455523 449268 443619 438435 433750 429604 425897 422366 418715 414984 411876 410303 410386 411288 412248
58750 412248 413415 415350 418151 421447 424888 428209 431143 433762 436676 440506 445300 450715 456403 461939
58736 461939 466819 471030 475258 480095 485359 490549 495494 500038 503682 506313 508915 512666 517435 521870
58722 521870 524919 526596 527349 527437 527081 526698 526756 527664 529838 533529 538525 544207 549864 554885 558985 562452
$$ packed form
58827D26610k161j343L9Q82O85K30K12M23P16J547K936L880L636K823K458K574
58811D46147K509K104J824J923K106J980J459P60K21k8k43p64j563k314k804k987
58795D50330k792k329k037k075j893j007j3N5o97r94q8J442K724L556M043M152
58779D52377M095M464N406O174N932M664K927J172m51j938l451n098o560p231
58765D62482o959o255n649n184m685m146l707l531l651l731l108j573Q3R02R60
58750D12248J167J935K801L296L441L321K934K619K914L830M794N415N688N536
58736D61939M880M211M228M837N264N190M945M544L644K631K602L751M769M435
58722E21870L049J677P53Q8l56l83N8R08K174L691M996N682N657N021M100L467
$$ plain form
58706 562452 565853 569153 571482 572029 570777 568059 563887 558162 551028 542540 532447 520881 508712 496644
58692 496644 484508 472149 460452 450578 442626 435959 430446 426334 423106 419600 415320 410727 406245
58679 406245 401869 397824 394745 392961 392202 392085 392331 392592 392731 393302 395118 398384 402843 408588 415952 424652
58663 424652 433790 442668 450948 458108 463552 467224 469342 469575 467376 463148 458270 453806 449890 446397
58649 446397 443407 440875 438652 436900 435789 434744 432856 430149 427530 425389 423116 420265 417324 414989
58635 414989 413495 413054 414120 416714 419961 422796 424789 426188 427568 429549 432317 435292 437739 439584
58621 439584 441145 442266 442604 442648 443491 445538 448358 451856 456508 462244 468206 473972 479967 486277 492084
58606 492084 496764 500515 503315 504333 503185 500949 499047 497694 496207 494269 492062 489580 486623 483284
$$ packed form
58706E62452L401L300K329N47j252k718m172n725p134q488j0093j1566j2169j2068
58692D96644j2136j2359j1697r874p952o667n513m112l228l506m280m593m482
58679D06245m376m045l079j784p59j17K46K61J39N71J816L266M459N745P364Q700
58663D24652R138Q878Q280P160N444L672K118K33k199m228m878m464l916l493
58649D46397k990k532k223j752j111j045j888k707k619k141k273k851k941k335
58635D14989j494m41J066K594L247K835J993J399J380J981K768K975K447J845
58621D39584J561J121L38M4Q43K047K820L498M652N736N962N766N995O310N807
58606D92084M680L751K800J018j148k236j902j353j487j938k207k482k957l339
$$ plain form
58592 483284 479867 476534 473483 471202 470199 470659 472612 476045 480688 486141 492410 499759 507838 515583
58578 515583 522334 528399 534240 539766 544904 550193 556178 562677 569225 575876 583114 591265 600330 610109
58564 610109 620317 631052 643227 657874 674792 692627 710557 729045 748374 767340 784121
58553 784121 797864 808670 816626 821650 823939 823814 821384 816930 811340 805577 799916 794165 788252 782021
58539 782021 774753 765508 753925 740306 725217 709358 693534 678222 663272 648460 634235 621634
58527 621634 611562 604269 599325 595848 592975 590331 588024 586272 585290 585385 586594 588280 589601 590401 591071
58512 591071 591566 591387 590596 589990 589911 589633 588395 586423 584539 583291 582803 582920 583101 582637 581296 579462 577562
58495 577562 575887 574894 574906 575453 575628 575231 574751 574283 573574 573258 574734 578394 583126 588089 593813 600933 609081
$$ packed form
58592D83284l417l333l051k281j003M60J953L433M643N453O269P349Q079P745
58578E15583O751O065N841N526N138N289N985O499O548O651P238Q151R065R779
58564F10109J0208J0735J2175J4647J6918J7835J7930J8488J9329J8966J6781
58553G84121J3743J0806P956N024K289j25k430m454n590n763n661n751n913o231
58539G82021p268r245j1583j3619j5089j5859j5824j5312j4950j4812j4225j2601
58527F21634j0072p293m944l477k873k644k307j752r82R5J209J686J321Q00O70
58512E91071M95j79p91o06p9k78j238j972j884j248m88J17J81m64j341j834j900
58495E77562j675r93J2N47J75l97m80m68p09l16J476L660M732M963N724P120Q148
$$ plain form
58478 609081 617790 627362 637928 648720 659239 670081 681460 691781 699038 703023 704959 705450 704029
58465 704029 700460 695383 689718 684278 679798 676609 674373 672705 671840 672275 674104 677201 681607 687274 693871
58450 693871 701200 709166 716903 722697 725400 725293 723022 718556 711984 704463 697336 690847 684618 678891
58436 678891 674422 671510 670001 669927 671424 674295 678243 683208 688970 694931 700786 706924 713754 721203 729254
58421 729254 738158 747690 757030 765783 774100 781262 785445 785823 783842 781431 778933 775766 772009 768053
58407 768053 763557 758084 752201 746790 741898 737250 733217 730236 728018 726298 725560 726000 726753 727339 728916
58392 728916 732729 738140 743591 748661 753664 757948 760335 760923 760974 761309 762013 763252 765132 767172 769052
58377 769052 771370 774550 777755 780096 782094 784668 787586 790401 793982 799403 806100 812907 820117 828674
$$ packed form
58478F09081Q709R572J0566J0792J0519J0842J1379J0321P257L985J936M91j421
58465G04029l569n077n665n440m480l189k236j668q65M35J829L097M406N667O597
58450F93871P329P966P737N794K703j07k271m466o572p521p127o489o229n727
58436F78891m469k912j509p4J497K871L948M965N762N961N855O138O830P449Q051
58421G29254Q904R532R340Q753Q317P162M183L78j981k411k498l167l757l956
58407G68053m496n473n883n411m892m648m033k981k218j720p38M40P53N86J577
58392G28916L813N411N451N070N003M284K387N88N1L35P04J239J880K040J880
58377G69052K318L180L205K341J998K574K918K815L581N421O697O807P210Q557
$$ plain form
58363 828674 838007 846814 855491 865598 877159 888601 899313 910162 921389 931998 941477 950296
58351 950296 958372 964730 969141 972717 976577 981070 986307 992144 997719 1002381 1007060 1013411 1021725 1031022
58337 1031022 1040890 1051686 1063143 1074531 1086225 1099536 1114785 1130923 1147007 1162761 1177816
58326 1177816 1191824 1205210 1218422 1230645 1240715 1249014 1256989 1265066 1272634 1279741 1287104 1294653 1301722
58313 1301722 1308530 1315871 1323635 1331316 1339667 1350097 1362750 1376829 1392353 1409718 1428017 1445876
58301 1445876 1463616 1482534 1502474 1522323 1542514 1564516 1587964 1610741 1631976 1652660 1673239
58290 1673239 1693026 1712217 1732201 1753470 1775255 1797405 1820640 1844955 1869810 1895825 1924116
58279 1924116 1954144 1984490 2015618 2049458 2086348 2124842 2164401 2205761 2248754 2292409 2337188
$$ packed form
58363H28674R333Q807Q677J0107J1561J1442J0712J0849J1227J0609R479Q819
58351I50296Q076O358M411L576L860M493N237N837N575M662M679O351Q314R297
58337A031022R868J0796J1457J1388J1694J3311J5249J6138J6084J5754J5055
58326A177816J4008J3386J3212J2223J0070Q299P975Q077P568P107P363P549P069
58313A301722O808P341P764P681Q351J0430J2653J4079J5524J7365J8299J7859
58301A445876J7740J8918J9940J9849K0191K2002K3448K2777K1235K0684K0579
58290A673239J9787J9191J9984K1269K1785K2150K3235K4315K4855K6015K8291
58279A924116L0028L0346L1128L3840L6890L8494L9559M1360M2993M3655M4779
$$ plain form
58268 2337188 2384469 2433930 2484114 2535421 2589622 2646528 2704186 2762450 2823308 2887559 2954209
58257 2954209 3023178 3095394 3170069 3245095 3320353 3397515 3476694 3556678 3638400 3724494 3815350
58246 3815350 3909349 4007120 4111619 4223798 4342180 4466893 4600038 4741871 4890966 5048423
58236 5048423 5217455 5398489 5589340 5790556 6005763 6236425 6481338 6741775 7021748
58227 7021748 7322665 7643359 7986101 8356807 8758538 9190878 9656525 10162239 10712548
58218 10712548 11309474 11959603 12674459 13462865 14330633 15289166 16356620 17549423 18881299
58209 18881299 20372475 22051607 23948490 26096597 28547046 31372833 34661219 38516563
58201 38516563 43073759 48495925 54956492 62638365 71754389 82555294 95318159 110344848
$$ packed form
58268B337188M7281M9461N0184N1307N4201N6906N7658N8264O0858O4251O6650
58257B954209O8969P2216P4675P5026P5258P7162P9179P9984Q1722Q6094R0856
58246C815350R3999R7771J04499J12179J18382J24713J33145J41833J49095J57457
58236E048423J69032J81034J90851K01216K15207K30662K44913K60437K79973
58227G021748L00917L20694L42742L70706M01731M32340M65647N05714N50309
58218A0712548N96926O50129P14856P88406Q67768R58533J067454J192803J331876
58209A8881299J491176J679132J896883K148107K450449K825787L288386L855344
58201C8516563M557196N422166O460567P681873R116024J0800905J2762865J5026689
$$ plain form
58193 110344848 127966046 148510840 172244515 199292955 229468052 261886817 294552647
58186 294552647 324362942 347806764 361996414 365371787 357809595 340412735 315271547
58179 315271547 285139823 252897881 220973585 191038508 164047169 140414185 120161650
58172 120161650 103045049 88690683 76700486 66691716 58311306 51259181 45298672
58165 45298672 40238313 35914794 32197059 28988522 26211353 23794052 21677066 19817560
58157 19817560 18180055 16729352 15436761 14284089 13255565 12332533 11499823 10749629
58149 10749629 10074505 9462983 8905626 8398652 7937728 7514268 7121326 6757151 6419539
58140 6419539 6102516 5802030 5519423 5255833 5008230 4774167 4555283 4352574 4162800
$$ packed form
58193A10344848J7621198K0544794K3733675K7048440L0175097L2418765L2665830
58186B94552647K9810295K3443822J4189650L375373p562192j7396860k5141188
58179C15271547l0131724l2241942l1924296k9935077k6991339k3632984k0252535
58172A20161650j7116601j4354366j1990197j0008770q380410p052125n960509
58165D5298672n060359m323519l717735l208537k777169k417301k116986j859506
58157A9817560j637505j450703j292591j152672j028524r23032q32710p50194
58149A0749629o75124o11522n57357n06974m60924m23460l92942l64175l37612
58140F419539l17023l00486k82607k63590k47603k34063k18884k02709j89774
$$ plain form
58131 4162800 3982882 3813645 3656085 3507990 3367333 3235234 3112656 2997697 2888727
58122 2888727 2786645 2691462 2600227 2510925 2425194 2344767 2268500 2195232 2126195 2062059 2000750
58111 2000750 1940753 1883668 1831079 1781707 1734009 1688791 1646824 1606525 1566426 1527572 1491285
58100 1491285 1456921 1423963 1393834 1367304 1342268 1316283 1289374 1262474 1235251 1207463 1180331
58089 1180331 1154593 1129112 1103182 1078132 1054889 1032126 1008716 985866 964807 944450 923425
58078 923425 902486 882750 863405 843380 823646 805665 789076 773028 758341 746122 735421
58067 735421 724337 712522 700781 689282 677911 667362 658088 649002 638813 627840 617138 606773
58055 606773 596287 585910 575981 566093 556024 546608 538570 531524 525014 519326 514245 508493 501654
$$ packed form
58131D162800j79918j69237j57560j48095j40657j32099j22578j14959j08970
58122B888727j02082r5183r1235q9302q5731q0427p6267p3268o9037o4136o1309
58111B000750n9997n7085n2589m9372m7698m5218m1967m0299m0099l8854l6287
58100A491285l4364l2958l0129k6530k5036k5985k6909k6900k7223k7788k7132
58089A180331k5738k5481k5930k5050k3243k2763k3410k2850k1059k0357k1025
58078I23425k0939j9736j9345k0025j9734j7981j6589j6048j4687j2219j0701
58067G35421j1084j1815j1741j1499j1371j0549r274r086j0189j0973j0702j0365
58055F06773j0486j0377r929r888j0069r416q038p046o510n688n081n752o839
$$ plain form
58042 501654 495218 490369 486084 480883 475134 470088 465820 461719 457957 454824 451434 446645 440568 433902
58028 433902 426588 418399 410025 402271 394917 387547 380714 375107 370285 365313 359934 354232 348046 341730
58014 341730 336512 333072 330631 328284 326130 324220 321725 318344 315308 313609 312391 310466 308327 307176
58000 307176 306861 306307 305220 304039 302915 301956 301687 302030 301693 299858 297590 296325 295821 294942 293599 292451
57984 292451 291451 290109 288550 286980 284784 281508 278089 275813 274610 273513 272108 270366 267963 265083
57970 265083 263067 262875 263693 264352 265152 266710 268065 267897 266929 267115 268825 270729 272157 273694 275511 276921
57954 276921 277675 278177 278373 277863 277104 277042 277600 277953 278260 279607 282147 284776 286900 289243 292638 297197 302811
57937 302811 309268 315693 321020 325301 329539 334087 338256 341562 344244 346289 347075 346285 344259 341122 336417
$$ packed form
58042E01654o436m849m285n201n749n046m268m101l762l133l390m789o077o666
58028D33902p314q189q374p754p354p370o833n607m822m972n379n702o186o316
58014C41730n218l440k441k347k154j910k495l381l036j699j218j925k139j151
58000C07176l15n54j087j181j124r59k69L43l37j835k268j265n04q79j343j148
57984B92451j000j342j559j570k196l276l419k276j203j097j405j742k403k880
57970B65083k016j92Q18O59Q00J558J355j68r68J86J710J904J428J537J817J410
57954B76921P54N02J96n10p59o2N58L53L07J347K540K629K124K343L395M559N614
57937C02811O457O425N327M281M238M548M169L306K682K045P86p90k026l137m705
$$ plain form
57922 336417 329904 322001 313272 304133 295187 287038 279613 272308 264904 257836 251591 246494 242956 241211
57908 241211 240781 240802 240804 240678 240214 239395 238771 238688 238448 237152 235159 233691 233177 233078 233293 234624 237632 241928
57890 241928 246762 251447 255146 257077 257286 256586 255599 254352 252777 250979 248930 246410 243285 239488 234978
57875 234978 230165 225980 222911 220378 217693 215113 213100 211131 208298 204797 201665 199293 197258 195506
57861 195506 194615 194932 196395 199021 202604 206160 208796 210995 213902 217546 221002 224141 227752 231780 234916
57846 234916 236324 236503 236017 234605 232122 229242 226534 223714 220451 217127 214262 211844 209758 208269 207652
57831 207652 207808 208662 210409 213044 216104 219145 222130 225259 228841 233315 238860 245038 251295 257581 263717
57816 263717 268461 270288 269072 266001 261823 256266 249328 241928 234816 227817 220626 213541 206966 201008
$$ packed form
57922C36417o513p903q729r139q946q149p425p305p404p068o245n097l538j745
57908B41211m30K1Kj26m64q19o24q3k40j296j993j468n14r9K15J331L008M296
57890B41928M834M685L699J931K09p00r87j247j575j798k049k520l125l797m510
57875B34978m813m185l069k533k685k580k013j969k833l501l132k372k035j752
57861A95506q91L17J463K626L583L556K636K199K907L644L456L139L611M028L136
57846B34916J408J79m86j412k483k880k708k820l263l324k865k418k086j489o17
57831B07652J56Q54J747K635L060L041K985L129L582M474N545O178O257O286O136
57816B63717M744J827j216l071m178n557o938p400p112o999p191p085o575n958
$$ plain form
57802 201008 195934 192243 189838 187780 185275 182310 179156 175997 173257 171489 170623 170099 169949 170817 172606
57787 172606 174170 174880 175565 177288 180067 183424 187418 192291 197768 203451 209442 215848 222114 227495 231867
57772 231867 235530 238515 240595 241672 241704 240545 238243 235174 231574 227290 222299 217010 211736 206265 200372
57757 200372 194366 188811 184038 180210 177446 175503 173684 171443 168845 166308 164142 162503 161390 160538
57743 160538 159606 158532 157396 156067 154548 153494 153614 154515 154956 154352 153264 152318 151590 151283 151903 153294
57727 153294 154446 154851 155268 156490 158121 159225 159541 159366 158826 157944 156990 156111 155051 153760 152825 152743 153190
57710 153190 153509 153460 152992 151817 149843 147639 145852 144466 143059 141535 140200 139465 139735 141093 142838 143903
57694 143903 144088 144200 144630 144613 143492 141826 140505 139451 138113 136667 135845 135974 136971 138851 141496 144447
$$ packed form
57802B01008n074l691k405k058k505k965l154l159k740j768q66n24j50Q68J789
57787A72606J564P10O85J723K779L357L994M873N477N683N991O406O266N381M372
57772B31867L663K985K080J077L2j159k302l069l600m284m991n289n274n471n893
57757B00372o006n555m773l828k764j943j819k241k598k537k166j639j113q52
57743A60538r32j074j136j329j519j054J20R01M41o04j088r46p28l07O20J391
57727A53294J152M05M17J222J631J104L16j75n40q82r54q79j060j291r35q2M47
57710A53190L19m9m68j175j974k204j787j386j407j524j335p35K70J358J745J065
57694A43903J85J12M30j7j121j666j321j054j338j446q22J29R97J880K645K951
$$ plain form
57678 144447 147814 152939 161203 172514 186009 201904 221514 245604 273864 306141 342930 383969
57666 383969 426772 466791 498726 517959 521921 510899 487501 455226 417515 377681 338783 303120
57654 303120 271932 245565 223654 205395 190098 177552 167621 159722 153133 147686 143656 141025 139220
57641 139220 137587 135874 134360 133712 134398 135959 137157 137253 136812 136810 137340 137774 137878 138008 138355 138692 138850 138842 138500
57622 138500 137544 136006 134149 132051 129767 127772 126613 126113 125542 124604 123716 123226 122979 122784 122735 122775 122355
57605 122355 120895 118439 115723 113694 112845 112774 112469 111333 109822 108802 108493 108463 108417 108343 107911 106487 103998
57588 103998 101319 99434 98476 97789 96685 95013 93188 91821 91198 91033 90831 90437 90073 89922 89893 89726 89137
57571 89137 88034 86780 86089 86294 86895 87179 87143 87339 87891 88199 87725 86686 85767 85406 85467 85485 85148 84678 84706
$$ packed form
57678A44447L367N125Q264J1311J3495J5895J9610K4090K8260L2277L6789M1039
57666C83969M2803M0019L1935J9233L962j1022k3398l2275l7711l9834l8898l5663
57654C03120l1188k6367k1911j8259j5297j2546r931p899o589n447m030k631j805
57641A39220j633j713j514o48O86J561J198R6m41kN30M34J04J30L47L37J58ql42
57622A38500r56j538j857k098k284j995j159n00n71r38q88m90k47j95m9M0m20
57605A22355j460k456k716k029q49p1l05j136j511j020l09l0m6p4m32j424k489
57588A03998k679j885r58o87j104j672j825j367o23j65k02l94l64j51k9j67n89
57571H9137j103j254o91K05O01K84l6J96N52L08m74j039r19l61O1J8l37m70K8
$$ plain form
57552 84706 85701 87591 89985 92478 94537 95452 94873 93249 91341 89446 87476 85638 84487 84273 84681 85293
57536 85293 86016 86991 88311 89837 91082 91394 90568 89174 88002 87322 86960 86863 87077 87298 86995 86134 85350 85271
57518 85271 85895 86683 87115 87199 87561 88828 90715 92056 92089 91371 90992 91199 91410 91306 91136 91013 90707 90231 89996
57499 89996 90154 90363 90312 89947 89059 87311 84972 83039 82182 81886 81033 79108 76602 74455 73349 73315 73766
57482 73766 73998 73782 73430 73322 73579 74147 74861 75425 75622 75601 75657 75751 75590 75183 74944 75134 75595 76121 76725 77390
57462 77390 77906 78135 78184 78158 77996 77662 77295 77063 77061 77320 77644 77474 76355 74676 73532 73602 74389 74768 74126 72857
57442 72857 71886 71824 72501 73278 73785 74182 74681 75215 75846 77023 78879 80592 81154 80661 80138 80146 80298 80170 79890
57423 79890 79632 79274 78836 78565 78333 77564 76105 74555 73424 72599 72010 72072 72864 73584 73519 73071 73094 73633 74052
$$ packed form
57552H4706R95J890K394K493K059R15n79j624j908j895j970j838j151k14M08O12
57536H5293P23R75J320J526J245L12q26j394j172o80l62r7K14K21l03q61p84p9
57518H5271O24P88M32Q4L62J267J887J341L3p18l79K07K11j04j70j23l06m76k35
57499H9996J58K09n1l65q88j748k339j933q57k96q53j925k506k147j106l4M51
57482G3766K32k16l52j08K57N68P14N64J97k1N6R4j61m07k39J90M61N26O04O65
57462G7390N16K29M9k6j62l34l67k32kK59L24j70j119j679j144P0P87L79o42j269
57442G2857r71o2O77P77N07L97M99N34O31J177J856J713N62m93n23QJ52j28k80
57423G9890k58l58m38k71k32p69j459j550j131q25n89O2P92P20o5m48K3N39M19
$$ plain form
57404 74052 74113 74068 73907 73393 72827 72941 73852 74863 75501 76144 77253 78595 79658 80498 81626 83234 84975
57387 84975 86521 87995 89729 91832 94119 96350 98367 100067 101379 102350 103109 103729 104204 104628 105187 105781
57371 105781 105803 104655 102430 99797 97239 94755 92393 90586 89652 89251 88740 88006 87642 88250 89789 91687
57355 91687 93410 94859 96202 97473 98450 98944 99045 98960 98758 98493 98469 99086 100414 102157 104036 105940 107687
57338 107687 108937 109462 109287 108476 107038 105136 103164 101462 100147 99275 98909 98878 98710 98001 96740 95220
57322 95220 93774 92682 92138 92145 92541 93113 93615 93757 93496 93301 93748 94753 95559 95642 95327 95322 95933 96922 97864 98390
57302 98390 98348 97998 97946 98637 99957 101405 102522 103136 103476 104143 105725 108202 110885 113035 114314 114666 114222
57285 114222 113527 113393 114113 115072 115505 115423 115483 116187 117557 119324 120988 121900 121854 121478 121492 121613 120850 119087 117700
$$ packed form
57404G4052O1m5j61n14n66J14R11J011O38O43J109J342J063Q40J128J608J741
57387H4975J546J474J734K103K287K231K017J700J312R71P59O20M75M24N59N94
57371A05781K2j148k225k633k558k484k362j807r34m01n11p34l64O08J539J898
57355I1687J723J449J343J271R77M94J01q5k02k65k4O17J328J743J879J904J747
57338A07687J250N25j75q11j438j902j972j702j315q72l66l1j68p09j261j520
57322I5220j446j092n44PL96N72N02J42k61j95M47J005Q06Q3l15nO11R89R42N26
57302I8390m2l50n2O91J320J448J117O14L40O67J582K477K683K150J279L52m44
57285A14222o95j34P20R59M33q2O0P04J370J767J664R12m6l76J4J21p63j763j387
$$ plain form
57266 117700 118180 120509 123393 125794 127646 129161 130189 130566 130619 130790 130935 130560 129781 129532 130571 132625
57250 132625 134790 136510 137806 138815 139605 140414 141570 143023 144288 145063 145708 146922 149022 151641 154120
57235 154120 156158 158063 160261 162579 164371 165505 166820 169145 172160 174825 176761 178498 180359 181880
57221 181880 182658 183105 183959 185487 187623 190454 194017 197798 200996 203259 204896 206431 208200 210349 212898
57206 212898 215782 218898 222125 225300 228324 231329 234570 238167 242145 246691 251970 257655 263092 268144
57192 268144 273460 279594 286211 292537 298369 304277 310934 318578 326987 335672 344120 352135 359996 368203
57178 368203 377163 387094 397976 409459 421092 432881 445296 458493 471802 484440 496526 508955
57166 508955 522235 535834 548775 560607 571603 582268 592903 603658 614761 626438 638609
$$ packed form
57266A17700M80K329K884K401J852J515J028L77N3J71J45l75p79k49J039K054
57250A32625K165J720J296J009P90Q09J156J453J265P75O45J214K100K619K479
57235A54120K038J905K198K318J792J134J315K325L015K665J936J737J861J521
57221A81880P78M47Q54J528K136K831L563L781L198K263J637J535J769K149K549
57206B12898K884L116L227L175L024L005L241L597L978M546N279N685N437N052
57192B68144N316O134O617O326N832N908O657P644Q409Q685Q448Q015P861Q207
57178C68203Q960R931J0882J1483J1633J1789J2415J3197J3309J2638J2086J2429
57166E08955J3280J3599J2941J1832J0996J0665J0635J0755J1103J1677J2171
$$ plain form
57155 638609 650897 663124 675578 688543 701807 715052 728674 743640 760432 778569 797365
57144 797365 816763 837131 858585 880888 903891 927793 953027 980052 1009130 1040204 1073042
57133 1073042 1107530 1143658 1181356 1220679 1262257 1307172 1356218 1409457 1466554 1527305 1591814
57122 1591814 1660537 1734234 1813615 1898943 1990347 2088471 2194404 2309003 2432885 2567292
57112 2567292 2714355 2876191 3054277 3250142 3466414 3706965 3976590 4281053 4627368
57103 4627368 5023941 5480906 6010831 6629153 7354141 8207038 9212235 10396204 11785067
57094 11785067 13402616 15269880 17404857 19820834 22523874 25510669 28766340 32260967
57086 32260967 35944528 39740850 43542020 47206583 50566326 53443983 55678999 57154198
$$ packed form
57155F38609J2288J2227J2454J2965J3264J3245J3622J4966J6792J8137J8796
57144G97365J9398K0368K1454K2303K3003K3902K5234K7025K9078L1074L2838
57133A073042L4488L6128L7698L9323M1578M4915M9046N3239N7097O0751O4509
57122A591814O8723P3697P9381Q5328R1404R8124J05933J14599J23882J34407
57112B567292J47063J61836J78086J95865K16272K40551K69625L04463L46315
57103D627368L96573M56965N29925O18322P24988Q52897J005197J183969J388863
57094A1785067J617549J867264K134977K415977K703040K986795L255671L494627
57086C2260967L683561L796322L801170L664563L359743K877657K235016J475199
$$ plain form
57078 57154198 57814522 57670225 56782817 55241682 53144428 50588090 47667952 44477601
57070 44477601 41108667 37651338 34194027 30819480 27598561 24585671 21817350 19312720
57062 19312720 17075353 15097092 13362564 11852112 10543184 9411925 8435149 7591395
57054 7591395 6861177 6227612 5677020 5198265 4781444 4417520 4098665 3818039 3569476
57045 3569476 3348177 3151355 2977175 2823128 2686172 2564116 2455853 2360537 2277587 2207275
57035 2207275 2150244 2106755 2077521 2064415 2067851 2082612 2097795 2101865 2087168 2050101 1989705 1908178
57023 1908178 1811712 1708676 1606358 1509426 1420373 1340183 1268797 1205861 1151101 1103764 1062303
57012 1062303 1025278 992136 962555 935482 909586 884422 860484 838195 817399 797681 778748
$$ packed form
57078E7154198O60324j44297q87408j541135k097254k556338k920138l190351
57070D4477601l368934l457329l457311l374547l220919l012890k768321k504630
57062A9312720k237367j978261j734528j510452j308928j131259r76776q43754
57054G591395p30218o33565n50592m78755m16821l63924l18855k80626k48563
57045C569476k21299j96822j74180j54047j36956j22056j08263r5316q2950p0312
57035B207275n7031m3489k9234j3106L436J4761J5183M070j4697l7067o0396q1527
57023A908178r6466j03036j02318r6932q9053q0190p1386o2936n4760m7337m1461
57012A062303l7025l3142k9581k7073k5896k5164k3938k2289k0796j9718j8933
$$ plain form
57001 778748 760545 743308 727476 713346 700954 690346 681609 674544 668686 663833 660185 657825 656573
56988 656573 656520 658150 661646 666507 672019 677408 681264 681665 677550 669526 658758 645610 629994 612516
56974 612516 594454 576795 560039 544799 531897 521784 514352 509338 506561 505750 506532 508677 512248
56961 512248 517543 524922 534424 545334 556279 565809 572691 575676 573633 566224 554117 538322 519777
56948 519777 499836 480523 463594 449588 438138 428983 422273 418218 416900 418228 421757 426925 433876
56935 433876 443727 457451 474648 493707 512790 530118 543673 551461 552294 546057 533397 515573
56923 515573 494451 472026 449686 428079 407536 388302 370449 353918 338709 324919 312703
56912 312703 302309 293852 286884 280553 274571 269684 266740 265480 264729 263628 262261 261200 260908 261589 263157
$$ packed form
57001G78748j8203j7237j5832j4130j2392j0608q737p065n858m853l648k360j252
56988F56573n3J630L496M861N512N389L856M01m115q024j0768j3148j5616j7478
56974F12516j8062j7659j6756j5240j2902j0113p432n014k777q11P82K145L571
56961E12248N295P379R502J0910J0945R530O882K985k043p409j2107j5795j8545
56948E19777j9941j9313j6929j4006j1450r155o710m055j318J328L529N168O951
56935D33876R851J3724J7197J9059J9083J7328J3555P788Q33o237j2660j7824
56923E15573k1122k2425k2340k1607k0543j9234j7853j6531j5209j3790j2216
56912C12703j0394q457o968o331n982m887k944j260p51j101j367j061k92O81J568
$$ plain form
56897 263157 265234 267415 269621 272121 275318 279618 285345 292548 301034 310688 321445 332760 343455
56884 343455 352392 359017 362962 363494 359950 352574 342562 331384 320374 310712 303263 298344 295902 295857
56870 295857 298167 302792 309990 320388 334421 351811 371951 394597 419789 447145 475448 502688
56858 502688 526206 543179 551600 550949 541920 525895 505071 482477 460874 441501 424367 409714
56846 409714 398646 392312 391091 394827 403382 416751 434931 458039 486441 520566 560448 605150
56834 605150 652295 698124 738261 768640 786052 788499 775701 749366 712721 669638 623974 579136
56822 579136 537690 501242 470692 446444 428394 416265 410231 410809 417840 430123 446537 467179
56810 467179 492788 523209 556725 590429 620626 643412 655911 657183 647619 627811 598841 563384
$$ packed form
56897B63157K077K181K206K500L197M300N727P203Q486R654J0757J1315J0695
56884C43455Q937O625L945N32l544p376j0012j1178j1010r662p449m919k442m5
56870B95857K310M625P198J0398J4033J7390K0140K2646K5192K7356K8303K7240
56858E02688K3518J6973Q421o51r029j6025k0824k2594k1603j9373j7134j4653
56846D09714j1068o334j221L736Q555J3369J8180K3108K8402L4125L9882M4702
56834F05150M7145M5829M0137L0379J7412K447j2798k6335l6645m3083m5664m4838
56822E79136m1446l6448l0550k4248j8050j2129o034N78P031J2283J6414K0642
56810D67179K5609L0421L3516L3704L0197K2786J2499J272r564j9808k8970l5457
$$ plain form
56798 563384 525363 488076 453184 421600 394434 372481 355387 342027 331688 324537 321125 321771
56786 321771 326422 334818 346589 361131 377443 394152 409710 422317 429780 430113 422747 408972 390852
56773 390852 369944 347284 324132 302013 282058 264664 249620 236216 223566 211430 200542
56762 200542 191670 184620 178717 173903 170525 168191 165748 162487 158694 154941 151592 149074 147780 147388
56748 147388 146952 146023 145044 144411 143857 143148 142695 142882 143310 143349 143081 143034 143139 142639 141083 138933 137020 135726
56730 135726 134870 134224 133829 133732 133641 133149 132346 131890 132301 133418 134784 136266 137964 139712 141107 141865 141870 141115
56712 141115 139998 139403 139878 140886 141470 141528 141818 142761 143947 144873 145494 145904 146095 146235 146609 147047 146908 145864
56694 145864 144299 142787 141645 141080 141224 141801 142223 142166 141692 140774 139305 137676 136678 136580 136876 137184 137739 138716
$$ packed form
56798E63384l8021l7287l4892l1584k7166k1953j7094j3360j0339p151l412O46
56786C21771M651Q396J1771J4542J6312J6709J5558J2607P463L33p366j3775j8120
56773C90852k0908k2660k3152k2119j9955j7394j5044j3404j2650j2136j0888
56762B00542q872p050n903m814l378k334k443l261l793l753l349k518j294l92
56748A47388m36r29r79o33n54p09m53J87M28L9k68m7J05n00j556k150j913j294
56730A35726q56o46l95r7r1m92q03m56M11J117J366J482J698J748J395P58Np55
56712A41115j117n95M75J008N84N8K90R43J186R26O21M10J91J40L74M38j39j044
56694A45864j565j512j142n65J44N77M22n7m74r18j469j629r98r8K96L08N55R77
$$ plain form
56676 138716 139681 140164 140225 140110 139843 139573 139757 140528 141366 141816 142111 142622 143193 143527 143717 143807 143329 142045 140799
56657 140799 140859 142535 145126 147989 150876 153363 154907 155706 156672 158153 159342 159456 159001 159192 160351 161562
56641 161562 161938 161600 161160 160796 160365 160113 160525 161435 161963 161670 161215 161453 162343 163284 164079 164866 165391 165216 164561
56622 164561 164106 163880 163198 161876 160620 159854 158990 157408 155536 154325 154103 154488 154981 155080 154218 152346 150360
56605 150360 149283 149053 148662 147433 145641 143882 142352 140997 139959 139584 140015 140923 141680 141890 141738 141700 141897
56588 141897 141950 141549 140934 140638 140961 141807 142835 143627 143877 143648 143309 143127 143049 142979 143070 143560 144468 145580 146731
56569 146731 148028 149813 152329 155362 158413 161386 164842 169314 174643 180475 187102 195096 204076 212476
56555 212476 218668 221893 222210 220260 217271 214546 212567 210931 209219 207387 205316 202774 200017 197720
$$ packed form
56676A38716R65M83O1j15k67k70J84P71Q38M50K95N11N71L34J90R0m78j284j246
56657A40799O0J676K591K863K887K487J544P99R66J481J189J14m55J91J159J211
56641A61562L76l38m40l64m31k52M12R10N28k93m55K38Q90R41P95P87N25j75o55
56622A64561m55k26o82j322j256p66q64j582j872j211k22L85M93R9q62j872j986
56605A50360j077k30l91j229j792j759j530j355j038l75M31R08P57K10j52l8J97
56588A41897N3m01o15k96L23Q46J028P92K50k29l39j82p8p0R1M90R08J112J151
56569A46731J297J785K516L033L051K973L456M472N329N832O627P994Q980Q400
56555B12476O192L225L17j950k989k725j979j636j712j832k071k542k757k297
$$ plain form
56541 197720 195985 194141 191859 189667 187937 186149 183788 181307 179452 178212 177174 176481 176615 177418 178063
56526 178063 177971 177303 176651 176559 177134 177839 177930 177348 176747 176390 175623 173912 171849 170469 170022 170046 170278 170734 171152
56507 171152 171094 170561 170001 169806 170149 171066 172238 172954 172823 172292 172002 171948 171791 171657 171933 172398 172261 171152 169640
56488 169640 168762 169213 170800 172400 172741 171533 169614 167788 166110 164664 164258 165526 167740 169420 169953
56473 169953 169941 170118 170598 171100 171329 171233 171299 172352 174583 177121 179064 180467 181734 182567 182447 181737 181311 181310
56455 181310 181220 180972 180957 181050 180681 179939 179585 179802 179955 179808 180004 180937 181979 182414 182421 182632 183137 183462 183231 182539
56435 182539 181863 181756 182366 183167 183499 183381 183457 184148 185231 186267 187031 187511 187883 188433 189209 189887 190338 191022
56417 191022 192284 193540 193911 193471 193107 193174 193152 192635 191915 191416 191299 191721 192797 194151 195167 195806 196523 197315
$$ packed form
56541A97720j735j844k282k192j730j788k361k481j855j240j038o93J34Q03O45
56526A78063r2o68o52r2N75P05R1n82o01l57p67j711k063j380m47K4K32M56M18
56507A71152n8n33n60j95L43R17J172P16j31n31k90n4j57j34K76M65j37j109j512
56488A69640q78M51J587J600L41j208j919j826j678j446m06J268K214J680N33
56473A69953j2J77M80N02K29r6O6J053K231K538J943J403J267Q33j20p10m26j
56455A81310r0k48j5R3l69p42l54K17J53j47J96R33J042M35PK11N05L25k31o92
56435A82539o76j07O10Q01L32j18P6O91J083J036P64M80L72N50P76O78M51O84
56417A91022J262J256L71m40l64O7k2n17p20m99j17M22J076J354J016O39P17P92
$$ plain form
56399 197315 197652 197489 197506 198067 198688 198911 198974 199216 199497 199663 200046 201008 202396 203767 204803 205236 204941 204359
56381 204359 204315 205066 205992 206577 207150 208253 209772 211229 212521 213844 215085 215828 215902 215589 215319 215289 215317 214979
56363 214979 214096 213121 212826 213520 214828 216252 217692 219376 221514 224033 226397 227835 228110 227994 228573 230138
56347 230138 232165 234143 235877 237144 237784 238184 239004 240339 241744 243101 244746 246682 248426 249881 251671
56332 251671 254295 257471 260588 263319 265614 267578 269530 271688 273693 275040 275977 277279 278986 280082
56318 280082 279738 278206 276272 274515 273394 273329 274264 275652 277128 278708 280181 281096 281604 282533 284235 286118
56302 286118 287761 289714 292612 296156 299612 302798 305946 309000 311604 313501 314533 314670 314427 314803 316417
56287 316417 319013 322084 325492 329238 333240 337677 342918 348676 353925 358246 362693 368645 376177 384180
$$ packed form
56399A97315L37j63J7N61O21K23O3K42K81J66L83R62J388J371J036M33k95n82
56381B04359m4P51R26N85N73J103J519J457J292J323J241P43P4l13k70l0K8l38
56363B14979q83r75k95O94J308J424J440J684K138K519K364J438K75j16N79J565
56347B30138K027J978J734J267O40M00Q20J335J405J357J645J936J744J455J790
56332B51671K624L176L117K731K295J964J952K158K005J347R37J302J707J096
56318B80082l44j532j934j757j121o5R35J388J476J580J473R15N08R29J702J883
56302B86118J643J953K898L544L456L186L148L054K604J897J032J37k43L76J614
56287C16417K596L071L408L746M002M437N241N758N249M321M447N952P532Q003
$$ plain form
56273 384180 391812 399225 407067 415747 425161 434915 444940 455853 468311 482033 496115 510410 525915
56260 525915 543636 563879 586942 613563 644136 678266 715714 757174 803589 855295 912363
56249 912363 975066 1043378 1116579 1193931 1275168 1359779 1446433 1533618 1620056 1703838 1781981
56238 1781981 1851703 1911538 1960415 1996535 2018396 2026382 2022003 2005738 1976766 1934879 1881675 1819780
56226 1819780 1751717 1679690 1605666 1531158 1457113 1384121 1312694 1243584 1177950 1116849 1060306
56215 1060306 1007339 957228 910256 866941 827175 790636 757382 727386 700050 674886 652222
56204 652222 632551 615590 600588 587140 575061 563963 553679 544692 537401 531342 525800 520746
56192 520746 516480 512787 509271 506139 503843 502267 500939 499716 498567 497140 495346 493929 493565 493793 493733
$$ packed form
56273C84180P632P413P842Q680R414R754J0025J0913J2458J3722J4082J4295J5505
56260E25915J7721K0243K3063K6621L0573L4130L7448M1460M6415N1706N7068
56249I12363O2703O8312P3201P7352Q1237Q4611Q6654Q7185Q6438Q3782P8143
56238A781981O9722N9835M8877L6120K1861P986m379j6265k8972m1887n3204o1895
56226A819780o8063p2027p4024p4508p4045p2992p1427o9110o5634o1101n6543
56215A060306n2967n0111m6972m3315l9766l6539l3254k9996k7336k5164k2664
56204F52222j9671j6961j5002j3448j2079j1098j0284q987p291o059n542n054
56192E20746m266l693l516l132k296j576j328j223j149j427j794j417l64K28o0
$$ plain form
56177 493733 493552 494254 496235 498948 501850 504837 507837 510805 514017 517745 521803 526014 530791 536527 542793
56162 542793 548934 555096 561840 569195 577018 585965 596954 609912 624120 639677 657533 678181 701503
56149 701503 727959 758814 795022 836931 885372 941995 1007960 1082852 1165119 1252783 1343194
56138 1343194 1432628 1516814 1592140 1656678 1710542 1755376 1793283 1826162 1855684 1882940 1907482
56127 1907482 1927241 1940148 1945681 1944627 1938084 1927290 1913474 1896612 1874600 1844578 1804805 1754609
56115 1754609 1693431 1621459 1541196 1457154 1373811 1294482 1221682 1157226 1101689 1054720 1016053
56104 1016053 985517 962120 944020 929631 918224 909543 903414 899641 897727 896967 897313 899674 904581
56091 904581 910971 917135 922481 927464 932307 936891 941659 947490 954623 962544 970815 979209 987273 994628
$$ packed form
56177D93733j81P02J981K713K902K987L000K968L212L728M058M211M777N736O266
56162E42793O141O162O744P355P823Q947J0989J2958J4208J5557J7856K0648K3322
56149G01503K6456L0855L6208M1909M8441N6623O5965P4892Q2267Q7664R0411
56138A343194Q9434Q4186P5326O4538N3864M4834L7907L2879K9522K7256K4542
56127A907482J9759J2907N533j054o543j0794j3816j6862k2012l0022l9773n0196
56115A754609o1178p1972q0263q4042q3343p9329p2800o4456n5537m6969l8667
56104A016053l0536k3397j8100j4389j1407q681o129l773j914p60L46K361M907
56091I04581O390O164N346M983M843M584M768N831P133P921Q271Q394Q064P355
$$ plain form
56077 994628 1001583 1008757 1016354 1024394 1033142 1042593 1052098 1061381 1071270 1082499 1094511 1106538 1119140
56064 1119140 1133417 1149310 1165990 1183352 1201756 1220757 1239527 1258206 1277566 1297707 1318227
56053 1318227 1339190 1360680 1381959 1402303 1422062 1441623 1460248 1477406 1494408 1512984 1533027
56042 1533027 1553440 1574407 1596892 1620715 1645194 1671033 1699417 1729863 1761186 1793986 1829896
56031 1829896 1868946 1910072 1953649 2000803 2050540 2100342 2149545 2199550 2250831 2302519 2354975
56020 2354975 2409875 2467481 2526444 2586558 2649077 2714099 2780444 2848421 2919996 2995812 3074722
56009 3074722 3156645 3243095 3334418 3429242 3527220 3629687 3737257 3849472 3967175 4092414
55999 4092414 4225631 4365730 4513175 4670099 4837229 5013808 5200779 5400764 5614780
$$ packed form
56077I94628O955P174P597Q040Q748R451R505R283R889J1229J2012J2027J2602
56064A119140J4277J5893J6680J7362J8404J9001J8770J8679J9360K0141K0520
56053A318227K0963K1490K1279K0344J9759J9561J8625J7158J7002J8576K0043
56042A533027K0413K0967K2485K3823K4479K5839K8384L0446L1323L2800L5910
56031A829896L9050M1126M3577M7154M9737M9802M9203N0005N1281N1688N2456
56020B354975N4900N7606N8963O0114O2519O5022O6345O7977P1575P5816P8910
56009C074722Q1923Q6450R1323R4824R7978J02467J07570J12215J17703J25239
55999D092414J33217J40099J47445J56924J67130J76579J86971J99985K14016
$$ plain form
55990 5614780 5842357 6085023 6345964 6626124 6924587 7243045 7585903 7955843 8353687
55981 8353687 8782837 9249111 9755848 10304307 10899657 11551547 12268364 13056584 13926586
55972 13926586 14893379 15971032 17173059 18519825 20039778 21763499 23724994 25971773
55964 25971773 28568389 31592093 35136222 39320627 44289778 50199635 57217671 65538625
55956 65538625 75390562 87025951 100718970 116765561 135457998 157037391 181633575
55949 181633575 209116289 238766661 268902933 296843733 319452086 334009209 338883640
55942 338883640 333725250 319345644 297512004 270646295 241354210 211914120 183974373
55935 183974373 158535376 136077400 116694951 100218955 86340634 74707556 64969506
$$ packed form
55990E614780K27577K42666K60941K80160K98463L18458L42858L69940L97844
55981H353687M29150M66274N06737N48459N95350O51890P16817P88220Q70002
55972A3926586R66793J077653J202027J346766J519953J723721J961495K246779
55964B5971773K596616L023704L544129M184405M969151N909857P018036Q320954
55956F5538625R851937J1635389J3693019J6046591J8692437K1579393K4596184
55949A81633575K7482714K9650372L0136272K7940800K2608353J4557123M874431
55942C38883640n158390j4379606k1833640k6865709k9292085k9440090k7939747
55935A83974373k5438997k2457976j9382449j6475996j3878321j1633078r738050
$$ plain form
55928 64969506 56799868 49916867 44092638 39141296 34906675 31263626 28117741 25393047
55920 25393047 23022292 20949795 19133868 17539675 16133878 14888598 13783805 12801453
55912 12801453 11921943 11129168 10413763 9768044 9182068 8647182 8158732 7712360 7301537
55903 7301537 6921077 6569023 6242853 5937857 5651428 5384884 5138614 4909162 4693327
55894 4693327 4491393 4303871 4128687 3964201 3811746 3672381 3543828 3422883 3308152
55885 3308152 3198163 3089735 2980823 2872804 2767813 2666070 2567766 2474962 2389178 2309139
55875 2309139 2233102 2161410 2094624 2031061 1968511 1906896 1847269 1789769 1734419 1682401 1634532
55864 1634532 1589782 1547075 1507174 1471040 1437583 1404941 1372914 1342474 1313795 1286240 1259429
$$ packed form
55928F4969506q169638o883001n824229m951342m234621l643049l145885k724694
55920B5393047k370755k072497j815927j594193j405797j245280j104793r82352
55912A2801453q79510p92775p15405o45719n85976n34886m88450m46372m10823
55903G301537l80460l52054l26170l04996k86429k66544k46270k29452k15835
55894D693327k01934j87522j75184j64486j52455j39365j28553j20945j14731
55885C308152j09989j08428j08912j08019j04991j01743r8304r2804q5784q0039
55875B309139p6037p1692o6786o3563o2550o1615n9627n7500n5350n2018m7869
55864A634532m4750m2707l9901l6134l3457l2642l2027l0440k8679k7555k6811
$$ plain form
55853 1259429 1232982 1206150 1178888 1152260 1126685 1100871 1073661 1045729 1018285 991333 964566
55842 964566 938810 915091 893132 872135 852225 833833 816492 799521 783292 768643 755622
55831 755622 743712 732722 722601 713116 704449 697201 690981 683902 674441 663018 650940 638672 626000
55818 626000 612986 599813 586482 573441 561661 551315 541401 531502 522816 516433 511632 507044 502557
55805 502557 498873 496039 493683 492004 491286 490969 490374 489914 490483 492047 493814 495440 497170 499156 501415
55790 501415 504137 507417 511150 515689 521886 529678 537308 542584 544257 541613 533855 521078 505132 488385
55776 488385 472052 456550 442763 431872 424482 420784 420899 423888 427026 427391 424004 417569 408708 397671
55762 397671 385444 373767 363861 355918 349691 344797 340625 336783 333528 331048 328546 324805 319471 313106
$$ packed form
55853A259429k6447k6832k7262k6628k5575k5814k7210k7932k7444k6952k6767
55842I64566k5756k3719k1959k0997j9910j8392j7341j6971j6229j4649j3021
55831G55622j1910j0990j0121r485q667p248o220p079r461j1423j2078j2268j2672
55818F26000j3014j3173j3331j3041j1780j0346r914r899q686o383m801m588m487
55805E02557l684k834k356j679p18l17n95m60N69J564J767J626J730J986K259
55790E01415K722L280L733M539O197P792P630N276J673k644p758j2777j5946j6747
55776D88385j6333j5502j3787j0891p390l698J15K989L138L65l387o435q861j1037
55762C97671j2227j1677r906p943o227m894m172l842l255k480k502l741n334o365
$$ plain form
55748 313106 306231 299060 291843 284738 277579 270461 264187 259326 255216 250745 245900 241610 238296 235506
55734 235506 232863 230457 228297 226198 224239 222650 221235 219536 217488 215289 212765 209552 205863 202399
55720 202399 199515 197049 194847 192885 191012 189202 187939 187711 188231 188786 189237 190015 191216 192408 193323 194065
55704 194065 194629 194822 194679 194370 193701 192280 190189 187856 185230 181762 177364 172869 169271 166885 165454
55689 165454 164679 164440 164688 165337 166240 167293 168548 169960 171080 171402 171186 171364 172273 173041 172755 171698 170752
55672 170752 170031 168951 167412 166055 165326 165097 165283 166157 167830 169858 171541 172408 172446 172154 172216 172824 173484
55655 173484 173819 174198 175096 176166 176614 176312 175836 175488 174990 174193 173457 173140 173169 173311 173468 173586 173505 172996 171791
55636 171791 169662 166668 163166 159349 155020 150082 145001 140438 136683 133768 131742 130434 129261 127774
$$ packed form
55748C13106o875p171p217p105p159p118o274m861m110m471m845m290l314k790
55734B35506k643k406k160k099j959j589j415j699k048k199k524l213l689l464
55720B02399k884k466k202j962j873j810j263k28N20N55M51P78J201J192R15P42
55704A94065N64J93j43l09o69j421k091k333k626l468m398m495l598k386j431
55689A65454p75k39K48O49R03J053J255J412J120L22k16J78R09P68k86j057r46
55672A70752p21j080j539j357p29k29J86Q74J673K028J683Q67L8k92O2O08O60
55655A73484L35L79Q98J070M48l02m76l48m98p97p36l17K9J42J57J18q1n09j205
55636A71791k129k994l502l817m329m938n081m563l755k915k026j308j173j487
$$ plain form
55622 127774 126176 124883 123914 123134 122703 122673 122506 121612 120141 118665 117403 116344 115681 115395 114752 113103 110889
55605 110889 108979 107281 104965 101975 99280 97600 96840 96775 97284 97659 96775 94458 91921 90410 89996 90015
55589 90015 90044 90054 90156 90661 91968 94014 96122 97622 98403 98840 99501 100931 103214 105700 107660 109231 111245
55572 111245 114114 117517 121184 125209 129371 132822 134859 135524 135185 134019 132176 129977 127632 125087 122358
55557 122358 119622 116849 113765 110439 107488 105446 104213 103246 102028 100349 98527 97336 97247 97699 97645 96790
55541 96790 95707 94794 93855 92895 92468 92922 93917 95070 96477 98211 99945 101481 103134 105100 106904 107942
55525 107942 108201 108055 107647 106878 105696 104070 101967 99596 97369 95420 93531 91674 90174 89093 88004
55510 88004 86660 85372 84424 83642 82891 82424 82301 81997 81111 79992 79181 78661 78170 77772 77564 77222 76477 75680
$$ packed form
55622A27774j598j293r69p80m31l0j67q94j471j476j262j059o63k86o43j649k214
55605A10889j910j698k316k990k695j680p60o5N09L75q84k317k537j511m14J9
55589I0015K9J0J02N05J307K046K108J500P81M37O61J430K283K486J960J571K014
55572A11245K869L403L667M025M162L451K037O65l39j166j843k199k345k545k729
55557A22358k736k773l084l326k951k042j233r67j218j679j822j191q9M52n4q55
55541I6790j083r13r39r60m27M54R95J153J407J734J734J536J653J966J804J038
55525A07942K59j46m08p69j182j626k103k371k227j949j889j857j500j081j089
55510H8004j344j288r48p82p51m67j23l04q86j119q11n20m91l98k08l42p45p97
$$ plain form
55492 75680 75305 75181 74857 74442 74417 74791 75141 75335 75571 75770 75557 74864 73988 73064 72004 71032 70718 71347 72635
55473 72635 74158 75640 76757 77086 76482 75250 73836 72551 71585 71011 70639 70122 69333 68497 67859 67390 66889
55456 66889 66303 65899 66100 67079 68487 69706 70434 70829 71013 70741 69793 68463 67354 66794 66637 66550 66258 65653
55438 65653 64869 64224 63941 64065 64672 65867 67410 68673 69222 69196 68863 68191 67185 66281 65858 65623 65078 64497
55420 64497 64759 66181 68030 69404 70084 70339 70290 69833 68978 67987 67207 66843 66796 66686 66200 65450 64844 64569 64394
55401 64394 64022 63419 62712 62021 61578 61773 62743 63976 64644 64490 64161 64463 65406 66266 66517 66325 66045 65635 64932
55382 64932 64168 63763 63811 64235 65261 67082 69049 69992 69573 68719 68351 68251 67633 66327 64823 63539 62649
55365 62649 62393 62887 63712 64287 64616 65182 66104 66908 67218 67215 67246 67327 67242 66877 66278 65530 64729 64018 63592 63639 64167
$$ packed form
55492G5680l75j24l24m15k5L74L50J94K36J99k13o93q76r24j060r72l14O29J288
55473G2635J523J482J117L29o04j232j414j285r66n74l72n17p89q36o38m69n01
55456F6889n86m04K01R79J408J219P28L95J84k72r48j330j109n60j57q7k92o05
55438F5653p84o45k83J24O07J195J543J263N49k6l33o72j006r04m23k35n45n81
55420F4497K62J422J849J374O80K55m9m57q55r91p80l64m7j10m86p50o06k75j75
55401F4394l72o03p07o91m43J95R70J233O68j54l29L02R43Q60K51j92k80m10p03
55382F4932p64m05M8M24J026J821J967R43m19q54l68j00o18j306j504j284q90
55365F2649k56M94Q25N75L29N66R22Q04L10lL1Q1q5l65n99p48q01p11m26M7N28
$$ plain form
55344 64167 64824 65105 64848 64374 63942 63340 62302 61133 60497 60650 61211 61649 61693 61306 60635 60053 59966 60423 61058
55325 61058 61471 61540 61402 61251 61110 60764 60013 59106 58645 58900 59475 59882 60157 60608 61235 61835 62415 62976 63060 62133
55305 62133 60394 58693 57595 57010 56726 56737 56907 56895 56708 56899 57908 59474 60953 61987 62645 63103 63480
55288 63480 63853 64293 64884 65695 66582 67108 66961 66425 66114 66207 66290 66057 65754 65771 66065 66239 65975 65248 64315 63639
55268 63639 63591 64097 64735 65221 65621 66048 66483 66968 67646 68488 69223 69681 69905 69894 69584 69196 69146 69418 69467 69020
55248 69020 68547 68572 68958 69377 70056 71351 72782 73268 72431 71094 70218 69822 69247 68194 67138 66770 67260 68102
55230 68102 68582 68405 67849 67353 67061 66821 66529 66257 66095 66087 66337 66955 67809 68486 68638 68338 67953 67704 67461 67012
55210 67012 66425 65954 65573 64874 63638 62305 61564 61485 61489 61267 61287 62129 63587 64796 65108 64519 63365 62018
$$ packed form
55344F4167O57K81k57m74m32o02j038j169o36J53N61M38M4l87o71n82q7M57O35
55325F1058M13O9j38j51j41l46p51r07m61K55N75M07K75M51O27O00N80N61Q4r27
55305F2133j739j701j098n85k84J1J70j2j87J91J009J566J479J034O58M58L77
55288F3480L73M40N91Q11Q87N26j47n36l11R3Q3k33l03J7K94J74k64p27r33o76
55268F3639m8N06O38M86M00M27M35M85O78Q42P35M58K24j1l10l88n0K72M9m47
55248F9020m73K5L86M19O79J295J431M86q37j337q76l96n75j053j056l68M90Q42
55230F8102M80j77n56m96k92k40k92k72j62qK50O18Q54O77J52l00l85k49k43m49
55210F7012n87m71l81o99j236j333p41p9Mk22K0Q42J458J209L12n89j154j347
$$ plain form
55192 62018 60891 60383 60612 61272 61838 61933 61639 61542 62231 63541 64534 64579 64254 64691 66083 67377 67576 66809 65854
55173 65854 65065 64260 63404 62876 63029 63816 64847 65640 65849 65492 64964 64652 64540 64318 63821 63216 62860 63147 64312
55154 64312 66121 67854 68945 69597 70363 71179 71343 70586 69593 69127 69125 69116 69145 69604 70317 70479 69666 68369 67337
55135 67337 66784 66489 66326 66367 66701 67374 68392 69530 70292 70297 69626 68664 67745 67104 66974 67446 68293 69168 69932
55116 69932 70588 70977 70884 70411 69958 69701 69405 68925 68627 68986 69904 70857 71684 72805 74369 75597 75540 74465
55098 74465 73851 74736 76526 77878 78404 78890 79926 81082 81585 81262 80461 79485 78553 77981 77925 78090 78100 78078 78465
55079 78465 79310 80160 80689 81112 81816 82794 83533 83362 81946 79660 77530 76548 76919 77963 78772 78927 78640 78331
55061 78331 78126 77754 77000 76128 75564 75178 74333 72938 71978 72448 74011 75255 75208 74030 72376 70777 69806
$$ packed form
55192F2018j127n08K29O60N66R5k94r7O89J310R93M5l25M37J392J294J99p67r55
55173F5854p89q05q56n28J53P87J031P93K09l57n28l12j12k22m97o05l56K87J165
55154F4312J809J733J091O52P66Q16J64p57r93m66krK9M59P13J62q13j297j032
55135F7337n53k95j63M1L34O73J018J138P62No71r62r19o41j30M72Q47Q75P64
55116F9932O56L89r3m73m53k57k96m80k98L59R18R53Q27J121J564J228n7j075
55098G4465o14Q85J790J352N26M86J036J156N03l23q01r76r32n72n6J65J0k2L87
55079G8465Q45Q50N29M23P04R78P39j71j416k286k130r82L71J044Q09J55k87l09
55061G8331k05l72p54q72n64l86q45j395r60M70J563J244m7j178j654j599r71
$$ plain form
55044 69806 70099 71706 73786 75375 76204 76550 76644 76607 76690 77097 77682 78176 78610 79157 79621 79484 78551 77301 76472
55025 76472 76447 77021 77606 77650 77088 76448 76331 76691 76768 75858 74064 72216 71114 70969 71461 72139 72657 72806 72535
55006 72535 72033 71662 71710 72180 72832 73381 73692 73891 74277 75007 75885 76632 77426 78838 81018 83223 84464 84548
54988 84548 84118 83796 83707 83795 84132 84633 84859 84440 83581 82979 83256 84565 86555 88597 90130 90931 91105 90871
54970 90871 90505 90339 90500 90642 90244 89319 88572 88653 89465 90297 90506 89930 88866 87823 87210 87075 87230 87541 87972
54951 87972 88369 88526 88528 88638 88755 88373 87340 86261 85825 86032 86415 86703 86847 86711 86256 85892 86106 86741 87116
54932 87116 86919 86551 86542 87000 87759 88634 89349 89525 89092 88550 88592 89508 91053 92850 94880 97573 101402 106244
54914 106244 111307 115861 119963 124181 128671 132785 135647 136779 136154 133960 130509 126148 121142 115811
$$ packed form
55044F9806K93J607K080J589Q29L46R4l7Q3M07N85M94M34N47M64j37r33j250q29
55025G6472k5N74N85M4n62o40j17L60P7r10j794j848j102j45M92O78N18J49k71
55006G2535n02l71M8M70O52N49L11J99L86P30Q78P47P94J412K180K205J241Q4
54988H4548m30l22q9Q8L37N01K26m19q59o02K77J309J990K042J533Q01J74k34
54970I0871l66j66J61J42l98r25p47Q1Q12Q32K09n76j064j043o13j35J55L11M31
54951H7972L97J57KJ10J17l82j033j079m36K07L83K88J44j36m55l64K14O35L75
54932H7116j97l68rM58P59Q75P15J76m33n42M2R16J545J797K030K693L829M842
54914A06244N063M554M102M218M490M114K862J132o25k194l451m361n006n331
$$ plain form
54900 115811 110745 106546 103239 100331 97662 95774 95119 95277 95397 95188 94960 94811 94397 93564 92697 92173 91886
54883 91886 91610 91550 92158 93538 95343 97214 99090 101113 103482 106431 110091 114255 118417 122187 125614
54868 125614 128996 132441 135684 138258 139695 139602 137750 134272 129731 124874 120195 115735 111335 107039 103211
54853 103211 100207 98013 96248 94505 92633 90725 88971 87553 86514 85561 84159 82073 79854 78524
54839 78524 78591 79480 80124 80064 79779 79975 80813 81873 82665 82974 82885 82719 82910 83630 84530 85041 84981 84650 84278 83709
54819 83709 82844 82054 81789 81986 82285 82702 83597 84928 86054 86493 86436 86235 85808 84963 84046 83753 84339 85365
54801 85365 86227 86658 86744 86690 86612 86425 86044 85796 86347 87876 89561 90380 90327 90326 90885 91375 90857 89252 87429 86431
54781 86431 86785 88252 89985 91120 91480 91610 92077 92917 93846 94720 95592 96561 97773 99403 101444 103672 105981
$$ packed form
54900A15811n066m199l307k908k669j888o55J58J20k09k28j49m14q33q67n24k87
54883I1886k76o0O08J380J805J871J876K023K369K949L660M164M162L770L427
54868A25614L382L445L243K574J437r3j852l478m541m857m679m460m400m296l828
54853A03211l004k194j765j743j872j908j754j418j039r53j402k086k219j330
54839G8524O7Q89O44o0k85J96Q38J060P92L09q9j66J91P20R00N11o0l31l72n69
54819H3709q65p90k65J97K99M17Q95J331J126M39n7k01m27q45r17k93N86J026
54801H5365Q62M31Q6n4p8j87l81k48N51J529J685Q19n3jN59M90n18j605j823r98
54781H6431L54J467J733J135L60J30M67Q40R29Q74Q72R69J212J630K041K228K309
$$ plain form
54764 105981 108554 111560 114906 118448 122224 126240 130226 133874 137139 140026 142191 143061 142340 140224 137200
54749 137200 133812 130478 127302 124056 120561 117017 113866 111392 109608 108361 107329 106039 104208 102066
54735 102066 100159 98826 98025 97623 97656 98208 99098 99797 99812 99267 98981 99695 101234 102822 104254 106246 109381
54718 109381 113189 116735 119770 122789 126187 129900 133690 137205 139750 140592 139677 137609 134891 131573 127774
54703 127774 124051 120956 118464 116066 113305 110137 106979 104422 102662 101205 99420 97364 95699 94745
54689 94745 94068 93178 92157 91289 90453 89357 88149 87344 87127 87062 86555 85389 83842 82484 81910 82428 83858
54672 83858 85633 87150 88071 88329 87957 86951 85362 83486 81862 80926 80743 81160 82121 83582 85216 86488
54656 86488 87141 87358 87425 87454 87588 88135 89210 90395 91025 90836 90235 89919 90302 91211 92103 92620 92906 93239 93390
$$ packed form
54764A05981K573L006L346L542L776M016L986L648L265K887K165Q70p21k116l024
54749A37200l388l334l176l246l495l544l151k474j784j247j032j290j831k142
54735A02066j907j333q01m02L3N52Q90O99J5n45k86P14J539J588J432J992L135
54718A09381L808L546L035L019L398L713L790L515K545Q42r15k068k718l318l799
54703A27774l723l095k492k398k761l168l158k557j760j457j785k056j665r54
54689I4745o77q90j021q68q36j096j208q05k17o5n07j166j547j358n74N18J430
54672H3858J775J517R21K58l72j006j589j876j624r36j83M17R61J461J634J272
54656H6488O53K17O7K9J34N47J075J185O30j89o01l16L83R09Q92N17K86L33J51
$$ plain form
54637 93390 92745 91211 89675 89223 90103 91710 93376 94727 95389 94950 93417 91375 89430 87761 86385 85543
54621 85543 85429 85739 85911 85829 85880 86246 86510 86248 85696 85540 86159 87384 88904 90578 92337 94056 95579 96672
54603 96672 96967 96250 94847 93413 92229 91029 89685 88678 88555 89189 89907 90225 90141 89876 89617 89421 89061
54586 89061 88135 86649 85334 85031 85792 86981 88109 89113 89901 90254 90322 90687 91651 92808 93605 93992 94292
54569 94292 94717 95300 95976 96442 96191 95063 93669 92906 93078 93692 94072 93925 93366 92676 92125 91887 91961 92210 92482
54550 92482 92788 93339 94327 95583 96562 96827 96534 96292 96632 97726 99467 101495 103222 104205 104543 104674 104857
54533 104857 105158 105806 106965 108157 108540 108054 107666 108075 108690 108420 107064 105409 104151 103314 102604 101790 100754
54516 100754 99577 98595 98059 97778 97340 96590 95605 94411 93142 92306 92383 93171 93960 94377 94669 95160 95889 96838
$$ packed form
54637I3390o45j534j536m52Q80J607J666J351O62m39j533k042j945j669j376q42
54621H5543j14L10J72q2N1L66K64k62n52j56O19J225J520J674J759J719J523J093
54603I6672K95p17j403j434j184j200j344j007j23O34P18L18q4k65k59j96l60
54586H9061r26j486j315l03P61J189J128J004P88L53O8L65R64J157P97L87L00
54569I4292M25N83O76M66k51j128j394p63J72O14L80j47n59o90n51k38P4K49K72
54550I2482L06N51R88J256R79K65k93k42L40J094J741K028J727R83L38J31J83
54533A04857L01O48J159J192L83m86l88M09O15k70j356j655j258q37p10q14j036
54516A00754j177r82n36k81m38p50r85j194j269q36P7P88P89M17K92M91P29R49
$$ plain form
54498 96838 98041 99312 100242 100670 100844 100978 100960 100670 100269 99986 99889 100024 100449 100966 101097 100641 100013 99784 100101
54479 100101 100802 101847 103265 104796 105990 106668 107026 107303 107616 108081 108797 109615 110196 110448 110735 111519 112890
54462 112890 114521 115932 116741 116765 116099 115062 113966 112950 112047 111313 110716 109991 108904 107674 106933 107093 107889
54445 107889 108805 109810 111317 113362 115165 115740 114823 112980 110935 109075 107629 106970 107387 108594 109703
54430 109703 109936 109353 108735 108683 108968 108892 108225 107533 107560 108506 110009 111641 113132 114212 114555 114109 113360 113039
54412 113039 113432 114038 114080 113337 112302 111473 110793 110025 109416 109529 110424 111469 112057 112135 111862 111212 110246 109467 109471
54393 109471 110340 111692 113197 114727 116091 117015 117401 117430 117359 117366 117512 117688 117712 117622 117705 118028 118171 117755 117059 116688
54373 116688 116746 116764 116426 115924 115576 115475 115643 116135 116863 117613 118315 119015 119573 119792 119877 120314 121125 121755 121939 122215
$$ packed form
54498I6838J203J271R30M28J74J34j8k90m01k83r7J35M25N17J31m56o28k29L17
54479A00101P01J045J418J531J194O78L58K77L13M65P16Q18N81K52K87P84J371
54462A12890J631J411Q09K4o66j037j096j016r03p34n97p25j087j230p41J60P96
54445A07889R16J005J507K045J803N75r17j843k045j860j446o59M17J207J109
54430A09703K33n83o18n2K85p6o67o92K7R46J503J632J491J080L43m46p49l21
54412A13039L93O06M2p43j035q29o80p68o09J13Q95J045N88P8k73o50r66p79M
54393A09471Q69J352J505J530J364R24L86K9p1PJ46J76K4r0Q3L23J43m16o96l71
54373A16688N8J8l38n02l48j01J68M92P28P50P02P00N58K19Q5M37Q11O30J84K76
$$ plain form
54353 122215 123197 124700 125976 126533 126285 125180 123232 120865 118805 117577 117335 117979 119138 120229 121007 122027
54337 122027 124139 127493 131361 134819 137171 137852 136683 134453 132600 131851 131551 130729 129367 128147 127292
54322 127292 126358 125005 123288 121185 118564 115839 114003 113543 113747 113548 112774 112092 111958 112161 112295 112169 111699
54305 111699 110926 110220 110051 110366 110569 110272 109686 109062 108291 107390 106958 107543 108786 109782 110200 110470 110869 111048
54287 111048 110717 110300 110488 111380 112376 112769 112274 111188 110285 110365 111571 113146 114093 114112 113774 113814 114421 115265 116000
54268 116000 116563 116991 117172 116906 116252 115608 115370 115605 116173 117036 118242 119667 121027 122145 122978 123439 123512 123536
54250 123536 123991 124752 124981 124109 122680 121790 121719 121612 120609 118936 117597 117150 117173 116945 116366 115973 116151 116653
54232 116653 117012 117133 117216 117209 116753 115719 114485 113499 112858 112502 112560 113143 113897 114179 113796 113325 113532 114564 115737
$$ packed form
54353A22215R82J503J276N57k48j105j948k367k060j228k42O44J159J091P78J020
54337A22027K112L354L868L458K352O81j169k230j853p49l00q22j362j220q55
54322A27292r34j353j717k103k621k725j836m60K04j99p74o82j34K03J34j26m70
54305A11699p73p06j69L15K03k97n86o24p71r01m32N85J243R96M18K70L99J79
54287A11048l31m17J88Q92R96L93m95j086r03Q0J206J575R47J9l38M0O07Q44P35
54268A16000N63M28J81k66o54o44k38K35N68Q63J206J425J360J118Q33M61P3K4
54250A23536M55P61K29q72j429q90p1j07j003j673j339m47K3k28n79l93J78N02
54232A16653L59J21Q3pm56j034j234r86o41l56N8N83P54K82l83m71K07J032J173
$$ plain form
54213 115737 116061 114971 112756 110423 109055 109071 110007 111030 111683 112178 112999 114321 115837 117098 117861 118144
54197 118144 118059 117700 117134 116444 115858 115799 116636 118160 119473 119594 118236 115955 113739 112502 112662 113771 114738
54180 114738 114828 114358 114048 113898 113386 112693 112846 114287 116058 116962 116927 116620 116279 115735 115152 114801 114255 112803
54162 112803 110747 109357 109259 109671 109599 109092 108838 109124 109779 110583 111121 110656 108886 106703 105499 105772 106917
54145 106917 108248 109588 110845 111722 112133 112443 113006 113782 114558 115170 115332 114744 113692 113120 113647 114757 115414
54128 115414 115280 114870 114663 114591 114401 114017 113465 112848 112512 112808 113525 114004 113971 113951 114559 115773 117170 118515 119650
54109 119650 120159 119753 118891 118437 118686 119153 119403 119573 119966 120622 121530 122787 124194 125022 124623 123144 121339
54092 121339 119793 118625 117790 117319 117285 117742 118647 119667 120207 119952 119361 119263 119910 120658 120662 119719 118406 117601 117867
$$ packed form
54213A15737L24j090k215k333j368J6R36J023O53M95Q21J322J516J261P63K83
54197A18144q5l59n66o90n86n9Q37J524J313J21j358k281k216j237J60J109R67
54180A14738R0m70l10j50n12o93J53J441J771R04l5l07l41n44n83l51n46j452
54162A12803k056j390r8M12p2n07k54K86O55Q04N38m65j770k183j204K73J145
54145A06917J331J340J257Q77M11L10N63P76P76O12J62n88j052n72N27J110O57
54128A15414j34m10k07p2j90l84n52o17l36K96P17M79l3k0O08J214J397J345J135
54109A19650N09m06q62m54K49M67K50J70L93O56R08J257J407Q28l99j479j805
54092A21339j546j168q35m71l4M57R05J020N40k55n91r8O47P48Mr43j313q05K66
$$ plain form
54073 117867 119078 120509 121423 121641 121505 121386 121408 121591 121938 122302 122448 122451 122813 124013 125987 128186 130002 131075
54055 131075 131405 131394 131661 132551 133807 134868 135478 135881 136458 137392 138733 140583 143017 145889 148882 151795
54039 151795 154692 157757 161093 164780 169032 174066 179775 185691 191442 197110 202939 208823 214391 219616
54025 219616 224973 230813 236825 242336 246898 250305 252194 252085 249844 245785 240260 233481 225827 217922
54011 217922 210174 202538 195031 188193 182612 178160 174194 170448 167217 164615 162194 159537 156734 153989
53997 153989 151217 148473 146376 145476 145413 145340 145060 145020 145172 144710 143249 141574 140643 140376 140029 139378 138791 138345
53979 138345 137652 136657 135947 136019 136651 137238 137444 137366 137375 137941 139314 141184 142843 143849 144263 144191 143532 142438 141631
53960 141631 141749 142554 143266 143667 144387 146007 148257 150338 151793 152783 153611 154305 154739 154986 155361 156136 157350
$$ packed form
54073A17867J211J431R14K18j36j19K2J83L47L64J46LL62J200J974K199J816J073
54055A31075L30j1K67Q90J256J061O10M03N77R34J341J850K434K872K993K913
54039A51795K897L065L336L687M252N034N709N916N751N668N829N884N568N225
54025B19616N357N840O012N511M562L407J889j09k241m059n525o779p654p905
54011B17922p748p636p507o838n581m452l966l746l231k602k421k657k803k745
53997A53989k772k744k097r00o3p3k80m0J52m62j461j675r31k67l47o51n87m46
53979A38345o93r95p10P2O32N87K06p8RN66J373J870J659J006M14p2o59j094q07
53960A41631J18Q05P12M01P20J620K250K081J455R90Q28O94M34K47L75P75J214
$$ plain form
53943 157350 158945 160975 163518 166453 169538 172739 176255 180169 184254 188271 192246 196294 200257 203722
53929 203722 206315 207898 208630 209060 209958 211671 213674 215108 215835 216611 218150 220410 223051 226242 230529
53914 230529 235898 241418 245975 249217 251638 253824 255775 257022 257340 257128 256962 256818 256048 254244 251883
53899 251883 249894 248669 247710 246201 243711 240376 236671 233088 229840 226785 223677 220465 217243 214051
53885 214051 210970 208314 206336 204728 202913 201007 200001 200610 202359 204368 206736 210467 216102 223145
53871 223145 231038 240003 250390 261518 271625 278889 282272 281592 277208 269671 259512 247359 234219
53858 234219 221381 209741 199412 190196 182237 175852 170842 166497 162348 158619 155776 153892 152578
53845 152578 151388 150204 149357 149391 150485 152045 153047 152915 151954 150885 150160 149740 149303 148563 147561 146737 146514
$$ packed form
53943A57350J595K030K543K935L085L201L516L914M085M017L975M048L963L465
53929B03722K593J583P32M30Q98J713K003J434P27P76J539K260K641L191M287
53914B30529N369N520M557L242K421K186J951J247L18k12j66j44p70j804k361
53899B51883j989j225r59j509k490l335l705l583l248l055l108l212l222l192
53885B14051l081k656j978j608j815j906j006O09J749K009K368L731N635P043
53871B23145P893Q965J0387J1128J0107P264L383o80m384p537j0159j2153j3140
53858B34219j2838j1640j0329r216p959o385n010m345m149l729k843j884j314
53845A52578j190j184q47L4J094J560J002j32r61j069p25m20m37p40j002q24k23
$$ plain form
53828 146514 146697 146584 145809 144846 144447 144835 145725 146875 148184 149398 150247 150927 152019 153686 155348 156393
53812 156393 157042 158171 160314 163061 165499 167185 168636 170873 174426 178846 183281 187386 191401 195365
53798 195365 198758 201151 202828 204337 205645 206253 206124 205941 206311 207120 207880 208393 208727 208868 208759 208527 208308
53781 208308 207879 206776 204748 201875 198393 194760 191703 189647 188064 185941 183075 180342 178364 176534
53767 176534 173946 170877 168555 167523 167019 166051 164436 162497 160371 158115 156129 154933 154583 154674 154768 154564
53751 154564 153821 152565 151347 150869 151241 151874 152176 152082 151869 151777 151985 152642 153630 154478 154787 154676 154570 154616 154580
53732 154580 154257 153741 153241 152934 153064 153898 155348 156836 157836 158504 159547 161475 164182 167220 170231 173022
53716 173022 175497 177707 179848 182041 184214 186319 188469 190662 192550 193822 194750 196007 197926 200319
$$ packed form
53828A46514J83j13p75r63l99L88Q90J150J309J214Q49O80J092J667J662J045
53812A56393O49J129K143K747K438J686J451K237L553M420M435M105M015L964
53798A95365L393K393J677J509J308O08j29j83L70Q09P60N13L34J41j09k32k19
53781B08308m29j103k028k873l482l633l057k056j583k123k866k733j978j830
53767A76534k588l069k322j032n04r68j615j939k126k256j986j196l50R1R4k04
53751A54564p43j256j218m78L72O33L02r4k13r2K08O57R88Q48L09j11j06M6l6
53732A54580l23n16n00l07J30Q34J450J488J000O68J043J928K707L038L011K791
53716A73022K475K210K141K193K173K105K150K193J888J272R28J257J919K393
$$ plain form
53702 200319 203080 206521 210817 215462 219703 223340 226698 229890 232538 234220 234839 234538 233654 232879 232939 233772
53686 233772 234388 233970 232870 232118 232102 232255 231996 231420 230909 230581 230384 230361 230436 230213 229360 228075 226825 225743
53668 225743 224627 223481 222628 222245 222124 221970 221635 220995 219963 218805 218116 218171 218533 218559 218104 217438 216681 215752
53650 215752 214829 214378 214632 215369 216359 217708 219583 221835 224147 226379 228521 230448 232001 233262 234409
53635 234409 235346 235779 235772 235890 236565 237589 238528 239486 241062 243574 246635 249608 252164 254306 256189 258178
53619 258178 260762 263994 267177 269599 271571 274275 278395 283298 287811 291536 295059 299011 303269 307087
53605 307087 309789 311318 312251 313346 315012 317162 319479 321603 323065 323451 322909 322291 322388 323117 323812 324182
53589 324182 324514 324862 324635 323364 321528 320125 319544 319308 319014 319051 320127 322290 324773 326776 328048 328643
$$ packed form
53702B00319K761L441M296M645M241L637L358L192K648J682O19l01q84p75O0Q33
53686B33772O16m18j100p52j6J53k59n76n11l28j97k3P5k23q53j285j250j082
53668B25743j116j146q53l83j21j54l35o40j032j158o89N5L62K6m55o66p57r29
53650B15752r23m51K54P37R90J349J875K252K312K232K142J927J553J261J147
53635B34409R37M33pJ18O75J024R39R58J576K512L061K973K556K142J883J989
53619B58178K584L232L183K422J972K704M120M903M513L725L523L952M258L818
53605C07087K702J529R33J095J666K150K317K124J462L86n42o18R7P29O95L70
53589C24182L32L48k27j271j836j403n81k36k94L7J076K163K483K003J272N95
$$ plain form
53573 328643 328482 327476 325874 324023 321769 318568 314383 310072 306593 304135 302391 301331 301107 301277 300868
53558 300868 299490 297930 297282 297764 298718 299547 300266 301247 302764 304848 307305 309814 312128 314261 316364 318491
53542 318491 320662 323113 326244 330200 334689 339413 344544 350560 357611 365322 373295 381547 390266 399394
53528 399394 408830 418931 430369 443328 457248 471496 485979 500837 515975 531287 547100 563884
53516 563884 581707 600460 620390 641800 664254 686814 709232 732256 756481 781459 806324
53505 806324 830755 854827 878376 901105 923125 944824 966337 987603 1008768 1030012 1051019
53494 1051019 1071113 1089978 1107895 1125272 1142322 1159163 1175806 1192023 1207681 1223314 1239892
53483 1239892 1257753 1276114 1293823 1310287 1325435 1339114 1350873 1360185 1366621 1370010 1370672 1369347
$$ packed form
53573C28643j61j006j602j851k254l201m185m311l479k458j744j060k24J70m09
53558C00868j378j560o48M82R54Q29P19R81J517K084K457K509K314K133K103K127
53542C18491K171K451L131L956M489M724N131O016P051P711P973Q252Q719R128
53528C99394R436J0101J1438J2959J3920J4248J4483J4858J5138J5312J5813J6784
53516E63884J7823J8753J9930K1410K2454K2560K2418K3024K4225K4978K4865
53505H06324K4431K4072K3549K2729K2020K1699K1513K1266K1165K1244K1007
53494A051019K0094J8865J7917J7377J7050J6841J6643J6217J5658J5633J6578
53483A239892J7861J8361J7709J6464J5148J3679J1759R312O436L389O62j325
$$ plain form
53471 1369347 1366563 1362179 1355776 1347379 1337425 1326113 1313239 1298794 1283373 1267768 1252330 1236883
53459 1236883 1221019 1204258 1186120 1166443 1145685 1124648 1103803 1083088 1062404 1042042 1022407
53448 1022407 1003567 985341 967787 951304 936255 922755 910849 900631 892026 884733 878543 873492
53436 873492 869519 866153 862939 860098 858456 858666 860765 864553 870074 877466 886514 896654 907555 919536
53422 919536 933273 949041 966296 984107 1002074 1020735 1040976 1063125 1086827 1111771 1138238
53411 1138238 1166735 1197272 1229327 1262474 1296822 1332807 1370820 1411186 1454199 1499898 1547815
53400 1547815 1597247 1647795 1699432 1752110 1805586 1859656 1914250 1969139 2023803 2077821 2131146
53389 2131146 2183790 2235468 2285792 2334540 2381369 2425536 2466412 2504137 2539213 2571487 2600096
$$ packed form
53471A369347k784m384o403q397r954j1312j2874j4445j5421j5605j5438j5447
53459A236883j5864j6761j8138j9677k0758k1037k0845k0715k0684k0362j9635
53448A022407j8840j8226j7554j6483j5049j3500j1906j0218q605p293o190n051
53436H73492l973l366l214k841j642K10K099L788N521P392R048J0140J0901J1981
53422I19536J3737J5768J7255J7811J7967J8661K0241K2149K3702K4944K6467
53411A138238K8497L0537L2055L3147L4348L5985L8013M0366M3013M5699M7917
53400A547815M9432N0548N1637N2678N3476N4070N4594N4889N4664N4018N3325
53389B131146N2644N1678N0324M8748M6829M4167M0876L7725L5076L2274K8609
$$ plain form
53378 2600096 2624446 2644623 2660685 2672207 2678870 2680984 2678939 2672449 2660661 2642685 2617764 2585430
53366 2585430 2546107 2501294 2452728 2401482 2348166 2293547 2238438 2183268 2128372 2074488 2022379
53355 2022379 1972130 1923410 1876229 1830798 1786788 1743504 1700716 1658576 1616735 1574466 1531855
53344 1531855 1490051 1450054 1412003 1375949 1342370 1311386 1282314 1254771 1229565 1207613 1188490
53333 1188490 1170960 1154591 1139856 1126732 1114191 1101242 1087678 1073673 1059384 1045311 1032372
53322 1032372 1021159 1011426 1002623 994572 987355 980917 975229 970553 967169 964965 963710 963596 965134 968535
53308 968535 973567 980099 988420 998777 1010850 1024037 1038217 1053963 1071878 1091907 1113473 1136150
53296 1136150 1159954 1185000 1211146 1238068 1265458 1292954 1319994 1345930 1370298 1392955 1414024
$$ packed form
53378B600096K4350K0177J6062J1522O663K114k045o490j1788j7976k4921l2334
53366B585430l9323m4813m8566n1246n3316n4619n5109n5170n4896n3884n2109
53355B022379n0249m8720m7181m5431m4010m3284m2788m2140m1841m2269m2611
53344A531855m1804l9997l8051l6054l3579l0984k9072k7543k5206k1952j9123
53333A188490j7530j6369j4735j3124j2541j2949j3564j4005j4289j4073j2939
53322A032372j1213r733q803q051p217o438n688m676l384k204j255j14J538L401
53308I68535N032O532Q321J0357J2073J3187J4180J5746J7915K0029K1566K2677
53296A136150K3804K5046K6146K6922K7390K7496K7040K5936K4368K2657K1069
$$ plain form
53285 1414024 1433760 1452325 1469607 1485305 1499148 1510771 1519369 1523956 1524297 1521300 1516078 1508820 1499010
53272 1499010 1486566 1472061 1455768 1437169 1415766 1391947 1366618 1340296 1313039 1285058 1256876
53261 1256876 1228839 1200855 1172772 1144751 1117091 1089866 1062921 1036170 1009788 984114 959420
53250 959420 935739 912837 890253 867379 843672 819017 793953 769364 745800 723202 701407
53239 701407 680736 661839 644987 629757 615519 602082 589807 579238 570631 563596 557059 549794
53227 549794 541249 531810 522127 512310 501984 490946 479420 467650 455604 443237 430757 418495
53215 418495 406690 395626 385725 377143 369401 361744 353952 346548 340102 334538 329242 323714 317924 312068
53201 312068 306113 299720 292657 285290 278486 272840 268067 263313 258153 253084 248988 246199 244152 241870
$$ packed form
53285A414024J9736J8565J7282J5698J3843J1623Q598M587L41k997n222p258r810
53272A499010j2444j4505j6293j8599k1403k3819k5329k6322k7257k7981k8182
53261A256876k8037k7984k8083k8021k7660k7225k6945k6751k6382k5674k4694
53250I59420k3681k2902k2584k2874k3707k4655k5064k4589k3564k2598k1795
53239G01407k0671j8897j6852j5230j4238j3437j2275j0569q607p035o537p265
53227E49794q545r439r683r817j0326j1038j1526j1770j2046j2367j2480j2262
53215D18495j1805j1064r901q582p742p657p792p404o446n564n296n528n790n856
53201C12068n955o393p063p367o804n646m773m754n160n069m096k789k047k282
$$ plain form
53187 241870 238782 235246 232342 230974 231008 231347 230909 229496 227652 225915 224484 223495 223192 223596 224200 224327
53171 224327 223843 223280 223147 223272 223062 222263 221166 220038 218694 216862 214723 212770 211274 210166 209335 208654
53155 208654 207775 206325 204453 202861 202062 201841 201571 200929 200133 199660 199846 200590 201327 201524 201310 201445 202448
53138 202448 204011 205420 206334 206881 207253 207507 207663 207659 207246 206219 204792 203568 203088 203495 204491 205516 206089
53121 206089 206139 205880 205209 203615 201030 198443 197115 197220 197811 198066 198026 197912 197381 195921 193675 191354 189503
53104 189503 188157 187204 186639 186414 186290 186082 185938 186183 186790 187192 186858 185996 185349 185145 184631 183075 180966 179659
53086 179659 179842 180897 181895 182652 183505 184532 185511 186395 187302 188100 188425 188146 187540 186952 186485 186082 185712 185445
53068 185445 185390 185574 185790 185710 185254 184769 184660 184970 185508 186274 187414 188808 190072 191073 192130 193487 194847
$$ packed form
53187B41870l088l536k904j368L4L39m38j413j844j737j431r89l03M04O04J27
53171B24327m84n63j33J25k10p99j097j128j344j832k139j953j496j108q31o81
53155B08654q79j450j872j592p99k21k70o42p96m73J86P44P37J97k14J35J003
53138B02448J563J409R14N47L72K54J56mm13j027j427j224m80M07R96J025N73
53121B06089N0k59o71j594k585k587j328J05N91K55m0j14n31j460k246k321j851
53104A89503j346r53n65k25j24k08j44K45O07M02l34q62o47k04n14j556k109j307
53086A79659J83J055R98P57Q53J027R79Q84R07P98L25k79o06n88m67m03l70k67
53068A85445n5J84K16q0m56m85j09L10N38P66J140J394J264J001J057J357J360
$$ plain form
53051 194847 195704 195997 196129 196372 196542 196342 195756 194907 193700 191885 189472 186866 184517 182578 180972 179640
53035 179640 178591 177785 177119 176505 175902 175372 175138 175451 176212 176946 177335 177642 178333 179378 180294 180807 181132 181538
53017 181538 182038 182565 183071 183329 183082 182528 182269 182489 182606 182091 181266 180853 181016 181335 181516 181615 181687 181713 181793 181942
52997 181942 181789 181024 180136 180128 181332 182994 184146 184436 183971 182929 181729 181127 181663 183137 184904 186486 187707
52980 187707 188507 188890 188923 188602 188006 187692 188503 190643 193284 195473 197099 198555 199845 200665 201166 201939 203244
52963 203244 204819 206461 208197 209769 210575 210401 209752 209161 208528 207437 205802 203929 202149 200665 199531
52948 199531 198539 197327 195822 194393 193319 192373 191213 189981 189138 188765 188399 187615 186590 185944 186107 186854
52932 186854 187493 187544 187138 186694 186324 185888 185486 185375 185364 184864 183797 182901 182709 182715 182156 181189 180606 180628 180732 180616
$$ packed form
53051A94847Q57K93J32K43J70k00n86q49j207j815k413k606k349j939j606j332
53035A79640j049q06o66o14o03n30k34L13P61P34L89L07O91J045R16N13L25M06
53017A81538N00N27N06K58k47n54k59K20J17n15q25m13J63L19J81R9P2K6Q0J49
52997A81942j53p65q88qJ204J662J152K90m65j042j200o02N36J474J767J582J221
52980A87707Q00L83L3l21n96l14Q11K140K641K189J626J456J290Q20N01P73J305
52963B03244J575J642J736J572Q06j74o49n91o33j091j635j873j780j484j134
52948A99531r92j212j505j429j074r46j160j232q43l73l66p84j025o46J63P47
52932A86854O39N1m06m44l70m36m02j11j1n00j067q96j92On59r67n83K2J04j16
$$ plain form
52912 180616 180576 180833 181147 181277 181239 180905 179956 178564 177583 177644 178415 179128 179523 179818 180025 179816 179047 178065 177439
52893 177439 177539 178347 179494 180529 181195 181448 181249 180586 179701 179005 178713 178816 179424 180618 181843 182029 180826
52876 180826 179267 178611 178798 178714 177870 177138 177683 179731 182650 185774 188689 190958 192093 191997 191229 190607 190521
52859 190521 190713 190753 190489 189895 188736 186857 184735 183226 182619 182385 182066 181857 181964 181874 180825 178742 176209
52842 176209 173782 171801 170621 170381 170622 170668 170363 170000 169646 169110 168460 168007 167774 167560 167452 167678 167975 167843
52824 167843 167513 167881 169250 170844 171859 172305 172419 172031 171062 170067 169573 169298 168708 168018 167934 168622 169628 170756
52806 170756 172330 174420 176361 177326 177150 176386 175673 175169 174543 173508 172198 170899 169565 167981 166385 165384
52790 165384 165111 164971 164503 163962 163684 163487 163241 163462 164588 166010 166683 166574 166696 167642 168801 169247 168902 168596
$$ packed form
52912A80616m0K57L14J30l8l34r49j392r81O1P71P13L95K95K07k09p69r82o26
52893A77439J00Q08J147J035O66K53j99o63q85o96k92J03O08J194J225J86j203
52876A80826j559o56J87q4q44p32N45K048K919L124K915K269J135r6p68o22q6
52859A90521J92M0k64n94j159j879k122j509o07k34l19k09J07r0j049k083k533
52842A76209k427j981j180k40K41M6l05l63l54n36o50m53k33k14j08K26K97j32
52824A67843l30L68J369J594J015M46J14l88r69r95m94k75n90o90q4O88J006J128
52806A70756J574K090J941R65j76p64p13n04o26j035j310j299j334j584j596j001
52790A65384k73j40m68n41k78j97k46K21J126J422O73j09J22R46J159M46l45l06
$$ plain form
52772 168596 169224 170874 172533 172812 171352 169338 168168 167870 167471 166625 165909 165508 164699 163086 161521 161202
52756 161202 162398 164494 166759 168593 169547 169710 169766 170219 170852 171381 172165 173657 175481 176718 176986 176693 176329
52739 176329 176054 175945 176126 176609 177437 178949 181436 184548 187441 189614 191156 192186 192571 192382 192089 191991 191802
52722 191802 191157 190286 189753 189632 189320 188222 186345 184147 181993 179923 177888 176050 174753 174250 174524 175352
52706 175352 176434 177389 177797 177392 176245 174756 173488 172948 173251 173875 173990 173315 172555 172741 174156 176140 177872
52689 177872 179107 180109 181185 182394 183579 184586 185457 186397 187378 187923 187583 186603 185701 185096 184147 182306
52673 182306 180125 178850 179052 180073 180864 181050 180959 180923 180905 180805 180716 180728 180675 180388 180168 180693 182342 184734 187069
52654 187069 188772 189731 190127 190315 190720 191503 192293 192472 191777 190410 188622 186518 184390 182865 182437 182936 183672
$$ packed form
52772A68596O28J650J659K79j460k014j170k98l99q46p16m01q09j613j565l19
52756A61202J196K096K265J834R54J63N6M53O33N29P84J492J824J237K68k93l64
52739A76329k75j09J81M83Q28J512K487L112K893K173J542J030L85j89k93r8j89
52722A91802o45q71n33j21l12j098j877k198k154k070k035j838j297n03K74Q28
52706A75352J082R55M08m05j147j489j268n40L03O24J15o75p60J86J415J984J732
52689A77872J235J002J076J209J185J007Q71R40R81N45l40r80r02o05r49j841
52673A82306k181j275K02J021P91J86r1l6j8j00q9J2n3k87k20N25J649K392K335
52654A87069J703R59L96J88M05P83P90J79o95j367j788k104k128j525m28M99P36
$$ plain form
52637 183672 184021 183813 183334 183123 183614 184756 186052 187109 188077 189390 191198 193214 195017 196324 197052 197310
52621 197310 197312 197153 196775 196199 195586 194887 193731 192047 190593 190306 191160 192183 192702 193049 193806 194907 195875 196611
52603 196611 197429 198511 199715 200805 201485 201355 200305 198980 198414 199022 200137 200640 199881 198047 195948 194517
52587 194517 194237 194872 195875 197020 198437 200090 201620 202795 203718 204372 204350 203355 201711 199999 198424 196942
52571 196942 195841 195641 196370 197336 197803 197611 197049 196473 196204 196511 197338 198123 198183 197325 196011 194929 194440 194331
52553 194331 194092 193449 192677 192270 192369 192716 193135 193686 194210 194106 192931 191064 189443 188718 188917 189743 190778 191488
52535 191488 191597 191576 192302 193984 195817 196923 197248 197204 196879 196175 195449 195301 195681 195832 195307 194545 194194 194367
52517 194367 194885 195874 197518 199407 200664 200876 200590 200861 202463 205464 209233 212875 215901 218555 221237
$$ packed form
52637A83672L49k08m79k11M91J142J296J057R68J313J808K016J803J307P28K58
52621A97310Kj59l78n76o13o99j156j684j454k87Q54J023N19L47P57J101R68P36
52603A96611Q18J082J204J090O80j30j050j325n66O08J115N03p59j834k099j431
52587A94517k80O35J003J145J417J653J530J175R23O54k2r95j644j712j575j482
52571A96942j101k00P29R66M67j92n62n76k69L07Q27P85O0q58j314j082m89j09
52553A94331k39o43p72m07R9L47M19N51N24j04j175j867j621p25J99Q26J035P10
52535A91488J09k1P26J682J833J106L25m4l25p04p26j48L80J51n25p62l51J73
52517A94367N18R89J644J889J257K12k86K71J602L001L769L642L026K654K682
$$ plain form
52502 221237 223634 224747 223916 221518 218507 215539 212766 210219 208023 206229 204775 203679 203099 203068 203237
52487 203237 203059 202296 201358 201016 201638 202784 203704 204138 204383 204636 204709 204495 204256 204157 203963 203633 203849 205315 207647
52468 207647 209615 210563 211026 211750 212729 213606 214570 216274 218966 222156 225121 227450 229059 229962 230158 229636
52452 229636 228455 226822 225038 223296 221582 219788 217797 215470 212846 210455 209045 208687 208401 207130 204939
52437 204939 202859 201579 200790 199872 198729 197688 196971 196592 196512 196620 196759 197083 198155 200293 202898 204911
52421 204911 205981 206828 208208 209908 211072 211374 211510 212506 214800 218130 222048 226297 230793 235611 241159
52406 241159 248101 256708 266179 274786 280816 283413 282629 279002 273288 266436 259460 253140 247771 243179
52392 243179 238980 234962 231319 228484 226669 225667 225198 225308 226216 227764 229271 230063 230121 230089 230676 232091
$$ packed form
52502B21237K397J113q31k398l011k968k773k547k196j794j454j096n80l1J69
52487B03237j78p63r38l42O22J146R20M34K45K53P3k14k39r9j94l30K16J466K332
52468B07647J968R48M63P24R79Q77R64J704K692L190K965K329J609R03J96n22
52452B29636j181j633j784j742j714j794j991k327k624k391j410l58k86j271k191
52437B04939k080j280p89r18j143j041p17l79q0J08J39L24J072K138K605K013
52421B04911J070Q47J380J700J164L02J36R96K294L330L918M249M496M818N548
52406B41159O942Q607R471Q607O030K597p84l627n714o852o976o320n369m592
52392B43179m199m018l643k835j815j002m69J10R08J548J507P92N8l2N87J415
$$ plain form
52376 232091 234098 236531 239561 243321 247427 251235 254652 258331 262836 267875 272718 277041 280906 284045
52362 284045 285868 286325 286198 286233 286399 286327 286062 285933 285981 285981 285922 286043 286462 287148 288219 289909 292289 295303 298976
52343 298976 303212 307545 311567 315591 320375 326157 332538 339408 347318 356532 366382 376198 386498 398518
52329 398518 412674 428194 444317 461215 479457 499082 519599 540625 562024 583522 604617
52318 604617 625023 644913 664491 683466 701153 717124 731538 744786 756993 768038 777883 786664
52306 786664 794501 801475 807716 813229 817679 820674 822376 823502 824575 825460 825788 825481 824595 822913 820040
52291 820040 815763 810063 803023 795016 786808 779108 772127 765879 760717 757155 755380 755408 757559 762150 768751
52276 768751 776474 785186 795719 808533 822757 837086 851120 865212 879358 893061 906229 919436
$$ packed form
52376B32091K007K433L030L760M106L808L417L679M505N039M843M323L865L139
52362B84045J823M57j27L5J66p2k65j29M8%n9J21M19O86J071J690K380L014L673
52343B98976M236M333M022M024M784N782O381O870P910R214R850R816J0300J2020
52329C98518J4156J5520J6123J6898J8242J9625K0517K1026K1399K1498K1095
52318F04617K0406J9890J9578J8975J7687J5971J4414J3248J2207J1045R845Q781
52306G86664P837O974O241N513M450K995J702J126J073Q85L28l07q86j682k873
52291H20040m277n700p040q007q208p700o981o248n162l562j775K8K151M591O601
52276G68751P723Q712J0533J2814J4224J4329J4034J4092J4146J3703J3168J3207
$$ plain form
52264 919436 932996 946249 958093 967980 976167 983207 989522 995354 1000772 1005632 1009659 1012684 1014789
52251 1014789 1016207 1017116 1017503 1017065 1015182 1011116 1004541 995908 986141 975863 965125 954000 943101 933127
52237 933127 923986 914864 905274 895691 887009 879680 873641 868788 865125 862495 860484 858698 857036 855769
52223 855769 855362 856156 858038 860531 863296 866453 870323 874971 880187 885729 891465 897378 903649 910545 917922
52208 917922 924972 930787 935193 938772 942179 945789 949948 954908 960230 964746 967608 969211 970701 972719
52194 972719 975032 977250 979324 981221 982693 983748 984981 986903 989054 990263 989864 988239 986065 983485
52180 983485 980274 976452 972238 967554 962071 955768 949071 942410 936015 930254 925736 922730 920749 919015
52166 919015 917215 915530 914124 912975 912202 912224 913411 915759 918904 922358 925649 928388 930341 931486 932012
$$ packed form
52264I19436J3560J3253J1844R887Q187P040O315N832N418M860M027L025K105
52251A014789J418R09L87m38j883m066o575q633r767j0278j0738j1125j0899r974
52237I33127r141r122r590r583q682p329o039m853l663k630k011j786j662j267
52223H55769m07P94J882K493K765L157L870M648N216N542N736N913O271O896P377
52208I17922P050N815M406L579L407L610M159M960N322M516K862J603J490K018
52194I72719K313K218K074J897J472J055J233J922K151J209l99j625k174k580
52180I83485l211l822m214m684n483o303o697o661o395n761m518l006j981j734
52166I19015j800j685j406j149p73K2J187K348L145L454L291K739J953J145N26
$$ plain form
52151 932012 932232 932369 932303 931641 930212 928427 927067 926689 927309 928551 929993 931427 932967 934910 937372 940220
52135 940220 943469 947624 953298 960580 969120 978899 990549 1004774 1021703 1041065 1062669 1086351 1111581
52122 1111581 1137643 1164303 1191967 1220832 1250102 1278382 1304837 1329571 1352812 1374189 1393218
52111 1393218 1410163 1425671 1439421 1449757 1455102 1455417 1451933 1445874 1437940 1428761 1419019 1408969 1398436
52098 1398436 1387555 1377067 1367608 1359060 1350945 1343182 1335998 1329286 1322479 1315103 1307154 1298912 1290575
52085 1290575 1282107 1273366 1264463 1256186 1249974 1247155 1248051 1251895 1257643 1264800 1273525 1284153 1296686 1310650
52071 1310650 1325357 1340285 1355244 1370193 1385014 1399483 1413315 1426111 1437357 1446643 1453855 1459069
52059 1459069 1462349 1463782 1463531 1461603 1457658 1451363 1442979 1433291 1422807 1411320 1398414 1384166 1369098
$$ packed form
52151I32012K20J37o6o62j429j785j360l78O20J242J442J434J540J943K462K848
52135I40220L249M155N674P282Q540R779J1650J4225J6929J9362K1604K3682K5230
52122A111581K6062K6660K7664K8865K9270K8280K6455K4734K3241K1377J9029
52111A393218J6945J5508J3750J0336N345L15l484o059p934r179r742j0050j0533
52098A398436j0881j0488r459q548q115p763p184o712o807p376p949q242q337
52085A290575q468q741q903q277o212k819Q96L844N748P157Q725J0628J2533J3964
52071A310650J4707J4928J4959J4949J4821J4469J3832J2796J1246R286P212N214
52059A459069L280J433k51j928l945o295q384r688j0484j1487j2906j4248j5068
$$ plain form
52046 1369098 1353593 1337603 1320847 1303046 1284028 1263918 1243288 1222887 1203114 1183966 1165601
52035 1165601 1148734 1134171 1122101 1112095 1103814 1097359 1092772 1089506 1086746 1084175 1081990 1080073 1077525
52022 1077525 1073396 1067691 1061279 1054807 1048178 1041184 1034158 1027542 1021070 1014026 1006240 998210 989903 980035
52008 980035 967125 951098 933269 914837 895991 876595 857026 837797 818734 799151 778763
51997 778763 757965 737249 716862 697162 678781 662110 646963 633045 620524 609797 600875 593357
51985 593357 586921 581384 576330 571078 565216 558790 551835 544035 535073 525074 514439 503450 492410
51972 492410 481952 472762 464951 458063 451817 446539 442732 440538 439821 440550 442824 446607 451654 457645
51958 457645 464268 471259 478424 485506 491873 496616 499174 499724 498683 496007 491439 485411 479249 474314
$$ packed form
52046A369098j5505j5990j6756j7801j9018k0110k0630k0401j9773j9148j8365
52035A165601j6867j4563j2070j0006q281o455m587l266k760k571k185j917k548
52022A077525m129n705o412o472o629o994p026o616o472p044p786q030q307r868
52008I80035j2910j6027j7829j8432j8846j9396j9569j9229j9063j9583k0388
51997G78763k0798k0716k0387j9700j8381j6671j5147j3918j2521j0727q922p518
51985E93357o436n537n054n252n862o426o955p800q962r999j0635j0989j1040
51972D92410j0458r190p811o888o246n278l807k194p17P29K274L783N047N991
51958D57645O623O991P165P082O367M743K558N50j041k676m568o028o162m935
$$ plain form
51944 474314 471179 469698 469535 470424 472300 475523 480870 489003 499943 513089 527580 542486 556850
51931 556850 569775 580357 587459 589895 587215 580151 569985 557632 543674 529024 514796 501282
51919 501282 487590 472789 457181 442157 428901 417557 407535 398269 389590 381722 375165 370459
51907 370459 367740 366446 365677 365087 365362 367538 371839 377471 383692 390679 398968 408339 417827 426760 435098
51892 435098 442564 448120 450911 451466 451346 451657 452386 453146 453943 454859 455446 454923 452962 449949 446502 443008
51876 443008 439728 437021 435228 434399 434351 434975 436312 438331 440776 443221 445106 445672 444143 440210 434288
51861 434288 427147 419324 411033 402562 394542 387800 383027 380560 380234 381436 383445 385785 388142 390061
51847 390061 391023 390916 390124 388989 387400 385088 382104 378778 375355 371964 368804 365982 363133 359626 355404
$$ packed form
51944D74314l135j481j63Q89J876L223N347Q133J0940J3146J4491J4906J4364
51931E56850J2925J0582P102K436k680p064j0166j2353j3958j4650j4228j3514
51919E01282j3692j4801j5608j5024j3256j1344j0022r266q679p868o557m706
51907C70459k719j294p69n90K75K176M301N632O221O987Q289R371R488Q933Q338
51892D35098P466N556K791N55j20L11P29P60P97R16N87n23j961l013l447l494
51876D43008l280k707j793q29m8O24J337K019K445K445J885N66j529l933n922
51861D34288p141p823q291q471q020o742m773k467l26J202K009K340K357J919
51847C90061R62j07p92j135j589k312k984l326l423l391l160k822k849l507m222
$$ plain form
51832 355404 351449 349154 349210 351114 353648 355723 356886 357329 357529 357825 358190 358323 357875 356584 354293 351031
51816 351031 347192 343537 340832 339344 338679 338236 337874 338116 339640 342506 345898 348664 350119 350383 350024 349470
51800 349470 348750 347680 346111 343988 341305 338161 334904 332097 330146 328863 327482 325298 322340 319320
51786 319320 316919 315294 314275 313742 313538 313270 312703 312285 312841 314576 316674 318132 318699 318785 318734 318577 318461
51769 318461 318953 320759 324153 328715 333725 338944 344953 352423 361080 369751 377523 384306 389963 393483
51755 393483 393717 390749 385879 380277 374166 367238 359302 350481 341358 333117 326993 323307 321340 320368 320514
51740 320514 322436 326566 332848 340971 350591 361527 373767 386953 399860 410871 419266 425760 431659
51727 431659 437874 444789 452327 459638 465256 468162 468404 466235 461170 452683 441667 430316 420378 412039
$$ packed form
51832C55404l955k295N6J904K534K075J163M43K00K96L65J33m48j291k291l262
51816C51031l839l655k705j488o65m43l62K42J524K866L392K766J455K64l59n54
51800C49470p20j070j569k123k683l144l257k807j951j283j381k184k958l020
51786C19320k401j625j019n33k04k68n67m18N56J735K098J458N67Q6n1j57j16
51769C18461M92J806L394M562N010N219O009P470Q657Q671P772O783N657L520
51755C93483K34k968m870n602o111o928p936q821r123q241o124l686j967r72J46
51740C20514J922M130O282Q123R620J0936J2240J3186J2907J1011Q395O494N899
51727D31659O215O915P538P311N618K906K42k169n065q487j1016j1351r938q339
$$ plain form
51713 412039 404582 397489 390666 384078 377684 371545 365751 360370 355660 352215 350726 351525 354329 358286
51699 358286 362222 365056 366194 365712 364287 362895 362317 362703 363655 364788 365989 367015 367073 365207 361173 355773
51683 355773 350329 345841 342475 339675 336866 334138 332131 331292 331595 333127 336355 341427 347632 354210 361407
51668 361407 370060 380248 391061 401572 411223 419149 424068 425378 423722 419929 413963 405603 395836
51655 395836 386788 380189 376433 375115 375909 378621 382763 387474 391838 395070 396434 395252 391254 384893
51641 384893 377151 368891 360486 352093 344100 336998 330947 325756 321263 317415 313982 310593 307247 304474
51627 304474 302760 302074 302169 303020 304544 306129 307009 307190 307520 308630 310139 311209 311632 311924 312409 312711 312304
51610 312304 311178 309609 307561 304828 301694 298974 297262 296516 296552 297540 299726 302998 307085 311992 317904
$$ packed form
51713D12039p457p093o823o588o394o139n794n381m710l445j489P99K804L957
51699C58286L936K834J138m82j425j392n78L86R52J133J201J026N8j866m034n400
51683C55773n444m488l366k800k809k728k007q39L03J532L228N072O205O578P197
51668C61407Q653J0188J0813J0511R651P926M919J310j656l793n966q360r767
51655C95836r048o599l756j318P94K712M142M711M364L232J364j182l998o361
51641C84893p742q260q405q393p993p102o051n191m493l848l433l389l346k773
51627C04474j714o86R5Q51J524J585Q80J81L30J110J509J070M23K92M85L02m07
51610C12304j126j569k048k733l134k720j712p46L6R88K186L272M087M907N912
$$ plain form
51595 317904 324822 332501 340545 348304 354950 360005 363547 365559 365501 363158 359618 356634 355013 354339 354306
51580 354306 355458 358345 362744 368261 375174 384102 395188 408015 422067 436827 451699 466294 480700
51567 480700 495139 509434 523091 535820 547854 559959 573350 589406 609230 633517 662734
51556 662734 696888 734808 774050 811899 846262 875456 897705 911537 916503 913010 901626 883022
51544 883022 858403 829316 796915 761835 724832 687165 650266 615327 583189 554230 528257
51533 528257 504819 483709 464989 448583 434205 421736 411276 402697 395465 389070 383414 378555
51521 378555 374264 370043 365573 360980 356654 352850 349502 346404 343442 340521 337352 333666 329732 326371
51507 326371 324168 322809 321412 319348 316639 313778 311434 310054 309520 309342 309365 309936 311096 312128 312497 312886
$$ packed form
51595C17904O918P679Q044P759O646N055L542K012n8k343l540k984j621o74l3
51580C54306J152K887M399N517O913Q928J1086J2827J4052J4760J4872J4595J4406
51567D80700J4439J4295J3657J2729J2034J2105J3391J6056J9824K4287K9217
51556F62734L4154L7920L9242L7849L4363K9194K2249J3832M966l493j1384j8604
51544H83022k4619k9087l2401l5080l7003l7667l6899l4939l2138k8959k5973
51533E28257k3438k1110j8720j6406j4378j2469j0460q579p232o395n656m859
51521C78555m291m221m470m593m326l804l348l098k962k921l169l686l934l361
51507C26371k203j359j397k064k709k861k344j380n34j78K3N71J160J032L69L89
$$ plain form
51491 312886 314551 317725 321377 324557 327284 330032 333025 336259 339579 342451 344197 344792 344911 344849 343891
51476 343891 341189 336929 332134 327541 323060 318196 312655 306612 300630 295220 290443 286111 282386 279676
51462 279676 277822 275948 273513 271044 269271 268018 266620 265175 264620 265570 267789 270838 274622 279029 283650
51447 283650 288276 293389 299858 308345 319103 331933 345956 359623 371395 380512 387036 391327 393720
51434 393720 394598 394433 393593 392207 390300 387948 385162 381655 376816 370125 361723 352637 344354 337954 333526
51419 333526 330356 327702 325397 323676 322500 321282 319497 317476 316274 316676 318519 321063 323677 325917
51405 325917 327288 327462 326782 326082 325849 325827 325652 325525 325989 327282 329307 332078 335774 340292 345228 350494
51389 350494 356586 364019 372844 383179 395943 412380 432829 456584 483229 513556 548665 588614
$$ packed form
51491C12886J665L174L652L180K727K748K993L234L320K872J746N95J19o2r58
51476C43891k702m260m795m593m481m864n541o043n982n410m777m332l725k710
51462B79676j854j874k435k469j773j253j398j445n55R50K219L049L784M407M621
51447B83650M626N113O469Q487J0758J2830J4023J3667J1772R117O524M291K393
51434C93720Q78j65q40j386j907k352k786l507m839o691q402r086q283o400m428
51419C33526l170k654k305j721j176j218j785k021j202M02J843K544K614K240
51405C25917J371J74o80p00k33k2j75j27M64J293K025K771L696M518M936N266
51389C50494O092P433Q825J0335J2764J6437K0449K3755K6645L0327L5109L9949
$$ plain form
51377 588614 632599 680196 731432 785361 839232 889652 934315 972267 1002848 1025027 1037744
51366 1037744 1040436 1033076 1016055 990200 956720 916935 872158 823853 773683 723186 673531 625719
51354 625719 580888 540128 503960 472211 444499 420707 400886 384785 371679 360639 350917 342126
51342 342126 334231 327421 321862 317486 314027 311257 309099 307505 306398 305769 305602 305595 305137 303799 301747 299564
51326 299564 297737 296490 295882 295783 295817 295670 295400 295207 294958 294277 293067 291556 289797 287586 285062 282947 281836
51309 281836 281492 281149 280313 278945 277096 274810 272472 270859 270672 271993 274214 276373 277641 277679 276710 275324
51293 275324 274161 273568 273363 273070 272666 273009 275089 278844 283156 287245 291559 296942 303352 309802 315209
51278 315209 318845 320319 319861 318480 317202 316106 314610 312663 310959 309902 309087 308188 307737 308483 310277
$$ packed form
51377E88614M3985M7597N1236N3929N3871N0420M4663L7952L0581K2179J2717
51366A037744K692p360j7021k5855l3480l9785m4777m8305n0170n0497m9655m7812
51354F25719m4831m0760l6168l1749k7712k3792j9821j6101j3106j1040r722q791
51342C42126p895o810n559m376l459k770k158j594j107o29j67pm58j338k052k183
51326B99564j827j247o08r9L4j47k70j93k49o81j210j511j759k211k524k115j111
51309B81836l44l43q36j368j849k286k338j613j87J321K221K159J268L8r69j386
51293B75324j163n93k05k93m04L43K080L755M312M089M314N383O410O450N407
51278C15209L636J474m58j381j278j096j496j947j704j057q15q99m51P46J794
$$ plain form
51263 310277 312102 312947 312381 310515 307927 305498 303781 302430 300572 297825 294720 292053 290051 288304 286303
51248 286303 283839 280982 277955 275174 273297 272915 274032 276010 278222 280584 283190 285600 286979 287010 286135
51233 286135 284728 282570 279607 276723 275073 274790 274993 275091 275434 276497 278046 279536 280905 282470 284194
51218 284194 285559 286189 286233 286074 285914 285803 285845 286196 286858 287625 288226 288553 288764 289181 289964 290913 291704 292411 293596
51199 293596 295676 298205 300087 300656 300346 300145 300497 301051 301438 301839 302566 303390 303705 303330 302777 302665 303136 303981
51181 303981 305042 306241 307306 307811 307540 306711 305719 304728 303570 301994 300008 297940 296180 294860 293839
51166 293839 293022 292631 293103 294681 297102 299685 301846 303649 305765 308658 311795 313934 314345 313503 312342
51151 312342 311117 309425 307227 305275 304382 304630 305519 306545 307357 307621 307131 306024 304622 303073 301321 299351
$$ packed form
51263C10277J825Q45n66j866k588k429j717j351j858k747l105k667k002j747k001
51248B86303k464k857l027k781j877l82J117J978K212K362K606K410J379L1q75
51233B86135j407k158k963k884j650k83K03R8L43J063J549J490J369J565J724
51218B84194J365O30M4j59j60j11M2L51O62P67O01L27K11M17P83R49P91P07J185
51199B93596K080K529J882N69l10k01L52N54L87M01P27Q24L15l75n53j12M71Q45
51181C03981J061J199J065N05k71q29r92r91j158j576j986k068j760j320j021
51166B93839q17l91M72J578K421K583K161J803K116K893L137K139M11q42j161
51151C12342j225j692k198j952q93K48Q89J026Q12K64m90j107j402j549j752j970
$$ plain form
51135 299351 297276 295247 293450 292133 291388 291046 290983 291518 293197 296116 299653 302945 305505 307409 309115
51120 309115 311132 313602 316063 317698 317933 316815 314999 313505 313262 314445 316250 317645 318451 319363 320906
51105 320906 322796 324488 325932 327460 329223 331178 333461 336385 339990 343802 347055 349116 349864 349820 349846
51090 349846 350550 352047 354163 356570 358696 359931 360226 360175 360173 359824 358543 356443 354147 351995 350040 348670
51074 348670 348452 349213 349918 349895 349809 351022 354149 358618 363520 368578 374244 381165 389789 400383 412973
51059 412973 426909 440668 452623 462141 469648 475616 480183 484034 488903 496398 506621 518614 531704
51046 531704 545563 559180 570939 579873 586025 589512 590277 589097 587674 586934 585902 582909 577260 568971
51032 568971 557534 542153 523097 502006 480767 460652 442451 426764 413945 404113 397210 392731
$$ packed form
51135B99351k075k029j797j317p45l42o3N35J679K919L537L292K560J904J706
51120C09115K017K470K461J635K35j118j816j494k43J183J805J395Q06R12J543
51105C20906J890J692J444J528J763J955K283K924L605L812L253K061P48m4K6
51090C49846P04J497K116K407K126J235K95n1kl49j281k100k296k152j955j370
51074C48670k18P61P05k3q6J213L127M469M902N058N666O921Q624J0594J2590
51059D12973J3936J3759J1955R518P507N968M567L851M869P495J0223J1993J3090
51046E31704J3859J3617J1759Q934O152L487P65j180j423p40j032k993n649q289
51032E68971j1437j5381j9056k1091k1239k0115j8201j5687j2819r832o903m479
$$ plain form
51020 392731 389642 387108 385290 385002 386641 389879 394284 399644 405595 411511 417013 422258 427575 433079
51006 433079 438681 444258 449857 455968 463393 472419 482244 491760 500885 510593 521589 533571 545966
50993 545966 558782 572320 586471 600664 614364 627377 639857 652133 664315 676008 686715
50982 686715 696519 706000 715412 724384 732528 739847 746386 752064 757209 762815 769991 779578 792583 810311
50968 810311 833453 861478 893551 929749 970673 1016165 1065187 1116964 1171461 1228537 1287232
50957 1287232 1346203 1404441 1461262 1515865 1567194 1614213 1656250 1693172 1725225 1752630 1775493
50946 1775493 1794216 1809743 1823069 1834668 1844781 1853997 1862956 1871436 1878293 1882400 1883238 1880521 1873939
50933 1873939 1863649 1850546 1835465 1818249 1797935 1773787 1745848 1714480 1679604 1640467 1596165
$$ packed form
51020C92731l089k534j818k88J639L238M405N360N951N916N502N245N317N504
51006D33079N602N577N599O111P425R026R825R516R125R708J0996J1982J2395
50993E45966J2816J3538J4151J4193J3700J3013J2480J2276J2182J1693J0707
50982F86715R804R481R412Q972Q144P319O539N678N145N606P176R587J3005J7728
50968H10311K3142K8025L2073L6198M0924M5492M9022N1777N4497N7076N8695
50957A287232N8971N8238N6821N4603N1329M7019M2037L6922L2053K7405K2863
50946A775493J8723J5527J3326J1599J0113R216Q959Q480O857M107Q38k717o582
50933A873939j0290j3103j5081j7216k0314k4148k7939l1368l4876l9137m4302
$$ plain form
50922 1596165 1546545 1492707 1436579 1380001 1324186 1269859 1217492 1167390 1119862 1075383 1034355
50911 1034355 996690 962028 930417 902312 877757 856029 836343 818474 802307 787310 773021
50900 773021 759707 747987 737969 729302 721819 715449 709656 703735 697767 692570 688491 684911 681245
50887 681245 677877 675644 674868 675313 676717 678844 681218 683373 685350 687610 690598 694626 700001 706812 714688
50872 714688 723231 732611 743357 755565 768786 782699 797490 813514 831056 850556 872589 897352
50860 897352 924641 954585 988028 1025791 1067959 1114377 1165562 1222524 1285934 1356076 1433568
50849 1433568 1519359 1613775 1716111 1825371 1940926 2062128 2187782 2316527 2447414 2579511
50839 2579511 2711001 2839073 2960688 3073078 3173610 3259832 3330006 3383538 3420860 3443160
$$ packed form
50922A596165m9620n3838n6128n6578n5815n4327n2367n0102m7528m4479m1028
50911A034355l7665l4662l1611k8105k4555k1728j9686j7869j6167j4997j4289
50900G73021j3314j1720j0018q667p483o370n793n921n968n197m079l580l666
50887F81245l368k233p76M45J404K127K374K155J977K260K988M028N375O811P876
50872G14688Q543R380J0746J2208J3221J3913J4791J6024J7542J9500K2033K4763
50860H97352K7289K9944L3443L7763M2168M6418N1185N6962O3410P0142P7492
50849A433568Q5791R4416J02336J09260J15555J21202J25654J28745J30887J32097
50839B579511J31490J28072J21615J12390J00532Q6222P0174N3532L7322K2300
$$ plain form
50829 3443160 3452219 3450134 3438990 3421079 3399530 3378315 3361038 3349721 3344933 3346840 3355506 3369948
50817 3369948 3387328 3403516 3414513 3417256 3409317 3388372 3352320 3299912 3231053 3146500 3047412 2935360
50805 2935360 2812617 2682148 2547140 2410525 2274991 2143208 2017785 1900952 1794378
50796 1794378 1699258 1616264 1545293 1485530 1436085 1396521 1366500 1345024 1330398 1321076 1316130 1314666
50784 1314666 1315167 1315900 1315870 1314912 1312870 1309189 1303490 1296064 1287457 1277835 1266981 1254735 1241065 1225887
50770 1225887 1209145 1190980 1171561 1150846 1128711 1105230 1080498 1054389 1026951 999079 972341
50759 972341 947965 926232 906896 889853 875247 863255 853975 847304 842832 840176 839556 841696 846911
50746 846911 854660 864283 875848 889916 906779 926438 949165 975514 1005790 1040008 1078419 1121540
$$ packed form
50829C443160R059k085j1144j7911k1549k1215j7277j1317m788J907Q666J4442
50817C369948J7380J6188J0997K743p939k0945l6052n2408o8859q4553r9088j12052
50805B935360j22743j30469j35008j36615j35534j31783j25423j16833j06574
50796A794378r5120q2994p0971n9763m9445l9564l0021k1476j4626r322m946j464
50784A314666N01P33l0r58k042l681n699p426q607r622j0854j2246j3670j5178
50770A225887j6742j8165j9419k0715k2135k3481k4732k6109k7438k7872k6738
50759I72341k4376k1733j9336j7043j4606j1992r280o671m472k656o20K140N215
50746H46911P749R623J1565J4068J6863J9659K2727K6349L0276L4218L8411M3121
$$ plain form
50734 1121540 1169482 1221660 1277407 1336573 1399234 1465121 1533643 1604236 1676272 1748673 1819987
50723 1819987 1889033 1955316 2018652 2078344 2132676 2179172 2215505 2240337 2253454 2255276 2246499 2228330
50711 2228330 2202892 2173040 2141710 2111533 2084957 2064260 2051006 2045456 2046716 2053471 2064465 2078324
50699 2078324 2093218 2106919 2117041 2121119 2116666 2101506 2074237 2034452 1982817 1921219 1852639 1780356
50687 1780356 1707045 1634697 1565238 1500685 1442542 1391455 1347765 1312112 1285187 1267201 1257914
50676 1257914 1257025 1264210 1278987 1300886 1329497 1363933 1402459 1443133 1484739 1526542 1567223 1604747
50664 1604747 1637503 1665153 1688207 1707277 1722950 1735847 1746380 1754739 1761379 1767146 1772581 1777423
50652 1777423 1781220 1784223 1787296 1791151 1796144 1802706 1811542 1823326 1838475 1857247 1879742 1905827 1935279
$$ packed form
50734A121540M7942N2178N5747N9166O2661O5887O8522P0593P2036P2401P1314
50723A819987O9046O6283O3336N9692N4332M6496L6333K4832J3117J822q777j8169
50711B228330k5438k9852l1330l0177k6576k0697j3254n550J260O755J0994J3859
50699B078324J4894J3701J0122M078m453j5160k7269l9785n1635o1598o8580p2283
50687A780356p3311p2348o9459o4553n8143n1087m3690l5653k6925j7986r287
50676A257914q89P185J4777K1899K8611L4436L8526M0674M1606M1803M0681L7524
50664A604747L2756K7650K3054J9070J5673J2897J0533Q359O640N767N435M842
50652A777423L797L003L073L855M993O562Q836J1784J5149J8772K2495K6085K9452
$$ plain form
50639 1935279 1968026 2004068 2043108 2084460 2127239 2170462 2212941 2253413 2291095 2326247 2360179
50628 2360179 2394287 2428292 2458885 2480262 2486589 2474393 2443117 2394427 2331926 2261236 2189085
50617 2189085 2121302 2061474 2011326 1971749 1943066 1924773 1915672 1914358 1919249 1928173 1938317 1946827
50605 1946827 1951423 1950384 1942124 1925063 1898077 1861035 1814846 1761007 1701203 1637234 1571013 1504405
50593 1504405 1439054 1376351 1317305 1262307 1211260 1164229 1121847 1084817 1053141 1026172 1003310
50582 1003310 984287 968807 956350 946462 938894 933317 929197 926141 924075 922965 922651 923141 924755 927685
50568 927685 931648 936255 941620 948324 956872 967419 979957 994530 1011295 1030571 1052836 1078580
50556 1078580 1108089 1141325 1177859 1216912 1257660 1299617 1342466 1385390 1426867 1465447 1500616
$$ packed form
50639A935279L2747L6042L9040M1352M2779M3223M2479M0472L7682L5152L3932
50628B360179L4108L4005L0593K1377O327j2196l1276m8690o2501p0690p2151
50617B189085o7783n9828n0148l9577k8683j8293r101j314M891Q924J0144Q510
50605A946827M596j039q260j7061k6986l7042m6189n3839n9804o3969o6221o6608
50593A504405o5351o2703n9046n4998n1047m7031m2382l7030l1676k6969k2862
50582A003310j9023j5480j2457r888p568n577m120l056k066j110l14M90J614K930
50568I27685L963M607N365O704Q548J0547J2538J4573J6765J9276K2265K5744
50556A078580K9509L3236L6534L9053M0748M1957M2849M2924M1477L8580L5169
$$ plain form
50545 1500616 1532702 1562215 1589711 1616158 1642963 1671503 1702914 1738271 1778553 1824176 1874865
50534 1874865 1930342 1991044 2057982 2131885 2212624 2299568 2392430 2491637 2597657 2709880 2826289
50523 2826289 2944363 3062160 3178323 3291200 3398306 3496777 3584098 3658276 3717491 3759800
50513 3759800 3783224 3786132 3767751 3728474 3669768 3593824 3503345 3401520 3291977 3178608 3065395
50502 3065395 2956229 2854639 2763648 2685951 2624093 2580163 2555147 2548662 2559259 2584763 2622318
50491 2622318 2668297 2718246 2766790 2807817 2835361 2844879 2833769 2800870 2746017 2670484 2577527
50480 2577527 2471848 2358204 2240494 2121804 2004710 1891273 1782942 1680772 1585694 1498420
50470 1498420 1419105 1347298 1282423 1224353 1173304 1129042 1090361 1055711 1024364 996611 972734
$$ packed form
50545A500616L2086K9513K7496K6447K6805K8540L1411L5357M0282M5623N0689
50534A874865N5477O0702O6938P3903Q0739Q6944R2862R9207J06020J12223J16409
50523B826289J18074J17797J16163J12877J07106R8471Q7321P4178N9215M2309
50513C759800K3424K908j8381l9277n8706p5944r0479j01825j09543j13369j13213
50502C065395j09166j01590r0991p7697o1858m3930k5016o485J0597K5504L7555
50491B622318M5979M9949M8544M1027K7544R518j1110l2899n4853p5533r2957
50480B577527j05679j13644j17710j18690j17094j13437j08331j02170r5078q7274
50470A498420p9315p1807o4875n8070n1049m4262l8681l4650l1347k7753k3877
$$ plain form
50459 972734 952252 934501 919526 907805 899240 893052 888697 886262 885699 886251 887127 888454 891033 895255
50445 895255 900735 907015 914138 922295 931252 940466 949619 958790 968119 977612 987323 997458 1008062 1018727
50431 1018727 1028870 1038346 1047595 1057152 1067241 1078012 1089875 1103330 1118596 1135787 1155374 1178045
50419 1178045 1204010 1232919 1264725 1300264 1340532 1385633 1434930 1488197 1545998 1608743 1675708
50408 1675708 1745240 1815526 1884873 1951578 2014168 2071873 2124367 2170886 2209906 2239970 2260513
50397 2260513 2271456 2272143 2261232 2237783 2202065 2155124 2098020 2032087 1959822 1884830 1810534 1739170
50385 1739170 1672197 1611282 1558404 1515079 1481855 1458669 1445340 1441575 1446737 1459755 1479054 1502315
50373 1502315 1526433 1548069 1564437 1573612 1574265 1565390 1546401 1517416 1479339 1433726 1382584 1328048
$$ packed form
50459I72734k0482j7751j4975j1721q565o188m355k435n63N52Q76J327K579M222
50445H95255N480O280P123Q157Q957R214R153R171R329R493R711J0135J0604J0665
50431A018727J0143R476R249R557J0089J0771J1863J3455J5266J7191J9587K2671
50419A178045K5965K8909L1806L5539M0268M5101M9297N3267N7801O2745O6965
50408A675708O9532P0286O9347O6705O2590N7705N2494M6519L9020L0064K0543
50397B260513J0943O87j0911k3449l5718m6941n7104o5933p2265p4992p4296p1364
50385A739170o6973o0915n2878m3325l3224k3186j3329l765N162J3018J9299K3261
50373A502315K4118K1636J6368R175O53q875j8989k8985l8077m5613n1142n4536
$$ plain form
50361 1328048 1272032 1216072 1161489 1109598 1061527 1017732 977791 940769 905843 872694 841500
50350 841500 812657 786379 762456 740513 720661 703745 690639 681202 674201 668365 663390 659805
50338 659805 658103 658196 659586 661817 664749 668519 673179 678320 683201 687450 691532 696342 702392 709536 717392
50323 717392 725713 734409 743538 753366 764252 776398 789870 804751 820951 837752 853830 867792
50311 867792 878552 885285 887546 885612 880443 873089 864384 855221 846583 838994 832350 826687 822725 821213
50297 821213 822066 824655 828630 833886 839941 846124 852356 859088 866406 873777 880778 887486 894086 900729
50283 900729 907936 916403 926142 936648 948386 963235 982426 1004206 1024214 1038037 1043041 1038433
50271 1038433 1024827 1004084 978820 951582 924583 899895 879021 862074 847967 835815 825820
$$ packed form
50361A328048n6016n5960n4583n1891m8071m3795l9941l7022l4926l3149l1194
50350H41500k8843k6278k3923k1943j9852j6916j3106r437p001n836m975l585
50338F59805j702R3J390K231K932L770M660N141M881M249M082M810O050P144P856
50323G17392Q321Q696R129R828J0886J2146J3472J4881J6200J6801J6078J3962
50311H67792J0760O733K261j934n169p354q705r163q638p589o644n663l962j512
50297H21213Q53K589L975N256O055O183O232O732P318P371P001O708O600O643
50283I00729P207Q467R739J0506J1738J4849J9191K1780K0008J3823N004m608
50271A038433j3606k0743k5264k7238k6999k4688k0874j6947j4107j2152r995
$$ plain form
50260 825820 818640 814411 812658 812706 813853 815524 817644 820639 824787 829821 835376 841376 847647 853611 858853
50245 858853 863701 868687 873726 878417 882886 887586 892354 896519 900120 904228 909696 916256 923273 930839
50231 930839 939559 949693 961249 974710 990962 1010409 1032572 1056545 1081433 1106239 1129831 1151337
50219 1151337 1170519 1187714 1203527 1218512 1232928 1246785 1260200 1273435 1286184 1296953 1303525
50208 1303525 1304060 1297378 1282472 1258664 1226591 1188472 1146941 1103985 1061289 1020906 984778 953750
50196 953750 927672 906337 889681 877030 866745 856801 845371 830884 812159 788930 762131 733533
50184 733533 705136 678587 654578 632654 612069 592995 576465 562932 551504 541018 531440 523564
50172 523564 517662 513077 509167 505998 503874 502651 501866 501362 501449 502456 504300 506614 509215 512339 516345
$$ packed form
50260H25820p180m229j753M8J147J671K120K995M148N034N555O000O271N964N242
50245H58853M848M986N039M691M469M700M768M165L601M108N468O560P017P566
50231I30839Q720J0134J1556J3461J6252J9447K2163K3973K4888K4806K3592K1506
50219A151337J9182J7195J5813J4985J4416J3857J3415J3235J2749J0769O572
50208A303525N35o682j4906k3808l2073l8119m1531m2956m2696m0383l6128l1028
50196I53750k6078k1335j6656j2651j0285r944j1430j4487j8725k3229k6799k8598
50184G33533k8397k6549k4009k1924k0585j9074j6530j3533j1428j0486r578p876
50172E23564n902m585l910l169k124j223p85n04Q7J007J844K314K601L124M006
$$ plain form
50157 516345 521299 527060 533720 541629 550836 560780 570760 580463 589677 597761 603995 608492 612181 615583
50143 615583 617989 618254 616267 613222 610466 608466 607095 606627 607994 611951 618187 625552 633106 640784 649003
50128 649003 657948 667421 677291 687765 699178 711665 725179 739789 755833 773758 793795 815905
50116 815905 840093 866732 896446 929830 967496 1010291 1058978 1113449 1172580 1235142 1300505
50105 1300505 1367990 1435789 1501252 1562569 1619865 1674638 1728401 1781932 1835195 1887380 1936991
50094 1936991 1982157 2020895 2051053 2070248 2076234 2067578 2044058 2006679 1957531 1899506 1835691 1768605
50082 1768605 1699867 1630563 1561904 1495394 1432362 1373472 1318926 1269021 1224218 1184455 1148771
50071 1148771 1115941 1085334 1056747 1029543 1002603 975466 949108 925161 904433 886435 870213
$$ packed form
50157E16345M954N761O660P909R207R944R980R703R214Q084O234M497L689L402
50143F15583K406K65j987l045k756k000j371m68J367L957O236P365P554P678Q219
50128F49003Q945R473R870J0474J1413J2487J3514J4610J6044J7925K0037K2110
50116H15905K4188K6639K9714L3384L7666M2795M8687N4471N9131O2562O5363
50105A300505O7485O7799O5463O1317N7296N4773N3763N3531N3263N2185M9611
50094A936991M5166L8738L0158J9195N986q656k3520l7379m9148n8025o3815o7086
50082A768605o8738o9304o8659o6510o3032n8890n4546m9905m4803l9763l5684
50071A148771l2830l0607k8587k7204k6940k7137k6358k3947k0728j7998j6222
$$ plain form
50060 870213 855297 841825 830127 820389 812585 806525 801971 798772 796905 796291 796630 797558 799063 801545
50046 801545 805278 809886 814666 819437 824730 830943 837589 843649 848441 851864 854075 855383 856274 857052 857423
50031 857423 856951 855844 854762 853794 852280 849857 846969 843995 840481 835867 830458 824972 819404 813163 806271
50016 806271 799638 793927 788672 782862 776076 768777 761674 754979 748258 740980 733214 725704 719221 714186
50002 714186 711203 711471 715949 724228 735026 748004 764385 785430 810949 839839 871594 906503
49990 906503 944515 984717 1026092 1068218 1110865 1153166 1193532 1230309 1262363 1289166 1310648
49979 1310648 1327181 1339679 1349477 1357856 1365433 1371869 1376069 1376508 1371401 1358796 1336921 1304749 1262427
49966 1262427 1211310 1153658 1092278 1030178 970144 914226 863431 817972 777911 743480 714758
$$ packed form
50060H70213j4916j3472j1698r738p804o060m554l199j867o14L39R28J505K482
50046H01545L733M608M780M771N293O213O646O060M792L423K211J308Q91P78L71
50031H57423m72j107j082r68j514k423k888k974l514m614n409n486n568o241o892
50016H06271o633n711n255n810o786p299p103o695o721p278p766p510o483n035
50002G14186k983K68M478Q279J0798J2978J6381K1045K5519K8890L1755L4909
49990I06503L8012M0202M1375M2126M2647M2301M0366L6777L2054K6803K1482
49979A310648J6533J2498R798Q379P577O436M200M39n107j2605k1875l2172m2322
49966A262427n1117n7652o1380o2100o0034n5918n0795m5459m0061l4431k8722
$$ plain form
49955 714758 691299 672399 657626 646843 639773 635929 635132 637622 643352 651313 659877 667796 674633
49942 674633 680370 684917 688163 690228 691353 691481 690091 686580 680699 672471 661749 648196 631937 613942
49928 613942 595405 576895 558572 541122 525816 513395 503494 495476 489371 485504 483618 482994 483190
49915 483190 484045 485175 486169 487278 489121 491604 493916 495850 498348 502231 507030 511771 516445 521961 528910
49900 528910 537228 546976 558539 571762 585485 598344 609650 619237 626917 632525 636252 638476 639367
49887 639367 638948 637334 634575 630322 624037 615522 604946 592347 577557 560839 543275 526238 510574
49874 510574 496462 483878 472815 463094 454353 446458 439748 434651 431183 429034 428099 428608 430685 434036
49860 434036 438247 443155 448725 454792 461282 468575 477206 487125 497701 508679 520629 533996 547925
$$ packed form
49955G14758k3459j8900j4773j0783p070l844p97K490N730P961Q564P919O837
49942F74633N737M547L246K065J125J28j390l511n881q228j0722j3553j6259j7995
49928F13942j8537j8510j8323j7450j5306j2421r901q018o105l867j886o24J96
49915D83190Q55J130R94J109J843K483K312J934K498L883M799M741M674N516O949
49900E28910Q318R748J1563J3223J3723J2859J1306R587P680N608L727K224Q91
49887F39367m19j614k759m253o285q515j0576j2599j4790j6718j7564j7037j5664
49874E10574j4112j2584j1063r721q741p895o710n097l468k149r35N09K077L351
49860D34036M211M908N570O067O490P293Q631R919J0576J0978J1950J3367J3929
$$ plain form
49847 547925 560594 570793 578794 585628 591892 597405 601633 604015 604073 601577 596750 590219 582690 574636
49833 574636 566146 557002 547032 536531 526294 517096 509282 502963 498434 496062 495787 496991 498991 501519
49819 501519 504735 509005 514741 522184 531144 541076 551551 562534 574032 585660 596769 606946 616095
49806 616095 624057 630535 635494 639362 642541 644843 645642 644544 641670 637269 631252 623256 613103 601107
49792 601107 587942 574228 560243 546002 531642 517673 504798 493552 484119 476422 470166 464852
$$ packed form
49847E47925J2669J0199Q001O834O264N513M228K382N8k496m827o531p529q054
49833E74636q490r144r970j0501j0237r198p814o319m529k372k75J204K000K528
49819E01519L216M270N736P443Q960R932J0475J0983J1498J1628J1109J0177R149
49806F16095P962O478M959L868L179K302P99j098k874m401o017p996j0153j1996
49792F01107j3165j3714j3985j4241j4360j3969j2875j1246r433p697o256n314
$$ [...]
##END NTUPLES=NMR SPECTRUM
##END=
