##TITLE=NES1095_T12_9886966_kAx0Q6P168
##JCAMPDX= 6.0         $$ Bruker NMR JCAMP-DX V2.0
##DATA TYPE= NMR SPECTRUM
##DATA CLASS= NTUPLES
##ORIGIN= BRUKER
##OWNER= Administrator
$$ 1.72 TOPSPIN		Version 2.1
$$ 2016-08-28 18:13:06.289 -0500  Administrator@X
$$ Compression mode = diff/dup
##.OBSERVE FREQUENCY= 400.02188249412
##.OBSERVE NUCLEUS= ^1H
##.ACQUISITION MODE= SIMULTANEOUS (DQD)
##.ACQUISITION SCHEME= undefined
##.AVERAGES= 8
##.DIGITISER RES= 22
##SPECTROMETER/DATA SYSTEM= spect
##.PULSE SEQUENCE= zg30
##.SOLVENT NAME= COFFEE_meoh
##.SHIFT REFERENCE= INTERNAL, COFFEE_meoh, 1, 14.98509
##AUDIT TRAIL= $$ (NUMBER, WHEN, WHO, WHERE, PROCESS, VERSION, WHAT)
$$ ##TITLE= Audit trail, TOPSPIN		Version 2.1
$$ ##JCAMPDX= 5.01
$$ ##ORIGIN= Bruker BioSpin GmbH
$$ ##OWNER= Administrator
$$ $$ E:\/data/COFFEE/nmr/NES1095_T12_9886966_kAx0Q6P168/10/pdata/1/auditp.txt
$$ ##AUDIT TRAIL=  $$ (NUMBER, WHEN, WHO, WHERE, PROCESS, VERSION, WHAT)
(   1,<2016-08-28 18:12:59.273 -0500>,<Administrator>,<X>,<go>,<TOPSPIN 2.1>,
      <created by zg
	started at 2016-08-28 18:11:53.289 -0500,
	POWCHK enabled, PULCHK disabled,
       configuration hash MD5:
       21 0F 79 D6 B3 7B B4 F6 88 20 88 DB 03 48 BD 9F
       data hash MD5: 64K
       D0 8D 76 5B 4C D4 4C DA 54 F8 E6 94 9F 15 65 02>)
(   2,<2016-08-28 18:13:02.320 -0500>,<Administrator>,<X>,<proc1d>,<TOPSPIN 2.1>,
      <Start of raw data processing
       efp LB = 0 FT_mod = 6 PKNL = 1 PHC0 = 0 PHC1 = 0 SI = 32K 
       data hash MD5: 32K
       2C AA 82 F7 AB B0 42 35 45 B9 B1 BA D2 D1 CD 86>)
(   3,<2016-08-28 18:13:02.586 -0500>,<Administrator>,<X>,<proc1d>,<TOPSPIN 2.1>,
      <pk PHC0 = 87.29187 PHC1 = 0 
       data hash MD5: 32K
       7C FD 10 A4 8C 48 6A B6 43 DC 57 33 6D DD 37 89>)
(   4,<2016-08-28 18:13:02.695 -0500>,<Administrator>,<X>,<proc1d>,<TOPSPIN 2.1>,
      <abs ABSG = 1 
       data hash MD5: 32K
       83 0C EA 77 6E 32 63 F1 F4 94 CC B4 C5 EB C4 03>)
(   5,<2016-08-28 18:13:02.758 -0500>,<Administrator>,<X>,<proc1d>,<TOPSPIN 2.1>,
      <abs ABSG = 2 
       data hash MD5: 32K
       BF FD 79 8E E2 A5 D2 17 BB 59 D1 E5 8E 6E D1 34>)
(   6,<2016-08-28 18:13:02.804 -0500>,<Administrator>,<X>,<proc1d>,<TOPSPIN 2.1>,
      <abs ABSG = 3 
       data hash MD5: 32K
       C4 79 79 39 3B E7 15 35 36 C8 47 D4 7F A9 7B 68>)
(   7,<2016-08-28 18:13:02.867 -0500>,<Administrator>,<X>,<proc1d>,<TOPSPIN 2.1>,
      <abs ABSG = 4 
       data hash MD5: 32K
       F6 36 18 DD 0A A5 0C D3 5E 6F 85 03 19 07 97 77>)
(   8,<2016-08-28 18:13:02.914 -0500>,<Administrator>,<X>,<proc1d>,<TOPSPIN 2.1>,
      <abs ABSG = 5 
       data hash MD5: 32K
       72 40 69 C8 E6 E5 D7 EF 8B CA 9C FD 8A C8 FB E7>)
$$ ##END=
$$ 
$$ $$ hash MD5
$$ $$ 3F 13 9E BC 82 2C 40 C8 A7 C8 E0 F2 6E DA 92 A9
##$RELAX= 
##$RELAX= 
##$RELAX= 
##$RELAX= 
##$RELAX= 
##$RELAX= 
##$RELAX= 
$$ Bruker specific parameters
$$ --------------------------
##$DU= <E:\>
##$EXPNO= 10
##$NAME= <NES1095_T12_9886966_kAx0Q6P168>
##$PROCNO= 1
$$ [...]
150 150 150 150 150 150 150 150
##$TP07= 0
##$TPNAME0= <>
##$TPNAME1= <>
##$TPNAME2= <>
##$TPNAME3= <>
##$TPNAME4= <>
##$TPNAME5= <>
##$TPNAME6= <>
##$TPNAME7= <>
##$TPOAL= (0..7)
0.5 0.5 0.5 0.5 0.5 0.5 0.5 0.5
##$TPOFFS= (0..7)
0 0 0 0 0 0 0 0
##$TUNHIN= 0
##$TUNHOUT= 0
##$TUNXOUT= 0
##$USERA1= <user>
##$USERA2= <user>
##$USERA3= <user>
##$USERA4= <user>
##$USERA5= <user>
##$V9= 5
##$VALIST= <valist>
##$VCLIST= <CCCCCCCCCCCCCCC>
##$VD= 0
##$VDLIST= <DDDDDDDDDDDDDDD>
##$VPLIST= <PPPPPPPPPPPPPPP>
##$VTLIST= <TTTTTTTTTTTTTTT>
##$WBST= 2048
##$WBSW= 25
##$XGAIN= (0..3)
0 0 0 0
##$XL= 0
##$YL= 0
##$YMAX_a= 490337
##$YMIN_a= -421163
##$ZGOPTNS= <>
##$ZL1= 120
##$ZL2= 120
##$ZL3= 120
##$ZL4= 120
##$ABSF1= 14.98509
##$ABSF2= -5.573092
##$ABSG= 5
##$ABSL= 3
##$ALPHA= 0
##$AQORDER= 0
##$ASSFAC= 0
##$ASSFACI= 0
##$ASSFACX= 0
##$ASSWID= 0
##$AUNMP= <proc_prof1d_extract_pilot.lims>
##$AXLEFT= 0
##$AXNAME= <>
##$AXNUC= <1H>
##$AXRIGHT= 0
##$AXTYPE= 0
##$AXUNIT= <>
##$AZFE= 0.1
##$AZFW= 0.1
##$BCFW= 0
##$BC_mod= 0
##$BYTORDP= 0
##$COROFFS= 0
##$CY= 15
##$DATMOD= 1
##$DC= 0
##$DFILT= <>
##$DTYPP= 0
##$F1P= 0
##$F2P= 0
##$FCOR= 0.5
##$FTSIZE= 32768
##$FT_mod= 6
##$GAMMA= 0
##$GB= 0
##$INTBC= 1
##$INTSCL= 1
##$ISEN= 128
##$LB= 0
##$LEV0= 0
##$LPBIN= 0
##$MAXI= 10000
##$MC2= 0
##$MEAN= 0
##$ME_mod= 0
##$MI= 0
##$NCOEF= 0
##$NC_proc= -8
##$NLEV= 6
##$NOISF1= 0
##$NOISF2= 0
##$NSP= 0
##$NTH_PI= 0
##$NZP= 0
##$OFFSET= 14.98509
##$PC= 1
##$PHC0= 87.29187
##$PHC1= 0
##$PH_mod= 1
##$PKNL= yes
##$PPARMOD= 0
##$PPDIAG= 0
##$PPIPTYP= 0
##$PPMPNUM= 2147483647
##$PPRESOL= 1
##$PSCAL= 4
##$PSIGN= 0
##$PYNMP= <proc.py>
##$REVERSE= no
##$SF= 400.02
##$SI= 32768
##$SIGF1= 0
##$SIGF2= 0
##$SINO= 400
##$SIOLD= 32768
##$SPECTYP= <>
##$SREGLST= <1H.CDCl3>
##$SSB= 0
##$STSI= 32768
##$STSR= 0
##$SW_p= 8223.68421052631
##$SYMM= 0
##$S_DEV= 0
##$TDeff= 65536
##$TDoff= 0
##$TI= <>
##$TILT= no
##$TM1= 0
##$TM2= 0
##$TOPLEV= 0
##$USERP1= <user>
##$USERP2= <user>
##$USERP3= <user>
##$USERP4= <user>
##$USERP5= <user>
##$WDW= 1
##$XDIM= 32768
##$YMAX_p= 397656093
##$YMIN_p= -665878
##$CURPLOT= <Network HP LaserJet P1505>
##$CURPRIN= <$Network HP LaserJet P1505>
##$DFORMAT= <normdp>
##$LAYOUT= <+/1D_H.xwp>
##$LFORMAT= <normlp>
##$PFORMAT= <normpl>
##$SURQMSG= 1
$$ End of Bruker specific parameters
$$ ---------------------------------
##NTUPLES= NMR SPECTRUM
##VAR_NAME=  FREQUENCY,     SPECTRUM/REAL,   SPECTRUM/IMAG
##SYMBOL=    X,             R,               I
##VAR_TYPE=  INDEPENDENT,   DEPENDENT,       DEPENDENT
##VAR_FORM=  AFFN,          ASDF,            ASDF
##VAR_DIM=   32768,         32768,           32768
##UNITS=     HZ,            ARBITRARY UNITS, ARBITRARY UNITS
##FACTOR=    0.250966925370066, 1,           1
##FIRST=     8223.43324360094, 9000,         -192846
##LAST=      0,             -133360,         -75991
##MIN=       0,             -665878,         0
##MAX=       8223.43324360094, 397656093,    0
$$ Real data points
##PAGE= N=1
##DATA TABLE= (X++(R..R)), XYDATA
$$ [...]
19531a72720j0428A64550a72822j39360G6369J27273N8951a04047m3065B7427
$$ -172720 -183148 164550 -172822 -312182 76369 203642 262593 -104047 -147112 27427
19520a6200m5446k13069f7477B0962h4356m27560H3196a26568A92901K50181A15528
$$ -16200 -61646 -274715 -67477 20962 -84356 -511916 83196 -126568 192901 443082 115528
19508A44264b04643J1736j04095A90004c83630a64934N2145C3702a33682D4581
$$ 144264 -204643 -192907 -297002 190004 -383630 -164934 -112789 33702 -133682 44581
19497a79751M400e8394F0328a88398Q0385q3386H4370Q7960L1112b27000M5486
$$ -179751 -175351 -58394 60328 -188398 -108013 -191399 84370 172330 203442 -227000 -181514
19486a81514a1573o8134A61773d3184l22991g546B71959b49497a14285A9229c78591
$$ -181514 -11573 -79707 161773 -43184 -366175 -7546 271959 -249497 -114285 19229 -378591
19474a72016B17515m3907h6188B74592a27355j19818Q9564j78946g2108j23891
$$ -172016 217515 173608 -86188 274592 -127355 -247173 -157609 -336555 -72108 -195999
19464a95999a5254j12848m8975D7041m849k127J01444a61777L0821A09699c51672
$$ -195999 -15254 -128102 -177077 47041 42192 40065 141509 -161777 -130956 109699 -351672
19452A48521J35419a98859A64653h2073C4225M2362g3286C24867a06567d4968
$$ 148521 283940 -198859 164653 -82073 34225 76587 -73286 324867 -106567 -44968
19441A01653a45759n2633k6414a4026j34407A98497L5269A0370a17104L1608j59236
$$ 101653 -145759 -198392 -224806 -14026 -148433 198497 233766 10370 -117104 -85496 -244732
19430b44732n1713E9189g3402C9638c3020B38198q1146B1525J1678a29828b4965
$$ -244732 -296445 59189 -73402 39638 -33020 238198 157052 21525 33203 -129828 -24965
19418d4196B78276b0007I3182l5212R9099c8457A18704b70160i9807B51979A04676
$$ -44196 278276 -20007 93182 57970 157069 -38457 118704 -270160 -99807 251979 104676
19406d59880b01185c6482j31403F6395c23k73556f0952a2782q0170L0858j24720
$$ -459880 -201185 -36482 -167885 66395 -323 -273879 -60952 -12782 -92952 -62094 -186814
19395a86814j34023F0549a55342A21958e9423m27134P1466B79316H0436b0941
$$ -186814 -320837 60549 -155342 121958 -59423 -486557 -415091 279316 80436 -20941
19384e9372k65999B15768a45042a4401m17587I7704b44755d9769E4571P021a67578
$$ -59372 -325371 215768 -145042 -14401 -431988 97704 -244755 -49769 54571 61592 -167578
19372C5651A2726N4768a28379a6354A8176J35036a92590C13330d35855a65736
$$ 35651 12726 67494 -128379 -16354 18176 153212 -192590 313330 -435855 -165736
19361i0381a3664C21566b22273i3973D1613J09660R216e6437K1444A14014f2863
$$ -90381 -13664 321566 -222273 -93973 41613 151273 160489 -56437 -34993 114014 -62863
19349A52383a45786m0296g7512m03196b20562B22713f0616E4724a07115j68138
$$ 152383 -145786 -186082 -77512 -480708 -220562 222713 -60616 54724 -107115 -275253
19339b75253C9910a69031P1299L5403B25086H7991f5667E7194j9443h1185l8109
$$ -275253 39910 -169031 -97732 -62329 225086 87991 -65667 57194 37751 -81185 -119294
19328a19294K3783p0843c3459B24106e6571F7859k8788K23618d42741A37292J5092
$$ -119294 -95511 -166354 -33459 224106 -56571 67859 39071 262689 -442741 137292 152384
19317A52384a47698p8517a2274A14453a16927c9296l1058D6656J22347c4746q4326
$$ 152384 -147698 -226215 -12274 114453 -116927 -39296 -70354 46656 169003 -34746 -119072
19306a19072A4425b86042I7957a25748k30962B11024a12247r7695M9341A6206
$$ -119072 14425 -286042 97957 -125748 -356710 211024 -112247 -209942 -160601 16206
19295b0892j81358B1360h015A7015b41993C1778f5248j30058F6237j0152a99554
$$ -20892 -202250 21360 -8015 17015 -241993 31778 -65248 -195306 66237 56085 -199554
19283A42879a10793K6485j7060j65752B91450b19522P2127N2340A0577a75590
$$ 142879 -110793 -84308 -101368 -267120 291450 -219522 -147395 -95055 10577 -175590
19272b0596A5192b45245A68074C1297a28373O2781J7786l8062l83642D81775c77898
$$ -20596 15192 -245245 168074 31297 -128373 -65592 -47806 -85868 -469510 481775 -377898
19260e49521a84531N7676N6498H9598O9221a3960j06743F063b85736c8507A54913
$$ -549521 -184531 -126855 -70357 89598 158819 -13960 -120703 6063 -285736 -38507 154913
19248c06252M7814A10594b1051l53803B32869i2689I674a43124J3007M1965I38
$$ -306252 -258438 110594 -21051 -374854 232869 -92689 9674 -143124 -130117 -88152 938
19236B09285e8532n7236J3387B78315b79258a22722j01343a05100A0147b076A48466
$$ 209285 -58532 -115768 -102381 278315 -279258 -122722 -224065 -105100 10147 -2076 148466
19224b06697c5815D4559M6630a74886P932L0168e5654q1459l0001g485k16891
$$ -206697 -35815 44559 91189 -174886 -166954 -136786 -55654 -137113 -167114 -7485 -224376
19213b24376P6455L1514l9574I2689b04011k6435q3430q8523A2046b07738j37038
$$ -224376 -147921 -116407 -155981 92689 -204011 -230446 -313876 -402399 12046 -207738 -344776
19202c44776B54358a00573E1897q366a11288j0789k71408Q7435F4113a39647f4237
$$ -344776 254358 -100573 51897 43531 -111288 -122077 -393485 -306050 64113 -139647 -64237
19190A20111B044M39c14142n1860C12067d1753G111K3431j495a98341j06242e305
$$ 120111 2044 2483 -314142 -366002 312067 -41753 7111 30542 29047 -198341 -304583 -5305
19177b21494k88249a02700b4279k67171a24510j06086I3961a1579l3446C654N8277
$$ -221494 -509743 -102700 -24279 -291450 -124510 -230596 93961 -11579 -45025 3654 61931
19166F1931c38591J65817B09004b26756d2970o3067F3873b29722I1458a66033
$$ 61931 -338591 -172774 209004 -226756 -42970 -106037 63873 -229722 91458 -166033
19155b2036B9028b24508g5937E5690Q7265g4245c450p7222b023j29767o7415g8115
$$ -22036 29028 -224508 -75937 55690 142955 -74245 -3450 -80672 -2023 -131790 -199205 -78115
19142a6194H9102M1112B2663J21535A6802K9353d351j51787l1733E2488c94121
$$ -16194 89102 130214 22663 144198 16802 46155 -4351 -156138 -187871 52488 -394121
19130b77081A79074b49330i4119C30333b00668B19355f1204b4262B22248a99821
$$ -277081 179074 -249330 -94119 330333 -200668 219355 -61204 -24262 222248 -199821
19119G9264b26791f4821j80437a09622D8109d06264A6741b12706c556A29231L36977
$$ 79264 -226791 -64821 -245258 -109622 48109 -406264 16741 -212706 -3556 129231 466208
19108D66208a0102l7123J051A86671L1515a8313l9815H2186c6647j35630l8328
$$ 466208 -10102 -47225 -46174 186671 218186 -18313 -58128 82186 -36647 -172277 -210605
19097b10605G3937i2423L6460G8492a42186l55276a49341M2097N3399C3211L1752
$$ -210605 73937 -92423 -55963 78492 -142186 -497462 -149341 -107244 -53845 33211 64963
19086F4963c07071N4989C511c14696J26855p1340J18229j9063p2867Q4136e3262
$$ 64963 -307071 -252082 3511 -314696 -187841 -259181 -140952 -160015 -232882 -148746 -53262
19074C31110d2007C28257D1113b55907a07179L9345A38140a51426G2471J9912
$$ 331110 -42007 328257 41113 -255907 -107179 -67834 138140 -151426 72471 92383
19064I2383M3867E5016c2466C7936e3429A25373a83584k1373a2340D0743a4466
$$ 92383 136250 55016 -32466 37936 -53429 125373 -183584 -204957 -12340 40743 -14466
19052c43536C0799J30135J90364H5513b64940j60188a28512A12896C638a859A88584
$$ -343536 30799 160934 351298 85513 -264940 -425128 -128512 112896 3638 -1859 188584
19040c45972F1861L5611b13861p0736A17720b171k79719D4181b59187a3456L306
$$ -345972 61861 97472 -213861 -284597 117720 -2171 -281890 44181 -259187 -13456 -10150
19029a0150n8463B227i6216j09836A19158B2299d6482A06386a38049j0974j1903
$$ -10150 -68613 2227 -96216 -206052 119158 22299 -46482 106386 -138049 -149023 -160926
19018a60926k24016h4046L7834n977j7409B67498b02796E5592P403J20798b9140
$$ -160926 -384942 -84046 -46212 -52189 -69598 267498 -202796 55592 62995 183793 -29140
19006B07987d8284j42428d5880k77673B42166f9951k01229A70757g4824l4297
$$ 207987 -48284 -190712 -45880 -323553 242166 -69951 -271180 170757 -74824 -109121
18996a09121k90759P7940P4684L6482o5060l0709O2791i3707F431K20213b57485
$$ -109121 -399880 -321940 -247256 -210774 -275834 -306543 -243752 -93707 6431 226644 -257485
18984b43006a12770K7193m133F288Q7230j1962K382J33924R1184H42K54535K16713
$$ -243006 -112770 -85577 -89710 6288 93518 81556 83938 217862 309046 842 255377 472090
18972D72090a7615N599n514k0886j252B08442f5359k2647b1060B45416d7672j19081
$$ 472090 -17615 -12016 -17530 -38416 -39668 208442 -65359 -88006 -21060 245416 -47672 -166753
18960a66753I7692a01514r6306l31155d8204P834k41502c4589k9292j19700k812
$$ -166753 97692 -101514 -197820 -528975 -48204 -40370 -281872 -34589 -63881 -183581 -186393
18949a86393A24786b0847B61394a67136O7150d865j25608j73425A59098G2649
$$ -186393 124786 -20847 261394 -167136 -99986 -4865 -130473 -303898 159098 72649
18938b29522Q5039D1844J23891D3255a84698C50679N4065a84922f338B7144P5016
$$ -229522 -144483 41844 165735 43255 -184698 350679 404744 -184922 -6338 27144 102160
18927A02160J3610a3454j04686B35506B1983D371J18426B0082g0488D7152a33372
$$ 102160 115770 -13454 -118140 235506 21983 4371 122797 20082 -70488 47152 -133372
18915a58079N3536j83172m4563d6276A30934L84385A79649k2123k3577c75186
$$ -158079 -104543 -287715 -332278 -46276 130934 515319 179649 157526 133949 -375186
18904c53939K9930J35348e6823j39640c0496d208k0730l859m5649B74598a63312
$$ -353939 -324009 -188661 -56823 -196463 -30496 -4208 -24938 -28797 -74446 274598 -163312
18892F3219a87885j82053a0408H7669k0275k7244M3219J66126d02488A23493D6211
$$ 63219 -187885 -369938 -10408 87669 67394 40150 83369 249495 -402488 123493 46211
18880A64725a95365k01574N5855B09804a52246q8612a04234l2858D7923N368b27252
$$ 164725 -195365 -396939 -341084 209804 -152246 -240858 -104234 -137092 47923 53291 -227252
18868B54306k2165C1028K61253c4729B7192L2445a58409c0205m9939b0713q5442
$$ 254306 232141 31028 292281 -34729 27192 59637 -158409 -30205 -80144 -20713 -106155
18857a06155m1075J1051A8211K3108J24572l0805i3159q2967A26445Q1337a58899
$$ -106155 -147230 -136179 18211 41319 165891 135086 -93159 -176126 126445 207782 -158899
18845b10745K3098h7570A651a93573C54207i519r4270J6025j88926g0068j6437
$$ -210745 -187647 -87570 1651 -193573 354207 -9519 -103789 -87764 -276690 -70068 -86505
18834h6505k50836J60995j39613k9201A52064b4760j0368j20649B34396b56826
$$ -86505 -337341 -176346 -315959 -345160 152064 -24760 -35128 -155777 234396 -256826
18823d28769G4440l5058b76274B0317K48078d3230b11l6529j43246G5121C5170
$$ -428769 74440 39382 -276274 20317 268395 -43230 -211 -36740 -179986 75121 35170
18811c21989A89419b4858i735A99194a50123j1294A61237f9739A93073J6127P0228
$$ -321989 189419 -24858 -9735 199194 -150123 -161417 161237 -69739 193073 209200 279428
18800B79428E0270N025a68598G079J86355a2919C59971C5066a27084l6441g0429
$$ 279428 50270 55295 -168598 7079 193434 -12919 359971 35066 -127084 -163525 -70429
18788b9182A54016b1542j67122R0712m7304l404n8913O9851A7261J33482b55617
$$ -29182 154016 -21542 -188664 -97952 -145256 -148660 -207573 -137722 17261 150743 -255617
18776a36539o3037o9988j63428a45672I9210b92029g3671L2409q6425E0223a58665
$$ -136539 -199576 -269564 -432992 -145672 99210 -292029 -73671 -41262 -127687 50223 -158665
18764B39240A13934l4053a708l80199H7397d0645l34671a58788B7658c7168q5072
$$ 239240 113934 79881 -1708 -381907 87397 -40645 -375316 -158788 27658 -37168 -122240
18753a22240b1260j48417L4817F6903b296A2543b01449E2453b32465F5001J17382
$$ -122240 -21260 -169677 -134860 66903 -2296 12543 -201449 52453 -232465 65001 182383
18742A82383a11940F0105c36595A68089E3442a23775j00481j84045G4838c03383
$$ 182383 -111940 60105 -336595 168089 53442 -123775 -224256 -408301 74838 -303383
18731a68316c9290j49684B05851c5231A72961b66602F8819j1198e609j2862k52966
$$ -168316 -39290 -188974 205851 -35231 172961 -266602 68819 57621 -5609 -18471 -271437
18720b71437h9212k2743l895D6392A333a22791k20443a64816L4268j4851f3231
$$ -271437 -89212 -111955 -115850 46392 1333 -122791 -343234 -164816 -130548 -145399 -63231
18708i3920A831d3274A1577a30676e1110c700j66489A75202k2406b3239p2734
$$ -93920 1831 -43274 11577 -130676 -51110 -3700 -170189 175202 152796 -23239 -95973
18697i5973k4268k8191j8006O4155b6509k34980P7033g8250k4141K3541B29467
$$ -95973 -120241 -148432 -166438 -102283 -26509 -261489 -184456 -78250 -102391 -78850 229467
18685i1383A02697j1429a07464k9209f3756q275j44971h814k37015K6613A91517
$$ -91383 102697 91268 -107464 -136673 -63756 -72031 -217002 -8814 -245829 -219216 191517
18673a54176F7930h1479l6653j61882a37012n3922C5766J02885K9812F7613c59534
$$ -154176 67930 -81479 -118132 -280014 -137012 -190934 35766 138651 168463 67613 -359534
18661C07651F1265a163l7342j56507A64975a95025E41425f5402F8190J70492b73527
$$ 307651 61265 -1163 -38505 -195012 164975 -195025 541425 -65402 68190 238682 -273527
18649A48939M8650a89973n1257k04904P1218M3784J62918j23939A03197c2788
$$ 148939 197589 -189973 -241230 -446134 -374916 -331132 -168214 -292153 103197 -32788
18638B7101b34544C7520f0525C420d8235a2164F0205d8697k01238A37226A5793
$$ 27101 -234544 37520 -60525 3420 -48235 -12164 60205 -48697 -249935 137226 15793
18626C8304d92820h2449A61125a83243A64074a65528K0710A33720a93131E7748
$$ 38304 -492820 -82449 161125 -183243 164074 -165528 -144818 133720 -193131 57748
18615C2530P6656O3102c22472I0196j6127R6125b02647g6869B6081a4991C026
$$ 32530 109186 172288 -322472 90196 74069 170194 -202647 -76869 26081 -14991 3026
18603b5155l26604a13435D5581J48488a67885A86052a08651D4183G788J20670
$$ -25155 -351759 -113435 45581 194069 -167885 186052 -108651 44183 7788 128458
18593A28458a47366B8112L6855L9202b18874j4666k2119a7534p6141a1361j49185
$$ 128458 -147366 28112 64967 104169 -218874 -233540 -255659 -17534 -93675 -11361 -160546
18582a60546B51116c11873b4673m0884k12872K8238H9978a4847c029o3518A3392
$$ -160546 251116 -311873 -24673 -65557 -278429 -250191 89978 -14847 -3029 -66547 13392
18570d7127C704J19950b45198C69591b14008J01199j3356N6773l2728A23632E2244
$$ -47127 3704 123654 -245198 369591 -214008 -112809 -126165 -69392 -102120 123632 52244
18558f8044J9137A65683l3564a64645j53157B04607c4856k46903O1603i118A04117
$$ -68044 -48907 165683 132119 -164645 -317802 204607 -34856 -281759 -220156 -9118 104117
18546b69679D0346h6255b9619j67005A2396M5845d6291K2259j36752A33598O0953
$$ -269679 40346 -86255 -29619 -196624 12396 58241 -46291 -24032 -160784 133598 194551
18535A94551a25379A09733J01479b37671A94744c2807m0593l0623j59901f9785
$$ 194551 -125379 109733 211212 -237671 194744 -32807 -73400 -104023 -263924 -69785
18524H8489a70120o2137R4543l30216C6586J03989J07519c46868A7036c50523
$$ 88489 -170120 -232257 -137714 -467930 36586 140575 248094 -346868 17036 -350523
18513c65003O2293C7573a89479R128f2815b745l6440A13113J66426f8210l4499
$$ -365003 -302710 37573 -189479 -180351 -62815 -2745 -39185 113113 279539 -68210 -102709
18502a02709K5834l6730m2502k1917a0600m669k6592A47503b55324c8892D9711
$$ -102709 -76875 -113605 -156107 -178024 -10600 -15269 -41861 147503 -255324 -38892 49711
18490c87916A18348D5616h1306L3050k17435J3156A01324b5412n702o188r6394
$$ -387916 118348 45616 -81306 -48256 -265691 -252535 101324 -25412 -31114 -37302 -133696
18479a33696E02630b3602j01895I5396a82578H2774Q0789a14479B46076f9686
$$ -133696 502630 -23602 -125497 95396 -182578 82774 163563 -114479 246076 -69686
18468B7089d9237m63710i7862o8620A8138b31951c5856m5195f371A65707a32326
$$ 27089 -49237 -512947 -97862 -166482 18138 -231951 -35856 -81051 -6371 165707 -132326
18456b59147J02410A52168b10620c3527H1571K47959A7891a80510h2824D6094
$$ -259147 -156737 152168 -210620 -33527 81571 329530 17891 -180510 -82824 46094
18445B9784J80177a88922B9497b09591a4598p436A27272O208a30075A21179c52682
$$ 29784 209961 -188922 29497 -209591 -14598 -22034 127272 133480 -130075 121179 -352682
18433C31772a40224M4824b7522m3964A07175b20441H4788b9936G3654b46277j33404
$$ 331772 -140224 -95400 -27522 -71486 107175 -220441 84788 -29936 73654 -246277 -379681
18422c79681C5030c5389H9937J42773C3865Q5674b9637B317a35848F983h665F7200
$$ -379681 35030 -35389 89937 232710 33865 119539 -29637 2317 -135848 6983 -8665 67200
18409i3539M5019k0504k10994C71143c7679j01263H8281a89680H5915J22314C6041
$$ -93539 -48520 -69024 -280018 371143 -37679 -138942 88281 -189680 85915 208229 36041
18397a46388A23401c3925j01874g214B80559M3251a43582b682l9926j24537o330
$$ -146388 123401 -33925 -135799 -7214 280559 323810 -143582 -2682 -42608 -167145 -173475
18386a73475f3874m6766j77877O7770a2372k4079k23159p0501p9414I8235a76917
$$ -173475 -63874 -110640 -288517 -220747 -12372 -36451 -259610 -330111 -409525 98235 -176917
18374D5567K861f3943A20867e0402C7347a80836B16491a87298F6504K31316h4980
$$ 45567 48428 -63943 120867 -50402 37347 -180836 216491 -187298 66504 297820 -84980
18362A05958b69009b9025o3620K4881A01998b84367A66242a66905e284A7471a34897
$$ 105958 -269009 -29025 -92645 -67764 101998 -284367 166242 -166905 -5284 17471 -134897
18350A02192a52570p1344B023i5603j49927B6828a5569A47357c02946b0699p1523
$$ 102192 -152570 -223914 2023 -95603 -245530 26828 -15569 147357 -302946 -20699 -92222
18339i2222E8567b16270j01280A24218a31642A63517E3539c2703r9836J1025j03501
$$ -92222 58567 -216270 -317550 124218 -131642 163517 53539 -32703 -132539 -121514 -225015
18328b25015c032q6714J2289A74973c09388A01052B646a30702K458a668k47242
$$ -225015 -3032 -89746 -77457 174973 -309388 101052 2646 -130702 -128244 -1668 -248910
18317b48910B8442J29344e9572A95712b97195J39865G3109M0315a44659G0445
$$ -248910 28442 157786 -59572 195712 -297195 -157330 73109 113424 -144659 70445
18306a55349M7685A09241a93332a1758k49430A91006f2298A33827j6395a44215
$$ -155349 -107664 109241 -193332 -11758 -261188 191006 -62298 133827 117432 -144215
18295C6599a05898J5572A09350a20651I3970c5691G2779a61700A33535R791i28
$$ 36599 -105898 -90326 109350 -120651 93970 -35691 72779 -161700 133535 143326 -928
18283f2730k00361L7069i8305j38293f5152r1A45699j1915c37352D5430h70j29388
$$ -62730 -263091 -226022 -98305 -236598 -65152 -65243 145699 133784 -337352 45430 -870 -130258
18271a30258A01735J74714d5811A34508I28L42583D5763A8955d0079G5305g422
$$ -130258 101735 276449 -45811 134508 928 343511 45763 18955 -40079 75305 -7422
18259b08260F0589h8424A29912d9084l4955o4574C33935e798A0430J8567b0836
$$ -208260 60589 -88424 129912 -49084 -84039 -148613 333935 -5798 10430 28997 -20836
18247b62313i4299j03365H9118J34857o3809a79068d6524H9411B1622b04840A37431
$$ -262313 -94299 -197664 89118 223975 160166 -179068 -46524 89411 21622 -204840 137431
18235a06736M0077j5020o9377j20104a08410A41918f4640j03882N2914A71526
$$ -106736 -66659 -81679 -151056 -271160 -108410 141918 -64640 -168522 -115608 171526
18224b27090C55144c6627J7456H857h8313A3637a75353A65979D6671J507K25862
$$ -227090 355144 -36627 -19171 8857 -88313 13637 -175353 165979 46671 48178 274040
18213B74040h5114A52493c0352l3373H252L9587N6300C6703J57325f45169a41693
$$ 274040 -85114 152493 -30352 -63725 8252 47839 104139 36703 194028 -645169 -141693
18201e3311B56116A2590R6842M1083p2486c66467a41236E5581a19972A47961a20313
$$ -53311 256116 12590 109432 150515 78029 -366467 -141236 55581 -119972 147961 -120313
18189A88385E9441c56836A21331l1440a56928A1188a35586h46m4848F4170J68986
$$ 188385 59441 -356836 121331 89891 -156928 11188 -135586 -846 -45694 64170 233156
18178B33156L20938b27400J08549b4521k55614M0365a15251A46856a07559d8482
$$ 233156 554094 -227400 -118851 -24521 -280135 -239770 -115251 146856 -107559 -48482
18167a36480j5820B26489b09588J02988b0857A66902E2161c19555B4727a06063
$$ -136480 -152300 226489 -209588 -106600 -20857 166902 52161 -319555 24727 -106063
18156a04851C8077e37C60902E9025B0887J01751e9588A67467J9497c35856J41086
$$ -104851 38077 -537 360902 59025 20887 122638 -59588 167467 186964 -335856 -194770
18145a94770A69284m5288P2726L6691I8665b6137A42643d931F203d228j30281
$$ -194770 169284 123996 196722 233413 98665 -26137 142643 -4931 6203 -4228 -134509
18134a34509A92963K1507C0264K97748A5019a001D280J5385J57376b57112P9762
$$ -134509 192963 214470 30264 328012 15019 -1001 4280 19665 177041 -257112 -177350
18123a77350q3464D8212D12K63195C3400c77980c0629A59213J984J84187b33710
$$ -177350 -260814 48212 412 263607 33400 -377980 -30629 159213 161197 345384 -233710
18111B67257R3780a56648q6361h755j10579A38055b74345a31622M9075H331N4865
$$ 267257 361037 -156648 -243009 -8755 -119334 138055 -274345 -131622 -82547 8331 63196
18100F3196B0172a5206F2771g9278k16423b8968r5231e5263F9300b04014O7209
$$ 63196 20172 -15206 62771 -79278 -295701 -28968 -124199 -55263 69300 -204014 -136805
18089a36805B07145D3075H887J65492b67164G6647a81892A3891K06529l2585F7542
$$ -136805 207145 43075 8887 174379 -267164 76647 -181892 13891 220420 187835 67542
18077c01544J05293A19320J39812H2529C313g2629E2293a27197m3063A32362n1175
$$ -301544 -196251 119320 259132 82529 3313 -72629 52293 -127197 -170260 132362 81187
18066H1187R122g0623I4179m0555d1923k971A95675f7435k1512k507A11739C469
$$ 81187 90309 -70623 94179 53624 -41923 -44894 195675 -67435 -88947 -91454 111739 3469
18053E2752K0751P7139c7543r9633b8196r975r0309d7958j9560j3068n3814q8598
$$ 52752 73503 150642 -37543 -137176 -28196 -38171 -128480 -47958 -67518 -80586 -134400 -222998
18041b22998J4471G9462a28471G3196a76765j1422j18488A56031c2149r456C4292
$$ -222998 -208527 79462 -128471 73196 -176765 -188187 -306675 156031 -32149 -41605 34292
18029A07618b81064e5543A2642a00237a3448A77727A3736b70326a27832b3014
$$ 107618 -281064 -55543 12642 -100237 -13448 177727 13736 -270326 -127832 -23014
18018b23952A23948k4641b242B84277C243b32348E5762M983a3248E2307J01269
$$ -223952 123948 99307 -2242 284277 3243 -232348 55762 60745 -13248 52307 153576
18007A53576c8205k7263A39980L853d0532l0244j03789G1978b35756h204A51021
$$ 153576 -38205 -65468 139980 143833 -40532 -70776 -174565 71978 -235756 -8204 151021
17995H1204h6871m24485c0158j52279P8076o4295A01885J7715l8068H381a87775
$$ 81204 -86871 -511356 -30158 -182437 -104361 -168656 101885 119600 81532 8381 -187775
17983b51149A33472d8331n5999A07332e5177j90540k8578C35626I3922g0839e018
$$ -251149 133472 -48331 -104330 107332 -55177 -245717 -274295 335626 93922 -70839 -5018
17971g81k70663B78559i8274B4174c49918B31084d4732A60873P5176r6408n6691
$$ -781 -271444 278559 -98274 24174 -349918 231084 -44732 160873 236049 139641 82950
17960H2950J34977b8199K169Q42j20959A9494P2949N6487c50050M7575A69747
$$ 82950 217927 -28199 -26030 -25188 -146147 19494 92443 148930 -350050 -302475 169747
17948g3255A52089K8528a07764F1832l184J72579d16305C12272n883G9574c07127
$$ -73255 152089 180617 -107764 61832 58648 231227 -416305 312272 306389 79574 -307127
17936I2592a18894A66713c09645A5871a48093E6192m443P7127K85114A68781F3488
$$ 92592 -118894 166713 -309645 15871 -148093 56192 51749 128876 413990 168781 63488
17924b6350n4924m4992j95930B93851a30771A28196o1216e3120j73535H4743B3334
$$ -26350 -81274 -126266 -322196 293851 -130771 128196 66980 -53120 -226655 84743 23334
17912b43123R4821d9794b4649C545R3625a27790j135F3701a8191k65073a08521
$$ -243123 -148302 -49794 -24649 3545 97170 -127790 -128925 63701 -18191 -283264 -108521
17900a36910D4068c30890a19500E0528d5121d76A27304j0012n5390d2333A99227
$$ -136910 44068 -330890 -119500 50528 -45121 -476 127304 117292 61902 -42333 199227
17888A21738d1605B87504a81213B43671I4853b35473A57756b3406o6810C4891
$$ 121738 -41605 287504 -181213 243671 94853 -235473 157756 -23406 -90216 34891
17877a02803H7556J25576E4824a01980A3986a17395m8949M9881e0908A53629c21906
$$ -102803 87556 213132 54824 -101980 13986 -117395 -166344 -116463 -50908 153629 -321906
17865C77743B2381J54023b09559A76578Q7133j12520F0015M0759C5994O6367E0438
$$ 377743 22381 176404 -209559 176578 263711 151191 60015 100774 35994 102361 50438
17853a36600I9900d5067E0741a5845e280C02574j10599g1864B66786c53178C425
$$ -136600 99900 -45067 50741 -15845 -5280 302574 191975 -71864 266786 -353178 3425
17841e9642j85588m8436f1095r8128A76074l97q3979L1216Q5463c1624j7314N514
$$ -59642 -245230 -293666 -61095 -159223 176074 175677 91698 122914 208377 -31624 -48938 -43424
17829d3424m6011C00536A28187J62607A08449c17025f1687j45319i3176d4201
$$ -43424 -89435 300536 128187 290794 108449 -317025 -61687 -207006 -93176 -44201
17818g9527C3041R8438J71264c1306C1028J22408G1492L21401D6384K25406n6652
$$ -79527 33041 131479 302743 -31306 31028 153436 71492 392893 46384 271790 215138
17807B15138J19213G2140J37778b97539o7749B35884b60328D07065F2372c25143
$$ 215138 334351 72140 209918 -297539 -365288 235884 -260328 407065 62372 -325143
17796F6413i2242C62438b46937e3375G7295c4349B11520a49318C12801a82158
$$ 66413 -92242 362438 -246937 -53375 77295 -34349 211520 -149318 312801 -182158
17785I4349J18748b31968A8062J42084i7240A03926J1171J23660h8880B06693
$$ 94349 213097 -231968 18062 160146 -97240 103926 115097 238757 -88880 206693
17774a49851A7716R5369K230r361D2416J58533a6908C4166a81222F0093d8045
$$ -149851 17716 113085 115315 105954 42416 200949 -16908 34166 -181222 60093 -48045
17762H9089J50885d5802J8974I1613p723B4299c87281a08386l4743o7997j48916
$$ 89089 239974 -45802 -26828 91613 83890 24299 -387281 -108386 -143129 -211126 -360042
17751c60042b3208o8140k63112J41515b8818A7641i9901F7600a39839F0730d9838
$$ -360042 -23208 -91348 -354460 -212945 -28818 17641 -99901 67600 -139839 60730 -49838
17739a51341b0910R015k23277c3978A61526o2771R1378a4509A95442l8535E4020
$$ -151341 -20910 -11895 -235172 -33978 161526 98755 190133 -14509 195442 156907 54020
17727B53749m6520q4369m8573P4911J65390A3594L72046a4187I1790N0803L5590
$$ 253749 207229 122860 74287 149198 314588 13594 385640 -14187 91790 142593 178183
17716A78183J04956B6790g8089B24177K054J84199D8797P1221K9032j9256m8742
$$ 178183 283139 26790 -78089 224177 226231 410430 48797 120018 149050 129794 81052
17705H1052N887D0427b93360a7407I4277O9320j4347J41977b151B92296E346J2152
$$ 81052 86939 40427 -293360 -17407 94277 163597 149250 291227 -2151 292296 5346 17498
17693A7498f7847B1584g1184j48830C20581D4548J73595L8170A17616J12469l0717
$$ 17498 -67847 21584 -71184 -220014 320581 44548 218143 256313 117616 230085 199368
17682A99368F0294b6755j03851b4779B91215o6408l2883a32387A0521f0202A0332
$$ 199368 60294 -26755 -130606 -24779 291215 224807 191924 -132387 10521 -60202 10332
17670B99303j44176D2253i5624q7762M4573B22825H5158C1987D799O5265O2262
$$ 299303 155127 42253 -95624 -183386 -138813 222825 85158 31987 4799 70064 132326
17659A32326r567a13962a1068A81637h2434A98671n9424n2496k9302K7907A7965
$$ 132326 122759 -113962 -11068 181637 -82434 198671 139247 86751 57449 85356 17965
17647H570J12472L68222H6375h1459A71463c8693A00851b12953J05912e0242C54103
$$ 8570 121042 489264 86375 -81459 171463 -38693 100851 -212953 -107041 -50242 354103
17635C50987I2486J90643d9225C06901j27723J37513g2793B94439A34506d1973
$$ 350987 92486 283129 -49225 306901 179178 316691 -72793 294439 134506 -41973
17624B1485N5546B7039n115a45950b3530B6755c1833J5643p2000D65793A91975
$$ 21485 77031 27039 21924 -145950 -23530 26755 -31833 -16190 -88190 465793 191975
17612A11904J58801a28477A90757K1690o7594M0445a89494d1714n5463A81165
$$ 111904 270705 -128477 190757 212447 144853 185298 -189494 -41714 -97177 181165
17601E3649J05896E8279c7940a1806p4838B18638K2928A8139J27583e6908o544
$$ 53649 159545 58279 -37940 -11806 -86644 218638 241566 18139 145722 -56908 -63452
17590f3452B54301l9790B2041R2955b3734m2676K5322B60653I2699P3712k3050
$$ -63452 254301 214511 22041 114996 -23734 -66410 -41088 260653 92699 166411 143361
17579A43361a38982j03795H5515D514P242a91260P5584F8082J43864a59666b5012
$$ 143361 -138982 -242777 85515 4514 11756 -191260 -115676 68082 211946 -159666 -25012
17567G6349P5075H372O0565B0407L42261A30105n2849O3692q065O3220n1414M029
$$ 76349 151424 8372 68937 20407 362668 130105 77256 140948 132883 196103 144689 148718
17555A48718m3608b5023k34779A72799p1298a74916H8596K54566F2975a5591A15994
$$ 148718 105110 -25023 -259802 172799 101501 -174916 88596 343162 62975 -15591 115994
17543B40597G7518a06229G0146J23905c3028B75336D0920R5302K2425J0247L10456
$$ 240597 77518 -106229 70146 194051 -33028 275336 40920 136222 158647 168894 479350
17532D79350j28165A53744k2122K02408j35591E3221M38373Q460K23914j71930
$$ 479350 351185 153744 131622 334030 198439 53221 491594 500054 723968 552038
17522E52038k309n833K4092a93254C62576j63440M9147D8987Q6141J92231J0711
$$ 552038 549729 543896 567988 -193254 362576 199136 248283 48987 135128 327359 338070
17511C38070O7966K24698J54809l7484k59767r1594m8201J3784j42429A07013
$$ 338070 406036 630734 785543 748059 488292 396698 348497 362281 219852 107013
17500C47682M9527j94885K98487E4374L10291N2616j24305O8510D2008J8818j3317
$$ 347682 397209 202324 500811 54374 364665 417281 292976 361486 42008 60826 47509
17489D7509Q6786K96103j80288J53486j40844A12470J36498o9222o0958J68694
$$ 47509 134295 430398 250110 403596 262752 112470 248968 179746 118788 287482
17479B87482f3512A7827n927a21383E3595N29135j84597b12576b8163B32120C9233
$$ 287482 -63512 17827 11900 -121383 53595 582730 398133 -212576 -28163 232120 39233
17467D43728A38044a83057E8254O7974L03396H8389J79596Q6446c0503B29569
$$ 443728 138044 -183057 58254 126228 429624 88389 267985 354431 -30503 229569
17456I5795H61K99049q9012o255n096J17853b4370B73830b8284I1146K50334J09372
$$ 95795 861 299910 210898 204643 199547 317400 -24370 273830 -28284 91146 341480 450852
17444D50852A74724q2861a1003B6047k291N4302R4194J07392J47130A80021e2959
$$ 450852 174724 91863 -11003 26047 23756 78058 172252 279644 426774 180021 -52959
17432A18577J8474F5361J95785K5653P2756I5496P9820K27496A89256L2805j3287
$$ 118577 137051 65361 261146 286799 359555 95496 175316 402812 189256 222061 208774
17421B08774a78183C17194c334B59417m2237p9917L477b9578B22470I7947i0535
$$ 208774 -178183 317194 -3334 259417 217180 137263 140740 -29578 222470 97947 -90535
17409A91274k2992K40692K3179M8195a96187A14612B4497J86896a07807B25814
$$ 191274 168282 408974 432153 480348 -196187 114612 24497 211393 -107807 225814
17398A19933J90960A49827e765A25423J27477o4260J04560K7466n8732C782N57354
$$ 119933 310893 149827 -5765 125423 252900 188640 293200 320666 261934 3782 561136
17387E61136k35090F878J81262K24453I9006l2423J64685F6973K20129p632F5134
$$ 561136 326046 6878 188140 412593 99006 66583 231268 66973 287102 279470 65134
17375B06290N8402O0605L341J01661r6535E1391N33829k19735P0422F8895e7213
$$ 206290 264692 325297 328638 430299 333764 51391 585220 365485 435907 68895 -57213
17363B40891A02415a29973B42237d5730H5364I044l230K46691F9372L94082A23545
$$ 240891 102415 -129973 242237 -45730 85364 9044 5814 252505 69372 463454 123545
17351d8102j8805B12636b76431A98113J2839P3228A40879M2853K44923A36256
$$ -48102 -66907 212636 -276431 198113 210952 284180 140879 183732 428655 136256
17340i8415m389C31204A59207J31129k8864J15627A78695K11985E1339J80149
$$ -98415 -102804 331204 159207 290336 261472 377099 178695 390680 51339 231488
17330B31488J81598A41337n0113l8777c3345B77355A33406a31813B6573c6655
$$ 231488 413086 141337 91224 52447 -33345 277355 133406 -131813 26573 -36655
17319B62772G6915M76606A37125a57609C54424M5004Q435j63A79109O303o1947
$$ 262772 76915 553521 137125 -157609 354424 399428 407863 407700 179109 185412 123465
17308A23465J09563j11292k5469J26555G3796i2872B81430a08983A20144J60890
$$ 123465 233028 121736 96267 222822 73796 -92872 281430 -108983 120144 281034
17298B81034m1393J74918b43619B25995j07886K59567p7606m6705K60903B00798
$$ 281034 239641 414559 -243619 225995 118109 377676 300070 253365 514268 200798
17287F34617B33440A07476J02067J28272J42804l4292K8210n213J1070A0619R1691
$$ 634617 233440 107476 209543 337815 480619 446327 474537 469324 480394 10619 102310
17276A02310J95907J32791r9885A3522h6602A47208e4275F9387L66257A96397
$$ 102310 298217 431008 331123 13522 -86602 147208 -54275 69387 435644 196397
17265F46468a68344A35466B4599R9126d6203C33854j10561q2842L59359B02959
$$ 646468 -168344 135466 24599 123725 -46203 333854 223293 140451 499810 202959
17254F6968K87500j45832I1240Q777J15539I5231J57566l8744q5316L14901L5511
$$ 66968 354468 208636 91240 100017 215556 95231 252797 214053 128737 443638 479149
17243D79149j71492n9571K42693j74605C0263Q2239N7005m2967l757L21840o9183
$$ 479149 307657 248086 490779 316174 30263 112502 169507 126540 122783 444623 375440
17232C75440j39292k8560R0869L2679A39025J1477N8863A02174K79259c5415A18317
$$ 375440 236148 207588 298457 331136 139025 150502 209365 102174 381433 -35415 118317
17220A16298K20239N045J20615r9225R63Q2808F2172b5633C15386J67231j02826
$$ 116298 336537 341582 462197 362972 363935 446743 62172 -25633 315386 482617 379791
17209C79791G1067K24964j04266E2959c962D41904G8968c4412F8196J72898P5805
$$ 379791 71067 296031 191765 52959 -3962 441904 78968 -34412 68196 241094 316899
17198C16899M7052j39477Q7184J12041R4810n8903o3106Q9222B01682J77481e7260
$$ 316899 363951 224474 311658 423699 518509 459606 396500 485722 201682 379163 -57260
17186E86588m3705L0179k40029A32415K89028q3321j1243A48682N21417j08253
$$ 586588 542883 573062 333033 132415 421443 338122 326879 148682 670099 561846
17176E61846j41636p8395j5324K08821J08650j54924I0405m4913J88823M0476
$$ 561846 420210 341815 326491 535312 643962 489038 90405 45492 234315 274791
17166B74791K85495j84527m0163o441K1386J6131n8653L39862B47499M45897B79008
$$ 274791 560286 375759 335596 329155 350541 366672 308019 647881 247499 693396 279008
17154B87458J1921Q362Q6340j42467q7012N09719C20340L06063k62433N7121K20605
$$ 287458 299379 307741 394081 251614 164602 674321 320340 626403 363970 421091 641696
17143F41696B80610K03119A71482L40956M8662j44507J43228J7149k55006K73187
$$ 641696 280610 483729 171482 512438 561100 416593 559821 576970 321964 595151
17133E95151k06824p4158J46552J04824A70377K53477J87207A74469R7661N40350
$$ 595151 388327 314169 460721 565545 170377 423854 611061 174469 272130 812480
17123H12480A04347L42362A23365K88500K51114p4467k8822N4670k77430K86412
$$ 812480 104347 446709 123365 411865 662979 588512 559690 614360 336930 623342
17113F23342J52550C64528L18510C17125l6472L05919L7218j95974M2954j06606
$$ 623342 775892 364528 683038 317125 280653 586572 623790 427816 470770 364164
17103C64164k5661K33454B78511K11819p8075j40624L45939i486D93089L86769
$$ 364164 338503 571957 278511 490330 412255 271631 617570 -9486 493089 879858
17093H79858j79928m0406k0814j27866J09882j65502J91314M3618m3300k67193
$$ 879858 699930 659524 638710 510844 620726 455224 646538 690156 646856 379663
17083C79663J14062A87854N10556j26774r9228J41842j33607J17897M6436J20806
$$ 379663 493725 187854 698410 571636 472408 614250 480643 598540 644976 765782
17073G65782C20538J31503J17651J37812r9197k71857K46654l3080K21372j30036
$$ 765782 320538 452041 569692 707504 608307 336450 583104 550024 771396 641360
17063F41360J2735J28936l20878M39863k34551l0427J17105k18327J87088q4267
$$ 641360 654095 783031 462153 902016 667465 637038 754143 535816 722904 638637
17053F38637K07349q1635p1473k12850L42342J94983k56270J5392k58645L01697
$$ 638637 845986 764351 692878 480028 822370 1017353 761083 776475 517830 819527
17043H19527J10549j18115k19004q1631J48082n9158K12441N5429j13160r6642
$$ 819527 930076 811961 592957 511326 659408 600250 812691 868120 754960 658318
17033F58318M07033m46223K09166K39432l74823j4097J59526k33345K60235j8810
$$ 658318 1065351 619128 828294 1067726 692903 678806 838332 604987 865222 846412
17023H46412L4098k10049L98184k66698K04037j57153j18670j202L99299l43346
$$ 846412 880510 670461 1068645 801947 1005984 848831 730161 728959 1128258 784912
17013G84912J85408m74700o787O32624m35127J45593R9290P4183k02880j67382
$$ 784912 970320 495620 488833 1121457 686330 831923 931213 1005396 802516 635134
17003F35134J00170N85959m77196P8169J50543J92245l22120k61059M32754J4447
$$ 635134 735304 1321263 844067 922236 1072779 1265024 942904 681845 1114599 1129046
16993A129046k68821J49908J25023k37270M55454n78436L45542j78422K6201K64595
$$ 1129046 860225 1010133 1135156 897886 1353340 774904 1120446 942024 968225 1232820
16983A232820K1083n31517N72066k88297n245P0685l1057N54032j31697m43089
$$ 1232820 1253903 722386 1294452 1006155 1000910 1071595 1040538 1594570 1462873 1019784
16973A019784L07522j99646j26624J80239j71824K40482P0635k42854L77164l41831
$$ 1019784 1327306 1127660 1001036 1181275 1009451 1249933 1320568 1077714 1454878 1113047
16963A113047M23428R4878k01237K66312k48250J0916q2876o3717K05094m4796
$$ 1113047 1536475 1631353 1430116 1696428 1448178 1459094 1376218 1312501 1517595 1472799
16953A472799k06481K94556K95017n50810J61789J65559m34243K50726K32021
$$ 1472799 1266318 1560874 1855891 1305081 1466870 1632429 1198186 1448912 1680933
16944A680933o896j69178J75857J44221l18242N0675J28814o8279O5610o7565
$$ 1680933 1674037 1504859 1680716 1824937 1506695 1557370 1686184 1617905 1683515 1615950
16934A615950J90977l1767m8771J03550J25882j67605L28433m71872m1113N9212
$$ 1615950 1806927 1775160 1726389 1829939 1955821 1788216 2116649 1644777 1603664 1662876
16924A662876K05566j11907M03989j92225J71207n7081J93036n9715j96342j24715
$$ 1662876 1868442 1756535 2160524 1968299 2139506 2082425 2275461 2215746 2019404 1894689
16914A894689L50197J41672m80004J02667J75419J50078Q6270m2016j7323l4193
$$ 1894689 2244886 2386558 1906554 2009221 2184640 2334718 2420988 2378972 2361649 2327456
16904B327456O6454N173j44228N3085M6257K62108k26159J03214j6284N046j8858
$$ 2327456 2393910 2399083 2254855 2307940 2354197 2616305 2390146 2493360 2477076 2482122 2463264
16893B463264J86587j63884M01797j24241q4547K52435K8909k58063J44275K86340
$$ 2463264 2649851 2485967 2887764 2763523 2678976 2931411 2960320 2702257 2846532 3132872
16883C132872l39581L89079j73735K62529l7958j58439K69252N146q9069J92025
$$ 3132872 2793291 3182370 3008635 3271164 3233206 3074767 3344019 3349165 3260096 3452121
16873C452121L6652Q6311L44254l23312j31880N66081N6882k89341j92846K09137
$$ 3452121 3488773 3575084 3919338 3596026 3464146 4030227 4087109 3797768 3604922 3814059
16863C814059j3284K98368K0186l6850J12793L32449k8153n6050j31818K26812
$$ 3814059 3800775 4099143 4119329 4082479 4195272 4527721 4499568 4443518 4311700 4538512
16853D538512J68358k13339q4496L42849L17535l14523K05586M32398Q4891q7469
$$ 4538512 4706870 4493531 4409035 4751884 5069419 4754896 4960482 5392880 5477771 5390302
16843E390302o46908R36945j08431J15723L20592k62431J85532L30078J42484
$$ 5390302 4743394 5680339 5571908 5687631 6008223 5745792 5931324 6261402 6403886
16834F403886J064j42392J77763J8763L68282j16891K69676j22016N34883J67962
$$ 6403886 6404950 6262558 6440321 6459084 6827366 6710475 6980151 6858135 7393018 7560980
16824G560980J64976R4359k2978M52196P2248j98857N58817j08047L48258J16087
$$ 7560980 7725956 7820315 7797337 8249533 8321781 8122924 8681741 8573694 8921952 9038039
16814I038039J30654N04204r3770r9283L55992M02995J93910L05394L20971L69904
$$ 9038039 9168693 9672897 9579127 9479844 9835836 10238831 10432741 10738135 11059106 11429010
16804A1429010K37008N5838L0005Q83648j42616L17990L99610J8472N98634L23471
$$ 11429010 11666018 11721856 11751861 12635509 12492893 12810883 13210493 13228965 13827599 14151070
16794A4151070K81339L46548J17868M63442O73819K58312O79362N94700L0228
$$ 14151070 14432409 14778957 14896825 15360267 16034086 16292398 16971760 17566460 17596688
16785A7596688M41828R62237O6460N82780P33675N18671O76990P25214N53080
$$ 17596688 18038516 19000753 19067213 19649993 20383668 20902339 21579329 22304543 22857623
16776B2857623K58204Q58050R06537O60428O67641Q21002J200493O71608J116967
$$ 22857623 23115827 23973877 24880414 25540842 26208483 27029485 28229978 28901586 30018553
16767C0018553Q30719N02140J259354J099951Q75737Q39124J540910J432271L51733
$$ 30018553 30849272 31351412 32610766 33710717 34586454 35425578 36966488 38398759 38750492
16758C8750492J870405J099936J560781J246099J314759J427485J615421J535381
$$ 38750492 40620897 41720833 43281614 44527713 45842472 47269957 48885378 50420759
16750E0420759J654422J577505J441426J746310J933064J471471J535510J637209
$$ 50420759 52075181 53652686 55094112 56840422 58773486 60244957 61780467 63417676
16742F3417676J865784J656055J311093K058222J065311J687547J568986J166571
$$ 63417676 65283460 66939515 68250608 70308830 71374141 73061688 74630674 75797245
16734G5797245J502691N79506J086788J038421N59242O24747Q40885P049J52392
$$ 75797245 77299936 77879442 78966230 80004651 80563893 81188640 82029525 82036574 82188966
16725H2188966J66680q1389m36170m09679o51914q91979r13847j256508q96269
$$ 82188966 82355646 82274257 81838087 81428408 80776494 79884515 78970668 77714160 76817891
16716G6817891r58246j315390j551506j207012j832593j245945j700271j745183
$$ 76817891 75859645 74544255 72992749 71785737 69953144 68707199 67006928 65261745
16708F5261745j461685j633161j859626j354277j862533j586273j682609j597058
$$ 65261745 63800060 62166899 60307273 58952996 57090463 55504190 53821581 52224523
16700E2224523j081697j742689j215424j350932j767165r94756j546094j260599
$$ 52224523 51142826 49400137 48184713 46833781 45066616 44071860 42525766 41265167
16692D1265167j330597q92991j306622j147172j219374r34409q54245j003375
$$ 41265167 39934570 39041579 37734957 36587785 35368411 34434002 33579757 32576382
16684C2576382j243022o12912r37319q93262o58331j158848l60091j030000n64145
$$ 32576382 31333360 30720448 29783129 28889867 28231536 27072688 26712597 25682597 25118452
16675B5118452o08810p68958q35949k93799n74021q61767l35391m37257p82184
$$ 25118452 24509642 23740684 22904735 22610936 22036915 21175148 20839757 20402500 19620316
16666A9620316m52777m48925o88030m9773o12393k41435m32423o01504l71694
$$ 19620316 19167539 18718614 18030584 17980811 17368418 17126983 16694560 16093056 15721362
16657A5721362j12396n93995p2183l19680p51293j9014l89575J55382q54003m03203
$$ 15721362 15608966 15014971 14942788 14623108 13871815 13852801 13463226 13618608 12764605 12361402
16647A2361402J71413m65916k1170p8567m05144m07470j97237k03122l08211p2834
$$ 12361402 12532815 12066899 12045729 11967162 11562018 11154548 10957311 10754189 10445978 10373144
16637A0373144l53906o5131k64504j89715l14773K05316k28499n33727J11115
$$ 10373144 10019238 9954107 9689603 9499888 9185115 9390431 9161932 8628205 8739320
16628H739320j82305l06177L80965n68937J4144j67069j77463j27128o8561k33542
$$ 8739320 8557015 8250838 8631803 8062866 8077010 7909941 7732478 7605350 7536789 7303247
16618G303247J54522l68636P0589j34477j72439k37359K4396q2439k7117k47576
$$ 7303247 7457769 7089133 7159722 7025245 6852806 6615447 6639843 6557404 6530287 6282711
16608F282711l65086M37114j56690k34976O9031r4568j31352j83996n83165N59288
$$ 6282711 5917625 6354739 6198049 5963073 6032104 5937536 5806184 5622188 5039023 5598311
16598E598311j47500j87504K0892l97973M01203m60388J95048j85490k71826J48383
$$ 5598311 5450811 5263307 5284199 4886226 5287429 4827041 5022089 4836599 4564773 4713156
16588D713156L0088k19124l9142j04500M0525j06284J43847k03124K30197m02654
$$ 4713156 4743244 4524120 4484978 4380478 4421003 4314719 4458566 4255442 4485639 4082985
16578D082985o1207K62621j93001j41094n0302K17973O5893l83822j45849K10475
$$ 4082985 4021778 4284399 4091398 3950304 3900002 4117975 4183868 3800046 3654197 3864672
16568C864672K6P9431k21654j03385J9198k98839J93776o6936j92026L72908k90128
$$ 3864672 3864698 3944129 3722475 3619090 3638288 3339449 3533225 3466289 3274263 3647171 3357043
16557C357043r9396O4895l12131K62284j18147o9635K89753m51556M2090K10127
$$ 3357043 3257647 3322542 3010411 3272695 3154548 3084913 3374666 2923110 2965200 3175327
16547C175327k25715j2767K20578m54600M32434k87055K35077l86263M06417l09423
$$ 3175327 2949612 2936845 3157423 2702823 3135257 2848202 3083279 2697016 3103433 2794010
16537B794010l16820Q2501K91960O2586j87395p2155k58723J06372J52203k18073
$$ 2794010 2477190 2559691 2851651 2914237 2726842 2654687 2395964 2502336 2654539 2436466
16527B436466j52100o8147Q7417K2348Q3453q679J75505j43707J09165l93154
$$ 2436466 2284366 2216219 2303636 2325984 2409437 2400758 2576263 2432556 2541721 2148567
16517B148567L25238k04470m3579m5490n054J49681k62543L52235l27054K38650
$$ 2148567 2473805 2269335 2225756 2180266 2175212 2324893 2062350 2414585 2087531 2326181
16507B326181j1455O3166m02805J19135k27388J12568K882K18757j58368k66583
$$ 2326181 2314726 2377892 1975087 2094222 1866834 1979402 1982284 2201041 2042673 1776090
16497A776090L82399j10302Q2029M5562k50791K18673k10210p8178j63365O9444
$$ 1776090 2158489 2048187 2130216 2175778 1924987 2143660 1933450 1855272 1691907 1761351
16487A761351O9427l63879P4756J69978l36085N35497j90520l62719L05873K37422
$$ 1761351 1830778 1466899 1541655 1711633 1375548 1911045 1720525 1357806 1663679 1901101
16477A901101k15541m8487R5118K57610n17247K24621J24180l24486k489L56111
$$ 1901101 1685560 1637073 1732191 1989801 1472554 1697175 1821355 1496869 1494380 1850491
16467A850491m40546k18227K39971K51835k5827J7132r4107L8116k9822k97430
$$ 1850491 1409945 1191718 1431689 1683524 1657697 1674829 1580722 1618838 1589016 1291586
16457A291586L93914k45296K13576k22043j29639r3476K12696j59434O8185J82348
$$ 1291586 1685500 1440204 1653780 1431737 1302098 1208622 1421318 1261884 1330069 1512417
16447A512417J11009j09126o28745N20787P0405p4719J61918k01866l66191M51154
$$ 1512417 1623426 1514300 885555 1406342 1476747 1402028 1563946 1362080 995889 1447043
16437A447043k46256N8558J95212k44398k4953j13648L68517j50605J72003k04038
$$ 1447043 1200787 1259345 1454557 1210159 1185206 1071558 1440075 1289470 1461473 1257435
16427A257435j9323L363m17J0400K7932j93290O5773K96473k15728m46850m0046
$$ 1257435 1238112 1241475 1241058 1251458 1279390 1086100 1151873 1448346 1232618 785768 745722
16416G45722L00624N460R0946q3879m1653L3553j3567m1074L10774j1436N2272
$$ 745722 1046346 1051806 1142752 1058873 1017220 1050773 1037206 996132 1306906 1295470 1347742
16405A347742k81037K03402j12477j98954K04616k86691M10016l13362j30994
$$ 1347742 1066705 1270107 1157630 958676 1163292 876601 1286617 973255 842261
16396H42261J07766N90701n18399M3531k4165k13938N3129J02592N1202J38211
$$ 842261 950027 1540728 1022329 1065860 1041695 827757 880886 983478 1034680 1172891
16386A172891l6793k46349j4132O2025J02890p1836K33836k27955K05000k45224
$$ 1172891 1136098 889749 875617 937642 1040532 968696 1202532 974577 1179577 934353
16376I34353m7738k96599N47693k08336o9289M5456m9374r8022L31953k49784
$$ 934353 886615 590016 1137709 929373 860084 905540 856166 758144 1090097 840313
16366H40313K0634N5220M63949o34773K78278K3562k70304J70164j97952K29076
$$ 840313 860947 916167 1380116 745343 1023621 1047183 776879 947043 749091 978167
16356I78167k83739J72322j31663j20147L37322j48160l4966o8866K14382j16409
$$ 978167 694428 866750 735087 614940 952262 804102 769136 700270 914652 798243
16346G98243K52056k92768J88657j30207J58266J1271j218k26589n2342l39480
$$ 798243 1050299 757531 946188 815981 974247 985518 984300 757711 705369 365889
16336C65889L89282N230K04064L14255o20315j18954M50605j12240j9122l59653
$$ 365889 755171 760401 964465 1278720 658405 539451 990056 877816 858694 499041
16326D99041K86937Q6231m8302k1658C17011L37129k83501L06500J04624R4377
$$ 499041 785978 872209 823907 802249 317011 654140 370639 677139 781763 876140
16316H76140j78217K65212m73872K41465j13790J04706K56232k09534J23235l47071
$$ 876140 697923 963135 489263 730728 616938 721644 977876 768342 891577 544506
16306E44506J38902K39472l84641K66515J58637k28429R2888l18207J95752O10
$$ 544506 683408 922880 538239 804754 963391 734962 827850 509643 705395 706005
16296G06005k12689L6491r4674J00770R178j23724K77011k14266J71408J31834
$$ 706005 493316 529807 435133 535903 545081 421357 698368 484102 655510 787344
16286G87344k79637K1289k0260o095J25461N3526j36638k56574J73727J35433
$$ 787344 507707 528996 508736 502641 628102 681628 544990 288416 462143 597576
16276E97576r6336K10701l13419J24778K26909r8757A34740P06043l18867L43726
$$ 597576 501240 711941 398522 523300 750209 651452 134740 840783 521916 865642
16266H65642k76871Q9689P9886k71528n1082L1770J9118A69531L92913q228J70506
$$ 865642 588771 678460 758346 486818 435736 467506 486624 169531 562444 554216 724722
16255G24722D1269Q6134K51898K75678k71466J89469L8750R015n1727J41821l37614
$$ 724722 41269 127403 379301 654979 383513 572982 611732 620747 569020 710841 373227
16244C73227K82328k80895J56075R902J1456P7673j81068J17125j78783K25036
$$ 373227 655555 374660 530735 540637 552093 629766 448698 565823 387040 612076
16234F12076K01649j25532B77879l8859M52126j64900l6175K84808k61477B18836
$$ 612076 813725 688193 277879 239020 691146 526246 490071 774879 513402 218836
16223A41257M6146M25295B40120M80439B06721O3776J4167L35813A80135K40268
$$ 141257 187403 612698 240120 720559 206721 270497 284664 620477 180135 420403
16213D20403K5322M35589A08543K09802P4313J41760k12909K38705k54142J16910
$$ 420403 445725 881314 108543 318345 392658 534418 321509 560214 306072 422982
16203D22982G0907A684J23751K88540j13116J26485B02037M98639j22696j01151
$$ 422982 70907 1684 125435 413975 300859 427344 202037 700676 577980 476829
16193D76829K44253B90977J6882I1134m2310K96410p698o8076n5173K78381J27415
$$ 476829 721082 290977 307859 91134 48824 345234 337536 269460 214287 492668 620083
16182F20083j74290E8911L58016A33113N32694k07049a41938A55531K85371j63694
$$ 620083 445793 58911 416927 133113 665807 458758 -141938 155531 440902 277208
16172B77208J99338q5155p0928j47851M4335K29464B19298K10139A81895Q4286
$$ 277208 476546 391391 320463 172612 216947 446411 219298 429437 181895 266181
16162B66181K39932A90426K43488A44362J08722K35863A56688J44047R2628l8944
$$ 266181 506113 190426 433914 144362 253084 488947 156688 300735 393363 354419
16152C54419p192R3675j31001J54322j35788h942A94853a08897E34483A24013
$$ 354419 347227 440902 309901 464223 328435 -8942 194853 -108897 534483 124013
16141I7070N3475O4738K2029P737o8743h0787I8116J19992J83437a2805A43226
$$ 97070 150545 215283 237312 245049 176306 -80787 98116 218108 401545 -12805 143226
16129D69843l5862k2891j23735K17145B03575J0001a90095C4380K57917R0304
$$ 469843 433981 411090 287355 504500 203575 213576 -190095 34380 292297 382601
16119C82601j58493J82748o2428q3624I300L62164C1951K65899K175a00145B0477
$$ 382601 224108 406856 344428 260804 9300 371464 31951 297850 300025 -100145 20477
16107B13588l796Q5652B4237M75931q5141n4937r9881P0028J95757B16960r7961
$$ 213588 209792 295444 24237 500168 415027 360090 260209 330237 525994 216960 118999
16096A18999M4298l8872J7603J68972d3483G4885L8980J82980J28510H4401J9750
$$ 118999 163297 124425 142028 311000 -43483 74885 113865 296845 425355 84401 104151
16085A04151J79602Q0055j19732K03690G6200J45472k715J69636i02A91795b0981
$$ 104151 283753 363808 244076 447766 76200 221672 218957 388593 -902 191795 -20981
16073A21025K7788Q4315k203j08880c7905E6832I928K31634K81117A41725k0982
$$ 121025 148813 233128 230925 122045 -37905 56832 9928 241562 522679 141725 120743
16062A20743j6005J8226L9978K760p8655m402P5366n2431o629i6620C00734r1256
$$ 120743 104738 122964 162942 165702 87047 82645 158011 105580 98951 -96620 300734 209478
16050B09478H3240J37057N1722J67521B32L44379p8256h8676B48250O0094d7334
$$ 209478 83240 220297 272019 439540 232 344611 266355 -88676 248250 308344 -47334
16038C3764f8139I1016a07826L4251B69300A03495D3951R6420e1065B04435P1387
$$ 33764 -68139 91016 -107826 -73575 269300 103495 43951 140371 -51065 204435 275822
16027B75822A26237D8924L86413A07865N9442J49354q1934a09345A68170P9480
$$ 275822 126237 48924 435337 107865 167307 316661 234727 -109345 168170 247650
16017B47650A22260f971k6826h498q0935m8414B8930e2464K1574I4626B5891a9094
$$ 247650 122260 -6971 -33797 -8498 -89433 -137847 28930 -52464 -30890 94626 25891 -19094
16004B74865B0786i5186B74134G4776c11334A32910K8628E3759Q8236Q2959b38791
$$ 274865 20786 -95186 274134 74776 -311334 132910 161538 53759 141995 224954 -238791
15992B87141D8923B610N42759B28104K41672J41671M77299j73845k10264l5174
$$ 287141 48923 2610 545369 228104 469776 611447 1088746 914901 704637 669463
15982F69463C01324E6216a83075D10142j08956j26432a25436A4189b52666C20008
$$ 669463 301324 56216 -183075 410142 301186 174754 -125436 14189 -252666 320008
15971B70671H6499J7675A376K66399O3940m9559B2714a09807B33657K6777d0094
$$ 270671 86499 104174 1376 267775 331715 282156 22714 -109807 233657 260434 -40094
15959a96847E1467K74444G3727P4399M055J9607D9158A3662J71082o2964B9926
$$ -196847 51467 325911 73727 148126 152181 171788 49158 13662 184744 121780 29926
15947B31986A9039b50710b2840A04800c1337B6874P9043i0451C63357A19732k8484
$$ 231986 19039 -250710 -22840 104800 -31337 26874 105917 -90451 363357 119732 91248
15936I1248h4168B51261f9117I8048e4413l6879C37561E5799B1190e2273C20348
$$ 91248 -84168 251261 -69117 98048 -54413 -91292 337561 55799 21190 -52273 320348
15924d5806C03818A34430J36313d3970A17190D4819e3930n272A58938D4384b7275
$$ -45806 303818 134430 270743 -43970 117190 44819 -53930 -59202 158938 44384 -27275
15912A71792J51209j19569P6944A37222F1291K01532m0695a7547j65688G5915
$$ 171792 323001 203432 280376 137222 61291 262823 222128 -17547 -183235 75915
15901C57379K05830B8490a41873G8566a5361F0685a13192n23752C8799K61373
$$ 357379 563209 28490 -141873 78566 -15361 60685 -113192 -636944 38799 300172
15891C00172A06689d0161F1415L2734O1888D3081O475J24883c24326R7504A06023
$$ 300172 106689 -40161 61415 94149 156037 43081 49556 174439 -324326 -226822 106023
15879c5816J118A96902n1257b56491C5307J07320c39952G8091J42417a70270A06199
$$ -35816 -34698 196902 145645 -256491 35307 142627 -339952 78091 220508 -170270 106199
15867e1865C69440g4764A18640K1426n8217d3659r7758b7996A81900a61490a3883
$$ -51865 369440 -74764 118640 140066 81849 -43659 -141417 -27996 181900 -161490 -13883
15855e1114j10878O8531C9068a96130A047c01939C11918a37863k638A63085B5655
$$ -51114 -161992 -93461 39068 -196130 1047 -301939 311918 -137863 -140501 163085 25655
15843C0838h7400O124B59813c39868l4971H8234a81468j41953I227J29780k7935
$$ 30838 -87400 -81276 259813 -339868 -374839 88234 -181468 -323421 9227 139007 111072
15832A11072J68138c81218C7522b28673B13275a4559A8677J10278b35920m466
$$ 111072 279210 -381218 37522 -228673 213275 -14559 18677 128955 -235920 -240386
15822b40386c6082m891I4492C2698Q6438b10587d3108E5582a03311I1569b33611
$$ -240386 -36082 -40973 94492 32698 119136 -210587 -43108 55582 -103311 91569 -233611
15810b4162B53004J1241a78602C3997a27108N9779C77890e0555C61643j49978
$$ -24162 253004 264245 -178602 33997 -127108 -67329 377890 -50555 361643 211665
15800B11665B2028c09906A99851D1535K43176D3803Q6978h0423j56677a11902
$$ 211665 22028 -309906 199851 41535 284711 43803 130781 -80423 -237100 -111902
15789c14553a32954M3418B15617d4782j69182j1635h2285C8346c76824a81282
$$ -314553 -132954 -89536 215617 -44782 -213964 -225599 -82285 38346 -376824 -181282
15778D7765a83362B9699A2042J65334C9299M6002J85685a65340L5768H1237J98221
$$ 47765 -183362 29699 12042 177376 39299 85301 270986 -165340 -129572 81237 279458
15767B79458o7235a48106A32289b20784B32003a98906D4385b11881g0580L4483
$$ 279458 212223 -148106 132289 -220784 232003 -198906 44385 -211881 -70580 -36097
15757c6097k14110B57665c85632B78791j02422j2698N7604b99482D6626a49786
$$ -36097 -250207 257665 -385632 278791 176369 163671 221275 -299482 46626 -149786
15746H6792J62306j13075K09625I0009P3954C085Q2194D0370J93344f9846c635
$$ 86792 249098 136023 345648 90009 163963 3085 85279 40370 233714 -69846 -3635
15734a2979k47522G2976A6314c56779c4113k70658B15858C8873K1397k9448L1778
$$ -12979 -260501 72976 16314 -356779 -34113 -304771 215858 38873 60270 30822 62600
15723F2600h6487M617A22938J36577r6421d2809m0502B74837a56914b3983k74311
$$ 62600 -86487 -81870 122938 259515 163094 -42809 -83311 274837 -156914 -23983 -298294
15712b98294A03476B6523L093J25614d9499A48117k7365e9995q2311b0790l1498
$$ -298294 103476 26523 29616 155230 -49499 148117 120752 -59995 -142306 -20790 -52288
15701e2288B7469J69340G1795a19046K3355B44885L6985q8375a02904B61760a18921
$$ -52288 27469 196809 71795 -119046 -95691 244885 281870 193495 -102904 261760 -118921
15689c20229i6858M0754k8612A41005g7613k14317I0486c7173C28195o2990C1258
$$ -320229 -96858 -56104 -84716 141005 -77613 -291930 90486 -37173 328195 265205 31258
15677D2078A285a48284A7078a26351H8054M367l4322c75997d0273k02477F1881
$$ 42078 1285 -148284 17078 -126351 88054 92421 58099 -375997 -40273 -242750 61881
15665g6672a8100F8269j9330P330M3731a73254K82o0884o3289G6788h6957Q275
$$ -76672 -18100 68269 48939 56269 100000 -173254 -172972 -233856 -297145 76788 -86957 -78682
15653g8682m5672m3815c4815o947r2839c2387j07326p7621O5927H3299p538a76272
$$ -78682 -124354 -168169 -34815 -41762 -134601 -32387 -139713 -217334 -151407 83299 75761 -176272
15640A48188J29843j0350f4807K8258A28826J73727a58498f5912j20870l33482
$$ 148188 278031 267681 -64807 -36549 128826 302553 -158498 -65912 -186782 -520264
15630e20264B52169b17375B81162b8249A02749M1277o4002b24612a4193A06829
$$ -520264 252169 -217375 281162 -28249 102749 144026 80024 -224612 -14193 106829
15619i3353j7603K5932o2343a4265A72174l6486L7183f1380K4754M823p9076h835
$$ -93353 -110956 -85024 -147367 -14265 172174 135688 172871 -61380 -36626 -31803 -110879 -8835
15606C78076a26375l14583a46259A63245b80578N2579j1303l2640I4660a42812
$$ 378076 -126375 -440958 -146259 163245 -280578 -227999 -239302 -271942 94660 -142812
15595a01298K466K4050q2921o4673J08162B06282b37552F4127g0906j3994j3784
$$ -101298 -98832 -74782 -157703 -222376 -114214 206282 -237552 64127 -70906 -84900 -98684
15584i8684G3356j6287O5794C881J10548D6408K30283d8645A49593J81213c72595
$$ -98684 73356 57069 122863 3881 114429 46408 276691 -48645 149593 330806 -372595
15572a41789D2931a72980F6705A131b23798R0054q1716l2432b9833B17135A5714
$$ -141789 42931 -172980 66705 1131 -223798 -133744 -215460 -247892 -29833 217135 15714
15560b92676A20710J4230a7458j38905Q028A1974b522n2611A28674Q5796b40776
$$ -292676 120710 134940 -17458 -156363 -148335 11974 -2522 -55133 128674 214470 -240776
15548a04686l9167H5440K8190D2366c6798l2954A22805A6779e102j95717A74513
$$ -104686 -143853 85440 113630 42366 -36798 -69752 122805 16779 -5102 -200819 174513
15536C44265j60354R4047a76380J2200c4724o0201J970B51100j16831A9878R8495
$$ 344265 183911 277958 -176380 -164180 -34724 -94925 -92955 251100 134269 19878 118373
15525A18373A3551b06811j13601A47564e7727B10740F8521K62167E7674K10181
$$ 118373 13551 -206811 -320412 147564 -57727 210740 68521 330688 57674 267855
15515B67855n1636j00837F998J9147a15978C29622j03811r6268l9092p83J61238
$$ 267855 216219 115382 6998 26145 -115978 329622 225811 129543 90451 89668 250906
15504B50906m0921A2189J7035a07873A55634c1462n516m2167q0762L0746C17012
$$ 250906 209985 12189 29224 -107873 155634 -31462 -36978 -79145 -159907 -129161 317012
15492a65233c7345m8103j18571C11846a58561B6146E801a43217A98908F0120a48636
$$ -165233 -37345 -85448 -204019 311846 -158561 26146 5801 -143217 198908 60120 -148636
15480b20566f6586A65257A5696L78298p3010K44204p0750B05541P7402j28147
$$ -220566 -66586 165257 15696 393994 320984 565188 494438 205541 282943 154796
15470A54796l3075a33733A67641R6137a38768H2446L0795O7280a06112J1541b0362
$$ 154796 121721 -133733 167641 263778 -138768 82446 113241 180521 -106112 -94571 -20362
15458A48346B2702c07227e5397D30329b53278A02911b0672r877b488m0464j13171
$$ 148346 22702 -307227 -55397 430329 -253278 102911 -20672 -30549 -2488 -42952 -156123
15447a56123d413n1487j82701D21863k823J18077J60554C12483A51807l8328P7743
$$ -156123 -4413 -55900 -238601 421863 419040 537117 697671 312483 151807 113479 191222
15436A91222K4467K0185a65292B06482A193a07017A47054m1137K4983E4826J25008
$$ 191222 215689 235874 -165292 206482 1193 -107017 147054 105917 130900 54826 179834
15425A79834n470G7142Q6114D7688b3239o3963q7159I0850a38584A76367b77823
$$ 179834 174364 77142 163256 47688 -23239 -87202 -174361 90850 -138584 176367 -277823
15413c0533j28668L0804H0833a23255j09207A65538j0287o5138B2070J3889L094
$$ -30533 -159201 -128397 80833 -123255 -232462 165538 155251 90113 22070 35959 39053
15402C9053q037N18267A9688J01686A0213J23238K54760H1344J82481j6855c07673
$$ 39053 31016 549283 19688 121374 10213 133451 388211 81344 263825 246970 -307673
15390B54716a19559A79Q2405K08530E0549J4904g6131B6503a51367d726B1133
$$ 254716 -119559 179 82584 291114 50549 65453 -76131 26503 -151367 -4726 21133
15378h77l4400m2346D548b39416J16618A09778Q8681F6788J65185E3928a55998
$$ -877 -35277 -77623 4548 -239416 -122798 109778 198459 66788 231973 53928 -155998
15366C39496a90942P5485B09365G6356J445N6578n3867J3971K62146E3808J61279
$$ 339496 -190942 -115457 209365 76356 77801 134379 80512 94483 356629 53808 215087
15355B15087j04183K4764J46512R6802f3835r445j4254k25291e2047F0331M7783
$$ 215087 110904 135668 282180 378982 -63835 -73280 -87534 -312825 -52047 60331 108114
15344A08114J19744j13814K53917g080B90519r153H2952J91794b0245A81486b7942
$$ 108114 227858 114044 367961 -7080 290519 281366 82952 274746 -20245 181486 -27942
15332c98351B13613a47226N7195I7686D0451b1752p2071B72421o0803J06785D0242
$$ -398351 213613 -147226 -90031 97686 40451 -21752 -93823 272421 211618 318403 40242
15320h451C39896j61811b16366B5543h1485C63955e6863p3854L4971I1328R5003
$$ -8451 339896 178085 -216366 25543 -81485 363955 -56863 -130717 -95746 91328 186331
15309A86331l2750a8682k36165E2746J54010j03231R1899f0981m5934d7100k9517
$$ 186331 153581 -18682 -254847 52746 206756 103525 195424 -60981 -106915 -47100 -76617
15298g6617K390o8729B15252K06651A69131k1586j7357j1238a15593D235L15730
$$ -76617 -74227 -142956 215252 421903 169131 147545 130188 118950 -115593 4235 319965
15287C19965E7239f2187A89607a41628E2841a58806g5420c5849E0244R6453h1511
$$ 319965 57239 -62187 189607 -141628 52841 -158806 -75420 -35849 50244 146697 -81511
15275C82578C6755A4347a33382j14206a1058B11302e7749G8539e7298B00016e2942
$$ 382578 36755 14347 -133382 -247588 -11058 211302 -57749 78539 -57298 200016 -52942
15263B11288E1852P4246K8B6049b14159A36129e4686B1127P4115C2650b66234
$$ 211288 51852 126098 126126 26049 -214159 136129 -54686 21127 95242 32650 -266234
15251b55038A72893m623o3438M0507M74126R7694P62572L8266n95295K31134C67026
$$ -255038 172893 168270 104832 145339 619465 717159 1479731 1517997 922702 1153836 367026
15239C58086G0137K89102i178A77689b624D1724c56245I9155g6754C25193C0164
$$ 358086 70137 359239 -9178 177689 -2624 41724 -356245 99155 -76754 325193 30164
15227c9470A35784k1065a58624g400A42280L5485a73949B87174a77200a7948E0713
$$ -39470 135784 114719 -158624 -7400 142280 177765 -173949 287174 -177200 -17948 50713
15215a37128f012A88991q6990m2891m529Q691J21470d21598a14334c437j20520
$$ -137128 -6012 188991 102001 59110 54581 63272 184742 -421598 -114334 -3437 -123957
15204a23957M2241F6326L40821a7413G4819a81974a5390j82226I6271f5248p0026
$$ -123957 -81716 66326 407147 -17413 74819 -181974 -15390 -197616 96271 -65248 -135274
15193a35274e0161E7929c4651j7455C9927a6713L890a730B08882H865O6622N0490
$$ -135274 -50161 57929 -34651 -52106 39927 -16713 -12823 -1730 208882 8865 75487 125977
15181A25977K61464b5465k7570B40943j05669b70283C5220e154j31635E9248a23714
$$ 125977 387441 -25465 -53035 240943 135274 -270283 35220 -5154 -136789 59248 -123714
15169A18584a13428C18290a5543k35804B78460E0123K37752d1157L783j11145
$$ 118584 -113428 318290 -15543 -251347 278460 50123 287875 -41157 -37374 -148519
15159a48519I9629B5220O5205h355A07232K48778A3474a20160K0590A34015K17090
$$ -148519 99629 25220 90425 -8355 107232 356010 13474 -120160 -99570 134015 351105
15148C51105A15764K1823b3260C9566J56100c2810A31296l8949h6269l106l5713
$$ 351105 115764 137587 -23260 39566 195666 -32810 131296 92347 -86269 -89375 -125088
15137a25088B4175M1165f4600A01289J13908L1474h4620F0433J52082o6529c8346
$$ -125088 24175 65340 -64600 101289 215197 246671 -84620 60433 212515 145986 -38346
15125A76669K2439m9238P5454K0296p4649i4657b2654D33141j05588a08845M4463
$$ 176669 199108 149870 225324 245620 170971 -94657 -22654 433141 327553 -108845 -64382
15114f4382F2768d1885B25994i36A60007J62727A2750a513r3695L3275o4944A62927
$$ -64382 62768 -41885 225994 -936 160007 322734 12750 -1513 -95208 -61933 -126877 162927
15101C6627N2949L7281N1208g2864B12805g3027B634P0180c8204A30828K2574
$$ 36627 89576 126857 178065 -72864 212805 -73027 2634 72814 -38204 130828 153402
15090A53402K3443a2731a720I0888J58880j23321e4613B59415j13614N1204Q7350
$$ 153402 176845 -12731 -1720 90888 249768 126447 -54613 259415 145801 197005 284355
15079B84355N5951A23447J46674f2969A19387m8804b1344H495b0812j84081a3260
$$ 284355 340306 123447 270121 -62969 119387 70583 -21344 8495 -20812 -204893 -13260
15067I96K47898C5284J72701j7270b15864B57109A2093R3518f3395k28349E6538
$$ 996 248894 35284 207985 190715 -215864 257109 12093 105611 -63395 -291744 56538
15055H7578J32886F6093Q3925p885J95684k7188j11371M6783R6655H6172a5473
$$ 87578 220464 66093 150018 142133 337817 310629 199258 246041 342696 86172 -15473
15043A10176j8193J3978C6493M00955j49911l3194k2937P7129N2052j11362k0603
$$ 110176 91983 105961 36493 437448 287537 254343 231406 308535 360587 249225 228622
15032B28622M2297A30755K18911J51433B26483Q9806J26149j99943K52548m4699
$$ 228622 270919 130755 349666 501099 226483 316289 442438 242495 495043 450344
15022D50344B02251M0034A06696K10199K35621G4351L0066K25973L19308k25381
$$ 450344 202251 242285 106696 316895 552516 74351 104417 330390 649698 424317
15012D24317n8322K09925B60491J38023j49331N7428N2780j63433R6190N9452
$$ 424317 365995 575920 260491 398514 249183 306611 359391 195958 292148 351600
15002C51600D8605K60918n0983P0632j7255q7984L08036o0729A55898J27222L05860
$$ 351600 48605 309523 258540 329172 311917 223933 531969 471240 155898 283120 588980
14991E88980A53235O8193C7031J93825O1113J04731q4844R4418K785P0802N0820
$$ 588980 153235 221428 37031 230856 291969 396700 311856 406274 409059 479861 530681
14980E30681q3939P4882j98666o4305J32717A56548J06544J88699j42800J43351
$$ 530681 446742 521624 322958 258653 391370 156548 263092 451791 308991 452342
14970D52342R4851m7287k38930j13857J68422I9820a3114A4949L01244O6244Q1762
$$ 452342 547193 499906 260976 147119 315541 99820 -13114 14949 316193 382437 464199
14959D64199j23493r865A29957a9385B12501k7727M1738J23468j36299J05714
$$ 464199 340706 330841 129957 -19385 212501 184774 226512 349980 213681 319395
14949C19395Q8825k4903A69064K16087p6565K64495B61324K01460j57071O5876
$$ 319395 408220 383317 169064 385151 308586 573081 261324 462784 305713 371589
14939C71589K98760A02256M84255k16467Q057r7652K54172q9630J41009K98020
$$ 371589 670349 102256 586511 370044 378101 280449 534621 444991 586000 884020
14929H84020l8344l8389l8119J26733R5416j60127j47980J9272j50776P69310
$$ 884020 845676 807287 769168 895901 991317 831190 683210 702482 551706 1321016
14919A321016j24198K88238k62342L18606o40145J21733k67192R2342C93328m9269
$$ 1321016 1196818 1485056 1222714 1541320 901175 1022908 755716 848058 393328 344059
14909C44059H0271K92063K07374k42402l704K15148o3145a55261H0927J69531
$$ 344059 80271 372334 579708 337306 333602 548750 485605 -155261 80927 250458
14899B50458J58937A29745P7152K72743K2405j28218j52413K21971N7832B09298
$$ 250458 409395 129745 206897 479640 502045 373827 221414 443385 501217 209298
14888C86139J61235r8967Q536K9790J96812k85175n1344L48851j97855K24684
$$ 386139 547374 448407 456943 486733 683545 398370 347026 695877 498022 722706
14878G22706j76526q1221G1562L03566j13301L9595K71584o0643j93030R3295
$$ 722706 546180 464959 71562 375128 261827 301422 573006 512363 319333 412628
14868D12628j95816J73863m4864J80606B57642K15562m2084n3287p6189R6697
$$ 412628 216812 390675 345811 526417 257642 473204 431120 377833 301644 398341
14858C98341I2807L85728j66049J78403k36880L38m5713O5216J05778J28160q5799
$$ 398341 92807 478535 312486 490889 254009 254347 208634 273850 379628 507788 421989
14847D21989O9876A17817K22740L34412B70308O40709k22203q0195M56423C88261
$$ 421989 491865 117817 340557 674969 270308 911017 688814 608619 1065042 388261
14836E23018l078j16444P8377Q5606r5205M7705A69252J26192A37282L04086q2260
$$ 523018 519940 403496 481873 567479 472274 519979 169252 295444 137282 441368 359108
14825C59108J79477a0428A83642K46987J68640B47142O60434B19292M64287k84255
$$ 359108 538585 -10428 183642 430629 599269 247142 907576 219292 683579 399324
14815C99324J38071k854J6531A58128O8088J41020M2808j97958J46903J19755
$$ 399324 537395 534541 551072 158128 226216 367236 410044 212086 358989 478744
14805D78744j27232k0953l0415K97944k19515j24753K85470j98290M6003j6370
$$ 478744 351512 330559 300144 598088 378573 253820 539290 341000 387003 370633
14795C70633k4726l9139r0481L57157B82939K35234P4682k61305l3727K47058
$$ 370633 345907 306768 216287 573444 282939 518173 592855 331550 297823 544881
14785E44881m4810O065q4876J33177k49012K22387n6668J07905k6500k25504K8851
$$ 544881 500071 506136 421260 554437 305425 527812 471144 579049 552549 327045 355896
14774C55896J62833J47529P4161l16897n8964M60234B37560L51233k50823K95529
$$ 355896 518729 666258 740419 423522 364558 824792 237560 588793 337970 633499
14764F33499j73993R0478j15147K5960K04633C15866L21498q4053j56118J59346
$$ 633499 459506 549984 434837 460797 665430 315866 637364 553311 397193 556539
14754E56539n8804L6049B37506J16737J28820B17728J88341k6884B7564O81086
$$ 556539 497735 533784 237506 354243 483063 217728 406069 379185 27564 708650
14744G08650k52202J64427K4006o4946J61071k71927j337J2251J55358k94231
$$ 708650 456448 620875 644881 579935 741006 469079 467742 479993 635351 341120
14734C41120K15518O4974L3007j21488M24265k84315J14631J83284o3971Q1013
$$ 341120 556638 621612 654619 533131 957396 673081 787712 970996 907025 988038
14724I88038K35766m06843J33546l0343J44126m22464J6620K29681M2780m34196
$$ 988038 1223804 816961 950507 920164 1064290 641826 658446 888127 930907 496711
14714D96711J32112j49687M7151m5332J65647j27874O7508J07624P9478Q0942
$$ 496711 628823 479136 526287 480955 646602 518728 586236 693860 773338 854280
14704H54280K3594l84150L22735L29133j48573K36553j07570K2647m2302l28523
$$ 854280 877874 493724 816459 1145592 997019 1233572 1126002 1148649 1106347 777824
14694G77824P5417L13968m30945L71577m70576j58833j06870O84795l47287B35834
$$ 777824 853241 1167209 736264 1107841 637265 478432 371562 1056357 709070 235834
14683H51800C66929M72816o3477j92462M27428m27650O4287P5941j6586N501k92167
$$ 851800 366929 839745 776268 583806 1011234 583584 647871 723812 707226 712727 420560
14672D20560K02961j71263N0155J41522p0627J53615O1371l13211J80310K95173
$$ 420560 623521 452258 502413 643935 573308 726923 788294 475083 655393 950566
14662I50566k97709K05607k47534R7280J66062l43876K76822l16636K59424R2689
$$ 950566 652857 858464 610930 708210 874272 530396 807218 490582 750006 842695
14652H42695j23427K8768J47374j94188J26682k27892k4021M07212k41265O0783
$$ 842695 719268 748036 895410 701222 827904 600012 575991 983203 741938 802721
14642H02721o0152J38720j36066J07279l31434K30822Q7177k58445Q6545L59268
$$ 802721 742569 881289 745223 852502 521068 751890 839067 580622 667167 1026435
14632A026435k37002M30415l06281M060O2940J43423k41670K62922r2741k61154
$$ 1026435 789433 1219848 913567 917627 980567 1123990 882320 1145242 1052501 791347
14622G91347J44496N16147j81322m48349K65859m1322q4639L39248l13293j4080
$$ 791347 935843 1451990 1270668 822319 1088178 1046856 962217 1301465 988172 974092
14612I74092j50378M65369n87341K82374k37830J9132L37547j13227K58090p7953
$$ 974092 823714 1289083 701742 984116 746286 765418 1102965 989738 1247828 1169875
14602A169875M8270k08688L47423l56368N3381l9725P5645K64291k14793J95411
$$ 1169875 1218145 1009457 1356880 1000512 1053893 1014168 1089813 1354104 1139311 1334722
14592A334722k4628j29576k31144O0772L70089q7829J66022l49697J42398j10599
$$ 1334722 1310094 1180518 949374 1010146 1380235 1292406 1458428 1108731 1251129 1140530
14582A140530K23816J93595l7447k48995J51222n1862K14004m80615J25319K67772
$$ 1140530 1364346 1557941 1520494 1271499 1422721 1370859 1584863 1104248 1229567 1497339
14572A497339k52716J6174M14051j52612K5242K34464l19930R4593k12253M22481
$$ 1497339 1244623 1260797 1674848 1522236 1547478 1781942 1462012 1556605 1344352 1766833
14562A766833m8911N000J57890j98573M09730k9410K57455l3070K23785J99389
$$ 1766833 1717922 1722922 1880812 1682239 2091969 2062559 2320014 2286944 2510729 2710118
14552B710118l0936P24678Q36191J596066L484634O162649J4159054L868983j6571012
$$ 2710118 2679182 3403860 4240051 5836117 9320751 15483400 29642454 33511437 16940425
14543A6940425F813197k798468M77160j672362r64676n5076m59475K23745k67453
$$ 16940425 6813197 4014729 4491889 2819527 1854851 1799775 1340300 1564045 1296592
14534A296592r787L34727k19006m1653J18723L03333k14601m214j43979r9071
$$ 1296592 1286805 1621532 1402526 1360873 1479596 1782929 1568328 1564114 1420135 1321064
14524A321064K36450l2223L10117k96483J55403l4877J95520K24107l36283K73761
$$ 1321064 1557514 1525291 1835408 1538925 1694328 1659451 1854971 2079078 1742795 2016556
14514B016556j67360j44098J18733j42130L41352j86729J77018R7130k43769N82618
$$ 2016556 1849196 1705098 1823831 1681701 2023053 1836324 2013342 2110472 1866703 2449321
14504B449321k70489J34269m6090q1204j66543J17039J06994k86827M73406n10820
$$ 2449321 2178832 2313101 2267011 2185807 2019264 2136303 2243297 1956470 2429876 1919056
14494A919056M55407j39426N0323K51216k819j98020O3110k22814M59488K11l204
$$ 1919056 2374463 2235037 2285360 2536576 2533757 2335737 2398847 2176033 2635521 2635732 2632528
14483B632528l7967n480k9612j48410M47841P8958J23467k95485j34665N55862
$$ 2632528 2594561 2589081 2559469 2411059 2858900 2937858 3061325 2765840 2631175 3187037
14473C187037l77426Q572r734K04180N8547j49623K98535k91997J28983j03517
$$ 3187037 2809611 2818183 2808449 3012629 3071176 2921553 3220088 2928091 3057074 2953557
14463B953557L76508K128m9996L11766j49858O0944m04716L72827J36582j13835
$$ 2953557 3330065 3332193 3282197 3593963 3444105 3505049 3100333 3473160 3609742 3495907
14453C495907j07623n3395L64483l23973M74694J14916P8739j37028L254L20479
$$ 3495907 3388284 3334889 3699372 3375399 3850093 3965009 4043748 3906720 3909974 4230453
14443D230453k96213O1078J46036P2754K0894K61165k89529O74514m38208p0004
$$ 4230453 3934240 3995318 4141354 4214108 4235002 4496167 4206638 4881152 4442944 4372940
14433D372940N7017L86996O6496m16646K29146M02672k12121L96110n4831J29749
$$ 4372940 4429957 4816953 4883449 4466803 4695949 5098621 4886500 5282610 5227779 5357528
14423E357528j40398M41607Q7852j40214M26859n4166n31195Q06318k46428q9598
$$ 5357528 5217130 5658737 5746589 5606375 6033234 5979068 5447873 6254191 6007763 5918165
14413E918165K71102M1485P5348J48353j91922N74975p4750p2703N39191J8410
$$ 5918165 6189267 6230752 6306100 6454453 6262531 6837506 6762756 6690053 7229244 7247654
14403G247654j86235q8340N94958j36516K2545L52256K5491k036K55535J25483
$$ 7247654 7061419 6973079 7568037 7431521 7454066 7806322 7831813 7829777 8085312 8210795
14393H210795R4704Q2912J3531J05439O9767J18045M08569K60249N7971P45234
$$ 8210795 8305499 8388411 8401942 8507381 8577148 8695193 9103762 9364011 9421982 10167216
14383A0167216j25814Q7338J58314K28728K81248J48983J42340J96494M44247
$$ 10167216 10041402 10128740 10287054 10515782 10797030 10946013 11088353 11284847 11729094
14374A1729094k88980P55259j25006L7062P45129N882N05925K53862k1217N58684
$$ 11729094 11440114 12195373 12070367 12107429 12852558 12858440 13364365 13618227 13597010 14155694
14364A4155694P0316L30779K71098K17678K35474K99766P20835J51059J79940
$$ 14155694 14226010 14556789 14827887 15045565 15281039 15580805 16301640 16452699 16632639
14355A6632639M91985N56130M52753K16746N21112L44009P33472Q19165k74548
$$ 16632639 17124624 17680754 18133507 18350253 18871365 19215374 19948846 20768011 20493463
14346B0493463Q76908P42243Q60857J96837P14359P89773P38046L53743J032450
$$ 20493463 21370371 22112614 22973471 23170308 23884667 24674440 25412486 25766229 26798679
14337B6798679N94843Q06826J034466O09439J005464J032103J042180Q15673J212384
$$ 26798679 27393522 28200348 29234814 29844253 30849717 31881820 32924000 33739673 34952057
14328C4952057J053855J438687J151514J408758J639117J424476J645807R96003
$$ 34952057 36005912 37444599 38596113 40004871 41643988 43068464 44714271 45710274
14320D5710274K091898J893510J567467J678601K162853K429492K362911K544592
$$ 45710274 47802172 49695682 51263149 52941750 55104603 57534095 59897006 62441598
14312F2441598K303294L010610K919314L352640L368286L225972L928551M052094
$$ 62441598 64744892 67755502 70674816 74027456 77395742 80621714 84550265 88602359
14304H8602359M173187M824662M890525M935230N592230O130511O515688O588303
$$ 88602359 92775546 97600208 102490733 107425963 113018193 119148704 125664392 132252695
14296A32252695P251654P962636Q224646Q652402R651107R955110J0711362J1313465
$$ 132252695 139504349 147466985 155691631 164344033 173995140 183950250 194661612 205975077
14288B05975077J2016201J2064281J3299352J3888504J3959025J4375212J4590872
$$ 205975077 217991278 230055559 243354911 257243415 271202440 285577652 300168524
14281C00168524J4571885J4840931J3973566J3121074J2163435J0940609R044466
$$ 300168524 314740409 329581340 343554906 356675980 368839415 379780024 388824490
14274C88824490O903609J927994k037148j150264j339415l292190l038503n350306
$$ 388824490 395728099 397656093 395618945 394468681 393129266 389837076 386798573 381448267
14266C81448267q880415j1384137j2739583j3649528j4107305j5269336j5274250
$$ 381448267 372567852 361183715 348444132 334794604 320687299 305417963 290143713
14259B90143713j4772327j4612334j4178256j3350233j3127959j2246913j1480784
$$ 290143713 275371386 260759052 246580796 233230563 220102604 207855691 196374907
14252A96374907j0535081r573572r614071r023284q658924p946547p230338o964718
$$ 196374907 185839826 176266254 166652183 157628899 148969975 141023428 133793090 126828372
14244A26828372n941785o467897n316437n216701m994848m830380m029623l969550
$$ 126828372 120886587 114418690 109102253 103885552 98890704 94060324 90030701 86061151
14236H6061151m015379l828296l150884l516339k861317k538843k619080k492127
$$ 86061151 82045772 78217476 75066592 71550253 68688936 66150093 63531013 61038886
14228F1038886k391771k774118j877429k156134j805265j665476j930427j737820
$$ 61038886 58647115 55872997 53995568 51839434 50034169 48368693 46438266 44700446
14220D4700446j250124j493207j405194j633095j061099j346713r88661q93062
$$ 44700446 43450322 41957115 40551921 38918826 37857727 36511014 35522353 34629291
14212C4629291j073513j431882p52813j276640p16459j28645p15058j191657p88590
$$ 34629291 33555778 32123896 31371083 30094443 29377984 29249339 28534281 27342624 26554034
14203B6554034q59108p39330l78697o61820n91669p33097n18098o51062o11389
$$ 26554034 25694926 24955596 24576899 23915079 23323410 22590313 22072215 21421153 20809764
14194B0809764m42225m50330o67221m94236l17149n91405n11089m78288k21433
$$ 20809764 20367539 19917209 19249988 18755752 18438603 17847198 17336109 16857821 16636388
14185A6636388j62238m31235m39692l83802k04429l50219l31894m47994j6394
$$ 16636388 16474150 16042915 15603223 15219421 15014992 14664773 14332879 13884885 13868491
14176A3868491m02197p070l61528m11198l99838j73185l98240k63571M85314p32750
$$ 13868491 13466294 13459224 13097696 12686498 12286660 12113475 11715235 11451664 11936978 11204228
14166A1204228m56466R4845m31962J6276k08392J34929q11437K8777k10319k85678
$$ 11204228 10747762 10842607 10410645 10426921 10218529 10353458 9542021 9570798 9360479 9074801
14156I074801k32504L51963j27551k57473m32180o8645J13413n47102J19297l05155
$$ 9074801 8842297 9194260 9066709 8809236 8377056 8308411 8421824 7874722 7994019 7688864
14146G688864J71592j22728p5977p8587k85861j24943l96201J249J78024L400
$$ 7688864 7860456 7737728 7661751 7583164 7297303 7172360 6776159 6777408 6955432 6958832
14136F958832k83710J26948l49680p2502l06295j58152O8841K91707l44630j72865
$$ 6958832 6675122 6802070 6452390 6379888 6073593 5915441 5984282 6275989 5931359 5758494
14126E758494q0992j3299L30490o26485J55920N5050j82114j13211R8135j91760
$$ 5758494 5677502 5664203 5994693 5368208 5524128 5579178 5397064 5283853 5381988 5190228
14116E190228q4657k70383P7799J06539o9168l08292K2836N2386m7558p2420Q5139
$$ 5190228 5105571 4835188 4912987 5019526 4950358 4642066 4664902 4717288 4669730 4597310 4682449
14105D682449l93776K23405l00306Q800l7460j61141N8360m41082L96418J14023
$$ 4682449 4288673 4512078 4211772 4220572 4183112 4021971 4080331 3639249 4035667 4149690
14095D149690j44448l73304J15046K27059l92806P1182n243j05751J01897l8268
$$ 4149690 4005242 3631938 3746984 3974043 3581237 3652419 3647176 3541425 3643322 3605054
14085C605054j18487K11919l19660J30466l9531o1921j05349J17635m83103L71650
$$ 3605054 3486567 3698486 3378826 3509292 3469761 3407840 3302491 3420126 2937023 3308673
14075C308673j1316J30806o51285K03845J7667o0169j96081j01039J96586q1583
$$ 3308673 3297357 3428163 2776878 2980723 2998390 2938221 2742140 2641101 2837687 2756104
14065B756104L27839m34007Q246M71649o6992K9561k92443n9546j93011l3471
$$ 2756104 3083943 2649936 2658182 3129831 3062839 3092400 2799957 2740411 2547400 2513929
14055B513929J06267l2572R6399j19938n0930k36566l0740N593J43552K51776
$$ 2513929 2620196 2587624 2684023 2564085 2513155 2276589 2245849 2251442 2394994 2646770
14045B646770k72701J97426n47051K55512J33676k03196L7785j91438P0551K15327
$$ 2646770 2374069 2571495 2024444 2279956 2413632 2210436 2248221 2056783 2127334 2342661
14035B342661l74558n1771K4108L09860j1176k05400j59358K63119J18841k08936
$$ 2342661 1968103 1916332 1940440 2250300 2239124 2033724 1874366 2137485 2256326 2047390
14025B047390j23166K00067k18944q9014j68819J18900J13306j68576n5270o566
$$ 2047390 1924224 2124291 1905347 1816333 1647514 1766414 1879720 1711144 1655874 1649308
14015A649308p1073Q6102J4014j99872K4098J54669J58855l16732j49822O1047
$$ 1649308 1578235 1664337 1678351 1478479 1502577 1657246 1816101 1499369 1349547 1410594
14005A410594L725J14207K36433j86255P1810j65911n32589M09604J0970N7579
$$ 1410594 1414319 1528526 1764959 1578704 1650514 1484603 952014 1361618 1372588 1430167
13995A430167L27935l19567K13687q7412J81234K06517O79306K609740M647664
$$ 1430167 1758102 1438535 1652222 1564810 1746044 1952561 2631867 5241607 9889271
13986I889271J2073762J2153732j0425394A0877676n083777j557474q10755o24867
$$ 9889271 21963033 34116765 23691371 10877676 5793899 4236425 3425670 2800803
13978B800803n34645J48524l75175K19500j97434j59466j25702P7677k55729J3121
$$ 2800803 2266158 2414682 2039507 2259007 2061573 1902107 1776405 1854082 1598353 1611474
13968A611474j613J81845n00763K88613m1078m8384J08480P7343j96813j08564
$$ 1611474 1609861 1791706 1290943 1579556 1538478 1490094 1598574 1675917 1479104 1370540
13958A370540L4074L0337M119n2396k6807j33376K54895j48589K73086l81903
$$ 1370540 1404614 1434951 1439070 1386674 1359867 1226491 1481386 1332797 1605883 1223980
13948A223980J31165m3292J1777k83365K98564k7328j25757J04676r7207J06752
$$ 1223980 1355145 1311853 1323630 1040265 1338829 1311501 1185744 1290420 1193213 1299965
13938A299965r6064k2794K6383m7617l07653O29802o35561M23456p2879l7453
$$ 1299965 1203901 1181107 1207490 1159873 852220 1482022 846461 1269917 1197038 1159585
13928A159585P2366p1005j7757l9997J6742q9050K99814o49765K66725N3412m6065
$$ 1159585 1231951 1160946 1143189 1103192 1119934 1030884 1330698 680933 947658 1001070 955005
13917I55005j1494J0695J04258L05742m38100J1470p4004J52514K63815k99510
$$ 955005 943511 954206 1058464 1364206 926106 937576 863572 1016086 1279901 980391
13907I80391K55838k82483k09751K41162j51786K45575m33418J46824j07K68087
$$ 980391 1236229 953746 743995 985157 833371 1078946 645528 792352 792245 1060332
13897A060332n18050K71454l1133J55680Q4634j95181q6923K21122k76996K57396
$$ 1060332 542282 813736 782603 938283 1022917 827736 740813 961935 684939 942335
13887I42335j50596j42325J78231P8464J62606J35851j61054n9123Q0548k77626
$$ 942335 791739 649414 827645 906109 1068715 1204566 1043512 984389 1064937 787311
13877G87311p9545j10948M93012n17960K02900j75089p0303K08183q4620K94650
$$ 787311 707766 596818 1089830 571870 774770 599681 529378 737561 652941 947591
13867I47591j9784l0725D24181J18981K48765C46496O50103l62110k66708O00750
$$ 947591 927807 897082 424181 543162 791927 346496 996599 634489 367781 968531
13857I68531k00549m1801K85145q7929k15872J70556D25656N8565J62612r6354
$$ 968531 767982 726181 1011326 923397 707525 878081 425656 484221 646833 550479
13847E50479J01308k31471L13510k74468J95036k8027K1644B35953L18236N3080
$$ 550479 651787 420316 733826 459358 654394 626367 648011 235953 554189 607269
13837F07269K12984o2809q494j00019J9464r7149Q4886L7098N4067J92224k00066
$$ 607269 820253 757444 748950 648931 668395 571246 656132 693230 747297 939521 739455
13826G39455J10882J41733l47794M9660k35225j30729L41655j3044j89732R473
$$ 739455 850337 992070 644276 693936 458711 327982 669637 656593 466861 476334
13816D76334n4131J49501j07121J11413m0197j375p8735K28467j20417j53735
$$ 476334 422203 571704 464583 575996 535799 534424 455689 684156 563739 410004
13806D10004q460p58K70257k11923J22513L8688j36233j4010J88668m3671j91393
$$ 410004 401544 400786 671043 459120 581633 620321 484088 470078 658746 615075 423682
13795D23682J9928J51396k3426k43724j0682l4914K28795J13182O6673l08582
$$ 423682 443610 595006 571580 327856 317174 282260 511055 624237 690910 382328
13785C82328j03327J93736J09165B62974K87590j19877j53762P486J45690J29396
$$ 382328 279001 472737 581902 262974 550564 430687 276925 284411 430101 559497
13775E59497k0085k27985n980L83177l12025J63912R0900k60072P2621L94543
$$ 559497 539412 311427 305447 688624 376599 540511 631411 371339 443960 838503
13765H38503m13252p9682K48461B63545L96832k27913K16660k12749j32051L52375
$$ 838503 425251 345569 594030 263545 660377 432464 649124 436375 304324 656699
13755F56699B45087L83659K249j30168j68723p2753J87500j07409K91526j63789
$$ 656699 245087 628746 630995 500827 332104 259351 446851 339442 630968 467179
13745D67179k20561J51603j24729L10003R9150B58291p5619M50478C09146j4760
$$ 467179 246618 398221 273492 583495 682645 258291 182672 633150 309146 294386
13735B94386L96348C41590K33398F2032J76382K06438k7240K94148j22957k18989
$$ 294386 690734 341590 574988 62032 238414 444852 417612 711760 588803 369814
13725C69814J9931A89700K25186b7867D07119R1258L5557l697K5722j26563j75657
$$ 369814 389745 189700 414886 -27867 407119 498377 533934 530237 555959 429396 253739
13714B53739J9990l104K17713Q4437A04747J13429L99864B64490J68259j07215
$$ 253739 273729 270625 488338 572775 104747 218176 618040 264490 432749 325534
13704C25534I7157K69421O0608J33118B14411K99480L3566r4630j80396O0979
$$ 325534 97157 366578 427186 560304 214411 513891 547457 452827 272431 333410
13694C33410O5643p4400j27402J20492l9390j29582E9802K73965Q9261B6007M77395
$$ 333410 399053 324653 197251 317743 278353 148771 59802 333767 423028 26007 503402
13683E03402k42483Q5994A67249J62319J75320j87459J62751A64971J89625J45212
$$ 503402 260919 346913 167249 329568 504888 317429 480180 164971 354596 499808
13673D99808K691j98499r2035L86106A2830K30091J67830l3426J8603A63282J81169
$$ 499808 502499 304000 211965 598071 12830 242921 410751 377325 395928 163282 344451
13662C44451n2858J8006J93344k18881p8844K22633J27397o7186E5397J92132
$$ 344451 291593 309599 502943 284062 205218 427851 555248 488062 55397 247529
13652B47529A19668J17408K28344n915A06408J26239I2803M49537k38699L79643
$$ 247529 119668 237076 465420 459505 106408 232647 92803 542340 303641 683284
13642F83284j04957k09452l1146K14116k16719J17531A23537K18688A59007J01973
$$ 683284 578327 368875 337729 551845 335126 452657 123537 342225 159007 260980
13632B60980B858J99762K20308j63882M87160I3514O2727J30919J18090k1359
$$ 260980 2858 202620 422928 259046 746206 93514 156241 287160 405250 383891
13622C83891P7156n593G051J74884J10913j29462K32360N4990j08997j12632J37279
$$ 383891 461047 455454 7051 181935 292848 163386 395746 450736 341739 229107 366386
13611C66386J3943j35430q9982K3652O9499Q0125j52083B362K32652J4484N1723
$$ 366386 380329 244899 154917 178569 248068 328193 176110 2362 235014 249498 301221
13600C01221A38984K232P7943j959P3136r4553C2658L81607q9389N5627n1044
$$ 301221 138984 141216 219159 217200 290336 195783 32658 414265 324876 380503 329459
13589C29459K602K08808o0786A44905m50J80721G0595J36150m0094J68328H3201
$$ 329459 332061 540869 480083 144905 144455 325176 70595 206745 166651 334979 83201
13577D4368J22588l8988L39449j37773G8422J37670F3739j3548L96178j54057
$$ 44368 166956 127968 467417 329644 78422 216092 63739 50191 446369 292312
13567B92312J6060M1079F1685a07652D75403j93294l4401q2054P1642R9754C0166
$$ 292312 308372 349451 61685 -107652 475403 282109 247708 165654 237296 337050 30166
13555a13685A68984K90523k24879H9540K4741k9362J74872p7717b66477D02299
$$ -113685 168984 459507 234628 89540 114281 84919 259791 182074 -266477 402299
13544B3483K73184K4752j29677R2384O3219O8344q7227A29830d0715A5896K37984
$$ 23483 296667 321419 191742 284126 347345 415689 328462 129830 -40715 15896 253880
13533B53880o5378M9113H292P4640C2989O6238J59435O5917A47112o8643a89014
$$ 253880 188502 237615 8292 82932 32989 99227 258662 324579 147112 78469 -189014
13521A64693a98642D543Q0573L04602o1742D6146J22726J21300K235K06812A49200
$$ 164693 -198642 4543 85116 389718 327976 46146 168872 290172 292407 499219 149200
13509C20178G7540K55942H9316K68356l4133c3473L830A67409J40318j26704P0856
$$ 320178 77540 333482 89316 357672 323539 -33473 -29643 167409 307727 181023 251879
13498B51879H3066L0969a23146B20236A4177d7476r462D22573i0881A42763q230
$$ 251879 83066 114035 -123146 220236 14177 -47476 -56938 422573 -90881 142763 134533
13487A34533A2354J02576P4091E7339J50595j02962i1916C06105j33053N0052
$$ 134533 12354 114930 189021 57339 207934 104972 -91916 306105 173052 223104
13477B23104d3496A20678K9983l2732E7811a36729j39791B96605m3239B8925L22440
$$ 223104 -43496 120678 150661 117929 57811 -136729 -276520 296605 253366 28925 351365
13466C51365c8269A50335J07531A11133J0620K8594K56399j67263R044H9441P0953
$$ 351365 -38269 150335 257866 111133 121753 150347 406746 239483 248527 89441 160394
13455A60394A7269K25802N1389A29488b7034j81093a1200B84416Q3356m9479d0420
$$ 160394 17269 243071 294460 129488 -27034 -208127 -11200 284416 367772 318293 -40420
13443A59607J13867J83967A79229a64061B61074N1339j41048a83419B8373g7448
$$ 159607 273474 457441 179229 -164061 261074 312413 171365 -183419 28373 -77448
13432C40566E4622P5389a68110B87612b45630A01216B0406J45454e0053B39794
$$ 340566 54622 130011 -168110 287612 -245630 101216 20406 165860 -50053 239794
13421C6612N5914I861a98045B31369d5941B55505B1728L71676A28010K19083A44614
$$ 36612 92526 9861 -198045 231369 -45941 255505 21728 393404 128010 347093 144614
13409I3246J09038g7205A44953E6227J6045Q7853f230C26666A58988i7304A55613
$$ 93246 202284 -77205 144953 56227 72272 160125 -6230 326666 158988 -97304 155613
13397A75755a79436b812D0802J33020a15923B07401K90097A29647J9123p3752
$$ 175755 -179436 -2812 40802 173822 -115923 207401 497498 129647 148770 75018
13387G5018J61156D5496i2645M1323B8371K590J92656Q9842H974K78681c02115
$$ 75018 236174 45496 -92645 -51322 28371 30961 223617 313459 8974 287655 -302115
13375I4903g2430J5690A84009G7028J33396n214G2701L7113R6641g6951o150n0851
$$ 94903 -72430 -56740 184009 77028 210424 205210 72701 109814 206455 -76951 -83101 -133952
13363a33952D29894j10699I5281K34818q1720r4524K4059a73242B31755J72914
$$ -133952 429894 319195 95281 330099 248379 153855 177914 -173242 231755 404669
13353D04669j1381d0244C3203K61591H6993Q2642b02066B69700N4719A50170F0675
$$ 404669 393288 -40244 33203 294794 86993 169635 -202066 269700 324419 150170 60675
13341A14009B5928M7081J98116M0220A22189J9689E8085J96260K00459A48527
$$ 114009 25928 73009 271125 311345 122189 141878 58085 254345 454804 148527
13330A33908m1223L70075A21934L3760J47113q2777j0005r6311N156e556p1528
$$ 133908 92685 462760 121934 155694 302807 220030 210025 113714 118870 -5556 -77084
13319g7084A7071a02191A02079J15843a20523A74223l1637J77885A48000b1075
$$ -77084 17071 -102191 102079 217922 -120523 174223 142586 320471 148000 -21075
13308D32551j32559j13582d1028B59679B2152J99766A04577J22916p0925a54867
$$ 432551 299992 186410 -41028 259679 22152 221918 104577 227493 156568 -154867
13297G2117J87313n7338j3035g9915B98242e04678A21201a26642B53030a19504
$$ 72117 259430 202092 189057 -79915 298242 -504678 121201 -126642 253030 -119504
13286A64289J91062a36646B30379a35689A5464a25950A95784H7078M2350b3884
$$ 164289 355351 -136646 230379 -135689 15464 -125950 195784 87078 129428 -23884
13275C33905D3119a86383D0931P6045d2594B97809j0659j32637a05126d3731b618
$$ 333905 43119 -186383 40931 116976 -42594 297809 287150 154513 -105126 -43731 -2618
13263c2429l9355l73629a58617A19291f7176B99808B586J44679E9506K02502G2771
$$ -32429 -71784 -445413 -158617 119291 -67176 299808 2586 147265 59506 262008 72771
13251f3619B4116d7352q9653j13215F1520N2592I287a1523A54915Q0190a97722
$$ -63619 24116 -47352 -137005 -250220 61520 114112 9287 -11523 154915 235105 -197722
13239h290K447n3410G1244L37850K2462a3551B47864g6062A98804h2474A50329
$$ -8290 -5843 -59253 71244 409094 431556 -13551 247864 -76062 198804 -82474 150329
13227b4760B37401n5339E1121h3074C13413A47419G133N8138k4654h1612B80881
$$ -24760 237401 182062 51121 -83074 313413 147419 7133 65271 40617 -81612 280881
13215B91092r8748a07910B70275j09488G687e5284a0406H1140J29473J31925C6578
$$ 291092 192344 -107910 270275 160787 7687 -55284 -10406 81140 210613 342538 36578
13203a11064A94944q2932K13827r0787a02684a190H6226C0317K8505K28006A21584
$$ -111064 194944 112012 325839 235052 -102684 -1190 86226 30317 58822 286828 121584
13191i2778a4829C38285F8445a04712A38686b7749E9435L67952A617a8259A72635
$$ -92778 -14829 338285 68445 -104712 138686 -27749 59435 427387 1617 -18259 172635
13179I9269b7284J1891k27030f9930A71195m6647n7765K0895A4236b65179C42090
$$ 99269 -27284 -15393 -242423 -69930 171195 124548 66783 87678 14236 -265179 342090
13167c3872j57048B2522c46901J35228C42576E089Q7238l7618a11441j1643K3853
$$ -33872 -190920 22522 -346901 -211673 342576 5089 92327 54709 -111441 -123084 -99231
13156i9231D6504b84121g8668K7778r9146E3819J37421a02657A94467r7109P9377
$$ -99231 46504 -284121 -78668 -50890 -150036 53819 191240 -102657 194467 97358 176735
13145A76735J09811a42454a3921o1286J8438E9826a65718f5159A01293m4651A4318
$$ 176735 286546 -142454 -13921 -75207 -56769 59826 -165718 -65159 101293 56642 14318
13133a43988C61973a29460L4079A34655F0740J85274A1965M7360K0836A5525J89886
$$ -143988 361973 -129460 -95381 134655 60740 246014 11965 59325 80161 15525 205411
13122B05411Q494h1463o1376D40736b22057l0285q8130B09920n9163o8835R0588
$$ 205411 213905 -81463 -142839 440736 -222057 -252342 -340472 209920 150757 81922 172510
13111A72510n1050b01782D6895J50752P8186a10465A5699J3676J4986K25003H6539
$$ 172510 121460 -201782 46895 197647 275833 -110465 15699 29375 44361 269364 86539
13099G2756a0601q5638J026J6959a0865A33141i3847g341j3117B31661j0732d682
$$ 72756 -10601 -96239 -95213 -78254 -10865 133141 -93847 -7341 -20458 231661 220929 -4682
13086a11311I9734f7384A03885l4020J51593b9970k19220Q4507F8002a72728G9488
$$ -111311 99734 -67384 103885 69865 221458 -29970 -249190 -164683 68002 -172728 79488
13074E9853i1372A71426J08715a40559H8613L8835B4404J09547b39n6120l75874
$$ 59853 -91372 171426 280141 -140559 88613 127448 24404 133951 -239 -56359 -432233
13063d32233A5760M8858k2631L7651M1431b4965q8243D768J16513O1286o3374
$$ -432233 15760 64618 41987 79638 121069 -24965 -113208 4768 121281 182567 119193
13052A19193N2809G1910J32924e7848J5368A53556K7485a19525j16512i0792l1111
$$ 119193 172002 71910 204834 -57848 -42480 153556 181041 -119525 -236037 -90792 -121903
13041a21903B23216P836r4071C89J11598C9968J67819d4582o3675C29967a20571
$$ -121903 223216 231052 136981 389 111987 39968 207787 -44582 -108257 329967 -120571
13029B23559j6342A766f1003k74759e5402n7708B86894d9937B2780L1898P6704
$$ 223559 207217 1766 -61003 -335762 -55402 -113110 286894 -49937 22780 54678 131382
13018A31382J08621d159E1019g8898B89069g8732B13386r4707a02026A27669k4745
$$ 131382 240003 -4159 51019 -78898 289069 -78732 213386 118679 -102026 127669 102924
13007A02924J20673n697c3176r8810J5083G3733b31799A978L9189M9925C3669
$$ 102924 223597 217900 -33176 -131986 -116903 73733 -231799 1978 41167 91092 33669
12995b05944o1033J24305F7038O7293j0231m5626h5368A61328a09727J5134D5380
$$ -205944 -266977 -142672 67038 134331 124100 78474 -85368 161328 -109727 -94593 45380
12983A18894D9272A6904a270k6957B16713I0230a79491b5564o4065C52688a66892
$$ 118894 49272 16904 -1270 -28227 216713 90230 -179491 -25564 -89629 352688 -166892
12971H3578P2690k356o4080a1571j50470M1772D1344c4034l15121A15049F373
$$ 83578 156268 153912 89832 -11571 -162041 -120269 41344 -34034 -349155 115049 6373
12959E0133P5896n1013g8007G7762m249a03733E6555a57505N5160D26638C077
$$ 50133 126029 75016 -78007 77762 73513 -103733 56555 -157505 -102345 426638 3077
12947h5907A24874J15931n2721b3700j69639F4207K00146b64242C6521R578b68330
$$ -85907 124874 240805 188084 -23700 -193339 64207 264353 -264242 36521 46099 -268330
12935h1873H0026N2500O612c8966k9694l4000A02029c57042D0337O3840b77159
$$ -81873 80026 132526 139138 -38966 -68660 -102660 102029 -357042 40337 104177 -277159
12923E7840K96792l0411a45989j36108C00303A9313i6557E2872c27494A7858f3413
$$ 57840 354632 324221 -145989 -282097 300303 19313 -96557 52872 -327494 17858 -63413
12911b01575f1548C52640A64618E1617g3228I357d1190k00478e0351C611J32905
$$ -201575 -61548 352640 164618 51617 -73228 9357 -41190 -241668 -50351 3611 136516
12900A36516Q1396G0048b66925A98097d8361o9317A07426f6453k111A10884M9243
$$ 136516 217912 70048 -266925 198097 -48361 -117678 107426 -66453 -68564 110884 160127
12889A60127c41947g2968C5598P0493m3466c0164n6095j61105D327P8376e0078
$$ 160127 -341947 -72968 35598 106091 62625 -30164 -86259 -247364 4327 82703 -50078
12877c5417q8591B57796i4230l1283D82303A20178g3767G7392J30287Q9802A16289
$$ -35417 -124008 257796 -94230 -125513 482303 120178 -73767 77392 207679 297481 116289
12865b69366G6234j7899R1123a58205r2341a9432j67283A07410i2348L1006B30469
$$ -269366 76234 58335 149458 -158205 -250546 -19432 -186715 107410 -92348 -61342 230469
12853b25080B2377K62807d0606C61382E8510R6167f8779F2447g8578H4751g4350
$$ -225080 22377 285184 -40606 361382 58510 154677 -68779 62447 -78578 84751 -74350
12841a6145k54829i9807p069k9924C87310A66091i2935I1238a17756k48337A55263
$$ -16145 -270974 -99807 -106876 -136800 387310 166091 -92935 91238 -117756 -366093 155263
12829C280a10665d2346p7380C7731A3748K9971J56922b14392R8377G9327a9160
$$ 3280 -110665 -42346 -119726 37731 13748 43719 200641 -214392 -116015 79327 -19160
12817e7643j19109E8359a17897I8952N3176J05826a35807A29244D4882c17669
$$ -57643 -176752 58359 -117897 98952 152128 257954 -135807 129244 44882 -317669
12806B49605M4209a56704A58401a52498j20578F9649J11200H0446J36863d8981
$$ 249605 293814 -156704 158401 -152498 -273076 69649 180849 80446 217309 -48981
12795d6868B58832j22106b46858h41H0767f0162j1593G0531c531J178l0758k01651
$$ -46868 258832 136726 -246858 -841 80767 -60162 -71755 70531 -3531 -2353 -33111 -234762
12783b34762f2371R669B20813G0013a33613C1283b98339D9778d0628A19060b47481
$$ -234762 -62371 -52702 220813 70013 -133613 31283 -298339 49778 -40628 119060 -247481
12771H8044l8256J94533c59075J51255C943L3544J27451a33453B3120c19136A20100
$$ 88044 49788 244321 -359075 -207820 3943 37487 164938 -133453 23120 -319136 120100
12759a44852B13538a22263f420k74324G2297N4724b31776C68803f6642n48206
$$ -144852 213538 -122263 -6420 -280744 72297 127021 -231776 368803 -66642 -614848
12749f14848d1044F3829a69780M975A28138A2733Q5666d2411I2882a654j08067
$$ -614848 -41044 63829 -169780 -164805 128138 12733 98399 -42411 92882 -1654 -109721
12738a09721j04990g2490A20255J30358i3232A95242J20668F4511a22889j03463
$$ -109721 -214711 -72490 120255 250613 -93232 195242 315910 64511 -122889 -226352
12728b26352A32471o3371a94176i2718p9041j63497R0902R0842G3966j1424M9637
$$ -226352 132471 69100 -194176 -92718 -171759 -335256 -244354 -153512 73966 62542 112179
12717A12179a18984I126Q766e0585A41404j9205C0104J47191n1281c84552a55204
$$ 112179 -118984 9126 17892 -50585 141404 122199 30104 177295 126014 -384552 -155204
12705B97588a6882B1121J56245a06542K1526D2927b90602a5758A4078a54866E9645
$$ 297588 -16882 21121 177366 -106542 -85016 42927 -290602 -15758 14078 -154866 59645
12693b29968m2584K9267p9549A4839M1641J48429a21361m1474L7026j6186J4910
$$ -229968 -272552 -243285 -322834 14839 56480 204909 -121361 -162835 -125809 -141995 -127085
12682a27085A24807J18729Q4683A3745J09273j9847i5907a4136B01828A4556b0626
$$ -127085 124807 243536 328219 13745 123018 103171 -95907 -14136 201828 14556 -20626
12670B33714n5302a45433j03391C32899a51663B44424a98890b4906E2632K2354
$$ 233714 178412 -145433 -248824 332899 -151663 244424 -198890 -24906 52632 74986
12660G4986K8948J47522c44475C01141a23623a7836B70096a37162A14243b3892
$$ 74986 103934 251456 -344475 301141 -123623 -17836 270096 -137162 114243 -23892
12649a76155A03566N7667c40496c7450A65423a9631G2483K04473c5826j74648
$$ -176155 103566 161233 -340496 -37450 165423 -19631 72483 276956 -35826 -210474
12639b10474A82001B7458a56933K8611A4515J69260q1022c59148B38948j7724
$$ -210474 182001 27458 -156933 -128322 14515 183775 102753 -359148 238948 221224
12629B21224h0980B73415A21151a251A2474i8339K0864Q409j10467B60213J8941
$$ 221224 -80980 273415 121151 -1251 12474 -98339 -77475 -69066 -179533 260213 279154
12618B79154i6864C01587C6063J00892a89435Q8239a6114A70905a34266j8404
$$ 279154 -96864 301587 36063 136955 -189435 -101196 -16114 170905 -134266 -152670
12608a52670B28314H8299a21297c4741B004N1671M5878b06968D1273J40472b64594
$$ -152670 228314 88299 -121297 -34741 2004 53675 99553 -206968 41273 181745 -264594
12596A04997A319c9515G2394F63O539M2015a20206E4444g4641M797d984j88860
$$ 104997 1319 -39515 72394 663 7202 49217 -120206 54444 -74641 -69844 -4984 -193844
12584a93844e5750A68675i8327C34827G6373B0083a84398B6863N7489L7562b2857
$$ -193844 -55750 168675 -98327 334827 76373 20083 -184398 26863 84352 121914 -22857
12572b35304A0479J68401a1546r1175A16109j2634a82019A26962B7074f93k10584
$$ -235304 10479 178880 -11546 -102721 116109 103475 -182019 126962 27074 -693 -211277
12561b11277i6942A99985F1970g8083a8855m4129j4101j09331g1580Q754E934
$$ -211277 -96942 199985 61970 -78083 -18855 -62984 -77085 -186416 -71580 -62826 5934
12549B45768A4269l309R5737g1226j19227I0163N5647D2004i8636B5038K21203
$$ 245768 14269 10960 106697 -71226 -190453 90163 145810 42004 -98636 25038 246241
12538B46241a17016n0008C5702J3483A0331g0883B5663a3431H7986H480N1934
$$ 246241 -117016 -167024 35702 49185 10331 -70883 25663 -13431 87986 8480 60414
12527F0414J39596a54798j72663A62402o1390b14898Q2445B72699q9241e8461
$$ 60414 200010 -154798 -327461 162402 101012 -214898 -132453 272699 183458 -58461
12516B0931n137a04938A39947e5149H3780d9886D466J26139h0418j06979a9928
$$ 20931 15794 -104938 139947 -55149 83780 -49886 4466 130605 -80418 -187397 -19928
12504A14776E4463P8018O0111l1109d6732j63074L6684B1557f0147j93159c4530
$$ 114776 54463 132481 192592 161483 -46732 -209806 -173122 21557 -60147 -253306 -34530
12492H87g072r2900b4419k36952J05244C5756J7323A2785K67508a00548B46906
$$ 887 -7072 -99972 -24419 -261371 -156127 35756 53079 12785 280293 -100548 246906
12480B75283b9391p7931H8613k5154K4557b0938B9739a80049p1724i2972a0749
$$ 275283 -29391 -107322 88613 63459 88016 -20938 29739 -180049 -251773 -92972 -10749
12468c79150H2125i715A42507K25375c7617C26604G846R1575k7213i3589q1657
$$ -379150 82125 -9715 142507 367882 -37617 326604 7846 99421 72208 -93589 -175246
12457a75246P4697d7050A04167e8245H1848C2405a66055e5519m647q6355A10835
$$ -175246 -100549 -47050 104167 -58245 81848 32405 -166055 -55519 -60166 -146521 110835
12445F4936e3157A8797h2295A57509A7617a21257C19622b7142k58187J9675Q6744
$$ 64936 -53157 18797 -82295 157509 17617 -121257 319622 -27142 -285329 -265654 -178910
12434a78910B7447e0439F9155a81482F7103e7773k01571G7222h3908r493d4702
$$ -178910 27447 -50439 69155 -181482 67103 -57773 -259344 77222 -83908 -93401 -44702
12422a01998k63264N8154I4783a54904L2633C71415G9509c15916e4101m8955b9578
$$ -101998 -365262 -307108 94783 -154904 -122271 371415 79509 -315916 -54101 -103056 -29578
12410b9779m5778o02I8711m6429J61309a42474j72847A6671O5577c09085D822
$$ -29779 -75557 -76159 98711 52282 213591 -142474 -315321 16671 82248 -309085 4822
12398i5361L767C5185I897i1722A68844a6221F521d5964r0392j81110a16866K5216
$$ -95361 -91594 35185 9897 -91722 168844 -16221 6521 -45964 -136356 -317466 -116866 -91650
12386i1650A29272D6371a1780j51392B81508H7517a14162I3834g2752B16036a84363
$$ -91650 129272 46371 -11780 -163172 281508 87517 -114162 93834 -72752 216036 -184363
12374A73824m7247a05476d7326A79765a75844K9223k19603J52957l0870A3793
$$ 173824 126577 -105476 -47326 179765 -175844 -146621 -366224 -213267 -244137 13793
12363b89171A16349N5016D1082J51605P8095a10811K8254j2381l51033A30217
$$ -289171 116349 171365 41082 192687 270782 -110811 -82557 -94938 -445971 130217
12352a24796H9470O422J30382k1816G4288c34355a11830G3144d9752C01746F0539
$$ -124796 89470 95892 226274 204458 74288 -334355 -111830 73144 -49752 301746 60539
12340C55510g424E698b9689a3304A76559B5729b19503J2078P1645B48782I2411
$$ 355510 -7424 5698 -29689 -13304 176559 25729 -219503 -207425 -135780 248782 92411
12328A9347a67345e5174k2221I3863K52J20448Q540b5215F962N5861a29495H2556
$$ 19347 -167345 -55174 -77395 93863 94115 214563 223103 -25215 6962 62823 -129495 82556
12315a7396A61513d1066j66880C7748L00436H901a8561F0178J62766a5264C3475
$$ -17396 161513 -41066 -207946 37748 338184 8901 -18561 60178 222944 -15264 33475
12303c13606B4565b06347E4106N7052a89854C5149L5630R1491a84428D6375L76302
$$ -313606 24565 -206347 54106 111158 -189854 35149 70779 162270 -184428 46375 422677
12292D22677D6083a87032A74845m3840J12579c6767j15183e7368B25972h8175
$$ 422677 46083 -187032 174845 131005 243584 -36767 -151950 -57368 225972 -88175
12281a53262A29594o0393g5785B64974J07671C461J00832b6579B26310C8395J15216
$$ -153262 129594 69201 -75785 264974 372645 3461 104293 -26579 226310 38395 153611
12270A53611o0706k1219c43598h3599D7778B3811K66752j08099L64047d0418n7183
$$ 153611 92905 71686 -343598 -83599 47778 23811 290563 182464 546511 -40418 -97601
12259i7601C64215I8122a5572B56700i3694d6189D60037A66663M3501b481B60664
$$ -97601 364215 98122 -15572 256700 -93694 -46189 460037 166663 210164 -2481 260664
12247A54517n4936B9111c14878A14683J50492H5442L2663h6718D3550J13709A2388
$$ 154517 99581 29111 -314878 114683 265175 85442 118105 -86718 43550 157259 12388
12235b880A54998E9913K59604a78040A67292j0835b902j92403R4474B62507d32574
$$ -2880 154998 59913 319517 -178040 167292 156457 -2902 -195305 -100831 262507 -432574
12223A71662a37382B49519j03739L55400j91506i9221A53563O0707b81530C56527
$$ 171662 -137382 249519 145780 501180 309674 -99221 153563 214270 -281530 356527
12212a26228E0741h4213F0450J24656L2571h7783J4518B15854j6112a46530D6865
$$ -126228 50741 -84213 60450 185106 217677 -87783 -73265 215854 199742 -146530 46865
12200B60913n2296q5034J77702A13523a04809B93625r2947j3472j0805J52363
$$ 260913 208617 123583 301285 113523 -104809 293625 200678 187206 176401 328764
12190C28764A59005N4831K19644A8062K12145b62975f3135n9382A46945a27915
$$ 328764 159005 213836 433480 18062 230207 -262975 -63135 -122517 146945 -127915
12179A57015K70671a13005a7201j29599H7633e8140j12775D3064B88N9271J02744
$$ 157015 427686 -113005 -17201 -146800 87633 -58140 -170915 43064 288 59559 162303
12168A62303A6657O9384C4983L35498e711D6149j1867J47388J69147h6607F2061
$$ 162303 16657 86041 34983 370481 -5711 46149 34282 181670 350817 -86607 62061
12156H9856d9247J3046A48026P6034K8320a48094e9455j57467f9983c196o8198
$$ 89856 -49247 -36201 148026 224060 252380 -148094 -59455 -216922 -69983 -3196 -71394
12145g1394A64522d595n6183k94606b1811H7329a2202A1160J64639E6099R577
$$ -71394 164522 -4595 -60778 -355384 -21811 87329 -12202 11160 175799 56099 65676
12134F5676A6997a23414N876B34152j06969f9598C94522A79901H2673k4532J14214
$$ 65676 16997 -123414 -117538 234152 127183 -69598 394522 179901 82673 58141 172355
12123A72355b3747q8528j95491E558a77539E7907a04852M3260K8651B68403c36603
$$ 172355 -23747 -112275 -307766 5558 -177539 57907 -104852 -61592 -32941 268403 -336603
12111a50951b460k20081A34037l6955a34375J9600J8930q0894A18356a59202f620
$$ -150951 -2460 -222541 134037 97082 -134375 -114775 -95845 -176739 118356 -159202 -6620
12099C07294D3888A5783h6482j9509A51075a07835c4415o9899I380K212b9529
$$ 307294 43888 15783 -86482 -105991 151075 -107835 -34415 -104314 9380 11592 -29529
12087C95719q5654c51460A39657d8933G307a85836C12691b966A45510M0385Q662
$$ 395719 310065 -351460 139657 -48933 7307 -185836 312691 -2966 145510 185895 194557
12076A94557n8463h2415d0193A65656A6909K09553g0077k78450d8924A35151L7593
$$ 194557 136094 -82415 -40193 165656 16909 226462 -70077 -348527 -48924 135151 172744
12065A72744n9905p597J0651b37128J12541j6298P0029A54240b1420D457K46771
$$ 172744 112839 105242 115893 -237128 -124587 -140885 -70856 154240 -21420 4457 251228
12054B51228a79937A19767R4228H3414i8743F3732b5755B12743a84933D7926c4124
$$ 251228 -179937 119767 213995 83414 -98743 63732 -25755 212743 -184933 47926 -34124
12042A78423c33686G7298h4577F9476J09523i5959F6007a50232j6550n310l6170
$$ 178423 -333686 77298 -84577 69476 178999 -95959 66007 -150232 -166782 -172092 -208262
12031b08262q0522m2053h9597o0784B69440c4875k24025A47914J90799b48932
$$ -208262 -288784 -330837 -89597 -150381 269440 -34875 -258900 147914 338713 -248932
12020A34360a01858n1039A86651A210d9980B01868a14640J6351B00286c0452A09701
$$ 134360 -101858 -152897 186651 1210 -49980 201868 -114640 -98289 200286 -30452 109701
12008a58961F0545g3362c1890A1545J93600N5528a77065k62586J35534F5729K56370
$$ -158961 60545 -73362 -31890 11545 205145 260673 -177065 -439651 -304117 65729 322099
11997C22099F7700e3276l2503A9625L54518h5578j68524A15326D9851a57465g2919
$$ 322099 67700 -53276 -85779 19625 374143 -85578 -254102 115326 49851 -157465 -72919
11985A53241g4478A85583N9149e4414C60220g8646p9044d1915D7876a31647F5229
$$ 153241 -74478 185583 244732 -54414 360220 -78646 -157690 -41915 47876 -131647 65229
11973c21065A83036B0397J6001K46507i0106A32004i0614o209A765f2695A53949
$$ -321065 183036 20397 36398 282905 -90106 132004 -90614 -96823 1765 -62695 153949
11961f8004o7165A63777b85927l8739F0514M4296J6697g950A59423a89842J5299
$$ -68004 -135169 163777 -285927 -324666 60514 104810 121507 -7950 159423 -189842 -174543
11950a74543o0532K079Q5361B72175j29764L860D0017L31251a97531C802K37809
$$ -174543 -235075 -232996 -147635 272175 142411 146271 40017 371268 -197531 3802 241611
11939B41611i9402F2461b9752j52182J0507O182F8702M643d26450b5645I3689
$$ 241611 -99402 62461 -29752 -181934 -171427 -165245 68702 73345 -426450 -25645 93689
11927I5773J8959d9215k33069p9069h6048A76521b41966a1691B4919k209J48660
$$ 95773 114732 -49215 -282284 -361353 -86048 176521 -241966 -11691 24919 22710 171370
11916A71370a53406P6000q7648A16807c4908A3221b9031l7643K6848B07075b05495
$$ 171370 -153406 -77406 -165054 116807 -34908 13221 -29031 -66674 -39826 207075 -205495
11904b4117k5069C97437a76470B03730r8139a52106A9103J44030a65004k26506
$$ -24117 -49186 397437 -176470 203730 105591 -152106 19103 163133 -165004 -391510
11894c91510a7844e770H1512a28213B07281c65636h5756B5037c62831C92933A3574
$$ -391510 -17844 -5770 81512 -128213 207281 -365636 -85756 25037 -362831 392933 13574
11882f6064k79458P9172C4478J70197d82724a61854D7504h6383j02876j80228
$$ -66064 -345522 -266350 34478 204675 -482724 -161854 47504 -86383 -189259 -369487
11872c69487e6038j90923B84864H8075a14127j66933A70167f1409j92961A10085
$$ -369487 -56038 -246961 284864 88075 -114127 -281060 170167 -61409 -254370 110085
11861b80249h0784k22090c679A59756b01698a2450A480a61966I5272c7972o2862
$$ -280249 -80784 -302874 -3679 159756 -201698 -12450 1480 -161966 95272 -37972 -100834
11850a00834o261K0339j39219J01955N4830k10393g4667C40969i6132m8138M1669
$$ -100834 -107095 -86756 -225975 -124020 -69190 -279583 -74667 340969 -96132 -144270 -102601
11839a02601F4078c18337a54603a5784I7765i5086B4781M0901b1996r3996j069
$$ -102601 64078 -318337 -154603 -15784 97765 -95086 24781 65682 -21996 -115992 -117061
11828a17061G0722b8911g203k93233a34298c722q2767j71969B08930R8415A02813
$$ -117061 70722 -28911 -7203 -300436 -134298 -3722 -86489 -258458 208930 307345 102813
11816b43072K1401A27354a65049a968A59519b13614k28502b2824j09120N0177
$$ -243072 -221671 127354 -165049 -1968 159519 -213614 -442116 -22824 -131944 -81767
11806h1767A76331F3787b48752G0197L4765B9719M0048j3847c65222a57058A68578
$$ -81767 176331 63787 -248752 70197 104962 29719 69767 55920 -365222 -157058 168578
11794b03282A83038b41554b546I3242K81385n9882D6963I346K26282E9891A6529
$$ -203282 183038 -241554 -2546 93242 374627 314745 46963 9346 235628 59891 16529
11782g6613A75464j3531F57d10269D02361A25541B1734d3077A08837A9336h9612
$$ -76613 175464 161933 657 -410269 402361 125541 21734 -43077 108837 19336 -89612
11770G4972h5826A5266J4601b5470A50270F2725J3717a30598j9890B10623B5483
$$ 74972 -85826 15266 29867 -25470 150270 62725 76442 -130598 -150488 210623 25483
11758h5472j62307a6847A89999F0026K6402K43682E1806g3092J5502j98801B703
$$ -85472 -247779 -16847 189999 60026 86428 330110 51806 -73092 -57590 -256391 2703
11746h1811j64717O7577B6731R3864h8661K8529p6549N7678j79660A82894D7742
$$ -81811 -246528 -178951 26731 120595 -88661 -60132 -136681 -79003 -258663 182894 47742
11734b54454j08306J63943B28297a77126J8261H4373d5040A49424C1858a16667
$$ -254454 -362760 -198817 228297 -177126 -158865 84373 -45040 149424 31858 -116667
11723D6682R4163C5915M61772E7153b2650A27646a06956q6386A2476g8958A64088
$$ 46682 140845 35915 497687 57153 -22650 127646 -106956 -193342 12476 -78958 164088
11711F4740G023L2261a51644E4625a2269j02577I1018c33885a20542B8635A0575
$$ 64740 7023 39284 -151644 54625 -12269 -114846 91018 -333885 -120542 28635 10575
11699c13426a13545e3504A76009c05210b6518k21948P1370m1853B4236M1131b01069
$$ -313426 -113545 -53504 176009 -305210 -26518 -248466 -177096 -218949 24236 65367 -201069
11687a24027C000K630K29872c8921B6176b6740A63712d8625I6706a65207d5148
$$ -124027 3000 5630 235502 -38921 26176 -26740 163712 -48625 96706 -165207 -45148
11675d1068A77333c69188G1260K6230D0700a04708A37265D5088j9188N3239c8597
$$ -41068 177333 -369188 71260 97490 40700 -104708 137265 45088 25900 79139 -38597
11663g7933L6619C4261a51506B4891d4161n3022A49748a85898A22530K6653A9981
$$ -77933 -41314 34261 -151506 24891 -44161 -97183 149748 -185898 122530 149183 19981
11651a03884A52327d8129A27866m9370K00495A37107O5158j6331a10642k13832
$$ -103884 152327 -48129 127866 78496 278991 137107 202265 185934 -110642 -324474
11641c24474C17146r2275a02123C6245D392J4907a78745L3633A02714a05824I1027
$$ -324474 317146 224871 -102123 36245 4392 19299 -178745 -145112 102714 -105824 91027
11629e4071a084k70033e7061j80142D5225e4550m0997G791b7873q0849A73300
$$ -54071 -1084 -271117 -57061 -237203 45225 -54550 -95547 7791 -27873 -108722 173300
11617a34793B2792a69392P9004F9362g5461B66255c58549B43746I823b58340B52592
$$ -134793 22792 -169392 -90388 69362 -75461 266255 -358549 243746 9823 -258340 252592
11605a86819A62598h9641j66222A30566J37886d3512J3447O737m1016j0694I3113
$$ -186819 162598 -89641 -255863 130566 268452 -43512 -30065 -23328 -64344 -75038 93113
11593B23754i9949B87506C4576J76505f3584A8976N7784J14803a75914g0220L5073
$$ 223754 -99949 287506 34576 211081 -63584 18976 76760 191563 -175914 -70220 -35147
11582c5147G5873Q7586b883j08531B3372b45803E4377b1820H6675J8746K3663
$$ -35147 75873 163459 -2883 -111414 23372 -245803 54377 -21820 86675 105421 129084
11571A29084J34633a17866J3871B45768j10971a32898B28273R4746f5196n2699
$$ 129084 263717 -117866 -103995 245768 134797 -132898 228273 323019 -65196 -117895
11561a17895A21267g2836k09967A18893a67832d8301r224j0288A87638i8674A3005
$$ -117895 121267 -72836 -282803 118893 -167832 -48301 -57525 -67813 187638 -98674 13005
11549A307M970h5125A26989a17078e3310H3615J22095f065A64933D0958N15J18799
$$ 1307 6277 -85125 126989 -117078 -53310 83615 205710 -6065 164933 40958 41473 160272
11537A60272A8273J0992L2684d6622A48173J02869p1058a95569L6503a8502E0414
$$ 160272 18273 29265 61949 -46622 148173 251042 179984 -195569 -159066 -18502 50414
11525D84965b74522C9678N1217N2677O7177l0040a63922d5918j09080B25118n6091
$$ 484965 -274522 39678 90895 143572 210749 180709 -163922 -45918 -154998 225118 169027
11514A69027j6695n8773C371K22608p0028p5365K61063a44840D2811d9607I7277
$$ 169027 152332 93559 3371 225979 155951 80586 341649 -144840 42811 -49607 97277
11502B7726a65801G4130e4572C1599A4442h2027n885C14358b03666B74J29290
$$ 27726 -165801 74130 -54572 31599 14442 -82027 -87912 314358 -203666 274 129564
11491A29564J21726K7929A9021a73924D7059J37105n8376D0318a704B27125F5048
$$ 129564 251290 279219 19021 -173924 47059 184164 125788 40318 -1704 227125 65048
11479B42491d2094F5422J93160A10872a96165B20322c35475H0923a80144C7722
$$ 242491 -42094 65422 258582 110872 -196165 220322 -335475 80923 -180144 37722
11468A01102K58224A15645D6767e1334C05781j14265b82202B0634h1529C3757
$$ 101102 359326 115645 46767 -51334 305781 191516 -282202 20634 -81529 33757
11457A47991C1885J4296K30573a13576E8377R3850o7793J90280f0579B10795a10152
$$ 147991 31885 46181 276754 -113576 58377 152227 84434 274714 -60579 210795 -110152
11445a67114N919h249n1191F4446c722I0108a0803A3651L10384j53572D0396i1227
$$ -167114 -161195 -8249 -59440 64446 -3722 90108 -10803 13651 324035 170463 40396 -91227
11432D9854a6603H551K56957E0755d6078B29805c2919j62249D6226f7280C1702
$$ 49854 -16603 8551 265508 50755 -46078 229805 -32919 -195168 46226 -67280 31702
11420D3974b18594A95525a25647I4815a21752M9035m666c2538A91712n5699I017
$$ 43974 -218594 195525 -125647 94815 -121752 -72717 -77383 -32538 191712 136013 9017
11408A2877J28741a65583A70927F0895b54962C0489g8815B05306b4923B02441
$$ 12877 141618 -165583 170927 60895 -254962 30489 -78815 205306 -24923 202441
11397e1818A29730B6416J32977o024M3106d0051k06234a2376j69570A61573i2389
$$ -51818 129730 26416 159393 153369 196475 -40051 -246285 -12376 -181946 161573 -92389
11385c6711o4748F7170i8359D0798N1557I289J36657J45654a8226I0543b86386
$$ -36711 -101459 67170 -98359 40798 92355 9289 145946 291600 -18226 90543 -286386
11373A78464a40055A05140m3162a31387A32829P571m6366M6164m5193C8923a12925
$$ 178464 -140055 105140 61978 -131387 132829 140400 94034 140198 95005 38923 -112925
11361a22216A18818J95580A3508g5818j02995d3579j02573E7429O9526c732k11232
$$ -122216 118818 314398 13508 -75818 -178813 -43579 -146152 57429 126955 -3732 -214964
11350b14964O2455e2074F6957b24279j86089A78247b16900k7936A63664L3112
$$ -214964 -152509 -52074 66957 -224279 -410368 178247 -216900 -244836 163664 196776
11340A96776b36318a14785p5041A70005b22772N5234E6087b47939A40182a08787
$$ 196776 -236318 -114785 -189826 170005 -222772 -167538 56087 -247939 140182 -108787
11329a66538C83925a68208g0333a267A33653b81469B03028O440H609a85525A3321
$$ -166538 383925 -168208 -70333 -1267 133653 -281469 203028 209468 8609 -185525 13321
11317A74221b3692r3939C36138a16577r9089i0205E1540b7556A48825j1276h9910
$$ 174221 -23692 -117631 336138 -116577 -215666 -90205 51540 -27556 148825 137549 -89910
11305i1775a1628m11191A04810E0369i2455o5670P3554j90687k2304A26329A7517
$$ -91775 -11628 -422819 104810 50369 -92455 -158125 -84571 -275258 -297562 126329 17517
11293b54301G1325G566a72350G8123k9594c29118f6308j7707k4780C7991a99216
$$ -254301 71325 7566 -172350 78123 48529 -329118 -66308 -84015 -108795 37991 -199216
11281D5799b53562R0549N5587o7178A43611o6492L56125p419f3823k57360J9801
$$ 45799 -253562 -163013 -107426 -174604 143611 77119 433244 425825 -63823 -321183 -301382
11270c01382a8062m46273b9681B1026h6524D21122a56446g3477A20576a90513
$$ -301382 -18062 -464335 -29681 21026 -86524 421122 -156446 -73477 120576 -190513
11259A22532C6269c77l7093j30348n1617j67751a15303B50699A11676c81045A84260
$$ 122532 36269 -377 -37470 -167818 -219435 -387186 -115303 250699 111676 -381045 184260
11247f1539j2672q4816F6118j0440g6031j42620m3861j37909a41111L8472a170
$$ -61539 -74211 -159027 66118 55678 -76031 -218651 -262512 -400421 -141111 -102639 -1170
11235c2506j37869A0846N0501M857a21932j56153d0737N769k03821j94332a72659
$$ -32506 -170375 10846 61347 66204 -121932 -278085 -40737 -34968 -238789 -433121 -172659
11223b15938h6077o279m8402c7054I6165a03396B15151H9422K6384m3213e2568
$$ -215938 -86077 -92356 -140758 -37054 96165 -103396 215151 89422 115806 72593 -52568
11211b01657K73f5540A07918J85232a21307N2646p6778k82794I6345b02411L3303
$$ -201657 -201384 -65540 107918 293150 -121307 -68661 -145439 -428233 96345 -202411 -169108
11200a69108A8311a09618A70783a14372A01921d518n6272A13168a1535n0639j4340
$$ -169108 18311 -109618 170783 -114372 101921 -4518 -60790 113168 -11535 -62174 -76514
11189g6514j77419F8462c81279a19855J5281d4690j75596g000k49993B73387b57965
$$ -76514 -253933 68462 -381279 -119855 -104574 -44690 -220286 -7000 -256993 273387 -257965
11177G5249M4128a15790A3604a18573G4478c7066j55197B98407e0550k11188F3728
$$ 75249 119377 -115790 13604 -118573 74478 -37066 -192263 298407 -50550 -261738 63728
11165i407j0245e157B34567a5153P170m5972m2425r1547H7500b54137O3293P3230
$$ -9407 -19652 -5157 234567 -15153 -7983 -53955 -96380 -187927 87500 -254137 -190844 -117614
11153a17614j36057D017J55169i8978Q45j52987a06212A26024b18261f2731j27643
$$ -117614 -253671 4017 159186 -98978 -98133 -251120 -106212 126024 -218261 -62731 -190374
11142a90374r4729I9681g657C3459J10071a09243M6167b9437l6946l19580B1859
$$ -190374 -285103 99681 -7657 33459 143530 -109243 -63076 -29437 -66383 -385963 21859
11130c05554a22764M5532a0208A24658m7424N7647A1236i9998A60487b72466N6369
$$ -305554 -122764 -77232 -10208 124658 77234 134881 11236 -99998 160487 -272466 -216097
11119b16097b9187p2861r8937c1071A17022o676K057k6837O489b34352C18993
$$ -216097 -29187 -102048 -200985 -31071 117022 110346 112403 85566 92055 -234352 318993
11107b7663l607A42740P2057j6040i4781A49425b61626A2982c31847A06765K41834
$$ -27663 -31270 142740 214797 198757 -94781 149425 -261626 12982 -331847 106765 348599
11096C48599c80674B22354N050c4708D42135F3370J63661M7818r8637a9719A5737
$$ 348599 -380674 222354 227404 -34708 442135 63370 227031 274849 176212 -19719 15737
11084a32616m2320j15995E5565a860n9366A78590J4520e0751B43575K1113a06333
$$ -132616 -174936 -290931 55565 -1860 -61226 178590 193110 -50751 243575 264688 -106333
11072e6554j23759A52052J81968d1274j63883a3122B10223K20892J4091k04538
$$ -56554 -180313 152052 334020 -41274 -205157 -13122 210223 431115 445206 240668
11062B40668B7160L87818A22723K03531q582E2484K0144O12216j89763p0660J9785
$$ 240668 27160 414978 122723 326254 317672 52484 72628 684844 495081 424421 444206
11051D44206j73166E6170E246N45253J00058G3486K12601K34492J71543B32004
$$ 444206 271040 56170 5246 550499 650557 73486 286087 520579 692122 232004
11040C46706J94288Q2379A61492K10411K8946o3552c0275D42450Q4297A97539
$$ 346706 540994 623373 161492 371903 400849 337297 -30275 442450 526747 197539
11029D78723k28152L0188J66203j82368B8929K60568L42739j98596j84884q808
$$ 478723 250571 280759 446962 264594 28929 289497 632236 433640 248756 239948
11019B39948L29758C7799J0557L84856A50830K64870O1636n3389P5532A96119
$$ 239948 569706 37799 48356 433212 150830 415700 477336 423947 499479 196119
11008A49548N1006n2873L40337j74025j14866M8205J97508j63291C1281N0991
$$ 149548 200554 147681 488018 313993 199127 247332 444840 281549 31281 82272
10998H2272M31478q9359I7300L59198N7756l7882A50032L47869j57775n0172E1592
$$ 82272 513750 424391 97300 456498 514254 476372 150032 497901 340126 289954 51592
10986C49545J21172K14598l12042K12487k23619A49818N16818l01022L18262J98425
$$ 349545 470717 685315 373273 585760 362141 149818 666636 365614 683876 882301
10976H82301O6548D52699K43783L590N9931N75082k12034L2648K97912j4605J10084
$$ 882301 948849 452699 696482 700072 760003 1335085 1123051 1155699 1453611 1439006 1549090
10965A549090K49173l61920q9296m2785l23275J32395p8973k88062K62256J63258
$$ 1549090 1798263 1436343 1347047 1304262 980987 1113382 1034409 746347 1008603 1171861
10955A171861k42510L6605O4177L6817k91297r460J86910j98605l405k76131L61344
$$ 1171861 929351 965956 1030133 1066950 775653 766193 953103 754498 751093 474962 836306
10944H36306C11573M3086J33437o1237a38707B59963P2523g5238C80661o6531
$$ 836306 311573 354659 488096 426859 -138707 259963 332486 -75238 380661 314130
10934C14130A1473J22289A4264c9027H4464i7054c9236I8669e1715D01291b30839
$$ 314130 11473 133762 14264 -39027 84464 -97054 -39236 98669 -51715 401291 -230839
10922g1290C14155c51107a930A5040a73685d3920k09966I6494J60811a32392A32062
$$ -71290 314155 -351107 -1930 15040 -173685 -43920 -253886 96494 257305 -132392 132062
10910c61185g1112A39401a19412k84739A68170i0747b5372j5205q7716A4081P5450
$$ -361185 -71112 139401 -119412 -404151 168170 -90747 -25372 -40577 -128293 14081 89531
10899H9531J77333a9084j00707e4174B7524n538a12733B44803c54562c0584o8033
$$ 89531 266864 -19084 -119791 -54174 27524 21986 -112733 244803 -354562 -30584 -98617
10888i8617A05689D0817j870b02569A53409n0157a97003B7557a56463f9301C8735
$$ -98617 105689 40817 38947 -202569 153409 103252 -197003 27557 -156463 -69301 38735
10876e3475j00108k1133c2406j49167A55967l9256L1066f9933l620j44824N8849
$$ -53475 -153583 -174716 -32406 -181573 155967 116711 147777 -69933 -73553 -218377 -159528
10865a59528K4151b6385N199B32059n7739O986b05050E2956d3933j73692C9047
$$ -159528 -135377 -26385 -21186 232059 174320 181306 -205050 52956 -43933 -217625 39047
10853A11956O2854A3979K10844d9437k60057e4376j97370a12117M194j04391A78682
$$ 111956 174810 13979 224823 -49437 -309494 -54376 -251746 -112117 -107923 -212314 178682
10841d9771j8460B83454p8226D3277C705K10495L0544A8609g1703A6770h3965
$$ -49771 -68231 283454 205228 43277 3705 214200 244744 18609 -71703 16770 -83965
10829A8028K80682j33857n257J71179c4682D7229a98200a9578j74943e1400A49051
$$ 18028 298710 164853 159596 330775 -34682 47229 -198200 -19578 -194521 -51400 149051
10817I9029a37703e3492F129h1285j10930d9231a1653A47686a13539E2713b53298
$$ 99029 -137703 -53492 6129 -81285 -192215 -49231 -11653 147686 -113539 52713 -253298
10805I3775a01681j86017q3379i0760m8608k54457G7394j2640M0111n0628i8638
$$ 93775 -101681 -287698 -371077 -90760 -139368 -393825 77394 64754 104865 54237 -98638
10793a19979o5573k14395D29350c8959m58896I7076c55182a61258n1341O5234
$$ -119979 -185552 -399947 429350 -38959 -497855 97076 -355182 -161258 -212599 -147365
10783a47365C9732J04353b09224A37139a61023F8023a47410n044B6914c58083
$$ -147365 39732 144085 -209224 137139 -161023 68023 -147410 -152454 26914 -358083
10772A2869a40544I0258P1261b34668L5758C18483d40928a72300A66343a85132
$$ 12869 -140544 90258 161519 -234668 -198910 318483 -440928 -172300 166343 -185132
10761A08099J34134A19171b21353o552B13461d443j11295l20249H7341r570b20671
$$ 108099 242233 119171 -221353 -227905 213461 -4443 -115738 -435987 87341 77771 -220671
10749a12764H7788a94448h6264L095k5753A35236D8484k1652Q8441d9904A82958
$$ -112764 87788 -194448 -86264 -83169 -108922 135236 48484 26832 115273 -49904 182958
10737A99569I37J94690c32421c2277m0471m8299c4161I4901a07063E1179a9240
$$ 199569 937 195627 -332421 -32277 -72748 -121047 -34161 94901 -107063 51179 -19240
10725a22395M3685H069b01860q3745g8828D46458a21259p8482i3044K6439m2008
$$ -122395 -78710 8069 -201860 -285605 -78828 446458 -121259 -199741 -93044 -66605 -108613
10714a08613N2505P307k65961a43657M1920j43945A46001D3344K14203I266a52986
$$ -108613 -56108 -48801 -314762 -143657 -101737 -245682 146001 43344 257547 9266 -152986
10702h9675j55327A45035b40725I4279a06120A71313c09293a12737G0764d0901
$$ -89675 -245002 145035 -240725 94279 -106120 171313 -309293 -112737 70764 -40901
10691h287H2256a63634C2441K40347D3774K6588a60979A54891K0327c9176F1141
$$ -8287 82256 -163634 32441 272788 43774 70362 -160979 154891 175218 -39176 61141
10679b39012A26574A4357b4998D4582J00818C0716L927J9146e16812J24557a39095
$$ -239012 126574 14357 -24998 44582 145400 30716 34643 53789 -516812 -392255 -139095
10667g6731j26361a2126b18j0632k77827i5517A18056e6612p5439O5461l9833
$$ -76731 -203092 -12126 -218 -10850 -288677 -95517 118056 -56612 -132051 -66590 -106423
10656a06423A38484c7436G3242a30531a5958j53642P1210r0396r4533A7578R0410
$$ -106423 138484 -37436 73242 -130531 -15958 -169600 -98390 -188786 -283319 17578 107988
10645A07988a71402A67899a56729c8564q4132B29470b64939a16048A11542K4571
$$ 107988 -171402 167899 -156729 -38564 -122696 229470 -264939 -116048 111542 136113
10635A36113a95048I3208l9327a84109E053a76735j4049A94110a52011A53833
$$ 136113 -195048 93208 53881 -184109 5053 -176735 -190784 194110 -152011 153833
10624C2198g8851a9626n7913I0378J47939A2546J16377i2382o6122I8316e5673
$$ 32198 -78851 -19626 -77539 90378 238317 12546 128923 -92382 -158504 98316 -55673
10612B12256R4279a74373A22283b62385J05410N6522b1430k5779G3373a14135
$$ 212256 306535 -174373 122283 -262385 -156975 -100453 -21430 -47209 73373 -114135
10601f0227B4703f1219b8295G8282b76275A46599f0168i808G1479l2491j4052
$$ -60227 24703 -61219 -28295 78282 -276275 146599 -60168 -9808 71479 38988 24936
10590B4936J10009b83990a19220A44990l229F055a89849B00085F9874J37388n0614
$$ 24936 134945 -283990 -119220 144990 141761 6055 -189849 200085 69874 207262 156648
10579A56648b84085K2643R4853D06819b01979j26898A39539h4537L1626I0760
$$ 156648 -284085 -261442 -166589 406819 -201979 -328877 139539 -84537 -52911 90760
10568B34322A04441J4394a25846I7829m4083a10899I558R659Q0853g151q4842
$$ 234322 104441 118835 -125846 97829 53746 -110899 9558 19217 100070 -7151 -91993
10557i1993a6657o242k81185q4010a69675A8825K9246a46665F7391c16307N2890
$$ -91993 -16657 -22899 -304084 -388094 -169675 18825 48071 -146665 67391 -316307 -263417
10546b63417B40735j03885m6280a81172f7747A03976h2402j06491k8331A20017
$$ -263417 240735 136850 90570 -181172 -67747 103976 -82402 -188893 -217224 120017
10535a76604j01283a1151j0960G9051c16465A75429a48983L3503J4373D1109a2967
$$ -176604 -277887 -11151 -22111 79051 -316465 175429 -148983 -115480 -101107 41109 -12967
10523e5425F2858c1692o7696A96278a80832A00550j4347l7918a08603j04703e1579
$$ -55425 62858 -31692 -99388 196278 -180832 100550 86203 48285 -108603 -213306 -51579
10511B12627K6942b1106C2276g7406j73819i9775l33594a68054A26011N3021p1585
$$ 212627 239569 -21106 32276 -77406 -251225 -99775 -433369 -168054 126011 179032 107447
10500A07447C6005b53630A03277k9096a91808G7811b32083a14354l6161A97369
$$ 107447 36005 -253630 103277 74181 -191808 77811 -232083 -114354 -150515 197369
10489a01702A60952d1439C0783b16128n9356i9820k5093G9045g0460A34790P3016
$$ -101702 160952 -41439 30783 -216128 -275484 -99820 -124913 79045 -70460 134790 207806
10478B07806N1521I886J83402M7177k6987R7956j37304A3253J72100J21717C1380
$$ 207806 259327 9886 193288 240465 213478 311434 174130 13253 185353 307070 31380
10466a01239m28152A20611i5021o1315C20296a23419b7374j44972k1946G7005
$$ -101239 -529391 120611 -95021 -156336 320296 -123419 -27374 -172346 -194292 77005
10455b0562j92220A17477d2966M967A54841b36067a7303o8315N009l36536B22577
$$ -20562 -212782 117477 -42966 -37999 154841 -236067 -17303 -85618 -80609 -417145 222577
10443B36861C3826f643A87506g5767n125B2009c8900A56988F8217b32077f7062
$$ 236861 33826 -6643 187506 -75767 -80892 22009 -38900 156988 68217 -232077 -67062
10431a46034L8703m260d8637B40503a6900p8716B36685l3225a27741H8452c63826
$$ -146034 -107331 -111591 -48637 240503 -16900 -95616 236685 203460 -127741 88452 -363826
10419a41376q1066A61287e875G8345f9033A00359a83619d8328j25738F1792K99514
$$ -141376 -222442 161287 -5875 78345 -69033 100359 -183619 -48328 -174066 61792 361306
10408C61306a79348J1402n4879J04136K8842o182M2810A11932d14020A07610i9399
$$ 361306 -179348 -167946 -222825 -118689 -89847 -96029 -53219 111932 -414020 107610 -99399
10396a16147r5624A23114h8603C15143c7686G3923g5919a0204A11675a51158B87404
$$ -116147 -211771 123114 -88603 315143 -37686 73923 -75919 -10204 111675 -151158 287404
10384H3596e554f99l35724h0415q642A81142F8220a1861l2772B70328a66830k1504
$$ 83596 -5554 -699 -336423 -80415 -89057 181142 68220 -11861 -44633 270328 -166830 -188334
10372a88334A0170R4578J34122n797J27889b52243a04685A90959J33727j12030
$$ -188334 10170 104748 238870 233073 360962 -252243 -104685 190959 324686 212656
10362B12656F5581B8405e1544j3815C23866k3618A12897J13916q5707m2857L35558
$$ 212656 65581 28405 -51544 -65359 323866 300248 112897 226813 141106 98249 433807
10351D33807C6945a43284A76334a1094B86845L12810A5277K13011a4891B30632
$$ 433807 36945 -143284 176334 -11094 286845 599655 15277 228288 -14891 230632
10340E8150J95613E9454Q4797K60039j66643q6821h5966G3570e0749l51396D56369
$$ 58150 253763 59454 144251 404290 237647 150826 -85966 73570 -50749 -402145 456369
10328F9228L1730a91233f3414a2687F6326K7382c3416l25807A94493o8206i954
$$ 69228 100958 -191233 -63414 -12687 66326 93708 -33416 -359223 194493 126287 -9954
10316A9170O3517J36058a3652j54746k05846I6448b5381l6291a3214k79088J2291
$$ 19170 82687 218745 -13652 -168398 -374244 96448 -25381 -61672 -13214 -292302 -280011
10305b80011A7847b14080Q4877H6598N5134b11110c9223A96106I092g0617R018
$$ -280011 17847 -214080 -129203 86598 141732 -211110 -39223 196106 9092 -70617 -61599
10294f1599C0734b4124G4774J26352c01819R5767g2664C77396b6078A24549b82964
$$ -61599 30734 -24124 74774 201126 -301819 -206052 -72664 377396 -26078 124549 -282964
10282E0510a50465d1452j06033A58557a80590B20700F5071i6433a743j1073k18052
$$ 50510 -150465 -41452 -147485 158557 -180590 220700 65071 -96433 -1743 -12816 -230868
10271b30868n6033C96181I571K5589d8819A17656J3785a95833g7629a4643A30289
$$ -230868 -286901 396181 9571 35160 -48819 117656 131441 -195833 -77629 -14643 130289
10259G547a38840H354f9010A44351b96544B08304K81047A25523L18466A55468
$$ 7547 -138840 8354 -69010 144351 -296544 208304 489351 125523 443989 155468
10248B54887L3573A9712c9607C8668J24843N3708b98275a27676J3460B2485D403
$$ 254887 288460 19712 -39607 38668 163511 217219 -298275 -127676 -114216 22485 4403
10236C9385g3595E4722a829e80j2379k36479M7609H466c72702A48785J0314c1437
$$ 39385 -73595 54722 -1829 -580 -12959 -249438 -201829 8466 -372702 148785 159099 -31437
10223a69379l877k33136B57290b17815j8847P5885C9357J4330c84588A86338a84993
$$ -169379 -173256 -406392 257290 -217815 -236662 -160777 39357 53687 -384588 186338 -184993
10211B7047a28660c7381A53922o8604b90141A1891M6162f94j52036b2450k58398
$$ 27047 -128660 -37381 153922 85318 -290141 11891 58053 -694 -152730 -22450 -280848
10200b80848a8449p5986g52B7447a52831C15135h7537j04284k55407a00566j12313
$$ -280848 -18449 -94435 -752 27447 -152831 315135 -87537 -191821 -447228 -100566 -212879
10189b12879J06083a0517j37621e6942j36027A1860g1792j94335A4404d6732l43059
$$ -212879 -106796 -10517 -148138 -56942 -192969 11860 -71792 -266127 14404 -46732 -389791
10178c89791a63637B81533a51491A28856b6021A99698I7287b09108P4913B80851
$$ -389791 -163637 281533 -151491 128856 -26021 199698 97287 -209108 -134195 280851
10167d5971q5724r0337n4956a32833A03951j4812J58069A04346e739A91166g2018
$$ -45971 -131695 -222032 -276988 -132833 103951 89139 247208 104346 -5739 191166 -72018
10155C6475b48735J10106N5325k49546D65399I7176a63892I3604i6084b5708g017
$$ 36475 -248735 -138629 -83304 -332850 465399 97176 -163892 93604 -96084 -25708 -7017
10143b20744J6532j34251a06130o7196j78144J2938f9206C31044A03883a20678
$$ -220744 -204212 -338463 -106130 -173326 -351470 -338532 -69206 331044 103883 -120678
10132f0511K2421k97336g5312D4077a16026o5980A50428a81546j3919L9377B83145
$$ -60511 -38090 -335426 -75312 44077 -116026 -182006 150428 -181546 -195465 -156088 283145
10120B41021B7955a26004r4604j68827H6361b68731J21887C8178M7646A7376q09
$$ 241021 27955 -126004 -220608 -389435 86361 -268731 -146844 38178 85824 17376 16567
10109A6567K9719h4342a4607m19375A80204E7145g7035H4691L0732a62703J4976
$$ 16567 46286 -84342 -14607 -433982 180204 57145 -77035 84691 115423 -162703 -147727
10098a47727m7631j51466J38247g7830C9169M1592f2698l45693c3586q0778N4687
$$ -147727 -195358 -346824 -208577 -77830 39169 80761 -62698 -408391 -33586 -114364 -59677
10087e9677b3188l0073l4531j1892k44789b9340j86225A53412J06703B9277J04764
$$ -59677 -23188 -53261 -87792 -99684 -344473 -29340 -215565 153412 260115 29277 134041
10076A34041b60574Q2989A83691d6223o5397E8563k3327c2152A83735l3188E3501
$$ 134041 -260574 -177585 183691 -46223 -111620 58563 35236 -32152 183735 150547 53501
10064A44868b96957B26805c3316j30862j7940B7360J31809a35349m858K6585P432
$$ 144868 -296957 226805 -33316 -164178 -182118 27360 159169 -135349 -140207 -113622 -106190
10053a06190o6185j30763p2415J59135g1438E548L1117c22669H5451a95219j69371
$$ -106190 -172375 -303138 -375553 -216418 -71438 5548 36665 -322669 85451 -195219 -364590
10042c64590i2187l147r1677A60181a04171F81e5572A38952a50066k29659h9103
$$ -364590 -92187 -95334 -187011 160181 -104171 681 -55572 138952 -150066 -379725 -89103
10030b25642q5540B0871a41673P03k93655i6755o9454g5742j60141L3685k743
$$ -225642 -311182 20871 -141673 -140970 -434625 -96755 -166209 -75742 -235883 -202198 -204941
10019b04941A8771J88452a98634o5973o2008B2287Q9431a35078A63100J20025
$$ -204941 18771 207223 -198634 -264607 -326615 22287 111718 -135078 163100 283125
10009B83125B1428d63425i9581A7801O7934C441J65065i0286B31821J37537j82500
$$ 283125 21428 -463425 -99581 17801 85735 3441 168506 -90286 231821 369358 186858
9998A86858D3974b92090c8184j55724e6965j26498h6736j43394J08940L5395n6513
$$ 186858 43974 -292090 -38184 -193908 -56965 -183463 -86736 -230130 -121190 -85795 -142308
9987a42308a1431j00868A97410a8520P033k45356a8583o007p5197K8685j18972
$$ -142308 -11431 -112299 197410 -18520 -11487 -256843 -18583 -24590 -99787 -71102 -190074
9976a90074E3302a4894q9776A50713j3560d65025A37889E5721K5936b17741H6769
$$ -190074 53302 -14894 -104670 150713 137153 -465025 137889 55721 81657 -217741 86769
9964a37934G0643a57748C4000b36027i2358F6879a58067j6563b0314I6640F313
$$ -137934 70643 -157748 34000 -236027 -92358 66879 -158067 -174630 -20314 96640 6313
9952A61055c16446A1645K27637Q042E5822b72182Q4506C17347b15875i7039A37286
$$ 161055 -316446 11645 239282 247324 55822 -272182 -187676 317347 -215875 -97039 137286
9940A85297a18329C2184J92780b04736C79829a0238k15477A70915a52990E0718
$$ 185297 -118329 32184 224964 -204736 379829 -10238 -225715 170915 -152990 50718
9929c23675A10832l7908a19555b6638j36413J6582D9887K9030b09905j4204k30332
$$ -323675 110832 72924 -119555 -26638 -163051 -146469 49887 78917 -209905 -224109 -454441
9918d54441J53650A13065h9241h955j1400q0947E68669b33587J6441b2681F4484
$$ -454441 -300791 113065 -89241 -8955 -20355 -101302 568669 -233587 -217146 -22681 64484
9906B28619E4519a40205p4603j23396a22192B8576L15091C6044Q1852a957j45381
$$ 228619 54519 -140205 -214808 -338204 -122192 28576 343667 36044 117896 -1957 -147338
9895a47338k8799B07338o1372i5948b7384k89954a14260G5917a3887p4511A9582
$$ -147338 -176137 207338 145966 -95948 -27384 -317338 -114260 75917 -13887 -88398 19582
9883D081d3067D3450d6341q3586a4268H8923j9264b43551B59400a20607M091j26089
$$ 4081 -43067 43450 -46341 -129927 -14268 88923 69659 -243551 259400 -120607 -116516 -242605
9871b42605E2500L393A8842d1452J7420C7620b05859c2277k27425A54336N5874
$$ -242605 52500 55893 18842 -41452 -24032 37620 -205859 -32277 -259702 154336 210210
9860B10210I871R962J07273c3023E2544c4754k7355j89531C6167a74822E891d8290
$$ 210210 9871 19833 127106 -33023 52544 -34754 -62109 -251640 36167 -174822 5891 -48290
9847b31655n7565c9291B06614a04757j43544B50379C0295J23150b0452b913j53237
$$ -231655 -289220 -39291 206614 -104757 -248301 250379 30295 153445 -20452 -2913 -156150
9836a56150d7105A12019k0531q094a1994K199k45679q879J29055b9789A28322
$$ -156150 -47105 112019 91488 83394 -11994 -9795 -255474 -264353 -135298 -29789 128322
9824c45707B28638c3742n7272A73624F2690N7079i4118p1583A49695J20599j24290
$$ -345707 228638 -33742 -91014 173624 62690 119769 -94118 -165701 149695 270294 146004
9813A46004b57466g6118k002k32019J3384c3763j57640c1872k84954J49595G1209
$$ 146004 -257466 -76118 -78120 -310139 -296755 -33763 -191403 -31872 -316826 -167231 71209
9801C43226a50235n7365E0674g5238B9360b07147J02744A84046l2930c49471J3191
$$ 343226 -150235 -207600 50674 -75238 29360 -207147 -104403 184046 151116 -349471 -336280
9790c36280C10249b26153M2099L9670r2707r104j31309J24033J02737k41070a02405
$$ -336280 310249 -226153 -184054 -144384 -237091 -246195 -377504 -253471 -150734 -391804 -102405
9778b26667J07225b0067j47892Q0649G5599A6816L14940b93400f2076p2187j45820
$$ -226667 -119442 -20067 -167959 -87310 75599 16816 331756 -293400 -62076 -134263 -280083
9767b80083Q8371A39415e2331r965b8429j24347N4582j34531d6752j74770F9154
$$ -280083 -191712 139415 -52331 -62296 -28429 -152776 -98194 -232725 -46752 -221522 69154
9755c9996n8380q055j99939B7337c2440o001a6136A42626D6042J77766C2811b7180
$$ -39996 -98376 -106431 -306370 27337 -32440 -38441 -16136 142626 46042 223808 32811 -27180
9742A94919B0168P8417a43102D3693b05074j3316k1045I4369d7694k72939a22863
$$ 194919 20168 98585 -143102 43693 -205074 -218390 -239435 94369 -47694 -320633 -122863
9730a54745N4403a8153j36434B31371n7067H2817a15262B247a24126O0807b9278
$$ -154745 -100342 -18153 -154587 231371 174304 82817 -115262 2247 -124126 -63319 -29278
9718A82244b65688D7093f1521l35266e8819A32380a05695c9293A52769b00425
$$ 182244 -265688 47093 -61521 -396787 -58819 132380 -105695 -39293 152769 -200425
9707B5365c971n9223j29236A47389o6385f7389E3973b29301K8018I8744a24749
$$ 25365 -3971 -63194 -192430 147389 81004 -67389 53973 -229301 -201283 98744 -124749
9695C6366B603b1994B39815b27834d8524j10892j7434J6159D4681a8565H6580
$$ 36366 2603 -21994 239815 -227834 -48524 -159416 -176850 -160691 44681 -18565 86580
9683A62482f4123H6784R4221A3985g9920d265A69391b07889e2640J5450j05207
$$ 162482 -64123 86784 181005 13985 -79920 -4265 169391 -207889 -52640 -37190 -142397
9672a42397r8798F0378d412n8804p1191A27951Q1982a78691A68096f3535j79947
$$ -142397 -241195 60378 -4412 -63216 -134407 127951 209933 -178691 168096 -63535 -243482
9661b43482h6046k38585A97986F547a75675F7610K9881J20814b76761a05464l5855
$$ -243482 -86046 -324631 197986 6547 -175675 67610 97491 218305 -276761 -105464 -141319
9650a41319A22187g4975k29978A49966a27618L9452Q889A59248a95173k973j56972
$$ -141319 122187 -74975 -304953 149966 -127618 -88166 -79277 159248 -195173 -198146 -355118
9639c55118B31972b76506A86173c19383e287G4558a78064c9470C0429b46485e1048
$$ -355118 231972 -276506 186173 -319383 -5287 74558 -178064 -39470 30429 -246485 -51048
9627b12506D62943a51319p0984B65098b70820a02552l6177H3529O0411a94087
$$ -212506 462943 -151319 -222303 265098 -270820 -102552 -138729 83529 143940 -194087
9616a34498M3333B22507a2587A10752A1693P9501m3261a01380j322b6601k01592
$$ -134498 -91165 222507 -12587 110752 11693 91194 47933 -101380 -102702 -26601 -228193
9605b28193A44546a35347F7883d13323J25431a3094j62650A01395a2519j64288
$$ -228193 144546 -135347 67883 -413323 -287892 -13094 -175744 101395 -12519 -176807
9595a76807j1050j87668a31996m6186D13650a28048q5756Q5578G0411N2523c3685
$$ -176807 -187857 -375525 -131996 -178182 413650 -128048 -213804 -128226 70411 122934 -33685
9583b56715N0399D5211b55362D4028o580b12173i9402B24476a49004d7993o5422
$$ -256715 -206316 45211 -255362 44028 37448 -212173 -99402 224476 -149004 -47993 -113415
9572a13415D2599c30580A03150a26536B573J01402b11058L7678H2713c43155J02256
$$ -113415 42599 -330580 103150 -126536 2573 103975 -211058 -173380 82713 -343155 -240899
9561b40899G344c72435J05751A51323c4831A1491O1345a03549B33818a83164N1813
$$ -240899 7344 -372435 -266684 151323 -34831 11491 72836 -103549 233818 -183164 -131351
9550a31351G1842b54433A13651a39813c908j58016A64377d4329k72417i879k8016
$$ -131351 71842 -254433 113651 -139813 -3908 -161924 164377 -44329 -316746 -9879 -37895
9539c7895H5164C6729i7874F1124c5797k6390B25545f1580A49198J55420G398
$$ -37895 85164 36729 -97874 61124 -35797 -62187 225545 -61580 149198 304618 7398
9527d17121E6096a74596a8160l97102B9312M7891N0267I323f1457k15602J30635
$$ -417121 56096 -174596 -18160 -415262 29312 77203 127470 9323 -61457 -277059 -146424
9516a46424N5323A26818A8851a22078B56776a09888p6720O4278B9278c064k03535
$$ -146424 -91101 126818 18851 -122078 256776 -109888 -186608 -122330 29278 -3064 -206599
9505b06599A32858E4951a67798A41810b403j45065p0497d3371E5085M4453d3729
$$ -206599 132858 54951 -167798 141810 -2403 -147468 -217965 -43371 55085 99538 -43729
9493a58636I7884i1958H3007a38486E1230J43468D7373P526p809c67850B1633
$$ -158636 97884 -91958 83007 -138486 51230 194698 47373 54899 47090 -367850 21633
9481C9734a1902j96290A03933J4118Q5624a08274k03227J48183C6974A0929e7008
$$ 39734 -11902 -208192 103933 118051 203675 -108274 -311501 -163318 36974 10929 -57008
9469a16543m9169E4142K420L173O1568c30052g0260P303k08974A59006b2105j39021
$$ -116543 -165712 54142 56562 59735 121303 -330052 -70260 -62957 -271931 159006 -22105 -161126
9457a61126b3509k7308J5789r5248F8006J11800a78451B24475g2958D68044h6026
$$ -161126 -23509 -50817 -35028 -130276 68006 179806 -178451 224475 -72958 468044 -86026
9445b0197j9417n7596l406J274B5553J01137Q4818H3810a74865P9951A38933b76458
$$ -20197 -39614 -97210 -100616 -99342 25553 126690 211508 83810 -174865 -94914 138933 -276458
9432a43739A77382O0014b24941A94821a44322j6884I9098a98652O4894j38452
$$ -143739 177382 237396 -224941 194821 -144322 -161206 99098 -198652 -133758 -272210
9422b72210g2233j08261O3175a4754B6251a44755k33316A63381o2683k9332b84778
$$ -272210 -72233 -180494 -117319 -14754 26251 -144755 -378071 163381 100698 71366 -284778
9410C0296N6408j1724K38227j55824D1928M5539b48004A80468i3476k29091J02519
$$ 30296 86704 74980 313207 157383 41928 87467 -248004 180468 -93476 -322567 -220048
9399b20048B05907b74511H3128c61036R677i1560n3714c1822m13494a70191N8479
$$ -220048 205907 -274511 83128 -361036 -351359 -91560 -145274 -31822 -445316 -170191 -111712
9388a11712r9086I8173d4602B34928a2509A86628C2340J38112e8416j48971c6989
$$ -111712 -210798 98173 -44602 234928 -12509 186628 32340 170452 -58416 -207387 -36989
9376a43232a4073A7718N3328i8368p8364B6180a32712B1391h2662K9139j69240
$$ -143232 -14073 17718 71046 -98368 -176732 26180 -132712 21391 -82662 -53523 -222763
9365b22763A87848a35896K7104j46234A64591A2919b02189g943j70227p5694a7606
$$ -222763 187848 -135896 -108792 -255026 164591 12919 -202189 -7943 -178170 -253864 -17606
9353I3551d5085b1961j99361C16798b11403e1195m9977D40868a0290j9512j27868
$$ 93551 -45085 -21961 -221322 316798 -211403 -51195 -101172 440868 -10290 -29802 -157670
9342a57670n2032K772D3133b07095A48626c47950a53438j88102A32502c15402
$$ -157670 -209702 -206930 43133 -207095 148626 -347950 -153438 -341540 132502 -315402
9331g8330A30865a64702j43422f5528j74988Q0961c6230j67189j01390j68343
$$ -78330 130865 -164702 -308124 -65528 -240516 -159555 -36230 -203419 -304809 -473152
9321d73152J35657D66269E4749J48230e4359C7495c2405q1584o1163F9456j4178
$$ -473152 -337495 466269 54749 202979 -54359 37495 -32405 -113989 -175152 69456 55278
9310E5278P9876b69767A7473b3736j45473E5879i9505E2296d3558k46795G4750
$$ 55278 135154 -269767 17473 -23736 -169209 55879 -99505 52296 -43558 -290353 74750
9298b5137A8973a39597A28296g3997j89649a9697I6068b01191A14047f8231j03469
$$ -25137 18973 -139597 128296 -73997 -263646 -19697 96068 -201191 114047 -68231 -171700
9287a71700c0322E9274b80451J6456E9339a31152K9013b6690k72A356a45034A36377
$$ -171700 -30322 59274 -280451 -263995 59339 -131152 -102139 -26690 -26962 1356 -145034 136377
9274b09571I6264a39199b6000o8668A21365b5635j43344q5207j10085C40085H8238
$$ -209571 96264 -139199 -26000 -94668 121365 -25635 -168979 -254186 -364271 340085 88238
9262B01437C9193B885J90664a42546e7131k31191J05488A64149h3295k78946a42137
$$ 201437 39193 2885 193549 -142546 -57131 -288322 -182834 164149 -83295 -362241 -142137
9250A36027a10858j7146E25366C9474a62032b3979C4013c58965A43967a99339
$$ 136027 -110858 -128004 525366 39474 -162032 -23979 34013 -358965 143967 -199339
9239I1849h3189A8789b679B38403o3616o2414N9714a73357d335B14354a02535
$$ 91849 -83189 18789 -2679 238403 174787 112373 172087 -173357 -4335 214354 -102535
9227h9278A11866c11748I8851g2453j42247f7361B37117o6881c04533k90347a39045
$$ -89278 111866 -311748 98851 -72453 -214700 -67361 237117 170236 -304533 -594880 -139045
9215h3646p1200b1158I6862b06542m5025c6332A39693m1158L1355K39445C4559
$$ -83646 -154846 -21158 96862 -206542 -251567 -36332 139693 98535 129890 369335 34559
9203B15824I7624a40348B51220b46032d1874k0945a6938B3942P0570f374r1251
$$ 215824 97624 -140348 251220 -246032 -41874 -62819 -16938 23942 94512 -6374 -97625
9192i7625d5337q1403F2758b67795A0180L55892c21441K9665a34349f2979q2680
$$ -97625 -45337 -126740 62758 -267795 10180 366072 -321441 -291776 -134349 -62979 -145659
9181a45659H3415r630a25297a374k44686A03466k6916a52048f6686m1154O168
$$ -145659 83415 73785 -125297 -1374 -246060 103466 76550 -152048 -66686 -107840 -101672
9170a01672b6549A97711p4690a6341j02045H9612a58848A07864C6792h7874J8403
$$ -101672 -26549 197711 123021 -16341 -118386 89612 -158848 107864 36792 -87874 -69471
9159f9471D1399a30690I113d804H5580P7513a71992d8878j19899A09248C3655
$$ -69471 41399 -130690 9113 -4804 85580 163093 -171992 -48878 -168777 109248 33655
9147b06576K069I3067b40426f9313j5540A22804b41775F87L26881b34017a15465
$$ -206576 -204507 93067 -240426 -69313 -84853 122804 -241775 687 327568 -234017 -115465
9135b90774h4369C22524f6334k14319g3438A11846e4669J1587j31616B03749k1017
$$ -290774 -84369 322524 -66334 -280653 -73438 111846 -54669 -43082 -174698 203749 182732
9124A82732a82776h8135K3740n7937k93164a57436e1905j85522k8701C9748b47785
$$ 182732 -182776 -88135 -64395 -122332 -415496 -157436 -51905 -237427 -266128 39748 -247785
9112F1855J35481P8401c33968a9469n92452c0315j89908h1512A51577d07333i9397
$$ 61855 197336 275737 -333968 -19469 -611921 -30315 -220223 -81512 151577 -407333 -99397
9100B32661q7736c88741G9339p456f9200j42074C2374a32958j82569F9908b7828
$$ 232661 144925 -388741 79339 71883 -69200 -211274 32374 -132958 -315527 69908 -27828
9088A34210a8941a689B6006h8037F8021c37003a47882K6806e4384j73107M390
$$ 134210 -18941 -1689 26006 -88037 68021 -337003 -147882 -121076 -54384 -227491 -223101
9077b23101O1953B0339R2147O2008d040j1144A31595c2512k53262P6653D4396
$$ -223101 -161148 20339 112486 174494 -4040 -15184 131595 -32512 -285774 -209121 44396
9065a3158j9297I3391d4108j19624F9829K7819b00700l6740P0648a8m3864B13393
$$ -13158 -32455 93391 -44108 -163732 69829 97648 -200700 -237440 -166792 -18 -43882 213393
9052b84968d5511A9091J56863C397J8211b63981A1217a25050b148j81166P0269
$$ -284968 -45511 19091 175954 3397 21608 -263981 11217 -125050 -2148 -183314 -113045
9041a13045d0930j10502j97800Q0460A15468a63972B85949j18869A1418a2425
$$ -113045 -40930 -151432 -349232 -268772 115468 -163972 285949 167080 11418 -12425
9030a624p7971p6811j43009A2382J05081b83700c2293A07510J3582b73782d3011
$$ -1624 -79595 -156406 -299415 12382 117463 -283700 -32293 107510 121092 -273782 -43011
9018a42465L5364o5350A63404b93150a11160A24208a49886N632C1570O1892J57099
$$ -142465 -107101 -172451 163404 -293150 -111160 124208 -149886 -144254 31570 93462 250561
9007B50561a70903I6658h9501G5604c42614a60442k11946a1092k01843A16915
$$ 250561 -170903 96658 -89501 75604 -342614 -160442 -372388 -11092 -212935 116915
8996A58288D7618g3568j25135A11646b23075B02189k1647a19027P886k10816B36709
$$ 158288 47618 -73568 -198703 111646 -223075 202189 180542 -119027 -111141 -321957 236709
8984a79167A36805o2669b22758P2448k7668q0184h4842E3263a44040B27840g53
$$ -179167 136805 74136 -222758 -150310 -177978 -258162 -84842 53263 -144040 227840 -753
8972e11613a64736B1325K18225c0538j17421k7986F2509c36400A9061J15273c3300
$$ -511613 -164736 21325 239550 -30538 -147959 -175945 62509 -336400 19061 134334 -33300
8960i4559q7781k99834B5579a80440q0830O4316A47469c03425D47952i8493E1322
$$ -94559 -182340 -482174 25579 -180440 -261270 -196954 147469 -303425 447952 -98493 51322
8948a23246A47186a73050a979j73276A0074J03414a04510n5207h911j1951k18500
$$ -123246 147186 -173050 -1979 -175255 10074 113488 -104510 -159717 -8911 -20862 -239362
8937b39362e9730B04963e4884j04911B53578A0513a27409E6519J2974B8931L4865
$$ -239362 -59730 204963 -54884 -159795 253578 10513 -127409 56519 69493 28931 63796
8926F3796e5250F4135a3149j59280I6847P3293p4407O80026Q8812C36830C3266
$$ 63796 -55250 64135 -13149 -172429 96847 170140 95733 775759 864571 336830 33266
8914e8824l7024C51775H9506a04606p0916j8124f8526k5920f987k13928j9067
$$ -58824 -95848 351775 89506 -104606 -175522 -193646 -68526 -94446 -6987 -220915 -239982
8903b39982A21218a41335a7817k33773h5539A17247E6601c7451j40353N0500b6532
$$ -239982 121218 -141335 -17817 -251590 -85539 117247 56601 -37451 -177804 -127304 -26532
8891a09843j34787a6638A98554B3986J05205E0302b96140d7396q394j65504A1718
$$ -109843 -244630 -16638 198554 23986 129191 50302 -296140 -47396 -55790 -221294 11718
8879f7678j45411b43B47184a62042F3583a06822D2602L6888c50997R3813g1639
$$ -67678 -213089 -243 247184 -162042 63583 -106822 42602 79490 -350997 -257184 -71639
8867b56913o2401B2036G254J13190a69364k1585H1573a23023p039j39088R6956
$$ -256913 -319314 22036 7254 120444 -169364 -190949 81573 -123023 -130062 -269150 -172194
8856a72194m5421H3989L9480m6079a5292k76056H0242e039A30358J71797F83M317
$$ -172194 -217615 83989 123469 77390 -15292 -291348 80242 -5039 130358 302155 683 5000
8844E000L59581C6389A3857b96219A85955a53727p9836F5810a55914r9305l0033
$$ 5000 364581 36389 13857 -296219 185955 -153727 -233563 65810 -155914 -255219 -285252
8833b85252a27967j55489c0638A27636E1610M7265a19333B56205b11520q6040
$$ -285252 -127967 -283456 -30638 127636 51610 98875 -119333 256205 -211520 -297560
8823b97560c1656A50830f067D0842a19475B11779q2724J9128e2364A33337g7432
$$ -297560 -31656 150830 -6067 40842 -119475 211779 129055 148183 -52364 133337 -77432
$$ [...]
##END NTUPLES=NMR SPECTRUM
##END=
