##TITLE=NES1095_T12_9886966_kAx0Q6P168
##JCAMPDX= 6.0         $$ Bruker NMR JCAMP-DX V2.0
##DATA TYPE= NMR SPECTRUM
##DATA CLASS= NTUPLES
##ORIGIN= BRUKER
##OWNER= Administrator
$$ 1.72 TOPSPIN		Version 2.1
$$ 2016-08-28 20:55:41.101 -0500  Administrator@X
$$ Compression mode = diff/dup
##.OBSERVE FREQUENCY= 400.02188249412
##.OBSERVE NUCLEUS= ^1H
##.ACQUISITION MODE= SIMULTANEOUS (DQD)
##.ACQUISITION SCHEME= undefined
##.AVERAGES= 8
##.DIGITISER RES= 22
##SPECTROMETER/DATA SYSTEM= spect
##.PULSE SEQUENCE= zg30
##.SOLVENT NAME= COFFEE_meoh
##.SHIFT REFERENCE= INTERNAL, COFFEE_meoh, 1, 14.98509
##AUDIT TRAIL= $$ (NUMBER, WHEN, WHO, WHERE, PROCESS, VERSION, WHAT)
$$ ##TITLE= Audit trail, TOPSPIN		Version 2.1
$$ ##JCAMPDX= 5.01
$$ ##ORIGIN= Bruker BioSpin GmbH
$$ ##OWNER= Administrator
$$ $$ E:\/data/COFFEE/nmr/NES1095_T12_9886966_kAx0Q6P168/20/pdata/1/auditp.txt
$$ ##AUDIT TRAIL=  $$ (NUMBER, WHEN, WHO, WHERE, PROCESS, VERSION, WHAT)
(   1,<2016-08-28 20:55:34.086 -0500>,<Administrator>,<X>,<go>,<TOPSPIN 2.1>,
      <created by zg
	started at 2016-08-28 20:54:27.554 -0500,
	POWCHK enabled, PULCHK disabled,
       configuration hash MD5:
       21 0F 79 D6 B3 7B B4 F6 88 20 88 DB 03 48 BD 9F
       data hash MD5: 64K
       80 BC A0 D3 D3 8C 5D 68 F4 31 D8 84 4D 7A 45 6D>)
(   2,<2016-08-28 20:55:37.117 -0500>,<Administrator>,<X>,<proc1d>,<TOPSPIN 2.1>,
      <Start of raw data processing
       efp LB = 0 FT_mod = 6 PKNL = 1 PHC0 = 0 PHC1 = 0 SI = 32K 
       data hash MD5: 32K
       82 B2 F5 31 4F 69 7C 72 9E B7 56 F5 E0 2E 7D E5>)
(   3,<2016-08-28 20:55:37.398 -0500>,<Administrator>,<X>,<proc1d>,<TOPSPIN 2.1>,
      <pk PHC0 = 94.35608 PHC1 = 0 
       data hash MD5: 32K
       B6 61 E2 CA 60 92 41 3E 04 F7 29 6E D7 DC A3 E8>)
(   4,<2016-08-28 20:55:37.508 -0500>,<Administrator>,<X>,<proc1d>,<TOPSPIN 2.1>,
      <abs ABSG = 1 
       data hash MD5: 32K
       54 21 EF C6 7A 8A A5 70 84 73 76 11 84 42 F2 0B>)
(   5,<2016-08-28 20:55:37.554 -0500>,<Administrator>,<X>,<proc1d>,<TOPSPIN 2.1>,
      <abs ABSG = 2 
       data hash MD5: 32K
       FB 01 FC 89 CD 2E D3 31 C1 42 5F 68 D7 B4 57 37>)
(   6,<2016-08-28 20:55:37.617 -0500>,<Administrator>,<X>,<proc1d>,<TOPSPIN 2.1>,
      <abs ABSG = 3 
       data hash MD5: 32K
       B8 5E 1E 1B C2 CF 45 35 D6 79 8B CD 85 BC 96 1B>)
(   7,<2016-08-28 20:55:37.679 -0500>,<Administrator>,<X>,<proc1d>,<TOPSPIN 2.1>,
      <abs ABSG = 4 
       data hash MD5: 32K
       F6 46 9E ED 6A F3 75 BB AB EC 96 67 D4 FA 01 BF>)
(   8,<2016-08-28 20:55:37.726 -0500>,<Administrator>,<X>,<proc1d>,<TOPSPIN 2.1>,
      <abs ABSG = 5 
       data hash MD5: 32K
       93 32 6B BB 57 5D 62 5E 1E 47 85 41 D6 39 B0 12>)
$$ ##END=
$$ 
$$ $$ hash MD5
$$ $$ 91 BD 45 CD 88 C2 06 71 6B 4D BB D9 03 35 A0 C8
##$RELAX= 
##$RELAX= 
##$RELAX= 
##$RELAX= 
##$RELAX= 
##$RELAX= 
##$RELAX= 
$$ Bruker specific parameters
$$ --------------------------
##$DU= <E:\>
##$EXPNO= 20
##$NAME= <NES1095_T12_9886966_kAx0Q6P168>
##$PROCNO= 1
$$ [...]
150 150 150 150 150 150 150 150
##$TP07= 0
##$TPNAME0= <>
##$TPNAME1= <>
##$TPNAME2= <>
##$TPNAME3= <>
##$TPNAME4= <>
##$TPNAME5= <>
##$TPNAME6= <>
##$TPNAME7= <>
##$TPOAL= (0..7)
0.5 0.5 0.5 0.5 0.5 0.5 0.5 0.5
##$TPOFFS= (0..7)
0 0 0 0 0 0 0 0
##$TUNHIN= 0
##$TUNHOUT= 0
##$TUNXOUT= 0
##$USERA1= <user>
##$USERA2= <user>
##$USERA3= <user>
##$USERA4= <user>
##$USERA5= <user>
##$V9= 5
##$VALIST= <valist>
##$VCLIST= <CCCCCCCCCCCCCCC>
##$VD= 0
##$VDLIST= <DDDDDDDDDDDDDDD>
##$VPLIST= <PPPPPPPPPPPPPPP>
##$VTLIST= <TTTTTTTTTTTTTTT>
##$WBST= 2048
##$WBSW= 25
##$XGAIN= (0..3)
0 0 0 0
##$XL= 0
##$YL= 0
##$YMAX_a= 605532
##$YMIN_a= -507608
##$ZGOPTNS= <>
##$ZL1= 120
##$ZL2= 120
##$ZL3= 120
##$ZL4= 120
##$ABSF1= 14.98509
##$ABSF2= -5.573092
##$ABSG= 5
##$ABSL= 3
##$ALPHA= 0
##$AQORDER= 0
##$ASSFAC= 0
##$ASSFACI= 0
##$ASSFACX= 0
##$ASSWID= 0
##$AUNMP= <proc_prof1d_extract_pilot.lims>
##$AXLEFT= 0
##$AXNAME= <>
##$AXNUC= <1H>
##$AXRIGHT= 0
##$AXTYPE= 0
##$AXUNIT= <>
##$AZFE= 0.1
##$AZFW= 0.1
##$BCFW= 0
##$BC_mod= 0
##$BYTORDP= 0
##$COROFFS= 0
##$CY= 15
##$DATMOD= 1
##$DC= 0
##$DFILT= <>
##$DTYPP= 0
##$F1P= 0
##$F2P= 0
##$FCOR= 0.5
##$FTSIZE= 32768
##$FT_mod= 6
##$GAMMA= 0
##$GB= 0
##$INTBC= 1
##$INTSCL= 1
##$ISEN= 128
##$LB= 0
##$LEV0= 0
##$LPBIN= 0
##$MAXI= 10000
##$MC2= 0
##$MEAN= 0
##$ME_mod= 0
##$MI= 0
##$NCOEF= 0
##$NC_proc= -8
##$NLEV= 6
##$NOISF1= 0
##$NOISF2= 0
##$NSP= 0
##$NTH_PI= 0
##$NZP= 0
##$OFFSET= 14.98509
##$PC= 1
##$PHC0= 94.35608
##$PHC1= 0
##$PH_mod= 1
##$PKNL= yes
##$PPARMOD= 0
##$PPDIAG= 0
##$PPIPTYP= 0
##$PPMPNUM= 2147483647
##$PPRESOL= 1
##$PSCAL= 4
##$PSIGN= 0
##$PYNMP= <proc.py>
##$REVERSE= no
##$SF= 400.02
##$SI= 32768
##$SIGF1= 0
##$SIGF2= 0
##$SINO= 400
##$SIOLD= 32768
##$SPECTYP= <>
##$SREGLST= <1H.CDCl3>
##$SSB= 0
##$STSI= 32768
##$STSR= 0
##$SW_p= 8223.68421052631
##$SYMM= 0
##$S_DEV= 0
##$TDeff= 65536
##$TDoff= 0
##$TI= <>
##$TILT= no
##$TM1= 0
##$TM2= 0
##$TOPLEV= 0
##$USERP1= <user>
##$USERP2= <user>
##$USERP3= <user>
##$USERP4= <user>
##$USERP5= <user>
##$WDW= 1
##$XDIM= 32768
##$YMAX_p= 444697922
##$YMIN_p= -680226
##$CURPLOT= <Network HP LaserJet P1505>
##$CURPRIN= <$Network HP LaserJet P1505>
##$DFORMAT= <normdp>
##$LAYOUT= <+/1D_H.xwp>
##$LFORMAT= <normlp>
##$PFORMAT= <normpl>
##$SURQMSG= 1
$$ End of Bruker specific parameters
$$ ---------------------------------
##NTUPLES= NMR SPECTRUM
##VAR_NAME=  FREQUENCY,     SPECTRUM/REAL,   SPECTRUM/IMAG
##SYMBOL=    X,             R,               I
##VAR_TYPE=  INDEPENDENT,   DEPENDENT,       DEPENDENT
##VAR_FORM=  AFFN,          ASDF,            ASDF
##VAR_DIM=   32768,         32768,           32768
##UNITS=     HZ,            ARBITRARY UNITS, ARBITRARY UNITS
##FACTOR=    0.250966925370066, 1,           1
##FIRST=     8223.43324360094, -57465,       -115628
##LAST=      0,             10574,           121590
##MIN=       0,             -680226,         0
##MAX=       8223.43324360094, 444697922,    0
$$ Real data points
##PAGE= N=1
##DATA TABLE= (X++(R..R)), XYDATA
$$ [...]
19492a95561A94753o1398b44694D5965c5536B74009j16222a36404r0808J2946
$$ -195561 194753 133355 -244694 45965 -35536 274009 157787 -136404 -227212 -214266
19482b14266A15414c21020B01703H6553g2394b176p9407A3868c46535a40037G3049
$$ -214266 115414 -321020 201703 86553 -72394 -2176 -81583 13868 -346535 -140037 73049
19470A09114a91047A52556k1310b618A5373J11056g397j63894k31714f185k60845
$$ 109114 -191047 152556 131246 -2618 15373 126429 -7397 -171291 -403005 -6185 -267030
19459b67030B07940M4039a90117m882C9912J5784i3072l34999a71718b8623j19473
$$ -267030 207940 251979 -190117 -194999 39912 55696 -93072 -428071 -171718 -28623 -148096
19448a48096D7520g2654o097A04103l6276a16099J2486K5289r0630G8261d54171
$$ -148096 47520 -72654 -78751 104103 67827 -116099 -103613 -78324 -168954 78261 -454171
19436D8217J01923A9997b31164D3783K06004d7279k8325j18640k158B51704b74512
$$ 48217 150140 19997 -231164 43783 249787 -47279 -75604 -194244 -196402 251704 -274512
19424E3801H555Q7109a47446j52567A19831m1122a36971P677I1233e4256l1288
$$ 53801 8555 95664 -147446 -300013 119831 78709 -136971 -129294 91233 -54256 -85544
19413h5544j55194N6872r1586A61383d01936d6309A89003c98118L1722D5564i2406
$$ -85544 -240738 -183866 -275452 161383 -401936 -46309 189003 -398118 -366396 45564 -92406
19401b14986A05162B9648B848h1802l33032a12392K519j12497b5595j34286f920
$$ -214986 105162 29648 2848 -81802 -414834 -112392 -109873 -222370 -25595 -159881 -6920
19389b22698h2306j30221A14673B1197b44067B02396h9732j04311A72616l8650
$$ -222698 -82306 -212527 114673 21197 -244067 202396 -89732 -194043 172616 133966
19379A33966n8795h1152p6946J0990o7450I9945a47233D3279b70259f1318R561
$$ 133966 75171 -81152 -158098 -147108 -214558 99945 -147233 43279 -270259 -61318 -51757
19368e1757a171k23193A79064G2362h8543J2587l1931B40283a32068E2218h581
$$ -51757 -1171 -224364 179064 72362 -88543 -75956 -107887 240283 -132068 52218 -8581
19356A7140g1423j69125e1429o7628q2128h1747a6208l43505P3235b0855n28995
$$ 17140 -71423 -240548 -51429 -119057 -201185 -81747 -16208 -359713 -286478 -20855 -549850
19345e49850K61632M9248r1833J25873g5093G6225l1962b98744B28989h8818k98580
$$ -549850 -288218 -238970 -330803 -204930 -75093 76225 44263 -298744 228989 -88818 -387398
19334c87398F415L8180f8564j97415D6415a18914a4469j86542d6629E0837A8395
$$ -387398 6415 44595 -68564 -265979 46415 -118914 -14469 -201011 -46629 50837 18395
19322A69895e4387k68842J56007A07405c7904j4065n2184j7354e7854A47795a23120
$$ 169895 -54387 -323229 -167222 107405 -37904 -51969 -104153 -121507 -57854 147795 -123120
19310e1680k10062n162P517A09099O362c37391A9326J59828J8392a6429m5178
$$ -51680 -261742 -266904 -259387 109099 115461 -337391 19326 179154 197546 -16429 -61607
19299f1607o5371k98111c8638r0870r2031C9093f8051k29314i5625L3895l10946
$$ -61607 -126978 -425089 -38638 -129508 -221539 39093 -68051 -297365 -95625 -61730 -372676
19288c72676a031A32876c67672B43959a00867J407M2704m35626b01759r757B75568
$$ -372676 -1031 132876 -367672 243959 -100867 -99460 -56756 -492382 -201759 -211516 275568
19276A34347A0119d546B90983a90430R908Q984d8826p5851A40289d1329A33982
$$ 134347 10119 -4546 290983 -190430 -180522 -171538 -48826 -124677 140289 -41329 133982
19264a73989g4733l8864j18395h3434c4138j85575G2747l22f7379B80222a12235
$$ -173989 -74733 -113597 -231992 -83434 -34138 -219713 72747 72425 -67379 280222 -112235
19252D6622a06290Q445A54580a95196F0837a14974p3160i712E2757b10835e8584
$$ 46622 -106290 -97845 154580 -195196 60837 -114974 -188134 -9712 52757 -210835 -58584
19240c8509A0387c20177E0283R142b85731i2614j13014e9653o4999E948O7655
$$ -38509 10387 -320177 50283 59425 -285731 -92614 -205628 -59653 -124652 5948 73603
19229G3603b113A38335O7470a43413f6756D15019a98962g5828b7336k09226f1049
$$ 73603 -2113 138335 205805 -143413 -66756 415019 -198962 -75828 -27336 -236562 -61049
19217B37286n4206k2927b60228A23831b80362a10742j68169R2823i918j7895m59835
$$ 237286 183080 160153 -260228 123831 -280362 -110742 -278911 -186088 -9918 -27813 -487648
19206d87648A8975c6514a5617l09177A48364k6974b4816B67955a78932A85725
$$ -487648 18975 -36514 -15617 -324794 148364 121390 -24816 267955 -178932 185725
19195b09959n0401J26606K841r0063e1429m01255A3151e31473K45356D9910a18331
$$ -209959 -260360 -133754 -130913 -220976 -51429 -452684 13151 -531473 -286117 49910 -118331
19183a9366j9911C00508A43708a61440E9545e1707a6138k2075B4413c37559D2195
$$ -19366 -39277 300508 143708 -161440 59545 -51707 -16138 -38213 24413 -337559 42195
19171A55398f1528b4163l84213A09089a33429A53256J11167j4672a66395J586
$$ 155398 -61528 -24163 -408376 109089 -133429 153256 264423 249751 -166395 -164809
19161a64809C25944i4691L6133A67849d1565k09240J4330F2783g924j8805j48955
$$ -164809 325944 -94691 -58558 167849 -41565 -250805 -236475 62783 -7924 -26729 -175684
19150a75684A35413a35447E7947N5819d49330E2372d18726e5642j07812j62780
$$ -175684 135413 -135447 57947 113766 -449330 52372 -418726 -55642 -163454 -326234
19140c26234d0757o7281k08856B57008e1111D0287R6898a00016o6325p931A41441
$$ -326234 -40757 -108038 -316894 257008 -51111 40287 137185 -100016 -166341 -174272 141441
19128B3775a68160f8565F901L26144A62976a6074k78421J29985b1935j23738e947
$$ 23775 -168160 -68565 6901 333045 162976 -16074 -294495 -164510 -21935 -145673 -5947
19116g9544j1392n8199A89865e46865a62880n9512A78337a81801h17A76131a91327
$$ -79544 -90936 -149135 189865 -546865 -162880 -222392 178337 -181801 -817 176131 -191327
19104A23935m8826a09256M1133H4264a41068K7878j0832A30529a76939f7999n20423
$$ 123935 75109 -109256 -68123 84264 -141068 -113190 -124022 130529 -176939 -67999 -588422
19093e88422A48938g9411A44996b26244l1464g9087m8455A15122K47925F1111
$$ -588422 148938 -79411 144996 -226244 -257708 -79087 -127542 115122 363047 61111
19082A05512a74497A2043P355L8334B427a08145A58038a55288g2000B0564b4176
$$ 105512 -174497 12043 19398 57732 2427 -108145 158038 -155288 -72000 20564 -24176
19070a1321j19778C50259a27600E997a41082m7401n540j31756G2224i3852A64393
$$ -11321 -131099 350259 -127600 5997 -141082 -188483 -194023 -325779 72224 -93852 164393
19058E6738a75535m8082h0629G1500c178j02042m3142N2091F9093J30038a96550
$$ 56738 -175535 -223617 -80629 71500 -3178 -105220 -148362 -96271 69093 199131 -196550
19046a28862j80281J48058A22066a04576j3853j9659l18645a30711k83431B85376
$$ -128862 -309143 -161085 122066 -104576 -118429 -138088 -456733 -130711 -414142 285376
19035b03801i240A21506C0694J36432b66586A43028m7577J87882A04459P566J50306
$$ -203801 -9240 121506 30694 167126 -266586 143028 95451 283333 104459 112025 262331
19024B62331I5255b0742B44422o8821i6868b1941A77082a05665F2767J33643G9468
$$ 262331 95255 -20742 244422 175601 -96868 -21941 177082 -105665 62767 196410 79468
19012C49917j43432n7813J31653n2351g91A82945G9871c45435N6188k2122G8761
$$ 349917 206485 148672 280325 227974 -791 182945 79871 -345435 -289247 -311369 78761
19000A02436b55447d9490E1407Q1026e26105A48602a69444g9720A9895a51603
$$ 102436 -255447 -49490 51407 132433 -526105 148602 -169444 -79720 19895 -151603
18989I1605f4895b5179g587k55231G9830b83048B83510a43766m42907K88264d9102
$$ 91605 -64895 -25179 -7587 -262818 79830 -283048 283510 -143766 -586673 -298409 -49102
18977C03141a48415A12835a12301B80845J51914j30326a6149B436K51071l1538
$$ 303141 -148415 112835 -112301 280845 432759 302433 -16149 2436 253507 221969
18967B21969a39549b5321k76289b0592H4506a69793F425c13418l8489a16035A97136
$$ 221969 -139549 -25321 -301610 -20592 84506 -169793 6425 -313418 -351907 -116035 197136
18955b64487J02386C89784G8639a2111p7073B81112d3381j57538C3062J3730K5411
$$ -264487 -162101 389784 78639 -12111 -89184 281112 -43381 -200919 33062 46792 72203
18944G2203b21316A71801b11012J3668i769A23979f5229A72758d72086a16870
$$ 72203 -221316 171801 -211012 -197344 -9769 123979 -65229 172758 -472086 -116870
18933a61580D1338a67656H810K5269a54444b2503m0407I4616a20085A21554b27371
$$ -161580 41338 -167656 8810 34079 -154444 -22503 -62910 94616 -120085 121554 -227371
18921I4397e05576J21623a2880C26595a09621A5478L5761B2247Q3765h9149E63291
$$ 94397 -505576 -383953 -12880 326595 -109621 15478 51239 22247 106012 -89149 563291
18909E24127J25071a21866G5152a1500B63087a48236j3727H5062a91835H2855
$$ 524127 649198 -121866 75152 -11500 263087 -148236 -161963 85062 -191835 82855
18898h7808M1767A58887K8869b05997C4768J13977B4456a98227j19137a35974
$$ -87808 -46041 158887 187756 -205997 34768 148745 24456 -198227 -317364 -135974
18887B1710g9685l3758K8848n6828C54547A37833h1645A52214N5066a44136O8000
$$ 21710 -79685 -113443 -84595 -141423 354547 137833 -81645 152214 207280 -144136 -76136
18876g6136j28371p018C6065a38747A78064K04981a58715M2368j59485N3632J02735
$$ -76136 -204507 -211525 36065 -138747 178064 383045 -158715 -116347 -275832 -222200 -119465
18865a19465D9975b72499C2444a58798O352A22599D2242a922k23967B03831a43465
$$ -119465 49975 -272499 32444 -158798 -152446 122599 42242 -1922 -225889 203831 -143465
18853a86796E8031a43678A6238g9044B0128a67770C74236b94970D0057K83737
$$ -186796 58031 -143678 16238 -79044 20128 -167770 374236 -294970 40057 323794
18843C23794c8337C6955p344J28347b02913D5029a31639d4329j31612K7356k27798
$$ 323794 -38337 36955 29611 157958 -202913 45029 -131639 -44329 -175941 -148585 -376383
18832c76383h643j9333m3558A10001c5498p6776k7801C6749B410M3736k0857J55472
$$ -376383 -8643 -27976 -71534 110001 -35498 -112274 -140075 36749 2410 46146 25289 180761
18820A80761g8381G2403a3798q3650A77818a1214C71238j54098b5569D05186j40240
$$ 180761 -78381 72403 -13798 -97448 177818 -11214 371238 217140 -25569 405186 264946
18809B64946g0859A07872a4466k3391k71681N3050J03676c5477j1093j80160c4373
$$ 264946 -70859 107872 -14466 -37857 -309538 -256488 -152812 -35477 -46570 -226730 -34373
18797B79021g5566A79216c87953a56597B23560a54323k08992a49774A14697a93010
$$ 279021 -75566 179216 -387953 -156597 223560 -154323 -363315 -149774 114697 -193010
18786A36402b39286E83012a36397N7118K3950j28928j28150f7484m8052j27763
$$ 136402 -239286 583012 -136397 -79279 -55329 -184257 -312407 -67484 -115536 -243299
18776b43299C7305c48010J50254A94693a80908C06495j37477a42114k70469J24309
$$ -243299 37305 -348010 -197756 194693 -180908 306495 169018 -142114 -412583 -288274
18766b88274R1802K3844B89034a90976q5466A81841a92546C67553G9248b55935
$$ -288274 -196472 -172628 289034 -190976 -276442 181841 -192546 367553 79248 -255935
18755b46589A49460a18885j2485B82065e7736o2558A24766c00238N8249B12229
$$ -246589 149460 -118885 -131370 282065 -57736 -120294 124766 -300238 -241989 212229
18744A04521a14629m9056h0928l7111H2660p141a98219A941b96446A17297L8670
$$ 104521 -114629 -163685 -80928 -118039 82660 75519 -198219 1941 -296446 117297 155967
18733A55967m2970a83869b2207k36508O3472P1653A75831O2649a85213I033J10309
$$ 155967 112997 -183869 -22207 -258715 -195243 -123590 175831 238480 -185213 9033 119342
18722A19342J04799J64221a18491e6980l3243M3383o5773l57369a00638J0663
$$ 119342 224141 388362 -118491 -56980 -90223 -46840 -112613 -469982 -100638 -89975
18712h9975B3432e5803D8148b359I6831i251l18187J36230A40672c83601Q9346
$$ -89975 23432 -55803 48148 -2359 96831 -9251 -327438 -191208 140672 -383601 -294255
18701b94255A60537d49778D90517b73889j1119I0798j893A1417a97283Q6261C95784
$$ -294255 160537 -449778 490517 -273889 -285008 90798 88905 11417 -197283 -111022 395784
18689b03237g4536k71306d3359r0555A5753a01127B3568L1332B3877h0496A64661
$$ -203237 -74536 -345842 -43359 -133914 15753 -101127 23568 54900 23877 -80496 164661
18677a06105C57346b5409k48090G6600a88731n8743L0488K251A30361c6808j34123
$$ -106105 357346 -25409 -273499 76600 -188731 -247474 -216986 -214735 130361 -36808 -170931
18666a70931b3473m41199Q7170K231a42814j05715B55190b32703A55132C9649
$$ -170931 -23473 -464672 -377502 -375271 -142814 -248529 255190 -232703 155132 39649
18655c83207E3549a07918o9943B6949g4530j8455B0734K73215N986G4911l4994
$$ -383207 53549 -107918 -177861 26949 -74530 -92985 20734 293949 299935 74911 39917
18644C9917a27889m50910b07145A25728b32130B57675a32149J236M7791j9883
$$ 39917 -127889 -578799 -207145 125728 -232130 257675 -132149 -130913 -83122 -103005
18634a03005a6797j70258j02382H8552f3844l25116a12906j96788A3010P4833
$$ -103005 -16797 -187055 -289437 88552 -63844 -388960 -112906 -309694 13010 87843
18624H7843B8973K8620c821D2758j2453I099a94756j84748B17008a21500A86556
$$ 87843 28973 57593 -3821 42758 30305 9099 -194756 -379504 217008 -121500 186556
18612B61541l2668b38518g083r0984a9456A12557b36573O2778C20793b36348O6451
$$ 261541 228873 -238518 -7083 -98067 -19456 112557 -236573 -173795 320793 -236348 -169897
18601a69897C8812a86614A44329f728m8876F1095g0579k57302E4876e813l9531
$$ -169897 38812 -186614 144329 -6728 -55604 61095 -70579 -327881 54876 -5813 -45344
18590d5344A15852a46379B58350E3421f62236A1674R5063m8568A7408d68363A43437
$$ -45344 115852 -146379 258350 53421 -662236 11674 106737 58169 17408 -468363 143437
18578c49047F7459b26025j12628b7318j94731q1585H1770A5102a04492p4078k19146
$$ -349047 67459 -226025 -338653 -27318 -222049 -303634 81770 15102 -104492 -178570 -397716
18567c97716h991j5181k13842a01738k53987A87506I1669c00621H1717g462A38924
$$ -397716 -8991 -24172 -238014 -101738 -355725 187506 91669 -300621 81717 -7462 138924
18555c92292A39958K8131b55955G3214h5439j51036K6017l03630D19498b20553
$$ -392292 139958 168089 -255955 73214 -85439 -236475 -210458 -514088 419498 -220553
18544f9198B49937q2438J29859c92375B16699A04482b62704Q4851A34453a20071
$$ -69198 249937 167499 297358 -392375 216699 104482 -262704 -177853 134453 -120071
18533A58862h6511k88692c0135l81522J10435a33435A41762D0978O3466c57416
$$ 158862 -86511 -375203 -30135 -411657 -301222 -133435 141762 40978 104444 -357416
18522c50621d1826o38400a6444D4329e7118H6742j7666K7762A5864K44830c07923
$$ -350621 -41826 -680226 -16444 44329 -57118 86742 69076 96838 15864 260694 -307923
18510a81767g1223A06739l5325e9863k47015C0610a47971b9134q8442C75388H4848
$$ -181767 -71223 106739 71414 -59863 -306878 30610 -147971 -29134 -117576 375388 84848
18498a68575j3390I6514b60440d3949c581j68574p5199K8310i7437nI8956d20725
$$ -168575 -181965 96514 -260440 -43949 -3581 -172155 -247354 -219044 -97437 -97442 98956 -420725
18485a44623p4554D3700c47421D4397a1149k53827A24319m211C6234b01544A17619
$$ -144623 -219177 43700 -347421 44397 -11149 -264976 124319 120108 36234 -201544 117619
18473B58558a05306C59546A66221D1976J61987C9135a224A4535o341J35733a3743
$$ 258558 -105306 359546 166221 41976 203963 39135 -1224 14535 8194 143927 -13743
18461c02396a51138D10890d02922J38841O6440j66560A4456J3387c44301a60298
$$ -302396 -151138 410890 -402922 -264081 -197641 -364201 14456 27843 -344301 -160298
18450a72605A2806J47092c9530k2372D08027C3575K63924A14206b05560j30663
$$ -172605 12806 159898 -39530 -61902 408027 33575 297499 114206 -205560 -336223
18440c36223c5228o0105c8943B31465e6521k2230q1341f2463k3851A29693c17662
$$ -336223 -35228 -95333 -38943 231465 -56521 -78751 -160092 -62463 -86314 129693 -317662
18428H1863R9370p1875a72659N3469j93913A084f3742j69755J00560M0073A43100
$$ 81863 181233 109358 -172659 -119190 -313103 1084 -63742 -233497 -132937 -92864 143100
18416G898b55417m1888A79513a43606c9681A74054a94668g3580A68760a06818
$$ 7898 -255417 -297305 179513 -143606 -39681 174054 -194668 -73580 168760 -106818
18405B66590F7371K2092h9250A64606J84439A04223J43303a86325k3022k98293
$$ 266590 67371 89463 -89250 164606 349045 104223 247526 -186325 -209347 -507640
18395e07640b24646e6241E2029h2997I2401A6349b00009B538a7420j56613C4584
$$ -507640 -224646 -56241 52029 -82997 92401 16349 -200009 2538 -17420 -174033 34584
18383A86970p5227e4435j05368D3451g2197l06376E1640c54763j3876E0845a04771
$$ 186970 111743 -54435 -159803 43451 -72197 -378573 51640 -354763 -368639 50845 -104771
18371g9767A26946a33813M2563O989j45873J03528I0907a13507c9684A39022h9269
$$ -79767 126946 -133813 -91250 -84261 -230134 -126606 90907 -113507 -39684 139022 -89269
18359f4616C71145a35313n0727A63922E93K64311F7651b92314I873b73785F7358
$$ -64616 371145 -135313 -186040 163922 593 264904 67651 -292314 9873 -273785 67358
18347a72288n0811h3828r9203g784o5488o4624B76219c94526I4600c36492c1432
$$ -172288 -223099 -83828 -183031 -7784 -73272 -137896 276219 -394526 94600 -336492 -31432
18335E2891Q7480f9692d02G9971a06208K2040A15034a51741m8977C0924J27098
$$ 52891 140371 -69692 -402 79971 -106208 -84168 115034 -151741 -200718 30924 158022
18324A58022Q4074h1659J0935A97988F9695b6922r3433M0472j08992m2205A9824
$$ 158022 242096 -81659 -70724 197988 69695 -26922 -120355 -79883 -188875 -231080 19824
18312f3016d399C2111i4480H9515b14600O1712a5311C87809A53618j5433b5701
$$ -63016 -4399 32111 -94480 89515 -214600 -152888 -15311 387809 153618 138185 -25701
18300h8908o7269K1264c2693A14157c95252N3610a24938B64685g086B15062j2787
$$ -88908 -156177 -134913 -32693 114157 -395252 -341642 -124938 264685 -7086 215062 202275
18289B02275c19799A49755a34323K7208E1381B753b40888b138r1328E0375B4819
$$ 202275 -319799 149755 -134323 -107115 51381 2753 -240888 -2138 -93466 50375 24819
18277d0067k16716r3209J61437K9688j11840A8726J33695a2951k0311r2843A00264
$$ -40067 -256783 -349992 -188555 -158867 -270707 18726 152421 -12951 -33262 -126105 100264
18265F4421c2308j50169D4760a26151i452n28074A96330a82868f8192n3067H4313
$$ 64421 -32308 -182477 44760 -126151 -9452 -537526 196330 -182868 -68192 -121259 84313
18253A36367J847J12399f9056j92581c3852F5164a9147A52964p0245a96941P0377
$$ 136367 138214 250613 -69056 -261637 -33852 65164 -19147 152964 82719 -196941 -126564
18242a26564l3116n7887A15734h4579D65188A32853b31096H216M0354a38601e640
$$ -126564 -159680 -217567 115734 -84579 465188 132853 -231096 8216 48570 -138601 -5640
18230B04080L372n4216a51413B8561K26301I2212a85892j4389j34311J17526E3899
$$ 204080 207452 153236 -151413 28561 254862 92212 -185892 -200281 -334592 -217066 53899
18218B48292i2875H8320N0580a71013m32201a60709c647j54387e5180F8907c0749
$$ 248292 -92875 88320 138900 -171013 -603214 -160709 -3647 -158034 -55180 68907 -30749
18206d24160g7474K3695A26418a68620j10227a8641A06158Q9351p2546h3603A12503
$$ -424160 -77474 -53779 126418 -168620 -278847 -18641 106158 195509 122963 -83603 112503
18194A98523b09473i591k5626A20183J27590a99153j32065B43928J02890D6127
$$ 198523 -209473 -9591 -35217 120183 247773 -199153 -331218 243928 346818 46127
18183B06272j175G8261g4778k56645h4491a4137K750j41034N7248p714j05790
$$ 206272 205097 78261 -74778 -331423 -84491 -14137 -11387 -152421 -95173 -102887 -208677
18172b08677A94374J47351b70549a09988I5713c24283A5385O7544a25138N3005
$$ -208677 194374 341725 -270549 -109988 95713 -324283 15385 82929 -125138 -72133
18162g2133m7852A19979a76422Q1149A80892E296R7118a37599L4690B2882a58853
$$ -72133 -119985 119979 -176422 -95273 180892 5296 102414 -137599 -102909 22882 -158853
18150c9412C5147c2656H5271b36572h2905J2794C03261b17663d8250a3435F3101
$$ -39412 35147 -32656 85271 -236572 -82905 -70111 303261 -217663 -48250 -13435 63101
18138A5436R3215a38D85488a1547C4723e88507b50328A02801J39697j02789J25855
$$ 15436 108651 -138 485488 -11547 34723 -588507 -250328 102801 242498 139709 265564
18127B65564D0674K09059i7477m019D7792d3286j41714A08216K08602A57973a54179
$$ 265564 40674 249733 -97477 -101496 47792 -43286 -185000 108216 316818 157973 -154179
18115a34767N5100r0169A13901m6013a47089b4635k98012a4182n8056l9137J1393
$$ -134767 -79667 -169836 113901 67888 -147089 -24635 -322647 -14182 -72238 -111375 -99982
18104i9982A50201f1404b0597k7753B96770a16203j51141h399A11726b7671a3708
$$ -99982 150201 -61404 -20597 -48350 296770 -116203 -267344 -8399 111726 -27671 -13708
18092A20431b5929A41O3068J2773M1465J11489g3969j53908A5972J77604n3937
$$ 120431 -25929 141 63209 75982 117447 228936 -73969 -227877 15972 193576 139639
18081A39639a17047E8276k3062J13163g362k00399E7410b95167A89602l8776n5675
$$ 139639 -117047 58276 35214 148377 -7362 -207761 57410 -295167 189602 150826 95151
18070I5151a60001r2704G7229a57699P7649G7319a67313D347b74521f0905B63160
$$ 95151 -160001 -252705 77229 -157699 -80050 77319 -167313 4347 -274521 -60905 263160
18058b90311A33251D822a24753A09521B6311a55577A42687a45981k06828A68506
$$ -290311 133251 4822 -124753 109521 26311 -155577 142687 -145981 -352809 168506
18047E1117f7808E863f0163j23990K676j25126O9560B55207a21613N2832m0693
$$ 51117 -67808 5863 -60163 -184153 -181477 -306603 -237043 255207 -121613 -68781 -109474
18036a09474A05552J31792d168j44117A78563K1023r0411g5825K7539B07869a73732
$$ -109474 105552 237344 -4168 -148285 178563 199586 109175 -75825 -48286 207869 -173732
18024B07051p7877N5659L64622A34185K75230d14302f8602G7144b35030B36407
$$ 207051 129174 184833 549455 134185 409415 -414302 -68602 77144 -235030 236407
18013D53555b8983k45080A59997b29979e4691m19944B77243q5735a22735p2179
$$ 453555 -28983 -274063 159997 -229979 -54691 -474635 277243 191508 -122735 -194914
18003a94914O2959j25073b9649A52281F3603b0246a558E3678J69856a8263B01163
$$ -194914 -131955 -257028 -29649 152281 63603 -20246 -1558 53678 223534 -18263 201163
17991C719a60097K3903B9614g0853n972J7781i528k9942A53317b1098l122D357
$$ 3719 -160097 -136194 29614 -70853 -76825 -59044 -9528 -39470 153317 -21098 -24220 4357
17978H1435M9466J38575K2275a13917B73152l2638a7966l5499B663a09456k67958
$$ 81435 130901 269476 291751 -113917 273152 240514 -17966 -53465 2663 -109456 -377414
17967c77414F2405f4703o8965i006k5642A12720J33420C1044a11250A67413b76321
$$ -377414 62405 -64703 -133668 -9006 -34648 112720 246140 31044 -111250 167413 -276321
17955C30373j01399b88725A20783j3474a3666j1651l3582m9934K5036A54397O1469
$$ 330373 228974 -288725 120783 107309 -13666 -25317 -58899 -108833 -83797 154397 215866
17944B15866K8027a64421A24155e6521B97633E8027b27030N2168N4107A46998
$$ 215866 243893 -164421 124155 -56521 297633 58027 -227030 -174862 -120755 146998
17933c1064A29683a99162e7100A11513j2978c86291J72981C63657b48398b5490
$$ -31064 129683 -199162 -57100 111513 98535 -386291 -213310 363657 -248398 -25490
17922b65233N4648g9071k34237i3607B61693B4876f8211A36368o2491J16604f3690
$$ -265233 -210585 -79071 -313308 -93607 261693 24876 -68211 136368 73877 190481 -63690
17910B66675O4147a08806B48803E2323a49171j93674a8004B26034G465K5226K6822
$$ 266675 330822 -108806 248803 52323 -149171 -342845 -18004 226034 7465 32691 59513
17899E9513e6958k05357A53380b26856j78982a23151B211b30031M0451A78393
$$ 59513 -56958 -262315 153380 -226856 -405838 -123151 2211 -230031 -189580 178393
17888E5183L10244j64011k3272a76700d5573A94547G4816J06086C8366Q0043a36643
$$ 55183 365427 201416 178144 -176700 -45573 194547 74816 180902 38366 118409 -136643
17876A09716a20016b9279n5092D5213c30837O6192A1971b13804l9092d6765j95888
$$ 109716 -120016 -29279 -84371 45213 -330837 -264645 11971 -213804 -252896 -46765 -242653
17865b42653B24724q7324o1461a0503j4410k54313C21403a33417e6150A25072
$$ -242653 224724 137400 75939 -10503 -24913 -279226 321403 -133417 -56150 125072
17854H0997b10784E2958c84166a14342J1148j3408B88066k8927b24662l2183G0650
$$ 80997 -210784 52958 -384166 -114342 -103194 -116602 288066 259139 -224662 -256845 70650
17842b26846h7263k4805C70252e4169l3589A84564H8286B0944P3106J73043q6550
$$ -226846 -87263 -112068 370252 -54169 -87758 184564 88286 20944 94050 267093 180543
17831A80543Q3500a61806A03265P5281B6141M17364I6242e5179q9113A00622J33401
$$ 180543 264043 -161806 103265 178546 26141 443505 96242 -55179 -144292 100622 234023
17820B34023p170b01611A04411M4258D402a3638j63806B29325k8620c1769F4954
$$ 234023 226853 -201611 104411 148669 4402 -13638 -177444 229325 200705 -31769 64954
17808F7422a51453H244i76B14630F7318b7854E1767b01984c4806A26038E4871
$$ 67422 -151453 8244 -976 214630 67318 -27854 51767 -201984 -34806 126038 54871
17796A59247M6329a05259F4970K05318q8323H3548Q670P4653k035C0224b92534
$$ 159247 205576 -105259 64970 270288 181965 83548 92218 166871 164836 30224 -292534
17784A28546b28358p0306A23237J68011I6176P2379b17503H4984d4807A47525
$$ 128546 -228358 -298664 123237 291248 96176 168555 -217503 84984 -44807 147525
17773g5631n9475j12495A14354c26815a01897F6116b06619C19518n299b71827
$$ -75631 -135106 -247601 114354 -326815 -101897 66116 -206619 319518 314219 -271827
17762B9339b8835F0743b4043H8926j7860d6527j12483e5197F7831K8363J04060
$$ 29339 -28835 60743 -24043 88926 71066 -46527 -159010 -55197 67831 96194 200254
17751B00254F3017h136B52523l3805F8248J030J74573b29923B13457D6125Q914
$$ 200254 63017 -8136 252523 218718 68248 69278 243851 -229923 213457 46125 55039
17740E5039M5958a46695D15160I9283l8542L26324c0303k9313D6493K74089H227
$$ 55039 100997 -146695 415160 99283 60741 387065 -30303 -59616 46493 320582 8227
17728i3701n5846B609K99747e6416I0178c1219l146n0718m1877I7224j2579b2306
$$ -93701 -149547 2609 302356 -56416 90178 -31219 -34365 -85083 -126960 97224 84645 -22306
17715A89739B3613K44683a3086C7160j2502i3235C3644b5307A38371K1755L863
$$ 189739 23613 268296 -13086 37160 24658 -93235 33644 -25307 138371 160126 163989
17704A63989a35232B18874J23540j15528g4562D3917A6284R5097E4342J30102
$$ 163989 -135232 218874 342414 226886 -74562 43917 16284 111381 54342 184444
17694A84444M17540b03400K2829C4968O6934a0664A15892J5925N0253c3577C07272
$$ 184444 601984 -203400 -180571 34968 101902 -10664 115892 131817 182070 -33577 307272
17682A54416E944h2650m0470A65873a26550A30468h9149A21739K50472H6288a45754
$$ 154416 5944 -82650 -123120 165873 -126550 130468 -89149 121739 372211 86288 -145754
17670C0949L06648a12213E8322f2130j38938A67078A7861J21539b7568p31B90292
$$ 30949 337597 -112213 58322 -62130 -201068 167078 17861 139400 -27568 -28299 290292
17658b47980C96492A50413e811E8120o847O4927n4562J34599d8480B74597b33674
$$ -247980 396492 150413 -5811 58120 51273 116200 61638 196237 -48480 274597 -233674
17646D0471a13126D80219f6850E49041B06559l1774a08064B06131E1346a14936
$$ 40471 -113126 480219 -66850 549041 206559 174785 -108064 206131 51346 -114936
17635f8138A93751h3610G1946J57732D4207a93869m1595D39002a0699l03C07009
$$ -68138 193751 -83610 71946 229678 44207 -193869 -235464 439002 -10699 -11002 307009
17623A22432D076M35160k00969p9044K8312n4175h105A6450a48808D383J30779
$$ 122432 4076 439236 238267 159223 187535 133360 -8105 16450 -148808 4383 135162
17612A35162K83310A07677J82692a6674G9398E984d5833C18529F7249J98511b75036
$$ 135162 418472 107677 290369 -16674 79398 5984 -45833 318529 67249 265760 -275036
17600C17230j20222J55495B68b9081A8325K40348q3600K28590a1203j83863E31721
$$ 317230 197008 352503 268 -29081 18325 258673 175073 403663 -11203 -195066 531721
17588A72511K36901e6881A6053J31544F3734P5028a69672A58901J10482h2573
$$ 172511 409412 -56881 16053 147597 63734 138762 -169672 158901 269383 -82573
17577H7527b89154a4378j19746K3791A0381K85868A23385h0287j71913a16971
$$ 87527 -289154 -14378 -134124 -110333 10381 296249 123385 -80287 -252200 -116971
17566A44281K10935p1011k4749q4530j4585p0942I636Q915K75429j23593f5361
$$ 144281 355216 284205 259456 174926 160341 89399 9636 18551 293980 170387 -65361
17554A34773E9897K64036q5084j02966J62148n7616f2977B80391J61547H6454
$$ 134773 59897 323933 238849 135883 298031 240415 -62977 280391 441938 86454
17543F2366J25832d454G1947k8415j5388J26079F86Q399O3041M0199K36822D8091
$$ 62366 188198 -4454 71947 43532 28144 154223 686 9085 72126 112325 349147 48091
17530b12745e1605C58694j10316K27471m1412j56729N30467o8632o6183J93318
$$ -212745 -51605 358694 248378 475849 434437 277708 808175 739543 673360 866678
17520H66678j80445l00718Q742F4987L01410r5576m5250J62393l2363M2044K55019
$$ 866678 686233 385515 394257 64987 366397 270821 225571 387964 355601 397645 652664
17509F52664N0082J78465n8892p8361C22160H6071L05505O589j19552A23078Q7076
$$ 652664 702746 881211 822319 743958 322160 86071 391576 398165 278613 123078 210154
17498B10154J362C2670J27571j867J28553K84429F8052K28886Q1323j73986p1565
$$ 210154 211516 32670 160241 158374 286927 571356 68052 296938 378261 204275 132710
17487A32710K16280N0440A70913J312A2698J18188K21722j35405P6243j07906
$$ 132710 348990 399430 170913 172225 12698 130886 352608 217203 293446 185540
17477A85540N8305K5863A03683c7554e042B99772D1215J91278F0373L54358E2862
$$ 185540 243845 269708 103683 -37554 -5042 299772 41215 232493 60373 414731 52862
17465A31506C1347P2004R55K73167b4048A87427A0235K00506J10563p071A41579
$$ 131506 31347 103351 104306 377473 -24048 187427 10235 210741 321304 314233 141579
17453A61999F9091J84256L29256c2726D90243B07873L0080p3132B823O7419L01624
$$ 161999 69091 253347 582603 -32726 490243 207873 237953 164821 2823 70242 371866
17442C71866J97522j69885p177O0315B21322J25472E4519M45436F4190L76709
$$ 371866 569388 399503 392326 452641 221322 346794 54519 499955 64190 440899
17432D40899A83455K09046p0836G1276J18534c2182A34743b4724b584A38255L62185
$$ 440899 183455 392501 321665 71276 189810 -32182 134743 -24724 -2584 138255 500440
17421E00440A35696K07762D4931L81847A65634E4213J17149O9051j5941K63921
$$ 500440 135696 343458 44931 426778 165634 54213 171362 240413 224472 488393
17411D88393j46871r8140J63317A40696P1757G7409f2444H7495J31136J32591
$$ 488393 341522 243382 406699 140696 212453 77409 -62444 87495 218631 351222
17401C51222H5340L6725G516L69002l9698F5254K78848b37629C58K27774O0376
$$ 351222 85340 122065 7516 376518 336820 65254 344102 -237629 358 228132 288508
17390B88508M1778j11735F9814J32211G1000L77008j29936j06898J01095j2782
$$ 288508 330286 218551 69814 202025 71000 448008 318072 211174 312269 299487
17380B99487E4345K92634k0825j16342J25996g9550A2803L10683j14207l091K73274
$$ 299487 54345 346979 326154 209812 335808 -79550 12803 323486 209279 206188 479462
17369D79462k30492l6287m7483O4708J12513J34982k21931b82666c453C20812
$$ 479462 248970 212683 165200 229908 342421 477403 255472 -282666 -3453 320812
17358B87909J15756A14726J51582d1077C58329A05321D3482K20555K07679j61093
$$ 287909 403665 114726 266308 -41077 358329 105321 43482 264037 471716 310623
17348C10623j00735J91061k833H003J50205J82981r2896j2125n1956F3509L264
$$ 310623 209888 400949 398116 8003 158208 341189 248293 236168 184212 63509 66773
17337F6773Q1386K48496q1911c2626A81411L44504n5273j52430c4568C03163J14872
$$ 66773 148159 396655 314744 -32626 181411 525915 470642 318212 -34568 303163 418035
17326D18035j10174A16525Q2114p1889K17043j92J22386q7127A66466G3171Q2732
$$ 418035 307861 116525 198639 126750 343793 343601 465987 378860 166466 73171 155903
17315A55903g4404E44281a10686C27033j0002k9391A28801J57626A04580K38674
$$ 155903 -74404 544281 -110686 327033 317031 287640 128801 286427 104580 343254
17305C43254o8567J66785M6238A10817R5209J44420A25875L93359p4829k16316
$$ 343254 274687 441472 487710 110817 206026 350446 125875 519234 444405 228089
17295B28089a1640j44590D81330g8192E07406A27379K17495B4147a4289A80694
$$ 228089 -11640 -156230 481330 -78192 507406 127379 344874 24147 -14289 180694
17284D887K18043p6655A931J16268L81592j94565L5271q3950a70476a1432j8919
$$ 4887 222930 146275 1931 118199 499791 305226 340497 256547 -170476 -11432 -30351
17273c0351F6164J89428J91485h279B61693j4289j08704j4478K63249P3105q6663
$$ -30351 66164 255592 447077 -8279 261693 247404 138700 124222 387471 460576 373913
17262C73913j33025K12003j57022I3120J70791M1842j30739G9230L12777j94027
$$ 373913 240888 452891 295869 93120 263911 305753 175014 79230 392007 197980
17252A97980q6259K57143H3681K24792C0814L6446O2127K25938j61555O1459J77007
$$ 197980 111721 368864 83681 308473 30814 67260 129387 355325 193770 255229 432236
17241D32236o0707L2105b4791C96497o2010A23098L66371k08389Q3866L7515L1383
$$ 432236 371529 403634 -24791 396497 334487 123098 489469 281080 364946 402461 433844
17230D33844H2447D549L61994Q8535m5455q3466J30028n4174A24563L50755k17410
$$ 433844 82447 4549 366543 455078 409623 326157 456185 402011 124563 475318 257908
17219B57908M05838j42776o6798j59945J07592j21360J86630j71148Q8231A10049
$$ 257908 663746 520970 454172 294227 401819 280459 467089 295941 384172 110049
17208A31970P2635K42584k17152J37198K51031k42766M8875Q9689B42460K35541
$$ 131970 204605 447189 230037 367235 618266 375500 424375 514064 242460 478001
17198D78001J95036A50003J82202j8457K32533k01271J4742P752K8058J20131
$$ 478001 673037 150003 332205 313748 546281 345010 359752 367504 395562 515693
17188E15693A14355K71453O0773K04504E8582K36994j27548J80726M8587L9467
$$ 515693 114355 385808 446581 651085 58582 295576 168028 348754 397341 436808
17178D36808r1699r8658K04496k04621n916M17134j94974J36576o9861j24010
$$ 436808 345109 246451 450947 246326 240410 657544 462570 599146 529285 405275
17168D05275j03791j26118M24400O8086j64502N4308K08480l41916P0749j04647
$$ 405275 301484 175366 599766 667852 503350 557658 766138 424222 494971 390324
17158C90324R3181A74260J79316j56517J93468p1035J73171K2294J37234l06718
$$ 390324 483505 174260 353576 197059 390527 319492 492663 514957 652191 345473
17148C45473K00882O9807l4955k9163A92662N5358K08674J50491k66303K6120
$$ 345473 546355 616162 581207 552044 192662 248020 456694 607185 340882 367002
17138C67002J17751m2261K03051O7223j82536k48574O19048k76552j64739J05187
$$ 367002 484753 442492 645543 712766 530230 281656 900704 624152 459413 564600
17128E64600k68870L23202k33957J88552L7451P0081j79951J34069k41190J23945
$$ 564600 295730 618932 384975 573527 610978 681059 501108 635177 393987 517932
17118E17932M7735o3263J15234l8745A76860N38597o4286j70787J78941k36731
$$ 517932 565667 502404 617638 578893 176860 715457 651171 480384 659325 422594
17108D22594J31519P9046J35251j31900O5518J62870j77524j35177J82725p8156
$$ 422594 554113 633159 768410 636510 702028 864898 687374 552197 734922 656766
17098F56766J03734j47456j41314N5287J44658L1403n7992J53104C61357J32574
$$ 656766 760500 613044 471730 527017 671675 703078 645086 798190 361357 493931
17088D93931j90440J67790R9631j17491R3715n2683K85895K44656l28979k38668
$$ 493931 303491 471281 570912 453421 547136 494453 780348 1025004 696025 457357
17078D57357M24528k97559K55622D19388J30019L03204k24641P5961K20579k04134
$$ 457357 881885 584326 839948 419388 549407 852611 627970 703931 924510 720376
17068G20376j33554L82687P9476k88920J84673J26907k87766L7810K21099k83262
$$ 720376 586822 969509 1048985 760065 944738 1071645 783879 821689 1042788 759526
17058G59526L30818k33365l42016J00223p233L3509J37081O1105K60264m20803
$$ 759526 1090344 856979 514963 615186 607953 641462 778543 839648 1099912 679109
17048F79109L07119k52494K33302k87470L17255k39670j57834K71444J92735M9569
$$ 679109 986228 733734 967036 679566 996821 757151 599317 870761 1063496 1113065
17038A113065k27182r0610K29013j28890j06326O6522N9772J59918j74240J4276
$$ 1113065 885883 795273 1024286 895396 789070 855592 915364 1075282 901042 915318
17028I15318R225k2644L1869p9158M18600l74756k7190k11273N99396m90346L70482
$$ 915318 924543 901899 933768 854610 1273210 898454 871264 659991 1259387 769041 1139523
17017A139523J70165l38761j14834M43501j15238j48608J62526k30801J99027
$$ 1139523 1309688 970927 856093 1299594 1184356 1035748 1198274 967473 1166500
17008A166500o7403K4022j05262K94884l37151q947J59606K0417N1655M0673j54058
$$ 1166500 1099097 1123119 1017857 1312741 975590 966643 1126249 1146666 1198321 1238994 1084936
16997A084936k46887L14612j44166L09706F27796M89211L19495k8741l65213r4361
$$ 1084936 838049 1152661 1008495 1318201 627796 1117007 1436502 1407761 1042548 948187
16987I48187M85204K5238k839k65390J30297j29772L14936r1898N5204m45046
$$ 948187 1433391 1458629 1455790 1190400 1320697 1190925 1505861 1413963 1469167 1024121
16977A024121K47529K06655p2494j26680J68377O2086M267k53795K51520J04843
$$ 1024121 1271650 1478305 1405811 1279131 1447508 1509594 1513861 1260066 1511586 1616429
16967A616429R8632L1267l52104m1437o182K25534Q1779j29562l4020L80825N4479
$$ 1616429 1715061 1746328 1394224 1352787 1346605 1572139 1653918 1524356 1490336 1871161 1925640
16956A925640m34072L75664k71985Q1009m1909K80259j73673l18694M46963Q4961
$$ 1925640 1491568 1867232 1595247 1676256 1634347 1914606 1740933 1422239 1869202 1954163
16946A954163j98354L9088L72366q40994M62832N6244M306K382J18712j65810
$$ 1954163 1755809 1794897 2167263 1326269 1789101 1845345 1849651 1852033 1970745 1804935
16936A804935K91128J89894l58657K31488j09646r1857K73665N3718j31924j29061
$$ 1804935 2096063 2285957 1927300 2158788 2049142 1957285 2230950 2284668 2152744 2023683
16926B023683J30769J77123k01223L2091J50107j93141J72433J33519R104k71379
$$ 2023683 2154452 2331575 2130352 2162443 2312550 2119409 2291842 2425361 2434465 2163086
16916B163086K41041j2213K28982L288k46681K06578n3655Q8964J70695k6768
$$ 2163086 2404127 2391914 2620896 2624184 2377503 2584081 2530426 2619390 2790085 2763317
16906B763317j98853r007K17707J52003P7450j65248J80103R4092j61336J47013
$$ 2763317 2564464 2555457 2773164 2925167 3002617 2837369 3017472 3111564 2950228 3097241
16896C097241n6907J68685j71858P5838J79090j29307K04841j0900K41988o338
$$ 3097241 3040334 3209019 3037161 3112999 3292089 3162782 3367623 3356723 3598711 3592373
16886C592373k66672K14366K92183q1337k4373J85150j63859Q9484j48159K23090
$$ 3592373 3325701 3540067 3832250 3750913 3726540 3911690 3747831 3837315 3689156 3912246
16876C912246l74544N29344J12296N4979j58948N19710k06972j29095L65760j48801
$$ 3912246 3537702 4067046 4179342 4234321 4075373 4595083 4388111 4259016 4624776 4475975
16866D475975l9268J55200K21307L4311R287R8270q7830j42998j1693M31361j56267
$$ 4475975 4436707 4591907 4813214 4847525 4856812 4955082 4867252 4724254 4712561 5143922 4987655
16855D987655J36459M80505j30151J83198r6080L04629j77841K84819m8115J80582
$$ 4987655 5124114 5604619 5474468 5657666 5561586 5866215 5688374 5973193 5925078 6105660
16845F105660J48165J46516r5132J53355j2110L09878L18078j02857k27909M68637
$$ 6105660 6253825 6400341 6305209 6458564 6446454 6756332 7074410 6971553 6743644 7212281
16835G212281j36344L24078P8503M71649k06701K42597K34598L02447r3781j6239
$$ 7212281 7075937 7400015 7478518 7950167 7743466 7986063 8220661 8523108 8429327 8413088
16825H413088J38541N36371l8358M06554L21941k47568L15427M90930j16504p2069
$$ 8413088 8551629 9088000 9049642 9456196 9778137 9530569 9845996 10336926 10220422 10148353
16815A0148353O18535l7602L01874L04192L8226M50945K91006J94693J52315N60538
$$ 10148353 10766888 10729286 11031160 11335352 11373578 11824523 12115529 12310222 12462537 13023075
16805A3023075L22333L7663N89889J27408L10341L09106L48976M05945J00641
$$ 13023075 13345408 13383071 13972960 14100368 14410709 14719815 15068791 15474736 15575377
16796A5575377P30258K76067N43279K69609L73290M77970L92472M25999O79957
$$ 15575377 16305635 16581702 17124981 17394590 17767880 18245850 18638322 19064321 19744278
16787A9744278M68789K81418P16448P94621J35524P61884M61681P37541Q04448
$$ 19744278 20213067 20494485 21210933 22005554 22141078 22902962 23364643 24102184 24906632
16778B4906632P44155M87522R22581P68496R23374O09583Q75625Q21872J388468
$$ 24906632 25650787 26138309 27060890 27829386 28752760 29362343 30237968 31059840 32448308
16769C2448308P04600Q96651J115689J256735P07784J659681J056892J409812
$$ 32448308 33152908 34049559 35165248 36421983 37129767 38789448 39846340 41256152
16761D1256152J240529J234896J432186J403371J241469J668329J453583J501893
$$ 41256152 42496681 43731577 45163763 46567134 47808603 49476932 50930515 52432408
16753E2432408J722635K133797J419573J783487K177251J684348J564418K180995
$$ 52432408 54155043 56288840 57708413 59491900 61669151 63353499 64917917 67098912
16745F7098912K065127J754932K087861K020965J960940J621243K025434J944604
$$ 67098912 69164039 70918971 73006832 75027797 76988737 78609980 80635414 82580018
16737H2580018J931784J475386J963186J520176J501551J364105J196190J274084
$$ 82580018 84511802 85987188 87950374 89470550 90972101 92336206 93532396 94806480
16729I4806480R32308O73300O70600M34313L41435k3797n7033k26227o05153n61190
$$ 94806480 95738788 96412088 97082688 97517001 97858436 97834639 97777606 97551379 96946226 96385036
16719I6385036o26813j083345j463239r97904j116228j360959j968471j889608
$$ 96385036 95758223 94674878 93211639 92213735 91097507 89736548 87768077 85878469
16711H5878469j389750j871948j899083j675544k101756k014139j652734j955801
$$ 85878469 84488719 82616771 80717688 79042144 76940388 74926249 73273515 71317714
16703G1317714k155207k243598j475582j858267j737375j868389k134044j440038
$$ 71317714 69162507 66918909 65443327 63585060 61847685 59979296 57845252 56405214
16695E6405214j414781j828738j466937j693706j559476j098311j479794j549075
$$ 56405214 54990433 53161695 51694758 50001052 48441576 47343265 45863471 44314396
16687D4314396j568325p42868j766481j071496j072277q82794j134121j135318
$$ 44314396 42746071 42003203 40236722 39165226 38092949 37210155 36076034 34940716
16679C4940716j052678o12594q11534j100893o86062p82946r62714q61669r42358
$$ 34940716 33888038 33275444 32463910 31363017 30676955 29894009 28931295 28069626 27127268
16670B7127268k81749r54276p31578o02343o13782q50930m59753o72966k01700
$$ 27127268 26845519 25891243 25159665 24557322 23943540 23092610 22632857 21959891 21758191
16661B1758191o99562o08686k44906l16312r73030J05211o97011o83847K9051
$$ 21758191 21058629 20449943 20205037 19888725 18915695 19020906 18323895 17640048 17669099
16652A7669099o38896l72174r5367p10367k14187j49946n35145m81600j77703
$$ 17669099 17030203 16658029 16562662 15852295 15638108 15488162 14953017 14471417 14293714
16643A4293714m28218k65751j80980k90777r9176j94890m41896L9838n99642J10462
$$ 14293714 13865496 13599745 13418765 13127988 13028812 12833922 12392026 12431864 11832222 11942684
16633A1942684l44677l30588J14698k83938l68447J11907l08829k38299l46711
$$ 11942684 11598007 11267419 11382117 11098179 10729732 10841639 10532810 10294511 9947800
16624I947800j18198j24616m2056P8967o41288l3684J8508j73632l06917Q1512
$$ 9947800 9829602 9704986 9662930 9741897 9100609 9066925 9085433 8911801 8604884 8686396
16614H686396m68815j11112M8035k08527j19062k60995N0076k22831k51311K82571
$$ 8686396 8217581 8106469 8154504 7945977 7826915 7565920 7615996 7393165 7141854 7424425
16604G424425k0859j25772l61226M690K77902o29463k75477J5147j3091K33877
$$ 7424425 7403566 7277794 6916568 6921258 7199160 6569697 6294220 6309367 6296276 6530153
16594F530153j58932l33800L6004L9932j64042l4244q6663o6320k39654J91938
$$ 6530153 6371221 6037421 6073425 6113357 5949315 5915071 5828408 5762088 5522434 5714372
16584E714372j54858R6607m40671K55057m99270K61708j79730Q1427k88913j07909
$$ 5714372 5559514 5656121 5215450 5470507 4971237 5232945 5053215 5134642 4845729 4737820
16574D737820L61827j75609j90836K8009l78574m2344J35504L390p1786k07331
$$ 4737820 5099647 4924038 4733202 4761211 4382637 4340293 4475797 4479187 4407401 4200070
16564D200070L69205j55190o2893k81631j03265J78536M4550l89636M01531j29430
$$ 4200070 4569275 4414085 4351192 4069561 3966296 4144832 4189382 3799746 4201277 4071847
16554D071847j9506k66177L08121m03728k69036L44484j95968K56480k70856P0146
$$ 4071847 4052341 3786164 4094285 3690557 3421521 3766005 3570037 3826517 3555661 3625807
16544C625807P4214k5382N2843o4072n1856Q9696m04634j18237M44718o18571
$$ 3625807 3700021 3674639 3727482 3663410 3611554 3701250 3296616 3178379 3623097 3004526
16534C004526K25764j399j36465J4719J1229n4831j89451J69295J31349o6196
$$ 3004526 3230290 3228891 3092426 3107145 3118374 3063543 2874092 3043387 3174736 3108540
16524C108540j58813K75816j60369m06238o7458j7747L5342J1982j20977m8334
$$ 3108540 2949727 3225543 3065174 2658936 2591478 2573731 2609073 2621055 2500078 2451744
16514B451744J45634J41541J00165k77734o8067J44094j00112K92143n29947K53795
$$ 2451744 2597378 2738919 2839084 2561350 2493283 2637377 2537265 2829408 2299461 2553256
16504B553256l37098K01754J38855n4777k78312Q9152l35267O46975m39644O4465
$$ 2553256 2216158 2417912 2556767 2501990 2223678 2312830 1977563 2624538 2184894 2249359
16494B249359o3429J93655j22177l06945K24432J17770j47180q8712m758M86615
$$ 2249359 2185930 2379585 2257408 1950463 2174895 2292665 2145485 2056773 2052015 2538630
16484B538630k50637j71771j29114J22015j62252M178P6097J1364P7282O3159
$$ 2538630 2287993 2116222 1987108 2109123 1946871 1951049 2027146 2038510 2115792 2178951
16474B178951n13356M66785j197l71382L54899j81105l9722q7964p4659J06716
$$ 2178951 1665595 2132380 2131183 1759801 2114700 1933595 1893873 1805909 1731250 1837966
16464A837966Q9396k33231M21646j49159k27658j61808j34945K62991J76722K8408
$$ 1837966 1927362 1694131 2115777 1966618 1738960 1577152 1442207 1705198 1881920 1910328
16454A910328j72668L34325m47904M2961K71340J16058n45569p056J07742N1436
$$ 1910328 1737660 2071985 1624081 1667042 1938382 2054440 1508871 1501815 1609557 1660993
16444A660993J8028k39159l1520J55661j39121J95153r6300p8475L56650R2505
$$ 1660993 1679021 1439862 1408342 1564003 1424882 1620035 1523735 1445260 1801910 1894415
16434A894415l29683k13128L92608l30807Q8371J4243k8645L25381l87637K67958
$$ 1894415 1564732 1351604 1744212 1413405 1501776 1516019 1487374 1812755 1425118 1693076
16424A693076m62416M30628n55825L43098L6127l84741L57436L7298j92224N6354
$$ 1693076 1230660 1661288 1105463 1448561 1484688 1099947 1457383 1494681 1302457 1358811
16414A358811l3525O6331J42900Q5141L8049j51479j33368j91333M8478J53925
$$ 1358811 1325286 1391617 1534517 1619658 1657707 1506228 1372860 1181527 1230005 1383930
16404A383930L2060p1411l75749Q2605N72655l99633l9640P4665J28214n1828
$$ 1383930 1415990 1344579 968830 1051435 1624090 1224457 1184817 1259482 1387696 1335868
16394A335868J08557o7830k09693r9372K25054J9769k05273K82654k57192j25509
$$ 1335868 1444425 1376595 1166902 1067530 1292584 1312353 1107080 1389734 1132542 1007033
16384A007033M88M4400L4259j55402N5101P6529L08797k70007J65059j7276q0341
$$ 1007033 1007521 1051921 1086180 930778 985879 1062408 1371205 1101198 1266257 1248981 1168640
16373A168640n6602o833j4635K6781P9929j61988q0979P874L83786l67237o1217
$$ 1168640 1112038 1105205 1090570 1117351 1197280 1035292 954313 962187 1345973 978736 917519
16362I17519L42801j72160j81339K75253p9894K00787P4769j30212l30964k08654
$$ 917519 1260320 1088160 906821 1182074 1102180 1302967 1377736 1247524 916560 707906
16352G07906R4360J86496N876J38043j74656j35238J52598L18468k62858Q488
$$ 707906 802266 988762 994638 1132681 958025 822787 975385 1293853 1030995 1039483
16342A039483M2015J1640J43266m85114O0003p0599K1597K78229k35929L45096
$$ 1039483 1081498 1093138 1236404 751290 811293 740694 762291 1040520 804591 1149687
16332A149687l15775j30864L66937k28020k15767K59869n8178l63665N42506D93272
$$ 1149687 833912 703048 1069985 841965 626198 886067 827889 464224 1006730 493272
16321G16710L49874l3075n6373m27792K82165J39974j24272r331J97603k62860
$$ 716710 1066584 1033509 977136 549344 831509 971483 847211 837880 1035483 772623
16311G72623j39438L00569k80806K56799j13397P8236r626K42507m09433J05281
$$ 772623 633185 933754 652948 909747 796350 874586 864960 1107467 698034 803315
16301H03315j09010K95231m54480L50814j72602J28646L3295J21009m3602m17593
$$ 803315 694305 989536 535056 885870 713268 841914 875209 996218 952616 535023
16291E35023J93028j12105M452P9064M3444K418q9948j22737R8683K01639j64344
$$ 535023 728051 615946 620398 699462 742906 745324 655376 532639 631322 832961 668617
16280F68617j8042N2400O2694l03386M4919K51355K71185m58177J66618k21810
$$ 668617 650575 702975 765669 462283 507202 758557 1029742 571565 738183 516373
16270E16373K70717j8783l62703K61227J44507r5758j90695J52453k14586J26520
$$ 516373 787090 768307 405604 666831 811338 715580 524885 677338 462752 589272
16260E89272p9834J11680N4417A68870O73606k13745l0112j28865J54441j34004
$$ 589272 509438 621118 675535 168870 842476 628731 598619 469754 624195 490191
16250D90191P1874J79058p3484k73128Q9340K3444B33275L31817N7588j80422
$$ 490191 562065 741123 667639 394511 483851 507295 233275 565092 622680 442258
16240D42258J42913k4807k12471M75238O4330l57501l2732j5830K77638k28803
$$ 442258 585171 560364 347893 823131 887461 529960 497228 481398 759036 530233
16230E30233J26780j89753j78008N1308J28791J26718J80063l46290p6189J0498
$$ 530233 657013 467260 289252 340560 469351 596069 776132 429842 353653 364151
16220C64151J77753B25749L13351J05900B95724L78719j06395J16860l00167A64854
$$ 364151 541904 225749 539100 645000 295724 674443 568048 684908 384741 164854
16209G12682j13140Q6236Q7370l70559j66434J41807M9695M19279j67540k44559
$$ 712682 599542 685778 773148 402589 236155 377962 427657 846936 679396 434837
16199D34837j241N1138q4732K9406q558A86851Q40197l90183k48135J95767k42092
$$ 434837 433596 484734 400002 429408 420850 186851 1027048 636865 388730 584497 342405
16188C42405K55644A98949r5909L90957j05075F2469P34556B76294J63839J92064
$$ 342405 598049 198949 103040 493997 388922 62469 797025 276294 440133 632197
16178F32197O8980j56414r4668m2122A37045J38649L3213k845q3789K91722k38731
$$ 632197 701177 544763 450095 407973 137045 275694 308907 306062 222273 513995 275264
16167B75264M30670A26375j4471M31235H4780P7245K88979l2296J16310j24485
$$ 275264 705934 126375 111904 543139 84780 162025 451004 418708 535018 410533
16157D10533J79862A64681k2558K16390J09527J4657J72831j51312n1139m4805
$$ 410533 590395 164681 142123 358513 468040 482697 655528 504216 453077 408272
16147D08272r9650P8703M0839A6167J72367o132K00990i2132B48979K19611j32909
$$ 408272 308622 387325 428164 16167 188534 182402 383392 -92132 248979 468590 335681
16136C35681A64893K58105K0172B03742O8595R3778F6282e5882C21426I5795K80951
$$ 335681 164893 422998 443170 203742 272337 366115 66282 -55882 321426 95795 376746
16125C76746J21590p127O2081A93213k1909Q9241m2775F1246J10037k6404M3811
$$ 376746 498336 491209 553290 193213 171304 260545 217770 61246 171283 144879 188690
16114A88690l8109L42080k24977A32822J54138j32008A2683L50869j10582J9471
$$ 188690 150581 492661 267684 132822 286960 154952 12683 363552 252970 272441
16104B72441J09829F7820J75296D6159M08768g4003D08745A89872J18506j47124
$$ 272441 382270 67820 243116 46159 454927 -74003 408745 189872 308378 161254
16094A61254C6591K98893P60P924M8438j63347O5023n1689L3861l5182A04408
$$ 161254 36591 335484 336244 344168 392606 229259 294282 242593 276454 241272 104408
16082A81494b73222A14766b93249A40367b022B03406K86061B23087m3008P1048
$$ 181494 -273222 114766 -293249 140367 -2022 203406 489467 223087 180079 251127
16072B51127e3352C69253N46G9435M74605B76393A2500K29476K4395a20903A05111
$$ 251127 -53352 369253 369799 79435 554040 276393 12500 241976 266371 -120903 105111
16060A49593n0005J04979G5989J52458A00191J24577C9867J56854B4739J78167
$$ 149593 99588 204567 75989 228447 100191 224768 39867 196721 24739 202906
16050B02906m8740b3727E67541A37858N5001k710L4684F7304J83614b05682A26682
$$ 202906 154166 -23727 567541 137858 192859 190149 224833 67304 250918 -205682 126682
16038B5093J28682l077k1380b82648E58120k13672l0578P2344j54587A00685O2096
$$ 25093 153775 150698 129318 -282648 558120 344448 313870 386214 231627 100685 162781
16027A62781K55514H3748J54465a18742A71582J9091L1675r5480m1913K0409f848
$$ 162781 418295 83748 238213 -118742 171582 190673 222348 126868 84955 105364 -6848
16015A1101O6749J73526H0229l7003b21092g9353C51087d8542D9881J14214E4760
$$ 11101 77850 251376 80229 43226 -221092 -79353 351087 -48542 49881 164095 54760
16003a76980D9122q761c9587A69684k49A8244a8733k37087A73378J7004Q773L42739
$$ -176980 49122 40361 -39587 169684 169435 18244 -18733 -255820 173378 190382 199155 541894
15991E41894B61431M9725J24648N94983k3883M22140j36721j53548n47838j73182
$$ 541894 261431 311156 435804 1030787 1006904 1429044 1292323 1138775 590937 417755
15981D17755J20705j53264j66272a61583O2236B89453D2410Q6658R2777a81017
$$ 417755 538460 385196 218924 -161583 -99347 289453 42410 129068 221845 -181017
15970f1818C7911K908K26802P4662A07259B9366L20664b94432N3550A22904D3528
$$ -61818 37911 40819 267621 342283 107259 29366 350030 -294432 -240882 122904 43528
15958A72083A3520R600L84474a73182a7866H728d0121C03120c0229m2396k6594
$$ 172083 13520 23120 407594 -173182 -17866 8728 -40121 303120 -30229 -72625 -99219
15947i9219A55130b28231A58214d660j1958E3799O6010R8643l7710J4726J65119
$$ -99219 155130 -228231 158214 -4660 -16618 53799 119809 218452 180742 195468 360587
15936C60587a10732C03103b3200M480A4215c5901r4092A60811k5163n9369J37544
$$ 360587 -110732 303103 -23200 -18720 14215 -35901 -129993 160811 135648 76279 213823
15925B13823H3692J15253b5968q691k07702e0040A92776a11632G4912K06518A21174
$$ 213823 83692 198945 -25968 -34659 -242361 -50040 192776 -111632 74912 281430 121174
15913b1958j39776k78764a5883e463F9165M8032a03189M5495j16958F4067M5042
$$ -21958 -161734 -440498 -15883 -5463 69165 117197 -103189 -57694 -174652 64067 109109
15902A09109J0808c5762k14332B98167a22697B19336C2346h6339C40406p6641
$$ 109109 119917 -35762 -250094 298167 -122697 219336 32346 -86339 340406 263765
15892B63765h569A45397J64482A31324b45581d9191j62821A0034K92947j46608
$$ 263765 -8569 145397 309879 131324 -245581 -49191 -212012 10034 302981 156373
15882A56373k5439a45227D4605K8316J37800F5178k8787a46215o519C89K14800
$$ 156373 130934 -145227 44605 72921 210721 65178 36391 -146215 -152734 389 215189
15871B15189K14211A42780P178J5093J90182a43801B38021a1962f83A57222q828
$$ 215189 429400 142780 149958 165051 355233 -143801 238021 -11962 -683 157222 148394
15860A48394L9644b2590j31727A02473k0200B9675M9305M9049j5422J46814i1868
$$ 148394 188038 -22590 -154317 102473 82273 29675 78980 128029 112607 259421 -91868
15848g8508k59810f5844C56639A1450b76462J24095L1622B31489g2331N406j31397
$$ -78508 -338318 -65844 356639 11450 -276462 -152367 -120745 231489 -72331 -66925 -198322
15837a98322B17954L598b99286A60425p8385f3196E5994d21919E1807b49873A68566
$$ -198322 217954 221552 -299286 160425 82040 -63196 55994 -421919 51807 -249873 168566
15825i0976L8416I4816c03973J09352m152q9506D8074b21368i539C42165O9719
$$ -90976 -52560 94816 -303973 -194621 -198773 -288279 48074 -221368 -9539 342165 411884
15814D11884b05155a9636B07598o2336d24035a9345n0036R344b0401D0507K73070
$$ 411884 -205155 -19636 207598 145262 -424035 -19345 -69381 -60037 -20401 40507 313577
15803C13577j47521n8438K41267j7424F8549H480c6169G317J22845c3809A16989
$$ 313577 166056 107618 348885 331461 68549 8480 -36169 7317 130162 -33809 116989
15791g9519a110j57449A80982O700a3394l88520A30152a85161b7681j57866d1926
$$ -79519 -1110 -158559 180982 187682 -13394 -401914 130152 -185161 -27681 -185547 -41926
15779b40582j35097J79336M9234B00783G26a91490B37567a3736F4852b08766j10466
$$ -240582 -375679 -196343 -147109 200783 726 -191490 237567 -13736 64852 -208766 -319232
15768c19232A96201H7168k1042a22176K0477j53194A13417m3348R1802q133L6419
$$ -319232 196201 87168 66126 -122176 -101699 -254893 113417 70069 161871 153738 190157
15757A90157b28903F26809a20413l7693P8195N720B41383b0043A48406a07544
$$ 190157 -228903 626809 -120413 -158106 -79911 -74191 241383 -20043 148406 -107544
15746c624k76958a28428D2686L18627I2279b4398k8916a3675j48262g6588a6958
$$ -3624 -280582 -128428 42686 361313 92279 -24398 -53314 -13675 -161937 -76588 -16958
15734a23727H5857a02128j43100J01082K6908B14533a13733B03427h4271B88820
$$ -123727 85857 -102128 -245228 -144146 -117238 214533 -113733 203427 -84271 288820
15723a84401B78169a97193B0111B949P0885K0116a56212j28132F2503b14644c5352
$$ -184401 278169 -197193 20111 2949 73834 93950 -156212 -284344 62503 -214644 -35352
15711A94768A9161k733L57935g6868j52129a0701o4437n792k2477G9750K2676
$$ 194768 19161 16428 374363 -76868 -228997 -10701 -75138 -80930 -103407 79750 102426
15700A02426G174c36669h4885G5744b8477j68084B66387N8936A40207D8766a67045
$$ 102426 7174 -336669 -84885 75744 -28477 -196561 266387 325323 140207 48766 -167045
15688d09028h2718I5079f0939B8871R4508L01186b87491b7348k7945k47806H775
$$ -409028 -82718 95079 -60939 28871 123379 424565 -287491 -27348 -55293 -303099 8775
15676D581J42181k6088A8691M841K66107k1659a12598k5485C19836b09638D263
$$ 4581 146762 120674 18691 23532 289639 267980 -112598 -138083 319836 -209638 4263
15664E1099A5396M3998J02669M0812n3216n6230c39686J69147E8148A7557O6228
$$ 51099 15396 59394 162063 202875 149659 93429 -339686 -170539 58148 17557 83785
15653H3785f8764o9451N8663A02348b7528l7703B19683a52883H7454p813R963
$$ 83785 -68764 -138215 -79552 102348 -27528 -65231 219683 -152883 87454 79641 89604
15642H9604Q2550D4731j512a20082j67451H6730c8348F1440J25378c1998A36256
$$ 89604 172154 44731 43219 -120082 -287533 86730 -38348 61440 186818 -31998 136256
15630f1338C2312J19024B7366c8821l35448J44119A53886J23484H8817B0366a13685
$$ -61338 32312 151336 27366 -38821 -374269 -230150 153886 277370 88817 20366 -113685
15618a61931B49606a67712D6850a53610n0813A77399E2507b04813A55509a00146
$$ -161931 249606 -167712 46850 -153610 -204423 177399 52507 -204813 155509 -100146
15607i7820B2713K68519b93306a43800c0229M048j69722B07727a49242f6903k6741
$$ -97820 22713 291232 -293306 -143800 -30229 -26181 -195903 207727 -149242 -66903 -93644
15596i3644r7636R0312j89211b3949A20299b16994m5592j1673A40488i783k22046
$$ -93644 -191280 -100968 -290179 -23949 120299 -216994 -262586 -274259 140488 -9783 -231829
15585b31829C08781A41551a43371C91153c10175P5112B0223O9084c26907i0989
$$ -231829 308781 141551 -143371 391153 -310175 -235063 20223 89307 -326907 -90989
15574a32900e288B05787J4605a96867A35384A9377c11991J46519O3301B15152
$$ -132900 -5288 205787 220392 -196867 135384 19377 -311991 -165472 -102171 215152
15563C4382b38493k8814F4967N7764i4076M2486I9437J25407a14059B0367i5206
$$ 34382 -238493 -267307 64967 122731 -94076 -51590 99437 224844 -114059 20367 -95206
15551a07030J9055B18987c45539J23327C1992b01151P5750B17128a48540g591
$$ -107030 -87975 218987 -345539 -222212 31992 -201151 -125401 217128 -148540 -7591
15540B42604c28272A62978m0456L7051D9896h2797K3395H1821K06150e7689m40689
$$ 242604 -328272 162978 122522 159573 49896 -82797 -59402 81821 287971 -57689 -498378
15529d98378c8352j81290C01400C9277R184J32845b7377C1978J89627h9547F6557
$$ -498378 -38352 -219642 301400 39277 48461 181306 -27377 31978 221605 -89547 66557
15517A2203a21672D2122K27955Q5861A50540N2253f8220o0550G7999K58663H5348
$$ 12203 -121672 42122 270077 355938 150540 202793 -68220 -128770 77999 336662 85348
15505B06543H7425D335O1496G247a2036j08304B47721b9958B88701l0739p7586
$$ 206543 87425 4335 65831 7247 -12036 -120340 247721 -29958 288701 257962 180376
15494A80376p635b14185A96452J85788j46292d5139I8234b001A55539n3970J57069
$$ 180376 172741 -214185 196452 382240 235948 -45139 98234 -2001 155539 101569 258638
15483B58638b8782k1748A02033b3697C5833j2586L46192c338F10585N8126k43124
$$ 258638 -28782 -50530 102033 -23697 35833 23247 369439 -3338 610585 668711 425587
15472D25587A96333P8141B9798K00084a894L21o1749B29630G9990h204n7666C26548
$$ 425587 196333 274474 29798 229882 -1894 -1573 -63322 229630 79990 -8204 -65870 326548
15459B27325j6345a50859d2674j43337p056d0082B59828l7851G037K95682i932
$$ 227325 210980 -150859 -42674 -186011 -193067 -40082 259828 221977 7037 302719 -9932
15447D592O7740L4109O8225o8717N47512j8267K02322C42499K25173B38652A7132
$$ 4592 72332 106441 174666 105949 653461 635194 837516 342499 567672 238652 17132
15435B37880H7900b522m2944A64687d2556o2054B49738B195c17506J36251M709
$$ 237880 87900 -2522 -45466 164687 -42556 -104610 249738 2195 -317506 -181255 -176546
15424a76546B55188C4172a24634c7613k73807J10690G1037c6837j79210j04355
$$ -176546 255188 34172 -124634 -37613 -311420 -200730 71037 -36837 -216047 -320402
15414c20402D9585c8248j49527L0888A45942f4418C5875J62504d38027C06876
$$ -320402 49585 -38248 -187775 -156887 145942 -64418 35875 198379 -438027 306876
15403a41140b2040j20776f9645o4325r6176r0527A39088c75094a4190G6627a48023
$$ -141140 -22040 -142816 -69645 -133970 -230146 -320673 139088 -375094 -14190 76627 -148023
15391a76761B4542h507j30737A25039R0053a3729q2039H6995a2455k17273n4550
$$ -176761 24542 -8507 -139244 125039 215092 -13729 -95768 86995 -12455 -229728 -284278
15380b84278B2808L86490d9670m7022H4617a30924B63230H4489K78419A63109
$$ -284278 22808 409298 -49670 -96692 84617 -130924 263230 84489 362908 163109
15369B99059J72142j1524A70571C1696a00242B47670a35594l289p6472B20305
$$ 299059 471201 459677 170571 31696 -100242 247670 -135594 -138883 -215355 220305
15358A17305a77127B47548A00805M06855F6137L1642P2139O4200a85966b8716
$$ 117305 -177127 247548 100805 507660 66137 97779 169918 234118 -185966 -28716
15347B8850P8007i8262B61306k3877O4092N4836K1881j06795H3037K26131h7241
$$ 28850 106857 -98262 261306 237429 301521 356357 378238 271443 83037 309168 -87241
15335A53019b3301j35640B65719A11187A2721a0110B77961i8390B56942b15581
$$ 153019 -23301 -158941 265719 111187 12721 -10110 277961 -98390 256942 -215581
15324A64785p003d6906l0782A53831j9412g3439B57878a36273a7148j59152j21219
$$ 164785 157782 -46906 -77688 153831 134419 -73439 257878 -136273 -17148 -176300 -297519
15313b97519A00498N1381J04773b0952A72290a87248B60845a42225b1743B24881
$$ -297519 100498 151879 256652 -20952 172290 -187248 260845 -142225 -21743 224881
15302g7397m9228H6482b84980a36542A19049j6961h9493B47359a65099e1619F4559
$$ -77397 -126625 86482 -284980 -136542 119049 102088 -89493 247359 -165099 -51619 64559
15290D0920K66889j37199m2767b24339C38973A08247E3387K8394a7105D9222a28752
$$ 40920 307809 170610 127843 -224339 338973 108247 53387 81781 -17105 49222 -128752
15278a23872a0840l9573B06650c9113E8648a66292h1822A80878o8985f4601i850
$$ -123872 -10840 -50413 206650 -39113 58648 -166292 -81822 180878 111893 -64601 -9850
15266d53693A45442a09841j03137B82009c2934B88169c4317k3523j56748b6444
$$ -453693 145442 -109841 -212978 282009 -32934 288169 -34317 -57840 -214588 -26444
15255a41016j20584B09168m5079b1983B69605H7668Q3074L3034K04812N69078
$$ -141016 -261600 209168 164089 -21983 269605 87668 170742 203776 408588 977666
15245I77666P84794m78691J75820j26725F47290B01871G6090M38268c5729C3753
$$ 977666 1762460 1283769 1459589 1332864 647290 201871 76090 514358 -35729 33753
15234B43430G4426d6638B90955p0962C500e1877A67054o4109O525a9966B52138
$$ 243430 74426 -46638 290955 219993 3500 -51877 167054 102945 109470 -19966 252138
15222d7125B47614E660J6806a83811c590A2561a34376j85903i2666j37202A31965
$$ -47125 247614 5660 22466 -183811 -3590 12561 -134376 -320279 -92666 -229868 131965
15210A7990J44875b22719A52646n3771L4551B6396c3909q6887j7178E3377L0423
$$ 17990 162865 -222719 152646 98875 133426 26396 -33909 -120796 -137974 53377 83800
15199H3800J47628A199a59766B41791j20256F531J06139K20425a45043C53329
$$ 83800 231428 1199 -159766 241791 121535 6531 112670 333095 -145043 353329
15188d9958B51903K4917a84800B09264i1976A64278c624B97048a71032K5563e4630
$$ -49958 251903 276820 -184800 209264 -91976 164278 -3624 297048 -171032 -145469 -54630
15176B45576m7513G9921a91153i382B41185a31735A9008K15331d959j91186I7099
$$ 245576 198063 79921 -191153 -9382 241185 -131735 19008 234339 -4959 -196145 97099
15164B66553i0060g710D023K24917a02932D40132A61312a86180B428M41190B5230
$$ 266553 -90060 -7710 4023 228940 -102932 440132 161312 -186180 2428 443618 25230
15152I2715J80320e0863j1272K3738j26677B19108h2856D1229c28180B17890a04807
$$ 92715 273035 -50863 -62135 -38397 -165074 219108 -82856 41229 -328180 217890 -104807
15140G1639B1051M35929A09923m8264J51747h502A40900P8255J14898g9188D47663
$$ 71639 21051 456980 109923 61659 213406 -8502 140900 219155 334053 -79188 447663
15128a3196C31849A28132O4969O6243O6335J39124D8461K54844F8393J81397b5857
$$ -13196 331849 128132 193101 259344 325679 464803 48461 303305 68393 249790 -25857
15116d956C55005j53855P55h9585A98401j8810K6994r0456b00338A1602a50749
$$ -4956 355005 201150 201905 -89585 198401 179591 206585 116129 -200338 11602 -150749
15104B17292c6423I9666N856c15296a07124B17299k6536n0282J80906r5825b20634
$$ 217292 -36423 99666 105522 -315296 -107124 217299 190763 140481 321387 225562 -220634
15092d0405k60717C2500a21533C402K7485P0045J18871l7864D9125g8729C21983
$$ -40405 -301122 32500 -121533 3402 30887 100932 219803 181939 49125 -78729 321983
15080A49195c69243B16762K6064g4644p9701A89857e6254A98551Q2068a65234
$$ 149195 -369243 216762 242826 -74644 -154345 189857 -56254 198551 280619 -165234
15069C8327M9226Q8729E9505J06051G9294a2902D45073f4326A19869K5458C8351
$$ 38327 87553 176282 59505 165556 79294 -12902 445073 -64326 119869 145327 38351
15057a1905l3882B12788r9538K85071A11134N48172B22737Q6525N3874M5099A58706
$$ -11905 -45787 212788 113250 398321 111134 659306 222737 309262 363136 408235 158706
15045A37597K59878l6017o5910A21852b3407n284C46895R786A53922L33861j79385
$$ 137597 397475 361458 295548 121852 -23407 -28691 346895 356681 153922 487783 308398
15034C08398o2159J92501p4218n2698K87386k59287K30507Q9186k23934n4318
$$ 308398 246239 438740 364522 311824 599210 339923 570430 659616 435682 381364
15024C81364j59431L17977j88161O5051q7626G8837j0440K29783j17458L74294
$$ 381364 221933 539910 351749 416800 329174 78837 68397 298180 180722 555016
15014E55016k50597b7794H2736K75140K51660A06161L32505m9517I5540M26145
$$ 555016 304419 -27794 82736 357876 609536 106161 438666 389149 95540 521685
15004E21685o2663l9944R2364A71086J33666r0127r1008J34473J54303O4837A93316
$$ 521685 459022 419078 511442 171086 304752 214625 123617 258090 412393 477230 193316
14992B78634J08271j92776M58719k04314B4515L86704j40065Q6825j6080N8891
$$ 278634 386905 194129 652848 448534 24515 411219 271154 357979 341899 400790
14982D00790o3735M90511k47513J0019M05734k13419C12872M57074k90518L5379
$$ 400790 337055 827566 580053 590072 995806 782387 312872 769946 479428 514807
14972E14807A89628q433l8622L57701K4453d0041E05943J96201D2882J03193p1209
$$ 514807 189628 181195 142573 500274 524727 -40041 505943 702144 42882 146075 74866
14961G4866N09474A04452K49466n0393J19283Q0618k03190H9039L52537j10445
$$ 74866 584340 104452 353918 303525 422808 503426 300236 89039 441576 331131
14951C31131G4284O7344L56382j94129R393K4130j36662N12882n9387G308P81736
$$ 331131 74284 141628 498010 303881 313274 337404 200742 713624 654237 7308 789044
14940G89044C73414A26028L78305k36325P3737J63083N7564J81485k09101M45719
$$ 789044 373414 126028 504333 268008 341745 504828 562392 743877 534776 980495
14930I80495l88670M72038j32318O7372J78470L52410l36360j93826k68530L92192
$$ 980495 591825 1063863 931545 998917 1177387 1529797 1193437 999611 731081 1123273
14920A123273j942L77601P3664L43330m05893k13169k72900J1332j83784j09886
$$ 1123273 1121331 1498932 1572596 1915926 1510033 1296864 1023964 1035296 851512 741626
14910G41626l60332R5009L94652l4947C66707o8425k0266K08830N4548K5462B70516
$$ 741626 381294 476303 870955 836008 366707 298282 278016 486846 541394 566856 270516
14898C45408L1522K11836r0077K49995c509D54743N6080j04002L7247m5345L5748
$$ 345408 376930 588766 498689 748684 -3509 454743 510823 406821 444068 398723 434471
14887D34471K24393P3861C09096M19221k57341m4127J47983r3011K01132m8750
$$ 434471 658864 732725 309096 728317 470976 426849 574832 481821 682953 634203
14877F34203k63658L2441j38207L65678j58002Q5076j88240K14229m1833l5872
$$ 634203 370545 402986 264779 630457 472455 557531 369291 583520 541687 505815
14867E05815K30980J70407B52289J56981l439k6108K5760J07048F4284O19478
$$ 505815 736795 907202 252289 409270 405831 379723 405483 512531 64284 683762
14857F83762C05205J70705p1745j51662O0068o417k7372L4644L47816k1139j28070
$$ 683762 305205 475910 404165 252503 312571 306154 278782 313426 661242 640103 512033
14846E12033K24356k78612Q7569L52802j36696l6719N7506n3953K41690D29540
$$ 512033 736389 457777 545346 898148 761452 724733 782239 728286 969976 429540
14835G58278j53354j58271N648j42447J37675r9265J11157j11943J2259K96447
$$ 758278 604924 446653 452301 309854 447529 348264 459421 347478 359737 656184
14825F56184q4161K82142l18000J18790C25169K12690J26524B56968N30817l77196
$$ 656184 572023 854165 536165 654955 325169 537859 664383 256968 787785 410589
14815D10589J2424k3361K61315j25722L38583j23706l03452J24939O5414J26701
$$ 410589 423013 399652 660967 535245 873828 750122 446670 571609 637023 763724
14805G63724O1587K29002l38592k16235K69714l06103L5564J9291A91833L85660
$$ 763724 825311 1054313 715721 499486 769200 463097 498661 517952 191833 577493
14795E77493J3172k78934K60285j31483K79921B79149L18658j31485j9709L23412
$$ 577493 590665 311731 572016 440533 720454 279149 597807 466322 446613 770025
14785G70025j61209J6046r5122J6124k1732H7892N67368J06931k5368n1975P8970
$$ 770025 608816 624862 529740 545864 524132 87892 655260 762191 736823 684848 763818
14774G63818k3866j50324r566J20962k67872j24705q3950N00522j52328A51571
$$ 763818 739952 589628 580062 701024 433152 308447 224497 725019 572691 151571
14763E11064j01063L58681l53856K37688k18119j86476K30943l8109q751L87366
$$ 511064 410001 768682 414826 652514 434395 247919 478862 440753 432002 819368
14753H19368I7916N77772j59428k9304j14790R7504J55964G5691M35376R5494
$$ 819368 97916 675688 516260 486956 372166 469670 625634 75691 511067 606561
14743F06561j62384K43597L9422M4713l33220n2832k745K46030o5195K34927r7740
$$ 606561 444177 687774 727196 771909 438689 385857 383112 629142 563947 798874 701134
14732G01134q2178R0902J76965m5251J25391Q4403M37130m28936L94237k385n70158
$$ 701134 618956 709858 886823 841572 966963 1051366 1488496 1059560 1453797 1451412 881254
14721H81254M31942m38377j36979q311J72136L01488m44991M9582O6694l34946
$$ 881254 1313196 874819 737840 729529 901665 1203153 758162 807744 874438 539492
14711E39492J74135p4387M15773n07292M15634k75272J66586K02133j4205L40709
$$ 539492 713627 639240 1055013 547721 963355 688083 854669 1056802 1042597 1383306
14701A383306k18650J98802m1913j12060j11644n0767J65722m01599P0388K31079
$$ 1383306 1164656 1363458 1321545 1209485 1097841 1047074 1212796 811197 881585 1112664
14691A112664k72114J90102D83925L70994K1993j63731M26450k16199P4407j48304
$$ 1112664 840550 1030652 483925 854919 876912 713181 1139631 923432 997839 849535
14681H49535r1627n7484L13216D52902N04885r7022r1377K83995j08775p3586
$$ 849535 757908 700424 1013640 452902 957787 860765 769388 1053383 944608 871022
14671H71022J50699r8226q7925j64948K29548M164J76126p9697P106k75406K18765
$$ 871022 1021721 923495 835570 670622 900170 904334 1080460 1000763 1007869 732463 951228
14660I51228m9645L4525p2447K98366J2055j28147Q6553k99873L67152Q6070J41139
$$ 951228 901583 936108 863661 1162027 1174082 1045935 1132488 832615 1199767 1285837 1426976
14649A426976n43434J52339K88586k4193l83995j36562o7078K89182O169m1466
$$ 1426976 883542 1035881 1324467 1300274 916279 779717 712639 1001821 1007990 966524
14639I66524K38015n56263N88222k95655k466Q1650m0753K21608r8895P9319J8859
$$ 966524 1204539 648276 1236498 940843 938377 1020027 979274 1200882 1101987 1181306 1200165
14628A200165J01509k86985J74677r0798J89938k24175j80620L00528j3363O1265
$$ 1200165 1301674 1014689 1189366 1098568 1288506 1064331 883711 1184239 1170876 1232141
14618A232141p9221L21808k80613l8435J81133j69668j9426K78038n7399l50876
$$ 1232141 1152920 1474728 1194115 1155680 1336813 1167145 1147719 1425757 1368358 1017482
14608A017482J89199J7448k21567n3783L41075K28363l5686l17092J44225L283
$$ 1017482 1206681 1224129 1002562 948779 1289854 1518217 1482531 1165439 1309664 1312947
14598A312947J17166R1062O2518j76936J38543J0169L4539P0594M4599k29752
$$ 1312947 1430113 1521175 1583693 1406757 1545300 1555469 1590008 1660602 1705201 1475449
14588A475449K21809k61089O37101n33243m6966R6186P6480j25773j3371p713
$$ 1475449 1697258 1436169 2073270 1540027 1493061 1589247 1665727 1539954 1526583 1518870
14578A518870K90450k61805R269L39171j36388J32572l04724K36251p798J49714
$$ 1518870 1809320 1547515 1556784 1895955 1759567 1892139 1587415 1823666 1815868 1965582
14568A965582l1076k3624R8220L0332j96262n6731K98278l9848K68917M1618K09021
$$ 1965582 1934506 1910882 2009102 2039434 1843172 1786441 2084719 2044871 2313788 2355406 2564427
14557B564427P0613o0605J58456M28719o6765O75131P28520P06505K356034N470334
$$ 2564427 2635040 2574435 2732891 3161610 3094845 3769976 4498496 5205001 7561035 13031369
14547A3031369J1212035J5971801p074702A5546190G070632k000177Q5979j882715
$$ 13031369 24243404 40215205 33140503 15546190 7070632 5070455 5156434 3273719
14539C273719r19801r48447O51384k32197k43291K59455q5666o0513M24673m31376
$$ 3273719 2353918 1405471 2056855 1824658 1581367 1840822 1755156 1694643 2119316 1687940
14529A687940L78670Q3834j03827m6217J85925m38255L10925j46274P321p5958
$$ 1687940 2066610 2150444 2046617 2000400 2186325 1748070 2058995 1912721 1920042 1844084
14519A844084M26034j4852P8578k4129l71229M80823k86364M38943k71783J65434
$$ 1844084 2270118 2255266 2333844 2309715 1938486 2419309 2132945 2571888 2300105 2465539
14509B465539R0766J03345J58688R6842k20816j1529j5111q8669K05231q6112
$$ 2465539 2556305 2659650 2818338 2915180 2694364 2682835 2667724 2579055 2784286 2698174
14499B698174p7495K48027J07666j33149K7710p4209O5677L26213k41653n2335
$$ 2698174 2620679 2868706 2976372 2843223 2870933 2796724 2862401 3188614 2946961 2894626
14489B894626M58616j97427l307k48768L02091k51934M5607J16603J84612j41931
$$ 2894626 3353242 3155815 3152508 2903740 3205831 2953897 2999504 3116107 3300719 3158788
14479C158788L61245L16196j92827m24382M52906k38343M97484n0332l47024K17228
$$ 3158788 3520033 3836229 3643402 3219020 3671926 3433583 3931067 3880735 3533711 3750939
14469C750939k38808J56516K43051j83651K26957J83615R4940J91052R1340l29006
$$ 3750939 3512131 3668647 3911698 3728047 3955004 4138619 4233559 4424611 4515951 4186945
14459D186945K90154m15520K12673K60085k03780j18763J02515J52418J43228
$$ 4186945 4477099 4061579 4274252 4534337 4330557 4211794 4314309 4466727 4609955
14450D609955J96630l21154N16605j84020J69078J71163j3494l69471K48823J27476
$$ 4609955 4806585 4485431 5002036 4818016 4987094 5158257 5144763 4775292 5024115 5151591
14440E151591k705J74482n4364P7951M18313n7261m04348N28176J18018J32600
$$ 5151591 5148886 5323368 5269004 5346955 5765268 5708007 5303659 5831835 5949853 6082453
14430F082453J09744N4444j6684K76726l25021M43163K68046k85668K73238J68037
$$ 6082453 6192197 6246641 6229957 6506683 6181662 6624825 6892871 6607203 6880441 7048478
14420G048478Q4410M3406M49853j85485K60155l81011K17821L90777j58565J96675
$$ 7048478 7132888 7176294 7626147 7440662 7700817 7319806 7537627 7928404 7769839 7966514
14410G966514P4612J10654K58222Q9643L88058k1330L17907l52757L32605J95328
$$ 7966514 8041126 8151780 8410002 8499645 8887703 8866373 9184280 8831523 9164128 9359456
14400I359456K38732k85042K55116o9139J88819K07014N10157L99151k61601J81398
$$ 9359456 9598188 9313146 9568262 9499123 9687942 9894956 10405113 10804264 10542663 10724061
14390A0724061k4809N25169J78774L02770j16925K53060M52507L91891K00758
$$ 10724061 10699252 11224421 11403195 11705965 11589040 11842100 12294607 12686498 12887256
14381A2887256j01463O90668j54154M85546K13226n3781N06957M31217J78711
$$ 12887256 12785793 13476461 13322307 13807853 14021079 13967298 14474255 14905472 15084183
14372A5084183L1326M48792M23569K85577L20194N31754N65415K8051L89429j54542
$$ 15084183 15115509 15564301 15987870 16273447 16593641 17125395 17690810 17718861 18108290 17953748
14362A7953748P80183O56569K44828L38771K31360O55249O71371L87347M08858
$$ 17953748 18733931 19390500 19635328 19974099 20205459 20860708 21532079 21919426 22328284
14353B2328284Q33530P07646J08952N79502P17805M99076Q29489N27131Q21739
$$ 22328284 23161814 23869460 23978412 24557914 25275719 25774795 26604284 27131415 27953154
14344B7953154R27570O32488P40615R64273O92460P25428J557340K90927J099095
$$ 27953154 28880724 29513212 30253827 31218100 31910560 32635988 34193328 34484255 35583350
14335C5583350P53008J433643Q96843J376762J051966J175165J782068J110518
$$ 35583350 36336358 37770001 38666844 40043606 41095572 42270737 44052805 45163323
14327D5163323J245219K069202J126541K336090J273324K017435K069808K199513
$$ 45163323 46408542 48477744 49604285 51940375 53213699 55231134 57300942 59500455
14319E9500455J778859K283405K257580K758366K502211K451333L120192L130808
$$ 59500455 61279314 63562719 65820299 68578665 71080876 73532209 76652401 79783209
14311G9783209L377542L207846L849987L913389M480526M310046M562481N114552
$$ 79783209 83160751 86368597 90218584 94131973 98612499 102922545 107485026 112599578
14303A12599578M870557N818142N895565O468440O326039P558405P706522P736013
$$ 112599578 117470135 123288277 129183842 135652282 141978321 149536726 157243248 164979261
14295A64979261R038436R045314R886152J0048280J1390980J1409446J2345496
$$ 164979261 174017697 183063011 192949163 202997443 214388423 225797869 238143365
14288B38143365J2928364J3175642J4026184J4390506J5202410J5258982J5656165
$$ 238143365 251071729 264247371 278273555 292664061 307866471 323125453 338781618
14281C38781618J5266827J5305946J5120167J4305464J3014111J1567882J0223782
$$ 338781618 354048445 369354391 384474558 398780022 411794133 423362015 433585797
14274D33585797P300256L805919N950l05190p01259k177624l958559k412618o599338
$$ 433585797 440886053 444691972 444697922 444392732 443691473 441513849 437555290 435142672 428543334
14265D28543334j0119792j1576329j3359087j4419731j5313098j5828358j5471820
$$ 428543334 418423542 406847213 393488126 379068395 363755297 347926939 332455119
14258C32455119j6003965j5177493j5164245j4232162j4069583j3442662j2162860
$$ 332455119 316451154 301273661 286109416 271877254 257807671 244365009 232202149
14251B32202149j1254938j1323483j0810509j0648661r469152q858546q297156
$$ 232202149 220947211 209623728 198813219 188164558 178695406 169836860 161539704
14244A61539704p652600p355605p166038o861547o200268n741310m808157n529418
$$ 161539704 153887104 146531499 139365461 132503914 126303646 120562336 115754179 110224761
14236A10224761m774827m745280m305770m172996l191701l726606l136755l803100
$$ 110224761 105449934 100704654 96398884 92225888 89034187 85307581 82170826 78367726
14228G8367726l220996k636917l032108k520657k621688k199286k176485j848897
$$ 78367726 75146730 72509813 69477705 66957048 64335360 62136074 59959589 58110692
14220E8110692k238519j835203j946331j597020j741706j416232j269202j445405
$$ 58110692 55872173 54036970 52090639 50493619 48751913 47335681 46066479 44621074
14212D4621074j687789j318467j485480j023186q10933q39099j155014j353501
$$ 44621074 42933285 41614818 40129338 39106152 38295219 37456120 36301106 34947605
14204C4947605q96864j210758r45547o08723m17344j043846q57811p92521m86233
$$ 34947605 34050741 32839983 31894436 31285713 30868369 29824523 28966712 28174191 27687958
14195B7687958o67318q28917o49760n50701p49534m83002o11273o45913k55605
$$ 27687958 27020640 26191723 25541963 24991262 24241728 23758726 23147453 22501540 22245935
14186B2245935q12997l64116n88967l4153o07900m02813l40732m35590l58168
$$ 22245935 21432938 21068822 20479855 20445702 19837802 19434989 19094257 18658667 18300499
14177A8300499p57817K11803o38844j69351q26969n7741l98169j86421m65049
$$ 18300499 17542682 17754485 17115641 16946290 16119321 16061580 15663411 15476990 15011941
14168A5011941q669p77499K71523m06733l99271j02289j58584m12101k89152P0360
$$ 15011941 15003272 14225773 14497296 14090563 13691292 13589003 13430419 13018318 12729166 12799526
14158A2799526m69459k6995l21251j3823L1536o26607k30355K2293m19062K09776
$$ 12799526 12330067 12303072 11981821 11967998 11999534 11372927 11142572 11164865 10745803 10955579
14148A0955579l32476k16133m34821J89121k20515j06444l20354J22443l70012
$$ 10955579 10623103 10406970 9972149 10161270 9940755 9834311 9513957 9636400 9266388
14139I266388K81734l12384m47751j3185P6927j20098m32542J37057r9089m70720
$$ 9266388 9548122 9235738 8787987 8774802 8851729 8731631 8299089 8436146 8337057 7866337
14129G866337L7150K0314l9639j70568j08910m16353K47016m5668j64152l22144
$$ 7866337 7903487 7923801 7884162 7713594 7604684 7188331 7435347 7389679 7225527 6903383
14119F903383M2320k7731R8982k70830k77796J03542q2880M7748j97022K239O4132
$$ 6903383 6945703 6917972 7016954 6746124 6468328 6571870 6488990 6536738 6339716 6341955 6406087
14108F406087k76752J15967j52868m1220m52845O30927n59531L47957m47557j60212
$$ 6406087 6129335 6245302 6092434 6051214 5598369 6229296 5669765 6017722 5570165 5409953
14098E409953r5309J20290j54775R651k80455K14005p4842k10065N8035k96558
$$ 5409953 5314644 5434934 5280159 5289810 5009355 5223360 5148518 4938453 4996488 4699930
14088D699930M2123J45711k00483o9243J01525k04888K11164m44960K30846j88059
$$ 4699930 4742053 4887764 4687281 4618038 4719563 4514675 4725839 4280879 4511725 4323666
14078D323666L2025j87455L6009j78301L16856j37629m91092M47167J22479l34211
$$ 4323666 4355691 4168236 4204245 4025944 4342800 4205171 3714079 4161246 4283725 3949514
14068C949514L9141n25284L30921J3445J78876N5549j39227j86404K66611k54749
$$ 3949514 3988655 3463371 3794292 3807737 3986613 4042162 3902935 3716531 3983142 3728393
14058C728393P6679m27321k84595L29900M9077l38097L43230l18837O0747j57380
$$ 3728393 3805072 3377751 3093156 3423056 3472133 3134036 3477266 3158429 3219176 3061796
14048C061796J71204k78218L13515l46308M8867r6686L26079q0457k16915q6774
$$ 3061796 3233000 2954782 3268297 2921989 2970856 2874170 3200249 3119792 2902877 2816103
14038B816103J31861j05622J6555m9370k38093L68708j13758k91625J59755j5765
$$ 2816103 2947964 2842342 2858897 2809527 2571434 2940142 2826384 2534759 2694514 2678749
14028B678749m0068k4133n5037l20014L07529q9896K28366j73289k4002j4545
$$ 2678749 2638681 2614548 2559511 2239497 2547026 2457130 2685496 2512207 2488205 2473660
14018B473660j04008K80190j84831j80927j51378L19656j81709j59312L91034
$$ 2473660 2369652 2649842 2465011 2284084 2132706 2452362 2270653 2111341 2502375
14009B502375k88306J02935o28930N98790j14588j63408P8274j15068J7015j65082
$$ 2502375 2214069 2317004 1688074 2286864 2172276 2008868 2087142 1972074 1989089 1824007
13999A824007J60397j84863N3068j84902J73545j12088J00387K47227L1758K63492
$$ 1824007 1984404 1799541 1852609 1667707 1841252 1729164 1829551 2076778 2108536 2372028
13989B372028J146760L553945Q523195J8914887L557076j5181144j1056767m808945
$$ 2372028 3518788 7072733 15595928 34510815 38067891 22886747 11829980 7021035
13981G021035j827912r01568q80050j26480k77266R578l32215k80591J72319k01511
$$ 7021035 5193123 4291555 3411505 3285025 3007759 3017337 2685122 2404531 2576850 2375339
13971B375339K96697N3608m04779k02338L67938m72676O2373j38667L04402l59982
$$ 2375339 2672036 2725644 2320865 2118527 2486465 2013789 2076162 1937495 2241897 1881915
13961A881915K30293k38395j90731M35910m22349L56596k56033O8892q7088m3835
$$ 1881915 2112208 1873813 1683082 2118992 1696643 2053239 1797206 1866098 1779010 1735175
13951A735175j31892N45534n46335K34470o1818j35851k69880L26379K18960k65790
$$ 1735175 1603283 2148817 1602482 1836952 1775134 1639283 1369403 1695782 1914742 1648952
13941A648952l41733N07821l77376l7639K27678P7032j79388l72410N46915J87810
$$ 1648952 1307219 1815040 1437664 1400025 1627703 1704735 1525347 1152937 1699852 1887662
13931A887662l99737J99015j60557j0536q2347J4335q0436m6807K09137j01346
$$ 1887662 1487925 1686940 1526383 1515847 1433500 1447835 1367399 1320592 1529729 1428383
13921A428383l1988L3331Q5849k21022j60286K43440j16419N23790n35170r0936
$$ 1428383 1396395 1429726 1515575 1294553 1134267 1377707 1261288 1785078 1249908 1158972
13911A158972M1195J91879K15251j16895k05244j62984K45499n287l40504L02617
$$ 1158972 1200167 1392046 1607297 1490402 1285158 1122174 1367673 1362386 1021882 1324499
13901A324499p8956J15969j69471J07001j7024j57549k11999M55221J02437k34774
$$ 1324499 1245543 1361512 1192041 1299042 1282018 1124469 912470 1367691 1470128 1235354
13891A235354k12062J37820J07383j01126K7403j01734m138p9313L79628l23617
$$ 1235354 1023292 1161112 1268495 1167369 1194772 1093038 1088900 1009587 1389215 1065598
13881A065598o2420j5206m48k16678M27569K6808l07027J63612r1969k57072K76178
$$ 1065598 1003178 987972 987524 770846 1198415 1225223 918196 1081808 989839 732767 1008945
13870A008945r550J6473j21026J2548P8830R2702J1575j80362K4355P8583J4344
$$ 1008945 999395 1015868 894842 907390 986220 1078922 1090497 910135 934490 1013073 1027417
13859A027417k2680K16156l27671J88327O2517o6920M3343j19831j21388n949
$$ 1027417 1004737 1220893 893222 1081549 1144066 1077146 1120489 1000658 879270 873321
13849H73321J82135k30191P6266J43591n4967j39244K9251j0139o237M4159L69104
$$ 873321 1055456 825265 901531 1045122 990155 850911 880162 870023 863786 907945 1277049
13838A277049j31881l54175M84322n79660K38472J36655k49132l4156K76741l46146
$$ 1277049 1145168 790993 1275315 695655 934127 1070782 821650 787494 1064235 718089
13828G18089C13784K48717K03521r9061P4270p4745Q6012r4042J06910N1181J49824
$$ 718089 313784 562501 766022 666961 741231 666486 752498 658456 765366 816547 966371
13817I66371l67660L93085j60267k46812L62044L2768o5169k82684J99781k31149
$$ 966371 598711 991796 831529 584717 946761 979529 914360 631676 831457 600308
13807F00308j48641J43823K14622M6998m00580K54454k05069J59887L47546C74169
$$ 600308 451667 595490 810112 857110 456530 710984 505915 665802 1013348 374169
13796G47234q8983m2089O845J04743J12726j81517K56452m35906L05864k46398
$$ 747234 658251 616162 623007 727750 840476 658959 915411 479505 785369 538971
13786E38971R0473j4049K80219O9614l93961L48003k11610L937J31521l42090
$$ 538971 629444 615395 895614 965228 571267 919270 707660 711597 843118 501028
13776E01028B15491R44746m69240K2946l14992K20332K54120C38141L16626K87832
$$ 501028 215491 1160237 690997 713943 398951 619283 873403 338141 654767 942599
13766I42599l22783K09552l67882K81719Q4118j69887p090J31823j81536B60452
$$ 942599 619816 829368 461486 743205 827323 657436 650346 782169 600633 260452
13755H09034k18815L00798C96425K52860k06951J69657P5064l8712r6507J79762
$$ 809034 590219 891017 396425 649285 442334 611991 687055 648343 551836 731598
13745G31598J84338k29452p0069k56886P4030J27488Q4461k41857K29703m9014
$$ 731598 915936 686484 616415 359529 433559 561047 645508 403651 633354 584340
13735E84340j11540J27031n3655n6433R0049j46268m3269K20575B00117M58383
$$ 584340 472800 599831 546176 489743 579792 433524 390255 610830 200117 658500
13725F58500L1852C19799K65440J43858C62950K5161J87819A95904N18033l425
$$ 658500 690352 319799 585239 729097 362950 388111 575930 195904 713937 710512
13715G10512j42478k37842K24502j14475K97089K4397l72703l0593j03162J79518
$$ 710512 568034 330192 554694 440219 737308 761705 389002 358409 255247 434765
13705D34765j9593K71654B25105L01863j04458O6936j51146P3049L33820k93742
$$ 434765 415172 686826 225105 526968 422510 489446 338300 411349 745169 451427
13695D51427A26818J77290J33825K6635p8301j09694n3907O61245D01879K81687
$$ 451427 126818 304108 437933 464568 386267 276573 222666 883911 401879 683566
13685F83566M4333C61516J4263K72755J13101k28900k06384K85046p6361B23683
$$ 683566 727899 361516 375779 648534 761635 532735 326351 611397 535036 223683
13674F58412K7914C19403N05802C88912Q178J25171j91781J4873J19933P3001
$$ 658412 686326 319403 825205 388912 397090 522261 330480 345353 465286 538287
13664E38287A81119K23105A04878N41558j40584k00927j5579J40339J4096j98652
$$ 538287 181119 404224 104878 646436 505852 304925 289346 429685 443781 245129
13654B45129K84265n1342P921J26075Q4373l33647K2413L6468R2614A09770r340
$$ 245129 529394 478052 485973 612048 696421 362774 385187 421655 514269 109770 100430
13643A00430J05111j7225K74393j25440J93852A87850J83079q545p2387m242J423
$$ 100430 205541 188316 462709 337269 531121 187850 370929 362384 289997 285755 287178
13632B87178K24074k16840O079o8738M6781l3802j15750L20987J678k12318K76365
$$ 287178 511252 294412 300491 231753 278534 244732 128982 449969 451647 239329 515694
13621E15694R7691G0687N8552J82380b45122D02986K8043F8726k5963L60929O6725
$$ 515694 613385 70687 129239 311619 -245122 402986 431029 68726 42763 403692 470417
13610D70417p5925j2638j87146m513N7940f5853C65804J14504H5591K41897J17849
$$ 470417 394492 381854 194708 190195 248135 -65853 365804 480308 85591 327488 445337
13599D45337J37660j58692J35620q9884A42983L5492J63089K62160d7908A39085
$$ 445337 582997 424305 559925 470041 142983 178475 341564 603724 -47908 139085
13588C12196K44817B63127J31285L7973A47856J88345N392j4732J14806I2634
$$ 312196 557013 263127 394412 432385 147856 336201 341593 326861 441667 92634
13577D78252j18788j25258K77793j74780P3689b6701C98451A77885o8194J92258
$$ 478252 359464 234206 511999 337219 410908 -26701 398451 177885 109691 301949
13567C01949j10054J50058q0392K7711J43394A22993K25648J93452k57059K4652
$$ 301949 191895 341953 261561 289272 432666 122993 348641 542093 285034 309686
13557C09686N2574j49805O1958K9255a1206A91633K09724p2659E5418L26359A72092
$$ 309686 362260 212455 274413 303668 -11206 191633 401357 328698 55418 381777 172092
13545A27905D195L36090J96296A57592K10970j84133j2933e501C14300j39129
$$ 127905 4195 340285 536581 157592 368562 184429 171496 -5501 314300 175171
13535A75171J31430A48860Q1597R0777o9688O6180J93948A78373n7350K49933
$$ 175171 306601 148860 230457 321234 251546 317726 511674 178373 121023 370956
13525C70956I8291Q6537L17477C8607R8051K64484j45903G0885J93382L90623
$$ 370956 98291 184828 502305 38607 136658 401142 255239 70885 264267 654890
13515F54890A98697F1560K42416J89587j3961A50033J25748F0059K48715G8807
$$ 654890 198697 61560 303976 493563 479602 150033 275781 60059 308774 78807
13504A94543I0129L44713J5562j44222r0437D6531L23282M8059j1087H1016C7295
$$ 194543 90129 434842 450404 306182 215745 46531 369813 417872 406785 81016 37295
13492b9526q8561M4048B08143J65113j18959A25980M9318M60512E7734o62k8168
$$ -29526 -118087 -74039 208143 373256 254297 125980 175298 635810 57734 57072 28904
13481B8904L52864a5719C72953j64974l7508L79372B74541c55566A68249m7865
$$ 28904 381768 -15719 372953 207979 170471 549843 274541 -355566 168249 120384
13471A20384K14055J02335F9568P3055O208K85648j82838i9521E63575j04864
$$ 120384 334439 436774 69568 142623 148831 434479 251641 -99521 563575 458711
13461D58711A37264m5521L84678L1456j81713K45389B21176K6442m0470J17422
$$ 458711 137264 91743 476421 507877 326164 571553 221176 247618 207148 324570
13451C24570j36664a71600B83597O6458j07292G9472K55634O1266D5233J91185
$$ 324570 187906 -171600 283597 350055 242763 79472 335106 396372 45233 236418
13441B36418Q7787E0475J5003K71141j38848G6158K95146B2432O57745A49066
$$ 236418 324205 50475 65478 336619 197771 76158 371304 22432 680177 149066
13430C69061j48780g2653C25523A40397f1357C93083p2191F9102K96076c4891
$$ 369061 220281 -72653 325523 140397 -61357 393083 320892 69102 365178 -34891
13419C03562j26431R179r2875J14280r7340K08744j50594L7740P999c20397d2842
$$ 303562 177131 186310 93435 207715 110375 319119 168525 206265 214264 -320397 -42842
13407c0272G5390j8653J16383M4681j6097m4615J07877m6104J88927B5950K9728
$$ -30272 75390 56737 173120 217801 201704 157089 264966 218862 407789 25950 55678
13396E5678J55628K298m8983J28733j18347J70796k1851n0850o2663j803M46307
$$ 55678 211306 213604 164621 293354 175007 345803 323952 273102 210439 208636 654943
13385F54943A89073p5815D4208O4259C1443P0028M7654b854I5242a15202C82579
$$ 654943 189073 113258 44208 108467 31443 101471 149125 -2854 95242 -115202 382579
13373D27916A3559O5989K32953D3673J72407J98175E9862L2797j6663J04721R2539
$$ 427916 13559 79548 312501 43673 216080 414255 59862 92659 75996 180717 273256
13362B73256j16250P3755a82473f2169D9019R2490J07380l6029a9971A94454J7261
$$ 273256 157006 230761 -182473 -62169 49019 141509 248889 212860 -19971 194454 211715
13351B11715D2186P2505L66952A3074Q2550J52940F5115c7898D90139a1452k48728
$$ 211715 42186 114691 481643 13074 95624 248564 65115 -37898 490139 -11452 -260180
13340b60180D41153A17419f6483F2491L46643j54145c9041G6301M70635A92692
$$ -260180 441153 117419 -66483 62491 409134 254989 -39041 76301 546936 192692
13329B21002p3810L34685k25822I6108a44076C75058D1790M97697k19828J30767
$$ 221002 147192 481877 256055 96108 -144076 375058 41790 539487 319659 450426
13319D50426C8644a41821A44190i5246C06595p5999J82035a49306A54074Q0817
$$ 450426 38644 -141821 144190 -95246 306595 230596 412631 -149306 154074 234891
13309B34891F1735a82109A4510K12409C4468K49620K2179a73390A17352J89692
$$ 234891 61735 -182109 14510 226919 34468 284088 306267 -173390 117352 307044
13299C07044n773J74746A59727m2123N8672G8990a18260B83074A3964b205C68772
$$ 307044 301271 476017 159727 117604 176276 78990 -118260 283074 13964 -2205 368772
13287C7902o553A1238i0110K7964j15269A14322K26340A42205a12875B22784o0738
$$ 37902 31349 11238 -90110 -62146 -177415 114322 340662 142205 -112875 222784 162046
13276A62046g5351I506K8441J51717i9379B18365P7996I2844J07546G2237j1387
$$ 162046 -75351 9506 37947 189664 -99379 218365 296361 92844 200390 72237 60850
13265F0850J95392n9439M1145E1908d7680a759A90469K709p9245N4197b16084
$$ 60850 256242 196803 237948 51908 -47680 -1759 190469 193178 113933 168130 -216084
13253b68394A08882J47079k6916c0981B56807f3492B24687D0796N183L79385r5129
$$ -268394 108882 255961 229045 -30981 256807 -63492 224687 40796 45979 425364 330235
13242C30235a4144A50372a37A50175l1219L4304l0498D5003b2638g746A59920
$$ 330235 -14144 150372 -137 150175 118956 153260 122762 45003 -22638 -7746 159920
13230d9411A20875J73890p3517j03352J53357A13447J21838O6285e2198A32480
$$ -49411 120875 294765 221248 117896 271253 113447 235285 301570 -52198 132480
13219g4563B94556a49095A90116h0567b9503A3883K12431G7651j0231b69430B81934
$$ -74563 294556 -149095 190116 -80567 -29503 13883 226314 77651 67420 -269430 281934
13207F9063e2935B36886J44230A30305k6647e4114r5633B46893A17127p936b2924
$$ 69063 -52935 236886 381116 130305 103658 -54114 -149747 246893 117127 109191 -22924
13195a07580A78214m6944d7167j71545J044I7743J27792e5953m1232A31817d3172
$$ -107580 178214 131270 -47167 -218712 -217668 97743 225535 -55953 -97185 131817 -43172
13183A29378a50787e4597A46187J50489o7987d5552A55756J33124P2304i2227
$$ 129378 -150787 -54597 146187 296676 228689 -45552 155756 288880 361184 -92227
13172B11069N1261h6100A46716h777q4227C10115G234L0800K30335C1582L5058
$$ 211069 262330 -86100 146716 -8777 -93004 310115 7234 38034 268369 31582 66640
13161F6640C2510M72733b56670B40491m8949C6275b75548A07641L5273e9878m1854
$$ 66640 32510 505243 -256670 240491 191542 36275 -275548 107641 142914 -59878 -101732
13150a01732A72605o7255B5672P0048J13750a20992B75751a35975l3471B1701
$$ -101732 172605 105350 25672 95720 209470 -120992 275751 -135975 -169446 21701
13139B24985a38953e4305B28594L0364a42060A81895k8136J07818c88411H9308
$$ 224985 -138953 -54305 228594 258958 -142060 181895 153759 261577 -388411 89308
13128B05508n521L64807b33395A4110M82645b4695r6039A43861a14426b3691o1826
$$ 205508 199987 564794 -233395 14110 496755 -24695 -120734 143861 -114426 -23691 -85517
13117h5517d0198I0385M546g8982A15699O2401d7294B04686H467K945M17825g0752
$$ -85517 -40198 90385 94931 -78982 115699 178100 -47294 204686 8467 11412 429237 -70752
13104F1976a02133c7309k52128A43471C444c0107j69246m2000E2954L6073a11980
$$ 61976 -102133 -37309 -289437 143471 3444 -30107 -199353 -241353 52954 89027 -111980
13092b64222D7411K15694l9212k8749b2980B06598b76550L7048B04460J19716
$$ -264222 47411 263105 223893 195144 -22980 206598 -276550 -239502 204460 324176
13082C24176I8315L8810n4168a08846A91150f6293a5175B50781J6259a33931B70623
$$ 324176 98315 137125 82957 -108846 191150 -66293 -15175 250781 267040 -133931 270623
13070a90645N0151C00643I1401J1344L59681a89619B23390i1515A93318P8516
$$ -190645 -140494 300643 91401 102745 462426 -189619 223390 -91515 193318 271834
13060B71834C7619a31798B30804R8970j48108q0242J02258a12269H4212J5556
$$ 271834 37619 -131798 230804 329774 181666 101424 203682 -112269 84212 99768
13050I9768c8506O386G7217J24254n3288L602Q205e5698C7005K26287j21419m6715
$$ 99768 -38506 -32120 77217 201471 148183 151785 159990 -55698 37005 263292 141873 95158
13038I5158K72374g0503E3319h8754A33368n6010b2865H270d4925A09580e5097
$$ 95158 367532 -70503 53319 -88754 133368 77358 -22865 8270 -44925 109580 -55097
13026A61116a59357e0130j15182e0821E4800e408n9006A7252a41150E28780I4957
$$ 161116 -159357 -50130 -165312 -50821 54800 -5408 -64414 17252 -141150 528780 94957
13014a46910A82046b08297B6439K10517q7828P67N2268k0238b1879k652F5252
$$ -146910 182046 -208297 26439 236956 149128 149895 202163 181925 -21879 -24531 65252
13002A44648e0814C6694a76633C0470f7733A92227a30143C56667a87735r10e7082
$$ 144648 -50814 36694 -176633 30470 -67733 192227 -130143 356667 -187735 -188645 -57082
12990a00785G4316a39287b0595A15565b4259A91832b70514a32171B7255J07335
$$ -100785 74316 -139287 -20595 115565 -24259 191832 -270514 -132171 27255 134590
12980A34590m9597b84797A82666J18173E0720b86174j12631C69163e1126k31283
$$ 134590 84993 -284797 182666 300839 50720 -286174 -398805 369163 -51126 -282409
12970b82409J24501k5661B50609H0488B3737f2354B12528L8363H0278B9218b55696
$$ -282409 -157908 -183569 250609 80488 23737 -62354 212528 250891 80278 29218 -255696
12958a42184j178j23918c5847D40230a2148B30289M6440r0811c45556C26731A0247
$$ -142184 -143362 -267280 -35847 440230 -12148 230289 276729 185918 -345556 326731 10247
12946G0937R3934J33767G6352c16557g6775j09950A97745g7910H1273j4495L39
$$ 70937 164871 298638 76352 -316557 -76775 -186725 197745 -77910 81273 66778 67117
12935F7117J7781K08404b90826D858J0568J30086a91848D2019i8373A7516J05845
$$ 67117 84898 293302 -290826 4858 15426 145512 -191848 42019 -98373 17516 123361
12924A23361A8232R0200A9962M8707R5298F2026e4882b4646C3029a24962k8337
$$ 123361 18232 108432 19962 68669 163967 62026 -54882 -24646 33029 -124962 -153299
12913a53299H1757e2737L900m4949B87348a0709m9402A74210J86545E3688a14556
$$ -153299 81757 -52737 -48837 -93786 287348 -10709 -60111 174210 360755 53688 -114556
12901a16884A16555J8428d9517j88193j73024d250B2052e6382C14584b35286D9339
$$ -116884 116555 134983 -49517 -237710 -410734 -4250 22052 -56382 314584 -235286 49339
12889E8389a02298F3251a13787A65995M2297G3117P8225r792b04014B8175Q6420
$$ 58389 -102298 63251 -113787 165995 208292 73117 151342 141550 -204014 28175 114595
12878A14595a04895A55604D4263J59372F8568a32281B62893j04233i011C17083
$$ 114595 -104895 155604 44263 203635 68568 -132281 262893 158660 -9011 317083
12867B70904O3994a76126f542G0215h8419A54496o6934f0456A85771l7974a58824
$$ 270904 334898 -176126 -6542 70215 -88419 154496 87562 -60456 185771 147797 -158824
12855B03124r6295J63880c43257A58884N9963g6926j50303M9999C4956J75144
$$ 203124 106829 270709 -343257 158884 218847 -76926 -227229 -177230 34956 210100
12845B10100c13971e4740A3756e3756m3631F7707i1186k64843B69041j01049b06578
$$ 210100 -313971 -54740 13756 -53756 -97387 67707 -91186 -356029 269041 167992 -206578
12833A22005N2827H6062j2427C516h2575B8509J34991c14570H6153h6116B9680
$$ 122005 174832 86062 73635 3516 -82575 28509 163500 -314570 86153 -86116 29680
12821F33171A0649K19723j08845B5147a7979j21137A00718A3398d6774a3797A00435
$$ 633171 10649 230372 121527 25147 -17979 -139116 100718 13398 -46774 -13797 100435
12809a64522N2171k22869a28776K3370C82662d5730n4531m755C7757a48957O6343
$$ -164522 -112351 -335220 -128776 -105406 382662 -45730 -100261 -105016 37757 -148957 -82614
12798h2614I4865i9250P935B49936D1315Q980R520O5512h9319F8850K1597A8521
$$ -82614 94865 -99250 -91315 249936 41315 50295 59815 125327 -89319 68850 90447 18521
12785c6129A57741l8923O9065a99848E9553K06576d9069E2326R9058K8672P5910
$$ -36129 157741 118818 187883 -199848 59553 266129 -49069 52326 151384 180056 255966
12774B55966Q3132f953l54548F7882J1651Q195a303l35681D06356d37631a96133
$$ 255966 339098 -6953 -361501 67882 79533 87728 -1303 -336984 406356 -437631 -196133
12762d9020j82727N1407e1720B16268n7990d3209A21415E9453a32764A22367c3342
$$ -49020 -231747 -180340 -51720 216268 158278 -43209 121415 59453 -132764 122367 -33342
12750C24529j04555a35358B51787L6314A04824c25619J54617A82146b12954H4614
$$ 324529 219974 -135358 251787 288101 104824 -325619 -171002 182146 -212954 84614
12739c3555l9313A14661B3781a97922B27585i6125n3106A23422J70978A18842
$$ -33555 -72868 114661 23781 -197922 227585 -96125 -149231 123422 294400 118842
12728b22165o3753C12958B8152d918B3200J59432o0349h5648F122K7405D585J73982
$$ -222165 -285918 312958 28152 -4918 23200 182632 122283 -85648 6122 33527 4585 178567
12716A78567E0674J01922K0889K7495I621L00926A54223L9812R0708g8372c692
$$ 178567 50674 152596 173485 200980 9621 310547 154223 194035 284743 -78372 -3692
12704B46194K8326o7109m1350k55a83579o8838C51156b99755D2002j5353d5486
$$ 246194 274520 207411 166061 165806 -183579 -252417 351156 -299755 42002 26649 -45486
12692c59496G7465a48444d4999j75574C950K63447F4722b2365A03457J7763N3264
$$ -359496 77465 -148444 -44999 -220573 3950 267397 64722 -22365 103457 121220 174484
12681A74484a35719D1044a92713E243f50H2483J14179p8600N893b2810k38059
$$ 174484 -135719 41044 -192713 5243 -650 82483 196662 118062 123955 -22810 -260869
12670b60869e4980B66834b1874A81698a56155C62271A27020E2555N462F212P5212
$$ -260869 -54980 266834 -21874 181698 -156155 362271 127020 52555 58017 6212 81424
12659H1424J3250F164a62843l05558H1658i7992C8223a04999I5749b0394A80946
$$ 81424 94674 6164 -162843 -468401 81658 -97992 38223 -104999 95749 -20394 180946
12647D9031a73098F7858n798c08935F0313g3357G195R3100b84818H0008P9047
$$ 49031 -173098 67858 62060 -308935 60313 -73357 7195 100295 -284818 80008 159055
12636A59055a74033A4196Q6633e7899A44166D1173h0203C25502b04854C02751
$$ 159055 -174033 14196 100829 -57899 144166 41173 -80203 325502 -204854 302751
12625B7400J29563m7233q983B6652J68041r183f8910r4972b049m4383A88810b84321
$$ 27400 156963 109730 100747 26652 194693 185510 -68910 -163882 -2049 -46432 188810 -284321
12612h7346I9138J66471F4009L06163g4402B42164I3759k9676a54485B05161e1814
$$ -87346 99138 265609 64009 370172 -74402 242164 93759 64083 -154485 205161 -51814
12600c0423B54435j13346c56174a01877c6473E6918c90082J35812b0186I3317
$$ -30423 254435 141089 -356174 -101877 -36473 56918 -390082 -254270 -20186 93317
12589A2462J73412b04103B15234B6995g6507G1315b47137g2660A53158a20995
$$ 12462 185874 -204103 215234 26995 -76507 71315 -247137 -72660 153158 -120995
12578B18492b724m5000D6462a92193g3315j49807g3308C38607C2768K2554K59081
$$ 218492 -2724 -47724 46462 -192193 -73315 -223122 -73308 338607 32768 55322 314403
12567C14403E8963a7007A25510F2471b64780e5625A96074F3263J51359k7648a63932
$$ 314403 58963 -17007 125510 62471 -264780 -55625 196074 63263 214622 186974 -163932
12555A43053k4458J03474a88641A51447f6601k53187C4822k222i3459L6234M471
$$ 143053 118595 222069 -188641 151447 -66601 -319788 34822 32600 -93459 -57225 -52754
12544e2754A3521f6401l4577j91823A25442b06176A56743J18141E3785c14104
$$ -52754 13521 -66401 -100978 -292801 125442 -206176 156743 274884 53785 -314104
12533B74145p5005f6436a4424r1755j78991E1861c1575F6412g192j14355a0575
$$ 274145 199140 -66436 -14424 -106179 -285170 51861 -31575 66412 -7192 -121547 -10575
12521C82625j00079h9568A18536k534a54614A14807a17702C16351c71973J57628
$$ 382625 282546 -89568 118536 116002 -154614 114807 -117702 316351 -371973 -214345
12511b14345A7450h0633L7387I7631K326a09248k0746j00229E8434K31012A36809
$$ -214345 17450 -80633 -43246 97631 99957 -109248 -129994 -230223 58434 289446 136809
12499E8819f1178A6633E646J82345K7594G73K57960m2914b3617H683K3803M607
$$ 58819 -61178 16633 5646 187991 215585 773 258733 215819 -23617 8683 32486 37093
12487C7093i1189I6399R8218G3157a97495f2731A40030d45834a11381B4304g0624
$$ 37093 -91189 96399 194617 73157 -197495 -62731 140030 -445834 -111381 24304 -70624
12475a90917B68040D8704h7491C00583c450r6674o321K276L9048o4873b5279G2018
$$ -190917 268040 48704 -87491 300583 -3450 -100124 -106445 -104169 -65121 -129994 -25279 72018
12462D2477c47958B41632F1062R2809E5437K5135b78054F2172h5751A90377A500
$$ 42477 -347958 241632 61062 153871 55437 80572 -278054 62172 -85751 190377 1500
12450f3587j55728f4550F0940M5964a80428K7883l9121g3874L4669k87527A67826
$$ -63587 -219315 -64550 60940 106904 -180428 -152545 -191666 -73874 -39205 -326732 167826
12438H8955c03668A80769j4919b1540r3505D31370o7337a2601q3079J9569G4896
$$ 88955 -303668 180769 165850 -21540 -115045 431370 364033 -12601 -95680 -76111 74896
12426A27758J79184b940j21454A08137a33581o2219i3808A50031a53075L4270
$$ 127758 306942 -2940 -124394 108137 -133581 -195800 -93808 150031 -153075 -118805
12416a18805A16603l5341d46005A53850K5142e8807j32733d9764j56423A15703
$$ -118805 116603 81262 -446005 153850 178992 -58807 -191540 -49764 -206187 115703
12405b4809q7081L0552k4269A20540a04694A4217E602J12960J3037K08896a21739
$$ -24809 -111890 -81338 -105607 120540 -104694 14217 5602 118562 131599 340495 -121739
12393h9048r9896A51375F1923c00382A27450n3658a55377D04449j84154F0585
$$ -89048 -188944 151375 61923 -300382 127450 73792 -155377 404449 220295 60585
12382A55268l1157D7530K21487C5945R204N7668c8704A06670a53891l03888a5102
$$ 155268 124111 47530 269017 35945 45149 102817 -38704 106670 -153891 -457779 -15102
12370b0506j48393A30032c26942a26096b760k50317f6584A73535K16306G089a41782
$$ -20506 -168899 130032 -326942 -126096 -2760 -253077 -66584 173535 389841 7089 -141782
12358B37708b91065e3096n5859i994H298a6945j29110k6343e2891A19456a63335
$$ 237708 -291065 -53096 -108955 -9994 8298 -16945 -146055 -172398 -52891 119456 -163335
12346A41840c37011e8698A50234b51473A303a12826M5235C27943h1683C2619J80438
$$ 141840 -337011 -58698 150234 -251473 1303 -112826 -67591 327943 -81683 32619 213057
12335B13057e8250F8362g1096A67583e5702I4020L47901g4294k06773A6270K03734
$$ 213057 -58250 68362 -71096 167583 -55702 94020 441921 -74294 -281067 16270 220004
12324B20004E9532J03083K34315b60775k07730i8064b3227G8660K33254c43156
$$ 220004 59532 162615 396930 -260775 -468505 -98064 -23227 78660 311914 -343156
12313A2145R8523M3589n1032i7129i601G3033a02225c7003C3275j5850J77426
$$ 12145 110668 154257 103225 -97129 -9601 73033 -102225 -37003 33275 17425 194851
12302A94851O2786b1866j12956n152B14852q1759O0622D8514J86145G9509e4257
$$ 194851 257637 -21866 -134822 -139974 214852 133093 193715 48514 234659 79509 -54257
12290b96168C56108j32677a70166A93566p4603O5119B4972P8797g9896L6443q5115
$$ -296168 356108 223431 -170166 193566 118963 184082 24972 103769 -79896 -43453 -128568
12279a28568H6239g7033E0276M69018B33331r6401n4481f6180m3081A74144c7503
$$ -128568 86239 -77033 50276 519294 233331 136930 82449 -66180 -109261 174144 -37503
12267A69330m8509J80134H9532b24780a0679l5876A95647f7925B26308j08596
$$ 169330 120821 300955 89532 -224780 -10679 -46555 195647 -67925 226308 117712
12257A17712L7589N2023b352B85166j03578q4611K5859B6074K15713J97224B8161
$$ 117712 155301 207324 -2352 285166 181588 96977 122836 26074 241787 439011 28161
12245A75559A5870i1620G9736J153a07127p4054c8889A68345c68392D31544a05594
$$ 175559 15870 -91620 79736 80889 -107127 -181181 -38889 168345 -368392 431544 -105594
12233A18488E3480L23953j74015A796a11314c0951G9016L3372J75330D8447J19614
$$ 118488 53480 377433 203418 1796 -111314 -30951 79016 112388 287718 48447 168061
12222A68061C5243M5126K40106a28020A37579l5255L37571A07903c053C53887
$$ 168061 35243 80369 320475 -128020 137579 102324 439895 107903 -3053 353887
12211B01086I4022M6274K13289A00622K892K4539L083P3664a37524B43576G1496
$$ 201086 94022 140296 353585 100622 103514 128053 131136 204800 -137524 243576 71496
12199A49382c8886F0534a83701B03652M2366p8072R6970B6022J55861J75040j52135
$$ 149382 -38886 60534 -183701 203652 246018 167946 264916 26022 181883 356923 204788
12188B04788J12057R3875A83529a2746B7891b06681A16804h4522l6611D21357
$$ 204788 316845 410720 183529 -12746 27891 -206681 116804 -84522 -121133 421357
12177E34238D2835J95264L0404b69820C51842e0662B10916o9053J00837B4108
$$ 534238 42835 238099 268503 -269820 351842 -50662 210916 141863 242700 24108
12166A67635o0L36491a68030C12134j07222a248n5094B49145D1979L07845G1069
$$ 167635 167575 504066 -168030 312134 204912 -1248 -56342 249145 41979 349824 71069
12154A58275A9018J53508g4171p357B87019A1140J15749c4832q9142a3703I1874
$$ 158275 19018 172526 -74171 -81528 287019 11140 126889 -34832 -123974 -13703 91874
12142d2096q0401B22957m6312p0258j3192J41648L8280J2717h6143o0730B39322
$$ -42096 -122497 222957 176645 106387 93195 234843 273123 285840 -86143 -146873 239322
12130a79686L9332A06424k9798J05180R3980a0039B74132l4276C831L40404A39311
$$ -179686 -140354 106424 76626 181806 275786 -10039 274132 239856 3831 344235 139311
12118B28273c9488F3161P6035K30986B9652L57844a69372n3033i0682B0512a48605
$$ 228273 -39488 63161 139196 370182 29652 387496 -169372 -222405 -90682 20512 -148605
12106F6803B5078e027I5139P7735o9670J48339D6412J91665j08979c5532B42672
$$ 66803 25078 -5027 95139 172874 103204 251543 46412 238077 129098 -35532 242672
12094c0443C30423b67420A56542P3485c82289A33629A6942J9111J70082a18157
$$ -30443 330423 -267420 156542 230027 -382289 133629 16942 36053 206135 -118157
12083E5246N9633a21091A58216m8569e5113j51837H4687K72190b31394C21282
$$ 55246 114879 -121091 158216 109647 -55113 -206950 84687 356877 -231394 321282
12072F7456L57962a02348F8866J37544L13169c61216C9200K80250a2751A53015
$$ 67456 425418 -102348 68866 206410 519579 -361216 39200 319450 -12751 153015
12061a62470A28559b53555A10151a05739A49841B7254g8150A14069c9838C01117
$$ -162470 128559 -253555 110151 -105739 149841 27254 -78150 114069 -39838 301117
12050F3139b29541g3264e69H2624b6529m6767j05578k6564C9697a92909A33301
$$ 63139 -229541 -73264 -569 82624 -26529 -73296 -178874 -205438 39697 -192909 133301
12038a3271j34115o2239J2711e6978K44A5491a4040E0741J15343d6414A76038
$$ -13271 -147386 -209625 -196914 -56978 -56734 15491 -14040 50741 166084 -46414 176038
12026a80988o0026a9376H7295P6662c7045K613j78704A66166b4078r5432A18689
$$ -180988 -241014 -19376 87295 163957 -37045 -34432 -213136 166166 -24078 -119510 118689
12014B05359n7296i6033n7523A19247J18453a08747A5727J3125f3932A18716K8173
$$ 205359 148063 -96033 -153556 119247 237700 -108747 15727 28852 -63932 118716 146889
12003A46889f3725j57564a0843o6448B08659I3835c99713i4463A26597K57817
$$ 146889 -63725 -221289 -10843 -77291 208659 93835 -399713 -94463 126597 384414
11993C84414A268J54176g8342B3659r241c07338a17414r2044j28237b2105A5324
$$ 384414 1268 155444 -78342 23659 14418 -307338 -117414 -209458 -337695 -22105 15324
11981B21498A1195e8578A25241a27590A04253L1574n6673k9381a88909B0372d338
$$ 221498 11195 -58578 125241 -127590 104253 135827 79154 49773 -188909 20372 -4338
11969F873a01848F9576A1311b92348f4526A50347d8606E6635h2785D5813J30230
$$ 6873 -101848 69576 11311 -292348 -64526 150347 -48606 56635 -82785 45813 176043
11958A76043C1462g3486L0619A69345k6770J3856b32218J14391c5261r417C5019
$$ 176043 31462 -73486 -42867 169345 142575 156431 -232218 -117827 -35261 -44678 35019
11946e0244D7050R2668M3008a4727k11486C47595B1151e6971o1185E2446R5010
$$ -50244 47050 139718 182726 -14727 -226213 347595 21151 -56971 -118156 52446 147456
11935A47456E9189K31261c14453e8461E6292L6795b35591B49099A9508K27247
$$ 147456 59189 290450 -314453 -58461 56292 93087 -235591 249099 19508 246755
11925B46755a04413B4129c8413H5026d0653j3947B640K69931F0604J5309a03355
$$ 246755 -104413 24129 -38413 85026 -40653 -54600 2640 272571 60604 75913 -103355
11913A40234B6575M0600A961i0024H1841e5420k1213D9975c4512j17443k2360
$$ 140234 26575 67175 1961 -90024 81841 -55420 -76633 49975 -34512 -151955 -174315
11902a74315L9131B25229F5611a53373b0476j81778l4496C6673h7319B48a73503
$$ -174315 -135184 225229 65611 -153373 -20476 -202254 -236750 36673 -87319 248 -173503
11890a78113j04188b3325k36751q8546g0524C51706j69524a3855B23348C7682
$$ -178113 -282301 -23325 -260076 -348622 -70524 351706 182182 -13855 223348 37682
11879H5978a0356l51979A63302f0855j95856b3384E5327a6789j30918b4363B50884
$$ 85978 -10356 -362335 163302 -60855 -256711 -23384 55327 -16789 -147707 -24363 250884
11867A39482K02683a17946A53736c7637j91174m6473P1682A40463a13377G9419
$$ 139482 342165 -117946 153736 -37637 -228811 -275284 -203602 140463 -113377 79419
11856a54675A82963B6719a36528F4412a50034a6860A75576d48847H0463b96118
$$ -154675 182963 26719 -136528 64412 -150034 -16860 175576 -448847 80463 -296118
11845e426F7430f6679k9814B11786j9338c11458A67791f9421H4107a49193M9948
$$ -5426 67430 -66679 -96493 211786 192448 -311458 167791 -69421 84107 -149193 -99245
11834i9245D9804j2514b41654a9483A71669p8161b74780i6883J2436o6209e8947
$$ -99245 49804 37290 -241654 -19483 171669 93508 -274780 -96883 -84447 -150656 -58947
11822c65680h3850k6824L8817D7435c07828A41212A9892P6209c04775c0891l4753
$$ -365680 -83850 -110674 -71857 47435 -307828 141212 19892 96101 -304775 -30891 -65644
11811f5644r5237A21317i6690J8418m448B832b39449Q4703j15235a34042A82928
$$ -65644 -160881 121317 -96690 -78272 -82720 2832 -239449 -154746 -269981 -134042 182928
11799h0882G7037b27653M2416A61017f077q7321l03552h9602e812m7658j34540
$$ -80882 77037 -227653 -185237 161017 -6077 -93398 -396950 -89602 -5812 -53470 -188010
11788a88010e5241A23101K50788b34795r971A67022K18371b97750Q8696B04314
$$ -188010 -55241 123101 373889 -234795 -244766 167022 385393 -297750 -209054 204314
11777g8970k21315K8966j54342B18660i5945I8912a3572j73528j33391d9845A91148
$$ -78970 -300285 -271319 -425661 218660 -95945 98912 -13572 -187100 -320491 -49845 191148
11765a19239G8889c6665E4441O4015J774a2776A45448H99c29163A65144a67249
$$ -119239 78889 -36665 54441 118456 120230 -12776 145448 899 -329163 165144 -167249
11753e5266j46280e3346k37390a00814A46601D8391N1991b46432K8655C3872e6373
$$ -55266 -201546 -53346 -290736 -100814 146601 48391 100382 -246432 -217777 33872 -56373
11741g7073D4761g7422r3566r248A64707J48509A29431h106k56507G0370r157
$$ -77073 44761 -77422 -170988 -180236 164707 313216 129431 -8106 -264613 70370 61213
11730F1213Q2650E3264e6751k06342j27418F3677J73544m6653B8863b29276G5292
$$ 61213 143863 53264 -56751 -263093 -390511 63677 237221 190568 28863 -229276 75292
11718B45632a17199b8039B41603A19680N2478B5456l545M5464a47824B34081K3394
$$ 245632 -117199 -28039 241603 119680 172158 25456 21911 67375 -147824 234081 257475
11707B57475b46838G2131b5979p575A97114b6982j80044C75873a97319A80335
$$ 257475 -246838 72131 -25979 -33554 197114 -26982 -207026 375873 -197319 180335
11696b57508B46233D3147J60124a98759A76495f9454B21331p4467P020L93158
$$ -257508 246233 43147 203271 -198759 176495 -69454 221331 146864 153884 547042
11686E47042b07124L6442F2052a36701A38842c6652A28882l4382A5020P329b61744
$$ 547042 -207124 -170682 62052 -136701 138842 -36652 128882 94500 15020 22349 -261744
11674a41053k2498A17013a12695I0218O2163f343q0010j05763K7702C30542g6739
$$ -141053 -163551 117013 -112695 90218 152381 -6343 -86353 -192116 -164414 330542 -76739
11662a77131b0281j63894D1438c8288A61682N0036K4994l0389C811a50069c2383
$$ -177131 -20281 -184175 41438 -38288 161682 211718 236712 206323 3811 -150069 -32383
11650h2180L661K7163A69070A2010C532h5155A77159l4023E3070c54028F0996
$$ -82180 -78519 -51356 169070 12010 3532 -85155 177159 143136 53070 -354028 60996
11638G8927b71170D5653J63619C7965c51028B45772a32275j05154k9458D0636
$$ 78927 -271170 45653 209272 37965 -351028 245772 -132275 -237429 -266887 40636
11627c8324C80863b82646A23988a47067j08831A19367J08564n4181J50528a75043
$$ -38324 380863 -282646 123988 -147067 -255898 119367 227931 173750 324278 -175043
11616a31013B06660O6327b07473j28561a64975A37558d055o4445I7317A1664c6073
$$ -131013 206660 272987 -207473 -336034 -164975 137558 -4055 -68500 97317 11664 -36073
11604a39419L51j97770C36772e1303j55938A0175L0885N0418a92787A8239L63882
$$ -139419 -139068 -336838 336772 -51303 -207241 10175 41060 91478 -192787 18239 382121
11593C82121j23527a03073A8401h4728j95574B09734j01623h5A00607b968D43819
$$ 382121 258594 -103073 18401 -84728 -280302 209734 108111 -85 100607 -2968 443819
11581A3827b18172m597C3780c05196f0792I854R1072J67783J724D183g7073B09801
$$ 13827 -218172 -222769 33780 -305196 -60792 9854 100926 268709 270433 4183 -77073 209801
11568B49265H1366K85200j56576k2542H3007O505L1947J06634J2126A3147a53535
$$ 249265 81366 366566 209990 187448 83007 89512 121459 228093 240219 13147 -153535
11556A19438b56996B95326A04097b25j66239H5830e9527G6517l1237q835J6099
$$ 119438 -256996 295326 104097 -225 -166464 85830 -59527 76517 45280 36445 52544
11545E2544M3177J63734b84729a5629B35004b26424G5976e3470j17492A17642
$$ 52544 95721 259455 -284729 -15629 235004 -226424 75976 -53470 -170962 117642
11534I4779R8895a05340D3233a42663N4843c4236H7163N71396E7873K7420b08498
$$ 94779 193674 -105340 43233 -142663 -87820 -34236 87163 658559 57873 85293 -208498
11522a14164A30368d27601J91381B76693f4160j51499A45689D3025R4038g8486
$$ -114164 130368 -427601 -236220 276693 -64160 -215659 145689 43025 137063 -78486
11511a4046C1301K22296B5236J0989J22860o5415a08749c1523m0480c2961a3180
$$ -14046 31301 253597 25236 36225 159085 93670 -108749 -31523 -72003 -32961 -13180
11499D9818M7095J90906g44B04856R4884H9066b84839F0066K56620a26891B3882
$$ 49818 96913 287819 -744 204856 299740 89066 -284839 60066 316686 -126891 23882
11487D36745f2378C5673M10511A89428b5483p1537B67253r9871B5604g0042D98407
$$ 436745 -62378 35673 446184 189428 -25483 -97020 267253 167382 25604 -70042 498407
11475a84409D22053f9488C44302q5273J7901B6727f192E4945K30117Q1441A31968
$$ -184409 422053 -69488 344302 259029 276930 26727 -6192 54945 285062 366503 131968
11463d9576l5959A32250d913B66030O1484a54852G4493f2337B45986b06602k1058
$$ -49576 -85535 132250 -4913 266030 327514 -154852 74493 -62337 245986 -206602 -227660
11452b27660F4096b19688A65727a0758l06673e6912a6740o8396b9740A17022k8240
$$ -227660 64096 -219688 165727 -10758 -317431 -56912 -16740 -85136 -29740 117022 88782
11441H8782g6949i826j94720c8204k66936B5729R9690c1935A71653a03248B17503
$$ 88782 -76949 -9826 -204546 -38204 -305140 25729 125419 -31935 171653 -103248 217503
11429B3907b70711C95057i2602A73797h3723c3193k99374c1408p4299B33352A14535
$$ 23907 -270711 395057 -92602 173797 -83723 -33193 -332567 -31408 -105707 233352 114535
11417a61126A8017K65143q9420a35622E4186d3737j41500B93844h2705n5518K4489
$$ -161126 18017 283160 193740 -135622 54186 -43737 -185237 293844 -82705 -138223 -113734
11406a13734j21574D1066J96174f9499m5679B66292c9686A09002b19323E3907
$$ -113734 -235308 41066 237240 -69499 -115178 266292 -39686 109002 -219323 53907
11395f3994J9717r5054e1352A31191a17782h251A7797h9834A47903b78114C7801
$$ -63994 -44277 -139331 -51352 131191 -117782 -8251 17797 -89834 147903 -278114 37801
11383A59463J47733j43166F380b3638k14049f0309A20812a0348j51104A93226
$$ 159463 307196 164030 6380 -23638 -237687 -60309 120812 -10348 -161452 193226
11372C4010M9635J73218r8120b00933D5557b9972j92318R3244J0023k3207f6196
$$ 34010 83645 256863 158743 -200933 45557 -29972 -222290 -129046 -119023 -142230 -66196
11360C38015p3390p6063b04187H5391b9692J3906j78370M4883A42887g863j62826
$$ 338015 264625 188562 -204187 85391 -29692 -15786 -194156 -149273 142887 -7863 -170689
11349a70689k09563f7582A57809i9584E2851c7935q707o3396M7405A02009L4650
$$ -170689 -380252 -67582 157809 -99584 52851 -37935 -46642 -110038 -62633 102009 136659
11338A36659A2580J31822B4683b4522j66373k75708c7046E7135f9370D5354M8163
$$ 136659 12580 144402 24683 -24522 -190895 -466603 -37046 57135 -69370 45354 93517
11327I3517J48723E4597A2034a55345E38605k48053c32246a6060j13261M3940
$$ 93517 242240 54597 12034 -155345 538605 290552 -332246 -16060 -129321 -85381
11317h5381I2826Q077Q8143D1452b85852c9937m7724A69744A1285P1507k789b0560
$$ -85381 92826 100903 189046 41452 -285852 -39937 -87661 169744 11285 82792 80003 -20560
11304A52690C1587K21499a02482A41316i8435l27889c2061j28082B54447h9110
$$ 152690 31587 253086 -102482 141316 -98435 -426324 -32061 -160143 254447 -89110
11293I8097b0523k16436A39026b51636d7932l00356A45041B3393a11625d3208
$$ 98097 -20523 -236959 139026 -251636 -47932 -348288 145041 23393 -111625 -43208
11282d5358I7524d0802l62822H9578f7185B86004b72403i0247G1251h4588j99797
$$ -45358 97524 -40802 -403624 89578 -67185 286004 -272403 -90247 71251 -84588 -284385
11271b84385a16080h839l1288A14008D1121e7527E4164g7582A09238a95496j3105
$$ -284385 -116080 -8839 -40127 114008 41121 -57527 54164 -77582 109238 -195496 -208601
11260b08601C1476J16808E0197L5896J98263a95107N5849A453a19351E28336b4380
$$ -208601 31476 148284 50197 86093 284356 -195107 -139258 1453 -119351 528336 -24380
11248C56735e5587j27063b2295A0394g125j50841A45283d4008A14460A8225L3482
$$ 356735 -55587 -182650 -22295 10394 -7125 -157966 145283 -44008 114460 18225 51707
11237E1707a51225j73836G2978Q0736o0280c3257r906J2894G920J85671a5771
$$ 51707 -151225 -325061 72978 153714 93434 -33257 -43163 -30269 7920 193591 -15771
11225b0305k53929J20611A43183a71710h975B49923J7856I2755b56428A75712
$$ -20305 -274234 -153623 143183 -171710 -8975 249923 267779 92755 -256428 175712
11214e1635q0659j39769d5366J1776j05520k83022b5949A02610a43574n6841I4078
$$ -51635 -132294 -272063 -45366 -33590 -139110 -422132 -25949 102610 -143574 -200415 94078
11202b66866B53740q3915L2146b4825A28643c1831B01936g0281I7404a1369B58246
$$ -266866 253740 169825 201971 -24825 128643 -31831 201936 -70281 97404 -11369 258246
11190e5030Q684F0682M4454m6084a62253P047L6145k3090A01817a5761A84305
$$ -55030 -46346 60682 105136 59052 -162253 -155206 -119061 -142151 101817 -15761 184305
11178a26595j35432a14706j5920H6655A1509a52637B2262e5561B0134L1002B1721
$$ -126595 -262027 -114706 -130626 86655 11509 -152637 22262 -55561 20134 51136 21721
11166a80925J0185A19906a62984D6504b09018j44999B762K9847b86855b1325F4069
$$ -180925 -170740 119906 -162984 46504 -209018 -354017 2762 32609 -286855 -21325 64069
11154a61357M428k67762i0303m1010j41670B83494a62148a6184j58721L1456l2653
$$ -161357 -156929 -424691 -90303 -131313 -272983 283494 -162148 -16184 -174905 -143449 -176102
11143a76102h3053m6463G6296A0129N506K8318j1100g4037B23108k7092b31343
$$ -176102 -83053 -129516 76296 10129 15635 43953 32853 -74037 223108 196016 -231343
11131H1024a17251d7571q8436f1329B02251J28687d3998j23906j9991Q3044r734
$$ 81024 -117251 -47571 -136007 -61329 202251 330938 -43998 -167904 -187895 -104851 -114585
11120a14585e0837C92364a40314a521j19887o4710p1983L0234h7379K7788B89892
$$ -114585 -50837 392364 -140314 -1521 -121408 -186118 -258101 -227867 -87379 -59591 289892
11108a04750m4926p5952B46118F7960K08454q822G3377J52103n117a05479A04835
$$ -104750 -149676 -225628 246118 67960 276414 267592 73377 225480 220363 -105479 104835
11096a59226A074K22251G6679J76713J85740I894Q8894Q809a20156D9073a05323
$$ -159226 1074 223325 76679 253392 439132 9894 98788 107597 -120156 49073 -105323
11084a7585A58009R3774l0933O1970r2016C4148M08839j77675n9630A00015Q5100
$$ -17585 158009 251783 220850 282820 190804 34148 442987 265312 205682 100015 185115
11073A85115I429K69905m187J13528j71660J50924A72786N7887B2282K3170J09123
$$ 185115 9429 279334 275147 388675 217015 367939 172786 230673 22282 45452 154575
11062A54575b3200A73844m6334g3801K896b1476D56013K41121k49349m7287J3678
$$ 154575 -23200 173844 127510 -73801 -70905 -21476 456013 697134 447785 400498 414176
11051D14176n9670K64701j23748f1996E49609r9171j29973M94762l78896B13473
$$ 414176 354506 619207 495459 -61996 549609 450438 320465 815227 436331 213473
11040F05803B94388J51014N9289j0055R006j12121L98048j92688J60524k57069
$$ 605803 294388 445402 504691 494636 503642 391521 789569 596881 757405 500336
11030E00336q7403K55536B96213J71126k06792L26130P99k03381j01165J17477
$$ 500336 412933 668469 296213 467339 260547 586677 587476 384095 282930 400407
11020D00407J44153J78977l59521k5941n8642J22345o3886K61934j03408k29366
$$ 400407 544560 723537 364016 338075 279433 401778 337892 599826 496418 267052
11010B67052J25504j1654m9072J43895J79229K2190l36462A50983L07791b6636
$$ 267052 392556 380902 331830 475725 654954 677144 340682 150983 458774 -26636
10999C95997Q5970m3370A87440Q3173J24787j05874n0385J35273L5378L56489
$$ 395997 481967 438597 187440 270613 395400 289526 239141 374414 409792 766281
10989G66281l57315k5498j12876J46198J03416k32840M66120k00837K78353j81957
$$ 766281 408966 383468 270592 416790 520206 287366 753486 552649 831002 649045
10979F49045O6719k1062J06474J62679l24381L04163K17200J33452k42014N27219
$$ 649045 715764 694702 801176 963855 639474 943637 1160837 1294289 1052275 1579494
10969A579494J51532J51301L0409p0308J51149k31116j91315k35475O4406M6445
$$ 1579494 1731026 1882327 1912736 1842428 1993577 1762461 1571146 1335671 1400077 1446522
10959A446522l60806r563j63870L47606P5014o2422N6979J02930j0008m09534
$$ 1446522 1085716 1076153 912283 1259889 1334903 1272481 1329460 1432390 1422382 1012848
10949A012848K03253q3249k78109j20470k08583J60103B02059r5928K88597A20022
$$ 1012848 1216101 1132852 854743 734273 525690 685793 202059 106131 394728 120022
10938B47705L6349j04901N3217a71741k4551A49655M6452f2834C9837c71068F1930
$$ 247705 284054 179153 232370 -171741 -196292 149655 196107 -62834 39837 -371068 61930
10926I601c664G1910b34710B06492A6888J91103b94874c5391m88p743a281H6634
$$ 9601 -3664 71910 -234710 206492 16888 207991 -294874 -35391 -35879 -43622 -1281 86634
10913A54370o4527K94822b6987k37175d389D6697K27081a61897H1137K09025h1858
$$ 154370 89843 384665 -26987 -264162 -4389 46697 273778 -161897 81137 290162 -81858
10901C3627a07697L864I8691b12282H5154P5209J28903a36722A30952B1364a18209
$$ 33627 -107697 -103833 98691 -212282 85154 160363 289266 -136722 130952 21364 -118209
10889a23183a4221f918k2226J4367j08644M8028j71095J03981O7662l19696a19239
$$ -123183 -14221 -6918 -29144 -14777 -123421 -75393 -246488 -142507 -74845 -394541 -119239
10877a66390H1214l2149g8659K5598e059j53127q4390A07112a82271K9147b4276
$$ -166390 81214 49065 -78659 -53061 -5059 -158186 -242576 107112 -182271 -153124 -24276
10865B15882e1348C52238a05378b057A20257K5424J1645e11751b34824d6097A18248
$$ 215882 -51348 352238 -105378 -2057 120257 145681 157326 -511751 -234824 -46097 118248
10853A17922a8005B09959b02618A37191b26157A23046i1227c5256r8561C02661
$$ 117922 -18005 209959 -202618 137191 -226157 123046 -91227 -35256 -133817 302661
10842c2458B07707a19637A24379c2136j83291f7012n5682m4658f5112k27250a15460
$$ -32458 207707 -119637 124379 -32136 -215427 -67012 -122694 -167352 -65112 -292362 -115460
10830c32189c4041j27200j23421C16822E503c30207C64171G184c52193e1203A85889
$$ -332189 -34041 -161241 -284662 316822 5503 -330207 364171 7184 -352193 -51203 185889
10818d785A6887Q6901b23334j25342p2954a38743N1444D13535c7832A43402e4076
$$ -4785 16887 103788 -223334 -348676 -421630 -138743 -87299 413535 -37832 143402 -54076
10806G7716a58366A26652b01426A75542b3843j7772A9845O9385C9214p612J42652
$$ 77716 -158366 126652 -201426 175542 -23843 -41615 19845 89230 39214 31602 174254
10795A74254a79201H5114L36007c60017J19147m4905l9821c2115j03284d3199
$$ 174254 -179201 85114 421121 -360017 -240870 -285775 -325596 -32115 -135399 -43199
10784b83959A18372b86010h4803k91277C7961O8354g0128J8885f942B9437i2237
$$ -283959 118372 -286010 -84803 -376080 37961 106315 -70128 -51243 -6942 29437 -92237
10772H3225a06311A20600J33285p7351q7952J08432b73790C07182c01843J32746
$$ 83225 -106311 120600 253885 176534 88582 197014 -273790 307182 -301843 -169097
10762a69097M5283B4316P8265R3220i0312B6248L87451D6592K1782a3085j09729
$$ -169097 -123814 24316 102581 195801 -90312 26248 413699 46592 68374 -13085 -122814
10751a22814d6846b0330G0678b58532a02089D3993a99914c8362B85453a13204
$$ -122814 -46846 -20330 70678 -258532 -102089 43993 -199914 -38362 285453 -113204
10740a83731q5541A18168K3063D1051O7860D5211c4884I6465a16148C06819a06019
$$ -183731 -269272 118168 141231 41051 108911 45211 -34884 96465 -116148 306819 -106019
10728a78456F1983b62660k17901A34424b83422A17307c12315I0416b35451k3549
$$ -178456 61983 -262660 -480561 134424 -283422 117307 -312315 90416 -235451 -259000
10718b59000h9658j85371E8436C313a48091L8559E2162a67750B3577h6384k37411
$$ -259000 -89658 -275029 58436 3313 -148091 -109532 52162 -167750 23577 -86384 -323795
10707c23795h3311A86637c57007j39508E2747Q3471E1718i1244B31387q0709b73199
$$ -323795 -83311 186637 -357007 -496515 52747 136218 51718 -91244 231387 150678 -273199
10695c5680o9291A35477l8079a21762k69321G310f0832a7842j22038I4486b82956
$$ -35680 -104971 135477 97398 -121762 -391083 7310 -60832 -17842 -139880 94486 -282956
10683A71376D9460f1782D1991M30298e1583A9527h1111c1074k22216A99642b61627
$$ 171376 49460 -61782 41991 472289 -51583 19527 -81111 -31074 -253290 199642 -261627
10671B377a00731A72869a71018d7212o2196o9935h282j16943M655j64404B11134
$$ 2377 -100731 172869 -171018 -47212 -109408 -179343 -8282 -125225 -120570 -284974 211134
10659a40746p952p3655d5154E9553K80894a47272j20882A46443c06071o5500h2069
$$ -140746 -148698 -222353 -45154 59553 340447 -147272 -268154 146443 -306071 -371571 -82069
10647b72503A54502B8116Q0571a36246n784j45422f1031k63768h6262G371J42402
$$ -272503 154502 28116 108687 -136246 -142030 -287452 -61031 -324799 -86262 7371 149773
10636A49773P5853E7457d60973c8189E4963i4631A2128b4432j22493o2770D3252
$$ 149773 225626 57457 -460973 -38189 54963 -94631 12128 -24432 -146925 -209695 43252
10624b1172C6127K10132i1447a8992A6941d8519l22642A40285g4057k0491b1474
$$ -21172 36127 246259 -91447 -18992 16941 -48519 -371161 140285 -74057 -94548 -21474
10612C6513J43814o2534a31476a8684m6595A29494o2893K81011j25118r4354a27119
$$ 36513 180327 117793 -131476 -18684 -65279 129494 66601 347612 222494 128140 -127119
10600d35569G5228Q777L2138a06639O460B39801b49623h1879A71174m9331a49506
$$ -435569 75228 84005 116143 -106639 -100179 239801 -249623 -81879 171174 121843 -149506
10588A8805P2412D0531a14974E8009d9547k06488C97304a74169l0758B6788c81375
$$ 18805 91217 40531 -114974 58009 -49547 -256035 397304 -174169 -204927 26788 -381375
10576B5464c68499J51131H2238b94384h86A15695b25882A17552J6739a1792j94279
$$ 25464 -368499 -217368 82238 -294384 -886 115695 -225882 117552 134291 -11792 -206071
10565b06071A1596N0714K04886q2836J09402h4611G547R1552d3663B11574f3150
$$ -206071 11596 62310 267196 184360 293762 -84611 7547 99099 -43663 211574 -63150
10553c49066A508K36640o1760p0132a41842p0649B27354i149I3963M7745h6684
$$ -349066 1508 238148 176388 106256 -141842 -212491 227354 -9149 93963 141708 -86684
10541b01280j457e0755a8871C4465j4372n511b45423F9064c12106e3103D6943
$$ -201280 -202737 -50755 -18871 34465 20093 14582 -245423 69064 -312106 -53103 46943
10529b099k49989D7403g7003o1458L650K4097k74748R6802a36203N2908k7440
$$ -2099 -252088 47403 -77003 -138461 -134811 -110714 -385462 -288660 -136203 -83295 -110735
10518a10735o178L3547k7872J4645j42699a18963l64238a09087B124J98586k321
$$ -110735 -116913 -83366 -111238 -96593 -239292 -118963 -483201 -109087 2124 200710 198389
10507A98389n3638F6877c35797g3128K5394j02487e3179k1506L2039B36929a81986
$$ 198389 144751 66877 -335797 -73128 -47734 -150221 -53179 -74685 -42646 236929 -181986
10495A00897l5985h9234F5580e9791A13606b48740R6402B29444B4503a95174g8510
$$ 100897 64912 -89234 65580 -59791 113606 -248740 -152338 229444 24503 -195174 -78510
10483b15346d6944j134B1925K72213i3687c4187r803B90576A42941J17136j17558
$$ -215346 -46944 -48078 21925 294138 -93687 -34187 -43990 290576 142941 260077 142519
10472A42519n3859J53108j1019N696a66816B68801a70297A24634K4339a69067
$$ 142519 88660 241768 230749 236445 -166816 268801 -170297 124634 148973 -169067
10461b31174e3129G5386d437r0535B01109a492k12324f683E5804c9255k13026
$$ -231174 -53129 75386 -4437 -94972 201109 -1492 -213816 -6683 55804 -39255 -252281
10450b52281I0901A0606b34283A54089g823A316a93987n4906J02186D720c19923
$$ -252281 90901 10606 -234283 154089 -7823 1316 -193987 -248893 -146707 4720 -319923
10438B38716c5556D3184J22766a49054N8160F455b57307j50478J91159E1652K39315
$$ 238716 -35556 43184 165950 -149054 -90894 6455 -257307 -407785 -216626 51652 290967
10427B90967b58106A48054j3162a32339A02469c45676A01333a08380c7146Q922
$$ 290967 -258106 148054 134892 -132339 102469 -345676 101333 -108380 -37146 -28224
10417b8224H279c02753D3607D636c9021j83586m2286F4817F864a71713A65200
$$ -28224 8279 -302753 43607 4636 -39021 -222607 -264893 64817 6864 -171713 165200
10405A54788M6485h3907j21128A3973a45394B2627K8839g7187C0836a49851O2403
$$ 154788 201273 -83907 -205035 13973 -145394 22627 51466 -77187 30836 -149851 -87448
10394h7448B14314l1945a10486a4521D49648b87960E1694g699o0654b3826A04224
$$ -87448 214314 182369 -110486 -14521 449648 -287960 51694 -7699 -68353 -23826 104224
10382A61032C2967a8040B07943a89591l0370c1044h315B17574a18315E04700a54147
$$ 161032 32967 -18040 207943 -189591 -219961 -31044 -8315 217574 -118315 504700 -154147
10370B30237F4626G375L67482A60160G9267L26682A19229K17463H7185C7878J34985
$$ 230237 64626 7375 374857 160160 79267 405949 119229 336692 87185 37878 172863
10359A72863j3774J00427F8557a29247C32269A51383L5586o7653A5136b0000A54931
$$ 172863 159089 259516 68557 -129247 332269 151383 186969 119316 15136 -20000 154931
10347C49057j54800H5323K31661A04107J33255J95205H4185K3664J21410J85363
$$ 349057 194257 85323 316984 104107 237362 432567 84185 107849 229259 414622
10337D14622o6917Q379q5504p2039G9488b1436j51871j98257a81377a1594l80924
$$ 414622 347705 356084 270580 198541 79488 -21436 -173307 -371564 -181377 -11594 -392518
10326c92518a95350B28295b07403H0557K02451J14816A08264a06370B67416A23364
$$ -392518 -195350 228295 -207403 80557 283008 397824 108264 -106370 267416 123364
10315B11398O1950n2006n3867p4363K984i0367C7079c13455C37478a11142F9327
$$ 211398 273348 221342 167475 93112 96096 -90367 37079 -313455 337478 -111142 69327
10303A10675P9169m592e0312j4094D683J69137d2282k57629F478a28293B60315
$$ 110675 189844 185252 -50312 -64406 4683 173820 -42282 -299911 6478 -128293 260315
10291A33718d373j59473C47274b92170A41084a64997A34983h2154C7007a78886
$$ 133718 -4373 -163846 347274 -292170 141084 -164997 134983 -82154 37007 -178886
10280A87844a77918n2673B3554J82597r1029n6701c10940h8251q0380d4755B45759
$$ 187844 -177918 -230591 23554 206151 115122 58421 -310940 -88251 -168631 -44755 245759
10268a96727B28306B1586I43J52040l7127a06874B06262b9670o3193F0758f650
$$ -196727 228306 21586 943 152983 115856 -106874 206262 -29670 -92863 60758 -6650
10256c7679C21308j3066H6268J73699P8693P8457GN3223K0253K5028m1602K68507
$$ -37679 321308 308242 86268 259967 338660 417117 7 53230 73483 98511 56909 325416
10244C25416A31511b09303M0794B19606D2732f7909p5242E2529K48861b58722
$$ 325416 131511 -209303 -168509 219606 42732 -67909 -143151 52529 301390 -258722
10233c2469k6649j55126D4093h2354A31700l4140A1426K7431c99821a85110B18653
$$ -32469 -59118 -214244 44093 -82354 131700 97560 11426 38857 -399821 -185110 218653
10221a05913C3898a22690G6420N151B9640J07628b113l36224C1323c60407a51907
$$ -105913 33898 -122690 76420 81571 29640 137268 -2113 -338337 31323 -360407 -151907
10209G0909b74702k81434b50879O2156A80114E6161b09829j44635d986A30871
$$ 70909 -274702 -556136 -250879 -188723 180114 56161 -209829 -354464 -4986 130871
10198b11976B23665J4472b8111M724J36C0297e1217j08414K7174j6913E9158f9338
$$ -211976 223665 238137 -28111 -23387 -23251 30297 -51217 -159631 -132457 -149370 59158 -69338
10185f2707b6320l08252a65677j893H4755f4513G9973O9351n9849b92455A9051
$$ -62707 -26320 -334572 -165677 -167570 84755 -64513 79973 149324 89475 -292455 19051
10173b65024c2540r0832F856b99693A74239a29499l59018a09331m6126j57621
$$ -265024 -32540 -123372 6856 -299693 174239 -129499 -488517 -109331 -155457 -313078
10163c13078i5561j06782P2065b9691O618l89403E7177a40970a814m3517A9032
$$ -313078 -95561 -202343 -130278 -29691 -23073 -412476 57177 -140970 -1814 -45331 19032
10151B42449g2020n0925j10461j18999a52511r8302d0834j76083L5325A36185
$$ 242449 -72020 -122945 -233406 -352405 -152511 -250813 -40834 -216917 -181592 136185
10140B77989A13599N3697b0750j70226N2087D3953a81864D5056b26346E4327K08759
$$ 277989 113599 167296 -20750 -190976 -138889 43953 -181864 45056 -226346 54327 263086
10129B63086a67860g634I1864P5360b08593A18328g306j58267K0497Q828C7439
$$ 263086 -167860 -7634 91864 167224 -208593 118328 -7306 -165573 -145076 -136248 37439
10117D04183C537g5863m1469D9182a38035k60676h6226j1565a429j44476M1687
$$ 404183 3537 -75863 -117332 49182 -138035 -398711 -86226 -97791 -1429 -145905 -104218
10106a04218A0287B673b95118A80265N9172n5775F9041d2846j40509g4038r3554
$$ -104218 10287 2673 -295118 180265 239437 183662 69041 -42846 -183355 -74038 -167592
10095a67592I7916b53936g1952j90516A25134b87458f983p2991E8114e6741j2816
$$ -167592 97916 -253936 -71952 -262468 125134 -287458 -6983 -79974 58114 -56741 -69557
10084f9557j80148p9110e9962B00915h377k31969B66780b85165a19269j18781
$$ -69557 -249705 -328815 -59962 200915 -8377 -240346 266780 -285165 -119269 -238050
10074b38050A54721k2747K3902a7886B03077k4290a38844l7726g0901A17549b83417
$$ -238050 154721 131974 155876 -17886 203077 178787 -138844 -176570 -70901 117549 -283417
10062A36317a78408e2796p3247D9095d4768A47239a14603j02661j2679A42691
$$ 136317 -178408 -52796 -126043 49095 -44768 147239 -114603 -217264 -229943 142691
10051G4657b52126j22293B00750a08052d9406p878b698D1799j2300c15610A30708
$$ 74657 -252126 -374419 200750 -108052 -49406 -57284 -2698 41799 29499 -315610 130708
10039B51471q9136b30013C9123b37595O9233l4686E5058e3952A95277b55451b8230
$$ 251471 162335 -230013 39123 -237595 -168362 -203048 55058 -53952 195277 -255451 -28230
10027c16873c1424l0678F5477a84751A66232H0662K7893f7113E5284d3738P728
$$ -316873 -31424 -62102 65477 -184751 166232 80662 108555 -67113 55284 -43738 -36010
10016c6010A39408d8016j10115A5545d44577h3456E8980a38296p6308H7867d9760
$$ -36010 139408 -48016 -158131 15545 -444577 -83456 58980 -138296 -214604 87867 -49760
10004c3859k33296A83496a824I3603K5985E9329O6140a95167d2536o9416b6808
$$ -33859 -267155 183496 -1824 93603 119588 59329 125469 -195167 -42536 -111952 -26808
9992a57178B15604m3084a17545a1431B84625D89J42053P2184H0197a19517r2430
$$ -157178 215604 172520 -117545 -11431 284625 489 142542 214726 80197 -119517 -211947
9981b11947k2957A34566d10679g5974j32959I8770a78919b8204l4437C5928K54439
$$ -211947 -234904 134566 -410679 -75974 -208933 98770 -178919 -28204 -62641 35928 290367
9970B90367b1502B12448a92390j27734B65419E0760f4699b5538j65734A01497
$$ 290367 -21502 212448 -192390 -320124 265419 50760 -64699 -25538 -191272 101497
9959I489P2561e8319C36419d3536j72549D87251a59191G2333a00379O282j03524
$$ 9489 82050 -58319 336419 -43536 -216085 487251 -159191 72333 -100379 -94097 -197621
9948a97621M9139A98593H3258a39658A93031H8824P615a4662j97329j5579M7714
$$ -197621 -148482 198593 83258 -139658 193031 88824 96439 -14662 -211991 -227570 -179856
9937a79856A9525a73699D20194b4093r7702A0949a68480a8007j69948l23F7483
$$ -179856 19525 -173699 420194 -24093 -121795 10949 -168480 -18007 -187955 -188278 67483
9925a37414m1673c6292r0690N2638j41659b8624k84673a18574k1147G8885b63721
$$ -137414 -179087 -36292 -126982 -74344 -216003 -28624 -313297 -118574 -139721 78885 -263721
9913c8786k07100j40374A74692F0829J97423G617c16A244g5553k8993o008A28217
$$ -38786 -245886 -386260 174692 60829 258252 7617 -316 1244 -75553 -104546 -110554 128217
9900b03169O7980B47330D0231J55020I6530Q6505h4026L2586j00901P2524a5894
$$ -203169 -135189 247330 40231 195251 96530 183035 -84026 -51440 -152341 -79817 -15894
9888a66140B43467D2063g2189j06339k11499f3550k75621B27086d6232j61239
$$ -166140 243467 42063 -72189 -178528 -390027 -63550 -339171 227086 -46232 -207471
9878b07471h0041l01690d0366I2194C8001a57437C18272a20693A1746c27921b3791
$$ -207471 -80041 -381731 -40366 92194 38001 -157437 318272 -120693 11746 -327921 -23791
9866c00255f2681q4969A10049c13407J52070j03766C6649K314a61852B44595k3915
$$ -300255 -62681 -147650 110049 -313407 -161337 -265103 36649 38963 -161852 244595 220680
9855B20680j01804a92391l1003k39147h4168A20208c58349B0862M15667d16323
$$ 220680 118876 -192391 -223394 -462541 -84168 120208 -358349 20862 436529 -416323
9844E9639e4959A47611c1978F1725b95433a22824B51825g3967A12653M9373a91569
$$ 59639 -54959 147611 -31978 61725 -295433 -122824 251825 -73967 112653 162026 -191569
9832A7933J19270h1565m8102J9623d2060b221B7718K80575b54519O2217d9256
$$ 17933 137203 -81565 -129667 -110044 -42060 -2221 27718 308293 -254519 -192302 -49256
9820b38929r4100D0070b31479i2453a8152l06129h9062j37257j86736a46368f9764
$$ -238929 -333029 40070 -231479 -92453 -18152 -324281 -89062 -226319 -413055 -146368 -69764
9808a05046d5662l1373k72953C22885G03b52663I4447g510C8623d5178F9406h4542
$$ -105046 -45662 -77035 -349988 322885 703 -252663 94447 -7510 38623 -45178 69406 -84542
9795h5194C12733C3100c9127j6257I0042g692m2449o103l4603J9713J5695r3169
$$ -85194 312733 33100 -39127 -55384 90042 -7692 -50141 -56244 -90847 -71134 -55439 -148608
9783a48608A41666E4336e670p2139l1923L5645r7613k8562i0143k9349e886r2658
$$ -148608 141666 54336 -5670 -77809 -109732 -74087 -171700 -200262 -90143 -119492 -5886 -98544
9771i8544F3315c1058g983j34961m8836P7202j50432K9703j52472a14941f538
$$ -98544 63315 -31058 -7983 -142944 -191780 -114578 -265010 -235307 -387779 -114941 -6538
9759a25169l55481A67011C6135c7781j84049k0539e6197b592j60025A01562R8110
$$ -125169 -480650 167011 36135 -37781 -221830 -242369 -56197 -2592 -162617 101562 199672
9748A99672A4725a31881A70272f5872j51970C89807a43785A36641R6428a29218
$$ 199672 14725 -131881 170272 -65872 -217842 389807 -143785 136641 233069 -129218
9737a15557H2196I779K9541b0834q7418j58769d0192B00827O5782b16433f5228
$$ -115557 82196 9779 39320 -20834 -108252 -267021 -40192 200827 266609 -216433 -65228
9725H5392e0344j69938B919a0328l38486g4064J319k11340A9040b04771K6175
$$ 85392 -50344 -220282 2919 -10328 -348814 -74064 -72745 -284085 19040 -204771 -178596
9714a78596C6053K56353b9255c863B7393F849J00963B2104a70181h0951A36994
$$ -178596 36053 292406 -29255 -3863 27393 6849 107812 22104 -170181 -80951 136994
9702b65096B28862a11763k5407l1157E0655L67784a06639j85091g7977j00713
$$ -265096 228862 -111763 -137170 -168327 50655 418439 -106639 -291730 -77977 -178690
9692a78690K2665A92497e482k62804n5819c3254j09734I1116c61727C2449O064
$$ -178690 -156025 192497 -5482 -268286 -324105 -33254 -142988 91116 -361727 32449 38513
9681C8513c21994n9088C9490b40230A63823a89542m7126b0616m934k33131F6874
$$ 38513 -321994 -381082 39490 -240230 163823 -189542 -236668 -20616 -25550 -258681 66874
9669a18013B6407L035M388h734E3589Q841l440B0672P2520c66204a24995c4535
$$ -118013 26407 29442 33830 -8734 53589 62430 58990 20672 93192 -366204 -124995 -34535
9656a90166k743n5988A21752b17919r5126A75985d11482a49525L1562k38422g7349
$$ -190166 -192909 -248897 121752 -217919 -313045 175985 -411482 -149525 -117963 -356385 -77349
9644a53357A1193e3295b5031J0745k36228C2159a19619j86951a34317A96641E6728
$$ -153357 11193 -53295 -25031 -14286 -250514 32159 -119619 -306570 -134317 196641 56728
9632c81907a80046f2066A07077B3049g5037p7971e5747H9746f2185J4331j12737
$$ -381907 -180046 -62066 107077 23049 -75037 -153008 -55747 89746 -62185 -47854 -160591
9621a60591A51335K52138c17184B48669i8598I3265a45090A66875o4876a47388
$$ -160591 151335 403473 -317184 248669 -98598 93265 -145090 166875 101999 -147388
9610B02886D5805L23602a14945j41218A47997f9131j71521g4192r7599f4414I4775
$$ 202886 45805 369407 -114945 -256163 147997 -69131 -240652 -74192 -171791 -64414 94775
9598C06140E9873c29557a2209E5909b01687L2038e9893j60390C9372N799M6042
$$ 306140 59873 -329557 -12209 55909 -201687 -169649 -59893 -220283 39372 45171 91213
9587I1213B9429N3729d9267n0190k6079A80399C5743N9457K49347E5068i4743
$$ 91213 29429 83158 -49267 -99457 -125536 180399 35743 95200 344547 55068 -94743
9575b12665P0643A25655e1373C5983M0348c28887a54868F6324a59284m01014h082
$$ -212665 -142022 125655 -51373 35983 76331 -328887 -154868 66324 -159284 -560298 -8082
9563I4745O6600a15874a521m1018q9240n072A86367a03235k31559d4774F0734
$$ 94745 161345 -115874 -1521 -42539 -131779 -136851 186367 -103235 -334794 -44774 60734
9551a10845C30809a87233j85507F3932P3633B1956f3560j6101j7555I5164c54425
$$ -110845 330809 -187233 -372740 63932 137565 21956 -63560 -79661 -97216 95164 -354425
9539a40110N8356I2426d689B49406c8567n2896k13254h5616b1958j42085o289
$$ -140110 -81754 92426 -4689 249406 -38567 -91463 -304717 -85616 -21958 -164043 -170332
9528a70332A26699A7447c7530A14064e3171I8191a24791c926A44110b28173k1768
$$ -170332 126699 17447 -37530 114064 -53171 98191 -124791 -3926 144110 -228173 -249941
9517b49941O5421D0858a44652C06867a45148n3841P4728J2179j29724A37204a40105
$$ -249941 -184520 40858 -144652 306867 -145148 -198989 -124261 -112082 -241806 137204 -140105
9505A54428a05961A11112O4548B8451a27855M19R72N8436k56976h8297L7999D5273
$$ 154428 -105961 111112 175660 28451 -127855 -127436 -126464 -68028 -325004 -88297 -50298 45273
9492b59145e532j26780d4172A6309b41161R9715b485k43086a0449I4379a87869
$$ -259145 -5532 -132312 -44172 16309 -241161 -141446 -2485 -245571 -10449 94379 -187869
9480c332j49010j01953l4437M6653G5305a24961F6417N984b08910j48131l3379
$$ -3332 -152342 -254295 -288732 -242079 75305 -124961 66417 72401 -208910 -357041 -390420
9469c90420d2659m06808A98445b83600R7525g6496k1039k27460a13550J5410j70000
$$ -390420 -42659 -449467 198445 -283600 -186075 -76496 -97535 -324995 -113550 -98140 -268140
9458b68140G1174N1963a21369c3736j94678B70386I8423c06768d4501J8943o7558
$$ -268140 71174 123137 -121369 -33736 -228414 270386 98423 -306768 -44501 -25558 -93116
9447i3116l35692a79825J5093N0138j58372l4592B88033a66523e5988C14222a35741
$$ -93116 -428808 -179825 -164732 -114594 -272966 -307558 288033 -166523 -55988 314222 -135741
9435b63058C7161b57617A50529F9350g209k69792F371N4024b7706k68600K0503
$$ -263058 37161 -257617 150529 69350 -7209 -277001 6371 60395 -27706 -296306 -275803
9424b75803J27713p8781N9348A11938a02277k04660Q4425p8671I3746B9107K49114
$$ -275803 -148090 -226871 -167523 111938 -102277 -306937 -222512 -301183 93746 29107 278221
9413B78221f6683F8857e5730j36771A6629O4021l8382h5849B78573G2117a78495
$$ 278221 -66683 68857 -55730 -192501 16629 80650 42268 -85849 278573 72117 -178495
9401b35669C09953a25656G3304a25121j7942d3285j12150D7420a6510H8385c6444
$$ -235669 309953 -125656 73304 -125121 -143063 -43285 -155435 47420 -16510 88385 -36444
9389b77465G6830g8390j42358D7021d55760a58430n644c2063A63655a22104d4884
$$ -277465 76830 -78390 -220748 47021 -455760 -158430 -164074 -32063 163655 -122104 -44884
9377a0689A13328l8901l385a82383C9062f1865p4157L9704l49378E139a24040
$$ -10689 113328 74427 71042 -182383 39062 -61865 -136022 -96318 -445696 5139 -124040
9365h0093D3301a65145P1940A01737a35244f3365j18220A84921K4214a09309b5575
$$ -80093 43301 -165145 -93205 101737 -135244 -63365 -181585 184921 209135 -109309 -25575
9353f4197F1844a54401b4475l4574j54078i2325l0105j10947B22252a214I1333
$$ -64197 61844 -154401 -24475 -59049 -213127 -92325 -122430 -233377 222252 -1214 91333
9341A10630h8821k24450J29231A5139J61593a16161q0101B6481A0233i9964L182
$$ 110630 -88821 -313271 -184040 15139 176732 -116161 -196262 26481 10233 -99964 -96782
9330i6782B94221c4345j60065L5334j53449A89948e4170k44314C3326a8092k5973
$$ -96782 294221 -34345 -194410 -159076 -312525 189948 -54170 -298484 33326 -18092 -44065
9319d4065J5883A6235N3097b98287d9203g217A43916a87121A36374Q3233h0479
$$ -44065 -28182 16235 69332 -298287 -49203 -7217 143916 -187121 136374 219607 -80479
9307b64144g6602k19717g2981j16491c697A37132o8447m42b29940B13240i0822
$$ -264144 -76602 -296319 -72981 -189472 -3697 137132 68685 68243 -229940 213240 -90822
9295a29084i684j86299h9688B04521b07336C38291h1829j04487B85714e8638a0026
$$ -129084 -9684 -195983 -89688 204521 -207336 338291 -81829 -186316 285714 -58638 -10026
9283c59633F4311a12003A24272l8705N9508g6901j13205i1212B24577c4739N978
$$ -359633 64311 -112003 124272 85567 145075 -76901 -190106 -91212 224577 -34739 -28761
9272b8761j85782A34583Q7065A3471a0777j17905d6105k5780A74352Q1776A5818
$$ -28761 -214543 134583 221648 13471 -10777 -128682 -46105 -71885 174352 256128 15818
9260D8913J47333D6261g5656l1132M5004G8283N7628b5154p3413j47044g1555
$$ 48913 196246 46261 -75656 -106788 -61784 78283 135911 -25154 -98567 -245611 -71555
9248a32083B57233f8953l5556B05884b73362F78J93142a99631h963j69188E7665
$$ -132083 257233 -68953 -104509 205884 -273362 678 193820 -199631 -8963 -178151 57665
9236A66938B3384a08134A66428a10392j40169c695E0103N8087m6648J57808F7592
$$ 166938 23384 -108134 166428 -110392 -250561 -3695 50103 108190 61542 219350 67592
9224b90519n9869g2321A93946H8909a91743M9292A32945M7333a06967J3816M4842
$$ -290519 -350388 -72321 193946 88909 -191743 -142451 132945 180278 -106967 -93151 -48309
9213d8309q8954F5621b11378j83481j35744b26860g2855a6105p7884L6945A75769
$$ -48309 -137263 65621 -211378 -394859 -530603 -226860 -72855 -16105 -93989 -57044 175769
9201g4783o6213F1964N4177J86693b3872k3498k05373C1429b61713c1843j48611
$$ -74783 -140996 61964 116141 302834 -23872 -47370 -252743 31429 -261713 -31843 -180454
9190a80454C6587a88013R0885o7128B39693m5357a1998j58159H4245b40377P9537
$$ -180454 36587 -188013 -97128 -164256 239693 194336 -11998 -170157 84245 -240377 -160840
9179a60840l2821j04405a05211M8573A08383c4533A12587g548k86608l8378D2529
$$ -160840 -193661 -298066 -105211 -56638 108383 -34533 112587 -7548 -294156 -332534 42529
9167e3480F2649J51335e1344m2791A61211c4994m1343B12747o5650c4820C10804
$$ -53480 62649 213984 -51344 -94135 161211 -34994 -76337 212747 147097 -34820 310804
9155F4825a83156h101n0071l43641Q8565A09078D6042K35075a82030q9722A14447
$$ 64825 -183156 -8101 -58172 -401813 -313248 109078 46042 281117 -182030 -271752 114447
9143c4704D4163e5645M87r6136j11391G525b52488a2955k37613a4707j18940A73803
$$ -34704 44163 -55645 -55158 -151294 -262685 7525 -252488 -12955 -250568 -14707 -133647 173803
9130c8403m2799H7526R0538P4533B3853a49999B65789n8659a93820M8099j05876
$$ -38403 -81202 87526 178064 252597 23853 -149999 265789 207130 -193820 -145721 -251597
9119b51597a3674A63587D6888f4982q6249A64182a38385L4126j84058a27486A24594
$$ -251597 -13674 163587 46888 -64982 -151231 164182 -138385 -104259 -288317 -127486 124594
9107h9501A18085b29034A69418f1489k2303a9607l24696A75586d2179m5994A50447
$$ -89501 118085 -229034 169418 -61489 -83792 -19607 -344303 175586 -42179 -88173 150447
9095b44249G7840i8903F6289M1043k1071J82707h2551l78329e6804j70538Q840
$$ -244249 77840 -98903 66289 107332 86261 268968 -82551 -460880 -56804 -227342 -218502
9084b18502A29687p667L50467A6149a53644c334k23637F0015b40799l7336B11860
$$ -218502 129687 122020 472487 16149 -153644 -3334 -226971 60015 -240799 -278135 211860
9072f9789c3203I8758a02812n4394f0760j1740L3901j86906C46446j12830H7206
$$ -69789 -33203 98758 -102812 -157206 -60760 -72500 -38599 -225505 346446 233616 87206
9060g4263j06210A37187a21220q6756L255f879l74903a09953I7078b03873I1894
$$ -74263 -180473 137187 -121220 -207976 -204721 -6879 -381782 -109953 97078 -203873 91894
9048B26794c64644b3303j05836k1931A43070d0806A7339G44b57115J27776L3775
$$ 226794 -364644 -23303 -129139 -151070 143070 -40806 17339 744 -257115 -129339 -95564
9037i5564C9676b66932l1443c1936j47041A15163n0377K2653c18162e4830A52853
$$ -95564 39676 -266932 -298375 -31936 -178977 115163 64786 87439 -318162 -54830 152853
9025A12103a04984c7451E3069a13114d5440j04264C6221a77956d4852L092j01833
$$ 112103 -104984 -37451 53069 -113114 -45440 -149704 36221 -177956 -44852 -41760 -143593
9014a43593o7183d8192l2628r2857K6990K7679c8505a0922j63826A54418h1892
$$ -143593 -210776 -48192 -80820 -173677 -146687 -119008 -38505 -10922 -174748 154418 -81892
9002A83300K06774g0857q2190B874b9818n676j66327B15591H4412a63960I829
$$ 183300 390074 -70857 -153047 2874 -29818 -35494 -201821 215591 84412 -163960 9829
8990a31905H0722K7522d8203D0672b93361D1339b19067C6579a75281n1193B550
$$ -131905 80722 108244 -48203 40672 -293361 41339 -219067 36579 -175281 -226474 2550
8978a10218d3199k22293J4944k9266O5804Q7932b840l65659c4064l9338L1972
$$ -110218 -43199 -265492 -250548 -279814 -214010 -126078 -2840 -368499 -34064 -73402 -41430
8967d1430F406c71724C8239a75659M6162j1191j20271A10473l3104L1926f206
$$ -41430 6406 -371724 38239 -175659 -129497 -140688 -260959 110473 77369 109295 -6206
8955b30060J07858H4578K14628A3539f1554n089A3742R1455N1002a84356A30235
$$ -230060 -122202 84578 299206 13539 -61554 -66643 13742 105197 156199 -184356 130235
8943g4188l8273F9873J9003M229e7590C0417a09707C2177K1254h0904j09467A38277
$$ -74188 -112461 69873 88876 93105 -57590 30417 -109707 32177 53431 -80904 -190371 138277
8930g6005A33032a44413e12j43558B19493C3475a27173J8374A4872M2212K97538
$$ -76005 133032 -144413 -512 -144070 219493 33475 -127173 -108799 14872 57084 354622
8919C54622K44724n6400A20799K8485a81002d1173D843J69273O2932a79598B7064
$$ 354622 599346 542946 120799 149284 -181002 -41173 4843 174116 237048 -179598 27064
8907B62819g932k19741A47920o7847J30631d2056k84531a0205k27032L2782J2221
$$ 262819 -7932 -227673 147920 80073 210704 -42056 -326587 -10205 -237237 -204455 -192234
8896a92234l4930g8151A18816a46757A3949J3581e3974E6119a50740q1161i664
$$ -192234 -227164 -78151 118816 -146757 13949 27530 -53974 56119 -150740 -231901 -9664
8884b83295C7101a9867n3101j94488a31989P693A4934J14682b48306B10466F9342
$$ -283295 37101 -19867 -72968 -267456 -131989 -124296 14934 129616 -248306 210466 69342
8872c7798j75889m104e3763l70754F7466a36117C3190a02708k182K8719A26402
$$ -37798 -213687 -217791 -53763 -424517 67466 -136117 33190 -102708 -104890 -76171 126402
8860B7342b69013A15094b95108K9834A07897L8132f4024C50109a08884e0731D8297
$$ 27342 -269013 115094 -295108 -265274 107897 146029 -64024 350109 -108884 -50731 48297
8848a54236e0584B13766a7456j79871M32A3433b5426k4485k50145e267l28969
$$ -154236 -50584 213766 -17456 -197327 -196895 13433 -25426 -49911 -300056 -5267 -334236
8837c34236J26937j1369O321h2799B11394a8903C2350b1019j70548q428O0733
$$ -334236 -207299 -218668 -212347 -82799 211394 -18903 32350 -21019 -191567 -199995 -139262
8826a39262d9126k2760B77642b24396A03590c15180c6267A0322a54605B25204
$$ -139262 -49126 -71886 277642 -224396 103590 -315180 -36267 10322 -154605 225204
$$ [...]
##END NTUPLES=NMR SPECTRUM
##END=
