##TITLE=NES1095_T12_9886966_kAx0Q6P168
##JCAMPDX= 6.0         $$ Bruker NMR JCAMP-DX V2.0
##DATA TYPE= NMR SPECTRUM
##DATA CLASS= NTUPLES
##ORIGIN= BRUKER
##OWNER= Administrator
$$ 1.72 TOPSPIN		Version 2.1
$$ 2016-08-28 18:26:09.148 -0500  Administrator@X
$$ Compression mode = diff/dup
##.OBSERVE FREQUENCY= 400.02188249412
##.OBSERVE NUCLEUS= ^1H
##.ACQUISITION MODE= SIMULTANEOUS (DQD)
##.ACQUISITION SCHEME= undefined
##.AVERAGES= 64
##.DIGITISER RES= 22
##SPECTROMETER/DATA SYSTEM= spect
##.PULSE SEQUENCE= noesygpps1d.comp
##.SOLVENT NAME= COFFEE_meoh
##.SHIFT REFERENCE= INTERNAL, COFFEE_meoh, 1, 14.96286
##AUDIT TRAIL= $$ (NUMBER, WHEN, WHO, WHERE, PROCESS, VERSION, WHAT)
$$ ##TITLE= Audit trail, TOPSPIN		Version 2.1
$$ ##JCAMPDX= 5.01
$$ ##ORIGIN= Bruker BioSpin GmbH
$$ ##OWNER= Administrator
$$ $$ E:\/data/COFFEE/nmr/NES1095_T12_9886966_kAx0Q6P168/12/pdata/1/auditp.txt
$$ ##AUDIT TRAIL=  $$ (NUMBER, WHEN, WHO, WHERE, PROCESS, VERSION, WHAT)
(   1,<2016-08-28 18:26:03.992 -0500>,<Administrator>,<X>,<go>,<TOPSPIN 2.1>,
      <created by zg
	started at 2016-08-28 18:14:33.804 -0500,
	POWCHK enabled, PULCHK disabled,
       configuration hash MD5:
       21 0F 79 D6 B3 7B B4 F6 88 20 88 DB 03 48 BD 9F
       data hash MD5: 64K
       4A 29 A2 D8 96 FB 5E 55 F2 2F 67 1B 6E 6B A4 6B>)
(   2,<2016-08-28 18:26:07.117 -0500>,<Administrator>,<X>,<proc1d>,<TOPSPIN 2.1>,
      <Start of raw data processing
       efp LB = 0.3 FT_mod = 6 PKNL = 1 PHC0 = 0 PHC1 = 0 SI = 128K 
       data hash MD5: 128K
       6E 1A AD E0 AA 61 45 BB 5F 98 F1 46 9D 42 FE 7B>)
(   3,<2016-08-28 18:26:07.992 -0500>,<Administrator>,<X>,<proc1d>,<TOPSPIN 2.1>,
      <pk PHC0 = -87.18201 PHC1 = 0 
       data hash MD5: 128K
       81 8A 88 2A 31 B1 29 39 58 D0 A7 A2 08 BD D4 28>)
(   4,<2016-08-28 18:26:08.336 -0500>,<Administrator>,<X>,<proc1d>,<TOPSPIN 2.1>,
      <abs ABSG = 1 
       data hash MD5: 128K
       78 37 80 51 18 84 1F F2 49 B7 0C F8 72 21 55 83>)
(   5,<2016-08-28 18:26:08.445 -0500>,<Administrator>,<X>,<proc1d>,<TOPSPIN 2.1>,
      <abs ABSG = 2 
       data hash MD5: 128K
       E4 88 8C 53 2D 29 35 01 34 F8 1F EE ED FE 04 17>)
(   6,<2016-08-28 18:26:08.523 -0500>,<Administrator>,<X>,<proc1d>,<TOPSPIN 2.1>,
      <abs ABSG = 3 
       data hash MD5: 128K
       85 1E 7A 0C 6F 47 36 B3 36 CF 18 B2 48 46 EA 33>)
(   7,<2016-08-28 18:26:08.617 -0500>,<Administrator>,<X>,<proc1d>,<TOPSPIN 2.1>,
      <abs ABSG = 4 
       data hash MD5: 128K
       7E A4 0C 06 AF 7A 51 4A AF 54 F4 FE 6F 87 F9 78>)
(   8,<2016-08-28 18:26:08.695 -0500>,<Administrator>,<X>,<proc1d>,<TOPSPIN 2.1>,
      <abs ABSG = 5 
       data hash MD5: 128K
       02 B4 88 05 0C EF DF AA 0C 91 DE 95 F0 B1 EB DF>)
$$ ##END=
$$ 
$$ $$ hash MD5
$$ $$ 29 28 78 0E 80 03 1A 5B E3 D1 93 54 37 38 A6 91
##$RELAX= 
##$RELAX= 
##$RELAX= 
##$RELAX= 
##$RELAX= 
##$RELAX= 
##$RELAX= 
##$RELAX= 
$$ Bruker specific parameters
$$ --------------------------
##$DU= <E:\>
##$EXPNO= 12
$$ [...]
##$TP07= 0
##$TPNAME0= <>
##$TPNAME1= <>
##$TPNAME2= <>
##$TPNAME3= <>
##$TPNAME4= <>
##$TPNAME5= <>
##$TPNAME6= <>
##$TPNAME7= <>
##$TPOAL= (0..7)
0.5 0.5 0.5 0.5 0.5 0.5 0.5 0.5
##$TPOFFS= (0..7)
0 0 0 0 0 0 0 0
##$TUNHIN= 0
##$TUNHOUT= 0
##$TUNXOUT= 0
##$USERA1= <user>
##$USERA2= <user>
##$USERA3= <user>
##$USERA4= <user>
##$USERA5= <user>
##$V9= 5
##$VALIST= <valist>
##$VCLIST= <CCCCCCCCCCCCCCC>
##$VD= 0
##$VDLIST= <DDDDDDDDDDDDDDD>
##$VPLIST= <PPPPPPPPPPPPPPP>
##$VTLIST= <TTTTTTTTTTTTTTT>
##$WBST= 2048
##$WBSW= 25
##$XGAIN= (0..3)
0 0 0 0
##$XL= 0
##$YL= 0
##$YMAX_a= 6165575
##$YMIN_a= -12887043
##$ZGOPTNS= <>
##$ZL1= 120
##$ZL2= 120
##$ZL3= 120
##$ZL4= 120
##$ABSF1= 14.96286
##$ABSF2= -5.595322
##$ABSG= 5
##$ABSL= 3
##$ALPHA= 0
##$AQORDER= 0
##$ASSFAC= 0
##$ASSFACI= 0
##$ASSFACX= 0
##$ASSWID= 0
##$AUNMP= <proc_prof1d_extract.lims>
##$AXLEFT= 0
##$AXNAME= <>
##$AXNUC= <1H>
##$AXRIGHT= 0
##$AXTYPE= 0
##$AXUNIT= <>
##$AZFE= 0.1
##$AZFW= 0.1
##$BCFW= 0
##$BC_mod= 0
##$BYTORDP= 0
##$COROFFS= 0
##$CY= 15
##$DATMOD= 1
##$DC= 0
##$DFILT= <>
##$DTYPP= 0
##$F1P= 0
##$F2P= 0
##$FCOR= 0.5
##$FTSIZE= 131072
##$FT_mod= 6
##$GAMMA= 0
##$GB= 0
##$INTBC= 1
##$INTSCL= 1
##$ISEN= 128
##$LB= 0.3
##$LEV0= 0
##$LPBIN= 0
##$MAXI= 10000
##$MC2= 0
##$MEAN= 0
##$ME_mod= 0
##$MI= 0
##$NCOEF= 0
##$NC_proc= -2
##$NLEV= 6
##$NOISF1= 0
##$NOISF2= 0
##$NSP= 0
##$NTH_PI= 0
##$NZP= 0
##$OFFSET= 14.96286
##$PC= 1
##$PHC0= -87.18201
##$PHC1= 0
##$PH_mod= 1
##$PKNL= yes
##$PPARMOD= 0
##$PPDIAG= 0
##$PPIPTYP= 0
##$PPMPNUM= 2147483647
##$PPRESOL= 1
##$PSCAL= 4
##$PSIGN= 0
##$PYNMP= <proc.py>
##$REVERSE= no
##$SF= 400.020008893637
##$SI= 131072
##$SIGF1= 0
##$SIGF2= 0
##$SINO= 400
##$SIOLD= 131072
##$SPECTYP= <>
##$SREGLST= <1H.CDCl3>
##$SSB= 0
##$STSI= 131072
##$STSR= 0
##$SW_p= 8223.68421052631
##$SYMM= 0
##$S_DEV= 0
##$TDeff= 65536
##$TDoff= 0
##$TI= <>
##$TILT= no
##$TM1= 0
##$TM2= 0
##$TOPLEV= 0
##$USERP1= <user>
##$USERP2= <user>
##$USERP3= <user>
##$USERP4= <user>
##$USERP5= <user>
##$WDW= 1
##$XDIM= 131072
##$YMAX_p= 376643868
##$YMIN_p= -15221
##$CURPLOT= <Network HP LaserJet P1505>
##$CURPRIN= <$Network HP LaserJet P1505>
##$DFORMAT= <normdp>
##$LAYOUT= <+/1D_H.xwp>
##$LFORMAT= <normlp>
##$PFORMAT= <normpl>
##$SURQMSG= 1
$$ End of Bruker specific parameters
$$ ---------------------------------
##NTUPLES= NMR SPECTRUM
##VAR_NAME=  FREQUENCY,     SPECTRUM/REAL,   SPECTRUM/IMAG
##SYMBOL=    X,             R,               I
##VAR_TYPE=  INDEPENDENT,   DEPENDENT,       DEPENDENT
##VAR_FORM=  AFFN,          ASDF,            ASDF
##VAR_DIM=   131072,        131072,          131072
##UNITS=     HZ,            ARBITRARY UNITS, ARBITRARY UNITS
##FACTOR=    0.0627417313425164, 1,          1
##FIRST=     8223.62146879497, 34,           -42137
##LAST=      0,             2291,            -41954
##MIN=       0,             -15221,          0
##MAX=       8223.62146879497, 376643868,    0
$$ Real data points
##PAGE= N=1
##DATA TABLE= (X++(R..R)), XYDATA
$$ [...]
63365D92414J778o80k703m141n185n974o288n956n410n454o326p403q047q480
63351D22145r427j1045j2603j3335j3317j3326j3882j4627j4696j3607j1813j0281
63339B70186r547r271q777p881o930o154n395m555l894l563l241k556j690j061
63325A95671o98l02J61M67O36Q77J060Q32L16R8L87P59R58J271J816K147J939
63308B08395J560J363J088M57j23k68m77j363k326k090o05O44N44l19o52j02O77
63291B06403J103J206J281J468J631J423O51k77n50J53J171J581J210O30L25K62
63275B19671K92N21J075J755K173K176J952J797J827J926J853J469R95J002J835
63260B42319L038L702L514L176L371L768L562K775K241K368K729L073L852N254
$$ y = [492414, 494192, 493512, 490809, 486668, 481483, 475509, 469221, 463265, 457855, 452401, 446075, 438672, 430625, 422145, 412718, 401673, 389070, 375735, 362418, 349092, 335210, 320583, 305887, 292280, 280467, 270186, 260639, 251368, 242591, 234710, 227780, 221626, 216231, 211676, 207782, 204219, 200978, 198422, 196732, 195671, 194973, 194671, 194832, 195299, 195935, 196812, 197872, 198704, 199020, 199118, 199505, 200264, 201222, 202493, 204309, 206456, 208395, 209955, 211318, 212406, 212863, 212740, 212472, 211995, 210632, 208306, 206216, 205611, 206255, 206799, 206480, 205828, 205726, 206403, 207506, 208712, 209993, 211461, 213092, 214515, 215166, 214889, 214339, 214492, 215663, 217244, 218454, 219084, 219409, 219671, 219963, 220484, 221559, 223314, 225487, 227663, 229615, 231412, 233239, 235165, 237018, 238487, 239482, 240484, 242319, 245357, 249059, 252573, 255749, 259120, 262888, 266450, 269225, 271466, 273834, 276563, 279636, 283488, 288742]
63246B88742O517O919O907P456Q598R532J0006J0591J1591J2501J2935J3409J4659
63233D20363J6578J8303J9155J9245J9178J9372J9697J9704J9200J8444J7753
63222F26992J7117J6438J5915J5874J6330J6995J7599J7904J7624J6654J5184
63211H10626J3226J0347O400K193j290m285p971j2796j7834k1973k4930k6771
63199G24942k7289k6415k4770k3109k1546j9701j7339j4477j1234p969n216l081
63187E22796j011J412L812N602O951Q475J0266J1826J2960J4003J5123J5966J6227
63174F44408J6080J5814J5439J4954J4641J4716J4929J4777J4056J2849J1160
63163H03823Q886O208L566J034j923n776j0115j3958j6811j9019k1013k2639k3480
$$ y = [288742, 295259, 302178, 309085, 316541, 325139, 334671, 344677, 355268, 366859, 379360, 392295, 405704, 420363, 436941, 455244, 474399, 493644, 512822, 532194, 551891, 571595, 590795, 609239, 626992, 644109, 660547, 676462, 692336, 708666, 725661, 743260, 761164, 778788, 795442, 810626, 823852, 834199, 840599, 842792, 841502, 837217, 829246, 816450, 798616, 776643, 751713, 724942, 697653, 671238, 646468, 623359, 601813, 582112, 564773, 550296, 539062, 531093, 525877, 522796, 521785, 523197, 527009, 532611, 539562, 548037, 558303, 570129, 583089, 597092, 612215, 628181, 644408, 660488, 676302, 691741, 706695, 721336, 736052, 750981, 765758, 779814, 792663, 803823, 812709, 818917, 822483, 823517, 821594, 815818, 805703, 791745, 774934, 755915, 734902, 712263, 688783]
63150F88783k3482k2873k1718k0004j7973j6012j4260j2722j1579j0921j0281
63139E06958r079p621o906p168p225n858l430j527j165j872k521k525k008j257
63125D46796m07M15R95J233J313J491J773J974K131K539L225L703L589L222L242
63110D77234L719M150M264M250M130L598K747K319K758L401L236K208J288J196
63096E20498J681K091K266K545L094L575L516K845J996J477J466J774K136K440
63082E53400K696K956L225L473L739M154M753N310N592N722N952O072N633M955
63068F17632N180O801Q793R988J0791J2453J4953J6917J7736J8509K0429K3242
63056G83424K5934K8097K9892L1419L2854L4676L6993L9071M0241M0874M1691
$$ y = [688783, 665301, 642428, 620710, 600706, 582733, 566721, 552461, 539739, 528160, 517239, 506958, 497879, 490258, 483352, 476184, 468959, 463101, 459671, 458144, 456979, 455107, 452586, 450061, 448053, 446796, 446389, 446804, 447799, 449032, 450345, 451836, 453609, 455583, 457714, 460253, 463478, 467181, 470770, 473992, 477234, 480953, 485103, 489367, 493617, 497747, 501345, 504092, 506411, 509169, 512570, 515806, 518014, 519302, 520498, 522179, 524270, 526536, 529081, 532175, 535750, 539266, 542111, 544107, 545584, 547050, 548824, 550960, 553400, 556096, 559052, 562277, 565750, 569489, 573643, 578396, 583706, 589298, 595020, 600972, 607044, 612677, 617632, 622812, 629613, 638406, 648394, 659185, 671638, 686591, 703508, 721244, 739753, 760182, 783424, 809358, 837455, 867347, 898766, 931620, 966296, 1003289, 1042360, 1082601, 1123475, 1165166]
63045A165166M2519M2575M1790M0968M0638M0523M0220L9736L9180L8517L7807
63034A609639L7259L6818L6097L4843L3129L0918K7714K2889J6185P884j399j0967
63022A881009k0314k9170l7313m4432n0290n4804n7797n8948n8260n6275n3437
63011A359969m9493m4116l7928l2208k7401k2640j7052j0985n430o65L889Q565
62999A124505J2945J6585J9685K2547K4859K6164K6875K8007K9702L0817L0433
62988A393124K9104K7868K6621K4579K1951J9807J8122J5352J0528M623j020o556
62976A584103j2916j9976k6752l2968l9127m5115m9878n2734n4063n4472n4043
62965A142059n2638n0297m7094m3209l9273l6033l3471l0826k7673k4403k1445
$$ y = [1165166, 1207685, 1250260, 1292050, 1333018, 1373656, 1414179, 1454399, 1494135, 1533315, 1571832, 1609639, 1646898, 1683716, 1719813, 1754656, 1787785, 1818703, 1846417, 1869306, 1885491, 1893375, 1891976, 1881009, 1860695, 1831525, 1794212, 1749780, 1699490, 1644686, 1586889, 1527941, 1469681, 1413406, 1359969, 1310476, 1266360, 1228432, 1196224, 1168823, 1146183, 1129131, 1118146, 1112716, 1112051, 1115940, 1124505, 1137450, 1154035, 1173720, 1196267, 1221126, 1247290, 1274165, 1302172, 1331874, 1362691, 1393124, 1422228, 1450096, 1476717, 1501296, 1523247, 1543054, 1561176, 1576528, 1587056, 1591679, 1590659, 1584103, 1571187, 1551211, 1524459, 1491491, 1452364, 1407249, 1357371, 1304637, 1250574, 1196102, 1142059, 1089421, 1039124, 992030, 948821, 909548, 873515, 840044, 809218, 781545, 757142, 735697]
62954G35697j8757j6321j4467j3274j2230j0948r713q823p912o556n205m702n050
62941F01739n384n185m886n063n541n697n324m847m698m799m702m138l287k599
62927E35589k356k522k901l378l932m493m894n035n038n137n303n131m297l088
62913D78084k254k247k802l330l463l105k303j345p11n85n49r2O22Q37R4j223
62897D55628k237k404j919j445j454j880k439l057l698l960l470k668k488l033
62883D19476l332k872k491l049l873l635k273r00m4P97J789K255J832J117O15
62868D05412m0j198k327k604j906o82O41J597J660Q79J34R3K99j05j029j552j204
62851C98068m73l8q4m08p59r34q68o91n15k30K25N10K32m35q22n15K16Q12R92
$$ y = [735697, 716940, 700619, 686152, 672878, 660648, 649700, 639987, 631164, 623252, 616696, 611491, 606789, 601739, 596355, 591170, 586284, 581221, 575680, 569983, 564659, 559812, 555114, 550315, 545613, 541475, 538188, 535589, 533233, 530711, 527810, 524432, 520500, 516007, 511113, 506078, 501040, 495903, 490600, 485469, 481172, 478084, 475830, 473583, 470781, 467451, 463988, 460883, 458580, 457235, 456524, 455939, 455390, 455298, 455920, 456757, 456851, 455628, 453391, 450987, 449068, 447623, 446169, 444289, 441850, 438793, 435095, 431135, 427665, 424997, 422509, 419476, 416144, 413272, 410781, 407732, 403859, 400224, 397951, 397051, 397007, 397804, 399593, 401848, 403680, 404797, 405412, 405372, 404174, 401847, 399243, 397337, 396655, 397296, 398893, 400553, 401432, 401566, 401659, 401958, 401853, 400824, 399272, 398068, 397595, 397557, 397473, 397065, 396306, 395372, 394504, 393813, 393298, 393068, 393293, 393803, 394035, 393600, 392778, 392263, 392479, 393291, 394283]
62832C94283Q95Q44J012J181R14J17o60p46j37N10O88N46M55M16K02q4N0Q06J680
62813D02972J993J750J562J744J928J837J905K700L998N093N848O731P810Q498
62799D56369Q584Q744R568J0690J1479J2171J3495J5436J7177J8285J9324K1084
62787F22406K3779K7132L0823L4563L8107M1541M5300M9586N3984N7953O1519
62776A086693O5024O8268P0356P0635O9341O7046O3686N8659N1732M3281L3540
62765A748261K2286R644l305j5292k6033l6102m5758n4483o1646o7030p0577p2179
62753A327786p2014p0674o8618o5862o2333n8297n4099m9782m5284m0835l6882
62742G03106l3709l1222k9016k6562k3618k0577j8151j6547j5218j3628j1952
$$ y = [394283, 395178, 396022, 397034, 398215, 399129, 399246, 398586, 397840, 397703, 398213, 398901, 399447, 399902, 400318, 400520, 400436, 400486, 401292, 402972, 404965, 406715, 408277, 410021, 411949, 413786, 415691, 418391, 422389, 427482, 433330, 440061, 447871, 456369, 464953, 473697, 483265, 493955, 505434, 517605, 531100, 546536, 563713, 581998, 601322, 622406, 646185, 673317, 704140, 738703, 776810, 818351, 863651, 913237, 967221, 1025174, 1086693, 1151717, 1219985, 1290341, 1360976, 1430317, 1497363, 1561049, 1619708, 1671440, 1714721, 1748261, 1770547, 1780191, 1776886, 1761594, 1735561, 1699459, 1653701, 1599218, 1537572, 1470542, 1399965, 1327786, 1255772, 1185098, 1116480, 1050618, 988285, 929988, 875889, 826107, 780823, 739988, 703106, 669397, 638175, 609159, 582597, 558979, 538402, 520251, 503704, 488486, 474858, 462906]
62731D62906j0753j0158r666q672p007n119l808l516l693l186j505N48J865K324
62717D00560K723L605M616N185N384N932P404R550J1514J2783J3809J5439J7830
62704E16334K0413K2913K5800K9433L3371L6952M0180M3456M6765M9678N1964
62693I17259N3587N4286N3689N1758M8657M4271L8411L1346K3533J4880N022n660
62681A331039j5961k5067l3098m0246m6050n0037n2513n4120n4943n4635n3236
62670H51133n1267m9002m6214m2737l8969l5525l2622k9944k7114k4171k1548
62659D52020j9552j7995j6435j4747j3204j1986j0919r829q824q044p362o642
62647C06481o080n881n729n049l848k883k796l395l965m028l556k736j884j400
$$ y = [462906, 452153, 441995, 432329, 423657, 416650, 411531, 407723, 404207, 400514, 397328, 395823, 396371, 398236, 400560, 403283, 406888, 411504, 416689, 422073, 428005, 435409, 444959, 456473, 469256, 483065, 498504, 516334, 536747, 559660, 585460, 614893, 648264, 685216, 725396, 768852, 815617, 865295, 917259, 970846, 1025132, 1078821, 1130579, 1179236, 1223507, 1261918, 1293264, 1316797, 1331677, 1336699, 1331039, 1315078, 1290011, 1256913, 1216667, 1170617, 1120580, 1068067, 1013947, 959004, 904369, 851133, 799866, 750864, 704650, 661913, 622944, 587419, 554797, 524853, 497739, 473568, 452020, 432468, 414473, 398038, 383291, 370087, 358101, 347182, 337353, 328529, 320485, 313123, 306481, 300401, 294520, 288791, 283742, 279894, 277011, 274215, 270820, 266855, 262827, 259271, 256535, 254651, 253251]
62633B53251j464j724j704j459j522k135k876l166k846k067j007j2M23K07J6N02
62617B32417J318J507R05N63J478L368N086N867N856N613N581N963O754P800R009
62602B99085J0543J2560J4809J6715J8000J9106K0844K3618K7031L0275L2777
62591E25363L4457L5464L5892L5835L5425L4517L2478K8639K3022J6393R602L072
62579H50159l110q911j4252j8996k2936k5960k8210k9861l0795l0809l0064k9026
62567E77229k7887k6472k4740k2971k1311j9593j7756j5999j4370j2692j1127
62556C62311j0225j0011r650q585p519p499q288q542p542n990m899m341l754k972
62542B62494k459k592l062l126k401j238l17J19L95Q05J218J507J983L085M725
$$ y = [253251, 251787, 250063, 248359, 246900, 245378, 243243, 240367, 237201, 234355, 232288, 231281, 231269, 231692, 231899, 231915, 232417, 233735, 235242, 236147, 236710, 238188, 241556, 246642, 252509, 258365, 263978, 269559, 275522, 282276, 290076, 299085, 309628, 322188, 336997, 353712, 371712, 390818, 411662, 435280, 462311, 492586, 525363, 559820, 595284, 631176, 667011, 702436, 736953, 769431, 798070, 821092, 837485, 847087, 850159, 847049, 838138, 823886, 804890, 781954, 755994, 727784, 697923, 667128, 636319, 606255, 577229, 549342, 522870, 498130, 475159, 453848, 434255, 416499, 400500, 386130, 373438, 362311, 352086, 342075, 332425, 323840, 316321, 308822, 300534, 291992, 284450, 278460, 273561, 269220, 265466, 262494, 260035, 257443, 254381, 251255, 248854, 247616, 247299, 247418, 247813, 248618, 249836, 251343, 253326, 256411, 261136]
62527B61136O332P459Q095Q452Q734R074R539J0246J1500J3606J6318J8876K0798
62514D10165K2409K4210K6037K7337K8044K8571K9065K9181K8576K7106K4527
62503G05228K0605J5596J0238N026j16n334j0457j5217j9511k3176k5850k7265
62491F29767k7544k7062k6171k5114k4003k2749k1204j9385j7473j5571j3759
62480C89732j2201j0987r837q360o601m983l712k568j409m80j4J85N21J140J898
62465C32324K601L158L578L924M250M568M936N499O290P103P738Q248Q705Q859
62451D11781Q364P246N846M419L032J685J49k064n023p838r503j0181j0976j2280
62437C84657j3220j2968j1865j0790j0031r318q438p313n835m201l041k686k554
$$ y = [261136, 267468, 274927, 283022, 291474, 300208, 309282, 318821, 329067, 340567, 354173, 370491, 389367, 410165, 432574, 456784, 482821, 510158, 538202, 566773, 595838, 625019, 653595, 680701, 705228, 725833, 741429, 751667, 756693, 756577, 751243, 740786, 725569, 706058, 682882, 657032, 629767, 602223, 575161, 548990, 523876, 499873, 477124, 455920, 436535, 419062, 403491, 389732, 377531, 366544, 356707, 348347, 341746, 336763, 333051, 330483, 329074, 328594, 328580, 328765, 329286, 330426, 332324, 334925, 338083, 341661, 345585, 349835, 354403, 359339, 364838, 371128, 378231, 385969, 394217, 402922, 411781, 420145, 427391, 433237, 437656, 440688, 442373, 442522, 440458, 435435, 427597, 418094, 407913, 396937, 384657, 371437, 358469, 346604, 335814, 325783, 316465, 308027, 300714, 294879, 290678, 287637, 284951, 282397]
62424B82397j798l55J163K382L410M277M785N035N530O549P710Q381Q424Q348
62410C46238Q749R611J0192R790Q599P449O646N553L636J438m7o88j228k124l062
62395D10752l732m324n040n627n768n587n387n184m769m060l034j560L96K523
62381C59599M489O406Q651J1202J3566J5456J7224J9451K2331K5576K8775L1623
62369E64349L4003L6097L8273M0555M2254M2435M0836L7997L4517L0420K5376
62358I67112J9258J2298N041j692p214j1661j5965k0678k5126k8194k9752l0676
62346H32751l1543l2017l1646l0553k9020k6994k4507k2075k0146j8466j6578
62335E49206j4677j3375j2688j1943j0762r541q735q145p371o553o163o075n415
$$ y = [282397, 280599, 280244, 281407, 283789, 287199, 291476, 296261, 301296, 306826, 313375, 321085, 329466, 337890, 346238, 354987, 364598, 374790, 384580, 393179, 400628, 407274, 412827, 416463, 417901, 417854, 417166, 415938, 413814, 410752, 407020, 402696, 397656, 392029, 386261, 380674, 375287, 370103, 365334, 361274, 358240, 356680, 357076, 359599, 364088, 370494, 379145, 390347, 403913, 419369, 436593, 456044, 478375, 503951, 532726, 564349, 598352, 634449, 672722, 713277, 755531, 797966, 838802, 876799, 911316, 941736, 967112, 986370, 998668, 1003709, 1002017, 994803, 983142, 967177, 946499, 921373, 893179, 863427, 832751, 801208, 769191, 737545, 706992, 677972, 650978, 626471, 604396, 584250, 565784, 549206, 534529, 521154, 508466, 496523, 485761, 476220, 467485, 459340, 451969, 445416, 439253, 433178, 427763]
62322D27763l571j050R32J683J576J345J136N15p19k047k792k931l166m111n536
62307D09027o554o592o105o137p083q131q203p240o131n397m563l159j747j284
62293C30701j597j389J26K143L334L476L490M082N013N757O260O772P375Q062
62279C83605Q977J0128J1098J1501J1640J2239J3489J4851J5925J7077J8922K1466
62267E50918K4122K6350K8034K9318L0290L0812L0548K9182K6723K3436J9430
62256H49163J4558Q892L045k219o622j0443j4088j7697k1121k4114k6535k8374
62244G24445k9527k9702k8821k7352k5804k4083k1778j9118j6799j4881j2638
62233D73942r957p900p261p234o412m601k860k069k230k860l333l102k286j759
$$ y = [427763, 424192, 423142, 424074, 425757, 427333, 428678, 429814, 430329, 429610, 427563, 424771, 421840, 418674, 414563, 409027, 402473, 395881, 389776, 383639, 376556, 368425, 360222, 352982, 346851, 341454, 336891, 333732, 331985, 330701, 329104, 327715, 327841, 329984, 333318, 336794, 340284, 344366, 349379, 355136, 361396, 368168, 375543, 383605, 392582, 402710, 413808, 425309, 436949, 449188, 462677, 477528, 493453, 510530, 529452, 550918, 575040, 601390, 629424, 658742, 689032, 719844, 750392, 779574, 806297, 829733, 849163, 863721, 872613, 875658, 873439, 866817, 856374, 842286, 824589, 803468, 779354, 752819, 724445, 694918, 665216, 636395, 609043, 583239, 559156, 537378, 518260, 501461, 486580, 473942, 463985, 456085, 448824, 441590, 435178, 430577, 427717, 425648, 423418, 420558, 417225, 414123, 411837, 410078]
62219D10078j986k185j429r0Q25J240J762K224J980J497K041L650M929N242N531
62204D35309O439P154P002O792P492Q733R713J0596J1844J3070J3845J4745J6250
62191E68984J7315J6588J4542J2853J1888J0495Q280O420N816N902N978O476Q105
62178F99642J0577J3049J5234J7353J9395K1159K2658K3894K4342K3267K0582
62167I11152J7064J3675J0860Q462O150L874J902L76j025k724m600o070o902p504
62153I44690q244q833q717p848o686n552m406l278k514k389k728l186l689m259
62139H72361m572m232l528l324l848m129l166j353l8J78K3M76J785L652N636P120
62123H63041P537P073O696P166Q346R723J1155J2720J4310J5801J7247J8589J9568
$$ y = [410078, 408092, 405907, 404478, 404388, 405213, 406453, 408215, 410439, 412419, 413916, 415957, 419607, 424536, 429778, 435309, 441748, 448902, 455904, 462696, 470188, 478921, 488634, 499230, 511074, 524144, 537989, 552734, 568984, 586299, 602887, 617429, 630282, 642170, 652665, 660945, 667365, 673181, 679083, 685061, 691537, 699642, 710219, 723268, 738502, 755855, 775250, 796409, 819067, 842961, 867303, 890570, 911152, 928216, 941891, 952751, 961213, 967363, 971237, 973139, 973515, 972490, 969766, 965166, 959096, 952194, 944690, 936446, 927613, 918896, 911048, 904362, 898810, 894404, 891126, 888612, 886223, 883495, 880309, 876620, 872361, 867789, 863557, 860029, 856705, 852857, 848728, 845562, 844209, 844171, 844349, 844372, 844848, 846633, 850285, 855921, 863041, 870578, 877651, 884347, 891513, 899859, 909582, 920737, 933457, 947767, 963568, 980815, 999404, 1018972]
62110A018972K0225K1086K2504K4159K5598K6749K7598K7793K7096K5831K4465
62099A292076K3160K2129K1898K2683K3937K5024K5834K6276K5806K4321K2826
62088A555970K2400K2899K3540K4368K5931K7829K8817K8524K8011K8345K9429
62077A846063L0474L0909L0581K9680K8767K8391K8534K8796K8926K8752K7785
62066B167658K5645K2827K0286J8278J6353J4370J2721J1481J0210Q800P682P026
62054B343337O456N846N528N556N470N162N206N980P060P826Q088P874P260O619
62040B433268O396O344N694M331L055K371J868J149M68n2r41k433l786m297m349
62025B449086m628n035n179n347n969o564o251n075l901l116k366j485q05m08
$$ y = [1018972, 1039197, 1060283, 1082787, 1106946, 1132544, 1159293, 1186891, 1214684, 1241780, 1267611, 1292076, 1315236, 1337365, 1359263, 1381946, 1405883, 1430907, 1456741, 1483017, 1508823, 1533144, 1555970, 1578370, 1601269, 1624809, 1649177, 1675108, 1702937, 1731754, 1760278, 1788289, 1816634, 1846063, 1876537, 1907446, 1938027, 1967707, 1996474, 2024865, 2053399, 2082195, 2111121, 2139873, 2167658, 2193303, 2216130, 2236416, 2254694, 2271047, 2285417, 2298138, 2309619, 2319829, 2328629, 2336311, 2343337, 2349793, 2355639, 2361167, 2366723, 2372193, 2377355, 2382561, 2388541, 2395601, 2403427, 2411515, 2419389, 2426649, 2433268, 2439664, 2446008, 2451702, 2456033, 2459088, 2461459, 2463327, 2464476, 2464944, 2464892, 2463951, 2461518, 2457732, 2453435, 2449086, 2444458, 2439423, 2434244, 2428897, 2422928, 2416364, 2410113, 2405038, 2401137, 2398021, 2395655, 2394170, 2393365, 2392957]
62011B392957J45J200K644M236N740O768P081P058P294P607P149N622L791K458
61997B461750J397k33k796n843q670j0860j2389j3447j4271j4941j5336j5279
61985B349082j4760j4048j3619j3867j4778j5881j6598j6704j6462j6404j6917
61974B179044j7886j8697j8808j8304j7726j7368j7043j6644j6482j6818j7304
61963A985964j7284j6462j5110j3699j2578j1843j1367j0957j0597j0347j0021
61952A845699r246p973o676n784n207m537l489j999j92J544K778L626M717O374
61938A819635Q177R623J0819J2145J3655J5392J7807K1186K4802K7552K9392L1522
61926B041707L4968L9681M5223N1756N9871O9749Q0983R3224J06748J22356J40660
$$ y = [2392957, 2393102, 2394302, 2396946, 2401182, 2406922, 2413690, 2420771, 2427829, 2435123, 2442730, 2449879, 2455501, 2459292, 2461750, 2463147, 2462914, 2460118, 2454275, 2445605, 2434745, 2422356, 2408909, 2394638, 2379697, 2364361, 2349082, 2334322, 2320274, 2306655, 2292788, 2278010, 2262129, 2245531, 2228827, 2212365, 2195961, 2179044, 2161158, 2142461, 2123653, 2105349, 2087623, 2070255, 2053212, 2036568, 2020086, 2003268, 1985964, 1968680, 1952218, 1937108, 1923409, 1910831, 1898988, 1887621, 1876664, 1866067, 1855720, 1845699, 1836453, 1828480, 1821804, 1816020, 1810813, 1806276, 1802787, 1800788, 1800596, 1802140, 1804918, 1808544, 1813261, 1819635, 1827812, 1837435, 1848254, 1860399, 1874054, 1889446, 1907253, 1928439, 1953241, 1980793, 2010185, 2041707, 2076675, 2116356, 2161579, 2213335, 2273206, 2342955, 2423938, 2517162, 2623910, 2746266, 2886926]
61915B886926J61548J84468K09370K36971K67709L00727L34514L68419M02696
61906E353348M36580M66885M88783M97396M88176M56648L99446L16428K11550
61897I115240R1652l5095j59719k73047l67614m39484m87942n13741n18530n05910
61887E905810m81479m50609m16325l79856l42741l07312k75257k46579k20364
61878B785288j96019j73683j53863j36907j22486j09567r7318q6045p6732o9588
61868A563080o3630n7787n1906m6396m1471l7065l3104k9486k6053k2761j9656
61857A133765j6681j3858j1573j0030q608o575m441l550m064m569m145l583l776
61844A038312m050l354k100j437j327q66q8J41p9N02K341M321N257N174M682M079
$$ y = [2886926, 3048474, 3232942, 3442312, 3679283, 3946992, 4247719, 4582233, 4950652, 5353348, 5789928, 6256813, 6745596, 7242992, 7731168, 8187816, 8587262, 8903690, 9115240, 9206892, 9171797, 9012078, 8739031, 8371417, 7931933, 7443991, 6930250, 6411720, 5905810, 5424331, 4973722, 4557397, 4177541, 3834800, 3527488, 3252231, 3005652, 2785288, 2589269, 2415586, 2261723, 2124816, 2002330, 1892763, 1795445, 1709400, 1632668, 1563080, 1499450, 1441663, 1389757, 1343361, 1301890, 1264825, 1231721, 1202235, 1176182, 1153421, 1133765, 1117084, 1103226, 1091653, 1081623, 1073015, 1066440, 1061999, 1058449, 1054385, 1049816, 1045671, 1042088, 1038312, 1034262, 1030908, 1028808, 1027371, 1026044, 1025178, 1025090, 1025231, 1025152, 1025654, 1027995, 1032316, 1037573, 1042747, 1047429, 1051508]
61828A051508L537L331L419L460L623M580O353P994Q834R346J0250J1531J2892
61815A140658J4544J6740J9063K0882K2253K3745K5693K8129L1225L5166L9751
61804A417849M4538M9289N3937N8417O2920O8062P4395Q1875R0198R9313J09305
61793B210098J20105J31911J45504J61616J80191K00913K24268K51310K82529
61784C908445L17667L56597L99596M46627M97214N51206O08784O69121P29578
61775H484835P86601Q36454Q74017Q91263Q78192Q26034P29885N89525M09641
61766A5306447K00204k4121k46467m50945o24861p59709q51669r01608r14249
61757A0733022q96648q56581q01367p37259o69522o02633n39871m82603m30537
$$ y = [1051508, 1055045, 1058376, 1061795, 1065255, 1068878, 1073458, 1079811, 1087805, 1096639, 1105985, 1116235, 1127766, 1140658, 1155202, 1171942, 1191005, 1211887, 1234140, 1257885, 1283578, 1311707, 1342932, 1378098, 1417849, 1462387, 1511676, 1565613, 1624030, 1686950, 1755012, 1829407, 1911282, 2001480, 2100793, 2210098, 2330203, 2462114, 2607618, 2769234, 2949425, 3150338, 3374606, 3625916, 3908445, 4226112, 4582709, 4982305, 5428932, 5926146, 6477352, 7086136, 7755257, 8484835, 9271436, 10107890, 10981907, 11873170, 12751362, 13577396, 14307281, 14896806, 15306447, 15506651, 15482530, 15236063, 14785118, 14160257, 13400548, 12548879, 11647271, 10733022, 9836374, 8979793, 8178426, 7441167, 6771645, 6169012, 5629141, 5146538, 4716001]
61748D716001l83127l40511l02870k69579k39706k13123j90243j70740j53397
61739B452705j37416j23086j10797j00087r0172q0976p2952o6217o0344n4883
61729A555775m9630m4557l9788l5596l2135k9302k6957k5045k3339k1468j9497
61718A208461j7992j7190j6551j5627j4835j4724j4849j4239j2823j1520j1009
61707A047102j1098j1461j2094j2839j3157j2749j1948j1183j0552j0090r964
61696I19967j0080r989r527r091q898q437p195n562m511m427m789m886m512l907
61682H24156l375l100l152l543m178m748m824m252l524l326l737m089l781k902
61668G71625j903j083o64r65k050l382m240m391m044l404k651k224k518l192l417
$$ y = [4716001, 4332874, 3992363, 3689493, 3419914, 3180208, 2967085, 2776842, 2606102, 2452705, 2315289, 2192203, 2081406, 1981319, 1891147, 1810171, 1737219, 1671002, 1610658, 1555775, 1506145, 1461588, 1421800, 1386204, 1354069, 1324767, 1297810, 1272765, 1249426, 1227958, 1208461, 1190469, 1173279, 1156728, 1141101, 1126266, 1111542, 1096693, 1082454, 1069631, 1058111, 1047102, 1036004, 1024543, 1012449, 999610, 986453, 973704, 961756, 950573, 940021, 929931, 919967, 909887, 899898, 890371, 881280, 872382, 863945, 856750, 851188, 846677, 842250, 837461, 832575, 828063, 824156, 820781, 817681, 814529, 810986, 806808, 802060, 797236, 792984, 789460, 786134, 782397, 778308, 774527, 771625, 769722, 768639, 767975, 767010, 764960, 761578, 757338, 752947, 748903, 745499, 742848, 740624, 738106, 734914, 731497]
61653G31497k933k498k922l951m590m298l488k845k583k577k772l093l125k387
61639F87435r81L94J233J720K225K704K988L342M165N193N632N229M691M741N213
61624G35924N425N091M392L368J842l0j642k566l043l607m449n283n771n818n636
61609G18197n602o037o870p584p684p242o749o378n764m643l511l148l642m258
61595F39085m332l912l364k823k237j665j118l59P57J920K718L229L905M829N616
61580F42249O091O618P569Q757R760J0556J1525J2867J4327J5606J6802J8213
61568G80940J9719K0706K0753K0227J9831J9641J8980J7420J5475J4008J3264
61557I80964J2830J2353J1848J1468J1306J1382J1511J1273J0471R511Q910Q520
$$ y = [731497, 728564, 726066, 723144, 719193, 714603, 710305, 706817, 703972, 701389, 698812, 696040, 692947, 689822, 687435, 686454, 686848, 688081, 689801, 692026, 694730, 697718, 701060, 705225, 710418, 716050, 721279, 725970, 730711, 735924, 741349, 746440, 750832, 754200, 756042, 756012, 754370, 751804, 748761, 745154, 740705, 735422, 729651, 723833, 718197, 712595, 706558, 699688, 692104, 684420, 677178, 670429, 664051, 658287, 653644, 650133, 646985, 643343, 639085, 634753, 630841, 627477, 624654, 622417, 620752, 619634, 619275, 620032, 621952, 624670, 627899, 631804, 636633, 642249, 648340, 654958, 662527, 671284, 681044, 691600, 703125, 715992, 730319, 745925, 762727, 780940, 800659, 821365, 842118, 862345, 882176, 901817, 920797, 938217, 953692, 967700, 980964, 993794, 1006147, 1017995, 1029463, 1040769, 1052151, 1063662, 1074935, 1085406, 1094917, 1103827, 1112347]
61545A112347P707O326M993M160L339J618j268m550p131q579r456j0627j2229
61532A086650j3530j3934j3718j3393j2742j1155q791o586n019l633j970k43J342
61519I83278L278O174R859J3619J7141K0766K4957K9897L5456M1252M6887N2434
61507A284998N8528O5685P3760Q2383R1623J01775J12739J24111J35855J48255
61497B279712J61116J73360J83546J90360J92443J88303J76910J58269J33213
61488C837232J02773O8185L1410m879l8219o7122r0869j08812j20456j26142j27178
61477C355923j24929j20098j13118j04846r6324q7903p9255p0350o1964n4897
61467B442239m9007m3355l7166l0427k3641j7270j1372n612M37O861J3252J8943
$$ y = [1112347, 1120054, 1126380, 1131373, 1135533, 1138872, 1140490, 1139222, 1134672, 1127541, 1118962, 1109506, 1098879, 1086650, 1073120, 1059186, 1045468, 1032075, 1019333, 1008178, 999387, 992801, 987782, 984149, 982179, 981936, 983278, 986556, 992730, 1002589, 1016208, 1033349, 1054115, 1079072, 1108969, 1144425, 1185677, 1232564, 1284998, 1343526, 1409211, 1482971, 1565354, 1656977, 1758752, 1871491, 1995602, 2131457, 2279712, 2440828, 2614188, 2797734, 2988094, 3180537, 3368840, 3545750, 3704019, 3837232, 3940005, 4008190, 4039600, 4034721, 3996502, 3929380, 3838511, 3729699, 3609243, 3483101, 3355923, 3230994, 3110896, 2997778, 2892932, 2796608, 2708705, 2629450, 2559100, 2497136, 2442239, 2393232, 2349877, 2312711, 2282284, 2258643, 2241373, 2230001, 2224389, 2224826, 2231687, 2244939, 2263882]
61455B263882K3462K6738K8936L0159L0392K9836K9133K8939K9262K9584K9780
61444B580103L0464L2129L4301L6087L7241L8077L8590L8388L7542L6658L5917
61433B975497L4691L2505K9655K6486K2553J7205J0680M028k027p614j3110j8424
61421C112125k3106k6867k9797l2157l4089l5621l6781l7460l7172l5347l2088
61410B751640k8328k4876k1542j7666j3236q924n202k133N2R60P49P9q19k361
61396B628393m635o997q858j0133j0529r234o009j730K875Q396J5847K5138L5407
61383B657931M6442N8731P2297Q6508J01004J15891J30983J45724J59992J73999
61373C749502J87003J96947K01872K01083J94523J81657J61784J35225J03567
$$ y = [2263882, 2287344, 2314082, 2343018, 2373177, 2403569, 2433405, 2462538, 2491477, 2520739, 2550323, 2580103, 2610567, 2642696, 2676997, 2713084, 2750325, 2788402, 2826992, 2865380, 2902922, 2939580, 2975497, 3010188, 3042693, 3072348, 3098834, 3121387, 3138592, 3149272, 3153300, 3151273, 3143659, 3130549, 3112125, 3089019, 3062152, 3032355, 3000198, 2966109, 2930488, 2893707, 2856247, 2819075, 2783728, 2751640, 2723312, 2698436, 2676894, 2659228, 2645992, 2637068, 2631866, 2629733, 2629785, 2630745, 2631494, 2631573, 2630754, 2628393, 2623758, 2616761, 2607903, 2597770, 2587241, 2578007, 2571998, 2570268, 2573143, 2581539, 2597386, 2622524, 2657931, 2704373, 2763104, 2835401, 2921909, 3022913, 3138804, 3269787, 3415511, 3575503, 3749502, 3936505, 4133452, 4335324, 4536407, 4730930, 4912587, 5074371, 5209596, 5313163]
61364E313163O8804L2683l200l7326o8619r6704j21583j43110j60868j74517j84129
61353D424594j90118j92938j92894j90197j85027j77592j68226j57426j45719
61344B824457j33535j21314j09617r8788q8551p8282o7737n7301m7477l8431l0104
61333A953320k2363j4950p627n56N869J1607J7003K2099K6487L0093L3489L6982
61321B091453L9943M1575M1911M1455M0287L8204L5443L2459K9115K4889J9922
61310B476656J5160J1373Q578O523N154M412M013L644L124K228O95j495m137p136
61296B528792j0583j4446j8489k2459k6192k9502l2237l4325l5665l6159l6056
61285B232679l5922l5846l5047l2852k9816k7130k5087k2827j9684j5967j2301
$$ y = [5313163, 5381967, 5414650, 5411450, 5374124, 5305505, 5208801, 5087218, 4944108, 4783240, 4608723, 4424594, 4234476, 4041538, 3848644, 3658447, 3473420, 3295828, 3127602, 2970176, 2824457, 2690922, 2569608, 2459991, 2361203, 2272652, 2194370, 2126633, 2069332, 2021855, 1983424, 1953320, 1930957, 1916007, 1908380, 1907824, 1913693, 1925300, 1942303, 1964402, 1990889, 2020982, 2054471, 2091453, 2131396, 2172971, 2214882, 2256337, 2296624, 2334828, 2370271, 2402730, 2431845, 2456734, 2476656, 2491816, 2503189, 2511767, 2518290, 2523444, 2527856, 2531869, 2535513, 2538637, 2540865, 2541560, 2540065, 2535928, 2528792, 2518209, 2503763, 2485274, 2462815, 2436623, 2407121, 2374884, 2340559, 2304894, 2268735, 2232679, 2196757, 2160911, 2125864, 2093012, 2063196, 2036066, 2010979, 1988152, 1968468, 1952501, 1940200]
61274A940200q937o076m216l718m430n959q039j0416j2850j5413j8279k1000k2494
61261A798373k2089k0164j7322j3480q269j914M946J2124J9945K8464L7151M5505
61249A863270N3535O1532O9650P7800Q5754R3073R9021J02643J03030R9640R2423
61238B801371Q1646O7514N0112K9698P030j6686l9988o1380p9633r4019j04188
61227B641477j09801j10654j07313j01305r4284q7114p9964p3124o7270o2832
61217A747816n9453n6331n2896m9000m4641l9790l4539k9124k3693j8215j2761
61206A327373p844m186k112j256r70r10j149j783k578l112l209l135l273l655
61192A288201m033m356m935n951p078p905q554r486j0849j2400j3959j5519j6916
$$ y = [1940200, 1931263, 1925187, 1920971, 1917253, 1912823, 1906864, 1898825, 1888409, 1875559, 1860146, 1841867, 1820867, 1798373, 1776284, 1756120, 1738798, 1725318, 1717049, 1715135, 1720081, 1732205, 1752150, 1780614, 1817765, 1863270, 1916805, 1978337, 2047987, 2125787, 2211541, 2304614, 2403635, 2506278, 2609308, 2708948, 2801371, 2883017, 2950531, 3000643, 3030341, 3037371, 3020685, 2980697, 2919317, 2839684, 2745665, 2641477, 2531676, 2421022, 2313709, 2212404, 2118120, 2031006, 1951042, 1877918, 1810648, 1747816, 1688363, 1632032, 1579136, 1530136, 1485495, 1445705, 1411166, 1382042, 1358349, 1340134, 1327373, 1319529, 1315343, 1313231, 1311975, 1311005, 1310095, 1308946, 1307163, 1304585, 1301473, 1298264, 1295129, 1291856, 1288201, 1284168, 1279812, 1274877, 1268926, 1261848, 1253943, 1245389, 1235903, 1225054, 1212654, 1198695, 1183176, 1166260]
61179A166260j7940j8764j9748k0765k1266k1104k0702k0190j9221j7872j6877
61168I51811j6452j5690j3869j1641j0115r306q570q059q621j0317j2229j3791
61156H13151j5362j7243j9039k0297k1084k1591k1773k1602k1133k0098j8078
61145E95851j5306j2653j0641q976p375o114n350m535l117j403j41N16J117K164
61131E24037L684N422P058Q314R119R647J0120J0652J1367J2373J3543J4540J5208
61118F55084J5549J5358J4262J2372J0415Q860P258M897J853j069l319n011o333
61105G30176p073p013o525o445p242q529r511r790r538q955q011o898o215o283
61091F22148o545o262n599n376n846o412o641o851p387p968q175q132q164q168
$$ y = [1166260, 1148320, 1129556, 1109808, 1089043, 1067777, 1046673, 1025971, 1005781, 986560, 968688, 951811, 935359, 919669, 905800, 894159, 884044, 874738, 866168, 858109, 849488, 839171, 826942, 813151, 797789, 780546, 761507, 741210, 720126, 698535, 676762, 655160, 634027, 613929, 595851, 580545, 567892, 557251, 548275, 540900, 534786, 529436, 524901, 521784, 520381, 520240, 520756, 521873, 524037, 527721, 533143, 540201, 548515, 557634, 567281, 577401, 588053, 599420, 611793, 625336, 639876, 655084, 670633, 685991, 700253, 712625, 723040, 731900, 739158, 744055, 745908, 744839, 741520, 736509, 730176, 723103, 716090, 709565, 703120, 695878, 687349, 677838, 668048, 658510, 649555, 641544, 634646, 628431, 622148, 615603, 609341, 603742, 598366, 592520, 586108, 579467, 572616, 565229, 557261, 549086, 540954, 532790, 524622]
61077E24622p772o956o038n199m344l390k450j716j360j356j317p22L95J185Q51
61062D84433k88r23j00J754L278L565K924K365K568L420M381N039N280N265N374
61047E28335N952O899P654P731P249O810P002P999R408J0472J0751J0644J0874
61034F37780J1446J1702J1464J1473J2301J3581J4722J5727J6735J7523J8103
61023G92557J9158K1044K3033K4480K6130K9124L3219L7009L9662M1294M2256
61012A128966M3153M5096M8632N2850N6930O2021O9884Q0179R0980J01760J13793
61001A894244J27965J44759J66612J97448K39090K90437L50557M19764M97286
60992D328162N82169O78680P97457R49336J141732J380603J662263J947678K148224
$$ y = [524622, 516850, 509894, 503856, 498657, 494313, 490923, 488473, 486757, 485397, 484041, 482724, 482002, 482397, 483582, 484433, 484145, 483222, 483122, 484876, 488154, 491719, 494643, 497008, 499576, 502996, 507377, 512416, 517696, 522961, 528335, 534287, 541186, 548840, 556571, 563820, 570630, 577632, 585631, 595039, 605511, 616262, 626906, 637780, 649226, 660928, 672392, 683865, 696166, 709747, 724469, 740196, 756931, 774454, 792557, 811715, 832759, 855792, 880272, 906402, 935526, 968745, 1005754, 1045416, 1086710, 1128966, 1172119, 1217215, 1265847, 1318697, 1375627, 1437648, 1507532, 1587711, 1678691, 1780451, 1894244, 2022209, 2166968, 2333580, 2531028, 2770118, 3060555, 3411112, 3830876, 4328162, 4910331, 5589011, 6386468, 7335804, 8477536, 9858139, 11520402, 13468080, 15616304]
60983A5616304K159923J932656J510012R98903N04994J01252j58162k30832j21223
60974B2313827Q1244K26225J88226o1535m60106r14025j347299j704608j939736
60965A6382213k023513j961915j794835j572798j335863j109445r08442p38979
60957D936423n99654m86098l94905l23066k66534k21718j86999j61076j41235
60948B155138j24798j11188j00829r2815q5271p7488p0244o4205n9137n4596n0537
60937A264030m7301m5397m5069m5639m5784m4841m3253m1425l8955l5577l2041
60926G98748k9262k7217k5290k3205k0929j8373j5874j4303j3834j3298j1682
60915E85481r657q490q050p170n706m767m859n086m594l726l286l401l742m199
$$ y = [15616304, 17776227, 19708883, 21218895, 22217798, 22722792, 22824044, 22665882, 22435050, 22313827, 22395071, 22621296, 22809522, 22747987, 22287881, 21373856, 20026557, 18321949, 16382213, 14358700, 12396785, 10601950, 9029152, 7693289, 6583844, 5675402, 4936423, 4336769, 3850671, 3455766, 3132700, 2866166, 2644448, 2457449, 2296373, 2155138, 2030340, 1919152, 1818323, 1725508, 1640237, 1562749, 1492505, 1428300, 1369163, 1314567, 1264030, 1216729, 1171332, 1126263, 1080624, 1034840, 989999, 946746, 905321, 866366, 830789, 798748, 769486, 742269, 716979, 693774, 672845, 654472, 638598, 624295, 610461, 597163, 585481, 575824, 567334, 559284, 552114, 546408, 541641, 536782, 531696, 527102, 523376, 520090, 516689, 512947, 508748]
60901E08748m779n182n016m272l308k472j898j463q62O4J029J590J820K367L636
60886D90002N235O402O837O858O898P054P108O814O132N254M457L865L367K719
60872E69002J737M88p70j848k846l993n219o071o194n767n315n094m868m331l537
60857E15374k794k157j291Q6J752L176M088M610M865M794M502M404M787N427O014
60842E57637O618P348P782P418O607O403P246Q370Q807Q484P977P621P394P352
60828F63064P635Q055Q184P931P611P329O718N547M321L805M065M337L990L148
60814G45740K227J187k21j705k645l075l782n189o730p728q387r285j0306j0845
60800F79256j0794j0627j0464r813q367o512m814l431k242j163j73P53J487J821
$$ y = [508748, 503969, 498787, 493771, 489499, 486191, 483719, 481821, 480358, 479496, 479560, 480589, 482179, 483999, 486366, 490002, 495237, 501639, 508476, 515334, 522232, 529286, 536394, 543208, 549340, 554594, 559051, 562916, 566283, 569002, 570739, 571227, 570457, 568609, 565763, 561770, 556551, 550480, 544286, 538519, 533204, 528110, 523242, 518911, 515374, 512580, 510423, 509132, 509218, 510970, 514146, 518234, 522844, 527709, 532503, 537005, 541409, 546196, 551623, 557637, 564255, 571603, 579385, 586803, 593410, 599813, 607059, 615429, 624236, 632720, 640697, 648318, 655712, 663064, 670699, 678754, 686938, 694869, 702480, 709809, 716527, 722074, 726395, 730200, 734265, 738602, 742592, 745740, 747967, 749154, 748933, 747228, 744583, 741508, 737726, 732537, 725807, 718079, 709692, 700407, 690101, 679256, 668462, 657835, 647371, 637558, 629191, 622679, 617865, 614434, 612192, 611029, 610856, 611609, 613096, 614917]
60786F14917J806J819K159K789L436L819L719L122K363J905J970K412K850K822
60772F51908K077R98M47Q58J712K382L070M300N747O483O309O018O188O477O428
60757G11402O232O325O748P244P587P607P310P107P342P512O623M634K779K106
60743G98558K263K235J654Q66K35j6K78Q67R85J97r48j676k084k926m434o055
60727G89999p230p978q623r407j0360j1319j1997j2274j2316j2413j2703j3144
60715F60235j3444j3070j1818j0372r759r979r895q769p227o134n298m051k534
60702E47885j378m24J120L255M960N581N650N943O478O770O584O017N133L874
60688F07448K164jk391m430n636o238o983q212r507j0404j0960j1327j1224j0314
$$ y = [614917, 616723, 618542, 620701, 623490, 626926, 630745, 634464, 637586, 639949, 641854, 643824, 646236, 649086, 651908, 653985, 654983, 655430, 656288, 658000, 660382, 663452, 667752, 673499, 679982, 686291, 692309, 698497, 704974, 711402, 717634, 723959, 730707, 737951, 745538, 753145, 760455, 767562, 774904, 782416, 789039, 793673, 796452, 798558, 800821, 803056, 804710, 805576, 805811, 805795, 806073, 806940, 807925, 808122, 807174, 805498, 803414, 800488, 796054, 789999, 782769, 774791, 766168, 756761, 746401, 735082, 723085, 710811, 698495, 686082, 673379, 660235, 646791, 633721, 621903, 611531, 601772, 591793, 581898, 573129, 565902, 559768, 554470, 550419, 547885, 546507, 546083, 547203, 550458, 555418, 560999, 566649, 572592, 579070, 585840, 592424, 598441, 603574, 607448, 609612, 609611, 607220, 602790, 597154, 590916, 583933, 575721, 566214, 555810, 544850, 533523, 522299, 511985]
60674E11985q864p582o802o247n587m855m159l347k222r19K05J029J741K408K769
60659D69553K625K235K094K349K653K610K221J856J901K407K993L189K927K604
60645E04217K552K671K790L062L684M441M979N440O300P595Q824R654J0223J0642
60631E87074J0749J0574J0539J0934J1557J2050J2238J1985J1204J0259R796R919
60619G18878R924R259Q264P553P009O003M406K948K488L129L936L549J402j650
60605G87098m230n994p680r610j0961j1046j0564j0797j1959j3068j3194j2235
60593F65760j0617q856p336o064m720l216j966j286q44j07R15J809K291K269J739
60578F29771J076R46J438J752J337Q38J089J632J235k83j800k458k605k942l557
$$ y = [511985, 503121, 495539, 488737, 482490, 476903, 472048, 467889, 464542, 462320, 461401, 461606, 462635, 464376, 466784, 469553, 472178, 474413, 476507, 478856, 481509, 484119, 486340, 488196, 490097, 492504, 495497, 498686, 501613, 504217, 506769, 509440, 512230, 515292, 518976, 523417, 528396, 533836, 540136, 547731, 556555, 566209, 576432, 587074, 597823, 608397, 618936, 629870, 641427, 653477, 665715, 677700, 688904, 699163, 708959, 718878, 728802, 738061, 746325, 753878, 760887, 766890, 771296, 774244, 776732, 779861, 783797, 787346, 788748, 787098, 782868, 776874, 769194, 759584, 748623, 737577, 727013, 716216, 704257, 691189, 677995, 665760, 655143, 646287, 638951, 632887, 628167, 624951, 622985, 621699, 620855, 620748, 621663, 623472, 625763, 628032, 629771, 630847, 631793, 633231, 634983, 636320, 637158, 638247, 639879, 641114, 640831, 639031, 636573, 633968, 631026, 627469]
60563F27469m060m176l974l831m192m922n107l993k053m21N35J420K721M381O431
60548F06228R058J1865J4020J5552J7681K1308K5847L0042L3359L5976L7817L8246
60536H96999L6525L2183K5132J5839N282n468j5508k3883k9565l1952l1305k8537
60524H45742k4660k0351j5808j0875n579m91L647O562Q394R225R128Q563Q054
60511H21551P592P057P193R145J2864J6973K0677K4876L0754L8149M6238N5112
60499A098181O5544P7503R0007J02376J14739J27231J39666J52291J66117J82098
60489B315753K00314K20108K40193K57919K68748K67328K49503K13473J59657
60480D392996R0483J0809p2040j49777k15469k64833k96012l09041l05939k90576
$$ y = [627469, 623409, 619233, 615259, 611428, 607236, 602314, 597207, 593214, 591161, 590740, 591275, 592695, 595416, 599797, 606228, 615286, 627151, 641171, 656723, 674404, 695712, 721559, 751601, 784960, 820936, 858753, 896999, 933524, 965707, 990839, 1006678, 1011960, 1006492, 990984, 967101, 937536, 905584, 874279, 845742, 821082, 800731, 784923, 774048, 768469, 767978, 771625, 778187, 786581, 795806, 804934, 813497, 821551, 829143, 836200, 843393, 852538, 865402, 882375, 903052, 927928, 958682, 996831, 1043069, 1098181, 1163725, 1241228, 1331235, 1433611, 1548350, 1675581, 1815247, 1967538, 2133655, 2315753, 2516067, 2736175, 2976368, 3234287, 3503035, 3770363, 4019866, 4233339, 4392996, 4483479, 4494288, 4422248, 4272471, 4057002, 3792169, 3496157, 3187116, 2881177, 2590601]
60470B590601k67438k40232k11600j83693j58177j35819j16635j00550q7369p6205
60460A012883o5911n6376m8645m3297l9447l5818l2184k8966k6032k2819j9452
60449E93936j6690j4768j3153j1569j0445j0007r647q730p505o646o189n532m412
60436D68643l249k553k399k626l175l991m849n509n894n905n240l693j567M92
60422D18485K040K994L327L041K495K345K805L298L222K728K348K111J613R59
60408D53811R57K110L874N241N758N703N536N518N734O105O395O467O536O936
60394E26681P594P948P526O484N464M904M646M316L864L573L502L266K485J250
60380E93503j01j452k893m346n487o108o265o052n514m818m310m124l961l396
$$ y = [2590601, 2323163, 2082931, 1871331, 1687638, 1529461, 1393642, 1277007, 1176457, 1089088, 1012883, 946972, 890596, 841951, 798654, 759207, 723389, 691205, 662239, 636207, 613388, 593936, 577246, 562478, 549325, 537756, 527311, 517304, 507657, 498927, 491422, 484776, 478587, 473055, 468643, 465394, 462841, 460442, 457816, 454641, 450650, 445801, 440292, 434398, 428493, 423253, 419560, 417993, 418485, 420525, 423519, 426846, 429887, 432382, 434727, 437532, 440830, 444052, 446780, 449128, 451239, 452852, 453811, 454768, 456878, 460752, 465993, 471751, 477454, 482990, 488508, 494242, 500347, 506742, 513209, 519745, 526681, 534275, 542223, 549749, 556233, 561697, 566601, 571247, 575563, 579427, 583000, 586502, 589768, 592253, 593503, 593402, 591950, 589057, 584711, 579224, 573116, 566851, 560799, 555285, 550467, 546157, 542033, 538072, 534676]
60366E34676k426j509r91o53K1J066J820J734J181J095J832K806L314L250K860
60351E50076K312J834J782K138K316J913J301R49N63m65j999l253l754l642l139
60336E48932k417j823j515j001K16J623K158J747J455J931K591K722K501K488
60322E61608K744K939K799K085P87l87m39N36J128L86r56j671j740j931k326k324
60306E63238j785j159n40L21J101R24m68k300l712m497m715m290l364k473j981
60291E34300j658j173o64m72n51m38K56J522K956L960M140L710L423L860M862
60276E58033N731N989N831N804O123O457O445O283O565P468Q430Q811Q684Q649
60262F55303R040R666J0290J0958J1722J2432J2988J3663J4870J6652J8595K0283
$$ y = [534676, 532250, 530741, 529750, 529097, 529118, 530184, 532004, 533738, 534919, 536014, 537846, 540652, 543966, 547216, 550076, 552388, 554222, 556004, 558142, 560458, 562371, 563672, 564621, 565184, 564719, 562720, 559467, 555713, 552071, 548932, 546515, 544692, 543177, 542176, 542392, 544015, 546173, 547920, 549375, 551306, 553897, 556619, 559120, 561608, 564352, 567291, 570090, 572175, 572962, 572575, 572136, 572672, 573800, 574186, 573230, 571559, 569819, 567888, 565562, 563238, 561453, 560294, 559754, 560075, 561176, 562100, 561632, 559332, 555620, 551123, 546408, 542118, 538754, 536281, 534300, 532642, 531469, 530805, 530333, 529782, 529344, 529600, 531122, 534078, 538038, 542178, 545888, 549311, 553171, 558033, 563764, 569753, 575584, 581388, 587511, 593968, 600413, 606696, 613261, 620729, 629159, 637970, 646654, 655303, 664343, 674009, 684299, 695257, 706979, 719411, 732399, 746062, 760932, 777584, 796179, 816462]
60250H16462K1746K3374K5486K8076L0978L4175L7790M1915M6527N1568N6893
60239A214990O2182O7133P1799P6484Q1180Q5331Q8385R0368R1610R1921R0392
60228B111775Q6218P9594P1595O3160N4338M4653L4013K3045J2483K550o904j5850
60216B560670k3886l0458l5038l7246l7021l4710l0804k5716j9857j3581o766
60205B265587J175J0422K0186K9583L8800M8595N8856O8513P6879Q4123R0130
60194B792849R3931R4813R3206Q9808Q4429P6464O5968N3527L9453K3958P802
60183C516208q031k3218l7864n1403o2600p0759p6321p9967q1609q0556p6381
60172B867499o9377o0476n0786m0916l0536j8898n963P179J9248K9880L9544M8394
$$ y = [816462, 838208, 861582, 887068, 915144, 946122, 980297, 1018087, 1060002, 1106529, 1158097, 1214990, 1277172, 1344305, 1416104, 1492588, 1573768, 1659099, 1747484, 1837852, 1929462, 2021383, 2111775, 2197993, 2277587, 2349182, 2412342, 2466680, 2511333, 2545346, 2568391, 2580874, 2583424, 2576520, 2560670, 2536784, 2506326, 2471288, 2434042, 2397021, 2362311, 2331507, 2305791, 2285934, 2272353, 2265587, 2266762, 2277184, 2297370, 2326953, 2365753, 2414348, 2473204, 2541717, 2618596, 2702719, 2792849, 2886780, 2981593, 3074799, 3164607, 3249036, 3325500, 3391468, 3444995, 3484448, 3508406, 3516208, 3508177, 3484959, 3447095, 3395692, 3333092, 3262333, 3186012, 3106045, 3024436, 2943880, 2867499, 2798122, 2737646, 2686860, 2645944, 2615408, 2596510, 2590547, 2597726, 2616974, 2646854, 2686398, 2734792]
60160B734792N5544N9688O0291N7880N3229M6602L8030K8043J7558P148l149j3258
60148C142398k2721l0996l7570m1699m2641m0514l6394l1115k4335j5213l634
60137B815566R662K3901L8706N3950O9640Q5822J02300J18643J34808J51408J68926
60126C773332J86896K04288K20387K34879K47413K57633K65333K69950K70289
60117E930400K65448K55817K42318K24887K02550J75088J43663J09676P3853L6710
60107G660410r14l8269p4993j10549j43787j73485j98891k19461k34463k43213
60097F222385k45359k40782k29768k13600j94318j73370j50835j26520j01273
60088D546560p6587n3109l0337p765J4311L5100N3894P0133Q3309R2971R8671
$$ y = [2734792, 2790336, 2850024, 2910315, 2968195, 3021424, 3068026, 3106056, 3134099, 3151657, 3158805, 3155656, 3142398, 3119677, 3088681, 3051111, 3009412, 2966771, 2926257, 2889863, 2858748, 2834413, 2819200, 2815566, 2825228, 2849129, 2887835, 2941785, 3011425, 3097247, 3199547, 3318190, 3452998, 3604406, 3773332, 3960228, 4164516, 4384903, 4619782, 4867195, 5124828, 5390161, 5660111, 5930400, 6195848, 6451665, 6693983, 6918870, 7121420, 7296508, 7440171, 7549847, 7623700, 7660410, 7659496, 7621227, 7546234, 7435685, 7291898, 7118413, 6919522, 6700061, 6465598, 6222385, 5977026, 5736244, 5506476, 5292876, 5098558, 4925188, 4774353, 4647833, 4546560, 4469973, 4416864, 4386527, 4378762, 4393073, 4428173, 4482067, 4552200, 4635509, 4728480, 4827151]
60077D827151R9846R6065Q7400P4393N7710L8191J7120m066k4581m4428o3580
60066E161221q1414r7238j10976j22813j32380j38868j41993j42349j40593j36695
60056C915902j30296j21467j10775r8723q5540p1436n6705m1524k5967j0259N247
60045C168457K0448L5446N0046O3591P5500Q5666R4083J00364J03922J04313J01060
60034D002896R3495Q1402O5820M8529L0561J1666q487k9053m8399o5454q0172
60023D102804r2768j03066j10690j15433j17099j15391j10358j02756r3512q2893
60013C058838p0714n7408m4211l1906j9956p345O008J9343L2311M5461N9393P4022
60001C063836Q8766J02980J16017J27345J36701J43654J46942J44931J37073J24448
$$ y = [4827151, 4926997, 5023062, 5110462, 5184855, 5242565, 5280756, 5297876, 5293810, 5269229, 5224801, 5161221, 5079807, 4982569, 4871593, 4748780, 4616400, 4477532, 4335539, 4193190, 4052597, 3915902, 3785606, 3664139, 3553364, 3454641, 3369101, 3297665, 3240960, 3199436, 3173469, 3163210, 3168457, 3188905, 3224351, 3274397, 3337988, 3413488, 3499154, 3593237, 3693601, 3797523, 3901836, 4002896, 4096391, 4177793, 4243613, 4292142, 4322703, 4334369, 4325882, 4296829, 4248430, 4182976, 4102804, 4010036, 3906970, 3796280, 3680847, 3563748, 3448357, 3337999, 3235243, 3141731, 3058838, 2988124, 2930716, 2886505, 2854599, 2834643, 2827298, 2833306, 2852649, 2884960, 2930421, 2989814, 3063836, 3152602, 3255582, 3371599, 3498944, 3635645, 3779299, 3926241, 4071172, 4208245, 4332693]
59991D332693J08499Q9798O8456M5176K1138k864k6530m9419p0760q9820j05888
59980D320479j18072j25659j28739j27944j23583j15506j04003r0266p5670o0807
59970C250230m5519k9678j3722J546J5506K8083L9617N0421O0514O9706P7699
59959C504403Q4029Q8176Q9882Q9272Q6445Q1192P3366O3403N2181M0399K8357
59948D281105J6283M707n588j3850j9627k2798k3272k0689j4544m663Q605K4699
59936D210368M3139O3594Q5905J10119J36145J63338J90734K17739K44127K69321
59926E734529K92171L11478L26114L34334L33679L22075K98636K63217K15979
59917H432212J58040R2084K1709m9467j17681j78958k30182k70044k98340l14855
$$ y = [4332693, 4441192, 4530990, 4599446, 4644622, 4665760, 4662896, 4636366, 4586947, 4516187, 4426367, 4320479, 4202407, 4076748, 3948009, 3820065, 3696482, 3580976, 3476973, 3386707, 3311037, 3250230, 3204711, 3175033, 3161311, 3162857, 3178363, 3206446, 3246063, 3296484, 3356998, 3426704, 3504403, 3588432, 3676608, 3766490, 3855762, 3942207, 4023399, 4096765, 4160168, 4212349, 4252748, 4281105, 4297388, 4302095, 4296507, 4282657, 4263030, 4240232, 4216960, 4196271, 4181727, 4177064, 4185669, 4210368, 4253507, 4317101, 4403006, 4513125, 4649270, 4812608, 5003342, 5221081, 5465208, 5734529, 6026700, 6338178, 6664292, 6998626, 7332305, 7654380, 7953016, 8216233, 8432212, 8590252, 8682336, 8704045, 8654578, 8536897, 8357939, 8127757, 7857713, 7559373, 7244518]
59907G244518l19832l14965l02766k84941k62247k35771k07174j77638j47554
59898D991630j17443q8261o0485l3699p451J8131M2826O6710Q9653J10911J29613
59887E142135J45205J57142J64528J66340J61704J49787J29963J02332O7893K8161
59877F415190j4978n8984j00908j38182j69095j92555k08032k15886k17238k13241
59867D886091k04826j93234j80186j67174j54868j43454j33145j24097j16040
59858C469067j08289j00107r1012q0945p0123n8671m6547l4018k1873j0777p35
59847B845970Q345J5794K0501K1896J9995J4782O379m200j5290k5630l4562m1389
59835B832591m5542m7465m8377m8933m8950m8438m7840m6924m4623m0524l5510
$$ y = [7244518, 6924686, 6609721, 6306955, 6022014, 5759767, 5523996, 5316822, 5139184, 4991630, 4874187, 4785926, 4725441, 4691742, 4684291, 4702422, 4745248, 4811958, 4901611, 5012522, 5142135, 5287340, 5444482, 5609010, 5775350, 5937054, 6086841, 6216804, 6319136, 6387029, 6415190, 6400212, 6341228, 6240320, 6102138, 5933043, 5740488, 5532456, 5316570, 5099332, 4886091, 4681265, 4488031, 4307845, 4140671, 3985803, 3842349, 3709204, 3585107, 3469067, 3360778, 3260671, 3169659, 3088714, 3018591, 2959920, 2913373, 2879355, 2857482, 2846705, 2845970, 2854315, 2870109, 2890610, 2912506, 2932501, 2947283, 2953662, 2949462, 2934172, 2908542, 2873980, 2832591, 2787049, 2739584, 2691207, 2642274, 2593324, 2544886, 2497046, 2450122, 2405499, 2364975, 2329465]
59824B329465l0295k4363j7224r834l650J254O130J1859J8060K3786K8337L1507
59812B365032L3507L4575L4378L2084K7370K1020J4212P597J543l254o077o857
59800B555130n948l466O80O330J3277K1754L2226M4778N9048P4698R1544J09471
59788B999522J28625J49577J72842J98253K25021K51978K77173K97167L07203
59779E007361L02291K78463K33946J70287R2709Q974p2731j45338k03469k43736
59769E428757k65205k69579k60510k42256k18479j91877j64542j38205j13900
59760C564204r1764p1636n3763l8438k5233j3185j797Q878J9064K9417M0123N0658
59748C416528O0809P1223Q2544R4632J07116J20119J33930J48583J64313J81891
$$ y = [2329465, 2299170, 2274807, 2257583, 2247749, 2244099, 2245353, 2251483, 2263342, 2281402, 2305188, 2333525, 2365032, 2398539, 2433114, 2467492, 2499576, 2526946, 2547966, 2562178, 2569775, 2571318, 2568064, 2561987, 2555130, 2549182, 2545716, 2546396, 2552726, 2566003, 2587757, 2619983, 2664761, 2723809, 2798507, 2890051, 2999522, 3128147, 3277724, 3450566, 3648819, 3873840, 4125818, 4402991, 4700158, 5007361, 5309652, 5588115, 5822061, 5992348, 6085057, 6094031, 6021300, 5875962, 5672493, 5428757, 5163552, 4893973, 4633463, 4391207, 4172728, 3980851, 3816309, 3678104, 3564204, 3472440, 3400804, 3347041, 3308603, 3283370, 3270185, 3268388, 3277266, 3296330, 3325747, 3365870, 3416528, 3477337, 3548560, 3631104, 3725736, 3832852, 3952971, 4086901, 4235484, 4399797, 4581688]
59738D581688K01782K23358K45622K68422K92429L18143L45370L73285M00478
59729G250577M25174M45928M61838M71728M73671M66032M48900M24003L93676
59720A1261527L60488L27546K98233K75466K61487K57915K65206K81911L05147
59711A3894926L31888L59596L85657M06839M19631M21046M09215L83562L44602
59702A7356962K93666K32965J65793R6201K8178l4754q9370j32814j63108j79145
59692A7574574j80178j66042j38104r9056n1168M727O8100J37305K10080K84772
59682A7645010L60379M35775N09564N80151O45065P00407P41491P63753P62485
59673B3144080P32596O69814N72383M41519K81288R9152r3923k85415m63855o19636
$$ y = [4581688, 4783470, 5006828, 5252450, 5520872, 5813301, 6131444, 6476814, 6850099, 7250577, 7675751, 8121679, 8583517, 9055245, 9528916, 9994948, 10443848, 10867851, 11261527, 11622015, 11949561, 12247794, 12523260, 12784747, 13042662, 13307868, 13589779, 13894926, 14226814, 14586410, 14972067, 15378906, 15798537, 16219583, 16628798, 17012360, 17356962, 17650628, 17883593, 18049386, 18145587, 18173765, 18139011, 18049641, 17916827, 17753719, 17574574, 17394396, 17228354, 17090250, 16991194, 16940026, 16944753, 17012853, 17150158, 17360238, 17645010, 18005389, 18441164, 18950728, 19530879, 20175944, 20876351, 21617842, 22381595, 23144080, 23876676, 24546490, 25118873, 25560392, 25841680, 25940832, 25846909, 25561494, 25097639, 24478003]
59663B4478003p44747q33630q84747r00482q85681q47051p93446p35112o81819
59654A7171288o41631o20188o19130o34769o59681o86211p08290p20826p19879
59645A1160683p04450o76988o41034n99097n53117n05688m59541m16290l76377
59636F228101l39846l06484k75777k47469k21878j99082j78261j58450j39659
59627D161195j22628j07656r4278q1878p0175n9182m9152m0549l3710k8652k5356
59616C447979k4023k4669k6736k9594l3383l8857m6168n4160o1094o6016o9171
59605B974108p1128p1875p1031o8714o5609o2094n7816n2448m6386m0312l4440
59594B332255k8756k3607j9371j5672j1655p048k333K069O155R853J2814J4921
$$ y = [24478003, 23733256, 22899626, 22014879, 21114397, 20228716, 19381665, 18588219, 17853107, 17171288, 16529657, 15909469, 15290339, 14655570, 13995889, 13309678, 12601388, 11880562, 11160683, 10456233, 9779245, 9138211, 8539114, 7985997, 7480309, 7020768, 6604478, 6228101, 5888255, 5581771, 5305994, 5058525, 4836647, 4637565, 4459304, 4300854, 4161195, 4038567, 3930911, 3836633, 3754755, 3684580, 3625398, 3576246, 3535697, 3501987, 3473335, 3447979, 3423956, 3399287, 3372551, 3342957, 3309574, 3270717, 3224549, 3170389, 3109295, 3043279, 2974108, 2902980, 2831105, 2760074, 2691360, 2625751, 2563657, 2505841, 2453393, 2407007, 2366695, 2332255, 2303499, 2279892, 2260521, 2244849, 2233194, 2226146, 2223813, 2225882, 2232037, 2241890, 2254704, 2269625]
59582B269625J6437J7535J8141J8429J8863J9561K0118K0344K0791K2327K5451
59571B487622L0094L5667M1236M6172N0820N6191O2878P0605P8951Q7854R7305
59560C145395J07120J17388J28617J40997J53880J66423J78348J89676J99989
59551D527833K08516K14737K18473K19393K17060K11599K03766J93866J80777
59542F396020J62683J39112J11972Q4117N7224L1548P558j3322k9900m2245n0827
59531F853940n5347n5207n0510m1625k8112r268J4337M0805O8300R5511J20736
59520F953560J41721J56710J64707J64350J53600J31242R8075N6196P782m4930
59510G983013r9217j52285k01901k46132k82915l10453l27902l35371l33547l23627
$$ y = [2269625, 2286062, 2303597, 2321738, 2340167, 2359030, 2378591, 2398709, 2419053, 2439844, 2462171, 2487622, 2517716, 2553383, 2594619, 2640791, 2691611, 2747802, 2810680, 2881285, 2960236, 3048090, 3145395, 3252515, 3369903, 3498520, 3639517, 3793397, 3959820, 4138168, 4327844, 4527833, 4736349, 4951086, 5169559, 5388952, 5606012, 5817611, 6021377, 6215243, 6396020, 6558703, 6697815, 6809787, 6893904, 6951128, 6982676, 6990234, 6976912, 6947012, 6904767, 6853940, 6798593, 6743386, 6692876, 6651251, 6623139, 6613871, 6628208, 6669013, 6737313, 6832824, 6953560, 7095281, 7251991, 7416698, 7581048, 7734648, 7865890, 7963965, 8020161, 8027943, 7983013, 7883796, 7731511, 7529610, 7283478, 7000563, 6690110, 6362208, 6026837, 5693290, 5369663]
59500E369663l07318k86437k62634k37474k12288j87660j63494j39975j18021
59491C454362r8409q0873o4477m8590l2965j7314j413J4459K9734M4320N8759
59480C257593P3614Q8932J04407J19809J35029J49745J63155J74254J82381J87327
59470D636246J88771J85845J77543J63334J43123J16874Q4828M8067Q413l2186
59460E720858p1877j08807j41430j69033j91444k08281k19024k23787k23466k19103
59450C944606k11616k01958j90859j78359j64459j50168j37015j25368j14236
59441B470568j03041r2531q3411p5018o6282n7345m9284m2595l6741l1070k5505
59430A807745k0345j5844j1997q491m954j387J818M508P041R783J2559J4870J6299
$$ y = [5369663, 5062345, 4775908, 4513274, 4275800, 4063512, 3875852, 3712358, 3572383, 3454362, 3355953, 3275080, 3210603, 3162013, 3129048, 3111734, 3110321, 3124780, 3154514, 3198834, 3257593, 3331207, 3420139, 3524546, 3644355, 3779384, 3929129, 4092284, 4266538, 4448919, 4636246, 4825017, 5010862, 5188405, 5351739, 5494862, 5611736, 5696564, 5744631, 5753044, 5720858, 5648981, 5540174, 5398744, 5229711, 5038267, 4829986, 4610962, 4387175, 4163709, 3944606, 3732990, 3531032, 3340173, 3161814, 2997355, 2847187, 2710172, 2584804, 2470568, 2367527, 2274996, 2191585, 2116567, 2050285, 1992940, 1943656, 1901061, 1864320, 1833250, 1807745, 1787400, 1771556, 1759559, 1751068, 1746114, 1744727, 1746545, 1751053, 1758094, 1767877, 1780436, 1795306, 1811605]
59417A811605J6491J5028J1821P547L573J335J631M260Q460J3855K0574K8138
59405A944318L4761L8780M0440M1313M2164M2596M2834M4429M8648N5340O3889
59394B439512P4226Q6186R9000J12366J27142J44043J62393J81080K00197K20711
59384C846856K43147K67513K93995L22518L51898L80332M06591M29859M48676
59375F991385M60944M64951M59746M44897M20888L89766L54556L17782K81036
59366A0585951K45652K12908J83436J57014J32981J10226Q6827O0475K9640n980
59356A1799130m6043r0019j36912j85059k32471k77286l17922l53110l81899m03603
59346I374806m17926m25276m26687m23054m14660m01679l84828l65122l43236
$$ y = [1811605, 1828096, 1843124, 1854945, 1862492, 1866065, 1867400, 1869031, 1873291, 1881751, 1895606, 1916180, 1944318, 1979079, 2017859, 2058299, 2099612, 2141776, 2184372, 2227206, 2271635, 2320283, 2375623, 2439512, 2513738, 2599924, 2698924, 2811290, 2938432, 3082475, 3244868, 3425948, 3626145, 3846856, 4090003, 4357516, 4651511, 4974029, 5325927, 5706259, 6112850, 6542709, 6991385, 7452329, 7917280, 8377026, 8821923, 9242811, 9632577, 9987133, 10304915, 10585951, 10831603, 11044511, 11227947, 11384961, 11517942, 11628168, 11714995, 11775470, 11805110, 11799130, 11753087, 11663068, 11526156, 11341097, 11108626, 10831340, 10513418, 10160308, 9778409, 9374806, 8956880, 8531604, 8104917, 7681863, 7267203, 6865524, 6480696, 6115574, 5772338]
59337E772338l19572k94805k69935k45785k22738k00844j80024j60341j42220
59328C736074j26070j11552r7637q3721p0291n8089m7098l6795k6976j7773r077
59317C050995n93P600J5020K1298K6493L0956L4969L8359M0447M0728L9582L7786
59305C383640L5364L1676K6656K1080J5297Q846J818m396q513j0611j1311j0618
59293C478928q438n243j047N365J4959K6789L9054N1103O3070P4103Q2715Q8600
59281C909958R2591R4881R4863R2698Q9414Q5161P8785O9538N7888M4291K8561
59270D738629J1160o152k1692l5067m6379n5218o1172o4617o6226o6219o4665
59259D262382o2017n8798n5311n2026m9711m8676m8377m8231m8398m9309n0848
$$ y = [5772338, 5452766, 5157961, 4888026, 4642241, 4419503, 4218659, 4038635, 3878294, 3736074, 3610004, 3498452, 3400815, 3317094, 3246803, 3188714, 3141616, 3104821, 3077845, 3060072, 3050995, 3050402, 3058002, 3073022, 3094320, 3120813, 3151769, 3186738, 3225097, 3265544, 3306272, 3345854, 3383640, 3419004, 3450680, 3477336, 3498416, 3513713, 3522559, 3524377, 3519981, 3511468, 3500857, 3489546, 3478928, 3470490, 3465247, 3464200, 3469565, 3484524, 3511313, 3550367, 3601470, 3664540, 3738643, 3821358, 3909958, 4002549, 4097430, 4192293, 4284991, 4374405, 4459566, 4538351, 4607889, 4665777, 4710068, 4738629, 4749789, 4743637, 4721945, 4686878, 4640499, 4585281, 4524109, 4459492, 4393266, 4327047, 4262382, 4200365, 4141567, 4086256, 4034230, 3984519, 3935843, 3887466, 3839235, 3790837, 3741528, 3690680]
59248C690680n2386n3272n2964n1158m8118m4510m0606l5937k9892k2193j2736
59237C246908j514J1048K4417L8929N5757P5450R7051J19273J42007J66072J91751
59226D167149K18262K44378K68967K90834L08410L19679L22390L14685K95710
59217F750464K65524K24381J72637J11580M3938k6873r7662j65331k26361k77286
59207F775011l15926l41909l55959l58997l52023l36687l15523k91213k65523
59198C841251k39096k12450j86793j63511j43220j25825j11291r9632r0275q2267
59188B386891p5308o9774o5493o1295n6200n0439m4701l9041l3147k7308k2196
59177A841989j7824j3460q664l881K35L650O843J0095J3175J5731J7848K0068
$$ y = [3690680, 3638294, 3585022, 3532058, 3480900, 3432782, 3388272, 3347666, 3311729, 3281837, 3259644, 3246908, 3245394, 3256442, 3280859, 3319788, 3375545, 3450995, 3548046, 3667319, 3809326, 3975398, 4167149, 4385411, 4629789, 4898756, 5189590, 5498000, 5817679, 6140069, 6454754, 6750464, 7015988, 7240369, 7413006, 7524586, 7568524, 7541651, 7443989, 7278658, 7052297, 6775011, 6459085, 6117176, 5761217, 5402220, 5050197, 4713510, 4397987, 4106774, 3841251, 3602155, 3389705, 3202912, 3039401, 2896181, 2770356, 2659065, 2559433, 2469158, 2386891, 2311583, 2241809, 2176316, 2115021, 2058821, 2008382, 1963681, 1924640, 1891493, 1864185, 1841989, 1824165, 1810705, 1802041, 1798160, 1798395, 1802045, 1808888, 1818983, 1832158, 1847889, 1865737, 1885805]
59165A885805K2898K6339K9945L3297L6274L8999M1628M4251M6813M9106N0839
59154B306194N1745N1684N0809M9516M7904M5306M0878L4792K8231K1891J5143
59143B744093P308r20q173j4194j9773k5053k9046l1009l1314l0672k9272k7064
59131B504911k4123k0295j5203r083k894K947R339J7200K5957L4134M1301M8502
59119B612693N6758O5848P4823Q3162R0994R8468J05394J11558J17200J22946
59109C539844J29176J35530J41154J45510J48872J52002J55257J58005J58877
59100D864227J56587J50441J39937J24118J01895P3195L9359K178l7001p6867
59090E538069j15359j50156j79739k03461k20706k30799k33894k31390k25140
$$ y = [1885805, 1908703, 1935042, 1964987, 1998284, 2034558, 2073557, 2115185, 2159436, 2206249, 2255355, 2306194, 2357939, 2409623, 2460432, 2509948, 2557852, 2603158, 2644036, 2678828, 2707059, 2728950, 2744093, 2751401, 2750481, 2742308, 2728114, 2708341, 2683288, 2654242, 2623233, 2591919, 2561247, 2531975, 2504911, 2480788, 2460493, 2445290, 2436207, 2433313, 2436260, 2445599, 2462799, 2488756, 2522890, 2564191, 2612693, 2669451, 2735299, 2810122, 2893284, 2984278, 3082746, 3188140, 3299698, 3416898, 3539844, 3669020, 3804550, 3945704, 4091214, 4240086, 4392088, 4547345, 4705350, 4864227, 5020814, 5171255, 5311192, 5435310, 5537205, 5610400, 5649759, 5651937, 5614936, 5538069, 5422710, 5272554, 5092815, 4889354, 4668648, 4437849, 4203955, 3972565, 3747425]
59081C747425k16488k06071j94136j80946j67162j53880j41978j31384j21293
59072B234087j11107j00948r1372q2841p5445o8838o2576n6688n1654m7598m3946
59061A441074m0262l6846l3951l0960k7255k3440k0663j8927j7172j4948j2890
59050A163760j1405j0094q760p937p915q126q039p807p589p088o282n730n446
59037A061542m294j428K225M922O171O994Q290R958J1604J3249J4907J6102J6295
59024A166537J5703J5267J5782J7163J8635J9609K0042J9971J9007J6695J3257
59013A357668R532O140K994k52l563o466q431r384r826j0421j1256j1815j1741
59000A293179j1264j0640r692q324o940n763m251k062p3N59J22O7J025K200K776
$$ y = [3747425, 3530937, 3324866, 3130730, 2949784, 2782622, 2628742, 2486764, 2355380, 2234087, 2122980, 2022032, 1930660, 1847819, 1772374, 1703536, 1640960, 1584272, 1532618, 1485020, 1441074, 1400812, 1363966, 1330015, 1299055, 1271800, 1248360, 1227697, 1208770, 1191598, 1176650, 1163760, 1152355, 1142261, 1133501, 1125564, 1117649, 1109523, 1101484, 1093677, 1086088, 1079000, 1072718, 1066988, 1061542, 1057248, 1055820, 1058045, 1062967, 1069138, 1076132, 1084422, 1094380, 1105984, 1119233, 1134140, 1150242, 1166537, 1182240, 1197507, 1213289, 1230452, 1249087, 1268696, 1288738, 1308709, 1327716, 1344411, 1357668, 1367200, 1373340, 1376334, 1376082, 1372519, 1366053, 1357622, 1348238, 1338412, 1327991, 1316735, 1304920, 1293179, 1281915, 1271275, 1261583, 1253259, 1246319, 1240556, 1236305, 1234243, 1234170, 1234729, 1234851, 1234918, 1235943, 1238143, 1240919]
58985A240919K864K826K632K358K407K908L513M067M812N669O093N966O002O911
58971A299947Q680J0853J2956J4570J5700J7127J9629K2778K5332K6906K8272
58960A502750K9885L1172L1626L1536L1208L0475K9411K8588K8114K7412K6536
58949A828713K6562K8017K9955L1500L3237L6151L9939M3628M7161N1210N5742
58938B251815O0005O3749O7512P1707P6145Q0509Q4744Q9092R4166J00844J09642
58927C149930J20299J32264J45319J59493J74810J91374K09413K28904K49612
58918D761418K71648K95424L20908L47586L75387M04764M35449M65942M94729
58909H173255N21037N43782N60592N68662N65848N50262N19814M73397M12000
$$ y = [1240919, 1243783, 1246609, 1249241, 1251599, 1254006, 1256914, 1260427, 1264494, 1269306, 1274975, 1281068, 1287034, 1293036, 1299947, 1308627, 1319480, 1332436, 1347006, 1362706, 1379833, 1399462, 1422240, 1447572, 1474478, 1502750, 1532635, 1563807, 1595433, 1626969, 1658177, 1688652, 1718063, 1746651, 1774765, 1802177, 1828713, 1855275, 1883292, 1913247, 1944747, 1977984, 2014135, 2054074, 2097702, 2144863, 2196073, 2251815, 2311820, 2375569, 2443081, 2514788, 2590933, 2671442, 2756186, 2845278, 2939444, 3040288, 3149930, 3270229, 3402493, 3547812, 3707305, 3882115, 4073489, 4282902, 4511806, 4761418, 5033066, 5328490, 5649398, 5996984, 6372371, 6777135, 7212584, 7678526, 8173255, 8694292, 9238074, 9798666, 10367328, 10933176, 11483438, 12003252, 12476649, 12888649]
58900A2888649L37685K52003J56536N4564m9062j49734k43829l27903l98469m53163
58890A2067277m91796n16078n28649n32130n28478n18834n03941m84469m60992
58881G501910m34140m05090l75383l46044l17459k90291k65697k44122k24714
58872D598970k06603j90068j75671j62895j50651j38679j27521j17342j07695
58863C221845r8358q9641q1850p4970o8800o3051n7396n1704m6073m0492l4849
58852B514661k9380k4502k0021j5169r678m113J133O297J1362J5764J9496K3461
58840B489311K8112L2807L7221M2217M8292N4346N9291O3922O9787P6971Q4485
58829C086762R2207J00890J10632J20890J31807J44093J57665J71734J86260K02124
$$ y = [12888649, 13226334, 13478337, 13634873, 13689437, 13640375, 13490641, 13246812, 12918909, 12520440, 12067277, 11575481, 11059403, 10530754, 9998624, 9470146, 8951312, 8447371, 7962902, 7501910, 7067770, 6662680, 6287297, 5941253, 5623794, 5333503, 5067806, 4823684, 4598970, 4392367, 4202299, 4026628, 3863733, 3713082, 3574403, 3446882, 3329540, 3221845, 3123487, 3033846, 2951996, 2877026, 2808226, 2745175, 2687779, 2636075, 2590002, 2549510, 2514661, 2485281, 2460779, 2440758, 2425589, 2415911, 2411798, 2412931, 2419228, 2430590, 2446354, 2465850, 2489311, 2517423, 2550230, 2587451, 2629668, 2677960, 2732306, 2791597, 2855519, 2925306, 3002277, 3086762, 3178969, 3279859, 3390491, 3511381, 3643188, 3787281, 3944946, 4116680, 4302940, 4505064]
58819D505064K19826K39155K60203K83608L09517L37199L65774L94632M23123
58810G338101M50498M76126M99005N17114N27866N29065N18826M95050M55987
58801A1807638M01293L31923K49309J55467N3769n1187j54416k50986l36320m07231
58791A1799259m62520n02068n25921n34981n31737n19033m98374m70533m37266
58782G316826m01117l63771l25756k87813k51679k19788j94951j79791j75189
58773D916971j79341j89060k01400k13249k20631k20607k13657k02591j89260
58764C087175j73941j57475j41795j27840j14742j01742q9377p8279o8211n8993
58754A974780n1091m4599l8651l2635k7052k2515j8754j5231j2094r843q551p883
$$ y = [4505064, 4724890, 4964045, 5224248, 5507856, 5817373, 6154572, 6520346, 6914978, 7338101, 7788599, 8264725, 8763730, 9280844, 9808710, 10337775, 10856601, 11351651, 11807638, 12208931, 12540854, 12790163, 12945630, 12999399, 12948212, 12793796, 12542810, 12206490, 11799259, 11336739, 10834671, 10308750, 9773769, 9242032, 8722999, 8224625, 7754092, 7316826, 6915709, 6551938, 6226182, 5938369, 5686690, 5466902, 5271951, 5092160, 4916971, 4737630, 4548570, 4347170, 4133921, 3913290, 3692683, 3479026, 3276435, 3087175, 2913234, 2755759, 2613964, 2486124, 2371382, 2269640, 2180263, 2101984, 2033773, 1974780, 1923689, 1879090, 1840439, 1807804, 1780752, 1758237, 1739483, 1724252, 1712158, 1702315, 1693764, 1685881]
58742A685881p614p827q872j1092j4374j8132k2101k6559l1201l4493l5166l3853
58730A434597l2154l0583k8684k6705k5553k5274k5066k4805k5041k5430k4804
58719A140498k3044k1425k0682k0070j8729j6762j4507j1982r500p819p226p347
58707I61405q020r356j0964j2228j3380j5050j6721j7141j6335j5647j5549j5019
58695G95995j3536j1955j0850r597p869o480n839m968l006m62J820L808N528O486
58681G39075O811P771J0144J3056J5483J7847K0984K4542K7653L0491L4046L8803
58669I86706M4689N1870O0566P0082P8391Q2409P8664O4930M2155J4319j4099
58658A560682m0107o1727p6995q4643q5200q0541p2630o3049n3110m3637l4888
$$ y = [1685881, 1678267, 1670440, 1661568, 1650476, 1636102, 1617970, 1595869, 1569310, 1538109, 1503616, 1468450, 1434597, 1402443, 1371860, 1343176, 1316471, 1290918, 1265644, 1240578, 1215773, 1190732, 1165302, 1140498, 1117454, 1096029, 1075347, 1055277, 1036548, 1019786, 1005279, 993297, 983797, 975978, 968752, 961405, 953385, 944029, 933065, 920837, 907457, 892407, 875686, 858545, 842210, 826563, 811014, 795995, 782459, 770504, 759654, 750057, 742188, 735708, 729869, 724901, 721895, 721433, 723253, 727061, 732589, 739075, 745886, 753657, 763801, 776857, 792340, 810187, 831171, 855713, 883366, 913857, 947903, 986706, 1031395, 1083265, 1143831, 1213913, 1292304, 1374713, 1453377, 1518307, 1560462, 1574781, 1560682, 1520575, 1458848, 1381853, 1297210, 1212010, 1131469, 1058839, 995790, 942680, 899043, 864155]
58647H64155k7012k0225j4504r721o022l405r65K270N785Q099R061J0197J2372
58634H30085J4671J6266J7919K0604K3936K7037K9869L2742L5526L8448M2649
58623A129752M8815N6042O3169P0420P8629Q7643R6679J05710J15157J24759J33809
58612B110584J42214J50201J57119J61472J61938J57589J47442J30720J07595
58603C426874P9151M6863J2549k1489n3133q1200j05152j24246j37480j44359
58593B898378j45531j42727j37947j32287j25545j17346j08365r9750r1623q3219
58583A714038p4512o6524n9842n3993m8578m3845l9713l5359l0425k5669k1807
58572A213771j8598j5574j2800j0422q291o468n266m469l478k544k735m283o060
$$ y = [864155, 837143, 816918, 802414, 792693, 786671, 783266, 782301, 784571, 790356, 798455, 807516, 817713, 830085, 844756, 861022, 878941, 899545, 923481, 950518, 980387, 1013129, 1048655, 1087103, 1129752, 1178567, 1234609, 1297778, 1368198, 1446827, 1534470, 1631149, 1736859, 1852016, 1976775, 2110584, 2252798, 2402999, 2560118, 2721590, 2883528, 3041117, 3188559, 3319279, 3426874, 3506025, 3552888, 3565437, 3543948, 3490815, 3409615, 3304463, 3180217, 3042737, 2898378, 2752847, 2610120, 2472173, 2339886, 2214341, 2096995, 1988630, 1888880, 1797257, 1714038, 1639526, 1573002, 1513160, 1459167, 1410589, 1366744, 1327031, 1291672, 1261247, 1235578, 1213771, 1195173, 1179599, 1166799, 1156377, 1148086, 1141618, 1136352, 1131883, 1128405, 1125861, 1123126, 1118843, 1112783]
58559A112783p096p425p012n171j813J905M834O672P009M769m98p749j5397k2294
58545A063517k7489l0356l1472l2036l1968l0071k6433k2875k0291j7470j3597
58534G79459r985q054p210o299n535n378m988l558k106k166l621n348p044q868
58520F99299j0196j0363r972r914r768q571o560m757l428k221j283r83j025r76
58506F19282j109j770k473k652k568k649k652k293j817j219Q6K007L345L479L325
58491F10322L694M083L999L942M009L146J173k06J03O76m8j173j110l57l12o09
58475F31332m6Q34N22p78j512j238p18q4J023J912J459k7j220j762k224k693k983
58458F21797l648n191o817p538p831q546r079q425p215o739o662n705l998k811
$$ y = [1112783, 1105687, 1098262, 1091250, 1086079, 1084266, 1086171, 1091005, 1097677, 1104686, 1109455, 1108957, 1101208, 1085811, 1063517, 1036028, 1005672, 974200, 942164, 910196, 880125, 853692, 830817, 810526, 793056, 779459, 769474, 761420, 754210, 747911, 742376, 736998, 732010, 728452, 726346, 724180, 720559, 715211, 708167, 699299, 689103, 678740, 668768, 658854, 649086, 640515, 633955, 629198, 625770, 623549, 622266, 621283, 620258, 619282, 618173, 616403, 613930, 611278, 608710, 606061, 603409, 601116, 599299, 598080, 598166, 600173, 603518, 606997, 610322, 614016, 618099, 622098, 626040, 630049, 633195, 634368, 634162, 634265, 634941, 634893, 633720, 632610, 632253, 631941, 631332, 631286, 632120, 632642, 631864, 630352, 629114, 628396, 628312, 629335, 631247, 632706, 632679, 631459, 629697, 627473, 624780, 621797, 618149, 612958, 606141, 598603, 590772, 582226, 573147, 564722, 557507, 550768, 544106, 538401, 534403, 531592]
58444E31592k380j956j522j560j600q18L34Q16P57Q57P54j58j026o32M63Q53P18
58427E25492J207K105K320K138K777M033M705M908N759P004P267O535O251O974
58413E89475P897Q620R513J0400J0661J0440J0200R548Q152O994O874O572M649
58400F99995K137J029R51L1j609k146j483j388k248k537j702q97n46K56J580K252
58384F93675K014J932K296K265J711J391J201K86j084j676j349r55n02N18J414
58369G03137J153N66J265K732L014K002J359J509J372J039J735L194L746L175
58355G30998K846K993K570J838K233L644M429M316M464M780M061K749K616L544
58341G78081L775L369M213O368P696P622P968R468J0651J0912J1579J3095J3992
$$ y = [531592, 529212, 527256, 525734, 524174, 522574, 521756, 522090, 522906, 523663, 524520, 525274, 525116, 524090, 523458, 523921, 524774, 525492, 526699, 528804, 531124, 533262, 536039, 540072, 544777, 549685, 555444, 562448, 569715, 576250, 582501, 589475, 597372, 605992, 615505, 625905, 636566, 647006, 657206, 666754, 674906, 681900, 688774, 695346, 699995, 702132, 703161, 704112, 704143, 702534, 700388, 698905, 697517, 695269, 692732, 691030, 690133, 689587, 689843, 691423, 693675, 695689, 697621, 699917, 702182, 703893, 705284, 706485, 706771, 705687, 704011, 702662, 701707, 701205, 701723, 703137, 704290, 704856, 706121, 708853, 711867, 713869, 715228, 716737, 718109, 719148, 720883, 724077, 727823, 730998, 733844, 736837, 739407, 741245, 743478, 747122, 751551, 755867, 760331, 765111, 769172, 771921, 774537, 778081, 781856, 785225, 789438, 795806, 803502, 811124, 819092, 828560, 839211, 850123, 861702, 874797, 888789]
58328H88789J3592J2997J2789J2323J1709J1866J2236J1235R202Q065Q047P649
58316A020499O922P342Q414P987O229N725P104Q250Q311Q810J0173J0817J0472
58303A127055J0769J1885J2194J1853J2991J5649J7371J7505J8010J9369J9766
58292A294417J9054J9403K1064K1732K1129K1851K4576K6740K7174K7855K9768
58281A554763L1393L2521L5152L9269M2106M2969M4345M6960M8267M7282M6170
58270B011197M5629M3402L9016L5263L3376L1427K8990K8491L0403L2032L2627
58259B391853L4674L8720M2124M4309M7822N2846N6386N8212O1624O6921P0533
58248B966024P2106P5704Q2176Q7401R0098R4091J00649J06142J09664J15303
$$ y = [888789, 902381, 915378, 928167, 940490, 952199, 964065, 976301, 987536, 996738, 1004803, 1012850, 1020499, 1027421, 1034763, 1043177, 1051164, 1057393, 1063118, 1070222, 1078472, 1086783, 1095593, 1105766, 1116583, 1127055, 1137824, 1149709, 1161903, 1173756, 1186747, 1202396, 1219767, 1237272, 1255282, 1274651, 1294417, 1313471, 1332874, 1353938, 1375670, 1396799, 1418650, 1443226, 1469966, 1497140, 1524995, 1554763, 1586156, 1618677, 1653829, 1693098, 1735204, 1778173, 1822518, 1869478, 1917745, 1965027, 2011197, 2056826, 2100228, 2139244, 2174507, 2207883, 2239310, 2268300, 2296791, 2327194, 2359226, 2391853, 2426527, 2465247, 2507371, 2551680, 2599502, 2652348, 2708734, 2766946, 2828570, 2895491, 2966024, 3038130, 3113834, 3196010, 3283411, 3373509, 3467600, 3568249, 3674391, 3784055, 3899358]
58238C899358J24143J31854J37085J44159J54635J64483J72590J83371J97843
58229E309521K11196K22439K36879K55729K73465K89220L09944L38043L67164
58220G813600L94699M26757M65857N06222N46690N95325O55392P20457P89412
58211A2914411Q71914R72292J083871J206671J354409J536374J750418K002814
58203B3693174K316648K712694L203516L814783M585579N533097O640857P893547
58195F0393895R298294J0869169J2638474J4704562J7224437K0332844K4085683
58188A69547358K8401496L2821524L6183421L6743321L3044825K4927408J3691506
58181C75360859J283009j0611470k0806559k8428637l2914811l4246318l2984372
$$ y = [3899358, 4023501, 4155355, 4292440, 4436599, 4591234, 4755717, 4928307, 5111678, 5309521, 5520717, 5743156, 5980035, 6235764, 6509229, 6798449, 7108393, 7446436, 7813600, 8208299, 8635056, 9100913, 9607135, 10153825, 10749150, 11404542, 12124999, 12914411, 13786325, 14758617, 15842488, 17049159, 18403568, 19939942, 21690360, 23693174, 26009822, 28722516, 31926032, 35740815, 40326394, 45859491, 52500348, 60393895, 69692189, 80561358, 93199832, 107904394, 125128831, 145461675, 169547358, 197948854, 230770378, 266953799, 303697120, 336741945, 361669353, 375360859, 376643868, 366032398, 345225839, 316797202, 283882391, 249636073, 216651701]
58174B16651701k9970535k6000385k1695636j7487523j3623044j0250792p549169
58167I0074617n715155m794943m592219m796160n161731n538232n797302n826046
58159D7852829n589036n141873m574178l963405l371163k841667k390445k011230
58151A7969832j696998j443536j239247j068855r26066q10680p17005o36618n68383
58142H862444n14756m72114m34542m02581l78653l58423l35853l12318k92017
58133E361187k72920k50833k27945k08862j92213j74171j56464j43225j33615
58124C600939j24770j18234j16396j16241j13575j09852j08250j06676j01442
58115B585503r4278q9052q4839p8809p2696o9696o7938o3647n8103n5003n3384
$$ y = [216651701, 186681166, 160680781, 138985145, 121497622, 107874578, 97623786, 90074617, 84359462, 79564519, 74972300, 70176140, 65014409, 59476177, 53678875, 47852829, 42263793, 37121920, 32547742, 28584337, 25213174, 22371507, 19981062, 17969832, 16272834, 14829298, 13590051, 12521196, 11595130, 10784450, 10067445, 9430827, 8862444, 8347688, 7875574, 7441032, 7038451, 6659798, 6301375, 5965522, 5653204, 5361187, 5088267, 4837434, 4609489, 4400627, 4208414, 4034243, 3877779, 3734554, 3600939, 3476169, 3357935, 3241539, 3125298, 3011723, 2901871, 2793621, 2686945, 2585503, 2491225, 2402173, 2317334, 2238525, 2165829, 2096133, 2028195, 1964548, 1906445, 1851442, 1798058]
58104A798058m9736m4882m2326m1528l9047l4951l2257l1054k8743k5222k2779
58093A405533k1696k0562k0021k1684k4280k5143k4550k4675k5361k4828k3432
58082A149301k2827k2605k1434k0251k0683k1626k0954j9349j8776j8599j6933
58071I25264j4504j3432j3308j2155j0273r529r759r281q131p487o883n180l321
58058H02021k978l465l110k602l766o042p351p549p884q050o892n167m471m274
58044G28420l060j463j164j552o46J385K704L087L685M233L589K372K129K366
58030G46085J435l21j259j717l360n675o366n170m241m660n320n445n588n900
58016F92498n747n195m825m230k719j156q96j408j088J28J193K311M281O197O470
$$ y = [1798058, 1748322, 1703440, 1661114, 1619586, 1580539, 1545588, 1513331, 1482277, 1453534, 1428312, 1405533, 1383837, 1363275, 1343254, 1321570, 1297290, 1272147, 1247597, 1222922, 1197561, 1172733, 1149301, 1126474, 1103869, 1082435, 1062184, 1041501, 1019875, 998921, 979572, 960796, 942197, 925264, 910760, 897328, 884020, 871865, 861592, 852063, 842304, 833023, 824892, 817405, 810522, 805342, 802021, 799043, 795578, 792468, 789866, 786100, 780058, 772707, 765158, 757274, 749224, 742332, 737165, 732694, 728420, 725360, 723897, 722733, 721181, 720535, 721920, 724624, 727711, 731396, 735629, 739218, 741590, 743719, 746085, 747520, 747199, 745940, 744223, 740863, 735188, 728822, 723652, 719411, 714751, 709431, 703986, 698398, 692498, 686751, 681556, 676731, 672501, 669782, 668626, 667730, 666322, 665234, 665362, 666555, 668866, 673147, 679344, 685814]
58001F85814N756O089P444P842O693N200L730J539q47k017k572m710q394j0833
57987G00734j0540r274q934q965q013o212m626l786l733m284m682m072k633j273
57973F19707k30Q85J993K912M332O844R401J0557J0775J1488J2296J1352Q375
57960G10687N017K132r37m213o583p941r535j1564j2504j1532r744q204o607m603
57946F23869k749j262N58K851M502M789M484M592N030N167M676L451J537o00k644
57931F58251n174q770j2524j4893j5824j6506j7128j6677j5049j3475j2415j0827
57919D98989q127n262l164j598j58R25J634K599M058N404O254O820P019O325M818
57904E26536L237J765k7j938l195l917n054o686p917q674r862j1374j1793j0734
$$ y = [685814, 691570, 697659, 705103, 712945, 719638, 724838, 728568, 730107, 729260, 727243, 724671, 719961, 711567, 700734, 690194, 680920, 671986, 663021, 655008, 648796, 644170, 640384, 636651, 632367, 627685, 623613, 620980, 619707, 619477, 620362, 622355, 625267, 629599, 636443, 645844, 656401, 667176, 678664, 690960, 702312, 710687, 715704, 717836, 716899, 712686, 706103, 698162, 688627, 677063, 664559, 653027, 643283, 635079, 628472, 623869, 621120, 619858, 620416, 623267, 627769, 632558, 637042, 641634, 646664, 651831, 656507, 659958, 661495, 660895, 658251, 653077, 644307, 631783, 616890, 601066, 584560, 567432, 550755, 535706, 522231, 509816, 498989, 490862, 485600, 482436, 480838, 480680, 481605, 483239, 485838, 489896, 495300, 501554, 508374, 515393, 521718, 526536, 529773, 531538, 531511, 529573, 526378, 522461, 517407, 510721, 502804, 494130, 484268, 472894, 461101, 450367]
57890D50367r708r765r949r114p757o832o032m556k546o64J023K665L938M572
57876C95642M983N546O011O277O896Q055Q839Q371P023N729M667L458K101R41
57862D74539Qr16j852k675l426m197m984n768o484o823o539n953n649n676n600
57847D08005n200m532l503k134j103j060j610j900j980k526l395l774l738m244
57833C67306n424o322o578o956p716p964p206o309o117o242n953n344m869m596
57819B79710m460m478m203k884p13R79J395J268J674K804M396O434Q726J0562
57805C01210J1484J1789J1781J1245J0175R205Q826Q828Q928R116R072Q249P039
57792D26947O883Q517J0881J2401J2582J1765J0184P901N069J631k677p576j2159
$$ y = [450367, 440659, 430894, 420945, 411831, 404074, 397242, 391210, 386654, 384108, 383444, 384467, 387132, 391070, 395642, 400625, 406171, 412182, 418459, 425355, 433410, 442249, 450620, 457643, 463372, 468039, 471497, 473598, 474539, 474547, 473631, 471779, 469104, 465678, 461481, 456497, 450729, 444245, 437422, 430883, 424930, 419281, 413605, 408005, 402805, 398273, 394770, 392636, 391533, 390473, 388863, 386963, 384983, 382457, 379062, 375288, 371550, 367306, 361882, 355560, 348982, 342026, 334310, 326346, 319140, 312831, 306714, 300472, 294519, 289175, 284306, 279710, 275250, 270772, 266569, 263685, 262972, 263951, 265346, 266614, 268288, 271092, 275488, 281922, 290648, 301210, 312694, 324483, 336264, 347509, 357684, 366889, 375715, 384543, 393471, 402587, 411659, 419908, 426947, 433830, 442347, 453228, 465629, 478211, 489976, 500160, 508061, 513130, 514761, 512084, 504508, 492349]
57779D92349j5863j8791k0795k1260k0250j8810j7613j6211j4233j2268j0785
57768C05470r264p216n208l847k653r13Q99J679J300P43Q85J794K994L918M381
57753B94962M815N682O560O587N950N854O646P068O100M487L540L356L147K591
57739C67345J938J274O43L46M39M80L50O72J736K707K762K377K626L716M990N897
57723D00298O297O315O526P614R280J0219R894R472J0195J1707J3004J4167J5839
57710E30827J7667J8735J9268K0521K3005K5993K8835L1752L5152L9035M3274
57699H34064M7958N3290N9496O6832P5285Q4500R4250J04627J15551J26560J37403
57688A799816J48225J58645J67346J73106J75606J74538J68624J56447J37834
$$ y = [492349, 476486, 457695, 436900, 415640, 395390, 376580, 358967, 342756, 328523, 316255, 305470, 296206, 288990, 283782, 279935, 277282, 276369, 277268, 278947, 280247, 280990, 281875, 283669, 286663, 290581, 294962, 299777, 305459, 312019, 318606, 324556, 330410, 337056, 344124, 350224, 354711, 358251, 361607, 364754, 367345, 369283, 370557, 371200, 371546, 371985, 372465, 372815, 373487, 375223, 377930, 380692, 383069, 385695, 389411, 394401, 400298, 406595, 412910, 419436, 427050, 436330, 446549, 456443, 465915, 476110, 487817, 500821, 514988, 530827, 548494, 567229, 586497, 607018, 630023, 656016, 684851, 716603, 751755, 790790, 834064, 882022, 935312, 994808, 1061640, 1136925, 1221425, 1315675, 1420302, 1535853, 1662413, 1799816, 1948041, 2106686, 2274032, 2447138, 2622744, 2797282, 2965906, 3122353, 3260187]
57679C260187J13865Q6039N6276K7158J398j8768l1262l4094k6618j0697R416
57668C432900K7483L5496K5881l943m9057j00122j48643j88880k16667k29356
57658B585092k27356k13996j93273j68485j42635j18452r7380p9385o4046n1061
57648A229023l9897k9947k1148j3591o737J9O279J1341J5929K1841K9615L7766
57636A240493M4780N0894N7546O5857P5967Q7065R7854J07589J16762J26060J34731
57625B205598J40869J43282J41943J36522J25648J08215Q4572N6029K4072r549
57615C157201m2782p3873j01482j24096j40217j49611j53546j53321j49282j41749
57605A927242j32122j22229j12954j04059r5089q5960p6989o8748o1794n6197
$$ y = [3260187, 3374052, 3460091, 3516367, 3543525, 3544923, 3526155, 3494893, 3460799, 3434181, 3423484, 3432900, 3460383, 3495879, 3521760, 3517817, 3468760, 3368638, 3219995, 3031115, 2814448, 2585092, 2357736, 2143740, 1950467, 1781982, 1639347, 1520895, 1423515, 1344130, 1280084, 1229023, 1189126, 1159179, 1138031, 1124440, 1117703, 1117722, 1124001, 1135342, 1151271, 1173112, 1202727, 1240493, 1285273, 1336167, 1393713, 1459570, 1535537, 1622602, 1720456, 1828045, 1944807, 2070867, 2205598, 2346467, 2489749, 2631692, 2768214, 2893862, 3002077, 3086649, 3142678, 3166750, 3157201, 3114419, 3040546, 2939064, 2814968, 2674751, 2525140, 2371594, 2218273, 2068991, 1927242, 1795120, 1672891, 1559937, 1455878, 1360789, 1274829, 1197840, 1129092, 1067298, 1011101]
57595A011101n1511m7249m3150l9063l4965l1185k8059k5366k2620k0014j8356
57584F49563j7840j7508j6358j4421j2458j0941r834q988q318p752p279o911o539
57571E04416n982n304m739m231l371j911j28J388K178K238K190K999N082P706
57557E02531R720J0794J1585J2764J4390J6167J7832J9256K0596K2262K4352K6386
57545G08635K8175L0644L4983M1008M7290N2952N8513O4759P1700P8928Q6236
57534A303823R3449J00232J06450J12125J16679J18742J16994J10768R9714Q3562
57524B362538O2664L8183J1438j6372m3469o7395q6352j00333j10244j16323j18010
57513A816325j15246j09251j01926r4704q7931q1080p3618o5727n8116n1247m5006
$$ y = [1011101, 959590, 912341, 869191, 830128, 795163, 763978, 735919, 710553, 687933, 667919, 649563, 631723, 614215, 597857, 583436, 570978, 560037, 550203, 541215, 532897, 525145, 517866, 510955, 504416, 498434, 493130, 488391, 484160, 480789, 478878, 478750, 480138, 482316, 484554, 486744, 489743, 494825, 502531, 512251, 523045, 534630, 547394, 561784, 577951, 595783, 615039, 635635, 657897, 682249, 708635, 736810, 767454, 802437, 843445, 890735, 943687, 1002200, 1066959, 1138659, 1217587, 1303823, 1397272, 1497504, 1603954, 1716079, 1832758, 1951500, 2068494, 2179262, 2278976, 2362538, 2425202, 2463385, 2474823, 2458451, 2414982, 2347587, 2261235, 2160902, 2050658, 1934335, 1816325, 1701079, 1591828, 1489902, 1395198, 1307267, 1226187, 1152569, 1086842, 1028726, 977479, 932473]
57502I32473l9188l3865k9196k5190k1787j8819j5861j2547r068n897k926N08
57490G18637M512Q198J0758J2525J4562J7595K1673K6538L1822L7072M2032M6847
57478I92771N1863N7398O3666P0713P8258Q5971R3762J01417J07812J11186J10529
57467A925346J06226R8915Q8122P2557N1628K6295j428k9468n6134p9967r9460
57456B102632j13335j21275j24277j23932j21307j16683j10035j01536r1830q2232
57446I96190p4267o8319o3021n6801m9885m3911l9628l6090l2319k8618k5709
57435D77622k3459k1268j9089j7308j5952j4608j2929j0939r035p850p710q124
57423C09351q255p913p504p056o208n243n064n805o362n929m991m235l519k688
$$ y = [932473, 893285, 859420, 830224, 805034, 783247, 764428, 748567, 736020, 726952, 721055, 718129, 718637, 723149, 731347, 742105, 754630, 769192, 786787, 808460, 834998, 866820, 903892, 945924, 992771, 1044634, 1102032, 1165698, 1236411, 1314669, 1400640, 1494402, 1595819, 1703631, 1814817, 1925346, 2031572, 2130487, 2218609, 2291166, 2342794, 2369089, 2367661, 2338193, 2282059, 2202092, 2102632, 1989297, 1868022, 1743745, 1619813, 1498506, 1381823, 1271788, 1170252, 1078422, 996190, 921923, 853604, 790583, 733782, 683897, 639986, 600358, 564268, 531949, 503331, 477622, 454163, 432895, 413806, 396498, 380546, 365938, 353009, 342070, 333035, 325185, 317475, 309351, 301096, 293183, 285679, 278623, 272415, 267172, 262108, 256303, 249941, 244012, 239021, 234786, 231267, 228579]
57409B28579k475l409m528m371k941j628j366j829k226k032j073K98J206J105
57395B03310N52M51P59P27K13j04J44M53K19m85j124j271r03m19k94m88m74j03
57377B01163k6p78j818k190j719r24j02O51R08L25m93n63L5L26N7J06R26J677
57359A97561J484O94J39j63p09j320j264m95N1l19j127j412r83m85l72m02k69
57342A90609k08n17q89p54j60M03Q96J670K549K871K741L160M382N124M319K848
57326B19044K446L332M143L942L161K523K152J985K257L136M353N458O066N950
57312B69948N307M892N342O375P215P643Q125Q997J0172J1612J3345J5020J6116
57299C90109J6696J7277J7961J8320J8263J8337J8919J9659J9868J9122J7376
$$ y = [228579, 226104, 222695, 218167, 213796, 210855, 209227, 207861, 206032, 203806, 201774, 200701, 200999, 202205, 203310, 203862, 204313, 205072, 205799, 206012, 205908, 206052, 206505, 206724, 206239, 205115, 203844, 202941, 202522, 202228, 201740, 201266, 201163, 201137, 200359, 198541, 196351, 194632, 193708, 193606, 194257, 195165, 195490, 194997, 194434, 194469, 194795, 194852, 194958, 195884, 197561, 199045, 199739, 199878, 199715, 199006, 197686, 196422, 195927, 195978, 195659, 194532, 193120, 192137, 191652, 191280, 190878, 190609, 190401, 189884, 188995, 188241, 188081, 188484, 189380, 191050, 193599, 196470, 199211, 202371, 206753, 211877, 216196, 219044, 221490, 224822, 228965, 232907, 236068, 238591, 240743, 242728, 244985, 248121, 252474, 257932, 263998, 269948, 275255, 280147, 285489, 291864, 299079, 306722, 314847, 323844, 334016, 345628, 358973, 373993, 390109, 406805, 424082, 442043, 460363, 478626, 496963, 515882, 535541, 555409, 574531, 591907]
57288E91907J4986J2582J0453Q110M975J290k334o054j0478j5250j9032k1113
57276E70042k2084k2617k2596k1916k1159k0777k0339j9257j7703j6084j4218
57265C51292j1761r161p360o632o298n548m238k870k003j677j354o63J6L7n07
57250B91273q80p53n10l90j85J03J08j5N21J914L181L376K756K108J664J284J085
57233C06640J155J166R64J055J779K516K528K107K072K533L031L503M169M698
57219C39916M563M132M354N297N909N470M479L789L601L650L810M133M575N051
57205D02729N509N817N827N662N680O072O661P159P445P565P640P760P929Q158
57191D97613Q600R332J0022J0207J0020J0091J0597J1061J1379J2269J4075J5894
$$ y = [591907, 606893, 619475, 629928, 638038, 643013, 644303, 641969, 635915, 625437, 610187, 591155, 570042, 547958, 525341, 502745, 480829, 459670, 438893, 418554, 399297, 381594, 365510, 351292, 339531, 330370, 323010, 316378, 310080, 304532, 300294, 297424, 295421, 293744, 292390, 291727, 291743, 291780, 291273, 290393, 289640, 289130, 288740, 288555, 288658, 288766, 288751, 289272, 291186, 294367, 297743, 300499, 302607, 304271, 305555, 306640, 307795, 308961, 309925, 310980, 312759, 315275, 317803, 319910, 321982, 324515, 327546, 331049, 335218, 339916, 344479, 348611, 352965, 358262, 364171, 369641, 374120, 377909, 381510, 385160, 388970, 393103, 397678, 402729, 408238, 414055, 419882, 425544, 431224, 437296, 443957, 451116, 458561, 466126, 473766, 481526, 489455, 497613, 506213, 515545, 525567, 535774, 545794, 555885, 566482, 577543, 588922, 601191, 615266, 631160]
57179F31160J6724J6907J7456J8433J9018J8943J8753J8710J8520J8151J7984
57168H30759J8038J7947J7815J8122J8699J8748J8140J7737J8093J8718J9025
57157A031841J9128J9300J9339J9110J9030J9493K0250K0884K1432K2120K2855
57146A254782K3341K3404K2954K2045K1110K0661K0641K0571K0535K1280K3195
57135A494519K5913K9255L3898M0663M9684O0435P1854Q2203Q9695R3856R5684
57124B167659R6186R5553R4011R2404R1259R0254Q9376Q9726R2342R7059J03252
57113C199081J10911J20087J30250J41267J54305J70711J90579K13460K39740
57104D670391K70476L06768L50599M05519M75165N61653O66577P92659R42837
$$ y = [631160, 647884, 664791, 682247, 700680, 719698, 738641, 757394, 776104, 794624, 812775, 830759, 848797, 866744, 884559, 902681, 921380, 940128, 958268, 976005, 994098, 1012816, 1031841, 1050969, 1070269, 1089608, 1108718, 1127748, 1147241, 1167491, 1188375, 1209807, 1231927, 1254782, 1278123, 1301527, 1324481, 1346526, 1367636, 1388297, 1408938, 1429509, 1450044, 1471324, 1494519, 1520432, 1549687, 1583585, 1624248, 1673932, 1734367, 1806221, 1888424, 1978119, 2071975, 2167659, 2263845, 2359398, 2453409, 2545813, 2637072, 2727326, 2816702, 2906428, 2998770, 3095829, 3199081, 3309992, 3430079, 3560329, 3701596, 3855901, 4026612, 4217191, 4430651, 4670391, 4940867, 5247635, 5598234, 6003753, 6478918, 7040571, 7707148, 8499807, 9442644]
57095I442644J117982J316262J533385J762332J994951K226880K460280K699676
57087B4554392K945755L194239L436960L659367L839265L953564L983104L900678
57079E3467324L654252L178936K443593J489563M19396o52188j637011k478847
57071E9885018l144888l624154l928025m081356m109467m033105l871113l642544
57063B9450366l365953l059160k739261k421031k115758j832611j579689j361724
57055A0975179j177866j023657q94709p87194o96329o17186n47135m85711m32134
57046D313258l84575l41826l03932k70721k41013k13765j88940j66866j47560
57037B054060j30931j16828j04632r3509q3271p4365o6911o0409n4553m9557m5345
$$ y = [9442644, 10560626, 11876888, 13410273, 15172605, 17167556, 19394436, 21854716, 24554392, 27500147, 30694386, 34131346, 37790713, 41629978, 45583542, 49566646, 53467324, 57121576, 60300512, 62744105, 64233668, 64653064, 64000876, 62363865, 59885018, 56740130, 53115976, 49187951, 45106595, 40997128, 36964023, 33092910, 29450366, 26084413, 23025253, 20285992, 17864961, 15749203, 13916592, 12336903, 10975179, 9797313, 8773656, 7878947, 7091753, 6395424, 5778238, 5231103, 4745392, 4313258, 3928683, 3586857, 3282925, 3012204, 2771191, 2557426, 2368486, 2201620, 2054060, 1923129, 1806301, 1701669, 1608160, 1524889, 1450524, 1383613, 1323204, 1268651, 1219094, 1173749]
57026A173749m1096l6050l0415k5026k0339j5964j1084n168J676R087J7157K6498
57014A043025L7458M9481O1131P0075P2878O5965M8043K1641q375l7622o3264
57003A360436q3166r5520r9748r7028q9635q0009p0245o1517n3743m6299l9191
56992E44335l3122k8448k4645k0955j6981j2643q046l568L81L693O344P987Q209
56979D22541P144N223K594o30l702n686o525o896o981o346n027l757k826j675
56965C87451l9J539K777M371O904R808J2162J3969J5749J7242J7313J5104J0763
56952E15113N155p29o176j0962j5059j8090j9401j8898j7322j5397j3144j0357
56940C74733p285m310j318K034N641R031J2010J4887J8113K1823K5351K7094K5296
$$ y = [1173749, 1132653, 1096603, 1066188, 1041162, 1020823, 1004859, 993775, 988607, 990283, 999370, 1016527, 1043025, 1080483, 1129964, 1191095, 1261170, 1334048, 1400013, 1448056, 1469697, 1461322, 1423700, 1360436, 1277270, 1181750, 1082002, 984974, 895339, 815330, 745085, 683568, 629825, 583526, 544335, 511213, 482765, 458120, 437165, 420184, 407541, 399495, 395927, 396308, 400001, 406345, 414332, 422541, 429685, 434908, 437502, 436872, 433170, 427484, 420959, 414063, 407082, 400736, 395709, 391952, 389126, 387451, 387412, 388951, 391728, 396099, 403003, 412811, 424973, 438942, 454691, 471933, 489246, 504350, 515113, 520268, 519539, 513363, 502401, 487342, 469252, 449851, 430953, 413631, 398234, 385090, 374733, 367448, 363138, 361820, 363854, 369495, 378526, 390536, 405423, 423536, 445359, 470710, 497804, 523100]
56927E23100J9423J0557L19j0074j9549k6829l1070l2523l1946k9723k6082k1800
56915C23803j7931j4948j2633j0685r021p654o756o527o673o282m849l146k439
56902B14259k968l756l756k724j017Q27K381L575M702N868O735P203P996R945
56888B49270J2831J5655J7880J9703K1009K0785J7943J2414N353j517o804j0102
56876C74420j1879j2630j2332j0941r005p166n299k765N94M310Q033J1805J5592
56863C42737J9267K3123K7808L3296L8293M0852L9439L3504K3553J0980k317j4450
56851F16085k3877k9763l2268l2260l0300k6289k0361j3646p396j739M014J0047
56839D12247J5962K1880K8672L6868M6097N5522O3896O8968O7871N8839M2344
$$ y = [523100, 542523, 553080, 553399, 543325, 523776, 496947, 465877, 433354, 401408, 371685, 345603, 323803, 305872, 290924, 278291, 267606, 258585, 250931, 244175, 237648, 230975, 224693, 219844, 216698, 214259, 211291, 207535, 203779, 201055, 200038, 200865, 203246, 206821, 211523, 217391, 224126, 231329, 239325, 249270, 262101, 277756, 295636, 315339, 336348, 357133, 375076, 387490, 392843, 391326, 384522, 374420, 362541, 349911, 337579, 326638, 317633, 310467, 305168, 302403, 302997, 307307, 315340, 327145, 342737, 362004, 385127, 412935, 446231, 484524, 525376, 564815, 598319, 621872, 632852, 630535, 616085, 592208, 562445, 530177, 497917, 467617, 441328, 420967, 407321, 399925, 398186, 402200, 412247, 428209, 450089, 478761, 515629, 561726, 617248, 681144, 750112, 817983, 876822, 919166]
56828I19166K0569l485k6308m4533n6348o2079o3032o0124n3962m5583l6370k7396
56816D60515j9214j2042n753J81O299J2852J9971K7850L6303M4231M9650N0338
56804F71181M4656L2427J5435l152k0248l3961m3599m9098n0652m8644m3758l7188
56792D33399l0432k4461j9128j3843q646m094j73L792Q141J2538J6826K1224K5132
56779D20275K6630K3988J7396Q550j032j0587j9392k6374l0705l2290l1608k9319
56767C15532k6102k2546j9063j5894j3153j0864q999p513o214m788l273k333k567
56754A72223l529m008l412k354j649j277p56k7N19O10K95k50q02j133j190j137
56738A52123j055q83p00p87j226j714j896j690j204p09o06j097j711j692r17n3
$$ y = [919166, 939735, 936250, 909942, 865409, 809061, 746982, 683950, 623826, 569864, 524281, 487911, 460515, 441301, 429259, 423506, 423687, 429986, 442838, 462809, 490659, 526962, 571193, 620843, 671181, 715837, 748264, 763699, 760547, 740299, 706338, 662739, 613641, 562989, 514345, 470587, 433399, 402967, 378506, 359378, 345535, 336889, 332795, 332622, 336414, 344555, 357093, 373919, 395143, 420275, 446905, 470893, 488289, 496839, 495807, 485220, 465828, 439454, 408749, 376459, 344851, 315532, 289430, 266884, 247821, 231927, 218774, 207910, 198911, 191398, 185184, 180396, 177123, 174790, 172223, 168694, 164686, 161274, 158920, 157271, 155994, 155238, 155211, 155730, 156340, 156635, 156385, 155583, 154450, 153260, 152123, 151068, 150185, 149485, 148698, 147472, 145758, 143862, 142172, 140968, 140259, 139653, 138556, 136845, 135153, 134236, 134183]
56722A34183K56r7r14j775j944r26O39J446J116N90O40R23R24R31J305J573J137
56705A40007L69J33N59J017J013N16l41j234j619j253n93j98m1J43K58J33MJ15
56687A38988K10L0n0L83R27Q28J69j33M55J472K083J881J115M00J42J01k61r17
56669A47823j225r64p02p97p88l34k0m57j190j356r87p41p98q45p84o23q4Q38
56651A35966J278N04q84j686j753j757j711r93K40R46O91J23k03l96m31J42J239
56634A31315J923J533M79m15q29q78p50o11m58OQ41J383R36q9n77k38J42L8j65
56615A33586m2K26L64L80K05l08q02n92K97J054J193R93O18j46j045j190l21O58
56597A35128R84R76J151J208P19R0J8L95O51O95Q45J047R87P74Q91J446J996K097
$$ y = [134183, 134439, 134342, 133428, 131653, 129709, 128783, 129422, 130868, 131984, 132574, 133214, 134137, 135061, 135992, 137297, 138870, 140007, 140376, 140509, 141068, 142085, 143098, 143614, 143273, 142039, 140420, 139167, 138574, 138376, 138335, 138478, 138736, 138869, 138873, 138988, 139198, 139228, 139178, 139561, 140488, 141316, 141485, 141352, 141807, 143279, 145362, 147243, 148358, 148758, 148900, 149001, 148740, 147823, 146598, 145634, 144932, 144135, 143347, 143013, 142993, 142536, 141346, 139990, 139003, 138262, 137464, 136619, 135835, 135212, 135128, 135966, 137244, 137748, 136864, 135178, 133425, 131668, 129957, 128964, 129204, 130150, 130841, 130964, 130761, 130365, 129934, 130076, 131315, 133238, 134771, 135250, 134835, 134006, 133128, 132378, 131767, 131309, 131315, 132156, 133539, 134475, 134386, 133809, 133571, 133713, 133751, 133586, 133544, 133770, 134134, 134514, 134719, 134411, 133609, 133017, 133314, 134368, 135561, 136554, 137172, 137026, 135981, 134791, 134470, 135128, 136112, 137088, 138239, 139447, 140166, 140256, 140274, 140669, 141320, 142015, 142860, 143907, 144894, 145668, 146559, 148005, 150001, 152098]
56579A52098J755J352J336J813K294K094J230N62Q74K041L259L850L663L072K791
56564A84084L287M222M774M657M393M367M254L645K755K111J866J841J855J701
56550B29812J107N5j046j814k279k622k862k983l089l166l086k966l199l901m677
56535A93284n102n067m556l553k409j776j815j882j371m94Q1J5n91j465k138k049
56519A59112j204n06q76k168l313l527k969k271j751j344r99r22j194j406r63
56504A33699J50J219J619J450J164R22P01O17P04O74M44N31J285K069K019J376
56488A50643J166J704K315K464K311K049J648J332J423J616J278O00M87J157J814
56473A74007J970K044K341K395J891J401J587K334L170L881M332M281L766L194
$$ y = [152098, 153853, 155205, 156541, 158354, 160648, 162742, 163972, 164534, 165408, 167449, 170708, 174558, 178221, 181293, 184084, 187371, 191593, 196367, 201024, 205417, 209784, 214038, 217683, 220438, 222549, 224415, 226256, 228111, 229812, 230919, 230974, 229928, 228114, 225835, 223213, 220351, 217368, 214279, 211113, 208027, 205061, 201862, 197961, 193284, 188182, 183115, 178559, 175006, 172597, 170821, 169006, 167124, 165753, 165259, 165340, 165355, 164764, 163299, 161161, 159112, 157908, 157402, 156526, 154358, 151045, 147518, 144549, 142278, 140527, 139183, 138184, 137262, 136068, 134662, 133699, 133849, 135068, 136687, 138137, 139301, 140223, 140924, 141541, 142245, 142919, 143363, 143894, 145179, 147248, 149267, 150643, 151809, 153513, 155828, 158292, 160603, 162652, 164300, 165632, 167055, 168671, 169949, 170549, 171036, 172193, 174007, 175977, 178021, 180362, 182757, 184648, 186049, 187636, 189970, 193140, 197021, 201353, 205634, 209400, 212594]
56459B12594K758K333K036K109K153J409jj056j342j523k041k352k032j608j633
56444B11804j873j979k082k177j841j113p72j137j532j483j461j799j945j562
56430A89048j263j390j176j45O96K43r55j565j375j154j133q98m17r6o9k00n22
56413A77629r58j129r83j070j536j638r82l80n41q59n21j1k05o92l66Q07J825
56396A68390K109J787J008R5r9Q70K052K220J517R26N48k02j029r04K68J346J496
56379A82398J023O30O93J260J949K027J349R06J619K973L757L731L481L053K026
56364B12875P28J25N11J279J894K136J638L74o28k49J016J576R04N8o0K31L39
56347B24747L46N56Q94J142J294J475J818K430L091L318L120L222M005M756M741
$$ y = [212594, 215352, 217685, 219721, 221830, 223983, 225392, 225391, 224335, 222993, 221470, 219429, 217077, 215045, 213437, 211804, 209931, 207952, 205870, 203693, 201852, 200739, 199967, 198830, 197298, 195815, 194354, 192555, 190610, 189048, 187785, 186395, 185219, 185074, 185770, 186013, 185058, 183493, 182118, 180964, 179831, 178933, 178516, 178420, 178351, 178151, 177629, 176671, 175542, 174559, 173489, 171953, 170315, 169333, 168953, 168412, 167553, 167032, 167021, 166816, 166124, 165758, 166565, 168390, 170499, 172286, 173294, 173389, 173290, 174160, 176212, 178432, 179949, 180875, 181423, 181221, 180192, 179288, 179556, 180902, 182398, 183421, 184051, 184744, 186004, 187953, 189980, 191329, 192235, 193854, 196827, 200584, 204315, 207796, 210849, 212875, 213603, 213728, 214239, 215518, 217412, 219548, 221186, 221560, 220932, 220683, 221699, 223275, 224179, 224237, 224177, 224408, 224747, 225093, 225649, 226543, 227685, 228979, 230454, 232272, 234702, 237793, 241111, 244231, 247453, 251458, 256214, 260955]
56332B60955M449M778N513N662N002M244L906L911M142M519M762M799N027N478
56318C27147N381M330L170K683K256J076k05l80M02J089J442J771J615M60p30
56303C51507n38O68J322J209J472K323K776K748L354M795N858O018O209P072Q039
56288D04832Q721R666J1132J2517J3605J5021J6924J8503J9351K0151K1582K3589
56276E95594K6020K8870L1698L4088L6803M1183M7153N3322N9241O6019P4276
56265A094267Q3088R1612J00348J09921J19878J29410J38303J46502J53494J58661
56255B325484J61534J61527J58300J52317J44045J32744J17243R7913P6522N4197
56245C581826L1129Q302j2356k9957m5286n8888p0086p8409q4637q9709r3793
$$ y = [260955, 265404, 270182, 275695, 281357, 286359, 290603, 294509, 298420, 302562, 307081, 311843, 316642, 321669, 327147, 332528, 336858, 340028, 342711, 344967, 346043, 345838, 345458, 345860, 346949, 348391, 350162, 351777, 352237, 351507, 350969, 351637, 352959, 354168, 355640, 357963, 360739, 363487, 366841, 371636, 377494, 383512, 389721, 396793, 404832, 413553, 423219, 434351, 446868, 460473, 475494, 492418, 510921, 530272, 550423, 572005, 595594, 621614, 650484, 682182, 716270, 753073, 794256, 841409, 894731, 953972, 1019991, 1094267, 1177355, 1268967, 1369315, 1479236, 1599114, 1728524, 1866827, 2013329, 2166823, 2325484, 2487018, 2648545, 2806845, 2959162, 3103207, 3235951, 3353194, 3451107, 3527629, 3581826, 3612955, 3621257, 3608901, 3578944, 3533658, 3474770, 3404684, 3326275, 3241638, 3151929, 3058136]
56234C058136r6820r9010j00486j01483j02917j05466j08135j09221j08706j08045
56224B017847j07643j06331j03586j00242r6699r2277q6845q1262p5715o9475
56214A097772o2744n6873n2152m7377m2126l7475l3853l0270k6460k3597k1969
56203F62876k0123j7443j5410j4944j4541j2647j0076q491p932p467o923o537
56191E20342n945m889l849l043j862j83J068J527K121L301M120M011L946M612
56177E25277N017M256L301L708N516P517Q636Q281O464M338L420L697L768L209
56163E96405L113L924M643M854N463O676P356P329Q208J0850J4055J6811J9822
56150G09509K3678K7669L1626L6767M3497N0582N7717O6620P8041Q9969J00269
$$ y = [3058136, 2961316, 2862306, 2761820, 2660337, 2557420, 2451954, 2343819, 2234598, 2125892, 2017847, 1910204, 1803873, 1700287, 1600045, 1503346, 1411069, 1324224, 1242962, 1167247, 1097772, 1035028, 978155, 926003, 878626, 836500, 799025, 765172, 734902, 708442, 684845, 662876, 642753, 625310, 609900, 594956, 580415, 567768, 557692, 549201, 541269, 533802, 526879, 520342, 514397, 509508, 505659, 502616, 500754, 500571, 501639, 503166, 505287, 508588, 512708, 516719, 520665, 525277, 530294, 534550, 537851, 541559, 547075, 554592, 563228, 571509, 577973, 582311, 585731, 589428, 593196, 596405, 599518, 603442, 608085, 612939, 618402, 625078, 632434, 639763, 647971, 658821, 672876, 689687, 709509, 733187, 760856, 792482, 829249, 872746, 923328, 981045, 1047665, 1125706, 1215675, 1315944]
56139A315944J08790J15290J17711J14521J06812R6422Q4113P1246O0726N4064
56129B245639M9330M3840L6980K8792J8444O200n286j3929k0571k6663l1995l6838
56117B293943m3704n4413o7380q0013r1520j01134j06241j05164r9717r2385q3121
56106A369151p1549n9797n0137m1938l3997k7673k4564k3159k1149j9088j8520
56095I77580j8352j6615j4072j2684j2038j0659r229q972q490n840k364r13j403
56082H55949j587r70n12K68K432M875N782N789O552P441O947O021O689Q480R557
56067I23713J0122J1360J2392J1664J0214J0139J1116J1599J1960J3155J3948
56056A051382J2971J1859J2697J4208J4145J3589J4817J6790J7012J6174J6599
$$ y = [1315944, 1424734, 1540024, 1657735, 1772256, 1879068, 1975490, 2059603, 2130849, 2191575, 2245639, 2294969, 2338809, 2375789, 2404581, 2423025, 2429225, 2423939, 2410010, 2389439, 2362776, 2330781, 2293943, 2250239, 2195826, 2128446, 2048433, 1956913, 1855779, 1749538, 1644374, 1544657, 1452272, 1369151, 1297602, 1237805, 1187668, 1145730, 1111733, 1084060, 1059496, 1036337, 1015188, 996100, 977580, 959228, 942613, 928541, 915857, 903819, 893160, 883931, 874959, 866469, 860629, 858265, 857352, 855949, 854362, 853392, 852880, 853148, 855580, 860455, 866237, 872026, 878578, 886019, 892966, 898987, 905676, 914156, 923713, 933835, 945195, 957587, 969251, 979465, 989604, 1000720, 1012319, 1024279, 1037434, 1051382, 1064353, 1076212, 1088909, 1103117, 1117262, 1130851, 1145668, 1162458, 1179470, 1195644, 1212243]
56045A212243J7792J7914J8059K0416K3712K5096K5178K6527K8723K9582K9895
56034A475137L2027L5185L6859L7599L9538M1681M1677M0639M1145M2134M1109
56023A904730L9623M0841M3353M3376M1658M2070M4723M6581M7677N0507N4348
56012B399487N6402N7482O0578O4950O7858P0419P5392Q1005Q3807Q5762R1238
56001C194380R8886J04117J07651J13715J21600J27381J32233J40346J50273J57328
55991D447910J62961J72533J85383J96631K07096K21475K38537K53580K68772
55982F354878K90146L16234L41121L66613L99193M37288M74619N13875N63109
55973A0057076O21024O80861P46407Q28004R25034J030077J148357J294563J472716
$$ y = [1212243, 1230035, 1247949, 1266008, 1286424, 1310136, 1335232, 1360410, 1386937, 1415660, 1445242, 1475137, 1507164, 1542349, 1579208, 1616807, 1656345, 1698026, 1739703, 1780342, 1821487, 1863621, 1904730, 1944353, 1985194, 2028547, 2071923, 2113581, 2155651, 2200374, 2246955, 2294632, 2345139, 2399487, 2455889, 2513371, 2573949, 2638899, 2706757, 2777176, 2852568, 2933573, 3017380, 3103142, 3194380, 3293266, 3397383, 3505034, 3618749, 3740349, 3867730, 3999963, 4140309, 4290582, 4447910, 4610871, 4783404, 4968787, 5165418, 5372514, 5593989, 5832526, 6086106, 6354878, 6645024, 6961258, 7302379, 7668992, 8068185, 8505473, 8980092, 9493967, 10057076, 10678100, 11358961, 12105368, 12933372, 13858406, 14888483, 16036840, 17331403, 18804119]
55964A8804119J679757J927433K239797K632283L117227L725550M493018N424517
55956D4043701O499443P709815R065404J0577157J2286656J4311327J6811368
55949A21304871J9909025K3654219K7938774L2190519L5079410L4818380L0168725
55942C25063923K1341368R900907k184879j3362874k2604196k9190675l2738567
55935B56225007l3396023l1810063k8813078k5139546k1342161j7795701j4692106
55928H3236329j2072306r909135q160772o766093n646451m738686m007169l419199
55920B8516518k934942k527881k190853j914430j679105j473335j299093j154104
55912A3342775j026327r10327q11849p31441o59436n91400n33382m87405m45988
$$ y = [18804119, 20483876, 22411309, 24651106, 27283389, 30400616, 34126166, 38619184, 44043701, 50543144, 58252959, 67318363, 77895520, 90182176, 104493503, 121304871, 141213896, 164868115, 192806889, 224997408, 260076818, 294895198, 325063923, 346405291, 356306198, 354121319, 340758445, 318154249, 288963574, 256225007, 222828984, 191018921, 162205843, 137066297, 115724136, 97928435, 83236329, 71164023, 61254888, 53094116, 46328023, 40681572, 35942886, 31935717, 28516518, 25581576, 23053695, 20862842, 18948412, 17269307, 15795972, 14496879, 13342775, 12316448, 11406121, 10594272, 9862831, 9203395, 8611995, 8078613, 7591208, 7145220]
55903G145220m05382l70892l44595l20191k94370k71730k54332k37291k18585
55894D427852k02921j92007j80874j67293j55510j47292j38412j27278j18267
55885B997998j13129j07503r9220r1971q7581q2462p4976o8862o6131o3642n9666
55874B082855n7053n6922n5769n1812m7852m5302m1658l6541l4003l6019l9451
55863A580473m1983m5248m9606n1733n0080m7414m5288m1408l4942k9098k5806
55852A117867k2874j8957j6347j6235j6138j4576j3746j4998j6175j5798j5548
55841I36475j6324j6224j4687j4242j5904j7100j6396j5941j6992j7400j5858
55830G59407j4394j4250j3505j1232r810j0463j0668q686o766p041p963p675p321
$$ y = [7145220, 6739838, 6368946, 6024351, 5704160, 5409790, 5138060, 4883728, 4646437, 4427852, 4224931, 4032924, 3852050, 3684757, 3529247, 3381955, 3243543, 3116265, 2997998, 2884869, 2777366, 2678146, 2586175, 2498594, 2416132, 2341156, 2272294, 2206163, 2142521, 2082855, 2025802, 1968880, 1913111, 1861299, 1813447, 1768145, 1726487, 1689946, 1655943, 1619924, 1580473, 1538490, 1493242, 1443636, 1391903, 1341823, 1294409, 1249121, 1207713, 1172771, 1143673, 1117867, 1094993, 1076036, 1059689, 1043454, 1027316, 1012740, 998994, 983996, 967821, 952023, 936475, 920151, 903927, 889240, 874998, 859094, 841994, 825598, 809657, 792665, 775265, 759407, 745013, 730763, 717258, 706026, 696216, 685753, 675085, 666399, 659633, 652592, 644629, 636954, 629633]
55817F29633q091q363o717m709l956l440k132j328j833j921n61L29p06k069k402
55802E81734l264n757p589o627m629m385n464n810n389n249m905l451j622k82
55788E17311J514M590P388P851O005K817j658p009j1353j3556j4889j6607j7663
55775D64741j6790j4886j3308j1681r495q038q589j0209j1315j1922j2502j2288
55763C23718j0744r100q525q233p179o062n786n515m240k858k804l841m961o086
55749B37784p317p876p492p345q080q325o891m866l838l431k465j159m18r0L13
55734A68504M12n6k47L41P56L22o8K37J42j238k755l091k924l400l899l309k175
55717A47552j666j559j112p69j179j575r82k0K46K16Q04J583J685J580K203L139
$$ y = [629633, 621542, 613179, 606462, 601753, 597797, 594357, 592225, 590897, 589064, 587143, 586582, 586911, 586205, 584136, 581734, 578470, 572713, 565124, 558497, 553868, 549483, 544019, 538209, 532820, 527571, 522666, 519215, 517593, 517311, 518825, 523415, 530803, 538654, 544659, 547476, 545818, 538809, 527456, 513900, 499011, 482404, 464741, 447951, 433065, 419757, 408076, 398581, 390543, 381954, 371745, 360430, 348508, 336006, 323718, 312974, 303874, 295349, 287116, 279937, 273875, 268089, 262574, 258334, 255476, 252672, 248831, 243870, 237784, 230467, 222591, 215099, 207754, 199674, 191349, 184458, 179592, 175754, 172323, 169858, 168699, 168281, 168191, 168504, 168916, 168860, 168613, 168954, 169710, 170032, 169964, 170201, 170343, 169105, 166350, 163259, 160335, 156935, 153036, 149727, 147552, 145886, 144327, 143215, 142446, 141267, 139692, 138710, 138690, 138936, 139152, 139956, 141539, 143224, 144804, 147007, 150146]
55701A50146L344K972K896L089K957K535K106J363J42r06j428k077l065l363k504
55686A58207j739j991k217j292l0L96O17J729L105L507L320L645M240M177L709
55671A79383L563L360K609K285L405M897M958L885L434L975M341M151M208M712
55657B33166M864M274L390K514J606P53j24j531l389m477m050l186l313m300n173
55642B21024n708o025n686m656m094m707n422n250n195o417p805p554o157n483
55628A40865n709n499m677m303m461m206l561l435l642l108j997j632k251k724
55614H9660k555k336k185j512m91m6k20j77R0l21j413k029j619q76m34k86n15
55597G2735j239j784j338m27l72j236j742j318p64p69j116j507j923k027j398
$$ y = [150146, 153490, 156462, 159358, 162447, 165404, 167939, 170045, 171408, 171550, 170644, 169216, 167139, 164074, 160711, 158207, 156468, 154477, 152260, 150968, 150938, 151334, 151951, 153680, 156785, 160292, 163612, 167257, 171497, 175674, 179383, 182946, 186306, 188915, 191200, 194605, 199502, 204460, 208345, 211779, 215754, 220095, 224246, 228454, 233166, 238030, 242304, 245694, 248208, 249814, 250567, 250443, 248912, 245523, 241046, 236996, 233810, 230497, 226197, 221024, 215316, 209291, 203605, 198949, 194855, 190148, 184726, 179476, 174281, 167864, 160059, 152505, 146348, 140865, 135156, 129657, 124980, 120677, 116216, 112010, 108449, 105014, 101372, 98264, 96267, 94635, 92384, 89660, 87105, 84769, 82584, 81072, 80581, 80535, 80315, 80138, 80228, 79907, 78494, 76465, 74846, 73970, 73536, 73250, 72735, 71496, 69712, 68374, 67947, 67575, 66339, 64597, 63279, 62515, 61746, 60630, 59123, 57200, 55173, 53775]
55582E3775m93j93m58n56m60p45j164q02K95R89O13l82j387k030j834o75M90O16
55564D5599O1j16Qm38j204j121j59M64L15K74P81J191J159J171J297R41J75l8
55546E0360N92J240J457J756K337K604K370K261K410K082J089M14P84J694K364
55531G5814K681K715K331J747J602K024K479K792L351M107M390M023L556L141
55517A16753K262Q80k77r36j706k849l747m056m306m863n275n242n212n434n379
55502G0613m723m111m172m492m278l444k512j816j367j062p71m67m51r61j561
55487C4425j517q41l51n39j023j198q79k50K33m8j190k343k577k022j426r53k75
55470A7226M27O58N63N54K84p76j908j788n43L04Q0k96j52J1j96k84l5q8o33p91
$$ y = [53775, 53282, 53089, 52631, 52075, 51615, 50870, 49706, 48904, 49199, 50188, 50801, 50419, 49032, 47002, 45168, 44493, 44983, 45599, 45660, 45544, 45552, 45114, 43910, 42789, 42630, 43094, 43409, 43683, 44464, 45655, 46814, 47985, 49282, 50223, 50398, 50360, 50952, 52192, 53649, 55405, 57742, 60346, 62716, 64977, 67387, 69469, 70558, 70972, 71756, 73450, 75814, 78495, 81210, 83541, 85288, 86890, 88914, 91393, 94185, 97536, 101643, 106033, 110056, 113612, 116753, 119015, 119895, 119618, 118682, 116976, 114127, 110380, 106324, 102018, 97155, 91880, 86638, 81426, 75992, 70613, 65890, 61779, 57607, 53115, 48837, 45393, 42881, 41065, 39698, 38636, 37865, 37398, 36947, 35986, 34425, 32908, 32067, 31716, 31177, 30154, 28956, 28077, 27827, 28060, 28012, 26822, 24479, 21902, 19880, 18454, 17501, 17226, 17653, 18311, 18874, 19428, 19712, 18936, 17028, 15240, 14697, 15001, 15081, 14785, 14633, 14644, 14448, 14164, 14129, 14041, 13408, 12617]
55450A2617j12N50M12l0l3K00K19L05Q30J348J283Q56N63K99k02n92l77J95M47
55431A8778K21o4k3L79Q96J073N80l25r16p52L2J091K010K224J473L73j48K1K68
55412B7191L71O10Q31M51n21j376j745j827j572p20K31L55j78j64P03J280Q18
55395B4738Q3p2l8m96j182j438j211p58j20M53L13o17j428j363o90LO36J173J213
55376A9199O56O4j98m46q25q74m44j75m28o65n34n49j026j257o87Rm5o32j012
55357A0131j039r09m94J77N54M64N95J284J709J304R32J398J761P04j110j809
55341A5652j097n39r87j436r03K5K29l46q67q44m81j79j24k40l09j80O5K95N21
55322H255P26O83K72k17l91k01J35M68P04O76L67K1j97m05o33o01k03J53P1j98
$$ y = [12617, 12505, 13055, 13467, 13437, 13404, 13604, 13823, 14128, 14958, 16306, 17589, 18445, 19008, 19307, 19105, 18513, 18136, 18331, 18778, 18999, 18935, 18912, 19291, 20187, 21260, 21840, 21515, 20599, 19847, 19879, 20970, 22980, 25204, 26677, 27050, 26902, 26923, 27191, 27562, 28172, 29003, 29454, 28933, 27557, 25812, 23985, 22413, 21693, 21924, 22279, 22101, 21937, 22640, 23920, 24738, 24821, 24749, 24711, 24215, 23033, 21595, 20384, 19626, 19506, 19959, 20272, 19655, 18227, 16864, 16174, 16177, 16813, 17986, 19199, 19855, 19919, 19721, 19275, 18450, 17576, 17132, 16957, 16529, 15864, 15330, 14781, 13755, 12498, 11811, 11820, 11775, 11143, 10131, 9092, 8183, 7689, 7866, 8420, 8884, 9479, 10763, 12472, 13776, 14708, 16106, 17867, 18571, 17461, 15652, 14555, 14016, 13029, 11593, 10690, 10715, 10944, 10598, 9731, 8887, 8406, 8227, 8103, 7863, 7554, 7374, 7439, 7734, 8255, 8981, 9664, 9936, 9719, 9328, 9127, 9262, 9730, 10434, 11110, 11477, 11498, 11301, 10896, 10263, 9662, 9459, 9612, 9683, 9485]
55302I485r7M44R73J125R31N85J45m14j009j333j058l20K09J03k42j97J29K25
55284I684J79N49J217J413R58N16L73m1r52j544j112j19N13N42K75j4m2M67J124
55265A3986R66k20j305j220l44K31K12J22K66M65N45N06L27R7J0o7n52j401j885
55246A0739j515o59J24P43J228J337J005N53L7q00j618j433j25R72P93l9l41n7
55228A0944K13N25J220J760J289P7p07o06k39j74l06l71k91JM73P91O94M28L41
55209A6062L70L37M12O80P40L26j01o2J11j17m72l28J96M06P3m37q28r95o96J42
55189A5819R78J155P19J68k47n09m44j6L22K14m1n6n4l61o45m36J2J26o4k01l26
55168A6113o35q34n83j55J1O2K70L70J47Q5N56R11M11m71p53m95m70p32p29n45
$$ y = [9485, 9388, 9832, 10805, 11930, 12861, 13446, 13591, 13177, 12168, 10835, 9777, 9457, 9666, 9769, 9527, 9330, 9459, 9684, 9863, 10412, 11629, 13042, 14000, 14516, 14889, 14848, 13896, 12352, 11240, 11121, 11634, 12176, 12451, 12437, 12395, 12862, 13986, 14952, 14732, 13427, 12207, 11863, 12094, 12306, 12428, 12694, 13159, 13704, 14210, 14537, 14634, 14644, 14577, 14025, 12624, 10739, 9224, 8565, 8689, 9432, 10660, 11997, 13002, 13555, 13592, 12792, 11174, 9741, 9616, 10588, 11381, 11342, 11001, 10944, 11157, 11682, 12902, 14662, 15951, 16028, 15321, 14715, 14476, 14302, 13996, 13625, 13334, 13335, 13808, 14599, 15293, 15721, 16062, 16432, 16769, 17181, 17861, 18601, 18927, 18826, 18764, 18875, 18758, 18286, 17958, 18154, 18560, 18633, 18196, 17368, 16373, 15677, 15819, 16797, 17952, 18671, 18839, 18592, 18083, 17639, 17623, 17945, 18159, 18118, 18062, 18008, 17647, 17002, 16566, 16578, 16704, 16640, 16439, 16113, 15478, 14644, 14061, 13906, 13917, 13979, 14249, 14619, 14766, 14851, 15407, 16318, 16729, 16258, 15505, 15010, 14540, 13808, 13079, 12534]
55148A2534p07r86o48J71O11N40O05Q93Q00L18J59M99P48P56R75J277R15l6m52
55129A8972J68R26R66N52J89l10j128j685j359l73N93J216J488J370R64N72K89
55112B3410%j34K50R24J126O06M3MK48L79M83P11P95N65L74N63Q49P07J16m21
55092C1598l91L54J411J917J296N3o15j66P84J339J246O98q2q16j136r60o04l45
55074C5581j93j96m65p64n64K28R77J024L67m80r99r13l47K26M04K91J64q9p47
55055C3505j538j806j478j174j218j197p61j96J42M79J183J991K248J731R42N28
55039C3381O08P17L86k65o36l80K22P24R48Q24K32n40p45o0Q14J059Q22P23P27
55020C9561L44l23o86p10q24r20l94O52J260Q90L8o69j191j553j402n86L28O17
$$ y = [12534, 11827, 10841, 10193, 10364, 10975, 11515, 12120, 13013, 13813, 14131, 14290, 14789, 15537, 16293, 17268, 18545, 19460, 19424, 18972, 19140, 20066, 21032, 21584, 21773, 21463, 20335, 18650, 17291, 16918, 17511, 18727, 20215, 21585, 22549, 23121, 23410, 23410, 23276, 23526, 24450, 25576, 26182, 26225, 26229, 26477, 26856, 27339, 28050, 28845, 29410, 29784, 30347, 31196, 31903, 32019, 31598, 31207, 31561, 32972, 34889, 36185, 36238, 35623, 35457, 36241, 37580, 38826, 39524, 39442, 38626, 37490, 36530, 35926, 35581, 35388, 35192, 34727, 33963, 33399, 33627, 34604, 35628, 35995, 35515, 34516, 33603, 33256, 33482, 33886, 34177, 34341, 34252, 33505, 31967, 30161, 28683, 27509, 26291, 25094, 24333, 24137, 24279, 24758, 25941, 27932, 30180, 31911, 32853, 33381, 33989, 34706, 35092, 34827, 34191, 33811, 34033, 34757, 35705, 36529, 36761, 36221, 35476, 35416, 36230, 37289, 38111, 38834, 39561, 39905, 39582, 38896, 38186, 37362, 36442, 36048, 36700, 37960, 38850, 38888, 38219, 37028, 35475, 34073, 33487, 33815, 34432]
55002C4432J84m69p71m85J53O69Q30Q19O84J69n62o39K88J118O38o06r99j55P55
54983C6053R89J126J720K332K383J978J436R47R15J774L051L614L204K776K964
54968F7262L302L406L814M953O299P281Q220R590J1191J2717J4340J6041J7093
54955A85509J6981J6085J4709J2183P850K342l040p736j1819j4989j6668j6895
54943A84512j6264j5167j3706j2154j0811r560q198o914n928m879l336j641n87
54930G5367k76OP37J568J858J498J099J493L022N152O894P783Q232Q918J0108
54915A33459J1698J3433J4883J5527J5138J3754J1221P298K383k479o583j0054
54903B19678j2982j4792j5039j4336j3817j3866j3884j3194j1712r872q156o639
$$ y = [34432, 34616, 34147, 33376, 32891, 33044, 33713, 34543, 35362, 36046, 36215, 35653, 35014, 35302, 36420, 37058, 36452, 35453, 35298, 36053, 37042, 38168, 39888, 42220, 44603, 46581, 48017, 48964, 49879, 51653, 54704, 58318, 61522, 64298, 67262, 70564, 73970, 77784, 82737, 89036, 96317, 104537, 114127, 125318, 138035, 152375, 168416, 185509, 202490, 218575, 233284, 245467, 253317, 255659, 252619, 244883, 233064, 218075, 201407, 184512, 168248, 153081, 139375, 127221, 116410, 106850, 98652, 91738, 85810, 80931, 77595, 75954, 75367, 75091, 75097, 75834, 77402, 79260, 80758, 81857, 83350, 86372, 91524, 98418, 106201, 114433, 123351, 133459, 145157, 158590, 173473, 189000, 204138, 217892, 229113, 236411, 238794, 236315, 229732, 219678, 206696, 191904, 176865, 162529, 148712, 134846, 120962, 107768, 96056, 86184, 78028, 71389]
54891G1389m987l099j616j259j677j718j023n24r20j540j365m72K66M46L33J24
54875E2358k33o56r69j221j499j612j307o79n4K91Q1q53k103k723k166r42N7M52
54857C6222L91N8l20m39k80k20m14m96k68j51m63p64n27n8o3n36q10n48j14L7
54837C0237j51m38n16j69N10J131J414J452J457J449J355J198R94P30N80Q19J433
54820D3485K119K738L332L721L631L264L152L367L569L859M740O080P132P893
54806A02082R332J1707J3741J4319J4033J4082J4375J3846J2105R586O464K479
54794B38151k155o557r930j2063j3185j3773j4173j4093j2903j0793q963q054
54782A11509p168n276k992j797j940k229j788r89n14l94j55N98J876L210L991
$$ y = [71389, 66402, 63303, 61687, 60428, 58751, 57033, 56010, 55486, 54566, 53026, 51661, 51189, 51455, 51901, 52234, 52358, 52125, 51469, 50500, 49279, 47780, 46168, 44861, 44182, 44128, 44419, 44500, 43647, 41544, 38821, 36655, 35713, 35770, 36222, 36613, 36671, 36351, 35912, 35632, 35412, 34998, 34502, 34234, 34083, 33620, 32856, 32329, 32271, 32208, 31672, 30862, 30314, 30200, 30237, 30086, 29648, 29132, 28963, 29473, 30604, 32018, 33470, 34927, 36376, 37731, 38929, 39923, 40653, 41233, 42052, 43485, 45604, 48342, 51674, 55395, 59026, 62290, 65442, 68809, 72378, 76237, 80977, 87057, 94189, 102082, 111414, 123121, 136862, 151181, 165214, 179296, 193671, 207517, 219622, 229208, 235672, 238151, 235996, 229439, 219509, 207446, 194261, 180488, 166315, 152222, 139319, 128526, 119563, 111509, 104341, 99065, 96073, 94276, 92336, 90107, 88319, 87330, 86816, 86422, 86267, 86865, 88741, 91951, 95942]
54767I5942M221M647N765P103Q009Q665R731J1294J2903J4259J5171J5089J3458
54754B26257J0404O551K309k111o219r407j1439j2447j2661j2460j2237j1835
54742A54705j0702q989p769p568p480o570n350m894n159n234m743l938k954j995
54728G1360j787k601l364k968j987j767k197j950p53K37L36J39J42N1k37k61m2
54711E2351k47q86j011k61M35K84k20k16K69O21N60J96k24l13J69P48O06j95o26
54692E2040j31O51R86J018J127J078M92k96n41M6J092J979K194J653Q83N41O40
54675F5452O91N84P13J171J524J606J796K261K574K480K368K572K737K420J759
54660I2708J150O43J35k18k27p5r2l31n88o80n50k72q9j94m09l75n5K14K46K22
$$ y = [95942, 100163, 104810, 110575, 117678, 125687, 134352, 144083, 155377, 168280, 182539, 197710, 212799, 226257, 236661, 243212, 245521, 243410, 237191, 227784, 216345, 203898, 191237, 178777, 166540, 154705, 144003, 135014, 127245, 119677, 112197, 105627, 100277, 95383, 90224, 84990, 80247, 76309, 73355, 71360, 69573, 66972, 63608, 60640, 58653, 56886, 54689, 52739, 51986, 52223, 52559, 52698, 52840, 52891, 52654, 52393, 52351, 52104, 51218, 50207, 49946, 50381, 50665, 50445, 50229, 50498, 51119, 51679, 51875, 51651, 51338, 51507, 52255, 52861, 52666, 52040, 51909, 52560, 53546, 54564, 55691, 56769, 57261, 56965, 56424, 56470, 57562, 59541, 61735, 63388, 64271, 64812, 65452, 66143, 66727, 67440, 68611, 70135, 71741, 73537, 75798, 78372, 80852, 83220, 85792, 88529, 90949, 92708, 93858, 94501, 94636, 94418, 94191, 94116, 94024, 93693, 93105, 92425, 91875, 91603, 91514, 91320, 90911, 90536, 90481, 90695, 90941, 91163]
54640I1163L90Q54J595K460L141L532L880M232M095L246K476K659L234K636L29
54625A29922k463m283m833m666m310m059m014l874l182k080j272j035q78l69K64
54610H8868O45P99Q63P78N84N40O47M80k58j300k171k642k759k672k613k630k466
54593G4693j981j555j568j689j329o49l61o52j062j431k014k687k878k550k290
54578D9997k243j810p93O4Q7m24q19r60j029r89p26l38J3K49K75P8n6J52M52L69
54558D1549p5m72p16q51n41M93J578J605M79q30j562j590q43N39J594J364L72
54541D2093oM06O07M14P64J682J847Q39N8N78J598J988J876J767J508J165J498
54524F0682K493K743J535J73pL67R3n40o54o12j138j689j455j133j832k893k711
$$ y = [91163, 91553, 92407, 94002, 96462, 99603, 103135, 107015, 111247, 115342, 118588, 121064, 123723, 126957, 129593, 129922, 127459, 123176, 118343, 113677, 109367, 105308, 101294, 97420, 94238, 92158, 90886, 89851, 88973, 88604, 88868, 89513, 90312, 91175, 91953, 92537, 93077, 93724, 94204, 93946, 92646, 90475, 87833, 85074, 82402, 79789, 77159, 74693, 72712, 71157, 69589, 67900, 66571, 65922, 65561, 64909, 63847, 62416, 60402, 57715, 54837, 52287, 49997, 47754, 45944, 45151, 45215, 45302, 44878, 44059, 43099, 42070, 41081, 40355, 40017, 40030, 40279, 40554, 40632, 40576, 40728, 41180, 41549, 41474, 41002, 40286, 39435, 38894, 39387, 40965, 42570, 43049, 42219, 40657, 39067, 38224, 38763, 40357, 41721, 42093, 42087, 42493, 43100, 43514, 44278, 45960, 47807, 48646, 48704, 49282, 50880, 52868, 54744, 56511, 58019, 59184, 60682, 63175, 65918, 67453, 67626, 67619, 67986, 68079, 67539, 66885, 66273, 65135, 63446, 61991, 60858, 59026, 56133, 53422]
54507E3422j319k37o3j1L12M46L22L55K52o37j818k018j208o54p89o07M30J388
54489D7566J392Q51N69O33P41P44L87n18j344r91N56J922K020J248M70k40j162
54472E4844j928j782o38P07J349J043L71J59O10J058Q92L72J37K13J77Mj1j0l45
54453E7222p46o30j74j57o36p92l19M6l05r25j059o54j60J50K89L82N47O85M03
54434E3167l90r95o88J05L10j33j34P88J667J518O66J9k37n05q10p74l72j2P9
54415E3269J29M83J144J685J628J079Q42J546K739L312K818J921J480J764K511
54400G8350L282L625L462L327L745M335M217L287K439K249K216J550K17j193k150
54385A12958k478k392k424k862l265k984k230j927k371k895k974k895k909k662
$$ y = [53422, 52103, 51866, 51803, 51792, 52104, 52550, 52872, 53227, 53479, 52842, 51024, 49006, 47798, 47144, 46355, 45748, 46178, 47566, 48958, 49809, 50378, 51011, 51752, 52496, 52883, 52365, 51021, 50030, 50586, 52508, 54528, 55776, 56246, 56006, 54844, 52916, 51134, 50496, 51203, 52552, 53595, 53966, 54125, 54735, 55793, 56685, 57057, 57194, 57407, 57584, 57588, 57577, 57567, 57222, 56476, 55846, 55672, 55515, 54879, 54087, 53768, 53814, 53509, 52584, 51525, 50871, 50711, 50861, 51150, 51532, 52079, 52764, 53167, 52777, 51782, 51094, 51199, 51509, 51376, 51242, 52030, 53697, 55215, 55881, 55900, 55663, 55158, 54348, 53574, 53202, 53190, 53269, 53398, 53881, 55025, 56710, 58338, 59417, 60259, 61805, 64544, 67856, 70674, 72595, 74075, 75839, 78350, 81632, 85257, 88719, 92046, 95791, 100126, 104343, 107630, 110069, 112318, 114534, 116084, 116301, 115108, 112958, 110480, 108088, 105664, 102802, 99537, 96553, 94323, 92396, 90025, 87130, 84156, 81261, 78352, 75690]
54371G5690j932j250j097j118p58j96M5o4k27m85r92j424j292o96j59J20L53O43
54353F5161R01J176J574J921J979J927K162K615K759K407K058K256K882L329L291
54338I8398L046K906K621J602j81j841k521k435k556l321m135m258l654k754j870
54323G9047j243j153j667k369k802k951l004k885k425j850j628j820j968j760
54309D9522j417j286j262r52l37N9j67o91q41m55K5K29K36J22k86r05j100m67
54291D0027M29O83K08k66j97L15R43J375J300O89N3j69l05r12j683j780j177p27
54273C8806p49n44L20J216J465J363J540J912J943J477P55j6n99o48k33j9m20
54256D7569r51r26m26NK55N69Q48P11J99j45M3N96J076J110N73k40p31n98j13
$$ y = [75690, 73758, 72508, 71411, 70293, 69535, 69339, 69384, 69320, 69093, 68608, 67616, 66192, 64900, 64204, 64045, 64165, 64518, 65161, 66062, 67238, 68812, 70733, 72712, 74639, 76801, 79416, 82175, 84582, 86640, 88896, 91778, 95107, 98398, 101444, 104350, 106971, 108573, 108392, 106551, 104030, 101595, 99039, 95718, 91583, 87325, 83671, 80917, 79047, 77804, 76651, 74984, 72615, 69813, 66862, 63858, 60973, 58548, 56698, 55070, 53250, 51282, 49522, 48105, 46819, 45557, 44605, 44268, 44327, 44160, 43469, 42628, 42173, 42198, 42427, 42663, 42785, 42499, 41594, 40494, 40027, 40456, 41139, 41347, 41081, 40884, 41199, 42142, 43517, 44817, 45506, 45559, 45390, 45085, 44173, 42490, 40710, 39533, 38806, 38057, 37513, 37833, 39049, 40514, 41877, 43417, 45329, 47272, 48749, 49504, 49488, 48889, 48241, 48008, 47989, 47569, 46618, 45692, 45266, 45271, 45526, 46095, 46943, 47654, 47853, 47708, 47751, 48347, 49423, 50533, 51106, 50866, 50135, 49537, 49424]
54237D9424L19N86O41L32j43j01P24J562J528Q65M98O25O23K28k5J46J95m04j354
54218E6269j978k098j939j508o25N03J226J158O56M16O23P80M14k31m90k04J5
54201E2987l64j041j317r47k71L84R67J408J469J042L29l44p47p96n70l39l63
54184E1487n67n53L0J060J886J740M63j121j835j324l62J36M9k57p07j328j619
54167D7178r21M52J259Q22j81p60r29j303j846j840j040j05K99K23K8j93l91k50
54149D0502L57Q66N87k96q91p79m27l17k39J58O45P54N11L34L20K07p6k29q7J37
54129D2037J90M9j75l79m58l47j21J18L52M76K29l54o45j31P19Q91K18k99J42
54110D2512J106J552J091J32p79j262r81O0J095J066k27j716k109j158L00J326
$$ y = [49424, 49743, 50329, 50970, 51302, 51159, 51058, 51782, 53344, 54872, 55737, 56235, 56860, 57483, 57711, 57686, 57832, 58027, 57623, 56269, 54291, 52193, 50254, 48746, 48121, 48624, 49850, 51008, 51664, 52080, 52703, 53483, 53897, 53666, 53176, 52972, 52987, 52623, 51582, 50265, 49318, 49047, 49431, 50398, 51806, 53275, 54317, 54646, 54302, 53555, 52759, 52189, 51850, 51487, 50920, 50367, 50397, 51457, 53343, 55083, 55546, 54425, 52590, 51266, 50904, 51040, 51089, 50832, 50125, 48797, 47178, 46257, 46709, 47968, 48790, 48609, 47849, 46920, 45617, 43771, 41931, 40891, 40786, 41085, 41308, 41336, 41143, 40752, 40502, 40859, 41725, 42312, 42016, 41125, 40346, 39919, 39602, 39363, 39521, 40166, 40920, 41431, 41765, 42085, 42292, 42216, 41987, 41900, 42037, 42227, 42276, 42101, 41722, 41264, 40917, 40796, 40914, 41266, 41742, 41971, 41617, 40972, 40841, 41560, 42451, 42669, 42370, 42512, 43618, 45170, 46261, 46393, 45614, 44352, 43371, 43431, 44526, 45592, 45365, 43649, 41540, 40382, 40682, 42008]
54094D2008J614J310O20j49n15k99n3m62j279j473o53K90M57J88L64Q68P76r8
54076D3514p25k51R15J641J302J70r45j257o02L98R67J043J131J401J572J586
54060E1860J712J817J341L35k85J1N65N87M17R30K072K816K542J720J161J096
54044G0697J267J502J893K495L056L206K958K819L205L909M441M729N070N487
54030A16734N652N513N411N493N512N361N203M862L858K308J152J033J505J808
54016A71405J804J692J353O57j38q51j812l167m301m672m710n053n287m568l227
54001A39125k592l075l578l137k227j889k259k600k378j739j072n68k35j2J15
53986A11879J22K9m5m5j58n57j064j257j039p52p21q73r33q36p00n23j43M49Q14
$$ y = [42008, 43622, 44932, 45552, 45403, 44888, 44589, 44536, 44074, 42795, 41322, 40669, 40959, 41416, 41604, 41968, 42836, 43612, 43514, 42789, 42538, 43453, 45094, 46396, 46566, 45621, 44364, 43762, 44160, 45127, 46170, 47301, 48702, 50274, 51860, 53572, 55389, 56730, 57065, 56780, 56791, 57356, 57943, 58360, 59290, 61362, 64178, 66720, 68440, 69601, 70697, 71964, 73466, 75359, 77854, 80910, 84116, 87074, 89893, 93098, 97007, 101448, 106177, 111247, 116734, 122386, 127899, 133310, 138803, 144315, 149676, 154879, 159741, 163599, 165907, 167059, 168092, 169597, 171405, 173209, 174901, 176254, 176911, 176773, 175922, 174110, 170943, 166642, 161970, 157260, 152207, 146920, 142352, 139125, 136533, 133458, 129880, 126743, 124516, 122627, 120368, 117768, 115390, 113651, 112579, 112011, 111776, 111764, 111879, 112001, 112030, 111985, 111940, 111782, 111225, 110161, 108904, 107865, 107113, 106392, 105519, 104586, 103750, 103050, 102527, 102384, 102833, 103647]
53967A03647L49r73k284k536j545j06R19J305J266J001O84N44O31P65Q74J096
53951A05637J369J292P67L31M58Q90J089J123J500K305L099L621M035M430M569
53936A36515M356M187M510N230N716N444M564L760L536L652L431K546J287J08
53922A88842o99r09l96N52J361J848K332K906L192L094L254M130N106N173M219
53907B24005L065K378K190K296K486K360J561K93p67j212j265j356j631j959k209
53892B30235k464k923l549l908l715l485m112n647p096p666p521o985n852m153
53878A61159k832k686l204l389l310l735m538m708l928k996k533k302k062k116
53864A16820k560k797k314j423q15q05j309k059k619k628k296k186k402k430j999
$$ y = [103647, 103996, 103023, 100739, 98203, 96658, 96552, 97471, 98776, 100042, 101043, 101727, 102271, 102902, 103667, 104541, 105637, 107006, 108298, 109065, 109396, 109854, 110744, 111833, 112956, 114456, 116761, 119860, 123481, 127516, 131946, 136515, 140871, 145058, 149568, 154798, 160514, 165958, 170522, 174282, 177818, 181470, 184901, 187447, 188734, 188842, 188143, 187234, 186838, 187390, 188751, 190599, 192931, 195837, 199029, 202123, 205377, 209507, 214613, 219786, 224005, 227070, 229448, 231638, 233934, 236420, 238780, 240341, 240634, 239867, 238655, 237390, 236034, 234403, 232444, 230235, 227771, 224848, 221299, 217391, 213676, 210191, 206079, 200432, 193336, 185670, 178149, 171164, 165312, 161159, 158327, 155641, 152437, 149048, 145738, 142003, 137465, 132757, 128829, 125833, 123300, 120998, 118936, 116820, 114260, 111463, 109149, 107726, 106911, 106106, 104797, 102738, 100119, 97491, 95195, 93009, 90607, 88177, 86178]
53849H6178j494j249r87m02J90L16J05J11M47N64n9j184j961j777r74m84o85r48
53831G5707n37L19P47M57%p6J98N78R39J114Q97M64L35P33J276J476J306J043
53813H6976Q75P59N76L02J67N39J452K430L022L305L553L699L559L411L626L995
53797A22246L980L613L475L817M282M520M476M026L035J865J160J027J030J001
53783A63553J145J255O89n85j652j826j545j670k366l124l458l249k687k190k067
53768A40223k180k208k239k483k523j684l30J23j047k817l667l250k259j272m25
53753A11962J31K71J76R4l6l25n13k68K76O68P08N74N49P75J108J077L37p53j415
53734A15396j481j607k230k831k725k118j826k130k449k102j056M8N00K09j78
$$ y = [86178, 84684, 83435, 82448, 82046, 82236, 82552, 82657, 82768, 83215, 83779, 83720, 82536, 80575, 78798, 77824, 77340, 76655, 75707, 75170, 75489, 76236, 76693, 76693, 76617, 76815, 77393, 78332, 79446, 80343, 80807, 81142, 81875, 83151, 84627, 85933, 86976, 87851, 88610, 89186, 89488, 89655, 90194, 91646, 94076, 97098, 100403, 103956, 107655, 111214, 114625, 118251, 122246, 126226, 129839, 133314, 137131, 141413, 145933, 150409, 154435, 157470, 159335, 160495, 161522, 162552, 163553, 164698, 165953, 166642, 166057, 164405, 162579, 161034, 159364, 156998, 153874, 150416, 147167, 144480, 142290, 140223, 138043, 135835, 133596, 131113, 128590, 126906, 126576, 126699, 125652, 122835, 119168, 115918, 113659, 112387, 111962, 112093, 112364, 112540, 112634, 112598, 112273, 111760, 111492, 111768, 112436, 113144, 113718, 114267, 115042, 116150, 117227, 117564, 116811, 115396, 113915, 112308, 110078, 107247, 104522, 102404, 100578, 98448, 95999, 93897, 92841, 92889, 93389, 93598, 93420]
53719I3420n7L63M81L09M82J171J738J688J261Q17K91l50p96r66j232j635j536
53702I5449n82O26J414J999K841L705M040L833L279K203O18n48k99J053K290K843
53686A24764L039L001K369J245M03L10O17R14J315J951K445K368J804J140N15
53671A48200j85r35j453j484j160q66p71o07j93Mo22j702k017j063J91O20M05
53654A36362M56R08J065O04r1o97j260j662j564r77l50K7J95Q2m65j200j528j229
53636A28676o59j46L72R93J562J874J804J283M98K5L41J174J807J879J472O04
53620A43559n63j200m44J304K545K495J900J700J788J650J443J547J655J272Q21
53605A61472J254K563L582L442K506J665J299J320J675K287K816L010L146L624
$$ y = [93420, 93363, 93726, 94207, 94516, 94998, 96169, 97907, 99595, 100856, 101673, 101964, 101614, 100818, 99852, 98620, 96985, 95449, 94867, 95493, 96907, 98906, 101747, 105452, 109492, 113325, 116604, 118807, 119425, 118877, 118578, 119631, 121921, 124764, 127803, 130804, 133173, 134418, 134821, 135131, 135748, 136662, 137977, 139928, 142373, 144741, 146545, 147685, 148200, 148015, 147080, 145627, 144143, 142983, 142117, 141346, 140739, 140546, 140550, 139928, 138226, 136209, 135146, 135337, 135957, 136362, 136818, 137726, 138791, 139395, 139304, 138607, 137347, 135685, 134121, 133144, 132794, 132821, 133016, 133098, 132633, 131433, 129905, 128676, 128017, 127871, 128243, 129236, 130798, 132672, 134476, 135759, 136257, 136282, 136623, 137797, 139604, 141483, 142955, 143559, 142996, 141796, 141352, 142656, 145201, 147696, 149596, 151296, 153084, 154734, 156177, 157724, 159379, 160651, 161472, 162726, 165289, 168871, 172313, 174819, 176484, 177783, 179103, 180778, 183065, 185881, 188891, 192037, 195661]
53591A95661M213M182L296K222J723J814K014K135K420K923L307L269K933K633
53577B34745K498K356J959J283O74N88J028J408J273R18Q80J041Q28L00K35R21
53561B52935J580J387N02l77r55j247j104l75N98J349J891K462K835K507J526
53546B65514N14p4k79k35M7M35P01Q35J032J253J214Q62N37N58R11J336J585J559
53528B78305J424J561K105K639K578J895J174J027J586K567L553M259M691N049
53514C14413N372N456N265N212N743O766P760Q335Q489Q498Q730R385J0231J0819
53500D20474J1123J1630J2504J3176J3138J2804J2959J3702J4482J5044J5638
53489E66674J6377J6988J7201J7010J6555J6169J6421J7534J8884J9484J9026
$$ y = [195661, 199874, 204056, 207352, 209574, 211297, 213111, 215125, 217260, 219680, 222603, 225910, 229179, 232112, 234745, 237243, 239599, 241558, 242841, 243515, 244103, 245131, 246539, 247812, 248730, 249610, 250651, 251479, 251779, 252014, 252935, 254515, 255902, 256404, 256027, 255072, 253825, 252721, 252346, 252944, 254293, 256184, 258646, 261481, 263988, 265514, 266028, 265954, 265675, 265440, 265487, 265922, 266623, 267458, 268490, 269743, 270957, 271819, 272356, 272914, 273825, 275161, 276746, 278305, 279729, 281290, 283395, 286034, 288612, 290507, 291681, 292708, 294294, 296861, 300414, 304673, 309364, 314413, 319785, 325241, 330506, 335718, 341461, 348227, 355987, 364322, 372811, 381309, 390039, 399424, 409655, 420474, 431597, 443227, 455731, 468907, 482045, 494849, 507808, 521510, 535992, 551036, 566674, 583051, 600039, 617240, 634250, 650805, 666974, 683395, 700929, 719813, 739297, 758323]
53478G58323J7980J6874J5939J5390J5397J5741J5990J6081J6219J6267J5849
53467I36050J5119J4829J5343J6071J6127J5208J3670J2083J0912J0334J0032
53456A085778R389P971N927L878K498J934J493J29k441n349p542q853r769j0484
53442A074559j0786j0649j0363j0214j0470j1426j2908j3967j3836j3040j2858
53431I44042j3754j5012j5823j6020j5659j4752j3566j2550j1827j1218j0731
53420G93130j0383r684q086o002m495l831l250k348j724j819k015j451j90J099
53406G38951K089K920L774M748N906P125Q179R096J0123J1220J2047J2530J2957
53393H41665J3524J4298J5612J7692J9902K1222K1653K2209K3302K4186K4452
$$ y = [758323, 776303, 793177, 809116, 824506, 839903, 855644, 871634, 887715, 903934, 920201, 936050, 951169, 965998, 981341, 997412, 1013539, 1028747, 1042417, 1054500, 1065412, 1075746, 1085778, 1095167, 1103138, 1109065, 1112943, 1115441, 1117375, 1118868, 1118997, 1116556, 1111207, 1103665, 1094812, 1085043, 1074559, 1063773, 1053124, 1042761, 1032547, 1022077, 1010651, 997743, 983776, 969940, 956900, 944042, 930288, 915276, 899453, 883433, 867774, 853022, 839456, 826906, 815079, 803861, 793130, 782747, 773063, 764977, 758975, 754480, 750649, 747399, 745051, 743327, 741508, 739493, 738042, 737852, 738951, 741040, 743960, 747734, 752482, 758388, 765513, 773692, 782788, 792911, 804131, 816178, 828708, 841665, 855189, 869487, 885099, 902791, 922693, 943915, 965568, 987777, 1011079, 1035265, 1059717]
53382A059717K4955K6459K8320K9424K9769L0145L0752L1175L1404L1954L2984
53371A387058L3996L4397L3930L2702L1204L0054K9339K8446K6894K4927K2913
53360A715860K0688J7970J5008J2219R536O666L699Q42k018m986p682r799j1749
53347A766254j4125j6778j9082k0881k2483k3956k5185k6424k8045k9762l0843
53336A508690l1035l0701l0056k8977k7576k6275k5199k4109k3084k2689k3140
53325A215849k3807k3863k3160k2188k1357k0578j9514j8105j6756j5834j5053
53314I95634j3726j1718r794q712q375q199p951p807p868q128q618r177r293q658
53300H67610p612o593n573m471l664l315k666r65J123K116J740J249J577K312
$$ y = [1059717, 1084672, 1111131, 1139451, 1168875, 1198644, 1228789, 1259541, 1290716, 1322120, 1354074, 1387058, 1421054, 1455451, 1489381, 1522083, 1553287, 1583341, 1612680, 1641126, 1668020, 1692947, 1715860, 1736548, 1754518, 1769526, 1781745, 1791281, 1797947, 1801646, 1802488, 1800470, 1795484, 1787802, 1778003, 1766254, 1752129, 1735351, 1716269, 1695388, 1672905, 1648949, 1623764, 1597340, 1569295, 1539533, 1508690, 1477655, 1446954, 1416898, 1387921, 1360345, 1334070, 1308871, 1284762, 1261678, 1238989, 1215849, 1192042, 1168179, 1145019, 1122831, 1101474, 1080896, 1061382, 1043277, 1026521, 1010687, 995634, 981908, 970190, 960396, 951684, 943309, 935110, 927159, 919352, 911484, 903356, 894738, 885561, 876268, 867610, 859998, 853405, 847832, 843361, 839697, 836382, 833716, 832751, 833874, 835990, 837730, 838979, 840556, 842868]
53286H42868K833L402M369N198N304N342O632R338J2120J3692J4124J4301J4683
53273I54206J5038J5135J5168J5303J5205J4360J2827J1310J0422J0056R636Q736
53261A107402P309N543L762K287J141j1j361k624l518m336n654p496r224j0347
53247A082873j1027j1692j2496j3364j4306j5370j6298j6531j5781j4580j3976
53236I27452j4411j5067j4777j3570j2760j3340j4694j5373j4722j3346j2203
53225G73189j1727j1707j1645j1168j0386r745r438r138q521p685o810n765m491
53212F54963l368k724k296j732j368j759k627l042k697k398k997m354n639o295
53198F11667o478o670p053p313p102o629o437o550o358n649n160n514o150o096
$$ y = [842868, 845701, 849103, 853472, 858670, 863974, 869316, 875948, 885286, 897406, 911098, 925222, 939523, 954206, 969244, 984379, 999547, 1014850, 1030055, 1044415, 1057242, 1068552, 1078974, 1089030, 1098666, 1107402, 1114711, 1120254, 1124016, 1126303, 1127444, 1127433, 1126072, 1123448, 1119930, 1115594, 1109940, 1102444, 1093220, 1082873, 1071846, 1060154, 1047658, 1034294, 1019988, 1004618, 988320, 971789, 956008, 941428, 927452, 913041, 897974, 883197, 869627, 856867, 843527, 828833, 813460, 798738, 785392, 773189, 761462, 749755, 738110, 726942, 716556, 706811, 697373, 688235, 679714, 672029, 665219, 659454, 654963, 651595, 648871, 646575, 644843, 643475, 641716, 639089, 636047, 633350, 630952, 627955, 623601, 617962, 611667, 605189, 598519, 591466, 584153, 577051, 570422, 563985, 557435, 551077, 545428, 540268, 534754, 528604, 522508]
53184E22508n470n283n919o724p153p393p672p730p343o800o490o499o776p270
53170D27986p695p642p105o536o226o082o033o139o182n752m950m465m661n136
53156C43382n353n250m947m444l926l821m179m447m264l984l988l960l409k598
53142B84812k295k796l660m338m577m329l682k950k487k338k290k236k264k401
53128B42169k490k399k181k039k118k377k584k521k157j649j203r74j003j092
53114B15382q99k97M34R41J165J201J038P68P43J117J476J377J055R66Q61N8j358
53097B26028k468k807k987l649m519m912m656m077l493l077k951l003k922k664
53083A77843k585k867l183l165k843k395j934j696j956k442k430j731j030q67
$$ y = [522508, 517038, 511755, 505836, 499112, 491959, 484566, 476894, 469164, 461821, 455021, 448531, 442032, 435256, 427986, 420291, 412649, 405544, 399008, 392782, 386700, 380667, 374528, 368346, 362594, 357644, 353179, 348518, 343382, 338029, 332779, 327832, 323388, 319462, 315641, 311462, 307015, 302751, 298767, 294779, 290819, 287410, 284812, 282517, 279721, 276061, 271723, 267146, 262817, 259135, 256185, 253698, 251360, 249070, 246834, 244570, 242169, 239679, 237280, 235099, 233060, 230942, 228565, 225981, 223460, 221303, 219654, 218451, 217477, 216474, 215382, 214483, 214186, 214620, 215561, 216726, 217927, 218965, 219733, 220476, 221593, 223069, 224446, 225501, 226467, 227328, 227386, 226028, 223560, 220753, 217766, 214117, 209598, 204686, 200030, 195953, 192460, 189383, 186432, 183429, 180507, 177843, 175258, 172391, 169208, 166043, 163200, 160805, 158871, 157175, 155219, 152777, 150347, 148616, 147586, 146719]
53069A46719q90o32m30q44j617k003j818j470j139o56j03J84J60M7j89p04j193
53052A33422j109n17j16k65o07q13j052j408j480j001m68n70j172j506j266r93
53036A19079j164j446j207n10j05m16j010j204q89m46j57l9o2j30j8K50K20l48
53018A10398p93k91Q34J326P05r9k20o7m95j338j660j077j70L26J49m74r80q09
53000A05265n4M68K58j55J9N93P51L54R6L39N89L86MLM38R35J185J122Q26M40
52980A13862O5k93n94o51l27K26P61J235J695K011K071K059K204K370K294K091
52964A31079K056K133K078K097K660L671M389M357L900L479L105K621K184J949
52950A71758J646Q39m68j717k305k088j478j120j355j932k360k455k391k320k228
$$ y = [146719, 145829, 145197, 144767, 143923, 142306, 140303, 138485, 137015, 135876, 135220, 135117, 135301, 135461, 135508, 135319, 134615, 133422, 132313, 131796, 131680, 131415, 130808, 129995, 128943, 127535, 126055, 125054, 124586, 124016, 122844, 121338, 120072, 119079, 117915, 116469, 115262, 114752, 114647, 114231, 113221, 112017, 111128, 110682, 110525, 110486, 110424, 110294, 110276, 110526, 110746, 110398, 109605, 109314, 110148, 111474, 112179, 112080, 111860, 111793, 111298, 109960, 108300, 107223, 107053, 107379, 107528, 107054, 106074, 105265, 105211, 105679, 105937, 105782, 105801, 106394, 107145, 107499, 107595, 107934, 108523, 108909, 108913, 108916, 109354, 110289, 111474, 112596, 113422, 113862, 113927, 113634, 113040, 112389, 112062, 112288, 113049, 114284, 115979, 117990, 120061, 122120, 124324, 126694, 128988, 131079, 133135, 135268, 137346, 139443, 142103, 145774, 150163, 154520, 158420, 161899, 165004, 167625, 169809, 171758, 173404, 174243, 173775, 172058, 169753, 167665, 166187, 165067, 163712, 161780, 159420, 156965, 154574, 152254, 150026]
52935A50026k139k121k096j920j654j447j237r28p60j045j519j554j057o21n76
52920A29352m90L6O90R92J096J418J746J418L48o79r12m66qJ18J94N34R21Q40
52902A37148K70j54K9M41M09k2k15P1M49P07J112J665J734R51j16o72o91o03m19
52883A42094J68J001J520J520J262Q84K85l67o50n08l60l84k40L36J044J408J266
52866A50279P73J58k28r3L60N10J30k12O2O98J003Q80Q34J065J153Q75P23J225
52848A60195K076K470K179J793J768J768J291O45O87J561K307K012R95L26M31
52833A82504P62Q68J007J405J541P67o32j674j914j830j967k220k266k152k164
52818A72035k361k586k779k903k813k450k053j867j775j571j428j651k010j881
$$ y = [150026, 147887, 145766, 143670, 141750, 140096, 138649, 137412, 136484, 135724, 134679, 133160, 131606, 130549, 129928, 129352, 128862, 128898, 129588, 130580, 131676, 133094, 134840, 136258, 136606, 135927, 135015, 134549, 134541, 134659, 134853, 135387, 136308, 137148, 137418, 137264, 137293, 137734, 138143, 138121, 137906, 137977, 138426, 139133, 140245, 141910, 143644, 144595, 144479, 143807, 143116, 142513, 142094, 142262, 143263, 144783, 146303, 147565, 148449, 148734, 148367, 147717, 147209, 146849, 146465, 146225, 146561, 147605, 149013, 150279, 151052, 151210, 150982, 150889, 151249, 151759, 151889, 151677, 151739, 152437, 153440, 154320, 155154, 156219, 157372, 158247, 158970, 160195, 162271, 164741, 166920, 168713, 170481, 172249, 173540, 174185, 174872, 176433, 178740, 180752, 181747, 182073, 182504, 183266, 184134, 185141, 186546, 188087, 188854, 188222, 186548, 184634, 182804, 180837, 178617, 176351, 174199, 172035, 169674, 167088, 164309, 161406, 158593, 156143, 154090, 152223, 150448, 148877, 147449, 145798, 143788, 141907]
52804A41907j148m99n45j010j171q60n66o50r02r50q26q80j270j718j835j611
52788A25466j448j668k059k100j601r21n13m55n84q02j049j160j003p36o34p27
52772A08006q29q30p63o34m48l79o16j010j189j104j143j506j830j622r57m39
52756I2707n11j058j619j826j656j366j269j414j579j557j434j413j434j236p28
52741G2607j60J71J98M5j34j90J1M13P11N89P6m77p28n78j27L85O05K74n10j320
52721G1861j784j855j654j252p86n37o32p13k61O73J390J328P06J96J39L17M28
52704F7564M48M85N31M64K52O5J35N52J126J501J528J490J827K592L298L434K968
52687I0260K263J619J094P59P50J005J083N92l36j204j726k022k262k373k235
$$ y = [141907, 140759, 140260, 139715, 138705, 137534, 136674, 136108, 135458, 134556, 133606, 132780, 131900, 130630, 128912, 127077, 125466, 124018, 122350, 120291, 118191, 116590, 115669, 115156, 114701, 114117, 113315, 112266, 111106, 110103, 109367, 108733, 108006, 107177, 106347, 105584, 104950, 104502, 104123, 103507, 102497, 101308, 100204, 99061, 97555, 95725, 94103, 93146, 92707, 92196, 91138, 89519, 87693, 86037, 84671, 83402, 81988, 80409, 78852, 77418, 76005, 74571, 73335, 72607, 72447, 72618, 72816, 72861, 72727, 72537, 72548, 72961, 73672, 74261, 74337, 73860, 73132, 72554, 72427, 72812, 73417, 73691, 73181, 71861, 70077, 68222, 66568, 65316, 64530, 63993, 63361, 62648, 62387, 63060, 64450, 65778, 66484, 66680, 66819, 67136, 67564, 68012, 68497, 69028, 69492, 69744, 69809, 69944, 70496, 71622, 73123, 74651, 76141, 77968, 80560, 83858, 87292, 90260, 92523, 94142, 95236, 95995, 96745, 97750, 98833, 99425, 99089, 97885, 96159, 94137, 91875, 89502, 87267]
52672H7267j906j529j243j235j653k243k395j803r56n69q14j292j616j597j060
52657F5356j01N53J30j079j774j151J90J114J267J027O49J08m01m57o4K55J42
52640F5764j66k67j28jj1r2k29n40j040j450j387q21k09n4l30n89n44l06k5L14
52620E7889N90M67r3n54m33L7K92L03N01R60J217R63M32j1k78l48q3M63Q17O21
52600F3752J71J36P49J516J728J140J13p37r60n06K78Q01N53m74j561j795r26
52583F3978L43J129J238J082R95R39Q74R10J076J215J233J158R37M69p0l07j71
52566G7028K4J52N29J239J707J337M23j26J27Q40J567K197K581K342J388K68l96
52549I3227n56n15k59M49J432K047J901J231M63k34p64r30p09m22l04j02M74J166
$$ y = [87267, 85361, 83832, 82589, 81354, 79701, 77458, 75063, 73260, 72304, 71735, 70921, 69629, 68013, 66416, 65356, 65255, 65808, 65938, 64859, 63085, 61934, 62124, 63238, 64505, 65532, 66181, 66289, 65888, 65431, 65367, 65622, 65764, 65598, 65331, 65203, 65202, 65191, 65099, 64870, 64330, 63290, 61840, 60453, 59632, 59423, 59369, 59039, 58450, 57906, 57600, 57575, 57889, 58479, 58946, 58853, 58299, 57866, 57903, 58195, 58498, 58999, 59959, 61176, 62139, 62571, 62560, 62282, 61934, 61851, 62314, 63131, 63752, 63923, 64059, 64808, 66324, 68052, 69192, 69305, 68568, 67608, 67102, 67380, 68181, 68734, 68260, 66699, 64904, 63978, 64321, 65450, 66688, 67770, 68765, 69704, 70578, 71488, 72564, 73779, 75012, 76170, 77107, 77576, 77506, 77199, 77028, 77052, 77204, 77733, 78972, 80679, 82016, 82439, 82313, 82440, 83280, 84847, 87044, 89625, 91967, 93355, 93623, 93227, 92671, 92156, 91897, 92346, 93778, 95825, 97726, 98957, 99420, 99186, 98422, 97492, 96783, 96361, 96057, 95955, 96429, 97595]
52531I7595J457J351J310J504J556J162N30J3k48j81L03R94J377J226R03P89P75
52514A12416N93L44K80K96J32j08l4L93P33N77j5o25q08m14K34N72L72k6k09j82
52494A14521j59j94k62m52p17p16l07N4o3l26j34L19K62m05q35m40L45Q21R24
52475A12236R51Q67M74qp2L81Q77R52O96N99R23J321J176M55q0K70J161J599J208
52456A25986O10M89P77R83Q70N13N3k41m1O07J134J065N56N1l19o42p97n72r9
52437A30983K42L09K88K79J61r6k74j64J65M17L12j83p39p98j15Q51J265Q03L5
52418A33741k17K11P51Q69O72O01P52Q12N54J18k72n31n13J8R61J736J944J953
52400A44160K348K978L096K432J639J512K092K751K785J922M72q13j336j151p62
$$ y = [97595, 99052, 100403, 101713, 103217, 104773, 105935, 106465, 106478, 106230, 106049, 106352, 107346, 108723, 109949, 110852, 111641, 112416, 113009, 113353, 113633, 113929, 114061, 113953, 113919, 114312, 115045, 115622, 115607, 114982, 114174, 113760, 113994, 114566, 114938, 114912, 114703, 114521, 114362, 114168, 113906, 113454, 112737, 112021, 111714, 111768, 111705, 111379, 111245, 111564, 111826, 111421, 110586, 110146, 110491, 111312, 112236, 113187, 114054, 114528, 114520, 114448, 114829, 115706, 116658, 117354, 117953, 118876, 120197, 121373, 121828, 121748, 122018, 123179, 124778, 125986, 126596, 127085, 127862, 128845, 129715, 130228, 130281, 130040, 129999, 130606, 131740, 132805, 133361, 133412, 133093, 132451, 131654, 131082, 130983, 131225, 131534, 131822, 132101, 132262, 132166, 131892, 131728, 131893, 132310, 132622, 132439, 131700, 130902, 130787, 131638, 132903, 133706, 133741, 133524, 133735, 134486, 135355, 136027, 136628, 137380, 138192, 138746, 138864, 138592, 138061, 137548, 137566, 138527, 140263, 142207, 144160, 146508, 149486, 152582, 155014, 156653, 158165, 160257, 163008, 165793, 167715, 168187, 167374, 166038, 164887, 164125]
52385A64125n15m48o01j024j464j559j335j122r39n02M9J29l86q08n42J38O11
52368A53807P34P66Q12Q03P58P24O66O92J014J475J509R72N47Q70J644K149K250
52351A72192K337K512K503K273K097K050J916J725J770K117K390K330K170K292
52337B02674K668K813K328J446R44J303K115K594K628K738L004K791J868J031
52323B32945R97J356J334J143J599K752L787M216M281M205L921L568L539L886
52309B73529M322M937O053P336P895P530P106P276P698P977Q532R721J0771J0535
52295C81218R219Q405R279J1417J3439J4364J4147J3318J2526J2268J2710J3585
52283E25895J4331J4462J3932J3112J2337J1650J1029J0710J0926J1354J1230
$$ y = [164125, 163610, 163162, 162561, 161537, 160073, 158514, 157179, 156057, 155118, 154616, 154665, 154794, 154408, 153600, 153058, 153196, 153807, 154541, 155307, 156119, 156922, 157680, 158404, 159070, 159762, 160776, 162251, 163760, 164732, 165279, 166149, 167793, 169942, 172192, 174529, 177041, 179544, 181817, 183914, 185964, 187880, 189605, 191375, 193492, 195882, 198212, 200382, 202674, 205342, 208155, 210483, 211929, 212873, 214176, 216291, 218885, 221513, 224251, 227255, 230046, 231914, 232945, 233942, 235298, 236632, 237775, 239374, 242126, 245913, 250129, 254410, 258615, 262536, 266104, 269643, 273529, 277851, 282788, 288841, 296177, 304072, 311602, 318708, 325984, 333682, 341659, 350191, 359912, 370683, 381218, 390437, 398842, 408121, 419538, 432977, 447341, 461488, 474806, 487332, 499600, 512310, 525895, 540226, 554688, 568620, 581732, 594069, 605719, 616748, 627458, 638384, 649738, 660968]
52272F60968J0152Q554P223O550O337O117N541M560L422K416J577P66J5m03l98
52257G23397l03n42j098j500j359q06l65l45l99J37J494L228M731N729O174O097
52241G44270N863O177P321Q635R283R364R629J0283J0764J0748J0617J0673J0620
52228H64247J0123R348Q538P590O389N195M267L436K406J222Q2r80j922k586l096
52213I14259m025n645p341q248q275q066q063q219q450q870r484j0109j0615j0914
52199G97935j0762r966q841p942p341o588n559m798m752m947m474l180j880j370
52185G15535j568j806j744j643j817k205k630l114l652l925l593k821k120j732
52171F81165j559j658k238l022l258k704k154k444l306l743l353k730k570k905
$$ y = [660968, 671120, 679674, 686897, 693447, 699784, 705901, 711442, 716002, 719424, 721840, 723417, 724183, 724198, 723795, 723397, 723094, 722552, 721454, 719954, 718595, 717789, 717424, 717079, 716680, 716817, 718311, 721539, 726270, 731999, 738173, 744270, 750133, 756310, 763631, 772266, 781549, 790913, 800542, 810825, 821589, 832337, 842954, 853627, 864247, 874370, 883718, 892256, 899846, 906235, 911430, 915697, 919133, 921539, 922761, 922843, 921863, 919941, 917355, 914259, 910234, 904589, 897248, 889000, 880725, 872659, 864596, 856377, 847927, 839057, 829573, 819464, 808849, 797935, 787173, 777207, 768366, 760424, 753083, 746495, 740936, 736138, 731386, 726439, 721965, 718785, 716905, 715535, 713967, 712161, 710417, 708774, 706957, 704752, 702122, 699008, 695356, 691431, 687838, 685017, 682897, 681165, 679606, 677948, 675710, 672688, 669430, 666726, 664572, 662128, 658822, 655079, 651726, 648996, 646426, 643521]
52157F43521l293l363l036k514k119j958j764j288q36j007j866k686k775k270
52143F12746j902k064k399k318j786j423j751k512k963k768k323k116k097j941
52129E82383j566j112o44k89m33j288k352k793k405j720j186p45l00j6R7L72R18
52112E66921J285J142R40J389K408L204L357L326L795M864O183P509Q816R975
52098F25114J0714J1054J1510J2592J4124J5396J5988J6255J6786J7617J8321
52087G85471J8622J8598J8317J7745J7031J6444J5850J4775J3171J1636J0502
52076I58162R272P425N443M233L787L148J787K46q23j564k520l809n170o475p670
52061I65472q463q530p985p254o620o211o246o846p565p617o695n301m194l693
$$ y = [643521, 640228, 636865, 633829, 631315, 629196, 627238, 625474, 624186, 623350, 622343, 620477, 617791, 615016, 612746, 610844, 608780, 606381, 604063, 602277, 600854, 599103, 596591, 593628, 590860, 588537, 586421, 584324, 582383, 580817, 579705, 579061, 578772, 578339, 577051, 574699, 571906, 569501, 567781, 566595, 565850, 565550, 565534, 565631, 566003, 566921, 568206, 569348, 570288, 571677, 574085, 577289, 580646, 583972, 587767, 592631, 598814, 606323, 615139, 625114, 635828, 646882, 658392, 670984, 685108, 700504, 716492, 732747, 749533, 767150, 785471, 804093, 822691, 841008, 858753, 875784, 892228, 908078, 922853, 936024, 947660, 958162, 967434, 974859, 980302, 984535, 988322, 991470, 993257, 993503, 992680, 991116, 988596, 984787, 979617, 973142, 965472, 957009, 948479, 940494, 933240, 926620, 920409, 914163, 907317, 899752, 892135, 885440, 880139, 875945, 872252]
52047H72252l546l173k072k69J460K179J775J084R55J490K375L448M573N274N105
52032H92910M370L930M180M700M973N036N045M682L491J734L68RK31J30o73j806
52016I33310k793l564m378n457o834q287r428j0067j0541j1421j2804j4159j5131
52003H18446j6053j7256j8298j8499j8073j7951j8347j8404j7558j6563j6473
51992F24971j7175j7713j7744j7798j8155j8330j7939j7336j6960j6554j5597
51981D33670j4200j3012j2314j1735j0953j0234r961r949r559q549p442o893o903
51968C01966o913o562o054n717n481m987m065k971k226k207k769l238l021k289
$$ y = [872252, 868706, 865533, 863461, 863192, 864652, 866831, 868606, 869690, 870645, 872135, 874510, 877958, 882531, 887805, 892910, 897280, 901210, 905390, 910090, 915063, 920099, 925144, 929826, 933317, 935051, 935419, 935428, 935659, 935789, 935116, 933310, 930517, 926953, 922575, 917118, 910284, 901997, 892569, 882502, 871961, 860540, 847736, 833577, 818446, 802393, 785137, 766839, 748340, 730267, 712316, 693969, 675565, 658007, 641444, 624971, 607796, 590083, 572339, 554541, 536386, 518056, 500117, 482781, 465821, 449267, 433670, 419470, 406458, 394144, 382409, 371456, 361222, 351261, 341312, 331753, 323204, 315762, 308869, 301966, 295053, 288491, 282437, 276720, 271239, 266252, 262187, 259216, 256990, 254783, 252014, 248776, 245755, 243466]
$$ [...]
##END NTUPLES=NMR SPECTRUM
##END=
