##TITLE=NES1095_T12_9886966_kAx0Q6P168
##JCAMPDX= 6.0         $$ Bruker NMR JCAMP-DX V2.0
##DATA TYPE= NMR SPECTRUM
##DATA CLASS= NTUPLES
##ORIGIN= BRUKER
##OWNER= Administrator
$$ 1.72 TOPSPIN		Version 2.1
$$ 2016-08-28 21:08:43.711 -0500  Administrator@X
$$ Compression mode = diff/dup
##.OBSERVE FREQUENCY= 400.02188249412
##.OBSERVE NUCLEUS= ^1H
##.ACQUISITION MODE= SIMULTANEOUS (DQD)
##.ACQUISITION SCHEME= undefined
##.AVERAGES= 64
##.DIGITISER RES= 22
##SPECTROMETER/DATA SYSTEM= spect
##.PULSE SEQUENCE= noesygpps1d.comp
##.SOLVENT NAME= COFFEE_meoh
##.SHIFT REFERENCE= INTERNAL, COFFEE_meoh, 1, 14.96267
##AUDIT TRAIL= $$ (NUMBER, WHEN, WHO, WHERE, PROCESS, VERSION, WHAT)
$$ ##TITLE= Audit trail, TOPSPIN		Version 2.1
$$ ##JCAMPDX= 5.01
$$ ##ORIGIN= Bruker BioSpin GmbH
$$ ##OWNER= Administrator
$$ $$ E:\/data/COFFEE/nmr/NES1095_T12_9886966_kAx0Q6P168/22/pdata/1/auditp.txt
$$ ##AUDIT TRAIL=  $$ (NUMBER, WHEN, WHO, WHERE, PROCESS, VERSION, WHAT)
(   1,<2016-08-28 21:08:38.586 -0500>,<Administrator>,<X>,<go>,<TOPSPIN 2.1>,
      <created by zg
	started at 2016-08-28 20:57:08.992 -0500,
	POWCHK enabled, PULCHK disabled,
       configuration hash MD5:
       21 0F 79 D6 B3 7B B4 F6 88 20 88 DB 03 48 BD 9F
       data hash MD5: 64K
       84 67 CC 3F FF E6 25 ED 8D C3 B2 05 B5 C8 84 26>)
(   2,<2016-08-28 21:08:41.695 -0500>,<Administrator>,<X>,<proc1d>,<TOPSPIN 2.1>,
      <Start of raw data processing
       efp LB = 0.3 FT_mod = 6 PKNL = 1 PHC0 = 0 PHC1 = 0 SI = 128K 
       data hash MD5: 128K
       F5 66 3D 7C CD 45 5C E7 E6 AE 5A 2F 00 6F 95 EF>)
(   3,<2016-08-28 21:08:42.554 -0500>,<Administrator>,<X>,<proc1d>,<TOPSPIN 2.1>,
      <pk PHC0 = -83.18848 PHC1 = 0 
       data hash MD5: 128K
       DA CF 23 20 26 C4 12 91 C3 07 5C 56 82 88 0E C6>)
(   4,<2016-08-28 21:08:42.914 -0500>,<Administrator>,<X>,<proc1d>,<TOPSPIN 2.1>,
      <abs ABSG = 1 
       data hash MD5: 128K
       4E 06 20 69 3D F3 52 B9 72 4F 79 E6 2F CF FE C8>)
(   5,<2016-08-28 21:08:43.008 -0500>,<Administrator>,<X>,<proc1d>,<TOPSPIN 2.1>,
      <abs ABSG = 2 
       data hash MD5: 128K
       D1 F7 09 9A 1D 1A A0 EF 73 02 F6 76 31 A6 F0 20>)
(   6,<2016-08-28 21:08:43.086 -0500>,<Administrator>,<X>,<proc1d>,<TOPSPIN 2.1>,
      <abs ABSG = 3 
       data hash MD5: 128K
       6E B1 F0 FE 82 05 B0 97 B9 BA 23 A7 C0 18 2A 4D>)
(   7,<2016-08-28 21:08:43.179 -0500>,<Administrator>,<X>,<proc1d>,<TOPSPIN 2.1>,
      <abs ABSG = 4 
       data hash MD5: 128K
       C8 9B 48 C1 4D 96 3F 70 1D 90 16 4B 11 74 A7 24>)
(   8,<2016-08-28 21:08:43.289 -0500>,<Administrator>,<X>,<proc1d>,<TOPSPIN 2.1>,
      <abs ABSG = 5 
       data hash MD5: 128K
       6E 6E 25 C3 E7 A8 DB C6 B5 43 64 61 D8 00 54 79>)
$$ ##END=
$$ 
$$ $$ hash MD5
$$ $$ 2C 84 06 7A DB EE BA F4 39 CA 58 1D 89 5B C8 88
##$RELAX= 
##$RELAX= 
##$RELAX= 
##$RELAX= 
##$RELAX= 
##$RELAX= 
##$RELAX= 
##$RELAX= 
$$ Bruker specific parameters
$$ --------------------------
##$DU= <E:\>
##$EXPNO= 22
$$ [...]
##$TP07= 0
##$TPNAME0= <>
##$TPNAME1= <>
##$TPNAME2= <>
##$TPNAME3= <>
##$TPNAME4= <>
##$TPNAME5= <>
##$TPNAME6= <>
##$TPNAME7= <>
##$TPOAL= (0..7)
0.5 0.5 0.5 0.5 0.5 0.5 0.5 0.5
##$TPOFFS= (0..7)
0 0 0 0 0 0 0 0
##$TUNHIN= 0
##$TUNHOUT= 0
##$TUNXOUT= 0
##$USERA1= <user>
##$USERA2= <user>
##$USERA3= <user>
##$USERA4= <user>
##$USERA5= <user>
##$V9= 5
##$VALIST= <valist>
##$VCLIST= <CCCCCCCCCCCCCCC>
##$VD= 0
##$VDLIST= <DDDDDDDDDDDDDDD>
##$VPLIST= <PPPPPPPPPPPPPPP>
##$VTLIST= <TTTTTTTTTTTTTTT>
##$WBST= 2048
##$WBSW= 25
##$XGAIN= (0..3)
0 0 0 0
##$XL= 0
##$YL= 0
##$YMAX_a= 6407390
##$YMIN_a= -13891849
##$ZGOPTNS= <>
##$ZL1= 120
##$ZL2= 120
##$ZL3= 120
##$ZL4= 120
##$ABSF1= 14.96267
##$ABSF2= -5.595511
##$ABSG= 5
##$ABSL= 3
##$ALPHA= 0
##$AQORDER= 0
##$ASSFAC= 0
##$ASSFACI= 0
##$ASSFACX= 0
##$ASSWID= 0
##$AUNMP= <proc_prof1d_extract.lims>
##$AXLEFT= 0
##$AXNAME= <>
##$AXNUC= <1H>
##$AXRIGHT= 0
##$AXTYPE= 0
##$AXUNIT= <>
##$AZFE= 0.1
##$AZFW= 0.1
##$BCFW= 0
##$BC_mod= 0
##$BYTORDP= 0
##$COROFFS= 0
##$CY= 15
##$DATMOD= 1
##$DC= 0
##$DFILT= <>
##$DTYPP= 0
##$F1P= 0
##$F2P= 0
##$FCOR= 0.5
##$FTSIZE= 131072
##$FT_mod= 6
##$GAMMA= 0
##$GB= 0
##$INTBC= 1
##$INTSCL= 1
##$ISEN= 128
##$LB= 0.3
##$LEV0= 0
##$LPBIN= 0
##$MAXI= 10000
##$MC2= 0
##$MEAN= 0
##$ME_mod= 0
##$MI= 0
##$NCOEF= 0
##$NC_proc= -2
##$NLEV= 6
##$NOISF1= 0
##$NOISF2= 0
##$NSP= 0
##$NTH_PI= 0
##$NZP= 0
##$OFFSET= 14.96267
##$PC= 1
##$PHC0= -83.18848
##$PHC1= 0
##$PH_mod= 1
##$PKNL= yes
##$PPARMOD= 0
##$PPDIAG= 0
##$PPIPTYP= 0
##$PPMPNUM= 2147483647
##$PPRESOL= 1
##$PSCAL= 4
##$PSIGN= 0
##$PYNMP= <proc.py>
##$REVERSE= no
##$SF= 400.020008969613
##$SI= 131072
##$SIGF1= 0
##$SIGF2= 0
##$SINO= 400
##$SIOLD= 131072
##$SPECTYP= <>
##$SREGLST= <1H.CDCl3>
##$SSB= 0
##$STSI= 131072
##$STSR= 0
##$SW_p= 8223.68421052631
##$SYMM= 0
##$S_DEV= 0
##$TDeff= 65536
##$TDoff= 0
##$TI= <>
##$TILT= no
##$TM1= 0
##$TM2= 0
##$TOPLEV= 0
##$USERP1= <user>
##$USERP2= <user>
##$USERP3= <user>
##$USERP4= <user>
##$USERP5= <user>
##$WDW= 1
##$XDIM= 131072
##$YMAX_p= 405744030
##$YMIN_p= -11364
##$CURPLOT= <Network HP LaserJet P1505>
##$CURPRIN= <$Network HP LaserJet P1505>
##$DFORMAT= <normdp>
##$LAYOUT= <+/1D_H.xwp>
##$LFORMAT= <normlp>
##$PFORMAT= <normpl>
##$SURQMSG= 1
$$ End of Bruker specific parameters
$$ ---------------------------------
##NTUPLES= NMR SPECTRUM
##VAR_NAME=  FREQUENCY,     SPECTRUM/REAL,   SPECTRUM/IMAG
##SYMBOL=    X,             R,               I
##VAR_TYPE=  INDEPENDENT,   DEPENDENT,       DEPENDENT
##VAR_FORM=  AFFN,          ASDF,            ASDF
##VAR_DIM=   131072,        131072,          131072
##UNITS=     HZ,            ARBITRARY UNITS, ARBITRARY UNITS
##FACTOR=    0.0627417313425164, 1,          1
##FIRST=     8223.62146879497, -2248,        -43208
##LAST=      0,             -719,            -44417
##MIN=       0,             -11364,          0
##MAX=       8223.62146879497, 405744030,    0
$$ Real data points
##PAGE= N=1
##DATA TABLE= (X++(R..R)), XYDATA
$$ [...]
61073E12512n477m228l252k481j817j125m52l8J94P74J809K437J974J116J169
61058E03115K287L476M172M705N131M918M137L927M985O393O825O347O217P116
61044E73751Q408R112R013Q664Q636R025R542R960J0369J0994J1871J2877J3952
61031G06174J5082J6114J6813J7118J7170J7232J7732J9142K1434K3879K5867
61020I13757K7737L0265L3486L6650L9283M1605M3841M5900M7931N0597N4469
61009A365521N9726O6493P4905Q4595R4788J05301J16893J30563J47141J67953
60999B413879J95098K30654K76122L32752M01549M82807N77206O88437Q24043
60990F422547R92996J202632J455013J737216K006307K186183K194535J990462
$$ plain form
61073 512512 507035 502807 499555 497074 495257 494132 493680 493642 493836 494610 496419 498856 500830 501946 503115
61058 503115 505402 508878 513050 517755 522886 527804 531941 535868 540853 547246 554071 560418 566635 573751
61044 573751 582159 591271 600284 608948 617584 626609 636151 646111 656480 667474 679345 692222 706174
61031 706174 721256 737370 754183 771301 788471 805703 823435 842577 864011 887890 913757
61020 913757 941494 971759 1005245 1041895 1081178 1122783 1166624 1212524 1260455 1311052 1365521
61009 1365521 1425247 1491740 1566645 1651240 1746028 1851329 1968222 2098785 2245926 2413879
60999 2413879 2608977 2839631 3115753 3448505 3850054 4332861 4910067 5598504 6422547
60990 6422547 7415543 8618175 10073188 11810404 13816711 16002894 18197429 20187891
60982B0187891J604747J124921O50713K60781P912q0031j6999J22025K17401J63031
60972B4242392p6924m59928r04293j332798j688679j931860k038962k011329j876633
60963A1920986j676767j451417j228904j025374q47440o95735n68668m64622l81552
60954C580507l16114k64412k23436j91205j66013j46223j30529j17847j07084
60945A917644r7441q8711q0846p3507o6488o0416n6373n4676n4331n3862n2555
60934A178438n0761m9051m7295m4797m1361l7797l4954l2592k9890k6853k4358
60923G58729k2680k0984j8759j6862j6225j6183j5126j2622r854p988p009o383
60911E88054n900n502m950m238l822l984m292m182l719l347l194l101l099l218
$$ plain form
60982 20187891 21792638 22917559 23568272 23829053 23836965 23756934 23739935 23861960 24079361 24242392
60972 24242392 24165468 23705540 22801247 21468449 19779770 17847910 15808948 13797619 11920986
60963 11920986 10244219 8792802 7563898 6538524 5691084 4995349 4426681 3962059 3580507
60954 3580507 3264393 2999981 2776545 2585340 2419327 2273104 2142575 2024728 1917644
60945 1917644 1820203 1731492 1650646 1577139 1510651 1450235 1393862 1339186 1284855 1230993 1178438
60934 1178438 1127677 1078626 1031331 986534 945173 907376 872422 839830 809940 783087 758729
60923 758729 736049 715065 696306 679444 663219 647036 631910 619288 609434 601446 594437 588054
60911 588054 582154 576652 571702 567464 563642 559658 555366 551184 547465 544118 540924 537823 534724 531506
60897E31506l059k191r57j83J6M44J646L118M123M713N460O511P500Q133Q327
60882E75107P920O814N355M088L144K300J596J299J239P46n47k232l697m798n735
60867E92599o583p120o976n979m551l627l658l818k927j188o9j85l25Q08K773
60852E49174M244M994N794O766P133O673O246O549P251P787Q215Q770R178Q983
60838F47757Q273P570P280P473Q009Q617R035R237R293Q985P992O586N639N617
60824G57363N939N784N144M626M407L980K937J537L58l73r09j620k584l632m668
60809G78289n794p035q130q876r472j0202j0826j0818j0161r376q631p486n849
60796F65633m485m030l964l294j879l63J040K760M779O130N974M628L192K426
$$ plain form
60897 531506 528447 526256 525299 525116 525132 525576 527222 530340 534463 539176 544636 551147 558647 566780 575107
60882 575107 583027 589841 595196 599284 602428 604728 606324 607623 608862 609608 609061 606829 603132 598334 592599
60867 592599 586016 578896 571920 565941 561390 557763 554105 550287 547360 546172 546103 545918 545593 546401 549174
60852 549174 553418 558412 564206 570972 578105 584778 591024 597573 604824 612611 620826 629596 638774 647757
60838 647757 656030 663600 670880 678353 686362 694979 704014 713251 722544 731529 739521 746107 751746 757363
60824 757363 763302 769086 774230 778856 783263 787243 790180 791717 792075 791702 790793 789173 786589 782957 778289
60809 778289 772495 765460 757330 748454 738982 728780 717954 707136 696975 687599 678968 671482 665633
60796 665633 661148 657118 653154 649860 647981 647618 648658 651418 656197 662327 668301 672929 676121 678547
60782F78547K365K639K813K585K074J879K393L136L129K154J223J468K747L815
60768G12967L864L467L752M982O353P095P228P203P211P136O940O785O816P052
60754G98851P402P683P677P297O675N963N135M113K981J982J319J063J125J255
60740H60521J182Q62N09L04J41k81j184k537m027n237o042o723p550q342q836
60725H12760r404j0662j2312j3145j2647j1943j2346j3571j4240j3822j3074j2681
60713F62913j2503j2306j2170j1816j0415p745m851k881j798p53O06J920K946
60700E91147L885M946O084P110P665P263N841M160L143K841K556J790N67j148
60686F47850l520o181q192r118r628j0544j1775j2604j2708j2306j1566j0439
$$ plain form
60782 678547 680912 683551 686364 688949 691023 692902 695295 698431 701560 703714 704937 706405 709152 712967
60768 712967 716831 720298 724050 729032 735385 742480 749708 756911 764122 771258 778198 784983 791799 798851
60754 798851 806253 813936 821613 828910 835585 841548 846683 850796 853777 855759 857078 858141 859266 860521
60740 860521 861703 862565 863074 863378 863519 863238 862054 859517 855490 850253 844211 837488 829938 821596 812760
60725 812760 803356 792694 780382 767237 754590 742647 730301 716730 702490 688668 675594 662913
60713 662913 650410 638104 625934 614118 603703 595958 591107 588226 586428 585675 586281 588201 591147
60700 591147 595032 599978 606062 613172 620837 628100 633941 638101 641244 644085 646641 648431 648998 647850
60686 647850 644330 638149 629957 620839 611211 600667 588892 576288 563580 551274 539708 529269
60674E29269r034p624o283m918l652k669j744m64R51J709J558J281J624K257K374
60659E04635K001J938K543L298L691L842M006M036L755L386L202L026K570K012
60645E47941J863K331L218M292N401O334O977P544Q300R102R605R882J0384J1230
60631F44404J2026J2493J2777J2993J2927J2505J2107J2046J2097J1798J1020
60620G79193R892Q516P052N815M918M069L154K569K598K688K045O98o74j843l299
60605H27391n344p684r988j2148j3802j4344j3811j3084j2743j2330j1215r648
60593F91250q264o987n271l203j546o81k24J93M64M69M60O18P40P11Q66J542K476
60576F73613L038K920K313J542Q14J98m02j160k046k736l077l456m335n499o192
$$ plain form
60674 529269 520235 512611 506328 501410 497758 495089 493345 492881 493832 495541 497099 498380 500004 502261 504635
60659 504635 506636 508574 511117 514415 518106 521948 525954 529990 533745 537131 540333 543359 545929 547941
60645 547941 549804 552135 555353 559645 565046 571380 578357 585901 594201 603303 612908 622790 633174 644404
60631 644404 656430 668923 681700 694693 707620 720125 732232 744278 756375 768173 779193
60620 779193 789085 797601 804653 810468 815386 819455 822609 825178 827776 830464 832509 833207 832533 830690 827391
60605 827391 822047 814363 804375 792227 778425 764081 750270 737186 724443 712113 700898 691250
60593 691250 682986 675999 670728 667525 665979 665298 665074 665267 665731 666200 666660 667278 668018 668729 669595 671137 673613
60576 673613 676651 679571 681884 683426 684240 684438 684036 682876 680830 678094 675017 671561 667226 661727 655535
60561F55535o076n653n479n312m457k779r47M17J415K547M004N585P199R122J1676
60546F66797J4894J8595K2647K7067L1774L6303L9765M1229M0313L7304L2544
60535A009232K5870J7006O477m254j3743k1372k7048l0515l1386k9782k6430k2122
60523H51933j7262j2023o619j443K983O172Q033Q969R424R400Q759P899P708Q721
60509H92654J0654J3066J6051K0056K5267L1564L8971M7660N7570O8293P9508
60498A301314R1249J03671J16722J30231J44246J59222J75824J94581K15487K37721
60488B870268K59400K77426K87508K84792K65125K26506J69820R8549J8016o5327
60478D692083j44498k12928k65623l00012l16086l15997l03354k82272k56354
$$ plain form
60561 655535 649459 643806 638327 633015 628558 625779 624832 625249 626664 629211 633215 638800 645999 655121 666797
60546 666797 681691 700286 722933 750000 781774 818077 857842 899071 939384 976688 1009232
60535 1009232 1035102 1052108 1058585 1054331 1040588 1019216 992168 961653 930267 900485 874055 851933
60523 851933 834671 822648 816029 814586 817569 823741 831774 840743 850167 859567 868326 876225 883933 892654
60509 892654 903308 916374 932425 952481 977748 1009312 1048283 1095943 1153513 1221806 1301314
60498 1301314 1392563 1496234 1612956 1743187 1887433 2046655 2222479 2417060 2632547 2870268
60488 2870268 3129668 3407094 3694602 3979394 4244519 4471025 4640845 4739394 4757410 4692083
60478 4692083 4547585 4334657 4069034 3769022 3452936 3136939 2833585 2551313 2294959
60469B294959k28245j99992j73454j50035j30062j12890r7848q4845p4009o5101
60459I78478n7520n0768m4672l9334l4933l1391k8116k4497k0808j8193j7214
60448F11032j6854j5605j3309j1182j0002r225q131o992o463o305n580l988k403
60435D94993j879k540l673m666n474o222o645o242m939l248j627m2J612K995L694
60420D56097L860L956L980L521K556J559P81J12k15M81K300M251N276N361N183
60405D99059N155N346N930P005Q130Q635Q347P685P116O917P166P610P639O903
60391E98643N828N182N181N392N298M590L179J351j92r76j317j863k774l796m844
60376F18882n922o619o506n991n976o522o610n535l844k532j854j355o66K44J288
$$ plain form
60469 2294959 2066714 1866722 1693268 1543233 1413171 1300281 1202433 1117588 1043579 978478
60459 978478 920958 870190 825518 786184 751251 719860 691744 667247 646439 628246 611032
60448 611032 594178 578573 565264 554082 544080 534855 526724 519732 513269 506964 501384 497396 494993
60435 494993 493114 490574 486901 482235 476761 470539 463894 457652 452713 449465 447838 447796 449408 452403 456097
60420 456097 459957 463913 467893 471414 473970 475529 476310 476422 476207 476688 478988 483239 488515 493876 499059
60405 499059 504214 509560 515490 522495 530625 539260 547607 555292 562408 569325 576491 584101 591740 598643
60391 598643 604471 609653 614834 620226 625524 630114 633293 634644 634452 633476 632159 630296 627522 623726 618882
60376 618882 612960 606341 599835 593844 587868 581346 574736 569201 565357 562825 560971 559616 558950 559194 560482
60361E60482K270K801K627J979J412J327J709K304K841L148L145K772K084J413
60347E92314J184J338J238N04l86p90r24j476k346k608j848p70j77p3q3j01M9
60330E85045R04K615M283M776M047L151L003L579M242M350L541J919J13j118j480
60315F22970j357j395j975k970l893m252l884k937j725o74k37n30j155j657k071
60300E92258k617l093l070k669k458k535k459k113j916j867j383m15J17k83p13
60285E64784j13J222K252K728L143L579L734L823M380N258N874O342P289Q512
60271F22807Q924Q101O935O402O665P636R415J1615J3200J3632J3539J3666J3884
60258G56421J3920J4286J5548J7198J8226J8611J9308K0882K3015K5360K8097
$$ plain form
60361 560482 562752 565553 568180 570159 571571 572898 574607 576911 579752 582900 586045 588817 590901 592314
60347 592314 593498 594836 596074 596578 596192 595402 594478 593002 590656 588048 586200 585430 585253 585180 585097 584996 585045
60330 585045 585949 588564 592847 597623 601670 604821 607824 611403 615645 619995 623536 625455 625568 624450 622970
60315 622970 621613 620218 618243 615273 611380 607128 603244 600307 598582 597908 597671 597141 595986 594329 592258
60300 592258 589641 586548 583478 580809 578351 575816 573357 571244 569328 567461 566078 565663 565780 565497 564784
60285 564784 564671 565893 568145 570873 574016 577595 581329 585152 589532 594790 600664 607006 614295 622807
60271 622807 631731 639832 646767 653169 659834 667470 676885 688500 701700 715332 728871 742537 756421
60258 756421 770341 784627 800175 817373 835599 854210 873518 894400 917415 942775 970872
60247I70872L1419L5175L9264M3849M8931N4126N9179O4349P0001P6027Q1882
60236A575074Q7064R1348R4686R7031R8233R8030R6149R2453Q6928P9621P0707
60225B567324O0568M9676L8433K7201J6288N691m924j5547k5155l2285l6380l8198
60213B612692l8633l7555l4255k8709k1866j4622p024J409J0828K0824L0881M0816
60201B534786N0749O0750P0562P9671Q7573R3940R8445J00655J00189R6963R1024
60190C465307Q2244P0492N6200M0474K4404Q450p295k2541l6820m9950o1980p2570
60178C496415q0812q5858q7514q6058q1734p4776o5721n5377m4314l2604k0082
60167B781565o838O613J9560L1427M1833N0425N6708O0243O0915N8929N4533M7940
$$ plain form
60247 970872 1002291 1037466 1076730 1120579 1169510 1223636 1282815 1347164 1417165 1493192 1575074
60236 1575074 1662138 1753486 1848172 1945203 2043436 2141466 2237615 2330068 2416996 2496617 2567324
60225 2567324 2627892 2677568 2716001 2743202 2759490 2765181 2760257 2744710 2719555 2687270 2650890 2612692
60213 2612692 2574059 2536504 2502249 2473540 2451674 2437052 2430028 2431437 2442265 2463089 2493970 2534786
60201 2534786 2585535 2646285 2716847 2796518 2884091 2978031 3076476 3177131 3277320 3374283 3465307
60190 3465307 3547551 3618043 3674243 3714717 3739121 3747571 3740276 3717735 3680915 3630965 3568985 3496415
60178 3496415 3415603 3329745 3242231 3156173 3074439 2999663 2933942 2878565 2834251 2801647 2781565
60167 2781565 2774727 2781340 2800900 2832327 2874160 2924585 2981293 3041536 3102451 3161380 3215913 3263853
60155C263853L9504K9731J9073P918l149j3371k2212k9559l5261l8849l9936l8682
60143C139060l5465l0226k2556j2434m85J2539K6303M0887N6562P3567R1808J10695
60131C450255J29598J48476J67691J87153K06082K23860K40592K56420K70623
60122E280750K81956K89686K93751K93870K89175K78846K62761K41290K14882
60113G726967J84110J49793J12659P3077L1434j1323n3909r5341j34923j71566
60103G810978k03571k29388k48374k60611k66214k65110k57362k43539k24777
60094E612032k02592j78457j53272j27269j00634p4038m8365k4024q51K1256M1883
60083D765669O0322P5930Q8097R6048R8973R6477Q8904P7233O2578M5689K6911
$$ plain form
60155 3263853 3303357 3333088 3352161 3360079 3356930 3343559 3321347 3291788 3256527 3217678 3177742 3139060
60143 3139060 3103595 3073369 3050813 3038379 3037894 3050433 3076736 3117623 3174185 3247752 3339560 3450255
60131 3450255 3579853 3728329 3896020 4083173 4289255 4513115 4753707 5010127 5280750
60122 5280750 5562706 5852392 6146143 6440013 6729188 7008034 7270795 7512085 7726967
60113 7726967 7911077 8060870 8173529 8246606 8278040 8266717 8212808 8117467 7982544 7810978
60103 7810978 7607407 7378019 7129645 6869034 6602820 6337710 6080348 5836809 5612032
60094 5612032 5409440 5230983 5077711 4950442 4849808 4775770 4727405 4703381 4702530 4723786 4765669
60083 4765669 4825991 4901921 4990018 5086066 5185039 5281516 5370420 5447653 5510231 5555920 5582831
60072E582831O612j4530l5723n6291p5488r2406j06474j17959j27573j35621j41856
60061D685522j45963j47655j46342j41476j33348j23100j11703r9384q6166p2261
60051C478124n7681m2148k5828r590O052K1656L7871N4146O9129Q2065R3027J02018
60039C808841J08495J11800J11442J07067R8722Q7055P2754N5884L6366J4982
60029D613408o802k7930m8044o6731q3266r7185j08418j16670j21366j22417j20410
60018C694169j15798j08559r9000q8139p6780o4728n1522l7523k3664j0324L058
60007C021190J7175L2121M7434O2662P7774R2958J08040J22245J34772J45201
59997C861572J52861J56125J53333J44537J31531J15859R7521P6052N1976K6614
$$ plain form
60072 5582831 5589443 5574913 5539190 5482899 5407411 5315005 5208531 5090572 4962999 4827378 4685522
60061 4685522 4539559 4391904 4245562 4104086 3970738 3847638 3735935 3636551 3550385 3478124
60051 3478124 3420443 3378295 3352467 3342877 3348929 3370585 3408456 3462602 3531731 3613796 3706823 3808841
60039 3808841 3917336 4029136 4140578 4247645 4346367 4433422 4506176 4562060 4598426 4613408
60029 4613408 4606606 4578676 4530632 4463901 4380635 4283450 4175032 4058362 3936996 3814579 3694169
60018 3694169 3578371 3469812 3370812 3282673 3205893 3141165 3089643 3052120 3028456 3018132 3021190
60007 3021190 3038365 3070486 3117920 3180582 3258356 3351314 3459354 3581599 3716371 3861572
59997 3861572 4014433 4170558 4323891 4468428 4599959 4715818 4813339 4889391 4941367 4967981
59987D967981J037k4074m8046p0320r0537j07958j21291j29738j33754j34102
59977D109198j30583j22681j10966r6925q1557o5191m8526l2718j8062l642J1319
59966C409666K6421M0758N3870O5625P5765Q4111R0750R5573R7999R7510R4172
59955D232220Q8335Q0219P0208N9086M7480L5421K2867J0492n32r325j5437j8416
59943D602618j7868j3905o986K879J6297L3625N4247P7087J01654J28257J57132
59932E135037J87642K18465K48394K76700L02695L25202L42581L53068L54754
59923G744538L45509L23479K88074K40351J82388J16505M5201k8426j00634j67523
59913H989462k25616k72337l06376l27742l37333l36355l26144l08418k85309
$$ plain form
59987 4967981 4969018 4944944 4896898 4826578 4736041 4628083 4506792 4377054 4243300 4109198
59977 4109198 3978615 3855934 3744968 3648043 3566486 3501295 3452769 3420051 3401989 3398347 3409666
59966 3409666 3436087 3476845 3530715 3596340 3672105 3756216 3846966 3942539 4040538 4138048 4232220
59955 4232220 4320555 4400774 4470982 4530068 4577548 4612969 4635836 4646328 4645796 4636471 4621034 4602618
59943 4602618 4584750 4570845 4563859 4566738 4583035 4616660 4670907 4747994 4849648 4977905 5135037
59932 5135037 5322679 5541144 5789538 6066238 6368933 6694135 7036716 7389784 7744538
59923 7744538 8090047 8413526 8701600 8941951 9124339 9240844 9286045 9257619 9156985 8989462
59913 8989462 8763846 8491509 8185133 7857391 7520058 7183703 6857559 6549141 6263832
59904F263832k58881k30529k00855j70198j39118j08347p8289m8860j9957Q113
59894E016911L4960O0665Q5549J09299J30704J48506J62165J71453J75557J73047
59884F268816J62658J43808J16520Q1442M0200m624n0238r4271j34629j69162
59874F360520j96000k14354k24746k28391k26471k19929k09695j96842j82604
59865D461488j68299j55062j43466j33404j24363j15762j07033r7700q7617p7037
59855C251745o6182n4824m2665l0017j7701o276M146J3096J9316K1677K0282J6158
59843C128755R989J737q485j9692l0389l9324m5782m9647n1456n2096n2163n1707
59831B739740n0746m9620m8462m6621m3216l8218l2485k6646k0426j3334n630
$$ plain form
59904 6263832 6004951 5774422 5573567 5403369 5264251 5155904 5077615 5028755 5008798 5016911
59894 5016911 5051871 5112536 5198085 5307384 5438088 5586594 5748759 5920212 6095769 6268816
59884 6268816 6431474 6575282 6691802 6773244 6813444 6808820 6758582 6664311 6529682 6360520
59874 6360520 6164520 5950166 5725420 5497029 5270558 5050629 4840934 4644092 4461488
59865 4461488 4293189 4138127 3994661 3861257 3736894 3621132 3514099 3416399 3328782 3251745
59855 3251745 3185563 3130739 3088074 3058057 3040356 3034080 3038226 3051322 3070638 3092315 3112597 3128755
59843 3128755 3138744 3140481 3131996 3112304 3081915 3042591 2996809 2947162 2895706 2843610 2791447 2739740
59831 2739740 2688994 2639374 2590912 2544291 2501075 2462857 2430372 2403726 2383300 2369966 2364336
59820B364336J807Q413J4339J9954K5298L0100L3964L6396L6911L5376L2192K7872
59808B666958K2573J6297R533L327j390m311n533n139l196J66N030J1862K1046
59795B737223L2322M5029N8835P3972R0824J09671J30841J54641J80923K09026
59785C823307K38130K67221K94307L15827L27072L23256L00568K57240J94579
59776F341507J17170L1898n3488j31401j95326k41103k67808k77300k72805k57917
59766D793427k36206k10791j83845j56718j30495j06197q4364o4961m7802l2754
59756C539294j9423o998N224J7343K9037M0108N0753O1452P2771Q5081R8380J12457
59744D085479J27242J42819J59180J76253J94315K13981K35666K59296K84674
$$ plain form
59820 2364336 2366143 2374556 2388895 2408849 2434147 2464247 2498211 2534607 2571518 2606894 2639086 2666958
59808 2666958 2689531 2705828 2715361 2718688 2717298 2712987 2707454 2702315 2699119 2699285 2704315 2716177 2737223
59795 2737223 2769545 2814574 2873409 2947381 3038205 3147876 3278717 3433358 3614281 3823307
59785 3823307 4061437 4328658 4622965 4938792 5265864 5589120 5889688 6146928 6341507
59776 6341507 6458677 6490575 6437087 6305686 6110360 5869257 5601449 5324149 5051344 4793427
59766 4793427 4557221 4346430 4162585 4005867 3875372 3769175 3684811 3619850 3572048 3539294
59756 3539294 3519871 3512873 3518097 3535440 3564477 3604585 3655338 3716790 3789561 3874642 3973022 4085479
59744 4085479 4212721 4355540 4514720 4690973 4885288 5099269 5334935 5594231 5878905
59735E878905L11818L40646L70641M00972M30650M58270M81880M99490N09573
59726I682845N11011N03054M85892M61043M30818L97657L64421L34840L12723
59717A3484304L00403K98278L05673L21434L43629L69398L95568M19094M36807
59708A6674588M45297M41515M23553L90924L44588K86821K20634J49098P5471
59699A9452489L827o1184j15628j57036j83982j95670j92295j75041j45116j03247
59689A8127117n0633J0373P7343J49189K25674L05834L87726M69482N49543O25708
59679B0877356O94628P52347P94460Q15552Q09394P70473O95460N83676M37411
59670B7230757K62546O8375j33859l32483n15968o73666p97553q83715r32065
$$ plain form
59735 5878905 6190723 6531369 6902010 7302982 7733632 8191902 8673782 9173272 9682845
59726 9682845 10193856 10696910 11182802 11643845 12074663 12472320 12836741 13171581 13484304
59717 13484304 13784707 14082985 14388658 14710092 15053721 15423119 15818687 16237781 16674588
59708 16674588 17119885 17561400 17984953 18375877 18720465 19007286 19227920 19377018 19452489
59699 19452489 19456316 19395132 19279504 19122468 18938486 18742816 18550521 18375480 18230364 18127117
59689 18127117 18076484 18086857 18164200 18313389 18539063 18844897 19232623 19702105 20251648 20877356
59679 20877356 21571984 22324331 23118791 23934343 24743737 25514210 26209670 26793346 27230757
59670 27230757 27493303 27561678 27427819 27095336 26579368 25905702 25108149 24224434 23292369
59661B3292369r45090r27391q85984q30045p69699p14721o73401o51065o48631
59652A6246342o62496o86263p12922p36171p50846p53287p41926p17511o82503
59643I802417o40018n93066n44415m96518m51097m08746l69220l32229k97913
59634E669195k66643k38658k13878j91768j71376j51809j32940j15414r9866q6255
59624D000588p4029o2744n2424m3512l6613l2039k9484k8370k8532l0348l4030
59613C548463l9213m5327n2064n9114o5701p0838p3943p5138p4992p4113p2668
59602B845352p0105o5744n9803n3490m7726m2266l6487l0588k5204k0188j4712
59591B379039q700l200R69M325P886J1760J5105J7303J8605J9615K0524K1060
$$ plain form
59661 23292369 22347279 21419888 20533904 19703859 18934160 18219439 17546038 16894973 16246342
59652 16246342 15583846 14897583 14184661 13448490 12697644 11944357 11202431 10484920 9802417
59643 9802417 9162399 8569333 8024918 7528400 7077303 6668557 6299337 5967108 5669195
59634 5669195 5402552 5163894 4950016 4758248 4586872 4435063 4302123 4186709 4086843 4000588
59624 4000588 3926559 3863815 3811391 3767879 3731266 3699227 3669743 3641373 3612841 3582493 3548463
59613 3548463 3509250 3463923 3411859 3352745 3287044 3216206 3142263 3067125 2992133 2918020 2845352
59602 2845352 2775247 2709503 2649700 2596210 2548484 2506218 2469731 2439143 2413939 2393751 2379039
59591 2379039 2370339 2367139 2368108 2372433 2380319 2392079 2407184 2424487 2443092 2462707 2483231 2504291
59579B504291K1054K0879K1286K2755K5078K7720L0521L3880L8203M3461M9352
59568B838480N5703O2523O9896P7951Q6917R6937J07863J19358J31207J43433
59558C790268J56084J69071J82171J95078K07270K17844K25761K30429K31948
59549E605924K30631K26434K19125K08845J95926J80039J60123J35647J07701
59540G270395P8430M9631K2350k454k3691m0663n3289o1478o4804o2894n5759
59529G055774m3472k5942l431K2987N1802Q1592J10834J37448J59044J73603J79522
59518G899761J75251J59519J32218R4658M8824l323n9589j17060j72465k23075
59508G934719k67057l02958l29376l45348l50931l47222l35819l18367k96434
$$ plain form
59579 2504291 2525345 2546224 2567510 2590265 2615343 2643063 2673584 2707464 2745667 2789128 2838480
59568 2838480 2894183 2956706 3026602 3104553 3191470 3288407 3396270 3515628 3646835 3790268
59558 3790268 3946352 4115423 4297594 4492672 4699942 4917786 5143547 5373976 5605924
59549 5605924 5836555 6062989 6282114 6490959 6686885 6866924 7027047 7162694 7270395
59540 7270395 7348825 7398456 7420806 7418352 7394661 7353998 7300709 7239231 7174427 7111533 7055774
59529 7055774 7012302 6986360 6982929 7005916 7057718 7139310 7250144 7387592 7546636 7720239 7899761
59518 7899761 8075012 8234531 8366749 8461407 8510231 8506908 8447319 8330259 8157794 7934719
59508 7934719 7667662 7364704 7035328 6689980 6339049 5991827 5656008 5337641 5041207
59499E041207k71492k44885k17822j91426j66579j43643j22349j02182q2852o4429
59489C433548m6937l0031j3178L766K0415L6450N2265O8664Q5869J03128J19501
59478C833460J34852J49691J64224J77830J89392J97760K01834K00665J93692
59469E443400J80775J61852J36780J05696O9395K9296j2822n5036r5435j32383
59459E831518j64662j91425k12125k26476k34431k36369k33469k27507k19762
59450C885292k10159j98041j83803j69068j55149j42069j29396j17271j05991
59441B474345r5253q4622p4431o5392n7581n0474m3843l7847l2344k6917k1583
59430A884058j6687j2057p111k046J970M313N959Q361J1733J5024J7250J8147
$$ plain form
59499 5041207 4769715 4524830 4307008 4115582 3949003 3805360 3683011 3580829 3497977 3433548
59489 3433548 3386611 3356580 3343402 3347168 3367583 3404033 3456298 3524962 3610831 3713959 3833460
59478 3833460 3968312 4118003 4282227 4460057 4649449 4847209 5049043 5249708 5443400
59469 5443400 5624175 5786027 5922807 6028503 6097898 6127194 6114372 6059336 5963901 5831518
59459 5831518 5666856 5475431 5263306 5036830 4802399 4566030 4332561 4105054 3885292
59450 3885292 3675133 3477092 3293289 3124221 2969072 2827003 2697607 2580336 2474345
59441 2474345 2379092 2294470 2220039 2154647 2097066 2046592 2002749 1964902 1932558 1905641 1884058
59430 1884058 1867371 1855314 1848203 1846157 1848127 1852440 1858399 1866760 1878493 1893517 1910767 1928914
59418A928914J7693J5811J2841R742P471O299O090P076J0023J5342K2307K9393
59406B089002L5426M0179M3786M6071M6820M6577M6738M8734N3286O0412O9776
59395B626807Q0917R3409J07095J22134J38721J56718J75677J95325K16065K38820
59385D151688K64112K91440L19852L49077L79412M10271M39342M63637M81048
59376G549879M90497M91120M82202M63904M37528M05075L68850L31300K94517
59367A1314872K59718K27425J97899J70964J45528J19877R2375O1582K6139j4550
59357A2601829n9644j07633j57752k09620k61508l10078l52412l87560m15723
59348A0339899m36853m50722m57638m58220m52822m41811m26052m06605l84173
$$ plain form
59418 1928914 1946607 1962418 1975259 1985001 1992472 1998771 2004861 2011937 2021960 2037302 2059609 2089002
59406 2089002 2124428 2164607 2208393 2254464 2301284 2347861 2394599 2443333 2496619 2557031 2626807
59395 2626807 2707724 2801133 2908228 3030362 3169083 3325801 3501478 3696803 3912868 4151688
59385 4151688 4415800 4707240 5027092 5376169 5755581 6165852 6605194 7068831 7549879
59376 7549879 8040376 8531496 9013698 9477602 9915130 10320205 10689055 11020355 11314872
59367 11314872 11574590 11802015 11999914 12170878 12316406 12436283 12528658 12590240 12616379 12601829
59357 12601829 12542185 12434552 12276800 12067180 11805672 11495594 11143182 10755622 10339899
59348 10339899 9903046 9452324 8994686 8536466 8083644 7641833 7215781 6809176 6425003
59339F425003l59332l33027l06350k80080k54818k31128k09076j88008j67360
59330D095824j47519j29342j13047r8162q4296p1390n9206m7291l5565k4549j4679
59319C270778n773K721J0971J8476K4599K9373L3598L7813M1424M3322M3259M1975
59307C592536L9943L6785L2223K6704K0571J3535N719j468o549r608j1652j2761
59295C725978j1975q888m090K118J0279K0611L2318M4602N7478P0869Q3444R3256
59283D116000R9326J02124J02635J01471R8715R4077Q7084P7459O5401N1379L5711
59272E031382J8635Q60j6229l1207m3513n3472o1394o6828o9157o8741o6946o4834
59260D508556o2309n8984n5411n2752n1429n0824n0398n0418n1324n2863n4234
$$ plain form
59339 6425003 6065671 5732644 5426294 5146214 4891396 4660268 4451192 4263184 4095824
59330 4095824 3948305 3818963 3705916 3607754 3523458 3452068 3392862 3345571 3310006 3285457 3270778
59319 3270778 3265005 3267726 3278697 3297173 3321772 3351145 3384743 3422556 3463980 3507302 3550561 3592536
59307 3592536 3632479 3669264 3701487 3728191 3748762 3762297 3768016 3766548 3759999 3750391 3738739 3725978
59295 3725978 3714003 3705115 3701025 3703143 3713422 3734033 3766351 3810953 3868431 3939300 4022744 4116000
59283 4116000 4215326 4317450 4420085 4521556 4620271 4714348 4801432 4878891 4944292 4995671 5031382
59272 5031382 5050017 5050877 5034648 5003441 4959928 4906456 4845062 4778234 4709077 4640336 4573390 4508556
59260 4508556 4446247 4387263 4331852 4279100 4227671 4176847 4126449 4076031 4024707 3971844 3917610
59249C917610n4936n5031n4716n3855n1957m8567m3589l7231k9644k0781j0697
59238C456606L76J2502K6410M2963O2270Q3682J06561J30763J56335J83178K11029
59227D472675K39391K67301K93288L15647L32501L41740L41288L29631L06001
59218G239463K70173K22543J64492R8282K6535m7935j21723j90839k51502l01060
59208G108429l38127l62288l73871l73950l64345l47482l25875l01349k74760
59199D046382k46821k19054j93405j70898j51251j34064j19679j08394r9404r1264
59189B512148q3255p5702o9019o3066n7523n2298m7187m1589l5121k8388k2619
59178A936381j8303j4570j0208n121l00L593P015J0671J4435J7670K0360K3181
$$ plain form
59249 3917610 3862674 3807643 3752927 3699072 3647115 3598548 3554959 3517728 3488084 3467303 3456606
59238 3456606 3456982 3469484 3495894 3538857 3601127 3684809 3791370 3922133 4078468 4261646 4472675
59227 4472675 4712066 4979367 5272655 5588302 5920803 6262543 6603831 6933462 7239463
59218 7239463 7509636 7732179 7896671 7994953 8021488 7973553 7851830 7660991 7409489 7108429
59208 7108429 6770302 6408014 6034143 5660193 5295848 4948366 4622491 4321142 4046382
59199 4046382 3799561 3580507 3387102 3216204 3064953 2930889 2811210 2702816 2603412 2512148
59189 2512148 2428893 2353191 2284172 2221106 2163583 2111285 2064098 2022509 1987388 1959000 1936381
59178 1936381 1918078 1903508 1893300 1888179 1887879 1891472 1898487 1909158 1923593 1941263 1961623 1984804
59166A984804K6489K9873L2882L5696L8758M2151M5665M9144N2439N5206N7072
59155B450179N7871N7529N5958N3245M9776M5784M1053L5336K8818K1819J4254
59144B911622N995k372r797j5928k1397k6602l0773l2825l2748l1518k9820k7531
59132B656306k4448k0722j6273j0489l073N238J3367K1031K8664L6494M4465N2908
59120B783468O2430P2841Q2959R1778R9360J06292J12917J19469J26348J33622
59110C791484J40610J46618J51807J56786J61657J66045J69759J72516J73080
59101E230362J69446J60068J44432J22472R4198O0103K1397k0457o3834j06459
59091E811728j45546j78944k05865k26212k39765k46469k47147k43189k35696
$$ plain form
59166 1984804 2011293 2041166 2074048 2109744 2148502 2190653 2236318 2285462 2337901 2393107 2450179
59155 2450179 2508050 2565579 2621537 2674782 2724558 2770342 2811395 2846731 2875549 2897368 2911622
59144 2911622 2917617 2915245 2905448 2889520 2868123 2841521 2810748 2777923 2745175 2713657 2683837 2656306
59132 2656306 2631858 2611136 2594863 2584374 2581301 2586539 2599906 2620937 2649601 2686095 2730560 2783468
59120 2783468 2845898 2918739 3001698 3093476 3192836 3299128 3412045 3531514 3657862 3791484
59110 3791484 3932094 4078712 4230519 4387305 4548962 4715007 4884766 5057282 5230362
59101 5230362 5399808 5559876 5704308 5826780 5920978 5981081 6002478 5982021 5918187 5811728
59091 5811728 5666182 5487238 5281373 5055161 4815396 4568927 4321780 4078591 3842895
59082C842895k25350k12977j99664j86223j72895j59701j46831j34560j23051
59073B281643j12380j02653r3903q5903p8278p0865o4002n8216n3625m9752m6009
59062A466057m2247l8621l5141l1658k8251k5189k2447j9657j6710j4117j2479
59051A179540j1768j1417j1007j0621j0514j0618j0599j0251r688r053q151o724
59039A059129m974l445k185m55K380N919R135J1527J3352J4827J5810J6334J6898
59026A154252J7801J8672J8969J8796J8788J9333K0058K0127J8962J6717J4020
59015A356495J1115P545L001j727n267p247q713j0659j2741j3840j3473j2101
59003A292388j0362q695p542p198p235o628m840k499o96K22Q12J558K186K214
$$ plain form
59082 3842895 3617545 3404568 3204904 3018681 2845786 2686085 2539254 2404694 2281643
59073 2281643 2169263 2066610 1972707 1886804 1808526 1737661 1673659 1615443 1561818 1512066 1466057
59062 1466057 1423810 1385189 1350048 1318390 1290139 1264950 1242503 1222846 1206136 1192019 1179540
59051 1179540 1167772 1156355 1145348 1134727 1124213 1113595 1102996 1092745 1083057 1074004 1065853 1059129
59039 1059129 1054155 1050710 1048525 1048070 1050450 1056369 1065504 1077031 1090383 1105210 1121020 1137354 1154252
59026 1154252 1172053 1190725 1209694 1228490 1247278 1266611 1286669 1306796 1325758 1342475 1356495
59015 1356495 1367610 1375155 1378156 1376429 1371162 1363915 1355202 1344543 1331802 1317962 1304489 1292388
59003 1292388 1282026 1273331 1265789 1258591 1251356 1244728 1239888 1237389 1236693 1236915 1237727 1239285 1241471 1243685
58989A243685J870J977K869L889M209L873L631L908M368M529M409M433M959N998
58975A298607P230Q227Q833R383J0416J2131J4219J6279J8228K0301K2734K5415
58963A472003K7800K9306K9910L0134L0298L0112K9254K7962K6677K5423K4111
58952A782990K3205K3388K4752K6931K9899L3882L8494M2813M6471M9947N3686
58941B176458N7664O1966O6904P2149P6659P9981Q2950Q6555R0898R5876J02193
58930C050253J10700J21176J32680J44949J58687J74507J92290K11528K31763
58921D528533K52676K74367K97568L23075L50937L80515M11320M43244M75992
58912G738227N08601N39605N67206N89180O03034O06516N97890N75595N37933
$$ plain form
58989 1243685 1245555 1247532 1250401 1254290 1258499 1262372 1266003 1269911 1274279 1278808 1283217 1287650 1292609 1298607
58975 1298607 1305837 1314064 1322897 1332280 1342696 1354827 1369046 1385325 1403553 1423854 1446588 1472003
58963 1472003 1499803 1529109 1559019 1589153 1619451 1649563 1678817 1706779 1733456 1758879 1782990
58952 1782990 1806195 1829583 1854335 1881266 1911165 1945047 1983541 2026354 2072825 2122772 2176458
58941 2176458 2234122 2296088 2362992 2435141 2511800 2591781 2674731 2761286 2852184 2948060 3050253
58930 3050253 3160953 3282129 3414809 3559758 3718445 3892952 4085242 4296770 4528533
58921 4528533 4781209 5055576 5353144 5676219 6027156 6407671 6818991 7262235 7738227
58912 7738227 8246828 8786433 9353639 9942819 10545853 11152369 11750259 12325854 12863787
58903A2863787M83502M12236L26018K28213J22580J2852r6617k00519k93838l73593
58893A3484621m38868m89349n24753n46006n55888n57547n52739n41906n25520
58884H752045n04528m79888m52409m23053l92798l62399l32638l04629k79319
58875E220384k56790k36523k18123k01320j85639j70710j56736j44076j32505
58866C517962j21487j11002j01407r2611q4093p5738o7949o0923n4412m8290m2655
58855B657395l7348l1963k6465k1155j5974j0558n069j63M174Q900J4574K0418
58843B556766K5338K9360L3372L7891M2775M7954N3665N9946O6424P2837P9402
58832C105730Q6571R4575J03343J12723J22765J33769J45966J59198J73148J87938
$$ plain form
58903 12863787 13347289 13759525 14085543 14313756 14436336 14449188 14352571 14152052 13858214 13484621
58893 13484621 13045753 12556404 12031651 11485645 10929757 10372210 9819471 9277565 8752045
58884 8752045 8247517 7767629 7315220 6892167 6499369 6136970 5804332 5499703 5220384
58875 5220384 4963594 4727071 4508948 4307628 4121989 3951279 3794543 3650467 3517962
58866 3517962 3396475 3285473 3184066 3091455 3007362 2931624 2863675 2802752 2748340 2700050 2657395
58855 2657395 2620047 2588084 2561619 2540464 2524490 2513932 2508863 2508700 2512874 2521774 2536348 2556766
58843 2556766 2582104 2611464 2644836 2682727 2725502 2773456 2827121 2887067 2953491 3026328 3105730
58832 3105730 3192301 3286876 3390219 3502942 3625707 3759476 3905442 4064640 4237788 4425726
58822D425726K04255K22690K43247K65695K90098L16655L45188L75176M06265
58813G094995M38264M70483N01328N28718N50722N65674N71792N66887N48446
58804A1837309N14139M62591L94047L10453K14859J10740J885j07311k11929l07246
58794A3219537l89545m56467n06907n40865n59178n63196n54644n35701n08835
58785H604199m76145m38916l98101l55164l12199k71395k35004k05862j87147
58776E724266j80801j85952j99019k15338k30851k42678k48846k48090k40236
58767C732455k26628k09597j91167j72351j53814j36551j21309j07757r5103q3378
58757B234800p3195o4355n5790m7179l9535l3668k9003k4578k0400j7047j4598
$$ plain form
58822 4425726 4629981 4852671 5095918 5361613 5651711 5968366 6313554 6688730 7094995
58813 7094995 7533259 8003742 8505070 9033788 9584510 10150184 10721976 11288863 11837309
58804 11837309 12351448 12814039 13208086 13518539 13733398 13844138 13846023 13738712 13526783 13219537
58794 13219537 12829992 12373525 11866618 11325753 10766575 10203379 9648735 9113034 8604199
58785 8604199 8128054 7689138 7291037 6935873 6623674 6352279 6117275 5911413 5724266
58776 5724266 5543465 5357513 5158494 4943156 4712305 4469627 4220781 3972691 3732455
58767 3732455 3505827 3296230 3105063 2932712 2778898 2642347 2521038 2413281 2318178 2234800
58757 2234800 2161605 2097250 2041460 1994281 1954746 1921078 1892075 1867497 1847097 1830050 1815452
58746A815452j2721j1324j0388r690r441j0658j4009j8696k3311k7390l1159l4268
58734A602397l5956l6285l6058l5528l4277l2378l0630k9388k8206k6844k5789
58723A251058k5394k5298k4980k4190k2665k0300j7807j6285j5688j4569j1949
58712A031933q694o374n443n282n574o724q968j1779j4264j5854j6624j7070j7535
58699H91748j7813j7488j6570j5426j4129j2445j0469q647o972m899k403l13Q49
58686G65023J782L467N917Q578J1392J4569J7604J9654K0967K2941K6544L1348
58674I49786L6498M1994M8481N6380O5781P6726Q8642R9231J04627J01221Q7509
58663A756876O4327L3987k72l4368o4048q6287j00076j05838j04441r7095q5820
$$ plain form
58746 1815452 1802731 1791407 1781019 1771329 1761888 1751230 1737221 1718525 1695214 1667824 1636665 1602397
58734 1602397 1566441 1530156 1494098 1458570 1424293 1391915 1361285 1331897 1303691 1276847 1251058
58723 1251058 1225664 1200366 1175386 1151196 1128531 1108231 1090424 1074139 1058451 1043882 1031933
58712 1031933 1023239 1016865 1011422 1006140 1000566 993842 984874 973095 958831 942977 926353 909283 891748
58699 891748 873935 856447 839877 824451 810322 797877 787408 778761 771789 766890 764487 764174 765023
58686 765023 766805 770272 776189 784767 796159 810728 828332 847986 868953 891894 918438 949786
58674 949786 986284 1028278 1076759 1133139 1198920 1275646 1364288 1463519 1568146 1669367 1756876
58663 1756876 1821203 1855190 1854918 1820550 1756502 1670215 1570139 1464301 1359860 1262765 1176945
58652A176945p3200o1284n0847m1649l3266k5606j8939j3578r541o479l865j189
58640H37502J924N456Q795J1140J2394J3350J4839J7000J9645K2877K6869L1306
58628A023097L5676L9949M4510M9621N5383O2036O9694P7955Q6417R5498J06067
58617A745903J18130J30468J41749J51498J59891J66898J71830J73382J70068
58608C129817J60906J45726J24692R7931O6114L1065m822l9634p1859r9675j21400
58597C418861j36703j46477j51499j52010j48733j43167j36465j28763j20050
58588B154994j10915j01993r3334q4838p6690o8974o1441n4200m7978m3171l9203
58577A372257l5321l1524k8027k4400k0058j5386j1500q906o983m936k832j540
$$ plain form
58652 1176945 1103745 1042461 991614 949965 916699 891093 872154 858576 849035 842556 838691 837502
58640 837502 839426 844882 853677 864817 877211 890561 905400 922400 942045 964922 991791 1023097
58628 1023097 1058773 1098722 1143232 1192853 1248236 1310272 1379966 1457921 1544338 1639836 1745903
58617 1745903 1864033 1994501 2136250 2287748 2447639 2614537 2786367 2959749 3129817
58608 3129817 3290723 3436449 3561141 3659072 3725186 3756251 3751429 3711795 3639936 3540261 3418861
58597 3418861 3282158 3135681 2984182 2832172 2683439 2540272 2403807 2275044 2154994
58588 2154994 2044079 1942086 1848752 1763914 1687224 1618250 1556809 1502609 1454631 1411460 1372257
58577 1372257 1336936 1305412 1277385 1252985 1232927 1217541 1206041 1197135 1190152 1185216 1182384 1180844
58565A180844j742l142m679n539n765n600m591k008J948O109R616J2324J3650
58552A191425J2097O694j666j1089k0358k9000l6199m0800m2434m1749l9432l5669
58540I11820l0814k5905k1948j8997j6313j3409j0571q339o744n406m221l583
58528G45570l795m648n807p249q913j0230j0605j0184r627r241q871q465q067
58515F39868p392o088m478l289k669k164j684j641k010k189j999j989k420k793
58501E97063k698k365j969j262k70M54P69J328K464L494L711L326K843K246J487
58486F10621R92Q69K89j373l330m184l600k359j166k16L23K67j42l67j21N27J301
58469E98331J682J155j0p57n63k05o19j498j869j634j688k633m114n370n893n655
$$ plain form
58565 1180844 1179102 1175960 1171281 1165742 1159977 1154377 1149786 1147778 1149726 1155835 1165451 1177775 1191425
58552 1191425 1203522 1210216 1208550 1197461 1177103 1148103 1111904 1071104 1028670 986921 947489 911820
58540 911820 881006 855101 833153 814156 797843 784434 773863 765524 758780 753374 749153 745570
58528 745570 741775 737127 731320 724071 715158 704928 694323 684139 674512 665271 656400 647935 639868
58515 639868 632476 626388 621910 618621 615952 613788 612104 610463 608453 606264 604265 602276 599856 597063
58501 597063 594365 592000 590031 588769 588499 588953 589722 591050 593514 597008 600719 604045 606888 609134 610621
58486 610621 611613 612482 612771 611398 608068 603884 600284 597925 596759 596543 596866 597133 596991 596624 596503 597030 598331
58469 598331 600013 601168 601158 600401 599838 599633 599014 597516 595647 594013 592325 589692 585578 580208 574315 568660
58453E68660n138n000n350n546n081m222l479k892k334k001k063k198k061j784
58439E19511j575j250o53j32L1J34N05R39J208J552K080K313K072K096K949L918
58423E35698M020L563L621M354N011N397O154P557Q986R774R877R549R022Q507
58409F31090Q112P717P237O732N978M409K024k09j478k171l055l968m202l764
58395F54452l301l020k650k210k038k072j926j587j353j219r70o12j87N94J888
58380F33789L156L723L626L351L119L000L213L709L920L708L892N044O359O641
58366F90250N892N004M358L756L295L255L453L567L791M327M754M715M667M996
58352G50080N138M526L761L592L537K776J800J719K532L467M460N806O909P017
$$ plain form
58453 568660 563522 558522 553172 547626 542545 538323 534844 531952 529618 527617 525554 523356 521295 519511
58439 519511 517936 516686 516033 515901 515932 516066 516571 517510 518718 520270 522350 524663 526735 528831 531780 535698
58423 535698 539718 543281 546902 551256 556267 561664 567818 575375 584361 594135 604012 613561 622583 631090
58409 631090 639202 646919 654156 660888 666866 671275 673299 673090 671612 669441 666386 662418 658216 654452
58395 654452 651151 648131 645481 643271 641233 639161 637235 635648 634295 633076 632106 631494 631307 631901 633789
58380 633789 636945 640668 644294 647645 650764 653764 656977 660686 664606 668314 672206 677250 683609 690250
58366 690250 696142 701146 705504 709260 712555 715810 719263 722830 726621 730948 735702 740417 745084 750080
58352 750080 755218 759744 763505 767097 770634 773410 775210 776929 779461 782928 787388 793194 800103 807120
58338H07120O827P647R333J0648J1302J1958J2547J2398J1862J1930J2306J1741
58326I37619J0292R352R351R327Q972R138R913J0133R407Q908R453J0304J0525
58313A062694J0121R378Q400P816Q528J0238J1497J1655J1549J1980J2833J3962
58301A190651J5493J6913J7330J7081J7534J8972K0167K0532K1028K2256K3303
58290A401260K3298K2789K2713K3134K3847K5080K6830K8355K9089K9340K9707
58279A685442L0514L1900L3733L5298L5976L6162L6697L7611L8466L9390M0528
58268B081717M1063M0357L9499M0058M1809M3424M4837M6835M8942N0090N1019
58257B569650N3508N7472O1196O4325O7993P2166P5627P8516Q2189Q6565R0418
$$ plain form
58338 807120 813947 821594 830927 841575 852877 864835 877382 889780 901642 913572 925878 937619
58326 937619 947911 957263 966614 975941 984913 994051 1003964 1014097 1023504 1032412 1041865 1052169 1062694
58313 1062694 1072815 1082193 1090593 1098409 1106937 1117175 1128672 1140327 1151876 1163856 1176689 1190651
58301 1190651 1206144 1223057 1240387 1257468 1275002 1293974 1314141 1334673 1355701 1377957 1401260
58290 1401260 1424558 1447347 1470060 1493194 1517041 1542121 1568951 1597306 1626395 1655735 1685442
58279 1685442 1715956 1747856 1781589 1816887 1852863 1889025 1925722 1963333 2001799 2041189 2081717
58268 2081717 2122780 2163137 2202636 2242694 2284503 2327927 2372764 2419599 2468541 2518631 2569650
58257 2569650 2623158 2680630 2741826 2806151 2874144 2946310 3021937 3100453 3182642 3269207 3359625
58246C359625R4142R9189J04921J09361J13084J18720J26454J33825J40399J48594
58236D548314J59118J69743J79572J90510K03331K16453K29793K45720K64705
58227F407259K84271L03843L26293L53041L81995M12168M45889M84437N26067
58218I925263N70376O20247O77577P41742Q14081Q98912R98481J112350J243371
58209A7602400J398389J581902J796337K050526K360308K739373L199032L759653
58201C6487920M452115N304842O339772P582254R061129J0800236J2835449J5251724
58193A08115441J8180010K1732894K5924653L0577080L5149449L8567890L9349975
58186C17597392L6202481K8768227J7905828N270102p386975j8640748k7457453
$$ plain form
58246 3359625 3453767 3552956 3657877 3767238 3880322 3999042 4125496 4259321 4399720 4548314
58236 4548314 4707432 4877175 5056747 5247257 5450588 5667041 5896834 6142554 6407259
58227 6407259 6691530 6995373 7321666 7674707 8056702 8468870 8914759 9399196 9925263
58218 9925263 10495639 11115886 11793463 12535205 13349286 14248198 15246679 16359029 17602400
58209 17602400 19000789 20582691 22379028 24429554 26789862 29529235 32728267 36487920
58201 36487920 40940035 46244877 52584649 60166903 69228032 80028268 92863717 108115441
58193 108115441 126295451 148028345 173952998 204530078 239679527 278247417 317597392
58186 317597392 353799873 382568100 400473928 405744030 398357055 379716307 352258854
58179C52258854l3195776l5706856l5377289l2961064k9293172k5075747k0798862
58172A39850088j6749070j3076220r897917p365362n620695m691150m441628m635583
58164G3372463n034935n453352n755573n849328n695291n317446m789608m200005
58156C1276925l618161l083608k613581k213202j879430j603299j374611j185315
58148A3705718j028750q98533p89861p00008o26190n64770n13401m71718m38564
58139G673923m10521l84541l60091l37331l15109k92279k69403k47611k27033
58130D830004k07616j90068j74757j61039j48790j39322j33477j29975j26866
58121C418094j23576j20394j17042j13022j08581j04139r9297r3428q6799q0359
$$ plain form
58179 352258854 319063078 283356222 247978933 215017869 185724697 160648950 139850088
58172 139850088 123101018 110024798 100126881 92761519 87140824 82449674 78008046 73372463
58164 73372463 68337528 62884176 57128603 51279275 45583984 40266538 35476930 31276925
58156 31276925 27658764 24575156 21961575 19748373 17868943 16265644 14891033 13705718
58148 13705718 12676968 11778435 10988574 10288566 9662376 9097606 8584205 8112487 7673923
58139 7673923 7263402 6878861 6518770 6181439 5866330 5574051 5304648 5057037 4830004
58130 4830004 4622388 4432320 4257563 4096524 3947734 3808412 3674935 3544960 3418094
58121 3418094 3294518 3174124 3057082 2944060 2835479 2731340 2632043 2538615 2451816 2371457
58111B371457p4751p0075o6101o2340n8321n4103n0079m6258m2407l8860l6327
58100A771835l4805l3516l1966l0346k8968k8224k8851l1130l3952l5717l6115
58089A418245l5871l5114l3400l1251k9905k9395k8403k6419k4500k3438k2632
58078A097917k1324j9734j8361j7201j6202j5550j5075j4316j3344j2605j1863
58067I22342j0499q892q168q357q149o826n164m034l433l254l699m548n203n761
58053H36355o826p977p999o852n905n722n248l818k333j596j126m22N2J27O93
58038G81403K111L264L311L086L536L974L296J790L80j022k999n245o961q094
58024G81830q985r455r326r197r566r828r258q302p716p159n890m305l324k717
$$ plain form
58111 2371457 2296706 2226631 2160530 2098190 2039869 1985766 1935687 1889429 1847022 1808162 1771835
58100 1771835 1737030 1703514 1671548 1641202 1612234 1584010 1555159 1524029 1490077 1454360 1418245
58089 1418245 1382374 1347260 1313860 1282609 1252704 1223309 1194906 1168487 1143987 1120549 1097917
58078 1097917 1076593 1056859 1038498 1021297 1005095 989545 974470 960154 946810 934205 922342
58067 922342 911843 902951 894783 886426 878277 871451 866287 862253 858820 855566 851867 847319 842116 836355
58053 836355 829529 821552 813553 806701 800796 795074 789826 786008 783675 782079 780953 780531 780583 780710 781403
58038 781403 783514 786778 790089 793175 796711 800685 803981 805771 806151 805129 802130 796885 789924 781830
58024 781830 772845 763390 754064 744867 735301 725473 716215 707913 700197 693038 687148 682843 679519 676802
58010F76802j445N75K457L986N881Q301J0361J1437J1894J2221J2271J1745J0654
57997G77140Q969O400K875j026m418o724p951q565r018r311r161q675q382q456
57983G13697q368p691o701n812m934l935l182k910k555j454R2J295K126L319N215
57968F78202P421R543J1493J2982J3372J2259R810O346K114k435o550r713j2037
57955G32807j3893j5223j5483j4377j2381j0326q472o452m218k401j294q7K016
57942F30216M342N572N715O025O850O912N219K381n99l685p085j0230j2552j4430
57928F24651j6307j7518j7155j5554j3821j2321j0700q982p473n875l698j488
57916D93759l36j62L40J822L403M141M298M596M970M798L937K821J761O01q77
$$ plain form
58010 676802 675357 675932 678389 682375 688256 696557 706918 718355 730249 742470 754741 766486 777140
57997 777140 786109 792509 795384 794358 789940 783216 775265 766700 757682 748371 739210 730535 722153 713697
57983 713697 705329 697638 690937 685125 680191 676256 673074 670164 667609 666155 666247 667542 669668 672987 678202
57968 678202 685623 695166 706659 719641 733013 745272 755082 761428 763542 761107 754557 744844 732807
57955 732807 718914 703691 688208 673831 661450 651124 642652 636200 631982 629581 628287 628200 630216
57942 630216 634558 640130 645845 651870 658720 665632 670851 673232 672633 668948 661863 651633 639081 624651
57928 624651 608344 590826 573671 558117 544296 531975 521275 512293 504820 498945 495247 493759
57916 493759 493423 493261 493601 495423 498826 502967 507265 511861 516831 521629 525566 528387 530148 530749 529872
57901E29872k576m206n671p200q916j0333j0721j0062r292r182r429r206q374
57888D24704p495o836o041m800l280j806m77P65K014L364M773N963O735P275P859
57873D32717Q373Q450Q020P389O803O244N640M988M225L300K296J310K09j231
57859D98733l006m826o354p417q103q727r488j0019r646q304o857o215o340o473
57845C96958o065n187m192l336k663k033j351q80j027j807k814l846n026o210
57831C50521o878o923o898p053o795n773m790m833n554n678m694l360k571k464
57817B76257k607k440j651n88r5m08m94P59K999M887N872O510P071O986O027N028
57801C14113M839N311N822O326P200Q468R792J1062J2501J4176J5716J6613J6632
$$ plain form
57901 529872 527296 523090 517419 510219 501303 490970 480249 470187 460895 451713 442284 433078 424704
57888 424704 417209 410373 404332 399532 396252 394446 393969 394734 396748 400112 404885 410848 417583 424858 432717
57873 432717 441090 449540 457560 464949 471752 477996 483636 488624 492849 496149 498445 499755 499964 498733
57859 498733 495727 490901 484547 477130 469027 460300 450812 440793 431147 422843 415986 409771 403431 396958
57845 396958 390893 385706 381514 378178 375515 373482 372131 371251 370224 368417 365603 361757 356731 350521
57831 350521 343643 336720 329822 322769 315974 310201 305411 300578 295024 289346 284652 281292 278721 276257
57817 276257 273650 271210 269559 268971 268876 268468 267974 268733 271732 276619 282491 289001 296072 303058 309085 314113
57801 314113 318952 324263 330085 336411 343611 352079 361871 372933 385434 399610 415326 431939 448571
57788D48571J5863J4376J1946Q310L752q80m955q685j2564j6346j9071k0050j9505
57775D00762j8216j6821j5491j4050j2334j0514q939p579n979l972k081q52j48
57762B83786M65J019J351J713K468L350L750L694L893M745N845O546O606O167
57748C35398N555N083M740M105K991J917J464J420J145N93K26R3j43k96K67J482
57732C66040K366K378K202K778M124N539O570P280P866Q484R282J0303J1382J2240
57718D58834J2664J2729J2904J3699J4946J5847J6197J7003J9166K1944K3867
57707F39800K4923K6641K9869L3669L6895L9833M3701M9234N6292O4271P2404
57696A117532Q0309Q8611R8448J10075J22595J35278J48242J61359J73487J83339
$$ plain form
57788 448571 464434 478810 490756 499066 502818 501938 496983 488298 475734 459388 440317 420267 400762
57775 400762 382546 365725 350234 336184 323850 313336 304397 296818 290839 286867 284786 283934 283786
57762 283786 284251 285270 286621 288334 290802 294152 297902 301596 305489 310234 316079 322625 329231 335398
57748 335398 340953 346036 350776 354881 357872 359789 361253 362673 363818 364411 364637 364730 364587 364291 364558 366040
57732 366040 368406 370784 372986 375764 379888 385427 391997 399277 407143 415627 424909 435212 446594 458834
57718 458834 471498 484227 497131 510830 525776 541623 557820 574823 593989 615933 639800
57707 639800 664723 691364 721233 754902 791797 831630 875331 924565 980857 1045128 1117532
57696 1117532 1197841 1286452 1384900 1494975 1617570 1752848 1901090 2062449 2235936 2419275
57686B419275J90247J93339J90914J81552J65274J42935J15328Q3910N1681K2039
57676C756494k856k1614l2205l2562k2727n531J4328L0576L5504K2573r319n4669
57664C677992j04930j52778j93120k22022k36760k36938k24799k04215j79420
57655A923010j53948j29830j07653q7615p0257n5905m3964l3415k3890j5650q653
57644A192230k248M156J0613J7026K3612L0763L8626M6992N5493O3928P2563Q2064
57632A635818R2956J04997J17205J28504J38170J45774J50944J53260J51979J45738
57622B965345J32963J12944Q6477N5246K0874j5071n0462q2788j10161j31837
57612B983530j47740j57943j62757j62854j58922j51632j42072j31752j21649
$$ plain form
57686 2419275 2609522 2802861 2993775 3175327 3340601 3483536 3598864 3682774 3734455 3756494
57676 3756494 3753638 3732024 3699819 3667257 3644530 3638999 3653327 3683903 3719407 3741980 3732661 3677992
57664 3677992 3573062 3420284 3227164 3005142 2768382 2531444 2306645 2102430 1923010
57655 1923010 1769062 1639232 1531579 1443964 1373707 1317802 1273838 1240423 1216533 1200883 1192230
57644 1192230 1189982 1194138 1204751 1221777 1245389 1276152 1314778 1361770 1417263 1481191 1553754 1635818
57632 1635818 1728774 1833771 1950976 2079480 2217650 2363424 2514368 2667628 2819607 2965345
57622 2965345 3098308 3211252 3297729 3352975 3373849 3358778 3308316 3225528 3115367 2983530
57612 2983530 2835790 2677847 2515090 2352236 2193314 2041682 1899610 1767858 1646209
57603A646209j11662j01446r1425q2424p4648o7705o1408n5797n0551m5226m0110
57592H63807l5995l2984l0270k7341k4624k2584k0980j9440j8028j6745j5142
57581E99674j3113j1417j0626j0080q791o963n741n545n678n514n100m476l293
57568E03337j521J69J244J923K628L294L776M397N511O770P565Q050R083J1073
57554E67299J3431J5414J7044J8822K0914K3055K5214K7788L1116L5116L9608
57543H34821M4696N0557N7039O3763P0560P7605Q5096R3005J01058J08784J15620
57532A702604J21151J25111J26846J24976J18002J05275Q7147O4282L7500Q377
57522B621271k0725m7659p1354r1338j06990j17746j23773j25815j24436j19902
$$ plain form
57603 1646209 1534547 1433101 1341676 1259252 1184604 1116899 1055491 999694 949143 903917 863807
57592 863807 827812 794828 764558 737217 712593 690009 669029 649589 631561 614816 599674
57581 599674 586561 575144 564518 554438 545647 538684 532943 527398 521720 516206 511106 506630 503337
57568 503337 501816 501985 503229 505152 507780 511074 514850 519247 524758 531528 539093 547143 556226 567299
57554 567299 580730 596144 613188 632010 652924 675979 701193 728981 760097 795213 834821
57543 834821 879517 930074 987113 1050876 1121436 1199041 1284137 1377142 1478200 1586984 1702604
57532 1702604 1823755 1948866 2075712 2200688 2318690 2423965 2511112 2575394 2612894 2621271
57522 2621271 2600546 2552887 2481533 2390195 2283205 2165459 2041686 1915871 1791435 1671533
57512A671533j12827j04367r5539q6669p7706o8937o1007n4249m8210m2125l5922
57501H83975l0454k6474k3519k0316j6292j2201q988o505l797l39L520P210J0579
57488G56399J3770J6976K0409K4301K8698L3360L7992M2584M7582N3623O0992
57477A136686O9230P7479Q5283R2805J00225J07159J12878J16739J18026J15558
57467B132068J07957R4499P5554N2185K5551l265l2919o1401q6299j05741j19246
57456B078943j27510j31460j31717j28911j23854j17157j09070r9950r0529q1437
57446I37348p2860o4970n8182n2563m7511m2525l7905l4113l0883k7704k4805
57435D43327k2798k1500k0057j8153j6292j4794j3387j1962j0935j0527j0361
$$ plain form
57512 1671533 1558706 1454339 1358800 1272131 1194425 1125488 1064481 1010232 962022 919897 883975
57501 883975 853521 827047 803528 783212 766920 754719 745731 739226 735429 735090 738610 745820 756399
57488 756399 770169 787145 807554 831855 860553 893913 931905 974489 1022071 1075694 1136686
57477 1136686 1205916 1283395 1368678 1461483 1561708 1668867 1781745 1898484 2016510 2132068
57467 2132068 2240025 2334524 2410078 2462263 2487814 2484549 2451630 2390229 2303930 2198189 2078943
57456 2078943 1951433 1819973 1688256 1559345 1435491 1318334 1209264 1109314 1018785 937348
57446 937348 864488 799518 741336 688773 641262 598737 560832 526719 495836 468132 443327
57435 443327 420529 399029 378972 360819 344527 329733 316346 304384 293449 282922 272561
57424B72561j0071r723r290q412p071n964n678n913n924n425m686m070l827l972
57410A82535m086l583k537j813k007k606k714k215j696j530j532j464j282r87
57396A52483o21l83l71l06J09O59Q31N12M6l24o71j010j173j106r80q80o66k99
57378A45850LPk60n34n19l5P55J342J351R88P58P57O59L72K76N74Q55O65J82j19
57358A53927k57o82j418j799j323m01R5p9k95Q5R41J592J597J105N54K73L47O36
57340A54898Q52P98N84M82N41N85O40R95J661K092J829J227J078J584K143K279
57324A74268K297K747L526L975L767L348L366L950M672N070N023M671M290M274
57310B29244N016O514Q160R288R952J0867J2404J4019J4949J5237J5568J6275
$$ plain form
57424 272561 262490 252767 243477 235065 227994 222030 216352 210439 204515 199090 194404 190334 186507 182535
57410 182535 178449 174866 172329 170516 168509 165903 163189 160974 159278 157748 156216 154752 153470 152483
57396 152483 151862 151479 151108 150802 150911 151570 152401 152913 152959 152635 151964 150954 149781 148675 147695 146815 146149 145850
57378 145850 145853 145860 145600 145066 144547 144512 145267 146609 147960 148948 149706 150463 151122 151494 151770 152344 153199 153864 154046 153927
57358 153927 153670 152988 151570 149771 148448 148047 148142 148063 147768 147853 148794 150386 151983 153088 153642 153915 154262 154898
57340 154898 155750 156548 157132 157614 158155 158740 159380 160375 162036 164128 165957 167184 168262 169846 171989 174268
57324 174268 176565 179312 182838 186813 190580 193928 197294 201244 205916 210986 216009 220680 224970 229244
57310 229244 234260 240774 248934 258222 268174 279041 291445 305464 320413 335650 351218 367493
57298C67493J7038J7593J8192J9092K0079K0762K1040K0861J9918J8019J5507
57287E75594J2845R880O095J484l311p813j2066j6089j9557k2245k4314k5816
57275D74687k6430k6063k5249k4439k3323k1502j9433j7919j6767j4958j2204
57264B46400r567q067p501p083o619o383o248n757m939m322m093l841l270k692
57250A66018k502k552k370j818j220q91p74o39m65m73p67j086j101q27n29k94
57234A47710L2L56K78k75p40o16k30k80p68q98j19J182K162K387K064J704J708
57217A55657K090K497K632K613K716K849K666K238K086K404K654K337J803J903
57203A89145K964M452N573N924N600M946M298L802L443L292L505M036M548M869
$$ plain form
57298 367493 384531 402124 420316 439408 459487 480249 501289 522150 542068 560087 575594
57287 575594 588439 598319 604414 605898 602587 594774 582708 566619 547062 524817 500503 474687
57275 474687 448257 422194 396945 372506 349183 327681 308248 290329 273562 258604 246400
57264 246400 236833 228766 221265 214182 207563 201180 194932 189175 184236 179914 175821 171980 168710 166018
57250 166018 163516 160964 158594 156776 155556 154665 153891 153252 152787 152314 151547 150461 149360 148533 148004 147710
57234 147710 147742 148098 148376 148101 147361 146745 146515 146235 145467 144569 144450 145632 147794 150181 152245 153949 155657
57217 155657 157747 160244 162876 165489 168205 171054 173720 175958 178044 180448 183102 185439 187242 189145
57203 189145 192109 196561 202134 208058 213658 218604 222902 226704 230147 233439 236944 240980 245528 250397
57189B50397N336O284P342P691P094O228N798N766N751N865O553P764Q810R235
57175C45914R377R764J0336J0657J0701J0955J1718J2681J3342J3533J3463J3426
57163D85867J3649J4159J4690J4940J4963J5113J5387J5260J4430J3464J3286
57152F45208J4187J5692J7227J8482J9205J9166J8552J7996J8001J8513J9186
57141H41415J9864K0593K1330K1825K1819K1356K0835K0701K1074K1778K2719
57130A075309K3963K5417K6759K7809K8701K9486L0006L0474L1615L3836L6705
57119A400080L9826M3726M8974N4712N9213O1900O3820O6056O8662P1573P5553
57108B054095Q1646R0351J01992J17376J37609J63853J97759K41734K98189L68860
$$ plain form
57189 250397 255733 262017 269359 277050 284144 290372 296170 301936 307687 313552 320105 327869 336679 345914
57175 345914 355291 365055 375391 386048 396749 407704 419422 432103 445445 458978 472441 485867
57163 485867 499516 513675 528365 543305 558268 573381 588768 604028 618458 631922 645208
57152 645208 659395 675087 692314 710796 730001 749167 767719 785715 803716 822229 841415
57141 841415 861279 881872 903202 925027 946846 968202 989037 1009738 1030812 1052590 1075309
57130 1075309 1099272 1124689 1151448 1179257 1207958 1237444 1267450 1297924 1329539 1363375 1400080
57119 1400080 1439906 1483632 1532606 1587318 1646531 1708431 1772251 1838307 1906969 1978542 2054095
57108 2054095 2135741 2226092 2328084 2445460 2583069 2746922 2944681 3186415 3484604 3853464
57098C853464M55252N59243O82495Q25121R84854J157089J335714J514340J686714
57089A3054286J845042J977770K070292K108984K084910J995037J842857J639583
57081B8618761J402741J150097Q92695O31962L60649O5582k66011o35498j024328
57072C1196650j397755j719513j964792k122764k192620k180931k101218j971809
57064A5545248j811456j635786j456184j280317j113549r60475q25016p08839
57056E753626o10540n27219m56566l96915l46210l02199k63556k29912k00830
57047B419679j75543j53577j34843j19027j05498r3914q4357p6731p0543o5317
57037A340329o0729n6332n1644m6773m2416l9036l6271l3413l0214k6997k4134
$$ plain form
57098 3853464 4308716 4867959 5550454 6375575 7360429 8517518 9853232 11367572 13054286
57089 13054286 14899328 16877098 18947390 21056374 23141284 25136321 26979178 28618761
57081 28618761 30021502 31171599 32064294 32696256 33056905 33122487 32856476 32220978 31196650
57072 31196650 29798895 28079382 26114590 23991826 21799206 19618275 17517057 15545248
57064 15545248 13733792 12098006 10641822 9361505 8247956 7287481 6462465 5753626
57056 5753626 5143086 4615867 4159301 3762386 3416176 3113977 2850421 2620509 2419679
57047 2419679 2244136 2090559 1955716 1836689 1731191 1637277 1552920 1476189 1405646 1340329
57037 1340329 1279600 1223268 1171624 1124851 1082435 1043399 1007128 973715 943501 916504 892370
57026H92370k1615j9157j6468j3378r804n707j059M377J1261K0413L2165M6179
57014I19577O1712P7171Q8799R0950P9499N5507K4620p267l6840o2198q1107r1856
57002A118567r4842r1934q4761p4766o4092n4841m7450m0938l4687k8988k4020
56991D77248j9514j5553j2535j0154p431m030o36K165M375N668N049K135j978
56978D24809n708q248r491r451q502p485o898o271m932k965r13J030K971M789
56964C62735O348P971J0158J2929J5874J8619K0746K1431J9734J5345Q801J123
56952E21814o487j2857j7281j9797k0860k0776j9568j7194j3694r417n202j957
56940C56724K67K333M884P641J0241J3202J7252K2007K6051K8118K7526K3710
$$ plain form
57026 892370 870755 851598 835130 821752 811948 806241 805182 809559 820820 841233 873398 919577
57014 919577 981289 1058460 1147259 1238209 1317708 1373215 1397835 1390568 1353728 1291530 1210423 1118567
57002 1118567 1023725 931791 847030 772264 708172 653331 605881 564943 530256 501268 477248
56991 477248 457734 442181 429646 419492 412061 408031 407395 409560 413935 419603 424652 426787 424809
56978 424809 419101 410853 401362 391911 383409 375924 369026 362755 357823 354858 353945 354975 357946 362735
56964 362735 369083 377054 387212 400141 416015 434634 455380 476811 496545 511890 520691 521814
56952 521814 515327 502470 485189 465392 444532 423756 404188 386994 373300 363883 358681 356724
56940 356724 356991 359324 364208 371849 382090 395292 412544 434551 460602 488720 516246 539956
56928E39956J6395O445m222j3921k1936k7922l1320l1854l0126k7268k4144k1086
56916C28997j8102j5142j2334j0048q522p443o268m943l889l244k681k109j934
56903B32338k266k434j791n45O14J409J996K518L218M658P080R621J1020J1201
56889B78637J1511J3060J5349J6850J6517J4330J0759O263J325l400p194r539
56877C64468j0344j0012r156q113o784m944k539L36L541O897J0308J3997J8373
56864C66028K3406K8418L2694L5928L7709L6894L2307K4074J3647K497q597j8746
56852F06259k6368l0168l0371k8277k4836k0282j5004r792m975K3N826J2260J8787
56839D53082K5501L3115M2006N1503N9985O5264O5003N7519M2889K3325K141j7842
$$ plain form
56928 539956 556351 562796 558574 544653 522717 494795 463475 431621 401495 374227 350083 328997
56916 328997 310895 295753 283419 273371 264849 257406 251138 246195 242306 239062 236381 234272 232338
56903 232338 230072 227638 225847 225302 225916 227325 229321 231839 235057 239715 246795 256416 267436 278637
56889 278637 290148 303208 318557 335407 351924 366254 377013 383276 384601 381201 374007 364468
56877 364468 354124 344112 334956 326843 320059 315115 312576 312912 316453 323350 333658 347655 366028
56864 366028 389434 417852 450546 486474 524183 561077 593384 617458 631105 633602 625005 606259
56852 606259 579891 549723 519352 491075 466239 445957 430953 421161 416186 416209 422035 434295 453082
56839 453082 478583 511698 553704 605207 665192 730456 795459 852978 895867 919192 921333 903491
56827I03491l4951m8100n6250n8964n7146n2591m6535l9172l0723k2315j5069
56816D41675q769k239N024J2354J9215K6111L3720M1503M7581M9663M6025L6214
56804G48077K1530M599j1968k6558l8195m5949m9300m8774m5518m0356l3779k6683
56792D07126k0256j4973j0230n290j41M822R482J4053J8568K2647K5550K6362
56780D77720K4334J9343J1976L118o324j5260k2436k7052k9294k9943k9490k7901
56768C48791k5176k1751j8219j4929j2061r849q439p533o636n651m933m572m023
56755B05019k857j554r67j132j272j037j005j618k330k416k038j823j676j010
56741A82284K7M10l91j626k198j940j562j670k179k553k323j528p26m15m66l63
$$ plain form
56827 903491 868540 820440 764190 705226 648080 595489 548954 509782 479059 456744 441675
56816 441675 432906 430667 435691 448045 467260 493371 527091 568594 616175 665838 711863 748077
56804 748077 769607 774206 762238 735680 697485 651536 602236 553462 507944 467588 433809 407126
56792 407126 386870 371897 361667 356377 356236 361058 370540 384593 403161 425808 451358 477720
56780 477720 502054 521397 533373 536491 530167 514907 492471 465419 436125 406182 376692 348791
56768 348791 323615 301864 283645 268716 256655 246806 238367 230834 224198 218547 213614 209042 205019
56755 205019 202162 200608 199641 198509 197237 196200 195195 193577 191247 188831 186793 184970 183294 182284
56741 182284 182311 182721 182330 180704 178506 176566 175004 173334 171155 168602 166279 164751 164025 163610 163144 162781
56725A62781J9K56J48Q3L59N44M4r58j569j251l72L29N48N39O14P71Q06P39Q87
56706A65317J469K225K653K522J958J152K95k43j68K00J29n10r05l33P78J332
56690A77871R27K13k5L23Q15R86O75J00k85j90J70L59K53O6j08l88o12k80P31
56671A81601J638J458J73j174j600j136n64m67p67j037j004q18q32j210j617j445
56655A71199m56Q48J624J473P13p1n09n59m02l27n45r42j204j201j068q38l85
56638A67350K01M68K01j88j87P6R2k34m68l30j0K02K22J08j2L3K15J12n84j407
56618A65860j469n88M20P62N19K87L21L88K31o1j06M45J365J819J212R1l38L05
56600A71463J153J326R84P97R70J215J284J036L63m44p01j55M76L82k27n17k63
$$ plain form
56725 162781 162800 163056 163204 163287 163646 164190 164234 163276 161707 160456 160084 160413 160961 161500 162114 162885 163691 164430 165317
56706 165317 166786 169011 171664 174186 176144 177296 177591 177348 177180 177380 177509 176999 176094 175761 176539 177871
56690 177871 178798 179011 178986 179309 180124 181110 181785 181885 181600 181410 181580 181939 182192 182258 182150 181762 181150 180870 181601
56671 181601 183239 184697 184870 183696 182096 180960 180396 179929 179162 178125 177121 176303 175471 174261 172644 171199
56655 171199 170743 171591 173215 174688 175401 175330 174821 174262 173860 173533 172988 172046 170842 169641 168573 167735 167350
56638 167350 167551 168019 168220 168032 167845 167921 168013 167779 167311 166981 166971 167173 167395 167503 167491 167524 167739 167851 167267 165860
56618 165860 164391 163803 164223 164985 165504 165791 166112 166500 166731 166670 166564 167009 168374 170193 171405 171496 171158 171463
56600 171463 172616 173942 174926 175723 176693 177908 179192 180228 180591 180147 179446 179291 179767 180149 179922 179405 179142
56583A79142or5k39r6L47J020J863K555K643K143J641J699K371L321M044M038
56567B06391L233K327K247L127M206M787M852M665M232L562K999K926L266L598
56553B56418L604L214K499J630Q16R7o56j449k064k378k637l188m122n215o081
56538B40488o282n655m650m097m306m704m568l895l192k623j931j142p43r74j332
56523A90394j173n60j64m12j066j636j939k057j997j639j050o45q04j401j873
56508A71978j797j331q71n22p7M53O78L47k62o94q58q60n91J16R24J239J081J096
56490A70049J515J677J131N79J026K301L241L205K653K170J772J421J466K080
56476A96286K817L149L159L307L768M318M657M599M177L692L458L353L043K688
$$ plain form
56583 179142 179136 179041 178802 178706 179053 180073 181936 184491 187134 189277 190918 192617 194988 198309 202353 206391
56567 206391 209624 211951 214198 217325 221531 226318 231170 235835 240067 243629 246628 249554 252820 256418
56553 256418 260022 263236 265735 267365 268181 268278 267622 266173 264109 261731 259094 255906 251784 246569 240488
56538 240488 234206 228551 223901 219804 215498 210794 206226 202331 199139 196516 194585 193443 192700 191726 190394
56523 190394 189221 188661 188497 188085 187019 185383 183444 181387 179390 177751 176701 176056 175252 173851 171978
56508 171978 170181 168850 167979 167457 167380 167833 168511 168858 168596 167902 167044 166184 165593 165709 166633 167872 168953 170049
56490 170049 171564 173241 174372 174951 175977 178278 181519 184724 187377 189547 191319 192740 194206 196286
56476 196286 199103 202252 205411 208718 212486 216804 221461 226060 230237 233929 237387 240740 243783 246471
56462B46471K876L574L825K967J610P78N24J63m84r36j052j374k223l102l248
56447B50369k505j427p61q51j353j554j186p49q45j410j949k254k468k633k677
56432B25747k751k910k661j514K8P43J85p32j001p46p07j018j179r91r08j278
56416B08307j733j629r13k14o1l00n26p36j180j608j407n64O8q1m87l65K00N93
56398A97364P17Q75R20M81j03L8R89J825J892J493J081N98Q3P1P77J501J548J289
56380B13439J638K639L353L022J852O58J94O91J731K510K610K435K581K984L034
56365B45371K482J720J170Q72Q12J123J681J866J277M74M51J292J939J557O59
56350B64746L77R35J550J686J668J897K161K133J934J771J546J343J771L149M668
$$ plain form
56462 246471 249347 252921 256746 259713 261323 262101 262625 262788 262304 261368 260316 258942 256719 253617 250369
56447 250369 247864 246437 245676 244825 243472 241918 240732 239983 239138 237728 235779 233525 231057 228424 225747
56432 225747 222996 220086 217425 215911 215939 216682 216867 216135 215134 214388 213681 212663 211484 210493 209585 208307
56416 208307 206574 204945 204032 203818 203757 203457 202931 202195 201015 199407 198000 197436 197504 197423 196936 196571 196771 197364
56398 197364 198081 198956 199876 200357 200254 200292 201281 203106 204998 206491 207572 208170 208253 208324 209101 210602 212150 213439
56380 213439 215077 217716 221069 224091 225943 226601 226795 227486 229217 231727 234337 236772 239353 242337 245371
56365 245371 247853 249573 250743 251615 252427 253550 255231 257097 258374 258848 259299 260591 262530 264087 264746
56350 264746 265123 266058 267608 269294 270962 272859 275020 277153 279087 280858 282404 283747 285518 288667 293335
56335B93335N159M531L743L517L806M363N079N600N517N072M956N226N108M226
56321C59238L255K993L331L634L623L417L105K735K429K102J391K47p15q48k79
56306C89658L27N95O57P20Q66J197J813K583L271L860M550N349N978O280O562
56291D34266P299Q469R529J0184J0898J2202J3687J4395J4382J5059J7511K1067
56279E88948K4242K6515K8379L0188L2031L4599L8797M4367M9938N4843O0008
56268A012855O6556P4417Q2897R1858J01636J12178J22937J33360J43047J51675
56258B093416J59148J65521J70400J72695J71284J65803J56544J43880J27959
56249C526650J08877Q7032O3466L9727J7062m191k4012m1766n6529o8261p7778
$$ plain form
56335 293335 298494 303025 306768 310285 314091 318454 323533 329133 334650 339722 344678 349904 355012 359238
56321 359238 362493 365486 368817 372451 376074 379491 382596 385331 387760 389862 391253 391500 390785 389937 389658
56306 389658 389985 390580 391237 391957 392823 394020 395833 398416 401687 405547 410097 415446 421424 427704 434266
56291 434266 441565 450034 459563 469747 480645 492847 506534 520929 535311 550370 567881 588948
56279 588948 613190 639705 668084 698272 730303 764902 803699 848066 898004 952847 1012855
56268 1012855 1079411 1153828 1236725 1328583 1430219 1542397 1665334 1798694 1941741 2093416
56258 2093416 2252564 2418085 2588485 2761180 2932464 3098267 3254811 3398691 3526650
56249 3526650 3635527 3722559 3786025 3825752 3842814 3838623 3814611 3772845 3716316 3648055 3570277
56238C570277q5580r1517r5807r9381j02802j05730j07901j09849j12046j14040
56228B545624j15197j15629j15660j14900j12684j09166j05249j01501r7617r2942
56218A465079q7174q0721p4464o8987o3913n8402n2310m6362m1090l6345l2051
56207H23260k8570k5939k3524k0984j8924j7890j7327j6208j4287j2106j0132
56196F17369q480p150o075n135m385l913l328k023j73J229J671J708J923K164
56182E85402K254K579L325M042M501N131N960O122N271M466M653N189N020M435
56168F48350M352M570M187L259K707K833L219L737M514N224N644O493Q509J1057
56154G18655J3047J4895J7989K2381K6686L0512L5268M2145N0730O0254P0810
$$ plain form
56238 3570277 3484697 3393180 3297373 3197992 3095190 2989460 2881559 2771710 2659664 2545624
56228 2545624 2430427 2314798 2199138 2084238 1971554 1862388 1757139 1655638 1558021 1465079
56218 1465079 1377905 1297184 1222720 1153733 1089820 1031418 979108 932746 891656 855311 823260
56207 823260 794690 768751 745227 724243 705319 687429 670102 653894 639607 627501 617369
56196 617369 608889 601739 595664 590529 586144 582231 578903 576880 576707 577936 579607 581315 583238 585402
56182 585402 587656 590235 593560 597602 602103 607234 613194 619316 624587 629053 633706 638895 643915 648350
56168 648350 652702 657272 661459 664718 667425 670258 673477 677214 681728 686952 692596 699089 707598 718655
56154 718655 731702 746597 764586 786967 813653 844165 879433 921578 972308 1032562 1103372
56143A103372Q2539R4609J05874J15617J22898J26020J23728J16596J06477R4977
56133B192707Q3090P1917O2656N5496M9086M1525L1954K1055J0089j81r475j7377
56121B592542k3579k8865l5146m3998n5502o8641q2188r4765j04712j10652j11989
56110A832505j08634j00861q9922p8004o6832n6703m7468l9695l4061l0195k7110
56099A153020k4400k2243k0648j9464j8696j8023j6593j4114j1607j0157r428
56088I67647q364o756n053l209r49J156K213K352K525L096L771M623O073P901
56074I77026R326J0019J0278J0355J0424J0816J1560J2052J1992J2002J2538J2948
56062A111336J2676J2445J3053J3843J3861J3701J4518J5904J6595J6738J7535
$$ plain form
56143 1103372 1185911 1280520 1386394 1502011 1624909 1750929 1874657 1991253 2097730 2192707
56133 2192707 2275797 2347714 2410370 2465866 2514952 2556477 2588431 2609486 2619575 2619394 2609919 2592542
56121 2592542 2568963 2540098 2504952 2460954 2405452 2336811 2254623 2159858 2055146 1944494 1832505
56110 1832505 1723871 1623010 1533088 1455084 1388252 1331549 1284081 1244386 1210325 1180130 1153020
56099 1153020 1128620 1106377 1085729 1066265 1047569 1029546 1012953 998839 987232 977075 967647
56088 967647 959283 952527 947474 944265 943316 944472 946685 949037 951562 954658 958429 963052 969125 977026
56074 977026 986352 996371 1006649 1017004 1027428 1038244 1049804 1061856 1073848 1085850 1098388 1111336
56062 1111336 1124012 1136457 1149510 1163353 1177214 1190915 1205433 1221337 1237932 1254670 1272205
56051A272205J8915J9590J9283J9052J9398J9841K0416K1716K3283K3705K2715
56040A500119K1642K1533K2188K3274K4952K7139K9451L2019L5232L8706M1639
56029A817894M4060M6493M8714N0142N1101N2275N3392N3864N4228N5275N6432
56018B383870N6708N6705N7721N9615O1486O3800O7535P1879P5204P7808Q1201
56007C113532Q5240Q8580R1538R5709J01129J06568J12243J19335J27106J33709
55997D174689J39620J47091J56298J65349J74052J84217J96200K08558K21299
55988E767373K36039K52785K70111K88572L10432L35939L63565L93618M27794
55979H646228M65526N05142N48292N98594O56429P20110P91636Q75706R73648
$$ plain form
56051 1272205 1291120 1310710 1329993 1349045 1368443 1388284 1408700 1430416 1453699 1477404 1500119
56040 1500119 1521761 1543294 1565482 1588756 1613708 1640847 1670298 1702317 1737549 1776255 1817894
56029 1817894 1861954 1908447 1957161 2007303 2058404 2110679 2164071 2217935 2272163 2327438 2383870
56018 2383870 2440578 2497283 2555004 2614619 2676105 2739905 2807440 2879319 2954523 3032331 3113532
56007 3113532 3198772 3287352 3378890 3474599 3575728 3682296 3794539 3913874 4040980 4174689
55997 4174689 4314309 4461400 4617698 4783047 4957099 5141316 5337516 5546074 5767373
55988 5767373 6003412 6256197 6526308 6814880 7125312 7461251 7824816 8218434 8646228
55979 8646228 9111754 9616896 10165188 10763782 11420211 12140321 12931957 13807663 14781311
55970A4781311J084637J212643J365514J547658J761275K014925K323310K699240
55962B8790513L155130L712571M400531N243751O262727P482999Q932214J0634032
55954G8614468J2629406J5008526J7896917K1387953K5463422K9890898L4055890
55947B34947480L6841898L6834134L2935051K5018946J4087122J807452j0135995
55940C72336088k0423578k8170037l2924302l4710905l4004718l1554005k8136151
55933A62412392k4382469k0717095j7374942j4455269j1978586r923143q241097
55926E5339791o872656n762547m865400m139462l545072l051883k640798k296748
55918B2165225k005181j756248j545393j367195j213567j079197r63302q64273
$$ plain form
55970 14781311 15865948 17078591 18444105 19991763 21753038 23767963 26091273 28790513
55962 28790513 31945643 35658214 40058745 45302496 51565223 59048222 67980436 78614468
55954 78614468 91243874 106252400 124149317 145537270 171000692 200891590 234947480
55947 234947480 271789378 308623512 341558563 366577509 380664631 382472083 372336088
55940 372336088 351912510 323742473 290818171 256107266 222102548 190548543 162412392
55933 162412392 138029923 117312828 99937886 85482617 73504031 63580888 55339791
55926 55339791 48467135 42704588 37839188 33699726 30154654 27102771 24461973 22165225
55918 22165225 20160044 18403796 16858403 15491208 14277641 13198444 12235142 11370869
55910A1370869p77480o99965o32408n74622n23442m76778m35704m00712l69577
55901F480181l40573l14544k92185k72252k53787k37228k22246k07273j92244
55892D147849j79026j68185j57975j47369j37480j29144j21578j14280j07769
55883B885043j01756r5042q7839q1769p7049p2195o6992o3102o0941n8668n5172
55872B064518n1564m8729m5828m2376l9586l8502l8670l9621m1745m4723m6997
55861A586177m7684m7368m6310m3702l9485l5129l1808k9391k7837k7668k8394
55850A181401k8331k6868k5304k4690k4505k4143k3890k3646k2385j9942j7800
55839I19897j7164j7526j7833j7788j7342j6322j5193j4832j5001j4441j2872
$$ plain form
55910 11370869 10593389 9893424 9261016 8686394 8162952 7686174 7250470 6849758 6480181
55901 6480181 6139608 5825064 5532879 5260627 5006840 4769612 4547366 4340093 4147849
55892 4147849 3968823 3800638 3642663 3495294 3357814 3228670 3107092 2992812 2885043
55883 2885043 2783287 2688245 2600406 2518637 2441588 2369393 2302401 2239299 2178358 2119690 2064518
55872 2064518 2012954 1964225 1918397 1876021 1836435 1797933 1759263 1719642 1677897 1633174 1586177
55861 1586177 1538493 1491125 1444815 1401113 1361628 1326499 1294691 1265300 1237463 1209795 1181401
55850 1181401 1153070 1126202 1100898 1076208 1051703 1027560 1003670 980024 957639 937697 919897
55839 919897 902733 885207 867374 849586 832244 815922 800729 785897 770896 756455 743583
55828G43583j1411j0578r645q417p895q411q931q935r221r939r700p790n578m468
55814F22664l953k953j652p05J16J139J755J397N65k47j571l761n804o582o471
55799E93937o513o801o769o404o026n482m515l378k221m58K262N096O751O783
55785E66262N414K721j202n762j0230j4211j7275j8753j8444j6973j5018j2772
55773D43757j0518q915q248q173q601r977j2146j3918j4436j4130j3686j2954
55761C08055j1572r834q162o501m929m136m441n049n120m935n204n791n928n341
55747B21112m447l811l864m708n685n719m543l072k197j795j365r09o57n93p16
55732A77031j176j715j632q39j89l50j011j665k314k961l234l156l388m110m451
$$ plain form
55828 743583 732172 721594 711949 703532 695637 687226 678295 669360 660139 650200 640500 632710 627132 622664
55814 622664 618711 615758 614106 613401 613517 614656 616411 617808 618373 618126 616555 612794 606990 600408 593937
55799 593937 587424 580623 573854 567450 561424 555942 551427 548049 545828 545370 547632 552728 559479 566262
55785 566262 571676 574397 573195 567433 557203 542992 525717 506964 488520 471547 456529 443757
55773 443757 433239 424324 416076 407903 399302 389325 377179 363261 348825 334695 321009 308055
55761 308055 296483 286649 278487 271986 267057 262921 258480 253431 248311 243376 238172 232381 226453 221112
55747 221112 216665 212854 208990 204282 198597 192878 188335 185263 183066 181271 179906 178997 178340 177747 177031
55732 177031 175855 174140 172508 171669 171480 171130 170119 168454 166140 163179 159945 156789 153401 149291 144840
55717A44840l774k685k054j732j072o3Q20J358J541J290Q21O66Q54P97M34O50
55701A42691J866L131L368K771K173J781J359Q92K95q32k320l052k383j218p47
55686A49775p91m32M12J139J666K299K820K743K350K442L207M093M610M677M400
55671A85410M149M469N376O077N978N476N252N368N578N840N917N218L803K646
55657B56557K129J236o84k422k517j649j733l099m178l902k973k515k804l502
55643B27944m181m367l896l380l665m777n966o661o841o708o574o777p117o804
55629A50230n657m706m803n287n020m116l457l098k529k095k614l703m025l142
55615I5978j893q87j5M93M8j053j671j421j088j162j227j086j188j494j158k2
$$ plain form
55717 144840 141066 138381 136327 134595 133523 133460 134280 135638 137179 138469 139290 139956 140810 141607 142041 142691
55701 142691 144557 147688 151056 153827 156000 157781 159140 160032 160327 159495 157175 154123 151740 150522 149775
55686 149775 148984 148552 148964 150103 151769 154068 156888 159631 161981 164423 167630 171723 176333 181010 185410
55671 185410 189559 194028 199404 205481 211459 216935 222187 227555 233133 238973 244890 250108 253911 256557
55657 256557 258686 259922 259238 256816 254299 252650 250917 247818 243640 239738 236765 234250 231446 227944
55643 227944 223763 219396 215500 212120 208455 203678 197712 191051 184210 177502 170928 164151 157034 150230
55629 150230 144573 139867 135064 129777 124757 120641 117184 114086 111557 109462 106848 103145 99120 95978
55615 95978 94085 93198 93183 93676 93724 92671 91000 89579 88491 87329 86102 85016 83828 82334 81176 81154
55599H1154P57K09j213k497l237l372k735j583q11q86j189j001n57m69p22q85
55583F0963q57q10p78p09n96k69M49J133R90Qq27q02l15LK09N28O49K95j38k98
55563E8828o29j542k349k054r98n53j190j798j297q7O16M29J17M11J068J315R44
55546E1231N81Q59J611K166K220K056J957J862J651J428J344J435J767K404L126
55531G7698L464L278L013L191L799M342M362L751K749J811J337J392J673J755
55517A17615J362N19l80r16j232k061l760n539o251n833n354n528n870n650m990
55502F6132m535m406m160l605l090k874k667k065j252q63j094j302q03R3L34n26
55486C3317j739k357k295j978j471o25K13M00j39q27j247j399j265p92l65n78
$$ plain form
55599 81154 81911 82120 80907 78410 75173 71801 69066 67483 66672 65786 64597 63596 63039 62570 61848 60963
55583 60963 60106 59296 58518 57809 57213 56944 57393 58526 59516 59524 58697 57895 57580 57583 57792 58320 58969 59264 59126 58828
55563 58828 58199 56657 54308 52254 51256 50703 49513 47715 46418 46331 46947 47376 47493 47904 48972 50287 51231
55546 51231 51812 52671 54282 56448 58668 60724 62681 64543 66194 67622 68966 70401 72168 74572 77698
55531 77698 81162 84440 87453 90644 94443 98785 103147 106898 109647 111458 112795 114187 115860 117615
55517 117615 118977 119496 119116 118200 116968 114907 111147 105608 99357 93524 88170 82642 76772 71122 66132
55502 66132 61597 57191 53031 49426 46336 43462 40795 38730 37478 36615 35521 34219 33416 33509 33843 33317
55486 33317 31578 29221 26926 24948 23477 22852 23065 23465 23326 22499 21252 19853 18588 17796 17431 16853
55470A6853j334j727j161r4O19P27O47P56R92R41L41m76p43j10Q29J297J293J305
55452B0955J277P11k85r26r24q69j118j101l21P02J104Q25N18O21J011J318J168
55435B4666M47l22k41Q29J857J887J238Q23O76L8j183k025j769q88k93j85r3K61
55417B5723O20O21K24l15o30m55J96R94J552J727J559J035J16r72j719j824j518
55400B6934j235j051p43k79K4p1m51q66j150j191r76p02o18o46n23k91k34k43
55382A5688J42Q80J247Q75K83j1k77p95j032m65K94K17n43q69l54K76M27L39L21
55363A6643K05j17l50l39l18l78k88p3j43n77q82p36l87j43J9J41K01N16J430
55344A4424K419K307Q43p43j233p77k14J88N86P94N32N2k57n44j045j289o81L08
$$ plain form
55470 16853 15519 13792 12631 12537 13156 13883 14530 15286 16278 17219 17560 17084 16341 16231 17060 18357 19650 20955
55452 20955 22232 22943 22658 21732 20808 19939 18821 17720 17399 18101 19205 20030 20548 21169 22180 23498 24666
55435 24666 25113 24791 24550 25379 27236 29123 30361 31184 31860 31898 30715 28690 26921 26033 25740 25555 25462 25723
55417 25723 26343 26964 27188 26873 26243 25788 25984 26978 28530 30257 31816 32851 32967 31995 30276 28452 26934
55400 26934 25699 24648 23905 23626 23650 23579 23128 22262 21112 19921 18945 18243 17625 16979 16456 16165 15931 15688
55382 15688 15830 16710 17957 18832 19115 19104 18827 18032 17000 16535 16829 17046 16503 15634 15280 15556 15983 16322 16643
55363 16643 16848 16731 16381 16042 15724 15346 15058 14985 14842 14265 13383 12647 12260 12117 12136 12277 12478 12994 14424
55344 14424 16843 19150 19993 19250 18017 17240 17026 17214 17800 18594 19126 19178 18921 18377 17332 16043 15362 15670
55326A5670N12k95r83o42J88L63k32n57J23J178J326J82j237j647p86N72J607
55309A5342J985J689R07K02J69O85Q92K61p19j114o11K27O04J74o64j101p88l18
55291A7822n05j212j433o37N61J285J384J143O42j51r61j440j557j400q47J36
55275A2830J132J620J512J054L77m55j206j571j454r06mR54J422J114M67J79L70
55258A7435M32j55j110j505p35O74J460R71q6n42j63L95O87Q41Q43L36n75j158
55240A8045j013o30n23m48N1Q33J406J566J421J056N92K10q6l73l70L02J228J350
55222B4617M29m75n19j97k69l71K77J368J793J256N42K05m4n93j320j857k013
55205B2829j720j011j05O61R96O84k15j029r45j12L10l42j252j273m42L60P05
$$ plain form
55326 15670 16182 15887 14904 14262 14450 14813 14581 14024 14147 15325 16651 16833 15596 13949 13163 13735 15342
55309 15342 17327 19016 19923 20125 20294 20979 21871 22132 21413 20299 19688 19915 20519 20693 20029 18928 18140 17822
55291 17822 17317 16105 14672 14035 14596 15881 17265 18408 19050 18899 17938 16498 14941 13541 12694 12830
55275 12830 13962 15582 17094 18148 18525 18070 16864 15293 13839 12933 12929 13883 15305 16419 16886 17065 17435
55258 17435 17867 17712 16602 15097 14362 15036 16496 17467 17381 16839 16676 17071 17758 18599 19442 19778 19203 18045
55240 18045 17032 16402 15879 15431 15482 16315 17721 19287 20708 21764 22356 22566 22480 22107 21737 22039 23267 24617
55222 24617 25046 24571 24052 23855 23586 23215 23492 24860 26653 27909 28451 28656 28612 28019 26699 24842 22829
55205 22829 21109 20098 19993 20654 21650 22334 22119 21090 20145 20033 20343 20001 18749 17476 17034 17394 18099
55188A8099P37M69j15n42l25K39N58O93R74J045L04q86j501j310j005r65q98p40
55170A4831q00r05m93L14O82M01K21N65Q84P34M86M99N03L04K94O69Q84N01o6
55151B0508l24n33j105j703j693j060k53N16J173J374Q79J13k53j50pL2J75M42
55133A8131N68N04N30P98J058R35L46l74o96l95J28K86O1K7M74R83J083R09P91
55114B6147O49K82j22k59k81n13p28l76N07J180J151P47N32N84O70P37R16J151
55096C2974J237J162J114J123R33L79k69n56l29J70O90J140J376J101K37q07j429
55079D0246j338o10M63J417J665J007km68q0O39R45N30l85j305j754j638j327
55062C8005j186j044m65M55J009P34L1l49j82J08J22k8M4M23O96M65o9l00nM13
$$ plain form
55188 18099 18836 19305 19190 18648 18323 18562 19120 19813 20787 21832 22136 21250 19749 18439 17434 16469 15571 14831
55170 14831 14031 13126 12633 12947 13629 14030 14251 14816 15700 16434 16920 17419 17922 18226 18520 19189 20073 20574 20508
55151 20508 20184 19651 18546 16843 15150 14090 13837 14353 15526 16900 17779 17892 17639 17489 17482 17514 17689 18131
55133 18131 18699 19203 19733 20531 21589 22524 22870 22496 21800 21405 21533 21819 21880 21907 22381 23364 24447 25356 26147
55114 26147 26796 27078 26956 26697 26416 25903 25175 24799 25306 26486 27637 28384 28916 29500 30170 30907 31823 32974
55096 32974 34211 35373 36487 37610 38543 38922 38653 38097 37768 37938 38628 39768 41144 42245 42482 41675 40246
55079 40246 38908 38298 38761 40178 41843 42850 42848 42380 42300 42939 43884 44414 44029 42724 40970 39332 38005
55062 38005 36819 35775 35310 35765 36774 37508 37539 37190 37008 37116 37238 37210 37254 37677 38373 38838 38769 38469 38464 38877
55042C8877N82O65Q33P47Q9o20n10L80J020P30m6n19n05k91k4L18N89N60K27j39
55022D2963k40j8K27P6m33o74k18L92K47n88j122q58m50n54q04n54l4K3l82n05
55002C6494jN61M97j24o46n72l1M13L40o7k55ML17K78P1J59N37P26N40L96P02
54981D0339J241J493J415J498K007K519K552K384K817L991M965M801L774L063
54967G8859L394M494N760O963Q244R857J2026J4671J7134J8560J8648J7777J6307
54954B32694J4189J1325P844L765j104o525j1423j4661j6108j6620j6915j6827
54942A69634j5759j3659j1368r859r211q542p108n192l611k635j872j126o96o69
54928G8327n26K17J411K617L682M686N637O557P628Q952J0381J1774J3176J4567
$$ plain form
55042 38877 39459 40124 40957 41704 41793 41173 40663 41043 42063 42793 42747 42228 41723 41432 41408 41726 42315 42875 43102 42963
55022 42963 42723 42705 42932 43008 42575 41901 41683 42075 42322 41734 40612 39754 39304 38750 37946 37392 37358 37381 36999 36494
55002 36494 36493 37054 37551 37427 36781 36209 36178 36591 36931 36864 36609 36613 36930 37208 37279 37438 37975 38701 39241 39637 40339
54981 40339 41580 43073 44488 45986 47993 50512 53064 55448 58265 62256 67221 72022 75796 78859
54967 78859 82253 86747 92507 99470 107714 117571 129597 144268 161402 179962 198610 216387 232694
54954 232694 246883 258208 266052 269817 268713 262188 250765 236104 219996 203376 186461 169634
54942 169634 153875 140216 128848 118989 109778 101236 94128 88936 85325 82690 80818 79692 78996 78327
54928 78327 77801 78018 79429 82046 85728 90414 96051 102608 110236 119188 129569 141343 154519 169086
54914A69086J5620J5943J5337J3727J1098P651L743m97n075r557j3039j5017j5850
54901A93170j6117j5853j4914j3567j2249j0984r585q187p080o137m953l495k248
54888F7801j642j650j900j911j346l76L74M62J42j31m77j336k500l049k419j172
54872D8870l87n27j135j533j515j344j251j121p98m32l07l90l61j98k53o29q12
54855C5877l34M47O85J14o18p71l24J14J08j45j98l8j40o95j178r88l04J83L20
54836C2115N63J073J408J343J265J429J489J214J094J582K277K528K395K324K197
54821E6296J644J008J106J930K553K463K309K884M003M892N331N944P370R424
54807A09157J1228J2123J2477J3233J4667J5918J6053J5142J3716J1577P991L052
$$ plain form
54914 169086 184706 200649 215986 229713 240811 248462 252205 251708 246633 237076 224037 209020 193170
54901 193170 177053 161200 146286 132719 120470 109486 99901 91714 84634 78497 73544 70049 67801
54888 67801 66159 64509 62609 60698 59352 58976 59350 59812 59954 59823 59346 58010 55510 52461 50042 48870
54872 48870 48483 47956 46821 45288 43773 42429 41178 40057 39259 38827 38520 38130 37769 37571 37318 36689 35877
54855 35877 35543 35990 36675 36789 36171 35400 35076 35190 35298 35153 34955 34917 34777 34082 32904 31916 31612 31795 32115
54836 32115 32678 33751 35159 36502 37767 39196 40685 41899 42993 44575 46852 49380 51775 54099 56296
54821 56296 57940 58948 60054 61984 64537 67000 69309 72193 76196 81088 86419 92363 99733 109157
54807 109157 120385 132508 144985 158218 172885 188803 204856 219998 233714 245291 253282 256334
54795B56334k020o119r209j1687j3453j4122j3748j2857j1864j0837r732q595
54783A32091p542o700o086n482m539l131j538k23N11P54R27J422K093K312J874
54768A06743J631K703N053P454R050J0288J1901J3624J4571J4565J4207J3750
54756B25540J2673J0606P821M514L41m612q969j1283j1906j2605j4084j4949j3813
54743A69274j1399r610r009q496p263n888n187n035m877m626m483m385m187m015
54729H0814l941l690l002k028j065l31j53q39j981k484j846q18l26k89j46N7m1
54712E7891k03M5M54L49k42o65p07p50q90q17n37l88l08J11P45R82P21M46K84
54693E6521j23n65k49Q48J574J152K62m4K53N51O74P51O51L60M51J294K207K231
$$ plain form
54795 256334 254314 248195 238986 227299 213846 199724 185976 173119 161255 150418 140686 132091
54783 132091 124549 117849 111763 106281 101742 98611 97073 96850 97361 98115 99042 100464 102557 104869 106743
54768 106743 108374 111077 116130 123584 132634 142922 154823 168447 183018 197583 211790 225540
54756 225540 238213 248819 256640 261154 261495 256883 247914 236631 224725 212120 198036 183087 169274
54743 169274 157875 148265 139256 130760 123497 117609 112422 107387 102510 97884 93401 89016 84829 80814
54729 80814 76873 73183 70181 68153 67088 66757 66604 65765 63784 61300 59454 58636 58310 58021 57875 57932 57891
54712 57891 57688 57733 58187 58536 58294 57629 56922 56172 55282 54465 53928 53540 53232 53343 54088 55070 55791 56237 56521
54693 56521 56398 55833 55584 56432 58006 59158 59420 59376 59629 60180 60854 61605 62256 62616 63067 64361 66568 68799
54675F8799J506J013J114J258J112J132J717K557L090L183L029K782K548K411
54661I7251K220J592M19p67j195o77J59M58lo70q61n39k59l98o87n95M2R05J504
54642I7899J536J115Q04J180K195L186L727M128M767N312N082M029K778J688M48
54627A39874j227k981m255m921n170n028m434l656l169l027k732j880p27N7J51
54612I6875j09o0O38J648K157J603K79r02j324j167r67r93j310j997k831l098
54596H8442k407j523j630k678l343k864k035j879k150j992j403j043r92o89p2
54581F1742K31r3o22r53j179j434j612j724j915k013j589o63K23P58J063J043
54565E1263L69o51r86l26K16m42j725k084j024L99J000O89J63rK09M97N18K31
$$ plain form
54675 68799 70305 71318 72432 73690 74802 75934 77651 80208 83298 86481 89510 92292 94840 97251
54661 97251 99471 101063 101482 100715 99520 98843 99002 99460 99457 98787 97926 97387 97128 96730 96043 95448 95490 96395 97899
54642 97899 99435 100550 101354 102534 104729 107915 111642 115770 120537 125849 130931 134960 137738 139426 139874
54627 139874 138647 135666 131411 126490 121320 116292 111858 108202 105033 102006 99274 97394 96667 96724 96875
54612 96875 96766 96706 97344 98992 101149 102752 103031 102129 100805 99638 98671 97678 96368 94371 91540 88442
54596 88442 86035 84512 82882 80204 76861 73997 71962 70083 67933 65941 64538 63495 62503 61814 61742
54581 61742 61973 61880 61258 60305 59126 57692 56080 54356 52441 50428 48839 48176 48399 49157 50220 51263
54565 51263 51632 50981 49995 49669 49885 49443 47718 45634 44610 45009 46009 46698 46861 46852 47061 47558 48076 48307
54547D8307l3N3M01O19M31j06o36o77M4J187J845J368J31p47m64P38J902K281
54529E6644J944J560J687K374L358M336M846M279K516M04r61j409j654k138k547
54514G5239k569k418k269j881j196p77j059j596j617j047m99m37q17j298j444
54499E4315r49r4L20n1n31l04L85N83ko46o94k99Q2L87Q83J628K252K244J457
54480F0966M70J44O25J007M20p79j442j061j89N66J196J720J670O97o64j453j358
54463F2535r32p83r07r52p81n45l03J25Q17J483J692J333P42L54L32M73L42l00
54445F4725j088j298p83m46j128k251k336r84M96P97J95j88L0L53M42M08L12J58
54427E7414K95R80J689J569O77k4L8M52P09R06J196J252Q35L83M83J040J495J696
$$ plain form
54547 48307 48274 48327 48728 49347 49778 49672 49036 48359 48403 49590 51435 52803 52934 52187 51723 52461 54363 56644
54529 56644 58588 60148 61835 64209 67567 71903 76749 81028 83544 83948 82987 81578 79924 77786 75239
54514 75239 72670 70252 67983 66102 64906 64129 63070 61474 59857 58810 58311 57874 57057 55759 54315
54499 54315 53366 53272 53592 53541 53010 52706 53091 53674 53672 53026 52332 52033 52115 52502 53385 55013 57265 59509 60966
54480 60966 61436 61580 62205 63212 63632 62853 61411 60350 60161 60727 61923 63643 65313 66010 65346 63893 62535
54463 62535 61603 60820 59913 58961 58180 57635 57332 57457 58274 59757 61449 62782 63524 63878 64210 64683 65025 64725
54445 64725 63637 62339 61556 61110 59982 57731 55395 54411 54907 55704 55899 55711 55741 56094 56536 56944 57256 57414
54427 57414 57709 58689 60378 61947 62624 62600 62638 63090 63799 64705 65901 67153 67988 68371 68854 69894 71389 73085
54409G3085J982K496K890K810K370K001K023K472L177L833M104L891L487L344
54395A13965L517L541K949J834O39m16j397k204k539k470k486k790k936k566k082
54380A04559k130k674l034k731j949j283j237j832k439k352j711j430j856k161
54366G5740j587p18o17j140j212n49Mk2n7L87R17J090J208J712K374K681K558
54349H2769K226J837J611J927K771L514L625L282K856K285J422O33M34P68J081
54334A13041J004M98l54j354k135k585l083l915m644m584l735k808k367k401k644
54319G7934k877k878k517j986j632j583j696j839j917j761j303q04n33l30O1L29
54303E4668j22j177j870j502m76L08M87L15Jn28j239j834k008j700j001n0Q86
$$ plain form
54409 73085 75067 77563 80453 83263 85633 87634 89657 92129 95306 99139 103243 107134 110621 113965
54395 113965 117482 121023 123972 125806 126445 126029 124632 122428 119889 117419 114933 112143 109207 106641 104559
54380 104559 102429 99755 96721 93990 92041 90758 89521 87689 85250 82898 81187 79757 77901 75740
54366 75740 74153 73435 72818 71678 70466 69917 69921 69899 69842 70229 71146 72236 73444 75156 77530 80211 82769
54349 82769 84995 86832 88443 90370 93141 96655 100280 103562 106418 108703 110125 110758 111192 111960 113041
54334 113041 114045 114543 114189 112835 110700 108115 105032 101117 96473 91889 88154 85346 82979 80578 77934
54319 77934 75057 72179 69662 67676 66044 64461 62765 60926 59009 57248 55945 55141 54608 54278 54339 54668
54303 54668 54546 53369 51499 49997 49521 49829 50316 50631 50632 50104 48865 47031 45023 43323 42322 42272 43158
54286D3158J419J325P36no32j038j131q25k76J05O8j38n1L95P77P69N96P04J172
54267D7128J625J697J382R26N54L20J58J1m8J23M40N43J58m14m67L16J409J926
54249E7787J499M97m44r32q43l19J59Mq26j572j431m82M50P82O04K39p1j6O17
54230E5702J351J283L23l82N7J001J240P72N91R54R96K03q07j338j517j613j283
54213E7533k11J092J771J564P19m74j565j822r81J98Q03Q91J054J241Q47j14q81
54196F1665j003p83n59k98r7k98q16r95n28J02L99N20P44Q05L49l68q10r29j002
54177E6098r86o05mK85P3k68l60k28r5j28l98q07r74n70J74O36N32J62j31l31
54157E2075m81m61l04l29o19p48m14j7r0m02k15N75J168Q77q4j032j590j727j420
$$ plain form
54286 43158 44577 45902 46638 46633 46001 44963 43832 43007 42731 42836 42904 42766 42715 43110 43887 44656 45252 45956 47128
54267 47128 48753 50450 51832 52758 53312 53632 53790 53801 53753 53876 54316 54859 55017 54603 54136 54452 55861 57787
54249 57787 59286 59783 59339 58407 57564 57245 57404 57408 56582 55010 53579 53097 53547 54329 54933 55172 55101 55085 55702
54230 55702 57053 58336 58659 58277 58334 59335 60575 61347 61938 62892 63888 64091 63284 61946 60429 58816 57533
54213 57533 57322 58414 60185 61749 62468 61994 60429 58607 57626 57824 58627 59518 60572 61813 62660 62546 61665
54196 61665 60662 59879 59320 59022 58925 58627 57811 56816 56288 56390 56789 57309 58053 58858 59207 58839 58029 57100 56098
54177 56098 55112 54507 54503 54788 54861 54593 54233 54005 53910 53782 53384 52577 51603 51033 51207 51843 52375 52537 52406 52075
54157 52075 51594 51133 50829 50500 49881 49133 48719 48702 48612 48210 47995 48570 49738 50615 50531 49499 47909 46182 44762
54138D4762p12P8N52O34N41M04J75j73n45q37r53q16m49o2J45J62Q0j01l47m67
54118D2071l03nJ51K35N95J274J772J537O67j25j79M50J068J072N78J62L5j86
54100E0869p46j134p06K57P22K01o22p79j70M63M70o9n60n06K3M73M38K18M77
54081D9319J289J901J603N79m21r43j002o19L28J667K767L029K383J265K06m55
54065F2896o59n55l74k31r9N4J88K79M30P23J023J096R56R69J407K035K305K034
54047G4477J588J389J438J565J797K276K925L510L951M289M448M353M243M506
54033A16755N118N592N619N518N862O679P270O817N272L654L110L636M026L351
54019A88279K139J509J523J172l4j342j938k065k450l172l750l991m150m340m372
$$ plain form
54138 44762 44050 44128 44680 45314 45855 46259 46434 46261 45716 44879 43926 43110 42661 42599 42744 42906 42986 42885 42538 42071
54118 42071 41768 41763 41914 42149 42744 44018 45790 47327 47994 47869 47690 48140 49208 50280 50858 51020 51055 50869
54100 50869 50123 48989 48283 48540 49262 49463 48841 48062 47892 48355 48825 48756 48196 47690 47713 48186 48624 48842 49319
54081 49319 50608 52509 54112 54691 54270 53327 52325 51706 52034 53701 56468 59497 61880 63145 63351 62896
54065 62896 62237 61682 61308 61077 60978 61032 61220 61499 61929 62652 63675 64771 65727 66696 68103 70138 72443 74477
54047 74477 76065 77454 78892 80457 82254 84530 87455 90965 94916 99205 103653 108006 112249 116755
54033 116755 121873 127465 133084 138602 144464 151143 158413 165230 170502 174156 177266 180902 184928 188279
54019 188279 190418 191927 193450 194622 194588 193246 191308 189243 186793 183621 179871 175880 171730 167390 163018
54004A63018m140l821l579l371l091k737k401k165k008j807j530j385j521j696
53990A27766j528j070o89m19J2L80nj155j975j639q15p08j300j477p73k7j16q17
53972A13645j275j097n40L8M59O27M95K08J26N04J082J154K93j012j731j450p46
53955A10780l06j14J76O01J021J554K212K498J953J010O34J181K122K887L383
53940A31592L726L963M193M518M877N274O017P171P978P536O013M476L534K870
53926B03738K197J699J315N02p15j323o61N05R98Q46J064K099L358M220M735N143
53910B29720N353N207M899M774M758M309L056J431M16M34P38K53j080k330k870
53895B59068k994l143l265l376l944n127o113o073n383n137n586n958n692n105
$$ plain form
54004 163018 158878 155057 151478 148107 145016 142279 139878 137713 135705 133898 132368 130983 129462 127766
53990 127766 126238 125168 124479 124060 124072 124452 124447 123292 121317 119678 118863 118155 116855 115378 114605 114578 114462 113645
53972 113645 112370 111273 110733 110771 111230 111857 112352 112560 112686 113190 114272 115426 115719 114707 112976 111526 110780
53955 110780 110474 110360 110536 111137 112158 113712 115924 118422 120375 121385 122019 123200 125322 128209 131592
53940 131592 135318 139281 143474 147992 152869 158143 164160 171331 179309 186845 192858 197334 200868 203738
53926 203738 205935 207634 208949 209451 208736 207413 206752 207257 208255 209101 210165 212264 215622 219842 224577 229720
53910 229720 235073 240280 245179 249953 254711 259020 262076 263507 263923 264357 265095 265348 264268 261938 259068
53895 259068 256074 252931 249666 246290 242346 237219 231106 225033 219650 214513 208927 202969 197277 192172
53881A92172m667m399m220m315m721n036m883m405l961l622l251k877k656k604
53867A36555k619k706k955l288l447l206k559j726j032p75j075j776k500k856
53853A04035k718k311j950j701j372q80m52k95k42J4L90L80l20j342j905j545
53837H7786n38L09L48l45j057j097m14M16P30K89n98j329j423q41J54J295K282
53820H5967K575J710J25q28k44J205K049J820J394J515J785J504Q75P34J423K508
53804A06117L493M258M706M621M056L554L689M458N350N819N618M802L663K581
53790A66785J772J162O34L01M14R64J574J818J558R44K02m78j019j522k136k745
53774A70228k973k730k579l149m133m384l263j576p68j316k348k766k346j642
$$ plain form
53881 192172 187505 183106 178886 174571 169850 164814 159931 155526 151565 147943 144692 141815 139159 136555
53867 136555 133936 131230 128275 124987 121540 118334 115775 114049 113017 112242 111167 109391 106891 104035
53853 104035 101317 99006 97056 95355 93983 93103 92651 92356 92114 92128 92518 92898 92578 91236 89331 87786
53837 87786 87248 87557 87905 87560 86503 85406 84992 85408 86138 86427 85829 84500 83077 82236 82390 83685 85967
53820 85967 88542 90252 90377 89549 89305 90510 92559 94379 95773 97288 99073 100577 101452 102186 103609 106117
53804 106117 109610 113868 118574 123195 127251 130805 134494 138952 144302 150121 155739 160541 164204 166785
53790 166785 168557 169719 170353 170654 171068 172032 173606 175424 176982 177926 178128 177650 176631 175109 172973 170228
53774 170228 167255 164525 161946 158797 154664 150280 147017 145441 144673 143357 141009 138243 135897 134255
53760A34255j143r12q25q85j165j597j871j685j108o23n86p91p80n11l39l26o6
53743A19042N13P02o4j157j334m28L26j58j424k105j525k52O72N73n43k020k861
53726A07957k517j445n71k44j09R9J56r5l57k90M7M91J072J670J806J179J86o19
53708A08416j250j979k549k316j185K40J519K790M111M945M712L544K179J300
53694A24477J136J512J969K110J964J884K024K119J965J728J615J486J147P65
53680A47901O72Q57J049J106J110J061Q49M57Jl74n46m40k20k52o21q75o02j00
53662A51033m7n66j100j250j234j265r92k6J195J603P30o29j220p00M4J02l48
53645A45330m11J96P09M17l82q47o96l05K0K90M17K04j36p2M27P28M53P1J73N57
$$ plain form
53760 134255 133112 132200 131375 130490 129325 127728 125857 124172 123064 122441 121855 121064 120284 119773 119434 119108 119042
53743 119042 119555 120257 120193 119036 117702 117274 117600 117442 116018 113913 112388 112136 112808 113381 112838 110818 107957
53726 107957 105440 103995 103424 103180 103071 103170 103326 103231 102874 102584 102631 103122 104194 105864 107670 108849 109035 108416
53708 108416 107166 105187 102638 100322 99137 99377 100896 103686 107797 112742 117454 120998 123177 124477
53694 124477 125613 127125 129094 131204 133168 135052 137076 139195 141160 142888 144503 145989 147136 147901
53680 147901 148573 149430 150479 151585 152695 153756 154605 155062 155063 154689 154143 153703 153483 153231 152610 151735 151133 151033
53662 151033 150986 150420 149320 148070 146836 145571 144579 144553 145748 147351 148081 147452 146232 145532 145576 145678 145330
53645 145330 144919 145115 145824 146241 145859 145012 144316 144011 144031 144321 144738 144942 144806 144734 145161 145889 146342 146413 146586 147143
53625A47143O61N69R31J882K685K646J986J456J419J564J451J015N40L60O21J261
53609A68190K032K652K989L127L244L361L296K946K555K606L322M337M933M612
53595B14202L527K346J712J711J935K096K410L174M068M330L753L062K983L238
53581B54547K965J992J098R20J156J168R62R46J039O92r6m49K71J480J991J494
53565B72176P81N75P32Q11Q61J152J464J290P21N32J204K219K599J953P71j44
53549B89697l59K1N78R39R81Q02N41L18K46L78N94O98O91Q73J497K374K894K482
53531C06245J165l06r97o07L56J331K326L481M308M119L198K818L619M674M736
53516C40466M013L847M944O646P999Q768R117R088Q827Q888R638J0580J0790J0044
$$ plain form
53625 147143 147804 148373 149304 151186 153871 156517 158503 159959 161378 162942 164393 165408 165948 166308 166929 168190
53609 168190 170222 172874 175863 178990 182234 185595 188891 191837 194392 196998 200320 204657 209590 214202
53595 214202 217729 220075 221787 223498 225433 227529 229939 233113 237181 241511 245264 248326 251309 254547
53581 254547 257512 259504 260602 261522 262678 263846 264808 265754 266793 267485 267389 266940 267211 268691 270682 272176
53565 272176 272957 273532 274264 275075 275936 277088 278552 279842 280563 281095 282299 284518 287117 289070 289841 289697
53549 289697 289338 289359 289937 290876 291857 292659 293200 293518 293764 294142 294736 295434 296125 296998 298495 300869 303763 306245
53531 306245 307410 307104 306107 305500 305856 307187 309513 312994 317302 321421 324619 327437 331056 335730 340466
53516 340466 344479 348326 353270 359916 367915 376683 385800 394888 403715 412603 422241 432821 443611 453655
53502D53655R217R417J0933J3020J4617J5167J4952J4704J4969J5744J6637J7251
53490F20283J7486J7573J7831J8340J8856J9128J9173J9111J8936J8660J8467
53479H23844J8426J8234J7697J7309J7743J8689J8957J7987J6687J6231J6597
53468A018401J6873J6650J6327J6178J5859J4994J3755J2577J1663J0889J0066
53457A174232R131Q196P305O108M049J184j512l156m057n279p129q835r722j0093
53443A160422j0631j1454j2233j2775j3073j3099j2966j3121j3956j5243j6312
53432A015559j6721j6596j6284j5934j5476j4843j4144j3558j3036j2280j1158
53421H55529j0022r275q768p995o887n914n276m548l347j883n45O13J615K258
$$ plain form
53502 453655 462872 472289 483222 496242 510859 526026 540978 555682 570651 586395 603032 620283
53490 620283 637769 655342 673173 691513 710369 729497 748670 767781 786717 805377 823844
53479 823844 842270 860504 878201 895510 913253 931942 950899 968886 985573 1001804 1018401
53468 1018401 1035274 1051924 1068251 1084429 1100288 1115282 1129037 1141614 1153277 1164166 1174232
53457 1174232 1183363 1191559 1198864 1204972 1209021 1210205 1208693 1205537 1201480 1196201 1189072 1180237 1170515 1160422
53443 1160422 1149791 1138337 1126104 1113329 1100256 1087157 1074191 1061070 1047114 1031871 1015559
53432 1015559 998838 982242 965958 950024 934548 919705 905561 892003 878967 866687 855529
53421 855529 845507 836232 827464 819469 812582 806668 801392 796844 793497 791614 791069 791682 793297 795555
53407G95555K536K985M036N323O166O595P279Q552J0140J1765J3399J4873J5881
53394I05085J6544J7442J8828K0273K1414K2579K4239K6059K7099K6965K6393
53383A152920K6502K7671K9295L0616L1522L2505L3894L5417L6467L6642L6034
53372A509485L5139L4509L4290L4062L3377L2414L1706L1145K9825K7204K3917
53361A857073K0975J8526J6002J3193J0484Q058N516K403j296n248r026j2258
53349A924402j4866j7127j9255k1143k2794k4649k7018k9409l1140l2285l3273
53338A651443l3848l3372l2114l1096l0513k9422k7455k5724k5299k5706k5748
53327A331146k5157k4518k4067k3534k2852k2204k1468k0394j9197j8291j7504
$$ plain form
53407 795555 798091 801076 805112 810435 816601 823196 830475 839027 849167 860932 874331 889204 905085
53394 905085 921629 939071 957899 978172 999586 1022165 1046404 1072463 1099562 1126527 1152920
53383 1152920 1179422 1207093 1236388 1267004 1298526 1331031 1364925 1400342 1436809 1473451 1509485
53372 1509485 1544624 1579133 1613423 1647485 1680862 1713276 1744982 1776127 1805952 1833156 1857073
53361 1857073 1878048 1896574 1912576 1925769 1936253 1944311 1949827 1952230 1950934 1945686 1936660 1924402
53349 1924402 1909536 1892409 1873154 1852011 1829217 1804568 1777550 1748141 1717001 1684716 1651443
53338 1651443 1617595 1584223 1552109 1521013 1490500 1461078 1433623 1407899 1382600 1356894 1331146
53327 1331146 1305989 1281471 1257404 1233870 1211018 1188814 1167346 1146952 1127755 1109464 1091960
53316A091960j6178j4105j1821j0012q992q690q695q489q012p844q342q942q876
53303I62962q341q137q329q130p156n927m859l706k259r12L2R59K233L424L871
53288I15725L687L592L934M551N340O389P554Q569R635J1280J3427J5193J5870
53275A024746J5716J5381J5091J4851J4988J5683J6154J5246J3069J1089J0264
53264A182278R794Q454O454M995M343L455J635n40k219l367m398n474o693q313
53250A190404j0204j1609j2116j2379j3216j4410j5211j5595j6119j6728j6759
53239A036058j6210j5990j6560j7193j7031j6210j5426j4875j4290j3694j3419
53228H65160j3515j3525j3062j2206j1342j0734j0362j0021r514q792p934p045
$$ plain form
53316 1091960 1075782 1061677 1049856 1039844 1030852 1022162 1013467 1004978 996966 989122 980780 971838 962962
53303 962962 954621 946484 938155 930025 922869 916942 912083 908377 906118 905206 905238 906197 908430 911854 915725
53288 915725 919412 923004 926938 931489 936829 943218 950772 959341 968976 980256 993683 1008876 1024746
53275 1024746 1040462 1055843 1070934 1085785 1100773 1116456 1132610 1147856 1160925 1172014 1182278
53264 1182278 1192072 1200526 1206980 1211975 1216318 1219773 1221408 1220868 1218649 1215282 1210884 1205410 1198717 1190404
53250 1190404 1180200 1168591 1156475 1144096 1130880 1116470 1101259 1085664 1069545 1052817 1036058
53239 1036058 1019848 1003858 987298 970105 953074 936864 921438 906563 892273 878579 865160
53228 865160 851645 838120 825058 812852 801510 790776 780414 770393 760879 752087 744153 737108
53216G37108o233n668n451n439n233m476l187j835j089j342k350l445m166m580
53202F82614m955n344n742o302p100p816q042p882p822p982p915p295o464o078
53188E85875o367o977p432p625p816q172q481q439q215q375r074r671r465q604
53174D71162p880p778q047q105p542o437n431n367o349p368p263o058m851m549
53160C78137n124o011o620o483n533m381l775l768l873l996m554n520o127n829
53146C06543m970m191l672l309l129l113l063k954l062l455l757l698l468l240
53132B57462k870k373k140k307k431k269k206k442k390j652r73j264k088k163
53118B27894j194j93P5l0R6M55Q61J418K099K364J808Q99N39J012J714J881J337
$$ plain form
53216 737108 730875 725207 719756 714317 709084 704608 701421 699586 698497 697155 694805 691360 687194 682614
53202 682614 677659 672315 666573 660271 653171 645355 637313 629431 621609 613627 605712 598417 591953 585875
53188 585875 579508 572531 565099 557474 549658 541486 533005 524566 516351 507976 498902 489231 479766 471162
53174 471162 463282 455504 447457 439352 431810 425373 419942 414575 408226 400858 393595 387537 382686 378137
53160 378137 373013 367002 360382 353899 348366 343985 340210 336442 332569 328573 324019 318499 312372 306543
53146 306543 301573 297382 293710 290401 287272 284159 281096 278142 275080 271625 267868 264170 260702 257462
53132 257462 254592 252219 250079 247772 245341 243072 240866 238424 236034 234382 233409 232145 230057 227894
53118 227894 226700 226507 226582 226552 226648 227103 227964 229382 231481 233845 235653 236552 237091 238103 239817 241698 243035
53101B43035N20j03n77j330k515l648m136m027l910m147m537m727m597m195l612
53086A97494l106l024l404l833l849l381k738k291k171k208k140j946j869j999
53072A59535j994j507o83n9K7l86j016j424j133j62O91O23j50o77n43k87m40q29
53054A49586j105j312j589j735j587j425j558j794j741j375r30m26J91O55N69
53039A34424m0p60j250j417j231p80m11m29p22r21q83o92l78K5K39J3m84q99j152
53020A22252j304j145n35J3j93r57j376j166r58j073q94m1P65O98J09j00J49K65
53002A14509J53J78K37j34o51m16O77J549J351M38m22j049j491j455p57Q5M03
52985A13205K64J73K95M56O50R62J218J253J311J649J938J699J131R13J207J561
$$ plain form
53101 243035 243555 243452 242875 241545 239030 235382 231246 227219 223309 219162 214625 209898 205301 201106 197494
53086 197494 194388 191364 187960 184127 180278 176897 174159 171868 169697 167489 165349 163403 161534 159535
53072 159535 157541 156034 155351 155292 155319 154933 153917 152493 151360 151198 151889 152512 152362 151685 151142 150855 150415 149586
53054 149586 148481 147169 145580 143845 142258 140833 139275 137481 135740 134365 133435 133009 133200 133855 134424
53039 134424 134384 133624 132374 130957 129726 128946 128535 128106 127384 126463 125580 124888 124510 124535 124774 124787 124303 123404 122252
53020 122252 120948 119803 119268 119281 119088 118131 116755 115589 114631 113558 112664 112623 113388 114086 114195 114095 114244 114509
53002 114509 114662 114840 115077 114943 114292 113876 114553 116102 117453 117891 117469 116420 114929 113474 112717 112802 113205
52985 113205 113469 113642 113937 114393 115043 116005 117223 118476 119787 121436 123374 125073 126204 127117 128324 129885
52969A29885J745J999K398K638K667K909L524M002L888L426L183L273L420L469
52955A72426L449L251K635J578L92m80p63n68m09q35j853k830l133k801k403k298
52939A65358k243j792j002n57j026k111k831k577j717r77n80l42k53m47o87n04
52923A45712O1M41L57J81K52K92j57j007j673j687j064j84N21Q75J010J089J036
52906A46055Q27P87J201J659J414M99q8L44J225J396M86q13j544j339n42K17O55
52889A52439J023J533J818J395N92K96P00J017P04K36K49N81P38P20P17M97j43
52872A65112o77m21L96Q92P77N67N68L65l87j272j607j262o67j76L00R90J727
52855A65225J987J570J078J257J931K134J477P64Q72J569J973J797J486J351J299
$$ plain form
52969 129885 131630 133629 136027 138665 141332 144241 147765 151767 155655 159081 162264 165537 168957 172426
52955 172426 175875 179126 181761 183339 183731 183251 182488 181920 181511 180676 178823 175993 172860 170059 167656 165358
52939 165358 163115 161323 160321 159764 158738 156627 153796 151219 149502 148525 147945 147603 147350 146903 146216 145712
52923 145712 145773 146214 146571 146752 147004 147296 147139 146132 144459 142772 141708 141524 142045 142920 143930 145019 146055
52906 146055 146882 147669 148870 150529 151943 152442 152354 152698 153923 155319 155805 154992 153448 152109 151567 151784 152439
52889 152439 153462 154995 156813 158208 158800 159096 159796 160813 161517 161753 162002 162583 163321 164041 164758 165255 165112
52872 165112 164435 164014 164410 165302 166079 166646 167214 167579 167192 165920 164313 163051 162384 162208 162508 163498 165225
52855 165225 167212 168782 169860 171117 173048 175182 176659 177423 178295 179864 181837 183634 185120 186471 187770
52840A87770J243J327J602J904K020J807J281Q06Q56J310J389O55l25p95q67j165
52824B00818j750k187k402k741l223l470l304k881k289j624j358j877k733l015
52810A65964k556k064k012k098j957j708j522j194n56N9Q0o75j752k373k094j305
52794A42237q68j129j587j800k010k427k539j876r75o69q59q91p66q38o98K27
52778A22532J155N79j378k670j958k63O50L92l04q86j247j335j293j446j707j567
52762A09254j091j073j756k288k050j650j806k091j647o12O6j45j055k140k687
52747H7229k123q00M2k01p22o05k16l58q04p27p5N34Q89J146J028J84r29j479
52729H2013j453j414j349q21j58l05j364k291k214j268N0J381K218J990Q62k29
$$ plain form
52840 187770 189013 190340 191942 193846 195866 197673 198954 199760 200616 201926 203315 203970 203645 202850 201983 200818
52824 200818 199068 196881 194479 191738 188515 185045 181741 178860 176571 174947 173589 171712 168979 165964
52810 165964 163408 161344 159332 157234 155277 153569 152047 150853 150297 150356 150436 149761 148009 145636 143542 142237
52794 142237 141369 140240 138653 136853 134843 132416 129877 128001 127026 126357 125498 124607 123841 123003 122305 122532
52778 122532 123687 124266 122888 120218 118260 117997 118647 119039 118735 117849 116602 115267 113974 112528 110821 109254
52762 109254 108163 107090 105334 103046 100996 99346 97540 95449 93802 93190 93256 93111 92056 89916 87229
52747 87229 85106 84306 84348 84147 83425 82820 82604 82246 81442 80715 80640 81174 82063 83209 84237 84421 83492 82013
52729 82013 80560 79146 77797 76976 76818 76513 75149 72858 70644 69376 69426 70807 73025 75015 75877 75648
52713G5648o41o28o48p08n89k91M9L09L31Q2j01K03R63J781K402K737K645K171
52695H5715J793J840J913J563J239J650K420K461J663J101J385J904K031J978
52681A10656J932J369k6j517k173k084k042k401k916l341l591l505k960k165j555
52666H3681j437j801k235k120j290m94o16j374j569p09L16N48O8n92j281j863
52650F7232j776p76L78P96N55K79P1k71n02j86M40P26O19N51N47K28k59k15N29
52631F8966J238J198M99l04q12r01o78n16p01j005r56n53k70k61j55K40N33L66
52613F5928o7l57m45n23o68p95p26k71N25J160J117O35N19R71J221P01K5J52R63
52594G0065J410R41R2m00m19k19Q0N05R65J338J556J476R14K6n44k32P97J797
$$ plain form
52713 75648 75007 74379 73731 73023 72434 72143 72192 72501 72832 72914 72813 73016 73979 75760 78162 80899 83544 85715
52695 85715 87508 89348 91261 92824 94063 95713 98133 100594 102257 103358 104743 106647 108678 110656
52681 110656 112588 113957 113931 112414 110241 108157 106115 103714 100798 97457 93866 90361 87401 85236 83681
52666 83681 82244 80443 78208 76088 74798 74304 73688 72314 70745 70036 70352 70900 70968 70376 69095 67232
52650 67232 65456 64680 65058 65854 66409 66688 66759 66488 65986 65800 66240 66966 67585 68136 68683 68911 68652 68437 68966
52631 68966 70204 71402 71901 71597 70785 69884 69206 68690 67989 66984 66028 65475 65205 64944 64789 65029 65562 65928
52613 65928 65861 65504 65059 64536 63868 63073 62347 62076 62601 63761 64878 65513 66032 67003 68224 68925 68950 69102 70065
52594 70065 71475 72416 72508 72108 71689 71470 71550 72055 73020 74358 75914 77390 78304 78330 77786 77554 78351 80148
52576H0148K156J861J286P60L83P4k26m16l47m4K58L86M36N56O69N54J94r9K7
52557H8616O20J336J652J278M78q4JM78P94P75P33R38J355J809K142K124J575
52540A06620P20J84L66J015J536J574J214P95O73R37J230J072N04R1J19J66k00
52523A18616o37m21N20J474J826J608J174O88Q6o13j119j007k32M55M3j501k850
52506A18110k706j232L43J261J636J614J055K36j06K02M33M2n41o72m01q0L69
52489A19563J042J417R08j02n83k11L63N72O16Q16R93Q39N05L26K72O2k71l64
52471A26763o8K91L87L53N28Q30P56J17n10l75M88J260J260N72k39o90n95m8N40
52452A31620P42O20O73J074J337R61J62m52o40o03m36j0O58J328J809K012J796
$$ plain form
52576 80148 82304 84165 85451 86211 86594 86668 86442 86026 85679 85635 85893 86279 86715 87271 87940 88494 88688 88589 88616
52557 88616 89236 90572 92224 93502 93980 93896 93897 94375 95169 95944 96677 97615 98970 100779 102921 105045 106620
52540 106620 107340 107524 107890 108905 110441 112015 113229 114024 114697 115634 116864 117936 118440 118531 118650 118816 118616
52523 118616 117979 117558 118078 119552 121378 122986 124160 124848 124934 124321 123202 122195 121963 122418 122461 120960 118110
52506 118110 115404 114172 114515 115776 117412 119026 120081 120317 120211 120413 120846 120888 120347 119675 119274 119194 119563
52489 119563 120605 122022 122930 122828 122245 122034 122397 122969 123585 124401 125394 126233 126738 127064 127336 127398 127127 126763
52471 126763 126695 126986 127373 127726 128254 129084 129840 129957 129447 129072 129560 130820 132080 132652 132413 131723 131128 131080 131620
52452 131620 132362 132982 133655 134729 136066 137027 137189 136737 136097 135494 135058 135048 135706 137034 138843 140855 142651
52435A42651J136L69m8o2K2O3J68L07J88k99q93j234j156o65N8N97O56M92O21
52416A42971J069J320J136R16J032J266J238R92Q01O76N24M99P89J200J371J313
52400A59113J333J520J635J484J072N39J69L12R25J309Q16k51r26p72l05j45k73
52383A67555l38k09oJ03j06p50j435j466p15N7J05l97o97l73M35J342J862J581
52365A66548P04J71O39J566J948J777J924K689L273K972K119J476J274J341J662
52350A92083K260K830L027K943K893K923K845K652K492K376K132J690J176Q67
52336B25189J060J788K535K603J951J332J373J859K221K306K277K184K101K346
52322B53125L010L589L573L262L320L811M217M331M359M375M319M466N091N754
$$ plain form
52435 142651 143787 144156 144108 144046 144068 144131 144299 144606 144794 144495 143602 142368 141212 140547 140605 141202 141858 142350 142971
52416 142971 144040 145360 146496 147412 148444 149710 150948 151940 152741 153417 153941 154440 155229 156429 157800 159113
52400 159113 160446 161966 163601 165085 166157 166696 166865 167177 168102 169411 170227 169976 169050 168278 167973 167828 167555
52383 167555 167217 167008 167002 167105 166999 166249 164814 163348 162633 162690 162795 162398 161701 161328 161763 163105 164967 166548
52365 166548 167252 167423 168062 169628 171576 173353 175277 177966 181239 184211 186330 187806 189080 190421 192083
52350 192083 194343 197173 200200 203143 206036 208959 211804 214456 216948 219324 221456 223146 224322 225189
52336 225189 226249 228037 230572 233175 235126 236458 237831 239690 241911 244217 246494 248678 250779 253125
52322 253125 256135 259724 263297 266559 269879 273690 277907 282238 286597 290972 295291 299757 304848 310602
52308C10602N784N491N933P291Q518Q949R223R969J0593J0319R664R772J0696
52295D22804J1458J1631J1786J2326J2890J3172J3464J3942J4123J3570J2721
52284E63887J2454J3025J3939J4702J5245J5531J5260J4194J2649J1349J0737
52273G12972J0531J0028Q767O894N006L740L322L349L123K432J861K036K604K496
52259G79161J283k21r96j002r35j136j284j048n18J10Q20J602K308K845L389M208
52243G88586N358O602P610Q288Q959J0047J1444J2419J2413J1788J1361J1256
52231I06131J0778R589Q423Q138Q410Q063O667N120M358M116L467K196Q87j94
52217I86149j461l057m326m749m851n535o814p922q468q847r464j0259j1047j1743
$$ plain form
52308 310602 316386 321877 327810 335101 343619 352568 361791 371760 382353 392672 402336 412108 422804
52295 422804 434262 445893 457679 470005 482895 496067 509531 523473 537596 551166 563887
52284 563887 576341 589366 603305 618007 633252 648783 664043 678237 690886 702235 712972
52273 712972 723503 733531 742298 749192 754198 757938 761260 764609 767732 770164 772025 774061 776665 779161
52259 779161 780444 780223 779227 778225 777290 776154 774870 773822 773304 773414 774234 775836 778144 780989 784378 788586
52243 788586 793944 800546 808156 816444 825403 835450 846894 859313 871726 883514 894875 906131
52231 906131 916909 926498 934921 943059 951469 959532 966199 971319 975677 979793 983260 985456 986343 986149
52217 986149 984688 981631 977305 972556 967705 962170 955356 947434 938966 930119 920655 910396 899349 887606
52203H87606j2062j1614j0529r478q812q170p225o300n811n568n142m630m490
52190G87775m764m931m550l714k869k454k578k907k940k508j906j463j268j392
52176G47531j969k843l564l972m319m601m270l105j849j370j640k137k754l544
52162G05594l966l461k526k219k608k741k303k177k891l576l165j901r01p30j153
52147F69276j836k539k894k741k587l023l725l669k488r94j90k54p02j125j433
52132F39076j685k059k785l748m247l616k119q63o23j052j279j053q50j033j340
52117F10724j372j119p68l42K15P65J194J721K605L669M497N037N656O481P135
52102F46098P330P426Q150R880J2360J4940J6868J7627J7287J6644J6645J7549
$$ plain form
52203 887606 875544 863930 853401 843923 835111 826941 819716 813416 807605 802037 796895 792265 787775
52190 787775 783011 778080 773530 769816 766947 764493 761915 759008 756068 753560 751654 750191 748923 747531
52176 747531 745562 742719 739155 735183 730864 726263 721993 718888 717039 715669 714029 711892 709138 705594
52162 705594 701628 698167 695641 693422 690814 688073 685770 683593 680702 677126 673961 672060 671159 670429 669276
52147 669276 667440 664901 662007 659266 656679 653656 649931 646262 643774 642780 642590 642336 641634 640509 639076
52132 639076 637391 635332 632547 628799 624552 620936 618817 617954 617331 616279 615000 613947 613097 612064 610724
52117 610724 609352 608233 607465 607123 607338 608103 609297 611018 613623 617292 621789 626826 632482 638963 646098
52102 646098 653428 660854 669004 678884 691244 706184 723052 740679 757966 774610 791255 808804
52090H08804J8707J9326J9378J9438J9696J9484J8100J5885J3982J3089J2816
52079I98705J2407J1591J0499R176P615O001M547L215J879N57p58k296m095n618
52065A053425o254o137o052o573p592q605r111q826p947p153o894o841o405n649
52051I53386n117m808m115k872j733j148o73K45J338J953K064K247K753L263L531
52036I50314L807M425N288N992O312O338O165N644M592L194J983J276Q84N17K04
52021A006935L3l07j245k658l956m849n597o465p377q226r097j0059j1074j2262
52007I23796j3755j5180j5837j5671j5616j6525j8086j9290j9691j9765k0093
51996G34287k0645k0915k0551j9737j9010j8662j8420j7853j7073j6620j6665
$$ plain form
52090 808804 827511 846837 866215 885653 905349 924833 942933 958818 972800 985889 998705
52079 998705 1011112 1022703 1033202 1042378 1049993 1055994 1060541 1063756 1065635 1066192 1065434 1063138 1059043 1053425
52065 1053425 1047171 1041034 1034982 1028409 1020817 1012212 1003101 994275 986328 979175 972281 965440 959035 953386
52051 953386 948269 943461 939346 936474 934741 933593 932920 933165 934503 936456 938520 940767 943520 946783 950314
52036 950314 954121 958546 963834 969826 976138 982476 988641 994285 998877 1002071 1004054 1005330 1006214 1006731 1006935
52021 1006935 1006968 1006661 1005416 1002758 998802 993953 988356 981891 974514 966288 957191 947132 936058 923796
52007 923796 910041 894861 879024 863353 847737 831212 813126 793836 774145 754380 734287
51996 734287 713642 692727 672176 652439 633429 614767 596347 578494 561421 544801 528136
51985E28136j6770j6570j6213j5921j5556j4987j4393j3842j2971j1592j0221
51974C69100r493r326r223r093r085q831p744o055m791m446m343l680k610j849
51960B78531j705j935k322k795l186l295l239l301l460l475l403l617m148m424
51946B34226l942k890j896j390j529k366l492l833k618o63J18j080k938l667l116
51931A98924k445k214j891j102l49j37k52l44n76j116j491j073o1O06L55m40j001
51914A85393j072j071j417j918k028j702j554j958k393k177j494j079j070r41
51900A63519n33l04m65o89q54j308k022k310j845j145o10Q9J066J520Q78r4l01
51883A54592Q3N2n72j019r33p40p04n87l57l25m37k01M57R82J008P35M11R7P6
$$ plain form
51985 528136 511366 494796 478583 462662 447106 432119 417726 403884 390913 379321 369100
51974 369100 359607 350281 341058 331965 322880 314049 306305 300250 295459 291013 286670 282990 280380 278531
51960 278531 276826 274891 272569 269774 266588 263293 260054 256753 253293 249818 246415 242798 238650 234226
51946 234226 230284 227394 225498 224108 222579 220213 216721 212888 210270 209607 209725 208645 205707 202040 198924
51931 198924 196479 194265 192374 191272 190923 190786 190534 190190 189614 188498 187007 185934 185873 186479 186834 186394 185393
51914 185393 184321 183250 181833 179915 177887 176185 174631 172673 170280 168103 166609 165530 164460 163519
51900 163519 162986 162682 162217 161528 160674 159366 157344 155034 153189 152044 151434 151523 152589 154109 154987 154893 154592
51883 154592 154675 154727 154155 153136 152203 151463 150759 150172 149815 149490 149053 148852 149309 150291 151299 152034 152445 152542 152618
51864A52618O84J557J790J175N21M36N36L17N3J62L57J61j40J66J042J619J353
51847A64407O29J91K90O47R29J094J300J611J827J712J375J168J180J080O25M5
51831A80110k55k38j45j61k69l86m26k91n4J2k81p45j008r91r66j140j363j291
51813A70112q05j53L60P31J184J721J944J533P59K61L08N94P25O78O55P59R17
51796A82283R26N57k23r66j018k72N63P15K24j60M1N18O41K58j89k22J54O17R72
51777A85419J272J501J434R12J27n68r17p49Q1J433K671L106K700K058J636J313
51761B03429Q15L09K89Q92J638J978J967K191K925L636L567K784K238K681L860
51746B35199M949N420N214M444L319K185J303O49J80j6m7l37r79j347q88j7M03
$$ plain form
51864 152618 153302 154859 156649 157824 158345 158781 159317 159634 159687 159849 160206 160367 160227 160393 161435 163054 164407
51847 164407 165036 165227 165517 166164 167093 168187 169487 171098 172925 174637 176012 177180 178360 179440 180065 180110
51831 180110 179855 179617 179472 179311 179042 178656 178230 177939 177885 177897 177616 176871 175863 174872 173906 172766 171403 170112
51813 170112 169307 169154 169514 170245 171429 173150 175094 176627 177386 177647 177955 178549 179274 179952 180607 181366 182283
51796 182283 183209 183766 183543 182577 181559 181287 181850 182565 182789 182629 182670 183188 183829 184087 183898 183676 183830 184447 185419
51777 185419 186691 188192 189626 190538 190665 190097 189180 188431 188512 189945 192616 195722 198422 200480 202116 203429
51761 203429 204244 204553 204842 205734 207372 209350 211317 213508 216433 220069 223636 226420 228658 231339 235199
51746 235199 240148 245568 250782 255226 258545 260730 262033 262682 262862 262846 262799 262462 261483 260136 259248 259231 259634
51729B59634L09L60P58R79P08L18J89K55M27Q24J284J315Q39M27M18M38J17k45
51711B69354k68j58k81n34o88r51j492j843j461p19n20j039j526j448j126r65
51695B54335p58j57N45P08K59j07K60J279K445L492M379M786M168K527O78o74
51679B78165j717k950m102m357l591k619k031j569r06l28j83j87J65Q66J604K326
51663B58586L083L571L421K797K278K225K579L060L205K515R95o44j718k337k953
51648B80663l496l587l411l699m713n851o402o256n778n327n069m912m556l854
51634B13752l141k880l065l274l274l183l055k754k308j959j728j333p01j78p6
51619A80843k90m77l80J13Q67J313Q41m22j550j803j369q55n15l26m55j016j503
$$ plain form
51729 259634 259943 260303 261061 262040 262748 263066 263255 263510 263937 264761 266045 267360 268199 268626 269044 269482 269599 269354
51711 269354 269086 268928 268647 268113 267425 266474 264982 263139 261678 260959 260439 259400 257874 256426 255300 254335
51695 254335 253577 253420 253965 254673 254932 254825 255085 256364 258809 262301 266680 271466 275634 278161 278839 278165
51679 278165 276448 273498 269396 265039 261448 258829 256798 255229 254323 253995 253812 253625 253790 254656 256260 258586
51663 258586 261669 265240 268661 271458 273736 275961 278540 281600 284805 287320 288315 287671 285953 283616 280663
51648 280663 277167 273580 270169 266470 261757 255906 249504 243248 237470 232143 227074 222162 217606 213752
51634 213752 210611 207731 204666 201392 198118 194935 191880 189126 186818 184859 183131 181798 181097 180919 180843
51619 180843 180553 180076 179696 179809 180676 181989 182830 182408 180858 179055 177686 176831 176316 175990 175535 174519 173016
51602A73016j137N1R73P04l75j015n67L10N47m4o05k86Q03J786K050J813J679
51585A79703J827J927J732J528J776K549L506M311M740M553L749K994L201M315
51571B22411N054M414L015K252K369K288J304l5r82j639k361k913k885k536k418
51556B27338k517k395j932j314m38Q99K329L098L052K913L349M188M750M641M081
51541B52042L600L583L976M374M458M196L647K848K006J450J167P29m2p28j005
51526B86301j222j780k317k175j389n95j47J1j78p23j093o99J25M19m9n86q16
51509B73087j255k296l418l857l533k927k524k574l013l344l119k615k488k659
51495B33465k357j402o85q17j168q33N8P11Q14O50N03N49J003J743K138J821J322
$$ plain form
51602 173016 171879 171930 172903 173607 173232 172217 171650 171960 172507 172463 171858 171572 172375 174161 176211 178024 179703
51585 179703 181530 183457 185189 186717 188493 191042 194548 198859 203599 208152 211901 214895 218096 222411
51571 222411 227465 231879 234894 237146 239515 241803 243107 243072 242090 240451 238090 235177 232292 229756 227338
51556 227338 224821 222426 220494 219180 218742 219641 221970 225068 228120 231033 234382 238570 243320 247961 252042
51541 252042 255642 259225 263201 267575 272033 276229 279876 282724 284730 286180 287347 288076 288034 287306 286301
51526 286301 285079 283299 280982 278807 277418 276823 276676 276687 276509 275786 274693 273994 274119 274538 274489 273903 273087
51509 273087 271832 269536 266118 262261 258728 255801 253277 250703 247690 244346 241227 238612 236124 233465
51495 233465 231108 229706 229021 228204 227036 226203 226261 226972 227786 228436 228939 229488 230491 232234 234372 236193 237515
51478B37515J364J845K144K057J845J615J392J507K134K653K286J317Q36J238
51464B61748J790J844J720K057K905L843M556M908M819M460M317M710N312N391
51450C14380M550L111J862J411J731K266K451K075J173n6j116j385q10j74k58
51435C31211r34j487j582j402j043m65L2j21j031k213l218l937m284m172l989
51420C01365m341n154n642n493n407n942o522o206n085m070l554l089k360j717
51406B36783j479j332q46j54L25O39J225K111K644K352J692J587K273L066L287
51391B54173K957K348J391J1j283j777j481j166j403k181l334m777o134o787o676
51376B23881o444o470o300n570m886n053n744n777m707l318k511k325k316k285
$$ plain form
51478 237515 238879 240724 242868 244925 246770 248385 249777 251284 253418 256071 258357 259674 260510 261748
51464 261748 263538 265382 267102 269159 272064 275907 280463 285371 290190 294650 298967 303677 308989 314380
51450 314380 318930 322041 323903 325314 327045 329311 331762 333837 335010 334954 333838 332453 331643 331469 331211
51435 331211 330277 328790 327208 325806 324763 324298 324330 324209 323178 320965 317747 313810 309526 305354 301365
51420 301365 297024 291870 286228 280735 275328 269386 262864 256658 251573 247503 243949 240860 238500 236783
51406 236783 235304 233972 233126 232972 233297 233936 235161 237272 239916 242268 243960 245547 247820 250886 254173
51391 254173 257130 259478 260869 260880 259597 257820 256339 255173 253770 251589 248255 243478 237344 230557 223881
51376 223881 217437 210967 204667 199097 194211 189158 183414 177637 172930 169612 167101 164776 162460 160175
51362A60175k223j996j486q52l48j14k99j114k387l295l010j689m50k83j110j987
51346A37532k086j370m35J43K91L45N82R26J091R10M67m9n32r62j294j389j148
51329A33022o69k19R5M25R20J449J769J884J975J964J630J211J430K576L896M387
51313A57745M017L564L400L123K555K290K787L373K992J635L34k57o04j345k291
51298A83318k814k851k936l338l764l900l864l901l938l737l342l042k880k508
51284A36503j707q09l67m27m77j63K51K85r3n77j026j498j881j901j600j418j630
51267A21465j984k081j825j330o88m6L02K15l5o0J81M19N12N57O66Q06Q53O99
51249A18626L74J60L49Q04R73O16K08L23Q44J235J373J575J881J866J283M33k41
$$ plain form
51362 160175 157952 155956 154470 153618 153270 153156 152857 151743 149356 146061 143051 141362 140912 140629 139519 137532
51346 137532 135446 134076 133641 133784 134075 134420 135002 135928 137019 137929 138396 138347 137815 136853 135559 134170 133022
51329 133022 132353 132134 132229 132654 133574 135023 136792 138676 140651 142615 144245 145456 146886 149462 153358 157745
51313 157745 161762 165326 168726 171849 174404 176694 179481 182854 185846 187481 187815 187558 186954 185609 183318
51298 183318 180504 177653 174717 171379 167615 163715 159851 155950 152012 148275 144933 141891 139011 136503
51284 136503 134796 133987 133620 133193 132716 132553 132804 133089 132996 132419 131393 129895 128014 126113 124513 123095 121465
51267 121465 119481 117400 115575 114245 113557 113511 113813 114028 113993 113933 114114 114533 115045 115602 116268 117074 117927 118626
51249 118626 119000 119160 119509 120313 121286 121902 122110 122433 123277 124512 125885 127460 129341 131207 132490 132923 132682
51232A32682n74n61k38J54K35p2m58p09r06r93o23K92J168J355Q64J65n04j188
51214A30089j696j543n17Q88J762J437Kj663k464j979p37L99R69R50M10m33j102
51197A24772j202r09p08o89n29k12k59r72j820j923j034J77P90L91o63j555j661
51180A11994j086n86p37j211j099n3J095J229L35m17j87L78N4j116j718q50O23
51163A06648J228P65K58L49O47O91O39O54L69m47j193j113m00J2k43n50l09K52
51145A08257M98K45k41p77j316j568j082J16J303J782J594J287J150R85N66o9
51129A12730p09j076p77M03J984K976K874K155J509R78L09k29q2O14J003N91k17
51112A25036p97j010j044j025j115j465j749j207L49J914K264J375L94K77Q81
$$ plain form
51232 132682 132108 131547 131309 131463 131698 131626 131168 130459 129553 128560 127937 128229 129397 130752 131616 131781 131277 130089
51214 130089 128393 126850 126333 127221 128983 130420 130422 128759 126295 124316 123579 123978 124947 125897 126307 125874 124772
51197 124772 123570 122661 121953 121264 120735 120523 120264 119292 117472 115549 114515 114692 115482 115873 115210 113655 111994
51180 111994 110908 110322 109585 108374 107275 107222 108317 109546 109881 109464 109277 109655 109709 108593 106875 106025 106648
51163 106648 107876 108641 108899 109248 109895 110586 111225 111879 112248 111801 110608 109495 109095 109107 108864 108314 108005 108257
51145 108257 108755 109000 108759 107982 106666 105098 104016 104132 105435 107217 108811 110098 111248 112233 112799 112730
51129 112730 112021 110945 110168 110571 112555 115531 118405 120560 122069 123047 123356 123127 123045 123659 124662 125253 125036
51112 125036 124239 123229 122185 121160 120045 118580 116831 115624 115973 117887 120151 121526 121920 122197 123078
51097A23078J452J534J235Q87O21K50l94j059j245r01n81o43p08l23J74J67j40
51080A23404L5P38J024L72m74n26J56P72R32R20R92J028Q51M58l4m03l95p7P1
51061A29844k36o04n13j11O3oJ58N43N05j55o60k78O47J263J381J490J801K029
51043A37161J985J845J673J297P71N26P90J279J625J821J965J920J536R72M88
51028A57654J49K5L35J018J415R72J19j32N03J270J486J362J399J515J327R05
51012A71322P40J016J430J725K056K695L559M194M170L619L295L884N132O024
50998B14861O077N999O700Q055R151R570R682R822R963J0303J1396J3347J5479
50985C40405J7188J8688K0496K2658K4891K7207K9877L2984L6392L9987M3609
$$ plain form
51097 123078 124530 126064 127299 128186 128807 129057 128663 127604 126359 125458 124877 124234 123526 123203 123377 123544 123404
51080 123404 123439 124177 125201 125573 125099 124573 124729 125501 126433 127353 128345 129373 130224 130682 130648 130245 129850 129773 129844
51061 129844 129608 129004 128491 128380 128443 128437 128595 129138 129643 129488 128828 128550 129197 130460 131841 133331 135132 137161
51043 137161 139146 140991 142664 143961 144732 145258 146048 147327 148952 150773 152738 154658 156194 157166 157654
51028 157654 157803 157828 158163 159181 160596 161568 161687 161555 162058 163328 164814 166176 167575 169090 170417 171322
51012 171322 172062 173078 174508 176233 178289 180984 184543 188737 192907 196526 199821 203705 208837 214861
50998 214861 220938 226937 233637 241692 250843 260413 270095 279917 289880 300183 311579 324926 340405
50985 340405 357593 376281 396777 419435 444326 471533 501410 534394 570786 610773 654382
50974F54382M6915M9713N2275N4914N7364N8928N9191N8249N6331N3479M9658
50963A251399M4916L9484L3706K7861K1875J5562R211L561j034m973q532j1201
50951A421835j2507j2988j3472j3667j2579j0344q520q296r285j0596j2211j4622
50939A282748j7769k1120k4484k8041l1717l5070l7811l9991m1852m3607m5178
50928I16108m6022m5543m3945m2156m0613l8698l5836l2540k9667k7129k4298
50917E09661k1241j8596j6341j3865j1312r677r194q708p225n267l921l286k672
50904C78356j903j430j381j343j086q00n05R8J016J683J654J202J020J501K539
50889C80621L808N064O163P007P470P542P502P860Q829J0008J0866J1462J2320
$$ plain form
50974 654382 701297 751010 803285 858199 915563 974491 1033682 1091931 1148262 1201741 1251399
50963 1251399 1296315 1335799 1369505 1397366 1419241 1434803 1444014 1447575 1446541 1441568 1433036 1421835
50951 1421835 1409328 1396340 1382868 1369201 1356622 1346278 1337758 1329462 1320177 1309581 1297370 1282748
50939 1282748 1264979 1243859 1219375 1191334 1159617 1124547 1086736 1046745 1004893 961286 916108
50928 916108 870086 824543 780598 738442 697829 659131 623295 590755 561088 533959 509661
50917 509661 488420 469824 453483 439618 428306 418629 409435 400727 393502 388235 384314 381028 378356
50904 378356 376453 375023 373642 372299 371213 370413 369908 370006 371022 372705 374359 375561 376581 378082 380621
50889 380621 384429 389493 395656 402663 410133 417675 425177 433037 441866 451874 462740 474202 486522
50876D86522J3622J5027J6364J7979K0082K2211K3975K6004K9406L4262L9409
50865G44863M4016M8787N5028O2826P0917P8314Q5365R2928J01007J08740J15494
50854A608285J21369J26564J30723J33118J33199J30620J24982J15972J03832
50845B728664Q9421P3664N6969L9404K1349L889j1529k3951l3299l9902m3680
50834B860999m4109m1103l5707k9552k3644j8079j2944r161q064j0285j5350k2349
50822B590652l0750m0423n1153o2319p3193q3325r2523j00423j06307j09565j10268
50811A730403j09044j06352j02110r6231q9137q1519p3781o6077n8740n2211m6451
50800H48750m0898l5236k9838k5220k1327j7819j4779j2647j1382j0162q255n894
$$ plain form
50876 486522 500144 515171 531535 549514 569596 591807 615782 641786 671192 705454 744863
50865 744863 788879 837666 892694 955520 1026437 1104751 1190116 1283044 1384051 1492791 1608285
50854 1608285 1729654 1856218 1986941 2120059 2253258 2383878 2508860 2624832 2728664
50845 2728664 2818085 2891749 2948718 2988122 3009471 3013360 3001831 2977880 2944581 2904679 2860999
50834 2860999 2816890 2775787 2740080 2710528 2686884 2668805 2655861 2646700 2638636 2628351 2613001 2590652
50822 2590652 2559902 2519479 2468326 2406007 2332814 2249489 2156966 2056543 1950236 1840671 1730403
50811 1730403 1621359 1515007 1412897 1316666 1227529 1146010 1072229 1006152 947412 895201 848750
50800 848750 807852 772616 742778 717558 696231 678412 663633 650986 639604 629442 621187 615293
50788F15293l988l021k585k049j461j486k500l987n005n164m935n031n634o309
50774E62138o562o324n893n504n017m148k963j924j304p50K67J732L173M430N795
50759E37146P339Q701R820J1258J3373J5699J7733J9909K2936K6480K9488L1857
50747G51739L4824L9380M5071N0792N6126O1375O6760P2138P7236Q1662Q5020
50736A422123Q7313Q8885Q9548Q8116Q3460P5720O5992N4997M2690K9017J4399
50725B142260n60j5141k8196l8413m5234m9087n0557m9679m6395m1187l4958k8404
50713A714449k1933j6024j1327q335p190p832j0357j4980k1602k9451l7445m4978
50701A482995n2061n8481o3285o5624o5834o5031o3679o1277n7500n2872m8034
$$ plain form
50788 615293 611305 608284 605699 603650 602189 600703 598203 594216 589211 584047 579112 574081 568447 562138
50774 562138 555576 549252 543359 537855 532838 528690 525727 523803 522499 521749 522016 523748 526921 531351 537146
50759 537146 544485 553186 563006 574264 587637 603336 621069 640978 663914 690394 719882 751739
50747 751739 786563 825943 871014 921806 977932 1039307 1106067 1178205 1255441 1337103 1422123
50736 1422123 1509436 1598321 1687869 1775985 1859445 1935165 2001157 2056154 2098844 2127861 2142260
50725 2142260 2141700 2126559 2098363 2059950 2014716 1965629 1915072 1865393 1818998 1777811 1742853 1714449
50713 1714449 1692516 1676492 1665165 1656830 1649640 1641808 1631451 1616471 1594869 1565418 1527973 1482995
50701 1482995 1430934 1372453 1309168 1243544 1177710 1112679 1049000 987723 930223 877351 829317
50690H29317m3024l7782l2821k8740k5438k2367j9308j6346j3292r780n955k535
50678E71929j8J731L154M493N725O722P424Q025Q846R777J0086R217P696O701
50664F61508O644O779O421N980O310P433Q475Q845Q976R759J1550J3912J6215
50651G78807J8250K0267K2548K5132K7876L0606L3089L5068L6472L7508L8313
50640A103936L8604L7966L6372L4197L1685K8720K5229K1520J8003J4803J1804
50629A402839Q947O372M401L411L537M387N374O360P716R548J1175J1703J0904
50616A496674R191O918M129R77k017m352n969p247q698j0716j3490j7009k1100
50603A427291k5439k9582l3243l6637m0227m3951m7000m8690m9208m9105m8313
$$ plain form
50690 829317 786293 748511 715690 686950 661512 639145 619837 603491 590199 580419 574464 571929
50678 571929 571911 573642 576796 581289 587014 593736 601160 609185 618031 627808 637894 647111 654807 661508
50664 661508 668152 674931 681352 687332 693642 701075 709550 718395 727371 737130 748680 762592 778807
50651 778807 797057 817324 839872 865004 892880 923486 956575 991643 1028115 1065623 1103936
50640 1103936 1142540 1180506 1216878 1251075 1282760 1311480 1336709 1358229 1376232 1391035 1402839
50629 1402839 1411786 1418158 1422559 1425970 1429507 1433894 1439268 1445628 1453344 1462892 1474067 1485770 1496674
50616 1496674 1505865 1512783 1516912 1517889 1515872 1511520 1505551 1498304 1489606 1478890 1465400 1448391 1427291
50603 1427291 1401852 1372270 1339027 1302390 1262163 1218212 1171212 1122522 1073314 1024209 975896
50592I75896m6392m3565m0759l8426l6084l3302l0475k8062k5653k2520j8746
50581F11912j5161j2193r497o733m108j962k48J340K941M536O079P504Q778R987
50567F03175J1219J2291J2925J3318J4192J5987J8150J9625J9908J9446J9049
50556G79285J9129J9517J9731J9386J8515J7614J7210J7326J7478J7322J7119
50545I79632J7436J8463J9912K1574K3645K6315K9276L2023L4599L7645M1565
50534A282085M5963N0196N4214N8468O3017O7186P0239P2064P2919P2676P0634
50523A979661O6179N9442N1216M2321L3066K3288J2725J387j0338k1741l2111
50512B205095m1137m8975n5676o0663o3078o2743o0379n6743n1818m5263l7380
$$ plain form
50592 975896 929504 885939 845180 806754 770670 737368 706893 678831 653178 630658 611912
50581 611912 596751 584558 575061 568328 564220 562258 562010 563350 566291 570827 576906 584410 593188 603175
50567 603175 614394 626685 639610 652928 667120 683107 701257 720882 740790 760236 779285
50556 779285 798414 817931 837662 857048 875563 893177 910387 927713 945191 962513 979632
50545 979632 997068 1015531 1035443 1057017 1080662 1106977 1136253 1168276 1202875 1240520 1282085
50534 1282085 1328048 1378244 1432458 1490926 1553943 1621129 1691368 1763432 1836351 1909027 1979661
50523 1979661 2045840 2105282 2156498 2198819 2231885 2255173 2267898 2269285 2258947 2237206 2205095
50512 2205095 2163958 2114983 2059307 1998644 1935566 1872823 1812444 1755701 1703883 1658620 1621240
50501A621240k9149k1376j4107o990L1O392J1296J4489J6679J8877K1096K2088
50489A660566K0608J6575J0505K405p893j9553l0962m1236n0567n8821o4904o8083
50477A368640o9061o8981o7966o5433o1448n6796n1984m6984m1903l7153l2901
50466G68030k8901k4928k0948j6906j2806r009n968l672j696K72K332M622P090
50453F57512R205J0501J1381J2765J4829J6828J8232J9362K0649K1905K2753K3154
50441H59076K3130K2532K1537K0895K1018K1185K0331J8451J6547J5266J4276
50430A074244J3106J1941J1195J0714R975Q942Q274Q572R718J1186J2714J4395
50418A204976J6230J8031J9821K1920K4310K6321K7202K6895K5840K4235K1898
$$ plain form
50501 1621240 1592091 1570715 1556608 1549618 1549649 1556041 1567337 1581826 1598505 1617382 1638478 1660566
50489 1660566 1681174 1697749 1708254 1710659 1702766 1683213 1652251 1611015 1560448 1501627 1436723 1368640
50477 1368640 1299579 1230598 1162632 1097199 1035751 978955 926971 879987 838084 800931 768030
50466 768030 739129 714201 693253 676347 663541 654532 648564 644892 643196 643468 645800 650422 657512
50453 657512 666717 677218 688599 701364 716193 733021 751253 770615 791264 813169 835922 859076
50441 859076 882206 904738 926275 947170 968188 989373 1009704 1028155 1044702 1059968 1074244
50430 1074244 1087350 1099291 1110486 1121200 1131175 1140117 1148391 1156963 1166681 1177867 1190581 1204976
50418 1204976 1221206 1239237 1259058 1280978 1305288 1331609 1358811 1385706 1411546 1435781 1457679
50407A457679J8758J5017J0768N864K18o093j2980k0292k7559l4193l9968m4964
50395A322255m9091n2079n3892n4627n4021n1653m7823m3524l9355l4986k9998
50384H11206k4624j9291j3955q415k924K043O283R821J2694J5123J7411J9224
50372H24596J9436J7297J3455R214N071N95m497r810j4713j8767k1698k3466k4347
50359G72366k4562k4003k2654k1002j9543j8094j6241j4208j2658j1691j0786
50348E76924r648q505p532o631n823n225m574l489k180j194m12R20K966M980O462
50333E37039P792R236J0232J0286R979J0277J1309J2433J3222J3758J4211J4670
50321F74444J5142J5339J4801J3649J2742J2580J2466J1483R863Q636Q125P723
$$ plain form
50407 1457679 1476437 1491454 1502222 1508086 1508304 1502211 1489231 1468939 1441380 1407187 1367219 1322255
50395 1322255 1273164 1221085 1167193 1112566 1058545 1006892 959069 915545 876190 841204 811206
50384 811206 786582 767291 753336 744921 741997 744040 750323 760144 772838 787961 805372 824596
50372 824596 844032 861329 874784 883998 889069 889664 885167 875357 860644 841877 820179 796713 772366
50359 772366 747804 723801 701147 680145 660602 642508 626267 612059 599401 587710 576924
50348 576924 567276 558771 551239 544608 538785 533560 528986 525497 523317 522123 521711 522631 525597 530577 537039
50333 537039 544831 554067 564299 574585 584564 594841 606150 618583 631805 645563 659774 674444
50321 674444 689586 704925 719726 733375 746117 758697 771163 782646 792509 801145 809270 816993
50309H16993P007O209N496M666L723L004K474J655N32j79j44j77j273l366n585
50294H41035p377q753r711j0201j0632j1759j3771j5896j7127j7200j6645j6125
50282F85838j5887j5813j5768j5767j5755j5372j4196j2298j0366r093q567q331
50270E28625p854o782n020k943j367q98j263j611j392o98K21J245K138K573K611
50255E07585K742L157L473L462L617M356N158N175M481L918L750L334K283J054
50241E57545Q5q77j988k706k676k697l779n487o248n363l833k960k953l271l572
50226E09220l742l480k581j463q28p76p06q0R80J938K446K679L111M006M962N222
50210E20908M521L467K850K746K579J997J298R57R72Q49J62r51j808j907j573
$$ plain form
50309 816993 824000 830209 835705 840371 844094 847098 849572 851227 851759 851580 851436 851259 849986 846620 841035
50294 841035 833658 824905 815194 804993 794361 782602 768831 752935 735808 718608 701963 685838
50282 685838 669951 654138 638370 622603 606848 591476 577280 564982 554616 545523 536956 528625
50270 528625 520771 513989 508969 506026 504659 503761 502498 500887 499495 498797 499018 500263 502401 504974 507585
50255 507585 510327 513484 516957 520419 524036 528392 533550 538725 543206 547124 550874 554208 556491 557545
50241 557545 557630 556753 554765 552059 549383 546686 542907 537420 531172 525809 521976 519016 516063 512792 509220
50226 509220 505478 501998 499417 497954 497126 496350 495644 495564 496544 498482 500928 503607 506718 510724 515686 520908
50210 520908 525429 528896 531746 534492 537071 539068 540366 541323 542295 543144 543306 542355 540547 538640 537067
50195E37067j737k817m114m729m831n421o825q113q334p709p131o849o392n623
50181D56442n112n213n388m829l493k114j393j425j891k416k774k953l176l666
50167D10599m421n244n968o495o640o178n159l968k987k366k148k374k899l277
50153C50475l125k531j894j515j487j885k638l254l119k263j479j366j558j248
50139C21113l72L16L10J03N19J599K568K800K492K297K623L398M276M875M979
50124C53896M830M995N758O667P013O726O403O454O647O597O336O001N429M471
50110D38223L501L046L044K989K753K695K869K687J678K33q24j088p45j70L48
50095D61239O26P27J003J714K723L742M688N533O007N931N699N987O897P850Q368
$$ plain form
50195 537067 535330 532513 528399 523670 518839 513418 506593 498480 490146 482437 475306 468457 462065 456442
50181 456442 451330 446117 440729 435900 432407 430293 428900 427475 425584 423168 420394 417441 414265 410599
50167 410599 406178 400934 394966 388471 381831 375653 370494 366526 363539 361173 359025 356651 353752 350475
50153 350475 347350 344819 342925 341410 339923 338038 335400 332146 329027 326764 325285 323919 322361 321113
50139 321113 320741 321057 321367 321470 321989 323588 326156 328956 331448 333745 336368 339766 344042 348917 353896
50124 353896 358726 363721 369479 376146 383159 389885 396288 402742 409389 415986 422322 428323 433752 438223
50110 438223 441724 444770 447814 450803 453556 456251 459120 461807 463485 463718 462894 461806 461061 460891 461239
50095 461239 461865 462592 463595 465309 468032 471774 476462 481995 488002 493933 499632 505619 512516 520366 528734
50080E28734Q520Q523Q340Q021P966Q433R005R032Q527Q168Q377Q801Q789Q138
50066F47374P219O620O773P694Q933R851J0112R805R160Q353P688P578Q088Q634
50052G63882Q493P561O350N268M182K763R64q99k431l368l775m066m672n553o181
50037G68518o209n895n717n723n595n218m826m546m116l240j982o15Q02K512M693
50022G22843P272R996J2582J4749J6328J7442J8346J9035J9123J8358J7022J5590
50010I08686J4189J2771J1715J1564J2017J1810J0101P491N152L217P42k974p753
49997I98728j3177j8959k4554k9134l2350l4534l5845l5897l4657l2966l1501
49986F75154k9820k7278k4384k2245k0878j9138j6506j3917j2435j1859j1160
$$ plain form
50080 528734 537254 545777 554117 562138 570104 578537 587542 596574 605101 613269 621646 630447 639236 647374
50066 647374 654593 661213 667986 675680 684613 694464 704576 714381 723541 731894 739582 747160 755248 763882
50052 763882 772375 779936 786286 791554 795736 798499 799463 798564 796133 792765 788990 784924 780252 774699 768518
50037 768518 762309 756414 750697 744974 739379 734161 729335 724789 720673 717433 715451 714836 715638 718150 722843
50022 722843 730115 740111 752693 767442 783770 801212 819558 838593 857716 876074 893096 908686
50010 908686 922875 935646 947361 958925 970942 982752 992853 1000344 1005496 1008713 1009455 1006481 998728
49997 998728 985551 966592 942038 912904 880554 846020 810175 774278 739621 706655 675154
49986 675154 645334 618056 593672 571427 550549 531411 514905 500988 488553 476694 465534
49975D65534r803q127o695n763n305n155n097m956m669m315m069m068m148l857
49961C89507l043k261k276l151m170m672m594m258l943l760l617l245k599k065
49947C41853j905j732j066l67o01j694k297j469J52J334J763J954K264K686L197
49932C44072L683L797L470L249L528L840L567L045L059L546L712L424L466M191
49918C93649M828M621L997L972M869O116P098P794Q729J0586J3692J7587K1281
49905E08819K4059K5991K7521K8905L0116L0980L1144L0233K8354K6253K4621
49894H16996K3423K2220K1003K0285K0420K1138K1818K1871K0831J8400J4622
49883A043027R838M385j603p988j4409k0393k5531k9533l2262l3901l4934l5667
$$ plain form
49975 465534 455731 447604 440909 435146 429841 424686 419589 414633 409964 405649 401580 397512 393364 389507
49961 389507 386464 384203 381927 378776 374606 369934 365340 361082 357139 353379 349762 346517 343918 341853
49947 341853 339948 338216 337150 336783 336182 334488 332191 330722 330874 332208 333971 335925 338189 340875 344072
49932 344072 347755 351552 355022 358271 361799 365639 369206 372251 375310 378856 382568 385992 389458 393649
49918 393649 398477 403098 407095 411067 415936 422052 429150 436944 445673 456259 469951 487538 508819
49905 508819 532878 558869 586390 615295 645411 676391 707535 737768 766122 792375 816996
49894 816996 840419 862639 883642 903927 924347 945485 967303 989174 1010005 1028405 1043027
49883 1043027 1052865 1057250 1055647 1047659 1033250 1012857 987326 957793 925531 891630 856696 821029
49871H21029l5947l5508l4510l3364l2068l0177k7593k5044k3308k2262k1060
49860E00188j9176j6901j4769j2893j1092r339p881o940o465o183n948n904o215
49847C70482o548o237n177m223m221m890n218m856m462m551m758m512l793k933
49833C04103k159j747k020k726k926k067q02r2L7J95M61M26K14M75J204J507Q84
49816B94967L5m1P24J592J947J696J054L86J22M13Q93J078R30Q49J100J440J422
49799C10607J011P79J270K247K841K701K580L409M996O205O467O491P284R017
49785C67905J1139J3180J4947J6332J7382J8468J9951K1578K2531K2229K0952
49774E66594J9548J8546J7666J6191J3896J1436R814R490J0123J1009J1567J1425
$$ plain form
49871 821029 785082 749574 715064 681700 649632 619455 591862 566818 543510 521248 500188
49860 500188 481012 464111 449342 436449 425357 416018 408137 401197 394732 388549 382601 376697 370482
49847 370482 363934 357697 352520 348297 344076 339186 333968 329112 324650 320099 315341 310829 307036 304103
49833 304103 301944 300197 298177 295451 292525 290458 289656 289564 289601 289796 290257 290683 290897 291372 292576 294083 294967
49816 294967 295002 294961 295685 297277 299224 300920 301974 302360 302482 302895 303788 304866 305796 306645 307745 309185 310607
49799 310607 311618 312397 313667 315914 318755 321456 324036 327445 332441 338646 345113 351604 358888 367905
49785 367905 379044 392224 407171 423503 440885 459353 479304 500882 523413 545642 566594
49774 566594 586142 604688 622354 638545 652441 663877 673691 683181 693304 704313 715880 727305
49762G27305J0325Q105M640j10n875j1959j7594k2380k6165k8646k9556k9166
49750E78924k8144k6759k4714k1933j8995j6505j4377j2219j0053q226o812n588
49738C84599m574m064m102m236l984l298k555k183k283k445k033q99K70O40K38
49723C49091j10Q8L68J16m58o21j61L58M71L38K67J72j39m08k28K31L49r7o27
49704C49000p49m89l7O29J413J788J398P39O70J275J742J471Q10M42M37K78k68
49687C60549p18m44M20R45M63n30q97l35K20p5p33o50K73R95Q19L01L61J039J538
49668C63541J244L73k73j25N64J026R72J013J692K469K335J311M92M98P29M99
49652C78360Q3M7K52K30R0K27M44J37o84j321j332j027q65q15n01L08J514K653
$$ plain form
49762 727305 737630 745735 750375 750265 744390 732431 714837 692457 666292 637646 608090 578924
49750 578924 550780 524021 499307 477374 458379 441874 427497 415278 405225 396999 390187 384599
49738 384599 380025 375961 371859 367623 363639 360341 357786 355603 353320 350875 348842 347943 348213 348853 349091
49723 349091 348981 349069 349437 349553 349095 348474 348313 348671 349142 349480 349747 349919 349780 349372 349144 349375 349724 349627 349000
49704 349000 348251 347762 347725 348354 349767 351555 352953 353692 354362 355637 357379 358850 359660 360102 360539 360817 360549
49687 360549 359831 359387 359807 360752 361215 360685 359788 359453 359673 359598 358865 358215 358488 359483 360302 360603 360964 362003 363541
49668 363541 364785 365158 364885 364760 365324 366350 367322 368335 370027 372496 374831 376142 376634 377132 377861 378360
49652 378360 378443 378490 378742 378972 379062 379289 379733 379870 379186 377865 376533 375506 374641 373826 373325 373633 375147 377800
49634C77800L140K711J760R85P26Q41J123J545K062K460K478K008J149K71n6M79
49618D01482J534K357K517K247K090K380L095M010M867N467N709N625N437N473
49604D54290N915O552O978P097P239P670Q184Q425Q410Q488Q856R364R761R980
49590E67209J0181J0608J1397J2409J3347J4105J4861J5759J6684J7494J8303
49579G22357J9346K0670K2057K3183K3799K3958K4155K4927K6214K7420K8316
49568I86402K9392L0949L2256L2346L1482L1108L2163L3966L5057L4793L3791
49557A343705L3024L2758L2378L1084K8715K5858K3187K0770J8147J4978J1430
49546A616034P947M801J927q74l658o266q591j0777j2880j4468j4912j4195j3081
$$ plain form
49634 377800 380940 383651 385411 386396 387122 387963 389086 390631 392693 395153 397631 399639 400788 401059 401003 401482
49618 401482 403016 405373 407890 410137 412227 414607 417702 421712 426579 432046 437755 443380 448817 454290
49604 454290 460205 466757 473735 480832 488071 495741 503925 512350 520760 529248 538104 547468 557229 567209
49590 567209 577390 587998 599395 611804 625151 639256 654117 669876 686560 704054 722357
49579 722357 741703 762373 784430 807613 831412 855370 879525 904452 930666 958086 986402
49568 986402 1015794 1046743 1078999 1111345 1142827 1173935 1206098 1240064 1275121 1309914 1343705
49557 1343705 1376729 1409487 1441865 1472949 1501664 1527522 1550709 1571479 1589626 1604604 1616034
49546 1616034 1623981 1628782 1630709 1629835 1626177 1619911 1611320 1600543 1587663 1573195 1558283 1544088 1531007
49533A531007j2188j1325r997q241o430m598k479r4K251M569P195J0064J2521
$$ plain form
49533 1531007 1518819 1507494 1497497 1489256 1482826 1478228 1475749 1475655 1477906 1482475 1489670 1499734 1512255
$$ [...]
##END NTUPLES=NMR SPECTRUM
##END=
