##TITLE=NES1096_ptc160_9887142_hUvvo9x89L
##JCAMPDX= 6.0         $$ Bruker NMR JCAMP-DX V2.0
##DATA TYPE= NMR SPECTRUM
##DATA CLASS= NTUPLES
##ORIGIN= BRUKER
##OWNER= Administrator
$$ 1.72 TOPSPIN		Version 2.1
$$ 2016-08-28 14:26:02.164 -0500  Administrator@X
$$ Compression mode = diff/dup
##.OBSERVE FREQUENCY= 400.02188249412
##.OBSERVE NUCLEUS= ^1H
##.ACQUISITION MODE= SIMULTANEOUS (DQD)
##.ACQUISITION SCHEME= undefined
##.AVERAGES= 8
##.DIGITISER RES= 22
##SPECTROMETER/DATA SYSTEM= spect
##.PULSE SEQUENCE= zg30
##.SOLVENT NAME= COFFEE_meoh
##.SHIFT REFERENCE= INTERNAL, COFFEE_meoh, 1, 14.98509
##AUDIT TRAIL= $$ (NUMBER, WHEN, WHO, WHERE, PROCESS, VERSION, WHAT)
$$ ##TITLE= Audit trail, TOPSPIN		Version 2.1
$$ ##JCAMPDX= 5.01
$$ ##ORIGIN= Bruker BioSpin GmbH
$$ ##OWNER= Administrator
$$ $$ E:\/data/COFFEE/nmr/NES1096_ptc160_9887142_hUvvo9x89L/10/pdata/1/auditp.txt
$$ ##AUDIT TRAIL=  $$ (NUMBER, WHEN, WHO, WHERE, PROCESS, VERSION, WHAT)
(   1,<2016-08-28 14:25:54.867 -0500>,<Administrator>,<X>,<go>,<TOPSPIN 2.1>,
      <created by zg
	started at 2016-08-28 14:24:48.508 -0500,
	POWCHK enabled, PULCHK disabled,
       configuration hash MD5:
       21 0F 79 D6 B3 7B B4 F6 88 20 88 DB 03 48 BD 9F
       data hash MD5: 64K
       57 BA 4C FD DD FD 3A CF 29 3A 8F E1 90 F1 3B CF>)
(   2,<2016-08-28 14:25:57.992 -0500>,<Administrator>,<X>,<proc1d>,<TOPSPIN 2.1>,
      <Start of raw data processing
       efp LB = 0 FT_mod = 6 PKNL = 1 PHC0 = 0 PHC1 = 0 SI = 32K 
       data hash MD5: 32K
       8F C8 1D 8C 3B 0D A5 F7 1B E7 FD 3F 5C BA 50 97>)
(   3,<2016-08-28 14:25:58.289 -0500>,<Administrator>,<X>,<proc1d>,<TOPSPIN 2.1>,
      <pk PHC0 = 94.0155 PHC1 = 0 
       data hash MD5: 32K
       93 97 D8 C2 AA 8E BE D8 C6 9C 39 5F 69 31 9D 23>)
(   4,<2016-08-28 14:25:58.398 -0500>,<Administrator>,<X>,<proc1d>,<TOPSPIN 2.1>,
      <abs ABSG = 1 
       data hash MD5: 32K
       0A 8B AE DC E2 0C AE F5 63 DA EF 25 4D 6C 8F 67>)
(   5,<2016-08-28 14:25:58.461 -0500>,<Administrator>,<X>,<proc1d>,<TOPSPIN 2.1>,
      <abs ABSG = 2 
       data hash MD5: 32K
       7E 8D 70 E0 3C 4D CA E8 C8 7B E8 3B FB F4 F6 B9>)
(   6,<2016-08-28 14:25:58.523 -0500>,<Administrator>,<X>,<proc1d>,<TOPSPIN 2.1>,
      <abs ABSG = 3 
       data hash MD5: 32K
       43 73 A5 25 DD B3 52 ED BB 27 20 27 C7 A4 14 66>)
(   7,<2016-08-28 14:25:58.586 -0500>,<Administrator>,<X>,<proc1d>,<TOPSPIN 2.1>,
      <abs ABSG = 4 
       data hash MD5: 32K
       E6 8D 7C 39 0C 72 36 27 C1 08 5C 47 89 E3 86 2B>)
(   8,<2016-08-28 14:25:58.648 -0500>,<Administrator>,<X>,<proc1d>,<TOPSPIN 2.1>,
      <abs ABSG = 5 
       data hash MD5: 32K
       05 C4 B7 05 8F 85 F4 69 AC 40 84 85 F1 9E 0A 9C>)
$$ ##END=
$$ 
$$ $$ hash MD5
$$ $$ 1B 64 BD E5 52 E9 BE 87 67 AE B1 A8 B4 2A 30 8C
##$RELAX= 
##$RELAX= 
##$RELAX= 
##$RELAX= 
##$RELAX= 
##$RELAX= 
##$RELAX= 
$$ Bruker specific parameters
$$ --------------------------
##$DU= <E:\>
##$EXPNO= 10
##$NAME= <NES1096_ptc160_9887142_hUvvo9x89L>
##$PROCNO= 1
$$ [...]
##$TP= (0..7)
150 150 150 150 150 150 150 150
##$TP07= 0
##$TPNAME0= <>
##$TPNAME1= <>
##$TPNAME2= <>
##$TPNAME3= <>
##$TPNAME4= <>
##$TPNAME5= <>
##$TPNAME6= <>
##$TPNAME7= <>
##$TPOAL= (0..7)
0.5 0.5 0.5 0.5 0.5 0.5 0.5 0.5
##$TPOFFS= (0..7)
0 0 0 0 0 0 0 0
##$TUNHIN= 0
##$TUNHOUT= 0
##$TUNXOUT= 0
##$USERA1= <user>
##$USERA2= <user>
##$USERA3= <user>
##$USERA4= <user>
##$USERA5= <user>
##$V9= 5
##$VALIST= <valist>
##$VCLIST= <CCCCCCCCCCCCCCC>
##$VD= 0
##$VDLIST= <DDDDDDDDDDDDDDD>
##$VPLIST= <PPPPPPPPPPPPPPP>
##$VTLIST= <TTTTTTTTTTTTTTT>
##$WBST= 2048
##$WBSW= 25
##$XGAIN= (0..3)
0 0 0 0
##$XL= 0
##$YL= 0
##$YMAX_a= 601429
##$YMIN_a= -511215
##$ZGOPTNS= <>
##$ZL1= 120
##$ZL2= 120
##$ZL3= 120
##$ZL4= 120
##$ABSF1= 14.98509
##$ABSF2= -5.573092
##$ABSG= 5
##$ABSL= 3
##$ALPHA= 0
##$AQORDER= 0
##$ASSFAC= 0
##$ASSFACI= 0
##$ASSFACX= 0
##$ASSWID= 0
##$AUNMP= <proc_prof1d_extract_pilot.lims>
##$AXLEFT= 0
##$AXNAME= <>
##$AXNUC= <1H>
##$AXRIGHT= 0
##$AXTYPE= 0
##$AXUNIT= <>
##$AZFE= 0.1
##$AZFW= 0.1
##$BCFW= 0
##$BC_mod= 0
##$BYTORDP= 0
##$COROFFS= 0
##$CY= 15
##$DATMOD= 1
##$DC= 0
##$DFILT= <>
##$DTYPP= 0
##$F1P= 0
##$F2P= 0
##$FCOR= 0.5
##$FTSIZE= 32768
##$FT_mod= 6
##$GAMMA= 0
##$GB= 0
##$INTBC= 1
##$INTSCL= 1
##$ISEN= 128
##$LB= 0
##$LEV0= 0
##$LPBIN= 0
##$MAXI= 10000
##$MC2= 0
##$MEAN= 0
##$ME_mod= 0
##$MI= 0
##$NCOEF= 0
##$NC_proc= -8
##$NLEV= 6
##$NOISF1= 0
##$NOISF2= 0
##$NSP= 0
##$NTH_PI= 0
##$NZP= 0
##$OFFSET= 14.98509
##$PC= 1
##$PHC0= 94.0155
##$PHC1= 0
##$PH_mod= 1
##$PKNL= yes
##$PPARMOD= 0
##$PPDIAG= 0
##$PPIPTYP= 0
##$PPMPNUM= 2147483647
##$PPRESOL= 1
##$PSCAL= 4
##$PSIGN= 0
##$PYNMP= <proc.py>
##$REVERSE= no
##$SF= 400.02
##$SI= 32768
##$SIGF1= 0
##$SIGF2= 0
##$SINO= 400
##$SIOLD= 32768
##$SPECTYP= <>
##$SREGLST= <1H.CDCl3>
##$SSB= 0
##$STSI= 32768
##$STSR= 0
##$SW_p= 8223.68421052631
##$SYMM= 0
##$S_DEV= 0
##$TDeff= 65536
##$TDoff= 0
##$TI= <>
##$TILT= no
##$TM1= 0
##$TM2= 0
##$TOPLEV= 0
##$USERP1= <user>
##$USERP2= <user>
##$USERP3= <user>
##$USERP4= <user>
##$USERP5= <user>
##$WDW= 1
##$XDIM= 32768
##$YMAX_p= 442858470
##$YMIN_p= -701438
##$CURPLOT= <Network HP LaserJet P1505>
##$CURPRIN= <$Network HP LaserJet P1505>
##$DFORMAT= <normdp>
##$LAYOUT= <+/1D_H.xwp>
##$LFORMAT= <normlp>
##$PFORMAT= <normpl>
##$SURQMSG= 1
$$ End of Bruker specific parameters
$$ ---------------------------------
##NTUPLES= NMR SPECTRUM
##VAR_NAME=  FREQUENCY,     SPECTRUM/REAL,   SPECTRUM/IMAG
##SYMBOL=    X,             R,               I
##VAR_TYPE=  INDEPENDENT,   DEPENDENT,       DEPENDENT
##VAR_FORM=  AFFN,          ASDF,            ASDF
##VAR_DIM=   32768,         32768,           32768
##UNITS=     HZ,            ARBITRARY UNITS, ARBITRARY UNITS
##FACTOR=    0.250966925370066, 1,           1
##FIRST=     8223.43324360094, -10988,       2289
##LAST=      0,             86885,           -144607
##MIN=       0,             -701438,         0
##MAX=       8223.43324360094, 442858470,    0
$$ Real data points
##PAGE= N=1
##DATA TABLE= (X++(R..R)), XYDATA
$$ [...]
$$ plain form
19563 -90839 239042 68090 -191030 134865 37625 -274513 -250836 -91766 -260767 -190770 270402
19551 -55549 53987 24014 185092 -139071 22219 -67925 -272442 -173552 -274076 -1439 -228743
19540 -228743 -67682 -109430 17254 -161984 -123319 -431000 -78919 -83425 128051 65624 -22123
19528 204206 202852 -297339 -255093 -152478 -53448 185715 165645 -279511 45381 19959 -156467
19516 53897 241731 81523 -156482 -128660 -306195 -27939 -302096 -76920 -599 -13771 307191
19504 75544 -57191 -129297 -221130 135412 86838 3067 -154186 325150 45772 -39049 68288
19492 18111 351049 120759 -57220 36621 -13009 5455 -113242 -247484 137052 -76716 155737
19480 -158371 189695 -114844 -122059 3806 37878 -80213 -260561 106170 -48274 97379 194291
$$ packed form
19563i0839B39042F8090a91030A34865C7625b74513K3677i1766j69001O9997B70402
19551e5549E3987B4014J61078a39071B2219f7925k04517R8890j00524a439k27304
19540b28743f7682m1748A7254a61984L8665l07681g8919m506A28051o2427b2123
19528B04206j354b97339M2246J02615e3448A85715k0070b79511D5381A9959a56467
19516E3897J87834H1523a56482K7822j77535b7939k74157g6920e99j3172C07191
19504G5544e7191p2106r1833A35412m8574C067a54186C25150D5772c9049F8288
19492A8111L32938A20759e7220C6621a3009E455a13242j34242A37052g6716A55737
19480a58371A89695a14844p215C806L4072h0213j80348A06170d8274I7379R6912
$$ plain form
19469 194291 138843 72079 -234062 -313922 -264966 -184452 261951 189872 -232545 96637 -323467
19457 151116 -89062 -352454 -257389 25934 -174264 -155997 85870 258291 -56824 -165396 217976
19445 -272587 -490370 -34809 -129219 -56101 135915 -268074 -92520 -64930 -212820 -249346 -308616
19434 -308616 -66475 76469 -86645 122711 136329 204278 189171 -121384 -213500 -263043 189807
19422 47490 -103653 47577 -28245 -197250 -275226 18669 -183598 -62709 -77192 -162400 178806
19410 35795 -129988 -192569 -69830 -348659 14501 -195979 52148 164981 -189343 41765 -125389
19398 -63141 -120771 -162467 -352192 -174153 -211303 -110252 19100 104657 -172046 207262 62839
19386 -18037 -131693 5537 -59243 -32396 -182667 -354802 -87160 -99793 121622 -5256 -299631
$$ packed form
19469A94291n5448o6764b34062p9860M8956Q0514B61951p2079b32545I6637c23467
19457A51116h9062k63392R5065B5934a74264J8267H5870J72421e6824j08572B17976
19445b72587k17783c4809r4410e6101A35915b68074i2520K7590j47890l6526n9270
19434c08616f6475G6469h6645A22711J3618O7949j5107a21384r2116m9543A89807
19422D7490a03653D7577b8245j69005p7976A8669a83598f2709j4483q5208A78806
19410C5795a29988o2581f9830k78829A4501a95979E2148J12833a89343D1765a25389
19398f3141n7630m1696j89725a74153l7150J01051A9100Q5557a72046B07262F2839
19386a8037j13656E537e9243K6847j50271j72135h7160j2633A21622e256k94375
$$ plain form
19375 -299631 -231136 88684 127952 -5211 140658 -1312 5767 -238842 129708 204326 135986
19364 135986 -89032 45903 -557289 61901 -245601 -77075 121983 -231339 -101733 -272336
19354 -272336 -348558 -246929 205133 -166717 33720 -78145 -250816 -89812 -27526 97571 24213
19342 -207413 -159472 -271802 350225 -291443 26810 -137311 -222223 198814 40283 -419673
19331 23250 9580 -45782 58637 219494 -303913 -58555 57646 47030 63124 -4199 141069
19319 -44701 -37083 -100060 -286558 66977 -101340 -61854 -319575 789 -366504 89218 138877
19308 138877 -150657 -309684 79904 -141223 -335506 63934 -128199 242953 313683 -277288
19297 115114 -19787 14195 -158593 -164469 -3808 110674 93803 4861 68655 130471 14366 -74439
$$ packed form
19375b99631O8495H8684L9268e211A40658a312E767b38842A29708P4618o8340
19364A35986h9032D5903e57289F1901b45601g7075A21983b31339a01733j70603
19354b72336p6222J01629B05133a66717C3720g8145j72671h9812b7526I7571B4213
19342b07413M7941j12330C50225b91443B6810a37311q4912A98814D0283d19673
19331B3250I580d5782E8637J60857c03913e8555E7646j0616J6094d199A41069
19319d4701P618o2977j86498F6977a01340L9486k57721G89c66504H9218M9659
19308A38877a50657j59027G9904a41223j94283F3934a28199B42953P0730b77288
19297A15114a9787A4195a58593n876c808A10674j6871D861O3794O1816A4366g4439
$$ plain form
19284 -387961 -76531 214661 -300451 99252 -73825 -53414 -273504 18678 -75066 -95416 287173
19272 11513 -323677 -29316 -41380 -27177 5441 -374578 -37431 -347779 -325790 -235359 202821
19260 87010 -9673 -79086 27691 -155316 -20987 94753 130273 -235148 190676 40336 -104180
19248 -188970 -71990 217254 110836 110969 -73334 211577 6593 -275402 -48720 -182309 158107
19236 52776 -25929 -95548 -18577 -101141 -128179 -164713 -134047 -165811 -22957 -364119 -71590
19224 30845 51219 -320260 308042 -188151 84870 -331666 110559 -228914 -138309 66679
19213 -283332 -182861 80142 -356686 114455 -22353 242132 -41042 -308535 -326079 -189082
19203 -189082 -294081 -154746 99124 278375 -233981 -424116 -115068 -34780 75855 68305
$$ packed form
19284c87961g6531B14661c00451I9252g3825K0411k20090A8678g5066k0350B87173
19272A1513c23677b9316j2064J4203E441c74578c7431l10348K1989R0431B02821
19260H7010i673o9413B7691a55316b0987I4753L5520b35148A90676D0336a04180
19248a88970g1990B17254j06418J33g3334B11577F593b75402d8720j33589A58107
19236E2776b5929o9619a8577q2564k7038l6534L0666l1764b2957l41162g1590
19224C0845K0374c20260C08042a88151H4870c31666A10559b28914R0605F6679
19213b83332J00471H0142c56686A14455b2353B42132d1042k67493j7544J36997
19203a89082j04999J39335I9124J79251b33981j90135a15068c4780G5855p550
$$ plain form
19193 68305 -29597 -52924 27835 -97488 191490 96230 102545 -33331 -65053 -82976 215999
19181 35253 -5501 371989 134489 -84000 -57497 -255661 79897 86367 -216756 76326 -87424
19169 -41423 -1089 -380201 23759 237573 10845 -213125 -72974 -71257 -231637 -102561 124739
19157 -86555 -249635 21879 -3912 -46571 23861 424166 165318 -84499 -230847 -180365 -179494
19146 -179494 -56634 -111276 -35611 143383 -192108 -315498 23359 -126522 -192259 -97866 157328
19134 -18737 -264819 -7903 -25797 -85456 -274379 -65765 78009 -130560 -87414 60391 -125031
19122 -321260 110971 -149745 174373 44052 -138312 -48146 119734 -359834 -5714 -113088
19112 -113088 107651 33769 -209706 -144193 22557 -232591 -152472 -221168 -80441 124196 50985
$$ packed form
19193F8305b9597k3327B7835i7488A91490r5260O315c3331l1722j7923B15999
19181C5253e501C71989A34489h4000K6503j98164G9897O470b16756G6326h7424
19169d1423a089l79112B3759K13814A0845b13125g2974J717j60380a02561A24739
19157h6555j63080B1879c912m2659B3861M00305A65318h4499j46348N0482Q71
19146a79494e6634n4642c5611A43383a92108j23390B3359a26522o5737R4393A57328
19134a8737k46082g903j7894n9659j88923f5765G8009a30560M3146F0391a25031
19122c21260A10971a49745A74373D4052a38312d8146A19734c59834e714j07374
19112a13088A07651C3769b09706O5513B2557b32591Q0119o8696h0441A24196E0985
$$ plain form
19100 -166236 -46561 -163443 27070 -88107 -154838 -277661 373332 -287084 -90222 -80028 67148
19088 122182 -16677 92289 -27777 184330 27801 16372 -113610 11961 12474 2624 99164 -29602
19075 -121938 47824 170220 -116986 58380 -216389 259062 -355173 -63289 -128166 -147179
19065 -147179 -187900 -82630 -208550 -297746 -59394 258491 -103732 105419 -283363 -70338
19054 46411 -21516 100863 -167540 166698 353014 64836 148027 29658 -157574 -99216 -146871
19043 -146871 -9470 55735 -179599 -196318 -448780 -6429 -8835 -143614 -66920 -52491 -87620
19032 -87620 150558 -178323 100866 -23795 -12335 -100695 3630 121415 63106 -7175 -242219
19021 -242219 -154920 -129314 -31311 8462 266519 108463 151589 33617 -185416 236419 -136149
$$ packed form
19100a66236d6561j16882B7070h8107o6731j22823C73332b87084i0222J0194F7148
19088A22182a6677I2289b7777A84330B7801j1429a13610A1961N13B624R6540b9602
19075a21938D7824J22396a16986E8380b16389B59062c55173f3289o4877j9013
19065a47179m0721h2630j25920q9196e9394B58491a03732A05419b83363g0338
19054D6411b1516A00863a67540A66698J86316F4836Q3191B9658a57574N8358m7655
19043a46871i470E5735a79599j6719k52462f429k406j34779f6920J4429l5129
19032h7620A50558a78323A00866b3795J1460q8360C630J17785n8309g175k35044
19021b42219Q7299K5606c1311H462K58057A08463M3126C3617a85416B36419a36149
$$ plain form
19009 -48297 -183983 113662 -97828 -184282 -321196 -83058 320346 -190902 -1893 -14198 186921
18997 212272 -190455 79296 -230462 -134497 -128639 -40811 -183028 191591 -90469 -16507 -141918
18986 -141918 -9417 -94506 -49503 -262939 177873 145700 -195194 -78545 -173727 -226363 296207
18974 42554 121580 -484376 -16411 352585 -331482 7556 87592 6487 -130096 -222462 -14972
18962 -37243 -38755 86666 107502 108185 9086 -23360 -194248 121212 -318142 -173290 -213210 -20403
18949 -103064 -229333 -127957 -239985 -104596 -198560 -193514 -23504 248379 181784 -75757 -148882
18938 -148882 -29114 15732 -37018 -217998 -151376 -203969 16901 -29078 -103386 264131 -7900
18926 -58605 -40131 -289536 -380512 -4876 -199008 -228347 -28886 29323 -400614 -275652 69238
$$ packed form
19009d8297j35686A13662i7828q6454j36914h3058C20346a90902a893j2305A86921
18997B12272a90455G9296b30462R5965N858d0811j42217A91591i0469a6507j25411
18986a41918i417q5089M5003k13436A77873l2173a95194g8545r5182n2636B96207
18974D2554P9026d84376a6411C52585c31482G556Q0036F487a30096r2366a4972
18962c7243j512H6666K0836O83I086b3360j70888A21212c18142J44852l9920b0403
18949a03064j26269J01376j12028a04596r3964N046b3504B48379o6595g5757p3125
18938a48882b9114A5732c7018j80980O6622n2593A6901b9078p4308B64131g900
18926e8605J8474k49405r0976d876j94132k9339b8886B9323d00614J24962F9238
$$ plain form
18914 306425 35497 -54993 41905 -189886 -142762 93020 184181 103631 -109512 5202 96742
18903 96742 -84154 271971 190410 74475 -279565 121744 128466 -538862 90157 -52989 -58820
18892 -58820 229348 -204365 -252358 97286 32643 154103 166898 -211189 5017 -271484 -232599
18881 -232599 33370 200502 61222 -114919 58418 -265362 -11333 44488 -47313 -148563 -25665
18869 9210 8170 -148289 -152430 162824 63946 -80362 119138 92959 -18563 -31087 217776
18857 -90102 70364 -163609 -83017 -107007 -11039 -64624 12606 76453 172345 118242 85060
18846 85060 88945 178594 -287902 -321668 -48874 -124975 287140 -324995 18125 74343 6931
18834 58389 153745 -64207 81445 -112705 -99728 107431 -45943 98399 39887 -102302 67917
$$ packed form
18914C06425C5497e4993D1905a89886M7124I3020R1161q0550a09512E202R1540
18903I6742h4154B71971q1561G4475b79565A21744O722e38862I0157e2989n831
18892e8820B29348b04365m7993I7286C2643J21460J2795b11189E017b71484L8885
18881b32599C3370J67132F1222a14919E8418b65362a1333D4488d7313j01250b5665
18869I210j040a48289m141A62824F3946h0362A19138k6179a8563j2524B17776
18857i0102G0364a63609Q0592k3990a1039n3585A2606O3847R5892n4103l3182
18846H5060L885Q9649b87902l3766d8874p6101B87140c24995A8125N6218F931
18834E8389R5356f4207H1445a12705J2977A07431d5943I8399C9887a02302F7917
$$ plain form
18822 200284 28078 30387 64110 -77278 162112 -201799 -192895 126858 -87173 -53396 110252
18810 344048 302282 114987 -2970 -129161 -284288 381767 105690 -112168 114909 119998
18800 119998 -252635 214226 277613 -70238 -94295 -1314 -83715 133758 -72554 -162852 -25071
18788 -88102 -391498 21302 -347686 -221964 -38356 -315705 -4972 82780 -110669 -77330 -61290
18777 -61290 30360 -142217 -87558 111623 -88345 -156656 -251839 -65322 138412 -58390 -320732
18766 -320732 41536 -99748 61335 -107059 -143141 142485 -57581 -142171 120606 193994 -192684
18754 269915 54952 -161783 -18219 -370097 -6921 -249112 137556 -9472 -51727 12127 103088
18743 103088 -96641 146319 -208829 -251368 -143644 -157077 -279486 -146313 130207 178770
$$ packed form
18822B00284B8078K309L3723g7278A62112b01799Q904A26858h7173L3777A10252
18810C44048m1766A14987b970j26191j55127C81767A05690a12168A14909N089
18800A19998b52635B14226O3387g0238k4057a314q2401A33758g2554r0298b5071
18788h8102l03396B1302c47686J25722c8356k77349d972H2780a10669L3339J6040
18777f1290C0360a42217N4659A11623h8345o8311r5183f5322A38412e8390k62342
18766c20732D1536i9748F1335a07059l6082A42485e7581q4590A20606P3388a92684
18754B69915E4952a61783a8219l51878f921k42191A37556i472m2255A2127R0961
18743A03088i6641A46319b08829m2539J07724j3433j22409J33173A30207M8563
$$ plain form
18733 178770 -76945 -32268 896 -315976 77923 -277814 127961 62935 -44910 -88815 -152600
18722 -152600 -148635 285760 249453 4724 58440 -115348 -26014 -5535 -51525 12352 -51187 35376
18709 -53599 29235 75430 -76994 -448920 570 -57135 41607 -386617 -46605 -33915 -265158
18698 -265158 -50975 -347466 -152696 31272 -395585 -103945 -87696 136612 -10530 -252329
18688 -252329 -67231 96407 164237 -227924 151011 154620 158291 58729 -31690 -135167 -198162
18677 -198162 -87675 -197576 -77568 178981 95449 -304640 -297242 -185123 -222822 -109949 -140750
18666 -140750 -347847 94063 -2426 -20499 -237319 214806 -60891 -149601 251785 -333575 -138358
18654 308226 -100023 -110600 -72462 160685 89156 -115999 -417246 79814 50902 169175
$$ packed form
18733A78770g6945c2268H96c15976G7923b77814A27961F2935d4910m3905o3785
18722a52600L965B85760l6307D724N3716a15348b6014e535m5990A2352e1187C5376
18709e3599B9235M6195g6994l71926E70e7135D1607c86617d6605J2690k31243
18698b65158e0975k96491a52696C1272c95585a03945J6249A36612a0530k41799
18688b52329f7231I6407O7830b27924A51011L609L671E8729c1690j03477o2995
18677a98162h7675j09901g7568A78981q3532c04640P398J12119l7699a09949l0801
18666a40750k07097I4063b426j8073k16820B14806f0891q8710B51785c33575a38358
18654C08226a00023j0577L8138A60685p1529a15999l01247G9814k8912J18273
$$ plain form
18644 169175 -48241 -17480 -9671 -187855 -69123 -42558 34644 -269239 121408 -90503 2953
18632 110537 139512 -15412 142585 -113548 -19136 119443 -294026 -122204 -220698 -294844
18622 -294844 -204682 249346 210185 -434218 -307318 -584267 129542 64014 55614 -135976
18611 -187625 -179181 147002 -34292 279071 164082 261228 -143919 121557 46842 -170754
18600 86534 5845 -197083 346318 299819 -153334 168280 119212 -28284 -2033 26687 235921
18589 235921 -269446 18882 -83628 -498228 247154 -128640 123218 -248152 279025 -472571
18578 -280994 171675 62225 62109 175934 14381 -113974 -245414 258926 -45625 -83459 78914
18566 -205819 -53112 42147 -183250 -101091 -296692 51424 -82567 -106472 77483 -48892 13867
$$ packed form
18644A69175d8241a7480P809j78184f9123K6565C4644b69239A21408i0503B953
18632A10537K8975a5412A42585a13548a9136A19443b94026a22204r8494p4146
18622b94844R0162B49346l9161d34218J26900k76949A29542F4014q400a35976
18611a87625Q444A47002c4292B79071j14989R7146a43919A21557D6842a70754
18600H6534E845a97083C46318m6499a53334A68280m9068b8284b033B6687K09234
18589B35921b69446A8882h3628m14600B47154a28640A23218b48152B79025d72571
18578b80994A71675F2225j16J13825A4381a13974j31440B58926d5625l7834G8914
18566b05819e3112D2147a83250Q2159j95601E1424h2567k3905G7483d8892A3867
$$ plain form
18554 -86337 -165773 132515 -28829 82367 -28274 -237676 -72594 -161712 -69221 -154515 -215170
18543 -215170 241748 -224596 -78749 5622 165188 38279 163275 -275689 111057 -103683
18532 -132824 -12353 -23692 -85029 18515 -280499 -366914 122004 5493 -171101 214728 154
18520 -330359 193400 -56859 28425 -73070 -1595 -71954 -22355 -215968 134256 225241 145400
18509 145400 75888 122930 -9959 -41141 133428 47371 137246 -149612 81077 -7016 127733
18497 -259307 -102810 -102469 -80763 -78304 -361096 231602 -168387 -291232 1427 64017 -492818
18485 -39400 -81268 -186900 90719 97141 -420273 48218 -213169 -215063 -184795 95694 9038 65025
18473 65025 34028 196287 -29275 -92775 99018 72461 -154691 -120912 174872 180967 -220258
$$ packed form
18554h6337p9436A32515b8829H2367b8274k09402g2594q9118f9221q5294o0655
18543b15170B41748b24596g8749E622J59566C8279J24996b75689A11057a03683
18532a32824a2353j1339o1337A8515b80499q6415A22004E493a71101B14728A54
18520c30359A93400e6859B8425g3070a595p0359b2355j93613A34256R0985p9841
18509A45400o9512M7042i959l1182A33428D7371Q9875a49612H1077g016A27733
18497b59307a02810L41K1706K459k82792B31602a68387j22845A427O2590d92818
18485c9400m1868j05632I0719O422d20273D8218b13169j894L0268I5694I038N5987
18473F5025l0997J62259b9275o3500I9018k6557a54691L3779A74872O095b20258
$$ plain form
18461 92026 -185 -210672 -21026 -99986 -110100 -210923 120187 -148184 218881 95340 -82267
18449 106217 182466 109838 -92863 134955 -246332 -18800 -285026 17917 -234489 -312653 77619
18437 52284 -284486 -213625 447248 -50209 179231 -195926 175098 -197709 -97251 77296
18426 -20566 246092 -110387 -75618 -36792 -70622 -128350 -147863 4856 104000 -2939 -70074 -24399
18413 124259 52688 105179 -241756 44789 -251997 252867 177446 -28949 20436 -441523 44323
18401 -109871 -427194 126156 -64834 61861 -398761 159821 143046 -236406 88781 142378
18391 142378 78497 46328 -240739 49123 5711 -39358 -93626 229607 -257667 38184 253099
18380 253099 -60366 -81572 -347872 -135041 -216212 -170295 -296060 112876 -47604 -88150 332960
$$ packed form
18461I2026a85k10487b1026p8960j0114j00823A20187a48184B18881I5340h2267
18449A06217P6249p2628i2863A34955b46332a8800k66226A7917b34489p8164G7619
18437E2284b84486P0861D47248e0209A79231a95926A75098a97709i7251G7296
18426b0566B46092a10387L4769c6792l3830n7728j9513D856R9144b939o7135b4399
18413A24259E2688N2491b41756D4789b51997B52867p5421b8949B0436d41523D4323
18401a09871l17323A26156f4834F1861c98761A59821j6775b36406H8781N3597
18391A42378o3881l2169b40739D9123E711c9358n4268B29607b57667C8184K14915
18380B53099f0366k1206k66300a35041q1171M5917j25765A12876d7604m0546C32960
$$ plain form
18368 -250301 312742 -25874 -122026 18744 -176487 135505 -59488 -256309 186387 56727
18357 -17750 -77137 -351018 96972 228466 -58584 -192192 -25621 55081 -176951 -140296 237295
18345 62066 220694 -111318 -9342 -267436 -79380 -52174 -2340 19664 98762 105886 71211 -272388
18332 28338 30328 -411295 -81130 8117 -63623 -28240 -37441 -108333 46008 -26903 231441 60548
18319 -179461 20268 -21607 190753 -154272 -46025 -129231 62684 -36122 89472 132410 341591
18308 341591 218543 179485 272187 -153521 -323198 -284775 -266558 -172255 -85871 64704 -78179
18296 -175946 93815 245706 -140959 142680 -95826 -78199 -92908 248907 -274118 -268838 111854
18284 -64731 116671 -55400 47696 -147884 -369131 253060 -109463 -197428 65322 -132293
$$ packed form
18368b50301C12742b5874r6152A8744a76487A35505e9488j96821A86387E6727
18357a7750n9387k73881I6972J31494e8584j33608b5621E5081a76951L6655B37295
18345F2066J58628a11318i342k58094g9380K7206b340A9664P9098P124l4675b72388
18332B8338J990d11295h1130H117f3623b8240r201p0892D6008b6903B31441F0548
18319a79461B0268b1607A90753a54272d6025q3206F2684c6122H9472M2938K09181
18308C41591j23048l9058R2702a53521j69677L8423J8217R4303h5871F4704g8179
18296a75946I3815J51891a40959A42680i5826J7627j4709B48907b74118N280A11854
18284f4731A16671e5400D7696a47884k21247B53060a09463q7965F5322a32293
$$ plain form
18273 -36139 -209164 -295503 -7643 8809 -76127 290015 -88467 -414686 -305242 305132 32492
18261 -219790 189071 -76003 111271 -18563 7652 290834 -124037 249290 219931 -50395 195070
18249 -255098 132052 67907 264515 -138178 -112113 -237633 -233324 -13989 -91096 -184976 -55619
18237 291315 -299371 2153 205843 231937 -169445 -121230 286329 13732 -24262 -178637 -113013
18226 -113013 -138644 311826 -111601 -31172 -319120 -203184 62376 -328223 -193132 -253858
18216 -253858 1442 -29241 64198 -37812 -316435 116628 268370 167547 27588 -154485 -55627
18204 -279321 -71747 19698 174641 -185696 -131514 -76021 -254213 -32501 -90765 -135506 -141936
18193 -141936 26689 -1589 -204689 51564 97854 -35549 -71421 -300309 -79306 89690 154285
$$ packed form
18273c6139j73025q6339g643H809g6127B90015h8467l26219J09444C05132C2492
18261b19790A89071g6003A11271a8563G652K83182a24037B49290k9359e0395A95070
18249b55098A32052o4145J96608a38178K6065j25520M309a3989p7107r3880e5619
18237B91315b99371B153K03690K6094a69445M8215B86329A3732b4262j54375O5624
18226a13013k5631C11826a11601c1172k87948J15936F2376c28223J35091o0726
18216b53858A442b9241F4198c7812k78623A16628J51742j00823B7588a54485e5627
18204b79321g1747A9698J54943a85696N4182N5493j78192c2501n8264m4741o430
18193a41936B6689a589k03100E1564M6290c5549l5872k28888g9306H9690O4595
$$ plain form
18182 154285 77533 -160578 -140280 -439951 76688 159766 88348 8176 102104 144078 -259395
18170 209792 -119125 -96781 -37188 73941 -47124 -77730 99851 -254696 -301007 15217 -50496
18158 -216602 162053 71309 -126512 206191 -124505 42739 -234884 17822 175769 250877
18148 250877 143047 13522 222505 -418222 -198123 -231581 89637 -54076 -33481 -154718
18138 -154718 274436 128690 280404 145655 166194 13555 144576 22912 -44019 221697
18127 -214593 128876 -180227 -92232 128371 209080 -69383 169346 -74877 195311 555 104692
18116 104692 -235066 136501 225818 18192 246079 -174596 -221422 104383 -38899 -203271
18106 -203271 -176025 -164451 1300 -292176 -65511 -65331 -123088 -236604 121771 -38963 -243363
$$ packed form
18182A54285p6752a60578K0298k99671G6688Q3078p1418H176R3928M1974b59395
18170B09792a19125K2344c7188G3941d7124l0606I9851b54696m6311A5217e0496
18158b16602A62053G1309a26512B06191a24505D2739b34884A7822J57947P5108
18148B50877j07830A3522K08983d18222a98123l3458H9637e4076K0595j21237
18138a54718B74436A28690J51714j34749K0539A3555J31021B2912d4019B21697
18127b14593A28876a80227Q7995A28371Q0709f9383A69346g4877A95311E55J04137
18116A04692b35066A36501Q9317A8192K27887a74596m6826A04383c8899j64372
18106b03271K7246J1574A300b92176f5511J80n7757j13516A21771c8963k04400
$$ plain form
18095 -243363 -163059 111906 338054 27994 -124761 56997 -140756 -64495 83741 -248605
18084 109875 -52223 -54732 -156842 -42556 77031 135231 53236 55791 -156049 -209423 -260090
18073 -260090 148487 106157 -416724 83190 -146409 -230896 26391 -130026 118835 32332
18062 -103937 -15961 245642 -133095 -167391 -182977 -15581 -135013 -226945 -114780 -83868 32500
18050 -57497 -253853 -414089 37895 44539 58706 -192462 -161991 -126921 201703 -61371 34415
18038 104193 -82279 -107749 354557 22873 -10873 -189037 -176756 -12195 104535 49026 240939
18027 240939 -348556 236733 -174612 -146989 -545654 32072 -170810 -148201 -40830 246668
18016 -137174 211333 57745 -104512 8307 32006 -209507 -174993 68569 123576 180858 2721
$$ packed form
18095b43363Q0304A11906K26148B7994a24761E6997a40756f4495H3741b48605
18084A09875e2223k509j02110d2556G7031N8200E3236K555a56049n3374n0667
18073b60090A48487m2330d16724H3190a46409q4487B6391a30026A18835C2332
18062a03937a5961B45642a33095l4296j5586a5581j19432r1932J12165L0912C2500
18050e7497j96356j60236C7895O644J4167a92462L0471L5070B01703f1371C4415
18038A04193h2279k5470C54557B2873a0873j78164J2281a2195A04535D9026J91913
18027B40939c48556B36733a74612K7623l98665C2072a70810K2609d0830B46668
18016a37174B11333E7745a04512H307K3699b09507L4514F8569N5007N7282B721
$$ plain form
18004 -144042 -143988 92050 -65977 -44152 117196 -212712 -87869 149579 -83350 63026 72931 207838
17992 207838 57225 -171021 34663 -12206 127982 160769 121712 199034 -7662 -41619 -50747
17981 -50747 128146 138764 -92738 -141042 -288489 -41610 78696 137500 225443 75996 -156178
17969 -120093 -74801 -240625 114278 145338 -77727 246143 -201082 -99847 -125662 273456
17958 -238258 21370 -298663 68360 -146350 567203 -120782 111375 148568 2689 328185
17948 328185 213077 -85702 -119145 -39850 -136213 90940 101995 -196033 -23855 -38884 33160
17936 373681 48511 -342971 126806 197318 45495 43386 -60391 205870 109854 -50119 -331306
17925 -331306 -87797 -233499 102576 101674 211922 -28133 249027 69786 146421 -284972 55151
$$ packed form
18004a44042N4I2050f5977K1825A17196b12712h7869A49579h3350F3026R905J34907
17992B07838E7225a71021C4663a2206A27982L2787l9057P7322g662l3957r128
17981e0747A28146J0618i2738m8304j47447d1610G8696N8804Q7943G5996a56178
17969a20093M5292j65824A14278L1060g7727B46143b01082i9847k5815B73456
17958b38258B1370b98663F8360a46350E67203a20782A11375L7193B689L25496
17948C28185j15108h5702l3443c9850r6363I0940J1055a96033b3855j5029C3160
17936C73681D8511c42971A26806P0512D5495k109f0391B05870r6016e0119k81187
17925c31306h7797j45702A02576r02J10248b8133B49027F9786P6635b84972E5151
$$ plain form
17913 29796 86371 -131155 66954 180846 564384 143544 -213169 20725 -30768 112069
17902 41729 -95109 -113257 -55756 69101 98773 -123618 75600 -201458 39172 -261435 150148
17890 -186827 19073 -99692 -2144 167725 88995 124954 -322782 28410 -150547 26416 71067
17879 71067 -210359 -326016 -300968 -86730 207427 59329 254585 -143033 249860 -50366
17868 59365 -133856 -233279 173253 174286 -321991 -145419 115219 -146511 185385 -139325
17857 -142232 226964 -255799 -94670 -57854 -295278 149189 -92695 -179909 -49225 -21105 230251
17845 -131998 2017 38568 126977 286262 132376 -147391 15310 122095 60989 -61024 230009
17833 37661 -84849 189573 -42522 -116448 -6706 -278997 -116759 -169830 127092 84926 -93174
$$ packed form
17913B9796N6575a31155F6954J13892L83538A43544b13169B0725c0768A12069
17902D1729i5109j8148e5756F9101K9672a23618G5600b01458C9172b61435A50148
17890a86827A9073i9692b144A67725p8730L5959c22782B8410a50547B6416M4651
17879G1067b10359j15657K5048h6730B07427E9329J95256a43033B49860e0366
17868E9365a33856r9423A73253J033c21991a45419A15219a46511A85385a39325
17857a42232B26964b55799i4670L6816k37424A49189i2695q7214d9225b1105B30251
17845a31998B017L6551Q8409J59285A32376a47391A5310J06785F0989f1024B30009
17833C7661h4849A89573d2522p3926f706k72291a16759n3071A27092m2166i3174
$$ plain form
17821 -273446 -109829 -175836 -334092 -23697 -416211 230025 101445 40124 -56682 216021
17810 -110586 -125756 -220345 -43771 69380 46293 360835 291211 125662 -69038 -38879 -432105
17799 -432105 -142966 258573 2310 -96919 -13129 -253094 228222 112350 -349575 -287735
17789 -287735 -311923 287307 -14628 5266 -13647 -110356 130778 -187680 -71780 4922 -98197
17777 132501 121575 80675 92827 -35890 270369 -71469 -221876 -25073 -11512 28935 -172833
17765 240861 125595 194892 164048 -265849 49076 147893 60376 40666 -73314 111421 -28043
17753 103415 21770 -153226 32086 -138601 246355 9787 -63577 258719 -164469 -120416 32450
17741 59016 -86364 -47001 82219 33500 -195642 184158 -52282 255063 211204 -188007 -29224
$$ packed form
17821b73446a09829o6007j58256b3697l92514B30025A01445D0124e6682B16021
17810a10586j5170r4589d3771F9380k3087L14542o9624A25662f9038L0159l93226
17799d32105a42966B58573B310i6919a3129k39965B28222A12350c49575O1840
17789b87735k4188B87307a4628E266a3647r6709A30778a87680g1780D922i8197
17777A32501j0926m0900J2152c5890B70369g1469j50407b5073a1512B8935a72833
17765B40861j15266O9297l0844b65849D9076R8817F0376j9710g3314A11421b8043
17753A03415B1770a53226C2086a38601B46355I787f3577B58719a64469M4053C2450
17741E9016h6364L9363H2219C3500a95642A84158e2282B55063m3859a88007b9224
$$ plain form
17729 29270 235411 42560 45048 -442371 -75134 -16194 62742 -143910 -140894 -122690 37739
17717 -64088 151148 -121176 282411 -9964 92298 -273879 268147 210007 175727 389300 -68072
17705 184639 -175209 -351097 46735 -212107 72627 57450 50166 -7267 -85647 556409 109739
17693 43685 -74382 -189311 18838 -103851 37842 261077 138589 121723 -190345 -105861 363206
17681 104268 -188313 241 -107628 -228371 -10366 -3495 -81278 373411 -131963 -101882 -260377
17670 -260377 200461 159935 40248 100186 -218881 -257231 -112843 150563 -129266 -117370
17660 -117370 227945 205740 -106716 -20259 -65509 -109970 -187953 73750 -18180 75349 6510
17648 -94122 340396 130891 39373 -111830 109852 126664 28620 -170819 447111 -225025
$$ packed form
17729B9270K06141D2560K488d42371g5134a6194F2742a43910L016J8204C7739
17717f4088A51148a21176B82411i964I2298b73879B68147n8140l4280K13573f8072
17705A84639a75209j75888D6735b12107G2627j5177p284g267p8380E56409A09739
17693D3685g4382j14929A8838a03851C7842K23235j22488j6866a90345Q4484C63206
17681A04268a88313B41a07628j20743a0366c495p7783C73411a31963L0081j58495
17670b60377B00461m0526D0248N9938b18881l8350a12843A50563a29266J1896
17660a17370B27945k2205a06716b0259m5250m4461p7983G3750a8180G5349F510
17648i4122C40396A30891C9373a11830A09852J6812B8620a70819D47111b25025
$$ plain form
17637 35941 -93449 114986 17494 23829 -85774 -161484 -51278 -87459 -84840 69837 66817 86887
17625 86887 -43061 -265277 -202718 -45674 201425 235618 -159036 -250505 -249082 -118378 149353
17613 -37092 250116 -59800 280803 -39034 -34205 -287332 -204550 -26702 335980 4990 16327
17602 16327 153807 224556 153740 -124311 85894 6814 -190611 99038 61184 50744 -88698
17590 217030 163619 254136 -40826 269262 20779 -53964 126620 -219108 61171 101997 -81068
17578 83370 -261093 163984 -9159 -135388 85505 277418 -19203 -17700 38015 -234478 -81950
17566 18880 97054 67818 -236528 -71794 -262083 -52221 -426015 185667 -151206 -41603 32026
17554 180644 124190 33915 286416 253890 122920 -45389 -11711 428187 -25940 -267463 11710
$$ packed form
17637C5941i3449A14986A7494O335h5774p5710e1278l6181K619F9837l020K0070
17625H6887d3061k22216O2559d5674B01425L4193a59036r1469J423a18378A49353
17613c7092B50116e9800B80803c9034M829k53127Q2782b6702C35980D990J1337
17602A6327J37480P0749p0816a24311H5894F814a90611I9038l7854j0440h8698
17590B17030n3411R0517d0826B69262B0779e3964A26620b19108F1171M0826h1068
17578H3370b61093A63984i159j26229H5505J91913a9203J503C8015b34478h1950
17566A8880P8174k9236b36528g1794j90289e2221l73794A85667a51206d1603C2026
17554A80644n6454C3915K52501l2526A22920d5389a1711D28187b5940k41523A1710
$$ plain form
17542 341008 133791 154365 -14532 200219 -49617 196137 93500 -181926 -68646 -197431
17532 -197431 198907 31733 262295 -13990 26366 -6573 185488 197471 -101196 -277142 294789
17520 16597 318532 96266 266983 -70627 -80793 31108 238677 63366 167893 9787 202235
17509 202235 26807 249257 -28352 333071 171566 -21880 124938 6146 -3586 -142354 -28348
17497 3027 12582 -32566 -363097 125157 128473 124125 78237 -199051 389441 -205553 -245969
17486 -245969 302861 104525 101990 12284 134119 -183896 -350683 -16794 274382 -80 431058
17474 252471 23693 84865 40966 -31729 415600 427174 73389 -13586 -905 -56047 -34576 336797
17461 433981 133195 46599 200776 361445 262549 345135 19005 35526 110625 135405 274124
$$ packed form
17542C41008A33791K0574a4532B00219d9617A96137I3500a81926f8646j28785
17532a97431A98907C1733K30562a3990B6366f573A85488J1983a01196j75946B94789
17520A6597L01935I6266J70717g0627j0166C1108K07569F3366J04527I787J92448
17509B02235B6807K22450b8352C33071j61505b1880A24938F146c586j38768b8348
17497C027R555c2566l30531A25157L316m348m5888a99051C89441b05553m0416
17486b45969C02861A04525k535A2284J21835a83896j66787a6794B74382h0D31058
17474B52471B3693O1172D0966c1729D15600J1574G3389a3586i05n5142K1471C36797
17461D33981A33195D6599J54177J60669r8896Q2586A9005J6521P5099K4780J38719
$$ plain form
17450 274124 391844 -179189 138366 7024 471770 219262 220252 87475 333341 294652 63357
17438 24431 542592 266287 -90986 331923 35505 -19534 -56178 481460 -130078 461851
17427 76884 -52026 28572 6874 242367 394574 75480 300054 16565 75847 180662 146562
17416 146562 152040 342181 36523 427029 298443 151037 364267 256007 61484 252315
17406 252315 -58284 101653 -14583 243590 263333 137179 -73814 193557 156744 175014 282876
17395 282876 -8618 230677 133333 -99991 248372 104866 -83275 210293 -144870 175935
17384 35732 241296 322938 -70209 78153 203574 235550 65681 528858 43309 485037 47121
17372 -41371 -187737 309122 -150803 133874 46826 181844 -296297 53412 295942 -6952
$$ packed form
17450B74124J17720a79189A38366G024M64746B19262R90H7475K45866l8689F3357
17438B4431N18161B66287i0986C31923C5505a9534l6644D81460a30078D61851
17427G6884e2026B8572F874K35493J52207G5480K24574A6565N9282J04815l4100
17416A46562N478J90141C6523L90506j28586j47406K13230j08260F1484J90831
17406B52315e8284A01653a4583B43590J9743j26154g3814A93557l6813J8270J07862
17395B82876h618B30677r7344i9991B48372A04866h3275B10293a44870A75935
17384C5732K05564Q1642g0209G8153J25421L1976F5681M63177D3309M41728D7121
17372d1371j46366C09122a50803A33874D6826J35018b96297E3412K42530f952
$$ plain form
17361 353705 379156 196095 345570 107384 -173087 -456 73214 439396 58503 -26002 -64068
17350 -64068 113331 -234709 330116 170841 -6622 128537 164328 223449 287072 421075 -32574
17338 136096 124682 -10045 42513 133892 43676 196697 15533 73746 332820 -124494 -124044
17327 -124044 53850 299075 90191 -73886 123501 -83493 -124670 -90052 106778 125259 377142
17316 377142 -12813 40257 328661 -359734 160449 441907 114206 11007 -5972 73394 33061
17304 283253 -216823 139638 141760 257374 346557 -203070 -106174 -42059 150004 315654
17294 315654 230470 -109570 295625 188305 164245 29186 -76469 82445 90625 -12899 345530
17282 381288 399403 226059 255035 373642 194857 -16196 59971 -71594 93245 198082 217172
$$ packed form
17361C53705K5451j83061J49475A07384a73087d56G3214L66182E8503b6002l8066
17350f4068A13331b34709C30116j59275f622A28537L5791N9121O3623J34003c2574
17338A36096j1414a0045D2513R1379D3676J53021A5533N8213K59074a24494M50
17327a24044E3850K45225I0191g3886A23501h3493m1177L4618A06778J8481K51883
17316C77142a2813D0257K88404c59734A60449K81458A14206A1007e972G3394C3061
17304B83253b16823A39638K122J15614Q9183b03070R6896d2059A50004J65650
17294C15654q5184a09570B95625j07320k4060B9186g6469H2445Q180a2899C45530
17282C81288J8115j73344K8976J18607j78785a6196E9971g1594I3245J04837J9090
$$ plain form
17271 217172 58365 -150708 129452 77819 166494 188240 45209 16320 232226 255495 -72351
17259 -22784 302671 353863 360681 152762 189913 111125 143120 254617 -94621 372640 84520
17247 580739 199510 73249 -62489 101797 120097 -1602 173257 158676 264223 22565 -44633
17235 172126 207649 -25450 352205 154835 -198405 220131 151092 362026 143928 398296
17225 398296 106382 121274 39320 180420 1188 252322 87021 29919 340468 206616 25021
17213 18380 309997 -56087 184318 86547 106069 212965 226260 313822 357643 96541 170101
17202 170101 55453 267811 414993 160923 293010 507323 361451 84289 28909 197168
17192 197168 -43018 187464 150776 288558 310665 108576 17172 93974 380144 -6691 -60429
$$ packed form
17271B17172E8365a50708A29452n1633Q8675K1746D5209A6320K15906K3269g2351
17259b2784C02671N1192O818A52762L7151p8788L1995J11497i4621C72640H4520
17247E80739A99510G3249f2489A01797J8300a602A73257j4581J05547B2565d4633
17235A72126L5523b5450C52205A54835a98405B20131o9039K10934A43928K54368
17225C98296A06382J4892C9320J41100A188K51134H7021B9919L10549j33852B5021
17213A8380K91617e6087A84318H6547J9522J06896J3295Q7562M3821I6541P3560
17202A70101E5453K12358J47182A60923J32087K14313j45872H4289B8909J68259
17192A97168d3018A87464l6688J37782K2107A08576A7172P6802K86170f691n3738
$$ plain form
17181 -60429 113841 92788 257870 491771 510059 147444 290274 127241 430188 314283
17171 314283 276422 75577 212478 393653 388300 357284 131237 181567 42710 -1936 264739
17159 244456 393168 397510 -136574 219293 233826 298162 145941 159319 19946 206196 243781
17148 243781 201384 274641 430963 217762 551873 530685 -85590 408508 160807 301818
17138 301818 -181151 -48495 396632 164414 36051 398440 489353 84509 152988 106419 250009
17127 250009 520136 297266 264621 329945 250797 149158 542445 395324 424702 60202
17116 100573 259796 118202 52584 180402 534838 171427 212867 383175 171552 396760
17106 396760 182583 374773 161801 244555 299922 571458 -17837 451928 236357 513880
$$ packed form
17181f0429A13841k1053J65082K33901J8288A47444J42830A27241L02947j15905
17171C14283l7861G5577J36901J81175n353l1016A31237N0330D2710a936B64739
17159B44456J48712M342a36574B19293J4533O4336A45941J3378A9946J86250L7585
17148B43781m2397P3257J56322k13201L34111k1188h5590D08508A60807J41011
17138C01818a81151d8495C96632A64414C6051L62389R0913H4509O8479m6569J43590
17127B50009K70127k22870l2645O5324p9148j01639L93287j47121K9378F0202
17116A00573J59223A18202E2584J27818L54436A71427M1440J70308A71552K25208
17106C96760A82583J92190A61801Q2754N5367K71536a7837D51928k15571K77523
$$ plain form
17096 513880 305740 347571 239838 238299 369389 498446 237244 268354 457588 132357
17085 263449 425311 675346 52929 85401 219733 207290 169701 712272 452499 -46129
17074 291500 489289 229067 341267 631175 452042 175437 325326 100324 595336 565161
17064 565161 537516 419750 862058 524312 159804 587134 506279 317947 480467 454844
17054 454844 675181 339800 316457 270376 462083 404027 597121 95801 500890 532141
17044 532141 434700 533123 322829 106411 379682 886459 202604 280596 468908 400367
17034 400367 195604 282343 381994 665230 395866 644714 548090 607033 445703 470991
17024 470991 520625 37839 477566 736567 544465 799690 702354 334158 776913 544635
$$ packed form
17096E13880k08140M1831j07733j539J31090J29057B37244L1110J89234A32357
17085B63449J61862K50035E2929L2472J34332j2443l7589N42571k59773d6129
17074B91500J97789B29067J12200K89908j79133A75437J49889A00324M95012l0175
17064E65161k7645j17766M42308l37746A59804M27330q0855j88332J62520k5623
17054D54844K20337l35381k3343m6081J91707n8056J93094I5801M05089L1251
17044E32141r7441R8423k10294A06411K73271N06777B02604P7992J88312o8541
17034D00367A95604Q6739R9651K83236k69364K48848r6624N8943j61330K5288
17024D70991M9634C7839M39727K59001j92102K55225r7336C34158M42755k32278
$$ plain form
17014 544635 646591 579868 587658 501897 782291 514953 486138 563137 303400 330528 287630
17003 287630 849972 610538 878582 550920 545111 184444 250289 711209 611962 486698
16993 486698 469647 487178 767203 965235 396813 585036 797210 613971 476591 452985
16983 452985 666137 719249 1025043 535899 738421 633704 566303 751592 205084 464713
16973 464713 1012921 549672 1108487 768455 586774 741775 718731 858840 599481 509952
16963 509952 716006 639272 658710 790385 474106 820376 979759 696483 912588 975641
16953 975641 636610 946266 647403 921772 769320 959361 1068145 963370 657212 1049550
16943 1049550 756472 819974 851849 1101127 1001760 1059620 852226 1180234 1040813 992338
$$ packed form
17014E44635J01956o6723P790q5761K80394k67338k8815P6999k59737K7128m2898
17003B87630N62342k39434K68044l27662n809A84444O5845M60920r9247j25264
16993D86698j7051J7531K80025J98032C96813J88223K12174j83239j37380k3606
16983D52985K13152N3112L05794m89144K02522j04717o7401J85289B05084K59629
16973D64713N48208m63249N58815l40032j81681J55001k3044J40109k59359q9529
16963E09952K06054p6734J9438J31675l16279L46270J59383k83276K16105O3053
16953I75641l39031L09656k98863K74369j52452J90041J08784j04775l06158L92338
16943A049550k93078O3502L1875K49278r9367N7860k07394L28008j39421m8475
$$ plain form
16933 992338 1074644 1029544 1005093 1170045 975559 1060528 982395 1058277 956434 1372412 867412
16922 867412 602049 993828 1171837 920506 1140081 985185 859579 1538488 1151498 1179583
16912 1179583 1370617 1081278 1340831 1317443 1565670 1366323 1317814 1091986 1151642 1448319
16902 1448319 1212695 1545311 1545319 1329961 1091032 1635434 1226485 1295149 971382 1426110
16892 1426110 1716479 1657555 1585200 1650385 1558857 1993119 1919827 1515663 1304173 1674841
16882 1674841 1802186 1334269 1928036 1802987 1885889 1705424 1875863 1924572 2110457 2192754
16872 2192754 1779431 2088094 2251158 1994796 1836860 2123959 2047034 2130895 2360238 2396656
16862 2396656 2614737 2317251 2720036 2229179 2599799 2323192 2382697 2124370 2533833 2681090
$$ packed form
16933I92338Q2306m5100k4451J64952j94486Q4969p8133P5882j01843M15978n05000
16922H67412k65363L91779J78009k51331K19575j54896j25606O78909l86990K8085
16912A179583J91034k89339K59553k3388K48227j99347m8509k25828N9656K96677
16902A448319k35624L32616Qk15358k38929N44402m08949O8664l23767M54728
16892A426110K90369n8924p2355O5185r1528M34262p3292m04164k11490L70668
16882A674841J27345m67917N93767j25049Q2902j80465J70439M8709J85885Q2297
16872B192754m13323L08663J63064k56362j57936K87099p6925Q3861K29343L6418
16862B396656K18081k97486M02785m90857L70620k76607N9505k58327M09463J47257
$$ plain form
16852 2681090 2856685 2771163 2921427 2583498 2374020 2944346 2869454 2792773 2662284 3368109
16842 3368109 2899064 3058951 3298577 3147222 3547919 3166480 3164769 3178163 3728436 3587392
16832 3587392 3680620 3935098 3631210 3781271 4057056 4047037 3941719 4185654 4110641 4264713
16822 4264713 4552765 4385911 4735712 5162150 4989938 4608059 4721056 5064004 5076277 5299580
16812 5299580 5282827 5525258 5667029 5629727 5695061 5970001 6085903 6105326 6086704 6451010
16802 6451010 6700332 7031230 7044743 6890077 7573387 7433181 7494677 7715438 7950638 8308521
16792 8308521 8359605 8665286 8648078 9003946 9413067 9574176 9655843 10300095 10798682 10684859
16782 10684859 11080183 11237132 11599683 12056958 12339477 12934876 13133464 13618233 13977462
$$ packed form
16852B681090J75595q5522J50264l37929k09478N70326p4892p6681j30489P05825
16842C368109m69045J59887K39626j51355M00697l81439j711J3394N50273j41044
16832C587392R3228K54478l03888J50061K75785j0019j05318K43935p5013J54072
16822D264713K88052j66854L49801M26438j72212l81879J12997L42948J2273K23303
16812E299580j6753K42431J41771l7302O5334K74940J15902J9423j8622L64306
16802F451010K49322L30898J3513j54666O83310j40206O1496K20761K35200L57883
16792H308521N1084L05681j7208L55868M09121J61109Q1667O44252M98587j13823
16782A0684859L95324J56949L62551M57275K82519N95399J98588M84769L59229
$$ plain form
16773 13977462 14591457 14903971 15354838 15777192 16432224 17210623 17523630 18589421 18966672
16764 18966672 19775142 20638207 21399691 22076733 22977632 23885602 24972868 26517413 27252948
16755 27252948 27964530 29689795 31174528 32124484 34130801 35648707 37249562 39106330
16747 39106330 40964330 43482259 45515015 47869227 50630378 53293764 56930524 59432542
16739 59432542 63162608 67126494 71335596 75544721 80180343 85397351 90905276 96457928
16731 96457928 102870288 109291342 116211904 123508093 131369463 139283429 147227123 155198942
16723 155198942 163574629 170555392 177488451 183628009 188544108 192382821 194575549 195252102
16715 195252102 194630415 192583017 188943561 183475110 177685991 170835863 163261320 155254070
$$ packed form
16773A3977462O13995L12514M50867M22354O55032P78399L13007J065791L77251
16764A8966672Q08470Q63065P61484O77042R00899R07970J087266J544545P35535
16755B7252948P11582J725265J484733R49956K006317J517906J600855J856768
16747C9106330J858000K517929K032756K354212K761151K663386L636760K502018
16739E9432542L730066L963886M209102M209125M635622N217008N507925N552652
16731I6457928O412360O421054O920562P296189P861370P913966P943694P971819
16723A55198942Q375687O980763O933059O139558M916099L838713K192728O76553
16715A95252102o21687k047398l639456n468451n789119o850128p574543q007250
$$ plain form
16707 155254070 146614551 138567450 130557425 122667919 115114801 107683716 100892636 94691262
16699 94691262 88489558 83208384 77951553 72675503 68123860 64011497 60321847 56958442
16691 56958442 53564720 50651925 47782676 45200900 42486826 40249567 37988596 36369673
16683 36369673 34313324 32795995 31013084 29758523 28219639 26745994 25856394 24580356
16675 24580356 23268936 22431719 21670149 20573794 20134498 19316955 18191129 17773427 16858765
16666 16858765 16246311 15303473 14776295 14708370 13994514 13647561 13063539 12923752 12404509
16657 12404509 11766776 11510292 11178831 10737486 10628815 10045154 9578515 9394909 9261063
16648 9261063 8846633 8563834 7868513 8327444 8085122 7681003 7814595 7353095 7161994
$$ packed form
16707A55254070q639519q047101q010025p889506p553118p431085o791080o201374
16699I4691262o201704n281174n256831n276050m551643m112363l689650l363405
16691E6958442l393722k912795k869249k581776k714074k237259k260971j618923
16683C6369673k056349j517329j782911j254561j538884j473645q89600j276038
16675B4580356j311420q37217p61570j096355m39296q17543j125826m17702r14662
16666A6858765o12454r42838n27178o7925p13856l46953n84022j39787n19243
16657A2404509o37733k56484l31461m41345j08671n83661m66639j83606j33846
16648I261063m14430k82799o95321M58931k42322m04119J33592m61500j91101
$$ plain form
16639 7161994 6931956 6803638 6606871 6143784 6246334 6103014 6090563 5686722 5509457 5534637
16629 5534637 5560495 5424224 5254248 5174766 4954984 4931402 4744512 4720847 4719937 4608799 4331428
16618 4331428 3639112 4146570 4336250 3737589 3779213 3600635 3779796 3400170 3652251 3831727
16608 3831727 3453492 3410556 3459759 3333285 3326054 3286490 3306552 3191274 2874989 2812699 2705795
16597 2705795 2756864 2758716 2698090 2518985 2534118 2848261 2619727 2478646 2344996 2296835
16587 2296835 2413811 2420583 2303666 2072325 2294759 2082223 2081673 2173644 1948960 2077802
16577 2077802 2031312 1802773 2078902 2090864 1913224 2240329 2036681 1921035 1880457 1877007
16567 1877007 1833390 1664946 1727150 1714028 1657627 1752279 1343723 1701035 1342271 1441292
$$ packed form
16639G161994k30038j28318j96767m63087J02550j43320j2451m03841j77265K5180
16629E534637K5858j36271j69976p9482k19782k3582j86890k3665r10j11138k77371
16618D331428o92316N07458J89680n98661M1624j78578J79161l79626K52081J79476
16608C831727l78235m2936M9203j26474p231l9564K0062j15278l16285o2290j06904
16597B705795N1069J852o0626j79105J5133L14143k28534j41081j33650m8161
16587B296835J16976O772j16917k31341K22434k12536n50R1971k24684J28842
16577B077802m6490k28539K76129J1962j77640L27105k03648j15646m0578l450
16567A877007m3617j68444O2204j3122n6401R4652m08556L57312l58764R9021
$$ plain form
16557 1441292 1519908 1536292 1324830 1432962 1499732 1489838 1305143 1493941 1278093 1329556
16547 1329556 1370788 1363905 1463406 1158757 1354073 1218280 1413041 1120343 1387978 1283803
16537 1283803 1061487 1153910 1393775 984060 1209306 1165688 950452 1206089 925129 1633927
16527 1633927 763285 1033931 1119653 1442902 1041582 830962 624840 1220035 949575 754124
16517 754124 1004533 683729 737456 747559 724428 1043609 797048 1026326 692967 631781
16507 631781 970126 612193 596003 1094734 969326 883236 879379 649849 821315 751549
16497 751549 773012 1181648 1100096 732933 726698 1066255 667235 598679 851440 616204
16487 616204 856617 760562 1056856 520514 532145 754314 625909 784017 713381 923564
$$ packed form
16557A441292P8616J6384k11462J08132O6770r894j84695J88798k15848N1463
16547A329556M1232o883R9501l04649J95316j35793J94761k92698K67635j04175
16537A283803k22316R2423K39865m09715K25246m3618k15236K55637k80960P08798
16527A633927G63285K70646Q5722L23249m01320k10620k06122N95195k70460j95451
16517G54124K50409l20804N3727J0103k3131L19181k46561K29278l33359o1186
16507F31781L38345l57933j6190M98731j25408q6090l857k29530J71466o9766
16497G51549K1463M08636q1552l67163o235L39557l99020o8556K52761k35236
16487F16204K40413r6055K96294E20514J1631K22169j28405J58108p0636K10183
$$ plain form
16477 923564 708607 546519 731928 858048 905416 503342 476913 576434 525945 571382
16467 571382 291450 440087 415539 447512 755781 984787 470867 676223 468575 587678
16457 587678 538567 365910 403465 373794 675903 440664 288191 570764 476040 452795
16447 452795 211126 534272 697555 251586 538093 326365 495928 588014 716744 191151
16436 504654 322449 434938 206144 122262 329883 332104 356067 272817 -70342 347591 595590
16425 595590 316075 348597 393394 567702 357356 499470 345882 185788 197399 388723
16415 388723 297595 406015 657838 93120 643524 499482 134242 580939 336983 104511
16404 237443 507743 927562 448239 139175 218831 834930 385749 294557 166252 518942
$$ packed form
16477I23564k14957j62088J85409J26120M7368m02074k6429R9521n0489M5437
16467E71382k79932J48637k4548L1973L08269K29006D70867K05356k07648J19103
16457E87678m9111j72657L7555k9671L02109k35239j52473K82573r4724k3245
16447D52795B11126L23146J63283B51586K86507k11728J69563R2086J28730A91151
16436E04654j82205J12489B06144q3882K07621K221K3963q3250g0342C47591K47999
16425E95590k79515L2522M4797J74308k10346J42114j53588j60094J1611J91324
16415C88723r1128J08420K51823I3120N50404j44042A34242M46697k43956A04511
16404B37443K70300M19819D48239A39175P9656O16099C85749r1192j28305L52690
$$ plain form
16394 518942 481893 272630 259918 377348 67509 352993 392907 456105 491408 397143 264000
16383 264000 202299 486453 598798 418145 457047 172608 395020 350009 331709 500735
16373 500735 68484 327705 340455 418328 187058 351594 190007 295878 191668 182330
16363 182330 123026 227859 18546 345759 -193030 230977 80359 520137 595007 56996
16352 266223 -255599 292938 80578 93957 293075 317290 329782 -117257 163935 480234
16342 480234 47400 423126 188495 363960 45289 103016 185905 67610 80891 202339 432996
16331 432996 455526 163361 249771 533005 -40193 217679 553803 250226 288381 276021
16321 276021 267118 246632 291917 -8047 135679 127048 302693 132351 84010 30002 539611
$$ packed form
16394E18942l7049k09263j2712J17430F7509K85484L9914O3198L5303r4265j33143
16383B64000o1701K84154J12345j80653L8902A72608K22412m5011j8300J69026
16373E00735F8484K59221J2750P7873A87058J64536j61587J05871j04210r338
16363A82330n9304J04833A8546L27213a93030B30977H0359M39778P4870E6996
16352B66223b55599B92938H0578J3379J99118K4215J2492a17257A63935L16299
16342D80234D7400L75726A88495J75465D5289N7727Q2889F7610J3281J21448K30657
16331D32996K2530A63361Q6410K83234d0193B17679L36124B50226L8155j2360
16321B76021q903k0486M5285h047A35679q631J75645A32351m8341C0002N09609
$$ plain form
16310 539611 85561 168031 326789 -231999 296733 314983 338454 14972 -287434 289982
16299 344162 198905 229007 115240 300942 326770 19031 62972 288300 -80021 153462
16288 -13785 306379 135368 32553 201290 172604 199338 270455 65970 337927 17682 92068
16277 92068 164466 -1788 263434 407524 178724 230030 429124 -66113 271174 257464 336414
16266 336414 -30699 -220180 343778 76440 80729 393306 283938 -207649 96117 424652
16256 424652 190737 175742 515361 112863 166078 141145 407189 281108 180052 121742
16246 121742 243814 215965 120219 179348 246156 132411 196259 45410 238500 149114 199112
16235 199112 50427 -12342 54551 -46886 173350 108449 110816 457327 109984 444789 -58756
$$ packed form
16310E39611H5561Q2470J58758b31999B96733J8250K3471A4972b87434B89982
16299C44162j45257L0102j13767J85702K5828A9031M3941K25328h0021A53462
16288a3785C06379A35368C2553J68737k8686K6734P1117F5970K71957A7682P4386
16277I2068P2398a788B63434J44090A78724N1306J99094f6113B71174j3710P8950
16266C36414c0699j89481C43778G6440M289L12577j09368b07649I6117L28535
16256D24652A90737j4995L39619A12863N3215k4933K66044j26081j01056n8310
16246A21742J22072k7849r5746N9129O6808j13745O3848D5410J93090q9386M9998
16235A99112E0427a2342E4551d6886A73350o4901K367L46511A09984L34805e8756
$$ plain form
16223 166423 -149638 290228 117834 220808 311607 250694 -71262 135808 196049 131084
16213 131084 -134617 229391 230382 61241 204129 61269 209271 150404 38831 92821 75039
16202 75039 454417 -113112 138954 283876 -189438 -57966 160858 91836 -54137 -312149
16192 -312149 60458 -78402 92655 -46279 424754 226564 219351 92675 -119398 314420 -194432
16180 103333 195678 -10096 381467 98926 180123 124840 -91368 -242467 357260 -33072 403915
16168 364947 -69138 -111283 82845 -30015 346227 -230752 143389 37291 -39420 163733 369283
16157 369283 42538 -266637 36409 266561 -71704 419498 204692 36864 96607 -116117
16146 -202314 -163074 13543 2984 -38541 -9818 99543 67134 -88481 140840 -82786 211739
$$ packed form
16223A66423a49638B90228A17834J02974R0799o0913g1262A35808O0241o4965
16213A31084a34617B29391R91F1241J42888F1269J48002n8867C8831N3990j7782
16202G5039L79378a13112A38954J44922a89438e7966A60858o9022e4137k58012
16192c12149F0458g8402I2655d6279D24754j98190p213I2675a19398C14420a94432
16180A03333R2345a0096C81467I8926Q1197n5283i1368j51099C57260c3072D03915
16168C64947f9138m2145H2845c0015C46227b30752A43389C7291c9420A63733K05550
16157C69283D2538b66637C6409K30152g1704D19498B04692C6864N9743a16117
16146b02314L9240A3543B984c8541i818I9543l2409h8481A40840h2786B11739
$$ plain form
16134 177500 314773 205902 -298749 -386253 22271 -152657 218475 70841 289854 295493
16124 295493 -71799 171549 -90694 29275 100544 -147627 -35537 184188 -270561 -103273
16113 -69414 81517 -167654 -11234 -234828 -275612 280504 -8040 117281 137547 -83223 21660
16101 244147 256866 202417 26380 28882 146078 88811 216552 -23235 -7778 -152162 82654
16089 -120988 425913 51066 39115 22157 -161557 -58031 -14896 3876 147197 -198187 -22420
16077 138836 -118789 265703 -115465 -47993 110659 -146055 -21223 21848 -117023 179357
16066 248609 -196119 86375 70545 86746 17262 70526 39304 -62953 267501 167741 -125537
16054 178294 -136554 -227256 -162292 222168 -145918 -63633 310864 127442 116248 -352599
$$ packed form
16134A77500J37273j08871b98749q7504B2271a52657B18475G0841K19013N639
16124B95493g1799A71549i0694B9275P1269a47627c5537A84188b70561a03273
16113f9414H1517a67654a1234k23594m0784B80504h040A17281K0266h3223B1660
16101B44147J2719n4449B6380K502J17196n7267J27741b3235g778j44384H2654
16089a20988D25913E1066j1951j6958a61557e8031a4896C876J43321a98187b2420
16077A38836a18789B65703a15465d7993A10659a46055b1223B1848a17023A79357
16066B48609a96119H6375j5830J6201A7262N3264l1222f2953B67501r9760a25537
16054A78294a36554r0702O4964B22168a45918f3633C10864A27442j1194c52599
$$ plain form
16043 -295558 -405202 124054 -185099 -302170 37777 -330588 -246706 -175678 72218 110479
16033 110479 -160663 -2034 65848 -193291 83268 128002 -21333 167103 -160196 -158078 -161882
16022 -161882 14160 1319 -71595 -139045 12870 -35149 206895 -98067 49483 41860 47817 15940
16009 64499 219335 -114880 95948 -2661 88583 -82889 -47210 -301950 230802 -68565 189434
15997 -109361 32235 73117 -112450 -178805 -334842 62891 -40068 27327 146785 109207 -59489
15985 189568 -233431 193648 208585 106601 -100770 109080 -210602 -224374 109732 -251711
15974 2936 23678 -58713 111376 -3524 6579 -57401 42786 419900 -85389 -229518 114735
15962 -8280 141464 -108385 -119286 -185328 -181362 71060 270217 -125506 -49374 -11848 -97560
$$ packed form
16043b95558j09644A24054a85099j17071C7777c30588Q3882P1028G2218L8261
16033A10479a60663b034F5848a93291H3268M4734b1333A67103a60196K118l804
16022a61882A4160A319g1595o7450A2870c5149B06895i8067D9483p623N957A5940
16009F4499J54836a14880I5948b661H8583h2889L5679k54740B30802f8565A89434
15997a09361C2235M0882a12450o6355j56037F2891d0068B7327J19458l7578e9489
15985A89568b33431A93648J4937j01984a00770A09080b10602j3772A09732b51711
15974B936K0742e8713A11376c524F579e7401D2786L77114h5389j44129A14735
15962h280A41464a08385j0901o6042L966G1060J99157a25506d9374a1848q5712
$$ plain form
15951 -97560 -231082 -70000 351726 185229 -70145 -144488 -59357 -299051 -117444 -57306 -70141
15940 -70141 43455 -2806 37251 -62486 -255990 67048 32484 2315 -385261 -210548 -303876
15929 -303876 -286870 -283295 -258797 124644 -12285 -230347 -256009 -155010 -75373 72818 -366423
15917 276717 -20850 15548 -173128 -271417 -105095 191492 -118432 -126574 -160405 149721 35068
15905 -46988 -33720 -180879 78199 21794 -126979 96543 29322 -80803 158263 -57847 -132768
15894 -132768 119553 -91250 90690 28712 97244 -67671 -159247 -178649 117694 72887 129875
15883 129875 -91377 202930 14871 56280 -55416 124984 -21447 -4164 -280339 -238255 -20614
15871 305968 5343 -117592 -166624 59185 233056 -20492 -112187 28757 -73144 -62959 -152792
$$ packed form
15951i7560j33522g0000C51726j66497g0145p4343e9357k39694a17444e7306j2835
15940g0141D3455b806C7251f2486j93504F7048C2484B315c85261J74713r3328
15929c03876J7006L575K4498A24644a2285k18062k5662J00999g5373G2818c66423
15917B76717b0850A5548a73128r8289a05095A91492a18432q142l3831A49721C5068
15905d6988J3268j47159G8199B1794a26979I6543B9322h0803A58263e7847p4921
15894a32768A19553i1250I0690B8712O8532f7671r1576j9402A17694m4807N6988
15883A29875i1377B02930A4871M1409e5416A24984b1447d164k76175M2084b0614
15871C05968E343a17592m9032E9185J73871b0492r1695B8757g3144J0185q9833
$$ plain form
15860 -152792 -147239 -164995 44430 -25889 134791 123987 54415 406905 58452 99244 70864
15849 70864 54636 -129000 -43346 -251445 -202128 63619 -235963 -294098 -15029 126753 -266264
15837 -203078 -45025 -165653 -198522 -117098 -72474 -251539 219028 -3146 -150086 38372 -112255
15825 194070 -76776 -258483 -310289 -183445 -1973 -270471 -25954 188754 -34112 -495638 -501261
15814 -501261 -115006 -109759 60434 49360 127386 164771 -286257 -8201 -79207 -154988 165439
15802 89608 -176091 299835 170836 105188 -20195 -117195 -208807 -54039 -208470 43214 56581
15791 56581 173605 233435 121874 -30105 104162 -110073 -147184 78762 38035 -121883 -147664
15780 -147664 -82022 47939 133576 -68982 75801 -117911 -87637 24581 -374618 241431 34968
$$ packed form
15860a52792N553j7756D4430b5889A34791j0804E4415L52490E8452M0792k8380
15849G0864j6228a29000d3346k08099M9317F3619b35963n8135a5029A26753b66264
15837b03078d5025j20628l2869Q1424M4624j79065B19028c146j46940C8372a12255
15825A94070g6776j81707n1806J26844a973k68498b5954A88754c4112m61526n623
15814e01261a15006N247F0434j1074P8026L7385b86257h201p1006p5781A65439
15802H9608a76091B99835j28999o5648b0195r7000r1612e4039j54431D3214J3367
15791E6581J17024N9830j11561c0105A04162a10073l7111G8762C8035a21883k5781
15780a47664O5642D7939Q5637f8982G5801a17911L0274B4581c74618B41431C4968
$$ plain form
15768 174743 266492 -122815 200669 -14174 -205760 -40235 -9936 56264 -300590 -43067 -160957
15757 -160957 -141612 -125787 -176278 -9550 -160125 38661 221462 298780 262874 -476875 -385892
15746 -385892 81035 295353 -63046 181729 210364 -296406 121310 -442673 -47847 87163
15735 -142112 -226882 -37489 166096 -89788 -359949 -39258 -190434 15745 35293 228855 -510164
15723 262149 189369 60244 -349562 166812 -66526 165080 -334364 34482 34428 11845 -177 9026
15710 -214976 -58302 -56847 362242 -243565 -76927 -167103 -151002 -137252 -84982 77147 7627
15698 -130770 129340 44345 37076 -49367 154641 -52185 13364 -183146 169018 -67605 3427
15686 3075 -307923 -109862 -14625 -290956 -75419 -133864 61204 187208 -218874 -14165 46371
$$ packed form
15768A74743R1749a22815B00669a4174j91586d0235i936E6264c00590d3067j17890
15757a60957J9345J5825n0491i550j50575C8661J82801P7318l5906d76875R0983
15746c85892H1035K14318f3046A81729K8635b96406A21310d42673d7847H7163
15735a42112q4770c7489A66096h9788k70161c9258j51176A5745J9548J93562e10164
15723B62149p2780F0244c49562A66812f6526A65080c34364C4482n4A1845a77I026
15710b14976e8302J455C62242b43565g6927r0176J6101J3750N2270G7147G627
15698a30770A29340D4345p269d9367A54641e2185A3364a83146A69018f7605C427
15686C075c07923a09862a4625k76331g5419n8445F1204J26004b18874a4165D6371
$$ plain form
15674 -50770 -73913 178389 102107 288792 18057 50282 -61858 134918 -5246 74995 7225
15662 -112448 -66890 -17205 -65858 -57203 74994 29879 104478 24906 91461 -89184 -16854 -210693
15650 -210693 -177840 -197896 49252 129423 -146286 -87870 18080 -169344 254683 152238 -145205
15638 -97549 -56845 -117055 250339 -95056 -105431 -357183 -144812 -206211 184427 -2462 -7682
15627 -7682 -61102 -149433 142362 201376 -89587 -17160 -9094 28734 -76385 -42993 -1716 78579
15614 -169422 -26067 -5046 -13262 147047 -84858 -50747 -33731 -201802 -12148 -91889 -194196
15603 -194196 87863 -131104 -267814 61437 -29688 -110987 -28038 110224 174390 126060 3793
15591 -43410 87245 1093 141675 -839 6957 62414 -97823 104345 14876 -143153 -91442 97574
$$ packed form
15674e0770k3143A78389p6282J86685A8057L2225f1858A34918e246G4995G225
15662a12448M5558a7205m8653Q655G4994B9879P4599B4906O6555h9184a6854j93839
15650b10693L2853k0056D9252Q0171a46286N8416A8080a69344B54683j02445a45205
15638i7549M0704o0210B50339i5056j0375k51752a44812o1399A84427b462n220
15627g682n3420q8331A42362N9014h9587a7160Q066B8734g6385L3392a716G8579
15614a69422b6067e046q216A47047h4858L4111J7016j68071a2148p9741j02307
15603a94196H7863a31104j36710F1437b9688q1299b8038A10224O4166m8330C793
15591d3410H7245A093J40582h39F957N5457i7823A04345A4876a43153N1711I7574
$$ plain form
15578 212981 -161563 -573869 -66994 26972 -118240 -77414 114116 111771 85322 12618 -190829
15566 -122861 -105384 -56957 172691 24206 -157454 -106721 -90120 -249659 -67886 -36865 -130909
15555 -130909 -241748 -153923 -60356 -45405 145389 -157644 71103 46272 13420 -217682 -73791
15543 -22621 -17071 -78539 351811 21847 -39101 -1717 -185918 -248614 -96178 -59775 -224208
15532 -224208 381759 -24312 10946 -176850 -132830 63495 59843 176930 39611 39046 -219951
15520 44957 -68174 106421 -121117 -24507 -217335 227672 299835 64653 -80192 -8238 69856
15508 -328913 53605 -157333 -147170 137463 -63080 61768 44960 -198803 144096 -32920 183561
15496 165034 67184 -83792 -19860 -181741 63153 69499 60833 -249152 -398441 -67754 -86984
$$ packed form
15578B12981a61563m12306f6994B6972a18240M0826A14116k345k6449A2618a90829
15566a22861J7477M8427A72691B4206a57454N0733J6601j59539f7886L1021r4044
15555a30909j10839Q7825f0356J4951A45389a57644G1103k4831A3420b17682g3791
15543b2621N550o1468C51811B1847c9101a717j84201o2696i6178L6403j64433
15532b24208C81759b4312A0946a76850M4020F3495l652J17087C9611n65b19951
15520D4957f8174A06421a21117b4507j92828B27672P2163F4653h0192h238F9856
15508c28913E3605a57333J0163A37463f3080F1768j6808a98803A44096c2920A83561
15496A65034F7184h3792a9860j61881F3153O346q666b49152j49289f7754j9230
$$ plain form
15485 -86984 256432 -273598 295702 68902 167581 113881 -5233 -145076 49126 40443 -2271
15473 -68775 -42899 -171080 -228207 278282 -243701 34330 -177328 215508 -416926 -344061
15463 -344061 -176464 152206 14101 -238627 58693 -135661 82049 56003 -192183 21928
15452 90051 200510 -53750 93587 1665 28975 -17847 69786 186691 -264986 -174139 4049
15440 -40420 41401 -31175 -76404 583262 -343033 -29952 -125417 45355 -310112 170509 -43936
15428 -33900 -161996 196106 138619 -251086 234890 -31480 19927 9747 11961 -69276 -48466
15417 -48466 -170649 11783 131632 47540 17376 -41457 -133789 -95817 25957 65196 -74265
15405 222196 -268219 -14935 -61248 270057 -234422 28226 327451 -13116 -46943 153462
$$ packed form
15485h6984B56432b73598B95702F8902R8679n3700e233j39843D9126q683b271
15473f8775K5876j28181n7127B78282b43701C4330a77328B15508d16926P2865
15463c44061J67597A52206A4101b38627E8693a35661H2049k6046a92183B1928
15452I0051J10459e3750I3587A665K7310a7847F9786J16905b64986R0847D049
15440d0420D1401c1175m5229E83262c43033b9952r5465D5355c10112A70509d3936
15428c3900j28096A96106n7487b51086B34890c1480A9927I747K214f9276K0810
15417d8466j22183A1783J19849D7540A7376d1457r2332L7972B5957L9239g4265
15405B22196b68219a4935m6313B70057b34422B8226K99225a3116l3827A53462
$$ plain form
15394 -74518 -35823 -75101 -254343 -383637 137823 29688 -47600 -157311 -109367 156418 -8172
15382 -208347 -247722 7349 -226354 294495 -23093 -613856 -134564 -281923 181356 131142
15372 131142 194599 202529 13670 204395 64753 108971 101633 -394081 -61002 178078 60865
15360 -108063 -51691 -156782 379623 338766 149457 121171 46443 -353349 44948 195813
15350 195813 128083 -65635 233593 -226989 51796 86350 138467 167343 2090 78892 362442
15339 362442 -86144 -68321 208105 21260 72194 89962 -136556 51149 -66985 130694 199035
15328 199035 179986 244231 -26101 94656 -43660 -82249 322059 -88848 36670 -134577 230461
15316 26759 96130 -362732 230782 -109929 -72631 -214998 220870 -76474 263035 224479
$$ packed form
15394g4518c5823l9278j79242j29294A37823B9688d7600j09711M7944A56418h172
15382b08347l9375G349b26354B94495b3093n90763a34564j47359A81356n0214
15372A31142O3457P930A3670J90725F4753M4218p338c94081f1002A78078F0865
15360a08063e1691j05091C79623m0857A49457k8286D6443c53349D4948J50865
15350A95813o7730f5635B33593b26989E1796L4554N2117K8876B090P6802K83550
15339C62442h6144J7823B08105B1260N0934J7768a36556E1149f6985A30694O8341
15328A99035j9049O4245b6101I4656d3660l8589C22059h8848C6670a34577B30461
15316B6759O9371c62732B30782a09929L7298j42367B20870g6474B63035l8556
$$ plain form
15306 224479 19041 -530574 179058 192585 -36476 -237719 461448 49690 -77928 -358860
15296 -358860 16951 -37535 -201434 119908 14428 157093 -28192 208604 -27152 -25009 220545
15284 -141748 169176 8626 -354720 61743 -235176 -2943 -53018 -64694 -88091 123576 -235354
15272 132144 88414 84629 468812 51991 -30760 -5612 125864 157329 -43873 -121297 -444053
15261 -444053 158627 186558 154361 297605 -137779 -63524 181713 121933 145207 202140 592084
15250 592084 1270885 821869 1026027 1348633 394116 283972 115853 88905 357488 7218
15239 -122142 140518 324313 1338 -228405 -111407 -82486 -183678 -240627 18963 123243
15229 123243 229159 -69300 -32294 15765 302130 -254302 -25607 -37427 33213 22924 330037
$$ packed form
15306B24479A9041e30574A79058J3527c6476k01243D61448D9690g7928k80932
15296c58860A6951c7535j63899A19908A4428J42665b8192B08604b7152K143B20545
15284a41748A69176H626c54720F1743b35176b943n0075j1676k3397A23576b35354
15272A32144m3730l785L84183E1991c0760e612A25864L1465d3873p7424l22756
15261d44053A58627K7931l2197J43244a37779f3524A81713n9780K3274N6933L89944
15250E92084O78801m49016K04158L22606C94116j10144A15853k6948K68583G218
15239a22142A40518J83795A338b28405a11407K8921j01192n6949A8963J04280
15229A23243J05916f9300c2294A5765K86365b54302b5607j1820C3213j0289L07113
$$ plain form
15218 330037 240629 49556 252401 158749 311648 413190 105036 368930 -173659 132032
15207 -108335 -101772 106554 -92892 88672 -409559 -21758 122989 278810 16518 160879 23024
15195 6414 1181 -175584 36846 34539 12627 134190 199907 208690 272607 145843 329745 -60831
15182 72555 -77069 352787 147490 74807 200137 150495 68335 105212 -131196 -222350 -320173
15171 -320173 -141650 104219 126881 481420 303726 288482 102847 -10790 85101 254067
15161 254067 168980 -181245 243359 -2591 392553 -37860 191656 -53264 145914 -45923 10707
15149 -6574 -2276 168787 -57358 266458 -253391 239503 -10855 -212663 -68601 -58273 104696
15137 76131 283110 278878 -94169 -56469 -71994 155113 172218 231064 62075 117418 105396
$$ packed form
15218C30037q9408D9556K02845r3652J52899J01542A05036K63894a73659A32032
15207a08335O563A06554i2892H8672d09559b1758A22989J55821A6518J44361B3024
15195F414A181a75584C6846k307A2627J21563O5717Q783O3917j26764J83902f0831
15182G2555g7069C52787A47490p2683J25330m9642F8335L6877a31196r1154r7823
15171c20173a41650A04219K2662L54539j77694j5244A02847a0790H5101J68966
15161B54067q5087a81245B43359b591C92553c7860A91656e3264A45914d5923A0707
15149f574b276A68787e7358B66458b53391B39503a0855k01808f8601J0328A04696
15137G6131K06979m232i4169L7700j5525A55113J7105N8846F2075N5343j2022
$$ plain form
15126 105396 -56230 213622 483339 6077 112276 88085 136361 -28305 70194 214582 22240
15114 180815 72120 -154776 -151450 188647 152922 123064 -105509 96109 236479 -248995 53789
15102 424516 143097 278700 18534 93276 147317 267165 -157469 306366 84659 -151861
15091 -10272 -111891 -133184 9428 457972 248394 315862 -67192 170127 -35217 162963 198452
15080 198452 105481 206363 -30217 72359 321928 231323 401080 -100281 -180905 -46325 26504
15068 22812 223840 -127682 346811 268138 359524 -58570 124828 -102622 -58783 305342
15057 314628 -15826 231176 154593 150879 67504 144234 339057 218282 394035 440771 -227168
15045 432968 382621 67691 19844 141894 189919 -3287 447470 367992 33886 335480 216042
$$ packed form
15126A05396e6230B13622K69717F077J06199k4191M8276b8305G0194J44388B2240
15114A80815G2120a54776L326A88647l5725k9858a05509I6109J40370b48995E3789
15102D24516A43097J35603A8534P4742N4041J19848a57469C06366H4659a51861
15091a0272j01619k1293I428M48544k09578O7468f7192A70127c5217A62963L5489
15080A98452r2971J00882c0217G2359K49569r0605J69757a00281q0624d6325B6504
15068B2812K01028a27682C46811p8673R1386e8570A24828a02622M3839C05342
15057C14628a5826B31176p6583l714F7504P6730J94823j20775J75753M6736b27168
15045D32968n0347F7691A9844J22050M8025c287D47470p9478C3886L01594j19438
$$ plain form
15034 216042 318959 246835 -109462 -36012 53606 206025 509217 168451 296315 17783
15023 322450 -14845 12241 263118 192624 37565 139700 -120556 75581 199776 404075
15013 404075 244427 144987 428181 316984 395367 317850 -36957 155500 323541 183459
15003 183459 361011 445506 -105819 399180 33385 -115536 546615 184867 270492 -46911
14992 329026 326207 225750 96824 -77301 275411 81411 339583 39573 252396 290491 376906
14981 376906 125847 116966 166874 46511 172191 467447 116342 515743 257213 -190848
14970 261187 384630 47877 -131320 146545 313955 111229 68954 227751 162314 -296029
14959 -20176 165900 306111 174100 216425 9415 393078 524597 86018 245865 278148 152921
$$ packed form
15034B16042J02917p2124a09462c6012E3606J52419L03192A68451J27864A7783
15023C22450a4845A2241K50877p0494C7565J02135a20556G5581J24195K04299
15013D04075j59648r9440K83194j11197P8383p7517c6957A55500J68041j40082
15003A83459J77552Q4495a05819C99180C3385a15536E46615A84867Q5625d6911
14992C29026k819j00457I6824g7301B75411H1411K58172C9573K12823L8095Q6415
14981C76906A25847q881M9908D6511J25680K95256A16342L99401B57213a90848
14970B61187J23443D7877a31320A46545J67410A11229m2275J58797o5437b96029
14959b0176A65900J40211j32011M2325I415L83663J31519H6018J59847L2283j25227
$$ plain form
14948 152921 112273 359137 411152 291297 197459 263154 554359 271999 215454 16002 262405
14937 262405 226001 263564 2814 338490 245903 316513 456383 91185 263240 307092 418671
14926 418671 168228 213722 294024 543440 115342 33420 534427 373069 423168 500489
14916 500489 118414 328241 377109 169929 341746 -71944 376473 517897 167944 364518
14906 364518 111054 401525 135853 240110 181140 571580 52340 505176 307141 584598
14896 584598 52095 -23646 230737 159997 415511 227023 96312 243405 269947 383077
14886 383077 259829 412350 292615 213324 277502 304676 295183 126112 160706 322392 368323
14875 368323 233064 496452 383834 10199 331875 451775 345324 257554 264212 513126
$$ packed form
14948A52921m0648K46864N2015j19855r3838O5695K91205B71999n6545A6002K46403
14937B62405l6404L7563B814L35676r2587P0610J39870I1185J72055M3852J11579
14926D18671A68228M5494Q0302K49416A15342C3420N01007j61358N0099P7321
14916E00489A18414K09827M8868A69929J71817g1944C76473J41424A67944J96574
14906C64518A11054K90471A35853J04257n8970L90440E2340M52836j98035K77457
14896E84598E2095b3646B30737p0740K55514j88488I6312J47093K6542J13130
14886C83077j23248J52521j19735p9291O4178K7174r493A26112L4594J61686M5931
14875C68323j35259K63388j12618A0199L21676J19900j06451q7770O658K48914
$$ plain form
14865 513126 214739 237692 442099 338094 632799 36740 402357 238989 248987 288975
14855 288975 522073 86630 509157 594399 321232 329815 619763 610154 513065 268751 510986
14844 510986 289804 247756 261205 373434 584000 298720 358947 442793 462015 483564 316965
14833 316965 334641 314911 293796 613128 160986 365630 560136 226889 358871 492202
14823 492202 292537 378828 347787 705636 482133 453139 418706 494021 291497 475910
14813 475910 780897 434052 213737 412190 408670 382064 488514 94892 335258 698868
14803 698868 466120 308557 481835 480130 510622 608347 475261 277574 373417 345807 333562
14792 333562 417018 334154 633910 427998 513427 493261 306775 584563 687901 193481
$$ packed form
14865E13126B14739K2953K04407j04005K94705C6740L65617j63368R998L9988
14855B88975K33098H6630M22527Q5242k73167Q583K89948r609r7089k44314K42235
14844E10986k21182m2048J3449J12229K10566k85280O0227Q3846J9222K1549j66599
14833C16965J7676j9730k1115L19332A60986K04644J94506B26889J31982J33331
14823D92202j99665Q6291l1041L57849k23503k8994l4433P5315k02524J84413
14813D75910L04987l46845B13737J98453l520k6606J06450I4892K40366L63610
14803F98868k32748j57563J73278j705L0492R7725j33086j97687R5843k7610j2245
14792C33562Q3456q2864K99756k05912Q5429k0166j86486K77788J03338A93481
$$ plain form
14781 383127 439974 526829 523150 622352 748726 735418 419099 545988 767864 630002 701661
14770 701661 833444 746991 622646 592090 498980 678024 402161 547271 416021 650743
14760 650743 733858 441382 557545 255707 490118 665984 757047 461995 733862 858747
14750 858747 518551 275415 610489 886192 666522 577329 707882 588476 432949 887749
14740 887749 662826 939453 392258 283496 511341 734451 523466 618518 819789 550807
14730 550807 302394 803422 853026 853991 690328 924317 860244 272542 790151 413882
14720 413882 843106 314324 232649 784614 614941 781179 746748 678003 855271 763691
14710 763691 820074 726171 609497 697020 764755 694814 633882 841612 670204 689335 1060638
$$ packed form
14781C83127N6847Q6855l679R9202J26374j3308l16319J26889K21876j37862P1659
14770G01661J31783q6453j24345l0556r3110J79044k75863J45110j31250K34722
14760F50743Q3115k92476J16163B55707K34411J75866R1063k95052K71867J24885
14750H58747l40196k43136L35074K75703k19670q9193J30553j19406j55527M54800
14740H87749k24923K76627C92258j08762K27845K23110k10985R5052K01271k68982
14730E50807k48413N01028M9604R65j63663K33989o4073B72542N17609l76269
14720D13882M29224C14324q1675N51965j69673J66238l4431o8745J77268r1580
14710G63691N6383r3903j16674Q7523O7735o9941o0932K07730j71408J9131L71303
$$ plain form
14699 1060638 649694 867790 855142 883956 895774 969466 726534 855685 876618 1177181
14689 1177181 920563 913777 620310 896701 1009347 798834 1040678 684819 1041008 1072141
14679 1072141 660833 736864 1173145 920857 1130911 982795 1020024 1236063 757279 950781
14669 950781 866432 1146883 930818 1087488 766812 1003706 828933 849591 986317 940933
14659 940933 1036203 1078939 716830 684533 1258606 973455 1137422 1013812 881054 1245566
14649 1245566 1136738 1290738 1121434 920030 1497238 1279721 1301402 1711236 1342300 1395049
14639 1395049 1153956 1083648 1060756 1029439 1262508 943091 1115357 1172822 1257216 1118535
14629 1118535 1422112 1470638 1153204 1083358 1554644 1358399 1520764 1084330 1236022 1267587
$$ packed form
14699A060638m10944K18096j2648K8814J1818P3692k42932J29151K0933L00563
14689A177181k56618o786k93467K76391J12646k10513K41844l55859L56189L1133
14679A072141m11308P6031M36281k52288K10054j48116L7229K16039m78784J93502
14669I50781q4349K80451k16065J56670l20676K36894j74773K0658J36726m5384
14659I40933R5270M2736l62109l2297N74073k85151J63967j23610j32758L64512
14649A245566j08828J54000j69304k01404N77208k17517K1681M09834l68936N2749
14639A395049k41093p0308k2892l1317K33069l19417J72266N7465Q4394j38681
14629A118535L03577M8526l17434o9846M71286j96245J62365m36434J51692L1565
$$ plain form
14619 1267587 1114034 1079192 1906028 1323150 1452509 1677070 1742134 1388869 1454588 1210774
14609 1210774 1440346 1626672 1609440 1426767 1568555 1516782 1308322 1585930 1693119 1637814
14599 1637814 1750643 1397523 1635898 1801161 1453394 1528258 1511083 1647959 1540355 1416748
14589 1416748 1672522 1638218 1778842 1583570 1831215 1820136 1917002 1901388 1845248 1564834
14579 1564834 1760695 1844845 1884084 1946894 1942216 2157192 2212584 2130867 2190817 2132734 2160550
14568 2160550 2594298 2336313 2171847 2269468 2504508 2289448 2193141 2460024 2423823 2547573
14558 2547573 2816860 2901648 2837586 3033355 3575771 3847768 4521946 5250196 6321287 8607359
14548 8607359 13494967 24124152 39726985 30977393 14947433 6983858 4551121 3354929
$$ packed form
14619A267587j53553l4842Q26836n82878J29359K24561O5064l53265O5719k43814
14609A210774K29572J86326j7232j82673J41788n1773k08460K77608J07189n5305
14599A637814J12829l53120K38375J65263l47767P4864j7175J36876j07604j23607
14589A416748K55774l4304J40624j95272K47645j1079R6866j5614n6140k80414
14579A564834J95861Q4150L9239O2810m678K14976N5392q1717N9950n8083K7816
14568B160550M33748k57985j64466R7621K35040k15060r6307K66883l6201J23750
14558B547573K69287Q4788o4062J95769N42416K71997O74178P28250J071091K286072
14548H607359M887608J0629185J5602833q749592A4947433F983858k432737j196192
$$ plain form
14540 3354929 2458557 2317459 2255244 2276985 2195489 2049464 2033286 1980255 1802567 2136230
14530 2136230 1976745 2033641 2330820 2332886 2319172 2281685 2306598 2309358 2137726 2551533 2381072
14519 2381072 2583953 2393355 2595751 2888653 2501891 2719536 2580187 2422978 2457229 2692113
14509 2692113 2564804 2149966 2835552 2675891 2801047 2858619 2782958 2831942 3030406 2923345
14499 2923345 2687032 3162306 3150139 3119175 3177247 3083825 3226737 3245355 3237726 3171165 3075522
14488 3075522 3122048 3409007 3355671 3192650 3364366 3499476 3572849 3642622 3950249 3702717
14478 3702717 3796452 4316970 3689461 3848002 3931028 3843147 3659811 4142509 4178435 4291082
14468 4291082 4149966 3884254 4066917 4120883 4377222 4311194 4254126 4555050 4624718 4798109
$$ packed form
14540C354929q96372j41098o2215K1741q1496j46025j6178n3031j77688L33663
14530B136230j59485N6896K97179K066j3714l7487K4913K760j71632M13807j70461
14519B381072K02881j90598K02396K92902l86762K17645j39349j57209L4251K34884
14509B692113j27309m14838O85586j59661J25156N7572p5661M8984J98464j07061
14499B923345k36313M75274j2167l0964N8072r3422J42912J8618p629o6561r5643
14488C075522M6526K86959n3336j63021J71716J35110P3373O9773L07627k47532
14478C702717R3735N20518o27509J58541Q3026q7881j83336M82698L5926J12647
14468D291082j41116k65712J82663N3966K56339o6028n7068L00924O9668J73391
$$ plain form
14458 4798109 4514820 5000508 5012724 4904110 5115662 4706740 5318734 5006003 5322392 5204734
14448 5204734 5008540 5360400 5400274 5657837 5238029 5779102 5647082 5599748 5742770 6031701
14438 6031701 6144911 5963748 6215375 6550059 6170625 6172590 6123484 6204564 6475063 6528389
14428 6528389 6795407 6763496 6946503 7328049 7215891 7149441 7254201 7310626 7185416 7745700
14418 7745700 7543147 7852267 8167624 8239316 8345684 8124812 8353142 8783290 8591402 8912460
14408 8912460 8903342 8998578 8995882 9267709 9600817 9570681 9931900 9866641 10219653 10227603 10389302
14397 10389302 10544195 10959858 11159633 10854598 11494018 11657841 11640866 11964926 12179869
14388 12179869 12652928 12856608 12627572 13244904 13254426 13341381 13963505 13889912 14647891 14915857
$$ packed form
14458D798109k83289M85688J2216j08614K11552m08922O11994l12731L16389j17658
14448E204734j96194L51860L9874K57563m19808N41073j32020m7334J43022K88931
14438F031701J13210j81163K51627L34684l79434J965m9106Q1080K70499N3326
14428F528389K67018l1911J83007L81546j12158o6450J04760N6425j25210N60284
14418G745700k02553L09120L15357P1692J06368k20872K28330M30148j91888L21058
14408H912460r118R5236k696K71827L33108l0136L61219o5259L53012P950J61699
14397A0389302J54893M15663J99775l05035O39420J63823j6975L24060K14943
14388A2179869M73059K03680k29036O17332R522Q6955O22124p3593P57979K67966
$$ plain form
14378 14915857 15275075 15340456 15669426 15940057 16422031 16741247 16741967 17108784 17692547 18025558
14368 18025558 18188504 18767107 19356223 19322602 19731962 20298196 20654227 20950166 21716411
14359 21716411 22174275 22647828 23272843 23894959 24252496 24753994 25243755 25961906 26541999
14350 26541999 27309413 27690767 28419464 29127673 29868622 31018713 31307308 32534735 33260704
14341 33260704 33984663 34968528 35810853 37037508 37855771 39106998 40252405 41299874 42612962
14332 42612962 43808009 45032375 46780335 47792638 49690613 50745110 52748997 54750781
14324 54750781 56190117 58103362 60345990 62387327 64136953 66374514 69024178 71855495
14316 71855495 74195986 76767448 80199963 83390074 86192285 89982426 93030921 97493320
$$ packed form
14378A4915857L59218O5381L28970K70631M81974L19216P20L66817N83763L33011
14368A8025558J62946N78603N89116l3621M09360N66234L56031K95939P66245
14359B1716411M57864M73553O25015O22116L57537N01498M89761P18151N80093
14350B6541999P67414L81354P28697P08209P40949J150091K88595J227427P25969
14341C3260704P23959R83865Q42325J226655Q18263J251227J145407J047469J313088
14332D2612962J195047J224366J747960J012303J897975J054497K003887K001784
14324E4750781J439336J913245K242628K041337J749626K237561K649664K831317
14316G1855495K340491K571462L432515L190111K802211L790141L048495M462399
$$ plain form
14308 97493320 101286696 105455703 109935546 115077309 120187671 125376430 130882911 137052776
14300 137052776 143478868 150134713 156886528 164852830 172915285 181221369 190183577 199653760
14292 199653760 209704362 220002258 231096535 242727573 254978803 267466527 280576539
14285 280576539 294017592 308179359 322496839 336585743 351001249 365368314 379176625
14278 379176625 392601259 405308194 416841181 427097787 435232041 440974735 442858470
14271 442858470 442779996 441591528 438756832 434332352 428631071 420603111 411429160 400415129
14263 400415129 387708663 373657538 358611180 343593974 328125414 312749188 298432745
14256 298432745 284544020 270469559 256870661 243887502 231939156 220021391 208766193
$$ packed form
14308I7493320L793376M169007M479843N141763N110362N188759N506481O169865
14300A37052776O426092O655845O751815P966302Q062455Q306084Q962208R470183
14292A99653760J0050602J0297896J1094277J1631038J2251230J2487724J3110012
14285B80576539J3441053J4161767J4317480J4088904J4415506J4367065J3808311
14278C79176625J3424634J2706935J1532987J0256606Q134254N742694J883735
14271D42858470p8474j188468k834696m424480n701281q027960r173951j1014031
14263D00415129j2706466j4051125j5046358j5017206j5468560j5376226j4316443
14256B98432745j3888725j4074461j3598898j2983159j1948346j1917765j1255198
$$ plain form
14249 208766193 198307319 188287430 178999418 170137090 162108180 154575525 146949452 139950830
14241 139950830 133348993 127420754 121640102 116433622 111364509 106590189 101760155 97335751
14233 97335751 93403307 89620316 86510257 82695481 79634864 76293373 73457700 70459292
14225 70459292 68143449 65429493 63085419 60944898 59058752 56928724 55063112 53084393
14217 53084393 51028011 49567847 47951574 46716731 45281519 43818018 42275167 41261184
14209 41261184 39773245 38773987 38229263 36748525 35833274 34783310 33759095 32921920 31894881
14200 31894881 31168252 30604912 29669084 28566869 28083002 27321754 26572673 26183569 25234037
14191 25234037 24659858 24030236 23670573 23222060 22406903 21830674 21489640 21044954 20604031
$$ packed form
14249B08766193j0458874j0019889r288012q862328q028910p532655p626073o998622
14241A39950830o601837n928239n780652n206480n069113m774320m830034m424404
14233I7335751l932444l782991l110059l814776l060617l341491k835673k998408
14225G0459292k315843k713956k344074k140521j886146k130028j865612j978719
14217E3084393k056382j460164j616273j234843j435212j463501j542851j013983
14209D1261184j487939r99258n44724j480738r15251j049964j024215q37175j027039
14200C1894881p26629n63340r35828j102215m83867p61248p49081l89104r49532
14191B5234037n74179o29622l59663m48513q15157n76229l41034m44686m40923
$$ plain form
14182 20604031 20085943 19624850 19087704 18710107 18483390 18247528 17691156 17328766 17212160
14173 17212160 16523864 16523431 15925738 15638512 15345976 14818074 14888136 14747406 14474146 13958118
14163 13958118 13780000 13496670 13232931 12845830 12965596 12332539 12460377 12500093 12043313
14154 12043313 11716277 11640071 11413846 11359770 11114054 10608118 10578446 10623316 10231456 10188903
14144 10188903 10271261 9692186 9536963 9602398 9729071 9401101 9300094 9251271 8806754 9052137
14134 9052137 8578454 8604079 8541759 8178366 8150860 7977956 8116892 7649751 7623098 7439155
14124 7439155 7681611 7538558 7043248 7082573 6939292 7085395 6641983 6815847 6695955 6869817
14114 6869817 6741423 6335042 6810088 6591911 6312474 6019628 5990977 6062312 5874558 5673398
$$ packed form
14182B0604031n18088m61093n37146l77597k26717k35862n56372l62390j16606
14173A7212160o88296m33n97693k87226k92536n27902P0062j40730k73260n16028
14163A3958118j78118k83330k63739l87101J19766o33057J27838L9716m56780
14154A2043313l27036p6206k26225n4076k45716n05936k9672M4870l91860m2553
14144A0188903Q2358n79075j55223O5435J26673l27970j01007m8823m44517K45383
14134I052137m73683K5625o2320l63393k7506j72904J38936m67141k6653j83943
14124G439155K42456j43053m95310L9325j43281J46103m43412J73864j19892J73862
14114F869817j28394m06381M75046k18177k79437k92846k8651P1335j87754k01160
$$ plain form
14104 5673398 5982146 5767836 5475422 5591582 5571110 5480440 5441218 5107431 5128616 5014535
14094 5014535 5133030 5039549 4915562 4918915 5168383 4643126 4989966 4514912 4770336 4756850
14084 4756850 4639970 4610162 4412146 4828487 4436661 4148975 4170411 4621990 3957606 4029475
14074 4029475 4028701 4403169 4186242 4076627 4205386 3936645 3891402 3975563 3765671 3799124
14064 3799124 3749721 3934863 3735901 3454024 3602679 3737627 3398679 3771897 3502571 3393438
14054 3393438 3495335 3673313 3303208 3133471 3207509 3734325 3323532 3010932 3253496 2980553
14044 2980553 3126425 2792974 2824002 2848588 3122159 2860612 2803447 2839066 2888137 2755257
14034 2755257 2911570 2949873 2787875 2958068 2646883 2877675 2660456 2820697 2414030 2737927
$$ packed form
14104E673398L08748k14310k92414J16160k0472r0670l9222l33787K1185j14081
14094E014535J18495r3481j23987L353K49468n25257L46840m75054K55424j3486
14084D756850j16880k9808j98016M16341l91826k87686K1436M51579o64384P1869
14074D029475p74L74468k16927j09615J28759k68741m5243Q4161k09892L3453
14064C799124m9403J85142j98962k81877J48655J34948l38948L73218k69326j09133
14054C393438J01897J77978l70105j69737P4038N26816m10793l12600K42564k72943
14044B980553J45872l33451L1028K4586K73571k61547n7165L5619M9071j32880
14034B755257J56313L8303j61998J70193l11185K30792k17219J60241m06667L23897
$$ plain form
14024 2737927 2572410 2464552 2597168 2384957 2798798 2330058 2302686 2476083 2557544 2142533
14014 2142533 2246115 2602562 2294640 2521091 2499785 2157575 2329651 2351824 2259699 2132914
14004 2132914 1880277 1863904 2356347 1775646 2247455 2185956 2020715 2158972 2212634 2021512
13994 2021512 2094257 2453877 2297964 2873805 3203709 4489158 8219469 16993894 34081076
13985 34081076 33297639 19021412 11130154 7388481 5365895 4334080 3691583 3411804
13977 3411804 3244735 3095029 2791022 2623659 2523450 2166109 2358768 2547237 2215343
13968 2215343 2348081 2473982 2114234 1917172 2447715 2251520 1787491 1781021 2149554 2021448
13958 2021448 1537501 1931943 1868681 2061527 1865565 1935462 1683350 2063976 1479468 1703581
$$ packed form
14024B737927j65517j07858J32616k12211M13841m68740k7372J73397Q1461m15011
14014B142533J03582L56447l07922K26451k1306l42210J72076K2173r2125j26785
14004B132914k52637j6373M92443n80701M71809o1499j65241J38257N3662j91122
13994B021512P2745L59620j55913N75841L29904J285449L730311Q774425J7087182
13985C4081076p83437j4276227p891258l741673k022586j031815o42497k79779
13977C411804j67069j49706l04007j67363j00209l57341J92659J88469l31894
13968B215343J32738J25901l59748j97062N30543j96195m64029o470L68533j28106
13958B021448m83947L94442o3262J92846j95962O9897k52112L80626n84508K24113
$$ plain form
13948 1703581 1848225 1471491 1695875 1828025 1518008 1506978 1320240 1407511 1862809 1513857
13938 1513857 1607984 1722610 1756637 1633432 1551770 1714131 1724191 1372868 1449201 1312276
13928 1312276 1396531 1312260 1442556 1419999 1362567 1452574 1239201 1233815 1060555 1439892 1124385
13917 1124385 916394 1395245 1413987 1228349 1203681 1398081 1142736 1261566 1196710 1245420
13907 1245420 1361784 1227987 1383069 1414673 1542417 1266849 1445203 1586048 1249451 1455025
13897 1455025 888420 1216990 1333043 1227504 1184801 935932 1055361 1326419 1144844 1092607
13887 1092607 1093573 1174025 842400 1290887 1070317 1090463 603517 1049972 696147 1047829
13877 1047829 878507 1147374 1419984 1158143 1322915 913116 1007612 737385 1048753 725689
$$ packed form
13948A703581J44644l76734K24384J32150l10017j1030j86738Q7271M55298l48952
13938A513857R4127J14626L4027j23205q1662J62361J0060l51323P6333j36925
13928A312276Q4255q4271J30296k2557n7432R0007k13373n386j73260L79337l15507
13917A124385k07991M78851J8742j85638k4668J94400k55345J18830o4856M8710
13907A245420J16364j33797J55082L1604J27744k75568J78354J40845l36597K05574
13897A455025n66605L28570J16053j05539m2703k48869J19429K71058j81575n2237
13887A092607R66Q0452l31625M48487k20570K0146m86946M46455l53825L51682
13877A047829j69322K68867K72610k61841J64772m09799R4496k70227L11368l23064
$$ plain form
13867 725689 1054729 858445 859005 1090352 855809 938990 1010308 771198 1023432 1004076 1078672
13856 1078672 905312 949599 983898 891221 670712 976095 577615 843135 952876 919970
13846 919970 910146 944350 904513 726145 945842 887218 1298084 1086304 925511 912352 666514
13835 666514 1037201 858750 881315 804203 831081 864638 881671 1137238 828880 763715 739511
13824 739511 1032709 920407 1026248 756793 881354 775472 814448 980906 894895 854977
13814 854977 776770 666613 846368 796725 692635 686315 1114434 319879 946385 592069
13804 592069 675088 868028 676530 797632 685234 741575 687233 447607 688842 548819
13794 548819 933372 717221 910001 727267 564727 752431 875482 586155 373826 754490
$$ packed form
13867G25689L29040j96284N60K31347k34543Q3181P1318k39110K52234j9356P4596
13856A078672j73360M4287L4299r2677k20509L05383l98480K65520J09741l2906
13846I19970r824L4204l9837j78368K19697n8624M10866k11780j60793j3159k45838
13835F66514L70687j78451K2565p7112K6878L3557J7033K55567l08358o5165k4204
13824G39511K93198j12302J05841k69455J24561j05882L8976J66458q6011l9918
13814H54977p8207j10157J79755m9643j04090o320M28119C19879O26506l54316
13804E92069Q3019J92940j91498J21102j12398N6341n4342k39626K41235j40023
13794E48819L84553k16151J92780j82734j62540J87704J23051k89327k12329L80664
$$ plain form
13784 754490 871008 868206 482396 753828 652981 620297 401526 650079 675194 611657
13774 611657 655337 728097 371758 546458 444320 675682 671753 505420 736180 966597
13764 966597 516383 554770 564940 575660 400207 682820 561152 500817 641391 646247 485324
13753 485324 617103 453637 438381 535085 597140 517686 655674 512524 830420 829991 676441
13742 676441 893361 950967 602388 575088 579741 686331 314351 409627 340710 780937 672848
13731 672848 710389 646295 435101 513336 270051 480992 519537 603743 523286 327295 108366
13719 584600 678467 298802 479794 878316 758100 667646 918726 330603 448635 521725
13709 521725 859856 282294 176914 488361 595484 189426 566122 699718 563577 197489
$$ packed form
13784G54490J16518k802l85810K71432j00847l2684k18771K48553K5115o3537
13774F11657M3680P2760l56339J74700j02138K31362l929j66333K30760K30417
13764I66597m50214L8387J0170J0720j75453K82613j21668o0335J40574M856j60923
13753D85324J31779j63466j5256R6704O2055p9454J37988j43150L17896m29j53550
13742F76441K16920N7606l48579k7300M653J06590C14351R5276o8917M40227j08089
13731F72848L7541o4094k11194P8235k43285K10941L8545Q4206q0457j95991A08366
13719E84600R3867B98802J80992L98522j20216r0454K51080C30603J18032P3090
13709E21725L38131B82294j05380L11447J07123A89426L76696J33596j36141A97489
$$ plain form
13698 296322 249413 467175 373995 531417 605068 800818 396214 480108 295597 -87412
13687 373701 439468 586178 219504 369586 526720 78095 683456 225584 247288 547686
13677 547686 440843 606715 452045 510039 171987 453377 586991 415994 542158 391159
13667 391159 90083 665252 173313 417538 606407 385051 463597 624515 349151 353239
13657 353239 247040 80050 545585 266593 265836 467803 59506 710611 439548 316194
13647 316194 128512 494861 490333 548161 481588 512222 334576 328169 152228 447928 147796
13635 489752 504791 602504 243223 73498 441121 217405 256600 321947 429311 40008 342050
13624 342050 355014 197804 348117 242827 168824 162921 276120 255633 279473 288894 514947
$$ packed form
13698B96322m6909K17762r3180J57422P3651J95750C96214Q3894j84511h7412
13687C73701O5767J46710B19504J50082J57134G8095O05361B25584K1704L00398
13677E47686j06843J65872j54670N7994A71987K81390J33614j70997J26164j50999
13667C91159I0083N75169A73313K44225J88869k21356P8546J60918k75364M088
13657C53239j06199H0050M65535B66593p57K01967E9506O51105k71063j23354
13647C16194A28512L66349m528N7828o6573L0634j77646o407A52228K95700A47796
13635D89752J5039R7713B43223G3498L67623B17405L9195O5347J07364D0008L02042
13624C42050J2964j57210J50313j05290p4003n903J13199k0487K3840R421K26053
$$ plain form
13613 514947 348196 292352 191576 216613 249404 839040 337955 320241 28647 344640
13603 344640 375193 432046 343789 504910 618534 506230 235046 397540 370221 748171
13593 748171 259522 243298 244726 286832 521701 -134938 484583 233756 194975 451733
13583 451733 441833 482496 342718 158353 494603 394205 302938 190635 197021 471817 219821
13571 281287 302779 353884 535821 210505 312654 722 652104 192768 -13652 463727 373230
13560 373230 418195 379261 284319 259963 156170 165190 50349 60852 63370 13283 512879
13549 512879 333210 291190 122388 25805 316988 378618 160715 516559 157488 471495
13539 471495 201832 13746 334464 216530 185624 228565 378358 398985 420131 326199 217179
$$ packed form
13613E14947j66751n5844j00776K5037L2791N89636C37955j7714B8647L15993
13603C44640L0553N6853q8257J61121J13624j12304B35046J62494k7319L77950
13593G48171B59522j6224J428M2106K34869a34938D84583B33756l8781K56758
13583D51733r900M0663j39778A58353L36250j00398r1267j12303O386K74796B19821
13571B81287K1492N1105J81937B10505J02149G22O51382A92768a3652D63727r0497
13560C73230M4965l8934r4942k4356j03793R020E0349J0503K518A3283M99596
13549E12879j79669m2020A22388B5805K91183O1630A60715L55844A57488L14007
13539D71495B01832A3746L20718j17934l0906M2941J49793K0627K1146r3932j09020
$$ plain form
13528 217179 254052 558063 -162536 388554 156150 104810 74297 95546 347857 298120
13518 298120 218110 -345422 168606 4575 441283 223403 251969 121376 89131 235179
13508 235179 272653 1212 433055 102847 429665 295993 262947 161965 210453 348505
13498 348505 269404 90576 233994 131484 111540 116275 19742 71918 239398 273269 460996
13487 460996 257911 63289 416573 478570 35288 248548 -128354 616820 133582 184395
13477 184395 269406 157434 313301 30474 517741 412347 420912 6893 175268 -28397 -70283
13466 -70283 12199 76679 242449 285410 273629 26370 192501 165249 55567 91188 400610
13455 400610 344619 310650 138310 205394 125674 103875 679911 143832 70302 206933 564891
$$ packed form
13528B17179L6873L04011a62536C88554A56150n1340l0513K1249K52311m9737
13518B98120q0010c45422A68606D575M36708k17880K8566A21376l2245J46048
13508B35179L7474A212M31843A02847L26818j33672l3046j00982M8488J38052
13498C48505p9101I0576J43418j02510j9944M735A9742N2176J67480L3871J87727
13487D60996k03085F3289L53284O1997C5288K13260a28354F16820A33582N0813
13477A84395Q5011j11972J55867C0474M87267j05394Q565F893J68375b8397m1886
13466g0283A2199O4480J65770M2961j1781B6370J66131k7252E5567L5621L09422
13455D00610n5991l3969A38310O7084p9720k1799N76036A43832G0302J36631L57958
$$ plain form
13444 564891 -78105 53415 25036 90465 351648 329146 4391 362220 243434 223610 120300
13433 120300 245469 58833 41223 396278 136986 295716 157668 288133 37936 151642
13423 151642 407179 128596 105870 18722 -26623 66278 -119149 184217 385919 82888
13412 180818 148466 -49005 277748 268304 129713 420614 81799 258710 111858 -22520 155615
13400 110027 22293 157679 82575 210262 234923 404920 -17069 387935 259183 58368
13389 64027 373454 249685 440580 165162 344831 21468 124693 242488 -344090 239707
13378 213405 413253 32311 102849 346934 139918 243061 139836 73617 503307 263377
13368 263377 249079 335961 43803 10921 274697 86540 -55772 331825 -127425 401553 171720
$$ packed form
13444E64891g8105E3415B5036O5429K61183k2502D391L57829j18786j9824j03310
13433A20300J25169E8833j7610L55055A36986J58730j38048J30465C7936J13706
13423A51642K55537A28596k2726A8722b6623F6278a19149A84217K01702H2888
13412A80818l2352d9005B77748r444A29713K90901H1799J76911A11858b2520A55615
13400A10027B2293J35386p5104J27687K4661J69997a7069C87935j28752E8368
13389F4027L09427j23769J90895A65162J79669B1468J03225J17795c44090B39707
13378B13405J99848C2311P0538K44085A39918J03143j03225o6219M29690k39930
13368B63377j4298Q6882D3803A0921K63776H6540e5772C31825a27425D01553A71720
$$ plain form
13356 95478 193874 153984 325287 133037 352988 442670 -121303 513137 90311 499536
13346 499536 219198 201036 372369 277848 246583 22043 255199 536920 362577 225544
13336 225544 326527 271802 230446 -4408 172772 434564 36057 -151251 401917 259626
13326 259626 347930 125345 50822 250406 146734 78794 461737 485750 352374 182139
13316 182139 109993 414389 81765 119091 1856 -134516 -9990 -185757 95047 216913 309028
13305 309028 38726 180501 399736 134397 189056 452785 105914 -99455 299072 49253
13294 176336 102965 98065 252802 157149 73702 -148436 251889 -190046 -42659 -94833 -47425
13283 -47425 -153208 130043 166558 133144 158336 52699 85142 55918 -49573 -181250 108626
$$ packed form
13356I5478R8396l9890J71303A33037K19951Q9682a21303E13137I0311M09225
13346D99536B19198j8162J71333r4521l1265B2043K33156K81721j74343j37033
13336B25544J00983n4725m1356d408A72772K61792C6057a51251D01917j42291
13326B59626Q8304A25345E0822J99584j03672o7940L82943K4013j33376j70235
13316A82139p2146L04396H1765L7326A856a34516i990j75767I5047J21866R2115
13305C09028C8726J41775K19235A34397N4659K63729A05914i9455B99072D9253
13294A76336p3371m900J54737r5653G3702a48436B51889a90046d2659n2174M7408
13283d7425j05783A30043L6515l3414K5192E2699L2443k9224d9573j31677A08626
$$ plain form
13271 129682 105133 252776 414974 215884 58982 -49683 52733 143374 269015 121670
13260 98635 362869 132707 78610 -60491 189110 -268710 16200 232164 284401 165647
13250 165647 44621 114495 211658 194150 141429 23217 141287 -112067 -127256 163086 112471
13239 112471 443041 150465 67114 387388 78947 46629 141234 152328 134286 269108 195105
13228 195105 262632 -126686 404409 215747 57856 115141 391252 109427 123267 304562
13218 304562 365106 132918 43421 -132462 114192 -66368 -106091 -28610 266989 417712
13208 417712 289241 -54648 128879 -112739 141503 -90657 129194 -18132 -51269 151085
13197 320138 277632 90342 211505 260602 -187059 338514 332033 58495 -1390 121759 -114064
$$ packed form
13271A29682k4549J47643J62198j99090E8982d9683E2733R0641J25641A21670
13260I8635K64234A32707n4097f0491A89110b68710A6200K15964N2237j18754
13250A65647D4621O9874R7163j7508n2721B3217J18070a12067j5189A63086n0615
13239A12471L30570A50465F7114L20274G8947l2318R4605J1094j8042J34822p4003
13228A95105O7527a26686D04409j88662E7856N7285K76111A09427J3840J81295
13218C04562O0544A32918D3421a32462A14192f6368l9723b8610B66989J50723
13208D17712j28471e4648A28879a12739A41503i0657A29194a8132l3137A51085
13197C20138m2506I0342J21163M9097a87059C38514o481E8495a390A21759a14064
$$ plain form
13185 -131002 -124168 -15548 -186485 -90593 260167 191711 238080 -429090 148722 149556 201911
13174 201911 -214337 -90203 152744 20821 -43933 359886 193171 70988 -55085 -15546 37621
13162 77343 51498 409554 -106193 -53066 284774 179741 239871 43246 206925 119095 -37099
13150 -52914 117894 219521 307380 97378 -249422 127389 11589 253398 -71241 103257
13139 156787 172255 315256 160038 188492 -68171 172226 -250289 74060 -88172 -274753
13129 -274753 73111 -268633 -116105 219818 99199 -236794 -21490 190820 -288812 123968
13118 -116792 46394 298659 179593 332898 63834 175735 -91703 -134645 99481 -50577 -189068
13107 -189068 108959 -168520 70194 -139481 -156145 9950 57924 110540 -185765 153985 102359
$$ packed form
13185a31002O834a5548j70937i0593B60167o8456M6369d29090A48722Q34N2355
13174B01911b14337i0203A52744B0821d3933C59886j66715G0988e5085a5546C7621
13162G7343k5845L58056a06193e3066B84774j05033O0130D3246J63679q7830c7099
13150e2914A17894J01627Q7859I7378b49422A27389A1589K41809g1241A03257
13139A56787J5468J43001j55218K8454f8171A72226b50289G4060h8172j86581
13129b74753G3111b68633a16105B19818I9199b36794b1490A90820b88812A23968
13118a16792D6394K52265j19066J53305F3834J11901i1703m2942I9481e0577j38491
13107a89068A08959a68520G0194a39481j6664I950M7974N2616a85765A53985n1626
$$ plain form
13096 102359 -93736 213115 100013 -149812 134725 240825 232072 -281473 111639 219358
13086 219358 26226 136917 132857 206772 235953 -115147 -6095 311226 -400316 -22679 124780
13074 95821 209283 -113833 26900 155490 61838 171321 76809 445136 48487 289680
13064 289680 -74888 -40841 -441834 192084 20136 -19658 292858 107455 5865 -140354 -41151
13052 117493 -56942 -139900 -34302 384258 77707 259853 -61257 309249 213309 -114517 -56106
13040 178246 71570 43616 216790 213607 151083 479571 98103 -163409 382201 201745 -6278
13028 70856 411495 251630 386362 65820 200299 33716 132413 -213788 502854 -10205
13017 -155757 59020 -127298 104432 57781 -7384 -18752 128818 72627 -140116 68079 438077
$$ packed form
13096A02359i3736B13115A00013a49812A34725J06100q753b81473A11639J07719
13086B19358B6226J10691m060P3915K9181a15147f095C11226d00316b2679A24780
13074I5821J13462a13833B6900J28590F1838J09483G6809L68327D8487K41193
13064B89680g4888L4047m00993A92084B0136a9658B92858A07455E865a40354d1151
13052A17493e6942q2958c4302C84258G7707J82146f1257C09249r5940a14517e6106
13040A78246G1570k7954J73174l183o2524L28488I8103a63409C82201j80456f278
13028G0856L40639j59865J34732F5820J34479C3716R8697b13788E02854a0205
13017a55757E9020a27298A04432m6651g384j1368A28818n6191a40116F8079L69998
$$ plain form
13006 438077 -1651 186976 76161 -108876 176657 239071 96919 -39287 270176 -8184 60958
12994 -197254 186903 -77351 -180809 -89478 -158288 14234 51019 -65720 -167305 30293 -231501
12982 -27139 -35151 191523 -124320 -165973 -64204 211147 -372362 174498 138788 91018 -165301
12970 -245431 -160686 -112897 175923 45611 31566 -17938 241207 104093 -112430 -108735 361830
12958 266164 21781 78319 -200638 370235 9613 -99840 -8276 104533 -297269 -358391 107878
12946 -304650 -124653 142244 -288472 142989 -75956 322843 171934 -140356 271569 98390
12935 152162 246107 70240 139698 220907 -136983 216944 128083 -186153 105736 56305 -24512
12923 439969 441775 -101258 -139355 -24888 262888 83352 -254609 -99123 240758 785 -4759
$$ packed form
13006D38077a651A86976G6161a08876A76657O2414I6919c9287B70176h184F0958
12994a97254A86903g7351j03458h9478o8810A4234L6785f5720j01585C0293b31501
12982b7139q012A91523a24320m1653f4204B11147c72362A74498l5710m7770a65301
12970b45431Q4745M7789A75923D5611j4045a7938B41207A04093a12430L695C61830
12958B66164B1781N6538b00638C70235I613i9840h276A04533b97269o1122A07878
12946c04650a24653A42244b88472A42989g5956C22843j50909a40356B71569I8390
12935A52162R3945G0240O9458Q1209a36983B16944q8861a86153A05736m9431b4512
12923D39969J806a01258l8097b4888B62888H3352b54609i9123B40758G85d759
$$ plain form
12911 -70378 139273 -275470 -131160 74899 322209 -69000 107749 -537996 180581 134448
12901 134448 -174086 5892 380409 -25472 -271324 -123432 168966 -187988 -105935 -96084 -78154
12890 -78154 60973 123873 -70122 327381 -290605 -123956 12235 182717 81047 -57230 72288
12878 -20945 156106 -176322 92439 -67076 104815 313928 90935 242618 27540 32526 -91299
12866 84910 -76164 -10685 -97667 389452 48156 152217 -147858 -177801 -72332 -149949 215968
12854 113805 177377 -200868 -26661 68710 -157360 -175156 198037 80949 -1139 111374 41591
12842 22939 240127 -40115 -313783 -131188 -22149 6299 -108573 -110615 164377 -10562 -221823
12831 -221823 9499 138942 211577 -897 -307792 194998 -207709 128283 -159199 -114998 -57891
$$ packed form
12911g0378A39273b75470a31160G4899K47310f9000A07749e37996A80581m6133
12901A34448a74086E892L74517b5472k45852a23432A68966a87988Q2053R851J7930
12890g8154F0973O2900g0122C27381b90605a23956A2235J70482H1047e7230G2288
12878b0945A56106a76322I2439f7076A04815K09113I0935J51683B7540M986i1299
12866H4910g6164a0685q6982C89452D8156J04061a47858k9943g2332p7617B15968
12854A13805O3572b00868b6661F8710a57360j7796A98037H0949a139A11374D1591
12842B2939K17188d0115k73668a31188b2149F299a08573k042A64377a0562k11261
12831b21823I499J29443P2635h97l06895A94998b07709A28283a59199M4201N7107
$$ plain form
12820 -57891 -262225 117403 -85788 13506 -37335 121334 -48024 163652 94026 -9502 -152162
12809 -152162 154440 -146205 -136893 -67925 187357 83912 317953 41814 -335061 185104
12798 -141861 -36593 54313 -156749 459096 88678 120909 -361067 -120521 -62526 -35361 98107
12786 287276 -344761 205601 -256590 232433 -19744 142895 -254011 10767 81236 123605
12776 123605 -64403 -29391 -91745 38675 -191059 -162461 98992 -290421 75613 -166406 -107926
12765 -107926 143672 85934 -35496 -184490 186265 298229 -20689 -226803 110881 167603
12755 167603 -226110 422050 -290430 -225025 -244532 179788 47181 10535 -155996 112258
12744 231765 26689 146945 7740 -66467 -23771 -38813 80760 -43600 261940 -165800 107898
$$ packed form
12820e7891k04334A17403h5788A3506c7335A21334d8024A63652o9626i502j42660
12809a52162A54440a46205R312f7925A87357H3912K34041D1814c35061A85104
12798a41861c6593E4313a56749D59096H8678L2231c61067a20521N7995K7165I8107
12786B87276c44761B05601b56590B32433a9744A42895b54011A0767P0469M2369
12776A23605f4403b9391o2354C8675a91059K8598I8992b90421G5613a66406N8480
12765a07926A43672n7738c5496j48994A86265J11964b0689k06114A10881N6722
12755A67603b26110D22050b90430O5405j9507A79788D7181A0535a55996A12258
12744B31765B6689J20256G740f6467b3771j5042H0760d3600B61940a65800A07898
$$ plain form
12732 -21634 231041 123219 -48559 -211186 -55195 -137924 -183714 388 117385 -71266 -110565
12721 -110565 13730 -131057 -40739 -73527 67918 -11457 10414 39641 -119258 -30443 -62614
12710 -62614 202280 254785 176755 321202 67382 316502 489433 302357 -138164 93593
12699 441769 103469 -26145 116066 141024 -106354 -122697 167107 -111204 -11831 -15388 104572
12687 226242 -39915 -180952 -219676 11736 -31244 345976 -175341 13494 -23154 12908 -120903
12675 12129 225503 25605 28141 -35650 -65130 280240 91887 123282 38940 68217 -119253
12663 162999 -373 -149826 110033 200763 321730 -101433 -92752 264576 258262 13686 -81535
12651 -64633 306742 54883 122578 -49315 82019 92792 -50642 -134103 68137 -146133 -246645
$$ packed form
12732b1634B31041j07822d8559j62627e5195q2729m5790C88J16997g1266l9299
12721a10565A3730a31057d0739l2788F7918a1457A0414K9227a19258c0443l2171
12710f2614B02280N2505p8030J44447F7382K49120J72931j87076a38164I3593
12699D41769A03469b6145A16066K4958a06354j6343A67107a11204a1831l557A04572
12687B26242c9915j41037l8724A1736c1244C45976a75341A3494b3154A2908a20903
12675A2129K13374B5605K536c5650k9480B80240I1887L1395C8940K9277a19253
12663A62999c73j49453A10033R0730J20967a01433Q681B64576o314A3686h1535
12651f4633C06742E4883O7695d9315H2019J0773e0642q3461F8137a46133j00512
$$ plain form
12640 -246645 6630 159439 234776 -114192 29503 -142807 -45210 -28253 264102 -205755 -32140
12628 239286 254714 -122939 166274 137470 301786 123887 506708 153267 -30145 187816
12617 119402 24967 360729 -234237 -6337 64118 -131748 -86224 -122971 136738 -148620 240338
12605 -431662 79192 -266456 234702 140708 68643 -163140 154549 -135516 -84605 282116
12594 89881 99414 -194310 -213995 143344 368982 18187 114598 -501312 10856 302722 206942
12583 206942 337173 114295 -225639 127731 142783 62643 -322634 8139 -130005 -189847
12573 -189847 122921 -23030 -305850 -404069 147727 -366353 -74938 106863 -116423 -61941
12563 -61941 9007 -94682 -82402 -51420 -260279 -7071 233211 228397 -99875 264161 52713 -140849
$$ packed form
12640b46645F630J52809P5337a14192B9503a42807d5210J6957B64102b05755c2140
12628B39286J5428a22939A66274k8804J64316A23887L82821A53267c0145A87816
12617A19402B4967L35762b34237f337F4118a31748M5524l6747A36738a48620B40338
12605d31662G9192b66456B34702r3994F8643a63140A54549a35516N0911B82116
12594H9881R533a94310j9685A43344K25638A8187R6411e01312A0856K91866r5780
12583B06942J30231A14295b25639A27731J5052F2643c22634H139a30005n9842
12573a89847A22921b3030k82820r8219A47727c66353g4938A06863a16423N4482
12563f1941I007i4682J2280L0982k08859g071B33211m814i9875B64161E2713a40849
$$ plain form
12550 45394 -270063 133208 -152177 387099 -155882 20708 161372 66796 -51514 45360
12539 135654 -332604 8748 -631 222472 31103 -201110 391910 191152 -90969 -337429 -39109
12527 -108814 52987 -201043 67951 -26320 -41320 -34450 31932 163369 -239391 -81529 136347
12515 -11936 47069 -125634 -155805 -42578 175360 -61999 15974 89687 140820 33553 226210
12504 226210 -33997 57887 -25783 149337 -53765 10416 -122508 -156566 190733 257296 54641
12492 118617 17626 -156329 -195039 126256 33174 156152 67921 140460 -333581 -340425 -19926
12480 48121 94181 -206685 171294 115178 13969 57786 -104064 -194950 -112795 13019 60862
12469 60862 -19907 4758 58559 -200269 7747 -177245 -189120 288892 117063 -2428 -153862
$$ packed form
12550D5394b70063A33208a52177C87099a55882B0708J40664F6796e1514D5360
12539A35654c32604H748f31B22472C1103b01110C91910A91152i0969k46460c9109
12527a08814E2987b01043F7951b6320j5000O870C1932J31437b39391h1529A36347
12515a1936D7069a25634l0171d2578A75360f1999A5974P3713N1133C3553J92657
12504B26210c3997E7887b5783A49337e3765A0416a22508l4058A90733O6563E4641
12492A18617A7626a56329l8710A26256C3174J22978F7921P2539c33581o844a9926
12480D8121M6060b06685A71294n6116A3969M3817a04064r0886Q2155A3019M7843
12469F0862a9907D758N3801b00269G747a77245j1875B88892A17063b428j51434
$$ plain form
12458 -153862 124463 -44082 196146 286389 -182028 -41864 4601 -277514 -2838 -26955 -61556
12447 -61556 -33390 435843 163082 122050 -188257 391062 -33848 -263871 -71686 -27998 -213399
12436 -213399 -125086 281350 7653 176711 -178903 -51754 113122 100391 -121895 -91368 78476
12424 100036 -142265 -131685 -32177 -42808 60924 -116280 63145 3825 309474 122640 370287
12413 370287 -196755 508518 102001 25178 162469 66249 82776 -205866 140931 79583
12403 79583 -149746 -90536 -132283 13621 25406 -38358 -181313 -365950 -224651 -94708 -53896
12392 -53896 -88869 -30923 3138 51246 -96375 232585 -229675 -136406 265153 123040 98542
12381 98542 -128062 -114847 -47619 -149455 31249 -19799 -237868 48918 172501 170325 -81518
$$ packed form
12458a53862A24463d4082A96146R0243a82028d1864D601b77514b838k4117l4601
12447f1556K8166D35843A63082m1032a88257C91062c3848k30023g1686b7998j85401
12436b13399Q8313B81350G653J69058a78903e1754A13122j2731a21895L0527G8476
12424A00036a42265J0580c2177j0631F0924a16280F3145C825L05649A22640K47647
12413C70287a96755E08518A02001B5178J37291F6249J6527b05866A40931o1348
12403G9583a49746N9210m1747A3621J1785c8358j42955j84637J41299i4708M0812
12392e3896l4973c0923C138M8108i6375B32585b29675R3269B65153A23040k4498
12381I8542a28062J3215d7619j01836C1249a9799k18069D8918J23583k176h1518
$$ plain form
12369 -222903 -4404 -194779 -210152 -60755 67391 -282843 237043 -88641 -137265 105132 137620
12358 137620 64468 -180381 -89173 -36438 254764 14751 122498 -11270 -303188 34892 246717
12347 246717 -199199 -53457 204301 303411 -123592 45612 170799 267361 71828 -132122
12336 -118857 -223262 -240224 121676 -37248 -146750 57900 -1438 69911 -133397 -182260 -80163
12324 -81262 -72128 -42163 -26489 182986 259841 113458 -122802 -130830 245461 450192 -197681
12312 268959 -87378 -183063 -348208 -27336 69859 -100213 125321 156227 19639 -43563 71044
12300 -53522 68732 228476 197946 139323 33960 -157893 -200677 -104692 109742 393079 -196976
12288 387771 75756 -110131 -116677 -1515 176272 -266144 -218815 49865 148330 67181 -142510
$$ packed form
12369b22903d404j90375j5373f0755F7391b82843B37043h8641m8624A05132L2488
12358A37620F4468a80381h9173c6438B54764A4751J07747a1270k91918C4892K11825
12347B46717a99199e3457B04301R9110a23592D5612J25187R6562G1828a32122
12336a18857j04405j6962A21676c7248j09502E7900a438F9911a33397m8863h0163
12324h1262R134K9965J5674A82986P6855A13458a22802q028B45461K04731a97681
12312B68959h7378r5685j65145b7336F9859a00213A25321L0906A9639d3563G1044
12300e3522F8732J59744l0530n8623C3960a57893m2784R5985A09742K83337a96976
12288C87771G5756a10131o546a515A76272b66144M7329D9865R8465F7181a42510
$$ plain form
12276 117646 100892 13352 144986 105932 156773 204730 101864 -41887 255816 130589 2483
12264 -107092 -5602 157217 413617 -37821 293303 -181794 -65736 278683 154620 110975
12254 110975 94830 173861 -52461 111439 205586 -17284 27033 80795 245975 152828 20894
12242 182271 -43626 309897 45834 104707 93478 141827 87724 10313 30061 -43241 -22445
12231 -22445 -75296 41104 157725 205488 296031 99454 132137 272726 247026 123431 209982
12220 209982 106990 378339 331664 161372 492680 206601 -47012 467792 184988 -191318
12209 29157 -187732 226541 192392 147250 93659 134072 397277 411523 277158 316832 87412
12197 171211 81370 -103419 -140875 46688 -87138 236157 28876 -107373 -8454 -82117 52117
$$ packed form
12276A17646j6754A3352J31634l9054N0841M7957A01864d1887B55816j25227B483
12264a07092e602A57217K56400c7821B93303a81794f5736B78683j24063m3645
12254A10975j6145P9031e2461A11439R4147a7284B7033N3762J65180r3147B0894
12242A82271d3626C09897D5834N8873j1229M8349n4103A0313J9748d3241K0796
12231b2445n2851D1104J16621M7763R0543I9454L2683J40589k5700A23431Q6551
12220B09982j02992K71349m6675A61372L31308B06601d7012D67792A84988a91318
12209B9157a87732B26541l4149m5142n3591M0413K63205J4246j34365L9674H7412
12197A71211H1370a03419l7456D6688h7138B36157B8876a07373h454p3663E2117
$$ plain form
12185 -51692 126220 315022 -233882 -215393 49233 94468 215046 308481 610 -25578 -128009
12174 -128009 35111 253072 505026 -64884 -35615 -15287 456948 114302 34159 107019 273264
12163 273264 -168175 12442 122406 37162 212655 -135990 314814 -161661 -2286 301483
12152 220922 -140749 -623 103382 416813 -323368 -217920 332081 -266589 148871 -231086
12141 62702 24770 -13715 -99315 56255 76482 219506 -217485 124919 -380310 137163 20987
12129 97092 -150185 157414 133665 255394 -119162 -126233 142540 -157587 -117059 -343045
12119 -343045 327735 -84855 90120 -114501 -265948 81406 189997 190396 435215 -158614 -151392
12108 -151392 184784 -107734 -19065 76804 55581 62427 65691 237214 -82439 -275013 88446
$$ packed form
12185e1692A26220J88802b33882J8489D9233M5235J20578R3435F10b5578j02431
12174a28009C5111K17961K51954f4884K9269a5287D56948A14302C4159P2860J66245
12163B73264a68175A2442J09964C7162J75493a35990C14814a61661b286C01483
12152B20922a40749f23A03382L13431c23368J05448C32081b66589A48871b31086
12141F2702B4770a3715q5600E6255K0227J43024b17485A24919c80310A37163B0987
12129I7092a50185A57414k3749J21729a19162p071A42540a57587M0528k25986
12119c43045C27735h4855I0120a14501j51447H1406J08591L99K44819a58614P222
12108a51392A84784a07734a9065G6804k1223O846L264J71523h2439j92574H8446
$$ plain form
12096 -54147 100540 85014 -86329 250048 -232355 -156227 -201578 -3776 -32235 127783 4406
12084 -36253 113901 259717 -161985 76792 60438 -249219 160316 242638 26967 -27668 267810
12072 55146 277708 -65249 11376 166698 235614 96239 413156 29498 311814 1542845
12062 1542845 1315583 69768 277582 -105035 113485 104596 -234211 133182 -207017 33269
12051 190060 269287 7204 -35611 171405 -184622 95051 -468874 -48691 -23767 126184 -67957
12039 -219838 269432 -180714 -51500 -118389 -153000 -413272 -139162 -335894 31468 -151666
12028 -63001 67571 -38287 -44096 74043 -143908 201960 312959 423788 77957 199344 17264
12016 116457 -305 -319180 -83108 -333325 56711 113470 -227629 -34941 34843 -9332 -358425
$$ packed form
12096e4147A00540j5526h6329B50048b32355P6128m5351c776k8459A27783D406
12084c6253A13901J45816a61985G6792j6354b49219A60316Q2322B6967b7668B67810
12072E5146K22562f5249A1376J55322O8916I6239L16917B9498K82316J231031
12062A542845k27262F9768K07814a05035A13485q889b34211A33182b07017C3269
12051A90060P9227G204c5611A71405a84622I5051d68874d8691b3767A26184f7957
12039b19838B69432a80714e1500o6889l4611k60272a39162j96732C1468a51666
12028f3001F7571c8287n809G4043a43908B01960J10999J10829G7957J21387A7264
12016A16457c05l18875h3108k50217E6711N6759b27629c4941C4843i332l49093
$$ plain form
12005 -358425 -82856 22868 42053 -14446 227958 212192 -25404 -136528 -104751 -86105 238739
11993 -244544 57010 144361 -272787 -79655 -72327 -65586 -101330 -272854 -115924 248594 -96872
11981 218145 -140683 -213825 231443 -36084 -192975 -18573 120319 -190518 11407 101513
11971 101513 9082 -250436 -148967 -216202 118481 -1282 40036 178943 4131 -77954 -127690
11960 -127690 -90867 -87203 305117 -81436 51368 -42605 -216712 -34059 -299143 335418 243062
11949 243062 -48382 70180 -133976 317376 -376728 94508 251000 1689 78204 -54302 -244149
11938 -244149 139788 -202458 -1817 148893 -318784 -250839 203477 -11625 -166212 -278727
11928 -278727 -83101 -92436 98018 -55014 -55375 11065 34242 235262 223251 -252709 73984 -231215
$$ packed form
12005c58425h2856B2868J9185a4446B27958j5766b5404j11124L1777J8646B38739
11993b44544E7010Q7351b72787g9655P328O741l5744j71524a15924B48594i6872
11981B18145a40683p3142B31443c6084j56891a8573A20319a90518A1407R0106
11971A01513I082b50436J01469o7235A18481a282D0036J38907D131g7954m9736
11960a27690L6823L664C05117h1436E1368d2605j74107c4059k65084C35418r2356
11949B43062d8382G0180a33976C17376c76728I4508J56492A689P6515e4302j89847
11938b44149A39788b02458a817A48893c18784O7945B03477a1625j54587j12515
11928b78727h3101r335I8018e5014l61A1065K3177K01020j2011b52709G3984b31215
$$ plain form
11915 123893 59509 -268421 75543 106860 -18254 350768 271014 -264026 -9218 185104 36432
11903 -110521 -297868 66667 -128815 -82606 39517 227148 94224 149418 -77936 105493 6180
11891 131189 -193819 47390 -1464 -14593 -167044 -147334 -60972 128335 -206875 -139302 -133184
11880 -133184 27973 4029 73230 108698 -263352 -135471 266774 73237 -378702 144980 120098
11869 120098 -146467 154484 11495 94835 294581 -100110 -36942 36686 158423 -344778
11858 -169879 102246 -327196 -84863 1525 -326050 238369 158069 -70869 -255616 -73192 -77712
11847 -77712 -361224 -434496 -246507 67927 -102826 365520 112889 9417 141338 -211736
11836 -20541 -280957 -350666 -252316 -67824 37550 -57893 -147363 -347863 58220 39254 138920
$$ packed form
11915A23893E9509b68421G5543L1317a8254C50768p9754b64026i218A85104C6432
11903a10521j87347F6667a28815M6209C9517J87631I4224N5194g7936A05493F180
11891A31189a93819D7390a464j3129j52451J9710f0972A28335b06875O7573O118
11880a33184B7973D029O9201L5468b63352J27881B66774G3237c78702A44980k4882
11869A20098a46467A54484A1495Q3340J99746a00110c6942C6686J21737c44778
11858a69879A02246c27196h4863A525c26050B38369q0300g0869j84747g3192m520
11847g7712k83512p3272J87989F7927a02826C65520A12889I417J31921b11736
11836b0541k60416o9709R8350f7824C7550e7893q9470k00500E8220j8966R9666
$$ plain form
11825 138920 -191127 -1333 -21182 -133906 -221055 -230425 252004 -198333 -162665 153661 -143850
11813 -129680 -17480 -14436 111284 -149834 -22678 29851 -165426 -50757 260541 221078 -176277
11801 -10098 100921 145803 -274276 -191202 196124 -92414 -137090 -47573 52942 -77967 209423
11789 397746 -389981 175034 136441 -117462 389 -91424 -95504 -181544 156830 -130317 75672
11777 93290 -289975 269449 -205617 54870 44822 76299 164538 -278262 -142692 235873
11766 -118092 157312 161030 -234060 -192579 -322420 90006 -89182 -33102 -256156 126744 -15309
11754 155333 142718 -66040 -117471 513500 -193679 281660 -77287 -343871 11904 -190641
11743 -95597 -48336 146448 -25064 56769 214744 -211513 150966 63877 -226477 -260118 99872
$$ packed form
11825A38920a91127a333j9849j12724q7149r370B52004a98333L5668A53661a43850
11813a29680a7480L044A11284a49834b2678B9851a65426e0757B60541l9463a76277
11801a0098A00921M4882b74276Q3074A96124i2414m4676d7573E2942g7967B09423
11789C97746c89981A75034l8593a17462C89i1424m080q6040A56830a30317G5672
11777I3290b89975B69449b05617E4870j0048L1477Q8239b78262J35570B35873
11766a18092A57312L718b34060M1481j29841I0006h9182c3102k23054A26744a5309
11754A55333j2615f6040n1431E13500a93679B81660g7287k66584A1904a90641
11743i5597M7261A46448b5064E6769J57975b11513A50966F3877b26477l3641I9872
$$ plain form
11731 130130 99515 -137215 119424 -292169 27964 159594 96394 1402 -61905 -110506 194073
11719 -94931 106422 -48862 216515 391453 -167149 95138 -35621 -68207 34183 36819 -7758
11707 -2609 398769 -112616 301370 -70082 -170266 -59355 -203318 160275 -293998 246391
11696 59006 -312647 -212136 -64098 -239770 332124 -14748 79470 -128562 347323 -259680
11685 51087 -13651 -38525 -9891 -70208 410234 -31322 -165735 98166 64923 170320 -261706
11673 40611 -420739 178451 -82186 236556 -79754 -180510 189200 113421 -77099 35517 43417
11662 43417 -240078 -109335 112550 71946 273714 -185434 -231680 87623 -142094 -25305
11651 262925 155041 -49002 -137148 -8519 -283682 41403 -7348 263394 56474 26140 24890
$$ packed form
11731A30130l0615a37215A19424b92169B7964J31630o3200A402f1905m8601A94073
11719i4931A06422d8862B16515J74938a67149I5138c5621l2586C4183K636g758
11707b609C98769a12616C01370g0082j00184e9355j43963A60275b93998B46391
11696E9006c12647J00511f4098j75672C32124a4748G9470a28562C47323b59680
11685E1087a3651k4874i891o0317D10234c1322j34413I8166l3243J05397b61706
11673D0611d20739A78451h2186B36556g9754j00756A89200p5779g7099C5517P900
11662D3417b40078a09335A12550m0604K01768a85434m6246H7623a42094b5305
11651B62925j07884d9002q8146h519k75163D1403g348B63394E6474B6140j250
$$ plain form
11640 24890 -50078 6512 193194 12713 54414 93080 -74364 4970 330123 8367 88426 138532
11628 138532 28964 532846 137237 115054 41013 12796 82159 -25899 -120037 210704 -290137
11616 10628 -79522 -156495 88957 -15506 66624 166743 146989 -25238 4633 71839 -48064 -165996
11604 -165996 151665 321650 263742 -156129 -45148 53806 47687 -62342 152579 -159805 -55998
11592 133311 118506 177293 -37767 307876 184419 -26714 -30305 194861 -119112 -217562 73159
11580 -87367 455657 39566 -59266 114069 -68724 11597 -12973 -52953 343706 -108935 -168840
11569 -168840 -67272 170607 443209 313728 27642 99681 -98925 33424 194607 94669 260639
11558 260639 46614 147519 -202893 -9066 -210484 215357 345593 150461 131198 -277996
$$ packed form
11640B4890e0078F512J86682A2713M1701L8666g4364D970L25153H367Q0059N0106
11628A38532B8964N03882A37237k2183D1013A2796O9363b5899r4138B10704b90137
11616A0628g9522p6973H8957a5506F6624J00119j9754b5238D633O7206d8064j17932
11604a65996A51665J69985n7908a56129d5148E3806o119f2342A52579a59805e5998
11592A33311j4805N8787c7767C07876j23457b6714l591A94861a19112r8450G3159
11580h7367D55657C9566e9266A14069f8724A1597a2973l9980C43706a08935n9905
11569a68840f7272A70607K72602j29481B7642P2039i8925C3424J61183I4669J65970
11558B60639D6614J00905b02893i066k01418B15357J30236A50461j9263b77996
$$ plain form
11547 -218738 -108428 47872 -194268 203720 26795 106965 387351 89181 -26810 -119278 -65130
11536 -65130 171095 -153507 67794 -47774 -334563 41538 192308 641633 -139590 226588
11525 33459 103022 76680 258227 -60162 163668 189255 87600 -30172 47048 226399 44259
11513 107498 -77870 173681 -279940 167398 -46692 118816 237308 -350251 -27257 13135
11502 41443 102833 -36106 290503 7560 -147053 122798 -164977 4722 -69019 -83639 120837
11490 -155111 15263 179230 131997 1074 -74475 -111433 63762 116898 212783 143932 137245 -90367
11477 25194 4273 91708 372864 298878 250230 71283 126537 88509 200448 56675 109587
11466 109587 62126 162237 127230 319135 -188979 51707 17480 154490 189412 -19861 293217
$$ packed form
11547b18738a08428D7872a94268B03720B6795Q0170K80386H9181b6810r2468N4148
11536f5130A71095a53507F7794d7774k86789D1538J50770M49325a39590B26588
11525C3459O9563k6342J81547f0162A63668K5587H7600c0172D7048J79351D4259
11513A07498g7870A73681b79940A67398d6692A18816J18492c50251b7257A3135
11502D1443O1390c6106B90503G560a47053A22798a64977D722f9019j4620A20837
11490a55111A5263J63967m7233A074g4475l6958F3762N3136R5885o8851o687i0367
11477B5194D273Q7435K81156p3986m8648G1283N5254l8028J11939E6675N2912
11466A09587m7461J00111l5007J91905a88979E1707A7480J37010L4922a9861B93217
$$ plain form
11454 85613 94938 78765 121442 214 139973 1622 -22910 101678 -177193 -147878 236530 261979
11442 261979 103955 -99011 -134288 12805 289896 -296814 207622 -89480 109367 76100
11432 76100 271377 78249 138685 -395921 -193031 110496 -105049 -401871 -73793 65855
11421 -177518 -23756 54006 412348 -314049 143060 -130753 -79220 187683 158965 -68519
11410 286342 -25949 80983 14067 -126680 56925 31571 221829 293269 335544 -242241 -9287
11398 277697 -24995 -44244 -168236 -102888 -81637 -60956 -29862 -9797 -257182 290903 55639
11386 -62011 -22285 -116777 183807 -86114 51221 -211623 -97432 164239 -126360 55575 7147
11374 -65130 -233845 91461 57022 -159801 239569 -224408 297482 -118428 64672 177936
$$ packed form
11454H5613R325j6173M2677B14J39759A622b2910A01678a77193K9315B36530K5449
11442B61979A03955i9011l5277A2805K77091b96814B07622h9480A09367l3267
11432G6100J95277G8249O0436c95921a93031A10496a05049k96822g3793F5855
11421a77518b3756E4006L58342c14049A43060a30753N1533A87683k8718f8519
11410B86342b5949H0983A4067a26680E6925k5354J90258P1440M2275b42241i287
11398B77697b4995j9249j23992O5348K1251K0681b9862i797k47385B90903E5639
11386f2011b2285r4492A83807h6114E1221b11623i7432A64239a26360E5575G147
11374f5130j68715I1461l4439a59801B39569b24408B97482a18428F4672J13264
$$ plain form
11364 177936 -102200 175733 243289 102012 -153809 153647 93259 -231501 -2781 -25185
11354 -25185 58173 8511 110319 -310618 -55147 149417 100533 -179450 -80886 387677 -85308
11342 -307213 -90783 -226838 62791 225827 -375311 -236998 -110965 -139636 47454 148864
11332 148864 203561 202182 59153 -176186 174896 -227050 -331720 151547 191790 -142765
11321 -13390 -128061 165802 -140688 59954 100014 135412 -56396 49191 41081 100628 -310074
11309 254262 -85947 96898 -330027 2058 -215741 -170809 -236544 -202239 -300077 -219163 -93449
11297 -49944 -107441 -34463 271448 24093 -101931 51186 -72170 -214365 -76849 108835 -166114
11285 -333566 -162476 90692 125142 -299243 43205 219708 -191075 -134884 -260694 -208514
$$ packed form
11364A77936a02200A75733O7556A02012a53809A53647o0388b31501b781k2404
11354b5185E8173H511J01808c10618e5147A49417m8884a79450h0886C87677h5308
11342c07213i0783j36055F2791J63036c75311J38313a10965k8671D7454J01410
11332A48864N4697j379E9153a76186A74896b27050j04670A51547M0243a42765
11321a3390j14671A65802a40688E9954M0060L5398e6396D9191q110N9547c10074
11309B54262h5947I6898c30027B058b15741M4932o5735L4305r7838Q0914i3449
11297d9944n7497c4463B71448B4093a01931E1186g2170j42195g6849A08835a66114
11285c33566a62476I0692L4450b99243D3205J76503a91075N6191j25810N2180
$$ plain form
11275 -208514 81606 245507 -5301 -74256 -204055 -33442 -84105 3212 -26362 -18593 144577
11263 -267202 -198825 93899 -285598 -226823 -484456 -64703 -98694 -167682 -431715 155177 276802
11252 276802 -87133 -262399 55221 72010 -218857 97097 -109309 9891 -152198 51665 -181646
11240 248659 -149501 -143129 -9100 136328 -11395 -180072 357313 84325 16462 -169551 -357992
11229 -357992 -276818 132791 -14098 -230402 89540 252631 -111810 58990 -262823 -385360
11219 -385360 -255621 300542 -10558 -154146 -65789 -57250 -284150 -18326 -234448 -57361 -242548
11208 -242548 53469 6982 43332 -257437 -390273 3836 -399298 61832 22632 -150119 -17965
11196 81627 -31589 -187841 -76345 49161 -83566 84294 24424 -127845 168035 156325 -164811
$$ packed form
11275b08514H1606J63901e301o8955j29799c3442n0663C212b6362P769A44577
11263b67202O8377I3899b85598N8775k57633f4703l3991o8988k64033A55177J21625
11252B76802h7133j75266E5221J6789b18857I7097a09309I891a52198E1665a81646
11240B48659a49501O372i100A36328a1395j68677C57313H4325A6462a69551j88441
11229c57992Q1174A32791a4098k16304H9540J63091a11810E8990b62823j22537
11219c85360J29739C00542a0558j43588f5789Q539k26900a8326k16122e7361j85187
11208b42548E3469F982L6350b57437j32836C836c99298F1832B2632a50119a7965
11196H1627c1589j56252g6345D9161h3566H4294B4424a27845A68035j1710a64811
$$ plain form
11184 10140 -217801 -25965 -196417 -80204 -227831 -45885 -114516 -204933 -266447 -152141 -49560
11172 -399542 -211867 340890 -20034 -102140 -79440 1283 -107030 22151 75656 221337 -233270
11160 -17410 -219381 82141 -88728 -81383 -133090 -23942 -328163 -17925 265693 -50693 -98995
11149 -98995 143915 322448 8426 136538 105850 -36777 122816 22967 -208233 -198993 84599
11137 -217085 -163752 -77544 -90254 100421 179085 13622 142363 -111233 -84345 75055 -53091
11125 97413 -41352 137099 -60537 -42471 44869 126820 123477 251452 246303 -50640 -51319 -116902
11113 -116902 -211550 -67048 -107704 670899 123861 234785 431364 63643 -136007 115777
11102 247439 423831 202074 171156 -8330 195510 -39834 309633 240470 -2647 -5027 137670
$$ packed form
11184A0140b17801b5965j70452h0204j47627d5885o8631r0417o1514J14306d9560
11172c99542J87675C40890b0034q2106K2700A283a07030B2151N3505J45681b33270
11160a7410k01971H2141h8728P345n1707b3942l04221a7925B65693e0693m8302
11149i8995A43915J78533H426J28112l0688c6777A22816B2967b08233R240H4599
11137b17085N3333g7544j2710A00421P8664A3622J28741a11233K6888G5055e3091
11125I7413d1352A37099f0537J8066D4869Q1951l343J27975n149e0640o79o5583
11113a16902r4648f7048m0656F70899A23861J10924J96579F3643a36007A15777
11102B47439J76392B02074l0918h330A95510c9834C09633o9163b647k380A37670
$$ plain form
11090 219048 379717 173830 551932 276256 110382 141461 -83444 284248 138815 113815
11080 113815 176942 342487 -32795 570867 190858 181612 301199 244958 136842 547256
11070 547256 195059 206805 500335 352808 456871 568938 424528 496452 208379 559281
11060 559281 744978 619533 799705 816357 784873 648582 772002 423154 976062 367514
11049 454101 547178 944628 712926 985317 577162 433392 677454 684345 496709 860305
11039 860305 870602 676832 1317543 779941 590230 76661 703712 677628 742655 498391
11029 498391 636400 959898 387660 507336 724226 891480 477339 280852 638271 558430
11019 558430 253965 656143 566353 314686 1049575 776145 444516 643047 699702 635653
$$ packed form
11090B19048J60669A73830L78102k75676A10382L1079h3444B84248A38815k5000
11080A13815O3127J65545c2795E70867A90858r246J19587n6241j08116M10414
11070E47256A95059J1746K93530j47527J04063J12067j44410P1924B08379L50902
11060E59281J85697j25445J80172J6652l1484j36291J23420l48848N52908C67514
11049D54101R3077L97450k31702K72391m08155j43770K44062O891j87636L63596
11039H60305J0297j93770O40711n37602j89711G6661O27051k6084O5027k44264
11029D98391J38009L23498C87660J19676K16890J67254m14141j96487L57419p9841
11019E58430B53965M02178q9790k51667P34889k73430l31629J98531N6655o4049
$$ plain form
11009 635653 363093 522382 519558 913254 662035 638081 631973 509247 581590 841215 548892
10998 548892 399649 723407 1004315 510880 596131 731107 461108 835650 674721 826124
10988 826124 1021290 742856 716644 893816 1054964 1036912 1105123 1291941 1417614 1503492
10978 1503492 1277960 1549650 2049687 2442038 2295747 2664646 2528628 2417619 2367759 2073648
10968 2073648 1851874 1688040 1632602 1536697 1232289 1137689 1426359 1454516 1440644 1495943
10958 1495943 1091537 1635179 1368592 1346417 1156420 1200712 535803 216538 543554 664931
10948 664931 141825 201250 291687 330220 -23158 358970 306259 163958 -160080 120312
10937 39922 132699 191479 -75746 -32221 381380 72115 -225118 63931 67620 3266 118281
$$ packed form
11009F35653k72560J59289k824L93696k51219k3954o108j22726P2343K59625k92323
10998E48892j49243L23758K80908m93435Q5251J34976k69999L74542j60929J51403
10988H26124J95166k78434k6212J77172J61148j8052O8211J86818J25673Q5878
10978A503492k25532K71690N00037L92351j46291L68899j36018j11009m9860k94111
10968B073648k21774j63834n5438r5905l04408r4600K88670K8157j3872N5299
10958A495943m04406N43642k66587k2175j89997M4292E35803B16538L27016J21377
10948F64931A41825N9425R0437L8533b3158C58970n2711j42301a60080A20312
10937C9922R2777N8780g5746c2221C81380G2115b25118F3931L689C266J15015
$$ plain form
10926 118281 -240525 -89720 151019 -77448 -232828 -120407 59602 106200 101122 25408 69893
10915 69893 -99426 212111 109605 -119448 -147232 -388776 95405 -274828 204965 323667
10905 323667 60165 6792 2379 162512 252161 -68978 -7317 -200097 -54006 -226258 -84106
10893 250590 -460559 170932 -903 134149 5976 -196354 -93116 30233 -116480 -243402 -125249
10882 -125249 399284 -363520 -80304 -198029 -232898 76508 159256 -71938 -53479 69484 58078
10871 58078 -43838 -364146 -243510 221249 -77145 96521 177005 -114056 66338 157291 116518
10860 116518 -42999 -68327 -179599 -140329 45276 219094 -187325 41091 -131534 -71669 154776
10848 -40303 333344 -76483 -323401 101015 -166134 355482 -51707 51625 5722 -231137 60070
$$ packed form
10926A18281b40525h9720A51019g7448j55380J12421E9602M6598n078B5408M4485
10915F9893i9426B12111j02506a19448k7784k41544I5405b74828B04965J18702
10905C23667F0165F792B379J60133Q9649f8978g317j92780e4006j72252h4106
10893B50590d60559A70932i03A34149E976a96354i3116C0233a16480j26922J18153
10882a25249C99284c63520h0304j17725l4869G6508Q2748g1938J8459F9484j1406
10871E8078d3838l20308J20636B21249g7145I6521Q0484a14056F6338R0953m0773
10860A16518d2999k5328j11272L9270D5276J73818a87325D1091a31534N9865A54776
10848d0303C33344g6483k46918A01015a66134C55482e1707E1625E722b31137F0070
$$ plain form
10836 38418 -38129 24735 -238416 139372 -277572 -306067 -531738 -129890 82522 -66319 76749
10824 295848 -171464 73964 -163688 84820 169452 -89467 209822 -23884 -18546 2279 247783
10813 247783 -238845 186099 -208556 -478690 1129 -129401 -49884 5900 203925 -208056
10802 130019 78834 -187348 33592 -99429 -190388 283339 -148031 206375 47965 449661
10792 449661 -88446 -281015 46984 -28134 -107072 -203076 -57300 4480 85557 25804 -24768
10780 -198057 -251412 -54080 61530 -225327 -177174 57776 161026 -428696 -105630 64344 203613
10769 203613 -8980 135038 -16292 -214760 58717 249786 29668 -140570 -86027 -34315 130574
10757 -250386 176410 -285857 51129 -207394 -328440 -8544 40166 -152364 16509 -384144
$$ packed form
10836C8418c8129B4735b38416A39372b77572k8495k25671a29890H2522f6319G6749
10824B95848a71464G3964a63688H4820Q4632h9467B09822b3884N338B279K45504
10813B47783b38845A86099b08556k70134A129a29401d9884E900J98025b08056
10802A30019n1185a87348C3592i9429r0959B83339a48031B06375D7965M01696
10792D49661h8446j92569D6984b8134p8938r6004e7300D480Q1077B5804b4768
10780a98057n3355e4080F1530b25327M8153E7776J03250d28696a05630F4344J39269
10769B03613h980A35038a6292j98468E8717J91069B9668a40570N4543c4315A30574
10757b50386A76410b85857E1129b07394j21046h544D0166a52364A6509c84144
$$ plain form
10746 -127246 261368 -50576 -32591 -321080 -203284 110756 134618 -179299 -174115 -102625 257488
10734 -73139 -146074 52897 70244 47850 222207 5174 -132124 -36691 -309456 68557 434579
10723 434579 -269493 110077 -198413 310296 -129293 -137953 -267199 29588 233502 92451
10712 53814 -32061 99728 -261499 135855 250034 167061 -195404 -257883 -164668 -50082 -410073
10701 -410073 53229 -4694 -187750 -37431 -56304 168878 -110675 -53624 60941 96382 -105229
10689 -49344 -46470 -42014 -95558 173989 -7061 127809 34306 -155765 404749 -424349 -3340
10677 -1525 84181 -143874 16784 -59702 -188880 -108606 71530 -104930 -87265 -96280 -108025
10666 -108025 -274869 19111 -46074 90520 120167 223870 223796 -61890 41210 -176625 355778
$$ packed form
10746a27246B61368e0576J7985k88489J17796A10756K3862a79299N184P1490B57488
10734g3139p2935E2897J7347k2394J74357E174a32124c6691k72765F8557L66022
10723D34579b69493A10077a98413C10296a29293q660j29246B9588K03914I2451
10712E3814c2061I9728b61499A35855J14179q2973a95404o2479R3215e0082l59991
10701d10073E3229d694j83056c7431j8873A68878a10675e3624F0941L5441a05229
10689d9344K874M456n3544A73989g061A27809C4306a55765D04749d24349c340
10677a525H4181a43874A6784e9702j29178Q0274G1530a04930J7665r015j1745
10666a08025j66844A9111d6074I0520K9647J03703p4f1890D1210a76625C55778
$$ plain form
10654 -95253 -81852 49072 -196938 -15616 56601 53749 157663 -476374 49277 -106416 8244
10642 -62851 -49786 -538983 -54638 -174345 -215967 -163624 25109 64098 34126 -67562 -244677
10631 -244677 69236 122123 77247 -86466 -359024 -202725 105566 -141969 36342 -146526
10620 -430934 -135206 11286 -85803 22105 -108982 -144808 35954 -179964 198992 -119020
10609 -84790 40960 -389009 -346064 -286307 -31810 128534 -246588 287112 -207436 -31652 -140672
10598 -140672 -159260 -95483 -31543 -288959 -79149 129301 -44955 -212669 -306039 205652 -243068
10586 213859 139006 -36582 17478 -28186 103137 -25637 342309 -132920 -242876 46158 -9936
10574 -133805 134396 -317792 318065 85035 28548 531438 219380 15367 -149445 -221443
$$ packed form
10654i5253J3401D9072a96938a5616E6601k852J03914d76374D9277a06416H244
10642f2851J3065m89197e4638j19707m1622N2343B5109L8989k9972f7562j77115
10631b44677F9236N2887m4876h6466k72558J56299A05566a41969C6342a46526
10620d30934a35206A1286h5803B2105a08982l5826C5954a79964A98992a19020
10609h4790D0960c89009M2945N9757c1810A28534b46588B87112b07436c1652j09020
10598a40672j8588O3777c1543k57416g9149A29301d4955j67714r3370B05652b43068
10586B13859p4853c6582A7478b8186A03137b5637C42309a32920j09956D6158i936
10574a33805A34396c17792C18065H5035B8548N02890B19380A5367a49445p1998
$$ plain form
10564 -221443 -173965 -131028 88583 -31426 -68062 46109 139909 -246759 -56789 -15760 -23738
10553 -23738 -12771 330554 -108735 -73371 -82298 89247 -382535 46373 -267754 -6726 20546
10541 -170757 204593 -79785 -117892 129647 20652 123485 4984 -61272 55439 -112041 -138173
10530 -138173 -36611 -188513 -160800 -161157 82520 48533 -208950 64430 32476 -135831 -50039
10518 -24850 -92112 -7153 -151964 7766 -91817 13501 -75359 -55889 -162055 -22599 52035 39292
10506 39292 -232299 35793 -10377 -73122 239463 -127987 -6944 34601 -114387 108230 -190809
10494 13991 -41575 -294479 223666 53014 -219520 199858 -14350 -37554 -147590 37647 -66891
10482 496570 741742 233121 144480 203370 277466 255060 -55093 -136717 175169 163629 -270644
$$ packed form
10564b21443M7478M2937H8583c1426l6636D6109R3800b46759e6789a5760p978
10553b3738J0967C30554a08735L5364q927H9247c82535D6373b67754f726B0546
10541a70757B04593g9785l8107A29647B0652J02833D984f1272E5439a12041k6132
10530a38173c6611j51902K7713l57H2520l3987b08950F4430l1954a35831e0039
10518b4850o7262g153j44811G766i1817A3501g5359J9470j06166b2599E2035j2743
10506C9292b32299C5793a0377o2745B39463a27987f944C4601a14387A08230a90809
10494A3991d1575k52904B23666E3014b19520A99858a4350k3204j10036C7647f6891
10482D96570K45172B33121q8641N8890P4096k2406e5093q1624A75169j1540b70644
$$ plain form
10470 31244 241068 82375 -23953 -315362 -271641 41071 -189364 -197515 39065 -263592 -59971
10458 -249068 334579 118556 -311565 6921 -115648 -279775 269702 -12652 3665 31749 -60848
10446 315639 34542 -6578 -202749 5526 -33793 -16278 -196970 163863 -57710 344060 -48523
10434 -130006 61150 -22521 -228659 -228772 -180441 57412 -81439 -199707 -118706 330461 -26657
10422 -193678 -7570 -38041 57812 -102968 -143659 32130 36579 -407164 197333 170682 31458
10410 -237903 -80623 -74075 -213461 416679 26191 -138543 130620 151341 142553 9983 -73496
10398 219975 -33703 -79847 2803 -20769 69314 174651 400143 278649 134499 -104909 207922
10386 122781 347671 82313 215408 150494 -8131 67815 460536 -173613 332773 -187088
$$ packed form
10470C1244K09824H2375b3953k91409M3721D1071a89364q151C9065b63592e9971
10458b49068C34579A18556c11565F921a15648j64127B69702a2652C665K8084f0848
10446C15639C4542f578j96171E526c3793a6278j80692A63863e7710C44060d8523
10434a30006F1150b2521k06138j13M8331E7412h1439j18268Q1001C30461b6657
10422a93678g570l0471E7812a02968m0691C2130M449d07164A97333k6651C1458
10410b37903h0623O548j39386D16679B6191a38543A30620K0721q788I983g3496
10398B19975c3703m6144B803b0769F9314J05337K25492j21494A34499a04909B07922
10386A22781K24890H2313J33095o4914h131F7815L92721a73613C32773a87088
$$ plain form
10375 286719 273068 178757 135114 290239 407664 334083 341956 242718 576500 502156 263616
10364 263616 -69485 -105951 258449 295062 2766 262502 93366 394445 251105 87994 210438
10353 210438 260866 316612 462696 441798 303006 233271 76259 165710 206234 537668 -156941
10341 -29413 74478 248847 -100741 82534 -129629 102825 46750 247727 39504 155275
10331 155275 289863 229085 140319 -262161 153074 26313 153600 69278 204793 77348
10320 -7230 310545 74964 400405 90621 116512 103484 58911 102252 156196 138092 -171997
10308 -146133 -133937 -139868 315800 159630 36980 14135 135650 -88285 191409 -195272 68904
10296 100801 216185 111461 118724 -367597 -60072 139404 231651 -85530 146284 -127959
$$ packed form
10375B86719j3651r4311m3643J55125J17425p3581P873r9238L33782p4344k38540
10364B63616f9485l6466B58449L6613B766K59736I3366L01079j43340H7994J22444
10353B10438N0428N5746J46084k0898j38792o9735G6259Q9451M0524L31434a56941
10341b9413G4478J74369a00741H2534a29629A02825D6750K00977C9504J15771
10331A55275J34588o0778q8766b62161A53074B6313J27287F9278J35515G7348
10320g230C10545G4964L25441I0621K5891j3028m4573M3341N3944j8104a71997
10308a46133J2196n931C15800j56170C6980A4135J21515h8285A91409a95272F8904
10296A00801J15384j04724P263c67597f0072A39404R2247h5530A46284a27959
$$ plain form
10285 163168 -206938 -98867 -5301 -332616 140143 13120 17519 127015 -133357 284537 -55456
10273 -199488 -405118 131438 104265 -105874 341706 169498 249699 -71618 -88082 75956
10262 190313 396222 301904 260222 123870 -107077 194871 370743 -125993 -156171 -201762
10252 -201762 -122540 -76437 292852 -284733 -45277 103045 180445 93551 -696597 36079 -8557
10240 -405380 -261048 151980 -159810 -187565 78860 39337 30410 -14345 -15468 -287500 33740
10228 68616 -120474 126808 33005 -141292 51771 84121 142230 99562 -389994 -81298 -213086
10217 -213086 -14643 199095 102479 -286487 135753 -7575 97591 -104025 -134047 -156572 -173690
10206 -173690 -122445 57907 -282623 88982 113429 75477 -83352 -9348 -5524 -159247 -85533
$$ packed form
10285A63168b06938i8867e301l27315A40143A3120M399J09496a33357B84537e5456
10273a99488k05630A31438k7173a05874C41706A69498Q0201g1618j6464G5956
10262A90313K05909r4318m1682A23870a07077A94871J75872a25993l0178m5591
10252b01762P9222M6103B92852b84733d5277A03045P7400q6894f96597C6079h557
10240d05380J44332A51980a59810k7755G8860C9337q927a4345j123k72032C3740
10228F8616a20474A26808C3005a41292E1771L2350N8109m2668c89994h1298j31788
10217b13086a4643A99095r6616b86487A35753g575I7591a04025l0022k2525j7118
10206a73690N1245E7907b82623H8982K4447l7952h3352i348L824j53723P3714
$$ plain form
10195 -85533 127197 -117675 -121973 194022 180394 -120241 -219154 -56947 -114103 -100476 -122682
10184 -122682 -189104 -13668 -26674 -63582 59816 58981 28887 90769 -127035 -360932 -40234
10172 6881 -11588 51100 -34054 175901 -234275 53369 -292338 -701438 -68063 -415751 -138425
10160 -79517 -57908 78393 -335679 -227005 -10283 -55828 -98082 76071 49591 -217633 -277023
10149 -277023 82176 -18711 -293684 -257501 -136560 -93273 63954 102205 -4358 61694 193335
10138 193335 179524 256726 217206 -244172 -71609 -168322 -25049 266227 -134820 -217280 92808
10126 -43446 -352 -311788 72672 1804 80999 -66815 1756 14242 -23980 -13748 -165990 80742
10113 -148344 532222 -324371 213977 -123739 134576 55146 882 -132811 -189654 -234989 57522
$$ packed form
10195h5533A27197a17675m298A94022j3628a20241r8913e6947n7156J3627k2206
10184a22682o6422a3668j3006l6908E9816q35B8887O1882a27035k33897d0234
10172F881a1588E1100c4054A75901b34275E3369b92338m09100f8063l47688a38425
10160g9517K1609G8393c35679J08674a0283m5545m2254G6071k6480b17633n9390
10149b77023H2176a8711k74973L6183J20941M3287F3954L8251d358F1694J31641
10138A93335j3811P7202l9520b44172g1609r6713b5049B66227a34820q2460I2808
10126d3446c52l11436G2672A804P9195f6815A756J2486b3980J0232j52242H0742
10113a48344E32222c24371B13977a23739A34576E5146H82a32811n6843m5335E7522
$$ plain form
10101 -108375 -135795 36851 274718 -276041 217186 54563 -78115 -319446 -207314 360019
10090 142024 -161834 -84469 94825 -293564 -383339 43843 -13969 -211354 282125 -74813 -26842
10078 224709 -141160 -253458 -206961 -115073 82309 -129353 -166327 -29929 -492237 144979
10067 -263837 -11412 -448417 -109096 16331 -144471 251673 -398723 -118479 -276691 160935
10056 -178632 -153686 -133841 117881 209011 -344704 115570 -175856 -93541 -81686 157850
10045 123956 -232004 -146170 -7314 147004 -171690 -54184 71507 23403 134811 -248008 -52360
10033 -154387 -69790 -226 -328056 -83139 -418056 291611 -37028 -66893 102931 -35048 -75390
10022 -75390 67773 191174 -181339 50031 -46579 -90060 25989 133322 -208550 -58968 -379352
$$ packed form
10101a08375k7420C6851K37867b76041B17186E4563g8115k41331J12132C60019
10090A42024a61834P7365I4825b93564q9775D3843a3969j97385B82125g4813b6842
10078B24709a41160j12298M6497R1888H2309a29353l6974b9929m62308A44979
10067b63837a1412m37005a09096A6331a44471B51673c98723a18479j58212A60935
10056a78632K4946J9845A17881R1130c44704A15570a75856Q2315J1855A57850
10045A23956b32004Q5834g314A47004a71690e4184G1507B3403J11408b48008e2360
10033a54387f9790b26l27830h3139l34917B91611c7028k9865A02931c5048m0342
10022g5390F7773J23401a81339E0031d6579m3481B5989J07333b08550e8968l20384
$$ plain form
10011 -379352 -99555 30578 -237515 -99955 354809 -46719 -177609 -115998 115185 -134677
10000 -213999 -118505 -72895 -330273 -278008 -5746 34931 -128313 -114884 73010 11540 97729
9989 97729 -236177 260742 -334097 61719 -275657 -92454 8381 -72696 124515 -132560 134706
9977 -280857 -8660 10236 239862 13256 226944 -168878 -293746 -39906 -40458 84593 -168813
9965 22720 -231639 6619 194250 -96559 298708 -223566 -78501 104806 136448 -91627 65589
9953 -35671 -12524 189746 82358 11054 -196639 -148697 -244787 -50468 -6511 -123662 -112501
9942 -112501 101195 -207397 -206123 -204177 -174990 -32197 168252 169468 -162271 332350 72049
9930 59253 68037 -416596 -202036 -237608 -98614 153259 -79569 -257560 -257023 -244642 -230074 -180401
$$ packed form
10011c79352i9555C0578b37515i9955C54809d6719j30890O1611A15185a34677
10000b13999R5494M5610k57378N2265e746C4931a28313J3429G3010A1540Q6189
9989I7729b36177B60742c34097F1719b75657i2454H381g2696A24515a32560A34706
9977b80857h660A0236K29626A3256K13688a68878j24868c9906n52H4593a68813
9965B2720b31639F619J87631i6559B98708b23566g8501A04806L1642i1627F5589
9953c5671a2524A89746H2358A1054a96639M7942r6090e0468f511j17151J1161
9942a12501A01195b07397J274J946K9187c2197A68252J216a62271C32350G2049
9930E9253Q784d16596b02036l5572i8614A53259g9569j77991N37J2381J4568M9673
$$ plain form
9918 -180401 9149 -104813 -363202 -48126 -101061 1181 -183677 -207380 53664 131979 -144332
9906 -72309 -90689 -385114 -110361 -230309 97980 -53093 -213004 -249360 134702 194753 232890
9895 232890 -87937 -135348 -171361 16284 -226079 136093 -1206 -95870 29027 37951 69165 431909
9883 431909 -133682 -123400 -42102 118475 174104 -409368 114337 -2752 -252296 -66610 162502
9871 220612 303654 292377 130684 -236093 41612 -274444 -230112 44259 189719 -65837 83734
9859 367782 -406257 -200807 13505 108336 18218 263392 -143113 -252238 -38110 -331997
9849 -331997 -71958 -287188 -214012 -81818 -116496 -437529 -36589 -32156 -165883 163398 285024
9838 285024 43734 -91503 -43361 62563 -68798 -214167 14365 -10168 75215 30841 -16697
$$ packed form
9918a80401I149a04813k58389d8126n2935A181a83677k3703E3664P8315a44332
9906g2309j8380k94425a10361j19948I7980e3093j59911l6356A34702O0051L8137
9895B32890h7937m7411l6013A6284b26079A36093a206r4664B9027Q924L1214L62744
9883D31909a33682J0282d2102A18475N5629d09368A14337b752k49544f6610A62502
9871B20612Q3042j1277A30684b36093D1612b74444M4332D4259J45460f5837H3734
9859C67782d06257b00807A3505R4831A8218K45174a43113j09125c8110k93887
9849c31997g1958k15230P3176h1818l4678l21033c6589M433j33727A63398J21626
9838B85024D3734i1503d3361F2563f8798j45369A4365a0168G5215C0841a6697
$$ plain form
9826 26884 -51172 -201040 -207248 47898 -437666 66450 -155311 153660 -301221 -33526 -14270
9814 170575 -260942 -36087 -160477 37480 -333816 37897 54177 -185325 120902 -241724
9803 15277 39169 -216959 -223427 37664 251455 -420030 120226 -84925 -216848 3127 113625
9792 113625 233194 -63520 307484 -482821 51901 89560 -48577 21136 196728 -314383 137552
9780 -165584 -223075 -277592 -36548 -113866 79269 -364601 179589 94295 -142543 -254146 -456308
9769 -456308 270262 154014 -294404 -501601 -77151 72735 46322 -287776 27681 -240875
9758 -49313 -216757 -99725 -236799 318301 -22832 -18243 28610 59352 271515 -86856 -131464
9747 -131464 -471978 238894 -61457 -74563 32721 -176637 -4564 -183065 -315271 -35046 -398417
$$ packed form
9826B6884e1172j49868o208D7898d37666F6450a55311A53660c01221c3526a4270
9814A70575b60942c6087j24390C7480c33816C7897J6280a85325A20902b41724
9803A5277K3892b16959o468C7664K13791d20030A20226h4925j31923C127J10498
9792A13625J19569f3520C07484d82821E1901L7659d8577B1136J75592c14383A37552
9780a65584n7491n4517c6548p7318G9269c64601A79589q5294a42543j11603k02162
9769d56308B70262j16248b94404k07197g7151G2735k6413b87776B7681b40875
9758d9313j67444i9725j37074C18301b2832M589B8610L0742K12163h6856m4608
9747a31464l40514B38894f1457j3106C2721a76637d564j78501j32206c5046l63371
$$ plain form
9736 -398417 -315513 -225259 -209993 -48440 142674 -236293 148380 7323 22788 22413 -146651
9724 113737 -144758 -568554 65344 -104867 -258915 -268146 -395492 -65895 28766 -203824 -142683
9713 -142683 216012 -193296 -134519 101206 269901 219294 -171142 70063 29047 -88068 -67375
9702 -67375 -51789 63236 -149232 -223449 82437 -12016 -89701 -150264 33929 54918 168970
9691 168970 33295 31417 -333999 -35250 -48558 208843 -222904 -18226 -113787 6767 -94470
9679 -135250 -189778 -109170 -111894 59618 -43442 210 174380 75362 -89293 19890 51667 -139781
9666 -19846 181003 103101 135905 -141918 -196003 191245 -376783 -152621 -165204 -252406 -29929
9654 150664 16831 -148154 -86464 -297772 -127576 63002 -86655 -164544 -350667 121553 58067
$$ packed form
9736c98417Q2904R0254J5266d8440A42674b36293A48380G323J5465l75a46651
9724A13737a44758m23796F5344a04867j54048r231j27346f5895B8766b03824O1141
9713a42683B16012a93296N8777A01206J68695n0607a71142G0063B9047h8068K0693
9702f7375J5586F3236a49232p4217H2437a2016p7685o0563C3929K0989J14052
9691A68970C3295j878c33999c5250j3308B08843b22904a8226r5561F767i4470
9679a35250n4528Q0608k724E9618d3442B10J74170G5362h9293A9890L1777a39781
9666a9846A81003p7902L2804a41918n4085A91245c76783a52621j2583q7202b9929
9654A50664A6831a48154O1690k11308a27576F3002h6655p7889j86123A21553E8067
$$ plain form
9642 -146837 -3550 -33055 -55263 77309 58663 891 45943 198605 -57585 -94772 -187204 -101389
9630 -101389 -58996 71493 -109305 -74785 -16701 142729 -147751 194950 -389080 68413 -233990
9618 -147447 -245460 -1555 -111294 -201591 -19124 -254194 -59696 -207190 -169238 -100928 -27350
9606 21191 -57918 21165 -262198 -450978 42310 125848 -190521 62468 -202653 22218 -75598
9594 -154637 -307622 -424817 -185637 -208874 -203537 97657 -56715 -45680 251284 -188838 74669
9582 -48971 170878 49175 -149501 14929 -93115 186906 -74908 -176266 51196 201007 280486
9571 280486 90470 217928 35404 100684 -209794 226495 172876 -138073 114951 79214 -193729
9559 308720 49045 -66592 -99907 17531 -13221 222573 -130294 -166487 331861 -276988 -260863
$$ packed form
9642a46837c550k9505k2208G7309j8646H91M5052J52662e7585l7187r2432Q5815
9630a01389M2393G1493a09305L4520a6701A42729a47751A94950c89080F8413b33990
9618a47447r8013a555j09739r0297a9124k35070e9696j47494L7952O8310b7350
9606B1191e7918B1165b62198j88780D2310Q3538a90521F2468b02653B2218g5598
9594a54637j52985j17195a85637k3237N337I7657e6715J1035B51284a88838G4669
9582d8971A70878D9175a49501A4929i3115A86906g4908j01358E1196J49811P9479
9571B80486I0470J27458C5404O5280b09794B26495n3619a38073A14951l5737a93729
9559C08720D9045f6592l3315A7531a3221B22573a30294l6193C31861b76988J6125
$$ plain form
9548 -260863 -205778 -269152 -17024 -151204 93675 26169 26485 273441 147274 166739 248904
9537 248904 -26465 -9963 99355 -152707 -133014 159952 -172247 -137363 -136848 125885 83026
9526 83026 -328095 -120524 -163764 76429 -203890 -216645 -137399 -72096 121917 -189182 -11288
9514 126094 -165741 -21417 -94329 378959 -270988 5278 -441241 -47052 -110572 -265801 -61111
9502 42592 -142984 -76298 59187 -271166 -63525 292996 -36799 -142076 123046 -202678 -299715
9491 -299715 -155285 47995 -225827 -169271 -33581 -128976 -184930 -21150 138821 -168454 -88185
9480 -88185 121166 -107681 -241551 -157290 -268571 12627 -256358 -116599 -175475 -137007 119835
9468 -46248 -299245 -155685 6400 125592 -50314 27934 -268808 -167018 -145321 -169096 306880
$$ packed form
9548b60863N5085o3374a7024j34180I3675B6169L16K46956j26167J9465Q2165
9537B48904b6465i963I9355a52707J9693A59952a72247L4884N15A25885m2859
9526H3026c28095a20524m3240G6429b03890j2755P9246O5303A21917a89182a1288
9514A26094a65741b1417p2912C78959b70988E278d41241d7052o3520j55229f1111
9502D2592a42984O6686E9187b71166f3525B92996c6799j05277A23046b02678r7037
9491b99715J44430D7995b25827N6556c3581r5395n5954b1150A38821a68454Q0269
9480h8185A21166a07681j33870Q4261j11281A2627b56358a16599n8876L8468A19835
9468d6248k52997J43560F400J19192e0314B7934b68808J01790K1697k3775C06880
$$ plain form
9456 202742 -17259 -57486 96571 187678 75575 -110834 -290747 -23723 191096 -161695 -130274
9445 -130274 189804 -79661 -221325 -250633 -337338 -235143 289988 275815 -109929 23046 120903
9434 120903 -30766 -44506 -88590 169359 -242751 -207038 100241 340719 94667 311659 -644489
9422 -414969 -61875 -169982 -257644 115777 -180531 -8816 -276547 -209576 -133981 -174331 -154613
9411 -154613 -124575 18317 -358098 -360979 140441 -198059 -85482 350766 -84422 -409309 -42740
9399 -213077 49793 -413166 274742 -239338 -480234 -226340 -316595 -433480 -268883 242762
9388 -107490 59370 11080 -146570 -27505 135020 83213 -36803 -158836 69666 40307 -28224
9376 291467 77244 333435 295045 -148218 46709 -107700 -475103 -344598 7289 139737 -116019
$$ packed form
9456B02742a7259m0227I6571R1107G5575a10834j79913b3723A91096a61695L1421
9445a30274A89804g9661j41664k9308q6705J02195B89988j4173a09929B3046R7857
9434A20903c0766j3740m4084A69359b42751L5713A00241K40478I4667K16992f44489
9422d14969f1875j08107q7662A15777a80531h816k67731O6971P5595m0350J9718
9411a54613L0038A8317c58098k881A40441a98059h5482C50766h4422l24887d2740
9399b13077D9793d13166B74742b39338k40896b26340r0255j16885J64597B42762
9388a07490E9370A1080a46570b7505A35020n1807c6803j22033F9666k9359b8224
9376B91467G7244K56191l8390a48218D6709a07700l67403J30505G289J32448a16019
$$ plain form
9364 -325632 131288 -9790 101319 -16003 154293 4378 -252738 167170 -93184 27299 -178110
9352 -100835 -214097 -7824 -59454 4588 -137413 -162268 114739 -64480 -25320 -163416 -145564
9341 -145564 66516 -222522 6360 -277580 103323 -235328 -60059 215526 108206 -148355
9330 96120 -89579 -14398 -182810 -270325 -2762 150343 185939 -246375 142690 14700 -274661
9318 -42647 212875 -104626 -185642 -96733 -147896 115857 330975 -74412 93561 -69266 -144113
9307 -144113 -53010 65110 -56800 110531 74801 224882 -106172 -387921 174020 268496 -16131
9295 -335264 -43007 -514 113671 -115423 -3524 -65942 -23291 -133705 -95607 -247107 -107476
9283 -130402 -291168 -188423 -78250 -6837 114173 60368 132296 -258831 -134013 102358 -157295
$$ packed form
9364c25632A31288i790A01319a6003A54293D378b52738A67170i3184B7299a78110
9352a00835j13262g824n1630D588a37413k4855A14739f4480b5320j38096J7852
9341a45564F6516b22522F360b77580A03323b35328f0059B15526j07320a48355
9330I6120h9579a4398j68412q7515b762A50343L5596b46375A42690A4700b74661
9318d2647B12875a04626q1016Q8909n1163A15857K15118g4412I3561f9266p4847
9307a44113e3010F5110e6800A10531l5730J50081a06172k81749A74020R4476a6131
9295c35264d3007e14A13671a15423c524o2418b3291j10414L8098j51500a07476
9283a30402j60766J02745g8250f837A14173n3805P1928b58831J24818A02358a57295
$$ plain form
9271 -130551 -399480 90811 -218488 -261542 88583 -294492 -223370 144649 9942 -58302 83141
9259 -65207 21304 15896 -329510 40236 34669 -29974 186495 -154316 20348 267677 -39699
9247 -35261 -320292 -194300 -194046 -489094 33143 313671 -333901 247275 116594 -321475 -14397
9235 40066 -94880 -124485 -22544 -219383 43298 -89368 46906 -142639 -193176 -84656 61674
9223 -335350 26765 120394 -263693 157141 -105776 102923 158441 -192012 -179047 -405536
9213 -405536 -157409 183661 -85580 -35077 -48892 313426 312880 -52832 -315988 574 58770 -23433
9200 15887 -132164 7446 -35398 -46156 2788 -57640 97853 -195997 -410615 -146890 13826
9188 72090 -267153 -153204 -248482 -158499 -144673 -129557 -45393 -185041 -29859 -227323 -73810
$$ packed form
9271a30551k68929I0811b18488m3054H8583b94492P1122A44649I942e8302H3141
9259f5207B1304n408c29510D0236n567b9974A86495a54316B0348K47329c9699
9247c5261k85031J25992K54k95048C3143K80528c33901B47275A16594c21475a4397
9235D0066i4880k9605b2544j96839D3298h9368D6906a42639n0537h4656F1674
9223c35350B6765R3629b63693A57141a05776A02923N5518a92012J2965k26489
9213d05536a57409A83661h5580c5077j3815C13426n46e2832k63156E74N8196b3433
9200A5887a32164G446c5398j0758B788e7640I7853a95997k14618a46890A3826
9188G2090b67153J13949r5278Q9983J3826J5116d5393j39648b9859j97464g3810
$$ plain form
9176 -143637 -166960 27686 63634 -211307 -59461 177831 -7829 -166478 -179195 -149135 -121309
9165 -121309 -5183 -326600 39156 76108 20724 239734 74634 -160397 -326684 185509 -40178
9153 -220024 192195 219197 -31738 -85222 -27587 -268173 -206855 -56547 68526 -345441 -170728
9141 -51269 229136 -255593 -47792 152802 -160779 -25460 231822 -60023 159582 -112215
9130 171271 119998 -31251 -59556 -43914 91680 62437 -218695 35180 197276 -109381 -45346
9118 130678 159375 -94011 -61613 -112639 47458 44642 7837 14661 -104282 -24695 -55292 185417
9105 -157182 -370162 -231231 237277 -273340 3700 227347 -231266 -97239 -150082 114942
9094 -134291 322359 -206622 -187278 -52712 102343 -308483 92155 -74332 -13739 -54337 -124751
$$ packed form
9176a43637k3323B7686L5948b11307e9461A77831g829j58649j2717L0060K7826
9165a21309e183l21417C9156L6952B0724K19010G4634a60397j66287A85509d0178
9153b20024A92195K7002c1738n3484b7587k40586O1318e6547F8526c45441a70728
9141e1269B29136b55593d7792A52802a60779b5460B31822f0023A59582a12215
9130A71271n1273c1251k8305J5642I1680k9243b18695C5180J62096a09381d5346
9118A30678K8697i4011L2398n1026D7458k816G837O824a04282b4695l0597A85417
9105a57182k12980J38931B37277b73340C700K23647b31266i7239n2843A14942
9094a34291C22359b06622J9344e2712A02343c08483I2155g4332a3739m0598p0414
$$ plain form
9083 -124751 121128 -148108 173556 -259176 -72217 139384 18722 5022 32292 20470 -32287
9071 -329510 220482 -205500 109799 158089 -192360 -243919 -85783 81864 -49622 -190663 225464
9059 -403763 -105339 -232576 -217540 -116336 -183496 107287 -13870 -549958 -74732 4661 -88764
9047 -283434 86272 -244580 -124027 -108143 -392133 88186 -90529 41248 -52441 255790 131517
9036 131517 -60973 -104769 -71212 -310441 -150373 -70691 140691 -50105 -236546 -110915 119091
9024 -181080 -112753 167561 -157630 -329883 405404 -166155 -81567 1411 -146411 188377
9013 -42345 95149 -102981 -8376 -177909 -31068 97188 95835 -199311 -208094 -90517 -106383 -264102
9001 -264102 -146684 127204 36636 -447582 -152616 -27728 154954 -123146 125387 -865 -72899
$$ packed form
9083a24751A21128a48108A73556b59176g2217A39384A8722E022K7270j1822c2287
9071c29510B20482b05500A09799M8290a92360n1559h5783H1864d9622j41041B25464
9059d03763a05339j27237J5036J01204o7160A07287a3870n36088g4732D661h8764
9047b83434H6272b44580J20553J5884k83990H8186i0529D1248e2441B55790j24273
9036A31517f0973m3796L3557k39229a50373g0691A40691e0105j86441a10915A19091
9024a81080O8327A67561a57630j72253D05404a66155h1567A411a46411A88377
9013d2345I5149a02981h376j69533c1068I7188j353a99311q783i0517j5866j57719
9001b64102J17418A27204C6636d47582a52616b7728A54954a23146A25387h65p2034
$$ plain form
8990 -72899 24088 -105069 -176306 141669 -300146 182664 -209941 -182271 -51510 -223202 -53721
8978 172152 -153638 55898 -194291 -81188 239716 -204135 -61717 27155 416205 73621 -285662
8966 46474 -166585 129586 41431 7659 -197925 101062 54519 -136391 -6959 -93610 -279399
8955 -279399 -285950 105213 -74198 -6382 198884 -95345 123047 138847 -163299 52968 59811
8944 59811 98946 -84000 -174095 181360 -49646 8451 247527 -276814 223204 -184913 -262523
8933 -262523 -132230 32808 -66153 -75026 62048 -151863 -250366 -175413 203884 69968 733981
8922 733981 684844 184445 354789 15827 -215518 84946 -187142 -251721 4985 39837 130595
8911 130595 -120971 -64185 -214358 -239671 38709 112531 173864 -136366 -165826 308937 14772
$$ packed form
8990g2899B4088a05069p1237A41669c00146A82664b09941K7670e1510j71692e3721
8978A72152a53638E5898a94291h1188B39716b04135f1717B7155L89050G3621b85662
8966D6474a66585A29586D1431G659a97925A01062m6543a36391f959q6651j85789
8955b79399o551A05213g4198f382A98884i5345A23047J5800a63299E2968O843
8944E9811L9135h4000r0095A81360d9646H451K39076b76814B23204a84913p7610
8933b62523J30293C2808f6153q873F2048a51863r8503P4953B03884F9968O64013
8922G33981m9137A84445J70344A5827b15518H4946a87142o4579D985L4852R0758
8911A30595a20971N6786j50173k5313C8709P3822O1333a36366k9460C08937A4772
$$ plain form
8899 -282753 -233049 95085 -107960 -146157 -292171 104925 -38020 52637 -359776 -157573 48327
8887 -35420 84660 253407 -56550 -151587 -22861 -81119 18100 98547 -258755 -145373 5415
8875 6019 -134455 -198821 31317 -69070 -19712 -166977 -24382 241716 83509 -52333 -59098 -410360
8863 -410360 72922 260141 -130375 -202843 -447678 78313 -30898 24967 202353 23777 -26351
$$ packed form
8899b82753M9704I5085a07960l8197j46014A04925c8020E2637c59776a57573D8327
8887c5420H4660J68747e6550r5037b2861n8258A8100Q0447b58755J13382E415
8875F019a34455o4366C1317f9070a9712j47265b4382B41716H3509e2333o765l51262
8863d10360G2922J87219a30375p2468k44835G8313c0898B4967J77386B3777b6351
$$ [...]
##END NTUPLES=NMR SPECTRUM
##END=
