##TITLE=NES1096_ptc160_9887142_hUvvo9x89L
##JCAMPDX= 6.0         $$ Bruker NMR JCAMP-DX V2.0
##DATA TYPE= NMR SPECTRUM
##DATA CLASS= NTUPLES
##ORIGIN= BRUKER
##OWNER= Administrator
$$ 1.72 TOPSPIN		Version 2.1
$$ 2016-08-28 14:39:06.648 -0500  Administrator@X
$$ Compression mode = diff/dup
##.OBSERVE FREQUENCY= 400.02188249412
##.OBSERVE NUCLEUS= ^1H
##.ACQUISITION MODE= SIMULTANEOUS (DQD)
##.ACQUISITION SCHEME= undefined
##.AVERAGES= 64
##.DIGITISER RES= 22
##SPECTROMETER/DATA SYSTEM= spect
##.PULSE SEQUENCE= noesygpps1d.comp
##.SOLVENT NAME= COFFEE_meoh
##.SHIFT REFERENCE= INTERNAL, COFFEE_meoh, 1, 14.96029
##AUDIT TRAIL= $$ (NUMBER, WHEN, WHO, WHERE, PROCESS, VERSION, WHAT)
$$ ##TITLE= Audit trail, TOPSPIN		Version 2.1
$$ ##JCAMPDX= 5.01
$$ ##ORIGIN= Bruker BioSpin GmbH
$$ ##OWNER= Administrator
$$ $$ E:\/data/COFFEE/nmr/NES1096_ptc160_9887142_hUvvo9x89L/12/pdata/1/auditp.txt
$$ ##AUDIT TRAIL=  $$ (NUMBER, WHEN, WHO, WHERE, PROCESS, VERSION, WHAT)
(   1,<2016-08-28 14:39:01.023 -0500>,<Administrator>,<X>,<go>,<TOPSPIN 2.1>,
      <created by zg
	started at 2016-08-28 14:27:31.070 -0500,
	POWCHK enabled, PULCHK disabled,
       configuration hash MD5:
       21 0F 79 D6 B3 7B B4 F6 88 20 88 DB 03 48 BD 9F
       data hash MD5: 64K
       00 ED 73 21 60 30 BE 9A 34 E6 C2 85 1B 83 2A 49>)
(   2,<2016-08-28 14:39:04.211 -0500>,<Administrator>,<X>,<proc1d>,<TOPSPIN 2.1>,
      <Start of raw data processing
       efp LB = 0.3 FT_mod = 6 PKNL = 1 PHC0 = 0 PHC1 = 0 SI = 128K 
       data hash MD5: 128K
       01 80 BF 19 31 3A 39 20 BE 67 24 D1 EB 38 A3 A3>)
(   3,<2016-08-28 14:39:05.195 -0500>,<Administrator>,<X>,<proc1d>,<TOPSPIN 2.1>,
      <pk PHC0 = -83.11157 PHC1 = 0 
       data hash MD5: 128K
       E6 8F CF 1C 70 CD 4E 7E FF 66 86 C6 02 93 B1 66>)
(   4,<2016-08-28 14:39:05.617 -0500>,<Administrator>,<X>,<proc1d>,<TOPSPIN 2.1>,
      <abs ABSG = 1 
       data hash MD5: 128K
       0B DB 5D AF 8F 52 DE A1 18 18 41 09 A8 29 13 69>)
(   5,<2016-08-28 14:39:05.742 -0500>,<Administrator>,<X>,<proc1d>,<TOPSPIN 2.1>,
      <abs ABSG = 2 
       data hash MD5: 128K
       87 96 E9 2E 0D B8 82 DF 2F E1 95 48 20 9C 02 43>)
(   6,<2016-08-28 14:39:05.836 -0500>,<Administrator>,<X>,<proc1d>,<TOPSPIN 2.1>,
      <abs ABSG = 3 
       data hash MD5: 128K
       19 B5 96 9D 1F 7A 20 F8 25 1C 19 BC EF FC A5 BD>)
(   7,<2016-08-28 14:39:05.914 -0500>,<Administrator>,<X>,<proc1d>,<TOPSPIN 2.1>,
      <abs ABSG = 4 
       data hash MD5: 128K
       D4 79 E0 82 74 A6 61 AA 36 D1 1C DE E7 A6 AF BE>)
(   8,<2016-08-28 14:39:05.992 -0500>,<Administrator>,<X>,<proc1d>,<TOPSPIN 2.1>,
      <abs ABSG = 5 
       data hash MD5: 128K
       9B B3 4E 72 C5 97 42 09 7B 7E D6 2C 2E 4F 43 81>)
$$ ##END=
$$ 
$$ $$ hash MD5
$$ $$ FB 44 CA 2F B6 8B 47 43 F4 BE 13 07 50 88 E7 6C
##$RELAX= 
##$RELAX= 
##$RELAX= 
##$RELAX= 
##$RELAX= 
##$RELAX= 
##$RELAX= 
##$RELAX= 
$$ Bruker specific parameters
$$ --------------------------
##$DU= <E:\>
##$EXPNO= 12
$$ [...]
##$TP07= 0
##$TPNAME0= <>
##$TPNAME1= <>
##$TPNAME2= <>
##$TPNAME3= <>
##$TPNAME4= <>
##$TPNAME5= <>
##$TPNAME6= <>
##$TPNAME7= <>
##$TPOAL= (0..7)
0.5 0.5 0.5 0.5 0.5 0.5 0.5 0.5
##$TPOFFS= (0..7)
0 0 0 0 0 0 0 0
##$TUNHIN= 0
##$TUNHOUT= 0
##$TUNXOUT= 0
##$USERA1= <user>
##$USERA2= <user>
##$USERA3= <user>
##$USERA4= <user>
##$USERA5= <user>
##$V9= 5
##$VALIST= <valist>
##$VCLIST= <CCCCCCCCCCCCCCC>
##$VD= 0
##$VDLIST= <DDDDDDDDDDDDDDD>
##$VPLIST= <PPPPPPPPPPPPPPP>
##$VTLIST= <TTTTTTTTTTTTTTT>
##$WBST= 2048
##$WBSW= 25
##$XGAIN= (0..3)
0 0 0 0
##$XL= 0
##$YL= 0
##$YMAX_a= 6066420
##$YMIN_a= -11253186
##$ZGOPTNS= <>
##$ZL1= 120
##$ZL2= 120
##$ZL3= 120
##$ZL4= 120
##$ABSF1= 14.96029
##$ABSF2= -5.597892
##$ABSG= 5
##$ABSL= 3
##$ALPHA= 0
##$AQORDER= 0
##$ASSFAC= 0
##$ASSFACI= 0
##$ASSFACX= 0
##$ASSWID= 0
##$AUNMP= <proc_prof1d_extract.lims>
##$AXLEFT= 0
##$AXNAME= <>
##$AXNUC= <1H>
##$AXRIGHT= 0
##$AXTYPE= 0
##$AXUNIT= <>
##$AZFE= 0.1
##$AZFW= 0.1
##$BCFW= 0
##$BC_mod= 0
##$BYTORDP= 0
##$COROFFS= 0
##$CY= 15
##$DATMOD= 1
##$DC= 0
##$DFILT= <>
##$DTYPP= 0
##$F1P= 0
##$F2P= 0
##$FCOR= 0.5
##$FTSIZE= 131072
##$FT_mod= 6
##$GAMMA= 0
##$GB= 0
##$INTBC= 1
##$INTSCL= 1
##$ISEN= 128
##$LB= 0.3
##$LEV0= 0
##$LPBIN= 0
##$MAXI= 10000
##$MC2= 0
##$MEAN= 0
##$ME_mod= 0
##$MI= 0
##$NCOEF= 0
##$NC_proc= -2
##$NLEV= 6
##$NOISF1= 0
##$NOISF2= 0
##$NSP= 0
##$NTH_PI= 0
##$NZP= 0
##$OFFSET= 14.96029
##$PC= 1
##$PHC0= -83.11157
##$PHC1= 0
##$PH_mod= 1
##$PKNL= yes
##$PPARMOD= 0
##$PPDIAG= 0
##$PPIPTYP= 0
##$PPMPNUM= 2147483647
##$PPRESOL= 1
##$PSCAL= 4
##$PSIGN= 0
##$PYNMP= <proc.py>
##$REVERSE= no
##$SF= 400.020009922503
##$SI= 131072
##$SIGF1= 0
##$SIGF2= 0
##$SINO= 400
##$SIOLD= 131072
##$SPECTYP= <>
##$SREGLST= <1H.CDCl3>
##$SSB= 0
##$STSI= 131072
##$STSR= 0
##$SW_p= 8223.68421052631
##$SYMM= 0
##$S_DEV= 0
##$TDeff= 65536
##$TDoff= 0
##$TI= <>
##$TILT= no
##$TM1= 0
##$TM2= 0
##$TOPLEV= 0
##$USERP1= <user>
##$USERP2= <user>
##$USERP3= <user>
##$USERP4= <user>
##$USERP5= <user>
##$WDW= 1
##$XDIM= 131072
##$YMAX_p= 387098753
##$YMIN_p= -11903
##$CURPLOT= <Network HP LaserJet P1505>
##$CURPRIN= <$Network HP LaserJet P1505>
##$DFORMAT= <normdp>
##$LAYOUT= <+/1D_H.xwp>
##$LFORMAT= <normlp>
##$PFORMAT= <normpl>
##$SURQMSG= 1
$$ End of Bruker specific parameters
$$ ---------------------------------
##NTUPLES= NMR SPECTRUM
##VAR_NAME=  FREQUENCY,     SPECTRUM/REAL,   SPECTRUM/IMAG
##SYMBOL=    X,             R,               I
##VAR_TYPE=  INDEPENDENT,   DEPENDENT,       DEPENDENT
##VAR_FORM=  AFFN,          ASDF,            ASDF
##VAR_DIM=   131072,        131072,          131072
##UNITS=     HZ,            ARBITRARY UNITS, ARBITRARY UNITS
##FACTOR=    0.0627417313425164, 1,          1
##FIRST=     8223.62146879497, -1056,        -53134
##LAST=      0,             1291,            -53747
##MIN=       0,             -11903,          0
##MAX=       8223.62146879497, 387098753,    0
$$ Real data points
##PAGE= N=1
##DATA TABLE= (X++(R..R)), XYDATA
$$ [...]
63984B41848K826L162L432L655M016M706N629O431O786O647O334O363O980P851
$$ 241848 244674 247836 251268 254923 258939 263645 269274 275705 282491 289138 295472 301835 308815 316666
63970C16666Q456Q778R254R962J0342J0027R445R253R672J0775J2840J5752J8584
$$ 316666 325122 333900 343154 353116 363458 373485 382930 392183 401855 412630 425470 441222 459806
63957D59806K0650K2638K5752L0014L4541L9415M5821N4074O2941P1618Q1123
$$ 459806 480456 503094 528846 558860 593401 632816 678637 732711 795652 867270 948393
63946I48393R2512J04712J15445J23869J30990J37672J43469J47521J49365J48527
$$ 948393 1040905 1145617 1261062 1384931 1515921 1653593 1797062 1944583 2093948 2242475
63936B242475J44149J35591J22953J06763Q7707O6911M5805K5240M972j5712l7089
$$ 2242475 2386624 2522215 2645168 2751931 2839638 2906549 2952354 2977594 2982566 2966854 2929765
63925B929765n8842q0234r9995j16412j28155j35163j38524j39513j38784j36366
$$ 2929765 2870923 2790689 2690694 2574282 2446127 2310964 2172440 2032927 1894143 1757777
63915A757777j32139j26256j19081j10784j01240r0583p9699o9799o1432n4267
$$ 1757777 1625638 1499382 1380301 1269517 1168277 1077694 997995 928196 866764 812497
63905H12497m7773m1797l6410l1590k7296k3543k0287j7453j5075j3169j1497
$$ 812497 764724 722927 686517 654927 627631 604088 583801 566348 551273 538104 526607
63894E26607r856q553q035p997p496o176m751l972l671l275k579j487M42L401
$$ 526607 516751 508198 500163 492166 484670 478494 473743 469771 466100 462825 460246 458759 459201 462602
63880D62602O653R163J0749J2006J3321J4597J5681J6447J6627J6312J6298J7106
$$ 462602 469255 478418 489167 501173 514494 529091 544772 561219 577846 594158 610456 627562
63868F27562J7845J7128J5087J3323J2607J1815R733O798M207K135j57k888n530
$$ 627562 645407 662535 677622 690945 703552 715367 725100 731898 736105 738240 738083 735195 729665
63855G29665p848j0117j2221j3363j3083j2087j1677j2490j4061j5551j6740j8198
$$ 729665 721817 711700 699479 686116 673033 660946 649269 636779 622718 607167 590427 572229
63843E72229k0335k2517k3516k2904k1578k0659k0261j9678j8405j6651j5007
$$ 572229 551894 529377 505861 482957 461379 440720 420459 400781 382376 365725 350718
63832C50718j3983j3653j3488j2768j1367r861q656p492o171n244n288n921o165
$$ 350718 336735 323082 309594 296826 285459 275598 266942 259450 253279 248035 242747 236826 230661
63819B30661n674m907m274l836l677l837l918l479k861k796l203l171k344j412
$$ 230661 224987 220080 215806 211970 208293 204456 200538 197059 194198 191402 188199 185028 182684 181272
63805A81272r30n45J42O54L57n14j236j585j768j702j148l86l0j64l27l13m68
$$ 181272 180342 179797 179939 180593 180950 180436 179200 177615 175847 174145 172997 172611 172581 172417 172090 171777 171309
63788A71309j016j646j924j775j341p19j28J6m13q63o05K85Q75N35k43n41l15
$$ 171309 170293 168647 166723 164948 163607 162888 162760 162776 162363 161500 160895 161180 162055 162590 162347 161806 161491
63771A61491l01o50m91O59J823J713N55k94k99k35o35r08n27k7n7k22K65J250
$$ 161491 161190 160540 160049 160708 162531 164244 164799 164505 164206 163971 163336 162428 161901 161874 161817 161595 161860 163110
63753A63110J807J459N03n87j398j458o36M49J053J226J488J787J531O62m7O8
$$ 163110 164917 166376 166879 166292 164894 163436 162800 163249 164302 165528 167016 168803 170334 170996 170949 171017
63737A71017Q59J707K081J774J101Q33J395K189K285J769J640K329L130L363L248
$$ 171017 171876 173583 175664 177438 178539 179372 180767 182956 185241 187010 188650 190979 194109 197472 200720
63722B00720L342L744M379N274O094O056M905L503K731K353J607N13l46r91k074
$$ 200720 204062 207806 212185 217459 223553 229609 234514 238017 240748 243101 244708 245221 244875 243884 241810
63707B41810l653m788m645l402j880q09n81j226k233k789k518j780j119o21n4
$$ 241810 238157 233369 228724 225322 223442 222633 222052 220826 218593 215804 213286 211506 210387 209766 209712
63692B09712O53J322J760J889J814J789K019K348K424K267K352K900L396L222
$$ 209712 210365 211687 213447 215336 217150 218939 220958 223306 225730 227997 230349 233249 236645 239867
63678B39867K522J977J855J742J285O62K48J82M61J030J567J554R91O31J072J898
$$ 239867 242389 244366 246221 247963 249248 249910 250158 250340 250801 251831 253398 254952 255943 256574 257646 259544
63662B59544K193J752J106N35k40j263j999k138k146k535l025l040k679k639l218
$$ 259544 261737 263489 264595 265130 264890 263627 261628 259490 257344 254809 251784 248744 246065 243426 240208
63647B40208l901l958l124j713l32N58R78J258J514J592J651K226L340M119L919
$$ 240208 236307 232349 229225 227512 227180 227738 228716 229974 231488 233080 234731 236957 240297 244416 248335
63632B48335L392L678M791N759O132O375O738O827O559O543P044P495P539P781
$$ 248335 251727 255405 260196 265955 272087 278462 285200 292027 298586 305129 312173 319668 327207 334988
63618C34988Q776J0087J1115J2251J4224J6735J8727J9878K0966K2729K5202K8164
$$ 334988 343764 353851 364966 377217 391441 408176 426903 446781 467747 490476 515678 543842
63606E43842L1392L4325L6150L6483L5449L2920K8308K1426J3182N095j551n956
$$ 543842 575234 609559 645709 682192 717641 750561 778869 800295 813477 818572 817021 811065
63594H11065p810p552o365n435n264n885p413r998j3391j7014k0501k3771k6585
$$ 811065 803255 795703 789338 783903 778639 772754 765341 755343 741952 724938 704437 680666 654081
63581F54081k8409k8967k8540k7420k5332k1969j8012j4935j3448j2580j0896
$$ 654081 625672 596705 568165 540745 515413 493444 475432 460497 447049 434469 423573
63570D23573q261n735l880k099J21K216L400L895M530N514O417P194Q350J0012
$$ 423573 415312 409577 405697 403598 403719 405935 409335 413230 417760 423274 429691 436885 445235 455247
63556D55247J1638J2844J3922J5215J6657J8278K0642K4202K8552L2980L7535
$$ 455247 466885 479729 493651 508866 525523 543801 564443 588645 617197 650177 687712
63545F87712M2839M8549N2566N2156M5985L5079K2056R571p50q395j3467j6162
$$ 687712 730551 779100 831666 883822 929807 964886 986942 996513 995763 987368 973901 957739
63533I57739j6645j5228j2621r837p727o591o392p373j0165j5038k1244k7392
$$ 957739 941094 925866 913245 903408 895681 889090 882698 875325 865160 850122 828878 801486
63521H01486l2418l5953l7943l8316l7211l5140l2706l0242k7854k5562k3292
$$ 801486 769068 733115 695172 656856 619645 584505 551799 521557 493703 468141 444849
63510D44849k0901j8399j6059j4145j2581j1029r335p757o726o369o298n938n085
$$ 444849 423948 405549 389490 375345 362764 351735 342400 334643 327917 321548 315250 309312 304227
63497C04227m087l450l329l478l493l105k363j694j536j742j585o72M51R94R64
$$ 304227 300140 296690 293361 289883 286390 283285 280922 279228 277692 275950 274365 273693 274144 275138 276102
63482B76102R72J173J205J154J728L066M225M408M119M307M911N012M245L084
$$ 276102 277074 278247 279452 280606 282334 285400 289625 294033 298152 302459 307370 312382 316627 319711
63468C19711J767k9k208l781l981l324k935l148l344l049k483j975j352l12R22
$$ 319711 321478 321449 319241 315460 311479 308155 305220 302072 298728 295679 293196 291221 289869 289557 290479
63453B90479J711J761J448J333J570J932K289K723L239L630L846M345N809Q490
$$ 290479 292190 293951 295399 296732 298302 300234 302523 305246 308485 312115 315961 320306 326115 334605
63439C34605J1891J5126J7647J9833K2922K8050L4835M0870M3032L9646L1569
$$ 334605 346496 361622 379269 399102 422024 450074 484909 525779 568811 608457 640026
63428F40026K1284J1260L081k435n013m904k788O50N066J0360J6307K2389K8012
$$ 640026 661310 672570 675651 673216 668203 663299 660511 661161 666227 676587 692894 715283 743295
63415G43295L2885L7058M0584M3050M3559M1208L5678K7464J7717P904n53o637
$$ 743295 776180 813238 853822 896872 940431 981639 1017317 1044781 1062498 1070402 1069849 1063212
63403A063212j0002j1025j0595r738r263r645j1157j4027j8336k3752k9429l4370
$$ 1063212 1053210 1042185 1031590 1021852 1012589 1002944 991787 977760 959424 935672 906243 871873
63391H71873l7898l9863m0398l9602l7518l4405l0935k7930k5755k3969k1753
$$ 871873 833975 794112 753714 714112 676594 642189 611254 583324 557569 533600 511847
63380E11847j8756j5439j2499j0066p675n040k569q77J39J352L372N681P206P723
$$ 511847 493091 477652 465153 455087 447412 442372 439803 438926 439065 440417 443789 449470 456676 464399
63366D64399Q306J0099J3062J6271J9202K2078K4974K7426K9266L1222L4021L7198
$$ 464399 472705 482804 495866 512137 531339 553417 578391 605817 635083 666305 700326 737524
63354G37524L9578M0815M1647M2400M1923L8577L1974K3335J4313N912j521p643
$$ 737524 777102 817917 859564 901964 943887 982464 1014438 1037773 1052086 1057998 1056477 1048834
63342A048834j1776j3346j2629j0965r902j0099j1312j3382j6702k1491k7003
$$ 1048834 1037058 1023712 1011083 1000118 990216 980117 968805 955423 938721 917230 890227
63331H90227l1936l5381l7065l7021l5539l3281l0820k8092k4624k0200j4922
$$ 890227 858291 822910 785845 748824 713285 680004 649184 621092 596468 576268 561346
63320E61346q906k750J713K075k607j0617j8782k4553k6973k6370k3817k0643
$$ 561346 552440 549690 551403 553478 550871 540254 521472 496919 469946 443576 419759 399116
63308C99116j7797j5447j3318j1286r462p942o773o060n839n894n920n721n158
$$ 399116 381319 365872 352554 341268 331806 323864 317091 311031 305192 299298 293378 287657 282499
63295B82499m111k750j699j521k093k737k975k898k800k720k444j854j128n94
$$ 282499 278388 275638 273939 272418 270325 267588 264613 261715 258915 256195 253751 251897 250769 250175
63281B50175l88l12j59o3l24q73j261j250j030p66l00L88Q23N24l36j078j182
$$ 250175 249787 249475 249316 249253 248929 248056 246795 245545 244515 243749 243449 243837 244660 245184 244848 243770 242588
63264B42588n47O35J879K557K465K195K500L380M187M507M548M638M781M819M681
$$ 242588 242041 242676 244555 247112 249577 251772 254272 257652 261839 266346 270894 275532 280313 285132 289813
63249B89813M460M451N019O197P454Q253Q767R606J0903J2125J2871J3416J4298
$$ 289813 294273 298724 303743 309940 317394 325647 334414 344020 354923 367048 379919 393335 407633
63236D07633J5639J7046J8022J8379J8405J8569J8955J9118J8771J8311J8229
$$ 407633 423272 440318 458340 476719 495124 513693 532648 551766 570537 588848 607077
63225F07077J8272J7792J6914J6602J7461J9012K0367K1062K0984J9975J7944
$$ 607077 625349 643141 660055 676657 694118 713130 733497 754559 775543 795518 813462
63214H13462J5093J1701P891L628j189o615j2255j7095k0304k2248k4024k5883
$$ 813462 828555 840256 848147 851775 850586 843971 831716 814621 794317 772069 748045 722162
63202G22162k6828k6129k4391k2628k0854j8350j4870j0935p126l726q31J693
$$ 722162 695334 669205 644814 622186 601332 582982 568112 557177 550051 546325 545494 547187
63190E47187M228O957R534J1616J3496J5699J8128K0099K1171K1568K1799K2183
$$ 547187 551415 558372 567906 579522 593018 608717 626845 646944 668115 689683 711482 733665
63178G33665K2670K2878K2481K1727K1195K0779J9469J6726J3593J1572J0591
$$ 733665 756335 779213 801694 823421 844616 865395 884864 901590 915183 926755 937346
63167I37346Q961N397K15n526j1288j7018k2549k7499l1586l4634l6524l7267
$$ 937346 946307 951704 951919 946393 935105 918087 895538 868039 836453 801819 765295 728028
63155G28028l6967l5624l3309l0564k8229k6624k5234k3330k0746j7912j5392
$$ 728028 691061 655437 622128 591564 563335 536711 511477 488147 467401 449489 434097
63144D34097j3539j2301j1252r986q595p570p138o951o503n568m242k842j831
$$ 434097 420558 408257 397005 387019 378424 370854 363716 356765 350262 344694 340452 337610 335779
63131C35779j472j465j228o09lL64P94J513K192K489K671L219L964M207L693L015
$$ 335779 334307 332842 331614 331005 331002 331366 332160 333673 335865 338354 341025 344244 348208 352415 356108 359123
63115C59123K894L303L586L252K496J899J805K063K418K861L405L734L432K648
$$ 359123 362017 365320 368906 372158 374654 376553 378358 380421 382839 385700 389105 392839 396271 398919
63101C98919K074K092K257K014J617J858K959M146M540M107L440K895K273J339
$$ 398919 400993 403085 405342 407356 408973 410831 413790 417936 422476 426583 430023 432918 435191 436530
63087D36530K36q10j803k681k981k320j122k82M8P05K162L673M361M661N655P232
$$ 436530 436766 435956 434153 431472 428491 426171 425049 424767 424815 425520 427682 431355 435716 440377 446032 453264
63071D53264Q052P567O996P702R439J1013J2070J3288J5032J6766J7945J8809
$$ 453264 461316 468883 475879 483581 493020 504033 516103 529391 544423 561189 579134 597943
63059E97943K0017K1969K4677K7939L1335L4287L6433L7948L9378M1205M3470
$$ 597943 617960 639929 664606 692545 723880 758167 794600 832548 871926 913131 956601
63048I56601M5690M7160M7510M7036M6385M5897M5437M4840M4319M4363M5276
$$ 956601 1002291 1049451 1096961 1143997 1190382 1236279 1281716 1326556 1370875 1415238 1460514
63037A460514M6880M8504M9324M8804M6880M3641L8878L2190K3572J3648L234
$$ 1460514 1507394 1555898 1605222 1654026 1700906 1744547 1783425 1815615 1839187 1852835 1856069
63026A856069p245j7778k8335l8489m7430n4325n8722o0740o0748n8969n5511
$$ 1856069 1848824 1831046 1802711 1764222 1716792 1662467 1603745 1543005 1482257 1423288 1367777
63015A367777n0779m5474m0017l4242k7903k1221j4530p704m82O670J2772J7614
$$ 1367777 1316998 1271524 1231507 1197265 1169362 1148141 1133611 1125907 1125425 1132095 1144867 1162481
63003A162481K2165K7246L2210L5604L6870L6826L6603L6691L6995L7195L6926
$$ 1162481 1184646 1211892 1244102 1279706 1316576 1353402 1390005 1426696 1463691 1500886 1537812
62992A537812L6054L4998L4282L3673L2268K9567K5903K1527J5867Q233j160j1373
$$ 1537812 1573866 1608864 1643146 1676819 1709087 1738654 1764557 1786084 1801951 1810184 1809024 1797651
62980A797651k1689l1849m1622n0726n8896o5624p0054p1760p1460p0326o8637
$$ 1797651 1775962 1744113 1702491 1651765 1592869 1527245 1457191 1385431 1313971 1243645 1175008
62969A175008o5732o1323n6114n0992m6182m1511l7036l3046k9688k6867k4373
$$ 1175008 1109276 1047953 991839 940847 894665 853154 816118 783072 753384 726517 702144
62958G02144k1984j9668j7727j6500j5903j5486j4918j4192j3380j2564j1964
$$ 702144 680160 660492 642765 626265 610362 594876 579958 565766 552386 539822 527858
62947E27858j1700j1531j1200j0942j1103j1326j0832r593q551q369q626q525
$$ 527858 516158 504627 493427 482485 471382 460056 449224 439631 431080 422711 414085 405560
62935D05560p878p053o462o349o597o474n210l138j586j238j330j017o55r65j578
$$ 405560 397682 390629 384167 377818 371221 364747 359537 356399 354813 353575 352245 351228 350573 349608 348030
62920C48030j525p93l51p38j509k033k055j504n12L11L47k39p47r70j307j895
$$ 348030 346505 345712 345361 344623 343114 341081 339026 337522 337010 337321 337668 337429 336682 335712 334405 332510
62904C32510k366k591k862l196l194k744k254j854j118M5R38R57M50K08M99J042
$$ 332510 330144 327553 324691 321495 318301 315557 313303 311449 310331 310376 311314 312271 312721 312929 313428 314470
62888C14470J566J878J765J250Q04Q37J133J155P64L09J21J39M7l36p30m96O13
$$ 314470 316036 317914 319679 320929 321733 322570 323703 324858 325622 325931 326052 326191 326238 325902 325172 324676 325289
62871C25289J813J894O74o78j098r06j118j944k584k434j741j083o91m02J9O69
$$ 325289 327102 328996 329670 328992 327894 326988 325870 323926 321342 318908 317167 316084 315393 314991 315010 315679
62855C15679J357J692J535J229J118J030O62K89N01J171J377O05m90r37o09j56
$$ 315679 317036 318728 320263 321492 322610 323640 324302 324591 325092 326263 327640 328245 327755 326818 326209 326053
62839C26053k1j16l01o33j031j120o20K75J105J531J498J206J067J415K114K651
$$ 326053 326032 325916 325615 324982 323951 322831 322211 322486 323591 325122 326620 327826 328893 330308 332422 335073
62823C35073K748K652K618K477K102J899K239K621K315J756K269M013N284M697
$$ 335073 337821 340473 343091 345568 347670 349569 351808 354429 356744 358500 360769 364782 370066 374763
62809C74763L185K755L842N189O063P004Q239Q895Q560Q353R446J1305J2521J2777
$$ 374763 377948 380703 384545 389734 395797 402801 411040 419935 428495 436848 446294 457599 470120 482897
62795D82897J2941J3539J4279J5027J6198J8054K0356K2922K5905K9366L3167
$$ 482897 495838 509377 523656 538683 554881 572935 593291 616213 642118 671484 704651
62784G04651L7407M2363M7880N3372N8650O4054O9571P4424P7875P9881Q0493
$$ 704651 742058 784421 832301 885673 944323 1008377 1077948 1152372 1230247 1310128 1390621
62773A390621P9235P5587O9727O2133N2786M1334K7939J3397j471j6033k9608
$$ 1390621 1469856 1545443 1615170 1677303 1730089 1771423 1799362 1812759 1811288 1795255 1765647
62762A765647m1587n1841o0501o7262p1435p2893p2524p1448p0040o8021o5207
$$ 1765647 1724060 1672219 1611718 1544456 1473021 1400128 1327604 1256156 1186116 1118095 1052888
62751A052888o1817n8191n4455n0555m6434m2215l8219l4659l1359k7939k4431
$$ 1052888 991071 932880 878425 827870 781436 739221 701002 666343 634984 607045 582614
62740E82614k1380j9134j7265j5100j2666j0680r531q720p546o012m795m336m296
$$ 582614 561234 542100 524835 509735 497069 486389 476858 468138 460592 454580 449785 445449 441153
62727D41153l952k978j677m35Q48K508M260N102M496L459L800O159R289J1599
$$ 441153 437201 434223 432546 432111 432959 435467 439727 444829 449325 452784 456584 462743 472032 483631
62713D83631J2907J4156J5957J8072K0229K2672K5691K9189L2946L6969M1359
$$ 483631 496538 510694 526651 544723 564952 587624 613315 642504 675450 712419 753778
62702G53778M6180N1566N7633O4020O9851P4435P7769Q0207Q1880Q2583Q1904
$$ 753778 799958 851524 909157 973177 1043028 1117463 1195232 1275439 1357319 1439902 1521806
62691A521806P9140P3502O4783N3644M0878K6703J1126n229k1259l6173m9640
$$ 1521806 1600946 1674448 1739231 1792875 1833753 1860456 1871582 1866353 1845094 1808921 1759281
62680A759281o1242p0366p6722q0489q1962q1491p9728p7270p3915o9041o2961
$$ 1759281 1698039 1627673 1550951 1470462 1388500 1307009 1227281 1150011 1076096 1007055 944094
62669I44094n7198n2880m9434m5563m1084l6993l3885l1215k8292k5262k2670
$$ 944094 886896 834016 784582 739019 697935 660942 627057 595842 567550 542288 519618
62658E19618k0526j8353j5975j3794j2238j1228j0327r248q101p166o635o513
$$ 519618 499092 480739 464764 450970 438732 427504 417177 407929 399828 392662 386027 379514
62646C79514o669o833o750o364n819n151m149k813j711j439j762j734q94J43N31
$$ 379514 372845 366012 359262 352898 347079 341928 337779 334966 333255 331816 330054 328320 327426 327569 328100
62631C28100K33j70l53m51n41m56j49J07L8l46p56q09k82O17J368J714K019K703
$$ 328100 328333 328163 327810 327359 326818 326362 326213 326320 326358 326012 325256 324447 324165 324782 326150 327864 329883 332586
62613C32586L596M171M364M651N359O357P434Q567R677J0636J1650J3229J5514
$$ 332586 336182 340353 344717 349368 354727 361084 368518 377085 386762 397398 409048 422277 437791
62600D37791J7963J9991K1705K3733K6495K9813L3037L5465L6810L7400L7703
$$ 437791 455754 475745 497450 521183 547678 577491 610528 645993 682803 720203 757906
62589G57906L7639L6578L4068L0087K4600J7405Q809p4q110j4983k0901k5880
$$ 757906 795545 832123 866191 896278 920878 938283 947092 947018 938908 923925 903024 877144
62577H77144k9756l2545l4308l4862l4226l3059l2105l1307l0091k8384k6670
$$ 877144 847388 814843 780535 745673 711447 678388 646283 614976 584885 556501 529831
62566E29831k5019k2849j9906j6874j4636j3343j2510j1622j0347q505o268m219
$$ 529831 504812 481963 462057 445183 430547 417204 404694 393072 382725 374220 367952 363733
62554C63733k960k690l263m330n318n571m873l613k282j045j2N29N52O41J356
$$ 363733 360773 358083 354820 350490 345172 339601 334728 331115 328833 327788 327776 328305 328857 329498 330854
62539C30854K374K806K426J995K241K968L490L582L583L785M143M576N207O150
$$ 330854 333228 336034 338460 340455 342696 345664 349154 352736 356319 360104 364247 368823 374030 380180
62525C80180P364Q821J0676J3060J5848J8854K2138K5859K9759L3107L5401L6976
$$ 380180 387544 396365 407041 420101 435949 454803 476941 502800 532559 565666 601067 638043
62513F38043L8756M1304M4196M6288M6621M5138M2487L9079L4504K8102K0029
$$ 638043 676799 718103 762299 808587 855208 900346 942833 981912 1016416 1044518 1064547
62502A064547J1344K942n159j3192k0764k6988l1315l3812l4801l4583l3441l1536
$$ 1064547 1075891 1078833 1073674 1060482 1039718 1012730 981415 947603 912802 878219 844778 813242
62490H13242k8877k5658k2407j9466j6502j2996r024n079j305K454O039R127J1948
$$ 813242 784365 758707 736300 716834 700332 687336 678312 673233 671928 674382 680421 689548 701496
62477G01496J5095J8487K1251K2810K3368K3119K1787J9283J6081J2441Q040K855
$$ 701496 716591 735078 756329 779139 802507 825626 847413 866696 882777 895218 903258 906113
62465I06113k270o738j1134j6303k1928k6907l0757l3664l5479l5753l4741l3406
$$ 906113 903843 897105 885971 869668 847740 820833 790076 756412 720933 685180 650439 617033
62453F17033l2143l0409k7833k4972k2515k0378j8075j5608j3444j1793j0353
$$ 617033 584890 554481 526648 501676 479161 458783 440708 425100 411656 399863 389510
62442C89510q738o916n161l662k361j138j35M29O89J037J451J382N63m68j170
$$ 389510 380772 373856 368695 365033 362672 361534 361399 361828 362517 363554 365005 366387 366950 366482 365312
62427C65312j845l066m571n479n501n158m855m430l827l460l613l949l999l734
$$ 365312 363467 360401 355830 350351 344850 339692 334837 330407 326580 323120 319507 315558 311559 307825
62413C07825l382l021k548j903j123m37k07n48j010j037o88m31l63j85O5k1m49
$$ 307825 304443 301422 298874 296971 295848 295411 295204 294656 293646 292609 291921 291490 291127 290942 291007 290986 290537
62396B90537o38k29N26J358K301L158L308K561J591J095J002Q98P94Q91J157J590
$$ 290537 289899 289670 290196 291554 293855 297013 300321 302882 304473 305568 306570 307468 308262 309153 310310 311900
62380C11900K535M055N374N630N000M521M894O007P450Q954J0329J1451J2445
$$ 311900 314435 318490 323864 329494 334494 339015 343909 349916 357366 366320 376649 388100 400545
62367D00545J3599J5115J7050J9344K1665K3551K5041K6983L0333L5192M0764
$$ 400545 414144 429259 446309 465653 487318 510869 535910 562893 593226 628418 669182
62356F69182M6085N0596N4347N7791O1109O3405O3010N8962N1860M2988L3145
$$ 669182 715267 765863 820210 878001 939110 1002515 1065525 1124487 1176347 1219335 1252480
62345A252480K2843J2952M190l693j1394j8895k5662l1771l7787m3508m7822n0121
$$ 1252480 1275323 1288275 1292465 1288772 1277378 1258483 1232821 1201050 1163263 1119755 1071933 1021812
62333A021812n0958n0959m9882m7260m3308l8708l3902k9162k4870k1325j8450
$$ 1021812 970854 919895 870013 822753 779445 740737 706835 677673 652803 631478 613028
62322F13028j6113j4423j3468j3015j2854j3110j3893j4834j5345j5130j4264
$$ 613028 596915 582492 569024 556009 543155 530045 516152 501318 485973 470843 456579
62311D56579j3008j1824j1189j1091j0888j0093r024q247p689o770n363m022l246
$$ 456579 443571 431747 420558 409467 398579 388486 379462 371215 363526 356756 351393 347371 344125
62298C44125k969k911k934k841k255j045K57R12P46K74N1K11O00J095J594K014
$$ 344125 341156 338245 335311 332470 330215 329170 329427 330339 331085 331359 331410 331621 332221 333316 334910 336924
62282C36924K404K975L761M465M856N179N733O252O184N638N461O128P146P895
$$ 336924 339328 342303 346064 350529 355385 360564 366297 372549 378733 384371 389832 395960 403106 411001
62268D11001Q578R748J1280J2574J3588J5034J7502K0903K4871K9137L3539L8104
$$ 411001 419579 429327 440607 453181 466769 481803 499305 520208 545079 574216 607755 645859
62256F45859M3216M9072N4976N9706O2767O4660O5596O4626O0510N3042M3083
$$ 645859 689075 738147 793123 852829 915596 980256 1045852 1110478 1170988 1224030 1267113
62245A267113L1710J9884Q633j191r477j6840k3988l1248l8510m5339n1149n5533
$$ 1267113 1298823 1318707 1327340 1326149 1316672 1299832 1275844 1244596 1206086 1160747 1109598 1054065
62233A054065n8359n9450n8535n5726n1819m7645m3375l8851l4377l0612k7678
$$ 1054065 995706 936256 877721 821995 770176 722531 679156 640305 605928 575316 547638
62222E47638k4994k2127j9313j6901j4787j2745j0947r739r030q401p694p078
$$ 547638 522644 500517 481204 464303 449516 436771 425824 416085 407055 398654 390960 383882
62210C83882o564n845m850m056l900m081l907l255k722k669k580j746l29P81J094
$$ 383882 377318 371473 366623 362567 358667 354586 350679 347424 344702 342033 339453 337707 337378 338159 339253
62195C39253J064J439K430L703M851N686O287O992Q112R480J0493J0779J0681
$$ 339253 340317 341756 344186 347889 352740 358426 364713 371705 379817 389297 399790 410569 421250
62182D21250J0721J0814J0380R226P917P114O845O681O445O463P026Q001R225
$$ 421250 431971 442785 453165 462391 470308 477422 484267 490948 497393 503856 510882 518883 528108
62169E28108J1105J4333J8927K3948K8562L3051L8229M3951M8785N1318N1299
$$ 528108 539213 553546 572473 596421 624983 658034 696263 740214 788999 840317 891616
62158H91616M9258M5430L9550L1543K2162J2903N329J09l568p351j2230j7782
$$ 891616 940874 986304 1025854 1057397 1079559 1092462 1097791 1097900 1094332 1086981 1074751 1056969
62146A056969k3008k7499l1312l4156l5361l4763l2995l0743k8152k5132k1890
$$ 1056969 1033961 1006462 975150 940994 905633 870870 837875 807132 778980 753848 731958
62135G31958j8797j5997j3406j0989q826o997n530m333l059j295Q76K632L060
$$ 731958 713161 697164 683758 672769 663943 656946 651416 647083 644024 642729 643605 646237 649297
62122F49297K096N10j014k455l902m908m857l798k459j408q23j063k792n967r316
$$ 649297 651393 651903 650889 648434 644532 639624 634767 630969 628510 627102 626279 625216 622424 616457 607141
62107F07141j1481j2394j2780j2641j1249q658o132m567l374j587O67K573L927
$$ 607141 595660 583266 570486 557845 546596 537938 531806 527239 523865 522278 522945 525518 529445
62094E29445N061N837N784N229N335O641Q292R060Q707Q004P802Q399R533J0690
$$ 529445 534506 540343 546127 551356 556691 563332 571624 580684 589391 597395 605197 613596 623129 633819
62080F33819J1547J2274J3334J4980J7056J9232K1162K2480K3036K3157K3278
$$ 633819 645366 657640 670974 685954 703010 722242 743404 765884 788920 812077 835355
62069H35355K3362K3042K2435K2316K3280K5192K7566L0091L2501L4319L5066
$$ 835355 858717 881759 904194 926510 949790 974982 1002548 1032639 1065140 1099459 1134525
62058A134525L4451L2175K7961K2088J5525R223L537j495n858r921j4572k0255
$$ 1134525 1168976 1201151 1229112 1251200 1266725 1275948 1279485 1277990 1272132 1262211 1247639 1227384
62046A227384k6255l1563l6196m0810m5197m8084m8574m7109m4747m2200l9714
$$ 1227384 1201129 1169566 1133370 1092560 1047363 999279 950705 903596 858849 816649 776935
62035G76935l7339l4830l1845k8562k5703k3543k1383j8499j5204j2444j0626
$$ 776935 739596 704766 672921 644359 618656 595113 573730 555231 540027 527583 516957
62024E16957r392q332p368o531n888n716o235p154p875q181q338q490q353p664
$$ 516957 507565 499233 491865 485334 479446 473730 467495 460341 452466 444285 435947 427457 419104 411440
62010D11440o513n153l778k564j564m94J043K959M655N728O363O806O899O385
$$ 411440 404927 399774 395996 393432 391868 391374 392417 395376 400031 405759 412122 418928 425827 432212
61996D32212N385M235L092J990J009J12r35k165l196l758m170m909n914o740p256
$$ 432212 437597 441832 444924 446914 447923 448035 447100 444935 441739 437981 433811 428902 422988 416248 408992
61981D08992p668p993p936p315o204m714l090j984k070l274m757n688n764n046
$$ 408992 401324 393331 385395 378080 371876 367162 364072 362088 360018 356744 351987 346299 340535 335489
61967C35489l814k630k006j820j538j055p97q27n67L20J331J859J968J952J730
$$ 335489 331675 329045 327039 325219 323681 322626 321829 321002 320435 320755 322086 323945 325913 327865 329595
61952C29595J277J214K122L512M281M244M393N565P427R186J0671J2326J4340
$$ 329595 330872 332086 334208 337720 342001 346245 350638 356203 363630 372816 383487 395813 410153
61939D10153J6227J7394J7844J8269J9323K0865K2050K2242K1585K0578J9368
$$ 410153 426380 443774 461618 479887 499210 520075 542125 564367 585952 606530 625898
61928F25898J7787J5921J4181J2712J1086Q663N173R79l111o350q527r921j0757
$$ 625898 643685 659606 673787 686499 697585 706248 711421 712400 709289 702939 694412 684491 673734
61915F73734j0898j0253r047p423n089j801K068N907R641J3447J6943J9359K0606
$$ 673734 662836 652583 643536 636113 631024 629223 631291 637198 646839 660286 677229 696588 717194
61902G17194K1334K1655K0567J7177J1970O298R35m238r297j3718j6918j8970
$$ 717194 738528 760183 780750 797927 809897 816195 817130 812892 803595 789877 772959 753989
61890G53989k0435k1623k2256k1992k1089k0322k0046j9722j8658j7039j5721
$$ 753989 733554 711931 689675 667683 646594 626272 606226 586504 567846 550807 535086
61879E35086j5107j4751j4171j3416j2625j1559j0026q341o946n835m763l730
$$ 535086 519979 505228 491057 477641 465016 453457 443431 435090 428144 422309 417546 413816
61867D13816k854j954p99L72J105J484K190L720N871Q121J0176J2053J3934J6117
$$ 413816 410962 409008 408209 408581 409686 411170 413360 417080 422951 431072 441248 453301 467235 483352
61853D83352J8923K2399K6162K9663L2524L4689L6242L7164L7271L6447L4894
$$ 483352 502275 524674 550836 580499 613023 647712 683954 721118 758389 794836 829730
61842H29730L2971L0643K7281K2272J5714Q370J067n635j1335j5715j8648k0138
$$ 829730 862701 893344 920625 942897 958611 966981 968048 962413 951078 935363 916715 896577
61830H96577k0102j8423j5236j0935n863k21N652J1161J5756J9121K0949K0827
$$ 896577 876475 858052 842816 831881 826018 825797 831449 842610 858366 877487 898436 919263
61818I19263J8588J4575R257K765m789j2642j9574k4972k9350l3438l7050l9227
$$ 919263 937851 952426 961683 964448 959659 947017 927443 902471 873121 839683 802633 763406
61806G63406l9448l8211l6358l4253l1827k9086k6175k3154k0095j7311j5132
$$ 763406 723958 685747 649389 615136 583309 554223 528048 504894 484799 467488 452356
61795D52356j3509j2144j1030j0371r939r016p310n577m904n430o148n996m862
$$ 452356 438847 426703 415673 405302 395363 386347 379037 373460 368556 363126 356978 350982 346120
61782C46120l513k752k737l037l146k891k433j975j632j476j483j413j002l12
$$ 346120 342607 339855 337118 334081 330935 328044 325611 323636 322004 320528 319045 317632 316630 316318
61768C16318K14K47m7j50L17J327K427K994K737J999J388J032N90M5m1O05J328
$$ 316318 316532 316779 316732 316582 316899 318226 320653 323647 326384 328383 329771 330803 331393 331438 331397 332002 333330
61751C33330J319P54N01Q09R62L65o10j195j173r35q48r68j214j473j532j160
$$ 333330 334649 335403 335904 336713 337675 338040 337430 336235 335062 334127 333279 332311 331097 329624 328092 326932
61735C26932m18K97O30P13J053J894K829L240L056K797K844L021L030K943K975
$$ 326932 326514 326811 327441 328154 329207 331101 333930 337170 340226 343023 345867 348888 351918 354861 357836
61720C57836L081L111L112L108K853K282J964K496L508L871L022J514J56p84j407
$$ 357836 360917 364028 367140 370248 373101 375383 377347 379843 383351 387222 390244 391758 391914 391130 389723
61705C89723j758j958k331k993l620l854l715l377k880k288j819j558j356j182
$$ 389723 387965 386007 383676 380683 377063 373209 369494 366117 363237 360949 359130 357572 356216 355034
61691C55034j242j458j352p84l63n74j027j052p40o95j056j450j744k087k304
$$ 355034 353792 352334 350982 350198 349835 349261 348234 347182 346442 345747 344691 343241 341497 339410 337106
61676C37106k000j365j047j187j288j189j368k012k543k494k169j973j723j218
$$ 337106 335106 333741 332694 331507 330219 329030 327662 325650 323107 320613 318444 316471 314748 313530
61662C13530q93j177j605j358m68K50L64K10J69K30L49O36J045J382J712K336
$$ 313530 312637 311460 309855 308497 308029 308279 308643 308853 309022 309252 309601 310237 311282 312664 314376 316712
61646C16712L151L554L266K915L459N090O855P388O154M104K820K701K437P99
$$ 316712 319863 323417 326683 329598 333057 338147 345002 352390 358544 362648 365468 368169 370606 371405
61632C71405j432k398j831j501k611m095m393l807l728m223m016k710j508j316
$$ 371405 369973 367575 365744 364243 361632 357537 353144 349337 345609 341386 337370 334660 333152 331836
61618C31836j484j078l44l0PM70J313J748J466R73N68k53k022m424o503p540p455
$$ 331836 330352 329274 328930 328900 328907 329377 330690 332438 333904 334877 335445 335192 333170 328746 322243 314703 307248
61601C07248o596n430m352l535k927k475k321k616l159l424l101k543k445k996
$$ 307248 300652 295222 290870 287335 284408 281933 279612 276996 273837 270413 267312 264769 262324 259328
61587B59328l479k989j531j33K40l68j185j668j895k082k178k029j722j536j617
$$ 259328 255849 252860 251329 251196 251436 251068 249883 248215 246320 244238 242060 240031 238309 236773 235156
61572B35156j866k040j915j450q88o75j014j573j771j477j219j452j825j505k80
$$ 235156 233290 231250 229335 227885 226997 226322 225308 223735 221964 220487 219268 217816 215991 214486 214206
61557B14206J043J557J219O43K00j73m24k67K13M75K43o8n1j4m59j129j217n27
$$ 214206 215249 216806 218025 218668 218868 218695 218271 218004 218217 218692 218935 218867 218816 218802 218343 217214 215997 215470
61539B15470J76J56m45r54r87n90J65J282K485L119K637J176m38j350j370j022
$$ 215470 215646 215802 215357 214403 213416 212826 212991 214273 216758 219877 222514 223690 223252 221902 220532 219510
61523B19510r60j319j691j665j300j038j165j443j429j155j227j912k456j853
$$ 219510 218550 217231 215540 213875 212575 211537 210372 208929 207500 206345 205118 203206 200750 198897
61509A98897l02P73M88l94o07q5K81J01j66k43l63n60n06k93n30j271j734j470
$$ 198897 198595 199368 199856 199462 198855 198770 199051 199152 198986 198743 198380 197820 197314 197021 196491 195220 193486 192016
61491A92016r79o70j72O74R89J43q92p04M34R85M92R6N61J171J083O68P17J243
$$ 192016 191037 190367 190195 190869 191858 192001 191109 190405 190839 191824 192316 192412 192973 194144 195227 195895 196612 197855
61473A97855J763K067K030J311kr42p16K02P15N24J50r9l76n94l91J46L97J5o63
$$ 197855 199618 201685 203715 205026 205024 204082 203366 203568 204283 204807 204957 204858 204482 203888 203497 203643 204040 204055 203392
61454B03392j107j038m69L17Q21Q25P08Q20P95J03q59j097l83N55J286K113L041
$$ 203392 202285 201247 200778 201095 201916 202741 203449 204269 205064 205167 204308 203211 202828 203383 204669 206782 209823
61437B09823L342K670J826J674K037K340K626L112L313K636J523R58R49N65m47
$$ 209823 213165 215835 217661 219335 221372 223712 226338 229450 232763 235399 236922 237880 238829 239394 238947
61422B38947j125o66M68J306J585J697J921K268K796L518M079L937K927J414n4
$$ 238947 237822 237156 237624 238930 240515 242212 244133 246401 249197 252715 256794 260731 263658 265072 265018
61407B65018j085j562j688j864k342k926l167k920k557k506k749k844k493j856
$$ 265018 263933 262371 260683 258819 256477 253551 250384 247464 244907 242401 239652 236808 234315 232459
61393B32459j263q02m01j65l48r21j461j574j257p49k81j1L9J45O45J399J798
$$ 232459 231196 230394 229993 229828 229480 228559 227098 225524 224267 223518 223237 223226 223265 223410 224055 225454 227252
61376B27252J521R71O77O06M52K72L55O45Q11Q17R09J127J327J617K293L276M036
$$ 227252 228773 229744 230421 231027 231479 231751 232106 232751 233562 234379 235288 236415 237742 239359 241652 244928 248964
61359B48964M218L947L563L368L584M176M680M727M623M954N619N934N730N655
$$ 248964 253182 257129 260692 264060 267644 271820 276500 281227 285850 290804 296423 302357 308087 313742
61345C13742O055O273N490L867K370J797K283L444M642N363N607N727N700N010
$$ 313742 319797 326070 331560 335427 337797 339594 341877 345321 349963 355326 360933 366660 372360 377370
61331C77370L556K108J459J415J203M72o05j962l576m857m953l859k714k522l007
$$ 377370 380926 383034 384493 385908 387111 387583 386978 385016 381440 376583 371630 367771 365057 362535 359528
61316C59528l062k163q80n8J92M64J236K353L371M143M899N835O831P516P498
$$ 359528 356466 354303 353423 353365 353557 354021 355257 357610 360981 365124 370023 375858 382689 390205 397703
61301C97703O621N179L740K532J238l56j763k367k363k492k856k820k222j878
$$ 397703 404324 409503 413243 415775 417013 416657 414894 412527 410164 407672 404816 401996 399774 397896
61287C97896k450l472m093m240m391m601m429l680k669j720r03j86N24J423K551
$$ 397896 395446 391974 387881 383641 379250 374649 370220 366540 363871 362151 361248 361062 361586 363009 365560
61272C65560L551M004L969L817L661L296K733K404K716L562M439N052N694O813
$$ 365560 369111 373115 377084 380901 384562 387858 390591 392995 395711 399273 403712 408764 414458 421271
61258D21271Q183Q832Q124O609N286M329L273K343K503L906N366N873N766N759
$$ 421271 429454 438286 446410 453019 458305 462634 465907 468250 470753 474659 480025 485898 491664 497423
61244D97423N634M830L633K688J740l3k590m919o355p132p622p764p438o727n709
$$ 497423 503057 507887 511520 514208 515948 515915 513325 508406 502051 494919 487297 479533 472095 465368 459659
61229D59659m454l260k431j845j214o67n92r27j151r01k23O93J592K188K531L096
$$ 459659 455205 451945 449514 447669 446455 445788 445196 444269 443118 442217 441994 442687 444279 446467 448998 452094
61213D52094M003M561M175L319K830K637K067J100L64R1Q1N27J764L309M306M961
$$ 452094 456097 460658 464833 468152 470982 473619 475686 476786 477150 477241 477322 477849 479613 482922 487228 492189
61197D92189O284Q288R815J0467J1308J2938J4198J3638J1397Q748O523M898M053
$$ 492189 498473 506761 516576 527043 538351 551289 565487 579125 590522 599270 605793 610691 614744
61184F14744M069M509M885N213N582N599M885L715K620J723J014P83J124J447
$$ 614744 618813 623322 628207 633420 639002 644601 649486 653201 655821 657544 658558 659341 660465 661912
61170F61912J157N51L28M64K26p97k262l574m360m586m656n215o452p712q226
$$ 661912 663069 663620 663948 664412 664638 663841 661579 658005 653645 649059 644403 639188 632736 625024 616798
61155F16798q056p862p950q026p772p162o257n171m327m373n571p444r090r880
$$ 616798 608742 600880 592930 584904 577132 569970 563713 558542 554215 549842 544271 536827 527737 517857
61141E17857r838r479r183q888q339p550o671n637m325l025k221j885j501r02
$$ 517857 508019 498540 489357 480469 472130 464580 457909 452272 447947 444922 442701 440816 439315 438413
61127D38413m54k19M14J891L715N029N663O232P341R063J1071J2988J4647J6063
$$ 438413 437959 437740 438154 440045 443760 448789 454452 460684 468025 477088 488159 501147 515794 531857
61113E31857J7209J8018J8749J9994K1855K3489K4021K3712K3460K3401K2928
$$ 531857 549066 567084 585833 605827 627682 651171 675192 698904 722364 745765 768693
61102G68693K1867K0614J9025J6396J2788R303O586M151J588o12k093l475n382
$$ 768693 790560 811174 830199 846595 859383 868686 875272 879423 881011 880399 878306 874831 869449
61089H69449p457r058j0264j1532j2950j4402j5822j6797j6660j5566j4695j4794
$$ 869449 861992 852934 842670 831138 818188 803786 787964 771167 754507 738941 724246 709452
61077G09452j5270j5254j4717j3905j2643j0959r553q834q238p189n954m869l666
$$ 709452 694182 678928 664211 650306 637663 626704 617151 608317 600079 592890 586936 582067 578401
61064E78401k268j312j035o47M13J584K398L393M895O168O827P773R457J0665
$$ 578401 576133 574821 573786 573139 573552 575136 577534 580927 585822 591990 598817 606590 616047 626712
61050F26712J0520J0286J1514J3688J5549J7395J9967K2293K3133K3685K6226
$$ 626712 637232 647518 659032 672720 688269 705664 725631 747924 771057 794742 820968
61039H20968L0617L4704L7782M1060M4848M7826M9313M9992N0303N0257N0840
$$ 820968 851585 886289 924071 965131 1009979 1057805 1107118 1157110 1207413 1257670 1308510
61028A308510N3438N7852O3020O9348P7934Q7642R5788J01784J07653J15215J25751
$$ 1308510 1361948 1419800 1482820 1552168 1630102 1717744 1813532 1915316 2022969 2138184 2263935
61017B263935J42160J67912K03830K49390L06851L79681M67340N67779O86191
$$ 2263935 2406095 2574007 2777837 3027227 3334078 3713759 4181099 4748878 5435069
61008E435069Q35334J026646J267869J563638J890797K153338K184996J850865
$$ 5435069 6270403 7297049 8564918 10128556 12019353 14172691 16357687 18208552
61000A8208552J181536L97484k25435n27055n11989k68304J09657N05193P40377
$$ 18208552 19390088 19787572 19562137 19035082 18523093 18254789 18364446 18869639 19610016
60991A9610016O32485J31193o09672j321434j793698j973962j932769j769988
$$ 19610016 20242501 20373694 19764022 18442588 16648890 14674928 12742159 10972171
60983A0972171j558088j338858j134907r54275p95880o58642n44004m50875l74159
$$ 10972171 9414083 8075225 6940318 5986043 5190163 4531521 3987517 3536642 3162483
60974C162483l10014k58468k19558j90444j67717j49649j34956j21931j09980
$$ 3162483 2852469 2594001 2374443 2183999 2016282 1866633 1731677 1609746 1499766
60965A499766r9727r0790q1462p1365o2125n4655m7941m1479l6692l4735l4616
$$ 1499766 1400039 1309249 1227787 1156422 1094297 1039642 991701 950222 913530 878795 844179
60954H44179l4663l4232l3061l0644k7318k4484k2642k0625j7659j4735j2983
$$ 844179 809516 775284 742223 711579 684261 659777 637135 616510 598851 584116 571133
60943E71133j2044j1134j0328r730q749p350o774p721q936q905p992p581p939
$$ 571133 559089 547955 537627 527897 519148 511798 505024 497303 488367 479462 471470 463889 455950
60930D55950q233q080p804p593p414p344p284o903o439o669p448p314n549l553
$$ 455950 447717 439637 431833 424240 416826 409482 402198 395295 388856 382187 374739 367425 361876 358323
60916C58323l002l539l638k963k370k192j955j564j276p94K84J255R94j30m72
$$ 358323 355321 351782 348144 345181 342811 340619 338664 337100 335824 335030 335314 336569 337563 337433 336961
60901C36961N90J862K257K213K590L115K865J694L84l89o18o08n76o69j105j958
$$ 336961 337551 339413 341670 343883 346473 349588 352453 354147 354531 354142 353524 352916 352340 351671 350566 348608
60885C48608k824k979k255j638k413m537o397o557n253l758k758j982j142m43
$$ 348608 345784 342805 340550 338912 336499 331962 325565 319008 313755 309997 307239 305257 304115 303672
60871C03672j80k78l88j00Q49K320L772M712N018M727L891K843K149K002K080
$$ 303672 303492 303214 302826 302726 303575 305895 309667 314379 319397 324124 328015 330858 333007 335009 337089
60856C37089K334L246M810N894N468M019K838K269J661Q19L72N76P86N29K39M69
$$ 337089 339423 342669 347479 353373 358841 362860 365698 367967 369628 370447 370819 371395 372181 372710 372949 373418
60840C73418J013J272J040M50m43j544k482k886k818k668k731l050l485l746l599
$$ 373418 374431 375703 376743 377193 376750 375206 372724 369838 367020 364352 361621 358571 355086 351340 347741
60825C47741l191k988l225l608l720l541l315l148k974k825k799k793k542j989
$$ 347741 344550 341562 338337 334729 331009 327468 324153 321005 318031 315206 312407 309614 307072 305083
60811C05083j396j028q62p51o58n81l70J57R06J616K211K820L342L468L254L305
$$ 305083 303687 302659 301797 301046 300388 299807 299437 299594 300500 302116 304327 307147 310489 313957 317211 320516
60795C20516L991M833N205N295N779O669P319P550P982Q955R901J0286J0535J1414
$$ 320516 324507 329340 334545 339840 345619 352288 359607 367157 375139 384094 393995 404281 414816 426230
60781D26230J2916J4334J5207J5601J5713J5766J6222J7544J9554K1446K2542
$$ 426230 439146 453480 468687 484288 500001 515767 531989 549533 569087 590533 613075
60770F13075K2863K2931K3139K3387K3205K2286K0886J9555J8389J6802J4106
$$ 613075 635938 658869 682008 705395 728600 750886 771772 791327 809716 826518 840624
60759H40624J0164N314L4n097r479j2833j5361j7369j8924k0064k1012k1932k2662
$$ 840624 850788 856102 856136 851039 841560 828727 813366 795997 777073 757009 735997 714065 691403
60746F91403k3003k3017k2739k1948k0543j8968j7806j7122j6523j5771j5049
$$ 691403 668400 645383 622644 600696 580153 561185 543379 526257 509734 493963 478914
60735D78914j4663j4691j4790j4325j2927j1072r735r257r011q373p487o633n552
$$ 478914 464251 449560 434770 420445 407518 396446 386711 377454 368443 360070 352583 345950 340398
60722C40398m033k724k442k934l130k557j706j021l93K46N33K69j84m07m59n80
$$ 340398 336365 333641 331199 328265 325135 322578 320872 319851 319458 319704 320237 320506 320322 319915 319456 318876
60706C18876p49p74o58o38r63j734k767l672m169m369m565m856n076n010m513
$$ 318876 318127 317353 316695 316057 315094 313360 310593 306921 302752 298383 293818 288962 283886 278876 274363
60691B74363l654k909k842l332l547l025k307k011j811j115l45l91j055j122j36
$$ 274363 270709 267800 264958 261626 258079 255054 252747 250736 248925 247810 247465 247074 246019 244897 244761
60676B44761R73J289J014P36N07K09J00L72O42M65n8o26j193j645j499n96L83
$$ 244761 245734 247023 248037 248773 249280 249489 249589 249961 250603 251068 251010 250384 249191 247546 246047 245451 245834
60659B45834P04N88Q27J544K050J874J380J249J778K733L653M183M330M362M418
$$ 245834 246538 247126 247953 249497 251547 253421 254801 256050 257828 260561 264214 268397 272727 277089 281507
60644B81507M338L983L457K837J979R66L62O03J276J562J237Q06N97K87n33j698
$$ 281507 285845 289828 293285 296122 298101 299067 299429 300032 301308 302870 304107 304913 305510 305797 305264 303566
60628C03566k625k884k499j875j503j564j770j797j808k197k785k792j937j100
$$ 303566 300941 298057 295558 293683 292180 290616 288846 287049 285241 283044 280259 277467 275530 274430
60614B74430j370k587l447l090k009j189q86p10n08n66j002j515j796j720j123
$$ 274430 273060 270473 267026 263936 261927 260738 259852 259142 258634 258068 257066 255551 253755 252035 250912
60599B50912N9J299J689J023J93L4K26n6q34j341j219r16q35p84m59O3N32Q07
$$ 250912 250971 252270 253959 254982 255175 255209 255435 255379 254545 253204 251985 251069 250234 249450 248991 249054 249586 250393
60581B50393P38L34J36Q56K336L446L503L256L870N314O524O994P436Q606J0150
$$ 250393 251131 251465 251601 252457 254793 258239 261742 264998 268868 274182 280706 287700 295136 303742 313892
60566C13892J0997J0535R033P034M796K354k14k772n187p171q192p888o587n081
$$ 313892 324889 335424 344457 351491 356287 358641 358427 355655 350468 343297 335105 327217 320630 315549
60552C15549l760k288l66J570K843L436L912M595N358O157P098P920Q010P209
$$ 315549 311789 309501 309135 310705 313548 316984 320896 325491 330849 337006 344104 352024 360034 367243
60538C67243O029M815L208Q82j614l299l779l427k786k166j660j138l65M74O65
$$ 367243 373272 378087 381295 382177 380563 377264 373485 370058 367272 365106 363446 362308 361943 362417 363082
60523C63082k02j397j719r31l4M8n06r18q56n60k24K69J043K069L368M972O648
$$ 363082 362880 361483 359764 358833 358799 358847 358341 357423 356567 356007 355783 356052 357095 359164 362532 367504 374152
60506C74152P911Q631R440J1242J4359J8334K2481K6361K9722L2427L4573L6242
$$ 374152 382063 390694 400134 411376 425735 444069 466550 492911 522633 555060 589633 625875
60494F25875L6845L5036K9821K1562J1583R54r868k0323k9361l5956l9626m0361
$$ 625875 662720 697756 727577 749139 760722 761676 751808 731485 702124 666168 626542 586181
60482E86181l8531l5036l1120k7585k4377k1110j7826j5057j3226j2186j1324
$$ 586181 547650 512614 481494 453909 429532 408422 390596 375539 362313 350127 338803
60471C38803j0140q752p659o944o026m544l101k481k496k354k029k229k902k903
$$ 338803 328663 319911 312252 305308 299282 294738 291637 289156 286660 284306 282277 280048 277146 274243
60457B74243j700l76k32j097j861k080k111k121j918j614j553j634j432j022r71
$$ 274243 272543 272167 271935 270838 268977 266897 264786 262665 260747 259133 257580 255946 254514 253492 252521
60442B52521j446j917j855j298o18j40j2j51l20n73j351k790m106m319l328j828
$$ 252521 251075 249158 247303 246005 245387 245247 245235 245084 244764 244191 242840 240050 235944 231625 228297 226469
60426B26469k68J359K900L933M400M577M383L399J758K77n32r18j130r79n12l75
$$ 226469 226201 227560 230460 234393 238793 243370 247753 251152 252910 253187 252655 251737 250607 249628 249116 248741
60410B48741q93j373j030j30M59N65P87J380J851J767J426J378J670J852J599
$$ 248741 247848 246475 245445 245315 245774 246339 247126 248506 250357 252124 253550 254928 256598 258450 260049
60395B60049J073P02P14R89J307J614J966K297K442K359K126J771J347J114J279
$$ 260049 261122 261824 262538 263527 264834 266448 268414 270711 273153 275512 277638 279409 280756 281870 283149
60380B83149J551J395P82L16L49M91L23J58N64J388J892J783J570J725K038K037
$$ 283149 284700 286095 286877 287193 287542 288033 288356 288514 289078 290466 292358 294141 295711 297436 299474 301511
60364C01511J696J353J118P11j7o79o62K34J625K970L968M516M635M576M865N793
$$ 301511 303207 304560 305678 306389 306372 305693 305031 305265 306890 309860 313828 318344 322979 327555 332420 338213
60348C38213O936P521P302O715O132N312L790J477j283m006o175p373p657p555
$$ 338213 345149 352670 359972 366687 372819 378131 381921 383398 382115 378109 371934 364561 356904 349349
60334C49349p406o924n673l857k259j509j666k353k957k821j748l86L02Jp26j258
$$ 349349 341943 335019 329346 325489 323230 321721 320055 317702 314745 311924 310176 309790 310092 310093 309367 308109
60318C08109j508j659j685j428q58l0J032K164L033L525M114N521P990J1004J3600
$$ 308109 306601 304942 303257 301829 300971 300941 301973 304137 307170 310695 314809 320330 328320 339324 352924
60303C52924J4954J4861J3828J2605J1362R520O575K890o65l665o219q252r378
$$ 352924 367878 382739 396567 409172 420534 430054 436629 439519 438854 435189 428970 420718 411340
60290D11340r658r804j0257j0517r950q826p940p422o614n172l580k440j821j559
$$ 411340 401682 391878 381621 371104 361154 352328 344388 336966 330352 325180 321600 319160 317339 315780
60276C15780j656k051k378k338k096j961j951j926j914k012k147k210k291k447
$$ 315780 314124 312073 309695 307357 305261 303300 301349 299423 297509 295497 293350 291140 288849 286402
60262B86402k462k114j499q67l12Q9J17k22m92l92k71n02o86j67P65J058L52n03
$$ 286402 283940 281826 280327 279460 279148 279237 279354 279132 278640 278248 277977 277475 276789 276622 277387 278445 278797 278294
60244B78294o53k28J96M71P75J077J262J438J712J922J978K085K304K203J508
$$ 278294 277641 277413 277609 278080 278855 279932 281194 282632 284344 286266 288244 290329 292633 294836 296344
60229B96344P17N72R78J135O72Q3n3K31N38O98Q12R77J150J275J365J579K119
$$ 296344 297061 297633 298611 299746 300418 300501 300448 300679 301217 301915 302727 303704 304854 306129 307494 309073 311192
60212C11192K992L815M082L668L003K711L074L787M243M102L647L487L816M237
$$ 311192 314184 317999 322081 325749 328752 331463 334537 338324 342567 346669 350316 353803 357619 361856
60198C61856M359M324M457M650M543M137L820L744L588L065K326J690J198O78
$$ 361856 366215 370539 374996 379646 384189 388326 392146 395890 399478 402543 404869 406559 407757 408435
60184D08435O1m86p81q62j082j877l283m688n249m676l480k467k110k393k960
$$ 408435 408496 408010 407229 406367 405285 403408 400125 395437 390188 385512 382032 379565 377455 375062 372102
60169C72102l330l196k730k472k706l044k836j934q87l00k43l41l15k03q9J44
$$ 372102 368772 365576 362846 360374 357668 354624 351788 349854 348967 348667 348424 348083 347768 347565 347476 347620
60153C47620O30J179J385J062M76O9J24O22J302J758J740J463J464J970K676L225
$$ 347620 348250 349429 350814 351876 352352 352421 352545 353167 354469 356227 357967 359430 360894 362864 365540 368765
60137C68765L652M136M596M886N119N364N200M195K746J805J583J245J89r80j313
$$ 368765 372417 376553 381149 386035 391154 396518 401718 405913 408659 410464 412047 413292 413481 412501 411188
60122D11188q40l74k10J60J048J955K217J812J272J100J468K144K470J814L74
$$ 411188 410348 409974 409764 409924 410972 412927 415144 416956 418228 419328 420796 422940 425410 427224 427598
60107D27598p23n84L70Q92L50p68j722k275k485k273j608q57n65r57j848k869
$$ 427598 426875 426291 426661 427553 427903 427135 425413 423138 420653 418380 416772 415915 415350 414393 412545 409676
60091D09676l566l487k574j381o06m01l76j93R7K96L36L13M45R80J832K436K274
$$ 409676 406110 402623 400049 398668 398062 397661 397285 397092 397189 397485 397821 398134 398579 399559 401391 403827 406101
60074D06101J588J134J184J173M85p48j927k711l177l535l919m361m730m880m966
$$ 406101 407689 408823 410007 411180 411665 410917 408990 406279 403102 399567 395648 391287 386557 381677 376711
60059C76711n291n742n732n039m220l872l795l428k763k170j598o94L68R43J005
$$ 376711 371420 365678 359946 354907 350687 346815 343020 339592 336829 334659 333061 332367 332735 333678 334683
60044C34683J326K262L044K897K278K306L172L899L778L319L427M123M582M303
$$ 334683 336009 338271 341315 344212 346490 348796 351968 355867 359645 362964 366391 370514 375096 379399
60030C79399L631L011K228R06o34j617j926k301l197m084m354m367m932n984o589
$$ 379399 383030 386041 388269 389175 388541 386924 384998 382697 379500 375416 371062 366695 361763 355779 349190
60015C49190o220n353m743m640m865n138n125m572l601k559j574o20M4R8j47L8
$$ 349190 342970 337617 332874 328234 323369 318231 313106 308534 304933 302374 300800 300180 300224 300322 300175 300213
59999C00213P45J209R21K76j85m59n99k71N78J217J071O48P80J342J622J609J962
$$ 300213 300958 302167 303088 303364 303179 302720 302121 301850 302428 303645 304716 305364 306144 307486 309108 310717 312679
59982C12679K793L451L544L324K955K225J243O60P85J082Q66P6r54j906k418k110
$$ 312679 315472 318923 322467 325791 328746 330971 332214 332874 333659 334741 335607 335683 334729 332823 330405 328295
59966C28295j123j88J80K65N51R23R32N40J66M0m8l25o32n63NN91N17k80j046
$$ 328295 327172 326984 327164 327429 327980 328903 329835 330375 330541 330581 330533 330208 329576 329013 329018 329609 330126 329846 328800
59947C28800j118p62o05n49j8Q05J013M05r6P1J89m54j273j384j194j760k925
$$ 328800 327682 326920 326315 325766 325748 326553 327566 327971 327875 327946 328135 327681 326408 325024 323830 322070 319145
59930C19145l359k461j168o15r08j437j665j281l08O71R56O77P07J429K221K461
$$ 319145 315786 313325 312157 311542 310634 309197 307532 306251 305943 306614 307570 308247 308954 310383 312604 315065
59914C15065K344K302K225J800J144N78K08J98R25K311L354L174K253J872K376
$$ 315065 317409 319711 321936 323736 324880 325458 325666 325864 326789 329100 332454 335628 337881 339753 342129
59899C42129K825K483J815J644J870J633N74o42j069n52K22N83O34R64J765K549
$$ 342129 344954 347437 349252 350896 352766 354399 354973 354331 353262 352710 352932 353515 354149 355113 356878 359427
59883C59427K907L170L955N219O164O240N826N730O129O262N270L196J022l41
$$ 359427 362334 365504 369459 374678 380842 387082 392908 398638 404767 411029 416299 419495 420517 420176
59869D20176r67j654k867m195m944m910m395l650k631j296J54J423K492L755N581
$$ 420176 419209 417555 414688 410493 405549 400639 396244 392594 389963 388667 388821 390244 392736 396491 402072
59854D02072P649Q873Q353O321L802J442p84k670l389k436m46J383K267J817k76
$$ 402072 409721 418594 426947 433268 437070 438512 437728 435058 431669 429233 428787 430170 432437 434254 433978
59839D33978l748p311r605j0484j0656j0295q904o564m332l026k420j903j334
$$ 433978 430230 422919 413314 402830 392174 381879 372975 366411 362079 359053 356633 354730 353396
59826C53396q16k74L52Q79J223J530J669J119k75j850k874l310l459l332k835
$$ 353396 352580 352306 352658 353537 354760 356290 357959 359078 358803 356953 354079 350769 347310 343978 341143
59811C41143k252j969j923j858j796j815j623r56j96N3j32j59P0k8p37j547j885
$$ 341143 338891 336922 334999 333141 331345 329530 327907 326951 326755 326808 326676 326517 326587 326559 325822 324275 322390
59794C22390j880j996k337k609k649k611k690k855k883k578j970j274o66j83J01
$$ 322390 320510 318514 316177 313568 310919 308308 305618 302763 299880 297302 295332 294058 293392 293209 293310
59779B93310mn24j095j303j167r53o73r9O64J101R38N75O57J381K428L356L819
$$ 293310 293306 292782 291687 290384 289217 288264 287591 287492 288156 289257 290195 290770 291427 292808 295236 298592 302411
59762C02411L583K648J454O67O75J230J654J419O00j26L6J382L381N020N575N184
$$ 302411 305994 308642 310096 310763 311438 312668 314322 315741 316341 316215 316251 317633 321014 326034 331609 336793
59746C36793M585M275M066L582K955K697K940L146K767J870R70M54L65N60Q33
$$ 336793 341378 345653 349719 353301 356256 358953 361893 365039 367806 369676 370646 371100 371465 372025 372858
59731C72858R42P26K54k07l76j92M9p8n53p64k68N09Q65R05J259J734J278k89
$$ 372858 373800 374526 374780 374573 374197 374005 374054 373976 373423 372659 372391 372900 373765 374670 375929 377663 378941 378652
59713C78652j508j081L51J153R01N65Q08J210J243J017Q22P04P19R52J189J134
$$ 378652 377144 376063 376414 377567 378468 379033 379841 381051 382294 383311 384133 384837 385556 386508 387697 388831
59697C88831R94J206J585J522J106J111J641J715P20o06j228j209j348j905k438
$$ 388831 389825 391031 392616 394138 395244 396355 397996 399711 400431 399825 398597 397388 396040 394135 391697
59682C91697k559k226j504n83J12K45r0o47j399k314l094l530l791m035m035l605
$$ 391697 389138 386912 385408 384825 384937 385182 385092 384445 383046 380732 377638 374108 370317 366282 362247 358642
59666C58642l063k778k576k059j310p49n29m61m47m49k59K44P78J031J145J369
$$ 358642 355579 352801 350225 348166 346856 346107 345578 345117 344670 344221 343962 344206 344984 346015 347160 348529
59650C48529J495J232R30J215J940K222J624O78O9j34k41m51p95j195j368j044
$$ 348529 350024 351256 352186 353401 355341 357563 359187 359865 359934 359800 359559 359108 358313 357118 355750 354706
59634C54706m35j03k51n20n96o20q12j098j304j400j360j132q89r37j142r28j55
$$ 354706 354271 354168 353917 353397 352801 352181 351369 350271 348967 347567 346207 345075 344186 343249 342107 341179 341024
59617C41024M15Kj184k281k880l170l128k293o12J022J574J045M25M92J027J323
$$ 341024 341439 341441 340257 337976 335096 331926 328798 326505 325893 326915 328489 329534 329959 330451 331478 332801
59601C32801J158R09Q35O85J79m54p50o44m72l93k09J80M44K37k97o57n61k71
$$ 332801 333959 334868 335703 336388 336567 336113 335363 334719 334247 333854 333645 333825 334269 334506 334209 333552 332991 332720
59583C32720k91q58j748k501k841k867k848k906k923k690k087j195l11J81J58
$$ 332720 332429 331571 329823 327322 324481 321614 318766 315860 312937 310247 308160 306965 306654 306835 306993
59568C06993k8J64Q82J663J860J286M16q4k0K13J89j9o3R0J45L7R9M80Q60R35
$$ 306993 306965 307129 308011 309674 311534 312820 313236 313152 313132 313345 313534 313515 313452 313542 313687 313724 313823 314303 315163 316098
59548C16098R36J306K118L104M046M893N672O546P819R687J2282J5922K0493K4097
$$ 316098 317034 318340 320458 323562 327608 332501 338173 344719 352538 362225 374507 390429 410922 435019
59534D35019K3291J6107M759n704j1666j3229j2483j0853q637o024l423j103Q60
$$ 435019 458310 474417 479176 473472 461806 448577 436094 425241 416604 410580 407157 406054 406914
59521D06914K354L329L944M317M334L948L349K660J813Q13k68j653l696o053p705
$$ 406914 409268 412597 416541 420858 425192 429140 432489 435149 436962 437775 437507 435854 432158 426105 418400
59506D18400q204q272q615q736p749n916m476m073m228m338m404m507m346l705
$$ 418400 410196 401924 393309 384573 376824 370908 366432 362359 358131 353793 349389 344882 340536 336831
59492C36831k946k588k593k357j385J25J342J530P97N7Q2P69J583K393L460M682
$$ 336831 333885 331297 328704 326347 324962 325087 326429 327959 328756 328813 328895 329664 331247 333640 337100 341782
59476C41782N478N480M956M335L704K972K195J485P52j41j012j454j261o64n8
$$ 341782 347260 352740 357696 362031 365735 368707 370902 372387 373139 372998 371986 370532 369271 368607 368549
59461C68549M13R06J563K324L100L973M986N808O021N798N854O522P292P639P963
$$ 368549 368962 369868 371431 373755 376855 380828 385814 391622 397643 403441 409295 415817 423109 430748 438711
59446D38711R012J0461J0722Q527M395J58k759m320n304o156o696o733o550o564
$$ 438711 447723 458184 468906 477433 481828 481986 479227 474907 469603 463447 456751 450018 443468 436904
59432D36904o818p021o978o596n744m510l460l037k731j566M95K459L822N293
$$ 436904 430086 423065 416087 409491 403747 399237 395777 392740 390009 388443 388938 391397 395219 400512
59418D00512P481R755J1237J2246J3883J6647K0272K4243K7228K6580K0178R181
$$ 400512 407993 417748 428985 441231 455114 471761 492033 516276 543504 570084 590262 599443
59406E99443k207j0233j4120j5108j4315j2040q228k846L502Q711R696M752m677
$$ 599443 597236 587003 572883 557775 543460 531420 523192 520346 523848 532559 542255 547007 542330
59393E42330j4914k2470k5637k4723k1513j8020j5100j2392r693p673o743o199
$$ 542330 527416 504946 479309 454586 433073 415053 399953 387561 377868 370195 363452 357253
59381C57253n250m263l921l754k639o25R00R87J78m08k75L06Q18R09P46R46J761
$$ 357253 352003 347740 343819 340065 337426 336801 337701 338688 338866 338458 338183 338489 339307 340216 340962 341908 343669
59364C43669K535K523K031J940K281K279J847J944L079M399M882M684M646N135
$$ 343669 346204 348727 350758 352698 354979 357258 359105 361049 364128 368527 373409 378093 382739 387874
59350C87874O002P181Q556R632J0096J0448J1363J2601J3275J3159J2995J3396
$$ 387874 393876 401057 409613 419245 429341 439789 451152 463753 477028 490187 503182 516578
59338E16578J4048J4144J3256J1491R225O837M511K181j79k280l795m905o062
$$ 516578 530626 544770 558026 569517 578742 585579 590090 592271 592092 589812 586017 581112 575050
59325E75050p283q138q548r074r991j0632j0113q517o787n580m758l898k746j045
$$ 575050 567767 559629 551081 542007 532016 521384 511271 502754 495967 490387 485629 481731 478985 477940
59311D77940J427M282O550P820R048J1393J4231J5058J1797M897l139r855j4117
$$ 477940 479367 483649 490199 498019 507067 518460 532691 547749 559546 564443 561304 551449 537332
59298E37332j5848j5552j4217j2970j2197j1313r753p872o470n712n007l944k727
$$ 537332 521484 505932 491715 478745 466548 455235 445482 437610 431140 425428 420421 416477 413750
59285D13750j671p53J00O74P70N75M67O41J113J892K845L660M228M839N688O494
$$ 413750 412079 411326 411426 412100 412870 413445 413912 414553 415666 417558 420403 424063 428291 433130 438818 445312
59269D45312P056P826R251J0756J1259J0754J0366J0501R972P717M567K244J091
$$ 445312 452368 460194 469445 480201 491460 502214 512580 523081 533053 540770 545337 547581 548672
59256E48672q7k087m370o160p418q316q612q210p685p627p802p562o744n761n003
$$ 548672 548585 546498 542128 535968 528550 520234 511622 503412 495727 488100 480298 472736 465992 460231 455228
59241D55228m594m474m318l572k081m52O19J248K078L193L894L588K536J510J053
$$ 455228 450634 446160 441842 438270 436189 435737 436356 437604 439682 442875 446769 450357 452893 454403 455456
59226D55456J114J198P82k05j297k073k656l423m330n003n417n989o885p591p517
$$ 455456 456570 457768 458550 458345 457048 454975 452319 448896 444566 439563 434146 428157 421272 413681 406164
59211D06164o672n602m806m421m262m039l556k895k306j895j517r73k43N34J189
$$ 406164 399492 393890 389084 384663 380401 376362 372806 369911 367605 365710 364193 363220 362977 363511 364700
59196C64700J625J889K069K093J829J458J487K021K361J825P96K84N30P97O57
$$ 364700 366325 368214 370283 372376 374205 375663 377150 379171 381532 383357 384153 384437 384967 385764 386421
59181C86421O59J251J821J574R12J016K206L465L744L142K560K689L599M957O283
$$ 386421 387080 388331 390152 391726 392638 393654 395860 399325 403069 406211 408771 411460 415059 420016 426299
59166D26299P149P476P623P992Q516Q679Q085O970O013N663N639N228M054K484
$$ 426299 433448 440924 448547 456539 465055 473734 481819 488789 494802 500465 506104 511332 515386 517870
59152E17870J192L61n64k265m655o687p293o573n765n920o776p313p153o876o982
$$ 517870 519062 519423 518859 516594 511939 505252 497959 491386 485621 479701 472925 465612 458459 451583 444601
59137D44601p178o926o154n122l947k735j852j607j789j887j634j035r9J073K131
$$ 444601 437423 430497 424343 419221 415274 412539 410687 409080 407291 405404 403770 402735 402636 403709 405840
59122D05840K855L512M393N230N591N733O315P291P834P630P453P983Q682Q556
$$ 405840 408695 412207 416600 421830 427421 433154 439469 446760 454594 462224 469677 477660 486342 494898
59108D94898P619O870O923P357P521P313O918O234N040L507K214J538J267Q17
$$ 494898 502517 509387 516310 523667 531188 538501 545419 551653 556693 560200 562414 563952 565219 566036
59094E66036j74j533k716l306l302l018k701k415k179k083k182k357k469k590
$$ 566036 565862 564329 561613 558307 555005 551987 549286 546871 544692 542609 540427 538070 535601 533011
59080E33011l007l883n051o168p012p526p642p308o687o191o082o186o101n714
$$ 533011 530004 526121 521070 514902 507890 500364 492722 485414 478727 472536 466454 460268 454167 448453
59066D48453n291n097n060m875m314l344k089q58j23k47j140k207k809k735k250
$$ 448453 443162 438065 433005 428130 423816 420472 418383 417525 417402 417155 416015 413808 410999 408264 406014
59051D06014j703j237r15q48j074j317j088j60J141K156K388J873J114P09Q40
$$ 406014 404311 403074 402159 401311 400237 398920 397832 397672 398813 400969 403357 405230 406344 407053 407893
59036D07893J170J238R65O61N97P79J157J734K427L012L427L821M208M316M068
$$ 407893 409063 410301 411266 411927 412524 413303 414460 416194 418621 421633 425060 428881 433089 437405 441473
59021D41473L981M670O083P533Q486Q951R106Q933Q320P267N834M158K563J434
$$ 441473 445454 450124 456207 463740 472226 481177 490283 499216 507536 514803 520637 524795 527358 528792
59007E28792Q13L54k12p18q49n56l9N88J395K428L534M397M717M422L748L015
$$ 528792 529605 529959 529747 529029 528180 527624 527585 528173 529568 531996 535530 539927 544644 549066 552814 555829
58991E55829K377J861J592J740K102K095J289j52j728l105m181m858n034m817
$$ 555829 558206 560067 561659 563399 565501 567596 568885 568733 567005 563900 559719 554861 549827 545010
58977E45010m440l904k872j129R79K650L295L091K788K988L671M487N296O140
$$ 545010 540570 536666 533794 532665 533644 536294 539589 542680 545468 548456 552127 556614 561910 568050
58963E68050O789O751N928M966M676N219N994O258N645M203K221L4k132m190o106
$$ 568050 574839 581590 587518 592484 597160 602379 608373 614631 620276 624479 626700 626734 624602 620412 614306
58948F14306p867r487j0846j1563j1343j0540r966r927r766q790p278o084n479
$$ 614306 606439 596952 586106 574543 563200 552660 542694 532767 523001 514211 506933 500849 495370
58935D95370n017m482m228m436m675m573m345m259l999l123j866r55o92p08n89
$$ 495370 490353 485871 481643 477207 472532 467959 463614 459355 455356 452233 450367 449412 448720 448012 447423
58920D47423l19l9K49N47P08O23M25L61N80J063J716K430L157L886M556N096N628
$$ 447423 447104 447065 447314 447861 448569 449192 449617 449978 450558 451621 453337 455767 458924 462810 467366 472462 478090
58903D78090O477P736Q974R620R572R154Q553P692O668N893N594N566N619N988
$$ 478090 484567 492303 501277 510897 520469 529623 538176 545868 552536 558429 564023 569589 575208 581196
58889E81196P050Q874J1230J3784J6021J7309J7449J6940J6347J5534J3974J1692
$$ 581196 588246 597120 608350 622134 638155 655464 672913 689853 706200 721734 735708 747400
58877G47400R371P370N196K229j321m552o877q605j0452j2685j4800j6108j6433
$$ 747400 756771 764141 769337 771566 770245 765693 758816 750211 739759 727074 712274 696166 679733
58864F79733j6131j5522j4599j3383j2149j1111j0107q999q062p619p505p376
$$ 679733 663602 648080 633481 620098 607949 596838 586731 577732 569670 562051 554546 547170
58852E47170p367p858q683r145q876q139p219o112m988m289m113m042l869l894
$$ 547170 539803 531945 523262 514117 505241 497102 489883 483771 478783 474494 470381 466339 462470 458576
58838D58576m214m366m084l753l606l132k005j000j056j834k140j599r13n81k89
$$ 458576 454362 449996 445912 442159 438553 435421 433416 432416 431360 429526 427386 425787 424874 424293 424004
58823D24004K49P46R20R42J069J354J874K592K904K074M31o07j40J215K309K785
$$ 424004 424253 424999 425919 426861 427930 429284 431158 433750 436654 438728 439159 438552 438412 439627 441936 444721
58807D44721K967L003K873K826L046L077K260O98p73j574j856j984k042j999j982
$$ 444721 447688 450691 453564 456390 459436 462513 464773 465471 464698 463124 461268 459284 457242 455243 453261
58792D53261k207k696l195l329k924k233j658j224n23O87K083L196L975M619N114
$$ 453261 451054 448358 445163 441834 438910 436677 435019 433795 433272 433959 436042 439238 443213 447832 452946
58777D52946N321N314N210M774L643J929K43j040k205l715n520o927p201o286
$$ 452946 458267 463581 468791 473565 477208 479137 479380 478340 476135 472420 466900 459973 452772 446486
58763D46486m989m299m405m508l784k371j145o68o95p33o70o91p64m39O82K358
$$ 446486 441497 437198 432793 428285 424501 422130 420985 420317 419622 418889 418219 417528 416764 416325 417007 419365
58747D19365L712M007L377K562K010J639J441J772K678L552L895M068M666N517
$$ 419365 423077 427084 430461 433023 435033 436672 438113 439885 442563 446115 450010 454078 458744 464261
58733D64261N933N780N534N408N193M918M865M787L993K567J657J976K708K604
$$ 464261 470194 475974 481508 486916 492109 497027 501892 506679 510672 513239 514896 516872 519580 522184
58719E22184J644P75M19J78q3J20R56J808K222K672L793N212N871N384M488L975
$$ 522184 523828 524603 525022 525200 525117 525237 526193 528001 530223 532895 536688 541900 547771 553155 557643 561618
58703E61618L706K942J364n73k272l621n017o811q882j0623j1427j1245j0647
$$ 561618 565324 568266 569630 569057 566785 563164 558147 551336 542454 531831 520404 509159 498512
58690D98512j0242j0010r356p860n863m241l641l965m524m622m066l241k671k500
$$ 498512 488270 478260 468904 461044 455181 450940 447299 443334 438810 434188 430122 426881 424210 421710
58676D21710k449k262j975j664j082J18J797L214L765L726M045N294P012Q275
$$ 421710 419261 416999 415024 413360 412278 412396 414193 417407 421172 424898 428943 434237 441249 449524
58662D49524Q705Q596Q085O764M381J572o80k140l383m742n733n667m481k809
$$ 449524 458229 466825 474910 481674 486055 487627 486947 484807 481424 476682 470949 465282 460801 457992
58648D57992j508j201j933l047l674l479k786k022j386j020r73q68k12P91J317
$$ 457992 456484 455283 453350 450303 446629 443150 440364 438342 436956 435936 434963 434095 433883 434674 435991
58633D35991J115R78J523K254K439K281K324K249J342n4p49l75J96L22M47J068
$$ 435991 437106 438084 439607 441861 444300 446581 448905 451154 452496 452442 451693 451318 451514 451836 452283 453351
58617D53351J814K202K640L805N463O644O920O834O992P186O628M904K557O63
$$ 453351 455165 457367 460007 463812 469275 475919 482839 489673 496665 503851 510479 515383 517940 518603
58603E18603j43j99k49n14o34m04j66l22q47j467k009k380k428k014j142M3J227
$$ 518603 518460 518261 518012 517498 516864 516460 516294 515972 515125 513658 511649 509269 506841 504827 503685 503728 504955
58586E04955J962K010J747J875K702L936N191O275O906O692N742M843M708N266
$$ 504955 506917 508927 510674 512549 515251 519187 524378 530653 537559 544251 549993 554836 559544 564810
58572E64810N939O342O399O112N630N392N800O823Q078R255J0291J1300J2522
$$ 564810 570749 577091 583490 589602 595232 600624 606424 613247 621325 630580 640871 652171 664693
58559F64693J4132J5933J7400J8202J8466J8336J7588J5940J3500J0569P247L633
$$ 664693 678825 694758 712158 730360 748826 767162 784750 800690 814190 824759 832006 835639
58547H35639K02k415m019m853n170n112m953n101n739o731p939r391j1066j2703
$$ 835639 835841 833426 829407 824554 819384 814272 809319 804218 798479 791748 783809 774418 763352 750649
58533G50649j3926j4527j4576j4337j3982j3345j2106j0261q232o414m836l453
$$ 750649 736723 722196 707620 693283 679301 665956 653850 643589 635357 628943 624107 620654
58521F20654k426j794j154j05J058J540R92j11j047j446j243m73O35J589J929
$$ 620654 618228 616434 615280 615175 616233 617773 618765 618654 617607 616161 614918 614445 615080 616669 618598
58506F18598J585Q55J97ML61Q85R76M28l40q03r20j057j385j646j520r83k34N61
$$ 618598 620183 621038 621235 621239 621600 622485 623461 623889 623549 622746 621826 620769 619384 617738 616218 615235 615001 615562
58488F15562J300J828K002J877J691J587J526J572K101L447N316O908P757Q299
$$ 615562 616862 618690 620692 622569 624260 625847 627373 628945 631046 634493 639809 646717 654474 662773
58474F62773R307J0856J2166J2456J1652J0055P763M856J894l88j996l657n521
$$ 662773 672080 682936 695102 707558 719210 729265 737028 741884 743778 743390 741394 737737 732216
58461G32216o592n990m418l449l441l064j118J935M635O140O690O928P298P778
$$ 732216 725624 719634 715216 711767 708326 705262 704144 706079 710714 716854 723544 730472 737770 745548
58447G45548P801O661M365J790k83j898l351m487n125n634o313o607n786m108
$$ 745548 753349 760010 764375 766165 765882 763984 760633 756146 751021 745387 739074 732467 726681 722573
58433G22573k488j192J89J710K900L632M232M730M951N327O550Q290R324R313
$$ 722573 720085 718893 719082 720792 723692 727324 731556 736286 741237 746564 753114 761404 770728 780041
58419G80041R299J0010J0642J0013Q012N331K541J12j395j932k217k667k781k201
$$ 780041 789340 799350 809992 820005 828017 833348 835889 836001 834606 832674 830457 827790 825009 822808
58405H22808j650j942k739l193l258l296k886j282J097K837L343L493M228N325
$$ 822808 821158 819216 816477 813284 810026 806730 803844 802562 803659 806496 809839 813332 817560 822885
58391H22885N940N779N290N085N354N712N558M779L948L578L409K888K076J555
$$ 822885 828825 834604 839894 844979 850333 856045 861603 866382 870330 873908 877317 880205 882281 883836
58377H83836J600J997K590L420M340N088N806O855Q032Q477P742O521O060O964
$$ 883836 885436 887433 890023 893443 897783 902871 908677 915532 923564 932041 939783 946304 952364 959328
58363I59328Q731J0318J1067J1214J1498J2291J3250J3889J4144J4159J3826J3004
$$ 959328 968059 978377 989444 1000658 1012156 1024447 1037697 1051586 1065730 1079889 1093715 1106719
58351A106719J1981J1137J0225Q563O104L856K955L511M650N541O124O760P534
$$ 1106719 1118700 1129837 1140062 1148625 1154729 1158585 1161540 1165051 1169701 1175242 1181366 1188126 1195660
58338A195660Q256R108J0730J3243J5638J6777J6786J6751J7150J7477J7462J7697
$$ 1195660 1203916 1213024 1223754 1236997 1252635 1269412 1286198 1302949 1320099 1337576 1355038 1372735
58326A372735J8670J9907K0602K0438J9390J7450J5080J3308J2694J2730J2715
$$ 1372735 1391405 1411312 1431914 1452352 1471742 1489192 1504272 1517580 1530274 1543004 1555719
58315A555719J2729J3141J3772J4230J4629J5341J6372J7538J8893K0405K1663
$$ 1555719 1568448 1581589 1595361 1609591 1624220 1639561 1655933 1673471 1692364 1712769 1734432
58304A734432K2463K3233K4366K5583K6469K7141K7822K8303K8395K8354K8357
$$ 1734432 1756895 1780128 1804494 1830077 1856546 1883687 1911509 1939812 1968207 1996561 2024918
58293B024918K8145K7813K8158K9581L1353L2707L3916L5473L7038L8121L9035
$$ 2024918 2053063 2080876 2109034 2138615 2169968 2202675 2236591 2272064 2309102 2347223 2386258
58282B386258M0213M1327M2123M3373M5815M8809N1140N2542N3345N3392N2658
$$ 2386258 2426471 2467798 2509921 2553294 2599109 2647918 2699058 2751600 2804945 2858337 2910995
58271B910995N2146N2816N4227N5544N7163N9851O3002O5507O7755P1008P5246
$$ 2910995 2963141 3015957 3070184 3125728 3182891 3242742 3305744 3371251 3439006 3510014 3585260
58260C585260P9337Q2994Q6750R0411R3338R6048R9580J03473J06248J07852J09810
$$ 3585260 3664597 3747591 3834341 3924752 4018090 4114138 4213718 4317191 4423439 4531291 4641101
58249D641101J12998J17042J21813J27560J33650J39128J44650J51891J60994
$$ 4641101 4754099 4871141 4992954 5120514 5254164 5393292 5537942 5689833 5850827
58240E850827J70544J80017J90239K01371K12601K24041K36812K51075K66021
$$ 5850827 6021371 6201388 6391627 6592998 6805599 7029640 7266452 7517527 7783548
58231G783548K81829K99474L18547L37764L57705L80505M06658M34793M64929
$$ 7783548 8065377 8364851 8683398 9021162 9378867 9759372 10166030 10600823 11065752
58222A1065752M98980N37610N79565O24866O75685P33294P97179Q68096R48849
$$ 11065752 11564732 12102342 12681907 13306773 13982458 14715752 15512931 16381027 17329876
58213A7329876J040958J143486J256204J381032J520156J676854J859499K080653
$$ 17329876 18370834 19514320 20770524 22151556 23671712 25348566 27208065 29288718
58205B9288718K350769K677023L070036L547396M129650M839732N710309O785426
$$ 29288718 31639487 34316510 37386546 40933942 45063592 49903324 55613633 62399059
58197F2399059Q109070R716007J1637971J3914082J6593085J9735227K3405649
$$ 62399059 70508129 80224136 91862107 105776189 122369274 142104501 165510150
58190A65510150K7596509L2020609L5855574L7686142L5883266K9379009J8419481
$$ 165510150 193106659 225127268 260982842 298668984 334552250 363931259 382350740
58183C82350740M748013r011938k0435919k8165078l2092684l2946823l1712374
$$ 382350740 387098753 378086815 357650896 329485818 297393134 264446311 232733937
58176B32733937k9257619k6221416k3031275j9949085j7119456j4612878j2450730
$$ 232733937 203476318 177254902 154223627 134274542 117155086 102542208 90091478
58169I0091478j0617339r075609p785090o709039n811660n058515m421428l879208
$$ 90091478 79474139 70398530 62613440 55904401 50092741 45034226 40612798 36733590
58161C6733590l414227l012144k663656k361995k098965j866473j660570j480088
$$ 36733590 33319363 30307219 27643563 25281568 23182603 21316130 19655560 18175472
58153A8175472j322192j182714j059757r53012q60071p77135p03216o40229n88739
$$ 18175472 16853280 15670566 14610809 13657797 12797726 12020591 11317375 10677146 10088407
58144A0088407n46353n10192m78109m47652m16751l85887l57344l32069l09145
$$ 10088407 9542054 9031862 8553753 8106101 7689350 7303463 6946119 6614050 6304905
58135F304905k88030k69068k51857k35290k19377k05174j92847j81520j70895
$$ 6304905 6016875 5747807 5495950 5260660 5041283 4836109 4643262 4461742 4290847
58126D290847j61339j52591j44014j35856j28694j21954j14742j07705j02275
$$ 4290847 4129508 3976917 3832903 3697047 3568353 3446399 3331657 3223952 3121677
58117C121677r8436r4849r0909q6987q3108p9093p5489p2577o9156o4258n9364
$$ 3121677 3023241 2928392 2837483 2750496 2667388 2588295 2512806 2440229 2371073 2306815 2247451
58106B247451n6728n6009n4989n3185n2126n2103n1480m9638m7980m7256m6177
$$ 2247451 2190723 2134714 2079725 2026540 1974414 1922311 1870831 1821193 1773213 1725957 1679780
58095A679780m3621m0228l6941l3725l0631k8411k7206k6075k4611k3577k3309
$$ 1679780 1636159 1595931 1558990 1525265 1494634 1466223 1439017 1412942 1388331 1364754 1341445
58084A341445k3023k2440k2465k3365k3790k2751k1269k0865k1435k1757k1347
$$ 1341445 1318422 1295982 1273517 1250152 1226362 1203611 1182342 1161477 1140042 1118285 1096938
58073A096938k0720k0320k0148k0009j9578j8574j7243j6241j5782j5451j4916
$$ 1096938 1076218 1055898 1035750 1015741 996163 977589 960346 944105 928323 912872 897956
58062H97956j4166j3078j1580j0299j0031j0437j0376r656r332j0000j0923j1285
$$ 897956 883790 870712 859132 848833 838802 828365 817989 808333 799001 789001 778078 766793
58050G66793j1076j0412r052p268o027n723n642n212m851m956n109m897m654m718
$$ 766793 755717 745305 736253 728985 722958 717235 711593 706381 701530 696574 691465 686568 681914 677196
58036F77196m800m749n056n958o770o876o630o643o840o893o982p388p849p999
$$ 677196 672396 667647 662591 656633 649863 642987 636357 629714 622874 615981 608999 601611 593762 585763
58022E85763p860p510o808n989n796o499p374p733p759p787p539o809o156o110
$$ 585763 577903 570393 563585 557596 551800 545301 537927 530194 522435 514648 507109 500300 494144 488034
58008D88034o176n572m455l599l205k852k410k178k219k278k281k343k341k054
$$ 488034 481858 476286 471831 468232 465027 462175 459765 457587 455368 453090 450809 448466 446125 444071
57994D44071j600j308j218j140j147j521k175k490j916o31M71N03n56j760k137
$$ 444071 442471 441163 439945 438805 437658 436137 433962 431472 429556 428925 429396 429899 429343 427583 425446
57979D25446j630r12m31j45Ol9n9L39J018J294Q18L8l88j91N20J355J712J313
$$ 425446 423816 422904 422473 422328 422334 422295 422236 422575 423593 424887 425705 425743 425355 425164 425684 427039 428751 430064
57961D30064O72N05P21P08N07P42J384J642J316J141J378J223K09q18q82k22L42
$$ 430064 430736 431241 431962 432670 433177 433919 435303 436945 438261 439402 440780 442003 442212 441394 440512 440290 440632
57944D40632O38Q97J020R15J039J759K580K797K517K399K690L136L471L477K954
$$ 440632 441270 442167 443187 444102 445141 446900 449480 452277 454794 457193 459883 463019 466490 469967 472921
57929D72921K076J363Q36j73j887l526m461n194o291p167o968o080n587n593n344
$$ 472921 474997 476360 477196 477023 475136 471610 467149 461955 455664 448497 441529 435449 429862 424269 418925
57914D18925m797m725n211n232m169k708j804j479j124m64K36O35O61M68K78J42
$$ 418925 414128 409403 404192 398960 394791 392083 390279 388800 387676 387212 387448 388083 388744 389212 389490 389632
57898C89632q9m81q97j254j680k181k457k284j825j308p70m26o79j379j625r65
$$ 389632 389543 389062 388165 386911 385231 383050 380593 378309 376484 375176 374406 373980 373301 371922 370297 369332
57882C69332k67n93j648k279k299k673l822m822m690l673k752k344k053j467p63
$$ 369332 369065 368472 366824 364545 362246 359573 355751 350929 346239 342566 339814 337470 335417 333950 333187
57867C33187m19n68p58n08J1K12N8K85J353K708L570L950M297M488M079L313L006
$$ 333187 332768 332200 331442 330934 330945 331157 331215 331500 332853 335561 339131 343081 347378 351866 355945 359258 362264
57850C62264L364L676L319K483J722J280J060Q07J83r37k078k530k148j476r35
$$ 362264 365628 369304 372623 375106 376828 378108 379168 379975 380158 379221 377143 374613 372465 370989 370054
57835C70054m08K35O47M08l09p90m81N37J737K746L661M628N372N497N301N603
$$ 370054 369646 369881 370528 370936 370627 369837 369356 369893 371630 374376 378037 382665 388037 393534 398835 404438
57819D04438O424O444M411P82k766n162o551p327p488p102o641o448o326n922
$$ 404438 410862 417306 421717 422499 419733 414571 408020 400693 393205 386103 379462 373014 366688 360766
57805C60766n183m251l337k756k709k834k450j461n67l05k26N25K018L345L589
$$ 360766 355583 351332 347995 345239 342530 339696 337246 335785 335218 334913 334687 335212 337230 340575 344164
57790C44164K717J527Q69J014J624K217K612K979L586M465N335N755N539M924
$$ 344164 346881 348408 349277 350291 351915 354132 356744 359723 363309 367774 373109 378864 384403 389327
57776C89327M291L792L424L263L290L042J993L09j217k172k866l545l924l872
$$ 389327 393618 397410 400834 404097 407387 410429 412422 412731 411514 409342 406476 402931 399007 395135
57762C95135l893m379m913m960m729m703m635l892k532j314o06p9N14Q78O77Q1
$$ 395135 391242 386863 381950 376990 372261 367558 362923 359031 356499 355185 354579 354500 355014 355892 356569 356650
57746C56650l21l3Q61J551J138k13j206q85J84P64N51J94Q1o1l62m68j6R81K196
$$ 356650 356329 356296 357157 358708 359846 359633 358427 357542 357726 358490 359041 359235 359316 359255 358893 358425 358409 359390 361586
57727C61586K978K576J052l11l04P53J595J775J820J871J422N44J31N49J057J006
$$ 361586 364564 367140 368192 367881 367577 368330 369925 371700 373520 375391 376813 377357 377488 378037 379094 380100
57711C80100O07J37p02j918k658k266j248m91n4N24J200J536J532J599J846J975
$$ 380100 380707 380844 380142 378224 375566 373300 372052 371561 371507 372031 373231 374767 376299 377898 379744 381719
57695C81719J847J640J454J217R06O10L31K2k17j45L74J171J817J981J830J931
$$ 381719 383566 385206 386660 387877 388783 389393 389724 389746 389529 389384 389758 390929 392746 394727 396557 398488
57679C98488K650L837N410P752J1046J4505J7177J9368K2434K7161L3099L9544
$$ 398488 401138 404975 410385 418137 429183 443688 460865 480233 502667 529828 562927 602471
57667F02471M5806M9983M8580L8695K0852o45k0062l3208l9164l9861l7921l4628
$$ 602471 648277 698260 746840 785535 806387 805742 785680 752472 713308 673447 635526 600898
57655F00898l0082k4809k0102j6611j3693j0774q361p022o170m822l043j673r52
$$ 600898 570816 546007 525905 509294 495601 484827 476466 469444 463274 458452 455409 453736 452784
57642D52784l18O24J697K592L141L221K908K508K129J491O09J34M02P08L26k27
$$ 452784 452466 453090 454787 457379 460520 463741 466649 469157 471286 472777 473386 473520 473922 474630 474956 474729
57626D74729J23J269J972J607Q75N93P16Q26Q66R48J015J074J334J829K275K513
$$ 474729 474852 476121 478093 479700 480575 481168 481884 482710 483576 484524 485539 486613 487947 489776 492051 494564
57610D94564K728K951K807K073J226R71J423K037K291K191K076K184K445K602
$$ 494564 497292 500243 503050 505123 506349 507320 508743 510780 513071 515262 517338 519522 521967 524569
57596E24569K459K014J415Q88O05N63O22P86J255J988K387J933J112J064K076
$$ 524569 527028 529042 530457 531345 531950 532513 533135 533921 535176 537164 539551 541484 542596 543660 545736
57581E45736L032K802J682Q90R91J446J609J528J700K426L464M151L959L115K394
$$ 545736 548768 551570 553252 554142 555133 556579 558188 559716 561416 563842 567306 571457 575416 578531 580925
57566E80925K127J850J283J093J983L389M009L588L208L735M706N196N105N087
$$ 580925 583052 584902 586185 587278 589261 592650 596659 600247 603455 607190 611896 617092 622197 627284
57552F27284N513N983N789M670L085J816J271J267J590K366L574M507M460L795
$$ 627284 632797 638780 644569 649239 652324 654140 655411 656678 658268 660634 664208 668715 673175 676970
57538F76970L592M188M813M885M856N309N856N678M741L841L514L573L706L947
$$ 676970 680562 684750 689563 694448 699304 704613 710469 716147 720888 724729 728243 731816 735522 739469
57524G39469M356M723M836M837M987N221N271N177N277N637N791N392M882N026
$$ 739469 743825 748548 753384 758221 763208 768429 773700 778877 784154 789791 795582 800974 805856 810882
57510H10882N866O615O675O269N839N369M707M123M084M638N428O115O401N999
$$ 810882 816748 823363 830038 836307 842146 847515 852222 856345 860429 865067 870495 876610 883011 889010
57496H89010N070M426M652N283N511N522O196P508Q204P512O310N995O751P615
$$ 889010 894080 898506 903158 908441 913952 919474 925670 933178 941382 948894 955204 961199 967950 975565
57482I75565P865P670P455P292P026O590O069N658N576N885O340O567O433O165
$$ 975565 983430 991100 998555 1005847 1012873 1019463 1025532 1031190 1036766 1042651 1048991 1055558 1061991 1068156
57468A068156O069O231O459O505O368O314O582P145P835Q554R156R321Q879Q205
$$ 1068156 1074225 1080456 1086915 1093420 1099788 1106102 1112684 1119829 1127664 1136218 1145374 1154695 1163574 1171779
57454A171779P981Q464R220R600R275Q409P570P408Q081Q977R339R171R096R453
$$ 1171779 1179760 1188224 1197444 1207044 1216319 1224728 1232298 1239706 1247787 1256764 1266103 1275274 1284370 1293823
57440A293823R939J0277J0572J0918J1056J0772J0184R509Q902Q691R246J0298
$$ 1293823 1303762 1314039 1324611 1335529 1346585 1357357 1367541 1377050 1385952 1394643 1403889 1414187
57428A414187J0951J0785J0466J0815J1657J2179J2095J1835J1796J1965J2170
$$ 1414187 1425138 1435923 1446389 1457204 1468861 1481040 1493135 1504970 1516766 1528731 1540901
57417A540901J2278J2178J1969J2009J2440J2893J3064J3269J3881J4507J4432
$$ 1540901 1553179 1565357 1577326 1589335 1601775 1614668 1627732 1641001 1654882 1669389 1683821
57406A683821J3743J3236J3235J3300J3110J2932J2983J3139J3521J4581J6143
$$ 1683821 1697564 1710800 1724035 1737335 1750445 1763377 1776360 1789499 1803020 1817601 1833744
57395A833744J7105J6685J5531J4914J5228J5850J6198J6320J6535J7056J7796
$$ 1833744 1850849 1867534 1883065 1897979 1913207 1929057 1945255 1961575 1978110 1995166 2012962
57384B012962J8216J7628J6106J4807J4766J5634J6194J6008J5687J5640J5501
$$ 2012962 2031178 2048806 2064912 2079719 2094485 2110119 2126313 2142321 2158008 2173648 2189149
57373B189149J5075J4923J5466J6137J6105J5433J4924J5088J5846J7047J8567
$$ 2189149 2204224 2219147 2234613 2250750 2266855 2282288 2297212 2312300 2328146 2345193 2363760
57362B363760J9970K0665K0532K0051J9686J9566J9750K0296K0925K1034K0470
$$ 2363760 2383730 2404395 2424927 2444978 2464664 2484230 2503980 2524276 2545201 2566235 2586705
57351B586705J9915K0077K0703K0888K0304J9618J9502J9728J9639J9223J9120
$$ 2586705 2606620 2626697 2647400 2668288 2688592 2708210 2727712 2747440 2767079 2786302 2805422
57340B805422J9659K0389K0799K0978K1233K1436K1257K0831K0648K0828K1078
$$ 2805422 2825081 2845470 2866269 2887247 2908480 2929916 2951173 2972004 2992652 3013480 3034558
57329C034558K1351K1909K2615K2793K2202K1583K1782K2646K3321K3354K3021
$$ 3034558 3055909 3077818 3100433 3123226 3145428 3167011 3188793 3211439 3234760 3258114 3281135
57318C281135K2778K2882K3380K3998K4168K3658K3018K2887K3063K2880K2377
$$ 3281135 3303913 3326795 3350175 3374173 3398341 3421999 3445017 3467904 3490967 3513847 3536224
57307C536224K2320K2940K3495K3383K2979K2930K3150K3084K2651K2341K2509
$$ 3536224 3558544 3581484 3604979 3628362 3651341 3674271 3697421 3720505 3743156 3765497 3788006
57296C788006K2956K3215K2943K2210K1562K1650K2534K3492K3763K3329K2773
$$ 3788006 3810962 3834177 3857120 3879330 3900892 3922542 3945076 3968568 3992331 4015660 4038433
57285D038433K2519K2536K2603K2628K2614K2594K2616K2665K2692K2712K2833
$$ 4038433 4060952 4083488 4106091 4128719 4151333 4173927 4196543 4219208 4241900 4264612 4287445
57274D287445K3096K3314K3153K2407K1216K0134J9784K0292K1078K1434K1168
$$ 4287445 4310541 4333855 4357008 4379415 4400631 4420765 4440549 4460841 4481919 4503353 4524521
57263D524521K0537J9800J9216J9149J9590J9726J8809J7462J7220J8457J9671
$$ 4524521 4545058 4564858 4584074 4603223 4622813 4642539 4661348 4678810 4696030 4714487 4734158
57252D734158J9376J7971J6987J7088J7660J7965J7895J7564J7019J6441J6106
$$ 4734158 4753534 4771505 4788492 4805580 4823240 4841205 4859100 4876664 4893683 4910124 4926230
57241D926230J6023J5981J5876J5593J4739J2984J0721Q902Q072P874P491O373
$$ 4926230 4942253 4958234 4974110 4989703 5004442 5017426 5028147 5037049 5045121 5052995 5060486 5066859
57229E066859M532K471Q96K46M01Q82J205J062M61j25l5P64J499J530J154J119
$$ 5066859 5071391 5073862 5074758 5075004 5075405 5076287 5077492 5078554 5079015 5078890 5078855 5079619 5081118 5082648 5083802 5084921
57213E084921J603K152K400K347K090J755J602J736J903J848J700J627J424R31
$$ 5084921 5086524 5088676 5091076 5093423 5095513 5097268 5098870 5100606 5102509 5104357 5106057 5107684 5109108 5110039
57199E110039M60K51o7p87j290q68j32m57k051l654m395m881n956p281p902p598
$$ 5110039 5110499 5110750 5110683 5109896 5108606 5107738 5107606 5107149 5105098 5101444 5097049 5092168 5086212 5078931 5071029 5063431
57183E063431p001o704o790p044p274p511q090r280j0800j2025j2774j3466j4364
$$ 5063431 5056430 5049726 5042936 5035892 5028618 5021107 5013017 5003737 4992937 4980912 4968138 4954672 4940308
57170D940308j5251j6064j7276j9287k1775k3997k5512k6401k7096k8146k9793
$$ 4940308 4925057 4908993 4891717 4872430 4850655 4826658 4801146 4774745 4747649 4719503 4689710
57159D689710l1589l2755l3047l2955l2914l2785l2218l1059k9230k6663k3624
$$ 4689710 4658121 4625366 4592319 4559364 4526450 4493665 4461447 4430388 4401158 4374495 4350871
57148D350871k0679j8047j5469j2808j0433q749p826p595p913q326q424q626r891
$$ 4350871 4330192 4312145 4296676 4283868 4273435 4264686 4256860 4249265 4241352 4233026 4224602 4215976 4206085
57135D206085j2320j4786j6371j7375j8324j8868j8414j7188j5697j3601j0234
$$ 4206085 4193765 4178979 4162608 4145233 4126909 4108041 4089627 4072439 4056742 4043141 4032907
57124D032907n980k084R83M021P822J2158J6274J9819K2968K6002K9165L2844
$$ 4032907 4026927 4024843 4025826 4029847 4037669 4049827 4066101 4085920 4108888 4134890 4164055 4196899
57112D196899L7716M4723N4646O7555Q2914J00391J20365J43433J69907K00400
$$ 4196899 4234615 4279338 4333984 4401539 4484453 4584844 4705209 4848642 5018549 5218949
57102E218949K36560K80725L35012M01267M81685N78733O94378Q29723R85131
$$ 5218949 5455509 5736234 6071246 6472513 6954198 7532931 8227309 9057032 10042163
57093A0042163J159679J349920J549376J749461J940815K113891K258809K364894
$$ 10042163 11201842 12551762 14101138 15850599 17791414 19905305 22164114 24529008
57085B4529008K419829K408238K310828K106789J781965J340705Q13139K49521
$$ 24529008 26948837 29357075 31667903 33774692 35556657 36897362 37710501 37960022
57077C7960022k97067p87704j203182j538672j796407j982012k102813k165687
$$ 37960022 37662955 36875251 35672069 34133397 32336990 30354978 28252165 26086478
57069B6086478k175741k137707k058339j946855j813203j666324j513807j362255
$$ 26086478 23910737 21773030 19714691 17767836 15954633 14288309 12774502 11412247
57061A1412247j217155j082183r58759q46739p45707o55526n75768n05331m43060
$$ 11412247 10195092 9112909 8154150 7307411 6561704 5906178 5330410 4825079 4382019
57052D382019l88317l40494k98522k61520k29425k02159j78522j56925j36966
$$ 4382019 3993702 3653208 3354686 3093166 2863741 2661582 2483060 2326135 2189169
57043B189169j19301j04033r0428p8064o7051n6892m6518l5582k4356j2185J645
$$ 2189169 2069868 1965835 1875407 1797343 1730292 1673400 1626882 1591300 1566944 1554759 1556404
57032A556404J4106J7697O469j7183m3450o3016p2897p5254p3100o8386o2494
$$ 1556404 1570510 1588207 1594676 1577493 1534043 1471027 1398130 1322876 1249776 1181390 1118896
57021A118896n6449n0498m4462l8603l3669l0103k7630k5693k3906k2041j9952
$$ 1118896 1062447 1011949 967487 928884 895215 865112 837482 811789 787883 765842 745890
57010G45890j7698j5679j4400j3958j3868j3520j2767j1916j1171j0407r561q903
$$ 745890 728192 712513 698113 684155 670287 656767 644000 632084 620913 610506 600945 592042
56998E92042q622q417p781o563m996l386j946p54M03J830L357M355M684N098O145
$$ 592042 583420 575003 567222 560659 555663 552277 550331 549577 549980 551810 555167 559522 564206 569304 575449
56983E75449P036O467M257J331j737n106q520j0985j2015j2269j2362j1949j0673
$$ 575449 582485 588952 593209 594540 592803 587697 579177 568192 556177 543908 531546 519597 508924
56970E08924r121p969o861n212l527k701k335j106J163L179M240N340P501R892
$$ 508924 499803 491834 484973 479761 476234 473533 471198 470092 471255 474434 478674 484014 491515 501407
56956E01407J0532Q342L772j997p653j1884j3953j4324j4156j4050j3696j2704
$$ 501407 511939 520281 524053 522056 514403 502519 488566 474242 460086 446036 432340 419636
56944D19636j1221r588p853n922l905k035l22J541L885O740R795J2689J5269J7283
$$ 419636 408415 398827 390974 385052 381147 379112 378790 380331 384216 390956 400751 413440 428709 445992
56930D45992J7790J5420R649J763n905j1641j5107j6765j7184j6917j6470j6027
$$ 445992 463782 479202 488851 490614 484709 473068 457961 441196 424012 407095 390625 374598
56918C74598j5402j4387j2946j1096q910o732n051m082l642l466l313k775j565
$$ 374598 359196 344809 331863 320767 311857 305125 300074 295992 292350 288884 285571 282796 281231
56905B81231j31M90j45j251j678j175l49K78P54J284J913K649L564M639N726O747
$$ 281231 281100 281590 281445 280194 278516 277341 276992 277270 278024 279308 281221 283870 287434 292073 297799 304546
56889C04546P769Q832R777J0293J0045Q834O654L601k00m345p825r417q783o947
$$ 304546 312315 321147 330924 341217 351262 360096 366750 370351 370151 365806 357981 348564 339781 332834
56875C32834n390m706m419l894k918j518K86K385M657P288J0642J4630J8550K1793
$$ 332834 327444 322738 318319 314425 311507 309989 310275 312660 317317 324605 335247 349877 368427 390220
56861C90220K4403K6490K7346K5601K0410J2299K913n811j2356j6108j7476j7387
$$ 390220 414623 441113 468459 494060 514470 526769 529682 523871 511515 495407 477931 460544
56849D60544j6478j4810j2362r438o316k858J141N411R477J3445J7972K3399K9362
$$ 460544 444066 429256 416894 407456 401140 398282 399423 404834 414311 427756 445728 469127 498489
56836D98489L5398M1232M6140M8398M6023L8008K4814Q197r024k3627l3420l8295
$$ 498489 533887 575119 621259 669657 715680 753688 778502 786699 777675 754048 720628 682333
56824F82333l9564l8440l5530l1502k7232k3056j8531j3318p864k920J327N397
$$ 682333 642769 604329 568799 537297 510065 487009 468478 455160 447296 444376 445703 451100
56812D51100R968J5310K1055K6355L0387L2560L2099K7821J9019O643o876j9024
$$ 451100 461068 476378 497433 523788 554175 586735 618834 646655 665674 672317 665441 646417
56800F46417k8123l3350l4839l3881l2065k9880k6753k2559j8185j4290j0551
$$ 646417 618294 584944 550105 516224 484159 454279 427526 404967 386782 372492 361941
56789C61941o671l244q00J241L811O944J0091J3047J5603J6672J4869R964L029
$$ 361941 355270 352026 351226 352467 356278 363222 373313 386360 401963 418635 433504 443468 446497
56776D46497m581j1726j7255k0419k1551k1561k0804j9120j6860j4883j3476j2166
$$ 446497 441916 430190 412935 392516 370965 349404 328600 309480 292620 277737 264261 252095
56764B52095j0742r577q739p723o434n585n583n717n136m071l387l269l111k533
$$ 252095 241353 231776 223037 215314 208880 203295 197712 191995 186859 182788 179401 176132 173021 170488
56750A70488j864j555j589j620j407r22l03J95L04J5l55m75l69k89j95K39R84
$$ 170488 168624 167069 165480 163860 162453 161531 161228 161423 161727 161742 161387 160912 160543 160254 160059 160298 161282
56733A61282J297N06r53j857j604p90k40j08j00NM67J493K596K691J466K6m72
$$ 161282 162579 163085 162132 160275 158671 157881 157641 157533 157433 157438 157905 159398 161994 164685 166151 166177 165705
56716A65705k84l34o19m20K60N72J75l74n33k85K97J060J390P57k57m62K49P69
$$ 165705 165421 165087 164468 164048 164308 164880 165055 164681 164148 163863 164160 165220 166610 167367 167110 166648 166897 167666
56698A67666M90O5O5K6n06r85p95l85n07r23q07j56J64k66q31p64j05M00J83n44
$$ 167666 168156 168221 168286 168312 167806 166821 166026 165641 165134 164211 163404 163248 163412 163146 162315 161551 161446 161846 162029 161485
56678A61485r80n92K78P88N02l29j184j625j329l59O18R29P48P68J072J037M28
$$ 161485 160505 159913 160191 160979 161481 161152 159968 158343 157014 156655 157273 158202 158950 159718 160790 161827 162255
56661A62255k51o62r93j179p15L05R15O37K84P08J589K175K407K463J955O72m65
$$ 162255 162004 161342 160349 159170 158455 158760 159675 160312 160596 161304 162893 165068 167475 169938 171893 172565 172100
56644A72100m14M55R55Q93J021J392J162J85n00k67J19k55j085j401r14j37M65
$$ 172100 171686 172141 173096 173989 175010 176402 177564 177749 177249 176982 177101 176846 175761 174360 173446 173309 173774
56627A73774Q32J032J101J059Q60M51N9R1N89J035R14K46o21j457k154k545k522
$$ 173774 174606 175638 176739 177798 178658 179109 179168 179259 179848 180883 181797 182043 181422 179965 177811 175266 172744
56610A72744k169j593q39j75r2o74j245j150o93p08j228j330n15M37M83k77r09
$$ 172744 170575 168982 168143 167968 167876 167202 165957 164807 164114 163406 162178 160848 160333 160770 161253 160976 160067
56593A60067j033j052j170j052o57n46r10j007k35Q82J478J598J783J829J047
$$ 160067 159034 157982 156812 155760 155103 154557 153647 152640 152405 153287 154765 156363 158146 159975 161022
56578A61022l37j131q12j81m7q3M11J332K024K214K114J888J620J612K190L336
$$ 161022 160685 159554 158742 158561 158514 158431 158842 160174 162198 164412 166526 168414 170034 171646 173836 177172
56562A77172M832O554Q315R593R864R030P336M995K248l82k242k999k779k037
$$ 177172 182004 188558 196873 206466 216330 225360 232696 237691 239939 239557 237315 234316 231537 229500
56548B29500j382j271j663k192k718l388m027m020l120k011j513j596j614j361
$$ 229500 228118 226847 225184 222992 220274 216886 212859 208839 205719 203708 202195 200599 198985 197624
56534A97624j324j847k532k584j627j59P41L59p98j350m56J246K380K301J526
$$ 197624 196300 194453 191921 189337 187710 187551 188292 188651 187853 186503 186047 187293 189673 191974 193500
56519A93500Q49M79Q7n62j285j720j809j849k019k049j661j155j097j460j558
$$ 193500 194349 194828 194915 194353 193068 191348 189539 187690 185671 183622 181961 180806 179709 178249 176691
56504A76691r81r8N18P55Q19P86O40M63K93Q1j12r5P5N2l45q92j313j519j417
$$ 176691 175710 175612 176130 176885 177704 178490 179130 179593 179886 179967 179855 179760 179835 179887 179542 178650 177337 175818 174401
56485A74401r41l29M2K05N18R71J134R05P08P66Q22P93R92J476J874K063K271
$$ 174401 173460 173131 173173 173378 173896 174867 176001 176906 177614 178380 179202 179995 180987 182463 184337 186400 188671
56468A88671K265J430lq32n76k55p26j305r86j08L73N19J028J765J935J427Q33
$$ 188671 190936 192366 192363 191531 190955 190700 189974 188669 187683 187575 187948 188467 189495 191260 193195 194622 195455
56451A95455L43k67q31r76q93r58q51j17O94O58J9j76J46Q3m51m19M71J073N46
$$ 195455 195798 195531 194700 193724 192831 191873 191022 190905 191599 192257 192276 192100 192246 192329 191878 191459 191930 193003 193549
56432A93549l73o14l01j54k05J0M50O24M22K25L34P05J120J340J253J116J337
$$ 193549 193176 192562 192261 192107 191902 191912 192362 192986 193408 193633 193967 194672 195792 197132 198385 199501 200838
56415B00838J878K119J570N14k92l95l0J93j15o97r31n74q8P0J25N20J089J232
$$ 200838 202716 204835 206405 206919 206627 206232 206202 206395 206280 205583 204652 204078 203990 204060 204185 204705 205794 207026
56397B07026Q59N19O23R86J239J221R19M01j34m53m33K0R08J773J863J142O51
$$ 207026 207885 208404 209027 210013 211252 212473 213392 213793 213659 213206 212773 212793 213701 215474 217337 218479 219130
56380B19130J174J996J796N31m58j63R93J841J565K52j099j254m8J204J311P46
$$ 219130 220304 222300 224096 224627 224169 224006 224999 226840 228405 228657 227558 226304 226256 227460 228771 229517
56364B29517P57J415J714J402J313J775K072J757J337J236J179J002J055J299
$$ 229517 230274 231689 233403 234805 236118 237893 239965 241722 243059 244295 245474 246476 247531 248830
56350B48830J071L05p3M22R21M74n62j150r47k89N55J416J936J980J949K230K684
$$ 248830 249901 250206 250133 250555 251476 251950 251388 250238 249291 249002 249557 250973 252909 254889 256838 259068 261752
56333B61752L082L521L943L853L118K468K620L273L593L274K510J392K7j063j365
$$ 261752 264834 268355 272298 276151 279269 281737 284357 287630 291223 294497 297007 298399 298426 297363 295998
56318B95998j059p63p07o54m57j91J63O93J276J637J681J485J097O26L41M66R28
$$ 295998 294939 294176 293469 292815 292358 292167 292330 293023 294299 295936 297617 299102 300199 300825 301166 301632 302560
56301C02560J510K086K593K865K737K262J780J764K418L297L566K989K410K734
$$ 302560 304070 306156 308749 311614 314351 316613 318393 320157 322575 325872 329438 332427 334837 337571
56287C37571L692M273M159L993M204M421M316M159M238M393M462M671N205N874
$$ 337571 341263 345536 349695 353688 357892 362313 366629 370788 375026 379419 383881 388552 393757 399631
56273C99631O498P095P519P564P561Q282R812J1283J2078J2687J3826J5381J6766
$$ 399631 406129 413224 420743 428307 435868 444150 453962 465245 477323 490010 503836 519217 535983
56260E35983J7917J9266K1064K3297K5978K9103L2489L6059M0113M4955N0372
$$ 535983 553900 573166 594230 617527 643505 672608 705097 741156 781269 826224 876596
56249H76596N5787O0755O5186O9200P2957P6447P9353Q1202Q1597Q0127P6311
$$ 876596 932383 993138 1058324 1127524 1200481 1276928 1356281 1437483 1519080 1599207 1675518
56238A675518O9981O1576N1633M0164K7018J2634k026j6066k8693l9103m7154
$$ 1675518 1745499 1807075 1858708 1898872 1925890 1938524 1936498 1920432 1891739 1852636 1805482
56227A805482n3788n9923o5149o8488p0002p0500o9965o7715o4075o0342n6935
$$ 1805482 1751694 1691771 1626622 1558134 1488132 1417632 1347667 1279952 1215877 1155535 1098600
56216A098600n3106m8779m5090m2500l9972l6689l3253l0279k7256k3799k0805
$$ 1098600 1045494 996715 951625 909125 869153 832464 799211 768932 741676 717877 697072
56205F97072j9166j8282j6990j5136j3232j1346r411p939p388p271o852o162n561
$$ 697072 677906 659624 642634 627498 614266 602920 593509 585570 578182 570911 564059 557897 552336
56192E52336m886l774k349r02N00J531J519N35k46NP35J145J419J907K147J755
$$ 552336 547450 543676 541327 540425 540925 542456 543975 544510 544264 544269 545004 546149 547568 549475 551622 553377
56176E53377J510K303L659M472M643M823N058M911M569M672N343O304P554Q983
$$ 553377 554887 557190 560849 565321 569964 574787 579845 584756 589325 593997 599340 605644 613198 622181
56162F22181R742R170Q057P910R052J0453J1373J2223J3774J6267J9291K2104
$$ 622181 631923 641093 649150 657060 666112 676565 687938 700161 713935 730202 749493 771597
56150G71597K4235K6247K9478L4614M1014M8010N6123O6001P6577Q5318R0070
$$ 771597 795832 822079 851557 886171 927185 975195 1031318 1097319 1173896 1259214 1349284
56139A349284Q9962Q4872P5209O2466M9273L8503L2107L0333L1571L3144L2659
$$ 1349284 1439246 1524118 1599327 1661793 1711066 1749569 1781676 1812009 1843580 1876724 1909383
56128A909383K8788K1343J1538K002m608p619q403q743j0231j4956k4709l8666
$$ 1909383 1938171 1959514 1971052 1973054 1968446 1960827 1952424 1943681 1933450 1918494 1893785 1855119
56116A855119n3349o5616p4466p9464p9510p4476o6445n7795m9234m0848l3576
$$ 1855119 1801770 1736154 1661688 1582224 1502714 1428238 1361793 1303998 1254764 1213916 1180340
56105A180340k8063k3353j8348j3566j0012p318m608k129n12P33K411M255N689
$$ 1180340 1152277 1128924 1110576 1097010 1086998 1079680 1075072 1072943 1072431 1073164 1075575 1079830 1085519
56092A085519P028Q586R670R989J0743J2713J4530J4669J3945J4067J4815J4851
$$ 1085519 1092547 1101133 1110803 1120792 1131535 1144248 1158778 1173447 1187392 1201459 1216274 1231125
56080A231125J4277J4121J4162J3561J3017J3888J5675J6634J6518J6519J6937
$$ 1231125 1245402 1259523 1273685 1287246 1300263 1314151 1329826 1346460 1362978 1379497 1396434
56069A396434J7046J6982J7567J8515J8808J8681J9234K0413K1325K2188K3908
$$ 1396434 1413480 1430462 1448029 1466544 1485352 1504033 1523267 1543680 1565005 1587193 1611101
56058A611101K6013K7113K7206K7500K8188K8449K8398K9007L0248L1198L1766
$$ 1611101 1637114 1664227 1691433 1718933 1747121 1775570 1803968 1832975 1863223 1894421 1926187
56047A926187L2455L2925L2687L2684L4076L6000L6786L6818L7904M0288M2707
$$ 1926187 1958642 1991567 2024254 2056938 2091014 2127014 2163800 2200618 2238522 2278810 2321517
56036B321517M4865M7369M9570N0111M9409M9201M9827N0335N0881N2540N5081
$$ 2321517 2366382 2413751 2463321 2513432 2562841 2612042 2661869 2712204 2763085 2815625 2870706
56025B870706N7313N9268O1697O4127O5949O8480P3009P7825Q0423Q1854Q5232
$$ 2870706 2928019 2987287 3048984 3113111 3179060 3247540 3320549 3398374 3478797 3560651 3645883
56014C645883R0617R5192R8147J01379J05542J09435J13363J18969J25528J30505
$$ 3645883 3736500 3831692 3929839 4031218 4136760 4246195 4359558 4478527 4604055 4734560
56004D734560J34237J39891J48253J56601J63546J70918J79931J89435J99002
$$ 4734560 4868797 5008688 5156941 5313542 5477088 5648006 5827937 6017372 6216374
55995F216374K09984K22531K35065K47536K61755K77938K94483L11553L31108
$$ 6216374 6426358 6648889 6883954 7131490 7393245 7671183 7965666 8277219 8608327
55986H608327L53245L76431M01382M30439M63145M96954N32312N72333O17737
$$ 8608327 8961572 9338003 9739385 10169824 10632969 11129923 11662235 12234568 12852305
55977A2852305O67071P21560P84270Q55029R32136J018524J119889J237522J370225
$$ 12852305 13519376 14240936 15025206 15880235 16812371 17830895 18950784 20188306 21558531
55968B1558531J522548J703448J917690K167322K461121K813714L237204L744750
$$ 21558531 23081079 24784527 26702217 28869539 31330660 34144374 37381578 41126328
55960D1126328M361754N122356O056993P196128Q581529J0254989J2238418J4547167
$$ 41126328 45488082 50610438 56667431 63863559 72445088 82700077 94938495 109485662
55952A09485662J7220866K0308460K3797524K7525216L1050620L3473682L3402981
$$ 109485662 126706528 147014988 170812512 198337728 229388348 262862030 296265011
55945B96265011K9408114K0926269Q968954m095429j5646149k3961890k8631932
$$ 296265011 325673125 346599394 355568348 351472919 335826770 311864880 283232948
55938B83232948l0199046k9565392k7591211k4939221k2052440j9197029j6530291
$$ 283232948 253033902 223468510 195877299 170938078 148885638 129688609 113158318
55931A13158318j4144082j2073186j0306183q813775p566304o528964n660314
$$ 113158318 99014236 86941050 76634867 67821092 60254788 53725824 48065510
55924D8065510m925368m302098l772145l315474k917619k572710k275070k015080
$$ 48065510 43140142 38838044 35065899 31750425 28832806 26260096 23985026 21969946
55916B1969946j785733j585704j412990j261967j128896j013870r15182q27694
$$ 21969946 20184213 18598509 17185519 15923552 14794656 13780786 12865604 12037910
55908A2037910p48705o79781o21030n68926n21354m79497m43181m09448l77325
$$ 12037910 11289205 10609424 9988394 9419468 8898114 8418617 7975436 7565988 7188663
55899G188663l49151l25545l03723k82268k62937k46201k29451k11399j94228
$$ 7188663 6839512 6513967 6210244 5927976 5665039 5418838 5189387 4977988 4783760
55890D783760j79765j67438j57483j52040j51117j50958j48323j43357j36997
$$ 4783760 4603995 4436557 4279074 4127034 3975917 3824959 3676636 3533279 3396282
55881C396282j28957j19826j11875j05940j00145r3236q6564q1525p7753p5001
$$ 3396282 3267325 3147499 3035624 2929684 2829539 2736303 2649739 2568214 2490461 2415460
55871B415460p4094p4649p4402p2109o8861o5634o1962n7909n4669n2233m9068
$$ 2415460 2341366 2266717 2192315 2120206 2051345 1985711 1923749 1865840 1811171 1758938 1709870
55860A709870m5178m2805m2875m3314m2187l9990l7550l4276l0107k6850k5780
$$ 1709870 1664692 1621887 1579012 1535698 1493511 1453521 1415971 1381695 1351588 1324738 1298958
55849A298958k5821k5701k5952k7180k8240k7844k6510k5332k4264k3003k2130
$$ 1298958 1273137 1247436 1221484 1194304 1166064 1138220 1111710 1086378 1062114 1039111 1016981
55838A016981k1987k1669k0474j9125j8379j7680j6388j5083j4443j3872j2518
$$ 1016981 994994 973325 952851 933726 915347 897667 881279 866196 851753 837881 825363
55827H25363j0729r469r059r387j0481j2059j3294j3728j3694j3442j2835j2198
$$ 825363 814634 805165 796106 786719 776238 764179 750885 737157 723463 710021 697186 684988
55815F84988j2295j2968j3037j1966j0473r054p341n500m678n252n894n297l809
$$ 684988 672693 659725 646688 634722 624249 615195 607854 602354 597676 592424 586530 581233 577424
55802E77424k523j813j472j385j390j224j069j301j562j139l18RJ99J690M649
$$ 577424 574901 573088 571616 570231 568841 567617 566548 565247 563685 562546 562228 562237 562436 564126 568775
55787E68775P534R469J1103J2244J0659M655m389j3372k0155k3966k4579k2691
$$ 568775 576309 585778 596881 609125 619784 624439 620050 606678 586523 562557 537978 515287
55775E15287k0134j8281j6667j4107j0492o726l736k321l078n557q166r738j0389
$$ 515287 495153 476872 460205 446098 435606 428880 425144 422823 419745 414188 406022 396284 385895
55762C85895j0374r240o986m869l885l385k251p10J02k65j420k964m525n527n797
$$ 385895 375521 366281 359295 354426 350541 347156 344905 344195 344297 344032 342612 339648 335123 329596 323799
55747C23799n928o339o561o122n408m969m623m058l548l266k663j409k82k20r96
$$ 323799 317871 311532 304971 298849 293441 288472 283849 279791 276243 272977 270314 268905 268623 268403 267407
55732B67407j696j981k025j783j184p02q46j426j955k343k710k942k970l020l042
$$ 267407 265711 263730 261705 259922 258738 258036 257190 255764 253809 251466 248756 245814 242844 239824 236782
55717B36782k572j621r87j093j318j101r07j206j399p38K88O20K26n2Q4L7o44
$$ 236782 234210 232589 231602 230509 229191 228090 227183 225977 224578 223840 224128 224748 224974 224922 225006 225043 224399
55700B24399j703k599k965k819k697l247m278m719l940k620j791j573j469j288
$$ 224399 222696 220097 217132 214313 211616 208369 204091 199372 195432 192812 191021 189448 187979 186691
55686A86691j137r36o22m36m95n32m71o76j131j117k87O38R24Q49Q78N93n82k092
$$ 186691 185554 184618 183996 183560 183065 182533 182062 181386 180255 179138 178851 179489 180413 181262 182140 182733 182151 180059
55668A80059k751k205j041J70J116J401Q85K22K69J024J729J789J109j40j506
$$ 180059 177308 175103 174062 174232 175348 176749 177634 177856 178125 179149 180878 182667 183776 183636 182130
55653A82130k269k093j360n83R5M63kj343k672l139k786j930n43J057J710P18
$$ 182130 179861 177768 176408 175825 175920 176383 176381 175038 172366 169227 166441 164511 163968 165025 166735 167453
55637A67453r59j825j699j528j842k433l107l745l851l115k147j796k019k219
$$ 167453 166494 164669 162970 161442 159600 157167 154060 150315 146464 143349 141202 139406 137387 135168
55623A35168k291k353j989q03M97Q02J48n49r59j446j827j395k83L52j64j321
$$ 135168 132877 130524 128535 127732 128229 129031 129179 128630 127671 126225 124398 123003 122720 123072 122908 121587
55607A21587k323k881k936k515k013j859j803j313o55o63j354j744j275n13j43
$$ 121587 119264 116383 113447 110932 108919 107060 105257 103944 103289 102626 101272 99528 98253 97740 97597
55592I7597r7p1j73n56r43r60n96j44M6k64r13j236o83N08J675K551L218L554
$$ 97597 97500 97429 97256 96700 95757 94797 94201 94057 94103 93839 92926 91690 91007 91515 93190 95741 98959 102513
55574A02513L451L378L815M298L902K681J662J297R57J42p98j522k332l423m255
$$ 102513 105964 109342 113157 117455 121357 124038 125700 126997 127954 128096 127298 125776 123444 120021 115766
55559A15766m283l752l260k929k473j773r83l99l70j035j918k196j604p43l38
$$ 115766 111483 107731 104471 101542 99069 97296 96313 95914 95544 94509 92591 90395 88791 88048 87710
55544H7710n08q78r97o26N9M80L31J16N35J386J764J364Q70Q90J218J402J274
$$ 87710 87202 86324 85327 84701 84760 85240 85571 85687 86222 87608 89372 90736 91606 92496 93714 95116 96390
55527I6390O87n79k166l038k570j317k55K63M10K55j99o93r67j184j613k111k246
$$ 96390 97077 96498 94332 91294 88724 87407 87152 87415 87825 88080 87881 87188 86221 85037 83424 81313 79067
55510G9067j883j303q39o78q78j302j597j449q26L5P79R94M64m64r84n94L28Q99
$$ 79067 77184 75881 75042 74364 73486 72184 70587 69138 68312 68347 69126 70120 70584 70120 69136 68542 68870 69769
55492F9769O41q3m99j95N27J030R66M72j75q08j257j296r80o77n64m39k47l47
$$ 69769 70410 70327 69828 69633 70160 71190 72156 72628 72453 71645 70388 69092 68112 67435 66871 66432 66185 65838
55474F5838q07r37j99P78Q41j01j017j173q28m59p3L44M73J65j93j98Krk98n03
$$ 65838 65031 64094 63895 64673 65514 65413 64396 63223 62395 61936 61863 62207 62680 62845 62652 62454 62456 62447 62149 61646
55454F1646k32N06J186J194N83J24K32K69m73j422j322q4R65R17L84M07R93J367
$$ 61646 61414 61920 63106 64300 64883 65007 65239 65508 65035 63613 62291 62207 63172 64089 64473 64880 65873 67240
55436F7240J070K77n53r70p47k03j8m95j284j913k192k004j244j79O07R04J032
$$ 67240 68310 68587 68034 67064 66317 66114 66096 65601 64317 62404 60212 58208 56964 56785 57392 58296 59328
55419E9328J188J172R18P09O07L16j57l33j23j33o68j089p40R5O93Q35P03L39
$$ 59328 60516 61688 62606 63315 63922 64238 64081 63748 63625 63492 62824 61735 60995 61090 61783 62618 63321 63660
55401F3660j73m63m16n00r53j153n78J25m1q16r90k22M90L75p1l0L86M79R3k36
$$ 63660 63487 63024 62608 62108 61155 60002 59424 59549 59508 58692 57702 57480 57970 58345 58274 58244 58630 59109 59202 58966
55381E8966j33J64K57J72K46N44O79L11l54p69o34n8O92J235J024j42j471j755
$$ 58966 58833 58997 59254 59426 59672 60216 60895 61206 60852 60083 59449 59391 60083 61318 62342 62200 60729 58974
55363E8974q09J90K20l57n22lO79J109J244J002L45l65o74o76p15o47j10N67N42
$$ 58974 58165 58355 58575 58218 57696 57693 58372 59481 60725 61727 62072 61707 61033 60357 59642 58995 58885 59452 59994
55344E9994k26o54N0J211J529P02l54p59n64k95j07K01N55M34m05j317j271m2
$$ 59994 59768 59114 59164 60375 61904 62606 62252 61493 60929 60634 60527 60728 61283 61717 61312 59995 58724 58682
55326E8682J390J860J204K37k68k77k24l79o38q11q99r99r90n26M32J309J412
$$ 58682 60072 61932 63136 63373 63105 62828 62604 62225 61587 60776 59877 58878 57888 57362 57794 59103 60515
55309F0515P67J31R6M85P49O02J30l65m59R1R14J240Q64N25R32J690J717O11r32
$$ 60515 61282 61413 61509 61994 62743 63345 63475 63110 62651 62742 63656 64896 65760 66285 67217 68907 70624 71235 70303
55290G0303j979k215j891j378r24o33m51k77j14l2l9o0k4J05L29N49N91M39L32
$$ 70303 68324 66109 64218 62840 61916 61283 60832 60555 60441 60409 60370 60310 60286 60391 60720 61269 61860 62299 62631
55271F2631M70P13O82J42p58j520j620r36L3N86N04J63j9N7L69R05J406J363N89
$$ 62631 63101 63814 64496 64638 63880 62360 60740 59804 59837 60423 60927 61090 61071 61128 61497 62402 63808 65171 65760
55252F5760m00q63n84M5M71M38J17p6N2J82p2n17o39m68n81j112j492j377j143
$$ 65760 65360 64497 63913 63958 64429 64867 64984 64908 64960 65142 65070 64553 63914 63446 62865 61753 60261 58884 57741
55233E7741j069p85q8M12J59m20o20n26n84n70l7O46P28L54L27O75O55J96J45
$$ 57741 56672 55887 55799 56211 56370 55950 55330 54804 54220 53650 53613 54259 54987 55341 55668 56343 56998 57194 57339
55214E7339P99J238P00k43n16J07J040J687J757J200L16l82p29j048j427j447
$$ 57339 58138 59376 60076 59833 59317 59424 60464 62151 63908 65108 65424 65042 64313 63265 61838 60391
55198F0391q75j46L16O84J186J405Q10k62q15m10L02L86l34j103j053j08R29J262
$$ 60391 59516 59370 59686 60370 61556 62961 63771 63509 62694 62284 62586 62972 62638 61535 60482 60374 61303 62565
55180F2565R16M69J90l8j02L26J024J204N39l65q72j021j000n69K89Q24M02n23
$$ 62565 63481 63950 64140 64102 64000 64326 65350 66554 67093 66728 65856 64835 63835 63266 63555 64379 64781 64258
55162F4258j038j095j292j618j365l58O49R98R30J026J379J572J169J39r30j182
$$ 64258 63220 62125 60833 59215 57850 57492 58141 59139 60069 61095 62474 64046 65215 65354 64424 63242
55146F3242m44L15P7q16j062k75M99K90n59j106r67k38R84K232K468J145q25j952
$$ 63242 62798 63113 63190 62374 61312 61037 61536 61826 61267 60161 59194 58956 59940 62172 64640 65785 64960 63008
55128F3008j819j111l71L65Q30N05m25r64n89J41N53P75J151J422J173O41L50
$$ 63008 61189 60078 59707 60072 60902 61407 60982 60018 59429 59570 60123 60898 62049 63471 64644 65285 65635
55111F5635K50p9n56o86m65m21o58n74J48Q86Q84K82j35kL19L95K18j6k35m47
$$ 65635 65885 65806 65250 64564 64099 63678 63020 62446 62594 63480 64364 64646 64511 64509 64828 65223 65441 65425 65190 64743
55091F4743n68n00k94j13m6j0R7K57L77M82P06J001J024N43j14k97J56O56N50
$$ 64743 64175 63675 63381 63268 63222 63212 63309 63566 63943 64425 65131 66132 67156 67699 67585 67288 67444 68100 68650
55072F8650p6n57m65j2L54M36L56L13M42P23R04O29j66j025j308q81l17l06r00
$$ 68650 68574 68017 67552 67540 67894 68330 68686 68999 69441 70164 71068 71697 71531 70506 69198 68317 68000 67694 66794
55053F6794j442j300n63Q6J38j79k01L74J067J162N93Q3K88R87J451J387J099
$$ 66794 65352 64052 63489 63575 63713 63534 63333 63707 64774 65936 66529 66612 66900 67887 69338 70725 71824
55036G1824Q20L81k01m54j31K42R1l04k68J39J80l45p96p58o96j084j472j040
$$ 71824 72644 73025 72824 72370 72239 72481 72572 72268 72000 72139 72319 71974 71178 70420 69724 68640 67168 66128
55018F6128K33J464J808J164J27n34m77j42k62q81j188n89M15R27Q59Q18J022
$$ 66128 66361 67825 69633 70797 70924 70390 69913 69771 69509 68628 67440 66851 67266 68193 69052 69870 70892
55001G0892J048O99M62P94J400J629J298Q26O60Q20J012R57O31J75l29r33j588
$$ 70892 71940 72639 73101 73895 75295 76924 78222 79048 79708 80528 81540 82497 83128 83303 82974 82041 80453
54984H0453j985j800j064j55N53R11R66Q45O65M05j2m39m86k1N11N90L15K33N52
$$ 80453 78468 76668 75604 75449 76002 76913 77879 78724 79389 79794 79782 79343 78857 78836 79347 79937 80252 80485 81037
54965H1037Q78Q71O58N23M69L13lm37r01j134p06M70J784K300J646L61o34q22
$$ 81037 81915 82786 83444 83967 84436 84749 84746 84309 83408 82274 81568 82038 83822 86122 87768 88129 87495 86673
54947H6673m01J0l8m99r41j014q14p49j015j315j218p67m71o16q38o00j4K92L3
$$ 86673 86272 86282 86244 85745 84804 83790 82976 82227 81212 79897 78679 77912 77441 76825 75987 75387 75373 75665 75698
54928G5698l50l33M2L88N46O53Q09J027J379J988K770L410L568L171K556K317
$$ 75698 75348 75015 75057 75445 75991 76644 77453 78480 79859 81847 84617 88027 91595 94766 97322 99639
54912I9639K735L420L844M098M590M934L971J319j732l536l864l658l523l329
$$ 99639 102374 105794 109638 113736 118326 123260 127231 128550 126818 123282 119418 115760 112237 108908
54898A08908l053l007l129k957k450k088k042j899j468j096r39o77k60k09o52
$$ 108908 105855 102848 99719 96762 94312 92224 90182 88283 86815 85719 84780 84103 83843 83634 82982
54883H2982p95pJ136J590J255Q74Q32Q49P35P32R86J275J466J743K261K892L434
$$ 82982 82187 82180 83316 84906 86161 87035 87867 88716 89451 90183 91169 92444 93910 95653 97914 100806 104240
54866A04240L827L980L688K843J619L71o40j388k047k708l113k941k376k109k478
$$ 104240 108067 112047 115735 118578 120197 120568 119928 118540 116493 113785 110672 107731 105355 103246 100768
54851A00768k964k934k587k557k824k704k014j481j691k221k245j631r22m96k26
$$ 100768 97804 94870 92283 89726 86902 84198 82184 80703 79012 76791 74546 72915 71993 71497 71271
54836G1271R6M70Q21J102J170Q72L46%P5L96O69Q54J058J212J028L64m24o70j1
$$ 71271 71367 71837 72658 73760 74930 75802 76148 76148 76223 76619 77288 78142 79200 80412 81440 81804 81380 80710 80699
54817H0699J120J727J152k88j610k105j821j236o71j70K74N72O02L97K24M06R10
$$ 80699 81819 83546 84698 84410 82800 80695 78874 77638 76967 76797 77071 77643 78245 78642 78866 79272 80182
54800H0182J192P62j27o94o61m90n20l87J81O15K50n21p31l11j56o07q77l25N69
$$ 80182 81374 82136 82009 81315 80654 80164 79644 79257 79438 80053 80303 79782 79051 78740 78584 77977 77100 76775 77344
54781G7344J014J040J119J287J245J026Q70P27M89M21Q43J553K111K430K538K114
$$ 77344 78358 79398 80517 81804 83049 84075 84945 85672 86161 86582 87425 88978 91089 93519 96057 98171
54765I8171R37l51p59j54P42J466K212L024L482L427L332L583L838L413K002j29
$$ 98171 99108 98757 97998 97844 98586 100052 102264 105288 108770 112197 115529 119112 122950 126363 128365 128236
54749A28236k267l551l592k946k592k774k865k426j778j370j196j115j211j413
$$ 128236 125969 122418 118826 115880 113288 110514 107649 105223 103445 102075 100879 99764 98553 97140
54735I7140j318p96l58m93r75j258j206j039q13m15R5N29Q22R81R24O95O23J060
$$ 97140 95822 95026 94668 94175 93200 91942 90736 89697 88884 88469 88564 89093 89915 90896 91820 92515 93138 94198
54717I4198K012L177M222M875N016M785M409L849K877J486p7j659l126m007l906
$$ 94198 96210 99387 103609 108484 113500 118285 122694 126543 129420 130906 130829 129170 126044 122037 118131
54702A18131l282l085l420l449k851k416k603k558j454J5O12L82L39O68N16m22
$$ 118131 114849 111764 108344 104895 102044 99628 97025 94467 93013 93028 93640 94022 94361 95029 95545 95123
54686I5123j334j452r12k32K38J94m79j231j199l55L80L28k40p91j178j333j012
$$ 95123 93789 92337 91425 91193 91431 91625 91146 89915 88716 88361 88741 89069 88829 88038 86860 85527 84515
54669H4515l41J8l48j020j362j229p15K49J528K475K569K086J652J362Q65J16
$$ 84515 84174 84192 83844 82824 81462 80233 79518 79767 81295 83770 86339 88425 90077 91439 92304 92420
54653I2420n55r28j014p80k46J95J09l35m88j12L33L91K17J42M6m25j173j557
$$ 92420 91865 90937 89923 89143 88897 89092 89201 88866 88378 88266 88599 88990 89207 89349 89395 88970 87797 86240
54635H6240j131j71O05P70M50J2l37n89p82r05q99o69j93L21N26L05n5k20k72
$$ 86240 85109 84938 85543 86313 86763 86775 86438 85849 85067 84162 83263 82594 82401 82722 83248 83553 83498 83278 83006
54616H3006m92q11q16l53J91M37N42Q59J292J350R01M73O09J035Q98j83j512j999
$$ 83006 82514 81703 80887 80534 80725 81162 81704 82563 83855 85205 86106 86579 87188 88223 89121 88938 87426 85427
54598H5427j326j83O21R05Q80O13J23k52j16L25L67k78j039j208q06l93k75k29
$$ 85427 84101 83918 84539 85444 86324 86937 87060 86808 86692 87017 87384 87106 86067 84859 84053 83660 83385 83156
54580H3156K2M28P37P22L06l30p07m11L78R67R35O29O26R09R22L78l45o81m57
$$ 83156 83178 83606 84343 85065 85371 85041 84334 83923 84301 85268 86203 86832 87458 88367 89289 89667 89322 88641 88184
54561H8184J02O37Q11M73r4l63j47K19M75Q12J311J446P50k90o89k74J48j7m06
$$ 88184 88286 88923 89734 90207 90113 89750 89603 89822 90297 91109 92420 93866 94616 94326 93637 93363 93511 93494 93088
54542I3088l85J75R85J728K007J440J95r33j321j067n41R6O65P65K93j94j87R3
$$ 93088 92703 92878 93863 95591 97598 99038 99233 98300 96979 95912 95371 95467 96132 96897 97190 96996 96809 96902
54524I6902J53n9l24o79j150j308p80K4L43R5j52r4L8K6r0k83n06m47J04P13P01
$$ 96902 97055 96996 96672 95993 94843 93535 92755 92779 93122 93217 93065 92971 93009 93035 92945 92662 92156 91709 91813 92526 93227
54503I3227Q4m58m43Q2R15J737J894R77l66r94o89k54j76q1K69M60K85K36O20
$$ 93227 93311 92853 92410 92492 93407 95144 97038 98015 97649 96655 95966 95712 95536 95455 95724 96184 96469 96705 97325
54484I7325R52Q04O15R29J450J470Q70J04m45n76j17P79J518J700J557J361Q82
$$ 97325 98277 99081 99696 100625 102075 103545 104415 104519 104074 103498 103381 104160 105678 107378 108935 110296 111178
54467A11178l1q53j010p28n89n83l24N8M3l67o58o08m47k58R5M35L66m1k88k51
$$ 111178 111147 110294 109284 108556 107967 107384 107060 107118 107161 106794 106136 105528 105081 104823 104918 105353 105719 105678 105390 105139
54447A05139l15n67n69j30K92L31K83M96O52J53r12j698j432j44J391K202J783
$$ 105139 104824 104257 103688 103558 103850 104181 104464 104960 105612 105765 104853 103155 101723 101579 102970 105172 106955
54430A06955M54q30j213n93L79Q76N85p8m60l46n1K11O35J276J571R29l25j192
$$ 106955 107409 106579 105366 104773 105152 106028 106613 106535 106075 105729 105678 105889 106524 107800 109371 110300 109975 108783
54412A08783j177p30m37l06j36q5m19r23j004m21L83P08L45j44M5J025J976K019
$$ 108783 107606 106876 106439 106133 105997 105912 105493 104570 103566 103145 103528 104236 104581 104437 104482 105507 107483 109502
54394A09502J255N73N52R86J495J990K296J901N96r75j876j921j645j433j131
$$ 109502 110757 111330 111882 112868 114363 116353 118649 120550 121146 120171 118295 116374 114729 113296 112165
54379A12165o05j37o8l31n88o76p01p41o59k97K71P56J003J177J451J646J383
$$ 112165 111560 111423 111355 111024 110436 109760 109059 108318 107659 107362 107633 108389 109392 110569 112020 113666 115049
54362A15049O69Rj54M3J73P6j03k90n35q02r75j067j151j101o83M6P45J189J433
$$ 115049 115718 115727 115573 115616 115789 115865 115762 115472 114937 114135 113160 112093 110942 109841 109158 109204 109949 111138 112571
54343A12571J491J225O87K41J81M62R24J459J755J334K48n91l28P09J392J211
$$ 112571 114062 115287 115974 116215 116396 116858 117782 119241 120996 122330 122578 121987 121659 122368 123760 124971
54327A24971P43O53Q03O82K24k12m27n53q02j254j836k318k456k277k049j825
$$ 124971 125714 126367 127170 127852 128076 127864 127437 126884 126082 124828 122992 120674 118218 115941 113892 112067
54311A12067j340m96L11O42N21K10k38p95j077p54j97k08r73j763j796j095k63
$$ 112067 110727 110231 110542 111184 111705 111915 111677 110882 109805 109051 108854 108646 107673 105910 104114 103019 102756
54294A02756K18L42M06O90J165J462J245N91j30o44q35n62J49P92P52J55o6P42
$$ 102756 102974 103316 103722 104412 105577 107039 108284 108875 108745 108101 107266 106704 106853 107645 108397 108552 108486 109228
54276A09228K088K836K422J340M69J62o1q01j876k328j556j88O34O04L98N48Q56
$$ 109228 111316 114152 116574 117914 118383 118545 118484 117683 115807 113479 111923 111735 112369 112973 113371 113919 114775
54259A14775J018J110J136P83M9l97o7N53N79j57j033j443j236n57K42O54L82
$$ 114775 115793 116903 118039 118822 118871 118474 118407 118960 119539 119382 118349 116906 115670 115113 115355 116009 116391
54242A16391l11r17j175j078o61j13J27j79o88q78o63l32r9r6m85j162j553j262
$$ 116391 116080 115163 113988 112910 112249 112136 112263 112084 111396 110518 109855 109523 109424 109328 108843 107681 106128 104866
54224A04866o28k16L8N13J046J132Q27O49N95Q2r71j796j810j338r55p06l74J5
$$ 104866 104238 104022 104060 104573 105619 106751 107578 108227 108822 108904 107933 106137 104327 102989 102034 101328 100954 100969
54206A00969L50P27J123J195P83L34L74Q01J034P56K14o6K81J128J754J442L14
$$ 100969 101319 102046 103169 104364 105147 105481 105855 106656 107690 108446 108660 108594 108875 110003 111757 113199 113513
54189A13513p84j337j641j936j759p44M15O21j33p82o40j46j1k72n32o03n41l45
$$ 113513 112729 111392 109751 107815 106056 105312 105727 106348 106215 105433 104793 104647 104636 104364 103832 103229 102688 102343
54171A02343n4J53J97K71M92N55J38n52r58q94o90o01m80j73J28K24K80N11O79
$$ 102343 102289 102442 102639 102910 103402 103957 104095 103543 102585 101691 101001 100400 99920 99747 99875 100099 100379 100890 101569
54152A01569L69k77o07l36M4Pl06m36k95m1L75J018J459J144L18m1N81J563J970
$$ 101569 101938 101661 101054 100718 100762 100769 100463 100027 99732 99691 100066 101084 102543 103687 104005 103964 104545 106108 108078
54133A08078J609R71M57R2k16m70o77p90p14m96m07o37r87j075p18N6J146K293
$$ 108078 109687 110658 111115 111207 110991 110521 109844 109054 108340 107844 107437 106800 105813 104738 104020 104076 105222 107515
54115A07515K979K830K064J292Q13M28Mj51K71R68J176M99o47j408j327o35P9
$$ 107515 110494 113324 115388 116680 117493 117921 117925 117774 118045 119013 120189 120688 120041 118633 117306 116671 116750
54098A16750L56Q7m77p81l86M46Q29K80n76p83l66k44p68j195q56q8M98R64J522
$$ 116750 117106 117193 116716 115935 115549 115995 116824 117104 116528 115745 115379 115135 114367 113172 112316 112228 112726 113690 115212
54079A15212J622O44p91j251m18M44K60m38m68L66J272J671J644J331O85j21o29
$$ 115212 116834 117478 116687 115436 115018 115462 115722 115284 114816 115182 116454 118125 119769 121100 121785 121664 121035
54062A21035o28m18l21k83j01J62K83K35J72J44P0M2M00J234K022K077J473J073
$$ 121035 120407 119989 119668 119385 119284 119446 119729 119964 120136 120280 120350 120392 120792 122026 124048 126125 127598 128671
54044A28671J474K247K607K502K506K798L011L108L555M303M482L669K804K975
$$ 128671 130145 132392 134999 137501 140007 142805 145816 148924 152479 156782 161264 164933 167737 170712
54030A70712L797L999L277K536K321K105J466R04R68J314J249O82n1q08j536j972
$$ 170712 174509 178508 181785 184321 186642 188747 190213 191117 192085 193399 194648 195330 195279 194471 192935 190963
54014A90963k070k259k739k913k248j271r22j120r13M6J105J785K498L738N263
$$ 190963 188893 186634 183895 180982 178734 177463 176541 175421 174508 174554 175659 177444 179942 183680 188943
53999A88943O399O606N483K894n37l554n335o121o509o657o486o191n923n385
$$ 188943 195342 201948 207431 210325 209788 206234 200899 194778 188269 181612 175126 168935 163012 157627
53985A57627m265k945k219k361k823k850k171j159m97n24q45p03R6R83J350J141
$$ 157627 153362 150417 148198 145837 143014 140164 137993 136834 136337 135813 134968 134265 134361 135344 136694 137835
53969A37835O13L1k34J32P77Q01Ko71m24J66N9n93o67K54J350J743J384P13K10
$$ 137835 138448 138479 138245 138377 139154 139955 139957 139286 138862 139028 139087 138494 137827 138081 139431 141174 142558 143271 143481
53950A43481L50J301K470K918K425J648J233J310J836K701L366L195K416K055
$$ 143481 143831 145132 147602 150520 152945 154593 155826 157136 158972 161673 165039 168234 170650 172705
53936A72705K588L353L574L357L156K908K327J639J360J542J773J804J761J813
$$ 172705 175293 178646 182220 185577 188733 191641 193968 195607 196967 198509 200282 202086 203847 205660
53922B05660J963K143K345K657L183L845M301M400M543N107N653N280L876K282
$$ 205660 207623 209766 212111 214768 217951 221796 226097 230497 235040 240147 245800 251080 254956 257238
53908B57238J079kj183j977k034j850j989k188k008j776k059k598k692k459k680
$$ 257238 258317 258315 257132 255155 253121 251271 249282 247094 245086 243310 241251 238653 235961 233502 230822
53893B30822l442l900l545k974l039l815m694n120m917m227l332k431j547q16
$$ 230822 227380 223480 219935 216961 213922 210107 205413 200293 195376 191149 187817 185386 183839 183023
53879A83023o03j067j725j942j715j561j684j782j649j425j171p97n07q02j696
$$ 183023 182420 181353 179628 177686 175971 174410 172726 170944 169295 167870 166699 165902 165395 164593 162897
53864A62897k421k264j426p38o95j055j226q71j79L71M80L58M17Q21J457K229
$$ 162897 160476 158212 156786 156048 155353 154298 153072 152201 152022 152393 152873 153231 153648 154469 155926 158155
53848A58155L114L978M765N809P627J0179J2537J3398J1858P862K296l317p558
$$ 158155 161269 165247 170012 175821 183448 193627 206164 219562 231420 239282 241578 238261 230703
53835B30703r814j0332r723q600p425o277m880l238k098k147k864k935j965r83
$$ 230703 220889 210557 200834 192234 184809 178532 173652 170414 168316 166169 163305 160370 158405 157422
53821A57422r06j236q59L62J579K183K354K438K521K684L179M034M879N325N398
$$ 157422 156516 155280 154421 154783 156362 158545 160899 163337 165858 168542 171721 175755 180634 185959 191357
53806A91357N392N449N346M700L364J718M95K03O16R54N77n05j691k283j962j027
$$ 191357 196749 202198 207544 212244 215608 217326 217821 218024 218640 219594 220171 219666 217975 215692 213730 212703
53790B12703k22k18j063k104k545k175j536j249j266j053n18l64j218k622l456
$$ 212703 212481 212263 211200 209096 206551 204376 202840 201591 200325 199272 198754 198390 197172 194550 191094
53775A91094l261k722k687l110l261k714j806j144q92p01l17k9k98r93j382j113
$$ 191094 187833 185111 182424 179314 176053 173339 171533 170389 169497 168796 168479 168450 168152 167159 165777 164664
53759A64664p07p48r63p45k82l57j033j434j076n32m51n69l23J62L29R7j20o6
$$ 164664 163957 163209 162246 161501 161219 160862 159829 158395 157319 156787 156336 155767 155444 155606 155935 156032 155912 155846
53741A55846J33K81K13j30m47k30M71Q79N37M6J76P16R92J112J671K539K903K566
$$ 155846 155979 156260 156473 156343 155896 155666 156137 157016 157553 157599 157775 158491 159483 160595 162266 164805 167708 170274
53723A70274K171K047J854J582J851K768L428L183K544K240K159J935J809J950
$$ 170274 172445 174492 176346 177928 179779 182547 185975 189158 191702 193942 196101 198036 199845 201795
53709B01795J629J69j574j940n75J208K316L016L920M782M958M405L606K861K150
$$ 201795 203424 203593 202019 200079 199504 200712 203028 206044 209964 214746 219704 224109 227715 230576 232726
53694B32726J474R65P25P78J011J051N50k80p68o32l11k33k53j52j91n98r00n15
$$ 232726 234200 235165 235890 236668 237679 238730 239280 239000 238232 237600 237289 237056 236803 236651 236460 235862 234962 234447
53676B34447K07K82n23j317j230l65N85J129J063L37p64j626j846j630j360j092
$$ 234447 234654 234936 234413 233096 231866 231501 232086 233215 234278 234615 233851 232225 230379 228749 227389 226297
53660B26297p69n99p74r85o99O6P31Q89P10N35M34L32K35K21L37O87J399K305
$$ 226297 225528 224929 224155 223170 222471 222537 223268 224157 224867 225402 225836 226168 226403 226624 226961 227648 229047 231352
53642B31352K839K473J257j88j177j376q57R4J164K126K857L289L429L353L138
$$ 231352 234191 236664 237921 237733 236556 235180 234323 234417 235581 237707 240564 243853 247282 250635 253773
53627B53773K776K260J781J640J935K402K710K833L001L254L269K765K040J831
$$ 253773 256549 258809 260590 262230 264165 266567 269277 272110 275111 278365 281634 284399 286439 288270
53613B88270K510L471L669K824J830J749K627L594M034M106M124L912L137J977
$$ 288270 290780 294251 297920 300744 302574 304323 306950 310544 314578 318684 322808 326720 329857 331834
53599C31834R76M23J59K0K8J30R7j49m15n84r08j589k336k580k155j445q81n89
$$ 331834 332810 333233 333392 333412 333440 333570 333667 333518 333103 332519 331611 330022 327686 325106 322951 321506 320625 320036
53581C20036o12j093j967k687k643j834q68k70qK37O11J068J595K227K880L341
$$ 320036 319424 318331 316364 313677 311034 309200 308332 308062 308054 308291 308902 309970 311565 313792 316672 320013
53565C20013L443L212K837K551K416K188J506L43q46j527j578j294j021r42j000
$$ 320013 323456 326668 329505 332056 334472 336660 338166 338509 337663 336136 334558 333264 332243 331301 330301
53550C30301q46n0J347K574K801K150J599J905K906M042N053N863O212N931N443
$$ 330301 329455 329405 330752 333326 336127 338277 339876 341781 344687 348729 353782 359645 365857 371788 377231
53535C77231N514O441P825R131J0124J0775J1160J1573J2387J3553J4488J4741
$$ 377231 382745 389186 397011 406142 416266 427041 438201 449774 462161 475714 490202 504943
53523E04943J4552J4543J4997J5746J6626J7707J9037K0465K1776K2815K3485
$$ 504943 519495 534038 549035 564781 581407 599114 618151 638616 660392 683207 706692
53512G06692K3778K3884K4065K4412K4810K5108K5162K4814K4095K3436K3261
$$ 706692 730470 754354 778419 802831 827641 852749 877911 902725 926820 950256 973517
53501I73517K3342K3027K2201K1504K1335K1168K0404J9395J8938J9015J8899
$$ 973517 996859 1019886 1042087 1063591 1084926 1106094 1126498 1145893 1164831 1183846 1202745
53490A202745J8398J8131J8404J8657J8392J7968J7938J8132J7931J7037J5450
$$ 1202745 1221143 1239274 1257678 1276335 1294727 1312695 1330633 1348765 1366696 1383733 1399183
53479A399183J3067R971O835M445K822J362l22k252m568p453j0507j2883j4259
$$ 1399183 1412250 1422221 1429056 1433501 1436323 1437685 1437363 1435111 1430543 1423090 1412583 1399700 1385441
53466A385441j5102j5838j6313j6379j6414j6848j7588j8407j9537k1203k2869
$$ 1385441 1370339 1354501 1338188 1321809 1305395 1288547 1270959 1252552 1233015 1211812 1188943
53455A188943k3574k3093k2222k1768k1672k1360k0557j9437j8120j6464j4418
$$ 1188943 1165369 1142276 1120054 1098286 1076614 1055254 1034697 1015260 997140 980676 966258
53444I66258j2340j0724r599q455o846n009l616k936k435j450J6J403K448L564
$$ 966258 953918 943194 933595 925140 918294 913285 909669 906733 904298 902848 902864 904267 906715 910279
53430I10279N198P156Q847J0059J1184J2553J3997J5199J6247J7481J8956K0373
$$ 910279 915477 922633 931480 941539 952723 965276 979273 994472 1010719 1028200 1047156 1067529
53418A067529K1607K2877K4293K5637K6755K8008K9856L2185L4333L5880L7152
$$ 1067529 1089136 1112013 1136306 1161943 1188698 1216706 1246562 1278747 1313080 1348960 1386112
53407A386112L8874M1474M4745M8003N0510N1962N2686N3370N4450N5740N6684
$$ 1386112 1424986 1466460 1511205 1559208 1609718 1661680 1714366 1767736 1822186 1877926 1934610
53396A934610N6962N6803N6689N6799N6879N6624N5944N4759N2775M9877M6538
$$ 1934610 1991572 2048375 2105064 2161863 2218742 2275366 2331310 2386069 2438844 2488721 2535259
53385B535259M3404M0430L6949L2689K8252K4322K0864J7393J3643R614N294O90
$$ 2535259 2578663 2619093 2656042 2688731 2716983 2741305 2762169 2779562 2793205 2802819 2808113 2808803
53373B808803m203r806j6870k5481l4429m2114m7860n1928n4642n6208n7109n7862
$$ 2808803 2804600 2794794 2777924 2752443 2718014 2675900 2628040 2576112 2521470 2465262 2408153 2350291
53361B350291n8422n8409n7803n6785n5111n2519m9614m7417m6019m4668m3351
$$ 2350291 2291869 2233460 2175657 2118872 2063761 2011242 1961628 1914211 1868192 1823524 1780173
53350A780173m3099m4286m5645m5646m4166m2071l9895l7638l5395l3349l1354
$$ 1780173 1737074 1692788 1647143 1601497 1557331 1515260 1475365 1437727 1402332 1368983 1337629
53339A337629k9156k6792k4352k1729j9042j6899j5757j5347j5174j5167j5324
$$ 1337629 1308473 1281681 1257329 1235600 1216558 1199659 1183902 1168555 1153381 1138214 1122890
53328A122890j5195j4429j3467j2915j2519j1498r748p979o738n931n274m563
$$ 1122890 1107695 1093266 1079799 1066884 1054365 1042867 1033119 1025140 1018402 1012471 1007197 1002634
53316A002634l513j962k27J209K380L635M944N989O960Q488J0745J3196J5397
$$ 1002634 999121 997159 996932 998141 1000521 1004156 1009100 1015089 1022049 1030537 1041282 1054478 1069875
53303A069875J7409J9286K0782K1854K2950K4463K6248K7932K9260L0046L0102
$$ 1069875 1087284 1106570 1127352 1149206 1172156 1196619 1222867 1250799 1280059 1310105 1340207
53292A340207K9538K8710K7652K5953K3484K0913J9049J7867J6485J4097J0688
$$ 1340207 1369745 1398455 1426107 1452060 1475544 1496457 1515506 1533373 1549858 1563955 1574643
53281A574643O856L148l10l595o574q972j0862j2743j4890j6972j8644k0220k2236
$$ 1574643 1581499 1584647 1584337 1580742 1574168 1565196 1554334 1541591 1526701 1509729 1491085 1470865 1448629
53268A448629k4542k6421k7556k8294k8955k9487k9880l0386l1022l1330l0873
$$ 1448629 1424087 1397666 1370110 1341816 1312861 1283374 1253494 1223108 1192086 1160756 1129883
53257A129883k9710k8267k7022k6386k6432k6647k6387k5650k5062k5031k5382
$$ 1129883 1100173 1071906 1044884 1018498 992066 965419 939032 913382 888320 863289 837907
53246H37907k5786k6037k5772k4667k3037k1659k0730j9613j7899j6019j4400
$$ 837907 812121 786084 760312 735645 712608 690949 670219 650606 632707 616688 602288
53235F02288j2780j0926r340q517q060p338o687p005q291r477r794r597r693j0420
$$ 602288 589508 578582 569242 560725 552665 545327 538640 531635 523344 513867 504073 494476 484783 474363
53221D74363j1546j2620j3188j3017j2279j1372j0547r823r164q460p542o522
$$ 474363 462817 450197 437009 423992 411713 400341 389794 379971 370807 362347 354805 348283
53209C48283n859n780n824n428m799m594m948n427n880o557p304p433o738n967
$$ 348283 342424 336644 330820 325392 320593 315999 311051 305624 299744 293187 285883 278450 271712 265745
53195B65745n759n660m834l360k195j890k028k010j861j941k182k069j388o55
$$ 265745 259986 254326 249492 246132 243937 242047 240019 238009 236148 234207 232025 229956 228568 227913
53181B27913n60j066j373r24j58J1o78j567j949j813j609j549j399q14K49J400
$$ 227913 227353 226287 224914 223990 223832 223843 223165 221598 219649 217836 216227 214678 213279 212465 212714 214114
53165B14114K057J935J317O80N4r11k189l038k748j504k54J93k87j287k180k407
$$ 214114 216171 218106 219423 220103 220157 219246 217057 214019 211271 209767 209513 209706 209419 208132 205952 203545
53149B03545j849j020n76o05o43m67m17p14q52j91R97J629J106J15k27K96Q32
$$ 203545 201696 200676 200100 199495 198852 198385 197968 197254 196402 196211 197208 198837 199943 200058 199831 200127 200959
53132B00959O39m9m86m67m73q27j137q45j40J95j36n05k34M19O79M00K61O55J048
$$ 200959 201598 201549 201063 200596 200123 199296 198159 197314 197174 197369 197233 196728 196494 196913 197592 197992 198253 198908 199956
53113A99956P28j54q40r57q46r11j169j445j694j907j972j800j433r68n21k51
$$ 199956 200684 200530 199690 198733 197887 196976 195807 194362 192668 190761 188789 186989 185556 184588 184067 183816
53097A83816k72m74o07n52l46m1K43J83n06j554k195j831n44J090K336K530J514
$$ 183816 183544 183070 182463 181911 181565 181524 181767 181950 181444 179890 177695 175864 175320 176410 178746 181276 182790
53080A82790O9n99j37M90K58n99j041o85j30R7J75L81N41M59M63R66J673J788
$$ 182790 182859 182260 182123 182613 182871 182272 181231 180546 180416 180513 180688 181069 181610 182069 182532 183498 185171 186959
53062A86959J009m2n25k12N10J214J680J720J197M09Q9O96J752K251J735O80k29
$$ 186959 187968 187926 187401 187189 187699 188913 190593 192313 193510 193919 194008 194704 196456 198707 200442 201122 200893
53045B00893p78j076j136j016j066j586k301k604k305j752j231o74p7K40R7j54
$$ 200893 200115 199039 197903 196887 195821 194235 191934 189330 187025 185273 184042 183368 183291 183531 183628 183474
53029A83474n2K70K79j78o33o50l59j29jK38N09M37o1n16m77j18L9j77m61n59
$$ 183474 183422 183692 183971 183793 183160 182510 182151 182022 182021 182259 182768 183205 183144 182628 182151 182033 182072 181895 181434 180875
53009A80875n08k83L40J284J872J417O3j274j819j569j017n25j20K12L09k6o60
$$ 180875 180367 180084 180424 181708 183580 184997 185060 183786 181967 180398 179381 178856 178736 178948 179257 179231 178571
52992A78571j088q51oQ95J340J251R21O41N40N65N67M44K44P9o2k61m13k69K06
$$ 178571 177483 176632 176626 177521 178861 180112 181033 181674 182214 182779 183346 183790 184034 184113 184051 183790 183377 183108 183314
52973A83314P51J144J378J388R65K31o2P85K485L864M030L214K394K203K359K111
$$ 183314 184065 185209 186587 187975 188940 189171 189109 189894 192379 196243 200273 203487 205881 208084 210443 212554
52957B12554J133j28j048j550j982k447k652k489k279k231k130j847j697j882
$$ 212554 213687 213559 212511 210961 208979 206532 203880 201391 199112 196881 194751 192904 191207 189325
52943A89325j986j487n67J43L52J83k47p33p27J01J145J411P41j73r45j797k654
$$ 189325 187339 185852 185285 185428 185780 185963 185716 184983 184256 184357 185502 186913 187654 187481 186536 184739 182085
52926A82085k856k155j207o68m65l43m13o25m07N11J449J589J032L95j57p65j160
$$ 182085 179229 177074 175867 175199 174734 174391 173978 173353 172946 173457 174906 176495 177527 177922 177765 177000 175840
52909A75840j011o73q05j337j629j527j402j264o67L00R08Q42O24O60O70L49n9
$$ 175840 174829 174156 173351 172014 170385 168858 167456 166192 165525 165825 166733 167575 168199 168859 169529 169878 169819
52892A69819k89n30q88r83o02j98j48n7N47J231J144K76n11o00j73L28O64P48
$$ 169819 169530 169000 168112 167129 166527 166329 166181 166124 166671 167902 169046 169322 168811 168211 168038 168366 169030 169778
52874A69778O12N60Q33J184J158Q82R44J402J501O70n58j051l01J126K210K316
$$ 169778 170390 170950 171783 172967 174125 175007 175951 177353 178854 179524 178966 177915 177614 178740 180950 183266
52858A83266J509K26j177k450l176k891j754p24o06j135j481j435j421j469r94
$$ 183266 184775 185001 183824 181374 178198 175307 173553 172829 172223 171088 169607 168172 166751 165282 164288
52843A64288J96J392J788J277K71p40j236r25k95k44q21r85j41Q75J012N47M77
$$ 164288 164484 165876 167664 168941 169212 168472 167236 166311 166016 165772 164951 163966 163825 164700 165712 166259 166736
52826A66736Q49P62j28j122j598j699j756j704j359p76j23L94N10J79j04J92Q79
$$ 166736 167585 168347 168219 167097 165499 163800 162044 160340 158981 158205 158082 158476 158986 159165 159061 159253 160132
52809A60132J309J350J514K094K783L150K970K041M14j182j855j623j379j634
$$ 160132 161441 162791 164305 166399 169182 172332 175302 177343 177757 176575 174720 173097 171718 170084
52795A70084k043k267k394k270j392L9R03N61k37n60n58q14j092p68rM59M54L81
$$ 170084 168041 165774 163380 161110 159718 159757 160660 161221 160984 160424 159866 159052 157960 157192 157183 157642 158096 158477
52777A58477L68J74j51k74j06K28P15J179R77j74j404j555p28k4J06K74Q04J127
$$ 158477 158845 159019 158868 158594 158488 158716 159431 160610 161587 161413 160009 158454 157726 157702 157808 158082 158886 160013
52759A60013Q05L14K67N46O77N38K35k24p36r50o72j85J67L85O13Q06Q36O70L63
$$ 160013 160818 161132 161399 161945 162622 163160 163395 163171 162435 161485 160813 160628 160795 161180 161793 162599 163435 164105 164468
52740A64468Q1J68Q26J612J805J346R50J053J223R12L23R7N13J331K166K660K520
$$ 164468 164549 164717 165543 167155 168960 170306 171256 172309 173532 174444 174767 174864 175377 176708 178874 181534 184054
52723A84054J766P79j21r22j580j782j383q29p19j129j656j898j663q57L10J157
$$ 184054 185820 186599 186478 185556 183976 182194 180811 179982 179263 178134 176478 174580 172917 172060 172370 173527
52707A73527R62k43j560k007j374l30K84K27J3K26Q60J378J374Q89J86m64p77
$$ 173527 174489 174246 172686 170679 169305 168975 169259 169486 169499 169725 170585 171963 173337 174226 174412 173948 173171
52690A73171n96j36K52O11J295K264K915K757J941R28K8n30n64k15L1r8l97o99
$$ 173171 172575 172439 172691 173302 174597 176861 179776 182533 184474 185402 185430 184900 184336 184121 184152 184054 183657 182958
52672A82958j148j647j575n94O68J296J258J238J551J794J605J129O25J30l20
$$ 182958 181810 180163 178588 177994 178662 179958 181216 182454 184005 185799 187404 188533 189158 189288 188968
52657A88968n25l86o6L07Q50J564J945J285m63k275k892k107j025p04r16p13J2
$$ 188968 188443 188057 187991 188298 189148 190712 192657 193942 193479 191204 188312 186205 185180 184476 183560 182847 182859
52640A82859L47j74p88o71j32K0k41k92O0M69Q24J410K238K872K964K481J458
$$ 182859 183206 183032 182244 181573 181441 181461 181220 180928 180988 181457 182281 183691 185929 188801 191765 194246 195704
52623A95704P0j065j300p98l87m71o74o64o62q62r08m20L33P96Q26O65M22K8m14
$$ 195704 195774 194709 193409 192611 192224 191753 191079 190415 189753 188891 187983 187563 187896 188692 189518 190183 190605 190633 190219
52604A90219o32n11k27K8K53N78J065J573J789J517R73N69M27K19k95q03p81k15
$$ 190219 189587 189076 188849 188877 189130 189708 190773 192346 194135 195652 196625 197194 197621 197840 197545 196742 195961 195746
52586A95746K70J14m29n10L23J507K014J489N58J7J6K15L44L39J07l72q36r85
$$ 195746 196016 196130 195701 195191 195514 197021 199035 200524 201082 201099 201115 201330 201674 202013 202120 201748 200912 199927
52568A99927q47o45l69J08N82O29K36j92m26o38r51j207j358j580j767j386k83
$$ 199927 199080 198435 198066 198174 198756 199385 199621 199429 199003 198365 197414 196207 194849 193269 191502 190116 189833
52551A89833P64Q06j07r51r30k65K32P5n07q77o07J10O31N43J05m7L88J077J519
$$ 189833 190597 191403 191296 190345 189415 189150 189382 189457 188950 188073 187466 187576 188207 188750 188855 188808 189196 190273 191792
52532A91792J595J586J594J242J72j227j951j484m92m9l35o51n61m36o23p50l21
$$ 191792 193387 194973 196567 197809 197981 196754 194803 193319 192827 192778 192443 191792 191231 190795 190172 189422 189101
52515A89101L99P24O30Q41J751K830L339L281L200L288L177K591J782J102M77
$$ 189101 189500 190224 190854 191695 193446 196276 199615 202896 206096 209384 212561 215152 216934 218036 218513
52500B18513l07j067j390j332j449j965k373k146j504j030q78p83o92p71q90o65
$$ 218513 218206 217139 215749 214417 212968 211003 208630 206484 204980 203950 203072 202289 201597 200826 199936 199271
52484A99271j26K23J67R1L29O35O60N06M68N23M68L39L29M75O99J011J357J506
$$ 199271 199145 199368 199535 199626 199955 200590 201250 201756 202224 202747 203215 203554 203883 204358 205057 206068 207425 208931
52466B08931J355J159J128J062P84O49J120J961K504K613K730K861K293O97j112
$$ 208931 210286 211445 212573 213635 214419 215068 216188 218149 220653 223266 225996 228857 231150 231847 230735
52451B30735k111k342k566k960k932k289j788k106k753k625j413K2O72L76l00
$$ 230735 228624 226282 223716 220756 217824 215535 213747 211641 208888 206263 204850 204872 205544 205920 205620
52436B05620p79q42n44r2K37K99K11J92K64K58J06k6N2K97M29K26j96m16j41M55
$$ 205620 204841 203999 203455 203363 203600 203899 204110 204302 204566 204824 204930 204904 204956 205253 205682 205908 205712 205296 205155 205610
52416B05610R51J311J909K876L725M078M437N713Q025J0511J2343J3297J3162
$$ 205610 206561 207872 209781 212657 216382 220460 224897 230610 238635 249146 261489 274786 287948
52403B87948J1227P028J307m246q170r912r691q262o697n780n387m764l601k433
$$ 287948 299175 306203 307510 303264 295094 285182 275491 267229 260532 254752 249365 244601 241000 238567
52389B38567j843j625j140k38N74R09R17Q01L97l79r06k77J557L494M391M172
$$ 238567 236724 235099 233959 233721 234295 235204 236121 236922 237319 236940 236034 235757 237314 240808 245199 249371
52373B49371L550L035K672K555K980L922M821N141M852M254L652L223K932K377
$$ 249371 252921 255956 258628 261183 264163 268085 272906 278047 282899 287153 290805 294028 296960 299337
52359B99337J128n17j569j445o85j62L0M10J080J554J596J577J892K472L116L874
$$ 299337 300465 299948 298379 296934 296249 296087 296117 296527 297607 299161 300757 302334 304226 306698 309814 313688
52343C13688M882O066P214Q099Q469Q274Q063Q684J0300J2055J3084J3547J4253
$$ 313688 318570 324636 331850 339949 348418 356692 364755 373439 383739 395794 408878 422425 436678
52330D36678J5474J6706J7523J8110J8783J9449J9854K0027K0147K0163J9919
$$ 436678 452152 468858 486381 504491 523274 542723 562577 582604 602751 622914 642833
52319F42833J9567J9494J9702J9596J8542J6505J4018J1642R661Q189P247O646
$$ 642833 662400 681894 701596 721192 739734 756239 770257 781899 791560 799749 806996 813642
52307H13642N959M814L206J486Q6p27r85j075j505k464l557m161m051l533l034
$$ 813642 819601 824415 827621 829107 829193 828466 827481 826406 824901 822437 818880 814719 810668 807135 804101
52292H04101k769k868l492m563n552n873n433m575l493j998N4K420M686O696Q567
$$ 804101 801332 798464 794972 790409 784857 778984 773551 768976 765483 763485 763539 765959 770645 777341 785908
52277G85908J0451J2410J4313J5730J6087J5284J4055J3400J3632J4215J4430
$$ 785908 796359 808769 823082 838812 854899 870183 884238 897638 911270 925485 939915
52266I39915J3937J2675J0734Q480O422M733L197J810J051J102J223M34j227k729
$$ 939915 953852 966527 977261 985741 992163 996896 1000093 1001903 1002954 1004056 1005279 1005713 1004486 1001757
52252A001757l299l173l019l127l412l828m451n342o558q104r648j0579j0543
$$ 1001757 998458 995285 992266 989139 985727 981899 977448 972106 965548 957444 947796 937217 926674
52239I26674r868r114q391p356n886m407l459l066k728j970q52J69P29Q92R64
$$ 926674 916806 907692 899301 891945 886059 881652 878193 875127 872399 870429 869577 869746 870475 871367 872331
52224H72331J221J850K903M059M668M418L842L743M190M555M575M725N392O284
$$ 872331 873552 875402 878305 882364 887032 891450 895292 899035 903225 907780 912355 917080 922472 928756
52210I28756P049P834Q759R179Q258O087L681J958J183J266J948K722L086K999
$$ 928756 935805 943639 952398 961577 969835 975922 979603 981561 982744 984010 985958 988680 991766 994765
52196I94765K715K235J430O44M46O33K53j031k253k388j664j031q08o67o78j333
$$ 994765 997480 999715 1001145 1001789 1002235 1002868 1003121 1002090 999837 997449 995785 994754 993946 993279 992601 991268
52180I91268k474l140k900k607l272m648n602n660n417n444n473m949l890k712
$$ 991268 988794 985654 982754 980147 976875 972227 966625 960965 955548 950104 944631 939682 935792 933080
52166I33080j610n55K33M32K80N17J422K358K694K765L312M285M850M568L828
$$ 933080 931470 930915 931148 931580 931860 932377 933799 936157 938851 941616 944928 949213 954063 958631 962459
52151I62459K986J862M31o79r99r55j094r48L50K443L793L583K729K531L061L531
$$ 962459 965445 967307 967738 967059 966060 965105 964011 963063 963413 965856 969649 973232 975961 978492 981553 985084
52135I85084L737M350N917Q188J0484J2289J3569J4780J6488J8655K0564K1831
$$ 985084 988821 993171 999088 1007276 1017760 1030049 1043618 1058398 1074886 1093541 1114105 1135936
52123A135936K3095K5116K7393K8561K8215K7410K6999K6357K4413K1333J8324
$$ 1135936 1159031 1184147 1211540 1240101 1268316 1295726 1322725 1349082 1373495 1394828 1413152
52112A413152J6012J3818J0996P620M303J320j662n074q769j1941j3823j4469
$$ 1413152 1429164 1442982 1453978 1461598 1465901 1467221 1465559 1460485 1451716 1439775 1425952 1411483
52100A411483j4647j4807j4541j3271j1185r082p494o400n615m983m248l206k071
$$ 1411483 1396836 1382029 1367488 1354217 1343032 1333950 1326456 1320056 1314441 1309458 1305210 1302004 1299933
52087A299933j311j082j081r63n32M14J992L892N580O958Q461J0411J2589J4511
$$ 1299933 1298622 1297540 1296459 1295496 1294964 1295378 1297370 1301262 1306842 1313800 1322261 1332672 1345261 1359772
52073A359772J5769J6027J5210J3834J2785J2356J1972J1061R815Q689P519N707
$$ 1359772 1375541 1391568 1406778 1420612 1433397 1445753 1457725 1468786 1478601 1487290 1494809 1500516
52061A500516L096J93k474m816o956q956j0802j2462j3802j4613j4846j4766j4859
$$ 1500516 1503612 1503805 1501331 1496515 1489559 1480603 1469801 1457339 1443537 1428924 1414078 1399312 1384453
52048A384453j5540j6827j8267j9300j9794k0068k0339k0343j9726j8615j7502
$$ 1384453 1368913 1352086 1333819 1314519 1294725 1274657 1254318 1233975 1214249 1195634 1178132
52037A178132j6587j5493j3781j1518r219p223n379l373j320L05J360K316L572
$$ 1178132 1161545 1146052 1132271 1120753 1111534 1104311 1098932 1095559 1094239 1094544 1095904 1098220 1101792
$$ [...]
##END NTUPLES=NMR SPECTRUM
##END=
