##TITLE=NES1097_ptc170_9887054_qLuaFzhWXO
##JCAMPDX= 6.0         $$ Bruker NMR JCAMP-DX V2.0
##DATA TYPE= NMR SPECTRUM
##DATA CLASS= NTUPLES
##ORIGIN= BRUKER
##OWNER= Administrator
$$ 1.72 TOPSPIN		Version 2.1
$$ 2016-08-28 21:41:05.945 -0500  Administrator@X
$$ Compression mode = diff/dup
##.OBSERVE FREQUENCY= 400.02188249412
##.OBSERVE NUCLEUS= ^1H
##.ACQUISITION MODE= SIMULTANEOUS (DQD)
##.ACQUISITION SCHEME= undefined
##.AVERAGES= 64
##.DIGITISER RES= 22
##SPECTROMETER/DATA SYSTEM= spect
##.PULSE SEQUENCE= noesygpps1d.comp
##.SOLVENT NAME= COFFEE_meoh
##.SHIFT REFERENCE= INTERNAL, COFFEE_meoh, 1, 14.96069
##AUDIT TRAIL= $$ (NUMBER, WHEN, WHO, WHERE, PROCESS, VERSION, WHAT)
$$ ##TITLE= Audit trail, TOPSPIN		Version 2.1
$$ ##JCAMPDX= 5.01
$$ ##ORIGIN= Bruker BioSpin GmbH
$$ ##OWNER= Administrator
$$ $$ E:\/data/COFFEE/nmr/NES1097_ptc170_9887054_qLuaFzhWXO/12/pdata/1/auditp.txt
$$ ##AUDIT TRAIL=  $$ (NUMBER, WHEN, WHO, WHERE, PROCESS, VERSION, WHAT)
(   1,<2016-08-28 21:41:00.804 -0500>,<Administrator>,<X>,<go>,<TOPSPIN 2.1>,
      <created by zg
	started at 2016-08-28 21:29:30.914 -0500,
	POWCHK enabled, PULCHK disabled,
       configuration hash MD5:
       21 0F 79 D6 B3 7B B4 F6 88 20 88 DB 03 48 BD 9F
       data hash MD5: 64K
       E4 8C B6 EC CA 34 92 F9 4A 36 3F E8 ED 14 6A 13>)
(   2,<2016-08-28 21:41:03.929 -0500>,<Administrator>,<X>,<proc1d>,<TOPSPIN 2.1>,
      <Start of raw data processing
       efp LB = 0.3 FT_mod = 6 PKNL = 1 PHC0 = 0 PHC1 = 0 SI = 128K 
       data hash MD5: 128K
       F7 8D 9B 09 4B 7F 16 EC 5E 3C 63 B4 77 8B 16 A2>)
(   3,<2016-08-28 21:41:04.789 -0500>,<Administrator>,<X>,<proc1d>,<TOPSPIN 2.1>,
      <pk PHC0 = -82.18323 PHC1 = 0 
       data hash MD5: 128K
       CE 15 77 FA FF FE 82 D9 84 69 C8 3D 5F 0B 63 C2>)
(   4,<2016-08-28 21:41:05.148 -0500>,<Administrator>,<X>,<proc1d>,<TOPSPIN 2.1>,
      <abs ABSG = 1 
       data hash MD5: 128K
       7B 38 70 C6 3C F6 AE C4 14 0A DF 47 F2 CF 77 48>)
(   5,<2016-08-28 21:41:05.242 -0500>,<Administrator>,<X>,<proc1d>,<TOPSPIN 2.1>,
      <abs ABSG = 2 
       data hash MD5: 128K
       EC A7 3D 2E B8 83 BA B4 67 42 17 19 4D 62 DF 94>)
(   6,<2016-08-28 21:41:05.320 -0500>,<Administrator>,<X>,<proc1d>,<TOPSPIN 2.1>,
      <abs ABSG = 3 
       data hash MD5: 128K
       05 F8 EC B8 2B 9E A8 61 19 91 11 FB 87 36 66 89>)
(   7,<2016-08-28 21:41:05.414 -0500>,<Administrator>,<X>,<proc1d>,<TOPSPIN 2.1>,
      <abs ABSG = 4 
       data hash MD5: 128K
       67 AF 51 48 82 0B CD 79 98 DC E2 31 90 2E 8D 9A>)
(   8,<2016-08-28 21:41:05.523 -0500>,<Administrator>,<X>,<proc1d>,<TOPSPIN 2.1>,
      <abs ABSG = 5 
       data hash MD5: 128K
       63 92 DE 1C 83 31 E5 32 74 A5 C2 BC D1 C7 FB 9F>)
$$ ##END=
$$ 
$$ $$ hash MD5
$$ $$ C0 F2 3A AA 39 F8 71 9D 9E BA CE C3 B8 0B C9 D0
##$RELAX= 
##$RELAX= 
##$RELAX= 
##$RELAX= 
##$RELAX= 
##$RELAX= 
##$RELAX= 
##$RELAX= 
$$ Bruker specific parameters
$$ --------------------------
##$DU= <E:\>
##$EXPNO= 12
$$ [...]
##$TP07= 0
##$TPNAME0= <>
##$TPNAME1= <>
##$TPNAME2= <>
##$TPNAME3= <>
##$TPNAME4= <>
##$TPNAME5= <>
##$TPNAME6= <>
##$TPNAME7= <>
##$TPOAL= (0..7)
0.5 0.5 0.5 0.5 0.5 0.5 0.5 0.5
##$TPOFFS= (0..7)
0 0 0 0 0 0 0 0
##$TUNHIN= 0
##$TUNHOUT= 0
##$TUNXOUT= 0
##$USERA1= <user>
##$USERA2= <user>
##$USERA3= <user>
##$USERA4= <user>
##$USERA5= <user>
##$V9= 5
##$VALIST= <valist>
##$VCLIST= <CCCCCCCCCCCCCCC>
##$VD= 0
##$VDLIST= <DDDDDDDDDDDDDDD>
##$VPLIST= <PPPPPPPPPPPPPPP>
##$VTLIST= <TTTTTTTTTTTTTTT>
##$WBST= 2048
##$WBSW= 25
##$XGAIN= (0..3)
0 0 0 0
##$XL= 0
##$YL= 0
##$YMAX_a= 5491736
##$YMIN_a= -10352183
##$ZGOPTNS= <>
##$ZL1= 120
##$ZL2= 120
##$ZL3= 120
##$ZL4= 120
##$ABSF1= 14.96069
##$ABSF2= -5.597492
##$ABSG= 5
##$ABSL= 3
##$ALPHA= 0
##$AQORDER= 0
##$ASSFAC= 0
##$ASSFACI= 0
##$ASSFACX= 0
##$ASSWID= 0
##$AUNMP= <proc_prof1d_extract.lims>
##$AXLEFT= 0
##$AXNAME= <>
##$AXNUC= <1H>
##$AXRIGHT= 0
##$AXTYPE= 0
##$AXUNIT= <>
##$AZFE= 0.1
##$AZFW= 0.1
##$BCFW= 0
##$BC_mod= 0
##$BYTORDP= 0
##$COROFFS= 0
##$CY= 15
##$DATMOD= 1
##$DC= 0
##$DFILT= <>
##$DTYPP= 0
##$F1P= 0
##$F2P= 0
##$FCOR= 0.5
##$FTSIZE= 131072
##$FT_mod= 6
##$GAMMA= 0
##$GB= 0
##$INTBC= 1
##$INTSCL= 1
##$ISEN= 128
##$LB= 0.3
##$LEV0= 0
##$LPBIN= 0
##$MAXI= 10000
##$MC2= 0
##$MEAN= 0
##$ME_mod= 0
##$MI= 0
##$NCOEF= 0
##$NC_proc= -2
##$NLEV= 6
##$NOISF1= 0
##$NOISF2= 0
##$NSP= 0
##$NTH_PI= 0
##$NZP= 0
##$OFFSET= 14.96069
##$PC= 1
##$PHC0= -82.18323
##$PHC1= 0
##$PH_mod= 1
##$PKNL= yes
##$PPARMOD= 0
##$PPDIAG= 0
##$PPIPTYP= 0
##$PPMPNUM= 2147483647
##$PPRESOL= 1
##$PSCAL= 4
##$PSIGN= 0
##$PYNMP= <proc.py>
##$REVERSE= no
##$SF= 400.020009760747
##$SI= 131072
##$SIGF1= 0
##$SIGF2= 0
##$SINO= 400
##$SIOLD= 131072
##$SPECTYP= <>
##$SREGLST= <1H.CDCl3>
##$SSB= 0
##$STSI= 131072
##$STSR= 0
##$SW_p= 8223.68421052631
##$SYMM= 0
##$S_DEV= 0
##$TDeff= 65536
##$TDoff= 0
##$TI= <>
##$TILT= no
##$TM1= 0
##$TM2= 0
##$TOPLEV= 0
##$USERP1= <user>
##$USERP2= <user>
##$USERP3= <user>
##$USERP4= <user>
##$USERP5= <user>
##$WDW= 1
##$XDIM= 131072
##$YMAX_p= 337787611
##$YMIN_p= -11904
##$CURPLOT= <Network HP LaserJet P1505>
##$CURPRIN= <$Network HP LaserJet P1505>
##$DFORMAT= <normdp>
##$LAYOUT= <+/1D_H.xwp>
##$LFORMAT= <normlp>
##$PFORMAT= <normpl>
##$SURQMSG= 1
$$ End of Bruker specific parameters
$$ ---------------------------------
##NTUPLES= NMR SPECTRUM
##VAR_NAME=  FREQUENCY,     SPECTRUM/REAL,   SPECTRUM/IMAG
##SYMBOL=    X,             R,               I
##VAR_TYPE=  INDEPENDENT,   DEPENDENT,       DEPENDENT
##VAR_FORM=  AFFN,          ASDF,            ASDF
##VAR_DIM=   131072,        131072,          131072
##UNITS=     HZ,            ARBITRARY UNITS, ARBITRARY UNITS
##FACTOR=    0.0627417313425164, 1,          1
##FIRST=     8223.62146879497, 2654,         -45303
##LAST=      0,             4248,            -45691
##MIN=       0,             -11904,          0
##MAX=       8223.62146879497, 337787611,    0
$$ Real data points
##PAGE= N=1
##DATA TABLE= (X++(R..R)), XYDATA
$$ [...]
64032B81480K118J189M40l66j438k695l796m472m771m926m975m693l811k260k72
64017B46752J555K437K032R08O3j30j79o00j319k098l007m026m624m384l718l344
64001B26318l278k958k294j829j841j969j908j833j871j669q91K99J444K202K341
63986B10263J867J345J597K694L730M036M106M779N917O621O530O144N954N980
63972B71563O202O803P646Q143P955P526P536Q112Q832R378R916J0913J2678J5020
63958C98223J7340J9306K1372K4333K8350L2803L7273M2244M8444N5866O3899
63947G89453P2252Q1160R0694J00285J09149J16885J23507J29057J33346J35889
63937A881677J36064J33411J27917J19826J09216R5956Q0198O2579M3758K3998
$$ y = [281480, 283598, 284787, 285227, 284861, 283423, 280728, 276932, 272460, 267689, 262763, 257788, 253095, 249284, 247024, 246752, 248307, 250744, 252776, 253684, 253747, 253617, 253438, 252838, 251519, 249421, 246414, 242388, 237764, 233380, 229662, 226318, 223040, 220082, 217788, 215959, 214118, 212149, 210241, 208408, 206537, 204868, 203977, 204276, 205720, 207922, 210263, 212130, 213475, 215072, 217766, 221496, 225532, 229638, 234417, 240334, 246955, 253485, 259629, 265583, 271563, 277765, 284568, 292214, 300357, 308312, 315838, 323374, 331486, 340318, 349696, 359612, 370525, 383203, 398223, 415563, 434869, 456241, 480574, 508924, 541727, 579000, 621244, 669688, 725554, 789453, 861705, 942865, 1033559, 1133844, 1242993, 1359878, 1483385, 1612442, 1745788, 1881677, 2017741, 2151152, 2279069, 2398895, 2508111, 2604067, 2684265, 2746844, 2790602, 2814600]
63927B814600L495j7146l7108n5971p3639q9640j03068j13445j21230j26963j30302
63916A949583j30538j27960j23901j19205j13344j05542r6260q6839p8026o9608
63906H98360o1460n4100m7893m2431l7156l2200k8047k4679k1525j8193j4874
63895E15802j2081j0205r237q677p951p064o552o536o240m995l325k259j827j068
63881D27785M47K058L221M398O245Q498J0361J1583J2529J3467J4326J5023J5552
63868E45493J5765J5479J4736J3750J2666J1576J0513R259P391M887K410O39m98
63855F64066j559k858m406o328q775j1436j3659j5128j6083j6914j7804j8716
63843E30400j9443j9707j9469j9047j8672j8224j7636j7210j7055j6610j5360
$$ y = [2814600, 2818095, 2800949, 2763841, 2707870, 2634231, 2544591, 2441523, 2328078, 2206848, 2079885, 1949583, 1819045, 1691085, 1567184, 1447979, 1334635, 1229093, 1132833, 1045994, 967968, 898360, 836900, 782800, 734907, 692476, 655320, 623120, 595073, 570394, 548869, 530676, 515802, 503721, 493516, 484279, 475602, 467651, 460587, 454035, 447499, 441259, 436264, 432939, 430680, 428853, 427785, 428232, 430290, 433511, 437909, 444154, 452652, 463013, 474596, 487125, 500592, 514918, 529941, 545493, 561258, 576737, 591473, 605223, 617889, 629465, 639978, 649237, 656628, 661515, 663925, 664564, 664066, 662507, 659649, 655243, 648915, 640140, 628704, 615045, 599917, 583834, 566920, 549116, 530400, 510957, 491250, 471781, 452734, 434062, 415838, 398202, 380992, 363937, 347327, 331967]
63832C31967j3742j2527j1572j0119q281p244p648q628q894q150o998o018n377
63819B16769m961m519l932l502l581l830l453k342j384j272j704k076k336k627
63805A75250k682k196j408p65l13N3J52j61n67p29p97j012j125p75j70J49m0o67
63787A62197j638k586k757j861o83j73k53k56j43l82q65r76o65n11o60o80n01
63770A46607n67q24n86J90N26j12q53o35K40O39K37k10rP23J432J669J237K91
63752A49995n93q07l06L02L36l00r60p79M90K078K862K438J420O29L89O13J209
63735A59016K008K605K635K120J413Q62O56Q58J372J999K572K990L162L146L251
63720A90665L707M209M216L745L419L519L461K609J224J68j60j67m35j139j965
$$ y = [331967, 318225, 305698, 294126, 284007, 275726, 268482, 260834, 252206, 243312, 235162, 228164, 222146, 216769, 211808, 207289, 203357, 199855, 196274, 192444, 188991, 186649, 185265, 183993, 182289, 180213, 177877, 175250, 172568, 170372, 168964, 168199, 167886, 167939, 168091, 167930, 167363, 166634, 165837, 164825, 163700, 162925, 162755, 162904, 162864, 162197, 160559, 157973, 155216, 153355, 152672, 152499, 152246, 151990, 151847, 151465, 150600, 149624, 148959, 148448, 147788, 147108, 146607, 146040, 145216, 144630, 144820, 145346, 145234, 144381, 143746, 143986, 144625, 144862, 144652, 144643, 145366, 146798, 148467, 149704, 149995, 149402, 148595, 148289, 148591, 148927, 148627, 147667, 146888, 147378, 149456, 152318, 154756, 156176, 156805, 157194, 157807, 159016, 161024, 163629, 166264, 168384, 169797, 170659, 171315, 172173, 173545, 175544, 178116, 181106, 184268, 187414, 190665, 194372, 198581, 202797, 206542, 209961, 213480, 216941, 219550, 220774, 220942, 220782, 220615, 220180, 219041, 217076]
63705B17076k432k301j884j830k402l042k919j845m56M72O86N09M25O30R46J135
63689B02768J210J307J330J055O53P18J609K982M154M629M169K778R97j91k38
63674B29930L55P08O14N60Q37J213J472J759K237K759L037K853K116R85p5o90
63658B50670j046j599k314k678k567k626l377m417m930m739m316l907l198j945
63644B07011n07N18Q68P02L22J05L90J220K203K885L175L201L030K832L168M511
63628B35634O406P580P289O107N231N278O128P428Q719R395R253R029R758J1518
63614C44753J3402J4813J6138J7954K0132K2157K3933K5759K7744K9605L0932
63603E87322L1393L0764K8954K5962K1819J6766J1434O441J889k278n476o850
$$ y = [217076, 214644, 212343, 210459, 208629, 206227, 203185, 200266, 198421, 197965, 198437, 199123, 199632, 200057, 200687, 201633, 202768, 203978, 205285, 206615, 207670, 208323, 209041, 210650, 213632, 217786, 222415, 226584, 229362, 230359, 230168, 229930, 230285, 230993, 231607, 232167, 233004, 234217, 235689, 237448, 239685, 242444, 245481, 248334, 250450, 251435, 251360, 250670, 249624, 248025, 245711, 243033, 240466, 237840, 234463, 230046, 225116, 220377, 216061, 212154, 208956, 207011, 206504, 207022, 207890, 208592, 208914, 209019, 209409, 210629, 212832, 215717, 218892, 222093, 225123, 227955, 231123, 235634, 242040, 249620, 256909, 263016, 268247, 273525, 279653, 287081, 295800, 305195, 314448, 323477, 333235, 344753, 358155, 372968, 389106, 407060, 427192, 449349, 473282, 499041, 526785, 556390, 587322, 618715, 649479, 678433, 704395, 726214, 742980, 754414, 760855, 762744, 760466, 754990, 748140]
63591G48140o710o712p994r879j1230j2390j4631j8029k1215k3274k4598k5520
63579E65958k5367k3636k1209j9379j8194j6753j4846j3177j1959j0375p849n087
63567C78127l131j941o23J150K712L541M132N360P356R434J0957J1921J2757J3866
63553D55618J5325J6879J8226J9465K1152K3713K6943L0320L3538L6391L8336
63542G35906L8691L7214L3937K8637K1200J2595M599j785o893j0990j3311j3258
63530H66542j1844j0833j0742j0778j0647j1300j3631j7262k1085k4416k7187
63519F96817k9492l1322l2580l3056l2548l1127k9095k6640k3853k1047j8647
63508C87410j6654j4646j2503j0700r581q764p701o509n780n629n431m654l559
$$ y = [748140, 741430, 734718, 726724, 716845, 705615, 693225, 678594, 660565, 639350, 616076, 591478, 565958, 540591, 516955, 495746, 476367, 458173, 441420, 426574, 413397, 401438, 391063, 383214, 378127, 374996, 373055, 372432, 373582, 376294, 379835, 383967, 389327, 396683, 406117, 417074, 428995, 441752, 455618, 470943, 487822, 506048, 525513, 546665, 570378, 597321, 627641, 661179, 697570, 735906, 774597, 811811, 845748, 874385, 895585, 908180, 912779, 910994, 904101, 893111, 879800, 866542, 854698, 843865, 833123, 822345, 811698, 800398, 786767, 769505, 748420, 724004, 696817, 667325, 636003, 603423, 570367, 537819, 506692, 477597, 450957, 427104, 406057, 387410, 370756, 356110, 343607, 332907, 323326, 314562, 306861, 300352, 294572, 288943, 283512, 278858, 275299]
63495B75299k857k836l070k997k581k226k136k001j440n48J67L17Qk29J38J170
63479B54178K275K766K683K740L329L941L941L502L257L298L148K524J515J42
63465B93239j561l046l623l405l210l363l282k576j724j283j094q31o84q62r45
63450B61750m42L45P57Q86J531L062M976O575P617Q227Q682R411J0767J2667J4769
63435C51580J7060J9891K3279K6459K8323K8244K6424K3550K0157J6244J1712
63424E92923P217M189L620N047P229R680J2950J7340K2102K6267K9744L3009L5925
63411H07242L7383L6309L2665K7387K1491J5424R220L104k254o143q409r539j0224
63398I53656j0983j2153j4032j6826k0464k4531k8411l1580l3815l5140l5580
$$ y = [275299, 272442, 269606, 266536, 263539, 260958, 258732, 256596, 254595, 253155, 252607, 252774, 253091, 253099, 252870, 253008, 254178, 256453, 259219, 261902, 264642, 267971, 271912, 275853, 279355, 282612, 285910, 289058, 291582, 293097, 293239, 291678, 288632, 285009, 281604, 278394, 275031, 271749, 269173, 267449, 266166, 265072, 264241, 263557, 262695, 261750, 261308, 261653, 262410, 263296, 264827, 267889, 272865, 279440, 287057, 295284, 303966, 313377, 324144, 336811, 351580, 368640, 388531, 411810, 438269, 466592, 494836, 521260, 544810, 564967, 581211, 592923, 600140, 604329, 607949, 612996, 620225, 629905, 642855, 660195, 682297, 708564, 738308, 771317, 807242, 844625, 880934, 913599, 940986, 962477, 977901, 987121, 990225, 987971, 981828, 973419, 963880, 953656, 942673, 930520, 916488, 899662, 879198, 854667, 826256, 794676, 760861, 725721, 690141]
63387F90141l5103l3826l2092l0172k7962k5205k1984j8758j5912j3432j1088
63376D24607q804o720m978l524k099m28J590L880O322Q815J1110J2858J4016J5137
63362D71782J6916J9397K1899K3856K5542K7727L0670L3731L5995L7139L7512
63351G82166L7404L6506L4225L0382K5383J9722J3603P187R82m285q143j0601
63339I64531j2001j2819j3563j4614j6086j7937k0133k2670k5434k8179l0544
63328G50551l2094l2475l1730l0298k8534k6277k3189j9352j5331j1650q618o615
63316D84388o152p348r621j2146j4437j6355j7729j8272j7823j6482j4507j2253
63304C21263j0153q589p687p197o669n797m669l672l035k562j988j561j866k926
$$ y = [690141, 655038, 621212, 589120, 558948, 530986, 505781, 483797, 465039, 449127, 435695, 424607, 415803, 409083, 404105, 400581, 398482, 398054, 399644, 403524, 409846, 418661, 429771, 442629, 456645, 471782, 488698, 508095, 529994, 553850, 579392, 607119, 637789, 671520, 707515, 744654, 782166, 819570, 856076, 890301, 920683, 946066, 965788, 979391, 986578, 987560, 983275, 975132, 964531, 952530, 939711, 926148, 911534, 895448, 877511, 857378, 834708, 809274, 781095, 750551, 718457, 685982, 654252, 623954, 595420, 569143, 545954, 526602, 511271, 499621, 491003, 484388, 478236, 470888, 461267, 449121, 434684, 418329, 400600, 382328, 364505, 348023, 333516, 321263, 311110, 302521, 294834, 287637, 280968, 275171, 270502, 266830, 263795, 261233, 259245, 257684, 255818, 252892]
63290B52892l816l579k366j271j080j565k048k192k027j594r64m34k97m15l82
63275B28862q5K13L36L70K81j75r27j362j059m30j65k40l1O80J454J999K509K996
63257B35226K965K260J657J977K954L668L831L993M494N030N385N882O783P766
63243B93871Q387Q716R070R457R667R846J0537J2099J4198J5971J6682J6391J5947
63230D50839J6134J6832J7271J7134J6928J7126J7441J7348J6943J6762J6990
63219F37748J7270J7297J7089J6756J6373J5990J5345J3647J0196N323K27m209
63207G79052q100j1943j5815j9349k2051k3447k3366k2333k1314k0689j9873j8223
63195E52549j5902j3370j0595p402m228j654P05L858P833J1309J3245J4132J5119
$$ y = [252892, 249076, 245497, 243131, 241860, 240780, 239215, 237167, 234975, 232948, 231354, 230390, 229956, 229659, 229244, 228862, 228777, 228990, 229326, 229696, 229977, 229802, 228875, 227513, 226454, 226024, 225859, 225619, 225588, 226268, 227722, 229721, 232230, 235226, 238191, 240451, 242108, 244085, 247039, 250707, 254538, 258531, 263025, 268055, 273440, 279322, 286105, 293871, 302258, 310974, 320044, 329501, 339168, 349014, 359551, 371650, 385848, 401819, 418501, 434892, 450839, 466973, 483805, 501076, 518210, 535138, 552264, 569705, 587053, 603996, 620758, 637748, 655018, 672315, 689404, 706160, 722533, 738523, 753868, 767515, 777711, 783034, 783261, 779052, 770952, 759009, 743194, 723845, 701794, 678347, 654981, 632648, 611334, 590645, 570772, 552549, 536647, 523277, 512682, 505280, 501052, 499398, 500103, 503961, 511794, 523103, 536348, 550480, 565599]
63182E65599J6505J7815J8832J9733K0398K0465K0089J9895J9966J9536J8075
63171G76908J6143J4730J3994J3169J1476Q733N130R50l420p584j1501j5523j9824
63158H03381k3931k7042k8828k9706l0321l0898l1153l0689k9334k7236k4792
63147D89451k2473k0516j8754j6879j4902j3173j1851j0632r147p501o173n407
63135C32043n006m622m068l276k290j290n02P2O43J292J816J997J916J873K090
63120C22688K504K737K408J612J037J298K164K850L088L343L862M178L943L644
63106C61356L793L905L163J820R76R19P84J02l37K51J337J873J808J862K194K259
63090C88065J871J490J312R58L42J1K27M20P7l70k36L00N20L69N74J544K861L959
$$ y = [565599, 582104, 599919, 618751, 638484, 658882, 679347, 699436, 719331, 739297, 758833, 776908, 793051, 807781, 821775, 834944, 846420, 855153, 860283, 861233, 857813, 850229, 838728, 823205, 803381, 779450, 752408, 723580, 693874, 663553, 632655, 601502, 570813, 541479, 514243, 489451, 466978, 446462, 427708, 410829, 395927, 382754, 370903, 360271, 351124, 343623, 337450, 332043, 327037, 322415, 318347, 315071, 312781, 311491, 310989, 311061, 311704, 312996, 314812, 316809, 318725, 320598, 322688, 325192, 327929, 330337, 331949, 332986, 334284, 336448, 339298, 342386, 345729, 349591, 353769, 357712, 361356, 365149, 369054, 372217, 374037, 375013, 375932, 376716, 376818, 376481, 376732, 378069, 379942, 381750, 383612, 385806, 388065, 389936, 391426, 392738, 393696, 394038, 394049, 394276, 394696, 394773, 394403, 394167, 394467, 394987, 395356, 395930, 397474, 400335, 404294]
63072D04294M701N175N431N719O490P827R287J0491J1576J2793J4018J5108J6315
63059E29225J7922J9697K1228K2640K4464K6904K9727L2740L5811L8457M0064
63048H38879M0745M1361M2430M3493M3883M3644M3248M2775M2025M1292M1345
63037A305120M2514M4118M5024M4628M3125M0985L8282L4623K9646K3401J6138
63026A707604P830j621j1769k1628l0411l7919m4035m8399n0944n2227n2693n1946
63014A311842m9374m5289m0684l6025l0948k5158j8891j2347n500J340P360J2155
63002A068481J6259K0377K4535K8341L1545L3908L5030L4930L4459L4464L4796
62991A397125L4746L4196L3509L2478L0326K6892K2965J9051J4542Q641J493o187
$$ y = [404294, 408995, 414170, 419601, 425320, 431810, 439637, 448924, 459415, 470991, 483784, 497802, 512910, 529225, 547147, 566844, 588072, 610712, 635176, 662080, 691807, 724547, 760358, 798815, 838879, 879624, 920985, 963415, 1006908, 1050791, 1094435, 1137683, 1180458, 1222483, 1263775, 1305120, 1347634, 1391752, 1436776, 1481404, 1524529, 1565514, 1603796, 1638419, 1668065, 1691466, 1707604, 1715434, 1713813, 1702044, 1680416, 1650005, 1612086, 1568051, 1519652, 1468708, 1416481, 1363788, 1311842, 1262468, 1217179, 1176495, 1140470, 1109522, 1084364, 1065473, 1053126, 1047626, 1048966, 1056326, 1068481, 1084740, 1105117, 1129652, 1157993, 1189538, 1223446, 1258476, 1293406, 1327865, 1362329, 1397125, 1431871, 1466067, 1499576, 1532054, 1562380, 1589272, 1612237, 1631288, 1645830, 1654471, 1655964, 1649777]
62979A649777j4103k2404l0939l9201m6809n3489n8688o1867o3171o3260o2365
62968A133481o0181n6769n2870m9023m5038m0798l6912l3904l1248k8067k4562
62957F74109k1803k0140j8728j6875j4933j3512j2546j1783j1534j2146j3073
62946E07036j3293j2518j1384j0425r564q742q372q823r754j0314r893q608p181
62933C78165o346o168o039n487m816m573m616m310l513k730k156j399m36p2p72
62918C24732j662j506m09L38O0m94l41L90P35J43r75j805j930j606j429j815k654
62901C09772l434l647l091j996r32m54o59j091j217r30m59K8N27R68J159R88N55
62884B96087P8k36k66j15j8MK22P42J182J117P02M20L60J79k21n05m75l62l41
$$ y = [1649777, 1635674, 1613270, 1582331, 1543130, 1496321, 1442832, 1384144, 1322277, 1259106, 1195846, 1133481, 1073300, 1016531, 963661, 914638, 869600, 828802, 791890, 757986, 726738, 698671, 674109, 652306, 632166, 613438, 596563, 581630, 568118, 555572, 543789, 532255, 520109, 507036, 493743, 481225, 469841, 459416, 449852, 441110, 432738, 423915, 414161, 403847, 393954, 385346, 378165, 371819, 365651, 359612, 354125, 349309, 344736, 340120, 335810, 332297, 329567, 327411, 326012, 325576, 325504, 324732, 323070, 321564, 321155, 321493, 321553, 321059, 320718, 321108, 321843, 321986, 321011, 319206, 317276, 315670, 314241, 312426, 309772, 306338, 302691, 299600, 297604, 296672, 296218, 295559, 294468, 293251, 292321, 291862, 291890, 292417, 293385, 294544, 295532, 296087, 296165, 295929, 295663, 295548, 295530, 295534, 295756, 296498, 297680, 298797, 299499, 299919, 300279, 300458, 300237, 299732, 299257, 298895, 298554]
62865B98554k43K3J79O4K2L59P00L87n68j381j374o41K32P92R83R81R49R12Q76
62846C01806R51J165J201O71k24o91l11L22L71j82p08r41j119j230q81q6M77L68
62828C00959k5j21R1K99N07Q83J279J431J424J560J852K119K367K686K884K821
62812C23016K894L614M661N057M536M018M358N218N686N619N654O149O802P399
62798C94681Q263R661J1218J2242J2527J2554J2958J4054J5765J7799J9834K1761
62786E63317K3885K6786L0800L5618M0521M5084M9468N3987N8546O2717O6228
62775A056957O9063P1103P1941P1157O8503O3793N6945M8270L8439K7900J6594
62764A660665M438q082k0165l1311m1380n0143n7178o2231o5406o6985o7287o6634
$$ y = [298554, 298311, 298334, 298513, 298577, 298599, 298958, 299658, 300045, 299477, 298096, 296722, 296081, 296313, 297105, 298088, 299069, 300018, 300930, 301806, 302757, 303922, 305123, 305794, 305570, 304879, 304568, 304890, 305261, 305079, 304371, 303430, 302311, 301081, 300200, 300114, 300591, 300959, 300934, 300813, 300904, 301203, 301710, 302593, 303872, 305303, 306727, 308287, 310139, 312258, 314625, 317311, 320195, 323016, 325910, 329524, 334185, 339242, 343778, 347796, 352154, 357372, 363058, 368677, 374331, 380480, 387282, 394681, 402944, 412605, 423823, 436065, 448592, 461146, 474104, 488158, 503923, 521722, 541556, 563317, 587202, 613988, 644788, 680406, 720927, 766011, 815479, 869466, 928012, 990729, 1056957, 1126020, 1197123, 1269064, 1340221, 1408724, 1472517, 1529462, 1577732, 1616171, 1644071, 1660665, 1665103, 1657021, 1636856, 1605545, 1564165, 1514022, 1456844, 1394613, 1329207, 1262222, 1194935, 1128301]
62752A128301o5190o2895n9751n6165n2676m9385m5995m2323l8490l4583l0608
62741E90240k6818k3693k1407j9604j7823j5857j3666j1308r092p440o337n352
62729D11843m336l663l486l236k330j027l1M92J001J824K849L916N048O206P263
62714D22333Q262R423J0893J2742J5094J7886K0632K2910K5041K7769L1247L4907
62702F59139L8446M2325M6965N1988N6677O0810O4608O8104P0996P2924P3494
62691A306476P2193O8746O3458N6855M8972L9410K8015J5223J731j1773k4543
62680A664763l5962m6000n5078o3176o9387p2764p3465p2621p1102o8841o5474
62669I70893o1243n6889n2862m8978m4922m0720l6732l3329l0668k8530k6298
$$ y = [1128301, 1063111, 1000216, 940465, 884300, 831624, 782239, 736244, 693921, 655431, 620848, 590240, 563422, 539729, 518322, 498718, 480895, 465038, 451372, 440064, 430972, 423532, 417195, 411843, 407507, 403844, 400358, 397122, 394792, 393765, 393734, 394226, 395227, 397051, 399900, 403816, 408864, 415070, 422333, 430595, 440018, 450911, 463653, 478747, 496633, 517265, 540175, 565216, 592985, 624232, 659139, 697585, 739910, 786875, 838863, 895540, 956350, 1020958, 1089062, 1160058, 1232982, 1306476, 1378669, 1447415, 1510873, 1567728, 1616700, 1656110, 1684125, 1699348, 1701079, 1689306, 1664763, 1628801, 1582801, 1527723, 1464547, 1395160, 1322396, 1248931, 1176310, 1105208, 1036367, 970893, 909650, 852761, 799899, 750921, 705999, 665279, 628547, 595218, 564550, 536020, 509722]
62658E09722k3380j9852j6526j4132j2579j1290j0063r198q835q625q173p462
62646C59607o693o029n636n646n775n400m351l360l200l511l087j451L86J061
62632C06915L77o65j208j385j739k254k318j567m32K96L00m3j80O0M15N61N22
62615B97655P28J644L164M504M922M583M435N180O569P815Q411Q426Q333Q849
62601C75218J0622J3666J7060J9626K0948K1665K2808K4988K8007L0997L3089
62590F18694L4216L5058L5839L5467L2560K7242K1175J5617J0185L970k873r344
62578H57806j4947j9965k4473k7961l0104l1304l2079l2350l1754l0413k8910
62567E53546k7598k6227k4405k2185j9960j7946j5953j3806j1719j0032q666p218
$$ y = [509722, 486342, 466490, 449964, 435832, 423253, 411963, 401900, 392702, 383867, 375242, 367069, 359607, 352914, 346885, 341249, 335603, 329828, 324428, 320077, 316717, 313517, 310006, 306919, 305468, 305854, 306915, 307292, 306627, 305419, 304034, 302295, 300041, 297723, 296156, 295724, 296020, 296320, 296277, 296097, 296157, 296572, 297133, 297655, 298383, 300027, 303191, 307695, 312617, 317200, 321635, 326815, 333384, 341199, 349610, 358036, 366369, 375218, 385840, 399506, 416566, 436192, 457140, 478805, 501613, 526601, 554608, 585605, 618694, 652910, 687968, 723807, 759274, 791834, 819076, 840251, 855868, 866053, 870023, 867150, 857806, 842859, 822894, 798421, 770460, 740356, 709052, 676973, 644623, 612869, 582456, 553546, 525948, 499721, 475316, 453131, 433171, 415225, 399272, 385466, 373747, 363715, 355049, 347831]
62555C47831n666m571m371m705m828m493m035l695l313k760k229j876j501p89
62541B98999K55J304J997K176J992J874K210K926L511L623L456L444L766M298
62527C35831M906N582O400P469Q894J0642J2562J4579J6778J9188K1718K4398
62515D88947K7477L0940L4188L6484L7700L8374L9011L9553L9482L8216L5403
62504H85775L1040K5431J9006J2165N298j238p319j3075j8524k3266k6776k8853
62492H59664k9628k9312k8203k6748k5128k2918j9599j5409j1301p906m958j816
62480F36738J773N548R052J1921J4151J6157J8252J9947K0275J8933J6714J4454
62468H03915J2000Q701M502M6m252q618j3321j8055k2124k5103k7176k8841l0284
$$ y = [347831, 342165, 337594, 333223, 328518, 323690, 319197, 315162, 311467, 308154, 305394, 303165, 301289, 299788, 298999, 299254, 300558, 302555, 304731, 306723, 308597, 310807, 313733, 317244, 320867, 324323, 327767, 331533, 335831, 340737, 346319, 352719, 360188, 369082, 379724, 392286, 406865, 423643, 442831, 464549, 488947, 516424, 547364, 581552, 618036, 655736, 694110, 733121, 772674, 812156, 850372, 885775, 916815, 942246, 961252, 973417, 978715, 977477, 970158, 957083, 938559, 915293, 888517, 859664, 830036, 800724, 772521, 745773, 720645, 697727, 678128, 662719, 651418, 643512, 638554, 636738, 638511, 644059, 653111, 665032, 679183, 695340, 713592, 733539, 753814, 772747, 789461, 803915, 815915, 824616, 829118, 829164, 824912, 816294, 802973, 784918, 762794, 737691, 710515, 681674, 651390]
62455F51390l1098l0834k9684k8337k7012k5150k2330j9089j6416j4668j3397
62444C93375j2024j0298q333o548n373m635l561j822j73N74P66J264J841J423
62430C46476o8j312j441j199j611k468l016l380m237n502o380o503o132n349m050
62415B93828k783k533l344l969l352j947j029j171j901k507k678k469k121j840
62401B60184j521p80M65J656K191K191K240K436K279J593R88J088J627J856J550
62386B80043J164J051J061J043J196J649K093K211K296K986M471O252P662Q345
62372C23523Q324Q035Q269R610J1739J3711J4983J5865J6861J8040J9399K1336
62360D89695K4257K7975L1979L6065M0265M4345M7949N1135N4122N6425N6865
$$ y = [651390, 620292, 589458, 559774, 531437, 504425, 479275, 456945, 437856, 421440, 406772, 393375, 381351, 371053, 362720, 356172, 350799, 346164, 342603, 340781, 340608, 341182, 341948, 343212, 345053, 346476, 346408, 345096, 343655, 342456, 340845, 338377, 335361, 331981, 327744, 322242, 315862, 309359, 303227, 297878, 293828, 291045, 288512, 285168, 281199, 277847, 275900, 274871, 273700, 271799, 269292, 266614, 264145, 262024, 260184, 258663, 257883, 258348, 260004, 262195, 264386, 266626, 269062, 271341, 272934, 273922, 275010, 276637, 278493, 280043, 281207, 282258, 283319, 284362, 285558, 287207, 289300, 291511, 293807, 296793, 301264, 307516, 315178, 323523, 331847, 339882, 348151, 357761, 369500, 383211, 398194, 414059, 430920, 448960, 468359, 489695, 513952, 541927, 573906, 609971, 650236, 694581, 742530, 793665, 847787, 904212, 961077]
62349I61077N4787N0751M5653L9562L1958K2976J3781N535j746q970j6670k4257
62337A174437l0706l5761m0020m3841m6670m7818m7449m6219m4199m0910l6534
62326G14310l2262k9026k6412k3392j9834j6693j4869j4343j4485j4696j4654
62315D93644j4278j3720j3250j2966j2713j2319j1858j1545j1382j1046j0200
62304C58367q950p861p318p005o221m778l265k355k093k043j878j518q83R1J184
62289C03474J895J860J206N15M84J363K630L402L364L117L397M189M925N311N508
62274C46640N641N651N678O048O750P326P528P786Q758J0640J3089J5632J7996
62261D65163K0239K2725K5782K9312L2964L6757M1181M6395N1606N5596N7717
$$ y = [961077, 1015864, 1066615, 1112268, 1151830, 1183788, 1206764, 1220545, 1226080, 1224334, 1215364, 1198694, 1174437, 1143731, 1107970, 1067950, 1024109, 977439, 929621, 882172, 835953, 791754, 750844, 714310, 682048, 653022, 626610, 603218, 583384, 566691, 551822, 537479, 522994, 508298, 493644, 479366, 465646, 452396, 439430, 426717, 414398, 402540, 390995, 379613, 368567, 358367, 349417, 341556, 334238, 327233, 321012, 316234, 312969, 310614, 308521, 306478, 304600, 303082, 302199, 302290, 303474, 305369, 307229, 308435, 308950, 309434, 310797, 313427, 316829, 320193, 323310, 326707, 330896, 335821, 341132, 346640, 352281, 357932, 363610, 369658, 376408, 383734, 391262, 399048, 407806, 418446, 431535, 447167, 465163, 485402, 508127, 533909, 563221, 596185, 632942, 674123, 720518, 772124, 827720, 885437]
62250H85437N8184N7427N5491N1966M6363L8586K9208J9290R794J193o486j3543
62238A232910k0531k7888l5342m1938m6930n0389n2712n3869n3606n2107m9912
62227G47686m7244m3925l9984l5868l2008k8528k5406k2596j9922j7220j4625
62216D20360j2436j0701r310q391q085p943p254o082n346n494n776n324m332l580
62202C20306l220k860k504k466k407j394P59K950M005L982L802L986M302M515
62188C33756M879N722O912P941Q537Q954R617J0514J1057J0693R571Q415P752
62175D44320P491P348P383P950R186J0855J2763J5055J8003K1569K5406K9285
62163F16614L3357L7825M2355M6067M8136M8249M6447M2732L7192L0407K3401
$$ y = [885437, 943621, 1001048, 1056539, 1108505, 1154868, 1193454, 1222662, 1241952, 1251746, 1252939, 1246453, 1232910, 1212379, 1184491, 1149149, 1107211, 1060281, 1009892, 957180, 903311, 849705, 797598, 747686, 700442, 656517, 616533, 580665, 548657, 520129, 494723, 472127, 452205, 434985, 420360, 407924, 397223, 387913, 379522, 371437, 363494, 356240, 350158, 344812, 339318, 333542, 328218, 323886, 320306, 317086, 314226, 311722, 309256, 306849, 305455, 306214, 309164, 313169, 317151, 320953, 324939, 329241, 333756, 338635, 344357, 351269, 359210, 367747, 376701, 386318, 396832, 407889, 418582, 428153, 436568, 444320, 451811, 459159, 466542, 474492, 483678, 494533, 507296, 522351, 540354, 561923, 587329, 616614, 649971, 687796, 730151, 776218, 824354, 872603, 919050, 961782, 998974, 1029381, 1052782]
62152A052782J6932J1005N159q50o802j2343j7393k2169k6842l1168l4583l6677
62140H97051l7598l7781l7353l6053l3775l0900k7854k4605k0938j7063j3579
62129E79552j0768q392o234m430k994j427O79K802L831L306J929P18L2l63o17
62114E57624n54j1Q30J388R13r63l741o298p895q728r288r471q812p373n818m609
62098D87194l605k582j613p36K59J442K496L142L612M358N490O724P736Q306Q367
62083E30590Q132Q071Q539R570J1066J2951J4909J6386J7155J7647J8387J9341
62071F92744K0198K1053K2266K3755K4965K5628K6081K6761K7731K8825K9972
62060I69979L1088L1829L1612K9979K6943K3027J8821J4401R349L542k345p411
$$ y = [1052782, 1069714, 1080719, 1085878, 1085028, 1078226, 1065883, 1048490, 1026321, 999479, 968311, 933728, 897051, 859453, 821672, 784319, 748266, 714491, 683591, 655737, 631132, 610194, 593131, 579552, 568784, 560392, 554158, 549728, 546734, 545307, 545986, 548788, 552619, 555925, 557854, 558572, 558604, 558241, 557624, 557070, 557059, 557889, 559277, 560190, 559227, 555486, 549188, 541293, 532565, 523277, 513806, 504994, 497621, 491803, 487194, 483589, 481007, 479394, 478658, 478917, 480359, 482855, 485997, 489609, 493967, 499457, 506181, 513917, 522223, 530590, 538722, 546793, 555332, 564902, 575968, 588919, 603828, 620214, 637369, 655016, 673403, 692744, 712942, 733995, 756261, 780016, 804981, 830609, 856690, 883451, 911182, 940007, 969979, 1001067, 1032896, 1064508, 1094487, 1121430, 1144457, 1163278, 1177679, 1187028, 1190570, 1188225, 1180814]
62048A180814j1468j5174j9320k4207k9475l4278l7775l9858m1184m2237m2603
62037H43235m1658l9590l7131l4521l1527k8387k5844k4074k2403k0336j8151
62026E19613j6154j4081j1750r686q428p703o870n899n340n466n934o237o127
62013D09938n690n267n177n337n332m936m281l349j786M53K701M235N050N552
61999C86774N877N928N793N584N096M139L019K170J495N00r34k461l775m777n368
61984D09060n588n846o533p446q054q216q151p874p244o528o192o082n486m229
61970C15591l079k721k941l083k940k724k527k277j996j732j339o20K97R67J066
61955B89942P67O55J202K235L070L298L202L195L203L098L408M841P081Q924R818
$$ y = [1180814, 1169346, 1154172, 1134852, 1110645, 1081170, 1046892, 1009117, 969259, 928075, 885838, 843235, 801577, 761987, 724856, 690335, 658808, 630421, 604577, 580503, 558100, 537764, 519613, 503459, 489378, 477628, 467942, 459514, 451811, 444941, 439042, 433702, 428236, 422302, 416065, 409938, 404248, 398981, 393804, 388467, 383135, 378199, 373918, 370569, 368783, 369236, 371937, 376172, 381222, 386774, 392651, 398579, 404372, 409956, 415052, 419191, 422210, 424380, 425875, 426375, 425441, 422980, 419205, 414428, 409060, 403472, 397626, 391093, 383647, 375593, 367377, 359226, 351352, 344108, 337580, 331388, 325306, 319820, 315591, 312512, 309791, 306850, 303767, 300827, 298103, 295576, 293299, 291303, 289571, 288232, 287612, 287909, 288876, 289942, 290709, 291364, 292566, 294801, 297871, 301169, 304371, 307566, 310769, 313867, 317275, 322116, 329197, 338121, 347939]
61940C47939J0609J2299J4754J7079J8799K0025K0821K1040K0681J9938J8954
61929E42938J7882J7008J6413J5638J4144J1993R635P170M343J256j531l721n580
61916F47588p217q100p757o597n489m590l177p62K165M804P081R510J2167J4376
61902F54002J5516J5670J5198J4040J1878Q731M984R20l311p342j0690j3348j5829
61889F90419j8418k0690k1964k2024k1236k0135j9027j7866j6407j4729j3455
61878D84468j3113j3286j2942j1790j0688j0301r994q698o508m550l361k251m75
61865C76511J646L182L816M055M461N099N812O662P901R587J1420J3153J5000
61852D68305J7427K0416K3214K5089K6178K7255K8655K9859L0274L0013K9512
$$ y = [347939, 358548, 370847, 385601, 402680, 421479, 441504, 462325, 483365, 504046, 523984, 542938, 560820, 577828, 594241, 609879, 624023, 636016, 645651, 652821, 657164, 658420, 656889, 653168, 647588, 640371, 632271, 624514, 617917, 612428, 607838, 604661, 603899, 606064, 610868, 617949, 627459, 639626, 654002, 669518, 685188, 700386, 714426, 726304, 735035, 740019, 740939, 737628, 730286, 719596, 706248, 690419, 672001, 651311, 629347, 607323, 586087, 565952, 546925, 529059, 512652, 497923, 484468, 471355, 458069, 445127, 433337, 422649, 412348, 402354, 393656, 387148, 382598, 379237, 376986, 376511, 378157, 381339, 385155, 389210, 393671, 398770, 404582, 411244, 419145, 428732, 440152, 453305, 468305, 485732, 506148, 529362, 554451, 580629, 607884, 636539, 666398, 696672, 726685, 756197]
61841G56197K8673K6841K3686J9606J5103J0121M428j532o658j0187j2327j3698
61829H40253j4407j3948j1912q517m457m12L302O728R938J2620J4105J3942J2336
61816H59571R816O560K320l034r137j5245k0628k4943k8436l1576l4264l5619
61804F75385l5022l3116l1196k9688k7917k5432k2769k0594j8754j6639j4087
61793D00171j1479r343q123p930q074p437n729m030l467l749l722k931j956j336
61779C20865j088j150j526j795j281oJ077J124K51q08j513j706j469j107j008
61764C08860j207j293r39l16J82M00M96O87J099J604J783J277K76n60q58q98j092
61747C09501j305j052k49N24N86o5o07j94J043J982J738O89l7O7N34Q16Q97R38
$$ y = [756197, 784870, 811711, 835397, 855003, 870106, 880227, 884655, 883123, 876465, 866278, 853951, 840253, 825846, 811898, 799986, 791469, 787012, 786600, 789902, 796630, 806568, 819188, 833293, 847235, 859571, 869387, 875947, 878267, 875233, 866096, 850851, 830223, 805280, 776844, 745268, 711004, 675385, 640363, 607247, 576051, 546363, 518446, 493014, 470245, 449651, 430897, 414258, 400171, 388692, 379349, 371226, 363296, 355222, 347785, 342056, 338026, 334559, 330810, 327088, 324157, 322201, 320865, 319777, 318627, 317101, 315306, 314025, 314019, 315096, 316220, 316471, 315663, 314150, 312444, 310975, 309868, 308860, 307653, 306360, 305421, 305105, 305287, 305687, 306183, 306870, 307969, 309573, 311356, 312633, 312909, 312349, 311491, 310593, 309501, 308196, 307144, 306895, 307419, 308005, 307940, 307333, 307139, 308182, 310164, 311902, 312591, 312554, 312621, 313155, 313971, 314868, 315806]
61729C15806R12R28J331K148K845L040L064L400L850L895L550L409L814M484M983
61714C61459N063M598L593K445J815J961K323J999O87r91k178k726l299m372n424
61699C66953n534m697l930l909m138l853l189k843k939l024k932k931l018k834
61685C17182k420k290k589k791k556k225k098j822j093m31n80j371j885j680j169
61670B90182p87m23R0M65K77m30j160j444j123l97K70M00o9o84r20o03J64J251
61652B85059K440L218L060K035R12M87R22J820K742L464L852L854L716L910M587
61637C26078N231N107M061K657J447M26o11j471j691j314j121j853l360m695n042
61622C23849m467l698l322l203k720j571k06N95O05L63M83R14J103P12o6q90j676
$$ y = [315806, 316718, 317646, 318977, 321125, 323970, 327010, 330074, 333474, 337324, 341219, 344769, 348178, 351992, 356476, 361459, 366522, 371120, 374713, 377158, 378973, 380934, 383257, 385256, 385943, 384952, 382774, 380048, 376749, 372377, 366953, 361419, 356722, 352792, 348883, 344745, 340892, 337703, 334860, 331921, 328897, 325965, 323034, 320016, 317182, 314762, 312472, 309883, 307092, 304536, 302311, 300213, 298391, 297298, 296867, 296287, 294916, 293031, 291351, 290182, 289395, 288972, 289062, 289527, 289804, 289374, 288214, 286770, 285647, 285250, 285520, 285920, 285851, 285167, 284247, 283644, 283808, 285059, 287499, 290717, 293777, 295812, 296724, 297211, 298133, 299953, 302695, 306159, 310011, 313865, 317581, 321491, 326078, 331309, 336416, 340477, 343134, 344581, 345007, 344396, 342925, 341234, 339920, 338799, 336946, 333586, 328891, 323849, 319382, 315684, 312362, 309159, 306439, 304868, 304662, 305257, 305862, 306225, 306708, 307622, 308725, 309437, 309371, 308481, 306805]
61605C06805k477l166l475l338l055l008l282l646l874l965l971l777l296k806
61591B59669k791l260l576l227k559k280k410k278j644j185j472j974j733q41
61577B28439m90j353k584k861k052j216j099j359j406j395j805k510k868k673
61563B02768k358k152j753j008l77k06j35L26R36J140R52P67N66R3l04K8Q39J063
61545B01185L80j99J46Q93J083P03K96j14q13j484j457p05K10R85J623J804J196
61528B05732K33k73l13n88j167j321r07p83j385j857j366m47j67o02j002j103
61512A92684j304j725j914j625j184r81j019j109j110r49o54l81j68J60N72O08
61496A79901o5r78j315q99k89Q3L49P25J080J162Q68K33n55j044q29j34L23J95
$$ y = [306805, 304328, 301162, 297687, 294349, 291294, 288286, 285004, 281358, 277484, 273519, 269548, 265771, 262475, 259669, 256878, 253618, 250042, 246815, 244256, 241976, 239566, 237288, 235644, 234459, 232987, 231013, 229280, 228439, 227949, 226596, 224012, 221151, 219099, 217883, 216784, 215425, 214019, 212624, 210819, 208309, 205441, 202768, 200410, 198258, 196505, 195497, 195120, 194914, 194779, 195105, 196041, 197181, 198133, 198900, 199466, 199559, 199255, 199283, 200122, 201185, 201565, 201366, 201512, 202405, 203488, 204191, 204487, 204373, 203560, 202076, 200619, 199914, 200124, 201109, 202732, 204536, 205732, 205965, 205692, 205379, 204791, 203624, 202303, 201396, 200613, 199228, 197371, 196005, 195558, 195391, 194789, 193787, 192684, 191380, 189655, 187741, 186116, 184932, 183951, 182932, 181823, 180713, 179764, 179110, 178729, 178561, 178721, 179293, 179901, 179836, 178858, 177543, 176644, 176355, 176438, 176787, 177512, 178592, 179754, 180622, 180855, 180300, 179256, 178427, 178293, 178616, 178811]
61478A78811r7kM78R87J328J488J321O70k71r30q74k26M32O21M38L71N86N81j05
61459A85607j040j251n19K59K64j70j34N67J262J409J208J169J500K024K342K008
61443A96505Q14q04j913j817o35Q53J888K169J906J564J515J798K173K417K495
61428B10928K390J968J176K92j97n1N24J118J536J845K120K228J976J476J188
61413B30517J427J878J843J096K91K23P83J038M15o08j268j583k148k999l415
61398B27490k986k292k095k310k335k045j810j633j141m54k96q43j150m22P58
61383B06436J180P21L67O34R27O60J86Q0K02J26N4N70J629K483K635K269J745
61366B22904J182P57Q30J467K110K138J622J196J295J777K296K768L326L964M467
$$ y = [178811, 178714, 178712, 179190, 180177, 181505, 182993, 184314, 184984, 184713, 183783, 182909, 182683, 183115, 183736, 184174, 184545, 185131, 185712, 185607, 184567, 183316, 182797, 183056, 183320, 183150, 183016, 183583, 184845, 186254, 187462, 188631, 190131, 192155, 194497, 196505, 197319, 196515, 194602, 192785, 192150, 193003, 194891, 197060, 198966, 200530, 202045, 203843, 206016, 208433, 210928, 213318, 215286, 216462, 216754, 216557, 216506, 217030, 218148, 219684, 221529, 223649, 225877, 227853, 229329, 230517, 231944, 233822, 235665, 236761, 237052, 237275, 238058, 239096, 239511, 238903, 237635, 236052, 233904, 230905, 227490, 224504, 222212, 220117, 217807, 215472, 213427, 211617, 209984, 208843, 208389, 208093, 207250, 206100, 205678, 206436, 207616, 208337, 208704, 209338, 210265, 210925, 211111, 211191, 211393, 211519, 211573, 212143, 213772, 216255, 218890, 221159, 222904, 224086, 224843, 225673, 227140, 229250, 231388, 233010, 234206, 235501, 237278, 239574, 242342, 245668, 249632, 254099]
61351B54099M720M975N580O461P067O892N969M718L529K629K209K363K980L844
61337C18035M745N387N445M961M458M246L851K671R86k35n61m66n06p58j218j971
61321C49070k753l022k809k770l058k881j795n87j34j6P31K014K891L106L308
61306C41295L805M150M117M099M333M492M351M130L939L475K604J608O96k11j010
61291C85873j382j424j664k261k770k929k994l068k902k658l007l981m587m137
61277C46109l158k312j268M19K087K742K631K876L704M213L858L192K928L129
61263C71150L570M190M884N397N664N871O026N912N515N072M714M399M220M299
61249D40883M389M098L535L176L090K846K291J783J484R67j43j578k748l371l550
$$ y = [254099, 258819, 263794, 269374, 275835, 282902, 289794, 295763, 300481, 304010, 306639, 308848, 311211, 314191, 318035, 322780, 328167, 333612, 338573, 343031, 347277, 351128, 353799, 354785, 354550, 353989, 353523, 353017, 352259, 351041, 349070, 346317, 343295, 340486, 337716, 334658, 331777, 329982, 329395, 329261, 329245, 329976, 331990, 334881, 337987, 341295, 345100, 349250, 353367, 357466, 361799, 366291, 370642, 374772, 378711, 382186, 384790, 386398, 387094, 386883, 385873, 384491, 383067, 381403, 379142, 376372, 373443, 370449, 367381, 364479, 361821, 358814, 354833, 350246, 346109, 342951, 340639, 339371, 339790, 341877, 344619, 347250, 350126, 353830, 358043, 361901, 365093, 368021, 371150, 374720, 378910, 383794, 389191, 394855, 400726, 406752, 412664, 418179, 423251, 427965, 432364, 436584, 440883, 445272, 449370, 452905, 456081, 459171, 462017, 464308, 466091, 467575, 468542, 468399, 466821, 464073, 460702, 457152]
61234D57152l609l979m870n875o262n833n103m444l546k066m42M30K37l81n43
61219D10866l5N62O35L91P07J963L415M112M162M386M947N064M234K888J667P66
61203D50730L61Q77K221L384L508K970K872L761N422P511R731J1579J2637J3019
61189E30583J3031J2493J1030Q940P084N900N072M327L928M112M540M658M293
61176F19991L594K654J548O19K84N67R58Q86K13p02j430j894k393l215m242n047
61160F12391n396n586o206p464q841r545r334q731q350q180p792p074o409o108
61146E07375o013n859n698n817o384p360q562r623j0044r522q289p046o456o582
61132D04120o678n735l510r57O49R65P40Q69J754L373N354O908P456P540Q394
$$ y = [457152, 453543, 449564, 444694, 438819, 432557, 426724, 421621, 417177, 413631, 411565, 411123, 411553, 411790, 411409, 410866, 410831, 411393, 412028, 412419, 413126, 415089, 418504, 422616, 426778, 431164, 436111, 441175, 445409, 448297, 449964, 450730, 451091, 451968, 454189, 457573, 461081, 464051, 466923, 470684, 476106, 483617, 493348, 504927, 517564, 530583, 543614, 556107, 567137, 576077, 583161, 589061, 594133, 598460, 602388, 606500, 611040, 615698, 619991, 623585, 626239, 627787, 628406, 628690, 629257, 630215, 631101, 631314, 630612, 629182, 627288, 624895, 621680, 617438, 612391, 606995, 601409, 595203, 587739, 578898, 569353, 560019, 551288, 542938, 534758, 526966, 519892, 513483, 507375, 501362, 495503, 489805, 483988, 477604, 470244, 461682, 452059, 442015, 432493, 424204, 417158, 410702, 404120, 397442, 391707, 388197, 387240, 387889, 388854, 389594, 390463, 392217, 395590, 400944, 407852, 415308, 422848, 431242]
61117D31242J0289J2042J2689J2933J4162J6564J9059K0812K1895K2570K2779
61106F17036K2548K2184K1819K1222K0163J8704J6995J5129J3174J1144Q988O835
61094H15941M976L325J221j707m825p251r071j1023j3201j4942j6030j6923j7688
61081G12802j7663j6705j5812j5875j6419j6334j5406j4373j3786j3467j2983
61070E43979j2061j0575q632o716n383m688m135l253k049q72J3O66J309J966K494
61055D92063K954L744N020O340P305Q285R836J1577J2519J2558J2800J4095J6083
61042F15179J8085K0103K2402K4855K7364L0284L3739L7096L9794M2062M4122
61031I55085M5364M5401M5341M6820N0055N4051N8536O4292P1512P9166Q6421
$$ y = [431242, 441531, 453573, 466262, 479195, 493357, 509921, 528980, 549792, 571687, 594257, 617036, 639584, 661768, 683587, 704809, 724972, 743676, 760671, 775800, 788974, 800118, 809106, 815941, 820917, 824242, 825463, 823756, 818931, 811680, 802609, 791586, 778385, 763443, 747413, 730490, 712802, 695139, 678434, 662622, 646747, 630328, 613994, 598588, 584215, 570429, 556962, 543979, 531918, 521343, 512711, 505995, 500612, 495924, 491789, 488536, 486487, 485615, 485628, 486294, 487603, 489569, 492063, 495017, 498761, 503781, 510121, 517426, 525711, 535547, 547124, 559643, 572201, 585001, 599096, 615179, 633264, 653367, 675769, 700624, 727988, 758272, 792011, 829107, 868901, 910963, 955085, 1000449, 1045850, 1091191, 1138011, 1188066, 1242117, 1300653, 1364945, 1436457, 1515623, 1602044]
61020A602044R3768J02447J13738J29247J50926J80243K17690K63264L16855L78469
61010C548691M49177N31910O30766P50718Q99251J083632J296088J495807J613137
61001A2299177J586582J404705J112248P76654M54473J88993K1982j8038M9779
60992A7876555J46219J71295O5836j61326m58401p71565j061276j294596j441645
60983A3071096j487582j443254j338166j202699j057158r12802p76419o52070
60975D200946n41575m45906l65825l00835k48780k07271j74773j49856j30481
60966A635644j14804j02034r1811q3265p5351o7667o0297n3281m6795m1429l7608
60955H61302l4959l2780l0887k9425k8151k6597k4795k3161k1666j9767j7320
$$ y = [1602044, 1695812, 1798259, 1911997, 2041244, 2192170, 2372413, 2590103, 2853367, 3170222, 3548691, 3997868, 4529778, 5160544, 5911262, 6810513, 7894145, 9190233, 10686040, 12299177, 13885759, 15290464, 16402712, 17179366, 17633839, 17822832, 17844814, 17826776, 17876555, 18022774, 18194069, 18259905, 18098579, 17640178, 16868613, 15807337, 14512741, 13071096, 11583514, 10140260, 8802094, 7599395, 6542237, 5629435, 4853016, 4200946, 3659371, 3213465, 2847640, 2546805, 2298025, 2090754, 1915981, 1766125, 1635644, 1520840, 1418806, 1326995, 1243730, 1168379, 1100712, 1040415, 987134, 940339, 898910, 861302, 826343, 793563, 762676, 733251, 705100, 678503, 653708, 630547, 608881, 589114, 571794]
60944E71794j4971j3431j2622j1861j0623r007p511o466n774n276n252o122p556
60931D55322q409p955o804o125o264o691o992p234p419p305o878o412n977n398
60917C59459m767m382m080l298k032j109j131j658j791j212k79N35R33Q45N82
60902C36615O63J175J556J299O23J25J00M32Q88J137Q36J08l94l14k19q32j995
60885C41803k965l561m218m970n168m446l392k863l025l331l190k437j396n92
60871B96249k42J7O31J464K023K290K824L822M644M604L831L013K666K931L710
60856C34477M573M808M143L176K716K823K971K866K541J864O76m81o60K32J087
60841C67812R95L79K23O00O95N4q78j516j784j912k010k154k473k946l252l118
$$ y = [571794, 556823, 543392, 530770, 518909, 508286, 499279, 491768, 485302, 479528, 474252, 469000, 462878, 455322, 446913, 438958, 432154, 426029, 419765, 413074, 406082, 398848, 391429, 384124, 377246, 370834, 364857, 359459, 354692, 350310, 346230, 342932, 340900, 339791, 338660, 337002, 335211, 333999, 333720, 334255, 335188, 336033, 336615, 337278, 338453, 340009, 341308, 341931, 342056, 342156, 342588, 343476, 344613, 345449, 345557, 345163, 344849, 344630, 343798, 341803, 338838, 335277, 331059, 326089, 320921, 316475, 313083, 310220, 307195, 303864, 300674, 298237, 296841, 296249, 296007, 296024, 296655, 298119, 300142, 302432, 305256, 309078, 313722, 318326, 322157, 325170, 327836, 330767, 334477, 339050, 343858, 348001, 351177, 353893, 356716, 359687, 362553, 365094, 366958, 367634, 367153, 366493, 366725, 367812, 368807, 369186, 369409, 370009, 370704, 370758, 369880, 368364, 366580, 364668, 362658, 360504, 358031, 355085, 351833, 348715]
60825C48715k662k260k176k343k369j826p56J71K76k83o57k88O22J674K724L578
60809C42140L820L496L412M216N454O175O264O492P361Q606R780J0744J1465J1948
60795D41373J2524J3623J5102J6311J6973J7525J8408J9549K0675K1612K2044
60784F35719K1609K0464J9209J7915J5930J2988R906P584N858L919J430j384m332
60771G66815p178r399j0753j1849j3415j5167j6193j6353j6465j7088j7864j8208
60759E96883j8019j7502j6857j6300j5966j5680j5194j4624j4189j3631j2482
60748D26439j0964r876r514r320q819q188p724p288o680o003n396m888m716n263
60734C21800o339p089o958o227n322m235k990k090j868j940j829j648j625j432
$$ y = [348715, 346053, 343793, 341617, 339274, 336905, 335079, 334323, 334494, 334770, 334487, 333830, 333542, 334164, 335838, 338562, 342140, 345960, 349456, 352868, 357084, 362538, 368713, 374977, 381469, 388830, 397436, 407216, 417960, 429425, 441373, 453897, 467520, 482622, 498933, 515906, 533431, 551839, 571388, 592063, 613675, 635719, 657328, 677792, 697001, 714916, 730846, 743834, 753740, 761324, 767182, 771101, 772531, 771147, 766815, 759637, 750238, 739485, 727636, 714221, 699054, 682861, 666508, 650043, 632955, 615091, 596883, 578864, 561362, 544505, 528205, 512239, 496559, 481365, 466741, 452552, 438921, 426439, 415475, 405599, 396085, 386765, 377946, 369758, 362034, 354746, 348066, 342063, 336667, 331779, 327063, 321800, 315461, 308372, 301414, 295187, 289865, 285630, 282640, 280550, 278682, 276742, 274913, 273265, 271640, 270208]
60720B70208p79j24n9k22K55J394K261K206J456N16l03o73m27j36p28k180l315
60703B69350l270k622k448k759k684j967j501k125l410m065l428k200j578j934
60689B33359k562k656k179j624j249r44o55n66o53m89L02J475K230J986J013K81
60673B27069M67J230J595J099K75j22NK07J43j97o86j080j057o05j80r8jN69J349
60654B29982J692J597J653K066K500K902L642M601N020M659M302M534M769M160
60640B78079K899J814J130N17oj46j95q45k011k761k565j960j667j708j750j757
60624B67068j838j896j823j711j567j180o33n22j210k159k498k073j439r81o86
60609B44852o64j173j998k361j851r84n17n45o96q95j350j898j924j117NO52N68
$$ y = [270208, 269429, 269305, 269246, 269024, 269279, 270673, 272934, 275140, 276596, 277112, 276809, 276136, 275709, 275573, 274845, 272665, 269350, 266080, 263458, 261010, 258251, 255567, 253600, 252099, 249974, 246564, 242499, 239071, 236871, 235293, 233359, 230797, 228141, 225962, 224338, 223089, 222145, 221490, 220924, 220271, 219782, 220084, 221559, 223789, 225775, 226788, 227069, 227536, 228766, 230361, 231460, 231735, 231613, 231618, 231825, 231968, 231771, 231085, 230005, 228948, 228343, 228163, 228065, 228064, 228633, 229982, 231674, 233271, 234924, 236990, 239490, 242392, 246034, 250635, 255655, 260314, 264616, 269150, 273919, 278079, 280978, 282792, 283922, 284439, 284433, 284287, 284092, 283247, 281236, 278475, 275910, 273950, 272283, 270575, 268825, 267068, 265230, 263334, 261511, 259800, 258233, 257053, 256420, 255898, 254688, 252529, 250031, 247958, 246519, 245538, 244852, 244188, 243015, 241017, 238656, 236805, 235821, 235304, 234759, 234063, 233168, 231818, 229920, 227996, 226879, 226884, 227536, 228104]
60592B28104J40q9J82Q79J499J335K28r61j069J4J128J265P74O73J166J546J480
60575B38294J587K404L489M076M161M386N140O317P816R536J0891J0990R547P236
60561C25870M882K721O37j292k845m073n198o175o627o216m958l218j469O4J492
60546B93595K958M203M796M810M913N594O587P258P276O592N217L381J655M40
60532C59275n20j625k642k958k473j722j139p49n62o48p45m36L5j82j333k422
60516C39154k336j219j59K19L18P43J493K150K537K979L952N637P793J0094J2515
60501C85870J5176J7957K0572K3092K5940K9127L1793L2915L2248L0241K7193
60490F72124K2881J6982R505Q26q390j7230k4757l0349l3795l5188l4916l3555
$$ y = [228104, 228244, 228155, 228337, 229216, 230715, 232050, 232278, 231317, 230248, 230262, 231390, 232655, 233429, 234102, 235268, 236814, 238294, 239881, 242285, 245774, 249850, 254011, 258397, 263537, 269854, 277670, 287206, 298097, 309087, 318634, 325870, 330752, 333473, 334110, 332818, 329973, 325900, 320702, 314527, 307900, 301684, 296726, 293508, 292039, 292103, 293595, 296553, 300756, 305552, 310362, 315275, 320869, 327456, 334714, 341990, 348582, 353799, 357180, 358835, 359275, 358755, 357130, 354488, 351530, 349057, 347335, 346196, 345447, 344885, 344237, 343492, 343056, 343091, 342909, 341576, 339154, 336818, 335599, 335440, 335659, 335977, 336720, 338213, 340363, 342900, 345879, 349831, 355468, 363261, 373355, 385870, 401046, 419003, 439575, 462667, 488607, 517734, 549527, 582442, 614690, 644931, 672124, 695005, 711987, 721492, 722318, 713928, 696698, 671941, 641592, 607797, 572609, 537693, 504138]
60478E04138l1513k8814k5469k1996j9124j6960j4870j2420j0091q762q558q562
60466B96999p809o325n020m568m664m479l592k285j057k34q5p70j921k616k217
60451B49357j139m45p67j837k973l666l703l100k086j072m97o05j166j371m99
60436B24431J126K166J726M53l90o40j228k536l665l686k861k069j557q77K67
60421B10660J670K977L896M196L898L384K908K163Q17o46j222o81M3j9o96j067
60405B32281o31J97O92N37N1j21M19J412K148K241J992J802J544Q83P5j38N19
60388B45903J469K039K178K169K060J715J254R82J052J431J987K341J956Q75P7
60373B69488M43J490J910J340Q02J096J637J431N53o1R6P05J316J704J705J289
$$ y = [504138, 472625, 443811, 418342, 396346, 377222, 360262, 345392, 332972, 322881, 314119, 305561, 296999, 289190, 282865, 277845, 273277, 268613, 264134, 260542, 258257, 257200, 256966, 256881, 256111, 254190, 251574, 249357, 248218, 247773, 247006, 245169, 242196, 238530, 234827, 231727, 229641, 228569, 228072, 227467, 226301, 224930, 224431, 225557, 227723, 229449, 229902, 229512, 228872, 227644, 225108, 221443, 217757, 214896, 212827, 211270, 210393, 210660, 212330, 215307, 219203, 223399, 227297, 230681, 233589, 235752, 236569, 235923, 234701, 234020, 234063, 234044, 233348, 232281, 231650, 231847, 232539, 233076, 233127, 233006, 233425, 234837, 236985, 239226, 241218, 243020, 244564, 245447, 245522, 245384, 245903, 247372, 249411, 251589, 253758, 255818, 257533, 258787, 259769, 260821, 262252, 264239, 266580, 268536, 269411, 269488, 269931, 271421, 273331, 274671, 275473, 276569, 278206, 279637, 280190, 280129, 280225, 280930, 282246, 283950, 285655, 286944]
60357B86944Q74J020J773K648L303L811M267M626M896N193N504N764O085O450
60343C43158O292M964K696M79j181k672m275n446n708n597n921o451o239n073
60329C09026l846l280l062k602k000j743j774j531q07j35j33q18j648k058j821
60314B81768j070k13L94P92J426K575L951N106O118P479R269J0825J1528J1545
60300C51493J1467J1452J1104J0082Q339N839K576j024m124o292p986r865j1733
60287C71328j2579j1749r811q044p194o950o525n517m108k675j513p92n08l99
60273B92964k16q5l99j245k228k955l408l710l795l501k808j828p83j31k99j076
60257B64497j614j367p05k94k17j23J11L49N40N68J05q42j498j101N2J022J410
$$ y = [286944, 287818, 288838, 290611, 293259, 296562, 300373, 304640, 309266, 314162, 319355, 324859, 330623, 336708, 343158, 349450, 354414, 357110, 357589, 356408, 353736, 349461, 344015, 338307, 332710, 326789, 320338, 314099, 309026, 305180, 301900, 298838, 296236, 294236, 292493, 290719, 289188, 288381, 288246, 288113, 287295, 285647, 283589, 281768, 280698, 280485, 280879, 281671, 283097, 285672, 289623, 294729, 300847, 308326, 317595, 328420, 339948, 351493, 362960, 374412, 385516, 395598, 403937, 409776, 412352, 411328, 407204, 400912, 392926, 383061, 371328, 358749, 347000, 337189, 329145, 321951, 315001, 308476, 302959, 298851, 296176, 294663, 293871, 293363, 292964, 292748, 292663, 292264, 291019, 288791, 285836, 282428, 278718, 274923, 271422, 268614, 266786, 266003, 265872, 265573, 264497, 262883, 261516, 260811, 260517, 260300, 260177, 260288, 260637, 261177, 261745, 261850, 261008, 259510, 258409, 258461, 259483, 260893]
60240B60893J482J304P07jj53K72O16O10O29Q03P60M54L53N21M73K44N68J500
60222B72035J992J494R21J185J776J811J568J780K140J907J455J738K544K769
60208B97115K350K393L238L878L713L518L990M509M221L458L191L623M160M359
60194C47716M238L961L791M062M668M875M162K953J961J210L51m08m78nK6r76
60178C82107k438l393l575l534l895m787n779o117n273l493j827j273j881k746
60164C32096k923k313j591j388j646j803j492q55j69N77J487K272K352J534M14
60149C26552j60J27R18J707K211K329K107J834J829K028K035J820J963K847L918
60134C54065M254L783L349L532L978M028L541K765J854Q45j00p83j153j188q22
$$ y = [260893, 262375, 263679, 264386, 264385, 264232, 264504, 265120, 265730, 266359, 267162, 267922, 268376, 268729, 269250, 269723, 269967, 270535, 272035, 274027, 275521, 276442, 277627, 279403, 281214, 282782, 284562, 286702, 288609, 290064, 291802, 294346, 297115, 299465, 301858, 305096, 308974, 312687, 316205, 320195, 324704, 328925, 332383, 335574, 339197, 343357, 347716, 351954, 355915, 359706, 363768, 368436, 373311, 377473, 380426, 382387, 383597, 383948, 383540, 383062, 383057, 383083, 382107, 379669, 376276, 372701, 369167, 365272, 360485, 354706, 348589, 343316, 339823, 337996, 336723, 334842, 332096, 329173, 326860, 325269, 323881, 322235, 320432, 318940, 318085, 317916, 318493, 319980, 322252, 324604, 326138, 326552, 326392, 326519, 327437, 329144, 331355, 333684, 335791, 337625, 339454, 341482, 343517, 345337, 347300, 350147, 354065, 358319, 362102, 365451, 368983, 372961, 376989, 380530, 383295, 385149, 385994, 385894, 385111, 383958, 382770, 381948]
60119C81948j79M18Q11J151J475J485J045N68M91P07Q66R21R93R73O94L00l5m41
60101C94191r67j190q26m56r08k073l005l204l000k742k367j956j848j928j539
60086C66182m98M08M90J19J11N69R13Q15N63O11J157K045K791K821J995Q18r9
60069C81811n82q05r71j322k183l546m827n408n302n015m866m798m681m447l961
60054C29097l173k308j727j532j568j703j844j766j260m76K44Q60J579K306K579
60039C19308K308K165K818L994M773M779M580M744M927M324K802J124L2m69q15
60024C61394j271j888k699l679m611n323n873o296o374n968n382n031m887m630
60010B97482m228l899l658l342l009k835k605j935r85l76l02k96m8J30J0r7Q4
$$ y = [381948, 381769, 382187, 382998, 384149, 385624, 387109, 388154, 388722, 389213, 389920, 390786, 391707, 392700, 393673, 394367, 394667, 394632, 394191, 393224, 392034, 391208, 390752, 389844, 387771, 384766, 381562, 378562, 375820, 373453, 371497, 369649, 367721, 366182, 365684, 366092, 366582, 366701, 366812, 367381, 368294, 369109, 369672, 370283, 371440, 373485, 376276, 379097, 381092, 381910, 381811, 381229, 380424, 379453, 378131, 375948, 372402, 367575, 362167, 356865, 351850, 346984, 342186, 337505, 333058, 329097, 325924, 323616, 321889, 320357, 318789, 317086, 315242, 313476, 312216, 311740, 311984, 312844, 314423, 316729, 319308, 321616, 323781, 326599, 330593, 335366, 340145, 344725, 349469, 354396, 358720, 361522, 362646, 362678, 362209, 361394, 360123, 358235, 355536, 351857, 347246, 341923, 336050, 329754, 323380, 317412, 312030, 306999, 302112, 297482, 293254, 289355, 285697, 282355, 279346, 276511, 273906, 271971, 270986, 270610, 270308, 270012, 269964, 270094, 270104, 270007, 270091]
59993B70091K63J52M7L53R02J271J454J731K048K138K087K257K748L295L584L354
59977B97775K458J220M74P02J272J172L34l32k35K49N16M96L87J47l25p97r18
59960C04595o70l14L4N17J184J691J529O02n05j042q85n84n63n52j40M71O82L70
59942C06420P2J80L50q3j252k492k948k430j587j167j161j031p63j061k170l072
59926B85805k615j105n1k80j073j293o92J96R05J435J974K590L006K716J696Q81
59910B94095J426L235M808M844L634K460K076K280K680L236L945M415M075K724
59896C39933Q43p01j321j143p21l88j39K0m3j83R5J030K230L113L486L495L303
59879C52909L180L522M359N047M912M134L453L072K368R24o99j548j405r92j091
$$ y = [270091, 270354, 270506, 270553, 270906, 271808, 273079, 274533, 276264, 278312, 280450, 282537, 284794, 287542, 290837, 294421, 297775, 300233, 301453, 301927, 302629, 303901, 305073, 305407, 305075, 304840, 305089, 305605, 306101, 306488, 306635, 306310, 305513, 304595, 303925, 303611, 303645, 304162, 305346, 307037, 308566, 309168, 308663, 307621, 306736, 306152, 305589, 305037, 304897, 305368, 306050, 306420, 306492, 306672, 307022, 306939, 305687, 303195, 300247, 297817, 296230, 295063, 293902, 292871, 292108, 291047, 288877, 285805, 283190, 282085, 282034, 281754, 280681, 279388, 278696, 278892, 279797, 281232, 283206, 285796, 288802, 291518, 293214, 294095, 295521, 298756, 303564, 308408, 312042, 314502, 316578, 318858, 321538, 324774, 328719, 333134, 337209, 339933, 340776, 340075, 338754, 337611, 336890, 336502, 336363, 336383, 336340, 336157, 336252, 337282, 339512, 342625, 346111, 349606, 352909, 356089, 359611, 363970, 369017, 373929, 378063, 381516, 384588, 386956, 387880, 387181, 385633, 384228, 383236, 382145]
59864C82145j777k532k880k714k121j163M0J224K197L091M102N028N426N276N032
59849D00374M821M031K192p0j517j698j313j175j359j603k070l187m911o513p206
59834C78796o845n986n314n037m795m146l076j941j016l34P8J71J19K62N76M90
59818C42002m39j835k829l052k896k814k734k352j708j158q95p69o36n86p94j163
59802C15342j310r38k19K91J75m06r16j116j323j926k797l485l836m065m193l892
59786B85386l036k168j913k182k292j887j243p25l70j86l45p58q25j37P92J068
59770B69179N76J14K45O40P70P80J195K038K702K702K153J534J238J388J817K129
59754B91200K034J662J467J760K453L213L713L782L530L278L213L167K974K856
$$ y = [382145, 380368, 377836, 374956, 372242, 370121, 368958, 368998, 370222, 372419, 375510, 379612, 384640, 390066, 395342, 400374, 405195, 409226, 411418, 411348, 409831, 408133, 406820, 405645, 404286, 402683, 400613, 397426, 392515, 386002, 378796, 371951, 365965, 360651, 355614, 350819, 346673, 343597, 341656, 340640, 340306, 340384, 340555, 340674, 340936, 341512, 342002, 341563, 339728, 336899, 333847, 330951, 328137, 325403, 323051, 321343, 320185, 319290, 318521, 317885, 317299, 316505, 315342, 314032, 313094, 312875, 313166, 313341, 312935, 312019, 310903, 309580, 307654, 304857, 301372, 297536, 293471, 289278, 285386, 282350, 280182, 278269, 276087, 273795, 271908, 270665, 269940, 269570, 269384, 269039, 268281, 267456, 267319, 268111, 269179, 269755, 269869, 270114, 270754, 271524, 272304, 273499, 275537, 278239, 280941, 283094, 284628, 285866, 287254, 289071, 291200, 293234, 294896, 296363, 298123, 300576, 303789, 307502, 311284, 314814, 318092, 321305, 324472, 327446, 330302]
59740C30302L126L539L502K882K105J385N14l29l29P84J916J746M30o47o44rN02
59723C50775P14P52N70J45l46q23j314j602j243k60P04J155J213J067N55k91q39
59706C50932n49L29J201J932K630K965K487J438O25M58O74R54J251J437J256P28
59690C70748K12p8k18k19oJ54k46j162j824j677j096p83q21p71n50o15j270k160
59672C57618k676k653k523k761l314l680l505l043k853l130l467l287k395j116
59658C17215o5K37k39r71j334j123n61J21Q64J576K097K447K840L265L293K619
59642C32281J573Q40O28M17l05j293j768j413q34p98j232j405j012n56m47l87
59626C24289n2J10n02j532j963j521r87j018j364j557j674j973k311k452k502
$$ y = [330302, 333428, 336967, 340469, 343351, 345456, 346841, 347355, 347026, 346697, 347481, 349397, 351143, 351573, 350926, 350282, 350273, 350775, 351489, 352241, 352811, 352956, 352610, 351787, 350473, 348871, 347628, 347368, 348072, 349227, 350440, 351507, 352062, 351771, 350932, 350383, 350712, 351913, 353845, 356475, 359440, 361927, 363365, 363990, 364448, 365122, 366076, 367327, 368764, 370020, 370748, 370960, 370882, 370664, 370445, 370439, 370593, 370347, 369185, 367361, 365684, 364588, 363805, 362984, 362213, 361663, 361048, 359778, 357618, 354942, 352289, 349766, 347005, 343691, 340011, 336506, 333463, 330610, 327480, 324013, 320726, 318331, 317215, 317150, 317387, 317148, 316177, 314843, 313720, 313159, 313280, 314144, 315720, 317817, 320264, 323104, 326369, 329662, 332281, 333854, 334694, 335322, 335739, 335434, 334141, 332373, 330960, 330126, 329328, 328096, 326691, 325679, 325123, 324676, 324289, 324237, 324347, 323845, 322313, 320350, 318829, 317842, 316824, 315460, 313903, 312229, 310256, 307945, 305493, 302991]
59611C02991k547k166r74N88J559J598J287J270J528J625J323P69L24K98O93J076
59595C11242R13J89m82n87l82n18j066j306p37R0K24l68p69m83j73n75j343j597
59577C02272j328j386k160l015l151k425j262k55k3p49j762k086j586r38m54K18
59561B79910R86J009Q5o52k18Q12J314J316J528J799J394N96O11J740K884L199
59545B98313L116L312L706M048M623N720P093Q648J0914J4048J6813J7476J5542
59532D13372J1921P605K942j767n758q242q999q403p073n604m290k953j230Q59
59518C82380K716L689L680L135K496J781Q08l16j152j542j909k738l873m809n501
59503C78845o344p258p460o551n284m757n116n556n436m845m105l300k385j459
$$ y = [302991, 300444, 298278, 297304, 297892, 299451, 301049, 302336, 303606, 305134, 306759, 308082, 308851, 309175, 309473, 310166, 311242, 312155, 312344, 311862, 311275, 310893, 310375, 309309, 308003, 307266, 307356, 307580, 307212, 306443, 305960, 305787, 305212, 303869, 302272, 300944, 299558, 297398, 294383, 291232, 288807, 287545, 287290, 287267, 286518, 284756, 282670, 281084, 280146, 279692, 279910, 280896, 281905, 281990, 281338, 281120, 281932, 283246, 284562, 286090, 287889, 289283, 289879, 290490, 292230, 295114, 298313, 301429, 304741, 308447, 312495, 317118, 322838, 329931, 338579, 349493, 363541, 380354, 397830, 413372, 425293, 432898, 435840, 434073, 428315, 420073, 411074, 402671, 395598, 389994, 385704, 382751, 381521, 382380, 385096, 388785, 392465, 395600, 398096, 399877, 400685, 400369, 399217, 397675, 395766, 393028, 389155, 384346, 378845, 372501, 365243, 357783, 351232, 345948, 341191, 336075, 330519, 325083, 320238, 316133, 312833, 310448, 308989]
59489C08989o85j16L32P91J323J802K016J939J802J789J901K239L090M472N882
59474C37566O872P553Q082P971O659M556K787J788R66o8p84p26m24n56p25M3J811
59457C83371L503M237M263M419N223O627Q261R694J0689J1397J2062J2566J2517
59444D88829J1792J0637R135O956L850R1l737p121r655j0975j1076j0461r809
59431D68456r547r790j0406j0932j0718r500p703n937m369k814j179N17K407M571
59417C93056O661Q134Q988R978J1989J5284J9150K2051K2359J9439J4128P974
59405E59191K079l046o922r111r713r137p300l922J42K650J854j874o736j1280
59391D96875j4911j7253j8054j7706j6906j5739j3833j1501r832r241q739p243
$$ y = [308989, 308304, 308188, 308520, 309311, 310634, 312436, 314452, 316391, 318193, 319982, 321883, 324122, 327212, 331684, 337566, 344438, 351991, 360073, 368044, 374703, 379259, 382046, 383834, 384800, 384732, 383948, 383222, 382798, 382242, 381517, 381560, 383371, 386874, 391111, 395374, 399793, 405016, 411643, 419904, 429598, 440287, 451684, 463746, 476312, 488829, 500621, 511258, 520393, 527349, 531199, 531290, 527553, 520432, 510777, 499802, 488726, 478265, 468456, 458909, 449119, 438713, 427781, 417063, 407563, 399860, 393923, 389554, 386740, 385561, 386078, 388485, 393056, 399717, 407851, 416839, 426817, 438806, 454090, 473240, 495291, 517650, 537089, 551217, 559191, 561270, 558224, 551302, 542191, 532478, 523341, 516041, 512119, 512261, 514911, 516765, 514891, 508155, 496875, 481964, 464711, 446657, 428951, 412045, 396306, 382473, 370972, 361140, 351899, 343160, 335917]
59379C35917n093l483k763k155j131k22j27o49r93p36rJ024K206L011K770J611
59363C29178O04N94J189J469J317J503K471L705M427M459M172M091M678O061P675
59348C77593Q627Q729Q787R540J0758J1797J2529J3180J3620J3591J3354J3293
59336E15398J3002J1651R363P299O091M983L057N96j460k923m499o608q791j0270
59322E36889j0734j0420r781r114q407p522o538n734n099m208k805j244M5J283
59308D56611K994N067O713P451P542P232O102L559k49m421q035j0576j1900j2170
59294D55920j1868j1452j0896r794q036o161m820m040l205j814j07J176J611J541
59280C88055J591J863J901J545J350J890K916L723M203M886N969O930P432P902
$$ y = [335917, 330824, 327341, 324578, 322423, 321292, 321070, 320943, 320294, 319301, 318565, 318556, 319580, 321786, 324797, 327567, 329178, 329782, 330376, 331565, 333034, 334351, 335854, 338325, 342030, 346457, 350916, 355088, 359179, 363857, 369918, 377593, 386220, 394949, 403736, 413276, 424034, 435831, 448360, 461540, 475160, 488751, 502105, 515398, 528400, 540051, 549414, 556713, 562804, 567787, 570844, 571440, 569980, 567057, 562558, 555950, 547159, 536889, 526155, 515735, 505954, 496840, 488433, 480911, 474373, 468639, 463540, 459332, 456527, 455283, 455328, 456611, 459605, 464672, 471385, 478836, 486378, 493610, 499712, 503271, 503022, 498601, 490566, 479990, 468090, 455920, 444052, 432600, 421704, 411910, 403874, 397713, 392893, 388853, 385648, 383834, 383727, 384903, 386514, 388055, 389646, 391509, 393410, 394955, 396305, 398195, 401111, 404834, 409037, 413923, 419892, 426822, 434254, 442156]
59266D42156Q765R656J0024R984R883R355P775N424L276J558m28k845m702n268
59252E04613n228n732o911q054q747r032q808p901o632n653n189m921m511l861
59238D13433l002k147j582j158k36J377K885L549L781M345M841M172K341O56j1
59223D33244j45n24j294k465m224o244p490p381o530n815n428n297n562o047n982
59208C62816n066m141l939l852k854j187l5J37o0r3K1K67P22J091J012Q62J348
59191C47049K283K690K267J697J336O79l70p44M05K200K910J967M72j32O32K143
59175C67484L308L495L209L603M988O175N927M686M103M917O131O486N997N622
59161D36131N911O573P101P353P407P265O765N665L839J539n93k000k780l539
$$ y = [442156, 450921, 460577, 470601, 480585, 490468, 499823, 507598, 513022, 516298, 517856, 517428, 514583, 509881, 504613, 499385, 493653, 486742, 478688, 469941, 460909, 452101, 444200, 437568, 431915, 426726, 421805, 417294, 413433, 410431, 408284, 406702, 405544, 405308, 406685, 409570, 413119, 416900, 421245, 426086, 430258, 432599, 433255, 433244, 433099, 432575, 431281, 428816, 424592, 418348, 410858, 403477, 396947, 391132, 385704, 380407, 374845, 368798, 362816, 357750, 353609, 349670, 345818, 342964, 341777, 341742, 341879, 341819, 341726, 341747, 342014, 342736, 343827, 344839, 345701, 347049, 349332, 352022, 354289, 355986, 357322, 358001, 357631, 356887, 357292, 359492, 362402, 364369, 364841, 364709, 365341, 367484, 370792, 374287, 377496, 381099, 386087, 392262, 398189, 402875, 406978, 411895, 418026, 424512, 430509, 436131, 442042, 448615, 455716, 463069, 470476, 477741, 484506, 490171, 494010, 495549, 494956, 492956, 490176, 486637]
59147D86637m644n778o397o443o406o689p116p190o681n876n281n152n283n241
59133D02460m773l962l039k226j753j772k015j793p06P32J577J576J388J648K346
59118C89688L227M263N364O125O333O412O819P323P431P244P281P550P514O988
59104D79562O405O101N882N475M855M006K854J665R71P89M22o53k075l094l395
59089E09770l164k705k366k425k754k856k589k474k870l387l543l621m167n090
59075D65759n851o328o712o809o257n389m987n102n005m405l873l749l533k825
59061C94934k094j894k009j992j972k219k421k180j793j730j683j067j83Q6k70
59046C71513m00q2j35r19j500r45L43J283J500J300P75j66j138j430p96M44J932
$$ y = [486637, 481993, 476215, 469818, 463375, 456969, 450280, 443164, 435974, 429293, 423417, 418136, 412984, 407701, 402460, 397687, 393725, 390686, 388460, 386707, 384935, 382920, 381127, 380421, 381153, 382730, 384306, 385694, 387342, 389688, 392915, 397178, 402542, 408667, 415000, 421412, 428231, 435554, 442985, 450229, 457510, 465060, 472574, 479562, 485967, 492068, 497950, 503425, 508280, 512286, 515140, 516805, 517776, 518565, 518987, 518334, 516259, 513165, 509770, 506606, 503901, 501535, 499110, 496356, 493500, 490911, 488437, 485567, 482180, 478637, 475016, 470849, 465759, 459908, 453580, 446868, 440059, 433802, 428413, 423426, 418324, 413319, 408914, 405041, 401292, 397759, 394934, 392840, 390946, 388937, 386945, 384973, 382754, 380333, 378153, 376360, 374630, 372947, 371880, 371697, 371783, 371513, 371113, 371031, 370896, 369977, 368477, 367532, 367875, 369158, 370658, 371958, 372733, 372567, 371429, 369999, 369203, 369647, 371579]
59029C71579L312M030L770L073K820L119L416L615M269N452O420O764P156Q250
59015D37045R482R710Q692P220N955M855L688K485J411O23K95M13N47K24l49m20
58999D91876L63J542K486L058L433L654L695L663L627L363K610J483M11k98o21
58984E24345o75o18p57j398k557l860m796m995m437l502k740k271j483K93K749
58969D93298M714N473N577N880O241N886M912M477N205O257O543O249O266O536
58955E73514O017M313K328R29k50j999m181n921o867p529q384r298r900j0023
58941E22749r630q738p586o628o115n930n871n908o037o108n945n452m614l533
58927D34654k557k058j967j806j314q20p28q78p63l06K4j26m62l77L91J511K399
$$ y = [371579, 374891, 378921, 382691, 385764, 388584, 391703, 395119, 398734, 403003, 408455, 414875, 421639, 428795, 437045, 446527, 456237, 464929, 472149, 478104, 482959, 486647, 489132, 490543, 491166, 491461, 491874, 492421, 492645, 492296, 491876, 492239, 493781, 496267, 499325, 502758, 506412, 510107, 513770, 517397, 520760, 523370, 524853, 525264, 524966, 524345, 523670, 523052, 522295, 520897, 518340, 514480, 509684, 504689, 500252, 496750, 494010, 491739, 490256, 490549, 493298, 498012, 503485, 509062, 514942, 521183, 527069, 531981, 536458, 541663, 547920, 554463, 560712, 566978, 573514, 579531, 583844, 586172, 587101, 586851, 584852, 580671, 574750, 567883, 560354, 551970, 542672, 532772, 522749, 513119, 504381, 496795, 490167, 484052, 478122, 472251, 466343, 460306, 454198, 448253, 442801, 438187, 434654, 432097, 430039, 428072, 426266, 424952, 424132, 423404, 422526, 421763, 421457, 421481, 421355, 420893, 420516, 420907, 422418, 424817]
58910D24817K738K706K756L109L588M043M753O035P526Q333Q198P977Q506R334
58896E04419R236P909O363N549N362N381N824P082Q778J0106J0915J1746J2858
58883F11528J3912J4622J5040J5110J4555J3412J1987J0170P486M068Q40j662
58871G31068l987o681r302j1128j2275j3272j3989j3987j3569j3450j3491j2770
58859E93167j1069r326q355p919p420o910o854p439q455r463r891r414q487q008
58845D74157q144q018o940n429m509m419m598m618m499m285l905l466l174k974
58831D05179k626k149j879j995k250k201j541l52Q21J253P44m5j84N77J682K493
58815C97527K862L008L124L229L236L057K658K040J247N50N05J394K530K638J254
$$ y = [424817, 427555, 430261, 433017, 436126, 439714, 443757, 448510, 454545, 462071, 470404, 478602, 486579, 495085, 504419, 513655, 521564, 527927, 533476, 538838, 544219, 550043, 557125, 565903, 576009, 586924, 598670, 611528, 625440, 640062, 655102, 670212, 684767, 698179, 710166, 720336, 727822, 731890, 732730, 731068, 727081, 720400, 711098, 699970, 687695, 674423, 660434, 646447, 632878, 619428, 605937, 593167, 582098, 572772, 564417, 556498, 549078, 542168, 535314, 527875, 519420, 509957, 500066, 490652, 482165, 474157, 466013, 457995, 451055, 445626, 441117, 436698, 432100, 427482, 422983, 418698, 414793, 411327, 408153, 405179, 402553, 400404, 398525, 396530, 394280, 392079, 390538, 390186, 391007, 392260, 393004, 392959, 392775, 393352, 395034, 397527, 400389, 403397, 406521, 409750, 412986, 416043, 418701, 420741, 421988, 422538, 423043, 424437, 426967, 429605, 430859]
58800D30859o33j789k132k372k649k450j785j509k063k751k740k225j968k017
58786D01776j665o06N28R98Q83R32J614K646L421L733L894M214M579M683M431
58771D36061L881K937J474k48j758l001m326n682o373o016n217m831m875m769
58757C97257m354l974l732l375k949k771k638j816j30J579K546K999L456L751
58743C85849L482K985L049L719M263M305M285M645N235N713N967N852N091L881
58729D48321L068L235L897M087L571K946K706K693K568K413K588L144L557L223
58715D92017K159J153R72J524K051K144K147K481L015L446L829M283M400L561
58701E29182J781k11j878l363n054o928q602r803j0601j1157j1411j1144j0368
$$ y = [430859, 430226, 428437, 426305, 423933, 421284, 418834, 417049, 415540, 413477, 410726, 407986, 405761, 403793, 401776, 400111, 399505, 400033, 401031, 401914, 402846, 404460, 407106, 410527, 414260, 418154, 422368, 426947, 431630, 436061, 439942, 442879, 444353, 444105, 442347, 439346, 435020, 429338, 422965, 416949, 411732, 406901, 402026, 397257, 392903, 388929, 385197, 381822, 378873, 376102, 373464, 371648, 371518, 373097, 375643, 378642, 382098, 385849, 389331, 392316, 395365, 399084, 403347, 407652, 411937, 416582, 421817, 427530, 433497, 439349, 444440, 448321, 451389, 454624, 458521, 462608, 466179, 469125, 471831, 474524, 477092, 479505, 482093, 485237, 488794, 492017, 494176, 495329, 496301, 497825, 499876, 502020, 504167, 506648, 509663, 513109, 516938, 521221, 525621, 529182, 530963, 530752, 528874, 525511, 520457, 513529, 504927, 495124, 484523, 473366, 461955, 450811, 440443]
58688D40443r521q987q522p546o029m642l831l269k542j898j784k081k366k582
58674C74843k784k538j416O9R23J070J441K538L804M695N463O393P086P164P004
58659D15755P048O858N675L612J528j57j711l223m239m502m432m506m606m312
58645D08788l570k758k236k084k194k296k003j146j14L70J8o63r42o34m0O68J539
58628C90703K325K463J831J045O57M79J35j36J80R48J495J569J574J853K354L013
58612D12488L911M907N622N905N880N545M845M106L705L347K372Q34m43j044j266
58597D60714j158m17M46P7j768l383l230k022j494j825j758q57l0K18O64K058
58581D46235M028N729O790P187O968O549O669P456Q040P569O268N048M430M351
$$ y = [440443, 430922, 421935, 413413, 405867, 399838, 395196, 391365, 388096, 385554, 383656, 381872, 379791, 377425, 374843, 372059, 369521, 368105, 368174, 369097, 370167, 371608, 374146, 377950, 382645, 388108, 394501, 401587, 408751, 415755, 422803, 429661, 435336, 438948, 440476, 440319, 438608, 435385, 431146, 426644, 422212, 417706, 413100, 408788, 405218, 402460, 400224, 398140, 395946, 393650, 391647, 390501, 390387, 390757, 390775, 390112, 389170, 388536, 388496, 389164, 390703, 393028, 395491, 397322, 398367, 399024, 399503, 399638, 399502, 399682, 400630, 402125, 403694, 405268, 407121, 409475, 412488, 416399, 421306, 426928, 432833, 438713, 444258, 449103, 453209, 456914, 460261, 462633, 463467, 463024, 461980, 460714, 459556, 459139, 459585, 459662, 457894, 454511, 451281, 449259, 447765, 445940, 444182, 443325, 443295, 443513, 444177, 446235, 450263, 455992, 462782, 469969, 476937, 483486, 490155, 497611, 505651, 513220, 519488, 524536, 528966, 533317]
58567E33317M768N822P374Q778R430R410R440J0160J1596J3320J5001J6474J7405
58554F72295J7335J6244J4671J2945J0678P465L850J005n17j206j806k588l468
58541G46903m380n333o314p349q456r519j0373j1051j1743j2514j3155j3370j3037
58528F20309j2282j1362j0368r133p588o095n060m244l055j603p96j022j455j216
58514E45030o25m92p74p88m65l11l13J20J011J509J079K21k81l03k32l86q00j329
58496E41871j688j691j438j074m86L58J012J002N87M23N78N21J35K2O60J797K924
58479E45513L839M681N789P482R518J0929J1058J0537J0425J0555R758P749N573
58466F53406L943K330K90j509k332k564k913l178k775j921j315r76l59O06J465
$$ y = [533317, 538085, 543907, 551281, 560059, 569489, 578899, 588339, 598499, 610095, 623415, 638416, 654890, 672295, 689630, 705874, 720545, 733490, 744168, 751633, 755483, 756488, 755971, 754765, 752959, 750371, 746903, 742523, 737190, 730876, 723527, 715071, 705552, 695179, 684128, 672385, 659871, 646716, 633346, 620309, 608027, 596665, 586297, 577164, 569576, 563481, 558421, 554177, 551122, 549519, 548723, 547701, 546246, 545030, 544405, 543913, 543139, 542351, 541886, 541575, 541262, 541382, 542393, 543902, 544981, 545202, 544921, 544618, 544386, 544000, 543200, 541871, 540183, 538492, 537054, 535980, 535494, 535852, 536864, 537866, 538453, 538876, 539454, 539975, 540110, 540132, 540792, 542589, 545513, 549352, 554033, 559822, 567304, 576822, 587751, 598809, 609346, 619771, 630326, 640084, 647833, 653406, 657349, 659679, 659969, 658460, 656128, 653564, 650651, 647473, 644698, 642777, 641462, 640486, 640127, 640733, 642198]
58451F42198K132L028M172M877M556L435K235J385O52m55j984l325l878l851l947
58436F51230m289m269l603k834k456k112j210J74J536K686L725M614N352O266
58422F54810P575Q872R496R290Q669Q066P690P506P099N854L643J132r05k296
58408G36501l250l872m269m713n188n216m609l967l845l851l234k060j046m73
58394F86908N4R16K105L431M521M780M037L073K867L436L980L944L367K399J308
58379G31126P43J159J980K203J817J702K112K316K004J984K928M317N278N741
58365G67410O033O011N472M968N335O571P959R180J0502J1859J2617J2465J1889
58352H78271J1363J0633R265P576O410O103O125N735M728L485K666K816L931N329
$$ y = [642198, 644330, 647358, 651530, 656407, 660963, 664398, 666633, 668018, 668670, 668215, 666231, 662906, 659028, 655177, 651230, 646941, 642672, 639069, 636235, 633779, 631667, 630457, 630631, 632167, 634853, 638578, 643192, 648544, 654810, 662385, 671257, 680753, 690043, 698712, 706778, 714468, 721974, 729073, 734927, 738570, 739702, 738797, 736501, 733251, 729379, 725110, 720397, 715209, 709993, 705384, 701417, 697572, 693721, 690487, 688427, 687381, 686908, 686962, 687878, 689983, 693414, 697935, 702715, 706752, 709825, 712692, 716128, 720108, 724052, 727419, 729818, 731126, 731869, 733028, 735008, 737211, 739028, 740730, 742842, 745158, 747162, 749146, 752074, 756391, 761669, 767410, 773443, 779454, 784926, 789894, 795229, 801800, 809759, 818939, 829441, 841300, 853917, 866382, 878271, 889634, 900267, 909532, 917108, 923518, 929621, 935746, 941481, 946209, 949694, 952360, 955176, 959107, 964436]
58338I64436O248O680P267Q334R532J0600J1897J3686J5325J5905J5394J4535
58326A099839J3800J3137J2655J2684J2988J2714J1446R802Q598P974P555P135
58314A230327O778O645O876P473Q206Q895R728J0846J1795J2106J2291J3393J5389
58301A360748J7060J7675J7848J8245J8534J8269J7943J8253J9034J9746K0389
58290A563744K1102K1455K1113K0780K1509K3341K5448K7313K8973L0382L1489
58279A836649L2767L4757L7077L8680L9099L8833L8495L8250L8109L8161L8417
58268B249294L8855L9693M1258M3543M6095M8320M9888N1083N2847N6002O0307
58257B777185O4664O8403P1678P4588P6831P8511Q0377Q2671Q4751Q6355Q8321
$$ y = [964436, 970684, 977364, 984631, 992965, 1002497, 1013097, 1024994, 1038680, 1054005, 1069910, 1085304, 1099839, 1113639, 1126776, 1139431, 1152115, 1165103, 1177817, 1189263, 1199065, 1207663, 1215637, 1223192, 1230327, 1237105, 1243750, 1250626, 1258099, 1266305, 1275200, 1284928, 1295774, 1307569, 1319675, 1331966, 1345359, 1360748, 1377808, 1395483, 1413331, 1431576, 1450110, 1468379, 1486322, 1504575, 1523609, 1543355, 1563744, 1584846, 1606301, 1627414, 1648194, 1669703, 1693044, 1718492, 1745805, 1774778, 1805160, 1836649, 1869416, 1904173, 1941250, 1979930, 2019029, 2057862, 2096357, 2134607, 2172716, 2210877, 2249294, 2288149, 2327842, 2369100, 2412643, 2458738, 2507058, 2556946, 2608029, 2660876, 2716878, 2777185, 2841849, 2910252, 2981930, 3056518, 3133349, 3211860, 3292237, 3374908, 3459659, 3546014, 3634335]
58246C634335R1353R5127R9305J04450J10952J18063J24987J32069J39903J48174
58236D798718J56451J65229J75078J85690J96757K08829K22175K36048K50264
58227F595239K66303K85287L06188L27723L50768L76979M06248M37725M72392
58218I824852N12367N58262O09375O65921P29106P99710Q78426R66752J065815
58209A6610586J175820J298956J441487J610873J812858K054542K348524K711104
58201C1064750L158592L708924M383446N201185O172823P305638Q613031J0115633
58193G9724022J1840175J3828734J6142069J8822513K1812699K4868719K7511919
58186B14550850K9055397K8745889K6024723K0797938J3530257N082557l576663
$$ y = [3634335, 3725688, 3820815, 3920120, 4024570, 4135522, 4253585, 4378572, 4510641, 4650544, 4798718, 4955169, 5120398, 5295476, 5481166, 5677923, 5886752, 6108927, 6344975, 6595239, 6861542, 7146829, 7453017, 7780740, 8131508, 8508487, 8914735, 9352460, 9824852, 10337219, 10895481, 11504856, 12170777, 12899883, 13699593, 14578019, 15544771, 16610586, 17786406, 19085362, 20526849, 22137722, 23950580, 26005122, 28353646, 31064750, 34223342, 37932266, 42315712, 47516897, 53689720, 60995358, 69608389, 79724022, 91564197, 105392931, 121535000, 140357513, 162170212, 187038931, 214550850, 243606247, 272352136, 298376859, 319174797, 332705054, 337787611, 334210948]
58179C34210948j1582858j8251391k3114555k5987203k7000660k6526437k5021195
58172A76726649k2896908k0470888j7970159j5549174j3306966j1301779r558986
58165F5671789q075314o828068n788027m926323m214268l624277l133443k723960
58157B6358109k380159k088150j838254j624489j441060j281691j142207j020876
58149A3541223r15721q23752p43135o73651o14387n62900n17314m77474m43308
58140G769581m13522l86457l61062l36672l13016k90710k70697k52893k36300
58131D908252k20423k05635j92139j79685j68280j58163j48977j39954j31042
58122C363954j22891j15758j09317j03560r8814r4789r0505q5521q0408p5862
$$ y = [334210948, 322628090, 304376699, 281262144, 255274941, 228274281, 201747844, 176726649, 153829741, 133358853, 115388694, 99839520, 86532554, 75230775, 65671789, 57596475, 50768407, 44980380, 40054057, 35839789, 32215512, 29082069, 26358109, 23977950, 21889800, 20051546, 18427057, 16985997, 15704306, 14562099, 13541223, 12625502, 11801750, 11058615, 10384964, 9770577, 9207677, 8690363, 8212889, 7769581, 7356059, 6969602, 6608540, 6271868, 5958852, 5668142, 5397445, 5144552, 4908252, 4687829, 4482194, 4290055, 4110370, 3942090, 3783927, 3634950, 3494996, 3363954, 3241063, 3125305, 3015988, 2912428, 2813614, 2718825, 2628320, 2542799, 2462391, 2386529]
58112B386529p1963o8485o5296o2265n9285n6521n4182n2116n0069m8144m6561
58101A751642m5132m3638m2489m2253m2629m2590m1645m0275l8999l7611l5533
58090A298848l2526k8911k5303k2270k0080j8738j8149j8053j7910j7398j7011
58079A062499j7508j8656j9287j8911j8333j8213j8060j7411j7000j7600j8472
58068H63048j8243j6941j5827j5479j5267j4721j4260j4236j4213j3517j2034
58057F98310j0316r212r265j0069j0490j0004r349r293r355q682p613p287p899
58044E79476q545q704q764q962q865q162p100o002n025m439m423m551m314m038
58030D87582m400n193n609n706o323p426p867p259o750p231p890p516o418n899
$$ y = [2386529, 2314566, 2246081, 2180785, 2118520, 2059235, 2002714, 1948532, 1896416, 1846347, 1798203, 1751642, 1706510, 1662872, 1620383, 1578130, 1535501, 1492911, 1451266, 1410991, 1371992, 1334381, 1298848, 1266322, 1237411, 1212108, 1189838, 1169758, 1151020, 1132871, 1114818, 1096908, 1079510, 1062499, 1044991, 1026335, 1007048, 988137, 969804, 951591, 933531, 916120, 899120, 881520, 863048, 844805, 827864, 812037, 796558, 781291, 766570, 752310, 738074, 723861, 710344, 698310, 687994, 678782, 669517, 659448, 648958, 638954, 629605, 620312, 610957, 602275, 594662, 587375, 579476, 570931, 562227, 553463, 544501, 535636, 527474, 520374, 514372, 509347, 504908, 500485, 495934, 491620, 487582, 483182, 477989, 472380, 466674, 460351, 452925, 445058, 437799, 431049, 423818, 415928, 408412, 401994, 396095]
58016C96095o338o765o233m858l459k718k754l229l732m056m030l365k102j033
58002C41423j044j947k588k258j379o73l49l52p13j237j472j382j485k010k466
57987C20068k472k349k418k314j618o89k13k73n09q51j411j905j898j568j583
57972B97997k178k830k860k056p62K80K84q45k116k282j165J83P45N48L08M36
57956B83687P86J102J344J504J486J293J114J015P37J05m54k64O23J308J139N46
57940B97071M01Q74J454J834K210K746L353L939M400M321L277J568J64l10j52
57925C27150j21p92k364m497o213o549n650m852n288o769q144q458p509n772m102
57910B50070l227l125l049k387j318m41o9m0m8Q3L26N08N24M45K53k62r72j109
$$ y = [396095, 389757, 382992, 376759, 371901, 368442, 365724, 362970, 359741, 356009, 351953, 347923, 344558, 342456, 341423, 340379, 338432, 335844, 333586, 332207, 331534, 331185, 330833, 330120, 328883, 327411, 326029, 324544, 322534, 320068, 317596, 315247, 312829, 310515, 308897, 308208, 307995, 307722, 307213, 306362, 304951, 303046, 301148, 299580, 297997, 295819, 292989, 290129, 288073, 287311, 287591, 287875, 287030, 284914, 282632, 281467, 281650, 282395, 282943, 283251, 283687, 284473, 285575, 286919, 288423, 289909, 291202, 292316, 293331, 294068, 294173, 293719, 293455, 294078, 295386, 296525, 297071, 297472, 298346, 299800, 301634, 303844, 306590, 309943, 313882, 318282, 322603, 325880, 327448, 327612, 327302, 327150, 327029, 326237, 323873, 319376, 313163, 306614, 300964, 296112, 290824, 284055, 275911, 267453, 259944, 254172, 250070, 246843, 243718, 240669, 238282, 236964, 236523, 236454, 236414, 236366, 236449, 236775, 237283, 237807, 238252, 238505, 238243, 237271, 236162]
57892B36162q3J447K123J515N01j17m51p55p00j13K98k88j738l221m173m544m440
57875B21423m110l945l967l653k707j680j286j484j732j828j896j842j442q03
57861A89048j90L79R50J305J333J453K084K939L422L484L483L460L172K726K447
57846B21495K251J789J088M19l03j318k360k954l268l778m182l564j854j65O48
57831B03944R35J309J626J513J214J244J632K139K899M179N668O621O631N886
57817B47440M738L340J675l67k776n111o584o851o521o506o913p077o593n896
57803A95998n572n502n027l827k379j428j180j171r17n33n15r55j273q88j4N20
57787A65337L16mN07J984L566M381M386M069L710L312L001K969L036K771K169
$$ y = [236162, 236079, 237526, 239649, 241164, 241665, 241548, 241097, 240342, 239642, 239529, 239827, 239539, 237801, 234580, 230407, 225863, 221423, 217313, 213368, 209401, 205748, 203041, 201361, 200075, 198591, 196859, 195031, 193135, 191293, 189851, 189048, 188858, 189237, 190187, 191492, 192825, 194278, 196362, 199301, 202723, 206207, 209690, 213150, 216322, 219048, 221495, 223746, 225535, 226623, 227042, 226739, 225421, 223061, 220107, 216839, 213061, 208879, 205315, 203461, 203296, 203944, 204879, 206188, 207814, 209327, 210541, 211785, 213417, 215556, 218455, 222634, 228302, 234923, 241554, 247440, 252178, 255518, 257193, 256826, 254050, 248939, 242355, 235504, 228983, 222477, 215564, 208487, 201894, 195998, 190426, 184924, 179897, 176070, 173691, 172263, 171083, 169912, 168995, 168462, 167947, 166992, 165719, 164831, 164817, 165337, 165653, 165649, 166156, 168140, 171706, 176087, 180473, 184542, 188252, 191564, 194565, 197534, 200570, 203341, 205510]
57772B05510J692J539J373R82O09L00m38j846l278m014m244m587n005m996m606
57757A78991m340m223l818l218l037l269l073k027q25k53k20k60l84p98j296j449
57741A46501j236r09o15m30n47r62j296j326j410j919k539k539j678m45M65O68
57725A29783L34J15N93J489J805J107J95O0N27O40P9n70p88o59m00m7K11L1n58
57706A33947j109j365j478j492j175n80k15l18m35r4M33N34J16m02p27q46p26
57689A24068l35L7rl72m69n2L96L83J73M86J528K835M073N470P271R204J0936
57672A65623J2795J5408J8745K2222K5778L0035L4781L7967L7051L1174K1499
57661D53078R702k931j4996k4705l0856l3653l4101l2898l0300k6649k2485j8312
$$ y = [205510, 207202, 208741, 210114, 211096, 211705, 212005, 211567, 209721, 206443, 202429, 198185, 193598, 188593, 183597, 178991, 174651, 170428, 166610, 163392, 160355, 157086, 154013, 151986, 151161, 150908, 150688, 150428, 150044, 149246, 147950, 146501, 145265, 144356, 143741, 143311, 142764, 141802, 140506, 139180, 137770, 135851, 133312, 130773, 129095, 128650, 129115, 129783, 130117, 130232, 130825, 132314, 134119, 135226, 135421, 135481, 136008, 136648, 136727, 136157, 135369, 134710, 134310, 134263, 134474, 134505, 133947, 132838, 131473, 129995, 128503, 127328, 126748, 126533, 126215, 125780, 125686, 126119, 126653, 126769, 126367, 125640, 124794, 124068, 123733, 123770, 123761, 123389, 122920, 122868, 123264, 123647, 123820, 124306, 125834, 128669, 132742, 138212, 145483, 154687, 165623, 178418, 193826, 212571, 234793, 260571, 290606, 325387, 363354, 400405, 431579, 453078, 462780, 459849, 444853, 420148, 389292, 355639, 321538, 288640, 258340, 231691, 209206, 190894]
57649A90894j4584j1780j0041q864p548n969m587l784l491l373l081k369j315
57636A10108l51J79M10O38P12K68m77p05QJ117J729J534Q56J35m06p25r31j130
57618A12969j215r53m31j07k85p94j371k014k651k769j995p80p5l13j056j594
57602I4566j526q33J70R32J077P32K18m62j365k033j870j068m77l85k12K54K30
57585H7948q59k246k733k315j962j997j720p25L55Q00P60Q05J002R76N91P0m09
57568G8341q51j216j381j301j082q71q23j033j401j658j621j361j034o93l61r0
57552F1564J77N80J029J095N20l22p58n94k42j06j52j10J86P94J654K390K437
57535G0142J677P66M88Q09R35L40o26j254j310j125j054j150j231j007k61Q06
$$ y = [190894, 176310, 164530, 154489, 145625, 138077, 132108, 127521, 123737, 120246, 116873, 113792, 111423, 110108, 109757, 109936, 110346, 110984, 111696, 111964, 111487, 110782, 110790, 111907, 113636, 115170, 116026, 116161, 115755, 115030, 114099, 112969, 111754, 110801, 110370, 110263, 109978, 109184, 107813, 105799, 103148, 100379, 98384, 97604, 97529, 97216, 96160, 94566, 93040, 92207, 92377, 93309, 94386, 95118, 95336, 94874, 93509, 91476, 89606, 88538, 88061, 87676, 87464, 87718, 87948, 87089, 84843, 82110, 79795, 77833, 75836, 74116, 73391, 73746, 74546, 75306, 76111, 77113, 78089, 78680, 78750, 78341, 77490, 76274, 74893, 73592, 72510, 71639, 70816, 69783, 68382, 66724, 65103, 63742, 62708, 62015, 61654, 61564, 61741, 62321, 63350, 64445, 64965, 64643, 63885, 63291, 63049, 62943, 62791, 62681, 62867, 63661, 65315, 67705, 70142, 71819, 72585, 73073, 73882, 74817, 75157, 74531, 73277, 71967, 70842, 69788, 68638, 67407, 66400, 66139, 66945]
57519F6945J470J130J35m08J13J084J474J089O35O34P92N77Pl91l38j27j96n31
57501G4094p15n31l17n42j140j511j300q70q06j144j382j202q91r14j281j541
57485E8007j327p57k77j60k75l22j59J80O97J402K042K214J817J188O41J14n69
57468F4456j342j990k342k133j103M42J485J265K14o46r57j110j227r54l97l33
57452E3328j086j868j765q78O0O86J021Q93J33p79j016m98k5k11p03p22p6O90
57434D7184R88P99N93P23J007J011O87M12L36J13m94j042r63l84Q1K20L30M72
57416E2073L19j33k65L17J142J453J132O47L12J9l23n02k52L65Q91P96L1p50p26
57397E6546J42R67R48K72k73l59k82k05J50Q28J232P81k10q28o36q5K44L64O48
$$ y = [66945, 68415, 69545, 69680, 69272, 69385, 70469, 71943, 73032, 73667, 74301, 75093, 75670, 75677, 75286, 74948, 74821, 74625, 74094, 73379, 72848, 72531, 71989, 70849, 69338, 68038, 67168, 66362, 65218, 63836, 62634, 61743, 60829, 59548, 58007, 56680, 55923, 55646, 55486, 55211, 54889, 54730, 54910, 55607, 57009, 59051, 61265, 63082, 64270, 64911, 65025, 64456, 63114, 61124, 58782, 56649, 55546, 55988, 57473, 58738, 58952, 58306, 57349, 56239, 55012, 54058, 53661, 53328, 52242, 50374, 48609, 47731, 47791, 48477, 49498, 50391, 50524, 49745, 48729, 48231, 48206, 47995, 47292, 46570, 46494, 47184, 48172, 48971, 49564, 50287, 51294, 52305, 52992, 53404, 53740, 53853, 53359, 52317, 51354, 50970, 51051, 51271, 51601, 52073, 52392, 52259, 51994, 52311, 53453, 54906, 56038, 56685, 56997, 57016, 56693, 56191, 55939, 56304, 57195, 57991, 58022, 57272, 56546, 56688, 57655, 58603, 58875, 58602, 58243, 57961, 57756, 57906, 58734, 59966, 60747, 60537, 59709, 59073, 58988, 59232, 59596, 60244]
57378F0244J103J315J072O24K78m3n01q70p42k05J25j38o37p70m80k03k12l65
57360E9595n13o80p84n23J69Q44J002P20N12O40Q84R95J076J341J695J793J416
57343G0182O89q0o67j040j262j331j127n68K09Q55J041P17J78j02J64Q07J348
57326G0013J479J324J172J137J193J328J446J258O40o1m01n11q49j319j210k51
57310G6388P86J002M56r1k34j88j96k37k88m31o12o83o59o27m83l1N93J006J080
57291G6551J031J031R64O45Mq73j629j679p76N37J419J631J517J243O59M2J00
57274H2417J029K023K207J591P94K32q0j99j55K2M33J159J912K131J715J176Q95
57257I9302O98M96P13J494K114J866J169J002J435J594J066N01O05J186J520J263
$$ y = [60244, 61347, 62662, 63734, 64358, 64636, 64593, 64092, 63222, 62480, 62275, 62400, 62262, 61625, 60855, 60375, 60172, 59960, 59595, 59082, 58402, 57618, 57095, 57264, 58108, 59110, 59830, 60342, 60982, 61866, 62861, 63937, 65278, 66973, 68766, 70182, 70871, 70791, 70124, 69084, 67822, 66491, 65364, 64796, 65005, 65860, 66901, 67618, 67796, 67694, 67858, 68665, 70013, 71492, 72816, 73988, 75125, 76318, 77646, 79092, 80350, 80990, 80929, 80528, 80017, 79168, 77849, 76639, 76388, 77174, 78176, 78632, 78541, 78307, 78119, 77923, 77686, 77398, 76967, 76355, 75672, 75013, 74386, 73903, 73872, 74465, 75471, 76551, 77582, 78613, 79577, 80222, 80226, 79353, 77724, 76045, 75269, 75806, 77225, 78856, 80373, 81616, 82275, 82317, 82417, 83446, 85469, 87676, 89267, 90061, 90293, 90213, 90014, 89859, 89881, 90314, 91473, 93385, 95516, 97231, 98407, 99302, 100000, 100496, 101209, 102703, 104817, 106683, 107852, 108854, 110289, 111883, 112949, 113450, 114055, 115241, 116761, 118024]
57241A18024O56J30n7J11N43J198K002K628K678K283K109K490K914K852K635K865
57225A46061L336L312K755K372K466K580K412K257K270K107J684J613K393L608
57211A81226M442M551M147L628L447L921M785N369N510N798O519P009O669O091
57197B53112O355P489Q450Q543Q092P647P332P193P542Q538R768J0620J0881J0786
57183C72348J0658J0723J1079J1672J2277J2694J3000J3543J4591J5927J6896
57172E15408J7014J6534J6255J6706J7710J8713J9327J9456J9286J9302J9976
57161G15687K1167K2142K2521K2804K3607K4676K5255K5218K5269K5964K7150
57150I81460K8373K9458L0477L1502L2516L3307L3529L3155L2826L3213L4110
$$ y = [118024, 118680, 118810, 118753, 118864, 119407, 120605, 122607, 125235, 127913, 130196, 132305, 134795, 137709, 140561, 143196, 146061, 149397, 152709, 155464, 157836, 160302, 162882, 165294, 167551, 169821, 171928, 173612, 175225, 177618, 181226, 185668, 190219, 194366, 197994, 201441, 205362, 210147, 215516, 221026, 226824, 233343, 240352, 247021, 253112, 259467, 266956, 275406, 283949, 292041, 299688, 307020, 314213, 321755, 330293, 340061, 350681, 361562, 372348, 383006, 393729, 404808, 416480, 428757, 441451, 454451, 467994, 482585, 498512, 515408, 532422, 548956, 565211, 581917, 599627, 618340, 637667, 657123, 676409, 695711, 715687, 736854, 758996, 781517, 804321, 827928, 852604, 877859, 903077, 928346, 954310, 981460, 1009833, 1039291, 1069768, 1101270, 1133786, 1167093, 1200622, 1233777, 1266603, 1299816, 1333926]
57139A333926L4696L4737L4884L5565L6324L6729L7341L9151M2407M6646N1512
57128A763918N6766O1606O4844O5977O5556O4273O2300N9900N8162N8521O1610
57117B443433O6968P3738Q1247Q9012R6683J04338J12620J22283J33711J46999
57107C471032J62390J80382K01353K25587K53950K88421L31581L85640M52342
57098E952678N33886O33443P54494Q99936J071961J272064J500311J754563K030826
57089A6404162K323967K626945K928788L213301L458579L635202L703960L619553
57081D1914457L345362K874224K241055J516259P81782J03280m86655r87265j414716
57072D9887783j785262k106605k379071k600355k767906k878632k929055k917265
$$ y = [1333926, 1368622, 1403359, 1438243, 1473808, 1510132, 1546861, 1584202, 1623353, 1665760, 1712406, 1763918, 1820684, 1882290, 1947134, 2013111, 2078667, 2142940, 2205240, 2265140, 2323302, 2381823, 2443433, 2510401, 2584139, 2665386, 2754398, 2851081, 2955419, 3068039, 3190322, 3324033, 3471032, 3633422, 3813804, 4015157, 4240744, 4494694, 4783115, 5114696, 5500336, 5952678, 6486564, 7120007, 7874501, 8774437, 9846398, 11118462, 12618773, 14373336, 16404162, 18728129, 21355074, 24283862, 27497163, 30955742, 34590944, 38294904, 41914457, 45259819, 48134043, 50375098, 51891357, 52673139, 52776419, 52289764, 51302499, 49887783, 48102521, 45995916, 43616845, 41016490, 38248584, 35369952, 32440897, 29523632]
57064B9523632k845116k719098k549745k350052k133338j911418j693914j488330
57056A1832621j299916j131245r82494q52554p40005o43210n60124m88544m26627
57047D707902l73088l27003k87465k53402k23661j97399j74253j53959j35840
57038B581832j18964j02846q7495p2520n6727l9549k2983j1325q148j3528k4609
57027B023138l8536n4022o9869q3245r0861r1883q8588q3797p8391p1851o4296
57016A207799n6956n0796m5678m0977l6496l2440k8987k6126k3709k1582j9780
57005H24272j8581j8075j7777j6998j5595j4021j2640j1357j0014q752p807p175
56993F65480o567n578l948j938l30K62K01N84K101M271N841N750L896J173j315
$$ y = [29523632, 26678516, 23959418, 21409673, 19059621, 16926283, 15014865, 13320951, 11832621, 10532705, 9401460, 8418966, 7566412, 6826407, 6183197, 5623073, 5134529, 4707902, 4334814, 4007811, 3720346, 3466944, 3243283, 3045884, 2871631, 2717672, 2581832, 2462868, 2360022, 2272527, 2200007, 2143280, 2103731, 2080748, 2069423, 2061275, 2047747, 2023138, 1984602, 1930580, 1860711, 1777466, 1686605, 1594722, 1506134, 1422337, 1343946, 1272095, 1207799, 1150843, 1100047, 1054369, 1013392, 976896, 944456, 915469, 889343, 865634, 844052, 824272, 805691, 787616, 769839, 752841, 737246, 723225, 710585, 699228, 689214, 680462, 672655, 665480, 658913, 653335, 649387, 647449, 647119, 647381, 647582, 648166, 650267, 654538, 660379, 666129, 670025, 671198, 669883]
56978F69883l382n835r157j2495j4598j5308j5325j4822j3460j1754j0993j1361
56966E31393j1315r564o708m128k108o0K141M125N934P878R594J0157R105O735
56952E53179L505j70l780p023j0091j3024j5112j5669j5113j4363j3408j1510
56940D37421q729o115m165k171N41L660O631R493J2440J5099J6803J7098J5659
56927E13665J2273P417K222k607p336j2198j6427j8962j9726j9522j8939j8023
56915D01837j6801j5436j3941j2338j1016j0345r984r152p663o105m932l928k814
56902B77382j855j471j581j742j646j217m25O05J465J888K277L370N263P140Q252
56887B97705Q762R290R826R693Q567P024N772M633K747k91l782o443p528p345
$$ y = [669883, 666501, 660666, 651509, 639014, 624416, 609108, 593783, 578961, 565501, 553747, 542754, 531393, 520078, 510514, 503806, 499678, 497570, 497510, 499651, 503776, 509710, 517588, 527182, 537339, 546444, 553179, 556684, 556514, 552734, 545711, 535620, 522596, 507484, 491815, 476702, 462339, 448931, 437421, 428692, 422577, 418412, 416241, 416782, 420442, 427073, 436566, 449006, 464105, 480908, 498006, 513665, 525938, 533355, 535577, 532970, 525634, 513436, 497009, 478047, 458321, 438799, 419860, 401837, 385036, 369600, 355659, 343321, 332305, 321960, 311976, 302824, 295161, 289056, 284124, 280196, 277382, 275527, 274056, 272475, 270733, 269087, 267870, 267445, 268050, 269515, 271403, 273680, 277050, 282313, 289453, 297705, 306467, 315757, 325583, 335276, 343843, 350867, 356639, 361272, 364019, 363728, 359946, 353503, 345975, 338630]
56873C38630o747o206n448m058k172j51K193N410R284J2606J4601J6036J8259
56860C92237K1406K4223K5441K4616K1773J7040J0920M253k345q547j3768j7150
56848E00099j8404j8199j7322j5811j3230r402m668L95N253R722J4157J9076K4443
56835D76109K9703L4473L8669M1658M1987L8542L1547K2009J0646j972j4634k5612
56823G23125l3598l8075l9074l7228l3873l0272k6533k1838j5904r593l921R92
56811D34208N661J0380J5034J9474K3585K6940K8670K7734K3462J6054O640l361
56799F34481j2963k1587k8452l2581l3662l2451k9966k6631k2585j8460j5078
56788C60065j2442r675o194k354J316M907Q686J2185J4454J5088J4363J2371Q698
$$ y = [338630, 331883, 325677, 320229, 316171, 313999, 313848, 316041, 321451, 330735, 343341, 357942, 373978, 392237, 413643, 437866, 463307, 487923, 509696, 526736, 537656, 541909, 539564, 531017, 517249, 500099, 481695, 463496, 446174, 430363, 417133, 407731, 403063, 403458, 408711, 418433, 432590, 451666, 476109, 505812, 540285, 578954, 620612, 662599, 701141, 732688, 754697, 765343, 763371, 748737, 723125, 689527, 651452, 612378, 575150, 541277, 511005, 484472, 462634, 446730, 437137, 433216, 434208, 439869, 450249, 465283, 484757, 508342, 535282, 563952, 591686, 615148, 631202, 637842, 634481, 621518, 599931, 571479, 538898, 505236, 472785, 442819, 416188, 393603, 375143, 360065, 347623, 337948, 331754, 329400, 330716, 335623, 344309, 356494, 370948, 386036, 400399, 412770, 421468]
56775D21468L289k932q706j3387j6926j9282k0406k0566k0135j9101j7256j4890
56763B51170j2764j1307j0243r155p988o871n854n034m569m318l826k916k021
56750A64304j559j354j057q62j254k082k508k030j121o65r67j611k043k025j641
56735A41525j094n85j66K61P03Q31K51q52j595j262j72O93Q75P52O62K93o25j537
56717A38958j581o58N25J349J673J505R80N54O44Q96N16n74j501j534q70j40K72
56700A41014K17k29n04M4J067J305K36j032j223n26QR7J96L02k6n46m46L61R48
56681A41263P01On30p95p49k30M34M25l71r30n13J37j26j054j340n40L69M99J53
56662A36809O6L17N12N42N27L53m9j76N83J915K642K188J319J063J342J347R21
$$ y = [421468, 424757, 421825, 413119, 399732, 382806, 363524, 343118, 322552, 302417, 283316, 266060, 251170, 238406, 227099, 216856, 207701, 199713, 192842, 186988, 181954, 177385, 173067, 169241, 166325, 164304, 162745, 161391, 160334, 159472, 158218, 156136, 153628, 151598, 150477, 149812, 148845, 147234, 145191, 143166, 141525, 140431, 139846, 139680, 139941, 140644, 141475, 141726, 140874, 139279, 138017, 137845, 138538, 139413, 140165, 140827, 141120, 140495, 138958, 137377, 136719, 137244, 138593, 140266, 141771, 142751, 143305, 143949, 144845, 145361, 144787, 143286, 141752, 140882, 140742, 141014, 141231, 141002, 140498, 140542, 141609, 142914, 143150, 142118, 140895, 140369, 140377, 140474, 140670, 140972, 140946, 140400, 139954, 140315, 141263, 141964, 141970, 141440, 140645, 139896, 139666, 140100, 140525, 140154, 139224, 138711, 138848, 138722, 137668, 136328, 135788, 136157, 136656, 136809, 136875, 137192, 137704, 138246, 138773, 139126, 139077, 138901, 139484, 141399, 144041, 146229, 147548, 148611, 149953, 151300, 152221]
56645A52221P21J045J293R76N51P66J571K197K091J348M16k20k22K69N41J2j018
56628A64558j646j363m47N72J396J836J666Q45k37r62r43l67P0k57j179j753j319
56611A60470l58N2m42j167j421j270j152j123q66k94J67j9q98j863k139j551o58
56594A45468n8J90K92J96k03n72l95K43O90O09L76M24O61P82P00M29p7o53p97
56575A48305k47O16J225J502J681J727J374P63M61P54J268J548J741K331L384
56560A68433M453N272O092P070P653P070N356L420J898N09j187k824l580l282
56546B06353k604k173j983j798j642j667j814j882j821j774j909k190k324k002
56532A78770j300o80m63m87m97n91r19j172r42m58l66p58j006p15k62j24j96r3
$$ y = [152221, 152942, 153987, 155280, 156256, 156807, 157573, 159144, 161341, 163432, 164780, 165196, 164976, 164754, 165023, 165564, 165576, 164558, 162912, 161549, 161102, 161674, 163070, 164906, 166572, 167417, 167180, 166218, 165275, 164908, 164978, 164721, 163542, 161789, 160470, 160112, 160164, 159722, 158555, 157134, 155864, 154712, 153589, 152723, 152429, 152596, 152577, 151679, 149816, 147677, 146126, 145468, 145410, 145600, 145892, 146088, 145885, 145313, 144918, 145161, 145851, 146460, 146836, 147260, 147921, 148703, 149403, 149832, 149755, 149102, 148305, 148058, 148674, 149899, 151401, 153082, 154809, 156183, 156946, 157407, 158161, 159429, 160977, 162718, 165049, 168433, 172886, 178158, 184250, 191320, 198973, 206043, 211399, 214819, 216717, 217226, 216039, 213215, 209635, 206353, 203749, 201576, 199593, 197795, 196153, 194486, 192672, 190790, 188969, 187195, 185286, 183096, 180772, 178770, 177470, 176790, 176327, 175840, 175343, 174752, 173833, 172661, 171719, 171261, 170895, 170137, 169131, 168416, 168154, 168030, 167834, 167741]
56514A67741K44N25N31K75k7p7J83K98k12j060j355p86j10r2m91n33l2N46Q70
56495A66438J009J027Q41N03K27M9j62l55k94J6J95k6m25n13m8P47J380J432P65
56476A72806l85j461j849j314k38O89J108J157J034P35M49O96J592K287J862N90
56460A79758l78n68n72q06q10j92N64Q13O93O73O98M20o0l38l17j51J34M17K55
56441A80233m60r70n49L02M32l00q49o19k38l80o94n08k4L2l32k31Q19K050K246
56422A79960J140k84r19o44j20K57O75J230J486J066L01j44r3J38L04M04L23r3
56404A84987o00o34L8R54J451J274P48M57P70J467J925J785J333J060J021Q94
56388A98930M23l85j252j528n61J386K957L069K182J538J441J176M73o2j38k77
$$ y = [167741, 167985, 168510, 169041, 169316, 169289, 169212, 169395, 169693, 169481, 168421, 167066, 166280, 166170, 166078, 165587, 165054, 165022, 165568, 166438, 167447, 168474, 169315, 169818, 170045, 170094, 169932, 169577, 169283, 169299, 169494, 169468, 169043, 168530, 168482, 169229, 170609, 172041, 172806, 172421, 170960, 169111, 167797, 167559, 168248, 169356, 170513, 171547, 172282, 172731, 173427, 175019, 177306, 179168, 179758, 179380, 178812, 178240, 177434, 176624, 176432, 176996, 177809, 178502, 179175, 179873, 180293, 180233, 179895, 179578, 179427, 179561, 179978, 180233, 179773, 178803, 178254, 178556, 178988, 178688, 177839, 177220, 176982, 176602, 175908, 175400, 175376, 175408, 175076, 174845, 175664, 177714, 179960, 181100, 180816, 179897, 179253, 179133, 179390, 180065, 181295, 182781, 183847, 184148, 184004, 183911, 184049, 184353, 184757, 185080, 184987, 184387, 183753, 183791, 184745, 186196, 187470, 188218, 188675, 189445, 190912, 192837, 194622, 195955, 197015, 198036, 198930, 199353, 198968, 197716, 196188, 195627, 197013, 199970, 203039, 205221, 206759, 208200, 209376, 209849, 209787, 209649, 209372]
56372B09372p61j016o53k27k55k31N20J560J852J267O80O27P67O88N26N67Q20
56355B16103J151J449J502J115N23K68M89P03M34j86o78p79n64j99K06O40J233
56338B23410K106L033L429K884J690O63M40J015J874K516K807K917K986K969K789
56323B57528K500K165J741J259R90J168J554J620J215P55O04N85K94k98q41j045
56307B71794p88k1J125K117K357J853J291J301J840K448K870L173L449L634L645
56292C02088L424K882J995J015M05M25Q66J349J834K612L842N183O074O208N633
56277C45835M528L220K397K813M471O400P569P903Q042Q385Q899R666J0925J2386
56263D43439J3287J3485J3867J5246J7313J9314K1229K3616K6569K9679L2927
$$ y = [209372, 208611, 207595, 206942, 206715, 206460, 206229, 206749, 208309, 210161, 211428, 212108, 212735, 213502, 214190, 214716, 215283, 216103, 217254, 218703, 220205, 221320, 221843, 222111, 222600, 223303, 223737, 223551, 222873, 222094, 221530, 221331, 221537, 222177, 223410, 225516, 228549, 231978, 234862, 236552, 237215, 237655, 238670, 240544, 243060, 245867, 248784, 251770, 254739, 257528, 260028, 262193, 263934, 265193, 266183, 267351, 268905, 270525, 271740, 272495, 273099, 273684, 273978, 273680, 272839, 271794, 271006, 270985, 272110, 274227, 276584, 278437, 279728, 281029, 282869, 285317, 288187, 291360, 294809, 298443, 302088, 305512, 308394, 310389, 311404, 311809, 312234, 313100, 314449, 316283, 318895, 322737, 327920, 333994, 340202, 345835, 350363, 353583, 355980, 358793, 363264, 369664, 377233, 385136, 393178, 401563, 410462, 420128, 431053, 443439, 456726, 470211, 484078, 499324, 516637, 535951, 557180, 580796, 607365, 637044, 669971]
56252F69971L6837M1580M6627N1496N6264O1146O6011P0537P4440P7335P8821
56241A331065P8908P7952P5912P2127O6115N8170M8806L8043K5743J2419q72j3372
56229A871016k4937l5518m4721n2119n7787o2270o5934o8482o9336o8479o6694
56218A254739o4637o2086n8534n4316n0448m7346m4408m1048l7480l4160l1041
56207G29235k7871k4785k2102j9882j8062j6730j5855j4940j3424j1268q975p146
56195E28195o196o109o257n831m714l601l031k682k032j119l45J34L51L25L07
56180D87395P26J435J566P50p7J54J131J707J568J471J983K878L690M150M072
56165E14599L630L525M202N020N108M883N558P244Q719R392J0190J1885J3739
$$ y = [669971, 706808, 748388, 795015, 846511, 902775, 963921, 1029932, 1100469, 1174909, 1252244, 1331065, 1409973, 1487925, 1563837, 1635964, 1702079, 1760249, 1809055, 1847098, 1872841, 1885260, 1884388, 1871016, 1846079, 1810561, 1765840, 1713721, 1655934, 1593664, 1527730, 1459248, 1389912, 1321433, 1254739, 1190102, 1128016, 1069482, 1015166, 964718, 917372, 872964, 831916, 794436, 760276, 729235, 701364, 676579, 654477, 634595, 616533, 599803, 583948, 569008, 555584, 544316, 535341, 528195, 521999, 515890, 509633, 503802, 499088, 495487, 492456, 489774, 487742, 486623, 486278, 486412, 486763, 487088, 487395, 488121, 489556, 491122, 491872, 491795, 491949, 493080, 494787, 496355, 497826, 499809, 502687, 506377, 510527, 514599, 518229, 521754, 525956, 530976, 536084, 540967, 546525, 553769, 562488, 571880, 582070, 593955, 607694]
56152F07694J4716J5339J7185K0897K5638L0382L4981L9933M5800N2954O1301
56141I66820O9857P6843Q0621Q0623P7383P1794O4530N6176M7696M0369L5136
56130A667848L2026L0143K8017K4245J8393J1492N174J11m307q657j2768j6735
56118A774982k1860k9446l9047m8803n7294o4144o8991p1032o9931o6390o1429
56107A176615n5641m9287m2589l5723k8908k2678j7646j3927j1096q657o199l436
56095H80828n61J673K847L574M597N628N922N733O029O900P429P282P136P311
56081I52328P227O668O383O853P482P704P902Q465Q890Q677Q412Q930R961J0565
56067A066447J0554J0630J1319J2434J3559J4441J4992J5308J5657J6185J6860
$$ y = [607694, 622410, 637749, 654934, 675831, 701469, 731851, 766832, 806765, 852565, 905519, 966820, 1036677, 1113520, 1194141, 1274764, 1352147, 1423941, 1488471, 1544647, 1592343, 1632712, 1667848, 1699874, 1730017, 1758034, 1782279, 1800672, 1812164, 1817338, 1817449, 1813142, 1804485, 1791717, 1774982, 1753122, 1723676, 1684629, 1635826, 1578532, 1514388, 1445397, 1374365, 1304434, 1238044, 1176615, 1120974, 1071687, 1029098, 993375, 964467, 941789, 924143, 910216, 899120, 890463, 884264, 880828, 880267, 881940, 884787, 888361, 892958, 898586, 904508, 910241, 916270, 923170, 930599, 937881, 945017, 952328, 959555, 966223, 972606, 979459, 986941, 994645, 1002547, 1011012, 1019902, 1028579, 1036991, 1045921, 1055882, 1066447, 1077001, 1087631, 1098950, 1111384, 1124943, 1139384, 1154376, 1169684, 1185341, 1201526, 1218386]
56056A218386J7754J8944J9999K0206J9634J9368K0206K1599K2429K2406K2112
56045A443043K2081K2420K3135K4207K5452K6660K7896K9364L1058L2672L3809
56034A741797L4240L4195L4328L5076L6092L6707L6937L7526L9000M1131M3340
56023B150369M5230M6661M7884M9468N1715N4243N6642N9156O2106O5078O7604
56012B756156P0181P3528P7245Q0428Q3329Q6952R1215R5179R9021J03954J10005
56001C727193J15753J20757J26401J33635J41637J49528J57738J66683J75698
55992E015023J84426J93917K05221K18074K31935K47152K64228K82969L03171
55983G146116L25115L48864L74342M02389M34346M70286N09471N52785O02504
$$ y = [1218386, 1236140, 1255084, 1275083, 1295289, 1314923, 1334291, 1354497, 1376096, 1398525, 1420931, 1443043, 1465124, 1487544, 1510679, 1534886, 1560338, 1586998, 1614894, 1644258, 1675316, 1707988, 1741797, 1776037, 1810232, 1844560, 1879636, 1915728, 1952435, 1989372, 2026898, 2065898, 2107029, 2150369, 2195599, 2242260, 2290144, 2339612, 2391327, 2445570, 2502212, 2561368, 2623474, 2688552, 2756156, 2826337, 2899865, 2977110, 3057538, 3140867, 3227819, 3319034, 3414213, 3513234, 3617188, 3727193, 3842946, 3963703, 4090104, 4223739, 4365376, 4514904, 4672642, 4839325, 5015023, 5199449, 5393366, 5598587, 5816661, 6048596, 6295748, 6559976, 6842945, 7146116, 7471231, 7820095, 8194437, 8596826, 9031172, 9501458, 10010929, 10563714, 11166218]
55974A1166218O59206P21458P89365Q66011R54506J056332J173712J310889J471958
55965B0169655J660611J883503K151154K474820K866484L343384L927964M640544
55957D3118119N494841O501046P668491R005861J0527691J2263812J4254391J6530178
55949A25364430J9091181K1862603K4587854K6709863K7411172K5916004K1893741
55942B92836848J5646560P946859k85707q199000j5065996k0326060k3685306
55935B48868198k5186755k5149897k4012399k2187196j9998204j7677336j5384004
55928I9272407j3225690j1271147r555143q082535o838163n797890m934071m217753
55920C5350015l622305l126126k711323k361893k065039j812351j597490j413769
$$ y = [11166218, 11825424, 12546882, 13336247, 14202258, 15156764, 16213096, 17386808, 18697697, 20169655, 21830266, 23713769, 25864923, 28339743, 31206227, 34549611, 38477575, 43118119, 48612960, 55114006, 62782497, 71788358, 82316049, 94579861, 108834252, 125364430, 144455611, 166318214, 190906068, 217615931, 245027103, 270943107, 292836848, 308483408, 316430267, 316144560, 307945560, 292879564, 272553504, 248868198, 223681443, 198531546, 174519147, 152331951, 132333747, 114656411, 99272407, 86046717, 74775570, 65220427, 57137892, 50299729, 44501839, 39567768, 35350015, 31727710, 28601584, 25890261, 23528368, 21463329, 19650978, 18053488, 16639719]
55912A6639719j255197j118063r99686q96787q06519p27759o59798o00818n48868
55903I026224n03206m63400m28162l96237l67488l41901l18479k96129k74915
55894E636307k55464k37767k21312k05717j90742j76464j63844j54176j47473
55885C883348j42318j37646j33501j29713j25269j19678j13709j07946j01850
55876B771718r5028q8288q2493p7479p2934o9345o7048o5250o3040o0596n8487
55865A971730n6527n4214n1633m9089m6483m3846m1839m0977m0896m1085m1557
55854A463584m2129m1854m0037l7197l4214l1187k7961k5147k3536k2955k2542
55843A114825k1893k1200k0633k0241k0145k0270k0238j9982j9932k0087j9599
$$ y = [16639719, 15384522, 14266459, 13266773, 12369986, 11563467, 10835708, 10175910, 9575092, 9026224, 8523018, 8059618, 7631456, 7235219, 6867731, 6525830, 6207351, 5911222, 5636307, 5380843, 5143076, 4921764, 4716047, 4525305, 4348841, 4184997, 4030821, 3883348, 3741030, 3603384, 3469883, 3340170, 3214901, 3095223, 2981514, 2873568, 2771718, 2676690, 2588402, 2505909, 2428430, 2355496, 2286151, 2219103, 2153853, 2090813, 2030217, 1971730, 1915203, 1860989, 1809356, 1760267, 1713784, 1669938, 1628099, 1587122, 1546226, 1505141, 1463584, 1421455, 1379601, 1339564, 1302367, 1268153, 1236966, 1209005, 1183858, 1160322, 1137367, 1114825, 1092932, 1071732, 1051099, 1030858, 1010713, 990443, 970205, 950223, 930291, 910204, 890605]
55832H90605j7961j5934j4518j3613j2532j1289j0432j0083r978j0111j0512j0822
55820G42820j0892j1398j2866j4417j4594j3217j1515j0469j0039r859r785r574
55808F04195q922q090p752q016q167p556o256m746l433k561k149j856j311n65
55794E32815J20P72J570K341K738K882L261M065N108O363P811Q697P654L994j448
55779E88743p027j1539j4599j6267j6582j5403j2594q400l708L51K978L815K738
55766D92506kl582p048j0068j2813j5058j5984j5091j2924j0531q523o883n458
55753C68541m263l413l038l239l994n107o351p533q411q660q115o965n655m649
55739B89148m305m676n279n297m331k956k180k343k798k753k162j592j473j797
$$ y = [890605, 872644, 856710, 842192, 828579, 816047, 804758, 794326, 784243, 774265, 764154, 753642, 742820, 731928, 720530, 707664, 693247, 678653, 665436, 653921, 643452, 633413, 623554, 613769, 604195, 595273, 587183, 579431, 571415, 563248, 555692, 549436, 544690, 541257, 538696, 536547, 534691, 533380, 532815, 532935, 533707, 535277, 537618, 540356, 543238, 546499, 550564, 555672, 562035, 569846, 578543, 586197, 590191, 588743, 581716, 570177, 555578, 539311, 522729, 507326, 494732, 486332, 482624, 482975, 485953, 489768, 492506, 492504, 488922, 481874, 471806, 458993, 443935, 427951, 412860, 399936, 389405, 380882, 373999, 368541, 364278, 360865, 357827, 354588, 350594, 345487, 339136, 331603, 323192, 314532, 306417, 299452, 293797, 289148, 284843, 280167, 274888, 269591, 265260, 262304, 260124, 257781, 254983, 252230, 250068, 248476, 247003, 245206]
55725B45206k333k843l073k940k724k775k979k871k338j837j689j630j303p93
55711B13078l14K70J106J830J923J473J028Q28O27K13m27j347k530l524l736l219
55695B07279k682k668l105l637l929l679k850j963j597j572j247o05k96m27k25
55680A76797P03J601J668J272J315J805J853R30m68j444j538r86m64m75q44r43
55664A80782n33o2O5R1M46J015J302J130Q32Q31J326K136K691K449J569Q90R37
55647A97897J287J160L94o27j573k278k468j955j101o47j021j967k900l415l505
55632A77281l447l451l441l256l023k972l051k985k784k683k584k112j342q64
55618A39286r41j220j460j868k362k284j397m85l90r02j269j272j224j298j496
$$ y = [245206, 242873, 240030, 236957, 234017, 231293, 228518, 225539, 222668, 220330, 218493, 216804, 215174, 213871, 213078, 212764, 213034, 214140, 215970, 217893, 219366, 220394, 221222, 221849, 222062, 221635, 220288, 217758, 214234, 210498, 207279, 204597, 201929, 198824, 195187, 191258, 187579, 184729, 182766, 181169, 179597, 178350, 177745, 177449, 177022, 176797, 177500, 179101, 180769, 182041, 183356, 185161, 187014, 187944, 187476, 186032, 184494, 183508, 183044, 182569, 181725, 180782, 180249, 180187, 180252, 180343, 180789, 181804, 183106, 184236, 185068, 185899, 187225, 189361, 192052, 194501, 196070, 196960, 197897, 199184, 200344, 200738, 200111, 198538, 196260, 193792, 191837, 190736, 190089, 189068, 187101, 184201, 180786, 177281, 173834, 170383, 166942, 163686, 160663, 157691, 154640, 151655, 148871, 146188, 143604, 141492, 140150, 139286, 138345, 137125, 135665, 133797, 131435, 129151, 127754, 127269, 126879, 125977, 124708, 123436, 122212, 120914, 119418]
55603A19418j868k185j839p08L45N02M7k56l27n11o62n31n95j412k384k320j230
55586A03484l81m92r22q21j40P89J741K312K013J098N65Q71J367J395J334J874
55570A16087K823L273K780J754Q74M53L70L37J49k48r20j948l083l603l009j783
55554A14306r37q54j092j285j608k084k166j455m39j4l72p79m43N47J262R39l7
55537A03489n27j02L30j93j172j204R7J560J935J187J30n21m34L03J069J120M57
55520A07524j17j35j09o49j444j747j535j542k217l126l508l061k095j135n28
55505H4576l95p19j306j698j431o28JL7nN95J590J947J203O4n57o22p52j277j829
55486G8794j765r00J90O68L46j11q4K23K65P2M4J73J22mJ63M37J86o40j368j587
$$ y = [119418, 117550, 115365, 113526, 112818, 113163, 113665, 113712, 113456, 113129, 112618, 111956, 111425, 110830, 109418, 107034, 104714, 103484, 103103, 102611, 101689, 100868, 100728, 101517, 103258, 105570, 107583, 108681, 109246, 110117, 111484, 112879, 114213, 116087, 118910, 122183, 124963, 126717, 127591, 128044, 128414, 128751, 128900, 128652, 127732, 125784, 122701, 119098, 116089, 114306, 113369, 112515, 111423, 110138, 108530, 106446, 104280, 102825, 102386, 102372, 102000, 101221, 100778, 101325, 102587, 103526, 103489, 102962, 102860, 103190, 102997, 101825, 100621, 100718, 102278, 104213, 105400, 105530, 105009, 104575, 104878, 105947, 107067, 107524, 107407, 107272, 107163, 106514, 105070, 103323, 101788, 100246, 98029, 94903, 91395, 88334, 86239, 85104, 84576, 84181, 83462, 82156, 80458, 79027, 78399, 78400, 78437, 78432, 79027, 80617, 82564, 83767, 83831, 83274, 82652, 81900, 80623, 78794, 77029, 76129, 76319, 76987, 77333, 77222, 77138, 77361, 77626, 77698, 77742, 77915, 78037, 78033, 78196, 78633, 78819, 78179, 76811, 75224]
55466G5224j505j206m54N36J022P87M96N87O22J94l40n47o65r86j187r82q03j080
55448F9713j307p06N42J503J657J229N49j92p00p10l40P4L71M29J5p26j040m34
55430F9927M45N34j91p01l25M84R65J014J063J324J466J059J84m50k73L46M39
55413G7310l49j294j588j251p76l86j21j31l85m78k30o9l15n89n04m56q56j172
55395F6360o42K92M39l70r79n53M33J064J067P02K70R3M02R50J150Q51M91M24
55377G2444N47O93P71M58n81j864k175j005O31J216L29j182k192k126j139L2N52
55360F5409K32k89k77L05R15J135R23M12k56q33j042q10m01k38m91q37p97l24
55342F2736J25K65L56O61Q23L99l00n87m65o12j183j534j303r95r96p88J96J493
$$ y = [75224, 73719, 72513, 72059, 72595, 73617, 74404, 74900, 75487, 76109, 76303, 75963, 75416, 74751, 73765, 72578, 71596, 70793, 69713, 68406, 67700, 68242, 69745, 71402, 72631, 73180, 72988, 72288, 71578, 71238, 71312, 71683, 72112, 72127, 71401, 70361, 69927, 70372, 70906, 70715, 70014, 69689, 70173, 71138, 72152, 73215, 74539, 76005, 77064, 77248, 76798, 76525, 76871, 77310, 76961, 75667, 74079, 72828, 72052, 71666, 71545, 71414, 71029, 70551, 70321, 70252, 69937, 69348, 68844, 68388, 67532, 66360, 65718, 66010, 66449, 66079, 65100, 64547, 64980, 66044, 67111, 67813, 68083, 68176, 68578, 69528, 70678, 71529, 72020, 72444, 72991, 73684, 74455, 74913, 74332, 72468, 70293, 69288, 69919, 71135, 71464, 70282, 68090, 65964, 64825, 64857, 65409, 65641, 65352, 65075, 65380, 66295, 67430, 68353, 68765, 68509, 67676, 66634, 65824, 65423, 65185, 64694, 63857, 63060, 62736, 62861, 63126, 63482, 64143, 64966, 65365, 65065, 64478, 64013, 63401, 62218, 60684, 59381, 58386, 57390, 56602, 56798, 58291]
55324E8291K132J926J488J161P65K89J24K90J72o38j558j622o48N17R10L99l28
55307F3670m90Q6Q76J195Q33K26k1K59P34J036J126J123J020P49M03J46k6j58
55289G2787p2L80Q22N84l80j193j044j15P19Q66L75l29p71p01m25n24j022j212
55271F8745p29k15l03m71J67J228J345J52j103j178k73O20R91R57O96L24pk76
55253G0670n45o02j27N62N39m67j396j035M60J747J777O74o64j403j398j253j566
55236F5973k030j686k78J189J671J361J129J208J157Q17M72J54l65r05r24m02
55220F8541l8l07q30r76o37j55K14M39N19M48K70P0m4O8M48R11J173J156R72O86
55200G2928L25O1J06L82N31L54n5n65j146j621j655j174n35r5K01N19O81L47l27
$$ y = [58291, 60423, 62349, 63837, 64998, 65763, 66052, 66176, 66466, 66638, 66000, 64442, 62820, 62172, 62689, 63599, 63998, 63670, 63180, 63266, 64142, 65337, 66170, 66396, 66375, 66634, 67368, 68404, 69530, 70653, 71673, 72422, 72825, 72971, 72945, 72787, 72715, 73095, 73917, 74501, 74121, 72928, 71884, 71769, 72488, 73354, 73729, 73400, 72629, 71928, 71503, 70979, 69957, 68745, 68016, 67801, 67498, 67027, 67194, 68422, 69767, 69919, 68816, 67638, 67365, 67985, 68976, 69933, 70629, 70953, 70946, 70670, 70125, 69523, 69396, 69958, 70497, 70030, 68634, 67599, 68059, 69806, 71583, 72257, 71593, 70190, 68792, 67539, 65973, 63943, 62257, 61979, 63168, 64839, 66200, 67329, 68537, 69694, 70511, 70983, 71137, 70772, 69867, 68943, 68541, 68503, 68196, 67366, 66390, 65753, 65598, 65812, 66251, 66770, 67218, 67488, 67558, 67514, 67582, 68030, 68941, 70114, 71270, 72242, 72928, 73253, 73314, 73420, 73802, 74333, 74687, 74632, 74067, 72921, 71300, 69645, 68471, 67936, 67841, 68042, 68561, 69242, 69589, 69262]
55181F9262o59k50M55O79K62k04j82J97M78N50N89N95M01J19Q1K64K13k76p74
55162G1800q23n51l44k07J34O22Q34N51M5k40q6M20R57J178R82N58J19k89o21
55143G5039p56p10o92p34n55q0L17L76L51M56L59j53m76J2P19M45p90j625j261
55124G0242m67j37Q3R80K201K503J345n09j907k308j900j253q34n97j26O59J234
55107F9209J236J067J269J634J499P81pn68r95j187q54k06Q3j19j37M60J146J234
55089G5545Q70O60O92N56K6p41j509j932j470kJ557J938R91j59n56m02l20l38
55071G5406j17K47L67K45J72O5m10j038j068k22Q41J430J605J734J692J097R1
55054H2137p37j112j248j227q36j12L90K12m44j006j185j045o70r4N62J099J425
$$ y = [69262, 68603, 68353, 68808, 69487, 69749, 69545, 69363, 69560, 70038, 70588, 71177, 71772, 72173, 72292, 72373, 72637, 72850, 72574, 71800, 70977, 70426, 70082, 69875, 70009, 70631, 71465, 72016, 72061, 71821, 71735, 72155, 73112, 74290, 75272, 75830, 75949, 75660, 75039, 74283, 73573, 72881, 72147, 71592, 71512, 71829, 72205, 72556, 73012, 73371, 73218, 72742, 72754, 73473, 73918, 73128, 71503, 70242, 69775, 69638, 69721, 70701, 72902, 75405, 76750, 76241, 74334, 72026, 70126, 68873, 68039, 67442, 67316, 67975, 69209, 70445, 71512, 72781, 74415, 75914, 76695, 76688, 76120, 75125, 73938, 73084, 72878, 72961, 72842, 72705, 73165, 74311, 75545, 76415, 77075, 77767, 78323, 78349, 77608, 76099, 74167, 72697, 72695, 74252, 76190, 77181, 77022, 76466, 76064, 75744, 75406, 75289, 75536, 75903, 76148, 76320, 76385, 75975, 74937, 73869, 73647, 74488, 75918, 77523, 79257, 80949, 82046, 82137, 81400, 80288, 79040, 77813, 76977, 76865, 77255, 77467, 77023, 76017, 74832, 73787, 73117, 73023, 73585, 74684, 76109]
55037G6109J528J378R79M98J27j27l82o24o96n02j75L3r4n39r84j059p38l97l51
55018G3984n19o50p10p69p47n32k11P8M48J005J427J262O94M30P19R87P20K36
55000G7852J18K51L5o12j016o24K80R23Q86M16N2J03M58P96R06P51L93M3J19Q73
54980H3003J813J968J048k9j97L94O44K7p96r63m30K41O25O24K67k98p32p25k79
54961H6205L02O37M33k57r03q48pR96J512J417R37K32n82j206j328r09k29L12
54943H6714M03O2k97l04k08n40j172j276m75N30R43Q85Q39O49p2r12j007l75J06
54924H4493P4J81R06J752K020J758J455J348J488K041K986L849M202M169M055
54909A16777L779L148K369J757J139Q7j340k559l173l301l200k978k719k500k218
$$ y = [76109, 77637, 79015, 79994, 80492, 80619, 80492, 80110, 79486, 78790, 78288, 78113, 78146, 78052, 77513, 76529, 75470, 74732, 74335, 73984, 73465, 72815, 72105, 71336, 70589, 70057, 69846, 69924, 70372, 71377, 72804, 74066, 74760, 75190, 75909, 76896, 77616, 77852, 77970, 78221, 78256, 77644, 76628, 76004, 76284, 77207, 78093, 78509, 78561, 78664, 79122, 79918, 80824, 81575, 81968, 82011, 82130, 83003, 84816, 86784, 87832, 87803, 87606, 88000, 88644, 88671, 87875, 86912, 86482, 86723, 87348, 87972, 88239, 87941, 87209, 86484, 86205, 86507, 87144, 87577, 87320, 86417, 85569, 85562, 86558, 88070, 89487, 90424, 90656, 90074, 88868, 87540, 86631, 86402, 86714, 87117, 87179, 86882, 86578, 86370, 85830, 84658, 83382, 82907, 83437, 84380, 85265, 86104, 86753, 86681, 85769, 84762, 84387, 84493, 84567, 84748, 85654, 87406, 89426, 91184, 92639, 93987, 95475, 97516, 100502, 104351, 108553, 112722, 116777, 120556, 123704, 126073, 127830, 128969, 129056, 127716, 125157, 121984, 118683, 115483, 112505, 109786, 107286, 105068]
54894A05068j731j230j100j368j587j440j111q50n53q5K90K21q8n8M22P59M79
54877I6038o2j61L46J088J891K893L939M430M060L268K629K244J980J892J839
54862A28314J221j84j473j646j233j791l594m993m556k959j933k032k410k355
54848I8376k006j687j409j228j410j960k438k450k064j580j217j051j052j022
54834G5802p18j15N44R51R31N31P6j7L24O89O40J62l99p24o61l20j43n02j026
54815G6025q21K87J231R96l2o94n76j11M27J059J373Q25j45l01P27J941K428K391
54797H7030K293J933J064J35l63o74j192j582j302n95j24N5L39O88O99M60M87
54780H9351Q43J093J172J473J945J923J132K10j57n0R1J73L19L97K25J5J96R00
$$ y = [105068, 103337, 102107, 101007, 99639, 98052, 96612, 95501, 94651, 94098, 94013, 94303, 94524, 94436, 94378, 94800, 95559, 96038, 95976, 95815, 96161, 97249, 99140, 102033, 105972, 110402, 114462, 117730, 120359, 122603, 124583, 126475, 128314, 129535, 129351, 127878, 126232, 124999, 123208, 119614, 114621, 110065, 107106, 105173, 103141, 100731, 98376, 96370, 94683, 93274, 92046, 90636, 88676, 86238, 83788, 81724, 80144, 78927, 77876, 76824, 75802, 75084, 74969, 75513, 76464, 77395, 77926, 78002, 77985, 78309, 78998, 79638, 79800, 79401, 78677, 78016, 77696, 77553, 77051, 76025, 75204, 75491, 76722, 77718, 77686, 76992, 76416, 76305, 76732, 77791, 79164, 79989, 79844, 79543, 80270, 82211, 84639, 87030, 89323, 91256, 92320, 92455, 92092, 91418, 90226, 88644, 87342, 86747, 86623, 86678, 87017, 87705, 88404, 88864, 89351, 90194, 91287, 92459, 93932, 95877, 97800, 98932, 99142, 98985, 98935, 99026, 99199, 99518, 99915, 100140, 100155, 100351, 101251]
54762A01251J878K757L262L328L272L556M161M435L877K792J764P80n87k177l161
54747A31188l106k673k779l486m062l971l391k722k078j344n30J79N51M01k68
54732A01909j114j603j512j149r05p17k79L78Q74J072J230J446J439J187J331
54717A03587K412L929M764M521L854L394K962K158J207O30M18J8q52j955k960
54702A28087l694l915l408k460j838j908k145j860j185q54j170j671j874j839
54688I8266j847j869j674j239q01n51m82n05m83k29L33R90J264Q68L8n86n73k39
54670I0681l19j040j727j615q81m28o46r71q12m02k60l45j47M71J113J397J301
54653H5370R92O29L29P0l04o55m60M76J434J514Q46L83N35O88K49n41j135j395
$$ y = [101251, 103129, 105886, 109148, 112476, 115748, 119304, 123465, 127900, 131777, 134569, 136333, 137113, 136526, 134349, 131188, 128082, 125409, 122630, 119144, 115082, 111111, 107720, 104998, 102920, 101576, 101046, 101225, 101776, 102177, 101909, 100795, 99192, 97680, 96531, 95626, 94909, 94630, 95008, 95882, 96954, 98184, 99630, 101069, 102256, 103587, 105999, 109928, 114692, 119213, 123067, 126461, 129423, 131581, 132788, 133418, 133836, 133854, 133002, 131047, 128087, 124393, 120478, 117070, 114610, 112772, 110864, 108719, 106859, 105674, 104820, 103650, 101979, 100105, 98266, 96419, 94550, 92876, 91637, 90836, 90285, 89803, 89298, 88815, 88586, 88919, 89909, 91173, 92041, 92079, 91493, 90920, 90681, 90362, 89322, 87595, 85980, 85099, 84671, 84025, 83054, 82242, 81840, 81580, 81235, 81088, 81559, 82672, 84069, 85370, 86362, 86991, 87320, 87390, 87086, 86431, 85971, 86447, 87881, 89395, 90241, 90624, 91159, 91847, 92096, 91555, 90420, 89025]
54635H9025j375r38r8O53Q35N73K83M5k91p05j072j375j468r75O6P65L16q47j409
54616H2008p64M36J326J745J905J694Q58m00j353j406o51K16N87N09N34R37J391
54599H9572J527J434J302R10J7r43j193n80K98Q82R94N14n73j672j879j085k05
54582H9320J8k16l87m79o07n25n3M53O43P37R86R86L28m57m97J13M69K92K50P03
54562I2077J041O85k7l97k78L2K83K62l11j309j970j664o61K63P69J044J208J167
54544I2214R88R16R82R91Q78P38N84M20M82R34J394J257N88J66M52R73J035N70
54526A06562k6n74j101j445j353r55o58n77l91J20O96Q60M27l16q31p27j13M01
54508I9999K76l92j005j155r58p22n41l78l02l81m71l54m4K21K85K17J33O4P7
$$ y = [89025, 87650, 86712, 86614, 87267, 88102, 88675, 88958, 89003, 88712, 88007, 86935, 85560, 84092, 83117, 83183, 83948, 84264, 83417, 82008, 81244, 81680, 83006, 84751, 86656, 88350, 89208, 88808, 87455, 86049, 85398, 85614, 86201, 86710, 87244, 88181, 89572, 91099, 92533, 93835, 94745, 94762, 93819, 92626, 92046, 92344, 93226, 94220, 94734, 94161, 92489, 90610, 89525, 89320, 89338, 89122, 88735, 88256, 87649, 87124, 87071, 87524, 88167, 88904, 89890, 90876, 91204, 90747, 90250, 90363, 90832, 91124, 91374, 92077, 93118, 93803, 93776, 93379, 93101, 93133, 93416, 93678, 93367, 92058, 90088, 88424, 87763, 88026, 88795, 89839, 91047, 92214, 93202, 94118, 95100, 96091, 96969, 97707, 98291, 98711, 99193, 100127, 101521, 102778, 103366, 103532, 103984, 104957, 105992, 106562, 106536, 105962, 104861, 103416, 102063, 101108, 100450, 99873, 99482, 99602, 100298, 101158, 101585, 101269, 100438, 99711, 99598, 99999, 100275, 99883, 98878, 97723, 96765, 96043, 95502, 95124, 94822, 94441, 93970, 93616, 93572, 93793, 94078, 94295, 94428, 94492, 94569]
54489I4569L24Q06J193J124O73L04K67K99R4j28R1O76J011Q17N94R18J564J836
54471A07032J517J082R70J097J154R18K22r73k173k472j475M9R23Q82P69J270
54455A10792J938J775O08n80q37l82j67m74n34K29J140J051r4j157j301r26q67
54438A10214j241j564j554j296q60k96J03j3n16q24n22K73J079J348P45m42j215
54421A03419o84Q58K092K039R86r0n91n57k37J04J41k80q47j032p51m51m50m42
54403A03227O9R82J564J284M74o3J4L00L19K03M42J134J751J719R80n7q68j088
54385A12386n89M04J372J817J603R59K34l30o27o09k97J39L59J13m20o97m43m2
54367A15332o4m28m48K17J026J252Q91N49N34N47K68j43l77n02q56j458j873j724
$$ y = [94569, 94893, 95699, 96892, 98016, 98689, 98993, 99260, 99559, 99653, 99525, 99616, 100292, 101303, 102120, 102714, 103632, 105196, 107032, 108549, 109631, 110601, 111698, 112852, 113770, 113992, 113019, 110846, 108374, 106899, 106948, 107871, 108753, 109522, 110792, 112730, 114505, 115113, 114533, 113696, 113314, 113147, 112673, 112139, 112368, 113508, 114559, 114465, 113308, 112007, 111081, 110214, 108973, 107409, 105855, 104559, 103699, 103403, 103506, 103493, 102977, 102153, 101631, 101904, 102983, 104331, 105076, 104634, 103419, 102735, 103593, 105685, 107724, 108710, 108620, 108029, 107472, 107235, 107339, 107480, 107200, 106353, 105321, 104570, 104119, 103669, 103227, 103296, 104278, 105842, 107126, 107600, 107537, 107551, 107851, 108170, 108373, 108815, 109949, 111700, 113419, 114399, 114342, 113474, 112386, 111797, 112201, 113573, 115390, 116993, 117952, 118186, 117856, 117229, 116620, 116323, 116462, 116821, 116934, 116514, 115817, 115374, 115332, 115268, 114840, 114392, 114609, 115635, 116887, 117778, 118327, 118861, 119408, 119676, 119533, 119156, 118654, 117798, 116340, 114467, 112743]
54349A12743j189p75o75n62j07N41Q97P81N45O61J187J715J711R43l29j421j683
54332A14983j033oQ14J333J785K161K118J489O35R0m8j06l18n63o61p13r43j328
54314A19689j647j778j806j762j530j052m67R3O36J072J088N27j99m57j63O1k98
54297A12007r95j339r97k51M06O84N49J04m47q98j113j023n82J15P24Q77N90L22
54279A08733M21O67N65M5l82k74J77M39L24J27J74M99R95J537J855J560O10m71
54261A17601j039r65o51m88m84l25L02J352K239K220J248K85L44J284J931J443
54245A26297J61r88j517j607j639j721j607r64Q0P41K82r53j798j693j335j484
54229A10255j747j189J37J144J145N65J11j06k77l45j68J06K51L36M96O05M92
$$ y = [112743, 111554, 110779, 110104, 109542, 109435, 109976, 110873, 111654, 112199, 112860, 114047, 115762, 117473, 118416, 118087, 116666, 114983, 113950, 113944, 114758, 116091, 117876, 120037, 122155, 123644, 124279, 124369, 124321, 124215, 123897, 123334, 122673, 121960, 121017, 119689, 118042, 116264, 114458, 112696, 111166, 110114, 109647, 109740, 110376, 111448, 112536, 113063, 112864, 112407, 112244, 112305, 112007, 111012, 109673, 108676, 108425, 108831, 109515, 110064, 110168, 109721, 108823, 107710, 106687, 106105, 106220, 106944, 107821, 108411, 108733, 109154, 109821, 110386, 110431, 110049, 109775, 109952, 110391, 110715, 110842, 111016, 111515, 112510, 114047, 115902, 117462, 118072, 117601, 116562, 115597, 114946, 114458, 113974, 113649, 113951, 115303, 117542, 119762, 121010, 121295, 121639, 122923, 124854, 126297, 126458, 125470, 123953, 122346, 120707, 118986, 117379, 116415, 116495, 117236, 117518, 116565, 114767, 113074, 111739, 110255, 108508, 107319, 107456, 108600, 109745, 110310, 110421, 110315, 110038, 109693, 109525, 109631, 109882, 110218, 110714, 111319, 111811]
54212A11811L20L38L63o5r62j702j683r24P2Q09J064R01N92L73K14n8l31j54O23
54193A11601J436J511P80m6l20q4J53j4o32j386j725j273l49J67k01r61j314j148
54175A06195r58r22o84n3O20R69J040R66O88L05K28N37N60l10j597k125j428j84
54157A03847P14R89P58J03p39j265j158p02l73k08R0N36P68N63J60k9J35M80P67
54138A05436Q54P42N67N28P76J266J687J702J250O53K57N6j95n86r63j179j172
54121A11679q17l5P93R94M24k11k37Q7jn75q55k64Q35J673J895J667J227O83R5
54102A19057n08j090j478j398q36j83J55J67N4j78o54j183j242n57N00J252J428
54085A13306J337J363J413J085L34l20l85n5J07k8q7P5J06j40k00K77Q15P01N6
$$ y = [111811, 112131, 112469, 112832, 112767, 111805, 110103, 108420, 107496, 107568, 108377, 109441, 110342, 110934, 111307, 111521, 111463, 111132, 110978, 111601, 113037, 114548, 115328, 115282, 114962, 114878, 115031, 115017, 114385, 112999, 111274, 110001, 109652, 109819, 109618, 108657, 107343, 106195, 105237, 104315, 103631, 103578, 104198, 105167, 106207, 107173, 107861, 108166, 108394, 108931, 109491, 109181, 107584, 105459, 104031, 103847, 104561, 105550, 106308, 106411, 105672, 104407, 103249, 102547, 102174, 101966, 102056, 102592, 103360, 103923, 104083, 104054, 104189, 104669, 105436, 106290, 107032, 107599, 108127, 108903, 110169, 111856, 113558, 114808, 115461, 115718, 115774, 115579, 114993, 114030, 112851, 111679, 110862, 110827, 111620, 112614, 113038, 112827, 112590, 112677, 112676, 112101, 111246, 110982, 111817, 113490, 115385, 117052, 118279, 118962, 119057, 118549, 117459, 115981, 114583, 113747, 113564, 113719, 113886, 113940, 113762, 113108, 111925, 110683, 110126, 110626, 111878, 113306, 114643, 116006, 117419, 118504, 118838, 118518, 118133, 118078, 118185, 118157, 118070, 118145, 118251, 118111, 117911, 118188, 119003, 119704, 119760]
54066A19760k83J10Q60J462J733J541P29l57r17o06K8L65N21Q38J076P36K7k17
54048A27406L98J354J940J997J822J697J701J805J934K032K126K229K236K097
54034A52774K014K234K630K859K882L042L483L853L713L105K429J972J804J972
54020A90766K471K958K893K170J458J567K419L026K661J724J078Q15K45r19k176
54005B13156l186m354n951p320p660p107o315n349l930k495j947k293k575k349
53991A50325k174k325k087j040j06l95j591k409k260j577p65J51Q91Q57j1r01
53975A34583j004l35M72Q37O20Q8k70j48L08O63O68M73M30P59J260J341O62j95
53957A41212j95P82J621J432P26M81O30M01j98l12L26R88J125J023J056J127J218
$$ y = [119760, 119477, 119587, 120447, 121909, 123642, 125183, 125912, 125555, 124638, 124032, 124060, 124425, 124946, 125784, 126860, 127596, 127623, 127406, 127804, 129158, 131098, 133095, 134917, 136614, 138315, 140120, 142054, 144086, 146212, 148441, 150677, 152774, 154788, 157022, 159652, 162511, 165393, 168435, 171918, 175771, 179484, 182589, 185018, 186990, 188794, 190766, 193237, 196195, 199088, 201258, 202716, 204283, 206702, 209728, 212389, 214113, 215191, 216006, 216251, 215332, 213156, 209970, 205616, 199665, 192345, 184685, 177578, 171263, 165914, 161984, 159489, 157542, 155249, 152674, 150325, 148151, 145826, 143739, 142699, 142593, 142198, 140607, 138198, 135938, 134361, 133596, 133747, 134638, 135495, 135484, 134583, 133579, 133244, 133716, 134553, 135173, 135261, 134991, 134843, 135151, 135814, 136482, 136955, 137385, 138144, 139404, 140745, 141407, 141212, 141017, 141799, 143420, 144852, 145578, 146059, 146689, 147090, 146892, 146580, 146906, 147894, 149019, 150042, 151098, 152225, 153443]
53940A53443J677K516L168L338L404L560L398K885K888L851M683M064K379J267
53926A96521J451K146K568K850L175L089K339J617J752K606L352L620L750M042
53912B34878M308M248L869L324K540J299l33j780k387k112j655j706k167k349
53898B39977j918j330j268j873k670l134l128k922k883l185l735m331m837n109
53884A97654m870l927k536j349q60j031j532k097k516k506j949j175p46q31j061
53869A68668j058q70o71k71O96K078L144L410L324L736M855O008O515O390O051
53854B12005N532M394K320l87k991m837n710n816n536n127m593l806k736j611
53840A81101q12n81p71r11o30l5M19L98p7q14j609k204k370k193k113k447k947
$$ y = [153443, 155120, 157636, 160804, 164142, 167546, 171106, 174504, 177389, 180277, 184128, 188811, 192875, 195254, 196521, 197972, 200118, 202686, 205536, 208711, 211800, 214139, 215756, 217508, 220114, 223466, 227086, 230836, 234878, 239186, 243434, 247303, 250627, 253167, 254466, 254133, 252353, 249966, 247854, 246199, 244493, 242326, 239977, 238059, 236729, 235461, 233588, 230918, 227784, 224656, 221734, 218851, 215666, 211931, 207600, 202763, 197654, 192784, 188857, 186321, 184972, 184112, 183081, 181549, 179452, 176936, 174430, 172481, 171306, 170560, 169729, 168668, 167610, 166740, 166069, 165798, 166494, 168572, 171716, 175126, 178450, 182186, 187041, 193049, 199564, 205954, 212005, 217537, 221931, 224251, 223864, 220873, 216036, 210326, 204510, 198974, 193847, 189254, 185448, 182712, 181101, 180289, 179708, 178937, 178026, 177396, 177361, 177780, 178178, 178101, 177287, 175678, 173474, 171104, 168911, 166798, 164351, 161404]
53823A61404l111k804k351k024j753j375r30n27j10M51J125J689J935J819J513
53808A54951J338J574K182K770K970K826K680K725K883L085L393L662L427K454
53794A92920J284P67J095J642J838J715J488J087M49j37m23o16r60j218j190j356
53778A98385k223l208l127j967j182j774k948l276k536j630j220j286j719k469
53764A67820l102l023k251j496j287j508j768j802j394m41P23J429J297N60l01
53749A53456r35j118p45o2L97L45N8N3N22J135J372R94L25JK98Q43J037P38K51
53730A58965q9j38J50O58J049J084R22Q95J101J445J841K034J652Q76O92J712
53714A74849L080L362K453J561J304R58q9j145j170j72J026J870K359K742L364
$$ y = [161404, 158293, 155489, 153138, 151114, 149361, 147986, 147056, 146529, 146419, 146870, 147995, 149684, 151619, 153438, 154951, 156289, 157863, 160045, 162815, 165785, 168611, 171291, 174016, 176899, 179984, 183377, 187039, 190466, 192920, 194204, 194971, 196066, 197708, 199546, 201261, 202749, 203836, 204285, 204148, 203725, 203109, 202149, 200931, 199741, 198385, 196162, 192954, 189827, 187860, 186678, 184904, 181956, 178680, 176144, 174514, 173294, 172008, 170289, 167820, 164718, 161695, 159444, 157948, 156661, 155153, 153385, 151583, 150189, 149748, 150471, 151900, 153197, 153757, 153456, 152521, 151403, 150658, 150596, 150993, 151338, 151396, 151449, 151971, 153106, 154478, 155472, 155797, 155798, 156096, 156939, 157976, 158714, 158965, 158876, 158738, 158888, 159546, 160595, 161679, 162601, 163496, 164597, 166042, 167883, 169917, 171569, 172445, 173137, 174849, 177929, 181291, 183744, 185305, 186609, 187567, 187478, 186333, 185163, 184991, 186017, 187887, 190246, 192988, 196352]
53699A96352M395N274N061L772K696K682K921K209Q41J55N95J325J598J439R98
53684B32313K44n10p31n25o24j215j580j167l88R8K57L72L47j24q78j307r74j42
53666B23466L77r7j336k242k016j149q02j269j677j270l19M46P21O12K70l1P1
53649B13755N22P50M28J8J43P42J219J248J005Q32R50J373J752J585Q36K27M99
53632B27884J540K518K742K180J270N43L82Q36J616K340K720K616K136J742J866
53617B54931K403K846L078L470M097M416M078L565L492L751L845L725L612L356
53603C04665K658J754J224J170J207J166J179J144P59J22l31n30p72r99p60j17
53587C13539J69l16r71j050o12j86K0N1k62j020j701j552n61M98J008J114J238
$$ y = [196352, 200747, 206021, 211082, 214854, 217550, 220232, 223153, 225362, 226203, 226358, 226953, 228278, 229876, 231315, 232313, 232557, 232047, 231316, 230791, 230167, 228952, 227372, 226205, 225817, 225915, 226172, 226544, 226891, 226767, 225889, 224582, 223608, 223466, 223843, 223746, 222410, 220168, 218152, 217003, 216201, 214932, 213255, 211985, 211666, 212112, 212833, 213445, 213715, 213684, 213755, 214277, 215027, 215455, 215473, 215616, 216358, 217577, 218825, 219830, 220662, 221612, 222985, 224737, 226322, 227158, 227385, 227884, 229424, 231942, 234684, 236864, 238134, 238677, 239059, 239895, 241511, 243851, 246571, 249187, 251323, 253065, 254931, 257334, 260180, 263258, 266728, 270825, 275241, 279319, 282884, 286376, 290127, 293972, 297697, 301309, 304665, 307323, 309077, 310301, 311471, 312678, 313844, 315023, 316167, 316926, 317048, 316717, 316187, 315415, 314416, 313656, 313539, 313708, 313392, 312421, 311371, 310759, 310573, 310593, 310644, 310382, 309362, 307661, 306109, 305548, 306046, 307054, 308168, 309406]
53570C09406J464J639J790K025K110J557K99j017j666j693j749k140k462k257
53556C07306j692j184q12m85l23l61j30P63J778J950J255O54P04R84J250K108
53540C13765L875N535N872N204M968N798O932P581P903Q370Q933R324R621J0019
53526D13700J0424J0674J0985J1716J2805J3802J4392J4679J4951J5445J6312
53515E59885J7542J8900K0108K1146K2189K3215K3895K4020K3810K3614K3466
53504H01790K3222K2993K3029K3197K3013K2338K1639K1256K0878K0149J9414
53493A042918J9220J9325J8958J8087J7566J7788J7970J7317J6331J6169J7043
53482A238692J7939J7917J7007J5754J4383J2715J0593Q208O016M368L051J315
$$ y = [309406, 310870, 312509, 314299, 316324, 318434, 319991, 320290, 319273, 317607, 315914, 314165, 312025, 309563, 307306, 305614, 304430, 303618, 303133, 302810, 302449, 302319, 303082, 304860, 306810, 308065, 308719, 309423, 310407, 311657, 313765, 317640, 323175, 329047, 334251, 339219, 345017, 351949, 359530, 367433, 375803, 384736, 394060, 403681, 413700, 424124, 434798, 445783, 457499, 470304, 484106, 498498, 513177, 528128, 543573, 559885, 577427, 596327, 616435, 637581, 659770, 682985, 706880, 730900, 754710, 778324, 801790, 825012, 848005, 871034, 894231, 917244, 939582, 961221, 982477, 1003355, 1023504, 1042918, 1062138, 1081463, 1100421, 1118508, 1136074, 1153862, 1171832, 1189149, 1205480, 1221649, 1238692, 1256631, 1274548, 1291555, 1307309, 1321692, 1334407, 1345000, 1353208, 1359224, 1363592, 1366643, 1367958]
53470A367958j411m825q001j0350j2067j3624j5045j5916j6014j5774j5995j7031
53458A221905j8337j9027j8897j8656j9014j9871k0651k1085k1271k1212k0788
53447A003096k0085j9256j8098j6304j4162j2413j1236r973q199o466n497n018
53435H56389m063k352o42K87N49Q08J540K844M666O817Q921J0629J1906J2957
53421I11256J4017J5322J7031J8942K0443K1174K1624K2652K4399K6187K7546
53410A140593K8787L0312L1955L3440L5054L7191L9622M1790M3667M5636M7696
53399A555743M9541N1273N3212N4998N5789N5594N5415N5735N5748N4709N3113
53388B150870N1828N0750M9253M7435M5818M4167M1615L7950L3879K9974K6149
$$ y = [1367958, 1366547, 1361722, 1353721, 1343371, 1331304, 1317680, 1302635, 1286719, 1270705, 1254931, 1238936, 1221905, 1203568, 1184541, 1165644, 1146988, 1127974, 1108103, 1087452, 1066367, 1045096, 1023884, 1003096, 983011, 963755, 945657, 929353, 915191, 902778, 891542, 881569, 873370, 866904, 861407, 856389, 852326, 849974, 849332, 849619, 850168, 850976, 852516, 855360, 860026, 866843, 875764, 886393, 898299, 911256, 925273, 940595, 957626, 976568, 997011, 1018185, 1039809, 1062461, 1086860, 1113047, 1140593, 1169380, 1199692, 1231647, 1265087, 1300141, 1337332, 1376954, 1418744, 1462411, 1508047, 1555743, 1605284, 1656557, 1709769, 1764767, 1820556, 1876150, 1931565, 1987300, 2043048, 2097757, 2150870, 2202698, 2253448, 2302701, 2350136, 2395954, 2440121, 2481736, 2519686, 2553565, 2583539, 2609688]
53377B609688K2219J8288J4371J0225N685P71m563j0291j6061k1646k7493l4088
53365B567105m0867m6493n0309n2758n4379n5225n5486n5723n6054n5838n4626
53354A989347n2803n0865m8753m6365m4166m2666m1767m1149m0860m0969m0974
53343A498010m0180l8531l6590l4843l3334l1766k9698k6926k3907k1475j9863
53332A160897j8472j6838j5343j4510j4132j3709j3301j3280j3493j3338j2552
53321A001929j1412j0240r135q111p012n552l806k363j526o74R78L227N099O085
53307I57487O565P090P933R266J1174J3351J5341J7104J8983K1018K2803K4036
53295A132151K4835K5457K6019K6526K6850K6783K6336K5789K5129K3832K1663
$$ y = [2609688, 2631907, 2650195, 2664566, 2674791, 2680476, 2681247, 2676684, 2666393, 2650332, 2628686, 2601193, 2567105, 2526238, 2479745, 2429436, 2376678, 2322299, 2267074, 2211588, 2155865, 2099811, 2043973, 1989347, 1936544, 1885679, 1836926, 1790561, 1746395, 1703729, 1661962, 1620813, 1579953, 1538984, 1498010, 1457830, 1419299, 1382709, 1347866, 1314532, 1282766, 1253068, 1226142, 1202235, 1180760, 1160897, 1142425, 1125587, 1110244, 1095734, 1081602, 1067893, 1054592, 1041312, 1027819, 1014481, 1001929, 990517, 980277, 971142, 963031, 956019, 950467, 946661, 944298, 942772, 942098, 943076, 946303, 951402, 957487, 964052, 971142, 979075, 988341, 999515, 1012866, 1028207, 1045311, 1064294, 1085312, 1108115, 1132151, 1156986, 1182443, 1208462, 1234988, 1261838, 1288621, 1314957, 1340746, 1365875, 1389707, 1411370]
53284A411370J9309J7575J6198J4274J1622Q843O122K975o42l990o570q703j0744
53271A477639j2550j4173j6208j8927k1604k3445k4656k5943k7309k8071k7965
53260A236788k7634k7892k8833k9757k9844k9039k8137k7850k7850k7230k5876
53249I26846k4727k4505k4811k4843k4414k3842k3309k2873k2650k2506k1899
53238F66467k0516j8775j7220j5752j4004j2119j0519r169p729o367n706n956
53226E22635o633p279p946q885j0105j1327j2146j2211j1534j0594r918r625r571
53213C94861r658r681r187q060p027o927p451p389o244n002m842n681o443o412
53199B94857n864n461n494n739n761n329m663m237m239m350m132l541k930k583
$$ y = [1411370, 1430679, 1448254, 1464452, 1478726, 1490348, 1499191, 1505313, 1508288, 1507646, 1503656, 1497086, 1488383, 1477639, 1465089, 1450916, 1434708, 1415781, 1394177, 1370732, 1346076, 1320133, 1292824, 1264753, 1236788, 1209154, 1181262, 1152429, 1122672, 1092828, 1063789, 1035652, 1007802, 979952, 952722, 926846, 902119, 877614, 852803, 827960, 803546, 779704, 756395, 733522, 710872, 688366, 666467, 645951, 627176, 609956, 594204, 580200, 568081, 557562, 548393, 540664, 534297, 528591, 522635, 516002, 508723, 500777, 491892, 481787, 470460, 458314, 446103, 434569, 423975, 414057, 404432, 394861, 385203, 375522, 366335, 358275, 351248, 344321, 336870, 329481, 323237, 318235, 313393, 307712, 301269, 294857, 288993, 283532, 278038, 272299, 266538, 261209, 256546, 252309, 248070, 243720, 239588, 236047, 233117, 230534]
53185B30534k448k269j815j032j11N16M47k90j164j637j721j876k284k519k141
53170B10190j429j050j123j039l81M49P93N71J91j12m18p38r00q50p68q00r47
53153B01639j180j427j491j225q11o32q11j065j080q19m67j94m3J30N21J098J475
53136A93618J312P74L46K73M11N75O91N56j27j272k227k347j601n00M23Q86P98
53119A92589K61l52n93l56M1K14J15kP3L14N85P27M88l31j478k200j996j271q06
53100A86022o71k50N63R37L22o18r04o27o54j161j447j194j013j411j947j860
53084A74087j084j84L61M39J61j37k2N52J080J114Q51P48Q32P66M97L42M80P20
53066A81603Q46Q21O02J15m77p94p08n09m30k43L63J173J620J482J059O12Q9m21
$$ y = [230534, 228086, 225817, 224002, 222970, 222859, 223375, 223822, 223532, 222368, 220731, 219010, 217134, 214850, 212331, 210190, 208761, 207711, 206588, 205549, 205168, 205617, 206410, 206981, 207172, 207060, 206642, 205904, 205004, 204154, 203386, 202586, 201639, 200459, 199032, 197541, 196316, 195505, 194873, 194062, 192997, 191917, 191098, 190631, 190437, 190394, 190524, 191045, 192143, 193618, 194930, 195704, 196050, 196323, 196734, 197309, 198000, 198556, 198429, 197157, 194930, 192583, 190982, 190482, 190905, 191791, 192589, 192850, 192498, 191905, 191549, 191590, 191804, 191919, 191917, 191990, 192304, 192889, 193616, 194104, 193773, 192295, 190095, 188099, 186828, 186022, 185351, 185101, 185664, 186601, 186923, 186305, 185401, 184774, 184120, 182959, 181512, 180318, 179305, 177894, 175947, 174087, 173003, 172819, 173180, 173619, 173780, 173643, 173621, 174173, 175253, 176367, 177218, 177966, 178798, 179564, 180061, 180403, 180883, 181603, 182449, 183270, 183872, 183987, 183510, 182716, 182008, 181499, 181069, 180826, 181189, 182362, 183982, 185464, 186523, 187135, 187224, 186803]
53048A86803l69N69J650J609J42j548k114j561j027j306k046k435k172j584j090
53033A73521p90n27j70K33N08N66M09Lo98j430j626r67J77J101J482J464J207
53016A74463P62L06R1J40K91N11P87P93J48q89j520j379r12n53j23O22J280J252
52998A76070O03n9l83m98n48m94l81l26k36P7M47M29m1m42l38L3J62N0K13R12
52978A75250J695J864J318O43M53Q08J402J983K346K171J337L48q5R8K75J99L81
52961A92486J178K009K069J428Q12N05K38r1k43l04o91j377j726j491j292j699
52945A91811k365k620k474k436k516k187j309m78k17k97k28p2l03r51j343q95
52929A71120R4P60O55J27l06n84q44q92m20L36P03M58J74L89Q86J113J053J064
$$ y = [186803, 186434, 187003, 188653, 190262, 190404, 188856, 186742, 185181, 184154, 182848, 180802, 178367, 176195, 174611, 173521, 172731, 172204, 172034, 172267, 172775, 173341, 173750, 173753, 173055, 171625, 169999, 169032, 169209, 170310, 171792, 173256, 174463, 175225, 175531, 175622, 175762, 176053, 176564, 177351, 178144, 178292, 177403, 175883, 174504, 173592, 173039, 172916, 173538, 174818, 176070, 176673, 176614, 176231, 175733, 175185, 174691, 174310, 173984, 173748, 173825, 174272, 174701, 174660, 174218, 173880, 173913, 174075, 174125, 174338, 175250, 176945, 178809, 180127, 180770, 181223, 182031, 183433, 185416, 187762, 189933, 191270, 191618, 191533, 191631, 191906, 192105, 192486, 193664, 195673, 197742, 199170, 199982, 200487, 200725, 200634, 200391, 200087, 199396, 198019, 196293, 194802, 193510, 191811, 189446, 186826, 184352, 181916, 179400, 177213, 175904, 175426, 175209, 174912, 174684, 174612, 174309, 173358, 172015, 171120, 171214, 171974, 172629, 172756, 172450, 171866, 171022, 170130, 169710, 170046, 170749, 171207, 171381, 171770, 172656, 173769, 174822, 175886]
52911A75886J091O16m41j332j306n36J59L06R8j74n91j243j710j359j69R74J138
52894A71407L38n56q48o13k73O4M59O88M17k09n76l71K9J25n2j19M6J79N1k58
52874A69928n18n80m21r4L59R23J545K012K058J702J309J167J131R00M42m9n26
52857A81288j003j277j132p82p27j052j336j345j359j536j502r80m29m63r12j032
52841A64421o35k78l38m90l63k03m34q91j020o73k75j71j67R2N72Q35N72k9m40
52822A60085l00K36O12L83l32q98p88j24M74O06N03N71P59P17M98N92J156J637
52804A66387J485Q89L94O3m11r57j150r61r35j343j705j511j004p81r28r94p41
52787A55797l87j03L07R89J659J860J513R46M39k8n20q69q15l89Q7L53M22M15
$$ y = [175886, 176977, 177593, 177152, 175820, 174514, 173978, 174137, 174443, 174541, 174367, 173776, 172533, 170823, 169464, 169295, 170269, 171407, 171745, 171189, 170341, 169728, 169455, 169519, 169978, 170666, 171083, 170874, 170298, 169927, 169956, 170081, 170029, 169910, 169956, 170135, 170186, 169928, 169410, 168830, 168409, 168315, 168674, 169597, 171142, 173154, 175212, 176914, 178223, 179390, 180521, 181421, 181863, 181814, 181288, 180285, 179008, 177876, 177094, 176367, 175315, 173979, 172634, 171275, 169739, 168237, 167257, 166828, 166365, 165453, 164421, 163786, 163508, 163170, 162680, 162317, 162114, 161680, 160789, 159769, 159096, 158821, 158650, 158483, 158575, 159147, 159982, 160554, 160525, 160085, 159785, 160021, 160633, 161016, 160684, 159786, 158998, 158874, 159348, 159954, 160457, 161028, 161787, 162504, 163002, 163594, 164750, 166387, 167872, 168761, 169155, 169218, 168807, 167850, 166700, 165739, 164804, 163461, 161756, 160245, 159241, 158460, 157532, 156538, 155797, 155410, 155307, 155614, 156603, 158262, 160122, 161635, 162581, 163020, 162992, 162472, 161603, 160788, 160399, 160486, 160839, 161261, 161676]
52769A61676L43K28J72J39j26p27j266j244p49l70m06n44m50k99m46q19r48n73
52751A53591P1N37O64O90Q99J226J312J000N78L85L82M30P07J347J791J208k21
52734A66597j109m12J263K411K366J717J244J086J007R40R48R93R13N91K5o20
52718A79960j072j181j098j082j171j215j171j150j184j116q72n78l79j77K80
52703A66794J045J792K016J489M41o72j505j827j458n01M59P88N22L05N47J009
52687A71244J411J854K361K398J527K72l00J19O86M94l87j152j248r46r06j365
52671A76062j772j408l33N38M90j20l93r8J27k55r75j386j273r85r12r38m63J002
52653A66908L111M700M768L416J683M58j45m53o82q42r40j001r91q68o64m74l33
$$ y = [161676, 162019, 162247, 162419, 162558, 162432, 161705, 160439, 159195, 158446, 158076, 157670, 157126, 156676, 156377, 155931, 155112, 154164, 153591, 153662, 154199, 154863, 155553, 156452, 157678, 158990, 159990, 160568, 160953, 161335, 161765, 162472, 163819, 165610, 166818, 166597, 165488, 165076, 166339, 168750, 171116, 172833, 174077, 175163, 176170, 177110, 178058, 179051, 179964, 180555, 180580, 179960, 178888, 177707, 176609, 175527, 174356, 173141, 171970, 170820, 169636, 168520, 167648, 167070, 166691, 166514, 166794, 167839, 169631, 171647, 173136, 173577, 172905, 171400, 169573, 168115, 167614, 168073, 168861, 169383, 169688, 170235, 171244, 172655, 174509, 176870, 179268, 180795, 181067, 180767, 180886, 181572, 182066, 181679, 180527, 179279, 178333, 177427, 176062, 174290, 172882, 172549, 173087, 173577, 173457, 173064, 172966, 173093, 172838, 171863, 170477, 169204, 168219, 167307, 166369, 165906, 166908, 170019, 174719, 179487, 182903, 184586, 185044, 184899, 184446, 183764, 182922, 181982, 180981, 179990, 179122, 178458, 177984, 177651]
52636A77651j78N8L28N13O49R49J432J655J205M21J51O41J219J262R54O90L16
52619A89916m39j225j463j229j043r76p00k22J19L03N69P20K98n39j037q96n15
52602A81641q6O98J761K339J974J180O05K38j29k67K7L81L98L20N43Q73Q53N18
52584A93867K00j07n69r25p61k48L0o4p7L30J004J569J686J151J39p37j031r95
52566A94462j144j417j334q57m43k79p4K24J00p56j821k220j657n63M15Q96R01
52549A84433P97R01J061P19l42j453j566l99J104J686J085K01m3K84N25M74M71
52532A89938N91M19j64n96m71j96l29o69n55P6O12N94J20m78r31r72m89K43Q48
52513A87591J228J368J060L41pQ21K455L592L539K835K180J571Q37L18L49N63
$$ y = [177651, 177473, 177531, 177859, 178372, 179021, 179970, 181402, 183057, 184262, 184683, 184834, 185475, 186694, 187956, 188910, 189600, 189916, 189477, 188252, 186789, 185560, 184517, 183541, 182841, 182619, 182738, 183041, 183610, 184330, 184628, 184089, 183052, 182156, 181641, 181555, 182253, 184014, 186353, 188327, 189507, 190112, 190350, 190221, 189954, 189981, 190362, 190760, 191080, 191623, 192496, 193349, 193867, 194067, 193960, 193391, 192466, 191705, 191457, 191487, 191423, 191346, 191676, 192680, 194249, 195935, 197086, 197225, 196488, 195457, 194462, 193318, 191901, 190567, 189710, 189267, 188988, 188914, 189138, 189238, 188482, 186661, 184441, 182784, 182221, 182636, 183532, 184433, 185230, 186131, 187192, 187911, 187569, 186116, 184550, 184151, 185255, 186941, 188026, 188227, 188184, 188468, 188993, 189467, 189938, 190529, 190948, 190784, 190188, 189717, 189521, 189192, 188523, 187968, 188044, 188656, 189250, 189370, 188892, 187961, 186989, 186500, 186743, 187591, 188819, 190187, 191247, 191588, 191581, 192402, 194857, 198449, 201988, 204823, 207003, 208574, 209411, 209729, 210078, 210641]
52497B10641L14m53j208j580j655j688j893k324k716k603j951j406j524j942j782
52482A86230q43J62N84N59N67P63J031J378J846K122J745P83rJ5O36J085R33M37
52464B00024L1j00Q5N95J217J546J530J681K364L080K931J714J71q33j076r18
52448B14042r75j673k807l453k807j228J1R9n59j090j238j360j688j966j738q55
52432A90715K14O23%r66j177m07N21Q58O52K22l36p50l35J138K745L293K654J675
52414B01339J039Q31J015J644K552L529M766O509Q218Q851Q138O982O095M966
52400B66474K693m84l219m603n059n523o145o202n197l623k433j979j811j481
52386B21408j100r41q82n98l7O31J343K009K282J971J537J604K023K075J682J641
$$ y = [210641, 210955, 210502, 209294, 207714, 206059, 204371, 202478, 200154, 197438, 194835, 192884, 191478, 189954, 188012, 186230, 185387, 185549, 186133, 186692, 187259, 188022, 189053, 190431, 192277, 194399, 196144, 196927, 196918, 196933, 197569, 198654, 199587, 200024, 200055, 199955, 200040, 200635, 201852, 203398, 204928, 206609, 208973, 212053, 214984, 216698, 216869, 216036, 214960, 214042, 213067, 211394, 208587, 205134, 202327, 201099, 201110, 201209, 200650, 199560, 198322, 196962, 195274, 193308, 191570, 190715, 190929, 191552, 191552, 190586, 189409, 189002, 189523, 190381, 191033, 191255, 190919, 190169, 189834, 190972, 193717, 197010, 199664, 201339, 202378, 203209, 204224, 205868, 208420, 211949, 216715, 223224, 231442, 240293, 248431, 255413, 261508, 266474, 269167, 268683, 265464, 260861, 255802, 250279, 244134, 237932, 232735, 229112, 226679, 224700, 222889, 221408, 220308, 219367, 218485, 217887, 217850, 218481, 219824, 221833, 224115, 226086, 227623, 229227, 231250, 233325, 235007, 236648]
52370B36648K436L502M149M525N040N362M836L629K628K158J663P77M0J02P29
52355B78224J070O35k84r88q63K74J900L011K976K203J689J985K770L426L734
52340C01762L930M352N179O329P502Q445R202J0024J0943J1641J1900J2027J2564
52327D15800J3689J5097J6477J7800J8996J9675J9539J8937J8644J8898J9027
52316F12579J8320J6997J5891J5217J4273J2604J0836R836R396Q551P094N906
52304G57500N556N377M477L070J965J223J65j323k439k703k723l288m231m785
52290G57841m754m740n275o147o668o319n082l350j568N8J556K927M102N210O601
52275G34392Q383J0179J1535J2394J2929J3186J3176J3118J3200J3177J2676J1839
$$ y = [236648, 239084, 242586, 246735, 251260, 256300, 261662, 266498, 270127, 272755, 274913, 276576, 277353, 277393, 277495, 278224, 279294, 279929, 279645, 278657, 277794, 278068, 279968, 282979, 285955, 288158, 289847, 291832, 294602, 298028, 301762, 305692, 310044, 315223, 321552, 329054, 337499, 346701, 356725, 367668, 379309, 391209, 403236, 415800, 429489, 444586, 461063, 478863, 497859, 517534, 537073, 556010, 574654, 593552, 612579, 630899, 647896, 663787, 679004, 693277, 705881, 716717, 726553, 735949, 744500, 751594, 757500, 763056, 768433, 772910, 775980, 777945, 779168, 779333, 778010, 775571, 772868, 770145, 766857, 762626, 757841, 753087, 748347, 743072, 736925, 730257, 723938, 718856, 715506, 713938, 713996, 715552, 718479, 722581, 727791, 734392, 742775, 752954, 764489, 776883, 789812, 802998, 816174, 829292, 842492, 855669, 868345, 880184]
52263H80184J1186J0825J0207Q841O886M874L183J962J235Q70O30M30K94pq72
52248I40728k231l439m089m548n273o044o449o792p705q987r678r425q913q599
52234H48556p896o236m303l350l522l738l172k160j409j016o13k9N49R22J103
52219H13686J316J872K912M118M949N237N322N573O029O594P180P476P028N849
52205H85141M653M075L931L651L123K678K431K239K147K311K507K285J703J277
52191I24152J100O24l47j081q16K05J109J483J450R12m83k474l963m161l550l313
52175I10847l898m660m930m929n254n794n743m712l322k425k103j829j261m52
52161H59535N38J654K522K726K460K436K976L629L884L711L202K249R42j04l55
$$ y = [880184, 891370, 902195, 912402, 921243, 928129, 933003, 936186, 938148, 939383, 940253, 940883, 941313, 941607, 941600, 940728, 938497, 935058, 930969, 926421, 921148, 915104, 908655, 901863, 894158, 885171, 875493, 866068, 857155, 848556, 840660, 834424, 830121, 826771, 823249, 819511, 816339, 814179, 812770, 811754, 811141, 811112, 811661, 812583, 813686, 815002, 816874, 819786, 823904, 828853, 834090, 839412, 844985, 851014, 857608, 864788, 872264, 879292, 885141, 889794, 893869, 897800, 901451, 904574, 907252, 909683, 911922, 914069, 916380, 918887, 921172, 922875, 924152, 925252, 925876, 925529, 924448, 923632, 923837, 924946, 926429, 927879, 928791, 928308, 925834, 921871, 917710, 914160, 910847, 906949, 902289, 897359, 892430, 887176, 881382, 875639, 870927, 867605, 865180, 863077, 861248, 859987, 859535, 860073, 861727, 864249, 866975, 869435, 871871, 874847, 878476, 882360, 886071, 889273, 891522, 892464, 892360, 892005]
52146H92005k4K23O0l11n72m52K16J288K276K849L207L699M321N004O045P774
52130I27608R906J1794J3201J4358J5445J6501J7759J9438K1184K2366K3007K3757
52118A136324K4771K5290K4670K3308K2043K1041J9719J7570J4651J1421Q415
52107A349223N961L889J579j433m846p770r534j0207j0442j0822j1320j1408j0734
52094A272136r638q708p970o875n241l769l321l916m741n034m711m125l497k659
52080A197931j323M19K038L252M569O729R530J1741J2472J2203J2089J2570J3177
52067A297397J3449J3432J3200J2492J1084R238P509O157M916L285J022j656m307
52054A387218o695q826j0614j1765j2188j2302j2693j3533j4629j5903j7439j9069
$$ y = [892005, 891981, 892204, 892264, 891953, 891381, 890929, 891145, 892433, 894709, 897558, 900765, 904464, 908785, 913789, 919834, 927608, 937514, 949308, 962509, 976867, 992312, 1008813, 1026572, 1046010, 1067194, 1089560, 1112567, 1136324, 1161095, 1186385, 1211055, 1234363, 1256406, 1277447, 1297166, 1314736, 1329387, 1340808, 1349223, 1355184, 1359073, 1360652, 1359219, 1354373, 1346603, 1337069, 1326862, 1316420, 1305598, 1294278, 1282870, 1272136, 1262498, 1253790, 1245820, 1238945, 1233704, 1229935, 1226614, 1222698, 1217957, 1212923, 1208212, 1204087, 1200590, 1197931, 1196608, 1197027, 1199065, 1202317, 1206886, 1213615, 1223145, 1234886, 1247358, 1259561, 1271650, 1284220, 1297397, 1310846, 1324278, 1337478, 1349970, 1361054, 1370292, 1377801, 1383958, 1388874, 1392159, 1393181, 1391525, 1387218, 1380523, 1371697, 1361083, 1349318, 1337130, 1324828, 1312135, 1298602, 1283973, 1268070, 1250631, 1231562]
52042A231562k0233k0466j9863j8953j8241j7853j7418j6306j4196j1576r333
52031A047124p804o451m719k923j865j735j857j667j497k022l239m427n047n313
52017I96558n730o376o837o794o419o310p053q765j0975j2992j4458j5426j6035
52004H72388j6344j6550j6981j7686j8315j8638j8820j8961j8730j7941j7085
51993F76337j6727j6552j5738j4149j2503j1293j0273r125p992p044o158n307
51981E43476m723m420m079l790m229n724p654r242j0361j1106j1208j0522r580
51968D46838q889q105o649m720k922j243O36K333L164L430M177N569O598O600
51954D46817O069N511M550K779O82r39j910k459k633k504k483k746k792k097q76
$$ y = [1231562, 1211329, 1190863, 1171000, 1152047, 1133806, 1115953, 1098535, 1082229, 1068033, 1056457, 1047124, 1039320, 1032869, 1028150, 1025227, 1023362, 1021627, 1019770, 1018103, 1016606, 1014584, 1011345, 1006918, 1001871, 996558, 990828, 984452, 977615, 970821, 964402, 958092, 951039, 942274, 931299, 918307, 903849, 888423, 872388, 856044, 839494, 822513, 804827, 786512, 767874, 749054, 730093, 711363, 693422, 676337, 659610, 643058, 627320, 613171, 600668, 589375, 579102, 569977, 561985, 554941, 548783, 543476, 538753, 534333, 530254, 526464, 522235, 516511, 508857, 499615, 489254, 478148, 466940, 456418, 446838, 437949, 429844, 423195, 418475, 415553, 414310, 414946, 417279, 420443, 423873, 428050, 433619, 440217, 446817, 452886, 458397, 462947, 465726, 466408, 465469, 463559, 461100, 458467, 455963, 453480, 450734, 447942, 445845, 444969]
51939D44969M34J981M136O636Q798J0399J1633J2351J2088J0850R155P232M717
$$ y = [444969, 445403, 447384, 451520, 458156, 466954, 477353, 488986, 501337, 513425, 524275, 533430, 540662, 545379]
$$ [...]
##END NTUPLES=NMR SPECTRUM
##END=
