##TITLE=NES1097_ptc170_9887054_qLuaFzhWXO
##JCAMPDX= 6.0         $$ Bruker NMR JCAMP-DX V2.0
##DATA TYPE= NMR SPECTRUM
##DATA CLASS= NTUPLES
##ORIGIN= BRUKER
##OWNER= Administrator
$$ 1.72 TOPSPIN		Version 2.1
$$ 2016-08-28 21:28:00.961 -0500  Administrator@X
$$ Compression mode = diff/dup
##.OBSERVE FREQUENCY= 400.02188249412
##.OBSERVE NUCLEUS= ^1H
##.ACQUISITION MODE= SIMULTANEOUS (DQD)
##.ACQUISITION SCHEME= undefined
##.AVERAGES= 8
##.DIGITISER RES= 22
##SPECTROMETER/DATA SYSTEM= spect
##.PULSE SEQUENCE= zg30
##.SOLVENT NAME= COFFEE_meoh
##.SHIFT REFERENCE= INTERNAL, COFFEE_meoh, 1, 14.98509
##AUDIT TRAIL= $$ (NUMBER, WHEN, WHO, WHERE, PROCESS, VERSION, WHAT)
$$ ##TITLE= Audit trail, TOPSPIN		Version 2.1
$$ ##JCAMPDX= 5.01
$$ ##ORIGIN= Bruker BioSpin GmbH
$$ ##OWNER= Administrator
$$ $$ E:\/data/COFFEE/nmr/NES1097_ptc170_9887054_qLuaFzhWXO/10/pdata/1/auditp.txt
$$ ##AUDIT TRAIL=  $$ (NUMBER, WHEN, WHO, WHERE, PROCESS, VERSION, WHAT)
(   1,<2016-08-28 21:27:53.883 -0500>,<Administrator>,<X>,<go>,<TOPSPIN 2.1>,
      <created by zg
	started at 2016-08-28 21:26:46.554 -0500,
	POWCHK enabled, PULCHK disabled,
       configuration hash MD5:
       21 0F 79 D6 B3 7B B4 F6 88 20 88 DB 03 48 BD 9F
       data hash MD5: 64K
       D9 B0 0D 20 B3 82 7F 01 95 7B 82 3E C0 8B B8 08>)
(   2,<2016-08-28 21:27:56.961 -0500>,<Administrator>,<X>,<proc1d>,<TOPSPIN 2.1>,
      <Start of raw data processing
       efp LB = 0 FT_mod = 6 PKNL = 1 PHC0 = 0 PHC1 = 0 SI = 32K 
       data hash MD5: 32K
       4A 6B 5F 90 F1 B8 D0 DA 66 87 4B BB 96 A9 D2 17>)
(   3,<2016-08-28 21:27:57.242 -0500>,<Administrator>,<X>,<proc1d>,<TOPSPIN 2.1>,
      <pk PHC0 = 95.67993 PHC1 = 0 
       data hash MD5: 32K
       C7 9F EB A1 70 E0 35 98 C2 F1 89 D5 EC B8 BD 78>)
(   4,<2016-08-28 21:27:57.351 -0500>,<Administrator>,<X>,<proc1d>,<TOPSPIN 2.1>,
      <abs ABSG = 1 
       data hash MD5: 32K
       0D CA 78 A2 D9 CE 14 7E 4B 1C E2 33 99 25 62 5E>)
(   5,<2016-08-28 21:27:57.398 -0500>,<Administrator>,<X>,<proc1d>,<TOPSPIN 2.1>,
      <abs ABSG = 2 
       data hash MD5: 32K
       90 15 45 25 87 10 A4 22 DA 9F E1 39 2B DA 52 94>)
(   6,<2016-08-28 21:27:57.461 -0500>,<Administrator>,<X>,<proc1d>,<TOPSPIN 2.1>,
      <abs ABSG = 3 
       data hash MD5: 32K
       6A 38 EF E7 CC CD 66 91 17 D8 69 85 BD 1F 73 81>)
(   7,<2016-08-28 21:27:57.523 -0500>,<Administrator>,<X>,<proc1d>,<TOPSPIN 2.1>,
      <abs ABSG = 4 
       data hash MD5: 32K
       2C 34 91 C5 B4 94 72 1B 03 D6 AB 76 CC 4E E4 FE>)
(   8,<2016-08-28 21:27:57.570 -0500>,<Administrator>,<X>,<proc1d>,<TOPSPIN 2.1>,
      <abs ABSG = 5 
       data hash MD5: 32K
       90 87 58 1B C6 0F 39 5C 4C 6F CA 05 89 87 C6 ED>)
$$ ##END=
$$ 
$$ $$ hash MD5
$$ $$ 3C 3F 88 7C 6A A8 A3 10 4A 4E 06 8E 8C 68 25 3E
##$RELAX= 
##$RELAX= 
##$RELAX= 
##$RELAX= 
##$RELAX= 
##$RELAX= 
##$RELAX= 
$$ Bruker specific parameters
$$ --------------------------
##$DU= <E:\>
##$EXPNO= 10
##$NAME= <NES1097_ptc170_9887054_qLuaFzhWXO>
##$PROCNO= 1
$$ [...]
150 150 150 150 150 150 150 150
##$TP07= 0
##$TPNAME0= <>
##$TPNAME1= <>
##$TPNAME2= <>
##$TPNAME3= <>
##$TPNAME4= <>
##$TPNAME5= <>
##$TPNAME6= <>
##$TPNAME7= <>
##$TPOAL= (0..7)
0.5 0.5 0.5 0.5 0.5 0.5 0.5 0.5
##$TPOFFS= (0..7)
0 0 0 0 0 0 0 0
##$TUNHIN= 0
##$TUNHOUT= 0
##$TUNXOUT= 0
##$USERA1= <user>
##$USERA2= <user>
##$USERA3= <user>
##$USERA4= <user>
##$USERA5= <user>
##$V9= 5
##$VALIST= <valist>
##$VCLIST= <CCCCCCCCCCCCCCC>
##$VD= 0
##$VDLIST= <DDDDDDDDDDDDDDD>
##$VPLIST= <PPPPPPPPPPPPPPP>
##$VTLIST= <TTTTTTTTTTTTTTT>
##$WBST= 2048
##$WBSW= 25
##$XGAIN= (0..3)
0 0 0 0
##$XL= 0
##$YL= 0
##$YMAX_a= 573109
##$YMIN_a= -489150
##$ZGOPTNS= <>
##$ZL1= 120
##$ZL2= 120
##$ZL3= 120
##$ZL4= 120
##$ABSF1= 14.98509
##$ABSF2= -5.573092
##$ABSG= 5
##$ABSL= 3
##$ALPHA= 0
##$AQORDER= 0
##$ASSFAC= 0
##$ASSFACI= 0
##$ASSFACX= 0
##$ASSWID= 0
##$AUNMP= <proc_prof1d_extract_pilot.lims>
##$AXLEFT= 0
##$AXNAME= <>
##$AXNUC= <1H>
##$AXRIGHT= 0
##$AXTYPE= 0
##$AXUNIT= <>
##$AZFE= 0.1
##$AZFW= 0.1
##$BCFW= 0
##$BC_mod= 0
##$BYTORDP= 0
##$COROFFS= 0
##$CY= 15
##$DATMOD= 1
##$DC= 0
##$DFILT= <>
##$DTYPP= 0
##$F1P= 0
##$F2P= 0
##$FCOR= 0.5
##$FTSIZE= 32768
##$FT_mod= 6
##$GAMMA= 0
##$GB= 0
##$INTBC= 1
##$INTSCL= 1
##$ISEN= 128
##$LB= 0
##$LEV0= 0
##$LPBIN= 0
##$MAXI= 10000
##$MC2= 0
##$MEAN= 0
##$ME_mod= 0
##$MI= 0
##$NCOEF= 0
##$NC_proc= -8
##$NLEV= 6
##$NOISF1= 0
##$NOISF2= 0
##$NSP= 0
##$NTH_PI= 0
##$NZP= 0
##$OFFSET= 14.98509
##$PC= 1
##$PHC0= 95.67993
##$PHC1= 0
##$PH_mod= 1
##$PKNL= yes
##$PPARMOD= 0
##$PPDIAG= 0
##$PPIPTYP= 0
##$PPMPNUM= 2147483647
##$PPRESOL= 1
##$PSCAL= 4
##$PSIGN= 0
##$PYNMP= <proc.py>
##$REVERSE= no
##$SF= 400.02
##$SI= 32768
##$SIGF1= 0
##$SIGF2= 0
##$SINO= 400
##$SIOLD= 32768
##$SPECTYP= <>
##$SREGLST= <1H.CDCl3>
##$SSB= 0
##$STSI= 32768
##$STSR= 0
##$SW_p= 8223.68421052631
##$SYMM= 0
##$S_DEV= 0
##$TDeff= 65536
##$TDoff= 0
##$TI= <>
##$TILT= no
##$TM1= 0
##$TM2= 0
##$TOPLEV= 0
##$USERP1= <user>
##$USERP2= <user>
##$USERP3= <user>
##$USERP4= <user>
##$USERP5= <user>
##$WDW= 1
##$XDIM= 32768
##$YMAX_p= 443457357
##$YMIN_p= -785288
##$CURPLOT= <Network HP LaserJet P1505>
##$CURPRIN= <$Network HP LaserJet P1505>
##$DFORMAT= <normdp>
##$LAYOUT= <+/1D_H.xwp>
##$LFORMAT= <normlp>
##$PFORMAT= <normpl>
##$SURQMSG= 1
$$ End of Bruker specific parameters
$$ ---------------------------------
##NTUPLES= NMR SPECTRUM
##VAR_NAME=  FREQUENCY,     SPECTRUM/REAL,   SPECTRUM/IMAG
##SYMBOL=    X,             R,               I
##VAR_TYPE=  INDEPENDENT,   DEPENDENT,       DEPENDENT
##VAR_FORM=  AFFN,          ASDF,            ASDF
##VAR_DIM=   32768,         32768,           32768
##UNITS=     HZ,            ARBITRARY UNITS, ARBITRARY UNITS
##FACTOR=    0.250966925370066, 1,           1
##FIRST=     8223.43324360094, -130219,      -223833
##LAST=      0,             114939,          -36115
##MIN=       0,             -785288,         0
##MAX=       8223.43324360094, 443457357,    0
$$ Real data points
##PAGE= N=1
##DATA TABLE= (X++(R..R)), XYDATA
$$ [...]
$$ plain form
19551 -228026 -257239 -147989 24702 -267751 -48245 75669 -217073 154917 -255617 -218863
19541 -218863 -258661 -241619 170262 -170581 -312020 50716 -39287 -206457 4786 137093 -23833
19529 -321056 -178990 -11304 -39458 -107339 -123009 -41071 136746 -114297 -77 439705 -8111
19517 -130686 -20806 -43445 -38919 -25097 18338 -45434 46443 -266204 -241894 777 -28773 -65720
19505 -65720 -122282 -91900 -136599 -57509 112365 -117901 87758 -192861 128212 -128178 -146392
19494 -146392 -20213 24534 -70008 64144 130194 240919 135262 -96884 -190200 -26356 -36264
19483 -36264 -173053 -526323 57647 -161292 123988 -100978 -43434 -115771 195278 54843
19472 -56257 -229761 -237026 -177221 -118262 185965 126255 -8428 -151144 288493 168889 240335
$$ packed form
19551b28026k9213J09250B4702b67751d8245G5669b17073A54917b55617L6754
19541b18863l9798J7042A70262a70581j41439E0716c9287j67170D786J32307b3833
19529c21056J42066a1304k8154o7881j5670d1071A36746a14297g7D39705h111
19517a30686b0806k2639M526J3822A8338d5434D6443b66204K4310G77b8773l6947
19505f5720n6562L0382m4699e7509A12365a17901H7758a92861A28212a28178j8214
19494a46392b0213B4534g0008F4144O6050J10725j05657i6884r3316b6356r908
19483c6264j36789l53270E7647a61292A23988a00978d3434p2337A95278E4843
19472e6257j73504p265N9805N8959A85965n9710h428j42716B88493j19604P1446
$$ plain form
19461 240335 13645 198117 -376911 -203888 74258 -148474 -137356 -338708 122998 -68421
19450 -21206 -12496 -21068 -204468 365722 -378 161918 -89488 -170707 -260292 -21024 -27060 -184955
19438 -184955 -8716 39806 -110858 -310243 151507 -174761 -126120 132802 213368 -136769
19427 -29111 -36095 74242 13419 -154267 218936 21486 -470888 -232108 -172061 -178130 -196918
19416 -196918 35777 -22847 125673 -135548 -131713 127916 112330 -21681 -9453 -162808 99225
19404 -167502 -88410 110933 -134438 9259 -261229 -121874 -483123 56510 -306599 -134150
19393 5648 -126109 54420 -293985 158343 115120 99964 32615 80141 -20123 5292 -55270
19381 -31929 -264466 -23635 7649 -43391 129725 -128350 186718 -183133 -138145 53900 223130
$$ packed form
19461B40335A3645J84472c76911J73023G4258a48474J1118k01352A22998f8421
19450b1206Q710q572j83400C65722c78A61918h9488q1219q9585b1024o036j57895
19438a84955h716C9806a10858j99385A51507a74761M8641A32802Q0566a36769
19427b9111o984G4242A3419a54267B18936B1486d70888b32108O0047o069j8788
19416a96918C5777b2847A25673a35548L835A27916j5586b1681i453j53355I9225
19404a67502P9092A10933a34438I259b61229a21874l61249E6510c06599a34150
19393E648a26109E4420b93985A58343m3223j5156C2615M7526b0123E292e5270
19381c1929k32537b3635G649d3391A29725a28350A86718a83133M4988E3900J69230
$$ plain form
19370 223130 -41144 154141 -7497 -93198 -181214 24281 -244055 -357624 -108856 268957 -267121
19358 61092 44787 -153249 -332213 90451 111005 49852 -54183 277624 134612 -24975 -270691
19347 -270691 -201327 231627 248229 30611 -92787 146364 -271084 -206939 -462495 -70434 179276
19335 -271605 143375 -118980 28559 182214 -412988 -170646 -42637 -80954 -42108 65073
19324 -70835 -54308 1655 -189599 49709 -189063 -191319 -212760 12269 -285970 -102948 -120138
19313 -120138 112958 3263 20632 185992 350520 -37583 -434917 -315125 53631 -95245 -64024
19302 -64024 2400 38895 1734 -42094 -153758 -46875 -569550 18804 -118927 350 -62965 52086
19289 235785 -65791 90553 188278 144429 -175333 -318465 94674 243746 -21782 14404 -258576
$$ packed form
19370B23130d1144A54141g497q5701q8016B4281b44055j13569a08856B68957b67121
19358F1092j6305a53249j78964I0451K0554D9852e4183B77624A34612b4975k45716
19347b70691O9364B31627J6602C0611i2787A46364b71084O4145k55556g0434A79276
19335b71605A43375a18980B8559J53655d12988a70646d2637l8317L8846F5073
19324g0835J6527A655a89599D9709a89063k256k1441A2269b85970a02948j7190
19313a20138A12958C263J7369J65360J64528c7583l97334J19792E3631i5245L1221
19302f4024B400L6495A734d2094j11664d6875n22675A8804a18927C50f2965E2086
19289B35785f5791I0553R7725m3849a75333j43132I4674J49072b1782A4404b58576
$$ plain form
19277 -297203 -152343 -59563 -20711 101283 -151802 40356 -197888 -266381 -126571 55211
19266 -225819 307642 127262 203004 215 -122816 133150 -478829 -57107 -311660 -270074 33460
19254 -63405 -117260 -37035 -89253 -356878 2826 22519 -84246 -272870 114439 124182 -389293
19242 -21068 17493 -4935 -64823 135276 24639 43384 -167705 -51190 34690 91798 176076
19231 176076 -330245 -44807 46346 267689 123472 5309 141978 -116146 178768 236516
19221 236516 181457 56303 148487 -251584 4303 -119609 -108418 108678 -4736 341638 37583
19209 253964 128906 -7014 13498 -82844 129855 -275337 249121 151688 -41770 -11995 152114
19197 -288201 -288868 63982 -134594 13384 109532 -89088 232499 12458 -186436 -85619 -77537
$$ packed form
19277b97203J44860e9563b0711A01283a51802D0356a97888o8493a26571E5211
19266b25819C07642A27262P5742B15a22816A33150d78829e7107k54553M1586C3460
19254f3405n3855c7035n2218k67625B826J9693h4246j88624A14439R743c89293
19242b1068A7493d935n9888A35276B4639J8745a67705e1190C4690N7108Q4278
19231A76076c30245d4807D6346K21343A23472E309J36669a16146A78768N7748
19221B36516n5059E6303R2184b51584D303a19609J1191A08678d736C41638C7583
19209B53964j25058g014A3498h2844A29855b75337B49121r7433d1770a1995A52114
19197b88201o67F3982a34594A3384R6148h9088B32499A2458a86436h5619Q082
$$ plain form
19186 -77537 -96862 92905 -72099 -287836 -60575 120657 -119121 -1830 196671 -167385 176954
19174 -47383 -59906 -195302 303308 80996 -295649 -300736 32037 98600 -51211 -216337 7872
19162 -236850 -2388 -210904 -288185 92016 -133519 -97498 -215280 -188795 -13899 -18624 -290308
19151 -290308 -113411 -78995 -28676 -84057 54762 303749 106000 -140467 -59037 128301
19140 -215521 177049 -206079 -185019 -43513 -128865 22280 -146577 -11437 -66925 -259825 216634
19128 -211805 -343488 -258945 108669 342647 40911 -211012 -109420 253454 -85698 32156
19117 -208034 95756 65033 -173852 -261009 -230412 321586 -207619 15073 -268646 -212744 109740
19105 -44139 -59909 290586 33914 -287742 -181358 78139 -4748 35311 -251600 79593 -210254
$$ packed form
19186g7537j9325I2905g2099k15737f0575A20657a19121a830A96671a67385A76954
19174d7383j2523j35396C03308H0996b95649n087C2037O6563e1211j65126G872
19162b36850b388k08516p7281I2016a33519L6021j17782K6485a3899m725k71684
19151b90308a13411L4416b8676n5381E4762K48987A06000a40467e9037A28301
19140b15521A77049b06079K1060d3513q5352B2280a46577a1437n5488j92900B16634
19128b11805j31683Q4543A08669K33978D0911b11012J01592B53454h5698C2156
19117b08034I5756l0723a73852q7157L0597C21586b07619A5073b68646N5902A09740
19105d4139j5770B90586C3914b87742J06384G8139d748C5311b51600G9593b10254
$$ plain form
19093 222446 172520 -154491 -176829 -51732 -302945 130230 -115444 38775 319944 -155439
19082 89289 -216331 264188 21403 -132683 -173666 355198 -418173 113379 90860 143607
19072 143607 -159472 37523 -109441 -225418 -175253 -528911 40819 -238996 -72120 -97953
19062 -97953 -38589 -259734 194805 -149095 151299 -85772 212196 169803 27820 125410 -110855
19050 363797 17484 -136514 312241 214366 -144647 -346432 140710 32829 25157 -313726
19039 213980 33040 -58453 -180946 174574 -98757 174608 -47035 -96581 -154699 -179992 154300
19027 -390675 -52883 70568 43483 -25086 -61626 -51453 -113450 -99944 161455 107721 -385275
19015 -286064 -40419 -276027 146768 62670 125266 -87348 -11190 116948 -294318 146582
$$ packed form
19093B22446m9926a54491k2338e1732k51213A30230a15444C8775K81169a55439
19082H9289b16331B64188B1403a32683m0983C55198d18173A13379k2519N2747
19072A43607a59472C7523a09441j15977N0165l53658D0819b38996g2120k5833
19062i7953c8589k21145A94805a49095A51299h5772B12196m2393B7820R7590a10855
19050C63797A7484a36514C12241r7875a44647k01785A40710C2829p672c13726
19039B13980C3040e8453j22493A74574i8757A74608d7035m9546n8118k5293A54300
19027c90675e2883G0568k7085b5086l6540J0173o1997J3506A61455n3734c85275
19015b86064d0419k35608A46768F2670O2596h7348a1190A16948b94318A46582
$$ plain form
19004 85964 -217100 -143812 -163422 18350 -309166 -283385 116711 -149333 -130156 182289 -86204
18992 -58367 321735 -59426 27644 171146 -19103 -119808 86963 26754 -147834 -166594 -101284
18981 -101284 -128618 -144523 -144736 11075 -414728 42041 -141343 -55729 32444 194000 73753
18969 167868 -52452 195989 140110 99651 -168609 42251 -150746 218215 -216050 -474509
18959 -474509 10114 64287 45155 -26995 -282420 158862 -62830 -379397 -77680 80472 -11382
18947 165466 -86645 44145 46391 9478 -121008 -61772 166429 -91472 -75313 -271834 -283576
18936 -283576 -73217 -101421 318713 -106850 -100997 -100094 -185710 -183039 -36951 -28155 -169638 84475
18923 -5083 -99532 -432993 377052 -127689 161897 -235942 -179608 -7585 -162815 100330 57407
$$ packed form
19004H5964b17100P3288j9610A8350c09166K5781A16711a49333J9177A82289h6204
18992e8367C21735e9426B7644J43502a9103j00705H6963B6754a47834j8760O5310
18981a01284k7334j5905k13A1075d14728D2041a41343e5729C2444J61556G3753
18969A67868e2452A95989n5879m0459a68609D2251a50746B18215b16050k58459
18959d74509A0114N4173j9132b6995k55425A58862f2830l16567g7680H0472a1382
18947A65466h6645D4145K246I478a21008N9236A66429i1472J6159j96521j1742
18936b83576g3217k8204C18713a06850N853R03q5616K671c6951Q796j41483H4475
18923e083r4449l33461C77052a27689A61897b35942N6334g585j55230A00330m2923
$$ plain form
18912 57407 -113229 4481 120595 -51748 82920 63517 -275168 3020 -117045 -27718 363448
18900 -119373 -201382 -136029 -39535 -120355 85636 68310 6335 -198356 68219 -231973 -77043
18888 -322905 -239953 -153937 80757 -34928 -287733 179810 -142756 28608 -346619 -151985
18877 -250896 101975 -116953 -41345 -122017 -107194 -105813 186245 -52239 142969 204785 -59476
18865 -34686 -224175 -268081 24083 484287 -143075 -5390 -317969 -35651 -114494 63873 -123355
18853 -209534 193884 105831 123664 205083 -72402 165469 -167998 -280720 33354 -279969
18842 -193568 -232220 232702 -55666 -104573 204484 -64421 -256120 -213533 -305310 -280288 42437
18830 53796 -69373 -58122 -99972 -54104 192794 3390 -169461 58266 67993 79885 64494 96890
$$ packed form
18912E7407a13229D481J16114e1748H2920j9403b75168C020a17045b7718C63448
18900a19373q2009O5353c9535q0820H5636j7326F335a98356F8219b31973g7043
18888c22905Q2952Q6016H0757c4928k52805A79810a42756B8608c46619a51985
18877b50896A01975a16953d1345q0672J4823J381A86245e2239A42969O1816e9476
18865c4686j89489m3906B4083M60204a43075e390l12579c5651p8843F3873a23355
18853b09534A93884q8053J7833Q1419g2402A65469a67998j12722C3354b79969
18842a93568l8652B32702e5666m8907B04484f4421j91699M2587r1777K5022D2437
18830E3796f9373J1251m1850M5868A92794C390a69461E8266R727J1892j5391L2396
$$ plain form
18818 96890 126743 852 135841 331771 45277 -77279 296388 241345 37039 133091 183572
18807 183572 11669 55387 24900 -233545 235157 -129161 36150 -156833 41627 -251449
18796 51604 -42568 -310866 -18594 -287538 -312984 -146420 -4941 420630 268485 96629 138862
18785 138862 -264009 -59687 150767 -176379 -54140 -231020 190693 -156156 -171376 -65557
18774 118768 33065 8260 -74058 215607 -164054 125373 411124 -242727 297293 180781
18764 180781 -101755 131513 -190298 -34786 -37407 -163336 -60080 -56957 53358 -116502 53303
18752 171428 -262892 -447706 -49167 122316 -50747 234233 27812 12615 -54026 -345184
18742 -345184 -63841 -270867 -300394 -49108 10114 120240 -96435 99586 291261 -123578 129759
$$ packed form
18818I6890K9853H52J34989J95930D5277g7279B96388n5043C7039R6052N0481
18807A83572A1669M3718B4900b33545B35157a29161C6150a56833D1627b51449
18796E1604d2568k68298a8594k68944k5446a46420d941D20630j52145I6629M2233
18785A38862b64009e9687A50767a76379e4140j76880A90693a56156j5220f5557
18774A18768C3065H260g4058B15607a64054A25373K85751b42727B97293j16512
18764A80781a01755A31513a90298c4786k621j25929f0080L123E3358a16502E3303
18752A71428b62892j84814d9167A22316e0747B34233B7812A2615e4026k91158
18742c45184f3841k07026k9527d9108A0114J10126i6435I9586J91675a23578A29759
$$ plain form
18730 136874 -42287 58655 19461 -112692 161849 -245027 189334 -147057 190400 -59913
18719 147572 -29792 -143603 -273918 -35063 56207 -30174 -147367 11694 43886 -20074 106087
18707 -76011 -192974 -40474 -12722 -110263 27606 -223923 117268 -60931 -101789 364494 -20626
18695 -291188 195674 -165950 -14139 -430984 -260295 -114938 -189142 357697 64694 35427
18685 35427 171243 -285136 -188524 -47880 -64361 -48115 -303642 -141824 6826 127628 -297073
18673 113249 128498 -67257 -293614 -246806 -139448 36708 -188698 274796 -382983 41622
18662 -49834 -150731 -10397 184809 -343365 11698 -244722 -55129 -102518 -229921 199244
18651 -168532 -167630 89932 -203752 -7514 -216626 26418 -161917 -311934 -225037 -221547 59240
$$ packed form
18730A36874d2287E8655A9461a12692A61849b45027A89334a47057A90400e9913
18719A47572b9792j13811j30315c5063E6207c0174j17193A1694L2192b0074A06087
18707g6011j16963d0474a2722r7541B7606b23923A17268f0931m0858C64494b0626
18695b91188A95674a65950a4139m16845J70689a14938p4204C57697F4694k9267
18685C5427J35816b85136R6612d7880j6481J6246k55527a41824F826J20802b97073
18673A13249J5249f7257k26357M6808J07358C6708a88698B74796c82983D1622
18662d9834j00897a0397A84809c43365A1698b44722e5129m7389j27403A99244
18651a68532R02H9932b03752g514k09112B6418a61917j50017Q6897L490E9240
$$ plain form
18639 250671 -339918 -228516 -126129 -37868 -50428 -282485 97726 -408520 -212942 -31932
18628 -53500 -379112 -91547 166894 -130323 96630 33220 139336 79155 129436 -578274 971
18616 166335 -140346 -83641 147270 -81579 -456051 162751 -283670 -54200 92597 -218713
18605 -51424 115361 -196541 -31059 -219073 -18318 115437 246357 -99345 33495 140679
18595 140679 -83927 21620 171040 268545 136735 -269565 -78906 36092 -245670 -14649 32810
18583 41001 127615 -173826 -212899 -310590 155317 40794 63547 -4790 -110665 -230342 77426
18571 26233 -44439 -340161 49388 34582 -143086 -159126 281466 -248328 23057 -269168 91129
18559 52216 312726 -160109 63407 -331091 -162833 181202 -369469 139215 65818 -221496
$$ packed form
18639B50671c39918J11402J02387c7868j2560k32057I7726d08520J95578c1932
18628e3500l25612i1547A66894a30323I6630C3220J06116o0181N0281e78274I71
18616A66335a40346N6705A47270h1579l74472A62751b83670e4200I2597b18713
18605e1424A15361a96541c1059j88014a8318A15437J30920i9345C3495J07184
18595A40679h3927B1620J49420R7505j31810b69565g8906C6092b45670a4649C2810
18583D1001Q6614a73826l9073r7691A55317D0794K2753d790j05875j19677G7426
18571B6233d4439k95722D9388j4806a43086j6040B81466b48328B3057b69168I1129
18559E2216K60510a60109F3407c31091a62833A81202c69469A39215F5818b21496
$$ plain form
18548 166719 -280672 139654 97030 -15009 -264831 -81489 214387 -223808 242494 64185
18537 -364980 104240 131076 93779 -376628 -124643 -214604 -228324 -167114 -377611 -26352 98252
18525 147778 283436 90385 -136268 -84621 -164304 59872 -164893 -229592 106 155947 -153260
18513 144429 162980 146259 -253340 -5976 48290 116835 -61719 140910 168328 65298 -229382
18501 -346135 -51276 65028 -99983 75412 -89209 -19522 38920 33603 -232367 62624 -211210
18489 -64970 166308 52762 -121799 122526 121306 36998 -45123 81288 -62194 -480341 -43106
18477 -195748 456835 -162214 26975 -165694 -43484 208328 8431 -128862 -79146 -333080
18467 -333080 99298 80720 -298110 -34196 -110370 15380 129601 -54216 21535 117459 19838
$$ packed form
18548A66719b80672A39654m2624a5009k49822h1489B14387b23808B42494F4185
18537c64980A04240K6836l7297c76628a24643q9961j3720O1210k10497b6352I8252
18525A47778J35658I0385a36268N1647p9683E9872a64893o4699A06J55841a53260
18513A44429J8551j6721b53340e976D8290O8545f1719A40910K7418F5298b29382
18501c46135e1276F5028i9983G5412h9209a9522C8920n317b32367F2624b11210
18489f4970A66308E2762a21799A22526j220C6998d5123H1288f2194m18147d3106
18477a95748D56835a62214B6975a65694d3484B08328H431a28862M9716k53934
18467c33080I9298j8578b98110c4196p6174A5380J14221e4216B1535R5924A9838
$$ plain form
18455 -175205 226505 -336064 125814 41628 151248 -202383 -145754 -354194 143074 -72449
18444 -239171 280750 169490 -39570 -165918 -51406 -137175 -102811 -252706 -81821 -183585
18434 -183585 178024 232236 -61489 -160335 -213217 4562 -433648 -59787 -82150 27783 -260371
18422 -129 70866 -103372 -17416 -172247 20286 81489 137348 -193211 115182 -74099 -181738
18411 -181738 -232204 181365 68789 -5413 -124934 369073 249102 219010 -47343 31621 79235
18400 79235 -101359 49827 -25708 30886 48378 -12908 -19935 163468 -44366 54196 112118
18389 112118 136066 66985 -258174 -300047 1178 -40041 -36311 -207368 41631 393165 -5779
18377 199013 174867 128721 288709 -99508 -105443 35341 -195877 196118 -84378 -107690 -193016
$$ packed form
18455a75205B26505c36064A25814D1628J09620b02383N6629k08440A43074g2449
18444b39171B80750j11260c9570j26348e1406q5769L4364j49895h1821j01764
18434a83585A78024N4212f1489r8846n2882D562d33648e9787k2363B7783b60371
18422a29G0866a03372a7416j54831B0286O1203N5859a93211A15182g4099j07639
18411a81738n0466A81365F8789e413j19521C69073j19971l0092d7343C1621M7614
18400G9235a01359D9827b5708C0886J7492a2908p027A63468d4366E4196N7922
18389A12118K3948F6985b58174m1873A178d0041L730j71057D1631L51534e779
18377A99013k4146m6146J59988i9508n935C5341a95877A96118h4378k3312q5326
$$ plain form
18366 -193016 10193 -347732 -25419 49269 -220068 -143562 -267714 99334 -294849 -153969
18356 -153969 -252982 -237279 183682 74951 268690 -102764 -131168 -140793 87068 -195034 -118445
18345 -118445 -143509 143164 -139494 108100 -253757 -203884 -33701 46063 -325485 319695
18334 -80371 -190425 -189437 111771 -58083 -83286 217684 -299910 -124206 59247 55861 -2531
18322 -362827 -130616 -245775 -69993 236488 82189 -106121 -142326 -208389 24644 107925 38735
18310 60152 -45465 29886 -188123 30678 -39709 -308941 184168 -196731 -37903 -65848 87774
18298 34606 115870 167759 59038 -7448 -111319 -95600 -283886 63481 -133654 153349 173831
18287 173831 18833 11271 170916 -79104 -7413 -250869 525 225841 -502603 -147277 -299628
$$ packed form
18366a93016A0193c47732b5419D9269b20068P6506j24152I9334b94849J40880
18356a53969r9013J5703A83682G4951J93739a02764k8404r625H7068a95034P6589
18345a18445k5064A43164a39494A08100b53757M9873c3701D6063c25485C19695
18334h0371j10054R88A11771e8083k5203B17684b99910a24206E9247l386b531
18322c62827a30616j15159f9993B36488H2189a06121l6205o6063B4644Q3281C8735
18310F0152d5465B9886a88123C0678c9709k69232A84168a96731c7903k7945H7774
18298C4606Q1264N1889E9038g448j03871J5719j88286F3481a33654A53349K0482
18287A73831A8833p562J59645g9104g413k43456E25K25316e02603a47277j52351
$$ plain form
18276 -299628 -33352 69732 -11422 50486 -215868 217820 -189733 -80076 -357758 -86460 37992
18264 20677 -246775 -429145 111165 16355 -183799 173587 -379795 -119647 -173090 -140764
18254 -140764 -34239 84741 -213150 -89686 274793 166502 -203484 40295 -114443 -165765
18244 -165765 54097 222877 -265113 113814 230757 80226 147129 20389 -91532 -18939 -172818
18233 -172818 98782 231733 -163587 -368660 -133957 -280201 -188594 -174647 -338184 249702
18222 205335 -123732 -95160 -360685 -101508 -150109 -19492 23379 -110068 73708 -302908
18211 107385 -425256 -132156 -22903 -254134 -77185 -319296 -104282 103104 -58120 -251995
18201 -251995 147347 33217 39330 82177 -349415 -73103 -195672 11981 -32234 -105284 58591
$$ packed form
18276b99628c3352F9732a1422E0486b15868B17820a89733h0076k77682h6460C7992
18264B0677b46775j82370A11165A6355a83799A73587c79795a19647n3443L2326
18254a40764c4239H4741b13150h9686B74793j08291b03484D0295a14443n1322
18244a65765E4097J68780b65113A13814J16943H0226O6903B0389i1532a8939j53879
18233a72818I8782J32951a63587k05073a33957j46244R1607J3947j63537B49702
18222B05335a23732K8572k65525a01508m8601a9492B3379a10068G3708c02908
18211A07385d25256a32156b2903k31231g7185k42111a04282A03104e8120j93875
18201b51995A47347C3217O113M2847c49415g3103j22569A1981c2234p3050E8591
$$ plain form
18189 -46367 -297390 -106719 -41258 -135863 181952 -102816 258135 62338 46332 -243182
18178 -240850 -102496 7285 -83327 -127422 -99443 -186344 271218 -148521 -144291 4274 87027
18167 87027 -179447 -159235 -476463 38493 -240052 34880 147965 -249024 -170354 -391996
18157 -391996 -224483 135795 -131005 451290 145582 -242158 -286803 197633 -166471 254008
18146 12426 79280 -46126 -241304 -100357 -263510 -100897 172614 -63067 22019 202294
18136 202294 -4950 -155075 -51623 45839 91844 -32891 128751 114260 39068 -388387 -292858
18125 -292858 78263 434750 -332757 90126 -88631 373613 -214809 398142 -106497 -168375
18115 -168375 207476 -617 216926 92390 -121143 63616 97115 -207294 31053 33025 -232851
$$ packed form
18189d6367k51023a06719d1258r4605A81952a02816B58135F2338j6006b43182
18178b40850a02496G285h3327m4095K7979q6901B71218a48521M230D274Q2753
18167H7027a79447K0212l17228C8493b40052C4880J13085b49024P8670k21642
18157c91996J67513A35795a31005D51290A45582b42158m4645A97633a66471B54008
18146A2426O6854d6126j95178a00357j63153a00897A72614f3067B2019J80275
18136B02294d950j50125e1623D5839M6005c2891A28751j4491C9068c88387R5529
18125b92858G8263L56487c32757I0126h8631C73613b14809C98142a06497o1878
18115a68375B07476f17B16926I2390a21143F3616L3499b07294C1053J972b32851
$$ plain form
18103 -4741 57000 -55205 -207542 -188764 -199132 -49843 210318 135979 -46851 -97914 -127923
18092 -127923 -103392 -253947 -77649 -77022 -135602 -46085 85418 -87848 -184453 214943 -130636
18080 42017 351777 -339251 214186 257968 -377999 -32248 28132 182807 -297077 -66358
18069 53598 -217111 -23976 91237 235857 297258 175286 -90511 215745 137044 -320952 168458
18057 -259967 243640 -286758 95914 51744 100516 47670 -164603 256700 -147338 -67777
18046 11720 336142 -50666 95520 186339 -424220 -67080 199329 69433 -330256 -214744 -46854
18034 -244944 75463 284748 -191128 -84788 -12531 -18571 -159839 -189277 103832 -36092 -85628
18023 -85628 121337 -156028 -258531 216159 6680 -13134 154785 -154212 -43160 -23689 -134991
$$ packed form
18103d741E7000e5205j52337J8778j0368d9843B10318p4339d6851n1063l0009
18092a27923K4531j50555g7649O27n8580d6085H5418h7848r6605B14943a30636
18080D2017L09760c39251B14186M3782c77999c2248B8132J54675b97077f6358
18069E3598b17111b3976I1237J44620O1401j21972i0511B15745p8701c20952A68458
18057b59967B43640b86758I5914m4170M8772D7670a64603B56700a47338f7777
18046A1720L24422e0666I5520R0819d24220f7080A99329F9433c30256J15512d6854
18034b44944G5463K09285a91128h4788a2531o040j41268k9438A03832c6092m9536
18023h5628A21337a56028j02503B16159F680a3134A54785a54212d3160J9471j11302
$$ plain form
18012 -134991 -306028 -134009 -29472 -563675 -361346 338449 -212498 -61187 182089 144112
18002 144112 -132812 -45362 43171 225681 -178468 -51063 38522 -250388 -190894 -39874 -141400
17991 -141400 -168061 -58878 -346516 -145214 -113977 44321 -37045 278954 -151477 -32798 17484
17979 -338109 35219 -308369 -3711 -157607 43345 -200023 117844 191902 -149328 -119958 -37708
17967 308104 -354692 -295378 -316258 91970 184650 -171290 238957 -111054 231804 -80545
17956 -250908 43779 23908 20388 20752 -40569 -98718 106169 -79648 -173645 -345511 66963 55851
17944 55851 -6740 -70125 17847 228648 -106873 67564 -256276 -154117 108098 -207782 26657
17932 -220082 27221 36637 -63146 -312728 -178588 38587 129170 17963 -165046 161074 -230494
$$ packed form
18012a34991j71037a34009b9472n34203K02329C38449b12498f1187A82089l7977
18002A44112a32812d5362D3171J82510a78468e1063C8522b50388N9494c9874j01526
17991a41400k6661e8878k87638a45214L1237D4321c7045B78954a51477c2798A7484
17979c38109C5219c08369c711j53896D3345b00023A17844P4058a49328K9370c7708
17967C08104c54692N9314k0880I1970R2680a71290B38957a11054B31804h0545
17956b50908D3779j9871l520L64d0569n8149A06169g9648r3997j71866F6963j1112
17944E5851f740o3385A7847K10801a06873F7564b56276J02159A08098b07782B6657
17932b20082B7221R416f3146k49582J34140C8587R0583A7963a65046A61074b30494
$$ plain form
17920 -92499 -85274 -50341 67519 -159047 9926 -173056 -5874 -9720 -321378 -159728 32261 -230753
17907 61258 -166 -207563 33220 252008 25888 -68914 23851 120693 334869 -126943 -259075
17896 -259075 14750 -141611 100792 370058 101714 -42817 -13285 142918 -200673 -185415
17886 -185415 83666 -94663 51755 -203583 3696 -193002 189585 -56597 85737 -280552 156890
17874 -17038 -145223 45197 194563 126819 114901 126668 -82930 65943 206540 284482 -79670
17862 -120277 -335402 30099 -5159 -68115 -101116 -77163 14479 3990 -206218 159173 -261437
17850 212960 280306 -149744 152667 -60470 -130450 -87745 223930 139041 213807 -421611 56082
17838 -277519 -41012 -136473 -39095 -159679 -83803 -84489 -10554 82481 272427 56697 65242 9728
$$ packed form
17920i2499P225L4933F7519a59047I926a73056e874l846l11658a59728C2261b30753
17907F1258a66k07397C3220K18788B5888f8914B3851R6842K14176a26943j32132
17896b59075A4750a41611A00792K69266A01714d2817a3285A42918b00673J5258
17886a85415H3666i4663E1755b03583C696a93002A89585e6597H5737b80552A56890
17874a7038j28185D5197J49366o7744j1918J1767h2930F5943J40597P7942g9670
17862a20277k15125C0099e159o2956l3001K3953A4479C990b06218A59173b61437
17850B12960O7346a49744A52667f0470o9980M2705B23930q4889P4766d21611E6082
17838b77519d1012r5461c9095j20584P5876o86a0554H2481J89946E6697Q545I728
$$ plain form
17825 -129893 -182377 160636 -285447 -75923 21671 -433685 -7025 -189371 262744 -7760 -108636
17814 -108636 -212487 15504 -275437 -87144 -210217 -84197 165017 96988 -130264 210573
17803 -173613 79485 -197837 44278 -19283 -222150 97647 297535 -76528 50748 43420 167415
17792 167415 80824 8961 -379904 -92812 24847 -240644 154478 90694 30568 -193029 3318
17780 -29713 -101026 -151061 -58074 184001 -360192 -172054 -11041 -116523 -19562 -37179 -15137
17768 296253 104465 -266784 41603 -46140 -400976 39121 -54284 59606 -181165 195308
17757 -110219 116236 43248 -109291 -483779 89832 -76181 38011 -71462 -41020 74701 99521
17746 99521 194605 -212327 -120027 25028 53581 138086 -38390 98507 62641 -30825 225634
$$ packed form
17825a29893n2484A60636b85447g5923B1671d33685g025j82346B62744g760j00876
17814a08636j03851A5504b75437h7144j23073h4197A65017o8029a30264B10573
17803a73613G9485a97837D4278a9283k02867I7647J99888g6528E0748p328J23995
17792A67415H0824H961c79904i2812B4847b40644A54478o3784C0568a93029C318
17780b9713p1313n0035e8074A84001c60192a72054a1041j05482a9562j7617a5137
17768B96253A04465b66784D1603d6140l54836C9121e4284E9606a81165A95308
17757a10219A16236D3248a09291l74488H9832g6181C8011g1462L0442G4701K4820
17746I9521R5084b12327R2300B5028K8553Q4505c8390I8507l5866c0825B25634
$$ plain form
17734 -18266 -217018 186619 132923 22599 -220459 65114 -15138 -252547 126243 -161146
17723 161475 -225276 71197 -161528 171286 44189 -75063 76221 -117703 -470607 378169
17712 198742 -121560 240607 8206 120338 -163491 -273684 -121873 -5826 404768 295186
17702 295186 14802 75716 -102055 -253749 -49180 -273284 -113641 -60222 95430 -150900
17691 87754 87961 -95527 167390 -145775 -137468 105670 -229291 85186 -202415 -124985 355577
17679 154907 -206424 -118862 127078 131441 29986 90286 26529 18917 -164644 -16057 -198206
17668 -198206 -56603 284253 -187326 72046 -148738 -203448 -310944 -181013 -108798 -136015
17658 -136015 -257089 52565 230381 91602 163600 34360 -134573 182845 -93981 395765
$$ packed form
17734a8266j98752A86619n3696B2599b20459F5114a5138k37409A26243a61146
17723A61475b25276G1197a61528A71286D4189g5063G6221a17703l52904C78169
17712A98742a21560B40607H206J12132a63491j10193a21873e826D04768j09582
17702B95186A4802O0914a02055j51694d9180k24104a13641N3419I5430a50900
17691H7754K07i5527A67390a45775Q307A05670b29291H5186b02415P7430C55577
17679A54907b06424Q7562A27078M363B9986O0300B6529p612a64644a6057j82149
17668a98206e6603B84253a87326G2046a48738n4710j07496J29931P2215k7217
17658a36015j21074E2565J77816I1602P1998C4360a34573A82845i3981C95765
$$ plain form
17647 19031 126155 -113813 176155 -127267 -51384 116937 29515 49882 -267607 237977
17636 123091 69094 103667 -65389 285177 273058 -225345 13368 -181128 156953 -255565
17625 144454 136168 -31842 -226808 -26010 -176149 45000 -48685 -140121 -200611 105140 148392
17614 148392 -58969 -148012 39577 -97827 156979 40406 7434 -176563 74509 136557 -53691
17602 -7730 -150491 -278173 80275 20362 -92289 72896 -99734 121268 -90406 -205700 248489
17590 196706 -22250 -341520 129887 -123757 137472 -75384 243669 -182061 -61708 251301
17579 -4877 -119498 193728 -111109 87673 65511 82978 103302 -12580 185133 46304 221219
17568 221219 -422432 -88259 248163 21064 88120 169947 -143245 -88193 -125383 206789 -120627
$$ packed form
17647A9031J07124a13813A76155a27267e1384A16937B9515K0367b67607B37977
17636A23091n3997L4573f5389B85177j2119b25345A3368a81128A56953b55565
17625A44454q286c1842j94966b6010j50139D5000d8685r1436o0490A05140M3252
17614A48392e8969q9043C9577i7827A56979D0406G434a76563G4509O2048e3691
17602g730j42761j27682H0275B0362i2289G2896i9734A21268i0406j15294B48489
17590A96706b2250l19270A29887a23757A37472g5384B43669a82061f1708B51301
17579d877j14621A93728a11109H7673k2162J7467K0324a2580A85133D6304J74915
17568B21219d22432h8259B48163B1064O7056Q1827a43245N5052l7190B06789a20627
$$ plain form
17556 204529 -164096 135640 -10786 70111 -190777 23906 164116 11216 -5691 134395 129625
17545 129625 371113 67248 -133408 -70049 -88742 142114 255239 -286190 -84053 -182254
17535 -182254 -103963 115821 -5582 -351749 183279 148675 -16324 -210054 -21471 410171 7693
17523 104549 -227768 262226 -56500 156358 -317262 -47517 383848 126689 82891 50273
17513 50273 69471 -88425 51670 72127 601022 94301 -230426 -89953 -34168 -61278 -77396
17502 -77396 242340 156604 55903 -81010 371405 6323 -34609 12780 -22519 256634 333219
17491 333219 -2365 -43897 91645 123659 104684 150697 39811 -82784 69746 205435 97663
17479 130836 200194 237161 152692 333489 232172 167715 6676 -70534 301664 175786 260728
$$ packed form
17556B04529a64096A35640a0786G0111a90777B3906J40210A1216e691A34395m770
17545A29625K41488F7248a33408O3359j8693A42114J13125b86190h4053r8201
17535a82254P8291A15821e582l46167A83279l4604a6324j93730b1471D10171G693
17523A04549b27768B62226e6500A56358c17262d7517C83848A26689m3798l2618
17513E0273J9198h8425E1670K0457N28895I4301b30426h9953c4168k7110j6118
17502g7396B42340q5736E5903h1010C71405F323c4609A2780b2519B56634P6585
17491C33219b365m1532I1645L2014j8975M6013C9811h2784F9746J35689I7663
17479A30836O9358L6967q4469J80797j01317o4457F676g0534C01664j25878Q4942
$$ plain form
17468 260728 41285 55597 160707 -107312 -16881 54531 -16213 262050 162291 -238080 205619
17456 87931 55253 430706 89869 -141547 -264475 42713 144616 252449 130491 130195 437438
17445 437438 -73037 87882 110196 117557 140354 424795 99251 5646 -136665 10850 240512
17434 240512 428284 141099 46323 291628 302912 99333 -197991 147002 202336 220314
17424 220314 -19342 66814 -125707 -128968 127512 86230 214192 -148472 73914 200312 135495
17413 135495 175862 -60771 397103 3776 267616 52717 247798 146925 291548 -237372
17402 324673 -7289 143210 -166963 -50282 198015 -181868 212570 -29600 -30752 330223 232627
17391 232627 109576 315357 53669 102932 346479 379885 -55486 42665 232361 -304548
$$ packed form
17468B60728D1285J4312J05110a07312a6881E4531a6213B62050r9759b38080B05619
17456H7931l2678L75453H9869a41547j22928D2713J01903J07833j21958k96L07243
17445D37438g3037H7882K2314P361K2797K84441I9251E646a36665A0850K29662
17434B40512J87772A41099D6323K45305J1284I9333a97991A47002N5334J7978
17424B20314a9342F6814a25707l261A27512m1282J27962a48472G3914J26398o4817
17413A35495M0367f0771C97103C776K63840E2717J95081j00873J44623b37372
17402C24673g289A43210a66963e0282A98015a81868B12570b9600j152C30223r7596
17391B32627A09576K05781E3669M9263K43547L3406e5486D2665J89696c04548
$$ plain form
17380 -171594 201722 269819 225952 70051 114067 115839 419012 -23026 178551 237830 114318
17368 126697 50801 100920 -85656 -205047 15487 117062 56654 177403 -6924 -33332 -18608
17357 -18608 384025 155788 326243 132318 208133 -166 -14646 -18648 -44645 158768 225546
17346 225546 311716 177978 -39901 290244 317931 128624 -16901 -32240 214753 -16496 281339
17334 170805 140243 185636 308890 360864 199379 198394 242135 -77659 244916 27556 166084
17323 166084 307225 -177018 106185 -184650 54605 406262 169155 -16908 236257 168770
17313 168770 220856 268307 64631 250062 62557 78730 11270 -25084 -181530 32419 109152
17302 109152 -32093 13220 315224 324474 -70361 41276 -130115 107185 -62646 29048 -148952
$$ packed form
17380a71594B01722O8097m3867G0051M4016J772L03173b3026A78551N9279A14318
17368A26697E0801N0119h5656j19391A5487J01575E6654J20749f924k6408J4724
17357a8608C84025A55788J70455A32318P5815a66j4480m002k5997A58768O6778
17346B25546Q6170j33738c9901B90244K7687A28624a6901j5339B14753a6496B81339
17334A70805l0562M5393J23254N1974j61485r85M3741g7659B44916B7556J38528
17323A66084J41141a77018A06185a84650E4605L51657A69155a6908B36257o7487
17313A68770N2086M7451F4631J85431F2557J6173A1270b5084j56446C2419P6733
17302A09152c2093A3220L02004R250g0361D1276a30115A07185f2646B9048a48952
$$ plain form
17290 228996 242174 11638 -45185 213320 113124 235017 73794 -76165 31795 238764 233041
17279 233041 85907 351408 206981 -156981 312896 606390 37787 120935 79524 86604 242838
17268 242838 -35141 204356 98935 -91289 58527 187251 247336 117371 -178988 -85248 -33687
17256 -7111 329761 249870 51451 279381 268408 34580 350951 -245907 18931 203655 -45239
17244 -105695 280611 219522 357886 -57339 334311 220002 123082 250730 12626 297751
17234 297751 -108424 -20923 414990 289554 81251 -229270 -183127 157604 261083 254437
17224 254437 357600 -62740 -4711 3196 242093 -49840 137061 190888 -183681 -144803 294523
17212 -81130 -26172 -211682 122592 -21504 228996 98187 158985 215725 333737 82794 333928
$$ packed form
17290B28996J3178A1638d5185B13320j00196J21893G3794g6165C1795K06969n723
17279B33041H5907K65501j44427a56981C12896K93494C7787Q3148m1411P080J56234
17268B42838c5141B04356I8935i1289E8527J28724O0085A17371a78988h5248c3687
17256g111C29761p9891E1451K27930j0973C4580L16371b45907A8931J84724d5239
17244a05695B80611o1089J38364e7339C34311j14309r6920J27648A2626K85125
17234B97751a08424b0923D14990j25436H1251b29270M6143A57604J03479o646
17224B54437J03163f2740d711C196K38897d9840A37061N3827a83681L8878B94523
17212h1130b6172j85510A22592b1504B28996I8187O0798N6740J18012H2794K51134
$$ plain form
17201 333928 -156076 -32223 -27158 156064 84768 82097 102573 -135796 226406 256898 347249
17190 347249 256631 440435 341527 221649 409612 195232 234871 -11457 -85278 62049 224531
17179 224531 278240 -151316 225072 114320 87771 214679 57289 62164 130563 475942 29323
17167 294573 480607 -8614 265384 438934 325740 207872 457402 60432 679489 359992
17157 359992 84620 142864 107087 340740 481782 11293 89744 439823 401200 -75204 364684
17145 -70255 -43572 -16708 196253 165022 278438 427966 89013 -108975 339294 362716 300514
17134 300514 -86443 205933 385596 350579 560973 220880 601502 -19425 202390 188513
17124 188513 237788 461058 236704 228256 460476 158110 418382 179893 512636 196207
$$ packed form
17201C33928a56076c2223N065A56064p1296k671K0476a35796B26406L0492R0351
17190C47249r0618J83804r8908j19878J87963A95232L9639a1457p3821F2049J62482
17179B24531N3709a51316B25072j10752k6549J26908E7289M875O8399L45379B9323
17167B94573J86034h614B65384J73550j13194j17868K49530F0432O19057l19497
17157C59992H4620N8244l5777K33653J41042A1293P8451L50079l8623g5204C64684
17145g0255K6683a6708A96253l1231J13416J49528H9013a08975C39294K3422o2202
17134C00514h6443B05933J79663l5017K10394B20880L80622a9425B02390j3877
17124A88513M9275K23270k24354q448K32220A58110K60272A79893L32743A96207
$$ plain form
17113 489733 150533 210147 363307 297708 175434 47410 126268 480020 -51082 511844
17102 113902 146689 167814 149419 364806 197849 426179 116155 173098 376123 269476
17092 269476 437898 220338 72161 264363 344795 258504 395081 148170 668044 493639
17082 493639 196180 152587 452975 96523 180413 304623 60921 183932 191276 369695 374938
17071 374938 17286 236770 449173 401434 94758 521122 538613 221491 376323 -52128
17060 649185 414653 -33737 257169 352601 257008 237455 438082 131378 314976 564811
17050 564811 426300 190508 422901 469956 86373 191920 128259 512878 483895 490492 369650
17039 369650 291198 462547 685257 458360 749972 225565 322251 188269 655338 855956
$$ packed form
17113D89733A50533N9614J53160o5599j22274D7410P8858L53752e1082E11844
17102A13902L2787K1125j8395K15387j66957K28330A16155N6943K03025j06647
17092B69476J68422k17560G2161J92202Q0432q6291J36577A48170N19874j74405
17082D93639A96180m3593L00388I6523Q3890J24210F0921J23011P344J78419N243
17071C74938A7286K19484K12403m7739I4758M26364J7491B21491J54832e2128
17060F49185k34532c3737B57169R5432r5593j9553K00627A31378J83598K49835
17050E64811j38511A90508K32393M7055H6373J05547o3661L84619k8983O597j20842
17039C69650p8452J71349K22710k26897K91612B25565R6686j33982M67069K00618
$$ plain form
17029 855956 386012 394942 408840 439364 346046 561636 522865 510102 685256 346096 590246
17018 590246 378492 599413 567728 432956 284291 319284 497371 85360 549328 481471
17008 481471 409665 354644 451126 473579 250254 617205 624359 970695 358513 374898 723138
16997 723138 684439 396459 849307 564246 258878 585565 312927 416401 494981 561354
16987 561354 437479 381829 706707 571190 294689 551363 502405 528120 678158 674991
16977 674991 460033 841357 628367 1005978 393017 754326 433022 608078 683281 493540
16967 493540 573534 548574 491232 829216 469230 436387 760072 497034 619330 286392
16956 593061 972343 484453 449808 833814 972754 699204 850381 608556 789914 865616
$$ packed form
17029H55956C86012Q930J3898L0524r3318K15590l8771j2763J75154l39160K44150
17018E90246k11754K20921l1685j34772j48665L4993J78087H5360M63968o7857
17008D81471p1806n5021R6482K2453k23325L66951P154L46336C58513J6385L48240
16997G23138l8699k87980M52848k85061B58878L26687k72638J03474P8580O6373
16987E61354j23875n5650L24878j35517k76501K56674m8958K5715J50038l167
16977F74991k14958L81324k12990L77611C93017L61309l21304J75056P5203j89741
16967D93540P9994k4960n7342L37984l59986l2843L23685k63038J22296B86392
16956E93061L79282D84453l4645L84006J38940k73550J51177k41825J81358P5702
$$ plain form
16946 865616 705330 684931 714208 1043475 509614 824761 857802 733406 1077452 714824
16936 714824 1050972 862217 782655 887615 1112197 960865 750512 1272885 759733 985553
16926 985553 745459 882426 894818 879769 985846 974838 1032077 1498468 1308835 745683
16916 745683 953672 1052577 934501 1205327 1400243 1270433 1147297 1202209 1120369 1329951
16906 1329951 1307385 1173036 1181359 1181566 1476683 1094455 1226562 1430091 1347304 1734585 1270098
16895 1270098 1410662 1342756 1352350 1439705 1249538 1496173 1597996 1773078 1747505 1720128
16885 1720128 1579489 1599331 1490243 1436037 1419320 1783036 1215118 1588365 1843085 1762421
16875 1762421 1686137 1499632 1930317 1699601 1938094 1776698 1968826 1867944 1864824 1716279
$$ packed form
16946H65616j60286k0399K9277L29267E09614L15147L3041j24396L44046l62628
16936G14824L36148j88755p9562J04960K24582j51332k10353N22373n13152K25820
16926I85553k40094J36967J2392j5049J06077j1008N7239M66391j89633n63152
16916G45683K07989R8905j18076K70826J94916j29810j23136N4912q1840K09582
16906A329951k2566j34349Q323K07K95117l82228J32107K03529q2787L87281m64487
16895A270098J40564o7906R594Q7355j90167K46635J01823J75082k5573k7377
16885A720128j40639J9842j09088n4206j6717L63716n67918L73247K54720q0664
16875A762421p6284j86505M30685k30716K38493j61396J92128j00882l120j48545
$$ plain form
16865 1716279 1963607 1504013 2074987 2088987 2386162 2223665 2137904 2296516 2163900 2127177
16855 2127177 2324735 2433273 2362328 2272256 2177962 2535362 2429408 2411710 2671530 2258986
16845 2258986 2865732 3004390 2910868 2537822 2548175 2790345 2948528 2970965 3050993 2939604
16835 2939604 2940992 3118038 3435840 3690560 3350908 3737827 3700202 3510894 3872223 3532339
16825 3532339 3505008 3829446 3836230 3988749 4209701 4123962 4077548 4353648 4367547 4547914
16815 4547914 4752885 4774425 4469829 4795186 5187607 4991988 5223756 5427158 5305611 5823413
16805 5823413 5429784 5605575 5971253 6006981 5928703 6182513 6395208 6734007 6548959 6952899
16795 6952899 6961582 7590260 8020531 7599046 7659713 8330311 8747710 8513410 8820731 8940888
$$ packed form
16865A716279K47328m59594N70974J4000K97175j62497q5761J58612j32616l6723
16855B127177J97558J08538p0945r0072r4294L57400j05954j7698K59820m12544
16845B258986O06746J38658r3522l73046J0353K42170J58183K2437Q0028j11389
16835B939604J388J77046L17802K54720l39652L86919l7625j89308L61329l39884
16825C532339k7331L24438O784J52519K20952q5739m6414K76100J3899J80367
16815D547914K04971K1540l04596L25357L92421j95619K31768K03402j21547N17802
16805E823413l93629J75791L65678L5728p8278K53810K12695L38799j85048M03940
16795F952899Q683O28678M30271m21485O0667O70598M17399k34300L07321J20157
$$ plain form
16785 8940888 9311511 9826515 9872523 9880286 10363610 10876506 11053064 11392052 11649062 12292558
16775 12292558 12542662 12961944 13385464 13904784 14462829 14888187 15642976 16280241 16721263
16766 16721263 17346867 18063369 19027579 19390284 20238376 21173395 21999562 22914190 23982493
16757 23982493 24784605 25757110 27404958 28575358 29821391 31336349 33402742 34561558
16749 34561558 36069649 38395454 40210949 42597331 44613347 48013433 50178510 53037040
16741 53037040 56510229 60065236 63567075 67559461 72258580 76743348 81889255 87238884
16733 87238884 92496185 98809121 105306605 111831158 119214548 126627634 134052570 141695890
16725 141695890 149356172 157004421 163689228 170083641 175418163 180125587 182955818 185104970
$$ packed form
16785H940888L70623N15004M6008P763M83324N12896J76558L38988K57010O43496
16775A2292558K50104M19282M23520N19320N58045M25358P54789O37265M41022
16766A6721263O25604P16502R64210L62705Q48092R35019Q26167R14628J068303
16757B3982493Q02112R72505J647848J170400J246033J514958K066393J158816
16749C4561558J508091K325805J815495K386382K016016L400086K165077K858530
16741E3037040L473189L555007L501839L992386M699119M484768N145907N349629
16733H7238884N257301O312936O497484O524553P383390P413086P424936P643320
16725A41695890P660282P648249O684807O394413N334522M707424K830231K149152
$$ plain form
16717 185104970 185602228 184684847 182436729 178530018 173730441 167826866 161499765 154219363
16709 154219363 146592412 138974619 130977493 123519791 116100342 109139963 102497180 95999359
16701 95999359 89999014 84336733 78988562 74422563 69661553 65547269 61420935 57657381
16693 57657381 54478824 51277469 48515328 45745746 43212460 40982824 39047676 37191863
16685 37191863 35019355 32895941 31679969 30219249 28636650 27557693 26467272 24777084
16677 24777084 23664086 22806034 21927781 20907126 20049592 19114438 18735534 18145070 17270959
16668 17270959 16352339 16005016 15407520 15064936 14180842 13936623 13267670 12798525 12522392
16659 12522392 12526989 11550358 10984325 11006633 10545953 10513768 10280329 9766616 9605822 8866873
$$ packed form
16717A85104970M97258r17381k248118l906711m799577n903575o327101p280402
16709A54219363p626951p617793p997126p457702p419449o960379o642783o497821
16701I5999359o000345n662281n348171m565999m761010m114284m126334l763554
16693E7657381l178557l201355k762141k769582k533286k229636j935148j855813
16685C7191863k172508k123414j215972j460720j582599j078957j090421j690188
16677B4777084j112998q58052q78253j020655q57534r35154l78904n90464q74111
16668A7270959r18620l47323n97496l42584q84094k44219o68953m69145k76133
16659A2522392M597r76631n66033K2308m60680l2185k33439n13713j60794p38949
$$ plain form
16649 8866873 8698309 8582821 8145940 8226243 7937733 7469582 7501707 7344974 7098516 6851753
16639 6851753 6948101 6892729 6559600 6224556 6303022 5894242 5721516 5926321 5479391 5625836
16629 5625836 5424759 5134418 4990859 4803436 5065983 4567231 4742831 4511413 4481417 4695721
16619 4695721 4208941 3853043 4143086 3882667 3959314 3898151 3784833 4029623 3599495 3461301
16609 3461301 3497330 3892739 3581208 3215858 3005466 3192488 3106922 2706204 2710910 2897163
16599 2897163 2930714 2774940 2905804 2919091 2692295 2467025 2622028 2856620 2166345 2569371
16589 2569371 2956022 2300878 2235229 2239702 2455396 2539392 2212765 2218607 2074931 2009356 2271767
16578 2271767 2163492 1879618 1951560 2011352 2144316 1859504 2129424 2107533 1854367 1903446
$$ packed form
16649H866873j68564j15488m36881Q0303k88510m68151L2125j56733k46458k46763
16639F851753R6348n5372l33129l35044P8466m08780j72726K04805m46930J46445
16629E625836k01077k90341j43559j87423K62547m98752J75600k31418k9996K14304
16619D695721m86780l55898K90043k60419P6647o1163j13318K44790m30128j38194
16609C461301L6029L95409l11531l65350k10392J87022q5566m00718M706J86253
16599B897163L3551j55774J30864J3287k26796k25270J55003K34592o90275M03026
16589B569371L86651o55144o5649M473K15694Q3996l26627N842j43676o5575K62411
16578B271767j08275k83874P1942N9792J32964k84812K69920k1891k53166M9079
$$ plain form
16568 1903446 1813191 1789126 1650081 1789234 1617626 1726144 1493540 1532895 1645780 1921931
16558 1921931 1495519 1488795 1307418 1493504 1534249 1258782 1468596 1264935 1601801 1331181
16548 1331181 1379944 1206729 1388343 1587888 1199191 1435845 1093212 1023617 1278413 933947
16538 933947 1397263 1098259 961177 1012349 1375002 900447 1182816 1132970 930480 1226364
16528 1226364 1106542 1064679 929525 909978 1184367 853568 1319686 936957 1049174 856220
16518 856220 851770 1056023 844941 1089624 751476 1058738 809535 589803 914898 714665
16508 714665 769183 987699 944471 844916 568931 1019554 935460 792905 772939 664252
16498 664252 891500 742164 897691 670474 556788 824580 861302 703663 613814 602600
$$ packed form
16568A903446r0255k4065j39045J39153j71608J08518k32604L9355J12885K76151
16558A921931m26412o724j81377J86086M0745k75467K09814k03661L36866k70620
16548A331181M8763j73215J81614J99545l88697K36654l42633o9595K54796l44466
16538I33947M63316k99004j37082N1172L62653m74555K82369m9846k02490K95884
16528A226364j19822m1863j35154j9547K74389l30799M66118l82729J12217j92954
16518H56220m450K04253k11082K44683l38148L07262k49203k19732L25095k00233
16508G14665N4518K18516m3228r9555k75985M50623q4094j42555j9966j08687
16498F64252K27248j49336J55527k27217j13686K67792L6722j57639q9849j1214
$$ plain form
16488 602600 755673 841118 975504 799767 800898 872884 426668 668338 627715 742021
16478 742021 600943 724347 581754 992689 880019 333732 569643 392491 766510 611977
16468 611977 804433 598312 345564 322275 221462 366222 646027 573851 429823 413672
16458 413672 789971 739962 760244 806772 395089 616968 407388 599922 383353 842113
16448 842113 553625 547011 541370 326256 549847 377336 602539 584754 410658 455373 510759
16437 510759 362615 579293 612793 464763 392143 614434 378336 275774 680924 403282
16427 403282 240120 429383 691478 598208 285828 291423 732587 503656 372989 494912
16417 494912 570069 530277 716237 574958 288507 268580 647474 262848 326035 643306
$$ packed form
16488F02600J53073Q5445J34386j75737J131P1986D26668K41670m0623J14306
16478G42021j41078J23404j42593M10935j12670C33732K35911j77152L74019j54533
16468F11977J92456k06121k52748k3289j00813J44760K79805p2176j44028j6151
16458D13672L76299n0009K0282M6528C95089K21879k09580J92534k16569M58760
16448H42113k88488o614n641k15114K23591j72511K25203j7785j74096M4715N5386
16437E10759j48144K16678L3500j48030p2620K22291k36098j02562M05150k77642
16427D03282j63162J89263K62095r3270B85828N595M41164k28931j30667J21923
16417D94912P5157l9792J85960j41279k86451j9927L78894B62848O3187L17271
$$ plain form
16407 643306 266705 503397 31301 -24763 147264 620146 441601 204679 586163 638403
16397 638403 376870 419117 508689 383372 55857 372833 175575 257875 293475 333068 462488
16386 462488 295328 227766 336877 319755 344018 346308 445274 528517 554432 190995 362596
16375 362596 455476 680711 558953 206950 321459 30884 264513 269290 488535 359785
16365 359785 249910 137679 411282 99893 151427 73633 182813 281206 -115150 78882
16354 269258 236358 387222 491403 271671 319511 -29208 160442 460938 428876 -325527
16343 190233 298721 121475 486905 278934 444493 484280 170549 526918 496723 125947
16332 185144 196994 166672 34664 185950 325289 94311 -3743 198257 246622 293439 243800
$$ packed form
16407F43306B66705K36692C1301b4763A47264M72882j78545B04679L81484N2240
16397F38403k61533M2247Q9572j25317E5857L16976A75575Q2300L5600L9593J29420
16386D62488j67160o7562J09111j7122K4263K290R8966Q3243K5915A90995J71601
16375C62596R2880K25235j21758B06950J14509C0884K33629M777K19245j28750
16365C59785j09875j12231K73603I9893N1534G3633J09180R8393a15150G8882
16354B69258l2900J50864J04181k19732M7840b9208A60442L00496l2062c25527
16343A90233J08488A21475L65430k07971J65559L9787A70549L56369l0195A25947
16332A85144J1850l0322C4664J51286J39339I4311c743A98257M8365M6817m9639
$$ plain form
16321 243800 38080 266769 193036 410327 462096 127045 1476 293075 141346 -128508
16310 212092 107114 -76205 360632 197996 430849 30059 339217 39688 202270 494461
16300 494461 45502 279538 157515 189934 -370225 -72097 164117 67056 180360 154588
16290 154588 -193324 50597 257386 470498 75888 372251 87825 -84351 135193 199460
16280 199460 166108 251767 323237 96675 107249 421905 120812 397643 296911 -67431 272621
16268 216990 120709 223175 47021 525577 -133231 10214 395967 6409 166315 228242 243156
16257 243156 156159 130010 282395 267128 214816 104450 253522 75212 89075 136218 206978
16246 206978 48807 277874 176306 70790 10198 314255 410540 183571 -51268 117102
$$ packed form
16321B43800C8080K28689p3733K17291N1769A27045A476K91599A41346a28508
16310B12092j04978g6205C60632j62636K32853C0059L09158C9688J62582K92191
16300D94461D5502K34036j22023L2419c70225g2097A64117F7056J13304k5772
16290A54588a93324E0597K06789K13112G5888K96363H7825h4351A35193O4267
16280A99460l3352Q5659P1470I6675J0574L14656A20812K76831j00732f7431B72621
16268B16990r6281J02466D7021M78556a33231A0214L85753F409J59906O1927J4914
16257B43156q6997k6149J52385j5267n2312A04450J49072G5212J3863M7143P0760
16246B06978D8807K29067j01568G0790A0198L04057R6285A83571e1268A17102
$$ plain form
16235 141738 225577 177247 221721 236635 308953 220548 -99911 58430 255479 -5999 248734
16223 201303 237691 280350 93758 411981 141445 150114 -107489 -144908 26563 339817 230469
16212 230469 32525 268539 76239 204009 274470 228056 214910 270833 397428 285048 -67677
16200 338283 273305 132218 238769 -71613 124396 210904 111713 175555 443705 185777
16189 -20505 296119 185810 -68445 235889 231884 281644 -49529 333669 -227848 295203 29710
16177 -200760 123796 335834 466240 -173461 427244 176167 60218 -300357 -4801 -305474
16167 -305474 144546 -12022 127834 299867 9420 52039 -1126 270456 142621 -25998 16172
16155 -164701 -129922 77111 -111977 42603 -108470 -34269 -196614 73780 -89201 260661 -8714
$$ packed form
16235A41738Q3839m8330M4474J4914P2318q8405i9911E8430J97049e999B48734
16223B01303L6388M2659I3758L18223A41445Q669a07489l7419B6563L13254j09348
16212B30469C2525K36014G6239J27770P0461m6414j3146N5923J26595j12380f7677
16200C38283o4978A32218J06551g1613A24396Q6508r9191O3842K68150A85777
16189b0505B96119j10309f8445B35889m005M9760d9529C33669b27848B95203B9710
16177b00760A23796K12038J30406a73461D27244A76167F0218c00357d801l00673
16167c05474A44546a2022A27834J72033I420M2619a126B70456j27835b5998A6172
16155a64701L4779G7111a11977D2603a08470c4269j62345G3780h9201B60661h714
$$ plain form
16143 -85350 19291 -271526 267075 134041 43114 132634 115065 -162721 -3584 196901 -33596
16131 236152 155916 165330 16245 -115577 -112623 -88174 414357 -173776 -56035 192796 56888
16119 97181 -44610 177585 17352 -171796 159309 -46514 297654 52113 338978 -133731
16108 -314156 7155 469446 -93033 286014 79137 218884 118884 100789 60318 429285 303219
16097 303219 268982 -352978 104898 137737 -205296 -39992 133929 184683 213757 -122760
16086 142087 114837 -320037 -233938 -24285 -265095 -21878 -243008 -178849 -33910 -135176 82002
16074 120015 178286 180546 106390 182650 42117 -2896 -110817 -50231 37127 75902 -108409
16062 -24064 -234627 -41925 -26109 -135650 323013 449086 -133589 153184 64238 -40882
$$ packed form
16143h5350A9291b71526B67075j33034D3114Q9520j7569a62721c584A96901c3596
16131B36152q0236R414A6245a15577K954K4449D14357a73776e6035A92796E6888
16119I7181d4610A77585A7352a71796A59309d6514B97654E2113K86865a33731
16108c14156G155M62291i3033B86014G9137J39747j00000j8095m0471L68967j26066
16097C03219l4237c52978A04898L2839b05296c9992A33929N0754K9074a22760
16086A42087k7250c20037Q6099b4285k40810b1878k21130O4159c3910j01266H2002
16074A20015N8271K260p4156P6260D2117b896j07921e0231C7127L8775a08409
16062b4064k10563d1925J5816j09541C23013J26073a33589A53184F4238d0882
$$ plain form
16051 -376526 -11748 -101526 -86006 -22141 -98478 -45123 317314 122191 188327 -265345 86749
16039 -90391 -132144 181910 39687 -330972 -385813 -90630 17663 102542 162293 -165426 21313
16027 -105232 -155393 -204485 -286138 -417365 479484 -63579 -7665 -17682 -79687 -73442 -413445
16016 -413445 80164 -66440 -291773 -141088 11736 -221378 330619 14962 -61965 -168076
16006 -168076 -128744 -161136 -147661 -67667 91666 333830 -183579 3339 193511 -384052 -44901
15994 24547 -145920 -17545 -63177 164466 -32882 -448768 -163535 112148 -209149 -11176
15983 23637 258884 88551 338566 139344 189759 71400 -313801 138572 -201905 -278868
15973 -278868 99769 -216148 44911 52766 -132325 -248856 -24859 165964 -26053 150638 -236937
$$ packed form
16051c76526a1748q9778J5520b2141p6337d5123C17314A22191O6136b65345H6749
16039i0391m1753A81910C9687c30972n4841i0630A7663Q4879N9751a65426B1313
16027a05232n0161m9092q1653j31227D79484f3579g665j0017o2005O245l40003
16016d13445H0164f6440k25333a41088A1736b21378C30619A4962f1965j06111
16006a68076L9332l2392J3475f7667I1666K42164a83579C339J90172c84052d4901
15994B4547a45920a7545m5632A64466c2882m15886a63535A12148b09149a1176
15983B3637K35247H8551K50015A39344N0415G1400c13801A38572b01905p6963
15973b78868I9769b16148D4911P855a32325j16531b4859A65964b6053A50638b36937
$$ plain form
15961 -182929 118202 163036 -243018 153685 301877 -340136 -325811 -106814 -232797 46123
15950 -38441 74331 -24960 44768 60607 -98194 -582 -8254 -11268 -50742 -232981 -14796 -73162
15938 -73162 -135013 -103322 16904 -192838 100863 73025 -132238 166281 -263510 51257 11166
15926 318862 32815 76653 -9185 -433672 137378 119370 64545 488069 84275 23032 -118855
15914 -103873 -182311 145306 -294502 -151127 288757 213414 105082 -412037 -160146 -124136
15904 -124136 75991 104753 -56549 -57534 -95481 -171083 -44342 -29415 -22310 -70335 -17993 62725
15891 216505 385442 -95924 -197398 161436 -86878 -50549 -62467 84066 322383 72963 -59750
15879 251092 50450 -46977 -11065 25623 302952 -196737 -195727 5144 -42996 -241588 -116437
$$ packed form
15961a82929A18202M4834b43018A53685J48192c40136J4325a06814j25983D6123
15950c8441G4331b4960D4768J5839i8194e82p672l014l9474j82239a4796n8366
15938g3162o1851L1691A6904a92838A00863k7838a32238A66281b63510E1257A1166
15926C18862C2815M3838i185m24487A37378j8008n4825M23524H4275B3032a18855
15914a03873p8438A45306b94502J43375B88757p5343A05082d12037a60146L6010
15904a24136G5991K8762e6549r85l7947p5602d4342J4927P105m8025a7993F2725
15891B16505J68937i5924j01474A61436h6878L6329j1918H4066K38317G2963e9750
15879B51092E0450d6977a1065B5623K77329a96737J010E144d2996j98592a16437
$$ plain form
15867 -188589 133472 64752 -182970 -443466 170966 -153734 -113755 -127619 70408 -61085
15856 -265003 15716 -163500 28079 274914 176915 97025 -22583 -484469 -382256 281210
15845 -344674 -190579 1198 208878 -16208 -119668 -99817 -112240 -250370 229364 -135845
15834 -62308 97272 -51663 -10028 29342 -970 -259231 146400 26722 -112622 166663 -205672
15822 -244163 -195249 -91324 -400357 18829 141171 57291 -22380 195258 -282984 -116106
15811 -32288 73604 167205 14691 163911 230900 -136979 258427 180770 -8418 -259347 -18575
15799 41105 -112164 -249116 -151212 -88073 103573 177258 18180 179125 300239 12543 142714
15788 142714 -43128 -97539 13976 125249 -248016 -165798 -134336 127111 219601 -145831 -127668
$$ packed form
15867a88589A33472F4752a82970k60496A70966a53734L9979j3864G0408f1085
15856b65003A5716a63500B8079K46835r7999p9890b2583m61886J02213B81210
15845c44674J54095A198K07680a6208j03460J9851j2423j38130B29364a35845
15834f2308I7272e1663a0028B9342i70k58261A46400B6722a12622A66663b05672
15822b44163M8914i1324l09033A8829J22342E7291b2380A95258b82984a16106
15811c2288G3604R3601A4691J49220O6989a36979B58427p7657h418k50929a8575
15799D1105a12164j36952R7904O3139A03573P3685A8180J60945J21114A2543J30171
15788A42714d3128n4411A3976J11273b48016Q2218L1462A27111R2490a45831J8163
$$ plain form
15777 -127668 -33793 -166146 -91788 -147884 -412115 40979 -204945 -183259 75561 -43104 -116188
15766 -116188 -3047 136377 140469 228319 -46094 140230 2124 103318 -268678 60041 -89515
15754 350248 41680 130644 -335103 -69480 -188661 -65574 211877 -92735 130569 182991 251612
15743 251612 -187465 -417082 -123045 -397010 -65398 9881 -172825 -160544 108565 45576
15732 133601 -300546 -200601 -218499 -178973 -85824 -48510 -38952 -216508 -243087 27557 -420409
15720 -230443 -351764 -176042 78398 -231490 47381 -166385 -204397 -170546 93736 -35588 -31097
15709 -31097 67716 -162841 77119 138921 76497 131130 -123025 -159830 -132686 -283858 -125207
15697 -151218 -149332 -80375 -422234 -46048 -203596 105203 120946 -132573 41363 45338 48872
$$ packed form
15777a27668c3793j32353P4358n6096k64231D0979b04945K1686G5561d3104p3084
15766a16188c047A36377M092Q7850d6094A40230B124J01194b68678F0041h9515
15754C50248D1680Q8964c35103f9480j19181f5574B11877i2735A30569N2422O8621
15743B51612a87465k29617a23045k73965f5398I881a72825J2281A08565D5576
15732A33601c00546R9945j7898L9526h5824L7314R558j77556k6579B7557d20409
15720b30443j21321J75722G8398b31490D7381a66385l8012L3851I3736c5588M491
15709c1097F7716a62841G7119O1802o2424N4633a23025l6805K7144j51172a25207
15697a51218J886O8957l41859d6048j57548A05203J5743a32573D1363L975L534
$$ plain form
15686 48872 11594 -199826 -81269 -65007 -231880 -292175 -134595 -325148 -217028 19373 -235548
15674 210938 -199333 -75813 148863 -53605 145315 -142225 -7082 -241901 78555 -36706 -305424
15663 -305424 79413 322109 189686 208707 -47593 -87821 106778 32327 -137821 -157055 -62443
15651 -107361 -173361 -142637 29199 -7270 -171591 -63320 344334 -45940 -302568 305730 -378428
15639 -64992 77107 -212878 121268 -224973 -117800 258553 -222026 85225 -261442 87814
15628 -113730 308901 48727 162355 -158711 36730 31772 -9969 168490 -189137 204779 -203067
15616 -146299 -28408 -188093 8797 -243243 -78991 -238616 -36516 -55984 -324939 -82150 126908
15604 -238612 -95088 -160468 -1239 12850 -251236 -144124 -93195 -108724 -48580 -88262 72851
$$ packed form
15686D8872A1594a99826h1269J6262j66873o0295a34595j90553J08120A9373b35548
15674B10938a99333g5813A48863e3605A45315a42225g082k34819G8555c6706k68718
15663c05424G9413K42696j32423J9021d7593m0228A06778C2327a37821j9234f2443
15651a07361o6000L0724B9199g270j64321f3320C44334d5940k56628C05730c78428
15639f4992G7107b12878A21268b24973J07173B58553b22026H5225b61442H7814
15628a13730C08901D8727J13628a58711C6730m958i969A68490a89137B04779b03067
15616a46299b8408j59685H797b43243g8991j59625c6516j9468k68955h2150A26908
15604b38612i5088o5380a239A2850b51236J07112N0929j5529d8580l9682G2851
$$ plain form
15592 -234999 13005 -110027 46574 165889 -268390 -191908 290855 60765 215917 128027
15582 128027 -178077 -48406 89824 110307 -299040 -57231 -248960 103737 -309038 -26588
15571 161053 312914 104216 -67812 35574 384545 -252207 120223 101172 -397567 123789
15560 -39356 -194259 230419 228587 -164412 83746 84134 73759 -110716 36694 306608 -302253
15548 22119 -55805 245925 -306034 -24331 138572 -165577 46228 182327 -417995 105694
15537 41650 -132453 150055 -206799 -55650 -130805 -97048 -22659 29328 59499 -309609 63033
15525 -130638 65207 -198568 -110002 -137244 -501660 240974 66388 64553 -148355 130992 80721
15514 80721 -45701 -323185 -153555 -141600 83426 185107 140681 -319883 321709 -307616
$$ packed form
15592b34999A3005a10027D6574J19315b68390P6482B90855F0765J55152q7890
15582A28027a78077d8406H9824K0483b99040e7231j91729A03737c09038b6588
15571A61053J51861A04216f7812C5574L48971b52207A20223j9051c97567A23789
15560c9356j54903B30419j832a64412H3746L88j0375a10716C6694K69914c02253
15548B2119e5805B45925c06034b4331A38572a65577D6228J36099d17995A05694
15537D1650a32453A50055b06799e5650p5155L3757b2659B9328L0171c09609F3033
15525a30638F5207a98568Q8566k7242l64416B40974F6388j835a48355A30992n0271
15514H0721d5701k77484a53555J1955H3426J01681m4426c19883C21709c07616
$$ plain form
15503 -313922 135897 408549 -370268 -37311 -135559 -84160 149492 -17930 -141714 97363
15492 -51607 -59113 -157004 -303523 154882 -343552 -218220 92156 -3196 2588 -129208 -200497
15481 -200497 200817 -149189 226963 61830 6462 153520 18792 -15248 -119612 -293839
15471 -293839 263805 216237 234565 106820 52242 97731 -28761 29022 -76626 24883 -74465
15459 129264 180184 47334 27226 -129193 229130 145158 240422 135731 -47051 64099 -66908
15447 295865 98747 -36587 82409 63083 14233 273963 -33670 -160509 -376969 -125484 -5553
15435 54058 -137148 -39392 -153525 -262016 -149349 -89686 190984 19604 48553 -178963
15424 -13571 115401 -120362 -117606 -110700 -76167 149878 -99534 -1838 -259526 162995 17593
$$ packed form
15503c13922A35897K72652c70268c7311r8248N1399A49492a7930j23784I7363
15492e1607p506r7891j46519A54882c43552J25332I2156c196B588a29208p1289
15481b00497B00817a49189B26963F1830F462J47058A8792a5248j04364j74227
15471b93839B63805m7568J8328A06820E2242M5489b8761B9022g6626B4883g4465
15459A29264N0920D7334k0108a29193B29130q3972R5264j04691d7051F4099f6908
15447B95865I8747c6587H2409j9326A4233K59730c3670j26839k16460a25484e553
15435E4058a37148c9392j14133j08491J12667N9663A90984A9604K8949a78963
15424a3571A15401a20362K756O906L4533A49878i9534a838k57688A62995A7593
$$ plain form
15412 -279280 -502076 -115600 -217885 -13382 206578 -44240 137410 176775 38160 -259743
15401 68390 -51831 75000 -201622 83375 -246777 -318760 137177 -82706 127962 -34603 39383
15389 334408 -92910 -325291 -13110 -8358 -19732 182831 -165524 138101 161457 329998 -322718
15377 225889 323014 -27240 266141 -9598 -78749 -295694 96849 -93818 -48795 86527 45195
15366 45195 156993 -257326 -283897 -149825 -142324 104327 27199 -197583 -83335 172150 -115593
15354 -157770 -45633 -189118 25688 63000 -57979 163029 -894 177604 -66909 158348 140344
15343 140344 -114405 103508 -125143 180091 26818 119892 -105765 111553 -407516 31635
15332 178645 -296813 -173653 214066 -58266 3823 312217 272486 -304437 166919 204942
$$ packed form
15412b79280k22796a15600j02285a3382B06578d4240A37410L9365C8160b59743
15401F8390e1831G5000b01622H3375b46777p1983A37177h2706A27962c4603C9383
15389C34408i2910k32381a3110M752j1374A82831a65524A38101K3356J68541c22718
15377B25889R7125b7240B66141i598o9151k16945I6849i3818M5023H6527m1332
15366D5195J11798b57326k6571J34072P501A04327B7199a97583h3335A72150a15593
15354a57770d5633j43485B5688L7312e7979A63029h94A77604f6909A58348j8004
15343A40344a14405A03508a25143A80091B6818R3074a05765A11553d07516C1635
15332A78645b96813J23160B14066e8266C823L08394l9731c04437A66919L8023
$$ plain form
15322 204942 -69596 31910 159140 221483 145445 -130242 -414125 -13928 -246538 22682 -96123
15310 -91453 -82312 245386 36187 189535 135379 63579 38105 -44280 -162155 207883 -30255
15298 -31197 -223928 -79903 33534 -27777 324448 127405 -29898 260338 131062 -181083
15287 -134840 74672 -181335 87395 132509 -222101 136304 107295 245661 9717 -2133 -195227
15276 -195227 -14288 -171526 172040 -96894 97490 387649 -70901 32201 338577 225698
15266 225698 -49865 54688 76670 -129919 -122246 150650 -6008 223362 176253 -197507 269874
15254 263597 401898 -53738 610004 225046 920695 1234664 986545 1460870 752131 331502
15243 -113709 -243329 337487 116080 -63801 -156270 -2125 202990 164565 -274083 3062 457527
$$ packed form
15322B04942f9596C1910J27230O2343p6038a30242k83883a3928k32610B2682i6123
15310i1453R141B45386C6187J53348n4156F3579k5474d4280j17875B07883c0255
15298c1197j92731g9903C3534b7777C24448A27405b9898B60338j29276a81083
15287a34840G4672a81335H7395M5114b22101A36304k9009J38366I717b133j93094
15276a95227a4288j57238A72040i6894I7490K90159g0901C2201L06376j12879
15266B25698d9865E4688K1982a29919P673A50650f008B23362m7109a97507B69874
15254B63597J38301e3738F10004B25046O95649L13969k48119M74325p08739C31502
15243a13709j29620C37487A16080f3801r2469b125B02990l8425b74083C062M54465
$$ plain form
15232 457527 54740 -185830 -305184 -152496 94887 -311960 370779 -161737 361778 199327
15222 199327 66455 440013 -176386 -252780 260276 255275 313586 59600 -18677 -231376 113310
15210 165505 -25769 346561 -57166 166873 342137 117462 90071 -3501 34423 -18722 -143981
15199 -143981 227212 94698 -256267 -428072 250184 53693 70359 -106032 -53234 -73470
15189 -73470 110390 79915 18346 104193 445656 77077 -150386 -75918 -199016 186834 189278
15178 189278 -158050 -7691 301072 211251 349972 21656 162546 87482 -209340 17202 116260
15167 116260 117555 39331 -84628 6766 -226916 -99005 133427 -125227 -104170 25712 -155648
15155 -100365 450309 -256022 206266 95475 80498 122784 -71754 17604 -178701 18076 97777
$$ packed form
15232D57527E4740a85830j19354a52496I4887c11960C70779a61737C61778j62451
15222A99327F6455L73558a76386p6394B60276n001N8311E9600a8677k12699A13310
15210A65505b5769C46561e7166A66873J75264A17462k7391c501C4423a8722j25259
15199a43981B27212I4698b56267j71805B50184E3693J6666a06032N2798k0236
15189g3470A10390l0475A8346Q5847L41463G7077a50386P4468j23098A86834K444
15178A89278a58050g691C01072q9821J38721B1656J40890p5064b09340A7202R9058
15167A16260J295C9331h4628F766b26916i9005A33427a25227K1057B5712a55648
15155a00365D50309b56022B06266I5475j4977M2286g1754A7604a78701A8076P9701
$$ plain form
15144 97777 94400 175132 492913 262402 380604 -80478 207672 -152517 307497 383818 -309371
15132 135672 105353 -13593 307197 229240 112077 117471 -36827 -231599 208634 -328617 -105765
15120 279682 196280 133741 69914 57322 433334 294193 41050 -91423 -98873 -96672 -71128
15109 -71128 -121244 -124755 115864 -167411 -297371 361129 -21457 146070 183573 93480 194144
15098 194144 309770 154852 44823 20200 112523 175561 151039 659 217575 694 -36912 249653
15085 92914 -45192 239573 269982 -92836 159602 223062 -56525 124403 94295 1708 433637
15074 433637 30854 137814 118190 -182474 11092 71557 226065 -286474 265807 131246
15063 246042 85269 -79051 69181 295669 235086 -54478 -127420 42487 389928 82856 28218
$$ packed form
15144I7777l377Q0732L17781k30511J18202h0478B07672a52517C07497P6321c09371
15132A35672l0319a3593C07197p7957A12077N394c6827j94772B08634c28617a05765
15120B79682q3402o2539o3827j2592L76012j39141D1050i1423p450K201K5544
15109g1128n0116l511A15864a67411j29960C61129b1457A46070L7503r0093J00664
15098A94144J15626A54852D4823B0200R2323O3038k4522F59K16916F94c6912B49653
15085I2914d5192B39573L0409i2836A59602O3460e6525A24403l0108A708M31929
15074D33637C0854J06960j9624a82474A1092O0465J54508b86474B65807A31246
15063B46042H5269g9051F9181K26488o0583e4478p2942D2487L47441H2856B8218
$$ plain form
15051 273384 99399 216438 44645 248304 102220 -211617 173184 285472 337803 276075
15041 276075 -117478 225990 397509 -44279 20415 368229 436393 41366 -120594 -26392
15030 164819 5921 95113 -14048 471186 219438 239811 267871 397084 -95620 268978 117181
15018 54928 196934 482728 157526 -197254 508356 156368 33485 -146968 98935 178168
15008 178168 49363 -91898 22804 269970 206309 48320 352988 256887 320228 333491 157919
14996 273479 227752 71512 368822 181951 258514 -79940 243104 317645 -7735 181189 98861
14985 98861 -3327 -227842 244223 389666 90817 74720 -21239 306048 203027 295602 140028
14973 91680 176275 -69842 -116881 260637 23106 185458 154743 283335 319381 300639 182672
$$ packed form
15051B73384I9399J17039D4645K03659A02220b11617A73184J12288N2331o1728
15041B76075a17478B25990J71519d4279B0415L47814O8164D1366a20594b6392
15030A64819E921Q9192a4048D71186B19438K0373K8060J29213i5620B68978A17181
15018E4928J42006K85794A57526a97254E08356A56368C3485a46968I8935P9233
15008A78168D9363i1898B2804K47166o3661D8320L04668r6101O3341J3263A57919
14996B73479m5727G1512K97310A81951P6563g9940B43104P4541g735A81189q2328
14985I8861c327k24515B44223J45443I0817j6097b1239C06048j03021R2575A40028
14973I1680Q4595f9842m7039B60637B3106J62352l0715J28592L6046j8742j17967
$$ plain form
14962 182672 285862 78187 450482 -84935 -52949 178008 33015 280486 189194 -196522
14951 194653 243182 291248 250898 107960 149586 299565 166289 369057 229793 407752
14941 407752 434903 -42286 56697 181217 287589 129152 308655 -150369 188806 183323
14931 183323 142795 261986 93359 208818 194343 110935 67686 113441 230031 346601 111970
14919 311770 692063 64776 200864 -27077 247944 228648 -150975 392047 157527 152412
14909 152412 140479 214921 46551 -148101 100194 251271 156464 342190 155488 355033
14899 355033 235739 203440 442873 114468 270722 128342 86012 174551 513864 257510
14889 257510 212792 232294 305221 11685 322798 327195 351175 256976 249376 310807 255800 255439
$$ packed form
14962A82672J03190G8187L72295h4935L1986A78008C3015K47471r1292a96522
14951A94653M8529M8066m0350A07960M1626J49979j33276K02768j39264J77959
14941D07752K7151d2286E6697J24520J06372A29152J79503a50369A88806n483
14931A83323m0528J19191I3359J15459j4475q3408m3249M5755J16590J16570A11970
14919C11770L80293F4776J36088b7077B47944j9296a50975C92047A57527n115
14909A52412j1933P4442D6551a48101A00194J51077r4807J85726A55488J99545
14899C55033j19294l2299K39433A14468J56254A28342m2330Q8539L39313k56354
14889B57510m4718J9502P2927A1685L11113M397K3980r4199p600O1431n5007l61
$$ plain form
14877 255439 367602 226085 -1836 399769 494264 481425 304108 330936 363357 -71292 275938
14865 275102 218857 319993 438344 254215 45561 585727 327406 356783 326367 53523
14854 588419 330582 614422 189026 383772 506192 69931 148180 306837 157203 234882
14844 234882 551476 264707 420349 282675 505501 290195 284697 351564 378359 152745
14833 189188 388139 403763 265521 403680 208463 423805 200282 296476 417563 235599
14823 235599 517603 238279 542314 250747 632799 118819 419895 325285 423179 514996
14813 514996 637385 528061 257652 494155 36260 503391 615486 465385 349454 346202
14803 346202 307512 235667 446813 473831 453482 519692 522519 417073 246011 173992 354413
$$ packed form
14877B55439J12163j41517a836C99769R4495j2839j77317K6828L2421g1292B75938
14865B75102n6245J01136J18351j84129D5561N40166k58321K9377l0416E3523
14854E88419k57837K83840A89026J94746J22420F9931P8249J58657j49634P7679
14844B34882L16594B64707J55642j37674K22826k15306n498O6867K6795A52745
14833A89188J98951J5624j38242J38159j95217K15342B00282R6194J21087j81964
14823B35599K82004B38279L04035B50747L82052A18819L01076r4610R7894R1817
14813E14996J22389j09324B57652K36503C6260M67131J12095j50101j15931l252
14803C46202l8690p1845K11146K7018k0349O6210K827j05446j71062p2019J80421
$$ plain form
14792 354413 212972 862120 201796 518887 639083 457868 541846 391268 559682 236367
14781 484788 150802 273630 455697 465306 378353 518857 477995 520592 371366 735736
14771 735736 480921 484460 352104 517427 467023 372005 152674 585042 661556 239357
14760 500895 395657 478767 288790 664486 386354 433734 408013 227528 621245 327937
14750 327937 242861 349761 546978 548696 395991 742466 481492 372275 300705 560152
14740 560152 490798 277291 421478 665864 425327 662672 705081 220175 448575 383995
14730 383995 300217 506555 393421 551630 748236 525353 791854 737810 646236 537998
14720 537998 382163 850123 602328 570675 663839 532523 569862 477933 374257 869622
$$ packed form
14792C54413j41441O49148B01796L17091J20196j81215Q3978j50578J68414B36367
14781D84788A50802J22828J82067R609q6953J40504m0862M2597j49226L64370
14771G35736k54815L539j32356J65323n0404r5018A52674M32368P6514B39357
14760E00895j05238Q3110j89977L75696k78132M7380k5721j80485L93717k93308
14750C27937q5076J06900J97217J718j52705L46475k60974j09217p1570K59447
14740E60152o9354k13507J44187K44386k40537K37345M2409B20175K28400o4580
14730C83995q3778K06338j13134J58209J96606k22883K66501n4044r1574j08238
14720E37998j55835M67960k47795l1653R3164j31316L7339r1929j03676M95365
$$ plain form
14710 869622 586899 912967 554955 745720 842106 477192 952725 637457 741846 555040
14700 555040 812563 326520 617775 537881 771706 574957 958090 450303 660402 745926
14690 745926 543015 712070 548437 751968 1081964 539701 876163 616477 543555 828952
14680 828952 825605 350354 604204 798737 1069676 899112 839818 820994 567373 538221
14670 538221 902933 613771 731656 831028 540583 832043 967663 646415 863110 722524
14660 722524 1120661 873253 749012 543209 748676 830784 871605 750682 773444 785823
14650 785823 1104275 990624 1115168 830395 1118593 947131 923462 529882 1008922 991680
14640 991680 707384 911180 834157 1173100 777576 1255221 651430 1324924 996045 1020976
$$ packed form
14710H69622k82723L26068l58012J90765R6386l64914M75533l15268J04389j86806
14700E55040K57523C26520K91255p9894K33825j96749L83133D50303K10099Q5524
14690G45926k02911J69055j63633K03531L29996E39701L36462k59686p2922K85397
14680H28952l347C50354K53850J94533K70939j70564n9294j8824k53621k9152
14670E38221L64712k89162J17885R9372k90445K91460J35620l21248K16695j40586
14660G22524L98137k47408j24241k05803K05467Q2108M0821j20923K2762J2379
14650G85823L18452j13651J24544k84773K88198j71462k3669l93580M79040j7242
14640I91680k84296K03796p7023L38943l95524M77645o03791O73494l28879K4931
$$ plain form
14630 1020976 994835 790452 924231 810843 1231924 1050967 1088805 1281801 1098034 1058039
14620 1058039 1041596 1031799 1255116 1117078 1326108 895229 1174276 1314913 1390244 1154009
14610 1154009 1123975 1260609 1220766 1217580 1530532 1219598 1252343 1284147 1355542 1056454 1335275
14599 1335275 1357780 1203083 1461593 1180226 1258331 1619650 1204012 1290738 1235051 1497059
14589 1497059 1251095 1575560 1230393 1343433 1608275 1524429 1497194 1519927 1587968 1714707
14579 1714707 1861455 1731056 1652173 1513039 1639052 1611910 1840519 1465516 1750488 1773585
14569 1773585 1621723 1524258 2084666 2132857 1900884 2167437 2303480 2284844 2189760 1794051
14559 1794051 2438278 2164884 2527524 2596091 2346858 2967667 3286557 3416860 4201193 4864559
$$ packed form
14630A020976k6141k04383J33779j13388M21081j80957L7838J92996j83767l9995
14620A058039j6443r797K23317j38038K09030m30879K79047J40637P5331k36235
14610A154009l0034J36634l9843l186L12952l10934L2745L1804P1395k99088K78821
14599A335275K2505j54697K58510k81367P8105L61319m15638Q6726n5687K62008
14589A497059k45964L24465l45167J13040K64842q3846k7235K2733O8041J26739
14579A714707J46748j30399p8883j39134J26013k7142K28609l75003K84972K3097
14569A773585j51862r7465N60408M8191k31973K66553J36043j8636r5084l95709
14559A794051O44227k73394L62640O8567k49233O20809L18890J30303P84333O63366
$$ plain form
14549 4864559 6787656 9900541 16725753 30028974 34672684 22871951 11154858 5450542
14540 3324452 2599529 2068629 1909589 1804911 1559720 1561111 1665772 1740310 1770777 1470904
14530 1470904 1517620 1732829 1708439 1833784 2085991 1693917 2283411 1904964 1858853 1900897
14520 1900897 1863313 2139305 2049286 2040875 2155955 2144967 2159862 2201783 2125678 2360634 2030787
14509 2030787 2343035 2375663 2344101 2458729 2407892 2295395 2594078 2297726 2528278 2163249
14499 2163249 2335119 2565017 2334376 2598132 2651267 2728868 2457991 2503474 2622847 2666424
14489 2666424 2845624 2934349 2635693 2786034 2837261 2886832 3074955 3064887 3001358 3057551
14479 3057551 3158777 3108668 3061752 2965705 3150951 3248470 2937840 3590154 3172475 2986546
$$ packed form
14549D864559J923097L112885O825212J3303221M643710j1800733A1154858E450542
14540C324452p24923n30900j59040j04678k45191J391J04661P4538L0467k99873
14530A470904M6716K15209k4390J25345K52207l92074N89494l78447m6111M2044
14520A900897l7584K75992r0019q411J15080j0988J4895M1921p6105K34956l29847
14509B030787L12248L2628l1562J14628n0837j12497K98683k96352K30552l65029
14499B163249J71870K29898k30641K63756N3135P7601k70877M5483J19373M3577
14489B666424J79200Q8725k98656J50341N1227M9571J88123j0068o3529N6193
14479C057551J01226n0109m6916r6047J85246R7519l10630O52314m17679j85929
$$ plain form
14469 2986546 3502427 3144674 3622924 3520010 3660114 3455689 3374152 3625068 3825762 3517759
14459 3517759 3747132 3668677 4343400 4010175 4266241 4063648 4556272 4169411 3961325 4336545
14449 4336545 4233201 4492056 4496542 4343295 4520046 4662313 4750449 4788896 4729769 4813156
14439 4813156 4738054 4839041 4633368 4998756 5174916 5186160 5005790 5374141 5402720 5642207
14429 5642207 5484140 5636335 6160812 5961505 5705938 6295629 6001963 6087692 6171668 6245855
14419 6245855 6269208 6738367 6802255 6673681 6727302 6801091 7128815 6888865 7448841 7218639
14409 7218639 7180330 7616674 7287700 8029401 7962656 7731567 8085839 8112529 8353078 8444315
14399 8444315 8607873 8644914 9001704 9202806 9082761 9490928 9303664 10103004 9752625 10011128
$$ packed form
14469B986546N15881l57753M78250j02914J40104k04425q1537K50916K00694l08003
14459C517759K29373p8455O74723l33225K56066k02593M92624l86861k08086L75220
14449D336545j03344K58855M486j53247J76751J42267Q8136L8447n9127Q3387
14439D813156p5102J00987k05673L65388J76160J1244j80370L68351K8579K39487
14429E642207j58067J52195N24477j99307k55567N89691k93666Q5729Q3976P4187
14419F245855K3353M69159O3888j28574N3621P3789L27724k39950N59976k30202
14409G218639l8309M36344l28974P41701o6745k31089L54272K6690K40549R1237
14399H444315J63558L7041L56790K01102j20045M08167j87264P99340l50379K58503
$$ plain form
14389 10011128 10041321 10238793 10677718 10686247 10966310 10948609 11102915 11450188 11826759 11720118
14379 11720118 12161800 11962720 12599291 13121057 13306774 13339563 13340340 14093121 14335047 14473945
14369 14473945 14665595 14898552 15354873 16132183 15785036 16297682 16882048 17249163 17738415
14360 17738415 17815143 18259978 18539906 18957060 19497698 19914825 20118295 20832304 21287246
14351 21287246 21690142 22483868 22994062 23487639 23961307 24518311 25167107 26047934 26527170
14342 26527170 27464431 28320012 29157278 29685686 30494880 31323272 32397261 33220746 34273053
14333 34273053 35240440 36128632 37706128 38607946 39983757 41252324 42675642 44182538
14325 44182538 45333987 46718277 48803338 50033624 52153963 53833139 55962562 57794189
$$ packed form
14389A0011128L0193J97472M38925Q529K80063j7701J54306L47273L76571j06641
14379A1720118M41682j99080O36571N21766J85717L2789P77P52781K41926J38898
14369A4473945J91650K32957M56321P77310l47147N12646N84366L67115M89252
14360A7738415P6728M44835K79928M17154N40638M17127K03470P14009M54942
14351B1287246M02896P93726N10194M93577M73668N57004O48796Q80827M79236
14342B6527170R37261Q55581Q37266N28408Q09194Q28392J073989Q23485J052307
14333C4273053R67387Q88192J577496R01818J375811J268567J423318J506896
14325D4182538J151449J384290K085061J230286K120339J679176K129423J831627
$$ plain form
14317 57794189 60290151 62401993 64294319 67477844 70159147 72701958 76156030 79157260
14309 79157260 82777319 85952092 90139408 94176457 98177793 102945751 107762979 113278190
14301 113278190 118861649 124241864 130795891 137386853 144440074 152106329 160294306 168856992
14293 168856992 178143611 187905142 198424294 209411853 220822298 233493673 246425772
14286 246425772 260101913 274113050 288748762 304466828 319783922 335321859 350797803
14279 350797803 366567597 381923698 396449947 409899746 422167641 432468040 439664298
14272 439664298 442035749 443133548 443457357 441354478 439585976 435922837 431012401 423721795
14264 423721795 413305025 400522585 385961443 370594268 354221841 338121245 321482633
$$ packed form
14317E7794189K495962K111842J892326L183525K681303K542811L454072L001230
14309G9157260L620059L174773M187316M037049M001336M767958M817228N515211
14301A13278190N583459N380215O554027O590962P053221P666255Q187977Q562686
14293A68856992R286619R761531J0519152J0987559J1410445J2671375J2932099
14286B46425772J3676141J4011137J4635712J5718066J5317094J5537937J5475944
14279C50797803J5769794J5356101J4526249J3449799J2267895J0300399P196258
14272D39664298K371451J097799L23809k102879j768502l663139m910436p290606
14264D23721795j0416770j2782440j4561142j5367175j6372427j6100596j6638612
$$ plain form
14257 321482633 305583936 290492395 275667180 261088372 247077706 233921367 221583854
14250 221583854 210075758 198481822 188082847 178375182 169133784 160323875 152431394
14243 152431394 145291289 137419683 130913015 124544797 118691789 113265769 108581986 103406221
14235 103406221 98712949 94182581 90335108 86671005 83631403 80127164 76493489 73590976
14227 73590976 70290866 67710665 64930526 62738039 60741867 58036131 56099445 54317435
14219 54317435 52273458 50610824 48809146 47388773 45795888 44206972 43060625 41932733
14211 41932733 40198951 39234661 37662114 36634602 35832807 35293475 34090343 32918922
14203 32918922 31841153 31259609 29965118 29801619 28985391 28242926 27225253 26362429 25870857
$$ packed form
14257C21482633j5898697j5091541j4825215j4578808j4010666j3156339j2337513
14250B21583854j1508096j1593936j0398975r707665r241398q809909p892481
14243A52431394p140105p871606o506668o368218n853008n426020m683783n175765
14235A03406221m693272m530368l847473l664103l039602l504239l633675k902513
14227G3590976l300110k580201k780139k192487j996172k705736j936686j782010
14219E4317435k043977j662634j801678j420373j592885j588916j146347j127892
14211D1932733j733782r64290j572547j027512q01795n39332j203132j171421
14203C2918922j077769n81544j294491j63499q16228p42465j017673q62824m91572
$$ plain form
14194 25870857 25143180 24656022 23925388 23662904 22583014 22201403 21669158 21269417 20502519
14185 20502519 20211840 19990049 19512937 18951624 18548191 18237358 17964215 17180440 16845514
14176 16845514 16749169 16043439 16338307 15617586 15401531 15055530 14697398 14563657 13971397
14167 13971397 14185595 13883967 13278527 13093755 12999777 12501920 12551576 12036569 11953321 11428929
14157 11428929 11889116 11552998 11172100 10945844 10834700 10941920 10356736 10531338 10512829
14148 10512829 10028785 9789854 9702306 9193178 9694935 9175226 9043543 9068539 8997142 8552102
14138 8552102 8395268 8240158 8147719 8244394 8168650 7800302 8275286 7537282 7491294 7707728
14128 7707728 7649680 7478624 7237414 6978980 6760512 6867389 6868907 6973624 6548409 6640256
$$ packed form
14194B5870857p27677m87158p30634k62484j079890l81611n32245l99741p66898
14185B0502519k90679k21791m77112n61313m03433l10833k73143p83775l34926
14176A6845514r6345p05730K94868p20721k16055l46001l58132j33741n92260
14167A3971397K14198l01628o05440j84772r3978m97857M9656n15007q3248n24392
14157A1428929M60187l36118l80898k26256j11144J07220n85184J74602j8509
14148A0512829m84044k38931q7548n09128N01757n19709j31683K4996p1397m45040
14138H552102j56834j55110r2439R6675p5744l68348M74984p38004m5988K16434
14128G707728n8048j71056k41210k58434k18468J06877J518J04717m25215R1847
$$ plain form
14118 6640256 6386517 6532786 6668216 6115092 6259339 6085332 5744468 5803527 6050022 5732691
14108 5732691 5790288 5675593 5785098 5192805 5733497 5223839 5186015 5243089 5341856 5029630
14098 5029630 5172167 4636323 5170638 4807058 4874456 4877056 4550617 4505704 4408745 4871549
14088 4871549 4450059 4403755 4271391 4447061 4313261 4253385 4113693 4263220 4184264 4398008
14078 4398008 3959217 4098066 3721774 3696267 3828954 3881352 3852267 3515720 3471098 3676849
14068 3676849 3356853 3578500 3550593 3425574 3597830 3506905 3393293 3251585 3147703 3393804
14058 3393804 3442670 3259595 3251486 3184532 3262598 3187751 3095532 2820884 3080696 2982988 3038175
14047 3038175 3066341 2652787 2859177 2669008 2710857 2737280 3192044 2272937 2722436 2559339
$$ packed form
14118F640256k53739J46269J35430n53124J44247j74007l40864N9059K46495l17331
14108E732691N7597j14695J09505n92293N40692n09658l7824N7074R8767l12226
14098E029630J42537n35844N34315l63580O7398K600l26439m4913r6959M62804
14088D871549m21490m6304j32364J75670j33800n9876j39692J49527p8956K13744
14078D398008m38791J38849l76292k5507J32687N2398k9085l36547m4622K05751
14068C676849l19996K21647k7907j25019J72256r0925j13612j41708j03882K46101
14058C393804M8866j83075q109o6954P8066p4847r2219k74648K59812r7708N5187
14047C038175K8166m13554K06390j90169M1849K6423M54764r19107M49499j63097
$$ plain form
14037 2559339 2434162 2547912 2940759 2712545 2608519 2577621 2426214 2578126 2561956 2586202
14027 2586202 2651379 2363997 2478226 2387141 2333384 2172752 2316613 2235514 2092859 2191318
14017 2191318 2279511 1865270 2238042 2006207 1921110 2044050 2217908 2127085 1922819 1954940
14007 1954940 1891674 2163493 1866539 1924234 1922329 1693997 1918907 2089452 1882229 1741405
13997 1741405 1781492 1782453 1655618 1911712 1974892 2105207 2242481 2555408 3766213 6054429
13987 6054429 11677887 23769649 33496573 26427395 15421827 9117633 6084411 4561124
13979 4561124 3841923 3353560 3068835 3071663 2760922 2501529 2603595 2555905 2259407 2000062
13969 2000062 2421241 2056860 1835326 1964556 2149391 1711898 2314431 1738150 1706937 2176720
$$ packed form
14037B559339j25177J13750L92847k28214j04026l0898j51407J51912j6170K4246
14027B586202O5177k87382J14229r1085n3757j60632J43861q1099j42655R8459
14017B191318Q8193m14241L72772k31835q5097J22940J73858r0823k04266L2121
14007A954940o3266K71819k96954N7695j905k28332K24910J70545k07223j40824
13997A741405M0087R61j26835K56094O3180J30315J37274L12927J210805K288216
13987F054429N623458J2091762R726924p069178j1005568o304194l033222j523287
13979D561124p19201m88363k84725K828l10741k59393J02066m7690k96498k59345
13969B000062M21179l64381k21534J29230J84835m37493O02533n76281l1213M69783
$$ plain form
13959 2176720 1680353 1861336 1739788 2002968 1780442 1870921 1640507 1781668 1905141 1597233
13949 1597233 1482403 1722259 1587416 1656511 1758344 1748142 1463476 1693117 1577904 1527650
13939 1527650 1430188 1338370 1333541 1491904 1252931 1233668 1375663 1706123 1385983 1598223
13929 1598223 1489148 1435431 1588764 1552167 1389550 1210501 1290152 1492169 1114404 1128039
13919 1128039 958381 1250342 1392627 1365422 1276231 1317100 1017658 1321718 1251886 1160387
13909 1160387 1035522 1091960 1486599 959878 1151623 1158318 1086101 1075879 1059309 1183389
13899 1183389 1028710 959010 1091736 1500828 1358015 1001526 1390840 948138 819581 1174292
13889 1174292 1167711 1103245 917844 1213276 1022340 1012446 981136 968171 942578 1256057 1230372
$$ packed form
13959B176720m96367J80983j21548K63180k22526R0479k30414J41161J23473l07908
13949A597233j14830K39856j34843O9095J01833j0202k84666K29641j15213n0254
13939A527650r7462r1818m829J58363k38973j9263J41995L30460l20140K12240
13929A598223j09075n3717J53333l6597j62617j79049P9651K02017l77765J3635
13919A128039j69658K91961J42285k7205q9191M0869k99442L04060o9832r1499
13909A160387j24865N6438L94639n26721J91745O695p2217j0222j6570J24080
13899A183389j54679o9700J32726M09092j42813l56489L89314m42702j28557L54711
13889A174292o581o4466j85401K95432j90936r894l1310j2965k5593L13479k5685
$$ plain form
13878 1230372 1271999 1082846 790088 933073 777435 1124210 854974 1046099 939776 1132017
13868 1132017 691940 975457 1273906 1055536 1239127 815123 1081533 989347 955710 928247
13858 928247 717054 865187 942602 976018 1216921 874391 701163 996439 579482 907135
13848 907135 970555 803791 573654 764482 694784 718972 479546 785407 833610 924105
13838 924105 819358 1119736 906793 920344 773659 1003236 541435 740951 529051 476835
13828 476835 959946 1105845 689530 924758 906599 840215 744720 893786 715253 539093
13818 539093 976720 872438 966540 649397 891450 411770 1031456 661385 567249 679789
13808 679789 634071 564714 841522 866869 937534 825982 954475 768006 492504 790263
$$ packed form
13878A230372M1627j89153k92758J42985j55638L46775k69236J91125j06323J92241
13868A132017m40077K83517K98449k18370J83591m24004K66410r2186l3637k7463
13858I28247k11193J48133P7415L3416K40903l42530j73228K95276m16957L27653
13848I07135O3420j66764k30137J90828o9698K4188k39426L05861M8203R0495
13838I24105j04747L00378k12943J3551j46685K29577m61801J99516k11900n2216
13828D76835M83111J45899m16315K35228j8159o6384r5495J49066j78533j76160
13818E39093M37627j04282R4102l17143K42053D11770O19686l70071r4136J12540
13808F79789m5718o9357K76808K5347P0665j11552J28493j86469k75502K97759
$$ plain form
13798 790263 451898 778870 868048 481663 631221 980651 715244 465490 789607 663973
13788 663973 698130 484931 730675 413575 499245 644125 703088 658285 392095 508223
13778 508223 688957 636251 555626 639256 654491 677718 649548 509149 629759 750013 637606
13767 637606 724595 517029 619434 719755 529797 262452 749045 661576 507322 356396
13757 356396 497214 466515 436366 385037 456397 423227 363893 745105 407504 722217 458843
13746 458843 944104 694723 499501 280298 665326 803826 296959 508037 546347 604985
13736 604985 1030534 252528 818960 484536 566210 384230 693800 348461 360444 446842
13726 446842 651493 678214 474494 401186 289906 259214 456129 685262 355730 581448
$$ packed form
13798G90263l38365L26972Q9178l86385J49558L49430k65407k49754L24117j25634
13788F63973L4157k13199K45744l17100Q5670J44880N8963m4803k66190J16128
13778E08223J80734n2706q0625Q3630J5235K3227k8170j40399J20610J20254j12407
13767F37606Q6989k07566J02405J00321j89958B62452M86593q7469j54254j50926
13757C56396J40818l0699l0149n1329P1360l3170n9334L81212l37601L14713k63374
13746D58843M85261k49381j95222k19203L85028J38500B96959K11078L8310N8638
13736F04985M25549B52528N66432l34424Q1674j81980L09570l45339J1983Q6398
13726D46842K04651K6721k03720p3308j11280l0692J96915K29133l29532K25718
$$ plain form
13716 581448 685405 591714 487492 371248 747092 579096 323838 209246 639796 230942
13705 855527 358494 500717 65838 622883 568594 588197 618736 543044 314352 459246
13695 459246 462174 689866 458274 336017 467144 666577 411078 416258 556614 211622
13684 436224 635598 600651 353871 519329 652898 481921 285354 231314 366707 658225
13674 658225 589413 214361 342242 313189 305245 563915 575509 688792 441538 372660 258987
13663 258987 424024 349140 472166 594523 559527 445994 526447 -6818 161045 546036
13653 546036 304581 273783 274860 115454 627274 338249 512255 185649 516630 413508
13643 413508 534993 173910 489875 598901 406940 371021 181646 314855 598364 89504
$$ packed form
13716E81448J03957r3691j04222j16244L75844j67996k55258j14592M30550B30942
13705H55527C58494J42223F5838N57045n4289J9603L0539p5692k28692J44894
13695D59246K928K27692k31592j22257J31127J99433k55499N180J40356B11622
13684D36224J99374l4947k46780J65458J33569j70977j96567n4040J35393K91518
13674F58225o8812B14361J27881k9053p944K58670J1594J13283k47254o8878j13673
13663B58987J65037p4884J23026J22357l4996j13533Q0453f818A61045L84991
13653E46036k41455l0798J077A15454N11820k89025J74006A85649L30981j03122
13643D13508J21485A73910L15965J09026j91961l5919A81646J33209K83509H9504
$$ plain form
13632 415680 -18347 84021 600858 334350 390743 416379 418083 417089 326570 369611 250033
13621 250033 -21428 474455 212496 525048 477105 280217 143387 580024 187026 308502
13611 308502 25932 282223 146600 324949 581999 322464 198837 308133 95440 424388
13601 424388 220352 209126 311541 346799 361287 145274 392608 228222 503833 149870
13590 60036 191383 604038 438595 166203 491935 545019 253311 521800 358436 89155
13579 286182 309724 103008 333742 261565 91345 69296 538429 308245 294861 47151 459455
13568 459455 293216 286681 26578 580377 245266 408310 69406 598311 203662 421297
13558 421297 432962 688108 386090 103642 82567 387909 61694 188073 300528 421211
$$ packed form
13632D15680a8347H4021N16837k66508N6393K5636J704r94r0519M3041j19578
13621B50033b1428D74455B12496L12552m7943j96888j36830M36637A87026J21476
13611C08502B5932K56291j35623J78349K57050k59535j23627J09296I5440L28948
13601D24388k04036j1226J02415L5258J4488A45274K47334j64386K75611A49870
13590F0036J31347M12655j65443A66203L25732N3084B53311K68489j63364H9155
13579B86182K3542A03008K30734p2177I1345k2049M69133k30184j3384D7151M12304
13568D59455j66239o535B6578N53799B45266J63044F9406N28905B03662K17635
13558D21297J1665K55146l02018A03642k1075L05342F1694J26379J12455J20683
$$ plain form
13548 421211 407103 202978 81503 254884 99070 311397 195120 268008 215203 298123 306051
13537 306051 36705 236133 151763 444862 178777 173776 163599 250844 101868 192014 692717
13526 692717 19904 173490 231185 -7690 -196433 192563 252427 -53381 639133 197372 233626
13515 233626 124852 405662 193348 -139777 -98573 92313 154499 272792 201986 60653
13504 496225 -5849 257373 53241 202816 -5021 684063 216245 107225 86156 -31033 526405
13492 293452 165954 489768 194025 683 254870 89046 458748 223742 -104264 410023
13481 211128 250865 366066 145213 150317 80343 214426 426603 303534 38454 -32326 131682
13469 154994 319097 312602 376774 -67990 -15820 316450 196105 130318 262795 472182 274778
$$ packed form
13548D21211j4108B02978H1503J73381I9070K12327j16277P2888n2805Q2920P928
13537C06051C6705J99428q4370K93099A78777n001j0177Q7245A01868R0146N00703
13526F92717A9904J53586N7695g690j88743A92563N9864e3381F39133A97372L6254
13515B33626j08774K80810A93348a39777M1204I2313O2186J18293p0806F0653
13504D96225e849B57373E3241J49575e021F84063B16245A07225k1069c1033E26405
13492B93452j27498L23814A94025F83K54187H9046L69702B23742a04264D10023
13481B11128L9737J15201A45213N104o9974J34083K12177j23069C8454c2326A31682
13469A54994J64103o495O4172f7990a5820C16450j20345o5787J32477K09387j97404
$$ plain form
13458 274778 319468 489732 368802 176819 231974 183648 -89687 89684 424222 513236 76922
13446 417903 377352 316500 290694 98102 510946 114630 148806 294953 148654 287257
13436 287257 207559 229773 47457 525355 100936 201439 171807 251017 348068 95375 390254
13425 390254 85019 196033 125736 214501 -85097 156017 93563 208348 38064 113040 176429
13414 176429 -31878 383277 388068 231369 269363 193465 279085 -127939 5519 258308 170029
13403 170029 -108922 -44294 43781 203342 280746 203875 534908 300688 58139 61606 131309
13392 131309 -71060 128492 82683 52612 464087 180095 64769 217024 346683 280815
13382 280815 405547 214702 -92051 193983 4293 -3533 -78396 90874 159762 -132192 94124
$$ packed form
13458B74778M4690J70264j20930A76819N5155m8326h9687H9684L34538Q9014G6922
13446D17903m0551o0852k5806I8102M12844A14630L4176J46147j46299J38603
13436B87257p9698K2214D7457M77898A00936J00503k9632P9210R7051I5375K94879
13425C90254H5019J11014p0297Q8765h5097A56017o2454J14785C8064P4976O3389
13414A76429c1878C83277M791j56699L7994p5898Q5620a27939E519K52789q8279
13403A70029a08922d4294D3781J59561P7404p6871L31033k34220E8139L467O9703
13392A31309g1060A28492m5809l0071M11475A80095F4769J52255J29659o5868
13382B80815J24732j90845i2051A93983D293c533p4863I0874O8888a32192I4124
$$ plain form
13370 306842 127527 434883 404124 -122455 192646 262635 384073 -17362 339169 -259229
13359 170847 484338 258012 -75608 183917 239972 102134 382090 146374 217580 -48530
13348 229345 199849 145975 185308 474546 393251 270884 421543 264136 198597 129809 283525
13337 283525 225211 193227 107965 145677 250763 183908 -10748 427601 279613 -14922 -87012
13326 -87012 222627 531381 149865 257377 118592 485525 249013 115481 314412 166578
13316 166578 116583 384269 411994 316260 49989 -185669 -143885 65804 -12907 62306 424325
13305 424325 -78939 77825 429905 -33855 46547 83020 143519 193205 -84207 135301 179509
13294 179509 -90424 411766 -129374 -13536 -155864 120788 171647 29829 276677 37666
$$ packed form
13370C06842A27527L07356l0759a22455A92646O9989J21438a7362C39169b59229
13359A70847L13491k26326g5608A83917N6055A02134K79956A46374P1206d8530
13348B29345k9496n3874L9333K89238q1295j22367J50659j57407o5539o8788J53716
13337B83525n8314l1984q5262L7712J05086o6855a0748D27601j47988a4922p2090
13326h7012B22627L08754A49865J07512A18592L66933k36512A15481J98931j47834
13316A66578m9995K67686K7725r5734D9989a85669M1784F5804a2907F2306L62019
13305D24325g8939G7825L52080c3855D6547L6473O0499M9686h4207A35301M4208
13294A79509i0424D11766a29374a3536j42328A20788N0859B9829K46848C7666
$$ plain form
13283 50748 225112 16401 37985 190227 302601 -7607 75208 -163140 426195 -44519 149896
13271 36353 -8035 206548 127407 86283 154000 15016 46342 25330 156440 -64360 181943
13259 45525 -133860 154525 308862 151178 251800 204616 108635 240049 -142155 79116
13248 114963 217905 318140 201471 479331 122906 294702 240577 140607 -32392 99603
13237 -50034 -191467 152841 -192158 -150440 237303 13432 70676 -277579 205098 299904
13227 299904 18479 91186 69005 56324 240179 62140 -73669 -20778 -207251 -12943 216982
13215 106497 -31252 -136933 33845 280915 -11970 43827 198314 -91190 188477 68993 75887
13204 75887 23359 370762 257357 158871 -44865 235415 156762 139339 185362 258103 9519
$$ packed form
13283E0748J74364A6401K1584J52242J12374g607G5208a63140D26195d4519A49896
13271C6353h035B06548p9141m1124O7717A5016L1326k1012J31110f4360A81943
13259D5525a33860A54525J54337A51178J00622m7184r5981J31414a42155G9116
13248A14963J02942J00235j16669K77860A22906J71796n4125r9970c2392I9603
13237e0034j41433A52841a92158M1718B37303A3432N7244b77579B05098R4806
13227B99904A8479P2707k2181j2681J83855F2140g3669b0778j86473a2943B16982
13215A06497c1252j05681C3845K47070a1970D3827J54487i1190A88477F8993O894
13204G5887B3359L47403j13405r8486d4865B35415p8653j7423M6023P2741I519
$$ plain form
13192 138428 287710 226012 -201976 1405 -11923 10044 145621 248796 -287653 1056 31667
13181 31667 -83769 296888 41984 54577 -89672 -140637 -240283 162020 509321 309343 -860
13169 51663 44065 331693 31519 -12406 196182 157371 -91803 -47414 -94198 39579 487301
13158 487301 33306 80914 34245 -97681 -55643 22905 254226 -247364 23143 -145704 49927
13146 166272 326119 -104061 72292 410299 -237168 -122904 83337 100614 -99850 74091
13135 294777 601 351170 185978 125240 308854 277436 124552 21054 335436 287440 -6167
13123 108087 80431 -15705 154274 -167071 120533 214910 167771 222788 10647 48914 176282
13112 176282 26608 326151 11053 -87640 173885 413667 72688 -115005 201872 40083
$$ packed form
13192A38428J49282o1698b01976A405a1923A0044J35577J03175b87653A056L0611
13181C1667h3769B96888D1984J2593h9672n0965r9646A62020L47301j99978h60
13169E1663p598K87628C1519a2406A96182l8811i1803M4389m6784C9579M47722
13158D87301C3306M7608C4245i7681M2038B2905K31321b47364B3143a45704D9927
13146A66272J59847a04061G2292L38007b37168J14264H3337J7277i9850G4091
13135B94777F01L50569j65192o0738J83614l1418A24552B1054L14382m7996f167
13123A08087k7656a5705A54274a67071A20533R4377m7139N5017A0647L8267J27368
13112A76282B6608K99543A1053h7640A73885K39782G2688a15005B01872D0083
$$ plain form
13101 -20785 544 -42148 -164469 -2930 -124986 -87747 88334 -156624 -90870 57401 98919 215175
13089 215175 233102 -9883 -606 75439 45994 134772 -59974 107071 -333069 -92954 281428
13077 -214172 -389948 59850 64364 -159250 248752 142461 292581 94708 17786 -289121
13066 124497 178178 318773 255833 -92428 4382 -47478 254102 -54588 41558 -175622 131445
13054 38683 3749 264287 -92425 15865 19037 -44607 154740 41702 174771 275614 -9942
13042 195097 61850 221014 -22396 248723 304829 261341 -43104 148868 95481 185027 240390
13031 240390 -80686 137567 576587 75263 245814 83050 202761 142287 244414 48008
13020 233487 302802 252532 340447 -75844 232758 49861 74000 97495 -88040 -6350 47129
$$ packed form
13101b0785E44d2148j22321b930j22056L7239H8334a56624O5754E7401M1518J16256
13089B15175J7927i883f06G5439k9445Q8778e9974A07071c33069i2954B81428
13077b14172j75776E9850M514a59250B48752j06291J50120I4708A7786b89121
13066A24497N3681J40595o2940i2428D382d7478B54102e4588D1558a75622A31445
13054C8683C749K60538i2425A5865L172d4607A54740D1702J33069J00843i942
13042A95097F1850J59164b2396B48723N6106m3488d3104A48868n3387Q9546N5363
13031B40390h0686A37567M39020G5263J70551H3050J19711o0474J02127D8008
13020B33487O9315n0270Q7915g5844B32758D9861K4139K3495h8040f350D7129
$$ plain form
13008 -41445 -250952 27271 249808 -358826 325593 77981 40885 210189 68601 -147342
12997 224362 240116 121419 226798 -137639 -40840 -91503 6857 -73625 230880 97114 91221
12986 91221 75664 169292 56101 215287 144326 -106237 169854 -19931 -9791 18185 -167435
12974 50893 -1561 -12313 -239067 -14417 114081 -263010 136239 -8536 -27990 111104 -69672
12962 35844 -100704 89799 -39245 74213 37378 11967 240309 325073 -51043 230793 65160
12950 119728 -14623 -55315 50496 -198171 141996 -16247 54403 -183573 221174 -295736
12939 -82163 206282 241681 -99846 -80992 487127 -168176 -152149 219613 125809 72890 248997
12928 248997 270497 -204426 202975 449131 -112256 306288 -57464 -485248 240575 17143
$$ packed form
13008d1445k09507B7271K22537c58826C25593G7981l7096J69304F8601a47342
12997B24362J5754j18697J05379a37639d0840n0663F857g3625B30880I7114n893
12986I1221j5557R3628E6101J59186p0961a06237A69854a9931i791A8185a67435
12974E0893a561j0752k26754a4417A14081b63010A36239h536j9454A11104f9672
12962C5844a00704H9799c9245G4213l6835A1967K28342Q4764e1043B30793F5160
12950A19728a4623m0692E0496a98171A41996a6247E4403a83573B21174b95736
12939h2163B06282L5399i9846J8854D87127a68176J6027B19613r3804n2919J76107
12928B48997K1500b04426B02975K46156a12256C06288e7464m27784B40575A7143
$$ plain form
12917 95678 268205 28209 45192 73659 140549 -11300 15242 -84138 -112534 125580 30093
12905 -24289 67264 -79834 67371 -352270 -116651 169003 -78202 146311 22239 370457 150940
12893 -147535 -112727 79960 103298 31788 284416 -223206 276093 -55252 -279192 128312
12882 187893 -74598 237262 -217371 63075 -42696 88206 26794 -90423 181701 133517 -158781
12870 210803 74267 212509 51651 -87528 63797 -61121 396215 -139481 -113572 193235 146467
12859 146467 244111 66309 130074 -77657 -275621 -96870 -372870 14194 109132 -279885 77715
12847 62092 -81583 -63597 -102655 9693 28715 227694 -151527 -372321 125277 -129199 39006
12835 -70531 -150341 12501 10597 270687 -213787 133397 -52793 -117602 206574 -37013 313868
$$ packed form
12917I5678J72527B8209J6983K8467O6890a1300A5242h4138k8396A25580C0093
12905b4289F7264g9834F7371c52270a16651A69003g8202A46311B2239L48218A50940
12893a47535L4808G9960K3338C1788K52628b23206B76093e5252k23940A28312
12882A87893g4598B37262b17371F3075d2696H8206B6794i0423A81701m8184a58781
12870B10803G4267J38242E1651h7528F3797f1121C96215a39481K5909A93235m6768
12859A46467R7644F6309O3765g7657j97964i6870k76000A4194R4938b79885G7715
12847F2092h1583J7986l9058I693J9022J98979a51527k20794A25277a29199C9006
12835g0531p9810A2501j904K60090b13787A33397e2793o4809B06574c7013C13868
$$ plain form
12823 -36507 -145660 -174770 216939 116357 209795 -371093 122369 333277 268660 -91427
12812 120753 -111994 188609 67003 10360 177827 145903 -150134 56003 -102336 17572
12801 -32305 5850 148963 -154248 526716 36517 -154572 -147281 113079 19895 -120636 5603
12789 730 47080 -172341 -82192 51965 -291548 33622 22815 -27684 53593 20625 103140 141666
12777 141666 195225 98960 -15414 -124472 125279 -180682 196770 -57645 113592 -5790 154725
12765 -158780 113293 24702 -368490 16160 -29216 -107263 406150 137389 -295077 28820
12754 -72222 -236236 139782 -158869 -82026 55315 167782 29083 75369 -9649 250856 -218591
12742 27732 -51865 65632 124428 155853 227881 -92054 207301 -172850 83001 102271 215135
$$ packed form
12823c6507j09153k9110B16939j00582R3438c71093A22369K10908o4617i1427
12812A20753a11994A88609F7003A0360J67467l1924a50134E6003a02336A7572
12801c2305E850J43113a54248E26716C6517a54572P291A13079A9895a20636E603
12789G30M6350a72341h2192E1965b91548C3622j0807b7684E3593B0625Q2515L8526
12777A41666N3559r6265a5414j09058A25279a80682A96770e7645A13592e790A54725
12765a58780A13293B4702c68490A6160b9216p8047D06150A37389b95077B8820
12754g2222j64014A39782a58869P6843E5315J12467B9083M6286i649B50856b18591
12742B7732e1865F5632N8796L1425P2028i2054B07301a72850H3001J9270J12864
$$ plain form
12731 215135 1920 139658 61310 75707 80479 -115737 -42372 216938 19674 206329 52737
12719 210314 298605 -39362 290499 101004 -280254 -127317 -86238 -220724 31170 364328
12709 364328 237316 -251765 -154960 -109183 47325 278424 20131 167945 76283 75043 220350
12698 220350 77263 -68055 362728 209668 104437 138920 105347 354697 135268 -188744
12687 -15129 232696 80587 268453 -256103 281428 260494 182627 -172098 -29645 517509
12676 -28802 52185 -159442 69182 -62564 -51242 -4969 73655 93684 73401 152721 242946 42274
12663 -26153 170203 33485 -119087 -50751 143912 105945 109365 205604 -33668 50398 223292
12652 223292 -175511 21059 185107 -104911 20061 -51415 -297990 16856 13340 -16439 -177168
$$ packed form
12731B15135A920J37738F1310J4397M772a15737d2372B16938A9674J86655E2737
12719B10314Q8291c9362B90499A01004b80254a27317M1079j34486C1170L33158
12709C64328j27012b51765R6805M5777D7325K31099B0131J47814G6283j240J45307
12698B20350G7263f8055C62728j53060A04437L4483l3573K49350A35268a88744
12687a5129B32696H0587J87866b56103B81428k0934p7867a72098b9645E17509
12676b8802E2185a59442F9182f2564J1322d969G3655K0029k0283P9320R0225D2274
12663b6153A70203C3485a19087e0751A43912l7967L420R6239c3668E0398J72894
12652B23292a75511B1059J64048a04911B0061e1415k46575A6856l516a6439j60729
$$ plain form
12641 -177168 165343 200878 80841 -273777 149748 125083 109695 73984 -490899 27530 66702
12630 66702 190505 529514 398247 -160197 394575 155873 -7333 267980 60945 -106818
12619 -14696 12961 180911 267022 149710 203854 188027 -249619 -142448 -97236 -77239 450405
12607 56714 -51832 -103745 -18483 141253 -3669 -189580 -20469 66606 172579 -22167 73730
12595 251918 -38284 -15936 -217068 -139564 -114321 411653 -47751 -37667 85134 203953 142551
12584 142551 -51346 -113643 154059 187926 -129048 -215932 7363 -259911 374930 125629 76983
12573 76983 124397 -325762 -276554 -76657 17279 376596 147482 -197016 -199986 -236164 81949
12561 -226936 201876 -98446 -57075 -122598 -114066 60067 -185730 366103 -194838 5059 -42914
$$ packed form
12641a77168A65343L5535H0841b73777A49748k4665j5388l5711d90899B7530L9172
12630F6702J23803L39009j31267a60197C94575A55873g333B67980F0945a06818
12619a4696A2961J67950Q6111j17312N4144j5827b49619J07171M5212J9997D50405
12607E6714e1832n1913a8483A41253c669j85911b0469F6606J05973b2167G3730
12595B51918c8284a5936k01132P7504K5243D11653d7751J0084H5134J18819o1402
12584A42551e1346o2297A54059L3867a29048q6884G363b59911C74930A25629m8646
12573G6983M7414c25762M9208g6657A7279L59317A47482a97016k970l6178H1949
12561b26936B01876i8446M1371o5523Q532F0067a85730C66103a94838E059d2914
$$ plain form
12549 11566 -10195 237042 -331670 21281 148296 -147734 12771 159345 96765 -94447 -112605
12538 -112605 -288 -65045 -46386 -30576 185955 -477783 -335769 -140157 -27749 71796 52514
12527 52514 -172816 227927 104846 -197217 117867 300377 -46227 -144128 -121413 -201478
12517 -201478 55133 323023 80707 -64569 134827 256344 -39501 95906 -381633 98350 -84991
12505 233305 295088 -139789 92240 -64733 51391 407152 139720 -316823 -174691 152250
12494 -33486 -20487 16912 -58217 -54807 122941 150027 -47641 -59802 -153671 -25752 -49129 -80494
12482 -80494 102580 20909 -210466 -115457 -504410 -310716 322588 -1375 4887 -79615 -172710
12471 -172710 -127170 42946 129112 -109292 149726 -80238 355838 225481 -50164 222568
$$ packed form
12549A1566a0195B37042c31670B1281J27015a47734A2771J46574o2580i4447j8158
12538a12605b88o4757J8659J5810A85955d77783J42014a40157b7749G1796j9282
12527E2514a72816B27927A04846a97217A17867J82510d6227r7901K2715q0065
12517b01478E5133K67890H0707f4569A34827J21517c9501I5906c81633I8350h4991
12505B33305O1783a39789I2240f4733E1391L55761A39720c16823J42132A52250
12494c3486J2999A6912e8217L410A22941K7086d7641j2161r3869b5752k3377l1365
12482h0494A02580B0909b10466R5009l88953J93694C22588a375D887g9615r3095
12471a72710M5540D2946Q6166a09292A49726h0238C55838j30357e0164B22568
$$ plain form
12460 54076 80985 95292 -263385 -18203 74746 6585 -15915 -23960 -118409 -100060 -248490 -179561
12448 -179561 -96969 -13566 487908 -128617 239108 596734 56112 -263323 31854 -46891
12437 46749 -42793 -185030 -237376 -229962 93228 162596 270421 -303556 251031 100417 343024
12426 343024 -153438 131814 -311198 -210124 88431 156439 84942 374570 -10799 -31788
12416 -31788 193119 -55119 -169358 125670 173687 -35862 -22715 152460 321076 -59794 -4857
12404 -182414 -105174 -23297 66012 372748 -129213 65013 -168551 7138 -194182 -105453 115314
12392 20375 -49225 -16649 62858 -53157 -118144 63342 66830 -8260 -215509 163239 -100181
12380 256312 -464157 40076 102329 38945 -17990 87596 176037 -113335 167572 -89095 25181
$$ packed form
12460E4076K6909J4307b63385a8203G4746F585a5915q045r4449J8349j48430O8929
12448a79561Q2592a3566D87908a28617B39108L57626E6112b63323C1854d6891
12437D6749d2793j42237n2346P414I3228O9368J07825c03556B51031A00417K42607
12426C43024a53438A31814c11198J01074H8431O8008p1497K89628a0799k0989
12416c1788A93119e5119j14239A25670M8017c5862J3147A52460J68616e9794d857
12404a82414P7240b3297F6012L06736a29213F5013a68551G138a94182Q8729A15314
12392B0375d9225a6649F2858e3157o4987F3342L488h260k07249A63239a00181
12380B56312d64157D0076O2253C8945a7990H7596Q8441a13335A67572h9095B5181
$$ plain form
12368 79736 -211586 132739 246415 -390964 -15404 27243 154054 102655 183367 -206044
12357 167763 -53177 204242 -183629 -1194 -34043 113742 -182180 47777 -29751 39496 -448
12345 -78837 128126 -205612 347656 61747 190504 -19909 99671 -172575 -52375 16822 -50219
12333 368138 251349 -123872 90357 424311 -35029 65933 125349 72610 -30595 -168199 -12670
12321 -60839 26472 24778 -438186 197826 36984 -124855 -52175 74602 31847 -275253 -151012
12310 -151012 -219711 -27010 -92679 -108375 -69078 -93160 27519 93148 30094 -152671 134264
12298 93267 110816 19943 -39434 179346 73532 144290 -162014 -82859 -234629 -100743 401908
12286 -38899 -111964 78587 94168 -23590 -61472 60144 118287 -234639 92094 272364 338224
$$ packed form
12368G9736b11586A32739J13676c90964a5404B7243J26811n1399Q0712b06044
12357A67763e3177B04242a83629a194l2849A13742a82180D7777b9751C9496d48
12345g8837A28126b05612C47656F1747J28757a9909I9671a72575e2375A6822e0219
12333C68138j16789a23872I0357L33954c5029F5933N9416n2739c0595j37604a2670
12321f0839B6472j694d38186A97826C6984a24855e2175G4602C1847b75253J24241
12310a51012o8699b7010o5669j5696L9297k4082B7519O5629C0094a52671A34264
12298I3267J7549A9943c9434A79346G3532P0758a62014P9155j51770a00743D01908
12286c8899p3065G8587J5581b3590l7882F0144N8143b34639I2094J80270O5860
$$ plain form
12275 338224 -35937 296440 -76172 125722 -118821 28832 52942 15303 -69464 -162111 208368
12263 -308723 -243516 146573 74055 153468 198221 176061 114180 -215477 14154 252798 -85830
12251 131221 84162 -195114 408540 -13022 65116 -97569 -134433 -119008 29849 -156954 298498
12239 214830 142955 139357 5519 -30065 -31409 161382 65040 -59560 271742 -28368 347488
12227 16415 236618 364640 -35229 163007 165210 512696 255865 210744 184885 293407 593609
12216 593609 290555 199118 487533 184611 491663 335242 110203 121332 161148 125114
12206 125114 -182859 -190909 211073 348175 51872 80305 19384 102329 -33932 364807 195990
12195 195990 262930 135041 -47871 43462 -217347 -3921 209271 -82007 -159685 166411 -94769
$$ packed form
12275C38224c5937B96440g6172A25722a18821B8832K4110A5303f9464r2647B08368
12263c08723O5207A46573p2518P9413M4753k2160o1881b15477A4154K38644h5830
12251A31221m7059a95114D08540a3022F5116i7569l6864J5425B9849a56954B98498
12239B14830p1875l598E519c0065j344A61382F5040e9560B71742b8368C47488
12227A6415K20203J28022c5229A63007K203L47486B55865m5121k5859J08522L00202
12216E93609B90555r1437K88415A84611L07052j56421A10203J1129L9816l6034
12206A25114a82859q050B11073J37102E1872K8433A9384Q2945c3932C64807j68817
12195A95990O6940j27889d7871D3462b17347c921B09271h2007p7678A66411i4769
$$ plain form
12183 72604 348726 181477 145143 112569 -61206 -177180 312110 405264 161733 345150
12173 345150 167412 207968 92971 328774 422355 60177 -67206 239611 -3792 368721 35148
12161 238079 143627 50437 66576 6989 -72548 164352 94971 70820 186291 -144018 155263
12149 -14440 -188811 141785 -172421 226061 -240331 -117196 66981 210374 -19831 -209142
12139 -209142 -119083 -219914 -44793 57392 -90112 127919 -16385 43569 -219443 236617 216300
12128 216300 -162985 -237022 188424 -114290 -17492 -144567 126865 -57892 -8020 -240441
12118 -240441 89302 69102 -59114 128276 -38149 269494 -217963 -89681 98581 42875 -28611
12106 -164567 277224 -219743 -78662 -91641 -268371 -46477 -42882 -205853 -65052 -75932 137707
$$ packed form
12183G2604K76122j67249l6334l2574f1206j15974C12110R3154A61733J83417
12173C45150A67412M0556I2971K35803R3581F0177f7206B39611c792C68721C5148
12161B38079r4452E0437J6139F989g2548A64352o9381k4151J15471a44018A55263
12149a4440j74371A41785a72421B26061b40331a17196F6981J43393a9831j89311
12139b09142R0059j00831d4793E7392i0112A27919a6385D3569b19443B36617k0317
12128B16300a62985p4037A88424a14290a7492j27075A26865e7892h020k32421
12118b40441H9302k0200e9114A28276c8149B69494b17963h9681I8581D2875b8611
12106a64567B77224b19743g8662j2979j76730d6477L595j62971f5052j0880A37707
$$ plain form
12094 62890 56805 93244 -80719 -57819 -8444 5746 39936 36193 -157950 -116554 -188881 -127833
12082 -127833 -32120 43120 -89171 -194156 -95618 -28463 52488 69958 214030 138861 41044
12070 158149 121666 -28124 316512 -115958 299277 410741 1190196 1334243 677621 170306
12059 -135728 -41239 -356791 -14796 255903 -152242 123299 109328 -103557 -281899 93846
12048 -323304 -315331 69118 61172 163539 184272 243356 -169140 86066 143561 -43105 89166
12036 -223673 246384 -23175 198052 156855 -60090 285499 -125629 59833 83193 71367 231994
12025 231994 -36538 24896 32921 180360 -61579 340843 -51642 -167878 6478 251434 -198243
12013 -317723 246172 136593 57636 -136648 -45025 310512 101091 -170525 114014 -141055
$$ packed form
12094F2890o085L6439h0719K2900h444E746L4190l743a57950M1396p2327O1048
12082a27833c2120D3120h9171j04985i5618b8463E2488J7470J44072p5169D1044
12070A58149l6483b8124C16512a15958B99277J11464P79455J44047o56622A70306
12059a35728d1239l15552a4796B55903a52242A23299j3971a03557j78342I3846
12048c23304P973F9118p946J02367K0733N9084a69140H6066N7495d3105H9166
12036b23673B46384b3175A98052m1197f0090B85499a25629E9833K3360j1826J60627
12025B31994c6538B4896Q025J47439f1579C40843e1642j16236F478K44956a98243
12013c17723B46172j09579E7636a36648d5025C10512A01091a70525A14014a41055
$$ plain form
12002 136310 -205495 -131356 79981 38170 4671 179282 -188455 -55402 62817 -213492 -71616
11990 -814 31845 -176906 -195919 53222 22163 -13019 -83680 -267681 -363152 -365625 186913 251720
11978 251720 -308048 43316 82193 -127708 -183815 9056 -107038 -80588 -24878 -278440 -127197
11966 110604 166750 274302 138778 155051 189603 -31190 309656 70511 -244869 -224387 -235947
11955 -235947 36667 -42250 -174801 -126369 -11540 -73712 -142164 -54333 -433812 -285898 -140352
11943 197023 -97061 -5212 -482958 79914 60881 -253137 380074 70892 -161534 71755 -7933
11931 -16346 -153542 60754 -232997 2747 -187938 -50480 85202 -78272 -230560 108467 -28304
11919 -97960 -272022 -293510 84695 -5200 316056 318931 52084 203916 -91876 250694 83964
$$ packed form
12002A36310b05495P4139G9981C8170D671J74611a88455e5402F2817b13492g1616
11990h14C1845a76906j9013E3222B2163a3019p0661j84001r5471k473A86913O4807
11978B51720c08048D3316L8877a27708n6107I056a07038K6450b4878k53562a27197
11966A10604N6146J07552j35524J6273L4552c1190C09656G0511b44869K0482j1560
11955b35947C6667d2250j32551M8432a1540o2172o8452e4333l79479J47914a40352
11943A97023i7061e212m77746G9914j9033b53137C80074G0892a61534G1755g933
11931a6346j37196F0754b32997B747a87938e0480H5202g8272j52288A08467b8304
11919i7960j74062k1488H4695e200C16056K875E2084J51832i1876B50694H3964
$$ plain form
11907 -40774 298598 -142086 -96716 -3492 154130 -125763 -292083 -209802 77000 -129305 -99669
11896 -99669 -299172 191274 44423 -30376 -30432 -130402 -805 -12999 -167604 28367 178826 -53282
11883 49831 -334995 151861 -434822 1978 287714 -195230 -38559 102446 -220139 -34651
11872 -176898 -286356 -98428 107656 122252 6327 134574 -11999 -106171 -123265 -77659 -232809
11861 -232809 193028 296784 154796 -23966 -42814 -78139 28901 29320 265531 47487 21072
11849 -14955 40240 6793 171945 -78403 94741 -35300 -126882 -179459 -25949 -309056 263967
11837 -144458 90507 181059 -414007 -70849 -19291 88753 67268 -219950 -53675 -345448 -153254
11825 -420331 -95653 -208313 -152750 -219785 265192 305379 181069 64003 23504 -38088 -92216
$$ packed form
11907d0774B98598a42086M5370c492A54130a25763j66320Q2281G7000a29305K9636
11896i9669j99503A91274D4423c0376n6r9970h05j2194j54605B8367J50459e3282
11883D9831c34995A51861d34822A978K85736a95230c8559A02446b20139c4651
11872a76898j09458i8428A07656J4596F327J28247a1999r4172j7094M5606j55150
11861b32809A93028J03756j41988b3966j8848l5325B8901M19K36211D7487B1072
11849a4955D0240F793J65152g8403I4741c5300r1582n2577b5949k83107B63967
11837a44458I0507R0552d14007g0849a9291H8753k1485b19950e3675k91773a53254
11825d20331i5653j12660N5563o7035B65192M0187j24310F4003B3504c8088n4128
$$ plain form
11814 -92216 -291611 293084 312866 30763 -204504 178188 -146077 228629 -176887 158528
11803 100797 186641 -238807 -12888 -3361 85235 196058 32622 118168 -32766 -79534 162761
11791 -204528 -8564 227935 -313216 -57091 234515 150015 -163919 22037 -233484 166624
11780 177704 -173930 71032 -426795 -271641 -292964 -147118 97688 -195893 -313633 -372252
11770 -372252 204921 -161153 385685 188125 46793 323688 -238197 47864 -77613 -99944
11760 -99944 229512 -24829 -75887 -214130 59158 69979 -40010 -247904 5151 -78217 42754
11748 33467 -16780 -167948 -426880 -213500 -214094 -312450 372062 -65889 348025 -204297 109938
11736 -103029 99857 66748 -166129 -376897 306459 -96012 24678 133030 -60989 -114904 -161592
$$ packed form
11814i2216j99395B93084J9782C0763b04504A78188a46077B28629a76887A58528
11803A00797Q5844b38807a2888c361H5235J10823C2622Q5546c2766m6768A62761
11791b04528h564B27935c13216e7091B34515q4500a63919B2037b33484A66624
11780A77704a73930G1032d26795J55154k1323J45846I7688a95893j17740n8619
11770c72252B04921a61153C85685A88125D6793K76895b38197D7864g7613k2331
11760i9944B29512b4829n1058j38243E9158J0821d0010k07894E151g8217D2754
11748C3467a6780j51168k58932K13380n94r8356C72062f5889C48025b04297A09938
11736a03029I9857l3109a66129k10768C06459i6012B4678J08352f0989n3915m6688
$$ plain form
11725 -161592 236032 -175540 -228053 117926 120861 111550 -200607 10188 -155561 -94803 31112
11713 -136133 148550 -291975 -168169 -64287 -85676 110121 -236076 223010 -210273 133153
11702 216915 136069 261733 -94592 83111 -3611 310582 -127511 -90468 230971 119222 -137252
11690 -27887 49147 -242673 227308 201599 19768 87044 334782 -75146 -84192 120594 184673
11679 184673 2804 280429 115379 94946 -125135 14453 64821 -76565 180143 24390 -54136
11667 89205 166095 141624 -4683 -160715 -122718 -212247 -19256 14225 2388 -22167 311178 104210
11654 -52887 308873 130901 121959 -57101 -112161 -80728 89918 118492 70392 -395898 58880
11642 227679 168042 -244418 36809 -281822 -135916 -310894 -99600 253021 244078 239460 69093
$$ packed form
11725a61592B36032a75540n2513A17926K935r311b00607A0188a55561O0758C1112
11713a36133A48550b91975J23806f4287k1389A10121b36076B23010b10273A33153
11702B16915q0846J25664i4592H3111c611C10582a27511L7043B30971j11749a37252
11690b7887D9147b42673B27308k5709A9768O7276K47738g5146r046A20594O4079
11679A84673B804K77625A15379k0433a25135A4453N0368g6565A80143B4390e4136
11667H9205P6890k4471d683j56032L7997q9529a9256A4225B388b2167C11178A04210
11654e2887C08873A30901q942e7101n5060L1433H9918K8574m8100c95898E8880
11642B27679n9637b44418C6809b81822a35916j74978i9600B53021q943m618F9093
$$ plain form
11630 -300839 45799 -51553 231106 127212 -377453 -42973 90266 149887 -136451 184475
11619 176960 -928 28977 493986 281440 -170764 145218 193235 281930 -2376 -13784 35474
11607 163415 107680 -12583 77973 -90064 -236602 -97839 42457 -53577 -228971 5080 -102515
11595 82767 329706 298267 -257057 192439 86886 94325 2256 -10164 -18227 -79128 -63275 265739
11582 347544 -197639 12305 460936 210000 -33490 393479 167930 -21261 87712 297209
11572 297209 16919 155755 -293406 194454 -64604 -953 430319 -94593 -58037 -273278 128178
11560 -154938 76570 51679 215430 -292871 91523 -85702 -82997 -359451 144142 137819 -34175
11548 23038 -33219 68697 -186851 416248 -152398 14738 -185658 -131442 108790 4431 -11873
$$ packed form
11630c00839D5799e1553B31106j03894c77453d2973I0266N9621a36451A84475
11619A76960i28B8977M65009k12546a70764A45218M8017Q8695b376j1408C5474
11607A63415n5735a2583G7973i0064j46538i7839D2457e3577j75394E080a02515
11595H2767K46939l1439b57057A92439H6886P439B256a0164q063o0901J5853B65739
11582C47544a97639A2305M48631B10000c3490C93479A67930b1261H7712K09497
11572B97209A6919J38836b93406A94454f4604i53D30319i4593L6556k15241A28178
11560a54938G6570k4891J63751b92871I1523h5702K705k76454A44142o323c4175
11548B3038c3219F8697a86851D16248a52398A4738a85658N4216A08790D431a1873
$$ plain form
11536 -184889 94844 66834 -138278 152465 -151792 145712 110676 -32440 126352 78499
11526 78499 186282 90914 -117877 360229 -122873 220022 320595 -69043 12778 173430
11516 173430 392564 252719 -148807 174310 44625 137357 48316 99065 372070 -103346
11505 214624 443775 -10462 32226 321118 -75531 228075 74354 139608 -144954 234117
11494 -45523 371334 -24310 10311 373527 291760 206010 65801 6566 41748 135536 106172
11483 106172 64921 100008 163549 74810 219755 157421 32098 32882 225349 239602 -77572
11471 172166 441103 -116023 217211 174559 151859 100284 6056 -99375 171237 15898 82462
11460 82462 151395 172447 272035 -251125 75006 230834 46320 86873 233731 487249 257445
$$ packed form
11536a84889I4844k8010a38278A52465a51792A45712l5036c2440A26352m7853
11526G8499J07783I0914a17877C60229a22873B20022J00573f9043A2778J60652
11516A73430K19134j39845a48807A74310D4625R2732D8316N0749K73005a03346
11505B14624K29151a0462C2226K88892g5531B28075G4354O5254a44954B34117
11494d5523C71334b4310A0311L63216q1767q5750F5801F566L5182R3788k9364
11483A06172m1251L5087O3541G4810J44945o2334C2098P84J92467J4253g7572
11471A72166K68937a16023B17211m2652k2700n1575F056i9375A71237A5898O6564
11460H2462O8933K1052R9588b51125G5006J55828D6320M0553J46858K53518k29804
$$ plain form
11449 257445 -247160 -106142 378650 207571 -96803 -118038 18120 -63146 -77554 -119447 283720
11437 -35806 -278510 59977 84816 402566 118860 9542 163228 -17594 -295997 -328873 -139258
11425 62068 194830 129986 133229 -69107 -56801 -120208 141752 -149904 -182484 -198040 291382
11413 -322634 48357 105066 52633 -202127 175475 105103 -49597 193891 77985 -277604 70843
11401 14108 62029 125384 134819 248915 140433 -159250 109026 45263 195329 -64220 -153160
11390 -153160 63854 -159826 9986 10174 113878 -29673 11813 -317970 4590 58552 -267556
11378 -131045 285721 -66654 82044 -205920 313050 132461 180878 155480 -101918 599 104398
11367 104398 -114907 245524 -235411 -83029 -17067 55746 266679 -63662 -51060 -175745
$$ packed form
11449B57445b47160a06142C78650j71079i6803k1235A8120f3146j4408m1893B83720
11437c5806k42704E9977K4839L17750A18860I542J53686a7594k78403l2876a39258
11425F2068J32762o4844L243f9107J2306o3407A41752a49904l2580j5556B91382
11413c22634D8357N6709n2433b02127A75475p0372d9597A93891G7985b77604G0843
11401A4108M7921O3355R435J14096j08482a59250A09026D5263J50066f4220q8940
11390a53160F3854a59826I986J88J03704b9673A1813c17970D590N3962b67556
11378a31045B85721f6654H2044b05920C13050A32461M8417k5398a01918E99J03799
11367A04398a14907B45524b35411h3029a7067E5746K10933f3662J2602j24685
$$ plain form
11357 -175745 -213443 -55614 -472542 148333 186686 -79241 474067 15993 -34323 -354728 55704
11345 15141 23125 -66090 95385 -7519 -100693 -30790 223657 -181477 73635 -81308 -102282 8483
11332 -203091 155041 96439 86709 -286276 -99522 83771 -121798 -131818 23512 29252 76840
11321 76840 -226151 -24376 155429 134541 -159006 385983 190555 -84611 213280 -262582
11310 87935 52028 61758 -333900 -306895 -48396 -26167 -119513 23642 3606 -35502 -26440 -321885
11298 -321885 233646 150136 -275921 62044 -17694 -107862 -138232 260039 -400166 342398
11287 -201221 -235798 90752 -125138 -200363 220463 -37476 -241023 -27743 172517 232585 94060
11275 -1503 3561 -199314 -105393 103421 -130664 6043 -28841 -141105 43127 58548 -34252
$$ packed form
11357a75745l7698e5614m16928A48333L8353g9241D74067A5993c4323l20405E5704
11345A5141P984f6090I5385g519r3174c0790B23657a81477G3635h1308k0974H483
11332b03091A55041n8602r730b86276i9522H3771a21798j0020B3512N740M7588
11321G6840b26151b4376A55429k0888a59006C85983A90555h4611B13280b62582
11310H7935l5907R730c33900K7005d8396K2229r3346B3642C606c5502R062k95445
11298c21885B33646q3510b75921F2044a7694r0168l0370B60039d00166C42398
11287b01221l4577I0752a25138p5225B20463c7476k03547b7743A72517O0068I4060
11275a503C561a99314R3921A03421a30664F043b8841j12264D3127J5421c4252
$$ plain form
11263 163695 -169006 -5860 391923 -77250 -170511 94954 109015 26420 200765 -117461 -90413
11252 -90413 -224704 56607 41254 -65852 334216 -155770 9188 -177105 -354716 -21979 -51115
11241 -51115 -177549 -350172 -150329 106035 183044 -102188 -149468 55159 -359210 39368
11230 134470 -241740 2710 279203 29258 -94663 196069 -3318 46610 -49710 121654 -95394
11218 -73771 40356 -168483 -10233 -45265 -84155 10235 141200 153642 132248 -44937 104 133803
11206 133803 -161036 -345383 153892 -424477 -49440 -21662 -62508 67469 224334 -130903
11195 -86889 -11095 -146831 -203147 -67351 14240 -36804 167581 -46305 219646 -68494 -184236
11184 -184236 96258 -3228 74339 30742 -39052 96515 23319 48171 49913 -219582 524673
$$ packed form
11263A63695a69006e860C91923g7250r3261I4954J4061B6420J74345a17461K7048
11252i0413j34291E6607j5353f5852C34216a55770I188a77105j77611b1979k9136
11241e1115j26434j72623a50329A06035P7009a02188m7280E5159c59210C9368
11230A34470b41740B710K76493B9258i4663A96069c318D6610d9710A21654i5394
11218g3771D0356a68483a0233l5032l8890A0235J30965J2442k1394d4937A04J33699
11206A33803a61036j84347A53892d24477d9440b1662m0846F7469J56865a30903
11195h6889a1095j35736n6316f7351A4240c6804A67581d6305B19646f8494j15742
11184a84236I6258c228G4339C0742c9052I6515B3319K4852J742b19582E24673
$$ plain form
11172 -84749 -278030 -46783 34288 15736 -43166 -351414 -101612 -196813 -241843 10340 -75646
11160 44131 -166059 27942 47687 173508 -104140 109514 10624 36440 204318 -123606
11149 76663 117793 142404 132437 73452 245284 71433 -59046 -56835 73644 -321179 155529
11137 -177286 137213 339673 61802 215773 -222299 425568 101509 -304990 198949 -142922
11126 -296650 294595 -211116 -14890 250401 27494 30690 -246873 -23610 -169303 100450
11115 -3848 -72746 123710 -103310 -1027 67005 35076 -177064 -93084 56283 -137513 226901
11103 160517 -450732 32111 -51210 161823 114729 -239799 -116880 75921 195236 264470
11093 264470 -188083 -88518 -226133 -213792 -160743 369314 10958 304943 2057 49291 307580
$$ packed form
11172h4749j93281d6783C4288A5736d3166l08248a01612r5201m5030A0340g5646
11160D4131a66059B7942J9745J25821a04140A09514A0624K5816J67878a23606
11149G6663M1130K4611r967n8985J71832G1433e9046K211G3644c21179A55529
11137a77286A37213K02460F1802J53971b22299D25568A01509c04990A98949a42922
11126b96650B94595b11116a4890B50401B7494L196b46873b3610j45693A00450
11115c848o8898A23710a03310a027F7005l1929a77064Q3980E6283a37513B26901
11103A60517d50732C2111e1210A61823m7094b39799a16880G5921J19315O9234
11093B64470a88083h8518j37615J2341N3049C69314A0958K93985B057M7234K58289
$$ plain form
11082 307580 115245 299862 249741 224348 318854 260997 345475 560017 328606 304070 199738
11071 199738 288175 168909 189392 301467 -8504 57606 609932 279607 363037 411656 315692
11060 315692 450080 519625 467214 464226 492512 359358 557920 399621 443001 983773 309971
11048 444668 733905 883404 732064 743731 417196 917566 534092 368045 751978 644973
11038 644973 787508 585970 616520 927937 713308 585861 731863 372926 784716 701223
11028 701223 792881 779713 463121 980977 682278 576366 666905 635274 455669 734796
11018 734796 604076 446337 685168 512661 715493 520064 358296 625513 479594 403319
11008 403319 515550 589238 442568 600102 531944 660940 464597 839837 795268 524449
$$ packed form
11082C07580A15245J84617n0121k5393R4506n7857Q4478K14542k31411k4536j04332
11071A99738Q8437j19266K0483J12075h504E7606N52326B79607Q3430M8619r5964
11060C15692J34388O9545n2411k988K8286j33154J98562j58299M3380N40772C09971
11048D44668K89237J49499j51340J1667l26535N00370l83474j66047L83933j07005
11038F44973J42535k01538L0550L11417k14629j27447J46002l58937M11790q3493
11028G01223R1658j3168l16592N17856k98699j05912R0539l1631j79605K79127
11018G34796j30720j57739K38831j72507K02832j95429j61768K67217j45919p6275
11008D03319J12231P3688j46670J57534o8158J28996j96343L75240m4569k70819
$$ plain form
10998 524449 569726 447396 695155 339701 707594 390021 753515 633788 769285 452378
10988 452378 773897 472092 715650 952184 1036713 985184 994679 1078563 1208785 1108530
10978 1108530 1259275 1591595 1750339 1857791 2236301 2323548 2283781 2564375 2464073 2476571
10968 2476571 2226717 1980755 1710410 1623812 1316999 1256455 1261895 1160429 1718081 1296180
10958 1296180 1606744 1803237 1397126 1366596 1264257 876215 1088924 686415 614685 701839
10948 701839 470940 532700 58361 354993 246243 412833 53310 144196 204 183963 57832
10936 199439 -124522 234832 -66812 -252831 -249237 352935 57788 25881 2113 144332 169129
10925 169129 143305 178680 236008 -20155 67594 207597 75669 266757 -99265 84607 -112063
$$ packed form
10998E24449M5277j22330K47759C39701L67893l17573L63494j19727J35497l16907
10988D52378L21519l01805K43558K36534Q4529n1529R495Q3884J30222j00255
10978A108530J50745L32320J58744J07452L78510Q7247l9767K80594j00302J2498
10968B476571k49854k45962k70345q6598l06813o0544N440j01466N57652m21901
10958A296180L10564J96493m06111l0530j02339l88042K12709m02509p1730Q7154
10948G01839k30899O1760E8361K96632j08750J66590E3310R0886B04J83759E7832
10936A99439a24522B34832f6812j86019L594C52935E7788B5881B113J42219K4797
10925A69129k5824L5375N7328b0155F7594J40003G5669J91088i9265H4607a12063
$$ plain form
10913 50110 60342 410559 -239351 134023 -37475 239727 188997 47959 -19861 307787 241950
10902 241950 34853 -189224 138643 -184579 -96206 148293 48029 -64498 -131671 76249 133089
10891 133089 -78386 256191 -399627 479327 -236969 182433 257266 -246478 -149349 335814
10880 -341691 -202933 -227751 -27858 -148600 152220 -46238 -127086 93290 41556 -54743 277929
10868 63931 -28933 -318504 -137465 154194 -131203 -101762 -266612 -293988 224740 -253259
10857 86317 234484 41929 94599 -21849 271198 59307 110410 -171773 104066 41770 55080
10846 55080 98560 1358 136081 140684 154144 -110993 -85395 -75445 109924 -12300 -103558 -141129
10834 -141129 -17113 309245 -144018 -197343 -26119 8763 155651 -75923 26785 70662 102451
$$ packed form
10913E0110J0232L50217b39351A34023c7475B39727n0730D7959a9861C07787o5837
10902B41950C4853a89224A38643a84579Q8373A48293D8029f4498o7173G6249N6840
10891A33089g8386B56191c99627D79327b36969A82433P4833b46478R7129C35814
10880c41691J38758k4818b7858j20742A52220d6238q0848I3290D1556e4743B77929
10868F3931b8933k89571a37465A54194a31203K9441j64850k7376B24740b53259
10857H6317J48167D1929N2670b1849B71198E9307N1103a71773A04066D1770J3310
10846E5080M3480A358J34723M603J3460a10993K5598R950A09924a2300r1258l7571
10834a41129a7113C09245a44018n3325b6119H763J46888g5923B6785M3877L1789
$$ plain form
10823 102451 -350432 253958 -112258 34887 -286194 -345066 -274062 -107114 -281478 -56279
10812 -443454 -2716 44914 -137815 -12544 -73119 -91193 -24575 -10552 -193334 -109801 204317
10800 6257 -244895 231870 -2335 -126149 -335851 -41573 -49763 -102383 38852 250736 -205535
10788 -21531 96403 16885 44280 -156868 -90830 -217807 -248840 -10327 153337 -71166 -81442
10777 -81442 170233 -144534 -190831 -110585 -18466 -155535 13049 -132200 -121209 -153219 -229048
10766 -229048 -222008 358611 -31595 28432 170056 -90936 48504 -258720 -127511 57374 2670
10754 181297 -284689 258728 226784 -53249 -166672 177509 -4242 -323475 -82937 -18155 -25612
10743 -25612 -191348 -265672 126387 29047 26218 -7834 -206434 44801 -42452 166286 39829
$$ packed form
10823A02451c50432B53958a12258C4887b86194n8872P1004a07114j74364e6279
10812d43454b716D4914a37815a2544o0575j8074b4575a0552j82782Q3533B04317
10800F257b44895B31870b335j23814k09702d1573q190n2620C8852K11884b05535
10788b1531I6403A6885K7395a56868O6038j26977l1033a0327A53337g1166j0276
10777h1442A70233a44534m6297Q0246a8466j37069A3049a32200J0991l2010p5829
10766b29048P040C58611c1595B8432J41624i0936D8504b58720a27511E7374B670
10754A81297b84689B58728l1944e3249j13423A77509d242l19233h2937a8155p457
10743b5612j65736p4324A26387B9047k829g834j98600D4801d2452A66286C9829
$$ plain form
10731 -181790 99352 43868 -365213 -175660 -111572 -250711 -339363 -263378 84357 -269775 75858
10719 -147956 -460327 131599 -4360 318111 -84062 188715 -51746 41221 -295751 -92766 9894
10707 95068 -128491 -209973 72843 252118 -79081 43370 -323200 -377784 233639 128698 113935
10696 113935 -159399 -12202 -62242 -12875 -300461 -117632 -163666 -125525 65668 -8856 -171356
10685 -171356 -67737 -31407 -146450 -42548 79060 -78009 -83231 -33773 52011 149819 213599
10674 213599 6853 45318 4296 -34004 -79 -15178 -1358 122427 160941 46407 61972 -284337
10661 -71787 64145 -463883 -40648 250266 1161 34495 -135258 -178858 -106252 57355 -82419
10649 -28455 57181 19895 -124903 -70413 71579 -118488 -99092 -111436 -175388 -13993 -253471
$$ packed form
10731a81790I9352D3868c65213a75660O4088j39139q8652P5985H4357b69775G5858
10719a47956l12371A31599d360C18111h4062A88715e1746D1221b95751i2766I894
10707I5068a28491q1482G2843J79275g9081D3370c23200n4584B33639j04941j4763
10696A13935a59399a2202n0040a2875k87586a17632m6034L8141F5668h856j62500
10685a71356f7737c1407j15043d2548G9060g8009n222c3773E2011R7808O3780
10674B13599F853L8465D296c4004g9j5099a358A22427L8514D6407J5565b84337
10661g1787F4145d63883d0648B50266A161L3334a35258m3600P2606E7355h2419
10649b8455E7181A9895a24903N4490G1579a18488J9396j2344o3952a3993k39478
$$ plain form
10638 -253471 -102998 -51538 -39547 -38082 -83040 157145 -412 293863 -99504 -144115 -21124
10626 159934 19736 -180960 -116174 17942 -125422 -199303 -104001 -114697 149054 -121982 -114794
10615 -114794 -28943 127153 -223782 15295 -44802 103699 263694 141329 108812 202196
10605 202196 55216 -99187 -135394 66413 250032 -8878 187507 -92074 -282760 -125454 -171022
10594 -171022 -102034 -17051 -35580 5913 188145 240052 -151874 -117756 142312 227167 209539
10583 209539 -20114 134335 -90438 -48811 -64491 202098 -178707 252350 116112 -73910
10572 -234553 -198244 -105606 6605 56296 -181352 -21023 -295113 -42877 -63017 -84840 132024
10560 11845 41918 16797 134372 19090 170139 107345 242177 106469 -198150 106214
$$ packed form
10638b53471a02998N1460J1991J465m4958A57145d12B93863i9504m4611b1124
10626A59934A9736a80960O4786A7942a25422p3881R5302j0696A49054a21982P188
10615a14794b8943A27153b23782A5295d4802A03699J59995j22365l2517R3384
10605B02196E5216i9187l6207F6413J83619h878A87507i2074j90686a25454m5568
10594a71022O8988a7051j8529E913J82232N1907a51874L4118A42312Q4855j7628
10583B09539b0114A34335i0438M1627j5680B02098a78707B52350A16112g3910
10572b34553L6309R2638F605M9691a81352b1023k74090d2877k0140k1823A32024
10560A1845L0073A6797J17575A9090J51049o2794J34832A06469a98150A06214
$$ plain form
10549 149430 -216228 -200295 16895 209783 61986 -107605 3778 185343 -238087 -145938 -82152
10538 -82152 -30431 -128901 9684 -271408 -180759 -123613 -173169 -264245 128844 -254618 -211269
10527 -211269 10901 84241 -149781 -46232 -133406 191922 24683 -266466 -50056 -305642 -46546
10515 -133097 -292628 144276 -367429 235035 -200886 893 37754 788 266683 -59398 -164701
10504 -164701 -260805 112687 -196504 238296 32386 304620 21350 -361352 -193922 45975
10493 -115536 333975 -89569 121243 -356952 42306 82996 45429 12404 -59882 228003 518976
10482 518976 301651 400801 509060 500299 301100 -87578 -129329 -115448 -197132 -329120 -81178
10470 75839 -247878 395447 65229 138617 165500 -69412 -24972 -16879 -129643 115547 -337194
$$ packed form
10549A49430b16228J5933A6895J92888F1986a07605C778J81565b38087R2149O3786
10538h2152c0431r8470I684b71408R0649N7146m9556r1076A28844b54618M3349
10527b11269A0901P3340a49781d6232q7174A91922B4683b66466e0056k55586d6546
10515a33097j59531A44276c67429B35035b00886H93L6861G88K65895e9398j05303
10504a64701r6104A12687a96504B38296C2386K72234B1350c61352J67430D5975
10493a15536C33975h9569A21243c56952D2306M0690l7567A2404e9882B28003K90973
10482E18976k17325R9150J08259q761j99199h7578m1751J3881q1684j31988h1178
10470G5839b47878C95447F5229P3388K6883f9412b4972Q093j12764A15547c37194
$$ plain form
10458 71655 221527 -83045 220826 182750 84780 -35110 -21077 21681 -238772 -177406 -122958
10447 -122958 337129 36605 -135656 45196 52172 292578 -48526 -181307 13010 60252 54755
10436 54755 5588 -462258 -126026 -160812 -121437 194449 188402 280799 120726 -223395 15691
10424 24109 14677 -233267 376663 -60854 9039 -244569 105914 -5424 -40146 -21044 -5208 227915
10411 -65612 122476 -67203 -256761 -28866 239976 -99556 -234909 -22526 88702 -135239 -205249
10400 -205249 -42574 49918 25348 -254403 -150288 73649 8266 -18747 -115417 340197 124098
10388 106517 -173001 300977 171294 -224792 -626 -411222 41060 33756 198274 108853 254483
10377 254483 249465 -105336 199047 206339 145069 308584 217405 155968 486479 284696 413185
$$ packed form
10458G1655J49872h3045B20826l8076H4780c5110J4033B1681b38772O1366N4448
10447a22958C37129C6605a35656D5196O976K40406d8526j32781A3010M7242n497
10436E4755E588d62258a26026l4786L9375A94449o047R2397A20726b23395A5691
10424B4109r432b33267C76663f0854I039b44569A05914e424l4722J9102e208B27915
10411f5612A22476f7203j89558b8866B39976i9556j35353b2526H8702a35239p0010
10400b05249d2574D9918k4570b54403J04115G3649H266a8747r6670C40197A24098
10388A06517a73001C00977j29683b24792f26m10596D1060p304J64518q9421J45630
10377B54483n018a05336A99047P292o1270J63515r1179o1437L30511k01783J28489
$$ plain form
10366 413185 257401 224719 291025 292474 -164406 24442 372819 -15398 3503 193535 227538
10355 227538 329395 107453 149248 538366 172712 182459 -90676 -170586 335271 -92641 87478
10343 512091 671029 166480 259548 363512 221165 115543 369962 307438 156402 209781
10333 209781 192172 30256 12219 -209696 -243877 273370 -132187 -250509 -108427 293809
10322 44928 304704 60314 257679 272001 -127204 203053 180200 144421 137261 -253808 -173672
10311 -173672 -36464 -48744 -67893 265578 -6979 -50831 -140630 -25701 62736 -266587 283788
10299 -188341 -145344 -85320 -309981 -110745 -157705 -207737 -109410 -94629 2853 111874 134726
10288 134726 268522 54175 402676 -101485 19593 -328559 135182 -203628 161114 -220384
$$ packed form
10366D13185j55784l2682O6306J449a64406B4442L48377a5398C503J90032L4003
10355B27538J01857A07453M1795L89118A72712R747i0676p9910C35271i2641H7478
10343E12091J58938A66480R3068J03964j42347j05622K54419o2524j51036N3379
10333B09781j7609C0256A2219b09696l4181B73370a32187j18322a08427B93809
10322D4928K59776F0314J97365J4322a27204B03053k2853l5779p160b53808Q0136
10311a73672c6464j2280j9149B65578f979m3852q9799b5701F2736b66587B83788
10299a88341M2997O0024k24661a10745m6960n0032R8327J4781B853J09021K2852
10288A34726J33796E4175L48501a01485A9593c28559A35182b03628A61114b20384
$$ plain form
10277 -130895 154265 219668 -253919 51793 249083 -133479 164766 -163437 79675 7093
10266 -82037 299377 377203 409167 -135069 277699 -4744 413822 136929 374846 227934
10256 227934 -159372 -86968 95860 -98687 103840 219382 -18934 58288 -129126 18930 -266334
10244 -3106 -88213 204524 -32190 -93403 -284944 -295003 422539 183460 3863 -184862 -303339
10233 -303339 189963 17552 -93112 -289873 15841 -54498 -10461 -268164 -394492 25176 24988
10222 24988 -139017 118640 -298166 -9394 -84887 129873 156269 -120295 -9400 94954 208653
10211 208653 -303172 -40954 101214 -147470 76612 -158342 -43013 -13593 -171762 -28316
10200 -193987 57577 316615 36950 -230822 324774 -377666 -273175 -254031 -60033 -261972
$$ packed form
10277a30895A54265O5403b53919E1793J97290a33479A64766a63437G9675G093
10266h2037B99377P7826L1964a35069B77699d744D13822A36929K37917j46912
10256B27934a59372P2404I5860i8687A03840J15542a8934E8288a29126A8930b66334
10244c106q5107B04524c2190o1213j91541j0059D22539A83460C863a84862j18477
10233c03339A89963A7552i3112j96761A5841e4498a0461k57703j26328B5176j88
10222B4988a39017A18640b98166i394p5493A29873K6396a20295i400I4954J13699
10211B08653c03172d0954A01214a47470G6612a58342d3013a3593j58169b8316
10200a93987E7577K59038C6950b30822C24774c77666J04491J9144f0033k01939
$$ plain form
10190 -261972 480 -179790 44517 88187 311844 -132129 8896 102735 112539 277142 -22117
10178 280510 -34657 -80461 -68248 -48693 -156144 74969 -203054 50001 -46888 -229287 209122
10166 129000 -22612 -77890 -48260 -96804 -283511 -103649 -190381 56382 -60889 -286516 -212498
10155 -212498 120338 -32927 -127714 -89582 82301 -88570 13687 -29189 -100667 -318443 -105934
10143 -184433 108764 133047 89119 -59120 276222 -175812 -264754 -140222 18562 -170305
10132 158415 -43888 -53823 -207851 457774 125714 -109747 -151590 91607 -88985 15859 83375
10121 83375 -328774 139723 -308221 207765 97362 -11599 -171593 -176091 9992 74462 6219
10109 -82221 -22161 122073 -211397 21337 -8622 -175240 68639 163980 -40416 -81298 -13575
$$ packed form
10190b61972D80a79790D4517M3670K23657a32129H896R3839R804J64603b2117
10178B80510c4657m5804J2213J9555j07451G4969b03054E0001d6888j82399B09122
10166A29000b2612n5278K9630m8544j86707a03649q6732E6382f0889k25627P4018
10155b12498A20338c2927r4787L8132H2301h8570A3687b9189p1478k17776a05934
10143a84433A08764K4283m3928e9120B76222a75812q8942J24532A8562a70305
10132A58415d3888r935j54028D57774A25714a09747m1843I1607h8985A5859O7516
10121H3375c28774A39723c08221B07765I7362a1599j59994m498I992O4470F219
10109h2221b2161A22073b11397B1337h622j66618F8639R5341d0416m0882a3575
$$ plain form
10097 41334 -70270 -50253 -178489 -9480 -223430 -51047 27246 -29379 -242474 -47950 -160117
10086 -160117 -181351 90231 44373 -163595 6120 -57818 163720 -179917 -45752 132801 150868
10075 150868 326797 31033 44161 85216 -312413 31477 -367673 -103526 -448388 -171255
10064 -335169 -132257 -84224 -96599 259855 -149260 19662 -61356 -76797 263454 -132665
10053 -217525 -68387 152188 -328523 151538 67014 -267228 446126 -70090 43378 106693
10043 106693 -41353 -93363 312667 -204936 -211743 -166738 -148980 -60950 214242 250894 5442
10031 -49635 -172907 -471429 -126589 11049 -84398 394769 -70997 9677 -92247 -287416 115881
10019 -56618 -22951 -183599 -114086 -80095 -70674 298089 86885 -140763 -98119 -1811 -92237
$$ packed form
10097D1334g0270K0017j28236i480k13950e1047B7246b9379k13095d7950j12167
10086a60117k1234I0231D4373a63595F120e7818A63720a79917d5752A32801J8067
10075A50868J75929C1033J3128M1055c12413C1477c67673a03526l44862a71255
10064c35169a32257M8033j2375B59855a49260A9662f1356j5441B63454a32665
10053b17525f8387A52188c28523A51538F7014b67228D46126g0090D3378O3315
10043A06693d1353n2010C12667b04936o807M5005J7758f0950B14242L6652E442
10031d9635j23272k98522a26589A1049h4398C94769g0997I677i2247j95169A15881
10019e6618b2951j60648O9513L3991R421B98089H6885a40763M2644a811r0426
$$ plain form
10008 -92237 -221326 -373773 -300660 60845 29246 111555 -281043 -146213 158014 -51598 267873
9996 -133056 -109367 113256 -52415 228579 -27822 -167958 -105824 -282220 64613 -2727 -84774
9985 -84774 274809 -201546 10866 51714 42151 -59037 156918 91212 -158066 -281400 -96852
9973 72308 -142634 -75802 -114897 105637 -127922 -255423 78703 35555 -70171 143935 2469
9961 -207501 -154545 -68441 15741 -76897 386286 -193516 84863 -243883 -114996 -189126 36590
9949 12310 -358559 -303143 -74557 110561 -272649 160309 26786 -337591 139336 -83848 -78389
9938 -78389 -58375 68380 -79689 -340556 -190757 -350871 8223 -88345 40259 -215991 -273676
9927 -273676 -196744 -54551 -230538 129879 -382411 -139554 152882 151297 -210929 33934 -133987
$$ packed form
10008i2237j29089j52447P3113F0845B9246Q2309b81043J34830A58014e1598B67873
9996a33056K3689A13256e2415B28579b7822j40136O2134j76396F4613b727q2047
9985h4774B74809b01546A0866M0848r563e9037A56918o5706a58066j23334i6852
9973G2308a42634O6832l9095A05637a27922j27501G8703C5555g0171A43935B469
9961b07501N2956f8441A5741g6897C86286a93516H4863b43883a14996p4130C6590
9949A2310c58559N5416g4557A10561b72649A60309B6786c37591A39336h3848N459
9938g8389K0014F8380g9689k60867J49799j60114H223h8345D0259b15991n7685
9927b73676P6932e4551j75987A29879c82411a39554A52882j585b10929C3934a33987
$$ plain form
9915 -148580 -20533 -70539 -86517 61702 -113677 -308658 -90555 -30540 -335875 -7990 -205177
9904 -205177 -14146 -288815 115712 83508 -12241 -12639 -162623 -215351 14059 -297734 115062
9892 -61445 -83302 -321424 -124625 -32887 -279426 -357981 28883 189052 339785 -94738 -61251
9881 -61251 -193687 -256915 155320 -259293 358431 44083 185836 -175793 32902 -201282
9870 46700 -193378 278118 -142694 25765 -268401 -50814 -312953 254499 -523064 120472
9859 105021 205820 16604 -228764 50889 -197300 -103625 -99198 -80120 79280 -48841 72860
9847 -386836 -121776 -86402 12200 -159440 -386220 -11216 -132428 -289733 214431 260490
9837 260490 -129993 7328 7428 397790 -127646 -111234 29264 27730 -106927 27903 -242945
$$ packed form
9915a48580b0533n0006j5978F1702a13677j94981i0555c0540l05335g990j97187
9904b05177a4146k74669A15712l2204a2241l98j49984n2728A4059b97734A15062
9892f1445k1857k38122a24625c2887k46539p8555B8883J60169J50733i4738L3487
9881f1251j32436o3228A55320b59293C58431D4083J41753a75793C2902b01282
9870D6700a93378B78118a42694B5765b68401e0814k62139B54499e23064A20472
9859A05021J00799A6604b28764E0889a97300R3675M427J9078G9280d8841G2860
9847c86836a21776L5374A2200a59440k26780a1216j21212j57305B14431M6059
9837B60490a29993G328J00L90362a27646J6412B9264j534a06927B7903b42945
$$ plain form
9825 -364723 -3667 -48098 -115829 -72060 96139 84372 -82756 20776 -381330 229324 -53391
9813 -61041 135258 87571 -43273 249227 112413 60340 208208 -396928 -45012 -8764 353475
9801 -259419 -73226 287220 -83026 -131704 -112243 -3855 -104291 180103 -91648 -2729 -232671
9790 -232671 272177 -72438 -171534 23096 -64513 -35859 130297 -38188 -235663 309183 -181920
9778 151590 -68861 884 -211391 92570 -126052 40200 -105376 107535 99855 -112758 -73257
9767 -73257 97863 -162040 78094 173695 -37466 5070 -218330 74358 -17009 -76132 94289 71481
9755 71481 -365452 -131384 -103165 131172 -334954 -385172 -215625 457943 -335343 -148018
9744 190409 -268389 95235 237134 -165599 -196862 -51209 61867 -185055 229264 -42585 -252732
$$ packed form
9825c64723c667m4431o7731M3769I6139j1767h2756B0776c81330B29324e3391
9813f1041A35258m7687d3273B49227A12413n2073J47868c96928d5012h764C53475
9801b59419g3226B87220h3026m8678J9461c855j00436A80103i1648b729k29942
9790b32671B72177g2438r9096B3096f4513K8654A30297c8188j97475C09183a81920
9778A51590f8861H84b11391I2570a26052D0200a05376A07535p680a12758L9501
9767g3257I7863a62040G8094R5601c7466E070b18330G4358a7009n9123I4289k2808
9755G1481c65452a31384K8219A31172c34954n0218J69547D57943c35343a48018
9744A90409b68389I5235J41899a65599l1263e1209F1867a85055B29264d2585k10147
$$ plain form
9733 -252732 -202130 349005 -435324 -30632 131511 18756 77445 -225217 -148905 -178957 -257412
9722 -257412 137428 11820 -77148 -169134 431320 -44897 -352511 -112676 -148305 67669 -314908
9710 -461139 87773 -75828 -135345 360688 -209999 -7796 51054 -261553 -43988 -96436 -55449
9699 -55449 134934 185627 151033 -238461 170411 -8474 -320114 -151271 -380538 -29693 -127799
9688 -127799 10454 310812 56234 -105643 -61728 -294414 167291 -314113 -60813 -181337
9678 -181337 -135543 1688 -152742 71312 -119789 79755 -223348 -61359 -110188 -134723 136675
9666 180381 -51723 -308896 -243832 -256206 213176 -13791 -144126 40389 -112286 -256037 -37649
9654 -243018 -70529 -150714 -236884 -3969 -90538 -95980 142594 200067 48338 42863 -92088 -203677
$$ packed form
9733b52732N0602C49005d35324c0632A31511A8756N8689b25217P6312l0052p8455
9722b57412A37428A1820g7148r1986D31320d4897l07614a12676l5629F7669c14908
9710d61139H7773g5828n9517C60688b09999g796E1054b61553d3988n2448M0987
9699e5449A34934N0693l4594b38461A70411h474l11640a51271k29267b9693r8106
9688a27799A0454L00358E6234a05643M3915k32686A67291c14113f0813j20524
9678a81337M5794A688a52742G1312a19789G9755b23348f1359m8829k4535A36675
9666A80381e1723k57173O5064j2374B13176a3791j30335D0389a12286j43751c7649
9654b43018g0529q0185q6170c969q6569n442A42594N7473D8338n475i2088j11589
$$ plain form
9642 -203677 12606 39550 -152240 119490 -313248 24990 82236 34922 -300166 82406 -248943
9630 -25942 264121 -97718 -57880 331672 -163797 -400477 -201931 -238402 226240 148416 -30124
9618 95490 -380495 -171895 -56295 2286 -257213 2845 142717 -224886 79974 9887 -156538
9606 -47197 83643 -113134 32195 147939 -3927 -84724 -128215 -104732 15130 16412 23565 -338506
9593 -110780 -366762 125052 -271252 88000 259166 -185598 257427 132332 63798 -172995
9582 140103 -87553 -21490 -390150 18927 -324778 117797 -18280 2933 28364 89118 -94645
9570 -291353 180393 -159757 192283 -111877 86472 -165317 -292620 57108 53994 133505 -286848
9558 127559 -512769 75519 38438 -88040 -51539 -202034 -574394 133094 -36692 -141715 -127513
$$ packed form
9642b03677A2606K6944a52240A19490c13248B4990N7246C4922c00166H2406b48943
9630b5942B64121i7718L9838C31672a63797k36680J98546l6471B26240p7824c0124
9618I5490c80495a71895e6295B286b57213B845J39872b24886G9974I887a56538
9606d7197H3643a13134C2195J15744c927q0797m3491K3483A5130J282P153c38506
9593a10780k55982A25052b71252H8000J71166a85598B57427j25095F3798a72995
9582A40103h7553b1490l68660A8927c24778A17797a8280B933K5431O0754i4645
9570b91353A80393a59757A92283a11877H6472a65317j27303E7108l114P9511b86848
9558A27559e12769G5519l7081h8040L6501j50495l72360A33094c6692j05023J4202
$$ plain form
9547 -127513 85179 -220115 -267541 -16091 -242292 -9991 260406 -346865 -8784 -40631 -295383
9536 -295383 -51936 -158008 -205893 21671 -155072 -135498 215445 -242033 -304932 -17352 7298
9524 5861 320899 -5511 14341 -446589 -391189 -189635 -63329 -245364 175730 -412173 -193058
9512 6806 -190281 149219 246249 -21471 -13758 -31616 -39499 -155678 -65492 22083 -177301 -199757
9500 -199757 15019 -204670 -358440 -25988 -145170 -21091 -295974 85234 -218066 6222 72933
9489 72933 158297 -53168 38316 -101523 184733 -161621 -268525 -223518 139994 184740 -27711
9477 -233516 -192381 -130399 -34243 120610 -169974 16830 -271105 -170875 226419 -69649 -134585
9466 -134585 293400 57860 209376 96308 -95238 -146118 -130577 127096 188636 -204762 203466
$$ packed form
9547a27513H5179b20115m7426a6091k26201i991B60406c46865h784l1847k54752
9536b95383e1936j06072m7885B1671a55072J9574B15445b42033o2899a7352G298
9524E861L15038e511A4341d46589N5400a89635f3329j82035A75730d12173a93058
9512F806a90281A49219R7030b1471P713j7858p883j16179f5492B2083a77301k2456
9500a99757A5019b04670j53770b5988j19182b1091k74883H5234b18066F222O6711
9489G2933Q5364e3168C8316a01523A84733a61621j06904M5007A39994M4746b7711
9477b33516M1135O1982c4243A20610a69974A6830b71105J00230B26419f9649o4936
9466a34585B93400E7860J51516I6308i5238n0880J5541A27096O1540b04762B03466
$$ plain form
9454 -3905 -259896 -42027 -142588 153802 217418 -205769 -174343 -74836 -120351 -211422 57926
9442 -284464 -90010 35241 -309336 -308839 267631 -442705 -122005 -143475 45100 -273764 2424
9430 68787 -88364 -489966 65985 206370 -120975 -254114 -117706 -195093 -7558 -306722 -217966
9419 -217966 281696 -240963 -250767 3542 -41095 -271793 30386 -624885 148544 -93323 -177060
9408 -177060 128143 -208546 -56035 69517 40752 43193 -316400 -111801 -135804 -241693 -194724
9397 -194724 196498 16778 -97599 223702 -76970 76871 -92445 -42535 190212 -209652 -86767
9385 -140942 -154906 -103954 80337 -157469 247214 141156 -234506 -31854 -276247 -5566 -223998
9374 -223998 -103756 -158455 -257883 113941 -400398 -149566 -278850 53259 151337 98894 156161
$$ packed form
9454c905k55991d2027j00561A53802O3616b05769L1426g4836m5515r1071E7926
9442b84464i0010C5241c09336M97B67631d42705a22005k1470D5100b73764B424
9430F8787h8364m01602F5985J40385a20975j33139a17706p7387g558k99164Q8756
9419b17966B81696b40963r804C542d1095k30698C0386f24885A48544i3323q3737
9408a77060A28143b08546e6035F9517k8765K441c16400a11801k4003j05889M6969
9397a94724A96498A6778i7599B23702g6970G6871i2445d2535A90212b09652h6767
9385a40942j3964N0952H0337a57469B47214j06058b34506c1854k44393e566k18432
9374b23998a03756n4699r9428A13941d00398a49566j29284E3259R8078n2443N7267
$$ plain form
9363 156161 -54221 83777 -6694 -94865 -44159 138864 -132078 -17211 -13440 -8651 -202664 25131
9350 -93265 -106255 -324228 -609534 225415 -33226 -6165 10523 -300563 116171 126005 -18432
9338 88280 158518 -61960 125823 133827 -333768 92143 -172620 188125 -112558 -170532 34802
9326 -200876 -58457 -86796 -328714 -60057 710 -536489 89463 51490 -32036 -269943 263532
9314 295513 8980 -22614 -254001 363982 9920 61407 -408728 12967 121552 -45786 109746
9302 -135069 417592 -143313 284474 -54877 -11341 -207269 -101401 89903 -110452 -422323
9292 -422323 243339 101925 67059 25804 -331388 -206590 62669 -278276 -16609 -10949 -270075
9281 -270075 -30644 -153735 171290 -396930 -229888 94582 -93986 77508 -196485 -161581 -37647
$$ packed form
9363A56161e4221H3777f694q8171d4159A38864a32078a7211L771M789j94013B5131
9350i3265j2990k17973k85306B25415c3226f165A0523c00563A16171R834a8432
9338H8280P0238f1960A25823Q004c33768I2143a72620A88125a12558n7974C4802
9326b00876e8457k8339k41918f0057G10e36489H9463l7973c2036k37907B63532
9314B95513H980b2614k31387C63982I920N1487d08728A2967J08585d5786A09746
9302a35069D17592a43313B84474e4877a1341j95928a01401H9903a10452l11871
9292d22323B43339A01925l4866B5804c31388J24798F2669b78276a6609N660k59126
9281b70075c0644j23091A71290c96930J67042I4582i3986G7508a96485L4904c7647
$$ plain form
9269 -384746 -24229 55387 -237584 -79901 -69269 -24104 -163592 110820 62460 -85160 -191767
9258 -191767 -163777 157082 119839 285582 -62941 -126686 -249318 -193190 -154321 -61976 -336
9246 298089 95551 -57050 300674 -28161 259842 -395828 -420903 -152603 189142 -111899
9235 -67256 -197288 -144953 45598 13275 -29740 -177481 96617 -5985 33615 24549 233748 192587
9223 192587 -194887 54611 -63534 -46549 55457 -117557 93755 6440 285561 -480761 19840
9211 -51916 -244115 -165601 75883 -99308 -37792 -222040 -206654 22658 -76916 -333909 88905
9199 -210062 300103 -16770 205711 -233159 -108406 -742 25282 -328301 -66253 83180 -364789
9187 45479 -348392 40772 -174720 96519 137984 31593 -125598 -141332 -124682 75747 -170162
$$ packed form
9269c84746b4229E5387b37584g9901J0632b4104j39488A10820m8360h5160j06607
9258a91767K7990A57082l7243J65743f2941o3745j22632N6128L8869f1976c36
9246B98089I5551e7050C00674b8161B59842c95828k5075a52603A89142a11899
9235f7256j30032N2335D5598A3275b9740j47741I6617e985C3615r066K09199m1161
9223A92587a94887E4611f3534J6985E5457a17557I3755F440K79121d80761A9840
9211e1916j92199P8514G5883i9308c7792j84248J5386B2658g6916k56993H8905
9199b10062C00103a6770B05711b33159a08406g42B5282c28301f6253H3180c64789
9187D5479c48392D0772a74720I6519M1465C1593a25598j5734J6650G5747a70162
$$ plain form
9175 -192503 -394885 -52788 117936 50417 -8012 198945 -50764 228075 46780 -96393 -47954
9163 179139 161570 488010 110708 -160844 -106601 -125465 279586 -207562 -326105 -10383
9152 -118992 -79658 -501403 -24677 52019 -319568 141284 -64613 -33997 124892 77508 22255
9140 -69439 146794 -134921 115272 -379257 -299803 254068 230656 -178149 -240961 -76343 9091
9128 -154059 72587 -101229 53652 145902 192417 -85420 277668 -138638 300106 132398 135485
9117 135485 170153 -308235 134686 73857 159391 -171623 -281834 -78670 476908 372944
9107 372944 -302191 95383 -564414 -163648 20379 -220137 -225528 -4368 -207863 78757 -138138
9095 107118 29169 -25961 -33225 86172 -40894 -42105 -385969 128432 -227708 -123302 -18468
$$ packed form
9175a92503k02382e2788A17936E0417h012A98945e0764B28075D6780i6393d7954
9163A79139j7569L26440A10708a60844N4243j8864B79586b07562j18543a0383
9152a18992L9334m21745b4677E2019c19568A41284f4613L0616A24892m7384B2255
9140f9439A46794a34921A15272c79257P9454B54068k3412a78149o2812g6343I091
9128a54059G2587a01229E3652R2250M6515h5420B77668a38638C00106A32398L087
9117A35485L4668c08235A34686o0829Q5534a71623j10211g8670D76908j03964
9107C72944c02191I5383e64414a63648B0379b20137n391d368k03495G8757a38138
9095A07118B9169b5961p264H6172d0894j211l43864A28432b27708J04406a8468
$$ plain form
9083 179610 -340583 -250795 -64230 43442 32300 -3712 -151389 145877 9746 32654 -119383
9071 -308025 -246620 -239484 -175820 -197484 -15222 250689 -55203 121110 78161 -39384 -57557
9060 -57557 528621 -122342 95258 47821 -58580 58570 -156771 -365115 12835 307650 133785
9048 -74114 -116638 38999 395484 -23569 72745 -122137 -137541 -341894 10318 -329208 196754
9036 80010 46523 76622 -253012 -149464 -42284 367802 -277467 79582 -182139 15616 -195091
9024 309937 -130346 -458524 230440 19484 22344 -132869 -81097 -75479 -2883 -197217 -40529
9012 -133579 -267809 -46127 -198323 -35326 -181097 -320354 128155 14770 -274328 259226
9001 115232 140873 -9337 -285830 -366123 -182855 -186235 67075 -4786 -47650 -114225 -66619 -215928
$$ packed form
9083A79610c40583Q9788f4230D3442j1142c712j47677A45877I746K2908a19383
9071c08025O1405P136O3664k1664a5222B50689e5203A21110m2949c9384j8173
9060e7557E28621a22342I5258m7437e8580E8570a56771k08344A2835K94815A33785
9048g4114m2524C8999L56485b3569G2745a22137j5404k04353A0318c29208A96754
9036H0010l3487L0099b53012J03548d2284C67802b77467G9582a82139A5616a95091
9024C09937a30346l28178B30440A9484K860a32869N1772N618b883j94334d0529
9012a33579j34230d6127j52196c5326j45771j39257A28155A4770b74328B59226
9001A15232K5641i337k76493q0293a82855l380F7075d786m2864o6575M7606j49309
$$ plain form
8989 -215928 -80905 32721 -226448 -34150 -141246 36907 -97048 202352 -55990 134581 30132
8977 -274347 130816 -80539 85069 32564 -323346 24275 -62133 -92993 30214 -465048 185085
8965 -233570 -79321 -566809 -26003 187413 119153 -48152 -118704 -238753 278895 -108308 -139756
8954 -139756 139602 -42798 -61703 -158412 -243843 -121821 22452 -67336 47839 71750 -219390
8942 -58448 -109434 -272656 -11128 -97176 -409715 -241939 300322 -110893 -220110 -46823 187393
8930 -34294 -16263 208610 -179959 7704 -199688 160126 22473 290245 995685 653476 128592
8918 147805 -179472 -82345 -6305 -61532 159128 79628 -91557 86584 233176 -143932 -13975
8906 5203 318322 -294114 56176 -115266 16153 -198877 166575 37467 237650 -308991 16353
$$ packed form
8989b15928h0905C2721b26448c4150j07096C6907i7048B02352e5990A34581C0132
8977b74347A30816h0539H5069C2564c23346B4275f2133l0860C0214d65048A85085
8965b33570g9321m87488b6003A87413o8260d8152p0552j20049B78895a08308l1448
8954a39756A39602d2798j8905r6709q5431a21821B2452f7336D7839K3911b19390
8942e8448n0986j63222a1128q6048l12539J67776C00322a10893j09217d6823A87393
8930c4294a6263B08610a79959G704a99688A60126B2473K67772P05440l42209A28592
8918A47805a79472h2345f305n5227A59128p9500i1557H6584J46592a43932a3975
8906E203L13119b94114E6176a15266A6153a98877A66575C7467K00183c08991A6353
$$ plain form
8894 51581 204510 -276659 290914 218024 258484 -147622 -42817 27162 -83001 -26739 -43024
8883 -43024 41752 -35419 69627 -40491 -146542 -152199 -198402 -69962 93946 -274069 -123975
8871 -163395 -42016 183076 276108 137688 -178707 -111309 -96959 10882 -185289 -328716 -179161
8860 -179161 220233 51049 103556 -26219 180201 -144296 -124232 -79644 -47828 -102907 -275841
8849 -275841 45262 -3035 -192324 152412 34218 -172094 110565 118429 -106053 14896 -208852
8837 -296242 -186665 42083 -232198 -190080 -161141 -22026 219603 199893 -183830 -36443 -458023
$$ packed form
8894E1581J52929b76659B90914p2890M0460a47622d2817B7162h3001b6739j6285
8883d3024D1752c5419F9627d0491j06051n657m6203f9962I3946b74069a23975
8871a63395d2016A83076R3032A37688a78707O7398J4350A0882a85289j43427J49555
8860a79161B20233E1049N2507b6219A80201a44296K0064M4588L1816n5079j72934
8849b75841D5262c035j89289A52412C4218a72094A10565P864a06053A4896b08852
8837b96242J09577D2083b32198M2118K8939b2026B19603j9710a83830c6443m21580
$$ [...]
##END NTUPLES=NMR SPECTRUM
##END=
