##TITLE=NES1098_CD3_9886922_Iyb4cjCL7v
##JCAMPDX= 6.0         $$ Bruker NMR JCAMP-DX V2.0
##DATA TYPE= NMR SPECTRUM
##DATA CLASS= NTUPLES
##ORIGIN= BRUKER
##OWNER= Administrator
$$ 1.72 TOPSPIN		Version 2.1
$$ 2016-08-28 19:32:08.773 -0500  Administrator@X
$$ Compression mode = diff/dup
##.OBSERVE FREQUENCY= 400.02188249412
##.OBSERVE NUCLEUS= ^1H
##.ACQUISITION MODE= SIMULTANEOUS (DQD)
##.ACQUISITION SCHEME= undefined
##.AVERAGES= 64
##.DIGITISER RES= 22
##SPECTROMETER/DATA SYSTEM= spect
##.PULSE SEQUENCE= noesygpps1d.comp
##.SOLVENT NAME= COFFEE_meoh
##.SHIFT REFERENCE= INTERNAL, COFFEE_meoh, 1, 14.96324
##AUDIT TRAIL= $$ (NUMBER, WHEN, WHO, WHERE, PROCESS, VERSION, WHAT)
$$ ##TITLE= Audit trail, TOPSPIN		Version 2.1
$$ ##JCAMPDX= 5.01
$$ ##ORIGIN= Bruker BioSpin GmbH
$$ ##OWNER= Administrator
$$ $$ E:\/data/COFFEE/nmr/NES1098_CD3_9886922_Iyb4cjCL7v/12/pdata/1/auditp.txt
$$ ##AUDIT TRAIL=  $$ (NUMBER, WHEN, WHO, WHERE, PROCESS, VERSION, WHAT)
(   1,<2016-08-28 19:32:03.664 -0500>,<Administrator>,<X>,<go>,<TOPSPIN 2.1>,
      <created by zg
	started at 2016-08-28 19:20:34.320 -0500,
	POWCHK enabled, PULCHK disabled,
       configuration hash MD5:
       21 0F 79 D6 B3 7B B4 F6 88 20 88 DB 03 48 BD 9F
       data hash MD5: 64K
       B9 60 CA 95 F8 77 81 2F 2A FE 86 24 1D 67 FA A0>)
(   2,<2016-08-28 19:32:06.758 -0500>,<Administrator>,<X>,<proc1d>,<TOPSPIN 2.1>,
      <Start of raw data processing
       efp LB = 0.3 FT_mod = 6 PKNL = 1 PHC0 = 0 PHC1 = 0 SI = 128K 
       data hash MD5: 128K
       C0 37 A4 C5 02 C5 B1 E6 B4 E3 6D 11 60 E9 C1 B1>)
(   3,<2016-08-28 19:32:07.617 -0500>,<Administrator>,<X>,<proc1d>,<TOPSPIN 2.1>,
      <pk PHC0 = -84.73206 PHC1 = 0 
       data hash MD5: 128K
       1F 9D C6 23 A4 72 4E 49 01 36 39 C6 5C 65 70 11>)
(   4,<2016-08-28 19:32:07.976 -0500>,<Administrator>,<X>,<proc1d>,<TOPSPIN 2.1>,
      <abs ABSG = 1 
       data hash MD5: 128K
       57 18 B0 0E 53 63 B3 01 FC 52 7E E2 B6 D1 A2 BC>)
(   5,<2016-08-28 19:32:08.070 -0500>,<Administrator>,<X>,<proc1d>,<TOPSPIN 2.1>,
      <abs ABSG = 2 
       data hash MD5: 128K
       E7 CC AA EA 17 F6 57 C3 F0 C6 5D 5E DC 86 E1 CF>)
(   6,<2016-08-28 19:32:08.164 -0500>,<Administrator>,<X>,<proc1d>,<TOPSPIN 2.1>,
      <abs ABSG = 3 
       data hash MD5: 128K
       5A 5D 8C 6A 4B 59 C2 1B 28 A0 89 21 DE 60 DF 5F>)
(   7,<2016-08-28 19:32:08.242 -0500>,<Administrator>,<X>,<proc1d>,<TOPSPIN 2.1>,
      <abs ABSG = 4 
       data hash MD5: 128K
       A5 DF 16 1E 3E 1A 21 F0 F2 5A BD F4 B4 0B AB B6>)
(   8,<2016-08-28 19:32:08.351 -0500>,<Administrator>,<X>,<proc1d>,<TOPSPIN 2.1>,
      <abs ABSG = 5 
       data hash MD5: 128K
       2A 2C 76 D7 D3 CA 99 DD 73 DD 02 EE 4F EE BE 8F>)
$$ ##END=
$$ 
$$ $$ hash MD5
$$ $$ E0 DD BB 50 51 ED 1B 55 E8 78 2D AF EB CF EB C4
##$RELAX= 
##$RELAX= 
##$RELAX= 
##$RELAX= 
##$RELAX= 
##$RELAX= 
##$RELAX= 
##$RELAX= 
$$ Bruker specific parameters
$$ --------------------------
##$DU= <E:\>
##$EXPNO= 12
$$ [...]
##$TP07= 0
##$TPNAME0= <>
##$TPNAME1= <>
##$TPNAME2= <>
##$TPNAME3= <>
##$TPNAME4= <>
##$TPNAME5= <>
##$TPNAME6= <>
##$TPNAME7= <>
##$TPOAL= (0..7)
0.5 0.5 0.5 0.5 0.5 0.5 0.5 0.5
##$TPOFFS= (0..7)
0 0 0 0 0 0 0 0
##$TUNHIN= 0
##$TUNHOUT= 0
##$TUNXOUT= 0
##$USERA1= <user>
##$USERA2= <user>
##$USERA3= <user>
##$USERA4= <user>
##$USERA5= <user>
##$V9= 5
##$VALIST= <valist>
##$VCLIST= <CCCCCCCCCCCCCCC>
##$VD= 0
##$VDLIST= <DDDDDDDDDDDDDDD>
##$VPLIST= <PPPPPPPPPPPPPPP>
##$VTLIST= <TTTTTTTTTTTTTTT>
##$WBST= 2048
##$WBSW= 25
##$XGAIN= (0..3)
0 0 0 0
##$XL= 0
##$YL= 0
##$YMAX_a= 6953798
##$YMIN_a= -15100252
##$ZGOPTNS= <>
##$ZL1= 120
##$ZL2= 120
##$ZL3= 120
##$ZL4= 120
##$ABSF1= 14.96324
##$ABSF2= -5.594942
##$ABSG= 5
##$ABSL= 3
##$ALPHA= 0
##$AQORDER= 0
##$ASSFAC= 0
##$ASSFACI= 0
##$ASSFACX= 0
##$ASSWID= 0
##$AUNMP= <proc_prof1d_extract.lims>
##$AXLEFT= 0
##$AXNAME= <>
##$AXNUC= <1H>
##$AXRIGHT= 0
##$AXTYPE= 0
##$AXUNIT= <>
##$AZFE= 0.1
##$AZFW= 0.1
##$BCFW= 0
##$BC_mod= 0
##$BYTORDP= 0
##$COROFFS= 0
##$CY= 15
##$DATMOD= 1
##$DC= 0
##$DFILT= <>
##$DTYPP= 0
##$F1P= 0
##$F2P= 0
##$FCOR= 0.5
##$FTSIZE= 131072
##$FT_mod= 6
##$GAMMA= 0
##$GB= 0
##$INTBC= 1
##$INTSCL= 1
##$ISEN= 128
##$LB= 0.3
##$LEV0= 0
##$LPBIN= 0
##$MAXI= 10000
##$MC2= 0
##$MEAN= 0
##$ME_mod= 0
##$MI= 0
##$NCOEF= 0
##$NC_proc= -2
##$NLEV= 6
##$NOISF1= 0
##$NOISF2= 0
##$NSP= 0
##$NTH_PI= 0
##$NZP= 0
##$OFFSET= 14.96324
##$PC= 1
##$PHC0= -84.73206
##$PHC1= 0
##$PH_mod= 1
##$PKNL= yes
##$PPARMOD= 0
##$PPDIAG= 0
##$PPIPTYP= 0
##$PPMPNUM= 2147483647
##$PPRESOL= 1
##$PSCAL= 4
##$PSIGN= 0
##$PYNMP= <proc.py>
##$REVERSE= no
##$SF= 400.020008741194
##$SI= 131072
##$SIGF1= 0
##$SIGF2= 0
##$SINO= 400
##$SIOLD= 131072
##$SPECTYP= <>
##$SREGLST= <1H.CDCl3>
##$SSB= 0
##$STSI= 131072
##$STSR= 0
##$SW_p= 8223.68421052631
##$SYMM= 0
##$S_DEV= 0
##$TDeff= 65536
##$TDoff= 0
##$TI= <>
##$TILT= no
##$TM1= 0
##$TM2= 0
##$TOPLEV= 0
##$USERP1= <user>
##$USERP2= <user>
##$USERP3= <user>
##$USERP4= <user>
##$USERP5= <user>
##$WDW= 1
##$XDIM= 131072
##$YMAX_p= 364718088
##$YMIN_p= -10642
##$CURPLOT= <Network HP LaserJet P1505>
##$CURPRIN= <$Network HP LaserJet P1505>
##$DFORMAT= <normdp>
##$LAYOUT= <+/1D_H.xwp>
##$LFORMAT= <normlp>
##$PFORMAT= <normpl>
##$SURQMSG= 1
$$ End of Bruker specific parameters
$$ ---------------------------------
##NTUPLES= NMR SPECTRUM
##VAR_NAME=  FREQUENCY,     SPECTRUM/REAL,   SPECTRUM/IMAG
##SYMBOL=    X,             R,               I
##VAR_TYPE=  INDEPENDENT,   DEPENDENT,       DEPENDENT
##VAR_FORM=  AFFN,          ASDF,            ASDF
##VAR_DIM=   131072,        131072,          131072
##UNITS=     HZ,            ARBITRARY UNITS, ARBITRARY UNITS
##FACTOR=    0.0627417313425164, 1,          1
##FIRST=     8223.62146879497, -2208,        -53174
##LAST=      0,             522,             -53705
##MIN=       0,             -10642,          0
##MAX=       8223.62146879497, 364718088,    0
$$ Real data points
##PAGE= N=1
##DATA TABLE= (X++(R..R)), XYDATA
$$ [...]
$$ plain form
61035 633078 639237 644990 650622 656183 661241 665531 669545 674058 679298 684939 690687 696516 702502 708926
61021 708926 716351 725203 735337 746450 758730 772743 788793 806821 826849 849090 873696 900819
61009 900819 930870 964300 1001153 1041149 1084077 1129720 1177617 1227536 1280132 1336583 1397623
60998 1397623 1463550 1535203 1614311 1702751 1801963 1913143 2037520 2176701 2333690 2513930
60988 2513930 2724897 2974822 3272334 3626555 4045984 4537835 5111050 5780887 6569830
60979 6569830 7507103 8634352 10010348 11689356 13665145 15822320 17954667 19853015
60971 19853015 21388638 22521761 23253842 23605037 23649024 23540416 23460448 23505999 23627945
60962 23627945 23679156 23516031 23054296 22252656 21083450 19544557 17695952 15667785 13621919
$$ packed form
61035F33078O159N753N632N561N058M290M014M513N240N641N748N829N986O424
61021G08926P425Q852J0134J1113J2280J4013J6050J8028K0028K2241K4606K7123
61009I00819L0051L3430L6853L9996M2928M5643M7897M9919N2596N6451O1040
60998A397623O5927P1653P9108Q8440R9212J11180J24377J39181J56989J80240
60988B513930K10967K49925K97512L54221M19429M91851N73215O69837P88943
60979F569830R37273J127249J375996J679008J975789K157175K132347J898348
60971A9853015J535623J133123P32081L51195M3987j08608p9968M5551J21946
60962B3627945N1211j63125m61735q01640j169206j538893j848605k028167k045866
$$ plain form
60953 13621919 11698710 9986289 8519676 7295218 6287329 5462523 4788393 4236734
60945 4236734 3783385 3408068 3094415 2829312 2602218 2405287 2233215 2081823 1946806
60936 1946806 1824205 1711605 1608271 1514342 1430193 1355953 1290829 1232950 1180301 1131550 1085718
60925 1085718 1041714 998898 957686 918858 882489 848211 816214 787175 761350 738489 718578
60914 718578 701820 687817 675505 664120 653729 644698 637165 631188 626852 623983 622130 620967 620422
60901 620422 620373 620709 621720 623903 627180 630771 634083 637350 641187 645812 650857 655549 658920 660260 659668
60886 659668 657934 655615 652438 647745 641259 633231 624091 614229 603954 593491 583040 572868 563203
60873 563203 554070 545463 537663 531135 526096 522409 519907 518502 518022 518325 519638 522409 526744 532264 538577
$$ packed form
60953A3621919j923209j712421j466613j224458j007889q24806o74130n51659
60945D236734m53349l75317l13653k65103k27094j96931j72072j51392j35017
60936A946806j22601j12600j03334r3929q4149p4240o5124n7879n2649m8751m5832
60925A085718m4004m2816m1212l8828l6369l4278l1997k9039k5825k2861j9911
60914G18578j6758j4003j2312j1385j0391r031p533n977m336k869j853j163n45
60901F20422m9L36J011K183L277L591L312L267L837M625N045M692L371J340n92
60886F59668j734k319l177m693o486q028r140r862j0275j0463j0451j0172r665
60873E63203r133q607p800o528n039l687k502j405m80L03J313K771M335N520O313
$$ plain form
60858 538577 545579 553270 561652 570841 580913 591611 602638 614204 626793 640372 654442 669011
60846 669011 684758 701860 719249 735507 750094 763323 775546 786802 796882 805297 811510 815622
60834 815622 818551 821156 823441 824962 825548 825177 823563 820524 816448 811787 806285 799367 791164 782491 773843
60819 773843 765032 755808 746154 735855 724527 712475 701036 691608 684579 679489 675895 673632 672377
60806 672377 671509 670576 669655 669115 669201 670010 671760 674835 679425 685249 691597 697596 702425 705588 707204 707901
60790 707901 708242 708315 708010 707410 706617 705452 703804 702203 701551 702291 704262 707338 711670 717245 723792 731289
60774 731289 740039 750067 761017 772866 786058 800460 814732 827332 837782 846496 853766 859516
60762 859516 863796 866873 868889 869841 869857 869203 868199 867378 867428 868583 870316 871992 873534 875023 875939 875418
$$ packed form
60858E38577P002P691Q382R189J0072J0698J1027J1566J2589J3579J4070J4569
60846F69011J5747J7102J7389J6258J4587J3229J2223J1256J0080Q415O213M112
60834H15622K929K605K285J521N86l71j614l039m076m661n502o918q203q673q648
60819G73843q811r224r654j0299j1328j2052j1439r428p029n090l594k263j255
60806F72377q68r33r21n40Q6Q09J750L075M590N824O348N999M829L163J616O97
60790G07901L41P3l05o00p93j165j648j601o52P40J971L076M332N575O547P497
60774G31289Q750J0028J0950J1849J3192J4402J4272J2600J0450Q714P270N750
60762H59516M280L077K016R52J6o54j004q21N0J155J733J676J542J489R16n21
$$ plain form
60746 875418 873190 869758 865642 860874 855193 848364 840312 831266 821764 812214 802480 792103 780842 768838
60732 768838 756411 743919 731623 719433 707014 694333 681833 669923 658762 648797 640883 635280
60720 635280 630987 626710 622178 617910 614135 610789 608288 607347 608048 609824 612394 615938 620317 624913 629412
60705 629412 634003 638551 642242 644427 645359 645716 645715 644895 642471 637808 630900 622473 613306 603467 592623
60690 592623 581055 569762 559451 549980 541024 532722 525331 518638 512203 506053 500838 497293 495587
60677 495587 495118 494966 494700 494706 495651 497824 501210 505824 511539 517828 524169 530540 537043 543371 549306 555496
60661 555496 562874 571321 579743 587569 595354 603694 612376 620937 629343 637727 646076 654529 663437 672780
60647 672780 682094 691315 701068 711660 722369 732313 741523 750594 759589 767905 775077 781297 787224 793486
$$ packed form
60746H75418k228l432m116m768n681o829q052r046r502r550r734j0377j1261j2004
60732G68838j2427j2492j2296j2190j2419j2681j2500j1910j1161r965p914n603
60720F35280m293m277m532m268l775l346k501r41P01J776K570L544M379M596M499
60705F29412M591M548L691K185R32L57jq20k424m663o908q427r167r839j0844
60690E92623j1568j1293j0311r471q956q302p391o693o435o150n215l545j706
60677D95587m69j52k66OR45K173L386M614N715O289O341O371O503O328N935O190
60661E55496P378Q447Q422P826P785Q340Q682Q561Q406Q384Q349Q453Q908R343
60647F72780R314R221R753J0592J0709R944R210R071Q995Q316P172O220N927O262
$$ plain form
60633 793486 800047 805852 809550 810899 811042 810977 810229 807553 802628 796391 789905 783492 776884 769673 761546
60618 761546 752533 743125 733941 725353 717627 711246 706599 703455 701193 699697 699673 701901 706465 712873 720747
60603 720747 730059 740695 752060 763303 773765 782972 790331 795343 798281 800191 801818 802862 802713
60590 802713 801601 800414 799585 798863 798131 797676 797493 796932 795267 792129 787275 780551 772305 763214 753395 742237
60574 742237 729443 715744 702210 689368 677269 665943 655320 645204 635761 627585 620794 614514
60562 614514 607871 601233 595929 592842 591663 591330 590858 590001 589492 590479 593386 597553 602219 607459 613749
60547 613749 621004 628655 636549 645248 655523 667911 682723 700147 720379 743883 771408 803545
60535 803545 840386 881577 926290 972846 1018766 1061447 1098522 1127469 1145716 1151923 1146947 1133058
$$ packed form
60633G93486O561N805L698J349J43o5p48k676m925o237o486o413o608p211q127
60618G61546r013r408r184q588p726o381m647l144k262j496k4K228M564O408P874
60603G20747R312J0636J1365J1243J0462R207P359N012K938J910J627J044j49
60590H02713j112j187q29p22p32m55j83n61j665l138m854o724q246r091r819j1158
60574G42237j2794j3699j3534j2842j2099j1326j0623j0116r443q176o791o280
60562F14514o643o638n304l087j179l33m72q57n09R87K907M167M666N240O290
60547F13749P255P651P894Q699J0275J2388J4812J7424K0232K3504K7525L2137
60535H03545L6841M1191M4713M6556M5920M2681L7075K8947J8247O207m976j3889
$$ plain form
60523 1133058 1112511 1087335 1059961 1033067 1008711 988070 971946 960951 955157 953983 956456 961357
60511 961357 967362 973528 979523 985114 989788 993383 996802 1001471 1008292 1017729 1030735 1048709 1072463
60498 1072463 1101886 1136846 1177948 1226303 1283044 1349080 1424769 1509651 1603008 1704784 1815509
60487 1815509 1935353 2064140 2202868 2354850 2524912 2717784 2937576 3188105 3472060
60478 3472060 3788341 4129393 4480860 4823748 5137087 5399398 5589648 5689724 5688475 5584750
60468 5584750 5387156 5111273 4776592 4404233 4015013 3627729 3257871 2916629 2610142
60459 2610142 2339769 2103801 1899396 1723306 1571831 1441297 1328836 1232262 1149269 1077358
60449 1077358 1014553 959663 911842 870391 834978 805347 780584 759160 739854 722207 706049
$$ packed form
60523A133058k0547k5176k7374k6894k4356k0641j6124j0995n794j174K473M901
60511I61357O005O166N995N591M674L595L419M669O821R437J3006J7974K3754
60498A072463K9423L4960M1102M8355N6741O6036P5689Q4882R3357J01776J10725
60487A815509J19844J28787J38728J51982J70062J92872K19792K50529K83955
60478C472060L16281L41052L51467L42888L13339K62311J90250J00076j249j03725
60468E584750j97594k75883l34681l72359l89220l87284l69858l41242l06487
60459B610142k70373k35968k04405j76090j51475j30534j12461r6574q2993p1911
60449A077358o2805n4890m7821m1451l5413k9631k4763k1424j9306j7647j6158
$$ plain form
60438 706049 691140 677479 665310 654510 644410 634554 625195 616681 608761 600873 592835 584883 577320
60425 577320 570518 564997 561082 558616 557406 557746 560000 563608 566999 568806 569020 568736 568912 569610 570486 571623
60409 571623 573506 576242 579296 582244 585426 589441 594201 598935 603032 606439 609291 611702 614083 617144
60395 617144 621213 625830 630297 634410 638353 642111 645355 647871 649775 651243 652247 652736 652933 653238 653773
60380 653773 654102 653521 651567 648192 643655 638553 633856 630420 628183 626196 623724 621072 619019 617761 616818
60365 616818 615808 614834 614196 614117 614721 615872 617092 618014 618931 620508 623000 626135 629718 633841 638464 643272
60349 643272 648135 653246 658644 663903 668494 672160 674891 676889 678683 680864 683489 686058 688242 690228
60335 690228 692165 693711 694496 694736 695053 695872 697345 699575 702489 705574 708143 709926 711173 712194 712986
$$ packed form
60438G06049j4909j3661j2169j0800j0100r856r359q514p920p888q038p952p563
60425E77320o802n521l915k466j210L40K254L608L391J807K14k84J76O98Q76J137
60409E71623J883K736L054K948L182M015M760M734M097L407K852K411K381L061
60395F17144M069M617M467M113L943L758L244K516J904J468J004M89J97L05N35
60380F53773L29n81j954l375m537n102m697l436k237j987k472k652k053j258r43
60365F16818j010r74o38p9O04J151J220R22R17J577K492L135L583M123M623M808
60349F43272M863N111N398N259M591L666K731J998J794K181K625K569K184J986
60335F90228J937J546P85K40L17Q19J473K230K914L085K569J783J247J021P92
$$ plain form
60320 712986 713300 712832 711383 709039 706218 703381 700596 697486 693750 689721 686249 683868 682102 679839 676571
60305 676571 673081 670640 669678 669584 669692 669951 670475 670975 671071 670844 670628 670408 669832 668779 667474 665980 664050
60288 664050 661754 659910 659473 660546 662342 664134 665965 668373 671775 676280 681773 687805 693607 698698
60274 698698 703427 708535 714186 719930 725695 732252 740331 749719 759681 769990 781014 792999 805768
60261 805768 819219 833671 849600 867269 886689 907725 930212 954184 980040 1008348 1039478
60250 1039478 1073590 1110969 1152159 1197693 1247850 1302736 1362546 1427657 1498430 1574986 1657185
60239 1657185 1744866 1837871 1935667 2037046 2140465 2244513 2347687 2447904 2542887 2631072
60229 2631072 2711484 2782547 2841855 2887592 2919621 2938701 2945262 2939598 2922749 2896347 2861899 2820992
$$ packed form
60320G12986L14m68j449k344k821k837k785l110l736m029l472k381j766k263l268
60305F76571l490k441r62r4J08K59N24N00R6k27k16k20n76j053j305j494j930
60288F64050k296j844m37J073J796J792J831K408L402M505N493O032N802N091
60274F98698M729N108N651N744N765O557Q079R388R962J0309J1024J1985J2769
60261H05768J3451J4452J5929J7669J9420K1036K2487K3972K5856K8308L1130
60250A039478L4112L7379M1190M5534N0157N4886N9810O5111P0773P6556Q2199
60239A657185Q7681R3005R7796J01379J03419J04048J03174J00217R4983Q8185
60229B631072Q0412P1063N9308M5737L2029J9080O561n664j6849k6402l4448m0907
$$ plain form
60217 2820992 2775990 2729717 2684485 2642016 2604133 2572771 2549263 2534305 2528582 2532878 2547631 2573097
60205 2573097 2609982 2659249 2721097 2794666 2878762 2972307 3073966 3181920 3294071 3407922
60195 3407922 3520194 3627232 3726055 3814613 3891004 3953077 3998893 4027039 4036492 4026935 3999405
60184 3999405 3955887 3898030 3826950 3744623 3654633 3560974 3466642 3373983 3285875 3205787 3136700
60173 3136700 3080369 3037500 3008305 2993024 2992141 3006057 3034522 3076647 3131421 3197695 3273420 3355245
60161 3355245 3439185 3521516 3599025 3668913 3728856 3776965 3811667 3831982 3838016 3830824 3811752 3782365
60149 3782365 3744978 3702522 3657587 3612166 3568606 3530159 3500112 3480790 3473724 3480298 3501726 3538912
60137 3538912 3592895 3665232 3757479 3870470 4004422 4159527 4336177 4534864 4756030 4999598
$$ packed form
60217B820992m5002m6273m5232m2469l7883l1362k3508j4958n723M296J4753K5466
60205B573097L6885M9267O1848P3569Q4096R3545J01659J07954J12151J13851
60195C407922J12272J07038R8823Q8558P6391O2073M5816K8146R453r557k7530
60184C999405m3518n7857p1080q2327q9990r3659r4332r2659q8108q0088o9087
60173C136700n6331m2869k9195j5281q83J3916K8465M2125N4774O6274P5725Q1825
60161C355245Q3940Q2331P7509O9888N9943M8109L4702K0315O034p192j9072k9387
60149C782365l7387m2456m4935m5421m3560l8447l0047j9322p066O574K1428L7186
60137C538912N3983P2337R2247J12991J33952J55105J76650J98687K21166K43568
$$ plain form
60127 4999598 5264262 5547408 5845889 6156486 6475406 6797963 7119172 7434267 7738235
60118 7738235 8025383 8290048 8527515 8733818 8905038 9037556 9128977 9178260 9184925 9148547
60108 9148547 9069153 8947966 8787810 8592926 8368275 8118929 7850398 7569496 7284317 7002868
60098 7002868 6731885 6476889 6242632 6032829 5849845 5695192 5570107 5475219 5409993 5373223
60088 5373223 5363924 5381272 5423779 5489033 5574123 5675685 5789344 5909442 6029482 6142841
60078 6142841 6243420 6326199 6387504 6424821 6436653 6422730 6384005 6322034 6238336 6134558 6013049
60067 6013049 5876874 5729207 5572773 5409736 5241986 5071737 4902024 4736406 4578052
60058 4578052 4429331 4292380 4169634 4063427 3975244 3905609 3854537 3821957 3807954 3812751 3836181
$$ packed form
60127D999598K64664K83146K98481L10597L18920L22557L21209L15095L03968
60118G738235K87148K64665K37467K06303J71220J32518R1421M9283O665l6378
60108I148547p9394j21187j60156j94884k24651k49346k68531k80902k85179k81449
60098G002868k70983k54996k34257k09803j82984j54653j25085r4888o5226l6770
60088E373223r299J7348M2507O5254Q5090J01562J13659J20098J20040J13359
60078F142841J00579Q2779O1305L7317J1832j3923l8725o1971q3698j03778j21509
60067F013049j36175j47667j56434j63037j67750j70249j69713j65618j58354
60058D578052j48721j36951j22746j06207q8183o9635n1072l2580j4003M797K3430
$$ plain form
60047 3836181 3877186 3934205 4006122 4092272 4191322 4300660 4416997 4536793 4655732 4768689
60037 4768689 4871073 4959883 5032969 5087900 5122335 5134989 5125274 5092351 5035634 4956409 4858181
60026 4858181 4745099 4620486 4486864 4346919 4204251 4063428 3929182 3805067 3692770
60017 3692770 3592912 3506398 3434769 3379500 3341358 3320365 3316049 3327956 3356285 3401919 3465565
60006 3465565 3547047 3645591 3760335 3890166 4033436 4188274 4352654 4523513 4696098 4864918
59996 4864918 5025152 5172652 5303062 5411953 5495988 5553348 5583025 5584310 5557030 5501829 5420288
59985 5420288 5315237 5190877 5052052 4903428 4749732 4596394 4449091 4312489 4189813
59976 4189813 4083399 3994866 3924646 3872135 3836667 3818045 3816038 3829804 3858033 3899471 3953422
$$ packed form
60047C836181M1005N7019P1917Q6150R9050J09338J16337J19796J18939J12957
60037D768689J02384Q8810P3086N4931L4435J2654r715l2923n6717p9225r8228
60026D858181j13082j24613j33622j39945j42668j40823j34246j24115j12297
60017C692770r9858q6514p1629n5269l8142k0993m316J1907K8329M5634O3646
60006C465565Q1482R8544J14744J29831J43270J54838J64380J70859J72585J68820
59996D864918J60234J47500J30410J08891Q4035N7360K9677J285k7280n5201q1541
59985E420288j05051j24360j38825j48624j53696j53338j47303j36602j22676
59976D189813j06414q8533p0220n2511l5468j8622k007J3766K8229M1438N3951
$$ plain form
59965 3953422 4019907 4098992 4189465 4288373 4392193 4498062 4603351 4704690 4798476 4882200
59955 4882200 4954407 5013605 5058440 5088959 5106500 5111987 5105487 5087983 5062634 5033548 5004144 4977463
59943 4977463 4957413 4948597 4955024 4979687 5025246 5094467 5189971 5314095 5469115 5657136 5879375
59932 5879375 6135614 6424533 6744457 7093459 7468287 7863066 8269215 8676576 9074098
59923 9074098 9449139 9786874 10071676 10289793 10431155 10489654 10463174 10353894 10168111 9915348
59913 9915348 9607612 9258950 8884419 8498404 8113421 7739964 7386626 7059953 6764443
59904 6764443 6502913 6276875 6086813 5932587 5813700 5729018 5676656 5654795 5662618 5699891
59894 5699891 5765740 5858353 5975633 6115146 6273257 6445106 6625590 6809370 6989407 7156350
$$ packed form
59965C953422O6485P9085R0473R8908J03820J05869J05289J01339R3786Q3724
59955D882200P2207N9198M4835L0519J7541N487o500j7504k5349k9086k9404k6681
59943D977463k0050q816O427K4663M5559O9221R5504J24124J55020J88021K22239
59932E879375K56239K88919L19924L49002L74828L94779M06149M07361L97522
59923I074098L75041L37735K84802K18117J41362N8499k6480j09280j85783k52763
59913I915348l07736l48662l74531l86015l84983l73457l53338l26673k95510
59904F764443k61530k26038j90062j54226j18887q4682n2362k1861P823L7273
59894E699891O5849R2613J17280J39513J58111J71849J80484J83780J80037J66943
$$ plain form
59884 7156350 7300277 7412969 7488416 7522072 7510687 7452978 7350056 7205368 7024569 6815164
59874 6815164 6585480 6343450 6095984 5848850 5606521 5372003 5147023 4932451 4728617
59865 4728617 4535461 4352670 4179874 4016878 3863898 3721544 3590554 3471664 3365778
59856 3365778 3273890 3196438 3132899 3082319 3043912 3016646 2998452 2986443 2977831 2970115 2960577 2946414
59844 2946414 2925653 2897503 2861898 2819344 2771291 2719896 2667064 2614101 2562356 2513578 2469389
59833 2469389 2430827 2398529 2372894 2354007 2342082 2338141 2343653 2359143 2383685 2415937 2455094 2500529
59821 2500529 2551220 2606011 2663990 2724110 2784783 2844227 2900871 2953119 2999088 3036954 3065403
59810 3065403 3083703 3091848 3090923 3082962 3070235 3055010 3040062 3028734 3024069 3028219 3042879 3069761
$$ packed form
59884G156350J43927J12692P5447L3656j1385n7709j02922j44688j80799k09405
59874F815164k29684k42030k47466k47134k42329k34518k24980k14572k03834
59865D728617j93156j82791j72796j62996j52980j42354j30990j18890j05886
59856C365778r1888p7452o3539n0580l8407k7266j8194j2009q612p716r538j4163
59844B946414k0761k8150l5605m2554m8053n1395n2832n2963n1745m8778m4189
59833B469389l8562l2298k5635j8887j1925l941N512J5490K4542L2252L9157M5435
59821B500529N0691N4791N7979O0120O0673N9444N6644N2248M5969L7866K8449
59810C065403J8300Q145r25p961j2727j5225j4948j1328m665M150J4660K6882
$$ plain form
59798 3069761 3110457 3166547 3240228 3334225 3450505 3589666 3752175 3939869 4155708 4402353
59788 4402353 4681195 4991647 5329588 5685483 6043776 6384116 6683760 6920751 7077359
59779 7077359 7142665 7113553 6994793 6798705 6543627 6250777 5940976 5632709 5341028 5076253
59769 5076253 4843262 4642666 4473067 4332463 4218372 4127911 4058274 4006929 3971439 3949552
59759 3949552 3939651 3940841 3952601 3974686 4007428 4051717 4108350 4177424 4258593 4352047 4459133
59748 4459133 4581821 4721503 4878611 5053602 5247993 5463917 5702913 5965779 6253563
59739 6253563 6567965 6910573 7282279 7683561 8114508 8573950 9058776 9564180 10083780
59730 10083780 10609050 11129368 11633570 12111777 12556045 12960658 13323275 13646136 13935780
$$ packed form
59798C069761M0696N6090P3681R3997J16280J39161J62509J87694K15839K46645
59788D402353K78842L10452L37941L55895L58293L40340K99644K36991J56608
59779G077359O5306k9112j18760j96088k55078k92850l09801l08267k91681k64775
59769E076253k32991k00596j69599j40604j14091r0461o9637n1345l5490k1887
59759C949552r901J190J1760K2085L2742M4289N6633O9074Q1169R3454J07086
59748D459133J22688J39682J57108J74991J94391K15924K38996K62866K87784
59739F253563L14402L42608L71706M01282M30947M59442M84826N05404N19600
59730A0083780N25270N20318N04202M78207M44268M04613L62617L22861K89644
$$ plain form
59721 13935780 14201549 14454447 14706628 14970716 15258619 15580350 15943085 16350459 16802299
59712 16802299 17294840 17820835 18369525 18927098 19477808 20004906 20491190 20920093 21277562
59703 21277562 21553496 21742122 21842281 21858153 21799286 21679210 21513934 21321382 21120770 20931029
59693 20931029 20769396 20651320 20590687 20599081 20685034 20854659 21112800 21463102 21907347 22445413
59683 22445413 23075459 23793141 24590283 25454206 26367310 27305848 28238769 29128496 29933675
59674 29933675 30612345 31125138 31439108 31531622 31392818 31026356 30449358 29691397 28791580
59665 28791580 27794008 26743120 25679465 24635639 23632906 22679897 21773725 20902820 20051007
59656 20051007 19202332 18345003 17472932 16585520 15687430 14788406 13901850 13042050 12221501
$$ packed form
59721A3935780K65769K52898K52181K64088K87903L21731L62735M07374M51840
59712A6802299M92541N25995N48690N57573N50710N27098M86284M28903L57469
59703B1277562K75934J88626J00159J5872n8867j20076j65276j92552k00612j89741
59693B0931029j61633j18076o0633Q394Q5953J69625K58141L50302M44245N38066
59683B2445413O30046P17682P97142Q63923R13104R38538R32921Q89727Q05179
59674B9933675O78670N12793L13970R2514j38804l66462n76998p57961q99817
59665B8791580r97572j050888j063655j043826j002733r53009r06172q70905q51813
59656B0051007q48675q57329q72071q87412q98090q99024q86556q59800q20549
$$ plain form
59647 12221501 11449271 10730287 10065660 9454139 8893586 8381288 7913704 7487060 7098400
59638 7098400 6745481 6425736 6136061 5873767 5636964 5423835 5232274 5060670 4908425
59629 4908425 4775091 4659254 4558689 4471479 4396590 4333417 4280943 4237344 4200248 4167392 4136951
59618 4136951 4107201 4076099 4041470 4001505 3954820 3900240 3837102 3765866 3688050 3605404 3519342
59607 3519342 3431158 3342399 3254890 3170543 3091171 3018170 2952208 2893329 2841380 2796290 2758178
59596 2758178 2727420 2704419 2688903 2679571 2674948 2674670 2679424 2689479 2703702 2720314 2738286 2757529
59584 2757529 2777829 2798119 2817135 2834625 2851606 2869358 2888477 2909119 2931898 2958073 2988938
59573 2988938 3025456 3068494 3118819 3176727 3242218 3315870 3399060 3492994 3598018 3714364 3843163
$$ packed form
59647A2221501p72230p18984o64627o11521n60553n12298m67584m26644l88660
59638G098400l52919l19745k89675k62294k36803k13129j91561j71604j52245
59629D908425j33334j15837j00565q7210p4889o3173n2474m3599l7096l2856l0441
59618D136951k9750l1102l4629l9965m6685n4580o3138p1236p7816q2646q6062
59607C519342q8184q8759q7509q4347p9372p3001o5962n8879n1949m5090l8112
59596B758178l0758k3001j5516r332m623k78M754J0055J4223J6612J7972J9243
59584B757529K0300K0290J9016J7490J6981J7752J9119K0642K2779K6175L0865
59573B988938L6518M3038N0325N7908O5491P3652Q3190R3934J05024J16346J28799
$$ plain form
59562 3843163 3986125 4144327 4317699 4505561 4707295 4922678 5151809 5394351 5648452
59553 5648452 5910639 6177100 6444763 6710797 6971555 7222737 7460504 7682193 7886353
59544 7886353 8072569 8240613 8388963 8514466 8614517 8689651 8743388 8779749 8801785 8812626
59534 8812626 8817021 8821400 8832856 8858135 8902753 8970217 9061698 9176024 9309439 9455290 9604496
59523 9604496 9746649 9870756 9965568 10020318 10025968 9976095 9867131 9698529 9472836 9195222
59513 9195222 8872750 8514131 8129610 7730033 7325406 6924335 6534444 6162476 5813596
59504 5813596 5490888 5195764 4928675 4689469 4477504 4291702 4130526 3992057 3874427
59495 3874427 3776215 3696344 3633895 3588278 3559346 3546909 3550339 3569056 3603172 3653154 3719043
$$ packed form
59562C843163J42962J58202J73372J87862K01734K15383K29131K42542K54101
59553E648452K62187K66461K67663K66034K60758K51182K37767K21689K04160
59544G886353J86216J68044J48350J25503J00051P5134N3737L6361K2036J0841
59534H812626M395M379J1456K5279M4618O7464R1481J14326J33415J45851J49206
59523I604496J42153J24107R4812N4750N650m9873j08964j68602k25693k77614
59513I195222l22472l58619l84521l99577m04627m01071l89891l71968l48880
59504E813596l22708k95124k67089k39206k11965j85802j61176j38469j17630
59495C874427r8212p9871o2449m5617k8932j2437L430J8717L4116M9982O5889
$$ plain form
59484 3719043 3800541 3897728 4011120 4141075 4287659 4450887 4630411 4824881 5032178 5250199
59474 5250199 5476632 5707685 5937525 6159167 6365466 6549278 6703471 6821483 6897933 6928789
59464 6928789 6911476 6845312 6731914 6575224 6381187 6157118 5910812 5649837 5381288 5111555
59454 5111555 4845806 4587874 4340916 4107887 3891003 3691050 3507669 3340114 3187410
59445 3187410 3048380 2922261 2809048 2708631 2619828 2540877 2470656 2408867 2355418 2310288
59435 2310288 2273484 2244326 2221166 2202783 2189656 2182698 2181092 2182691 2186484 2193199 2203292 2215709
59423 2215709 2229083 2243058 2258017 2274601 2293892 2316831 2342700 2369069 2393901 2417062 2439422
59412 2439422 2461574 2484141 2508499 2536364 2569330 2609393 2658981 2719392 2789678 2867937 2953394
$$ packed form
59484C719043Q1498R7187J13392J29955J46584J63228J79524J94470K07297K18021
59474E250199K26433K31053K29840K21642K06299J83812J54193J18012P6450L0856
59464F928789j7313o6164j13398j56690j94037k24069k46306k60975k68549k69733
59454E111555k65749k57932k46958k33029k16884j99953j83381j67555j52704
59445C187410j39030j26119j13213j00417q8803p8951p0221o1789n3449m5130
59435B310288l6804k9158k3160j8383j3127o958j606J599L793O715J0093J2417
59423B215709J3374J3975J4959J6584J9291K2939K5869K6369K4832K3161K2360
59412B439422K2152K2567K4358K7865L2966M0063M9588O0411P0286P8259Q5457
$$ plain form
59401 2953394 3046547 3147877 3257526 3376241 3505961 3649573 3810609 3992983 4200289 4435130
59391 4435130 4699363 4994840 5323643 5687691 6088248 6525392 6997385 7500408 8028781
59382 8028781 8575015 9129565 9681171 10218185 10729943 11207417 11643667 12034455 12378398
59373 12378398 12676399 12931049 13146263 13326347 13474503 13592127 13679309 13735268 13757998 13744208
59363 13744208 13690278 13593195 13450823 13262481 13030241 12759421 12457222 12131012 11787815 11434319
59353 11434319 11076047 10716380 10356753 9997671 9639308 9281667 8924947 8570016 8218502
59344 8218502 7872754 7535894 7211425 6902418 6611295 6340432 6092264 5868311 5668602
59335 5668602 5492546 5339882 5210169 5101806 5012329 4939642 4882395 4839193 4807747 4784738
$$ packed form
59401B953394R3153J01330J09649J18715J29720J43612J61036J82374K07306K34841
59391D435130K64233K95477L28803L64048M00557M37144M71993N03023N28373
59382H028781N46234N54550N51606N37014N11758M77474M36250L90788L43943
59373A2378398K98001K54650K15214J80084J48156J17624Q7182N5959K2730j3790
59363A3744208n3930r7083j42372j88342k32240k70820l02199l26210l43197l53496
59353A1434319l58272l59667l59627l59082l58363l57641l56720l54931l51514
59344H218502l45748l36860l24469l09007k91123k70863k48168k23953j99709
59335E668602j76056j52664j29713j08363q9477p2687n7247m3202l1446k3009
$$ plain form
59325 4784738 4766296 4748920 4730358 4709511 4685295 4655908 4619496 4575267 4523619 4465414 4401452
59314 4401452 4332427 4259127 4182835 4105667 4030159 3958255 3890961 3829002 3773286 3724480 3682652
59303 3682652 3647718 3619880 3599384 3586414 3581654 3586449 3601891 3628082 3664684 3711750 3769597 3838366
59291 3838366 3918348 4010421 4115584 4234208 4366105 4510939 4668009 4835899 5012856 5197197
59281 5197197 5386687 5577651 5765252 5944620 6111288 6260634 6387493 6486553 6553190 6584215
59271 6584215 6578303 6535803 6458191 6348021 6209464 6048367 5871182 5683746 5490878 5296412
59261 5296412 5103108 4912912 4727806 4550260 4382601 4226268 4081987 3950338 3831866
59252 3831866 3726951 3635942 3559174 3496673 3448199 3413806 3394002 3389254 3399934 3427063 3472403
$$ packed form
59325D784738j8442j7376j8562k0847k4216k9387l6412m4229n1648n8205o3962
59314D401452o9025p3300p6292p7168p5508p1904o7294o1959n5716m8806m1828
59303C682652l4934k7838k0496j2970m760M795J5442K6191L6602M7066N7847O8769
59291C838366P9982R2073J05163J18624J31897J44834J57070J67890J76957J84341
59281E197197J89490J90964J87601J79368J66668J49346J26859R9060O6637L1025
59271F584215n912m2500p7612j10170j38557j61097j77185j87436j92868j94466
59261E296412j93304j90196j85106j77546j67659j56333j44281j31649j18472
59252C831866j04915r1009p6768o2501m8474l4393j9804m748J0680K7129M5340
$$ plain form
59241 3472403 3537358 3622384 3727982 3855776 4008041 4186720 4393446 4629821 4896742 5193630
59231 5193630 5518925 5870772 6246135 6639119 7040658 7439618 7823587 8178968 8491507
59222 8491507 8747521 8934940 9044020 9068376 9006017 8859456 8634984 8342052 7992909 7601877
59212 7601877 7184164 6754615 6326554 5910859 5515784 5147470 4810125 4505644 4233757
59203 4233757 3993144 3782287 3599186 3441124 3305374 3189726 3091893 3009048 2938624 2879099
59193 2879099 2829247 2787160 2750897 2719797 2694138 2673586 2656920 2643398 2633635 2628898 2630009 2637057
59181 2637057 2649775 2667998 2691904 2721684 2756811 2795989 2838232 2883719 2933087 2986058 3041165
59170 3041165 3096514 3150292 3200809 3246690 3286967 3320522 3345559 3360210 3363687 3356471 3339466 3313429
$$ packed form
59241C472403O4955Q5026J05598J27794J52265J78679K06726K36375K66921K96888
59231E193630L25295L51847L75363L92984M01539L98960L83969L55381L12539
59222H491507K56014J87419J09080K4356o2359j46561k24472k92932l49143l91032
59212G601877m17713m29549m28061m15695l95075l68314l37345l04481k71887
59203D233757k40613k10857j83101j58062j35750j15648r7833q2845p0424n9525
59193B879099m9852m2087l6263l1100k5659k0552j6666j3522r763m737J111P048
59181B637057J2718J8223K3906K9780L5127L9178M2243M5487M9368N2971N5107
59170C041165N5349N3778N0517M5881M0277L3555K5037J4651L477p216j7005k6037
$$ plain form
59158 3313429 3279168 3237833 3190849 3139833 3086502 3032490 2979125 2927349 2877715 2830598 2786791
59147 2786791 2747771 2714799 2687737 2665392 2647181 2633760 2625897 2623633 2626884 2635950 2650883 2671193
59135 2671193 2696793 2728449 2766777 2811677 2863470 2923604 2993254 3072046 3159125 3254804 3360088
59124 3360088 3475262 3600091 3734799 3879439 4032564 4191735 4355239 4522339 4691987
59115 4691987 4862217 5030592 5194412 5350828 5497847 5635183 5763394 5882496 5992149
59106 5992149 6092437 6183164 6262566 6327812 6376396 6405841 6412298 6390919 6337740 6250331 6127133
59095 6127133 5967908 5775257 5554579 5312262 5054670 4788531 4520601 4256301 3999524
59086 3999524 3753825 3522627 3307897 3109760 2927809 2761920 2611558 2475391 2352123
$$ packed form
59158C313429l4261m1335m6984n1016n3331n4012n3365n1776m9634m7117m3807
59147B786791l9020l2972k7062k2345j8211j3421p863k264L251R066J4933K0310
59135B671193K5600L1656L8328M4900N1793O0134O9650P8792Q7079R5679J05284
59124C360088J15174J24829J34708J44640J53125J59171J63504J67100J69648
59115D691987J70230J68375J63820J56416J47019J37336J28211J19102J09653
59106E992149J00288R0727P9402O5246M8584K9445O457k1379n3179q7409j23198
59095F127133j59225j92651k20678k42317k57592k66139k67930k64300k56777
59086C999524k45699k31198k14730j98137j81951j65889j50362j36167j23268
$$ plain form
59077 2352123 2240970 2140931 2050396 1967871 1892525 1823889 1761700 1706112 1657197 1614075 1575340
59066 1575340 1540461 1509931 1483850 1461331 1441602 1424889 1411854 1402720 1397069 1393826 1391386 1388484
59054 1388484 1384987 1381157 1376319 1369234 1359692 1348600 1336470 1323020 1308483 1294056 1280692 1268553
59042 1268553 1258004 1249988 1244896 1242213 1241950 1245482 1254259 1268381 1286980 1309180 1334097 1360622 1387862
59029 1387862 1415275 1441960 1466392 1487301 1504303 1517513 1527266 1534460 1540277 1545137 1548642 1550873
59017 1550873 1552973 1556074 1560455 1566087 1573081 1581167 1589510 1597568 1605364 1612516 1617885 1620659 1620896 1618452
59003 1618452 1612289 1601612 1587008 1569841 1551177 1531879 1512984 1495131 1478108 1461580 1445810
58992 1445810 1431226 1417932 1406204 1396877 1390536 1386825 1385129 1385446 1387995 1392389 1397851 1403919 1410520
$$ packed form
59077B352123j11153j00039r0535q2525p5346o8636o2189n5588m8915m3122l8735
59066A575340l4879l0530k6081k2519j9729j6713j3035r134n651l243k440k902
59054A388484l497l830m838p085r542j1092j2130j3450j4537j4427j3364j2139
59042A268553j0549q016n092k683k63L532Q777J4122J8599K2200K4917K6525K7240
59029A387862K7413K6685K4432K0909J7002J3210R753P194N817M860L505K231
59017A550873K100L101M381N632O994Q086Q343Q058P796P152N369K774K37k444
59003A618452o163j0677j4604j7167j8664j9298j8895j7853j7023j6528j5770
58992A445810j4584j3294j1728r327o341l711j696L17K549M394N462O068O601
$$ plain form
58979 1410520 1417722 1425797 1435216 1446255 1458924 1473359 1489737 1507776 1527139 1548504 1573306 1602000
58967 1602000 1633477 1666650 1701686 1738986 1777830 1816843 1855192 1892551 1928405 1962093 1993209
58956 1993209 2021473 2046741 2069683 2092000 2115479 2141274 2170266 2203292 2240515 2281376 2325812
58945 2325812 2374788 2429057 2488196 2551580 2619529 2692718 2771259 2855370 2946348 3045863 3154686
58934 3154686 3273017 3401704 3542224 3695819 3863594 4047320 4249254 4471177 4714227
58925 4714227 4979567 5268633 5582856 5923760 6293292 6693581 7126384 7592998 8094340
58916 8094340 8630573 9200588 9801968 10431030 11082421 11748580 12419425 13082012 13720440
58907 13720440 14316793 14852702 15310113 15671495 15921387 16049195 16050578 15926399 15681618 15325759
$$ packed form
58979A410520P202Q075R419J1039J2669J4435J6378J8039J9363K1365K4802K8694
58967A602000L1477L3173L5036L7300L8844L9013L8349L7359L5854L3688L1116
58956A993209K8264K5268K2942K2317K3479K5795K8992L3026L7223M0861M4436
58945B325812M8976N4269N9139O3384O7949P3189P8541Q4111R0978R9515J08823
58934C154686J18331J28687J40520J53595J67775J83726K01934K21923K43050
58925D714227K65340K89066L14223L40904L69532M00289M32803M66614N01342
58916H094340N36233N70015O01380O29062O51391O66159O70845O62587O38428
58907A3720440N96353N35909M57411L61382K49892J27808J383j24179k44781l55859
$$ plain form
58897 15325759 14873177 14341450 13749343 13116047 12460609 11800351 11149455 10518978 9917132
58888 9917132 9348848 8815958 8318802 7857232 7429806 7033403 6664977 6323087 6006738
58879 6006738 5713574 5440593 5186116 4949785 4730950 4528271 4340683 4167577 4008139
58870 4008139 3861461 3727172 3605014 3494008 3392985 3301690 3220288 3147855 3082501 3023089
58860 3023089 2969911 2923496 2883653 2849883 2821946 2799723 2783108 2772233 2767305 2768048 2773730 2783820
58848 2783820 2798330 2817567 2841967 2872072 2908252 2950399 2998207 3051709 3111338 3177620 3250993
58837 3250993 3331740 3419918 3515736 3620122 3734412 3859289 3994694 4141215 4300786 4475488
58827 4475488 4666369 4874277 5101228 5349993 5622700 5920733 6245821 6600370 6986713
$$ packed form
58897A5325759m52582n31727n92107o33296o55438o60258o50896o30477o01846
58888I917132n68284n32890m97156m61570m27426l96403l68426l41890l16349
58879F006738k93164k72981k54477k36331k18835k02679j87588j73106j59438
58870D008139j46678j34289j22158j11006j01023r1295q1402p2433o5354n9412
58860C023089n3178m6415l9843l3770k7937k2223j6615j0875m928P43N682J0090
58848B783820J4510J9237K4400L0105L6180M2147M7808N3502N9629O6282P3373
58837C250993Q0747Q8178R5818J04386J14290J24877J35405J46521J59571J74702
58827D475488J90881K07908K26951K48765K72707K98033L25088L54549L86343
$$ plain form
58818 6986713 7406555 7861026 8350638 8875090 9433142 10022110 10636887 11269659 11910665
58809 11910665 12548463 13168887 13754594 14286727 14747052 15118629 15386105 15537425 15565806
58800 15565806 15469869 15252721 14922125 14491173 13977159 13398884 12774804 12122666 11459062
58791 11459062 10798304 10151691 9527683 8932368 8369920 7843097 7353353 6900542 6483226
58782 6483226 6099976 5750175 5433300 5147924 4891740 4661757 4453854 4262816 4083762
58773 4083762 3913351 3749330 3589779 3433677 3281591 3134852 2994393 2861025 2736149
58764 2736149 2621147 2516374 2421566 2336817 2262310 2197459 2141150 2092400 2050102 2012773 1979569
58753 1979569 1951026 1927704 1908525 1891465 1875513 1860800 1847107 1833405 1818841 1803127 1785902
$$ packed form
58818F986713M19842M54471M89612N24452N58052N88968O14777O32772O41006
58809A1910665O37798O20424N85707N32133M60325L71577K67476J51320K8381
58800A5565806r5937k17148l30596m30952n14014n78275o24080o52138o63604
58791A1459062o60758o46613o24008n95315n62448n26823m89744m52811m17316
58782F483226l83250l49801l16875k85376k56184k29983k07903j91038j79054
58773D083762j70411j64021j59551j56102j52086j46739j40459j33368j24876
58764B736149j15002j04773r4808q4749p4507o4851n6309m8750m2298l7329l3204
58753A979569k8543k3322j9179j7060j5952j4713j3693j3702j4564j5714j7225
$$ plain form
58742 1785902 1766454 1744071 1718075 1687826 1653449 1616240 1577732 1538686 1499558 1461239 1424473
58731 1424473 1389143 1355097 1323059 1293663 1266176 1239402 1213303 1188537 1164907 1141592 1118569
58720 1118569 1096419 1075041 1054036 1034155 1016909 1002558 989755 977244 964834 952682 940769
58709 940769 929186 917993 906814 895475 884843 875974 868641 861708 854742 848101 841750 835321 829112
58696 829112 823632 818178 811326 802928 794271 786130 778000 769462 760967 752933 745287 738336 733054 730133
58682 730133 729657 731847 737172 745446 755706 767159 779470 792137 804525 816510 828222 839351
58670 839351 849773 860719 874133 890958 911042 934283 960136 985970 1007627 1022083 1028474 1026573
58658 1026573 1016043 997705 974031 947657 920496 894615 872386 854944 841588 831459 824854
$$ packed form
58742A785902j9448k2383k5996l0249l4377l7209l8508l9046l9128l8319l6766
58731A424473l5330l4046l2038k9396k7487k6774k6099k4766k3630k3315k3023
58720A118569k2150k1378k1005j9881j7246j4351j2803j2511j2410j2152j1913
58709I40769j1583j1193j1179j1339j0632q869p333o933o966o641o351o429o209
58696H29112n480n454o852q398q657q141q130q538q495q034p646o951n282k921
58682G30133m76K190N325Q274J0260J1453J2311J2667J2388J1985J1712J1129
58670H39351J0422J0946J3414J6825K0084K3241K5853K5834K1657J4456O391j901
58658A026573j0530j8338k3674k6374k7161k5881k2229j7442j3356j0129o605
$$ plain form
58647 824854 822242 823042 826208 831319 838558 848287 861061 877299 896497 917522 940084 965211 993980
58634 993980 1026540 1062685 1102664 1147082 1196620 1252037 1313828 1381861 1456133 1537846 1628865
58623 1628865 1730154 1841681 1963847 2097871 2244605 2403934 2575313 2757700 2948682
58614 2948682 3144617 3341718 3535869 3721291 3890604 4036538 4152770 4233384 4273380 4270592
58604 4270592 4226348 4144108 4028456 3885437 3722278 3545901 3362279 3177060 2995418 2820819
58594 2820819 2654937 2499041 2354424 2221410 2099343 1987981 1887754 1798399 1718615 1647507
58584 1647507 1585153 1531342 1484873 1444563 1409882 1380212 1354512 1331989 1312173 1294222 1277315
58573 1277315 1261798 1248728 1238295 1230022 1224364 1222238 1222724 1223033 1221315 1217891 1213205 1206278 1195942
$$ packed form
58647H24854k612Q00L166N111P239R729J2774J6238J9198K1025K2562K5127K8769
58634I93980L2560L6145L9979M4418M9538N5417O1791O8033P4272Q1713R1019
58623A628865J01289J11527J22166J34024J46734J59329J71379J82387J90982
58614B948682J95935J97101J94151J85422J69313J45934J16232Q0614L9996k788
58604D270592m4244q2240j15652j43019j63159j76377j83622j85219j81642j74599
58594B820819j65882j55896j44617j33014j22067j11362j00227q9355p9784p1108
58584A647507o2354n3811m6469m0310l4681k9670k5700k2523j9816j7951j6907
58573A277315j5517j3070j0433q273n658k126M86L09j718l424m686o927j0336
$$ plain form
58560 1195942 1182169 1165487 1146489 1126524 1107438 1089950 1073554 1058343 1045215 1033783 1021934
58549 1021934 1008221 993053 976720 958224 937154 915007 893370 872265 851433 831697 813731
58538 813731 796907 780683 765871 753205 741885 730858 720405 711115 702351 693095 683411 673839
58526 673839 664234 654488 645533 638327 632425 626599 620319 613889 607898 603324 601266 601692 603197 604671
58512 604671 606314 608458 610574 612280 614203 616967 620374 624358 629602 636348 643779 651517 660586 671900
58498 671900 684818 698098 711192 723700 734668 743444 750286 755273 757678 757154 754380 749768 742785
58485 742785 733376 722750 711820 700222 687803 675705 664983 655410 646558 638649 631411 623683 615265
58472 615265 607638 601630 595940 589243 582177 575791 569622 562899 556318 550964 546667 542908 540122 538555
$$ packed form
58560A195942j3773j6682j8998j9965j9086j7488j6396j5211j3128j1432j1849
58549A021934j3713j5168j6333j8496k1070k2147k1637k1105k0832j9736j7966
58538H13731j6824j6224j4812j2666j1320j1027j0453r290q764r256r684r572
58526F73839r605r746q955p206n902n826o280o430n991m574k058M26J505J474
58512F04671J643K144K116J706J923K764L407L984N244O746P431P738R069J1314
58498F71900J2918J3280J3094J2508J0968Q776O842M987K405n24k774m612o983
58485G42785r409j0626j0930j1598j2419j2098j0722r573q852p909p238p728q418
58472F15265p627o008n690o697p066o386o169o723o581n354m297l759k786j567
$$ plain form
58458 538555 537064 534652 532137 530858 530794 531404 533106 536426 540779 545568 551337 558416 565733 572499 579893
58443 579893 589389 600553 612053 623635 635396 646226 654734 660810 664792 666136 664455 660699 655733
58430 655733 649007 640257 631193 623611 617039 610119 603190 597524 593114 589313 586755 586578 588432 591128
58416 591128 594600 599513 605768 612973 621444 630958 639546 645354 648837 651340 652607 651637 648995 646113
58402 646113 643023 638825 633786 629091 625095 621523 618711 616938 615314 612997 610773 609829 609804 609657 609545
58387 609545 610211 611445 612717 614311 616365 618041 619204 621449 625710 630433 634032 637466 642200 647256
58373 647256 650830 653431 656856 661243 665682 670556 676662 683039 688254 692929 698621 705197 711709 718646
58359 718646 726812 735119 742157 748836 756801 765324 772403 777777 782026 783993 782285 778414 775277 773213
$$ packed form
58458E38555j491k412k515j279o4O10J702L320M353M789N769P079P317O766P394
58443E79893R496J1164J1500J1582J1761J0830Q508O076L982J344j681l756m966
58430F55733o726q750r064p582o572o920o929n666m410l801k558j77J854K696
58416E91128L472M913O255P205Q471R514Q588N808L483K503J267r70k642k882
58402F46113l090m198n039m695l996l572k812j773j624k317k224r44k5j47j12
58387F09545O66J234J272J594K054J676J163K245M261M723L599L434M734N056
58373F47256L574K601L425M387M439M874O106O377N215M675N692O576O512O937
58359G18646Q166Q307P038O679P965Q523P079N374M249J967j708l871l137k064
$$ plain form
58345 773213 770560 767357 765423 765326 766268 768427 772503 777442 781484 785087 790230 797375 805658 815186 826473
58330 826473 838370 849291 859590 870222 880253 888573 896713 906907 918520 929624 940745 953682
58318 953682 967812 981062 993297 1005226 1015319 1021748 1026213 1031830 1038237 1042847 1045920 1050087 1055730
58305 1055730 1061220 1067080 1075464 1086004 1096508 1107313 1120601 1135895 1150674 1165041 1181236 1198929
58293 1198929 1215600 1231384 1248927 1268589 1288431 1308819 1332363 1359284 1387387 1416584 1448856
58282 1448856 1483889 1519453 1555961 1595861 1638518 1680416 1720288 1759292 1796520 1829428 1858474
58271 1858474 1886194 1912052 1933586 1952299 1972721 1995837 2019192 2043247 2071520 2104365 2138727
58260 2138727 2174209 2213286 2255531 2297950 2341097 2388380 2439309 2490204 2541609 2597999 2660071
$$ packed form
58345G73213k653l203j934r7R42K159M076M939M042L603N143P145Q283R528J1287
58330H26473J1897J0921J0299J0632J0031Q320Q140J0194J1613J1104J1121J2937
58318I53682J4130J3250J2235J1929J0093O429M465N617O407M610L073M167N643
58305A055730N490N860Q384J0540J0504J0805J3288J5294J4779J4367J6195J7693
58293A198929J6671J5784J7543J9662J9842K0388K3544K6921K8103K9197L2272
58282A448856L5033L5564L6508L9900M2657M1898L9872L9004L7228L2908K9046
58271A858474K7720K5858K1534J8713K0422K3116K3355K4055K8273L2845L4362
58260B138727L5482L9077M2245M2419M3147M7283N0929N0895N1405N6390O2072
$$ plain form
58249 2660071 2724673 2792370 2867211 2948591 3031514 3115671 3206096 3304089 3405993 3511843 3626231
58238 3626231 3749283 3875858 4005399 4143599 4292695 4449335 4613679 4790967 4982150
58229 4982150 5182800 5393264 5619852 5864198 6122029 6394340 6688642 7007235 7346100
58220 7346100 7707544 8101430 8531554 8994144 9492511 10039166 10640595 11294931 12007956
58211 12007956 12795701 13668193 14628446 15691973 16889481 18247050 19785105 21543156
58203 21543156 23585668 25982227 28811407 32193028 36286865 41245907 47193762 54250193
58195 54250193 62544347 72206097 83407223 96443446 111752615 129887270 151566742
58188 151566742 177663383 208688603 243773164 280024128 313190432 339328713 356049144
$$ packed form
58249B660071O4602O7697P4841Q1380Q2923Q4157R0425R7993J01904J05850J14388
58238C626231J23052J26575J29541J38200J49096J56640J64344J77288J91183
58229D982150K00650K10464K26588K44346K57831K72311K94302L18593L38865
58220G346100L61444L93886M30124M62590M98367N46655O01429O54336P13025
58211A2007956P87745Q72492R60253J063527J197508J357569J538055J758051
58203B1543156K042512K396559K829180L381621M093837M959042N947855P056431
58195E4250193Q294154R661750J1201126J3036223J5309169J8134655K1679472
58188A51566742K6096641L1025220L5084561L6250964L3166304K6138281J6720431
$$ plain form
58181 356049144 362434263 358253285 343685748 319807100 289000151 254585431 219890977
58174 219890977 187456936 158750209 134292498 113966042 97331579 83855806 73014085
58167 73014085 64324282 57380383 51879900 47608405 44404390 42161715 40858681 40527846
58159 40527846 41125256 42391195 43852731 45001022 45492290 45191513 44059709 42061813
58151 42061813 39215243 35692616 31820137 27955880 24369984 21210100 18523466 16285881
58143 16285881 14433403 12898001 11624714 10564733 9671134 8908872 8257824 7700249 7214590
58134 7214590 6785067 6406093 6071421 5767843 5484342 5218720 4970390 4734720 4509150
58125 4509150 4297101 4100980 3917960 3746468 3589873 3449716 3321956 3203732 3097246
$$ packed form
58181C56049144O385119m180978j4567537k3878648l0806949l4414720l4694454
58174B19890977l2434041k8706727k4457711k0326456j6634463j3475773j0841721
58167G3014085q689803o943899n500483m271495l204015k242675j303034l30835
58159D0527846N97410J265939J461536J148291M91268l00777j131804j997896
58151D2061813k846570l522627l872479l864257l585896l159884k686634k237585
58143A6285881j852478j535402j273287j059981q93599p62262o51048n57575m85659
58134G214590m29523l78974l34672l03578k83501k65622k48330k35670k25570
58125D509150k12049j96121j83020j71492j56595j40157j27760j18224j06486
$$ plain form
58116 3097246 3003010 2915633 2830336 2747757 2668563 2589268 2507555 2426382 2348829 2273823 2200526
58105 2200526 2131895 2070158 2013356 1959880 1911833 1870469 1832687 1795384 1759021 1723744 1686386
58094 1686386 1644852 1601577 1559388 1517643 1475529 1435322 1399189 1366110 1334812 1306334 1281074
58083 1281074 1256819 1232423 1209938 1190474 1171503 1150918 1130299 1111477 1093381 1074935 1057579
58072 1057579 1042131 1026623 1010088 995077 983400 972732 960576 948392 938563 930241 921581 913434
58060 913434 907409 902583 897281 892004 887560 882413 874836 865874 857451 849383 840777 832450 825425 818901
58046 818901 812137 806486 803175 800954 798251 795722 794345 793064 790804 788915 789073 790548 792015 794271
58032 794271 798452 803176 806160 807447 808577 809760 810195 810032 809713 808371 804982 800248 795564 791117 786507
$$ packed form
58116C097246r4236q7377q5297q2579p9194p9295q1713q1173p7553p5006p3297
58105B200526o8631o1737n6802n3476m8047m1364l7782l7303l6363l5277l7358
58094A686386m1534m3275m2189m1745m2114m0207l6133l3079l1298k8478k5260
58083A281074k4255k4396k2485j9464j8971k0585k0619j8822j8096j8446j7356
58072A057579j5448j5508j6535j5011j1677j0668j2156j2184r829q322q660q147
58060I13434o025m826n302n277m444n147p577q962q423q068q606q327p025o524
58046H18901o764n651l311k221k703k529j377j281k260j889J58J475J467K256
58032G94271M181M724K984J287J130J183M35j63l19j342l389m734m684m447m610
$$ plain form
58017 786507 781987 777515 771993 765080 758417 753534 750010 747140 745594 745700 745919 745044 744267 745058 746494
58002 746494 746722 745515 743377 739634 733578 726187 718646 710477 701141 692099 685108 679618 673969 668119
57988 668119 663223 659598 657013 655831 656022 656201 655549 655416 657109 659513 660993 662237 664777 667897 669574
57973 669574 669595 669255 668736 667357 665862 665918 667463 668738 668844 668336 667495 665919 663765 661679 659563 656836
57957 656836 653734 651017 648804 646921 645856 646082 647119 648625 651515 656523 662499 667733 672136 676399
57943 676399 679924 681483 681185 679760 676512 670028 660549 649681 638119 625504 612189 599169 586471
57930 586471 573559 561210 551110 543466 536740 529841 523093 516946 511346 506595 503487 502360 502982 505220
57916 505220 508763 512548 515777 519249 524363 531080 538206 545350 553149 561730 570436 579015 587759 596436
$$ packed form
58017G86507m520m472n522o913o663m883l524k870j546J06K19q75p77P91J436
58002G46494K28j207k138l743o056p391p541q169r336r042o991n490n649n850
57988F68119m896l625k585j182J91J79o52j33J693K404J480J244K540L120J677
57973F69574K1l40n19j379j495N6J545J275J06n08q41j576k154k086k116k727
57957F56836l102k717k213j883j065K26J037J506K890N008N976N234M403M263
57943F76399L525J559k98j425l248o484r479j0868j1562j2615j3315j3020j2698
57930E86471j2912j2349j0100p644o726o899o748o147n600m751l108j127O22K238
57916E05220L543L785L229L472N114O717P126P144P799Q581Q706Q579Q744Q677
$$ plain form
57902 596436 604265 610816 615859 618596 618301 615500 611371 606268 600006 593052 586074 578727 570399 561799
57888 561799 554247 547627 540728 533438 526963 521901 517825 514875 514084 515768 518975 522910 527636 533111
57874 533111 538807 544600 550928 557804 564678 571392 578229 584930 590715 595375 599306 602510 604631 605866
57860 605866 606611 606246 603622 598919 593748 589187 584911 580448 576000 571633 566824 561315 555607 550248 545422
57845 545422 541389 538445 536256 534088 531871 530235 529348 528526 527083 524839 521782 518026 513983 509745 504475
57830 504475 497363 489066 481128 474098 467316 460415 453749 447252 440191 432376 424562 417362 410734 404679
57816 404679 399425 394704 389913 385280 381943 380576 380736 381712 383140 384755 386511 389115 393441 399254 405444
57801 405444 411723 419067 428289 439116 450878 463041 474840 485422 494785 503715 512516 520585 527384
$$ packed form
57902E96436P829O551N043K737k95k801m129n103o262o954o978p347q328q600
57888E61799p552o620o899p290o475n062m076k950p91J684L207L935M726N475
57874E33111N696N793O328O876O874O714O837O701N785M660L931L204K121J235
57860F05866P45l65k624m703n171m561m276m463m448m367m809n509n708n359m826
57845E45422m033k944k189k168k217j636q87q22j443k244l057l756m043m238n270
57830E04475p112q297p938p030o782o901o666o497p061p815p814p200o628o055
57816D04679n254m721m791m633l337j367J60R76J428J615J756K604M326N813O190
57801D05444O279P344R222J0827J1762J2163J1799J0582R363Q930Q801Q069O799
$$ plain form
57788 527384 532877 536823 538660 538347 536325 532359 525518 515727 504312 492534 480463 467817 455033
57775 455033 442910 431893 422194 414001 407136 401159 396119 392664 391114 391061 392059 393982 396565 399334
57761 399334 402267 405713 409552 413245 416920 421468 427230 433475 439443 445026 450084 454116 457105 459800
57747 459800 462706 465618 468577 472334 477189 482255 486634 490614 494978 499705 504205 508400 512818 517852
57733 517852 523514 529740 536502 543801 551848 561067 571704 583634 596676 610791 625955 642208 659814
57720 659814 678924 699120 719851 741284 764206 789116 816014 844970 876201 909721 945821
57709 945821 985825 1031405 1083100 1140448 1203721 1274490 1354311 1443921 1544034 1655777 1779759
57698 1779759 1915643 2063192 2223010 2395690 2580795 2776777 2980857 3188308 3392442
$$ packed form
57788E27384N493L946J837l13k022l966o841r791j1415j1778j2071j2646j2784
57775D55033j2123j1017r699q193o865n977n040l455j550n3R98J923K583K769
57761C99334K933L446L839L693L675M548N762O245N968N583N058M032K989K695
57747D59800K906K912K959L757M855N066M379L980M364M727M500M195M418N034
57733E17852N662O226O762P299Q047R219J0637J1930J3042J4115J5164J6253J7606
57720F59814J9110K0196K0731K1433K2922K4910K6898K8956L1231L3520L6100
57709I45821M0004M5580N1695N7348O3273P0769P9821Q9610J00113J11743J23982
57698A779759J35884J47549J59818J72680J85105J95982K04080K07451K04134
$$ plain form
57689 3392442 3585705 3760330 3908222 4021710 4095333 4126602 4115296 4063415 3976228 3861926
57679 3861926 3729297 3586264 3440601 3300329 3172331 3061564 2972356 2909413 2876929 2877848
57669 2877848 2914165 2985181 3082767 3189215 3282386 3344043 3363507 3335629 3258657 3135093 2973100
57658 2973100 2785796 2588830 2397341 2222980 2072232 1947127 1847162 1770446 1714161 1675523
57648 1675523 1652706 1644509 1649551 1666545 1695037 1735055 1786283 1848354 1921782 2007641 2106348 2217490
57636 2217490 2340734 2476195 2623804 2782741 2951122 3125449 3300377 3469525 3626330
57627 3626330 3763692 3873580 3948415 3983381 3977029 3930088 3844707 3724928 3576899 3408037
57617 3408037 3225993 3037907 2849579 2665049 2487305 2319268 2163393 2020455 1889670
$$ packed form
57689C392442J93263J74625J47892J13488P3623L1269j1306n1881q7187j14302
57679C861926j32629j43033j45663j40272j27998j10767q9208o2943l2484R19
57669B877848L6317P1016R7586J06448R3171O1657J9464k7878p6972j23564j61993
57658B973100j87304j96966j91489j74361j50748j25105r9965p6716n6285l8638
57648A675523k2817q197N042J6994K8492M0018N1228O2071P3428Q5859R8707J11142
57636B217490J23244J35461J47609J58937J68381J74327J74928J69148J56805
57627C626330J37362J09888P4835L4966o352m6941q5381j19779j48029j68862
57617C408037j82044j88086j88328j84530j77744j68037j55875j42938j30785
$$ plain form
57608 1889670 1770285 1662376 1565851 1479394 1400987 1329207 1263728 1204750 1152236 1105583 1063877
57597 1063877 1026400 992725 962291 934207 907811 883244 861142 841888 825338 810950 797807
57586 797807 784861 771693 758930 747525 737797 729441 722095 715441 709120 703166 698277 695054 693186
57573 693186 691990 691500 692298 694451 697468 701283 706485 713422 721764 731175 741826 754043 767957 783735
57559 783735 801709 822078 844854 870181 898354 929430 963268 1000049 1040449 1085248 1135175
57548 1135175 1191134 1254072 1324479 1402426 1488210 1582539 1685895 1798094 1918639 2047106
57538 2047106 2182823 2324215 2468414 2611172 2747087 2870245 2974944 3055951 3108531 3129070
57528 3129070 3116167 3071027 2996769 2897534 2778251 2644668 2502907 2358620 2216265 2078959
$$ packed form
57608A889670j19385j07909r6525q6457p8407p1780o5479n8978n2514m6653m1706
57597A063877l7477l3675l0434k8084k6396k4567k2102j9254j6550j4388j3143
57586G97807j2946j3168j2763j1405r728q356p346o654o321n954m889l223j868
57573F93186j196m90P98K153L017L815N202O937Q342R411J0651J2217J3914J5778
57559G83735J7974K0369K2776K5327K8173L1076L3838L6781M0400M4799M9927
57548A135175N5959O2938P0407P7947Q5784R4329J03356J12199J20545J28467
57538B047106J35717J41392J44199J42758J35915J23158J04699Q1007N2580K0539
57528C129070j2903m5140p4258r9235j19283j33583j41761j44287j42355j37306
$$ plain form
57518 2078959 1948869 1827705 1716754 1616435 1526241 1445484 1374026 1311955 1258704 1212904
57508 1212904 1173129 1138521 1108673 1083307 1062204 1045297 1032637 1024208 1019656 1018252 1019368 1023095
57496 1023095 1030045 1040442 1053829 1070005 1089769 1114249 1143878 1178625 1218991 1266032 1320479
57485 1320479 1382465 1452156 1530045 1616539 1711779 1815998 1929524 2052092 2182349 2317928
57475 2317928 2455523 2590679 2717858 2830980 2923980 2991240 3028289 3032494 3003191 2941451 2850185
57464 2850185 2734299 2599956 2453218 2299398 2143450 1990215 1843788 1706759 1580186
57455 1580186 1464134 1358270 1262231 1175697 1098178 1028950 967322 912754 864465 821210 781850
57444 781850 746004 713734 684816 658754 635294 614325 595410 577933 561695 546796 533031
$$ packed form
57518B078959j30090j21164j10951j00319r0194q0757p1458o2071n3251m5800
57508A212904l9775l4608k9848k5366k1103j6907j2660q429m552j404J116L727
57496A023095O950J0397J3387J6176J9764K4480K9629L4747M0366M7041N4447
57485A320479O1986O9691P7889Q6494R5240J04219J13526J22568J30257J35579
57475B317928J37595J35156J27179J13122R3000O7260L7049M205k9303o1740r1266
57464B850185j15886j34343j46738j53820j55948j53235j46427j37029j26573
57455A580186j16052j05864r6039q6534p7519o9228o1628n4568m8289m3255l9360
57444G81850l5846l2270k8918k6062k3460k0969j8915j7477j6238j4899j3765
$$ plain form
57433 533031 520004 507769 496696 486685 477195 468068 459644 451941 444471 437062 430138 423904 417990
57420 417990 412277 407321 403446 400030 396338 392654 389952 388673 388325 388073 387241 385494 383045 380641 378960
57405 378960 378036 377479 377140 377273 378179 379860 381921 383595 384101 383277 381829 380818 380878 381921 383298 384165 384000
57388 384000 383011 381908 381183 380738 380297 379873 379665 379730 379902 379939 379714 379401 379402 379806 380068 379595 378560 377608 376779
57369 376779 375486 373667 372239 371981 372545 373035 373045 372678 372038 371300 370920 371195 371865 372646 373842 375918 378663
57352 378663 381425 383981 386596 389308 391829 394250 397257 401327 406048 410499 414143 417159 420081 423274
57338 423274 426749 430315 433766 436863 439382 441408 443469 446033 448889 451463 453754 456501 460312 465111
57324 465111 470586 476580 482766 488615 494133 500102 507038 514462 521819 529605 538749 549201 560053 570995
$$ packed form
57433E33031j3027j2235j1073j0011r490r127q424p703p470p409o924o234n914
57420D17990n713m956l875l416l692l684k702j279l48k52q32j747k449k404j681
57405C78960r24n57l39J33R06J681K061J674N06q24j448j011O0J043J377Q67j65
57388C84000r89j103p25m45m41m24k08O5J72L7k25l13JM04K62m73j035r52q29
57369C76779j293j819j428k58N64M90J0l67o40p38l80K75O70P81J196K076K745
57352C78663K762K556K615K712K521K421L007M070M721M451L644L016K922L193
57338D23274L475L566L451L097K519K026K061K564K856K574K291K747L811M799
57324D65111N475N994O186N849N518N969O936P424P357P786R144J0452J0852J0942
$$ plain form
57310 570995 582772 596027 610473 625491 641040 657664 675882 695759 716912 738905 761834
57299 761834 786332 812752 840526 868677 896707 924490 951519 976870 999847 1020104 1037172
57288 1037172 1050400 1059237 1063002 1060596 1051303 1035960 1016494 994188 969194 941927 913945 886894
57276 886894 861327 837136 814497 793751 774948 758242 744327 733635 725341 717932 710700 704070
57264 704070 698582 694256 691019 689052 688481 689152 690924 693831 697736 702159 706669 711210 715844 720429 724834
57249 724834 729378 734779 741610 749857 758952 768149 776847 784743 791824 798316 804631 811301 818881 827718
57235 827718 837663 848035 858116 867855 877976 889257 901845 915431 929849 945146 961160 977464
57223 977464 993849 1010550 1027977 1046405 1065813 1085624 1104693 1122179 1138641 1155715 1174445
$$ packed form
57310E70995J1777J3255J4446J5018J5549J6624J8218J9877K1153K1993K2929
57299G61834K4498K6420K7774K8151K8030K7783K7029K5351K2977K0257J7068
57288A037172J3228Q837L765k406r293j5343j9466k2306k4994k7267k7982k7051
57276H86894k5567k4191k2639k0746j8803j6706j3915j0692q294p409p232o630
57264G04070n488m326l237j967n71O71J772K907L905M423M510M541M634M585M405
57249G24834M544N401O831Q247R095R197Q698P896P081O492O315O670P580Q837
57235H27718R945J0372J0081R739J0121J1281J2588J3586J4418J5297J6014J6304
57223I77464J6385J6701J7427J8428J9408J9811J9069J7486J6462J7074J8730
$$ plain form
57212 1174445 1194386 1214670 1235423 1257582 1281701 1307539 1334629 1362675 1391483 1421016 1451598
57201 1451598 1483687 1517309 1551941 1586917 1621806 1656576 1691637 1727490 1763974 1800072 1834926
57190 1834926 1868876 1903068 1938137 1973838 2009915 2046673 2084521 2123460 2163309 2204100 2246045
57179 2246045 2289353 2334207 2380672 2428522 2477449 2527416 2578488 2630333 2682389 2734553 2787232
57168 2787232 2840528 2893866 2946614 2998567 3049575 3099233 3147289 3193866 3238782 3281102 3319961
57157 3319961 3355556 3388747 3419874 3448622 3475001 3499863 3524331 3549274 3575516 3604138 3636241
57146 3636241 3672521 3713264 3758609 3808618 3862996 3920818 3980567 4040377 4098101 4151123 4196581
57135 4196581 4232545 4259270 4279085 4295132 4310625 4329153 4354477 4389135 4433404 4485881 4544357
$$ packed form
57212A174445J9941K0284K0753K2159K4119K5838K7090K8046K8808K9533L0582
57201A451598L2089L3622L4632L4976L4889L4770L5061L5853L6484L6098L4854
57190A834926L3950L4192L5069L5701L6077L6758L7848L8939L9849M0791M1945
57179B246045M3308M4854M6465M7850M8927M9967N1072N1845N2056N2164N2679
57168B787232N3296N3338N2748N1953N1008M9658M8056M6577M4916M2320L8859
57157C319961L5595L3191L1127K8748K6379K4862K4468K4943K6242K8622L2103
57146C636241L6280M0743M5345N0009N4378N7822N9749N9810N7724N3022M5458
57135D196581L5964K6725J9815J6047J5493J8528K5324L4658M4269N2477N8476
$$ plain form
57124 4544357 4605460 4664297 4715938 4757850 4790816 4818106 4844630 4876327 4918618 4974288 5042872
57113 5042872 5122004 5208972 5301514 5398690 5501986 5615333 5743693 5891655 6063150 6261857
57103 6261857 6492030 6759893 7074764 7448922 7897071 8437173 9091755 9887149 10850554
57094 10850554 12006894 13375344 14964475 16769045 18773544 20960731 23316582 25827508
57086 25827508 28474903 31231230 34055074 36885303 39643196 42245948 44617447 46681382
57078 46681382 48346533 49511155 50093627 50063109 49440963 48274562 46610313 44486617 41945401
57069 41945401 39048188 35884159 32564748 29207835 25921065 22792393 19887638 17250138
57061 17250138 14900994 12842118 11061853 9539747 8249316 7160824 6244664 5473180
$$ packed form
57124D544357O1103N8837N1641M1912L2966K7290K6524L1697M2291N5670O8584
57113E042872P9132Q6968R2542R7176J03296J13347J28360J47962J71495J98707
57103F261857K30173K67863L14871L74158M48149N40102O54582P95394R63405
57094A0850554J156340J368450J589131J804570K004499K187187K355851K510926
57086B5827508K647395K756327K823844K830229K757893K602752K371499K063935
57078D6681382J665151J164622N82472l0518o22146j166401j664249k123696k541216
57069D1945401k897213l164029l319411l356913l286770l128672k904755k637500
57061A7250138k349144k058876j780265j522106j290431j088492r16160p71484
$$ plain form
57053 5473180 4820247 4260970 3773041 3338515 2944694 2584377 2255611 1959963 1699525
57044 1699525 1474686 1283721 1123312 989084 876447 781551 701408 633248 574421 523031
57034 523031 477988 438248 402639 370628 342526 318484 297784 279514 263417 249652 238139
57023 238139 228625 221087 215608 212022 209940 209038 209167 210537 213949 220463 230542 243841 260111 280007
57009 280007 304753 335462 373289 420148 478918 552638 642883 747736 860616 971612 1070903
56998 1070903 1151227 1207109 1232714 1222143 1173124 1090626 986554 875335 768832 674006 593799
56987 593799 528924 478735 441477 415053 397813 388155 383492 380428 376299 370000 361197 349410 334312
56974 334312 316263 296031 274431 252713 232769 216175 203231 193454 186712 183264 182950 185163 189631
$$ packed form
57053E473180o52933n59277m87929m34526l93821l60317l28766k95648k60438
57044A699525k24839j90965j60409j34228j12637r4896q0143o8160n8827n1390
57034E23031m5043l9740l5609l2011k8102k4042k0700j8270j6097j3765j1513
57023B38139r514p538n479l586k082r02J29J370L412O514J0079J3299J6270J9896
57009B80007K4746L0709L7827M6859N8770P3720R0245J04853J12880J10996R9291
56998A070903Q0324N5882K5605j0571m9019q2498j04072j11219j06503r4826q0207
56987E93799o4875n0189l7258k6424j7240r658m663l064m129o299q803j1787j5098
56974C34312j8049k0232k1600k1718j9944j6594j2944r777o742l448l14K213M468
$$ plain form
56961 189631 196590 206176 218257 232961 250671 271027 292219 311577 326739 336215 339208 335339
56949 335339 324671 307934 286642 262860 238721 216058 196318 180501 168965 161396 157112 155406
56937 155406 155744 157989 162690 171003 184128 202771 226776 254697 283624 310005 331030 345083
56925 345083 350985 347601 334629 313271 285664 254078 220983 189130 160699 136501 116374 99943
56913 99943 86519 74988 64713 56220 50132 45736 41491 36771 32194 28397 25435 23347 22238 21653
56899 21653 20850 20000 20283 22466 26134 30612 35892 42217 49483 57556 66794 77866 91425 108027
56885 108027 127655 148942 169389 186793 200147 209066 213056 211838 205908 196380 184625 172243
56873 172243 160805 151192 143570 138231 135951 137251 141875 149413 159985 174054 192181 215315 244598
$$ packed form
56961A89631O959R586J2081J4704J7710K0356K1192J9358J5162R476K993l869
56949C35339j0668j6737k1292k3782k4139k2663j9740j5817j1536p569m284j706
56937A55406L38K245M701Q313J3125J8643K4005K7921K8927K6381K1025J4053
56925C45083N902l384j2972k1358k7607l1586l3095l1853k8431k4198k0127j6431
56913I9943j3424j1531j0275q493o088m396m245m720m577l797k962k088j109n85
56899B1653q03q50K83K183L668M478N280O325P266Q073R238J1072J3559J6602
56885A08027J9628K1287K0447J7404J3354Q919L990j218n930r528j1755j2382
56873A72243j1438r613p622n339k280J300M624P538J0572J4069J8127K3134K9283
$$ plain form
56860 244598 280195 320526 362852 403969 440133 467471 483538 488089 481736 464626 437468 403334
56848 403334 367111 333051 303445 279310 261159 249030 242782 242753 249614 263522 284133 311648
56836 311648 347365 392983 449547 516431 590134 663815 729111 779355 811096 822839 813560 783340
56824 783340 734996 674194 607767 541885 481187 428625 385637 352554 328984 314035 306594 305794
56812 305794 311324 323310 342200 368915 404744 450216 503427 559327 610970 651948 678176 687865
56800 687865 680426 655962 615978 564272 506600 449029 396110 350025 311032 278632 252508 232665
56788 232665 219039 211304 209020 211744 219013 230577 246743 268015 293942 322211 349017 370394
56776 370394 383494 387125 381427 367072 344792 315821 282513 247972 214897 184971 159143 137797
$$ packed form
56860B44598L5597M0331M2326M1117L6164K7338J6067M551o353j7110k7158l4134
56848D03334l6223l4060k9606k4135j8151j2129o248k9O861J3908K0611K7515
56836C11648L5717M5618N6564O6884P3703P3681O5296N0244L1741J1743r279l0220
56824G83340m8344o0802o6427o5882o0698n2562m2988l3083k3570j4949p441q00
56812C05794N530J1986J8890K6715L5829M5472N3211N5900N1643M0978K6228R689
56800F87865p439k4464l9984n1706n7672n7571n2919m6085l8993l2400k6124j9843
56788B32665j3626p735k284K724P269J1564J6166K1272K5927K8269K6806K1377
56776C70394J3100L631n698j4355k2280k8971l3308l4541l3075k9926k5828k1346
$$ plain form
56764 137797 120543 106541 95404 87225 81518 76854 72108 67456 63555 60295 57107 54062 51787
56751 51787 50378 49141 47399 45072 42486 40087 38257 36935 35593 33950 32494 31829 31786 31743 31540 31398
56735 31398 31131 30233 28746 27313 26292 25412 24354 23103 21694 20217 19093 18734 18832 18616 17919 17393 17491
56718 17491 17822 17774 17296 16804 16726 17319 18542 19881 20713 20991 21218 21629 21888 21752 21536 21629 21926 22055 21946
56699 21946 21932 22467 23855 26036 28518 30767 32690 34502 36188 37499 38463 39446 40581 41585 42305 43020
56683 43020 43937 44722 44822 44106 43032 42272 42186 42470 42326 41199 39265 37040 34753 32473 30605 29624 29373
56666 29373 29225 29010 29210 30025 30821 30775 29711 28121 26670 25851 25755 26045 26419 27103 28502 30364 31839 32476
56648 32476 32683 32986 33302 33219 32619 31786 31108 30845 30945 31074 31082 31359 32331 33668 34547 34743 34854 35359 36025 36448
$$ packed form
56764A37797j7254j4002j1137q179n707m664m746m652l901l260l188l045k275
56751E1787j409j237j742k327k586k399j830j322j342j643j456o65m3m3k03j42
56735C1398k67q98j487j433j021q80j058j251j409j477j124l59R8k16o97n26R8
56718A7491L31m8m78m92p8N93J223J339Q32K78K27M11K59j36k16R3K97J29j09
56699B1946j4N35J388K181K482K249J923J812J686J311R64R83J135J004P20P15
56683D3020R17P85J00p16j074p60q6K84j44j127j934k225k287k280j868r81k51
56666B9373j48k15K00Q15P96m6j064j590j451q19r6K90L74O84J399J862J475O37
56648C2476K07L03L16q3o00q33o78k63J00J29QK77R72J337Q79J96J11N05O66M23
$$ plain form
56628 36448 36629 36741 36826 36929 37138 37298 37145 36892 37147 38047 39026 39695 40390 41530 42930 44161 45191 46245
56610 46245 47328 48201 48569 48137 46859 45316 44385 44239 44145 43479 42555 42121 42499 43511 44866 46225 47313
56593 47313 48300 49705 51536 52894 52928 51961 51255 51808 53675 56322 59273 62366 65525 68291 69826 69665
56577 69665 68442 67418 67370 68308 70157 72981 76458 79841 82748 85463 88291 91245 94504 98457 102979
56562 102979 107389 111499 115930 120932 125686 129453 132752 136643 141298 146065 150472 154381 157401 159019
56548 159019 159319 158933 158268 157261 155841 154123 152062 149275 145409 140627 135692 131502 128184 124701 119809
56533 119809 113564 107449 102799 99649 97311 95449 94027 92755 91247 89553 88024 86813 85868 85173 84608
56518 84608 83769 82351 80579 78947 77618 76363 75018 73769 73040 73093 73671 74071 73860 73340 73007 72739 72007
$$ packed form
56628C6448J81J12Q5J03K09J60j53k53K55R00R79O69O95J140J400J231J030J054
56610D6245J083Q73L68m32j278j543r31j46r4o66r24m34L78J012J355J359J088
56593D7313R87J405J831J358L4r67p06N53J867K647K951L093L159K766J535j61
56577F9665j223j024m8R38J849K824L477L383K907K715K828K954L259L953M522
56562A02979M410M110M431N002M754L767L299L891M655M767M407L909L020J618
56548A59019L00l86o65j007j420j718k061k787l866m782m935m190l318l483m892
56533A19809o245o115m650l150k338j862j422j272j508j694j529j211r45o95n65
56518H4608q39j418j772j632j329j255j345j249p29N3N78M00k11n20l33k68p32
$$ plain form
56501 72007 70744 69402 68319 67719 68103 69701 71568 72291 71787 71416 72115 73495 75034 76928 79236 81335
56485 81335 82894 84450 86334 88064 89475 91408 94411 97711 100366 102575 104822 106693 107615 108045 108741
56470 108741 109523 109896 110319 111627 113601 115294 116456 117606 118957 120307 121709 123247 124400 124583 124136
56455 124136 123882 123920 123685 123011 122276 121703 121287 121157 121317 121346 121042 120936 121469 122159 122398 122458 122834 123201 123107 123040
56435 123040 123630 124314 124145 123497 123562 124444 125198 125578 126234 127067 126918 125243 122887 120850 119260 117845 116459
56418 116459 114871 112854 110750 109180 108142 107120 106028 105212 104595 103829 103265 103721 105203 106864 108340
56403 108340 110083 112240 114208 115614 116764 117823 118453 118583 118763 119420 120444 121785 123726 126282 128874
56388 128874 130894 132161 132840 133363 134361 136032 137712 138657 139060 139552 140039 139946 139460 139520 140564 142235 144311
$$ packed form
56501G2007j263j342j083o00L84J598J867P23n04l71O99J380J539J894K308K099
56485H1335J559J556J884J730J411J933L003L300K655K209K247J871R22M30O96
56470A08741P82L73M23J308J974J693J162J150J351J350J402J538J153J83m47
56455A24136k54L8k35o74p35n73m16j30J60K9l04j06N33O90K39O0L76L67r4o7
56435A23040N90O84j69o48O5Q82P54L80O56Q33j49j675k356k037j590j415j386
56418A16459j588k017k104j570j038j022j092q16o17p66n64M56J482J661J476
56403A08340J743K157J968J406J150J059O30J30J80O57J024J341J941K556K592
56388A28874K020J267O79N23R98J671J680R45M03M92M87r3m86O0J044J671K076
$$ plain form
56371 144311 146911 149700 151902 153295 154435 155780 157371 159348 161867 164489 166535 168074 169710 171449
56357 171449 172805 173996 175836 178293 180298 181321 182120 183555 185626 188061 190964 194330 197689 200724
56343 200724 203772 207384 211824 217064 222768 228247 233023 237474 242364 247789 253176 258137 262722 266970
56329 266970 270954 274992 279087 282506 284759 286542 288705 290689 291260 290481 289631 289301 288965 288366 287883 287465
56313 287465 286598 285561 285329 285951 286266 285573 284442 283630 283401 284125 286269 289384 292206 294205 296084 298566
56297 298566 301750 305819 311177 317588 324272 331178 339164 348700 359359 370682 382502 394395 406057
56284 406057 418294 432435 448688 466337 485472 507014 531001 556494 583469 613197 646385
56273 646385 682543 721681 765067 813767 867886 927807 994710 1069313 1151483 1241517 1340335
$$ packed form
56371A44311K600K789K202J393J140J345J591J977K519K622K046J539J636J739
56357A71449J356J191J840K457K005J023P99J435K071K435K903L366L359L035
56343B00724L048L612M440N240N704N479M776M451M890N425N387M961M585M248
56329B66970L984M038M095L419K253J783K163J984N71p79q50l30l36n99m83m18
56313B87465q67j037k32O22L15o93j131q12k29P24K144L115K822J999J879K482
56297B98566L184M069N358O411O684O906P986R536J0659J1323J1820J1893J1662
56284D06057J2237J4141J6253J7649J9135K1542K3987K5493K6975K9728L3188
56273F46385L6158L9138M3386M8700N4119N9921O6903P4603Q2170R0034R8818
$$ plain form
56262 1340335 1447902 1562997 1685143 1815187 1953195 2097156 2244362 2392540 2538902
56253 2538902 2679605 2811120 2931056 3037115 3126679 3198092 3251020 3284967 3298995 3293594 3271335
56242 3271335 3234988 3186557 3128665 3064912 2997620 2926749 2852042 2774671 2695708 2614489 2529779
56231 2529779 2441328 2349334 2253827 2155665 2056699 1957816 1858190 1757583 1657994 1561819 1469702
56220 1469702 1381394 1297390 1218362 1144157 1074682 1010754 952954 900630 853045 810343 772407
56209 772407 738070 706544 678405 654076 632593 613004 595676 581028 568204 556238 545347
56198 545347 535937 527547 519954 514086 510641 508908 508017 508100 509146 510154 510665 511823 514599 518211 521557
56183 521557 524954 529116 533651 537849 541888 546001 549559 552091 554061 555731 556530 556498 556826 557993 559011
$$ packed form
56262A340335J07567J15095J22146J30044J38008J43961J47206J48178J46362
56253B538902J40703J31515J19936J06059Q9564P1413N2928L3947J4028n401k2259
56242C271335l6347m8431n7892o3753o7292p0871p4707p7371p8963q1219q4710
56231B529779q8451r1994r5507r8162r8966r8883r9626j00607r9589r6175r2117
56220A469702q8308q4004p9028p4205o9475o3928n7800n2324m7585m2702l7936
56209G72407l4337l1526k8139k4329k1483j9589j7328j4648j2824j1966j0891
56198E45347r410q390p593n868l445j733q91Q3J046J008N11J158K776L612L346
56183E21557L397M162M535M198M039M113L558K532J970J670P99l2L28J167J018
$$ plain form
56168 559011 559634 561431 565341 569962 573801 577525 582461 588573 595562 604227 614997 626724 638675 652270
56154 652270 669133 688975 711034 735944 764423 795891 830349 870061 917449 972924 1036752
56143 1036752 1111379 1199742 1302860 1421115 1556155 1708857 1876406 2053340 2234054 2412433
56133 2412433 2581088 2734065 2869698 2988922 3092240 3180364 3255889 3321208 3375591 3416651
56123 3416651 3443610 3456909 3456130 3441179 3414539 3379471 3336368 3282840 3216419 3134952 3035621 2916445
56111 2916445 2778623 2625729 2461603 2290835 2119871 1955159 1800760 1659225 1533053
56102 1533053 1423167 1327584 1244054 1172668 1113782 1065135 1023607 988202 958861 934003 912013
56091 912013 893546 879591 868685 858730 849982 843521 838481 833652 830115 829237 829758 829867 830489 833417
$$ packed form
56168E59011O23J797L910M621L839L724M936O112O989Q665J0770J1727J1951J3595
56154F52270J6863J9842K2059K4910K8479L1468L4458L9712M7388N5475O3828
56143A036752P4627Q8363J03118J18255J35040J52702J67549J76934J80714J78379
56133B412433J68655J52977J35633J19224J03318Q8124P5525O5319N4383M1060
56123C416651K6959J3299p79j4951k6640l5068m3103n3528o6421q1467r9331j19176
56111B916445j37822j52894j64126j70768j70964j64712j54399j41535j26172
56102A533053j09886r5583q3530p1386n8886m8647m1528l5405k9341k4858k1990
56091I12013j8467j3955j0906r955q748o461n040m829l537q78N21J09O22K928
$$ plain form
56077 833417 837934 842470 847710 854733 861961 867645 873510 882140 892390 901366 909385 918962 930194 941185
56063 941185 951855 963396 975103 985539 995647 1007125 1019122 1030179 1041684 1055541 1070315
56052 1070315 1083829 1097636 1114443 1133022 1150447 1167624 1187651 1210287 1233045 1256173 1281416
56041 1281416 1307374 1331425 1354961 1381382 1410242 1438670 1467140 1498175 1530730 1561693 1591718
56030 1591718 1623726 1656865 1688089 1718630 1752643 1790355 1828724 1867802 1910017 1954240 1997217
56019 1997217 2040069 2086695 2136577 2186041 2235754 2289869 2348452 2407898 2468196 2532542 2600590
56008 2600590 2669545 2741159 2819955 2905337 2993233 3084546 3183721 3290006 3398825 3510861 3630725
55997 3630725 3757553 3886404 4018240 4158795 4308330 4462613 4623371 4797152 4984447
$$ packed form
56077H33417M517M536N240P023P228N684N865Q630J0250Q976Q019R577J1232J0991
56063I41185J0670J1541J1707J0436J0108J1478J1997J1057J1505J3857J4774
56052A070315J3514J3807J6807J8579J7425J7177K0027K2636K2758K3128K5243
56041A281416K5958K4051K3536K6421K8860K8428K8470L1035L2555L0963L0025
56030A591718L2008L3139L1224L0541L4013L7712L8369L9078M2215M4223M2977
56019A997217M2852M6626M9882M9464M9713N4115N8583N9446O0298O4346O8048
56008B600590O8955P1614P8796Q5382Q7896R1313R9175J06285J08819J12036J19864
55997C630725J26828J28851J31836J40555J49535J54283J60758J73781J87295
$$ plain form
55988 4984447 5180810 5388032 5612738 5854696 6108729 6377639 6670564 6989123 7328654
55979 7328654 7692637 8091645 8528461 8999305 9509487 10072009 10691132 11364365 12100455
55970 12100455 12917438 13823763 14821609 15928944 17177522 18590445 20186483 22007920
55962 22007920 24121104 26594465 29509724 32996480 37220213 42329289 48442370 55682041
55954 55682041 64180920 74070324 85535455 98901633 114635254 133319043 155737553
55947 155737553 182839735 215084070 251292423 288102915 320929292 345826511 360644088
55940 360644088 364718088 358008966 340923307 314849099 282450407 247149812 212181305
55933 212181305 179889171 151532423 127456760 107424057 90935854 77436744 66390270
$$ packed form
55988D984447J96363K07222K24706K41958K54033K68910K92925L18559L39531
55979G328654L63983L99008M36816M70844N10182N62522O19123O73233P36090
55970A2100455Q16983R06325R97846J107335J248578J412923J596038J821437
55962B2007920K113184K473361K915259L486756M223733N109076O113081P239671
55954E5682041Q498879R889404J1465131J3366178J5733621J8683789K2418510
55947A55737553K7102182L2244335L6208353L6810492L2826377K4897219J4817577
55940C60644088M074000o709122j7085659k6074208l2398692l5300595l4968507
55933B12181305l2292134k8356748k4075663k0032703j6488203j3499110j1046474
$$ plain form
55926 66390270 57311516 49802699 43559901 38340818 33942183 30206897 27022354 24294893
55918 24294893 21937186 19881850 18085825 16512098 15121149 13884145 12787344 11816483
55910 11816483 10950034 10171965 9476684 8856103 8294618 7781431 7315364 6892984 6503794
55901 6503794 6141502 5808666 5505737 5225926 4964858 4724925 4506032 4301669 4108025
55892 4108025 3927796 3761502 3604027 3453126 3312536 3183319 3060656 2942445 2832667
55883 2832667 2732874 2638428 2546475 2459865 2380014 2303576 2229387 2161119 2099653 2040019 1979279
55872 1979279 1920513 1865774 1811981 1757180 1704327 1655445 1608349 1562446 1521628 1487956 1458342
55861 1458342 1430795 1408205 1392419 1379873 1366373 1351226 1333782 1311202 1282872 1252250 1221396
$$ packed form
55926F6390270r078754p508817o242798n219083m398635l735286l184543k727461
55918B4294893k357707k055336j796025j573727j390949j237004j096801r70861
55910A1816483q66449p78069o95281o20581n61485n13187m66067m22380l89190
55901F503794l62292l32836l02929k79811k61068k39933k18893k04363j93644
55892D108025j80229j66294j57475j50901j40590j29217j22663j18211j09778
55883B832667r9793r4446r1953q6610p9851p6438p4189o8268o1466n9634o0740
55872A979279n8766n4739n3793n4801n2853m8882m7096m5903m0818l3672k9614
55861A458342k7547k2590j5786j2546j3500j5147j7444k2580k8330l0622l0854
$$ plain form
55850 1221396 1188350 1152523 1117608 1086229 1056473 1026612 998535 973499 949109 923682 899316
55839 899316 877671 856808 835152 814550 796540 779491 762210 746552 733751 721923 709860
55828 709860 699605 692624 687134 681725 677958 676749 675857 673640 671843 672006 672486 671590 670351 669634 667814
55813 667814 663827 659292 655124 649267 640295 630113 620646 610982 600201 589862 581194 572945 564443
55800 564443 557596 553341 549299 543611 537939 533952 529972 524046 517433 511943 506522 499635 492693 488160
55786 488160 486328 486465 488784 492509 494293 491457 484840 476060 464277 448350 430045 412144 395218
55773 395218 378988 365004 355120 348707 343840 339870 336599 332582 326556 319144 311080 301398 289432
55760 289432 276959 266190 257194 249250 242987 239066 236351 233456 230600 228183 225225 221067 216817 213232
$$ packed form
55850A221396l3046l5827l4915l1379k9756k9861k8077k5036k4390k5427k4366
55839H99316k1645k0863k1656k0602j8010j7049j7281j5658j2801j1828j2063
55828G09860j0255o981n490n409l767j209q92k217j797J63M80q96j239p17j820
55813F67814l987m535m168n857q972j0182r467r664j0781j0339q668q249q502
55800E64443o847m255m042n688n672l987l980n926o613n490n421o887o942m533
55786D88160j832J37K319L725J784k836o617q780j1783j5927j8305j7901j6926
55773C95218j6230j3984r884o413m867l970l271m017o026p412q064r682j1966
55760B89432j2473j0769q996p944o263l921k715k895k856k417k958m158m250l585
$$ plain form
55746 213232 209067 203429 197801 193669 190118 185919 181968 179419 177336 174618 172314 171553 170923 168514 164974
55731 164974 162035 159625 157024 155256 155618 157048 157612 157354 157187 156271 153291 149288 146516 145279 144376 143795
55715 143795 144401 145691 146412 146897 148509 151273 154184 157233 161000 164899 167961 170786 174613 178914 181973
55700 181973 183362 183891 183610 181816 178724 175297 171778 168009 164722 162821 161809 160535 159063 158340 158519
55685 158519 159108 160278 162665 166336 171059 176839 183109 188511 192736 197395 203646 210234 215389 219296
55671 219296 222913 225763 226983 227379 228299 229435 229840 230083 231172 232231 231556 229343 227158 225341 223081
55656 223081 220489 218383 216523 214116 211538 209426 206705 201812 195387 189459 184317 178560 171948 165691
55642 165691 159973 153650 146645 140386 135455 130896 126170 121875 118097 113986 109477 105680 102956 100196
$$ packed form
55746B13232m165n638n628m132l551m199l951k549k083k718k304p61o30k409l540
55731A64974k939k410k601j768L62J430N64k58j67r16k980m003k772j237r03n81
55715A43795O06J290P21M85J612K764K911L049L767L899L062K825L827M301L059
55700A81973J389N29k81j794l092l427l519l769l287j901j012j274j472p23J79
55685A58519N89J170K387L671M723N780O270N402M225M659O251O588N155L907
55671B19296L617K850J220L96R20J136M05K43J089J059o75k213k185j817k260
55656B23081k592k106j860k407k578k112k721m893o425n928n142n757o612o257
55642A65691n718o323p005o259m931m559m726m295l778m111m509l797k724k760
$$ plain form
55628 100196 96601 92738 89300 86134 83065 80509 78718 77337 76043 74831 73527 71880 70203 69053
55614 69053 68324 67424 66222 65056 64079 63384 63268 63487 62868 60832 58696 58200 59211 60225 60601 60852 61129
55597 61129 60978 60409 59798 58902 57259 55358 54162 53724 53476 53463 53972 54378 53866 52946 52785 53320 53510 53144
55579 53144 52822 52445 51387 50059 49612 50079 50334 49923 49437 49116 48629 48330 49186 51231 53450 55377 57447
55562 57447 59655 61200 61759 61915 62095 62021 61357 59981 57803 55237 53523 53468 54224 54524 54631 55683 57581
55545 57581 59163 60231 61732 64046 66690 69632 73223 76868 79460 81240 83596 86915 90180 92802
55531 92802 95145 97077 97727 97109 96396 96126 95515 93882 91399 88177 84063 79643 75974 73011 69664 65673
55515 65673 61912 58599 54832 50394 46440 43791 41953 40375 39279 38596 37448 35378 32976 30700 28310
$$ packed form
55628A00196l595l863l438l166l069k556j791j381j294j212j304j647j677j150
55614F9053p29r00j202j166r77o95j16K19o19k036k136m96J011J014L76K51K77
55597F1129j51n69o11q96j643j901j196m38k48j3N09M06n12r20j61N35J90l66
55579E3144l22l77j058j328m47M67K55m11m86l21m87k99Q56K045K219J927K070
55562E7447K208J545N59J56J80p4o64j376k178k566j714n5P56L00J07J052J898
55545E7581J582J068J501K314K644K942L591L645K592J780K356L319L265K622
55531I2802K343J932O50o18p13k70o11j633k483l222m114m420l669k963l347l991
55515F5673l761l313l767m438l954k649j838j578j096o83j148k070k402k276k390
$$ plain form
55500 28310 25918 24316 23681 23170 22339 21708 21436 20816 19711 19129 19570 20069 19686 18741 17692 15984 13153
55483 13153 10078 8026 7135 6752 6632 6810 6815 5992 4398 2763 1699 1337 1425 1546 1476 1456 1826 2510 3297
55464 3297 4280 5355 5744 5040 4325 4932 6317 6610 5308 3822 3171 2769 2002 1412 1577 2142 2740 3720
55446 3720 5194 6474 7187 7903 8908 9458 9079 8610 9038 10108 10936 11230 11129 10618 9871 9567 10079 10888
55428 10888 11387 11628 11790 11607 10971 10474 10747 11762 13208 14900 16369 16792 15956 14726 14128 14487 15752
55411 15752 17873 20410 22573 24184 25924 28154 30212 31321 31510 31138 30323 29330 28768 28716 28220 26326
55395 26326 23161 19581 16304 13729 12029 10944 9953 8958 8301 7930 7230 5896 4284 2730 1257 136
55378 -188 22 -73 -624 -848 -368 232 538 900 1423 1439 628 -293 -657 -725 -880 -892 -649 -736 -1575 -2729 -3682
$$ packed form
55500B8310k392j602o35n11q31o31k72o20j105n82M41M99l83r45j049j708k831
55483A3153l075k052q91l83j20J78Nq23j594j635j064l62Q8J21p0k0L70O84P87
55464C297R83J075L89p04p15O07J385K93j302j486o51m02p67n90J65N65N98R80
55446C720J474J280P13P16J005N50l79m69M28J070Q28K94j01n11p47l04N12Q09
55428A0888M99K41J62j83o36m97K73J015J446J692J469M23q36j230n98L59J265
55411A5752K121K537K163J611J740K230K058J109J89l72q15r93n62n2m96j894
55395B6326l165l580l277k575j700j085r91r95o57l71p00j334j612j554A257A36
55378a88B2g3n51k24c68B32L06L62N23J6F28b93l64o8j55j2K43q7q39j154r53
$$ plain form
55357 -3682 -4475 -5017 -4769 -3699 -2708 -2291 -1739 -398 1142 1982 2170 2163 1854 1086 405 319 471 408 504 1138
55337 1138 1676 1360 697 773 1583 2092 1781 1100 553 240 273 820 1704 2521 3164 3758 4194 4215 3871 3513
55317 3513 3422 3640 3979 4079 3805 3614 4011 4593 4373 3293 2535 2877 3521 3190 1810 462 138 1032 2660
55298 2660 4184 4968 5179 5516 6256 7073 7745 8265 8246 7216 5687 4807 4700 4396 3721 3812 5063 6087
55280 6087 5775 5073 5400 6323 6273 4858 3110 1893 1358 1542 2355 3141 3259 2911 2683 2624 2517 2607 3285
55261 3285 4434 5786 7412 9126 10009 9412 7956 6738 5986 5283 4595 4152 3838 3494 3406 3693 3765 3220
55243 3220 2671 2815 3279 3321 3065 2999 2914 2479 2297 3084 4232 4492 3854 3396 3468 3385 2945 2959 4000 5627
55223 5627 7143 8340 9290 10116 11036 12060 12666 12377 11565 11095 11313 11983 12913 13899 14345 13775 12593 11550
$$ packed form
55357c682p93n42K48J070R91M17N52c98A142Q40J88pl09p68D05q6J52o3R6O34
55337A138N38l16o63P6Q10N09l11o81n47B40L3N47Q84Q17O43N94M36K1l44l58
55317C513r1K18L39J00k74j91L97N82k20j080p58L42O44l31j380D62A38Q94J628
55298B660J524P84K11L37P40Q17O72N20j9j030j529q80j07l04o75R1J251J024
55280F087l12p02L27R23n0j415j748j217n35J84Q13P86J18l48k28n9j07R0O78
55261C285J149J352J626J714Q83n97j456j218p52p03o88m43l14l44q8K87P2n45
55243C220n49J44M64M2k56o6q5m35j82P87J148K60o38m58P2q3m40J4J041J627
55223E627J516J197R50Q26R20J024O06k89q12m70K18O70R30R86M46n70j182j043
$$ plain form
55205 11550 10671 9507 8284 7863 8532 9606 10237 10071 9177 7953 7035 6770 6888 7138 7840 9262 10880
55188 10880 11970 12545 12952 12948 12043 10487 9075 8238 7987 8392 9254 9707 9117 8064 7547 7566 7467 7314 7692
55169 7692 8360 8314 7272 6033 5306 5126 5436 6226 7032 7231 6995 7115 7770 8325 8394 8262 8147 7879 7507
55150 7507 7482 8086 9198 10555 11642 11531 9746 7202 5440 4978 5227 5858 7196 9188 11076 12332
55134 12332 13096 13529 13570 13556 14200 15686 17454 19058 20505 21574 21636 20484 18695 16913 15330 14042 13312
55117 13312 13234 13594 14171 14815 15259 15363 15439 15800 16158 16023 15516 15110 14829 14520 14664 15900 17813 19189 19609
55098 19609 19895 20858 22453 24216 25736 26555 26457 26033 26228 27168 28112 28595 28894 29329 29915 30717 31785 32722
55080 32722 33138 33471 34445 35790 36492 36381 36353 36889 37438 37521 37395 37240 36677 35516 34152 32896 31742 31079
$$ packed form
55205A1550q79j164j223m21O69J074O31j66q94j224r18k65J18K50P02J422J618
55188A0880J090N75M07mr05j556j412q37k51M05Q62M53n90j053n17J9r9j53L78
55169G692O68m6j042j239p27j80L10P90Q06J99k36J20O55N55O9j32j15k68l72
55150G507k5O04J112J357J087j11j785k544j762m62K49O31J338J992J888J256
55134A2332P64M33M1j4O44J486J768J604J447J069O2j152j789j782j583j288p30
55117A3312p8L60N77O44M44J04P6L61L58j35n07m06k81l09J44J236J913J376M20
55098A9609K86R63J595J763J520Q19r8m24J95R40R44M83K99M35N86Q02J068R37
55080C2722M16L33R74J345P02j11k8N36N49Q3j26j55n63j161j364j256j154o63
$$ plain form
55062 31079 31619 33176 34414 34365 33499 32890 33023 33727 34542 34774 33986 32799 32486 33393 34531 35037 35207 35653
55044 35653 36296 36746 36994 37137 36988 36452 35789 35181 34589 34308 34938 36492 38140 39218 39887 40551 41254 41852
55026 41852 42124 41612 40149 38641 38281 38796 38590 36993 35147 34116 33374 32019 30360 29266 28788 28503
55010 28503 28546 29228 30164 30693 30843 31051 31342 31452 31388 31168 30525 29575 29248 30234 31941 33325 34360 35818
54992 35818 37891 39919 41312 41988 42032 41632 41295 41488 42069 42582 42987 43673 44896 46735 49371 52901 56995
54975 56995 61198 65499 70221 75564 81603 88549 96592 105681 115786 127146 139951 154075 169430
54962 169430 186157 204037 222042 238933 253985 266629 275783 280205 279377 273584 263278 248934
54950 248934 231460 212264 192854 174507 158089 143773 131069 119470 109042 100221 93230 87885
$$ packed form
55062C1079N40J557J238m9q66o09J33P04Q15K32p88j187l13R07J138N06J70M46
55044C5653O43M50K48J43j49n36o63o08n92k81O30J554J648J078O69O64P03N98
55026D1852K72n12j463j508l60N15k06j597j846j031p42j355j659j094m78k85
55010B8503M3O82R36N29J50K08K91J10o4k20o43r50l27R86J707J384J035J458
54992C5818K073K028J393O76M4m00l37J93N81N13M05O86J223J839K636L530M094
54975E6995M203M301M722N343O039O946Q043R089J0105J1360J2805J4124J5355
54962A69430J6727J7880J8005J6891J5052J2644R154M422q28n793j0306j4344
54950B48934j7474j9196j9410j8347j6418j4316j2704j1599j0428q821o991n345
$$ plain form
54938 87885 83712 80136 76860 74262 73029 73221 74182 75562 77771 81046 84760 88401 92699 98891 107086
54923 107086 116204 125564 135771 147902 162301 178370 195091 211493 226740 239952 249984 255548
54911 255548 255803 250799 241362 228626 213666 197299 180088 162667 146023 131086 118026 106357
54899 106357 95866 86989 80101 74889 70699 67162 64205 61803 59952 58613 57544 56471 55481 54834
54885 54834 54317 53358 51912 50609 49745 48787 47202 45234 43435 41956 40759 40012 39768 39642 39236 38628 38067
54868 38067 37546 36984 36460 35976 35355 34572 33789 32968 31974 31131 30893 30831 29939 28319 27484 28352 29913 30743 30932
54849 30932 31507 32640 33566 33787 33302 32044 30143 28456 27817 27885 27609 26637 25417 24195 22983 22381 23336
54832 23336 25877 28947 31603 33671 35228 36324 37448 39442 42576 46202 49549 52459 55196 58064
$$ packed form
54938H7885m173l576l276k598j233J92R61J380K209L275L714L641M298O192Q195
54923A07086R118R360J0207J2131J4399J6069J6721J6402J5247J3212J0032N564
54911B55548K55n004r437j2736j4960j6367j7211j7421j6644j4937j3060j1669
54899A06357j0491q877o888n212m190l537k957k402j851j339j069j073r90o47
54885E4834n17r59j446j303q64r58j585j968j799j479j197p47k44j26m06o08n61
54868C8067n21n62n24m84o21p83p83q21r94q43k38o2q92j620q35Q68J561Q30J89
54849C0932N75J133R26K21m85j258j901j687o39O8k76r72j220j222j212o02R55
54832B3336K541L070K656K068J557J096J124J994L134L626L347K910K737K868
$$ plain form
54818 58064 61365 65369 70178 75888 82812 91160 100588 110608 121389 133670 147839 163545 180239
54805 180239 197533 214814 230906 244287 253553 257800 256970 251839 243310 231754 217323 200819 183824
54792 183824 167900 153922 142060 132058 123486 116045 109684 104323 99655 95468 91971 89466 87871
54779 87871 86884 86471 86857 88163 90329 93241 96678 100431 104756 110445 118042 127247 137518 148909 161819
54764 161819 176202 191617 207832 224607 240877 254765 264692 270151 271365 268601 262051 252192 240098
54751 240098 227152 214287 201534 188667 176186 165030 155245 145807 136145 127025 119249 112248 104870
54738 104870 97024 89547 82823 76615 71082 66891 64175 62234 60436 58727 57133 55401 53314 50942
54724 50942 48600 46907 46649 47842 49138 48965 47319 45763 45612 46761 48310 49510 49937 49494 48603 47908
$$ packed form
54818E8064L301M004M809N710O924Q348R428J0020J0781J2281J4169J5706J6694
54805A80239J7294J7281J6092J3381R266M247q30n131q529j1556j4431j6504j6995
54792A83824j5924j3978j1862j0002q572p441o361n361m668m187l497k505j595
54779H7871r87m13L86J306K166K912L437L753M325N689P597R205J0271J1391J2910
54764A61819J4383J5415J6215J6775J6270J3888R927N459J214k764o550r859j2094
54751B40098j2946j2865j2753j2867j2481j1156r785r438r662r120p776p001p378
54738A04870p846p477o724o208n533m191k716j941j798j709j594j732k087k372
54724E0942k342j693k58J193J296j73j646j556j51J149J549J200M27m43q91o95
$$ plain form
54708 47908 47576 47250 46741 46211 45665 44910 44152 43994 44603 45437 46031 46483 46870 46809 46048 45106 44836 45518 46673
54689 46673 47613 47982 47924 47890 48228 48878 49614 50452 51537 52683 53426 53618 53642 53871 54243 54521 54789 55490 57027
54670 57027 59442 62448 65752 69305 73156 77164 81076 84825 88368 91291 93033 93699 94094 94720 95303
54655 95303 95567 95866 96593 97591 98710 100402 103133 106666 110543 114801 119487 124054 128075 132146 137149
54640 137149 142917 148489 153363 157505 160395 161185 159760 156654 151961 145361 137259 128830 120789 112964
54626 112964 105260 98097 91719 85916 80710 76511 73345 70690 68306 66535 65568 65113 64924 64992 65108 65036
54610 65036 65201 66321 68180 69685 70359 70780 71239 71056 69796 68206 67154 66377 65021 62879 60416 58007
54594 58007 55786 53873 52206 50407 48262 46073 44265 42976 42252 42156 42385 42251 41373 40074 38880 38085
$$ packed form
54708D7908l32l26n09n30n46p55p58j58O09Q34N94M52L87o1p61r42k70O82J155
54689D6673R40L69n8l4L38O50P36Q38J085J146P43J92K4K29L72K78K68P01J537
54670E7027K415L006L304L553L851M008L912L749L543K923J742O66L95O26N83
54655I5303K64K99P27R98J119J692K731L533L877M258M686M567M021M071N003
54640A37149N768N572M874M142K890P90j425l106m693o600q102q429q041p825
54626A12964p704p163o378n803n206m199l166k655k384j771r67m55j89O8J16p2
54610F5036J65J120J859J505O74M21M59j83j260j590j052p77j356k142k463k409
54594E8007k221j913j667j799k145k189j808j289p24r6K29j34q78j299j194p95
$$ plain form
54578 38085 37886 38386 39203 39695 39857 40403 41621 42790 43122 42684 41967 41138 40201 39409 38977 38772 38684 38847 39214
54559 39214 39396 39326 39508 40138 40600 40424 40205 40901 42596 44602 46450 48058 49192 49509 49183 48946 49368 50444
54541 50444 51902 53672 56000 59188 63133 67190 70768 74043 77662 81731 85590 88742 91376 93723
54527 93723 95447 96085 95644 94391 92451 89979 87315 84614 81674 78408 75089 71879 68587 65266 62521
54512 62521 60803 59830 59080 58405 57737 56729 55226 53687 52577 51711 50724 49844 49547 49752 49991 50230 50900
54495 50900 52164 53676 55042 56090 56657 56523 55668 54458 53539 53551 54662 56297 57531 57927 57740 57286 56539
54478 56539 55523 54614 54154 54088 54207 54376 54366 53881 52970 51983 50940 49555 48056 47266 47432 47675 47159 46189
54460 46189 45584 45514 45635 45846 46170 46273 45867 45330 45206 45340 45233 45022 45363 46348 47305 47736 47865 48115 48483
$$ packed form
54578C8085j99N00Q17M92J62N46J218J169L32m38p17q29r37p92m32k05q8J63L67
54559C9214J82p0J82O30M62j76k19O96J695K006J848J608J134L17l26k37M22J076
54541E0444J458J770K328L188L945M057L578L275L619M069L859L152K634K347
54527I3723J724O38m41j253j940k472k664k701k940l266l319l210l292l321k745
54512F2521j718r73p50o75o68j008j503j539j110q66r87q80k97K05K39K39O70
54495E0900J264J512J366J048N67j34q55j210r19J2J111J635J234L96j87m54p47
54478E6539j016r09m60o6J19J69j0m85r11r87j043j385j499p90J66K43n16r70
54460D6189o05p0J21K11L24J03m06n37j24J34j07k11L41R85R57M31J29K50L68
$$ plain form
54441 48483 48636 48386 47928 47643 47611 47347 46350 44934 44092 44335 45162 45901 46480 46988 47145 46823 46610 47154 48263
54422 48263 49225 49738 49981 50091 50208 50713 51807 53092 54115 55042 56189 57217 57504 57153 56930 57332 58282
54405 58282 59584 61107 62690 64445 66988 70764 75307 79675 83395 86402 88403 89115 88965 88780 88823 88814
54389 88814 88697 88552 87862 85878 82890 80240 78754 77863 76606 74855 73146 71815 70816 70059 69536 69138
54373 69138 68578 67535 65979 64411 63493 63205 62734 61604 60501 60339 60808 60645 59299 57554 56500 56563 57605
54356 57605 59231 60779 61667 62059 62759 64260 66305 68452 70522 72434 74163 76026 78429 81110 83197
54341 83197 84276 84892 85734 86850 87926 88764 89078 88397 86718 84921 83924 83584 82920 81320 79096 76865
54325 76865 74794 72584 69903 66708 63313 60260 57972 56420 55089 53441 51486 49766 48710 48059 47211
$$ packed form
54441D8483J53k50m58k85l2k64r97j416q42K43Q27P39N79N08J57l22k13N44J109
54422D8263R62N13K43J10J17N05J094J285J023R27J147J028K87l51k23M02R50
54405E8282J302J523J583J755K543L776M543M368L720L007K001P12j50j85M3r
54389H8814j17j45o90j984k988k650j486q91j257j751j709j331r99p57n23l98
54373F9138n60j043j556j568r18k88m71j130j103j62M69j63j346j745j054O3J042
54356E7605J626J548Q88L92P00J501K045K147K070J912J729J863K403K681K087
54341H3197J079O16Q42J116J076Q38L14o81j679j797r97l40o64j600k224k231
54325G6865k071k210k681l195l395l053k288j552j331j648j955j720j056o51q48
$$ plain form
54310 47211 46058 45140 44921 45244 45694 46088 46326 46128 45322 44181 43107 42154 41188 40293 39577 38780 37598 36331
54292 36331 35746 36243 37497 38918 40152 41120 41841 42310 42432 42143 41629 41169 40722 40019 39212 38851 38947 38661
54274 38661 37439 35891 34906 34437 33975 33703 34173 35064 35406 35080 35085 36126 37801 39402 40692 41535 41554 40682
54256 40682 39584 39079 39416 40256 41072 41410 41210 40981 41285 42031 42709 43237 43980 44871 45228 44654 43492 42237
54238 42237 41093 40351 40481 41400 42227 42242 41698 41308 41251 41128 40616 39813 39092 38846 39158 39556 39346 38338 37017
54219 37017 35978 35478 35576 36221 37018 37390 37255 37225 37899 39238 40786 42143 42984 42954 41909 40206 38620 38031
54201 38031 38943 40957 42815 43473 43141 42838 42996 43151 42999 43019 43726 44919 46059 46934 47569 47868 47628 46728
54183 46728 45127 43088 41410 40894 41361 41735 41342 40579 40096 39965 40022 40420 41293 42294 42974 43290 43405 43433
$$ packed form
54310D7211j153r18k19L23M50L94K38j98q06j141j074r53r66q95p16p97j182j267
54292C6331n85M97J254J421J234R68P21M69J22k89n14m60m47p03q07l61R6k86
54274C8661j222j548r85m69m62k72M70Q91L42l26NJ041J675J601J290Q43J9q72
54256D0682j098n05L37Q40Q16L38k00k29L04P46O78N28P43Q91L57n74j162j255
54238D2237j144p42J30R19Q27J5n44l90n7j23n12q03p21k46L12L98k10j008j321
54219C7017j039n00R8O45P97L72j35l0O74J339J548J357Q41l0j045j703j586n89
54201C8031R12K014J858O58l32l03J58J55j52K0P07J193J140Q75O35K99k40r00
54183D6728j601k039j678n16M67L74l93p63m83j31N7L98Q73J001O80L16J15K8
$$ plain form
54165 43433 43688 44659 46180 47185 46922 46045 45801 46442 47150 47379 47454 47839 48497 49166 49751 50134 49957 48890
54147 48890 47052 45052 43585 42968 42952 43033 42946 42740 42381 41614 40343 38840 37402 35996 34501 33046 31910
54130 31910 31240 31105 31668 33039 35046 37267 39241 40611 41265 41369 41064 40212 38768 37319 36701 37003 37499
54113 37499 37701 37852 38152 38165 37487 36448 35628 35104 34713 34590 34850 35103 34969 34770 35004 35365 35028 33803 32312
54094 32312 31079 30198 29870 30411 31447 31906 31286 30407 30364 31103 31579 31150 30309 29963 30384 31071 31500 31823 32740
54075 32740 34624 36906 38510 38884 38454 37996 37851 37902 38107 38656 39613 40713 41704 42674 43854 45173 46297
54058 46297 47046 47516 47813 48001 48415 49613 51718 54051 55732 56503 56763 57018 57674 59108 61448 64260 66903
54041 66903 69227 71661 74583 77922 81321 84398 86950 89231 91976 95744 100342 105221 110249 115487
$$ packed form
54165D3433K55R71J521J005k63q77k44O41P08K29P5L85O58O69N85L83j77j067
54147D8890j838k000j467o17j6Q1q7k06l59p67j271j503j438j406j495j455j136
54130C1910o70j35N63J371K007K221J974J370O54J04l05q52j444j449o18L02M96
54113C7499K02J51L00J3o78j039q20n24l91j23K60K53j34j99K34L61l37j225j491
54094C2312j233q81l28N41J036M59o20q79m3P39M76m29q41l46M21O87M29L23R17
54075C2740J884K282J604L74m30m58j45N1K05N49R57J100R91R70J180J319J124
54058D6297P49M70K97J88M14J198K105K333J681P71K60K55O56J434K340K812K643
54041F6903K324K434K922L339L399L077K552K281K745L768M598M879N028N238
$$ plain form
54027 115487 120457 124493 127951 132173 137802 143811 148697 152155 154996 157794 160251 161794 162264 161959 161307
54012 161307 160629 160097 159815 159710 159254 157598 154399 150321 146289 142436 138409 134469 131338 128852 125817
53997 125817 121630 117239 113950 111947 110571 109437 108500 107503 106164 104730 103739 103306 103086 102750 102162 101302
53981 101302 100389 99856 99831 99891 99636 99123 98483 97543 96348 95630 96147 97840 100118 102650 105300 107615 109073
53964 109073 109721 109927 109650 108575 106915 105437 104576 103997 103173 102035 100950 100269 99959 99610 98941 98357 98748
53947 98748 100534 103247 106252 109381 112575 115513 118215 121541 126300 132137 137984 143460 149034 154938
53933 154938 160661 165591 169466 172105 173318 173288 172575 171600 170467 169355 168574 168144 167776 167437 167558 168569
53917 168569 170496 173096 176074 179144 182197 185520 189544 194307 199382 204333 209029 213558 218091 222748
$$ packed form
54027A15487M970M036L458M222N629O009M886L458K841K798K457J543M70l05o52
54012A61307o78n32k82j05m56j656l199m078m032l853m027l940l131k486l035
53997A25817m187m391l289k003j376j134r37r97j339j434r91m33k20l36n88q60
53981A01302r13n33k5O0k55n13o40r40j195p18N17J693K278K532K650K315J458
53964A09073O48K06k77j075j660j478q61n79q24j138j085o81l10l49o69n84L91
53947I8748J786K713L005L129L194K938K702L326M759N837N847N476N574N904
53933A54938N723M930L875K639J213l0p13r75j133j112p81m30l68l39J21J011
53917A68569J927K600K978L070L053L323M024M763N075M951M696M529M533M657
$$ plain form
53903 222748 227304 231100 233600 234918 235502 235383 234227 232111 229716 227625 225810 223890 221573 218664 215020
53888 215020 210711 206075 201429 196781 191900 186589 180878 175031 169353 163947 158769 153889 149479 145461
53874 145461 141467 137331 133332 129741 126418 123140 120047 117446 115366 113571 111735 109358 105933 101674
53860 101674 97774 95384 94434 93898 93011 91731 90243 88542 86577 84367 81975 79632 77723 76358 75126
53845 75126 73645 72100 70857 69868 68919 68193 67999 68125 68060 67757 67621 67849 68280 68767 69162 69096 68384 67523 67231
53826 67231 67570 68161 69075 70763 73097 75222 76534 77185 77513 77570 77392 77248 77447 78184 79548 81282 82725
53809 82725 83515 84217 85682 87883 90104 92126 94442 97286 100334 103530 107366 112029 116972 121621 125963
53794 125963 130241 134590 139093 143575 147276 149491 150629 151800 153185 153815 153327 152926 153871 155839 157572
$$ packed form
53903B22748M556L796K500J318N84j19j156k116k395k091j815j920k317k909l644
53888B15020m309m636m646m648m881n311n711n847n678n406n178m880m410m018
53874A45461l994m136l999l591l323l278l093k601k080j795j836k377l425m259
53860A01674l900k390r50n36q87j280j488j701j965k210k392k343j909j365j232
53845G5126j481j545j243r89r49p26j94J26o5l03j36K28M31M87L95o6p12q61k92
53826F7231L39N91R14J688K334K125J312O51L28N7j78j44J99P37J364J734J443
53809H2725P90P02J465K201K221K022K316K844L048L196L836M663M943M649M342
53794A25963M278M349M503M482L701K215J138J171J385O30m88m01R45J968J733
$$ plain form
53779 157572 158510 158943 159035 158566 157395 155494 152715 149128 145408 142253 139603 136928 134129 131536 129168
53764 129168 126673 124064 121904 120502 119330 117548 114920 112013 109544 107751 106465 105592 105249 105284 105013
53749 105013 103850 102113 100791 100415 100580 100670 100631 100718 100764 100117 98364 95968 94025 93289 93399 93291 92435 91322
53731 91322 90508 89673 88214 86355 84939 84259 83895 83660 83860 84464 84802 84455 83869 83793 84544 86033 87975 89862
53713 89862 91222 92176 93278 94626 95606 95658 94790 93264 91362 89659 88842 89084 90183 92448 96641 102752
53697 102752 109591 115986 121624 126360 129665 131414 132514 133938 135697 137387 139159 141353 143667 145477
53683 145477 146769 148053 149600 151293 152947 154283 154967 155142 155561 156660 157951 158822 159427 160167 160866 161261
53667 161261 161804 163104 164823 166024 166430 166558 166822 167270 168017 169076 169815 169394 167807 165925 164548 164010
$$ packed form
53779A57572R38M33R2m69j171j901k779l587l720l155k650k675k799k593k368
53764A29168k495k609k160j402j172j782k628k907k469j793j286q73l43L5k71
53749A05013j163j737j322l76J65R0l9Q7M6o47j753k396j943p36J10j08q56j113
53731I1322q14q35j459j859j416o80l64k35K00O04L38l47n86p6P51J489J942J887
53713H9862J360R54J102J348R80N2q68j526j902j703q17K42J099K265M193O111
53697A02752O839O395N638M736L305J749J100J424J759J690J772K194K314J810
53683A45477J292J284J547J693J654J336O84J75M19J099J291Q71O05P40O99L95
53667A61261N43J300J719J201M06J28K64M48P47J059P39m21j587j882j377n38
$$ plain form
53651 164010 164480 165799 167064 167235 166302 165246 164794 164885 165318 166079 166872 167104 166629 165956 165490 165130 164738 164395
53633 164395 163986 163224 162320 161986 162413 162875 162796 162662 163276 164491 165307 165075 164130 163299 163206 164027 165540 167327
53615 167327 169056 170649 172115 173312 174099 174673 175565 177175 179410 181903 184548 187602 191153 194687 197527
53600 197527 199641 201736 204534 208263 212822 217935 223027 227465 231151 234490 237583 240077 242139 244915
53586 244915 249357 255090 261097 266993 272832 278114 282095 285046 288141 291931 295720 298689 300895 302851
53572 302851 304732 306372 307644 308611 309624 311326 314080 317311 319927 321501 322531 323422 323872 323588 322999
53557 322999 322820 323245 323948 324603 325133 325647 326346 327236 327884 327783 326977 325961 324927 323674 322330 321453 321058
53540 321058 320232 318261 315683 313653 312588 312012 311465 310974 310659 310414 310059 309507 308753 307868 307013 306338 305962
$$ packed form
53651A64010M70J319J265J71r33j056m52R1M33P61P93K32m75o73m66l60l92l43
53633A64395m09p62r04l34M27M62p9j34O14J215Q16k32r45q31r3Q21J513J787
53615A67327J729J593J466J197P87N74Q92J610K235K493K645L054L551L534K840
53600A97527K114K095K798L729M559N113N092M438L686L339L093K494K062K776
53586B44915M442N733O007N896N839N282L981K951L095L790L789K969K206J956
53572C02851J881J640J272R67J013J702K754L231K616J574J030Q91M50k84n89
53557C22999j79M25P03O55N30N14O99Q90O48j01q06j016j034j253j344q77l95
53540C21058q26j971k578k030j065n76n47m91l15k45l55n52p54q85q55o75l76
$$ plain form
53523 305962 306052 306661 307436 307871 308056 308864 311104 314792 319452 324703 330240 335684 340985 346653 353067 359884
53507 359884 366725 374163 383272 394263 406236 418312 430356 442539 455019 468240 482790 498555
53495 498555 514652 530712 547619 566409 586876 608004 629386 651351 673892 696458 719030
53484 719030 742486 767372 792918 817886 842054 866216 890875 915608 939844 963719 987854
53473 987854 1012549 1037584 1062736 1088205 1114278 1140657 1166401 1190811 1214256 1237771 1261695
53462 1261695 1285042 1306462 1325505 1342649 1358439 1373155 1387219 1401195 1415105 1428177 1439591
53451 1439591 1449247 1457595 1464968 1471259 1475955 1478254 1477416 1473371 1466896 1458969 1449921 1439378 1426880 1412430
53437 1412430 1396514 1379769 1362629 1345208 1327532 1309737 1291778 1273021 1252574 1230231 1206751
$$ packed form
53523C05962R0O09P75M35J85Q08K240L688M660N251N537N444N301N668O414O817
53507C59884O841P438R109J0991J1973J2076J2044J2183J2480J3221J4550J5765
53495D98555J6097J6060J6907J8790K0467K1128K1382K1965K2541K2566K2572
53484G19030K3456K4886K5546K4968K4168K4162K4659K4733K4236K3875K4135
53473I87854K4695K5035K5152K5469K6073K6379K5744K4410K3445K3515K3924
53462A261695K3347K1420J9043J7144J5790J4716J4064J3976J3910J3072J1414
53451A439591R656Q348P373O291M696K299q38m045o475p927r048j0543j2498j4450
53437A412430j5916j6745j7140j7421j7676j7795j7959j8757k0447k2343k3480
$$ plain form
53426 1206751 1183020 1159240 1135205 1111050 1087315 1064460 1042702 1022227 1003163 985349 968450
53415 968450 952369 937380 923825 911767 900931 890926 881601 873268 866459 861447 858139 856447 856435
53402 856435 858030 860971 865285 871509 880143 891106 903925 918168 933425 949291 965769 983465
53390 983465 1002926 1024034 1046397 1070128 1095686 1123129 1152032 1182139 1213622 1246694 1281404
53379 1281404 1317803 1355974 1395846 1437313 1480393 1524948 1570349 1615982 1662107 1709715 1759339
53368 1759339 1810302 1861336 1911682 1961461 2011205 2061194 2111147 2160377 2208148 2253752 2296362
53357 2296362 2335222 2370187 2401759 2430363 2455993 2478821 2499569 2518628 2535168 2547875 2556411
53346 2556411 2561409 2563194 2561355 2555629 2546302 2533322 2515780 2492718 2464053 2430307 2391891 2349135
$$ packed form
53426A206751k3731k3780k4035k4155k3735k2855k1758k0475j9064j7814j6899
53415I68450j6081j4989j3555j2058j0836j0005r325q333o809n012l308j692j2
53402H56435J595K941M314O224Q634J0963J2819J4243J5257J5866J6478J7696
53390I83465J9461K1108K2363K3731K5558K7443K8903L0107L1483L3072L4710
53379A281404L6399L8171L9872M1467M3080M4555M5401M5633M6125M7608M9624
53368A759339N0963N1034N0346M9779M9744M9989M9953M9230M7771M5604M2610
53357B296362L8860L4965L1572K8604K5630K2828K0748J9059J6540J2707Q536
53346B556411M998J785j839n726r327j2980j7542k3062k8665l3746l8416m2756
$$ plain form
53334 2349135 2302768 2253925 2203781 2153418 2103871 2055972 2010087 1966048 1923284 1881044 1838717
53323 1838717 1796008 1752762 1708785 1664116 1619405 1575654 1533447 1492670 1452999 1414413 1377215
53312 1377215 1341766 1308314 1276923 1247612 1220583 1196140 1174199 1154120 1135305 1117652 1101100
53301 1101100 1085181 1069574 1054834 1041868 1030812 1021103 1012535 1005452 999895 995337 991441 988400 986284
53288 986284 984698 983385 982632 982847 984217 986890 990961 996115 1001937 1008842 1018054 1030282 1044931 1060931
53274 1060931 1077768 1095382 1113629 1132419 1151983 1172562 1194019 1215995 1238037 1259480 1279772
53263 1279772 1299215 1318786 1338831 1358518 1376984 1394300 1410674 1425380 1437418 1446941 1455137 1462751
53251 1462751 1469481 1474820 1478738 1481282 1481995 1480094 1475129 1467388 1457677 1446634 1434200 1419881 1403532
$$ packed form
53334B349135m6367m8843n0144n0363m9547m7899m5885m4039m2764m2240m2327
53323A838717m2709m3246m3977m4669m4711m3751m2207m0777l9671l8586l7198
53312A377215l5449l3452l1391k9311k7029k4443k1941k0079j8815j7653j6552
53301A101100j5919j5607j4740j2966j1056r709q568p083n557m558l896l041k116
53288I86284j586j313p53K15J370K673M071N154N822O905R212J2228J4649J6000
53274A060931J6837J7614J8247J8790J9564K0579K1457K1976K2042K1443K0292
53263A279772J9443J9571K0045J9687J8466J7316J6374J4706J2038R523Q196P614
53251A462751O730N339L918K544P13j901m965p741r711j1043j2434j4319j6349
$$ plain form
53238 1403532 1385547 1366234 1345434 1323009 1299304 1274837 1249866 1224599 1199513 1175063 1151272
53227 1151272 1127907 1104848 1082154 1060015 1038793 1018650 998963 978685 957641 936872 917258
53216 917258 898389 879400 860343 841921 824276 806935 789824 773509 758498 744995 733312
53205 733312 723768 716033 709181 702525 695940 689292 682073 673852 664759 655296 645817 636201 625937 614686
53191 614686 602889 591544 581108 570996 560528 549932 539871 530405 521191 512355 504232 496347
53179 496347 487614 477691 467277 456911 446326 435332 424444 414115 404040 393855 383991 375073
53167 375073 366811 358203 348779 339075 329872 321437 313637 306394 299793 293848 288344 282935 277389 271774
53153 271774 266440 261848 258297 255622 253109 249982 246173 242408 239249 236288 232674 228330 224085 220632
$$ packed form
53238A403532j7985j9313k0800k2425k3705k4467k4971k5267k5086k4450k3791
53227A151272k3365k3059k2694k2139k1222k0143j9687k0278k1044k0769j9614
53216I17258j8869j8989j9057j8422j7645j7341j7111j6315j5011j3503j1683
53205G33312r544p735o852o656o585o648p219q221r093r463r479r616j0264j1251
53191F14686j1797j1345j0436j0112j0468j0596j0061r466r214q836q123p885
53179D96347q733r923j0414j0366j0585j0994j0888j0329j0075j0185r864q918
53167C75073q262q608r424r704r203q435p800p243o601n945n504n409n546n615
53153B71774n334m592l551k675k513l127l809l765l159k961l614m344m245l453
$$ plain form
53139 220632 217895 215593 213891 213125 213128 213205 212704 211418 209622 207908 206862 206690 207182 208061 209229 210598 211911
53122 211911 212903 213503 213668 213161 211738 209536 207048 204617 202106 199193 195859 192388 188957 185509 182193
53107 182193 179554 177875 176499 174405 171514 168803 166893 165194 162942 160480 158729 157722 156584 154924
53093 154924 153323 152217 151124 149404 147179 144964 142826 140511 138124 136094 134580 133441 132700 132528 132660
53078 132660 132419 131542 130607 130223 130032 129069 127119 125211 124473 124835 125311 125380 125541 126381 127607 128360 128248 127670
53060 127670 127235 127140 127162 127009 126585 125952 125059 123626 121547 119368 118005 117757 117957 117843 117416 117021 116469 115202
53042 115202 113243 111344 110062 109229 108535 108191 108667 109938 111326 112028 111683 110498 108983 107595 106592 106110
53026 106110 106141 106380 106398 106167 106188 106824 107746 108395 108737 109107 109428 109238 108541 107990 108011 108194 107863 106897 105655 104421
$$ packed form
53139B20632k737k302j702p66LP7n01j286j796j714j046j72M92Q79J168J369J313
53122B11911R92O00J65n07j423k202k488k431k511k913l334l471l431l448l316
53107A82193k639j679j376k094k891k711j910j699k252k462j751j007j138j660
53093A54924j601j106j093j720k225k215k138k315k387k030j514j139p41j72J32
53078A32660k41q77r35l84j91r63j950j908p38L62M76O9J61Q40J226P53j12n78
53060A27670m35r5K2j53m24o33q93j433k079k179j363k48K00j14m27l95n52j267
53042A15202j959j899j282q33o94l44M76J271J388P02l45j185j515j388j003m82
53026A06110L1K39J8k31K1O36R22O49L42L70L21j90o97n51K1J83l31r66j242j234
$$ plain form
53006 104421 103278 102362 101829 101549 101077 100035 98538 97299 97255 98815 101377 103737 105139 105776 106257 106834
52990 106834 107345 107693 108064 108640 109405 110352 111779 114130 117480 121318 124996 128327 131523 134620 137312 139406
52974 139406 141103 142579 143595 143854 143486 142887 142202 141369 140446 139538 138575 137565 136910 136919 137116 136616 135234 133657
52956 133657 132422 131307 129912 128332 126935 125905 125287 125095 125058 124661 123809 123154 123362 124245 125030 125343 125563
52939 125563 126264 127594 129213 130600 131446 131874 132246 132699 133055 133233 133515 134150 134926 135377 135317 134910 134383 133974
52921 133974 134136 135409 137883 140879 143235 144055 143337 142041 141364 141726 142500 142824 142566 142281 142389 142731 142996
52904 142996 143282 144037 145596 147864 150302 152104 152638 151999 151102 150944 151731 152932 154143 155495 157052 158278
52888 158278 158598 158303 158370 159418 161271 163471 165682 167525 168669 169407 170531 172253 173721 174117 173771 173631
$$ packed form
53006A04421j143r16n33k80m72j042j497j239m4J560K562K360J402O37M81N77
52990A06834N11L48L71N76P65R47J427K351L350L838L678L331L196L097K692K094
52974A39406J697J476J016K59l68n99o85q33r23r08r63j010o55RJ97n00j382j577
52956A33657j235j115j395j580j397j030o18j92l7l97q52o55K08Q83P85L13K20
52939A25563P01J330J619J387Q46M28L72M53L56J78K82O35P76M51o0m07n27m09
52921A33974J62J273K474K996K356Q20p18j296o77L62P74L24k58k85J08L42K65
52904A42996K86P55J559K268K438J802N34o39q97j58P87J201J211J352J557J226
52888A58278L20k95O7J048J853K200K211J843J144P38J124J722J468L96l46j40
$$ plain form
52872 173631 174017 174547 175010 175575 176268 176966 177910 179577 181931 184398 186641 188830 191064 193134 194980 196823
52856 196823 198695 200346 201798 203475 205523 207501 208943 209781 210058 209742 209074 208547 208222 207593 206474 205432
52840 205432 204890 204304 202862 200599 198256 196295 194670 193362 192454 191669 190413 188438 186133 184032 182284
52825 182284 180640 178734 176380 173767 171361 169466 167890 166154 164045 161941 160629 160699 161854 162889 162692
52810 162692 161366 159977 159110 158184 156456 154215 152507 151991 152487 153409 154185 154399 153984 153243 152421 151385 149944
52793 149944 148220 146387 144303 141822 139299 137268 135760 134358 132839 131359 130079 129051 128430 128365 128666
52778 128666 128933 129018 129017 128898 128500 127835 126949 125596 123600 121518 120226 119703 118833 116822 114244 112233 111002
52761 111002 109711 107666 105131 102942 101650 101102 100639 99683 98299 97155 96791 96982 97015 96525 95831 95365 95000
$$ packed form
52872A73631L86N30M63N65O93O98R44J667K354K467K243K189K234K070J846J843
52856A96823J872J651J452J677K048J978J442Q38K77l16o68n27l25o29j119j042
52840B05432n42n86j442k263k343j961j625j308r08p85j256j975k305k101j748
52825A82284j644j906k354k613k406j895j576j736k109k104j312P0J155J035j97
52810A62692j326j389q67r26j728k241j708n16M96R22P76K14m15p41q22j036j441
52793A49944j724j833k084k481k523k031j508j402j519j480j280j028o21o5L01
52778A28666K67Q5jj19l98o65q86j353j996k082j292n23q70k011k578k011j231
52761A11002j291k045k535k189j292n48m63r56j384j144l64J91L3m90o94m66l65
$$ plain form
52744 95000 94132 92318 89692 86826 84311 82439 81079 79785 78217 76631 75788 76124 77077 77564 77147 76451
52728 76451 76320 76875 77577 77918 77725 77040 76119 75459 75456 75999 76636 77136 77538 77684 77210 76239 75735 76678 78952
52709 78952 81409 83024 83751 84185 84788 85674 86889 88435 89976 90875 90746 89741 88131 85915 83176 80593
52693 80593 78989 78331 77679 76359 74741 73563 72865 72066 70885 69621 68562 67585 66541 65628 65130 64939
52677 64939 64587 63706 62278 60556 58910 57722 57189 57131 57133 57060 57279 58121 59149 59325 58114 56206 54893 54875
52659 54875 55862 57154 58209 58769 58879 58907 59230 59784 60167 60238 60308 60664 61168 61533 61725 61960 62468 63351 64493
52640 64493 65526 66105 66275 66355 66413 66130 65214 63679 61676 59475 57641 56807 57010 57657 58280 58961 59827 60646
52622 60646 61201 61599 61857 61701 61204 61122 62022 63415 64358 64570 64397 63963 63119 62074 61336 60973 60626 60262 60296
$$ packed form
52744I5000q68j814k626k866k515j872j360j294j568j586q43L36R53M87m17o96
52728G6451j31N55P02L41j93o85r21o60lN43O37N00M02J46m74r71n04R43K274
52709G8952K457J615P27M34O03Q86J215J546J541Q99j29j005j610k216k739k583
52693H0593j604o58o52j320j618j178o98p99j181j264j059r77j044r13m98j91
52677F4939l52q81j428j722j646j188n33n8Kp3K19Q42J028J76j211j908j313j8
52659E4875R87J292J055N60J10K8L23N54L83P1P0L56N04L65J92K35N08Q83J142
52640F4493J033N79J70Q0N8k83r16j535k003k201j834q34K03O47O23O81Q66Q19
52622F0646N55L98K58j56m97q2R00J393R43K12j73m34q44j045p38l63l47l64L4
$$ plain form
52603 60296 60824 61361 61592 61926 63016 65019 67458 69553 70616 70533 70025 70048 70807 71612 71827 71606 71556 72041
52585 72041 73002 74162 75194 75940 76686 78035 80245 82860 85207 87047 88594 90015 91227 92146 92913 93824
52569 93824 95151 97045 99468 102070 104255 105573 106227 107040 108713 111136 113633 115778 117680 119494 121132
52554 121132 122582 124003 125246 125787 125583 125544 126598 128499 130121 130735 130467 129714 128770 127960 127485 127032 126086
52537 126086 124760 123809 123733 124329 125180 126130 127120 128026 128798 129387 129486 128853 127932 127556 127815 127819 126859 125255 123758
52518 123758 122664 121968 121859 122489 123543 124484 125002 124880 123828 121964 120165 119321 119372 119585 119621 119804 120415 121315
52500 121315 122322 123422 124466 125093 125172 125022 124989 125045 124945 124604 124151 123786 123671 123802 123931 123761 123327 123022 123183
52481 123183 123823 124788 125978 127264 128428 129402 130406 131658 133058 134361 135470 136305 136561 136081 135406 135412 136194
$$ packed form
52603F0296N28N37K31L34J090K003K439K095J063q3n08K3P59Q05K15k21n0M85
52585G2041R61J160J032P46P46J349K210K615K347J840J547J421J212R19P67R11
52569I3824J327J894K423K602K185J318O54Q13J673K423K497K145J902J814J638
52554A21132J450J421J243N41k04l9J054J901J622O14k68p53r44q10m75m53r46
52537A26086j326r51p6N96Q51R50R90R06P72N89R9o33r21l76K59Mr60j604j497
52518A23758j094o96j09O30J054R41N18j22j052j864j799q44N1K13L6J83O11R00
52500A21315J007J100J044O27P9j50l3N6j00l41m53l65j15J31J29j70m34l05J61
52481A23183O40R65J190J286J164R74J004J252J400J303J109Q35K56m80o75OP82
$$ plain form
52464 136194 136817 136573 136013 136173 137060 137663 137380 136717 136378 136378 136425 136632 137264 138135 138764 138971 138896 138646 138290 138037
52444 138037 137936 137560 136460 134868 133509 132731 132254 131772 131294 130840 130287 129699 129441 129708 130212 130509 130467 130270
52426 130270 130152 130171 130096 129514 128231 126585 125137 124108 123370 122883 122811 123182 123792 124517 125380 126301 127091 127702
52408 127702 128172 128348 128074 127678 127782 128527 129461 130282 131162 132096 132536 132149 131576 131887 133460 135774 138129 140147
52390 140147 141695 142745 143396 143811 144079 144265 144563 145232 146388 147953 149790 151822 154033 156351 158497 160039
52374 160039 160781 161058 161470 162414 164030 166381 169284 172088 174207 175890 177948 180572 182999 184510 185313
52359 185313 186097 187286 189002 191268 193741 195702 196837 197725 199034 200534 201530 202091 203148 205340 208270
52344 208270 211060 213198 214709 215821 216765 217746 218960 220566 222608 224934 227307 229612 231800 233633 234804
$$ packed form
52464A36194O23k44n60J60Q87O03k83o63l39%M7K07O32Q71O29K07p5k50l56k53
52444A38037j01l76j100j592j359p78m77m82m78m54n53n88k58K67N04K97m2j97
52426A30270j18J9p5n82j283j646j448j029p38m87p2L71O10P25Q63R21P90O11
52408A27702M70J76k74l96J04P45R34Q21Q80R34M40l87n73L11J573K314K355K018
52390A40147J548J050O51M15K68J86K98O69J156J565J837K032K211K318K146J542
52374A60039P42K77M12R44J616K351K903K804K119J683K058K624K427J511Q03
52359A85313P84J189J716K266K473J961J135Q88J309J500R96N61J057K192K930
52344B08270K790K138J511J112R44R81J214J606K042K326K373K305K188J833J171
$$ plain form
52329 234804 235408 235927 236606 237279 238063 239660 242458 245732 248384 250202 251741 253213 254300 255089 256334 258561
52313 258561 261537 264827 268331 272001 275686 279629 284578 290855 297754 304443 311153 318862 327902 337566
52299 337566 347105 356594 366546 377115 387978 398762 409407 420258 431966 445061 459407 474184
52287 474184 488622 502601 516360 529910 543071 555969 568964 581972 594308 605452 615717
52276 615717 625919 636613 647921 659764 671874 683673 694568 704409 713404 721638 729005 735608
52264 735608 741897 748243 754553 760376 765277 769146 772289 775150 777781 779691 780503 780661 781166 782622 784791
52249 784791 787013 788709 789571 789771 789995 790803 791881 792355 791983 791526 791862 793293 796030 800672 807569 815970
52233 815970 824455 832239 839800 848196 857980 868680 879237 889005 898338 908117 918761 930023 941575
$$ packed form
52329B34804O04N19O79O73P84J597K798L274K652J818J539J472J087P89J245K227
52313B58561K976L290L504L670L685L943M949O277O899O689O710P709R040R664
52299C37566R539R489R952J0569J0863J0784J0645J0851J1708J3095J4346J4777
52287D74184J4438J3979J3759J3550J3161J2898J2995J3008J2336J1144J0265
52276F15717J0202J0694J1308J1843J2110J1799J0895R841Q995Q234P367O603
52264G35608O289O346O310N823M901L869L143K861K631J910Q12J58N05J456K169
52249G84791K222J696Q62K00K24Q08J078M74l72m57L36J431K737M642O897Q401
52233H15970Q485P784P561Q396R784J0700J0557R768R333R779J0644J1262J1552
$$ plain form
52220 941575 953266 964724 975363 985094 994495 1003977 1013239 1021861 1029912 1037518 1044342 1050056 1054958
52207 1054958 1059525 1063644 1066867 1069135 1070653 1071320 1070936 1069859 1068759 1067707 1066115 1063651 1060704 1057877
52193 1057877 1055459 1053489 1051914 1050559 1049240 1047937 1046651 1045198 1043520 1042053 1041332 1041224 1040974 1040032 1038493
52178 1038493 1036746 1035076 1033587 1032132 1030346 1028134 1026077 1024901 1024548 1024220 1023329 1021890 1019960 1017300 1013879
52163 1013879 1010214 1006889 1003975 1001172 998247 995109 991689 987930 983821 979369 974744 970413 966807 963794
52149 963794 960834 957660 954480 951387 948049 944195 940071 936077 932144 927760 922504 916442 910077 903972
52135 903972 898303 892727 886868 880873 875216 869933 864412 858132 851388 845079 839909 835802 831917 827201
52121 827201 821164 814239 807292 800837 794906 789535 784913 781029 777651 774766 772617 771142 769791 768176
$$ packed form
52220I41575J1691J1458J0639R731R401R482R262Q622Q051P606O824N714M902
52207A054958M567M119L223K268J518O67l84j077j100j052j592k464k947k827
52193A057877k418j970j575j355j319j303j286j453j678j467p21j08k50r42j539
52178A038493j747j670j489j455j786k212k057j176l53l28q91j439j930k660l421
52163A013879l665l325k914k803k925l138l420l759m109m452m625m331l606l013
52149I63794k960l174l180l093l338l854m124l994l933m384n256o062o365o105
52135I03972n669n576n859n995n657n283n521o280o744o309n170m107l885m716
52121H27201o037o925o947o455n931n371m622l884l378k885k149j475j351j615
$$ plain form
52107 768176 766534 765292 764575 764507 765606 768291 772134 776149 779885 783904 789113 795941 804207 813470 823330
52092 823330 833546 844090 855113 866862 879603 893555 908790 925196 942544 960554 978841
52081 978841 996981 1014813 1032640 1050903 1069499 1087573 1104194 1119286 1133714 1148297 1162854
52070 1162854 1176435 1188451 1199256 1209485 1219118 1227505 1234231 1239608 1244267 1248457 1251852 1253919 1254452
52057 1254452 1253755 1252261 1249998 1246664 1242320 1237699 1233459 1229362 1224694 1219471 1214708 1211292 1208896 1206274
52043 1206274 1202455 1197485 1192147 1187237 1183056 1179433 1176118 1173055 1170294 1167782 1165449 1163437 1162028 1161281
52029 1161281 1160886 1160422 1159745 1159142 1159155 1160095 1161648 1163060 1163872 1164315 1164867 1165654 1166566 1167705 1169251 1170950 1172224
52012 1172224 1172865 1173188 1173313 1172660 1170503 1166844 1162315 1157243 1151120 1143189 1133368 1122258 1110225 1096868
$$ packed form
52107G68176j642j242p17o8J099K685L843M015L736M019N209O828Q266R263R860
52092H23330J0216J0544J1023J1749J2741J3952J5235J6406J7348J8010J8287
52081I78841J8140J7832J7827J8263J8596J8074J6621J5092J4428J4583J4557
52070A162854J3581J2016J0805J0229R633Q387O726N377M659M190L395K067N33
52057A254452o97j494k263l334m344m621m240m097m668n223m763l416k396k622
52043A206274l819m970n338m910m181l623l315l063k761k512k333k012j409p47
52029A161281l95m64o77o03J3R40J553J412Q12M43N52P87R12J139J546J699J274
52012A172224O41L23J25o53k157l659m529n072o123p931r821j1110j2033j3357
$$ plain form
51998 1096868 1081686 1064995 1047647 1029933 1011348 991560 970974 950106 928955 907326 885170
51987 885170 862194 837817 812194 786722 762668 739604 716088 691638 667101 643213 619796
51976 619796 596531 573517 550777 528050 505533 484175 464790 447355 431486 416997 403618
51965 403618 390731 377916 365454 353902 343423 333852 325062 316942 309256 301917 295230 289662 285400
51952 285400 282181 279403 276433 273147 270108 267885 266249 264430 262088 259465 256664 253502 250164 247253
51938 247253 244933 242679 240159 237699 235529 233239 230449 227450 224731 222389 220367 218693 217017 214575
51924 214575 211184 207751 205151 203123 200985 198949 197829 197698 197682 197009 195604 193757 191895 190634 190348
51909 190348 190544 190255 189192 188036 187478 187352 186920 185666 183626 181187 178826 176997 176041 175970 176217 175738 173779
$$ packed form
51998A096868j5182j6691j7348j7714j8585j9788k0586k0868k1151k1629k2156
51987H85170k2976k4377k5623k5472k4054k3064k3516k4450k4537k3888k3417
51976F19796k3265k3014k2740k2727k2517k1358j9385j7435j5869j4489j3379
51965D03618j2887j2815j2462j1552j0479r571q790q120p686p339o687n568m262
51952B85400l219k778k970l286l039k223j636j819k342k623k801l162l338k911
51938B47253k320k254k520k460k170k290k790k999k719k342k022j674j676k442
51924B14575l391l433k600k028k138k036j120j31j6o73j405j847j862j261k86
51909A90348J96k89j063j156n58j26m32j254k040k439k361j829r56p1K47m79j959
$$ plain form
51892 173779 170598 167239 164597 162956 162273 162334 162577 162390 161777 161190 160585 159364 157485 155789 154766 153819
51876 153819 152377 150966 150430 150668 150972 151102 151220 151197 150853 150541 150683 151063 151357 151946 153293 154809 155400 154898
51858 154898 154046 153266 152535 152246 152998 154458 155635 156448 157876 160259 162585 163910 164532 165240 166257 167461
51842 167461 168851 170227 171040 171101 170877 170692 170258 169449 168813 168759 168909 168852 168919 169458 169916 169486 168367 167544 167509
51823 167509 167932 168468 169173 170045 170802 171290 171763 172630 174101 176003 177764 178750 178907 178836 178931 178725 177591 175897
51805 175897 174812 174914 175511 175522 174638 173388 172432 172056 172180 172516 172782 172907 173059 173399 173929 174708 176088 178360
51787 178360 181066 183050 183558 183189 183290 184397 185751 186544 187056 188117 189823 191465 192610 193581 194801 196259
51771 196259 197800 199423 201054 202393 203353 204409 206257 209197 212937 216851 220378 223400 226290 229417
$$ packed form
51892A73779l181l359k642j641o83O1K43j87o13n87o05j221j879j696j023r47
51876A53819j442j411n36K38L04J30J18k3l44l12J42L80K94N89J347J516N91n02
51858A54898q52p80p31k89P52J460J177Q13J428K383K326J325O22P08J017J204
51842A67461J390J376Q13O1k24j85m34q09o36n4J50n7O7N39M58m30j119q23l5
51823A67509M23N36P05Q72P57M88M73Q67J471J902J761R86J57p1R5k06j134j694
51805A75897j085J02N97J1q84j250r56l76J24L36K66J25J52L40N30P79J380K272
51787A78360K706J984N08l69J01J107J354P93N12J061J706J642J145R71J220J458
51771A96259J541J623J631J339R60J056J848K940L740L914L527L022K890L127
$$ plain form
51757 229417 232614 235321 237146 237984 237680 236127 233750 231368 229367 227417 225159 222745 220486 218497 216994
51742 216994 216490 217254 218879 220757 222693 224674 226341 227189 227213 226941 226889 227229 227872 228536 228791 228388 227584 226943
51724 226943 226785 226965 227145 227130 226955 226707 226305 225534 224395 223270 222460 221585 219807 216753 212924 209191 206271
51707 206271 204620 204177 204004 202862 200586 198377 197249 196701 195556 193614 191706 190332 189145 187767 186361
51692 186361 185211 184358 183851 183834 184139 184241 183934 183658 183962 184925 186419 188617 191804 195758 199597 202325 203431
51675 203431 203068 201818 200319 199062 198436 198773 200154 202144 204000 205310 206358 207736 209629 211536 212685
51660 212685 212678 211750 210477 209293 208293 207393 206539 205630 204361 202312 199329 195804 192430 189488 186434 182475
51644 182475 177734 173565 171360 171093 171374 170811 168917 165835 161895 157760 154378 152250 150959 149871 148993
$$ packed form
51757B29417L197K707J825Q38l04j553k377k382k001j950k258k414k259j989j503
51742B16994n04P64J625J878J936J981J667Q48K4k72n2L40O43O64K55m03q04o41
51724B26943j58J80J80j5j75k48m02p71j139j125q10q75j778l054l829l733k920
51707B06271j651m43j73j142k276k209j128n48j145j942j908j374j187j378j406
51692A86361j150q53n07j7L05J02l07k76L04R63J494K198L187L954L839K728J106
51675B03431l63j250j499j257o26L37J381J990J856J310J048J378J893J907J149
51660B12685pr28j273j184j000r00q54r09j269k049k983l525l374k942l054l959
51644A82475m741m169k205k67K81n63j894l082l940m135l382k128j291j088q78
$$ plain form
51629 148993 148740 149127 149731 150302 150864 151252 151106 150429 149638 148904 147931 146611 145524 145335 145894 146306 145834 144528
51611 144528 142974 141700 140865 140396 140230 140378 140787 141247 141537 141623 141638 141631 141481 141069 140531 140250 140616 141748 143400
51592 143400 145107 146496 147545 148608 150124 152187 154404 156326 158106 160554 164339 169240 174396 179202
51578 179202 183706 188190 192730 197215 201432 205026 207675 209472 210859 212047 212806 212943 212610 211859 210283
51563 210283 207569 204214 201292 199542 198955 199072 199416 199713 200093 201025 202874 205615 209161 213753 219603 226232
51547 226232 232542 237610 241271 244063 246863 250349 254503 258694 262458 265876 268851 270552 270326 268998
51533 268998 268300 268889 269697 269508 268349 266871 265094 262559 259342 256100 253168 250168 246612 242460 238008
51518 238008 233597 229490 225818 222504 219390 216427 213631 210951 208389 206168 204483 203062 201317 199060
$$ packed form
51629A48993k53L87O04N71N62L88j46o77p91p34r73j320j087j89N59M12m72j306
51611A44528j554j274q35m69j66J48M09M60K90Q6J5pj50m12n38k81L66J132J652
51592A43400J707J389J049J063J516K063K217J922J780K448L785M901N156M806
51578A79202M504M484M540M485M217L594K649J797J387J188P59J37l33p51j576
51563B10283k714l355k922j750n87J17L44K97L80R32J849K741L546M592N850O629
51547B26232O310N068L661K792K800L486M154M191L764L418K975J701k26j328
51533B68998o98N89Q08j89j159j478j777k535l217l242k932l000l556m152m452
51518B38008m411m107l672l314l114k963k796k680k562k221j685j421j745k257
$$ plain form
51504 199060 196857 195409 194736 194202 193342 192408 192027 192497 193534 194618 195407 195876 196273 196947 198002 199102 199832
51487 199832 200352 201371 203283 205566 207321 208234 208671 208972 209117 209089 209196 209874 211418 213908 217140 220601
51471 220601 223873 227109 230758 234765 238475 241516 244358 247701 251658 255893 260225 264713 269379 274238
51457 274238 279414 284803 289803 293803 296849 299384 301501 303050 304448 306595 309688 312658 314191 313880
51443 313880 312029 308833 304379 299190 294029 289116 284070 278683 273201 267694 261776 255300 248864 243085
51429 243085 237675 231845 225490 219405 214261 209942 206143 203113 201366 200883 201026 201126 200876 200259 199485 199063
51413 199063 199589 201283 203826 206675 209444 211977 214247 216286 218080 219456 220145 219946 218674 215999 211628
51398 211628 205794 199371 193263 187718 182407 177063 171827 166981 162553 158351 154252 150335 146712 143360
$$ packed form
51504A99060k203j448o73n34q60r34l81M70J037J084P89M69L97O74J055J100P30
51487A99832N20J019J912K283J755R13M37L01J45k8J07O78J544K490L232L461
51471B20601L272L236L649M007L710L041K842L343L957M235M332M488M666M859
51457B74238N176N389N000M000L046K535K117J549J398K147L093K970J533l11
51443C13880j851l196m454n189n161m913n046n387n482n507n918o476o436n779
51429B43085n410n830o355o085n144m319l799l030j747m83J43J00k50o17p74m22
51413A99063N26J694K543K849K769K533K270K039J794J376O89j99j272k675m371
51398B11628n834o423o108n545n311n344n236m846m428m202m099l917l623l352
$$ plain form
51384 143360 140162 137059 134095 131350 128955 127120 125920 124976 123581 121400 118936 116986 115748 114787 113855
51369 113855 113307 113493 114133 114573 114423 113694 112568 111409 110757 110848 111236 111343 111303 111708 112503 112794 112090 111120 110938
51350 110938 111583 112221 112359 112295 112374 112415 112027 111094 109763 108313 107233 107076 107948 109365 110832 112324 113973
51333 113973 115614 117046 118650 121263 125273 130037 134392 137718 140453 143594 147656 152132 156025 158829
51319 158829 160803 162328 163365 163686 163253 162082 160008 157007 153510 149962 146219 141910 137355 133491 130736
51304 130736 128447 125754 122495 119048 115680 112527 109944 108305 107401 106436 104791 102656 100849 100043 100177
51289 100177 100583 100726 100777 101288 102304 103078 102776 101264 99103 97057 95826 95903 97198 98851 99862 100047 100053
51272 100053 100336 100513 100031 99241 99293 100825 103103 104762 105227 105059 104950 104914 104683 104458 104768 105742 106946 107872
$$ packed form
51384A43360l198l103k964k745k395j835j200r44j395k181k464j950j238r61r32
51369A13855n48J86O40M40j50p29j126j159o52R1L88J07m0M05P95K91p04r70j82
51350A10938O45O38J38o4P9M1l88r33j331j450j080j57Q72J417J467J492J649
51333A13973J641J432J604K613M010M764M355L326K735L141M062M476L893K804
51319A58829J974J525J037L21m33j171k074l001l497l548l743m309m555l864k755
51304A30736k289k693l259l447l368l153k583j639r04r65j645k135j807q06J34
51289A00177M06J43N1N11J016P74l02j512k161k046j231P7J295J653J011J85O
51272A00053K83J77m82p90N2J532K278J659M65j68j09l6k31k25L10R74J204R26
$$ plain form
51254 107872 108177 107593 106149 104533 103662 103714 103970 103761 103059 101993 100494 98823 97866 98205 99213 99710 99404
51237 99404 99104 99595 100836 102269 103463 104334 105002 105555 105848 105639 105094 104885 105426 106304 106881 107233 107938 109071
51219 109071 110066 110614 111036 111588 112000 112091 112340 113413 115279 117194 118472 119049 119352 119773 120316 120718 120884 121087
51201 121087 121599 122262 122664 122696 122681 122944 123521 124265 125009 125604 126028 126453 127015 127599 128040 128365 128515 128035 126613
51182 126613 124745 123306 122423 121412 119976 118702 118076 117680 116902 115939 115398 115230 114726 113541 112125 111039
51166 111039 110207 109047 107088 104455 101860 100096 99380 99216 99020 98789 98942 99643 100524 101143 101429 101621 101874
51149 101874 102102 102195 102246 102466 102880 103295 103652 104224 105223 106414 107445 108445 109834 111515 112732 112898 112199
51132 112199 111156 109991 108712 107484 106537 105839 105188 104512 103864 103219 102521 101846 101405 101462 102211 103467 104452
$$ packed form
51254A07872L05n84j444j616q71N2K56k09p02j066j499j671r57L39J008M97l06
51237I9404l00M91J241J433J194Q71O68N53K93k09n45k09N41Q78N77L52P05J133
51219A09071R95N48M22N52M12R1K49J073J866J915J278N77L03M21N43M02J66K03
51201A21087N12O63M02L2j5K63N77P44P44N95M24M25N62N84M41L25J50m80j422
51182A26613j868j439q83j011j436j274o26l96p78r63n41j68n04j185j416j086
51166A11039q32j160j959k633k595j764p16j64j96k31J53P01Q81O19K86J92K53
51149A01874K28R3N1K20M14M15L57N72R99J191J031J000J389J681J217J66o99
51132A12199j043j165j279j228r47o98o51o76o48o45o98o75m41N7P49J256R85
$$ plain form
51115 104452 104302 103013 101553 100819 100866 101304 101926 102542 102764 102613 102945 104525 106862 108706 109590 110121 110767
51098 110767 111268 111511 112148 113778 116016 117936 119116 119820 120444 121274 122577 124389 126207 127333 127629 127660
51082 127660 128011 128728 129508 130218 131060 132257 133729 135168 136392 137582 138977 140354 141020 140487 139089 137778
51066 137778 137309 137688 138311 138460 137752 136414 135187 134732 134957 135072 134527 133771 133845 135262 137522 139774 141623
51049 141623 143135 144339 145071 145277 145131 144798 144323 143841 143682 144095 144912 145619 145791 145497 145238 145417 145871 146070
51031 146070 145870 145833 146510 147591 148183 147907 147348 147333 148143 149525 151087 152441 153310 153868 154760 156520 159036
51014 159036 161776 164391 166921 169597 172625 175972 179187 181662 183324 184903 187285 190820 195357 200580
51000 200580 205930 210627 214407 218126 223100 229790 237545 245586 253731 262142 270875 279939 289491 299747
$$ packed form
51115A04452j50j289j460p34M7M38O22O16K22j51L32J580K337J844Q84N31O46
51098A10767N01K43O37J630K238J920J180P04O24Q30J303J812J818J126K96L1
51082A27660L51P17P80P10Q42J197J472J439J224J190J395J377O66n33j398j311
51066A37778m69L79O23J49p08j338j227m55K25J15n45p56P4J417K260K252J849
51049A41623J512J204P32K06j46l33m75m82j59M13Q17P07J72k94k59J79M54J99
51031A46070k00l7O77J081N92k76n59j5Q10J382J562J354Q69N58Q92J760K516
51014A59036K740K615K530K676L028L347L215K475J662J579K382L535M537N223
51000B00580N350M697L780L719M974O690P755Q041Q145Q411Q733R064R552J0256
$$ plain form
50986 299747 310933 323363 337329 352886 370014 388984 410262 434009 460008 488108 518370
50975 518370 550779 585241 622004 661649 704468 750175 798247 848097 898810 949346 999391
50964 999391 1049434 1099490 1148197 1193761 1235489 1273795 1309006 1340970 1369765 1395989 1420071
50953 1420071 1441900 1461409 1479129 1495881 1512236 1528570 1545338 1562956 1581505 1600626 1619486
50942 1619486 1636766 1651031 1661376 1667490 1668813 1664002 1651659 1631463 1604118 1570270 1529915 1482934
50930 1482934 1429717 1371089 1308108 1242292 1175676 1110093 1046421 984891 926107 871305 821463
50919 821463 776510 735684 698439 664718 634493 607425 583042 561069 541500 524515 510358
50908 510358 499120 490514 483933 478757 474484 470610 466675 462692 459340 457299 456272 455014 452563 449326
$$ packed form
50986B99747J1186J2430J3966J5557J7128J8970K1278K3747K5999K8100L0262
50975E18370L2409L4462L6763L9645M2819M5707M8072M9850N0713N0536N0045
50964I99391N0043N0056M8707M5564M1728L8306L5211L1964K8795K6224K4082
50953A420071K1829J9509J7720J6752J6355J6334J6768J7618J8549J9121J8860
50942A619486J7280J4265J0345O114J323m811j2343k0196k7345l3848m0355m6981
50930A482934n3217n8628o2981o5816o6616o5583o3672o1530n8784n4802m9842
50919H21463m4953m0826l7245l3721l0225k7068k4383k1973j9569j6985j4157
50908E10358j1238q606o581n176m273l874l935l983l352k041j027j258k451l237
$$ plain form
50894 449326 446674 445471 445299 445190 444838 444813 445710 447446 449591 452163 455797 461086 467909 475536 483303 491076
50878 491076 499106 507652 516899 527133 538753 552008 566830 583089 600932 620792 643033 667771
50866 667771 695090 725351 759248 797555 840898 889683 944186 1004642 1071227 1144062 1223325
50855 1223325 1309327 1402246 1501681 1606625 1716066 1829377 1945780 2063577 2180312 2293736
50845 2293736 2402180 2503974 2597099 2679906 2751841 2813101 2863917 2904735 2936957 2962918 2985105
50834 2985105 3005851 3027682 3053186 3084143 3121136 3164229 3213380 3267697 3324580 3380143 3430297
50823 3430297 3471111 3498594 3509171 3500633 3472149 3423208 3353172 3262220 3152235 3026200 2886989
50812 2886989 2737231 2580163 2419964 2260929 2106430 1958619 1818923 1688706 1569516
$$ packed form
50894D49326k652j203j72j09l52k5Q97J736K145K572L634N289O823P627P767P773
50878D91076Q030Q546R247J0234J1620J3255J4822J6259J7843J9860K2241K4738
50866F67771K7319L0261L3897L8307M3343M8785N4503O0456O6585P2835P9263
50855A223325Q6002R2919R9435J04944J09441J13311J16403J17797J16735J13424
50845B293736J08444J01794R3125Q2807P1935O1260N0816M0818L2222K5961K2187
50834B985105K0746K1831K5504L0957L6993M3093M9151N4317N6883N5563N0154
50823C430297M0814K7483J0577q538k8484m8941p0036r0952j09985j26035j39211
50812B886989j49758j57068j60199j59035j54499j47811j39696j30217j19190
$$ plain form
50803 1569516 1462590 1368075 1284988 1212229 1149428 1096446 1052319 1015385 984518 959594 940549
50792 940549 926580 916736 910734 908580 909657 912768 916929 921533 925781 928577 929218 927759 924538 919648
50778 919648 913013 904668 894755 883429 870892 857362 842934 827682 811944 796262 780994 766246
50766 766246 752277 739626 728604 718912 710084 702189 695932 692132 691268 693417 698416 706053 716129
50753 716129 728346 742280 757720 775050 794977 817782 843157 870998 901992 937072 976542
50742 976542 1020254 1068598 1122716 1183435 1250337 1322230 1398353 1478631 1562618 1648644 1734361
50731 1734361 1817932 1898163 1973412 2040955 2097900 2142511 2174356 2193615 2200876 2197574 2185916 2168117
50719 2168117 2146122 2122208 2099331 2080392 2067273 2060747 2061051 2068161 2081529 2099785 2120779 2142015
$$ packed form
50803A569516j06926r4515q3087p2759o2801n2982m4127l6934l0867k4924j9045
50792I40549j3969r844o002k154J077L111M161M604M248K796O41j459l221m890
50778I19648o635q345r913j1326j2537j3530j4428j5252j5738j5682j5268j4748
50766G66246j3969j2651j1022r692q828p895o257l800q64K149M999P637J0076
50753G16129J2217J3934J5440J7330J9927K2805K5375K7841L0994L5080L9470
50742I76542M3712M8344N4118O0719O6902P1893P6123Q0278Q3987Q6026Q5717
50731A734361Q3571Q0231P5249O7543N6945M4611L1845J9259P261l302j1658j7799
50719B168117k1995k3914k2877j8939j3119o526L04P110J3368J8256K0994K1236
$$ plain form
50707 2142015 2161144 2176048 2184413 2183484 2170661 2144296 2103777 2049238 1981804 1903869 1818262 1727028
50695 1727028 1631794 1535388 1441981 1354919 1275058 1201777 1134922 1075056 1022428 976750 937799
50684 937799 905420 879064 858066 842341 832196 827483 827482 831598 839609 851236 865959 883281 902812
50671 902812 924122 946846 970814 995656 1020429 1044061 1065992 1085983 1103585 1118375 1130564
50660 1130564 1140706 1148868 1154591 1157576 1157946 1156092 1152827 1149475 1147035 1145378 1143919 1142858 1142983 1144473
50646 1144473 1147002 1151003 1157792 1168176 1181860 1198321 1217274 1238014 1259455 1281349 1304465 1328988
50634 1328988 1353641 1377033 1398897 1419269 1437464 1452996 1466860 1480684 1494931 1509059 1523247
50623 1523247 1538897 1557357 1579009 1603679 1631063 1660419 1690431 1719739 1747376 1772516 1794023
$$ packed form
50707B142015J9129J4904Q365r29j2823k6365m0519n4539o7434p7935q5607r1234
50695A727028r5234r6406r3407q7062p9861p3281o6855n9866n2628m5678l8951
50684I37799l2379k6356k0998j5725j0145m713jM116Q011J1627J4723J7322J9531
50671I02812K1310K2724K3968K4842K4773K3632K1931J9991J7602J4790J2189
50660A130564J0142Q162N723K985L70j854l265l352k440j657j459j061J25J490
50646A144473K529M001O789J0384J3684J6461J8953K0740K1441K1894K3116K4523
50634A328988K4653K3392K1864K0372J8195J5532J3864J3824J4247J4128J4188
50623A523247J5650J8460K1652K4670K7384K9356L0012K9308K7637K5140K1507
$$ plain form
50612 1794023 1810333 1819722 1820951 1814026 1800235 1781168 1757736 1730206 1698787 1663850 1625931 1585855
50600 1585855 1544500 1501946 1457218 1409445 1359001 1306975 1253953 1200202 1146797 1095486 1047150
50589 1047150 1001200 956827 914240 874309 837592 804196 774155 747441 723776 702859 684743
50578 684743 669718 657878 648955 642513 638092 635218 633470 632672 633002 634923 638898 645138 653600 664177
50564 664177 676773 691198 707264 725053 744902 767030 791406 818063 847174 878516 911221
50553 911221 944430 978013 1012330 1047508 1083314 1119395 1155144 1189544 1221827 1252319 1282197
50542 1282197 1312305 1342648 1373010 1403567 1434687 1466476 1498730 1531093 1563293 1595506 1628505
50531 1628505 1663144 1699678 1737902 1777836 1819838 1863996 1909837 1956685 2003854 2050420 2095295
$$ packed form
50612A794023J6310R389J229o925j3791j9067k3432k7530l1419l4937l7919m0076
50600A585855m1355m2554m4728m7773n0444n2026n3022n3751n3405n1311m8336
50589A047150m5950m4373m2587l9931l6717l3396l0041k6714k3665k0917j8116
50578F84743j5025j1840q923o442m421k874j748p98L30J921L975O240Q462J0577
50564F64177J2596J4425J6066J7789J9849K2128K4376K6657K9111L1342L2705
50553I11221L3209L3583L4317L5178L5806L6081L5749L4400L2283L0492K9878
50542A282197L0108L0343L0362L0557L1120L1789L2254L2363L2200L2213L2999
50531A628505L4639L6534L8224L9934M2002M4158M5841M6848M7169M6566M4875
$$ plain form
50520 2095295 2137649 2176784 2211423 2239625 2259809 2271508 2274879 2269891 2256367 2234596 2205431 2169942
50508 2169942 2129244 2084543 2037038 1987877 1938416 1890486 1846198 1807444 1775500 1750751 1732601
50497 1732601 1719850 1711431 1706736 1705190 1705804 1707368 1709039 1710623 1712457 1714991 1718143 1720753 1720834 1716492
50483 1716492 1706469 1689771 1665318 1632408 1591303 1543010 1488621 1429182 1366008 1300746 1235148
50472 1235148 1170986 1109928 1053007 1000233 951146 905819 864961 829071 797881 770780 747413
50461 747413 727585 710821 696395 683866 673455 665763 661038 658750 658060 658734 661380 666570 674073
50448 674073 683248 693933 706380 720405 735334 750973 768072 787411 808845 831653 855501 880588
50436 880588 907083 934868 963697 993207 1022850 1052254 1081558 1111020 1140452 1169583 1198903
$$ packed form
50520B095295M2354L9135L4639K8202K0184J1699L371m988j3524k1771k9165l5489
50508B169942m0698m4701m7505m9161m9461m7930m4288l8754l1944k4749j8150
50497A732601j2751q419m695j546O14J564J671J584J834K534L152K610Q1m342
50483A716492j0023j6698k4453l2910m1105m8293n4389n9439o3174o5262o5598
50472A235148o4162o1058n6921n2774m9087m5327m0858l5890l1190k7101k3367
50461G47413j9828j6764j4426j2529j0411p692m725k288o90O74K646N190P503
50448F74073R175J0685J2447J4025J4929J5639J7099J9339K1434K2808K3848K5087
50436H80588K6495K7785K8829K9510K9643K9404K9304K9462K9432K9131K9320
$$ plain form
50425 1198903 1229426 1261351 1293604 1325129 1356116 1387457 1419397 1451477 1483638 1516662 1551296
50414 1551296 1587323 1623619 1658847 1691968 1722461 1750171 1774804 1795454 1810873 1820324 1823958 1822227
50402 1822227 1815080 1801885 1782078 1755759 1723666 1686508 1644371 1596927 1544364 1487880 1428968
50391 1428968 1368436 1306571 1244196 1183007 1124718 1070322 1020330 975261 935498 901062 871956
50380 871956 848534 831111 819307 812187 809075 809938 814948 823896 836106 850725 866881 883483 899021
50367 899021 911869 920998 926255 927712 924934 917313 905009 889024 870323 849405 826876 803689
50355 803689 780495 757269 734002 711332 689973 669986 651163 633804 618483 605184 593295
50344 593295 582380 572542 564047 556991 551257 546517 542439 539221 537668 538331 540917 544959 550620 558127
$$ packed form
50425A198903L0523L1925L2253L1525L0987L1341L1940L2080L2161L3024L4634
50414A551296L6027L6296L5228L3121L0493K7710K4633K0650J5419R451L634j731
50402A822227p147j3195j9807k6319l2093l7158m2137m7444n2563n6484n8912
50391A428968o0532o1865o2375o1189n8289n4396m9992m5069l9763l4436k9106
50380H71956k3422j7423j1804p120l112Q63N010Q948J2210J4619J6156J6602J5538
50367H99021J2848R129N257J457k778p621j2304j5985j8701k0918k2529k3187
50355H03689k3194k3226k3267k2670k1359j9987j8823j7359j5321j3299j1889
50344E93295j0915r838q495p056n734m740m078l218j553O63K586M042N661P507
$$ plain form
50330 558127 566849 575886 585412 596413 608995 621926 634250 646540 660130 675648 692761 710874
50318 710874 729619 748939 769052 790172 812178 834795 857915 881281 903968 924952 944337
50307 944337 963300 982548 1001571 1019636 1036614 1052307 1065785 1076286 1084266 1090810 1096317 1100425
50295 1100425 1102843 1103490 1102061 1098259 1092399 1084972 1075577 1062978 1046403 1026347 1003943 980007 954828
50282 954828 928481 901155 873456 846550 821685 799367 779068 759832 741125 723148 706564
50271 706564 691884 679018 667426 656772 647287 639315 632658 626595 620541 614533 609190 605222 602805
50258 602805 601332 600025 598954 599089 601108 604476 608107 611632 615602 620681 627134 634926 643764 653046
50244 653046 662230 671267 680340 689305 697834 705950 713911 721560 728374 734167 739161 743248 745767 746273
$$ packed form
50330E58127Q722R037R526J1001J2582J2931J2324J2290J3590J5518J7113J8113
50318G10874J8745J9320K0113K1120K2006K2617K3120K3366K2687K0984J9385
50307I44337J8963J9248J9023J8065J6978J5693J3478J0501P980O544N507M108
50295A100425K418O47j429l802n860p427r395j2599j6575k0056k2404k3936k5179
50282I54828k6347k7326k7699k6906k4865k2318k0299j9236j8707j7977j6584
50271G06564j4680j2866j1592j0654r485p972o657o063o054o008n343l968k417
50258F02805j473j307j071J35K019L368L631L525L970N079O453P792Q838R282
50244F53046R184R037R073Q965Q529Q116P961P649O814N793M994M087K519N06
$$ plain form
50230 746273 745062 742705 739515 735704 731553 727098 722010 716201 710170 704409 698818 693096 687414 682200
50216 682200 677502 673119 669230 666326 664540 663571 663392 664494 667175 670969 675083 679195 683552 688504 694220
50201 694220 700724 707895 715408 722882 730155 737236 743976 749931 754589 757687 759285 759654 759009 757210 753714
50186 753714 748019 740210 730901 720623 709543 697889 686285 675345 665114 655272 645750 636778 628417
50173 628417 620547 613343 607277 602413 598118 593773 589450 585587 582192 578742 574784 570340 565757 561329
50159 561329 557073 552740 548104 543282 538623 534303 530276 526670 523830 521780 519985 517954 515755 513581
50145 513581 511177 508219 505037 502353 500344 498493 496481 494727 493919 494293 495544 497203 499050 501288 504301
50130 504301 508040 511806 514938 517575 520378 523578 526799 529743 532525 535187 537383 538755 539338 539484 539646
$$ packed form
50230G46273j211k357l190l811m151m455n088n809o031n761n591n722n682n214
50216F82200m698m383l889k904j786r69j79J102K681L794M114M112M357M952N716
50201F94220O504P171P513P474P273P081O740N955M658L098J598L69o45j799l496
50186G53714n695p809r309j0278j1080j1654j1604j0940j0231r842r522q972q361
50173F28417p870p204o066m864m295m345m323l863l395l450l958m444m583m428
50159E61329m256m333m636m822m659m320m027l606k840k050j795k031k199k174
50145E13581k404k958l182k684k009j851k012j754q08L74J251J659J847K238L013
50130E04301L739L766L132K637K803L200L221K944K782K662K196J372N83J46J62
$$ plain form
50115 539646 540188 540947 541030 539609 537057 534713 533316 532239 530601 528480 526569 525195 524260 523777 523837 524274
50099 524274 524968 526283 528671 531969 535606 539475 544145 550254 558146 567978 579701 592839 606679 620689
50085 620689 634556 648065 661492 675959 692677 711704 732007 752894 774795 798381 823519
50074 823519 849485 875807 902482 929688 957749 987225 1018658 1052292 1088284 1127042 1169134
50063 1169134 1215030 1265188 1320135 1380042 1444260 1511501 1580358 1649322 1716399 1779222 1835871
50052 1835871 1885642 1929166 1967923 2003540 2037281 2070047 2102670 2135796 2169105 2200778 2227965
50041 2227965 2247666 2257102 2253792 2236029 2203378 2156391 2096090 2024327 1944518 1861022 1777313 1695165
50029 1695165 1615753 1540703 1471455 1408178 1350178 1297112 1249133 1206015 1166924 1131097 1098111
$$ packed form
50115E39646N42P59Q3j421k552k344j397j077j638k121j911j374r35m83O0M37
50099E24274O94J315K388L298L637L869M670O109P892R832J1723J3138J3840J4010
50085F20689J3867J3509J3427J4467J6718J9027K0303K0887K1901K3586K5138
50074H23519K5966K6322K6675K7206K8061K9476L1433L3634L5992L8758M2092
50063A169134M5896N0158N4947N9907O4218O7241O8857O8964O7077O2823N6649
50052A835871M9771M3524L8757L5617L3741L2766L2623L3126L3309L1673K7187
50041B227965J9701R436l310j7763l2651m6987o0301p1763p9809q3496q3709q2148
50029A695165p9412p5050o9248o3277n8000n3066m7979m3118l9091l5827l2986
$$ plain form
50018 1098111 1067543 1039065 1013115 990687 972002 955876 940951 927214 915788 907409 901602 897293
50006 897293 893779 891077 889646 889918 891846 894766 897722 900038 901639 902976 904634 906747 908643 909259 908165
49991 908165 905973 903489 900631 896558 890720 883378 875073 866092 856676 847386 838845 831170 823827 816097
49977 816097 807734 799338 792126 787052 784010 782106 780766 780277 781031 782675 784512 786558 789670 794547 801134
49962 801134 809180 818841 830335 843289 856961 871141 886506 904117 924872 949435 978300 1011667
49950 1011667 1049464 1091771 1139229 1192956 1254068 1323227 1400415 1484952 1575748 1671528 1770645
49939 1770645 1870694 1968756 2062426 2150674 2233631 2311789 2385736 2456493 2525518 2594042 2662433
49928 2662433 2730041 2795158 2854841 2905017 2941200 2959419 2956811 2931868 2884590 2816459 2730131
$$ packed form
50018A098111l0568k8478k5950k2428j8685j6126j4925j3737j1426q379n807m309
50006H97293l514k702j431K72J928K920K956K316J601J337J658K113J896O16j094
49991I08165k192k484k858m073n838p342q305q981r416r290q541p675p343p730
49977H16097q363q396p212n074l042j904j340m89P54J644J837K046L112M877O587
49962H01134Q046R661J1494J2954J3672J4180J5365J7611K0755K4563K8865L3367
49950A011667L7797M2307M7458N3727O1112O9159P7188Q4537R0796R5780R9117
49939A770645J00049R8062R3670Q8248Q2957P8158P3947P0757O9025O8524O8391
49928B662433O7608O5117N9683N0176L6183J8219k608k4943m7278o8131q6328
$$ plain form
49917 2730131 2629051 2517136 2398311 2275831 2151864 2027795 1904950 1785026 1669864
49908 1669864 1560884 1458754 1363622 1275644 1195244 1122696 1057593 998944 945897 898225 856034
49897 856034 819177 787009 758614 733191 710342 690018 672080 655913 640693 626035 612093
49886 612093 598970 586373 573974 561748 549663 537387 524708 512054 500135 489216 479107
49875 479107 469803 461640 454712 448611 442929 437725 433260 429478 426063 422946 420453 418867 417955 417128 416111
49860 416111 415280 415168 415789 416781 418191 420624 424353 428714 432806 436469 440072 443562 446444 448726 451122
49845 451122 454104 457284 460202 463238 467206 472299 477990 483942 490506 498293 507659 518806 532057 547757
49831 547757 566033 586903 610560 637356 667578 701500 739754 783382 833270 889531 951549
$$ packed form
49917B730131j01080j11915j18825j22480j23967j24069j22845j19924j15162
49908A669864j08980j02130r5132q7978q0400p2548o5103n8649n3047m7672m2191
49897H56034l6857l2168k8395k5423k2849k0324j7938j6167j5220j4658j3942
49886F12093j3123j2597j2399j2226j2085j2276j2679j2654j1919j0919j0109
49875D79107r304q163o928o101n682n204m465l782l415l117k493j586r12q27j017
49860D16111q31j12O21R92J410K433L729M361M092L663L603L490K882K282K396
49845D51122K982L180K918L036L968N093N691N952O564P787R366J1147J3251J5700
49831E47757J8276K0870K3657K6796L0222L3922L8254M3628M9888N6261O2018
$$ plain form
49820 951549 1018461 1089341 1162852 1237008 1309475 1378053 1440923 1496742 1544850 1585495 1619923
49809 1619923 1650327 1679428 1709444 1740945 1772663 1802305 1827185 1843977 1848610 1837357 1808188
49798 1808188 1760873 1696135 1615497 1522045 1420645 1316807 1215239 1119218 1030626 950182 877869
49787 877869 813514 756967 707792 665068 627760 595135 566771 542368 521641 504199 489435
49776 489435 476767 465966 456912 449026 441526 434433 428755 425155 422804 420182 416841 413670 411492 410037
49762 410037 408539 406753 404921 403112 401121 399021 397370 396722 397076 397921 398702 399224 399691 400420 401443 402369
49746 402369 402750 402625 402503 402708 402941 402747 402203 401740 401372 400711 399927 400027 401636 403877 405184 405087 404569 404633
49728 404633 405233 405827 406309 406888 407468 407745 407784 408032 408740 409712 410660 411501 412239 412807 413183 413555 414166 415026 415893
$$ packed form
49820I51549O6912P0880P3511P4156P2467O8578O2870N5819M8108M0645L4428
49809A619923L0404K9101L0016L1501L1718K9642K4880J6792M633j1253k9169
49798A808188m7315o4738q0638r3452j01400j03838j01568r6021q8592q0444p2313
49787H77869o4355n6547m9175m2724l7308l2625k8364k4403k0727j7442j4764
49776D89435j2668j0801r054p886p500p093n678l600k351k622l341l171k178j455
49762D10037j498j786j832j809j991k100j651o48L54Q45P81N22M67P29J023R26
49746D02369L81j25j22K05K33j94n44m63l68o61p84J00J609K241J307r7n18O4
49728D04633O00N94M82N79N80K77L9K48P08R72R48Q41P38N68L76L72O11Q60Q67
$$ plain form
49709 415893 416604 417342 418451 420010 421757 423429 424995 426432 427564 428316 428919 429597 430288 431024 432309 434522
49693 434522 437014 438449 438210 436954 435591 434296 432873 431514 430630 430180 429662 428709 427301 425615 424026
49678 424026 423150 423323 424000 424087 423065 421494 420274 419629 419108 418420 417945 418248 419283 420382 421058 421508 422119
49661 422119 422786 423110 423131 423379 424171 425280 426382 427402 428326 429097 429845 430768 431614 431813 431406 431297 432136 433479
49643 433479 434515 435123 435601 435799 435394 434838 435182 436831 439179 441551 443799 445794 447063 447421 447554 448444
49627 448444 450377 452777 454895 456421 457547 458658 459980 461414 462740 463922 465137 466597 468438 470669
49613 470669 473034 475143 476994 479228 482438 486392 490388 494343 498919 504551 510984 517999 525934 535020
49599 535020 544699 554203 563525 573229 583438 593572 603166 612480 622164 632655 644019 656154 668931
$$ packed form
49709D15893P11P38J109J559J747J672J566J437J132P52O03O78O91P36J285K213
49693D34522K492J435k39j256j363j295j423j359q84m50n18r53j408j686j589
49678D24026q76J73O77Q7j022j571j220o45n21o88m75L03J035J099O76M50O11
49661D22119O67L24K1K48P92J109J102J020R24P71P48R23Q46J99m07j09Q39J343
49643D33479J036O08M78J98m05n56L44J649K348K372K248J995J269L58J33Q90
49627D48444J933K400K118J526J126J111J322J434J326J182J215J460J841K231
49613D70669K365K109J851K234L210L954L996L955M576N632O433P015P935R086
49599E35020R679R504R322R704J0209J0134R594R314R684J0491J1364J2135J2777
$$ plain form
49586 668931 682325 696500 711710 727978 745019 762556 780660 799727 820177 842198 865707
49575 865707 890445 916234 943314 972360 1003943 1037853 1073116 1108848 1145045 1182314 1220966
49564 1220966 1260653 1300990 1342179 1384722 1428691 1473565 1518802 1564296 1610186 1656243 1701644
49553 1701644 1745377 1786906 1826336 1863785 1898686 1929952 1956749 1978734 1995532 2006557 2011768
49542 2011768 2012158 2008917 2002297 1991802 1977353 1959700 1939815 1918521 1896749 1875451 1854915 1834718
49530 1834718 1814723 1795746 1778960 1765049 1754213 1746579 1742098 1740332 1740910 1744091 1750457 1760134 1772676
$$ packed form
49586F68931J3394J4175J5210J6268J7041J7537J8104J9067K0450K2021K3509
49575H65707K4738K5789K7080K9046L1583L3910L5263L5732L6197L7269L8652
49564A220966L9687M0337M1189M2543M3969M4874M5237M5494M5890M6057M5401
49553A701644M3733M1529L9430L7449L4901L1266K6797K1985J6798J1025N211
49542B011768L90l241o620j0495j4449j7653j9885k1294k1772k1298k0536k0197
49530A834718j9995j8977j6786j3911j0836p634m481j766N78L181O366R677J2542
$$ [...]
##END NTUPLES=NMR SPECTRUM
##END=
