##TITLE=NES1098_CD3_9886922_Iyb4cjCL7v
##JCAMPDX= 6.0         $$ Bruker NMR JCAMP-DX V2.0
##DATA TYPE= NMR SPECTRUM
##DATA CLASS= NTUPLES
##ORIGIN= BRUKER
##OWNER= Administrator
$$ 1.72 TOPSPIN		Version 2.1
$$ 2016-08-28 19:19:06.461 -0500  Administrator@X
$$ Compression mode = diff/dup
##.OBSERVE FREQUENCY= 400.02188249412
##.OBSERVE NUCLEUS= ^1H
##.ACQUISITION MODE= SIMULTANEOUS (DQD)
##.ACQUISITION SCHEME= undefined
##.AVERAGES= 8
##.DIGITISER RES= 22
##SPECTROMETER/DATA SYSTEM= spect
##.PULSE SEQUENCE= zg30
##.SOLVENT NAME= COFFEE_meoh
##.SHIFT REFERENCE= INTERNAL, COFFEE_meoh, 1, 14.98509
##AUDIT TRAIL= $$ (NUMBER, WHEN, WHO, WHERE, PROCESS, VERSION, WHAT)
$$ ##TITLE= Audit trail, TOPSPIN		Version 2.1
$$ ##JCAMPDX= 5.01
$$ ##ORIGIN= Bruker BioSpin GmbH
$$ ##OWNER= Administrator
$$ $$ E:\/data/COFFEE/nmr/NES1098_CD3_9886922_Iyb4cjCL7v/10/pdata/1/auditp.txt
$$ ##AUDIT TRAIL=  $$ (NUMBER, WHEN, WHO, WHERE, PROCESS, VERSION, WHAT)
(   1,<2016-08-28 19:18:59.398 -0500>,<Administrator>,<X>,<go>,<TOPSPIN 2.1>,
      <created by zg
	started at 2016-08-28 19:17:52.586 -0500,
	POWCHK enabled, PULCHK disabled,
       configuration hash MD5:
       21 0F 79 D6 B3 7B B4 F6 88 20 88 DB 03 48 BD 9F
       data hash MD5: 64K
       9B CB F4 2F C4 55 7F 1A D9 03 59 2F 13 9D D6 DE>)
(   2,<2016-08-28 19:19:02.492 -0500>,<Administrator>,<X>,<proc1d>,<TOPSPIN 2.1>,
      <Start of raw data processing
       efp LB = 0 FT_mod = 6 PKNL = 1 PHC0 = 0 PHC1 = 0 SI = 32K 
       data hash MD5: 32K
       E9 C9 D0 C8 AE C4 54 63 72 44 59 F1 AF DC 36 77>)
(   3,<2016-08-28 19:19:02.773 -0500>,<Administrator>,<X>,<proc1d>,<TOPSPIN 2.1>,
      <pk PHC0 = 92.74109 PHC1 = 0 
       data hash MD5: 32K
       3B E6 BD 31 90 B5 F7 2C 75 77 DA 05 FE 65 11 33>)
(   4,<2016-08-28 19:19:02.883 -0500>,<Administrator>,<X>,<proc1d>,<TOPSPIN 2.1>,
      <abs ABSG = 1 
       data hash MD5: 32K
       C5 49 EA 10 68 6F B3 71 86 CF 84 28 26 6A F2 66>)
(   5,<2016-08-28 19:19:02.929 -0500>,<Administrator>,<X>,<proc1d>,<TOPSPIN 2.1>,
      <abs ABSG = 2 
       data hash MD5: 32K
       AB B2 DD BF FD 3C AD 21 32 81 F7 70 AF 2D 8C 30>)
(   6,<2016-08-28 19:19:02.992 -0500>,<Administrator>,<X>,<proc1d>,<TOPSPIN 2.1>,
      <abs ABSG = 3 
       data hash MD5: 32K
       8F 48 59 8E 69 42 78 98 40 28 28 AA 10 20 23 71>)
(   7,<2016-08-28 19:19:03.039 -0500>,<Administrator>,<X>,<proc1d>,<TOPSPIN 2.1>,
      <abs ABSG = 4 
       data hash MD5: 32K
       60 94 D4 F4 04 E4 AC 27 2C 42 20 2B A1 63 C2 D4>)
(   8,<2016-08-28 19:19:03.101 -0500>,<Administrator>,<X>,<proc1d>,<TOPSPIN 2.1>,
      <abs ABSG = 5 
       data hash MD5: 32K
       A0 74 E9 45 62 62 22 A4 F7 E4 9F CC 86 A9 5D 88>)
$$ ##END=
$$ 
$$ $$ hash MD5
$$ $$ E1 22 48 DC 7A CB 00 52 82 87 B6 FE 93 AA 9B 28
##$RELAX= 
##$RELAX= 
##$RELAX= 
##$RELAX= 
##$RELAX= 
##$RELAX= 
##$RELAX= 
$$ Bruker specific parameters
$$ --------------------------
##$DU= <E:\>
##$EXPNO= 10
##$NAME= <NES1098_CD3_9886922_Iyb4cjCL7v>
##$PROCNO= 1
$$ [...]
150 150 150 150 150 150 150 150
##$TP07= 0
##$TPNAME0= <>
##$TPNAME1= <>
##$TPNAME2= <>
##$TPNAME3= <>
##$TPNAME4= <>
##$TPNAME5= <>
##$TPNAME6= <>
##$TPNAME7= <>
##$TPOAL= (0..7)
0.5 0.5 0.5 0.5 0.5 0.5 0.5 0.5
##$TPOFFS= (0..7)
0 0 0 0 0 0 0 0
##$TUNHIN= 0
##$TUNHOUT= 0
##$TUNXOUT= 0
##$USERA1= <user>
##$USERA2= <user>
##$USERA3= <user>
##$USERA4= <user>
##$USERA5= <user>
##$V9= 5
##$VALIST= <valist>
##$VCLIST= <CCCCCCCCCCCCCCC>
##$VD= 0
##$VDLIST= <DDDDDDDDDDDDDDD>
##$VPLIST= <PPPPPPPPPPPPPPP>
##$VTLIST= <TTTTTTTTTTTTTTT>
##$WBST= 2048
##$WBSW= 25
##$XGAIN= (0..3)
0 0 0 0
##$XL= 0
##$YL= 0
##$YMAX_a= 552159
##$YMIN_a= -461196
##$ZGOPTNS= <>
##$ZL1= 120
##$ZL2= 120
##$ZL3= 120
##$ZL4= 120
##$ABSF1= 14.98509
##$ABSF2= -5.573092
##$ABSG= 5
##$ABSL= 3
##$ALPHA= 0
##$AQORDER= 0
##$ASSFAC= 0
##$ASSFACI= 0
##$ASSFACX= 0
##$ASSWID= 0
##$AUNMP= <proc_prof1d_extract_pilot.lims>
##$AXLEFT= 0
##$AXNAME= <>
##$AXNUC= <1H>
##$AXRIGHT= 0
##$AXTYPE= 0
##$AXUNIT= <>
##$AZFE= 0.1
##$AZFW= 0.1
##$BCFW= 0
##$BC_mod= 0
##$BYTORDP= 0
##$COROFFS= 0
##$CY= 15
##$DATMOD= 1
##$DC= 0
##$DFILT= <>
##$DTYPP= 0
##$F1P= 0
##$F2P= 0
##$FCOR= 0.5
##$FTSIZE= 32768
##$FT_mod= 6
##$GAMMA= 0
##$GB= 0
##$INTBC= 1
##$INTSCL= 1
##$ISEN= 128
##$LB= 0
##$LEV0= 0
##$LPBIN= 0
##$MAXI= 10000
##$MC2= 0
##$MEAN= 0
##$ME_mod= 0
##$MI= 0
##$NCOEF= 0
##$NC_proc= -8
##$NLEV= 6
##$NOISF1= 0
##$NOISF2= 0
##$NSP= 0
##$NTH_PI= 0
##$NZP= 0
##$OFFSET= 14.98509
##$PC= 1
##$PHC0= 92.74109
##$PHC1= 0
##$PH_mod= 1
##$PKNL= yes
##$PPARMOD= 0
##$PPDIAG= 0
##$PPIPTYP= 0
##$PPMPNUM= 2147483647
##$PPRESOL= 1
##$PSCAL= 4
##$PSIGN= 0
##$PYNMP= <proc.py>
##$REVERSE= no
##$SF= 400.02
##$SI= 32768
##$SIGF1= 0
##$SIGF2= 0
##$SINO= 400
##$SIOLD= 32768
##$SPECTYP= <>
##$SREGLST= <1H.CDCl3>
##$SSB= 0
##$STSI= 32768
##$STSR= 0
##$SW_p= 8223.68421052631
##$SYMM= 0
##$S_DEV= 0
##$TDeff= 65536
##$TDoff= 0
##$TI= <>
##$TILT= no
##$TM1= 0
##$TM2= 0
##$TOPLEV= 0
##$USERP1= <user>
##$USERP2= <user>
##$USERP3= <user>
##$USERP4= <user>
##$USERP5= <user>
##$WDW= 1
##$XDIM= 32768
##$YMAX_p= 439179128
##$YMIN_p= -663122
##$CURPLOT= <Network HP LaserJet P1505>
##$CURPRIN= <$Network HP LaserJet P1505>
##$DFORMAT= <normdp>
##$LAYOUT= <+/1D_H.xwp>
##$LFORMAT= <normlp>
##$PFORMAT= <normpl>
##$SURQMSG= 1
$$ End of Bruker specific parameters
$$ ---------------------------------
##NTUPLES= NMR SPECTRUM
##VAR_NAME=  FREQUENCY,     SPECTRUM/REAL,   SPECTRUM/IMAG
##SYMBOL=    X,             R,               I
##VAR_TYPE=  INDEPENDENT,   DEPENDENT,       DEPENDENT
##VAR_FORM=  AFFN,          ASDF,            ASDF
##VAR_DIM=   32768,         32768,           32768
##UNITS=     HZ,            ARBITRARY UNITS, ARBITRARY UNITS
##FACTOR=    0.250966925370066, 1,           1
##FIRST=     8223.43324360094, 139736,       67068
##LAST=      0,             -200265,         -168595
##MIN=       0,             -663122,         0
##MAX=       8223.43324360094, 439179128,    0
$$ Real data points
##PAGE= N=1
##DATA TABLE= (X++(R..R)), XYDATA
$$ [...]
19507b43273j23720a11107j09321j17542C3743b8996a178A01189e0868C39652
$$ -243273 -366993 -111107 -220428 -337970 33743 -28996 -1178 101189 -50868 339652
19496a11707H8386a80353A70690E7873a14013C8205a85638c3080k43401h0666
$$ -111707 88386 -180353 170690 57873 -114013 38205 -185638 -33080 -276481 -80666
19485e9650q541H2170J52531d23668J34544c1531m2694E0068g6130j34978g991
$$ -59650 -68191 82170 234701 -423668 -289124 -31531 -74225 50068 -76130 -211108 -7991
19473c01257e6069B63954c0038B75433c46454j26390A54197e0432A06622a14192
$$ -301257 -56069 263954 -30038 275433 -346454 -472844 154197 -50432 106622 -114192
19462c1352E384a9546A0897P5623J48048h4531o1384n9977A26887C9673A5330
$$ -31352 5384 -19546 10897 86520 234568 -84531 -145915 -205892 126887 39673 15330
19450D5844d1360k35874a3676D8566a68348N2640L7732j47274f1687p9500J6739
$$ 45844 -41360 -277234 -13676 48566 -168348 -115708 -77976 -225250 -61687 -141187 -124448
19439a24448e9878l6771o8650f1464j09268c0850A35339a33196r2439F142c71342
$$ -124448 -59878 -96649 -165299 -61464 -170732 -30850 135339 -133196 -225635 6142 -371342
19427A86424c04368Q7581b2501k77343A02003J7921b5494k1004j69801N9064E08494
$$ 186424 -304368 -216787 -22501 -299844 102003 119924 -25494 -46498 -216299 -157235 508494
19415a77996I7211a76078D5860f9340F1821a28096o3075N3670A98500a91352G1069
$$ -177996 97211 -176078 45860 -69340 61821 -128096 -191171 -137501 198500 -191352 71069
19403A1577K96399c3566A06940f4578A43096b96256i631l56445F7996h6158I824
$$ 11577 307976 -33566 106940 -64578 143096 -296256 -9631 -366076 67996 -86158 9824
19391A04595d2007B75425c2203C5476J92194F2295d6727j41774A05910b46735
$$ 104595 -42007 275425 -32203 35476 227670 62295 -46727 -188501 105910 -246735
19380c40950a57944j73651E8181a4602j8686j74392O1773A1479g9849k37477K8524
$$ -340950 -157944 -331595 58181 -14602 -33288 -207680 -145907 11479 -79849 -317326 -288802
19369b88802h1112l2557j94225B0248b89932J43865k61156a55839g5966d719j7015
$$ -288802 -81112 -113669 -307894 20248 -289932 -146067 -407223 -155839 -75966 -4719 -21734
19358b1734n8710r0306A78513b7109a0697k75k81151E9012g1412j21990A29383
$$ -21734 -80444 -170750 178513 -27109 -10697 -10972 -292123 59012 -71412 -193402 129383
19346a56497m2155G8567a5058k68581i4224j53598R3867M6976C86204C3564c36705
$$ -156497 -198652 78567 -15058 -283639 -94224 -247822 -153955 -106979 386204 33564 -336705
19334d3841F7297B7339c50898h0586l12823J7009A11705c35092c753l16859B62649
$$ -43841 67297 27339 -350898 -80586 -393409 -376400 111705 -335092 -3753 -320612 262649
19322a07886j9712k30998J70165C3858L82b13211q1329J14528D410P8900N9300
$$ -107886 -127598 -358596 -188431 33858 34240 -213211 -294540 -180012 4410 83310 142610
19311A42610H304h3914A74843o9881a53569B81603f9908E9879a5541D8668d8416
$$ 142610 8304 -83914 174843 104962 -153569 281603 -69908 59879 -15541 48668 -48416
19299H5305a15211b6935f793H3284j8843Q7860a9080m6902p3531p9481k881D7015
$$ 85305 -115211 -26935 -6793 83284 64441 152301 -19080 -65982 -139513 -218994 -221875 47015
19286b47645A89671a06061j5284A02795C5487a42339N8377j51428k3070d7517
$$ -247645 189671 -106061 -121345 102795 35487 -142339 -83962 -235390 -258460 -47517
19275d08323i106F5833L6316G717M4607a67118j62862e3327j78830M2547r1949
$$ -408323 -9106 65833 102149 7717 52324 -167118 -329980 -53327 -232157 -189610 -281559
19264b81559e7150a9248j37691j6163G4659c33799A7460b20685j19877C2919a62566
$$ -281559 -57150 -19248 -156939 -173102 74659 -333799 17460 -220685 -340562 32919 -162566
19252i0957d5229k05807P8910g2384j70207f9758A76736a263F7106b26664f8490
$$ -90957 -45229 -251036 -172126 -72384 -242591 -69758 176736 -1263 67106 -226664 -68490
19240a4839l63984i8568l5446A56851p0587c54588i8586l52644a30312e0741B2375
$$ -14839 -378823 -98568 -134014 156851 86264 -354588 -98586 -451230 -130312 -50741 22375
19228a18657j83745R6515A60473Q9593b8787C9048E361N0175g2401b7073r1150
$$ -118657 -302402 -205887 160473 250066 -28787 39048 5361 55536 -72401 -27073 -118223
19217a18223o3780i0274B07650b38585L5512b2172C23546d7615J7457j66156A98830
$$ -118223 -182003 -90274 207650 -238585 -203073 -22172 323546 -47615 -30158 -196314 198830
19205E6810c3681B80019b30488E3894j8046J45880i1784r5358b0402j60365k26433
$$ 56810 -33681 280019 -230488 53894 35848 181728 -91784 -187142 -20402 -180767 -407200
19194d07200b6333H2517i2033A70948a17968M2825l03431E3924J26249d491j47919
$$ -407200 -26333 82517 -92033 170948 -117968 -75143 -378574 53924 180173 -4491 -152410
19183a52410C9809b4804C1079g1929A30820a07742c6547I3448a19924B2752b69195
$$ -152410 39809 -24804 31079 -71929 130820 -107742 -36547 93448 -119924 22752 -269195
19171I4794a45283l9992A04329e10086A23512A7372b32772d1831l94331C1669
$$ 94794 -145283 -185275 104329 -510086 123512 17372 -232772 -41831 -436162 31669
19160a38972O1236F9807i699A9544e7727J2887J3810k33340C7341b47873J04185
$$ -138972 -77736 69807 -9699 19544 -57727 -44840 -31030 -264370 37341 -247873 -143688
19149a43688f9947j98453l5826C9992O0221c11434J55671A66917C1451b30322
$$ -143688 -69947 -268400 -304226 39992 100213 -311434 -155763 166917 31451 -230322
19138a40589m3841f8391k9026j15435A83180b52567F2381d77616B6134b61745
$$ -140589 -184430 -68391 -97417 -212852 183180 -252567 62381 -477616 26134 -261745
19127a22246j42014B6431J41862B2842K48019j24043b4937k27109f9112j57993
$$ -122246 -264260 26431 168293 22842 270861 146818 -24937 -252046 -69112 -227105
19117b27105C6857c72651C7582f4933p5363D8311c20970i9400j3095l5465j78993
$$ -227105 36857 -372651 37582 -64933 -140296 48311 -320970 -99400 -112495 -147960 -326953
19106c26953A90031B8140c77717i7615I7109k2835g0129A32543a16338M4817f224
$$ -326953 190031 28140 -377717 -97615 97109 74274 -70129 132543 -116338 -71521 -6224
19094a13365A33016a78922b6661l2213k0760A76873m1551J8686h0891r1443B66564
$$ -113365 133016 -178922 -26661 -58874 -79634 176873 135322 154008 -80891 -172334 266564
19082i5302b6766r0420A46548d5273l26363E1025o563K40189b3166j37346H4227
$$ -95302 -26766 -117186 146548 -45273 -371636 51025 44462 284651 -23166 -160512 84227
19070b52989P5821A36199e2895F5133a39046D7178a30035e0488I9740a02292A88036
$$ -252989 -177168 136199 -52895 65133 -139046 47178 -130035 -50488 99740 -102292 188036
19058B40155C0027R0398a49495A40312P4841F3924k9304P0309c31188J27172G6140
$$ 240155 30027 120425 -149495 140312 215153 63924 34620 104929 -331188 -204016 76140
19046f4346H1595J81535b74802i8803C07798c4022G6076b33904M4337f5198j38234
$$ -64346 81595 263130 -274802 -98803 307798 -34022 76076 -233904 -189567 -65198 -203432
19035b03432j03415a11016A239e19779B54795C4658b18378j03750L9259A73395
$$ -203432 -306847 -111016 1239 -519779 254795 34658 -218378 -322128 -282869 173395
19024a7204l781A4839L8092A5380J70719E7591g3552d831k9579j50587P6742j01984
$$ -17204 -20985 14839 52931 15380 186099 57591 -73552 -4831 -34410 -184997 -108255 -210239
19012b10239J5486E3102a29602j08367a00524p0270M1121L8149j95325A53561
$$ -210239 -194753 53102 -129602 -237969 -100524 -170794 -129673 -91524 -286849 153561
19001c31322e1620j34432D1144j6104J37598E0401d0060f690j81927A28578a7877
$$ -331322 -51620 -186052 41144 25040 162638 50401 -40060 -6690 -188617 128578 -17877
18989G5859C5709a08119D1129c18090N477F2687J68245b47225b1725k63j06758
$$ 75859 35709 -108119 41129 -318090 -312613 62687 230932 -247225 -21725 -21988 -128746
18978a28746f2611I7305L9375l082J9946L25563l8682o0018j74367a86917C3520
$$ -128746 -62611 97305 136680 133598 153544 479107 440425 380407 206040 -186917 33520
18966I6017O8661K7587p7025g1627G6820d09352a66161M1253e5791k53671g1561
$$ 96017 164678 192265 115240 -71627 76820 -409352 -166161 -124908 -55791 -309462 -71561
18954a20308F8959a70622K8196j96112F4617a41927d2228A17453b27158B8774
$$ -120308 68959 -170622 -142426 -338538 64617 -141927 -42228 117453 -227158 28774
18943a6258q494l22047c0517o3547j54856b4627l6235F9656A7048J936a32833
$$ -16258 -24752 -346799 -30517 -94064 -248920 -24627 -60862 69656 17048 18984 -132833
18931A38441b13285c6247C0806O0904N751l8135j336A476K7984b11997j37054
$$ 138441 -213285 -36247 30806 91710 97461 59326 57990 1476 29460 -211997 -349051
18920c49051a26430H5217a17258B91803h3511G267R3538O0026f9058A53549K02719
$$ -349051 -126430 85217 -117258 291803 -83511 7267 100805 160831 -69058 153549 356268
18909C56268J88087j32171A73362b32131r8458A20748N28566F1585B5113b211
$$ 356268 544355 412184 173362 -232131 -330589 120748 649314 61585 25113 -2211
18898A7121b34801G5998c0319k48527o2821B9148b29050K4348f2433B22K18273
$$ 17121 -234801 75998 -30319 -278846 -341667 29148 -229050 -204702 -62433 222 218495
18887B18495e618l86045a1593C762R6140P8445b9129j75074C7776a87789C0785
$$ 218495 -5618 -391663 -11593 3762 99902 178347 -29129 -204203 37776 -187789 30785
18875f8118B13643e4923K2990l10826M8317a31487E1660a06753k62889B29372
$$ -68118 213643 -54923 -31933 -342759 -294442 -131487 51660 -106753 -369642 229372
18864G1016L5863c9632B90907b4972l36573B88444b13550j5935A07714a13371
$$ 71016 106879 -39632 290907 -24972 -361545 288444 -213550 -229485 107714 -113371
18853A83540a42992A64510a70388O4275L926A9862h0911B0011r62b6770j70457
$$ 183540 -142992 164510 -170388 -106113 -102187 19862 -80911 20011 19049 -26770 -197227
18842a97227b8225D8835F812J10321f1592K1317k5480C4789J16596a00272j2786
$$ -197227 -28225 48835 6812 117133 -61592 -40275 -65755 34789 151385 -100272 -113058
18831a13058N502l222K873B5300i5912j787d4145j15123c7363j12418A83070c7670
$$ -113058 -107556 -110778 -107905 25300 -95912 -97699 -44145 -159268 -37363 -149781 183070 -37670
18818A99266I5327K14346K5571A28675O0012k4345i2256A14157d66089D2235K38167
$$ 199266 95327 309673 335244 128675 188687 164342 -92256 114157 -466089 42235 280402
18807B80402o2711J67830f8229I1633c16736c1852j60910l8311e2793l2706k72275
$$ 280402 217691 385521 -68229 91633 -316736 -31852 -192762 -231073 -52793 -85499 -357774
18796c57774F3769N9557J6769C047b68036a10154j24318e7323B69093E339a80835
$$ -357774 63769 123326 140095 3047 -268036 -110154 -234472 -57323 269093 5339 -180835
18784B5114d1517k83110a18889a5931A16483a4164I2436B7455J33875a22344b6588
$$ 25114 -41517 -324627 -118889 -15931 116483 -14164 92436 27455 161330 -122344 -26588
18772i1824A97491a50529A08966b80574R7980A8194b47821A290a66197d9257A03157
$$ -91824 197491 -150529 108966 -280574 -182594 18194 -247821 1290 -166197 -49257 103157
18760b4445l4959A60249a25593p943j31912a17020j7406B60103b3277l44628A37711
$$ -24445 -59404 160249 -125593 -133536 -265448 -117020 -134426 260103 -23277 -367905 137711
18748a56010B8544M8598l6508J19294a96536j07138b6958E6170a2903G8940J46191
$$ -156010 28544 77142 40634 159928 -196536 -303674 -26958 56170 -12903 78940 225131
18737B25131a11737C7806a46021m5291O4639k34259a08707o0318J5871P0693k27769
$$ 225131 -111737 37806 -146021 -191312 -126673 -360932 -108707 -169025 -153154 -82461 -310230
18726c10230i2915o0789C00846H0757k018a1001r1161A48613a55956N0970K0258
$$ -310230 -92915 -153704 300846 80757 78739 -11001 -102162 148613 -155956 -104986 -84728
18715h4728a6585l06978b0863B37355a84510A23193B8456b8744j02356r7804D21191
$$ -84728 -16585 -323563 -20863 237355 -184510 123193 28456 -28744 -131100 -228904 421191
18703C69878a22032n3628C48683c5188C6758J35689f9175m8708N6607k40690Q7444
$$ 369878 -122032 -175660 348683 -35188 36758 172447 -69175 -117883 -61276 -301966 -214522
18692b14522b5874I8934L930M9891i2733b3396A29048g9880r8371g4178j3719
$$ -214522 -25874 98934 102864 152755 -92733 -23396 129048 -79880 -178251 -74178 -87897
18681h7897K4639B93662A9904a69609K3836I4095d1194o6299l48427J40309d5250
$$ -87897 -63258 293662 19904 -169609 -145773 94095 -41194 -107493 -455920 -315611 -45250
18669g1851m6571A17452b41641d0390j34416B5567c11002B071a38021f7727a8812
$$ -71851 -118422 117452 -241641 -40390 -174806 25567 -311002 2071 -138021 -67727 -18812
18657a71418o9880k05938a99391L1687j73694J68108b3972k35598A28989b4777
$$ -171418 -241298 -447236 -199391 -167704 -341398 -173290 -23972 -259570 128989 -24777
18646a619j14047A82130d3987j1262A32112n4087K5598d23138K07474G9152p03
$$ -1619 -115666 182130 -43987 -55249 132112 78025 103623 -423138 -215664 79152 78449
18635G8449a43016B42440q1168n3580b0979A58377K41737b73874J2543K8759A62534
$$ 78449 -143016 242440 161272 107692 -20979 158377 400114 -273874 -261331 -232572 162534
18623c78338k10204G4159J15939G013J63186b25658E9160l552b64080A73387q3274
$$ -378338 -588542 74159 190098 7013 170199 -225658 59160 55608 -264080 173387 90113
18612I0113a04356D8751K0386a13657c2026l9715K11C61978b12079B69b40145
$$ 90113 -104356 48751 69137 -113657 -32026 -71741 -71530 361978 -212079 269 -240145
18600f0451a6249C432e2156j53355k54137A10141D1588J66458E720b42116f3553
$$ -60451 -16249 3432 -52156 -205511 -459648 110141 41588 208046 5720 -242116 -63553
18588B15732d20986D4033L780c2079q4687B44960A08514a57528k5347O031K5495
$$ 215732 -420986 44033 47813 -32079 -116766 244960 108514 -157528 -182875 -176844 -151349
18577a51349J406A1100a53507e0096k35395G1852O6651A5546K631K50873a60470
$$ -151349 -149943 11100 -153507 -50096 -285491 71852 138503 15546 18177 269050 -160470
18565b79546b4525A74437G5419a16591r2364A62168h4568G1643h5063k82985h9892
$$ -279546 -24525 174437 75419 -116591 -208955 162168 -84568 71643 -85063 -368048 -89892
18553B11038c9502a2376j08299C49135a33627A08817a88264d2875A02062b0619
$$ 211038 -39502 -12376 -120675 349135 -133627 108817 -188264 -42875 102062 -20619
18542b23412B39088d6723j22972j66588C1684a11022a7749k29662h5351E9650
$$ -223412 239088 -46723 -169695 -336283 31684 -111022 -17749 -247411 -85351 59650
18531G2522a6768k32516g2274p5928E8468P5545F1881b94367h0443j78536A9365
$$ 72522 -16768 -249284 -72274 -148202 58468 134013 61881 -294367 -80443 -258979 19365
18519E8570K79596G2687j3847Q7746a65201j77495A16502h0428j60323B9343K20576
$$ 58570 338166 72687 58840 146586 -165201 -342696 116502 -80428 -240751 29343 249919
18508B49919d65593i8445k89782A95442p4250M796f4931l22386F0250a9038o7201
$$ 249919 -465593 -98445 -388227 195442 121192 125988 -64931 -387317 60250 -19038 -86239
18497h6239B2532a98141P9443F0806i1249F4431a47785C2610a98143e8594A65742
$$ -86239 22532 -198141 -118698 60806 -91249 64431 -147785 32610 -198143 -58594 165742
18485e6671a8099j83072o1274B7274A602a22042D08552c24845J10810R9109a6819
$$ -56671 -18099 -201171 -262445 27274 1602 -122042 408552 -324845 -214035 -114926 -16819
18473A38453D0522b51862g6234k3549J6554j78181P258A33027a80697a2100l268
$$ 138453 40522 -251862 -76234 -99783 -83229 -261410 -254152 133027 -180697 -12100 -15368
18462a5368G8298K6353M6851a29851B5330O0776g8576j14470Q0262E9313K01014
$$ -15368 78298 104651 151502 -129851 25330 86106 -78576 -193046 -112784 59313 260327
18451B60327c33669O6079L7831i1221j04983G3315P8185K067b4901k7740A55943
$$ 260327 -333669 -267590 -229759 -91221 -196204 73315 151500 153567 -24901 -52641 155943
18439B75013p1491g6419A38580i2310k94961a04716p6650A26019j9312a93625
$$ 275013 203522 -76419 138580 -92310 -387271 -104716 -181366 126019 106707 -193625
18428A42931a05309d2330A22433c93326C26i2610B2944a04569L6406K3254o886
$$ 142931 -105309 -42330 122433 -393326 326 -92610 22944 -104569 -68163 -44909 -51795
18417e1795A9419a23866H9331a78984B62059e4342b0486j60006Q3319j84658h4778
$$ -51795 19419 -123866 89331 -178984 262059 -54342 -20486 -180492 -97173 -281831 -84778
18405A40988n5071b8534B05913e4048q5138a4455j03908o4715O8907E2551a3747
$$ 140988 85917 -28534 205913 -54048 -139186 -14455 -118363 -183078 -114171 52551 -13747
18393i0049B10316k6399a36454a4219k53265H6292h0537r5039p1329D3019i8893
$$ -90049 210316 183917 -136454 -14219 -267484 86292 -80537 -175576 -246905 43019 -98893
18381a20797H132h1147J8705F5202b75189K4617A94247a35174C6961f6718A63676
$$ -120797 8132 -81147 -62442 65202 -275189 -250572 194247 -135174 36961 -66718 163676
18369I2950b820j02228b652A37870l6978K9987D729J39194I512J39112a15919
$$ 92950 -2820 -105048 -2652 137870 100892 130879 4729 143923 9512 148624 -115919
18357g2355o6524M4865p4338G0006a27019r5382L3668Q2529r0720c7167A60985
$$ -72355 -138879 -94014 -168352 70006 -127019 -222401 -188733 -106204 -196924 -37167 160985
18345f807l63676J69721B07697c39467J38446e135j81042G105f8532A43536j7632
$$ -6807 -370483 -200762 207697 -339467 -201021 -5135 -186177 7105 -68532 143536 125904
18334A25904k5440b91834f213j46972H1333a61494P5432H1260b62657f7536j63549
$$ 125904 100464 -291834 -6213 -153185 81333 -161494 -86062 81260 -262657 -67536 -231085
18323b31085m4751B93419a20450N2291n1976r5833d6502B65905N6884c7208j65988
$$ -231085 -275836 293419 -120450 -68159 -120135 -215968 -46502 265905 322789 -37208 -203196
18312b03196a8795j79026A78648e9468p1938L5832G8498A876K23392o4328J53466
$$ -203196 -18795 -197821 178648 -59468 -131406 -95574 78498 1876 225268 160940 314406
18301C14406a52744g2874j7108B08054a00267A00828J08957a14019c0369C0155
$$ 314406 -152744 -72874 -89982 208054 -100267 100828 209785 -114019 -30369 30155
18290a4372B57637a75056e2390C3009f214k04241n9448A24902M097a24276M3256
$$ -14372 257637 -175056 -52390 33009 -6214 -210455 -269903 124902 128999 -124276 -81020
18279h1020m4295j1320E4866b36129R1456R819M7663A73607h90j79220d4438j67970
$$ -81020 -125315 -136635 54866 -236129 -144673 -134854 -87191 173607 -890 -180110 -44438 -212408
18267b12408e7435G9601d1245n6829B66505l6329a31731C5660a10071A56729J30582
$$ -212408 -57435 79601 -41245 -98074 266505 230176 -131731 35660 -110071 156729 287311
18256B87311b0019q706j98087H8143C727R615f1410b0212o1429A49912a24607
$$ 287311 -20019 -28725 -226812 88143 3727 13342 -61410 -20212 -81641 149912 -124607
18244F4053a46740H4349m9a66121e6817A8975K14204e5947j12510l117A0748b9327
$$ 64053 -146740 84349 84300 -166121 -56817 18975 233179 -55947 -168457 -171574 10748 -29327
18231d69861B88291i5118A4952O7702a33004A50432f135F7898N3413d349j28747
$$ -469861 288291 -95118 14952 82654 -133004 150432 -6135 67898 121311 -4349 -133096
18220a33096O3429j52405d760j24610e6624J118A45766a63589A43346O6842a69069
$$ -133096 -69667 -222072 -4760 -129370 -56624 -55506 145766 -163589 143346 210188 -169069
18208b3021j79836A09764l2687b59508F600J48129Q1625H8644h6566n3231E1334
$$ -23021 -202857 109764 77077 -259508 6600 154729 236354 88644 -86566 -139797 51334
18196a44480K7840k3006C29082b30469j23125A14083f1453A98579a30163k0883
$$ -144480 -116640 -139646 329082 -230469 -353594 114083 -61453 198579 -130163 -151046
18186a51046c8932F3816a87796K5413K8773b2114j88140B5458F483c09527J38836
$$ -151046 -38932 63816 -187796 -162383 -133610 -22114 -210254 25458 6483 -309527 -170691
18175a70691N5562L9661F2720a86233A60880b182j16506H6749e2879p5541b7885
$$ -170691 -115129 -75468 62720 -186233 160880 -2182 -118688 86749 -52879 -128420 -27885
18163d13022a54072C44827I0027A8408a43649O1034A31145f4170I1070k7548a81213
$$ -413022 -154072 344827 90027 18408 -143649 -82615 131145 -64170 91070 63522 -181213
18151A29971b0288j69615a187A12398a8154A94725a78098A50627f0527A51145
$$ 129971 -20288 -189903 -1187 112398 -18154 194725 -178098 150627 -60527 151145
18140a98209f9324A55717f9252k16419j20967D8688L9984e3946M863j77843C46991
$$ -198209 -69324 155717 -69252 -285671 -406638 48688 88672 -53946 -49083 -226926 346991
18128b71326a00114D8373A7234d22305c2032A75957n1496D3106d9516E3967J55896
$$ -271326 -100114 48373 17234 -422305 -32032 175957 124461 43106 -49516 53967 209863
18117B09863a60829K7990B27702a92065O9247j00033M4755B26227a43038B56729
$$ 209863 -160829 -132839 227702 -192065 -122818 -222851 -178096 226227 -143038 256729
18106a10664D5013c40681J17456B8219b8372C5988K63391a14704J1304B14410
$$ -110664 45013 -340681 -223225 28219 -28372 35988 299379 -114704 -103400 214410
18095A82960J16869J90469G590c8817j17919A50133J5764g4144l2097C03153g6807
$$ 182960 299829 490298 7590 -38817 -156736 150133 165897 -74144 -106241 303153 -76807
18083a19670a7760q2443N390c4963k60426a06307k80883J88076b5877M864J0007
$$ -119670 -17760 -100203 -94813 -34963 -295389 -106307 -387190 -199114 -25877 -21013 -11006
18072a1006A04575m8042A3354a66623b9753A42403l7942a86809A23310R5766d87436
$$ -11006 104575 56533 13354 -166623 -29753 142403 104461 -186809 123310 219076 -487436
18060C14946a07423j0634A88853q8662a42744j08685D4948a69443B63998d0750
$$ 314946 -107423 -118057 188853 100191 -142744 -251429 44948 -169443 263998 -40750
18049A7647a66229P7027D2342e6715j46344D0344N4926d3210A73696j3156E2428
$$ 17647 -166229 -89202 42342 -56715 -203059 40344 95270 -43210 173696 160540 52428
18037E511J38107E8999J44625a34678M4214j60325A12737R871c46589H1857a85911
$$ 5511 143618 58999 203624 -134678 -90464 -250789 112737 122608 -346589 81857 -185911
18025A6673K09396l186O0204f9956q9466A37697b35371A17483b1273C15125m0885
$$ 16673 226069 222883 283087 -69956 -159422 137697 -235371 117483 -21273 315125 274240
18014B74240E9085d9298A29737b65228B51215b54A10099L6492d2877a051C54660
$$ 274240 59085 -49298 129737 -265228 251215 -254 110099 146591 -42877 -1051 354660
18002A12333b87288F1933a98289a4725D4458K11155b4862J959A81131C803O1461
$$ 112333 -287288 61933 -198289 -14725 44458 255613 -24862 -22903 181131 3803 65264
17991F5264c00620B67930D3319J63508a02310M9773A46911b52807J5132B93263
$$ 65264 -300620 267930 43319 206827 -102310 -52537 146911 -252807 -237675 293263
17980A0992i291A5922d3581B16792q3230o5360a25673A37058b74748G020a92621
$$ 10992 -9291 15922 -43581 216792 133562 68202 -125673 137058 -274748 7020 -192621
17968D8184a94367D6624f1791A70663c6238A0431K7514a23747C42879D5276b63576
$$ 48184 -194367 46624 -61791 170663 -36238 10431 37945 -123747 342879 45276 -263576
17956C85935j68899a22297j62316C3751K3936B0485J5257e3567C00768c9085A47401
$$ 385935 217036 -122297 -284613 33751 57687 20485 35742 -53567 300768 -39085 147401
17944G2906a17006d1046r9577l5113N0228b5500E3685b0970A095f6525b2084A52426
$$ 72906 -117006 -41046 -140623 -175736 -125508 -25500 53685 -20970 1095 -66525 -22084 152426
17931b1990n7065r5125I4742g4511A5542c7701A66675a36725B48069E3392M7740
$$ -21990 -79055 -174180 94742 -74511 15542 -37701 166675 -136725 248069 53392 101132
17920A01132J46140m9960I038c3255G2613N0531a0725A00590a31780l3252J8389
$$ 101132 247272 197312 9038 -33255 72613 123144 -10725 100590 -131780 -165032 -146643
17909a46643j95835a07657C8866f7342A52332E4227k7046R7935B4310g0301A57974
$$ -146643 -342478 -107657 38866 -67342 152332 54227 27181 125116 24310 -70301 157974
17897E4354A1753J0723c6689k19056G5282K62838A13810a80493B74217a59675
$$ 54354 11753 22476 -36689 -255745 75282 338120 113810 -180493 274217 -159675
17886A23067M6910J22755a54758I3966e8980H4156b21266e1529B11208o8919a10635
$$ 123067 169977 292732 -154758 93966 -58980 84156 -221266 -51529 211208 142289 -110635
17874a34520m6323a726B10507c06875J23028f252C31374C1358L5590g6075J9622
$$ -134520 -180843 -1726 210507 -306875 -183847 -6252 331374 31358 66948 -76075 -56453
17863e6453G2554a11386A04390a29704B49018g3060j57291A35337b7815j24839
$$ -56453 72554 -111386 104390 -129704 249018 -73060 -230351 135337 -27815 -152654
17853a52654M8037A09618a97108d649C9817a27250d6757K2436H5099a54508A13254
$$ -152654 -104617 109618 -197108 -4649 39817 -127250 -46757 -24321 85099 -154508 113254
17841E4059J46481I8865N9894o0866K58800A62623J31586g2421C37200j14950
$$ 54059 200540 98865 158759 97893 356693 162623 294209 -72421 337200 222250
17831B22250a2268n1832B67273l9395o1501F8269J51611N926h618A47120k4349
$$ 222250 -12268 -64100 267273 227878 166377 68269 219880 225806 -8618 147120 122771
17820A22771E9254o249K2243M4483k063b7617k78135C99669A42929J58738A17040
$$ 122771 59254 53005 75248 119731 117668 -27617 -305752 399669 142929 301667 117040
17808B10390G3361a38941d5966A5055a40488e2046C06476E11K37410l3752c6415
$$ 210390 73361 -138941 -45966 15055 -140488 -52046 306476 511 237921 204169 -36415
17796a02236G3414B8547O9423d04141C78663a67887D6450J34026l790q970G2060
$$ -102236 73414 28547 97970 -404141 378663 -167887 46450 180476 176686 167716 72060
17784C64186j78945B7606a45004k0628C5801b2986j34689D13709a53358A27834
$$ 364186 185241 27606 -145004 -165632 35801 -22986 -157675 413709 -153358 127834
17773C52416A40288j1541c6486A18639D1481M9554f0899A24942a393q0855F7931
$$ 352416 140288 128747 -36486 118639 41481 91035 -60899 124942 -1393 -82248 67931
17761B6859O5308a52252I8175M7258R9703a61223d1895j71002A39231J41239P7216
$$ 26859 92167 -152252 98175 145433 245136 -161223 -41895 -212897 139231 280470 357686
17750C57686B0451K50382r3804b38412I0857c8371B49053C0890O206Q1971c17670
$$ 357686 20451 270833 177029 -238412 90857 -38371 249053 30890 37096 119067 -317670
17738C94848g7658B040O2981K07619j2400q4490k7422f9321A44948b72831B5296
$$ 394848 -77658 2040 65021 272640 260240 175750 148328 -69321 144948 -272831 25296
17726f4877C9407a41390C29284I5837j6258O4248a01887B04167b52598k45602
$$ -64877 39407 -141390 329284 95837 79579 143827 -101887 204167 -252598 -498200
17716d98200g6665A4261g6543B28482r0754J55179k0400M1893e9838H8179a31742
$$ -498200 -76665 14261 -76543 228482 137728 292907 272507 314400 -59838 88179 -131742
17704b4899B6354J17030B6218J73047i8416k4852D30899j85775m6188A7143O7448
$$ -24899 26354 143384 26218 199265 -98416 -123268 430899 245124 198936 17143 84591
17693H4591d8940A6820L3975i3365A58506G5887k484a01149B55615j27477G495
$$ 84591 -48940 16820 50795 -93365 158506 75887 73403 -101149 255615 128138 7495
17681B45557A07593N9897p9167P2606a16772C3223d2810A18034J11861f7319j3722
$$ 245557 107593 167490 88323 160929 -116772 33223 -42810 118034 229895 -67319 -81041
17670h1041C56376b05971A74251b10685f5120B63581h0871F8057m398h7083C46667
$$ -81041 356376 -205971 174251 -210685 -65120 263581 -80871 68057 63659 -87083 346667
17658I5655g7562j1468A89257R410b31114i7644j73218g3456A39438K5454I651
$$ 95655 -77562 -89030 189257 198667 -231114 -97644 -270862 -73456 139438 164892 9651
17646G2241b88520C37406a03233A53526m7557D9158R2461d2528B51436Q7863D799
$$ 72241 -288520 337406 -103233 153526 105969 49158 141619 -42528 251436 339299 4799
17634A74567b3533A97013a25036F1721c4599A33487F4493K06284a24248l6842
$$ 174567 -23533 197013 -125036 61721 -34599 133487 64493 270777 -124248 -161090
17624a61090B06670f9847A62677m0765K6631B9192c3779B84582e1377C13877A9201
$$ -161090 206670 -69847 162677 121912 148543 29192 -33779 284582 -51377 313877 19201
17612B7694J31739p0654J03238P9163I7097b58729B82705a11212E8224P5758b687
$$ 27694 159433 88779 192017 271180 97097 -258729 282705 -111212 58224 133982 -2687
17600B71639a83940A12143E5405Q029K92765F2190d5316A74117o6229g6582A34274
$$ 271639 -183940 112143 55405 63434 356199 62190 -45316 174117 107888 -76582 134274
17588A74427J52783O0904l9609R2909I6047N1331a7901A27466b92690A91721J52188
$$ 174427 327210 388114 348505 441414 96047 147378 -17901 127466 -292690 191721 343909
17577C43909A67108F1271J46636B7613a56386M0729A40816M3111a13210B36443
$$ 343909 167108 61271 207907 27613 -156386 -115657 140816 183927 -113210 236443
17566I8081L19532n9460F1350R7033K3823E9685K94714A57676J8170J04388A26859
$$ 98081 417613 358153 61350 158383 182206 59685 354399 157676 175846 280234 126859
17554i5759C16182j31639K38015j29483k0948l9010K94157k17043c1507F0748
$$ -95759 316182 184543 422558 293075 272127 233117 527274 310231 -31507 60748
17543B7947J88655n2713J81036m5757A7669K58232N1809k7255A15536L96239F6749
$$ 27947 216602 163889 344925 299168 17669 275901 327710 300455 115536 511775 66749
17531a2690C51284J2061N1623J24091n1493L0471L39420J062j39520j1761R6961
$$ -12690 351284 363345 414968 539059 487566 518037 857457 858519 718999 707238 804199
17520H04199C31966O6419Q4733j30408j21429J42998G9206P07965C76594J84060
$$ 804199 331966 398385 483118 352710 231281 374279 79206 787171 376594 560654
17510E60654K14805L21991k13517j00651K62495D21731j71292J55754j96317Q2395
$$ 560654 775459 1097450 883933 783282 1045777 421731 250439 406193 209876 292271
17500B92271L5101a0275A69539J29390K5019K16344A50143A4740M06017R3329
$$ 292271 327372 -10275 169539 298929 323948 540292 150143 14740 420757 514086
17490E14086j8081A72772K20237j8694A16311K41681J57506B49508M9974p8350
$$ 514086 496005 172772 393009 374315 116311 357992 515498 249508 299482 221132
17480B21132H531i7064A02119L9699J15570f2197A55483J08863A20148N9908F0613
$$ 221132 8531 -97064 102119 141818 257388 -62197 155483 264346 120148 180056 60613
17468E65849A64998M52688j91613H9657L41387D8223O6627O4504q3874l209L03519
$$ 565849 164998 617686 426073 89657 431044 48223 114850 179354 95480 92271 395790
17457C95790A92122J06407o1136H2170k0332J14289h9275I3376K47628J2548J09234
$$ 395790 192122 298529 237393 82170 61838 176127 -89275 93376 341004 353552 462786
17446D62786r6973j17566K33292J26226n6709r3379k07937J67282A48176J64095
$$ 462786 365813 248247 481539 607765 551056 457677 249740 417022 148176 312271
17436C12271J84798j87743F4648J81292q4747p6331J01923G1597J18244M05297
$$ 312271 497069 309326 64648 245940 161193 84862 186785 71597 189841 595138
17426E95138G0456N78530l23918P2545j87554O7751L2252r6724J66179I5984K61327
$$ 595138 70456 648986 325068 397613 210059 277810 310062 213338 379517 95984 357311
17415C57311J11980P0489B07884Q0728G5666K29425L7378j34192J43411o9884
$$ 357311 469291 539780 207884 288612 75666 305091 342469 208277 351688 281804
17405B81804J86119h6774D85561G0386C3975K83287o0451h4682A15099J82979
$$ 281804 467923 -86774 485561 70386 33975 317262 256811 -84682 115099 298078
17395B98078A34022K23024C6553J87253m4597F0699J57685J27086A41510J48995
$$ 298078 134022 357046 36553 223806 179209 60699 218384 345470 141510 290505
17385B90505G6008J2560P0345a59255A30942K70988A89414B2817J14515J36239
$$ 290505 76008 88568 158913 -159255 130942 401930 189414 22817 137332 273571
17375B73571n8341J3202E4082J9896M16616A52816Q3398j08163l6041J80060A01324
$$ 273571 215230 228432 54082 73978 490594 152816 236214 128051 92010 272070 101324
17363A56977Q1765O520r6665L83011A07485J94096j28247K18265P3638A49983
$$ 156977 238742 245262 148597 531608 107485 301581 173334 391599 465237 149983
17352A2405J35613O9491L47010b5690D4114G972K00870k7331J40256A19886j9299
$$ 12405 148018 217509 564519 -25690 44114 7972 208842 181511 321767 119886 100587
17341A00587a7799A47620J21535L9529r717F9471B4293L23054j09780p4261o9803
$$ 100587 -17799 147620 269155 308684 298967 69471 24293 347347 237567 163306 93503
17330I3503J16718G8182a39027B90675j2625J04873l1522K39353k37579A5008
$$ 93503 210221 78182 -139027 290675 278050 382923 351401 590754 353175 15008
17319C51433l5457k9417J10948E3394J22135M19308A24520M8010N338o2506J44874
$$ 351433 315976 286559 397507 53394 175529 594837 124520 172530 177868 115362 260236
17308B60236R0946A19585N7368K61216k9591A57521J97477m0811d3381B77774
$$ 260236 351182 119585 176953 438169 408578 157521 354998 314187 -43381 277774
17297C74554q8468J43582A26897J15185L78477A15496E6915K44155K6122G0353
$$ 374554 286086 429668 126897 242082 620559 115496 56915 301070 327192 70353
17286B79020R6046R831j06135o6736L76277j31629A63697j6705K57665j65275
$$ 279020 375066 384897 278762 212026 588303 456674 163697 146992 404657 239382
17276B39382N9280J13315A93427P5937J76154k12758K02480c1685A15996K36058
$$ 239382 298662 411977 193427 269364 445518 232760 435240 -31685 115996 352054
17266C52054r7860P272B0204N66231F8771L63249M9269j08537P131m7147A62166
$$ 352054 254194 261466 20204 586435 68771 432020 481289 372752 379883 332736 162166
17254E00713P9846B46065L7199I3929N26421k26606j62313Q5477A05481L83776
$$ 500713 580559 246065 283264 93929 620350 393744 231431 316908 105481 489257
17244D89257A45749J15614m8389J17559Q7666B01992J17924j05543J18785J30955
$$ 489257 145749 261363 212974 330533 418199 201992 319916 214373 333158 464113
17234D64113n6009f4682B35070P025A01550K79765N1873j50112M5701q4918F8680
$$ 464113 408104 -64682 235070 242095 101550 381315 433188 283076 328777 243859 68680
17222C84188A69199J70214A56799L42020j07896j78667J96449K03821m5744A18268
$$ 384188 169199 339413 156799 498819 390923 212256 408705 612526 566782 118268
17211i0093C50309j32399m4445J05525m9829L44139k47188o6435J3995k4035q9769
$$ -90093 350309 217910 173465 278990 229161 573300 326112 259677 273672 249637 159868
17200A59868K26171q2537K92557k42182J23262R0412k46188N84788B05036l7228
$$ 159868 386039 303502 596059 353877 477139 567551 321363 906151 205036 167808
17190A67808J82439L15943G5646O54491k28480J79713j50374j69178J9136J93276
$$ 167808 350247 666190 75646 730137 501657 681370 530996 361818 380954 574230
17180E74230j09948m6265j82229L79575B92660N28602j84542k50196K08175j68199
$$ 574230 464282 418017 235788 615363 292660 821262 636720 386524 594699 426500
17170D26500j33918M19124A88444O10074l36113K31821B40821K74535j4821J12582
$$ 426500 292582 711706 188444 798518 462405 694226 240821 515356 500535 613117
17160F13117O847B77131O9843J77475p5287j20271p067J17445j12486A55680M34776
$$ 613117 619964 277131 346974 524449 449162 328891 321824 439269 326783 155680 590456
17149E90456k14183j79664K61395L356N4718B29666L58895k14121J99426J7650
$$ 590456 376273 196609 458004 461360 516078 229666 588561 374440 573866 591516
17139E91516j95273K39870R4973C29535M64987k91000N0875n0745K2189J79316
$$ 591516 396243 636113 731086 329535 794522 503522 554397 503652 525841 705157
17129G05157j65819P4839j57210L48376k54226N2729m5094M4539j64229r4032
$$ 705157 539338 614177 456967 805343 551117 603846 558752 603291 439062 345030
17119C45030M48272k97460J33752J29114j80034r7469k32274L15585k27279K84624
$$ 345030 793302 495842 629594 758708 578674 481205 248931 564516 337237 621861
17109F21861j41233M551A00398M83303j04968k35166P9827L49825Q4694j88142
$$ 621861 480628 485179 100398 583701 478733 243567 323394 673219 757913 569771
17099E69771r9000J16178J23038j41542N478j0866k33q5435J93785k95241N31564
$$ 569771 470771 586949 709987 568445 573923 563057 562824 477389 671174 375933 907497
17088I07497k49925L83220k58390k21033J06201L82600l11961J882j73112J49904
$$ 907497 657572 1040792 782402 561369 667570 1050170 738209 740091 566979 716883
17078G16883O3190n7468M06n7308k43214L38843k5056J39489n7389k46562L19067
$$ 716883 780073 722605 723011 665703 422489 761332 736276 875765 818376 571814 890881
17067H90881j45248O722J35288n6355O3824k77641J36053l2023j27230N26022
$$ 890881 745633 752355 887643 831288 895112 617471 753524 721501 594271 1120293
17057A120293l52005J70766l02542P9696p1850M9900j44128L83922j32060j07459
$$ 1120293 768288 939054 636512 716208 644358 694258 550130 934052 801992 694533
17047F94533J09091p8331K72672k48378m356K99910j64422P8158Q2686j60202
$$ 694533 803624 725293 997965 749587 745231 1045141 880719 958877 1041563 881361
17037H81361K0327D02116M37474J88900l53181N00885l28778o8109J30846J63102
$$ 881361 901688 402116 839590 1028490 675309 1176194 847416 779307 910153 1073255
17027A073255L56829l81585j42857K43372m21054K22135R8625L49068l44131L19131
$$ 1073255 1430084 1048499 905642 1149014 727960 950095 1048720 1397788 1053657 1372788
17017A372788l67709k27036L27761j45028K6157K90174m51603L21256o7162j32015
$$ 1372788 1005079 778043 1105804 960776 986933 1277107 825504 1146760 1079598 947583
17007I47583r0603P4935K38434Q1192q4933K88990j73755M717k44968l2075J90765
$$ 947583 856980 931915 1170349 1251541 1166608 1455598 1281843 1286560 1041592 1009517 1200282
16996A200282Q0417j13022J11866k11746J90770J37908j31450p3631J1679j84563
$$ 1200282 1280699 1167677 1279543 1067797 1258567 1396475 1265025 1191394 1203073 1018510
16986A018510K50679j14459O769K18046K28343m58301O83869m65245Q1765j4446
$$ 1018510 1269189 1154730 1161499 1379545 1607888 1149587 1833456 1368211 1449976 1435530
16976A435530q9870P1175O4817J53028k04419J02084j59813L51856l27218j18497
$$ 1435530 1345660 1416835 1481652 1634680 1430261 1532345 1372532 1724388 1397170 1278673
16966A278673r1635L58333N688k28041K70473j05796J32117L03985k93522J00700
$$ 1278673 1187038 1545371 1551059 1323018 1593491 1487695 1619812 1923797 1630275 1730975
16956A730975J31782k37375K46613l5432n24594L86893J92078L7894j22760j20497
$$ 1730975 1862757 1625382 1871995 1836563 1311969 1698862 1890940 1928834 1806074 1685577
16946A685577k70927M99142p1645N27486m33102k50383M69603k57033j2461j01767
$$ 1685577 1414650 1913792 1842147 2369633 1936531 1686148 2155751 1898718 1886257 1784490
16936A784490J15898j80490N32964l70795Q4307K07668k51577M0116J41566k2343
$$ 1784490 1900388 1719898 2252862 1882067 1966374 2174042 1922465 1962581 2104147 2081804
16926B081804J86608j90685P8471L6480J94746l0730M2690r6076K18206M7819
$$ 2081804 2268412 2077727 2156198 2192678 2387424 2356694 2399384 2303308 2521514 2569333
16916B569333J01269j22353k82686K19242J41305J19915r2698M09008o56862M55928
$$ 2569333 2670602 2548249 2265563 2484805 2626110 2746025 2653327 3062335 2405473 2861401
16906B861401l26315M29793j66326J85804k64985J82124Q2312R1173n6957N4787
$$ 2861401 2535086 2964879 2798553 2984357 2719372 2901496 2983808 3074981 3018024 3072811
16896C072811L3177R7758k11691K45497J76563m445k40166M05408j4592l10861
$$ 3072811 3105988 3203746 2992055 3237552 3414115 3409670 3169504 3574912 3560320 3249459
16886C249459J51197k11691O07466k02933j96165N22759r0524k35025L59788j01772
$$ 3249459 3400656 3188965 3796431 3593498 3397333 3920092 3829568 3594543 3954331 3852559
16876C852559K26336q1823K67363l18681R3645L72694m68257L50265j39431K72806
$$ 3852559 4078895 3997072 4264435 3945754 4039399 4412093 3943836 4294101 4154670 4427476
16866D427476p0927K27138o8502L38396j74470k39138L02798J15188j08368M22796
$$ 4427476 4356549 4583687 4515185 4853581 4679111 4439973 4742771 4857959 4749591 5172387
16856E172387Q5218J02557n0012k27442N39381q9402J8892J83343K28208J12058
$$ 5172387 5257605 5360162 5310150 5082708 5622089 5532687 5551579 5734922 5963130 6075188
16846F075188j63500L58524K01275j04044r7813L86774r1218M2168J93231p7072
$$ 6075188 5911688 6270212 6471487 6367443 6269630 6656404 6565186 6607354 6800585 6723513
16836F723513M20287K34896L2023K54163N8077M2264m5377J74606K43494K19284
$$ 6723513 7143800 7378696 7410719 7664882 7722959 7765223 7719846 7894452 8137946 8357230
16826H357230K67314J28906N7795l10520L70572R3070K82507K01283L37453J16276
$$ 8357230 8624544 8753450 8811245 8500725 8871297 8964367 9246874 9448157 9785610 9901886
16816I901886K07704L7884N10817J18280K63562L81015j64041L33159K75442J25082
$$ 9901886 10109590 10147474 10658291 10776571 11040133 11421148 11257107 11590266 11865708 11990790
16806A1990790J91255O25659K77633J68228J94284N07487J34628M67627J40128
$$ 11990790 12182045 12807704 13085337 13253565 13447849 13955336 14089964 14557591 14697719
16797A4697719M46693J85711M92940N90598P3988M28085N43402K00327P94504
$$ 14697719 15144412 15330123 15823063 16413661 16487649 16915734 17459136 17659463 18453967
16788A8453967L89466L68270N03454P45781M21455P44314R0715L49810Q13140
$$ 18453967 18843433 19211703 19715157 20460938 20882393 21626707 21717422 22067232 22880372
16779B2880372N19402O89097Q74984M79593Q06193M00264J077066N49873Q83123
$$ 22880372 23399774 24088871 24963855 25443448 26249641 26649905 27726971 28276844 29159967
16770B9159967R05403Q77872P19546J069343R58197J009313Q52223J141393R96386
$$ 29159967 30065370 30943242 31662788 32732131 33690328 34699641 35551864 36693257 37689643
16761C7689643R81748J100160J240474J471503P53519J697885J357561J309832
$$ 37689643 38671391 39771551 41012025 42483528 43237047 44934932 46292493 47602325
16753D7602325J204424J548818J248677J754402J477390J431940J571988J712626
$$ 47602325 48806749 50355567 51604244 53358646 54836036 56267976 57839964 59552590
16745E9552590J461010J438461K047061J104896J853267J665308J307770J712920
$$ 59552590 61013600 62452061 64499122 65604018 67457285 69122593 70430363 72143283
16737G2143283J253470J337149J502093J131180J222717J087873J126255R81567
$$ 72143283 73396753 74733902 76235995 77367175 78589892 79677765 80804020 81785587
16729H1785587N27559R45871Q14990k56927O34973J79094r0855j45271j37880
$$ 81785587 82313146 83259017 84074007 83817080 84452053 84631147 84540292 84395021 84257141
16720H4257141q1071j105800o33762o81976q95367j192178q54517j234494j012409
$$ 84257141 84176070 83070270 82436508 81754532 80859165 79666987 78812470 77577976 76565567
16711G6565567j467888j469191j537103j403088j528219j686588j335872j825297
$$ 76565567 75097679 73628488 72091385 70688297 69160078 67473490 66137618 64312321
16703F4312321j305905j848183j379580j487230j330209j693416j520976j153655
$$ 64312321 63006416 61158233 59778653 58291423 56961214 55267798 53746822 52593167
16695E2593167j703437j487428j282045j246928j184374j309366j459105j169818
$$ 52593167 50889730 49402302 48120257 46873329 45688955 44379589 42920484 41750666
16687D1750666j150891q65140j404531j036706j176912q32373n65108j339313
$$ 41750666 40599775 39734635 38330104 37293398 36116486 35284113 34719005 33379692
16679C3379692r15548j077034m18597j121031q92634o69807o13375q54267p69594
$$ 33379692 32464144 31387110 30968513 29847482 28954848 28285041 27671666 26817399 26047805
16670B6047805l52713q05533p51269l90490m82384q67131o56683m45570m48812
$$ 26047805 25695092 24889559 24138290 23747800 23265416 22398285 21741602 21296032 20847220
16661B0847220m23795l94389k10434n54511r04842k09179m10871m85043m18246
$$ 20847220 20423425 20029036 19818602 19264091 18359249 18150070 17739199 17254156 16835910
16652A6835910R462n96442l52268n15676k16896m91075k06025l18549k00348k10724
$$ 16835910 16845372 16248930 15896662 15380986 15164090 14673015 14466990 14148441 13948093 13737369
16642A3737369j74634n36340j48012k66216k90518l73784L0674n02644j78026
$$ 13737369 13562735 13026395 12878383 12612167 12321649 11947865 11978539 11475895 11297869
16633A1297869j72091q4505j52034j57535j25426l10532k62925r31l67854q542
$$ 11297869 11125778 11041273 10889239 10731704 10606278 10295746 10032821 10031890 9664036 9655494
16623I655494k45540r6225k12188N6735l76417k52794j18175K52297m73370J24616
$$ 9655494 9409954 9313729 9101541 9158276 8781859 8529065 8410890 8663187 8189817 8314433
16613H314433j91487l68306n9436k98324K97269m58873k13082K94006j78824k34191
$$ 8314433 8122946 7754640 7695204 7396880 7694149 7235276 7022194 7316200 7137376 6903185
16603F903185k51332j59372k3862M27898k56412m26356j3581j8288l07027K02695
$$ 6903185 6651853 6492481 6468619 6896517 6640105 6213749 6200168 6181880 5874853 6077548
16593F077548O3674l25673M9176l06614O0832J38302o38035J94829j32192k44444
$$ 6077548 6141222 5815549 5864725 5558111 5618943 5757245 5119210 5314039 5181847 4937403
16583D937403L72846j85482N955k48263N1406j24265j11677j97503j52790J63291
$$ 4937403 5310249 5124767 5130722 4882459 4933865 4809600 4697923 4500420 4347630 4510921
16573D510921K10969q7908m30108N4319N9226L18666l1391p38009K38494j06585
$$ 4510921 4721890 4633982 4203874 4258193 4317419 4636085 4604694 3866685 4105179 3998594
16563C998594L4954r8673K21796m28006K21147m49126J12008J89031q2405K04963
$$ 3998594 4033548 3934875 4156671 3728665 3949812 3500686 3612694 3801725 3719320 3924283
16553C924283j89749j75542L06244l49508j35308L2471J70135l12116J73139p7520
$$ 3924283 3734534 3558992 3865236 3515728 3380420 3412891 3583026 3270910 3444049 3366529
16543C366529M6812O900j10841M4173j56329K00369j78794k50586J67061j71229
$$ 3366529 3413341 3420241 3309400 3353573 3197244 3397613 3218819 2968233 3135294 2964065
16533B964065j64282K25922m25036M47916j61959l10466N85615l72868J89844
$$ 2964065 2799783 3025705 2600669 3048585 2886626 2576160 3161775 2788907 2978751
16524B978751o2826o25265M93970K68576n59035J13351J17417p2710j11589j6999
$$ 2978751 2915925 2290660 2784630 3053206 2494171 2607522 2724939 2652229 2540640 2523641
16514B523641j02169K99778j75847j39750k27627L13116J1983k10782L03201k70868
$$ 2523641 2421472 2721250 2545403 2405653 2178026 2491142 2503125 2292343 2595544 2324676
16504B324676N5683J97331j01392k51707l7813j19529J08647O3589P961k74818
$$ 2324676 2380359 2577690 2476298 2224591 2186778 2067249 2175896 2239485 2247446 1972628
16494A972628J74882K17557k05m02844p2181J71438k15258L51760l19318J46682
$$ 1972628 2147510 2365067 2364862 1962018 1889837 2061275 1846017 2197777 1878459 2025141
16484B025141k08477n5914L65551n8529k6283l74206K29403k89997N77711n80365
$$ 2025141 1816664 1760750 2126301 2067772 2041489 1667283 1896686 1606689 2184400 1604035
16474A604035J48470j07686j02355M6884J41101O41938n26010j47950r1934J79202
$$ 1604035 1752505 1644819 1542464 1589348 1730449 2372387 1846377 1698427 1606493 1785695
16464A785695O4917N0578j59034M6996j93500O0590P4249J52162j09783l11174
$$ 1785695 1850612 1901190 1742156 1789152 1595652 1656242 1730491 1882653 1772870 1461696
16454A461696P6284n6667o991J15690j55231J02270j07488L52984n82491J79223
$$ 1461696 1537980 1481313 1474322 1590012 1434781 1537051 1429563 1782547 1200056 1379279
16444A379279o8835M14524N313m54639K71181j60452j16696J44807L05275J12771
$$ 1379279 1310444 1724968 1730281 1275642 1546823 1386371 1269675 1414482 1719757 1832528
16434A832528m48985P1126j35653O9106p0493N814N277K5021j79818J98398k3785
$$ 1832528 1383543 1454669 1319016 1388122 1317629 1323443 1328720 1353741 1173923 1372321 1348536
16423A348536j1576o7175L71732m42280K28031j27471q5424L07875p5930k59556
$$ 1348536 1336960 1269785 1641517 1199237 1427268 1299797 1214373 1522248 1446318 1186762
16413A186762R5408J92305j91221k9090J49951J11129o18750M35305J34190k06581
$$ 1186762 1282170 1474475 1283254 1254164 1404115 1515244 896494 1331799 1465989 1259408
16403A259408k06103j84252J86081J55250J0376n5256K57232k98005j86436j53641
$$ 1259408 1053305 869053 1055134 1210384 1220760 1165504 1422736 1124731 938295 784654
16393G84654K92277m34842N34873R1420k72992R770M0620J8789k41761N4819K64524
$$ 784654 1076931 642089 1176962 1268382 995390 1005160 1045780 1064569 822808 877627 1142151
16382A142151n84N3247Q0557r8798j99950R3275l3165j17248J01478k02636J45280
$$ 1142151 1141567 1194814 1275371 1176573 976623 1069898 1036733 919485 1020963 818327 963607
16371I63607J22664l35489K65873o47j4075k44044k1757J4368K07102K83687n59141
$$ 963607 1086271 750782 1016655 1016008 1001933 757889 736132 750500 957602 1241289 682148
16360F82148J10821o6954J70560K45118k17212j41690o4810K22497j93611K97727
$$ 682148 792969 726015 896575 1141693 924481 782791 717981 940478 746867 1044594
16350A044594k79940M6092O602R9734q3442J21965k87525O2572J01332K1541K17621
$$ 1044594 764654 810746 817348 917082 833640 955605 668080 730652 831984 853525 1071146
16339A071146o3940k91310M01806l35514p6695J63735k41335M28272m39323o6283
$$ 1071146 1007206 715896 1117702 782188 705493 869228 627893 1056165 616842 550559
16329E50559L04795j12138L19344j47861A94508M51910j36795M03193l05311K13066
$$ 550559 855354 743216 1062560 914699 194508 646418 509623 912816 607505 820571
16319H20571k70226K29095K01065l33357J82088k93994K91098q3911l38863J53254
$$ 820571 550345 779440 980505 647148 829236 535242 826340 742429 403566 556820
16309E56820K64340J0304k84789K84345k32611J51394P6952l5987j01977O0993
$$ 556820 821160 831464 546675 831020 598409 749803 826755 790768 688791 749784
16299G49784k25015J77718k43859N01273k16160k50204J78008j82667L04315k62287
$$ 749784 524769 702487 458628 959901 743741 493537 671545 488878 793193 530906
16289E30906J22920l13186L01179B26968J35326K87830n0619p9344K07560Q2893
$$ 530906 653826 340640 641819 226968 362294 650124 599505 520161 727721 810614
16279H10614C36857K3407L15433O6164B39121M28735k86974J23691K68699k29934
$$ 810614 336857 360264 675697 741861 239121 667856 380882 504573 773272 543338
16269E43338B55666K74192j51275m4348r6853L49540k74768L22727J55517l20544
$$ 543338 255666 529858 378583 334235 237382 586922 312154 634881 790398 469854
16259D69854J06147B40602K21602j15748J33333q716B00015J01852L93760j35157
$$ 469854 576001 240602 462204 346456 479789 471073 200015 301867 695627 560470
16249E60470o3268L32435k18172n4019k27520R4872L10899l15587K01325o0930
$$ 560470 497202 829637 611465 557446 329926 424798 735697 420110 621435 560505
16239E60505j91457P651K82893k67627M4916o7683J07379A31960K97079o8854
$$ 560505 369048 376699 659592 391965 436881 369198 476577 131960 429039 360185
16229C60185O6475N3767B37183K12444H4819O26336B81308H0614K70506p2535
$$ 360185 426660 480427 237183 449627 84819 711155 281308 80614 351120 278585
16219B78585A27617L21308m2532K76806k07092j63505K95997B92907J50636j53403
$$ 278585 127617 448925 406393 683199 476107 312602 608599 292907 443543 290140
16209B90140J65393m440j03110m5936J33678M9750M62708B63643J03390r9169
$$ 290140 455533 451093 347983 302047 435725 485475 948183 263643 367033 267864
16199B67864l1990o8086L07916m0599L49106B08440J51932J45315q9390j01975
$$ 267864 235874 167788 475704 435105 784211 208440 360372 505687 416297 314322
16189C14322K69310B37008J31900A58195K56659j3875R0409k27685M87725A10063
$$ 314322 583632 237008 368908 158195 414854 400979 491388 263703 751428 110063
16178C2519K42895R4153J52154A94379J18849J85148p3218A24874K65349A81727
$$ 32519 275414 369567 521721 194379 313228 498376 425158 124874 390223 181727
16167F0577N4374J96963l7625D7801L46905A65038K25919A47944o236a99527g8549
$$ 60577 114951 311914 274289 47801 394706 165038 390957 147944 141708 -199527 -78549
16155D54179j34430M2351p8696J00739j21845j25852M077J3558J81789o4238O9557
$$ 454179 319749 362100 283404 384143 262298 136446 140523 154081 335870 271632 341189
16144C41189J87495c5103J0893B70844a30922A6776L17193K0954K59341E9133
$$ 341189 528684 -35103 -24210 270844 -130922 16776 333969 354923 614264 59133
16133B85393D8089e7318I7777k344J35076J71415j64529J27942A08195J19709
$$ 285393 48089 -57318 97777 95433 230509 401924 237395 365337 108195 227904
16123B27904J8852J6968N0665J36415A96361q954q8913h7778A25736m4153Q4113
$$ 227904 246756 263724 314389 450804 196361 187407 98494 -87778 125736 81583 165696
16112A65696J17798K62416B017L54543j72817l2136K64977F8325a5033A83635
$$ 165696 283494 545910 2017 356560 183743 151607 416584 68325 -15033 183635
16101e5803B80594f0931E50679B37874P369j9934Q5010j42035M07315j74214l0008
$$ -55803 280594 -60931 550679 237874 245243 225309 310319 168284 575599 401385 371377
16090C71377I4793J2012L9754L27678A08459K17919h7887A99042d3191B29485
$$ 371377 94793 106805 146559 474237 108459 326378 -87887 199042 -43191 229485
16079I8447C6655L06382r5896A03762C7026J72149P5891L1869M0516q574p9519
$$ 98447 36655 343037 247141 103762 37026 209175 285066 316935 357451 348877 269358
16068B69358H9063h4350E58729A02922K93500j77396Q6966f6406A34754K23583
$$ 269358 89063 -84350 558729 102922 396422 219026 305992 -66406 134754 358337
16058C58337j77440c9469I1567K75965K3407j7413A85378J87752a40714A20022
$$ 358337 180897 -39469 91567 367532 390939 373526 185378 373130 -140714 120022
16047B09397K0632G5163K11168F1853a5929C29079m326P981B5240M48464j14467
$$ 209397 230029 75163 286331 61853 -15929 329079 324753 332734 25240 473704 359237
16036C59237A54941f141k0342k7558A48756G0792Q9371E8707J77477p0053o9690
$$ 359237 154941 -6141 -26483 -54041 148756 70792 160163 58707 236184 166131 96441
16025I6441J94452H2886L0554j4790J05732i6794j15204P6150A8347K45404K0443
$$ 96441 290893 82886 113440 98650 204382 -96794 -211998 -135848 18347 263751 284194
16014B84194H3775m0109a4411B59126I3023J84726h5944F4630b86877H7159i580
$$ 284194 83775 43666 -14411 259126 93023 277749 -85944 64630 -286877 87159 -9580
16002B42105e9193C53804m6616a955B14h9029D0543J8033j0995K60670J7306K13583
$$ 242105 -59193 353804 307188 -1955 214 -89029 40543 58576 47581 308251 325557 539140
15990E39140I3122K84795L50651J31925Q7436L08571j94558l4815q1942k84848
$$ 539140 93122 377917 728568 860493 947929 1256500 1061942 1027127 945185 660337
15980F60337l12677p8949F2857b93550F0754K4155J09443P6363c9853A70443R9239
$$ 660337 347660 268711 62857 -293550 60754 84909 194352 270715 -39853 170443 269682
15969B69682B9954a74160A90493C9405L20109G3361a3584j5188l06415B05872
$$ 269682 29954 -174160 190493 39405 359514 73361 -13584 -28772 -335187 205872
15958A13894h4880E9939a80832D5686P2470a69913C31068E746i018A88239a13922
$$ 113894 -84880 59939 -180832 45686 118156 -169913 331068 5746 -9018 188239 -113922
15946A95888P3596I8682J5947K04989j08945D9701M04617h1978A08978R5663K68627
$$ 195888 269484 98682 114629 319618 210673 49701 454318 -81978 108978 204641 473268
15935D73268B5239L9848G797M9847q819P2478D0026J67603i1287K2471B26573
$$ 473268 25239 65087 7797 57644 48825 121303 40026 207629 -91287 -68816 226573
15923A64802B6938c1832l6982A38724M3602a79817b3741R996A25904J47821K8382
$$ 164802 26938 -31832 -68814 138724 182326 -179817 -23741 -13745 125904 273725 302107
15912C02107G1154e6572K7189A98685i3426K9071n3293d4846I604K6698a17804
$$ 302107 71154 -56572 -29383 198685 -93426 -64355 -117648 -44846 9604 36302 -117804
15900A50204c5321A55025k7361J6316B8450J49095a03571D2609K29491c95401
$$ 150204 -35321 155025 127664 143980 28450 177545 -103571 42609 272100 -395401
15889A64837O8194E8665K93058c14407M5471e9069C3152p86J32638F6819b01781
$$ 164837 233031 58665 351723 -314407 -268936 -59069 33152 32366 165004 66819 -201781
15877a27674K1865j3077B94178q6225k1788b02726A55261a7972j23201c8998j12993
$$ -127674 -105809 -118886 294178 207953 186165 -202726 155261 -17972 -141173 -38998 -151991
15866a51991e3762k20309d7528r1579A39267a48835f0916A33257a65275D2943
$$ -151991 -53762 -274071 -47528 -139107 139267 -148835 -60916 133257 -165275 42943
15855a3573l9796C4692K9063A2950a05562k1153G275c9342A46407b60190C9597
$$ -13573 -53369 34692 63755 12950 -105562 -126715 7275 -39342 146407 -260190 39597
15843B60990c01282J00294f6175A92041o6359g388B8670g989E0930h9087L5229
$$ 260990 -301282 -200988 -66175 192041 125682 -7388 28670 -7989 50930 -89087 -53858
15832e3858k7170A40639i4946d5171D12734H9186i2023r4577j8960i0550j15806
$$ -53858 -81028 140639 -94946 -45171 412734 89186 -92023 -186600 -205560 -90550 -206356
15821b06356C7313i5267B30100p5802c21133A21390b92273h6530r9947D4518b43184
$$ -206356 37313 -95267 230100 154298 -321133 121390 -292273 -86530 -186477 44518 -243184
15809b12550Q7741j57606A54178o4735O0492c324A3828a62011k3021A98200F9818
$$ -212550 -124809 -282415 154178 89443 149935 -3324 13828 -162011 -185032 198200 69818
15797B91008A31240R7914c08822I1518a35748B14959b75640B03353f0782E9969
$$ 291008 131240 229154 -308822 91518 -135748 214959 -275640 203353 -60782 59969
15786D6017K88557a39456C4749D234h3429d1216k18564A33821D0711b54905g6831
$$ 46017 334574 -139456 34749 4234 -83429 -41216 -259780 133821 40711 -254905 -76831
15774H6717B4849c10931g2847C97774i4423m6386I9472J11397h3703B6282j315
$$ 86717 24849 -310931 -72847 397774 -94423 -140809 99472 210869 -83703 26282 24967
15763B4967Q9741j3736a54700A63952a39304B76261j11681c03175A14838l737
$$ 24967 114708 100972 -154700 163952 -139304 276261 164580 -303175 114838 111101
15753A11101a83273A76789m3980e831G888K49087a91954F5364J74526p9204d7840
$$ 111101 -183273 176789 132809 -5831 7888 256975 -191954 65364 239890 160686 -47840
15741B20463r4721n2430a70477M9638A54969a58222A50095j5845o0352b90019
$$ 220463 125742 73312 -170477 -120839 154969 -158222 150095 134250 73898 -290019
15730a04468f480I9667i7982A8207f498k04969A19173j2307m5284J2611L8162
$$ -104468 -6480 99667 -97982 18207 -6498 -211467 119173 106866 61582 74193 112355
15719A12355m260f6664A39962b56716A62234b35191A34780E0149q237d9723k6454
$$ 112355 108095 -66664 139962 -256716 162234 -235191 134780 50149 41912 -49723 -76177
15708g6177c4715q5511E6471J28368G5671N4389B1757J19340K1431E8249h2859
$$ -76177 -34715 -120226 56471 184839 75671 130060 21757 141097 162528 58249 -82859
15696b39984n7719a14761k62826d0319l76284H2841B7956N293K27510f8794J1189
$$ -239984 -297703 -114761 -377587 -40319 -416603 82841 27956 33249 260759 -68794 -57605
15685e7605E4740c67836k5275d7212A27126a48038F4035N44266H9248j1557M99951
$$ -57605 54740 -367836 -393111 -47212 127126 -148038 64035 608301 89248 77691 577642
15674E77642A33222a2976A70339K20722A78827f0902H6132a34213F0740b00880
$$ 577642 133222 -12976 170339 391061 178827 -60902 86132 -134213 60740 -200880
15663d2580j09874p4658M2394c1346E857K5084b63439D1301b48348M9307B66421
$$ -42580 -152454 -227112 -184718 -31346 5857 30941 -263439 41301 -248348 -199041 266421
15651a20565A05348k7413O951h6469r5715j78500C78708a48983B5069K9368b10519
$$ -120565 105348 77935 84886 -86469 -182184 -360684 378708 -148983 25069 54437 -210519
15639c6493A5322J11346J7838N9669D7596Q409Q8236b51205I494J23495e0574
$$ -36493 15322 126668 144506 204175 47596 56005 144241 -251205 9494 132989 -50574
15627b8320f939E6984K6487a26100e6547D21083i7235B5518J92448a21885C2082
$$ -28320 -6939 56984 83471 -126100 -56547 421083 -97235 25518 217966 -121885 32082
15615A44965g8324A26710c52459G0599f9142A24587c4678m08601A29339m6641
$$ 144965 -78324 126710 -352459 70599 -69142 124587 -34678 -443279 129339 82698
15605H2698a36252r9677A42293n7317J15141c42921a61198d8862j86043R4070
$$ 82698 -136252 -235929 142293 84976 200117 -342921 -161198 -48862 -234905 -140835
15595a40835D0005b4285G3020L0517b1202j7274B68051j05074L5374a79835o0545
$$ -140835 40005 -24285 73020 103537 -21202 -38476 268051 162977 198351 -179835 -240380
15584b40380N6723a4573A27957D9503c7555n894j55363L3171l6687d8813q8193
$$ -240380 -183657 -14573 127957 49503 -37555 -43449 -198812 -165641 -202328 -48813 -137006
15573a37006b9964B29418c49783a73162L1246B38536f4210r119B1303M1967Q1618
$$ -137006 -29964 229418 -349783 -173162 -141916 238536 -64210 -73329 21303 63270 144888
15562A44888j4994f4897b1296D75397A01788D6716a28782H5325b30317A0822h6489
$$ 144888 129894 -64897 -21296 475397 101788 46716 -128782 85325 -230317 10822 -86489
15550b96912B23883j07704q268h1699A93129j1583a65066H2462j9528a27304F1169
$$ -296912 223883 116179 107911 -81699 193129 181546 -165066 82462 62934 -127304 61169
15538G6720e01529a89161B00382j2730B7066K6935c02921a285A49527A0707P6161
$$ 76720 -501529 -189161 200382 187652 27066 54001 -302921 -1285 149527 10707 86868
15527H6868h1285b8832j59840P0216B44382R4983A6577N1943i1871E0941f4500
$$ 86868 -81285 -28832 -188672 -118456 244382 339365 16577 68520 -91871 50941 -64500
15515G2384P8945J58718A10811M3241F591a16903A12191a16737a9608D0156b5279
$$ 72384 151329 310047 110811 154052 6591 -116903 112191 -116737 -19608 40156 -25279
15503C08054a6217H3323l5936e9209b6460F848J55495F6211b56290R1790C71103
$$ 308054 -16217 83323 47387 -59209 -26460 6848 162343 66211 -256290 -164500 371103
15491a04044B06043a00953A51852d5814A00767K2350a43713O861A44982J3120
$$ -104044 206043 -100953 151852 -45814 100767 123117 -143713 -136852 144982 158102
15481A58102a93357B03865P4912j36206M3114N2099M70216B47128J04987N5351
$$ 158102 -193357 203865 278777 142571 185685 237784 708000 247128 352115 407466
15471D07466j02505l5674c05537f4564j1903e672K258j10093d1118B95331K3890
$$ 407466 304961 269287 -305537 -64564 -76467 -5672 -3414 -113507 -41118 295331 319221
15460C19221I1878a14844A10614O7301f6044H5081J07760a5399A65398h5083B87577
$$ 319221 91878 -114844 110614 177915 -66044 85081 192841 -15399 165398 -85083 287577
15448F5568i847F9432K45237J02671J61094J89164o5002q933k74513j22582a52787
$$ 65568 -9847 69432 314669 417340 578434 767598 702596 693663 419150 296568 -152787
15436a97416d2366I0029m3942J6892J67407G3481d984B02201A0867R4409B2052
$$ -197416 -42366 90029 46087 62979 230386 73481 -4984 202201 10867 105276 22052
15424A11799e767A98375d8197B31756a49428H3837b63425b2505B87N2253g5822
$$ 111799 -5767 198375 -48197 231756 -149428 83837 -263425 -22505 287 52540 -75822
15412h2128a8552H3298J12538d1826A73645d7891q103p5612A61734e9221r8148
$$ -82128 -18552 83298 195836 -41826 173645 -47891 -55994 -131606 161734 -59221 -157369
15401a57369B9608a52564q2372F5138J0689A7860J62425a0283B40040l6403h5642
$$ -157369 29608 -152564 -234936 65138 75827 17860 180285 -10283 240040 203637 -85642
15389B64514q9186a13171o9325B3260a62303C01179b02528i3964C48360a80141
$$ 264514 175328 -113171 -182496 23260 -162303 301179 -202528 -93964 348360 -180141
15378A96729p7566c58791e2530B8634J30017K01012j18793k9388a89466C31131
$$ 196729 119163 -358791 -52530 28634 158651 359663 240870 211482 -189466 331131
15367B85114a23846k07730C0475J68447B6569a27273J8948C35061A46153J18306
$$ 285114 -123846 -331576 30475 198922 26569 -127273 -108325 335061 146153 264459
15357B64459J30675j92902j3761i5810C94236j55407M587P9927j19126m4442l4720
$$ 264459 395134 202232 188471 -95810 394236 238829 243416 323343 204217 159775 125055
15346A25055N84660i9409B66476a37876C56015l7735L9387J00246k08111e5649
$$ 125055 709715 -99409 266476 -137876 356015 318280 357667 457913 249802 -55649
15335H7426a95337A13128a72939C8787K71501r0449J51793A07241K88864I0197
$$ 87426 -195337 113128 -172939 38787 310288 219839 371632 107241 396105 90197
15324G9677a19955A66383J31900A45879o9722K28373r9157L171D0672h6586A72653
$$ 79677 -119955 166383 298283 145879 76157 304530 205373 208544 40672 -86586 172653
15312I9905J56230l2453J24104J12830e4481j34042a3950r1646A03179Q3563J68751
$$ 99905 256135 223682 347786 460616 -54481 -188523 -13950 -105596 103179 186742 355493
15301C55493d77549H2216f7837C0400b43603B49192j6939E7713b34852g8276B16759
$$ 355493 -477549 82216 -67837 30400 -243603 249192 232253 57713 -234852 -78276 216759
15289A72522a30891A30161g9608j25796D6502a16820M6678G6516l4501b71537
$$ 172522 -130891 130161 -79608 -205404 46502 -116820 -70142 76516 42015 -271537
15278A8705a36339B33970l9573b5834H5854b53029B11268r8706R4225a73726N6291
$$ 18705 -136339 233970 194397 -25834 85854 -253029 211268 112562 206787 -173726 -117435
15267a17435K5327d0327A61215j5671l5821E4856h5960p9500l1076b3798A74561
$$ -117435 -92108 -40327 161215 145544 109723 54856 -85960 -165460 -196536 -23798 174561
15255e6495a1392B38306A12115K280J64176c60381a30704K7351C1059e3026A28940
$$ -56495 -11392 238306 112115 114395 278571 -360381 -130704 -103353 31059 -53026 128940
15243B40046P84346L97513l06758K28223k7060A12159C0658L3772N2048e9416
$$ 240046 1024392 1421905 1115147 1343370 1316310 112159 30658 64430 116478 -59416
15232B6136G641K08022J09556h875r488j8179G5517e1677B72013l7059E2563O6083
$$ 26136 7641 215663 325219 -8875 -18363 -36542 75517 -51677 272013 234954 52563 118646
15220A18646a1008B39838H7967F011b16697A132K20728a03852j53665A08265l6570
$$ 118646 -11008 239838 87967 6011 -216697 1132 221860 -103852 -257517 108265 71695
15209G1695a52316C5308J52050n9345J2331L74199B4917R5539k5648H758P3080
$$ 71695 -152316 35308 187358 128013 140344 514543 24917 120456 94808 8758 81838
15198H1838a4900l0667C7736O2688J34986C0507K05571D283a37846A50466j708
$$ 81838 -14900 -45567 37736 100424 235410 30507 236078 4283 -137846 150466 148758
15187A48758g6193j79217d4272J0099q8446C23105H4852J11745a60992J3510K7764
$$ 148758 -76193 -255410 -44272 -34173 -122619 323105 84852 196597 -160992 -147482 -119718
15176a19718B38686F9265M1540h7233b0651D3339i3066C20005C6555J12314K4807
$$ -119718 238686 69265 110805 -87233 -20651 43339 -93066 320005 36555 148869 173676
15165A73676E403N9701h6919a6970o8542d2506A06925b34580B86853J421N9158
$$ 173676 5403 65104 -86919 -16970 -85512 -42506 106925 -234580 286853 288274 347432
15154C47432F3693g7705q6236C6680Q512J6502e2454A23782h8261A1448b02253
$$ 347432 63693 -77705 -163941 36680 45192 61694 -52454 123782 -88261 11448 -202253
15142A00754b1363A9858K01732C9260a83113h8083I84f2254l824G320a71974A23964
$$ 100754 -21363 19858 221590 39260 -183113 -88083 984 -62254 -66078 7320 -171974 123964
15129b4334B49017E7188J86696A8114M59163A48651J41035A38888K41668F9095
$$ -24334 249017 57188 243884 18114 477277 148651 289686 138888 380556 69095
15118C12290K74106K1416k01525g3683l200j57921K8153C9155e6192l8842A15390
$$ 312290 586396 607812 406287 -73683 -76883 -234804 -206651 39155 -56192 -95034 115390
15106B79232j26612P4907B5550R1189O3094P9154A21000J56999B1805J48422g1652
$$ 279232 152620 227527 25550 116739 179833 258987 121000 277999 21805 170227 -71652
15094b9946B16820n9793D8184K22478F6702J08225k248H3200L39904G1858g9535
$$ -29946 216820 157027 48184 270662 66702 174927 172679 83200 423104 71858 -79535
15082E9964k2246J15312D2739J35548p524a61393B46021c871l7090D8356A9949
$$ 59964 37718 153030 42739 178287 170763 -161393 246021 -3871 -40961 48356 19949
15070g7390B25482I6707a8021j13541C55078m7713j46568J13624m1118D4876c8402
$$ -77390 225482 96707 -18021 -131562 355078 307365 160797 274421 233303 44876 -38402
15058A81772P7681B9362J59923P1539B4736R1002J13747J10126n8702j01846O9321
$$ 181772 259453 29362 189285 260824 24736 115738 229485 339611 280909 179063 248384
15047B48384K58707j27882K02116B67871j05125l3740J92712q9147J1510L9732
$$ 248384 507091 379209 581325 267871 162746 129006 321718 232571 244081 283813
15037B83813J00806G1076N5150K45212o1197O1180A09941L98505k13250O75372
$$ 283813 384619 71076 126226 371438 310241 371421 109941 508446 295196 970568
15027I70568B75480J87188O1979j37154r7741K3343j2212A47670K89025A91523
$$ 970568 275480 462668 524647 387493 289752 313095 300883 147670 436695 191523
15016C79279m5793j53125J03361G6760K4917K79977K58423B15907q7347J63059
$$ 379279 333486 180361 283722 76760 101677 381654 640077 215907 128560 291619
15006B91619O4521o214a31652A64313m312J47663I9096N13573K4552k88281J85013
$$ 291619 356140 349926 -131652 164313 160001 307664 99096 612669 637221 348940 533953
14995E33953B61015M4865L8776A33186K19826m3572q90n720o8294L61011j67172
$$ 533953 261015 305880 344656 133186 353012 309440 308550 302830 234536 595547 428375
14984D28375j72058K74312M005P1334J39999Q4628k81056N1838K11101A92982
$$ 428375 256317 530629 534634 605968 745967 830595 549539 601377 812478 192982
14973C53520A63135Q4710Q3099J40012J66670k17991l0004j24884K46864G857
$$ 353520 163135 247845 330944 470956 637626 419635 389631 264747 511611 7857
14962A39852L11147J1168j34048a91551C72869p6301k0399k9423M9868Q6433E379
$$ 139852 450999 462167 328119 -191551 372869 296568 276169 246746 296614 383047 5379
14950B99331J92087j43738A17143J38485L10611j01805K81261C65246J34590q5868
$$ 299331 491418 347680 117143 255628 566239 464434 745695 365246 499836 413968
14940D13968D887O65735A33319J49469J27520A73130N17047k27133J92738J35583
$$ 413968 4887 670622 133319 282788 410308 173130 690177 463044 655782 791365
14930G91365P9938K60328L1795j50113P6758K83326N7819O9073j14759m30856
$$ 791365 871303 1131631 1163426 1013313 1090071 1373397 1431216 1500289 1385530 954674
14920I54674M96667J69477J8019L17696m05457o5922F97627N16441E84324Q2231
$$ 954674 1451341 1620818 1638837 1956533 1551076 1485154 697627 1214068 584324 666555
14910F66555j38558j31339j46712m485M48489B01027J16207j13675o973B6243
$$ 666555 527997 396658 249946 245461 693950 201027 317234 203559 196586 26243
14899C27033I6062J86594n7594J28321o3047R5280L67754C68464L61537k68011
$$ 327033 96062 282656 225062 353383 290336 385616 753370 368464 730001 461990
14889D61990j07657J6352K36897O1467K4690j40j62647K33592J40817J8444C79660
$$ 461990 354333 370685 607582 669049 693739 693599 530952 764544 905361 923805 379660
14877C07714K35483A95629K55194j71830L53741k54433J48173B58889N42985j86397
$$ 307714 543197 195629 450823 278993 632734 378301 526474 258889 801874 615477
14867F15477k34661J72420k684J54250q5899q8445n9641H6103M50012A76827J52029
$$ 615477 380816 553236 550552 704802 618903 530458 470817 86103 536115 176827 328856
14856C28856j42985L14492j93505o5193J28691J91360A51900O54598C80895J45169
$$ 328856 185871 500363 306858 241665 370356 561716 151900 806498 380895 526064
14846E26064M15775k96360K60665j7687k70255M26477j49446j47160L5938N1687
$$ 526064 941839 645479 906144 888457 618202 1044679 895233 748073 784011 835698
14836H35698k82837B40502K95551k09658K00774Q7040k2165k13686J25722P0301
$$ 835698 552861 240502 536053 326395 527169 614209 592044 378358 504080 574381
14826E74381B55148m1529J75736O234j13252M68225k45701K60909j32140o9142
$$ 574381 255148 213619 389355 395589 282337 750562 504861 765770 633630 564488
14816E64488P4203k71690J7479Q3409j48765R9343J78670j46371J54157k73109
$$ 564488 638691 367001 384480 467889 319124 418467 597137 450766 604923 331814
14806C31814K67437R8380j04993m0964B58200L43238J07445j91534A63046J69793
$$ 331814 599251 697631 592638 551674 258200 601438 708883 517349 163046 332839
14796C32839J21792j73267N4781K36893O845j42229o3166J33006q4756K0470j01059
$$ 332839 454631 281364 336145 573038 579883 437654 374488 507494 422738 443208 342149
14785C42149J52125l2229l1380P2670J38840j08533k35512L90035R6618j23688
$$ 342149 494274 462045 430665 503335 642175 533642 298130 688165 784783 661095
14775F61095j41762P6252m0082K08960q2306k5503A38120J11960K36136Q2330
$$ 661095 519333 595585 555503 764463 682157 656654 138120 250080 486216 568546
14765E68546R873P4846J1185j91614J18047J29195k36873J14596K0943B17583
$$ 568546 578419 653265 664450 472836 590883 720078 483205 597801 618744 217583
14754F68836k86869N7453o8918N1742M48821k79146p8160L05374j64676B97830
$$ 668836 381967 439420 370502 422244 871065 591919 513759 819133 654457 297830
14743E19553R7696j13728j53580k261m562J34510J39071k7679J08777j16578J13323
$$ 519553 617249 503521 349941 347680 343118 477628 616699 589020 697797 581219 694542
14732F94542j13914J82789J20487J67253j43730L56443L07459m32017J24727j47717
$$ 694542 580628 763417 883904 1051157 907427 1263870 1571329 1139312 1264039 1116322
14722A116322j9335J2284j99888k82610K87137j99739M975q2365K5258r4867j3958
$$ 1116322 1096987 1109271 909383 626773 913910 714171 719146 636781 662039 567172 553214
14711E53214L85161l26068l9155K94764j09698n1383o745K97867M04815j73857
$$ 553214 938375 612307 573152 867916 758218 706835 700090 997957 1402772 1228915
14701A228915K92390Q1687k16754k98768o2936j626k36317k01360J81744j41872
$$ 1228915 1521305 1602992 1386238 1087470 1024534 1022908 786591 585231 766975 625103
14691F25103J29639L5878l41566M60828l10272K87883q6410l89216J11143K00872
$$ 625103 754742 790620 449054 909882 599610 887493 801083 411867 523010 723882
14681G23882j37822R8530J66526j53603r5541Q139B72337N89066l22935P0297
$$ 723882 586060 684590 851116 697513 601972 610111 272337 861403 538468 608765
14671F08765j2803L43695m34175K19707Q2427j35855J70762M7592j71266k79697
$$ 608765 595962 939657 505482 725189 807616 671761 842523 890115 718849 439152
14661D39152K74651M3341l3906p3427k8694J56113J34603p2549p7295K22910L11575
$$ 439152 713803 757144 723238 649811 621117 777230 911833 839284 761989 984899 1296474
14650A296474m02617O0684k78123r28K14060k72085L56967l2348m9170p3611k19002
$$ 1296474 893857 954541 676418 675490 889550 617465 974432 942084 892914 819303 600301
14639F00301M53807l680k95921J92837k5917P3395L136k80350K27876j22144N15477
$$ 600301 1054108 1050428 754507 947344 921427 994822 997958 717608 945484 823340 1338817
14628A338817l27455k13056P1279J18121j3030j51566K41627j3720j42L25433
$$ 1338817 1011362 798306 869585 987706 974676 823110 1064737 1051017 1050875 1376308
14618A376308l69359k03685J78623o7370N0420Q1297J426o724k05912K66159k2991
$$ 1376308 1006949 803264 981887 914517 964937 1046234 1047660 1040936 835024 1101183 1078192
14607A078192K5421J0627K50049l66797J10469J25015j36958n7719Q6177J77645
$$ 1078192 1103613 1114240 1364289 997492 1107961 1232976 1096018 1038299 1124476 1302121
14597A302121R5799k03960P9754M7524J99605j25819l57699J93444J94501j08796
$$ 1302121 1397920 1193960 1273714 1321238 1520843 1395024 1037325 1230769 1425270 1316474
14587A316474j90793N35847q3232k42158q0495L9131J08176j03390j39548L8493
$$ 1316474 1125681 1661528 1578296 1336138 1255643 1294774 1402950 1299560 1160012 1198505
14577A198505M48372K6905o4426l8352p4703N4637J09029j42202P1974j85916
$$ 1198505 1646877 1673782 1609356 1571004 1496301 1550938 1659967 1517765 1589739 1403823
14567A403823J63241L32840m67032M83563j3075j85933j74271P2688N74925l4045
$$ 1403823 1567064 1899904 1432872 1916435 1903360 1717427 1543156 1615844 2190769 2156724
14557B156724n5955J45290K25322J28196R9189L21082N81024Q91330J455433L428388
$$ 2156724 2100769 2246059 2471381 2599577 2698766 3019848 3600872 4492202 5947635 9376023
14547I376023O100518J4462016Q890092j7816165F629947C169442p17936j92917
$$ 9376023 15476541 29938557 38828649 21012484 6629947 3169442 2451506 2258589
14539B258589J292674M43417j522252r01760L02277o03010L98603k31450j18675
$$ 2258589 3551263 3994680 2472428 1570668 1872945 1269935 1668538 1437088 1318413
14530A318413J82417J37821j46803K34078P7564k40682O57790m91350K26639q722
$$ 1318413 1500830 1638651 1491848 1725926 1803490 1562808 2220598 1729248 1955887 1947165
14520A947165j21177J36316j11621j77141J88358k6567Q6537J6986L86016l39197
$$ 1947165 1825988 1962304 1850683 1673542 1861900 1835333 1921870 1938856 2324872 1985675
14510A985675J97740k18264L4486p6657K82164L32306k05653l34653K07983K25980
$$ 1985675 2183415 1965151 1999637 1922980 2205144 2537450 2331797 1997144 2205127 2431107
14500B431107j78503J19061P2742r306k97154L85965m16513L55471l9339M1559
$$ 2431107 2252604 2371665 2444407 2435101 2137947 2523912 2107399 2462870 2423531 2465090
14490B465090J29481j88040K05391L41643l53309K50835j14756n7728N174K10460
$$ 2465090 2594571 2406531 2611922 2953565 2600256 2851091 2736335 2678607 2683781 2894241
14480B894241k08735J4418K12682r7978M49432k6491l634l51953K73212l53595
$$ 2894241 2685506 2699924 2912606 2814628 3264060 3237569 3233935 2881982 3155194 2801599
14470B801599O01871m20841K8768J17533J72121K43045l42478J69552K6236L66764
$$ 2801599 3403470 2982629 3011397 3128930 3301051 3544096 3201618 3371170 3397406 3764170
14460C764170l04966J01540L94184k42944j3707P6468J14820K59142l73319L75364
$$ 3764170 3459204 3560744 3954928 3711984 3698277 3774745 3889565 4148707 3775388 4150752
14450D150752L9583P3567j0422O5933j38555K07689j61638Q6505J03472M9336
$$ 4150752 4190335 4263902 4253480 4319413 4180858 4388547 4226909 4313414 4416886 4466222
14440D466222J24683j21890L68637K54420k95655J63570k89642L89764j87487
$$ 4466222 4590905 4469015 4837652 5092072 4796417 4959987 4670345 5060109 4872622
14431D872622K20482K82462j80520m313M3724J11304R5275N27106j01974L25653
$$ 4872622 5093104 5375566 5195046 5190733 5234457 5345761 5441036 5968142 5866168 6191821
14421F191821M05242l04620m3471j28122K1557L95860K84201m18115Q4960J57805
$$ 6191821 6597063 6292443 6248972 6120850 6142407 6538267 6822468 6404353 6489313 6647118
14411F647118k7462L80788J18692K35859Q3689j86816M11978L6729K17397k80064
$$ 6647118 6619656 7000444 7119136 7354995 7438684 7251868 7663846 7700575 7917972 7637908
14401G637908K12297o5794L07770l0338L44227J44949P1261K14084J0851K4277
$$ 7637908 7850205 7784411 8092181 8061843 8406070 8551019 8622280 8836364 8847215 8871492
14391H871492K12269r1999N70693L7014L37441N77887l46852L54866K68641J14554
$$ 8871492 9083761 8991762 9562455 9599469 9936910 10514797 10167945 10522811 10791452 10906006
14381A0906006j13599M25458L0890l8616M81889K62287L8611N00905J25309N68410
$$ 10906006 10792407 11217865 11248755 11210139 11692028 11954315 11992926 12493831 12619140 13187550
14371A3187550R0192K12208J55922M60352M41875N621L76837K33209K47739M33766
$$ 13187550 13277742 13489950 13645872 14106224 14548099 14553720 14930557 15163766 15411505 15845271
14361A5845271P1960O85126J66218M22746K09901Q10891J49446L84824M06234
$$ 15845271 15917231 16602357 16768575 17191321 17401222 18212113 18361559 18746383 19152617
14352A9152617O39900K51874P09590K99819Q58594N20588M45557O23652O34083
$$ 19152617 19792517 20044391 20753981 21053800 21912394 22432982 22878539 23502191 24136274
14343B4136274N82394O37864O01573J049851N10423J250466P90446O64895Q51856
$$ 24136274 24718668 25356532 25958105 27007956 27518379 28768845 29559291 30224186 31076042
14334C1076042P98982J059034J247073J063140R87276R96013J295709J374125
$$ 31076042 31875024 32934058 34181131 35244271 36231547 37227560 38523269 39897394
14326C9897394J173214J657339J464183J292308J324939J754462J678817K075032
$$ 39897394 41070608 42727947 44192130 45484438 46809377 48563839 50242656 52317688
14318E2317688J883536J798233K139985K484804K570558K560925K780744K845321
$$ 52317688 54201224 55999457 58139442 60624246 63194804 65755729 68536473 71381794
14310G1381794L198662K928594L848290L672304L788600M453818M598671M503951
$$ 71381794 74580456 77509050 81357340 85029644 88818244 93272062 97870733 102374684
14302A02374684N042836N713153N664188O375205O415074O883401P944375P987292
$$ 102374684 107417520 113130673 118794861 125170066 131585140 138468541 146412916 154400208
14294A54400208Q885954R321496R561125J1071904J0800093J2045929J2508664
$$ 154400208 163286162 172607658 182168783 193240687 204040780 216086709 228595373
14287B28595373J3042682J3954504J4627303J4736422J5596280J6188874J6045714
$$ 228595373 241638055 255592559 270219862 284956284 300552564 316741438 332787152
14280C32787152J6048246J6050510J6221544J4746286J4237771J2529743J0301056
$$ 332787152 348835398 364885908 381107452 395853738 410091509 422621252 432922308
14273D32922308N607069j24586n9136Q33473j917397p63877m150787q937321j1890365
$$ 432922308 438529377 438404791 438345655 439179128 437261731 436497854 432347067 423409746 411519381
14264D11519381j3589770j5038916j5747974j7182239j7056220j6973050j6656455
$$ 411519381 397929611 382890695 367142721 349960482 332904262 315931212 299274757
14257B99274757j6065866j5939570j4864185j4079006j3392862j2633449j1775379
$$ 299274757 283208891 267269321 252405136 238326130 224933268 212299819 200524440
14250B00524440j1258479r279634r623955r177700q968068p711310p433300p058708
$$ 200524440 189265961 179986327 170362372 161184672 152216604 144505294 137071994 130013286
14242A30013286o338390o048428n958291n519392m643152m544378m528870m065820
$$ 130013286 123674896 117626468 111668177 106148785 101505633 96961255 92432385 88366565
14234H8366565m147380l804995l240396k781792l249339l075884k981085k489607
$$ 88366565 84219185 80414190 77173794 74392002 71142663 68066779 65085694 62596087
14226F2596087k505113k201297j957984k548701j894103j278027k180157j573511
$$ 62596087 60090974 57889677 55931693 53382992 51488889 50210862 48030705 46457194
14218D6457194j825187j459769j453082j315692j338801p38992j616184j038014
$$ 46457194 44632007 43172238 41719156 40403464 39064663 38325671 36709487 35671473
14210C5671473j257293q33855p59072j080557p63720q85445j068707o00376r64032
$$ 35671473 34414180 33580325 32821253 31740696 30976976 30091531 29022824 28422448 27458416
14201B7458416o26804m84731o98443j293713o44757m58815p70805k16380n55572
$$ 27458416 26831612 26346881 25648438 24354725 23709968 23251153 22480348 22263968 21708396
14192B1708396o87033l46340p17800k77468o47362k63262q13929k95664l00264
$$ 21708396 21021363 20675023 19957223 19679755 19032393 18769131 17955202 17659538 17359274
14183A7359274j29381o10612j24067q05958l04782j81531j00019k89665o28969
$$ 17359274 17229893 16619281 16495214 15689256 15384474 15202943 15102924 14813259 14184290
14174A4184290j86259n4952q20389K10571n54670p6339k17102j83118j68297m49784
$$ 14184290 13998031 13943079 13122690 13333261 12778591 12702252 12485150 12302032 12133735 11683951
14164A1683951M8262k98700m59770M17179m44387o30516J43271k8813l65986j66390
$$ 11683951 11732213 11433513 10973743 11390922 10946535 10316019 10459290 10430477 10064491 9898101
14154I898101k98541m9072j60080L1609n82760r8674M0941l02035j047k20420
$$ 9898101 9599560 9550488 9390408 9422017 8839257 8740583 8781524 8479489 8478442 8258022
14144H258022M80164n62918k77997J32205j67280l97066J13161q8266j48667L4894
$$ 8258022 8738186 8175268 7897271 8029476 7862196 7465130 7578291 7490025 7341358 7376252
14134G376252n12934J76010j57805j75238m10463K11721J37600r9496k35506q3720
$$ 7376252 6863318 7039328 6881523 6706285 6295822 6507543 6645143 6545647 6310141 6226421
14124F226421Q5798l94231k22771J47994J960k01174J53003m28279m284K52597
$$ 6226421 6312219 5917988 5695217 5843211 5845171 5643997 5797000 5368721 5364437 5617034
14114E617034l91494l3430O4802J64649m76035K3162j645k19394M37368m54030
$$ 5617034 5225540 5192110 5256912 5421561 4945526 4968688 4967043 4747649 5185017 4730987
14104D730987J06835l3133J996j24575k62022k67773O54251m13755k23200J40977
$$ 4730987 4837822 4804689 4806685 4682110 4420088 4152315 4806566 4392811 4169611 4310588
14094D310588O0123l70874K6487j07019K78696j94715j5352O8340k61972r4876
$$ 4310588 4370711 3999837 4026324 3919305 4198001 4003286 3987934 4056274 3794302 3699426
14084C699426j72994J66265k55349J13532K22835L409j75121Q3617m03187J6794
$$ 3699426 3526432 3692697 3437348 3550880 3773715 3777124 3602003 3685620 3282433 3299227
14074C299227j08917r3668J20928l4251L5276K4505k58680K62489j70629K77776
$$ 3299227 3190310 3096642 3217570 3183319 3218595 3243100 2984420 3246909 3076280 3354056
14064C354056l91919K02607N4565m38316N98286P9437l71959l11829L56485p2046
$$ 3354056 2962137 3164744 3219309 2780993 3379279 3458716 3086757 2774928 3131413 3059367
14054C059367j09548q8935k35088O8461K73436m79587j66550K40636o9529K956
$$ 3059367 2949819 2860884 2625796 2694257 2967693 2488106 2321556 2562192 2492663 2495619
14044B495619q8514j45171M6453K64811p1696m2316k06361p0695J78817K77431
$$ 2495619 2407105 2261934 2308387 2573198 2501502 2459186 2252825 2182130 2360947 2638378
14034B638378l79139k8431j03250K80089l1767j96084L4325J4780j27046J48426
$$ 2638378 2259239 2230808 2127558 2407647 2375880 2179796 2214121 2228901 2101855 2250281
14024B250281k45169L25104l52833O273K87277n16092L87705j57414j65654k23861
$$ 2250281 2005112 2330216 1977383 1983656 2270933 1754841 2142546 1985132 1819478 1595617
14014A595617J67871n7060L90313m50572L98153l43471J14309l11329M40111l00053
$$ 1595617 1763488 1706428 2096741 1646169 2044322 1700851 1815160 1503831 1943942 1643889
14004A643889J00133L8779j68378O2476j29813L0388J35944j80269J48118m57634
$$ 1643889 1744022 1782801 1614423 1676899 1547086 1577474 1713418 1533149 1681267 1223633
13994A223633M90386m3732j67294J81303M08920P77524K321600M704143J1237366
$$ 1223633 1714019 1670287 1502993 1684296 2093216 2870740 5192340 9896483 21133849
13985B1133849J7881707r432887A2487340n906446k141435n72188j014636j97623
$$ 21133849 39015556 29582669 12487340 6580894 4439459 3867271 2852635 2655012
13977B655012k77429l0608R6976l37129L0166k09251K06923j70007k14984K41540
$$ 2655012 2377583 2346975 2443951 2106822 2136988 1927737 2134660 1964653 1749669 1991209
13967A991209j05645l95344L65708j77972K40052m82067M10160l71833J16464
$$ 1991209 1885564 1490220 1855928 1677956 1918008 1435941 1846101 1474268 1590732
13958A590732j30972L47246n32236O4239q2568L31362l86367L68525k02168j15781
$$ 1590732 1459760 1807006 1274770 1339009 1256441 1587803 1201436 1569961 1367793 1252012
13948A252012j5383K6006m353p1963Q2526L09750K7962k01295j27884K99434k65381
$$ 1252012 1236629 1262635 1258282 1186319 1268845 1578595 1606557 1405262 1277378 1576812 1311431
13937A311431J21475l81513J6979K0606j62645J32412O21582n90625r6956K02758
$$ 1311431 1432906 1051393 1068372 1088978 926333 1058745 1680327 1089702 992746 1195504
13927A195504m5035j94059N187L5013M33599l58257J89713j48742j91813J96719
$$ 1195504 1150469 956410 961597 996610 1430209 1071952 1261665 1112923 921110 1117829
13917A117829P0984p0168P617k34007k2715R0661J82932q2794j79901J52338Q802
$$ 1117829 1188813 1118645 1126262 892255 869540 960201 1143133 1060339 880438 1032776 1041578
13906A041578J69851k30715l60K2255k74950M63973j71457P668l14254L9898M89036
$$ 1041578 1211429 980714 980354 1002609 727659 1191632 1020175 1027843 713589 753487 1242523
13895A242523k33580j5035j0203p330j69015K66528r6877k18692K82334D44791
$$ 1242523 1008943 993908 983705 976375 807360 1073888 977011 758319 1040653 444791
13884I90431l48165J09281J50046L1217J06759m23703N95082m06368k17525J10368
$$ 990431 642266 751547 901593 932810 1039569 615866 1210948 804580 587055 697423
13874F97423j69556M36234j53187j72213J33590k2977J79061j19671q2228J41820
$$ 697423 527867 964101 810914 638701 772291 749314 928375 808704 726476 868296
13864H68296l32033N04035j67453k12331K53940l36918K72130C39599O02104n7949
$$ 868296 536263 1040298 872845 660514 914454 577536 849666 339599 941703 883754
13854H83754k38605J81715j22762J98136r1694j17802J41016p0070J08139J42419
$$ 883754 645149 826864 704102 902238 810544 692742 833758 763688 871827 1014246
13844A014246m30082K03278J65115D13663J77940L20522m17381J49681J8335j54013
$$ 1014246 584164 787442 952557 413663 591603 912125 494744 644425 662760 508747
13834E08747Q9432k6980J90864j46930K06274n6327n9889p322J456j33906J69855
$$ 508747 598179 571199 762063 615133 821407 765080 705191 697869 699325 565419 735274
13823G35274k30836n78K10583K4928r3478J27296k88032K16870N1770R8015k55046
$$ 735274 504438 503860 714443 739371 645893 773189 485157 702027 753797 851812 596766
13812E96766M1317j26181J40512k29016L34895j92853J40861k50511K33275k81536
$$ 596766 638083 511902 652414 423398 758293 565440 706301 455790 689065 407529
13802D07529J69852P1751J91990C36174L26437j49466K56802J700l25859P0018
$$ 407529 577381 649132 841122 336174 662611 513145 769947 771647 445788 515806
13792E15806O1274j79319L72611J95950j89024j83724m4029M6336j71572K78335
$$ 515806 577080 397761 770372 966322 777298 593574 549545 595881 424309 702644
13782G02644k71859K15135j65615m257L9492R5898B53697m4839L25992N714L86064
$$ 702644 430785 645920 480305 476048 515540 611438 253697 208858 534850 540564 926628
13771I26628m41263j65469J45025N7518B45905k3426L8998K46656j54858m6446
$$ 926628 485365 319896 464921 522439 245905 222479 261477 508133 353275 306829
13761C06829J02439K76265k32954j43496N20008B21532J55175J74937l6668n1224
$$ 306829 409268 685533 452579 309083 829091 221532 376707 551644 514976 463752
13751D63752r1806j4680k0768J40761J38772B94624j40409J90151M02558J70422
$$ 463752 371946 357266 336498 477259 616031 294624 154215 344366 746924 917346
13741I17346C88944k9559r8285J32083K89772k83247A94094J06082J45624r1667
$$ 917346 388944 359385 261100 393183 682955 399708 194094 300176 445800 354133
13731C54133J79675J0216j67864r5086J85355A42394L1624J84830A38459K82240
$$ 354133 533808 544024 376160 281074 466429 142394 174018 358848 138459 420699
13721D20699Q77P6017l9455B28452K2492J12294L15473k03109k5332p4783m6845
$$ 420699 421576 497593 458138 228452 250944 363238 678711 475602 450270 375487 328642
13710C28642J1434K79153l8173k38950j22452K46062A46312K46132M8590r6879
$$ 328642 340076 619229 581056 342106 219654 465716 146312 392444 441034 344155
13700C44155K22903k31428k364F5630L11462K8620N8322r0250j51386m8130J89125
$$ 344155 567058 335630 333266 65630 377092 405712 464034 373784 222398 174268 363393
13689C63393a0423F00291k55969j25561R9885A51386J55331l7234A31903K70163
$$ 363393 -10423 600291 344322 218761 318646 151386 306717 269483 131903 402066
13679D02066J84998A85982O9096K41075O6467k60570k6536n897J62560o5043j7233
$$ 402066 587064 185982 255078 496153 562620 302050 275514 269617 432177 367134 349901
13668C49901C639M53560r1821E3259K14137p7993q7646L00456j39987b1265A27829
$$ 349901 3639 457199 365378 53259 267396 189403 101757 402213 262226 -21265 127829
13656C30031B8241L5353N4964K033N29147C00227q7708J32902k3079j19389J82681
$$ 330031 28241 63594 118558 120591 649738 300227 212519 345421 322342 202953 385634
13645C85634j28959e1956D74249r7136j44992d2485A88899J21902J03594p4483
$$ 385634 256675 -51956 474249 377113 232121 -42485 188899 310801 414395 339912
13635C39912j43571R4773n7189m8287M61165k18550j35491o3707p2256L65390
$$ 339912 196341 291114 233925 185638 646803 428253 292762 229055 156799 522189
13625E22189k51365J50428C6970M05510p9166P4817j8533j60832P1481l6949H5880
$$ 522189 270824 421252 36970 442480 363314 438131 419598 258766 330247 293298 85880
13613B13006L365J43252A63530m7417M50937r0053A19982J21447L6305r1332O264
$$ 213006 216371 359623 163530 116113 567050 476997 119982 241429 277734 186402 192666
13602A92666o5482J8548J78762A53792L573P0237n6675B0344K41493H9016P3109
$$ 192666 127184 145732 324494 153792 157365 227602 170927 20344 261837 89016 162125
13591A62125L13518k8225j46449b1760j13074A81684o4541D1179L12101J7465
$$ 162125 475643 447418 300969 -21760 -134834 181684 117143 41179 353280 370745
13581C70745A2363L33967H0163M6139J29817L0658A25483J56304O6473A49773
$$ 370745 12363 346330 80163 126302 256119 286777 125483 281787 348260 149773
13570b6750D1343K76394a16496C93584n9966q1777n3666K9978a8346h82A95471
$$ -26750 41343 317737 -116496 393584 333618 251841 198175 228153 -18346 -882 195471
13558C04337j50049O0300O3649l9789f7976C56821p0619q622C912J69728o5201
$$ 304337 154288 214588 278237 238448 -67976 356821 286202 277580 3912 173640 108439
13547A08439a31415C47318P3513K1669j39795j3263E0281K69545g561A0152C90
$$ 108439 -131415 347318 420831 442500 302705 289442 50281 319826 -7561 10152 390
13535A84190a7870A51503M024Q0637J13377j74530Q1432J13604j53358b5259A88823
$$ 184190 -17870 151503 155527 236164 349541 175011 256443 370047 216689 -25259 188823
13523C09554d7478C42109c7375C31102G4464a02800B03989l0500K525J40112o7810
$$ 309554 -47478 342109 -37375 331102 74464 -102800 203989 173489 176014 316126 248316
13512B48316j10899J96150A25800J97410J72770A31023o3258b36685A46529L52801
$$ 248316 137417 333567 125800 323210 495980 131023 67765 -236685 146529 499330
13502D99330k01648I5514J44014A6684a36908D18742A88000H4089J54373A09939
$$ 499330 297682 95514 239528 16684 -136908 418742 188000 84089 238462 109939
13491B75665g8801B33906E0825M37067B24761j1995J03799J1351j06280f8238
$$ 275665 -78801 233906 50825 487892 224761 212766 316565 327916 221636 -68238
13480C68997D5107J94008c4946C03536a34395B20831l5322E09L44923A69695J96372
$$ 368997 45107 239115 -34946 303536 -134395 220831 185509 509 345432 169695 366067
13469C66067n4271F9440A7797c8820A88288F6798K33607l1938l1826A01161J22886
$$ 366067 311796 69440 17797 -38820 188288 66798 300405 268467 236641 101161 224047
13458B24047J71449A1673J91788a28706D38877j71509F3316J49347B3009J8976
$$ 224047 395496 11673 203461 -128706 438877 267368 63316 212663 23009 41985
13448D1985K58968K35721A18305M57149a2427B04150P1472f8643B13831I5426
$$ 41985 300953 536674 118305 575454 -12427 204150 275622 -68643 213831 95426
13437C22641o6465a7048M47k61540C62576b26259C88781p8578I0563j0448l7670
$$ 322641 256176 -17048 -16601 -278141 362576 -226259 388781 310203 90563 80115 42445
13426D2445A3035M5195K7105J10176M0071c3410B71006f5548B46577n2117c32450
$$ 42445 13035 58230 85335 195511 235582 -33410 271006 -65548 246577 194460 -332450
13414G4660N8484J35257M24369B28844J47920j50856K33999i5538J8795c7966
$$ 74660 133144 268401 692770 228844 376764 225908 459907 -95538 -76743 -37966
13403b22216C98240I2021g6713C4260O43761b08796o5600b5850D10336A40152
$$ -222216 398240 92021 -76713 34260 678021 -208796 -274396 -25850 410336 140152
13392B02085b72D4100J52735i4946A38032k2495N2676B3976J28693d2449A22604
$$ 202085 -272 44100 196835 -94946 138032 115537 168213 23976 152669 -42449 122604
13380b7872G7191J59364k4006l6399E3128d518m7543B33170H4611B2558R2856
$$ -27872 77191 236555 212549 176150 53128 -4518 -52061 233170 84611 22558 115414
13369A15414m6562A7976R4246C7761L20152j34016j744Q7085G3465K57498K5729
$$ 115414 68852 17976 112222 37761 357913 223897 222153 309238 73465 330963 356692
13358C56692G0059a2662A92522D0966c64746f6808C90576j33202J47022A99645
$$ 356692 70059 -12662 192522 40966 -364746 -66808 390576 257374 404396 199645
13347a83796A00363j8448L1805c15C44822b6837A92771q5790l9581P0399J00512
$$ -183796 100363 81915 113720 -315 344822 -26837 192771 106981 67400 137799 238311
13336B38311D751L68708p1089n2427M1527I0951J25952J17338J94j02739A08103
$$ 238311 4751 373459 302370 249943 291470 90951 216903 334241 334435 231696 108103
13324B31405H7056b8037q7648L7826I2363f7003A83690B353K58818R5606k1191
$$ 231405 87056 -28037 -115685 -77859 92363 -67003 183690 2353 261171 356777 335586
13313C35586A31103a44038f6165A30088C1610j3137J92890R4254e4565C00725
$$ 335586 131103 -144038 -66165 130088 31610 18473 211363 305617 -54565 300725
13302g6749B89035I3584J22841F5640k4468f694A16272i9928A51713R9456q6596
$$ -76749 289035 93584 216425 65640 41172 -6694 116272 -99928 151713 251169 164573
13291A64573Q4235A0056J73728j6017J79707A39232b0526E0409L9391C1510n609
$$ 164573 248808 10056 183784 167767 347474 139232 -20526 50409 89800 31510 25901
13280B5901N5206a60249A99425e2808A81100j747B9427L14967A11948m599k0826
$$ 25901 81107 -160249 199425 -52808 181100 179353 29427 344394 111948 107349 86523
13269H6523q618j1429c01451h8573D752J52132b49954D38590A12998c09256C68041
$$ 86523 77905 66476 -301451 -88573 4752 156884 -249954 438590 112998 -309256 368041
13257c09398I2550A0440a60580f9283j49131A33315l4076N2531a41612A19825
$$ -309398 92550 10440 -160580 -69283 -218414 133315 99239 151770 -141612 119825
13246D35682I7280f3288A75871n4851g0156j9902b0537C3459a28020J2934I5518
$$ 435682 97280 -63288 175871 121020 -70156 -90058 -20537 33459 -128020 -115086 95518
13234B20182b3852j3953B10447M5581a29371B63446A15763f0522C6165R0753m2065
$$ 220182 -23852 -37805 210447 256028 -129371 263446 115763 -60522 36165 126918 84853
13223H4853M1548e9609m6023L5130H6800B0041J14296i9371F7439R9972i1459
$$ 84853 126401 -59609 -105632 -70502 86800 20041 134337 -99371 67439 167411 -91459
13211d2702k96817G2686d5752D0002K47451I6262K50923A9361L6580O9905j8862
$$ -42702 -339519 72686 -45752 40002 287453 96262 347185 19361 55941 125846 106984
13200A06984a69543F4627j6439a20852b9771D60632j58775H8356a93969A31320
$$ 106984 -169543 64627 48188 -120852 -29771 460632 301857 88356 -193969 131320
13189I8251L9072l6763k9691j3788M8300D7550K91597j51850P1629r1844a17771
$$ 98251 137323 100560 70869 57081 105381 47550 339147 187297 258926 167082 -117771
13177B55188b30309B66125d0108J1558C1813e2345B17065g9477B18693I9191a09836
$$ 255188 -230309 266125 -40108 -28550 31813 -52345 217065 -79477 218693 99191 -109836
13165a14506d9126C82340j44054q7146m4107a00071A79046J96370c8387C5876
$$ -114506 -49126 382340 238286 151140 107033 -100071 179046 375416 -38387 35876
13154B30600A03469J13178P3137b14571A03303k4353a32536K6253F5639c8511
$$ 230600 103469 216647 289784 -214571 103303 78950 -132536 -106283 65639 -38511
13143A28185b03919A94811E8581Q4143G0971B3514a8268k3079j01824k42395H9472
$$ 128185 -203919 194811 58581 142724 70971 23514 -18268 -41347 -143171 -385566 89472
13131a13657D24179A06959d6211F3231J58949q0163J0380f77j42204A13172J75129
$$ -113657 424179 106959 -46211 63231 222180 142017 152397 -677 -142881 113172 288301
13120B88301H9214f5317C793R106a8600A89920a57738B83545G7575H622K34988
$$ 288301 89214 -65317 3793 12899 -18600 189920 -157738 283545 77575 8622 243610
13109B43610d0422C01466a50920j2157C39711c7057A85098p6357K7088A5831R6787
$$ 243610 -40422 301466 -150920 -163077 339711 -37057 185098 108741 135829 15831 112618
13098A12618C549J97359a24869b7708A62427J10969a97215B9498R5967g1178j91742
$$ 112618 3549 200908 -124869 -27708 162427 273396 -197215 29498 125465 -71178 -262920
13087b62920c0663A93230k672H6743b36731C7852P7527a4398I9230g4039j7009
$$ -262920 -30663 193230 190558 86743 -236731 37852 115379 -14398 99230 -74039 -91048
13076i1048C6925J2441a41414A9324e4224b7020A9840d0566C27564C7991b7297
$$ -91048 36925 49366 -141414 19324 -54224 -27020 19840 -40566 327564 37991 -27297
13064b6661o3015C0761J8527a31662A72434l2861a78377B8409M9389J79579a78435
$$ -26661 -89676 30761 49288 -131662 172434 139573 -178377 28409 77798 257377 -178435
13052A52105E1897R5483K1590J2053H6172f0323C14360H8675a7000j84819B64142
$$ 152105 51897 147380 168970 181023 86172 -60323 314360 88675 -17000 -201819 264142
13040b51201C08926a9769r0811C12881G4861D843b05255C5853a28226B7946K19106
$$ -251201 308926 -19769 -110580 312881 74861 4843 -205255 35853 -128226 27946 247052
13029B47052m0911D8854N0731C2996a89165A30722a93939C7480d5096j4809C17460
$$ 247052 206141 48854 99585 32996 -189165 130722 -193939 37480 -45096 -59905 317460
13017c16230B74971a53117r5212A05619b01806g0491A86403g553j2403A48027
$$ -316230 274971 -153117 -248329 105619 -201806 -70491 186403 -7553 -19956 148027
13006g0382K7806A35903c69787A49358a53974A04542b54471c9859B57201F2761
$$ -70382 -42576 135903 -369787 149358 -153974 104542 -254471 -39859 257201 62761
12995F7126f5557C99756a0439D2065a62479K7438k72201a31086M8943n901A45998
$$ 67126 -65557 399756 -10439 42065 -162479 -135041 -407242 -131086 -82143 -88044 145998
12983H8463d7308b688j11862j71722R9568B20272c69632E1305c782F2967k2432
$$ 88463 -47308 -2688 -114550 -286272 -186704 220272 -369632 51305 -3782 62967 40535
12972D0535b14531J02911j98420E7710a01466A82026G9170d533D6511g230l57107
$$ 40535 -214531 -111620 -310040 57710 -101466 182026 79170 -4533 46511 -7230 -364337
12961c64337p856a22446Q184J2350A94453A6093b0234D2234A992M01431A50696
$$ -364337 -372193 -122446 -114262 -101912 194453 16093 -20234 42234 1992 403423 150696
12949A57454a21551k34666A34545f0811D2018d3830A05757B8587K9526b51955
$$ 157454 -121551 -356217 134545 -60811 42018 -43830 105757 28587 58113 -251955
12938b09462e2370A83931n9768a23018N4717D0372b02180A1507a00096D6587c52378
$$ -209462 -52370 183931 124163 -123018 -68301 40372 -202180 11507 -100096 46587 -352378
12926B4996c27949g382r7982E7380k0663K48381D0296f2469B5105Q256b5175B0077
$$ 24996 -327949 -7382 -105364 57380 36717 285098 40296 -62469 25105 33361 -25175 20077
12913I6560b22281J07882F4286b33083d7486A15517m9099a52886E8540C74g2380
$$ 96560 -222281 -114399 64286 -233083 -47486 115517 66418 -152886 58540 374 -72380
12901C39805F0089L80801c75544B5137f9773k30112k0741g8430D7418a1048k13838
$$ 339805 60089 440890 -375544 25137 -69773 -299885 -320626 -78430 47418 -11048 -224886
12890b24886L3285A8741K6963K94744d6157J9294A06173c28940g1772G9117c14006
$$ -224886 -191601 18741 45704 340448 -46157 -26863 106173 -328940 -71772 79117 -314006
12878C771Q5395j0065N4807a69146A78177a1647j01989A01022e2129p2598m6484
$$ 3771 89166 79101 133908 -169146 178177 -11647 -113636 101022 -52129 -124727 -171211
12867a71211h2884A38942j1256J98906b8697j06573E5086b2182l35940B41049
$$ -171211 -82884 138942 127686 326592 -28697 -135270 55086 -22182 -358122 241049
12856b39970A00220J84208b12417e5582B1941b17819f5303A4584O9310m1137b80610
$$ -239970 100220 284428 -212417 -55582 21941 -217819 -65303 14584 83894 42757 -280610
12844B07502A5163J15609b116p1330J8954B9992J79444A6541a28520J0195C4308
$$ 207502 15163 130772 -2116 -73446 -54492 29992 209436 16541 -128520 -118325 34308
12832a10744A39552b60679a23072G3012a68140B63238b38381Q7820c6848p443
$$ -110744 139552 -260679 -123072 73012 -168140 263238 -238381 -150561 -36848 -44291
12822d4291j48489b3021k17839c1556l2182G436J09753N9207q6873a86535C40930
$$ -44291 -192780 -23021 -240860 -31556 -63738 7436 117189 176396 89523 -186535 340930
12810d7951m8755F3187J32384n5429K24195A36137l8342a15630K3669r8569A01577
$$ -47951 -96706 63187 195571 140142 364337 136137 97795 -115630 -91961 -190530 101577
12798B54379K3544f5453b5471A41966i2938k1146p3478A61699L1851a85009j1155
$$ 254379 277923 -65453 -25471 141966 -92938 -114084 -187562 161699 193550 -185009 -196164
12787a96164f2412C15K07101I0933B2082M7712a39772A05533a87457F6741b0035
$$ -196164 -62412 315 207416 90933 22082 69794 -139772 105533 -187457 66741 -20035
12775C24212a06633m5394A1971P0816d74952A58683C4792b16715h7567B904a51212
$$ 324212 -106633 -152027 11971 82787 -474952 158683 34792 -216715 -87567 2904 -151212
12763B19586a06899A68751J00730d07151G5586K8996c4207J3739A28051c49722
$$ 219586 -106899 168751 269481 -407151 75586 104582 -34207 -20468 128051 -349722
12752i9398k1013M2999a5986r0975J0266E4839a32050A1090J97395a48616n4480
$$ -99398 -120411 -77412 -15986 -106961 -96695 54839 -132050 11090 208485 -148616 -203096
12741b03096B48296a46877H8634c22898a5838o5147G115N5532J16784e8551B10986
$$ -203096 248296 -146877 88634 -322898 -15838 -80985 7115 62647 179431 -58551 210986
12729c0939A61498c30326B06086r7383A7377b4122o662l5016J9348l08441a54117
$$ -30939 161498 -330326 206086 108703 17377 -24122 -30784 -65800 -46452 -354893 -154117
12717i2208B12835C3516R5408l3198J04127g3014A53352m7457J42821m1582K00564
$$ -92208 212835 33516 128924 95726 199853 -73014 153352 105895 248716 207134 407698
12706D07698A18433J8192E7677E798a56518k3982A80172q750P385p5953f2808
$$ 407698 118433 136625 57677 5798 -156518 -180500 180172 171422 178807 102854 -62808
12694g3270A62660L7158b47185H7195a79200N0417L0645B37528H2207i0451k64201
$$ -73270 162660 199818 -247185 87195 -179200 -128783 -98138 237528 82207 -90451 -354652
12683c54652B19125I5119J49253m0312b05896g6211G265c08219E3381P8046C9320
$$ -354652 219125 95119 244372 204060 -205896 -76211 7265 -308219 53381 131427 39320
12671E80842G9506e0895q8446A34192a9492l93164C36602a51019C9460g3689k26485
$$ 580842 79506 -50895 -139341 134192 -19492 -412656 336602 -151019 39460 -73689 -300174
12660c00174J44481N9597A54045F4034b2761k23253G7525i4788k11184A44708
$$ -300174 -155693 -96096 154045 64034 -22761 -246014 77525 -94788 -305972 144708
12649D9823L07938A45703b62155A75429g8527A3192K6471i8160J0006F5937f073
$$ 49823 357761 145703 -262155 175429 -78527 13192 39663 -98160 -88154 65937 -6073
12637H9253L7714N7932L7061J4857E118b61935p7012A61433F5409J95176E8389
$$ 89253 126967 184899 221960 236817 5118 -261935 -338947 161433 65409 260585 58389
12625h9339k3715A98128o8859o0266J68109a48673e1402B2720b81600D8626i9609
$$ -89339 -113054 198128 129269 69003 237112 -148673 -51402 22720 -281600 48626 -99609
12613E092J31144a22795o2162k51657H6314O2156C3392a2611A6796J15624b53811
$$ 5092 136236 -122795 -184957 -436614 86314 148470 33392 -12611 16796 132420 -253811
12601B36282L5271G8295a18476I9453k9147K0424b64634n2888b7193A80693m8083
$$ 236282 271553 78295 -118476 99453 70306 90730 -264634 -317522 -27193 180693 132610
12590A32610A9627K43419e7735A29335b00121m3644h2731D9692N865R1289a50981
$$ 132610 19627 263046 -57735 129335 -200121 -243765 -82731 49692 55557 146846 -150981
12578a34301A95194g6432B35566H9135J3466a50060l3384d4146A25137Q3407q6855
$$ -134301 195194 -76432 235566 89135 102601 -150060 -183444 -44146 125137 208544 121689
12567A21689a9080b355j73553B68837g6923C29657a94979G6485a97065B25140
$$ 121689 -19080 -2355 -175908 268837 -76923 329657 -194979 76485 -197065 225140
12556h4956K0649A52318M7404o732a06068k1916D3712f3274g013k48357q3556
$$ -84956 -64307 152318 199722 192990 -106068 -127984 43712 -63274 -7013 -255370 -338926
12545c38926A78681i6718e114j08717m1829E2111O1005h8177D9461b41204A50078
$$ -338926 178681 -96718 -5114 -113831 -155660 52111 113116 -88177 49461 -241204 150078
12533a82146H8157M8273C8719E286h7482A58066c0018j07532j33495a1050k6908
$$ -182146 88157 136430 38719 5286 -87482 158066 -30018 -137550 -271045 -11050 -37958
12522c7958B68165a51571B45019q4109A217b11975M602A17540j6083C3520c288
$$ -37958 268165 -151571 245019 160910 1217 -211975 -207373 117540 101457 33520 -3288
12510a50953G7138Q3943J00432a7444G7460J514l7436b42941E14310a31946B74820
$$ -150953 77138 161081 261513 -17444 77460 78974 41538 -242941 514310 -131946 274820
12498B27313l8463J23839i9790F3634L820f0389A70455a44053m5447A57148D8551
$$ 227313 188850 312689 -99790 63634 67454 -60389 170455 -144053 -189500 157148 48551
12486D92850a9311o1893E284Q7680g8208O293j7051q6349c915A87322a23795a310
$$ 492850 -19311 -81204 5284 92964 -78208 -71915 -88966 -175315 -3915 187322 -123795 -1310
12473b9445j82439F8620J48790r6203c20200o1643A4004N541J84983b06835O103
$$ -29445 -211884 68620 217410 121207 -320200 -381843 14004 19545 204528 -206835 -200732
12462b00732Q5160N3769c0821B38348c6349b982q2325A77334n457k7660a38731
$$ -200732 -115572 -61803 -30821 238348 -36349 -2982 -85307 177334 171877 144217 -138731
12450H4851K3832C4797M9328g080I5165a68166l19571a91598j35580a39797q5895
$$ 84851 108683 34797 84125 -7080 95165 -168166 -487737 -191598 -327178 -139797 -225692
12439b25692k0564J09698C219N8497b33879A04990e3671b1288j60093l5713Q0465
$$ -225692 -246256 -136558 3219 61716 -233879 104990 -53671 -21288 -181381 -217094 -136629
12428a36629E5143A9692M6253f7462b5549l52408A79578b2616n4783I2684i824
$$ -136629 55143 19692 65945 -67462 -25549 -377957 179578 -22616 -77399 92684 -9824
12416b46447B7279M3983B1558g2679k77213f500o02244i1338A95078i8740j94932
$$ -246447 27279 71262 21558 -72679 -349892 -6500 -608744 -91338 195078 -98740 -293672
12405b93672O8982A47670K4722b11016K6073D5623b48586A77409A430a70142A51779
$$ -293672 -224690 147670 172392 -211016 -184943 45623 -248586 177409 1430 -170142 151779
12393a98312H0940J13648d565m964A80569b40139b3571I636J18585J93306j28515
$$ -198312 80940 194588 -4565 -9529 180569 -240139 -23571 9636 128221 321527 193012
12382A93012b05814B46113P3814H5858R2545K1029i0630D7768a58540B63823o4548
$$ 193012 -205814 246113 319927 85858 178403 199432 -90630 47768 -158540 263823 199275
12371A99275f0989j51311E9209A2710N915a0604j72107r6629k7806c9953F370
$$ 199275 -60989 -212300 59209 12710 18625 -10604 -182711 -279340 -307146 -39953 6370
12359B36751c78759a46329A72421c20004A97445b90090i3558L7190P596C12130
$$ 236751 -378759 -146329 172421 -320004 197445 -290090 -93558 -56368 -48772 312130
12348H9262P800j9003a72896E592b54699b109C36724b26933h1591E0916i4777
$$ 89262 97062 78059 -172896 5592 -254699 -2109 336724 -226933 -81591 50916 -94777
12336B5837J31855J73262A0170R1653e5108A94540k872a70464b3203O386A12209
$$ 25837 157692 330954 10170 101823 -55108 194540 191668 -170464 -23203 -16817 112209
12324D03033i9642B91493O7954j37860a152p3897j2593A06758L10555j64992J26092
$$ 403033 -99642 291493 359447 221587 -1152 -75049 -87642 106758 417313 252321 378413
12313C78413j10244I7656J9757D6466P4195N7355b2509E802L8837f1502j06496
$$ 378413 268169 97656 117413 46466 120661 178016 -22509 5802 44639 -61502 -167998
12302a67998O38A12693c36670a58013H1543K13124D7648b13740B29816r6112a50147
$$ -167998 -167360 112693 -336670 -158013 81543 294667 47648 -213740 229816 133704 -150147
12290G5144P2810b6447j9796C71740A34546F6035J7305k3910l279j4143h9122
$$ 75144 147954 -26447 -46243 371740 134546 66035 83340 59430 56151 42008 -89122
12278A75098e5282D24825A51519E6343L28430j86429L158E732b7107G8257J55559
$$ 175098 -55282 424825 151519 56343 384773 198344 201502 5732 -27107 78257 233816
12267B33816a9235l8361B76105J01155I9702P8587b1132A43550J45281D4753J57658
$$ 233816 -19235 -57596 276105 377260 99702 178289 -21132 143550 288831 44753 202411
12256B02411A1875O214a17217d3422B94281i7611r1314B31468a22663B52829E7175
$$ 202411 11875 18089 -117217 -43422 294281 -97611 -188925 231468 -122663 252829 57175
12244A00840N675a33139M2423B41540K4066I1379e7209B37595G5468j2380e6044
$$ 100840 106515 -133139 -90716 241540 265606 91379 -57209 237595 75468 63088 -56044
12232B71662E615K34486b00103A30417a30594b6675j16076A11358A9166L23597
$$ 271662 5615 240101 -200103 130417 -130594 -26675 -142751 111358 19166 342763
12222C42763H7565L43009E9309K59121m5422a10271B34957r2079K15251m7717
$$ 342763 87565 430574 59309 318430 273008 -110271 234957 142878 358129 310412
12212C10412P3771I8463b2162P964q2285G6663K9892N0298E4769f0638A08882
$$ 310412 384183 98463 -22162 -14198 -96483 76663 106555 156853 54769 -60638 108882
12200A56672A1793A060K36880k6820J8228B3822b4260I0564L76967j89248A02529
$$ 156672 11793 1060 237940 211120 229348 23822 -24260 90564 467531 278283 102529
12188B87562E4874c8524l2550C72448j53815a47777a6562A36277J26673f141B38295
$$ 287562 54874 -38524 -71074 372448 218633 -147777 -16562 136277 262950 -6141 238295
12176H239M85990G6247J23994h6842A25979J7154K58825j98704R2258F4249K81410
$$ 8239 494229 76247 200241 -86842 125979 143133 401958 203254 295512 64249 345659
12165C45659q6001L49951A42504J58924k769j17789k6238i0530B09719c3068B04676
$$ 345659 259658 609609 142504 301428 298659 180870 154632 -90530 209719 -33068 204676
12153A20891J51508H9574e8479j77549b9814A36128h2572B06080b14685B2599
$$ 120891 272399 89574 -58479 -236028 -29814 136128 -82572 206080 -214685 22599
12142a79672C56778b19170D0683a12422A07042C234c4807A92321e9350C95335
$$ -179672 356778 -219170 40683 -112422 107042 3234 -34807 192321 -59350 395335
12131B26798O3511j15167b40387J08813A93190E2515K63478b9454B2934Q4767
$$ 226798 290309 175142 -240387 -131574 193190 52515 315993 -29454 22934 107701
12121A07701M9020b21438C949J21740P8009b6959l0536E2332J04261a03594A14612
$$ 107701 156721 -221438 3949 125689 203698 -26959 -57495 52332 156593 -103594 114612
12109a25993I6835M8613a12965B19744C910J20249J5183N217C9876J24091e4081
$$ -125993 96835 145448 -112965 219744 3910 124159 139342 144559 39876 163967 -54081
12097B4788M04162H8767J85138a9406D5192e335D4038J81972j11787a32282B96056
$$ 24788 428950 88767 273905 -19406 45192 -5335 44038 226010 114223 -132282 296056
12085A06058J847N1885K1322H2789J5521L21716c6877b716A4773O1788A5227g0130
$$ 106058 107905 159790 181112 82789 98310 420026 -36877 -2716 14773 76561 15227 -70130
12072E46035A34159B0122K54475c11795I1948f125B40874D5887e8514h40G1189
$$ 546035 134159 20122 274597 -311795 91948 -6125 240874 45887 -58514 -840 71189
12060B57220I578M2213d4295j3798I0500c05604e0272j10246I0480A0041P6924
$$ 257220 9578 51791 -44295 -58093 90500 -305604 -50272 -160518 90480 10041 86965
12049H6965L0760b57510F5382f6398k0776p8643q3402P7149B14695g8319j40843
$$ 86965 117725 -257510 65382 -66398 -87174 -165817 -249219 -172070 214695 -78319 -219162
12038b19162F9182g7218B29858d9476A10221c7684m4880P49k8836I6579b6086
$$ -219162 69182 -77218 229858 -49476 110221 -37684 -82564 -81815 -110651 96579 -26086
12026A67135a19402q8227b9696j37341A49945f752j5521B8530c41170F0511Q9871
$$ 167135 -119402 -207629 -29696 -167037 149945 -6752 -22273 28530 -341170 60511 150382
12015A50382d3140E5425J02464D6976K92482C5929j0070c3488j04056N2089c3008
$$ 150382 -43140 55425 157889 46976 339458 35929 25859 -33488 -137544 -85455 -33008
12003I5650D1137b60075A0163J1374J96200H4579g2681j75198l0756J35575o9394
$$ 95650 41137 -260075 10163 21537 217737 84579 -72681 -247879 -278635 -143060 -212454
11992b12454F1857o235a48659a9184n3522C95313a34451D0241a08691K734j34478
$$ -212454 61857 55622 -148659 -19184 -72706 395313 -134451 40241 -108691 -105957 -240435
11981b40435M2662K8624k9979N2122G6016a67415A58025G8510L3703a20447c9889
$$ -240435 -197773 -169149 -199128 -147006 76016 -167415 158025 78510 112213 -120447 -39889
11969a41766L6860A12080e5828j09890L2030L8147o1477F4714d6705j64200i7470
$$ -141766 -104906 112080 -55828 -165718 -133688 -95541 -157018 64714 -46705 -210905 -97470
11957g507m2251j02521B18274I7439O6867m9660k8190K17255o6939O6834a58536
$$ -7507 -49758 -152279 218274 97439 164306 114646 86456 303711 236772 303606 -158536
11945a00463d0544A13546J5809K5684a0602E9762b6204E797a49644j57418A87037
$$ -100463 -40544 113546 129355 155039 -10602 59762 -26204 5797 -149644 -307062 187037
11933A28835l5175a8908D4446j577a62325J9647K9017n1671B77161D5956J2313
$$ 128835 93660 -18908 44446 42869 -162325 -142678 -113661 -165332 277161 45956 58269
11922E8269J20159a2693B2828a97751O5373A74451J79805A32438B6059a83633
$$ 58269 178428 -12693 22828 -197751 -132378 174451 354256 132438 26059 -183633
11911g1607A19988a27286j36494c4519A30409d9630b0766A33970a45948A09437
$$ -71607 119988 -127286 -263780 -34519 130409 -49630 -20766 133970 -145948 109437
11900g4287l8419c9240k27607O9576A29529c82241f0087p80j77682H3864f8064
$$ -74287 -112706 -39240 -266847 -197271 129529 -382241 -60087 -60867 -238549 83864 -68064
11888B69178d24096e544p9287A10258c29007J21891b5655B4233c44492g7837j57299
$$ 269178 -424096 -5544 -84831 110258 -329007 -207116 -25655 24233 -344492 -77837 -235136
11877b35136F5258J79482b93759J21644k288B6623R4019a64833l41203b24095
$$ -235136 65258 244740 -293759 -172115 -174403 26623 120642 -164833 -506036 -224095
11866f6414A22821j9462K5813a22067A10295c10758d5109h222m6480j64169I9901
$$ -66414 122821 103359 129172 -122067 110295 -310758 -45109 -8222 -54702 -218871 99901
11854I9653A1413a63121A3226a1169o8463B05868J9464G8807a27781d8215A5408
$$ 99653 11413 -163121 13226 -11169 -79632 205868 225332 78807 -127781 -48215 15408
11842B34205a20981a9373k36718e452n7645h663C8792J1814K8019e942j68835
$$ 234205 -120981 -19373 -256091 -5452 -63097 -8663 38792 50606 78625 -5942 -174777
11831a74777N2302E6056J57200a37729B03177a22943o0068A00219e23312a82133
$$ -174777 -122475 56056 213256 -137729 203177 -122943 -183011 100219 -523312 -182133
11820h3480L2876a3949F0234J74856a02994l03411e0263B00478f907n4401q2833
$$ -83480 -50604 -13949 60234 235090 -102994 -406405 -50263 200478 -6907 -61308 -144141
11809a44141j16901A827R5665f1269j84943O6600M2215j00101c555k06511n1454
$$ -144141 -261042 1827 97492 -61269 -246212 -179612 -137397 -237498 -3555 -210066 -261520
11798b61520J23804c6911B87114b09189C2140a18976A13841a04050B14225a25966
$$ -261520 -137716 -36911 287114 -209189 32140 -118976 113841 -104050 214225 -125966
11787h5327B77815j16120f4852A57993n094K7516l5666a88560b7668B65343q6715
$$ -85327 277815 161695 -64852 157993 152899 180415 144749 -188560 -27668 265343 178628
11776A78628a18175p2683A40820a20954j1083j4289k04087A46864o8386b47849
$$ 178628 -118175 -190858 140820 -120954 -132037 -146326 -350413 146864 78478 -247849
11765B7256A1547a8910j19185B002f5345L1470k26806d9929A89114f0768j66222
$$ 27256 11547 -18910 -138095 2002 -65345 -33875 -260681 -49929 189114 -60768 -226990
11754b26990C2109c24244G336b10748k86656A62256c5205E7484i867B22361b4009
$$ -226990 32109 -324244 7336 -210748 -497404 162256 -35205 57484 -9867 222361 -24009
11742F6110J6765b22792A95571E006b31604M7623q399b5636q4809A0957K77397
$$ 66110 82875 -222792 195571 5006 -231604 -183981 -192380 -25636 -110445 10957 288354
11731B88354A29783P7977a8918q2720A23088a35811L3082A34448K84556B7624
$$ 288354 129783 207760 -18918 -101638 123088 -135811 -102729 134448 419004 27624
11720A82685a5253A35272g5920K7893j48484j6509A57988p2731b00479P0232I7962
$$ 182685 -15253 135272 -75920 -48027 -196511 -213020 157988 85257 -200479 -130247 97962
11708e0273k89012a06251o2443C46456A56446a70421K792N1698H0267J59613A15048
$$ -50273 -339285 -106251 -168694 346456 156446 -170421 -167629 -115931 80267 239880 115048
11696H372N8426a56047L2063l0925A68484b77396E00820H4879c25950A03524Q1550
$$ 8372 66798 -156047 -123984 -154909 168484 -277396 500820 84879 -325950 103524 185074
11685A85074K1175F7769k4571J84370n0154L1955N3466b11389C67099A67219D6904
$$ 185074 206249 67769 43198 227568 177414 209369 262835 -211389 367099 167219 46904
11673b47033D9537c04004b1891G2572L10253A15117a22366m2191C4817a19656
$$ -247033 49537 -304004 -21891 72572 382825 115117 -122366 -164557 34817 -119656
11662a51273C0380c7254j77084I0861O1301a65090B23370D3090P7745E0730R7441
$$ -151273 30380 -37254 -214338 90861 152162 -165090 223370 43090 120835 50730 148171
11651A48171J50821C9998M12097G2405J16681n3755l6613c53721a30433C22598
$$ 148171 298992 39998 452095 72405 189086 135331 98718 -353721 -130433 322598
11640c63536i2196b4468j10141B18466C5201a93308k1867A84536D9398J56290
$$ -363536 -92196 -24468 -134609 218466 35201 -193308 -215175 184536 49398 205688
11630B05688g1268A11683J1309b22049L9225a2751j1740C93791a42351n3660O9225
$$ 205688 -71268 111683 122992 -222049 -182824 -12751 -24491 393791 -142351 -196011 -126786
11619a26786j58269a00753a773k10590c3536r5490A25895R0779H4472J76180G4910
$$ -126786 -285055 -100753 -1773 -212363 -33536 -129026 125895 216674 84472 260652 74910
11607B77764j4723j26789c22339a50011c7358C02384b78689k7851A75472g7208
$$ 277764 263041 136252 -322339 -150011 -37358 302384 -278689 -306540 175472 -77208
11596g9461l0708B87633D1934c105A44457j9575J62835a76259B49334b11639a02292
$$ -79461 -110169 287633 41934 -3105 144457 124882 287717 -176259 249334 -211639 -102292
11584H1421R338d387E1452N8501P9032M8770h5213C875K58096j24868b1263B31577
$$ 81421 90759 -4387 51452 109953 188985 237755 -85213 3875 261971 137103 -21263 231577
11571a71247Q3660n8780B05767K49328g7383j03900B84366I2018J93009h0394
$$ -171247 -87587 -146367 205767 455095 -77383 -181283 284366 92018 285027 -80394
11560I6538c827n717A7346L2165e42n5694A92403A6535K3593b06238B86196H9862
$$ 96538 -3827 -9544 17346 49511 -542 -56236 192403 16535 40128 -206238 286196 89862
11547G8057b33196Q9993d970A21376b14304j2747C9643P0592a96847C9845M9989
$$ 78057 -233196 -143203 -4970 121376 -214304 -227051 39643 110235 -196847 39845 89834
11536H9834A2866a06326B2652J809M75782E8689J74121D8189a8854C18145a5686
$$ 89834 12866 -106326 22652 24461 500243 58689 232810 48189 -18854 318145 -15686
11524A29769a552G8306K34390b7612A9561K15964P6457j54551B4859R5265J34303
$$ 129769 -1552 78306 312696 -27612 19561 235525 311982 157431 24859 120124 254427
11513B54427A22849d9113k5409D2475E397a55154L5197A24320A1148c9668A07115
$$ 254427 122849 -49113 -74522 42475 5397 -155154 -119957 124320 11148 -39668 107115
11501e1840A11291B0419K65180d1700q6257H25R8530h5756A77011b18664B96978
$$ -51840 111291 20419 285599 -41700 -127957 825 99355 -85756 177011 -218664 296978
11489B0233O2219b0309r4716A36505l5248P8186B8783c01201J43763B08126i0953
$$ 20233 82452 -20309 -115025 136505 101257 179443 28783 -301201 -157438 208126 -90953
11477C11173e2029A34014J16301O2685j24823I2917J77634A5370J39556K7528
$$ 311173 -52029 134014 250315 313000 188177 92917 270551 15370 154926 182454
11467A82454f3802B91161C4016c5897E068a0369B84433K5997a88228D4112i4382
$$ 182454 -63802 291161 34016 -35897 5068 -10369 284433 310430 -188228 44112 -94382
11455a1166B46609C3348K30244b38345A75090O7189B8831O1958B6027B482K49254
$$ -11166 246609 33348 263592 -238345 175090 242279 28831 90789 26027 2482 251736
11444B51736N2867e6106A57785J41818h878B24459a056B46893a84182m1216i8061
$$ 251736 304603 -56106 157785 299603 -8878 224459 -1056 246893 -184182 -225398 -98061
11432B2906c842l17841F7101J5090a47048B02965J06046d95968e6886I4228d4502
$$ 22906 -3842 -321683 67101 82191 -147048 202965 309011 -495968 -56886 94228 -44502
11420a29439D21153k07268b892B07199j00252l9622d43j32708p9649A68138b50438
$$ -129439 421153 213885 -2892 207199 106947 67325 -443 -133151 -212800 168138 -250438
11408H6185b34644D9884b82746B44813j8347C8313b04505J9279M9613A8108K16351
$$ 86185 -234644 49884 -282746 244813 226466 38313 -204505 -185226 -135613 18108 234459
11397B34459a02030l22470f8112A28097L02905j52178a40944j15851a01291N979
$$ 234459 -102030 -424500 -68112 128097 431002 278824 -140944 -256795 -101291 -95312
11387i5312M7651j2673o1515I6175C5943i6829d3174A02208D1202f1261j26777
$$ -95312 -47661 -60334 -121849 96175 35943 -96829 -43174 102208 41202 -61261 -188038
11376a88038i2017A55686p4768J00142o4073A8728a41328B95625a01422A23818
$$ -188038 -92017 155686 80918 181060 116987 18728 -141328 295625 -101422 123818
11365d11876J91024a00656j43895r260d415j33576p7011C5426a01707C1168F181
$$ -411876 -220852 -100656 -244551 -253811 -4415 -137991 -215002 35426 -101707 31168 6181
11353B16346b58209l9081a43654j39828g7329p0306B28186C5216e7416j15976
$$ 216346 -258209 -297290 -143654 -283482 -77329 -147635 228186 35216 -57416 -173392
11343a73392C6233J95297b00552M1903A14888k4137a05066d0979a5437m50719
$$ -173392 36233 231530 -200552 -158649 114888 90751 -105066 -40979 -15437 -466156
11333d66156F0501k363h5863C4050J78927c06850J47047A46793P9707G0937B3564
$$ -466156 60501 58138 -85863 34050 212977 -306850 -159803 146793 226500 70937 23564
11321a54817L2186o5673B09839L18281G5222j9306P3231a69112G7127J38317a06050
$$ -154817 -122631 -188304 209839 528120 75222 55916 129147 -169112 77127 215444 -106050
11309b3339A7883J08516a70214I2708b8221j2666j17107F1767a66957C15704f2438
$$ -23339 17883 126399 -170214 92708 -28221 -40887 -157994 61767 -166957 315704 -62438
11297a27760D14918A0861a63634N1966J1357k96532a25390C843a58542a244A23470
$$ -127760 414918 10861 -163634 -111668 -100311 -396843 -125390 3843 -158542 -1244 123470
11285G7028i5743l3081A66480a67586Q2860k1859d9200B8479g7919K6304B35513
$$ 77028 -95743 -128824 166480 -167586 -84726 -106585 -49200 28479 -77919 -51615 235513
11273c61290C18397a50936A56562A9371d2603C67152A73373h7244B37895r0563
$$ -361290 318397 -150936 156562 19371 -42603 367152 173373 -87244 237895 147332
11263A47332a98734j79846h0730M311L2309C20824a3136C4684J46c8885G4372
$$ 147332 -198734 -378580 -80730 -76419 -44110 320824 -13136 34684 34830 -38885 74372
11251b66336R2807c1140j16231B4135P4219a54150F8134h6306A28087b02736O4627
$$ -266336 -173529 -31140 -147371 24135 98354 -154150 68134 -86306 128087 -202736 -138109
11240a38109d0805A00699a44929d8286B9923h8328j1598R690j10515E1152a1503
$$ -138109 -40805 100699 -144929 -48286 29923 -88328 -99926 -90236 -200751 51152 -11503
11228a94462r1298A45733f2846C6451j1563f002A13185A5555d03976i8039O049
$$ -194462 -285760 145733 -62846 36451 24888 -6002 113185 15555 -403976 -98039 -91990
11217i1990p8477f4419B67829a85063I2246c0251B13541A9823E112b07506j4279
$$ -91990 -170467 -64419 267829 -185063 92246 -30251 213541 19823 5112 -207506 -221785
11206b21785j1153j9282a21159f0452G4032a82024j2263D0829J3393B6868a54500
$$ -221785 -232938 -252220 -121159 -60452 74032 -182024 -194287 40829 54222 26868 -154500
11194G3054a64162d2537A16695a88497j78904a74140j93654A81178a00826M126
$$ 73054 -164162 -42537 116695 -188497 -367401 -174140 -367794 181178 -100826 -96700
11184i6700B67806A6698a55685E7640J90097F0615k3390N0170c3717E8838f5828
$$ -96700 267806 16698 -155685 57640 247737 60615 37225 87395 -33717 58838 -65828
11172b23747c7694k41134n3574A99552A8223d1916A01033b9060C46858b92343
$$ -223747 -37694 -278828 -332402 199552 18223 -41916 101033 -29060 346858 -292343
11161A6706a5485B51833I0223A9687M0419J93248C1545a42764j30007J20960a7056
$$ 16706 -15485 251833 90223 19687 60106 253354 31545 -142764 -272771 -151811 -17056
11149B4925a40553e0789j25178b2438A031Q1543J12355Q9624r1460d1289A28487
$$ 24925 -140553 -50789 -175967 -22438 1031 82574 194929 284553 193093 -41289 128487
11137b37808A5240b17181D450h6307B77465E8110K26960a34408j43484a6930G4155
$$ -237808 15240 -217181 4450 -86307 277465 58110 285070 -134408 -277892 -16930 74155
11125G5725g7016j45015A46159N3484g7747e259n0054k51359A634J31315C7097
$$ 75725 -77016 -222031 146159 199643 -77747 -5259 -55313 -306672 1634 132949 37097
11113C4936J13565P558a26738B03637M2267b84196F3237b4088k61466A9703K60154
$$ 34936 148501 156059 -126738 203637 245904 -284196 63237 -24088 -285554 19703 279857
11102B79857C1032d2026B51845m1642n0653a7475C72650j43396q8863L8672p2358
$$ 279857 31032 -42026 251845 210203 159550 -17475 372650 229254 140391 179063 106705
11091A06705J41605E2976J52469b65341d4614j26299j135E0642J28797K7683a08804
$$ 106705 248310 52976 205445 -265341 -44614 -170913 -172048 50642 179439 207122 -108804
11079d8097r6976B20345r0497e4537B29758K19872d3055B73949J26820q0058N5511
$$ -48097 -145073 220345 129848 -54537 229758 449630 -43055 273949 400769 320711 376222
11068C76222q7263P6501A41121L18686l8934J03382k37746b3243F5338M16208
$$ 376222 288959 365460 141121 459807 420873 524255 286509 -23243 65338 481546
11058D81546l4052A44298L07690k692k16981J49385L80848C23522m5927K1409
$$ 481546 447494 144298 451988 449296 232315 381700 762548 323522 277595 299004
11048B99004P0258K46781j56240M5462j33490M23410j44946K8929Q5373p0311
$$ 299004 369262 616043 459803 505265 371775 795185 650239 679168 764541 694230
11038F94230k42171P6882j00331L42295K1616C72672K93342k33646K35531k27258
$$ 694230 452059 528941 428610 770905 792521 372672 666014 432368 667899 440641
11028D40641L22837J9681l23718J91637K27376m31595K37941j81975k5707K19356
$$ 440641 763478 783159 459441 651078 878454 446859 684800 502825 477118 696474
11018F96474M7215j67481k17879K75670L6796k77953J51642K20623k34297J05815
$$ 696474 743689 576208 358329 633999 670795 392842 544484 765107 530810 636625
11008F36625k60156J35668J76950j72890N8532j24984j35778K76224j11551k9004
$$ 636625 376469 512137 689087 516197 574729 449745 313967 590191 478640 449636
10998D49636j29328J32440Q163M8958k1031L99190k58394B51479O48956l43004
$$ 449636 320308 452748 460911 509869 488838 888028 629634 251479 900435 557431
10988E57431K07860k07339J32611j63734j07774K87201L1066k73035L62953K74340
$$ 557431 765291 557952 690563 526829 419055 706256 737322 464287 827240 1101580
10978A101580j74696K86337k68751J85726J37498k13499L72988K71773k01720
$$ 1101580 926884 1213221 944470 1130196 1267694 1054195 1427183 1698956 1497236
10969A497236L29368J6003M01362N5501J40462K39341l55176l8072M6482j3351
$$ 1497236 1826604 1842607 2243969 2299470 2439932 2679273 2324097 2286025 2332507 2319156
10959B319156n37737J41226j99366j10308j88092J66035n5680n4824k21266J62963
$$ 2319156 1781419 1922645 1723279 1612971 1424879 1590914 1535234 1480410 1259144 1422107
10949A422107J09618m06156j5593P2733l44565M1466D7567L31981k242J98923
$$ 1422107 1531725 1125569 1109976 1182709 838144 879610 47567 379548 377306 576229
10939E76229E4859K95752p0988A16760J73450j03032b02521P9806C42370B2791
$$ 576229 54859 350611 279623 116760 290210 187178 -202521 -122715 342370 22791
10928A68804m5398J3981k4647q851A2978K8810K3466L0000a39975n1042A11031
$$ 168804 123406 137387 112740 103889 12978 41788 65254 95254 -139975 -191017 111031
10916I5059J86225b24771g7604B48208A5192b70234a09035l3716C08113a39347
$$ 95059 281284 -224771 -77604 248208 15192 -270234 -109035 -142751 308113 -139347
10905g7498k3853j00959H2096b29156D277b6669n5714m02761d1784l29104a46028
$$ -77498 -101351 -202310 82096 -229156 4277 -26669 -82383 -485144 -41784 -370888 -146028
10893c19923e0919l44249F4243L607M1333a90673l3365A12827d8079A1614N616
$$ -319923 -50919 -395168 64243 67850 109183 -190673 -224038 112827 -48079 11614 17230
10882A7230O3123R7269a31527A45702b45434A05477d27311I0866a94697B7986
$$ 17230 80353 177622 -131527 145702 -245434 105477 -427311 90866 -194697 27986
10871e8228C66704b34130C46636a89819j63354A07015a42816K0735B75294b50167
$$ -58228 366704 -234130 346636 -189819 -353173 107015 -142816 -122081 275294 -250167
10860f7220B2561J136a08350j3771p646a9080k13290K090F1403f6770A90577B5380
$$ -67220 22561 23697 -108350 -122121 -129767 -19080 -232370 -230280 61403 -66770 190577 25380
10847g6469k1810C44469a193l0278j06041r0117H7141a02619A77288b58351L9580
$$ -76469 -98279 344469 -1193 -31471 -137512 -227629 87141 -102619 177288 -258351 -218771
10836b18771b2497l24885i7898K2959I7014P9562b4653A88328c5796j13953D3084
$$ -218771 -22497 -347382 -97898 -74939 97014 176576 -24653 188328 -35796 -149749 43084
10824A0134C81b43028A90790b5647B29657A4192P761d716j25357L3809C8208P7325
$$ 10134 381 -243028 190790 -25647 229657 14192 21953 -4716 -130073 -96264 38208 115533
10812A15533b42852i1446j85620C4770a30665B98120a78768n1765R8230J4401
$$ 115533 -242852 -91446 -277066 34770 -130665 298120 -178768 -230533 -132303 -117902
10802a17902D2206O7130a34713A5705K29406D5665J23757f5332j30005K5873M0882
$$ -117902 42206 109336 -134713 15705 245111 45665 169422 -65332 -195337 -169464 -128582
10791a28582A44756e7960a7917j13055A00501J25503a30661n1021F2346a50115
$$ -128582 144756 -57960 -17917 -130972 100501 226004 -130661 -181682 62346 -150115
10780b26569A41858a47537L6789L9069D6047c1702A19572A2612R0565a23383E4472
$$ -226569 141858 -147537 -110748 -71679 46047 -31702 119572 12612 103177 -123383 54472
10768E3665K51462b56119A47167J08667j27499e3886k13513R2847j07816H6984
$$ 53665 305127 -256119 147167 255834 128335 -53886 -267399 -174552 -282368 86984
10757B47829e8351A7571J00785K3041E1697b12295Q2788n8856h0415B4557R6744
$$ 247829 -58351 17571 118356 141397 51697 -212295 -129507 -188363 -80415 24557 121301
10746A21301e3347a186D06611f4963C6786a60451L1719a7034k37698I7001J3465
$$ 121301 -53347 -1186 406611 -64963 36786 -160451 -128732 -17034 -254732 97001 110466
10735A10466A2309e0702O295A76965h5218l0860G2626P960a01966j26680M9689
$$ 110466 12309 -50702 -44407 176965 -85218 -116078 72626 80586 -101966 -228646 -178957
10724a78957o127g0353D1837P3123b12015k6550K2780A72924H5040c99610H3585
$$ -178957 -185084 -70353 41837 114960 -212015 -238565 -215785 172924 85040 -399610 83585
10712G02b72447M814k0673A03728a21064k19052H9124B6161a38629f7608I2250
$$ 702 -272447 -267633 -288306 103728 -121064 -340116 89124 26161 -138629 -67608 92250
10700a88959A76572o766o6117b21708c5480D2999a06562P179K1362H3552a56421
$$ -188959 176572 169806 103689 -221708 -35480 42999 -106562 -99383 -78021 83552 -156421
10688c6645k40049c1700r1965r7480P975a9425q9106A4911a54604D71863b23117
$$ -36645 -276694 -31700 -123665 -221145 -213170 -19425 -108531 14911 -154604 471863 -223117
10676b17536R1426A76588a25665C9450a17357H0458e1999l8840D3336c9890k04549
$$ -217536 -126110 176588 -125665 39450 -117357 80458 -51999 -90839 43336 -39890 -244439
10665b44439A60486J07215j27776h0917A32808b86602A09678k7905b6435j69227
$$ -244439 160486 267701 139925 -80917 132808 -286602 109678 81773 -26435 -195662
10655a95662K9805D8163A388b46031a4049D5115P1637a14038B60780d92405C6547
$$ -195662 -165857 48163 1388 -246031 -14049 45115 116752 -114038 260780 -492405 36547
10643A06480i9130j65551p313f7756j1284k67802a38266B88586b9842C8403c48176
$$ 106480 -99130 -264681 -271994 -67756 -79040 -346842 -138266 288586 -29842 38403 -348176
10631A29065K61849b05956b4234j85378A5886K65284D346a17534k43044a4059
$$ 129065 390914 -205956 -24234 -209612 15886 281170 4346 -117534 -360578 -14059
10620B5174a22661q2645A47685r18b99192J15810e341B45815d07932a42446f4666
$$ 25174 -122661 -205306 147685 146767 -299192 -183382 -5341 245815 -407932 -142446 -64666
10608a02894K9784m9069C5714P3100P8158G1654h5653b6044j40207j54952f1081
$$ -102894 -73110 -122179 35714 108814 186972 71654 -85653 -26044 -166251 -321203 -61081
10596A53182b75540A25769b84532C421d9555m5268B00296b8249A22387m4819L1691
$$ 153182 -275540 125769 -284532 3421 -49555 -94823 200296 -28249 122387 77568 109259
10585A09259a48111C5540a97072d9251E8730c14188i6014A4195J22106b01377
$$ 109259 -148111 35540 -197072 -49251 58730 -314188 -96014 14195 136301 -201377
10574A0590f5449A22507b03179O1794j54107A44771g9155k27510g6902H5612f628
$$ 10590 -65449 122507 -203179 -141385 -295492 144771 -79155 -306665 -76902 85612 -6628
10562d3645B30886l4838D3985h9059l935C7718R2139b32243C0469a40402J9886
$$ -43645 230886 196048 43985 -89059 -92994 37718 129857 -232243 30469 -140402 -120516
10551a20516a5655C8513L7408Q9215a05728k75108b0179j36208K835j16861g2085
$$ -120516 -15655 38513 75921 165136 -105728 -380836 -20179 -156387 -153552 -270413 -72085
10539e105j06908C9841a60012b0712m7952j15076f106A01389l0703P9846A3759
$$ -5105 -112013 39841 -160012 -20712 -68664 -183740 -6106 101389 70686 150532 13759
10527c86530a85954h3288A11177m1034b08454p9192c3062k56338E1566f5656l13941
$$ -386530 -185954 -83288 111177 70143 -208454 -287646 -33062 -289400 51566 -65656 -379597
10516c79597E2992b49298n7808I188a04368G9669b55788c4058A6952c02054A6966
$$ -379597 52992 -249298 -307106 9188 -104368 79669 -255788 -34058 16952 -302054 16966
10504B7407c26082B39820a96981D5928J03694D7614a38186n7472A15371b16262
$$ 27407 -326082 239820 -196981 45928 149622 47614 -138186 -195658 115371 -216262
10493F7303b69575A86697b50001D87186h0794H9734b0762k70335C706d5355l5061
$$ 67303 -269575 186697 -250001 487186 -80794 89734 -20762 -291097 3706 -45355 -80416
10482h0416j44798Q4359j73122a22226B11707F0342K60257A52854J78180R4654
$$ -80416 -225214 -140855 -313977 -122226 211707 60342 320599 152854 331034 425688
10472D25688j36485A9999K28514o0820E1220e576B92897j032c199n3882k01149
$$ 425688 289203 19999 248513 187693 51220 -5576 292897 291865 -3199 -57081 -258230
10461b58230A66002d0036o9673J8288A60701c29754J13633C90000d47159H9827
$$ -258230 166002 -40036 -109709 -91421 160701 -329754 -216121 390000 -447159 89827
10450g9695A23469a33801c0813C34496H5169b21338b3643j1410B36346A16973
$$ -79695 123469 -133801 -30813 334496 85169 -221338 -23643 -35053 236346 116973
10439a47217A37399C9629a7836E0153c7066F8684a37721E8520O4248a41279l2322
$$ -147217 137399 39629 -17836 50153 -37066 68684 -137721 58520 122768 -141279 -173601
10428a73601K5988K1288F4788a27761a1655q5740D9846a79849B2997M8061b76073
$$ -173601 -147613 -126325 64788 -127761 -11655 -97395 49846 -179849 22997 71058 -276073
10416B72696D4219J7075P6005R8302a54888p2030g0961j91707a25646R949M5685
$$ 272696 44219 61294 137299 235601 -154888 -226918 -70961 -262668 -125646 -115697 -70012
10405g0012o4608B30274e0624A20456c03183A48781a00675A27586a66054j22452
$$ -70012 -134620 230274 -50624 120456 -303183 148781 -100675 127586 -166054 -288506
10395b88506A60071c6791B18126a13232r1435B39904B7812b28282G7171a9772
$$ -288506 160071 -36791 218126 -113232 -204667 239904 27812 -228282 77171 -19772
10384A49666b23444O6893A96003d2355E1376P3049a29117D2596F162P1683d5114
$$ 149666 -223444 -156551 196003 -42355 51376 124425 -129117 42596 6162 77845 -45114
10372B83196j05611e4633A01822h9328B42314a47408E48270j80292J05100A57649
$$ 283196 177585 -54633 101822 -89328 242314 -147408 548270 367978 473078 157649
10361B93387j07767K15552L5732q5139j25157H5494e6448j33866G1998k5031K08130
$$ 293387 185620 401172 436904 351765 226608 85494 -56448 -190314 71998 46967 255097
10350B55097J0083K82874k10778j53673M66726l20447A48676M62094l04363o5318
$$ 255097 265180 548054 337276 183603 650329 329882 148676 610770 306407 241089
10340B41089l9793G5317J86158j26832l4070A3735K71877o3173A01738J27398
$$ 241089 201296 75317 261475 134643 100573 13735 285612 222439 101738 229136
10330B29136P4638J0128A05358D6146J04363D6020b28232R6987j39889A7346J73073
$$ 229136 303774 313902 105358 46146 150509 46020 -228232 -131245 -271134 17346 190419
10319A90419A8315J76094O2255a731I640m518g5783C3148J06715m851H869Q4072
$$ 190419 18315 194409 256664 -1731 9640 5122 -75783 33148 139863 135012 8869 92941
10307I2941D5812J55177b40880c4842H2152J13025L33404D0878d09654G8561J50830
$$ 92941 45812 200989 -240880 -34842 82152 195177 528581 40878 -409654 78561 229391
10296B29391R8155a01355L8354A11198a28624N1867P814b3330D9740J99721F3170
$$ 229391 327546 -101355 -63001 111198 -128624 -76757 -68943 -23330 49740 249461 63170
10284A71493a57374D81914f9284r9951k62824A57923a24038C86870c11902B2884
$$ 171493 -157374 481914 -69284 -169235 -432059 157923 -124038 386870 -311902 22884
10273B01351r569a29897j18174J01848A53157L5441H0501M9760h5540m8599p7934
$$ 201351 191782 -129897 -248071 -146223 153157 188598 80501 130261 -85540 -134139 -212073
10262b12073L1477B23483f9800B5884HJ34009a05309B69059b50147C37443P8135
$$ -212073 -180596 223483 -69800 25884 8 134017 -105309 269059 -250147 337443 415578
10251D15578N9405A91757J63936r8261L1146p5016Q8036M6750G3964c6578F5406
$$ 415578 474983 191757 355693 257432 288578 213562 301598 348348 73964 -36578 65406
10239c57636A7053O3189a42736o2192A92273F8288a78096E0592a33137K9209k36201
$$ -357636 17053 80242 -142736 -204928 192273 68288 -178096 50592 -133137 -103928 -340129
10228c40129a08323c448r0753k73047H6520k5774g033j29553o1689j79430e3884
$$ -340129 -108323 -3448 -94201 -367248 86520 60746 -7033 -136586 -198275 -377705 -53884
10216i1068k543j69692c4931m2086p5314r232M7159A62696d61739A34176B2605
$$ -91068 -93611 -263303 -34931 -77017 -152331 -161563 -114404 162696 -461739 134176 22605
10204d9552l1075L7621B27176B787a07691B6274K0305i555j21001l39568a06758
$$ -49552 -80627 -43006 227176 2787 -107691 26274 46579 -9555 -130556 -470124 -106758
10192D1955a70560J0900D6068O2802d60344a63937r3318O1907A68359a11316A00398
$$ 41955 -170560 -159660 46068 108870 -460344 -163937 -257255 -195348 168359 -111316 100398
10180b23096J00717j52336J17524A43988a83311E09318B24716D2863a53302C0705
$$ -223096 -122379 -274715 -157191 143988 -183311 509318 224716 42863 -153302 30705
10169c14930G4592P9316b44598j06188j30423D73665a24374I7699c41819A25190
$$ -314930 74592 153908 -244598 -350786 -481209 473665 -124374 97699 -341819 125190
10158a458k7162o6676k1120J4270A40023E304d20761B7666e27597b12102a01223
$$ -1458 -28620 -95296 -116416 -102146 140023 5304 -420761 27666 -527597 -212102 -101223
10146F8620A2734P8230L57396F1312Q5781d6752r1609A6826b51007j00597F3498
$$ 68620 12734 90964 448360 61312 147093 -46752 -138361 16826 -251007 -351604 63498
10134d66963A4062d9821I9108J96907b65876H2001J48808a71219D0300a35994
$$ -466963 14062 -49821 99108 296015 -265876 82001 230809 -171219 40300 -135994
10123A76622a45731O0311k6985A64289g9894l54977a27099B93681d7320I8776
$$ 176622 -145731 -85420 -112405 164289 -79894 -434871 -127099 293681 -47320 98776
10112c22785a45252I7333f0865D5036a26154l41713i9863k459F6635c28316c2501
$$ -322785 -145252 97333 -60865 45036 -126154 -467867 -99863 -102322 66635 -328316 -32501
10100g8219r0442B32608b21088Q1304B80676B7679b56907M6120J03172H0821a51044
$$ -78219 -168661 232608 -221088 -139784 280676 27679 -256907 -210787 -107615 80821 -151044
10088b72777i1358j83807c7613j02261j8679A08176b981j40444C3651g3823k5120
$$ -272777 -91358 -275165 -37613 -139874 -158553 108176 -2981 -143425 33651 -73823 -98943
10077i8943J6588B67161h5173k64746I6991d6912k9016a4414j47632B16837i7245
$$ -98943 -82355 267161 -85173 -349919 96991 -46912 -75928 -14414 -162046 216837 -97245
10065H6568e1155E3570B5741Q2996l5842h4325J2262j39341i8502G1530N3620
$$ 86568 -51155 53570 25741 108737 72895 -84325 -72063 -211404 -98502 71530 125150
10054A25150e2549C42296b49725E346a96191A88611b42940m3540a1224p2525H6217
$$ 125150 -52549 342296 -249725 5346 -196191 188611 -242940 -286480 -11224 -83749 86217
10042D3955a41415k0891A54544b13392J00291A83168b65267M1596j52499k4552
$$ 43955 -141415 -162306 154544 -213392 -113101 183168 -265267 -223671 -376170 -400722
10032d00722J74793i2120D8640J77585H327J5069J09592a35565A2398m644d8195
$$ -400722 -225929 -92120 48640 226225 8327 23396 132988 -135565 12398 7754 -48195
10020a43530C26874f9489l24505d7447I0284d5042A45662D8682J04512e0022K4680
$$ -143530 326874 -69489 -393994 -47447 90284 -45042 145662 48682 153194 -50022 -25342
10009b5342A3636a49946k2619m90557A83989e9507k68698a55865f4674c425o3061
$$ -25342 13636 -149946 -172565 -663122 183989 -59507 -328205 -155865 -64674 -3425 -66486
9998f6486H912a75134A61945a9776m2864j84000p7667F148e8274B7702b9416j55048
$$ -66486 8912 -175134 161945 -19776 -62640 -246640 -324307 6148 -58274 27702 -29416 -184464
9986a84464k20734a44674O2153b6633k1250j52015Q3236G5618L7336c16345B8599
$$ -184464 -405198 -144674 -82521 -26633 -47883 -199898 -116662 75618 112954 -316345 28599
9974a48929c7945B15169i3304b489j85823B27836F8443d7179p5123q9923h3388
$$ -148929 -37945 215169 -93304 -2489 -188312 227836 68443 -47179 -122302 -212225 -83388
9962H4560c1938n6481K3118k4823B00273A5035d0060l95883E786b40564n7729
$$ 84560 -31938 -88419 -65301 -90124 200273 15035 -40060 -435943 5786 -240564 -298293
9951b98293O4166F8462g0643a8626k92301e1726j35299L9345j76253i8026J8672
$$ -298293 -234127 68462 -70643 -18626 -310927 -51726 -187025 -147680 -323933 -98026 -79354
9940g9354G3365c14213a18055j32003J03084L7701d2357k56651A1764e0578m0777
$$ -79354 73365 -314213 -118055 -250058 -146974 -109273 -42357 -299008 11764 -50578 -91355
9929i1355q7972A54946b98630a35727A77079a49143F95K35567B9764b86711h279
$$ -91355 -179327 154946 -298630 -135727 177079 -149143 695 236262 29764 -286711 -8279
9917C8207c74342A5295J29858j3612h4219A01714c63523A17769b20263c3896C95761
$$ 38207 -374342 15295 145153 131541 -84219 101714 -363523 117769 -220263 -33896 395761
9905A63588d953k06936j67538J50453n2468o1105c7790p9176C8950b90365B006
$$ 163588 -4953 -211889 -379427 -228974 -281442 -342547 -37790 -116966 38950 -290365 2006
9893c2763A294J46682d7662I4023h8506C9576d6622A84114B908g9351A45088b25042
$$ -32763 1294 147976 -47662 94023 -88506 39576 -46622 184114 2908 -79351 145088 -225042
9880i7956A83766a11840D5582J63641e2535k35745A81407C8109d15034J51989
$$ -97956 183766 -111840 45582 209223 -52535 -288280 181407 38109 -415034 -263045
9870b63045A15807E1662c99752g492k02950m0243A01114L53976E8513J3383a28362
$$ -263045 115807 51662 -399752 -7492 -210442 -250685 101114 455090 58513 71896 -128362
9858a42327C05235o3827A19933A418N2759g6317C2451a10422j37205E2930J00151
$$ -142327 305235 241408 119933 1418 54177 -76317 32451 -110422 -247627 52930 153081
9847A53081a56308q9148A52965P2080a7990k11104O0035l0066e8287j55762b9343
$$ 153081 -156308 -245456 152965 225045 -17990 -229094 -169059 -199125 -58287 -214049 -29343
9835A3089J82113a32562A48861a06119n7080g2038I4304i6703A14289b6707Q441
$$ 13089 195202 -132562 148861 -106119 -163199 -72038 94304 -96703 114289 -26707 -18266
9824a8266A47665g0377n0415j02122A28613b8626q5260L8359L7549n1712a1933
$$ -18266 147665 -70377 -120792 -222914 128613 -28626 -113886 -75527 -37978 -89690 -11933
9812B16040b43561B35808d9351A44339i3828m2199f0469l2322M4007j71385i5398
$$ 216040 -243561 235808 -49351 144339 -93828 -136027 -60469 -92791 -48784 -220169 -95398
9800a61044m486B29863d63042b16883J02499Q971M2728j08442g2274l52680f211
$$ -161044 -165530 229863 -463042 -216883 -114384 -105413 -62685 -171127 -72274 -424954 -6211
9788H3534i7264j2670G0377b04386A81723b57925g2482j20544L0059D7488J8693
$$ 83534 -97264 -109934 70377 -204386 181723 -257925 -72482 -193026 -162967 47488 66181
9777F6181k7356a40379j34176a01023B64895a13368N5596j9892l03829B55045
$$ 66181 38825 -140379 -274555 -101023 264895 -113368 -57772 -77664 -381493 255045
9766A47766o8687d0162J1815k96291a41040j11751B8993a62584a3096j64869A70931
$$ 147766 79079 -40162 -28347 -324638 -141040 -252791 28993 -162584 -13096 -177965 170931
9754g329o4100G137N0332g2934j67440H7058a18836I4189b4416o2194j16802k10840
$$ -7329 -71429 7137 57469 -72934 -240374 87058 -118836 94189 -24416 -86610 -203412 -414252
9742d14252D4040c296B8357b00373P1184e4785A41409f9643G7688K60946c37942
$$ -414252 44040 -3296 28357 -200373 -129189 -54785 141409 -69643 77688 338634 -337942
9730c17754A66190a54317H2075b37046J7195A92640F5727b8549A4093L0992a81949
$$ -317754 166190 -154317 82075 -237046 -219851 192640 65727 -28549 14093 45085 -181949
9718B803b50373J12372A88168b40767g6147B01031a59900f656j05161o053k39622
$$ 2803 -250373 -138001 188168 -240767 -76147 201031 -159900 -6656 -111817 -117870 -357492
9707c57492J52036I946c68114a22562A8501e04643a88917P6214N2212m009C4560
$$ -357492 -205456 9946 -368114 -122562 18501 -504643 -188917 -112703 -60491 -64500 34560
9695c4059m30677h7253F0280a47251A13878k555f2559j93053A27423j3711J08561
$$ -34059 -464736 -87253 60280 -147251 113878 111323 -62559 -255612 127423 113712 222273
9684B22273I2959i3570p143m8999A77458a24020R878A55045b1761A17759i6181
$$ 222273 92959 -93570 -100713 -149712 177458 -124020 -114142 155045 -21761 117759 -96181
9672c99312H3894b30004n9597B0837a72519r1564G4642A8667h2450C86412b30408
$$ -399312 83894 -230004 -289601 20837 -172519 -264083 74642 18667 -82450 386412 -230408
9660A54497F3370J12367E49a302n1981e639p4261L5259l32476E5336b13077F464
$$ 154497 63370 175737 549 -1302 -53283 -5639 -79900 -44641 -377117 55336 -213077 6464
9647a29633A43697b33125D0302N7815a65846e7630D53115a1236A15331c0890A65840
$$ -129633 143697 -233125 40302 98117 -165846 -57630 453115 -11236 115331 -30890 165840
9635a03214A8347e3846p7958r163A06071D2383d6511p0344E5606b50442i6768
$$ -103214 18347 -53846 -131804 -140967 106071 42383 -46511 -116855 55606 -250442 -96768
9623b44768g6014a2899j87929A12160E3618K22452b80810E4247i8104j71914c7529
$$ -244768 -76014 -12899 -200828 112160 53618 276070 -280810 54247 -98104 -270018 -37529
9611A61528p7697d4063j72924j43808D4272f4334l46803a36472j39585a3436C7275
$$ 161528 83831 -44063 -216987 -360795 44272 -64334 -411137 -136472 -276057 -13436 37275
9599B92455G2276a8146A349c8046j08635B1675J03798K0302a77844D8867i3468
$$ 292455 72276 -18146 1349 -38046 -146681 21675 125473 145775 -177844 48867 -93468
9587a40375N3755K1969m8506j4098C5357b41344i5431D519a69189D05216b57648
$$ -140375 -86620 -64651 -113157 -127255 35357 -241344 -95431 4519 -169189 405216 -257648
9575B4942a17757A1155J07884b20832A00945j8947a12276n8125K3247j77549d5803
$$ 24942 -117757 11155 119039 -220832 100945 81998 -112276 -170401 -147154 -324703 -45803
9563E6747b31885A46280O5978c17231g6486l29260a25021K5311j17612h8309K819
$$ 56747 -231885 146280 212258 -317231 -76486 -405746 -125021 -99710 -217322 -88309 -85490
9552h5490j91271e9637o9339a1834l07312a9052B6466a66062j08244E0030P1772
$$ -85490 -276761 -59637 -128976 -11834 -319146 -19052 26466 -166062 -274306 50030 121802
9541A21802h5356A7431b13943A35144b99877I5376a3673B27995c39643C49192
$$ 121802 -85356 17431 -213943 135144 -299877 95376 -13673 227995 -339643 349192
9530a97420A66355p1845D5035a19868r4686P7615A32339E6156a27460E7895J5200
$$ -197420 166355 94510 45035 -119868 -214554 -136939 132339 56156 -127460 57895 73095
9519G3095d1303A7080f7821A20426C1570K439J82801k4687d8133k9827J7355l7295
$$ 73095 -41303 17080 -67821 120426 31570 34009 216810 192123 -48133 -77960 -60605 -97900
9507i7900K4564b322o2507j71365C4423c8250j02332L6502A7071J72996l9818
$$ -97900 -73336 -2322 -64829 -236194 34423 -38250 -140582 -104080 17071 190067 150249
9496A50249b33824h6132I934b5751k13062Q7536c5132B02897b82592D111M7078
$$ 150249 -233824 -86132 9934 -25751 -238813 -151277 -35132 202897 -282592 4111 51189
9485E1189m226b9942k22370a9124k88205b4869F8931b05104h9407j7812m19639
$$ 51189 46963 -29942 -252312 -19124 -307329 -24869 68931 -205104 -89407 -107219 -526858
9474e26858A16551b92705q6040J32145N446J06133F7653R0034B7697h1532o4859
$$ -526858 116551 -292705 -378745 -246600 -241154 -135021 67653 157687 27697 -81532 -146391
9463a46391K8375N3273n5974j49724J30725r869B99287I6389a24149c6278A10808
$$ -146391 -118016 -64743 -120717 -270441 -139716 -149585 299287 96389 -124149 -36278 110808
9451i9320F1866A8561b89447J21827e6246j21074P7547M5487p4574l82813I2370
$$ -99320 61866 18561 -289447 -167620 -56246 -177320 -99773 -54286 -128860 -511673 92370
9439D3648a5814B42645a46765i488k56446a4772E2210a77088N4177p97o8969a5809
$$ 43648 -15814 242645 -146765 -9488 -265934 -14772 52210 -177088 -122911 -123708 -192677 -15809
9426b0024C47186A43502a21534A33435g3570l0820B5209M7399e5735r6752d126
$$ -20024 347186 143502 -121534 133435 -73570 -104390 25209 72608 -55735 -152487 -4126
9414a80089L1160A9130M35880A74833b21993A10685b70149h650p0750k30812b5949
$$ -180089 -148929 19130 455010 174833 -221993 110685 -270149 -8650 -79400 -310212 -25949
9402b4737B2331a98272i8140A1261L62934b19837Q1813k0849A42472a20504j86378
$$ -24737 22331 -198272 -98140 11261 374195 -219837 -138024 -158873 142472 -120504 -306882
9391c06882a38240j75520B0532e6170j60180B02883R1525a8554D7731h3857D3907
$$ -306882 -138240 -313760 20532 -56170 -216350 202883 294408 -18554 47731 -83857 43907
9379e0190B69561h9565C71916A30124b95702K8316K7952g8435B14485h253A9746
$$ -50190 269561 -89565 371916 130124 -295702 -267386 -239434 -78435 214485 -8253 19746
9367a1966k337A32028F0709f7234k57186a01307A9705J31495J55429c57545i6195
$$ -11966 -14303 132028 60709 -67234 -324420 -101307 19705 151200 306629 -357545 -96195
9355a66286D29693b45000r261a11419r860l10448J74413k16610A86629f0143k03412
$$ -166286 429693 -245000 -254261 -111419 -121279 -431727 -257314 -473924 186629 -60143 -263555
9344b63555l8334J22480I2838a83672q8503c6748j46431j65385a24476A16663
$$ -263555 -301889 -179409 92838 -183672 -272175 -36748 -183179 -348564 -124476 116663
9333h8729m77777b45037H1108a85109F867P0852R9280a49096f501q6084j07884
$$ -88729 -566506 -245037 81108 -185109 6867 77719 176999 -149096 -6501 -92585 -200469
9322b00469j4428d4255j09246D4694L0545i1567A69062H796h7316k27690J52549
$$ -200469 -214897 -44255 -153501 44694 75239 -91567 169062 8796 -87316 -315006 -162457
9311a62457A36387b56450L6297L1832j48576E0939O8964d5627j47873l9506A24096
$$ -162457 136387 -256450 -220153 -188321 -336897 50939 119903 -45627 -193500 -233006 124096
9299a9464j63065p7255B65252r2545m8386K03058g2414j0158D9663c53822N733
$$ -19464 -182529 -259784 265252 172707 124321 327379 -72414 -82572 49663 -353822 -348089
9288c48089J67007n8704J713D5137a98813P8990A26850c02464I3386K56802a64768
$$ -348089 -181082 -239786 -238073 45137 -198813 -119823 126850 -302464 93386 350188 -164768
9276e1516j9759q1044C91010a85721j75507i0548j89488h5431j0249c6932o6950
$$ -51516 -71275 -152319 391010 -185721 -361228 -90548 -280036 -85431 -95680 -36932 -103882
9265a03882c4910k41566g9831m8667K5538C64763B9112J68059a93776f9633B06913
$$ -103882 -34910 -276476 -79831 -128498 -102960 364763 29112 197171 -193776 -69633 206913
9253b49692a21356d8631j13820j32085b0689l00980J00700r1774A7892a47557
$$ -249692 -121356 -48631 -162451 -294536 -20689 -321669 -220969 -312743 17892 -147557
9242b0893A49887N5397d29318A67840i1505F041a12026j8460D3613h4197J097
$$ -20893 149887 205284 -429318 167840 -91505 6041 -112026 -130486 43613 -84197 -83100
9231h3100r2779j27967F7430b50300B02899a53366R107h791j01945D8379a45651
$$ -83100 -175879 -303846 67430 -250300 202899 -153366 -144259 -8791 -110736 48379 -145651
9219a34541B99792a70779C01788d974E0477a36379F540g141o6480n6113A37080
$$ -134541 299792 -170779 301788 -4974 50477 -136379 6540 -7141 -73621 -129734 137080
9207A11596a99731A9287i6476j51031c8541H0845b40551i6492M3455j9851k76514
$$ 111596 -199731 19287 -96476 -247507 -38541 80845 -240551 -96492 -53037 -72888 -349402
9196c49402B7634L2257i59l18109C0969Q0524a98962h7188n3247M6498j29680
$$ -349402 27634 59891 -959 -319068 30969 111493 -198962 -87188 -140435 -93937 -223617
9185b23617j46830a03859m7774A61877C7533k313P1921g4419k61292a52271b7873
$$ -223617 -370447 -103859 -151633 161877 37533 35220 107141 -74419 -335711 -152271 -27873
9173A45602b8165B26157b02155h8709F0456k8421a12236k981I0561e1985j33971
$$ 145602 -28165 226157 -202155 -88709 60456 32035 -112236 -115217 90561 -51985 -185956
9162a85956B32278M6953d9375k60121D02831j60080a49469A1100b04419j6584
$$ -185956 232278 279231 -49375 -309496 402831 242751 -149469 11100 -204419 -221003
9152b21003d2821k27891D13159b48314m3706b0429O910j44037L9597E3637c02094
$$ -221003 -42821 -270712 413159 -248314 -292020 -20429 -13519 -157556 -117959 53637 -302094
9140b64732N4206C0193b78349G7702K04431a80969n5904e7260o3574A50081l5222
$$ -264732 -210526 30193 -278349 77702 282133 -180969 -236873 -57260 -120834 150081 114859
9129A14859c0505l7391c2876p7079D6722b16927I6915k1440r964c2186J2058B9211
$$ 114859 -30505 -67896 -32876 -109955 46722 -216927 96915 75475 65511 -32186 -20128 29211
9116A3836f4253A70420b7845J3509r2502B19921i8456L5666a7780E7047J24938
$$ 13836 -64253 170420 -27845 -14336 -106838 219921 -98456 -62790 -17780 57047 181985
9105A81985L8329a62101A04076b46643i5400I7263g9221A15011a2819q3163j22838
$$ 181985 220314 -162101 104076 -246643 -95400 97263 -79221 115011 -12819 -95982 -218820
9094b18820B24247a57913B2248a15697L0719K4104N616O470A68161o3394a08730
$$ -218820 224247 -157913 22248 -115697 -84978 -60874 -55258 -48788 168161 104767 -108730
9082B17129c15244C5439i4543E1329J47138O2258c7701l29956g7525J6092A00
$$ 217129 -315244 35439 -94543 51329 198467 260725 -37701 -367657 -77525 -61433 100
9070b97395B6492d0823A4293b37650E0120j347J74078a46368n9018H9590c85821
$$ -297395 26492 -40823 14293 -237650 50120 48773 222851 -146368 -205386 89590 -385821
9058d2687k05585B21019B2255P6491f4478j06979K6222Q457L8347k21289B5046
$$ -42687 -248272 221019 22255 98746 -64478 -171457 -145235 -136778 -98431 -319720 25046
9046c8236q2011A58929b3495j83321M6478F90a74512P8284j04262a5732A3197
$$ -38236 -120247 158929 -23495 -206816 -160338 690 -174512 -96228 -200490 -15732 13197
9034a41530g365k40777A81198a96567o0402r3682B45497B8868j3615R3989k247
$$ -141530 -7365 -248142 181198 -196567 -256969 -350651 245497 28868 15253 109242 106995
9023A06995D3172a07826j9166A34a36052J1976j61334b7689o9350A94243b69056
$$ 106995 43172 -107826 -126992 134 -136052 -124076 -285410 -27689 -97039 194243 -269056
9011h1903A69060l1589b12721A21230b94004A75669J5785i0809o6285o4830D4137
$$ -81903 169060 137471 -212721 121230 -294004 175669 191454 -90809 -157094 -221924 44137
8999D0816j9487P3372a10443H3057o083a51329c1165j00343c4520m8095n8116
$$ 40816 21329 94701 -110443 83057 76974 -151329 -31165 -131508 -34520 -82615 -140731
8988a40731B5986c91391d355j95097K7966c4312l04813G8863h3309F9807b48804
$$ -140731 25986 -391391 -4355 -199452 -171486 -34312 -339125 78863 -83309 69807 -248804
8976a68726j5306O5882p1463e2182l4414A5428J13723Q6690o5846E8563a97583
$$ -168726 -184032 -118150 -189613 -52182 -86596 15428 129151 215841 149995 58563 -197583
8964H635J16009a64216e3683o0296M6845j04583A64796a82422a8777k67722N4202
$$ 8635 124644 -164216 -53683 -113979 -67134 -171717 164796 -182422 -18777 -286499 -232297
8953b32297A05297a1695p626j56607H571a10576r8798J2452B20554C4538K20140
$$ -232297 105297 -11695 -19321 -175928 8571 -110576 -209374 -196922 220554 34538 254678
8942B54678l4780a05026b9372m0548o5375f2974C9080d2123E1085i5126j47156
$$ 254678 219898 -105026 -29372 -69920 -135295 -62974 39080 -42123 51085 -95126 -242282
8931b42282C907L90511a79177g3987K3530n7164G1425a16390d988E9944J488k8358
$$ -242282 3907 394418 -179177 -73987 -50457 -107621 71425 -116390 -4988 59944 61432 33074
8919C3074g7089H90170D18245G0200l4379L06093D9043A2791d02143C13839b10868
$$ 33074 -77089 890170 418245 70200 35821 341914 49043 12791 -402143 313839 -210868
8907i8436j69014a1512j88236j23506E5336M0275c2951A92706o6405c68149a05422
$$ -98436 -267450 -11512 -199748 -323254 55336 95611 -32951 192706 126301 -368149 -105422
8895A49751a74892O7053j20886j47660I7525g6562c7549B6986c61650M8837B87963
$$ 149751 -174892 -107839 -228725 -376385 97525 -76562 -37549 26986 -361650 -312813 287963
8883e2221A73234b4012D7782a21365M44a6802k70427A07654C9900j6048b95734
$$ -52221 173234 -24012 47782 -121365 -120921 -16802 -287229 107654 39900 23852 -295734
8871b46241A11369Q5469i4931L6560A28994a63250L1370c7161H6555C4002a3397
$$ -246241 111369 196838 -94931 -58371 128994 -163250 -131880 -37161 86555 34002 -13397
8859C7429a33871e3513A79571b64837C1661c5563I6347l9802a24378a6963k73693
$$ 37429 -133871 -53513 179571 -264837 31661 -35563 96347 56545 -124378 -16963 -290656
8848b90656h198k30013b7160m8497J3151a6166j2436r6158I8913A9466K6053b25044
$$ -290656 -8198 -238211 -27160 -75657 -62506 -16166 -28602 -124760 98913 19466 45519 -225044
8835a10335l80800J75842a37485k60001h6962l8218H3162O976a55342D2489H150
$$ -110335 -491135 -315293 -137485 -397486 -86962 -125180 83162 90138 -155342 42489 8150
$$ [...]
##END NTUPLES=NMR SPECTRUM
##END=
